##TITLE=Analysis number 326160
Compound Code rh 01349
Project Code adrs
Chemist Name robbier
##JCAMPDX= 6.0         $$ Bruker NMR JCAMP-DX V2.0
##DATA TYPE= NMR SPECTRUM
##DATA CLASS= NTUPLES
##ORIGIN= Bruker BioSpin GmbH
##OWNER= nmr
$$ XWIN-NMR		Version 3.5
$$ Thu Jan 25 14:26:26 2007 GMT Standard Time (UT+0h)  MAYBRIDGE\nmr@NMR_250MHZ
##.OBSERVE FREQUENCY= 250.131544655141
##.OBSERVE NUCLEUS= ^1H
##.ACQUISITION MODE= SIMULTANEOUS (DQD)
##.ACQUISITION SCHEME= undefined
##.AVERAGES= 16
##.DIGITISER RES= 18
##SPECTROMETER/DATA SYSTEM= dpx250
##.PULSE SEQUENCE= zg30
##.SOLVENT NAME= DMSO
##.SHIFT REFERENCE= (INTERNAL, DMSO, 0, 16.522)
##AUDIT TRAIL= $$ (NUMBER, WHEN, WHO, WHERE, WHAT)
$$ ##TITLE= Audit trail, XWIN-NMR		Version 3.5
$$ ##JCAMPDX= 5.01
$$ ##ORIGIN= Bruker BioSpin GmbH
$$ ##OWNER= nmr
$$ C:\u/data/dgb/nmr/ADRS/2070/pdata/1/auditp.txt
$$ ##AUDIT TRAIL=  $$ (NUMBER, WHEN, WHO, WHERE, WHAT)
(   1,<2007-01-25 14:26:04.62 +000>,<MAYBRIDGE\nmr>,<NMR_250MHZ>,
      <created by zg, POWCHK disabled, PULCHK disabled
       configuration hash MD5:
       49 4B E0 1D 92 C2 6B 37 9F E6 65 BC 52 41 86 1D
       data hash MD5: 64K
       3A CA FB F9 55 6A 08 D4 C4 8B 0E 3B B3 42 AC F9>)
(   2,<2007-01-25 14:26:17.91 +000>,<MAYBRIDGE\nmr>,<NMR_250MHZ>,
      <Start of raw data processing
       ef LB = 0.3 FT_mod = 6 PKNL = 1 SI = 32K 
       data hash MD5: 32K
       D7 CA 10 22 05 91 60 43 CE 5D 5B 32 51 AC 08 D6>)
(   3,<2007-01-25 14:26:19.54 +000>,<MAYBRIDGE\nmr>,<NMR_250MHZ>,
      <apk 
       data hash MD5: 32K
       0B 01 C2 E1 C0 58 B8 7D 54 75 6C 47 B0 B2 4F 76>)
(   4,<2007-01-25 14:26:20.32 +000>,<MAYBRIDGE\nmr>,<NMR_250MHZ>,
      <abs ABSG = 5 
       data hash MD5: 32K
       69 E1 13 29 84 57 E3 B0 B9 14 BD 1E 13 5B E2 70>)
$$ ##END=
$$ 
$$ hash MD5
$$ CB 03 E1 A7 8C 7E 09 77 C5 B7 72 3E D0 C1 81 4D
##$RELAX= 
##$RELAX= 
##$RELAX= 
##$RELAX= 
##$RELAX= 
##$RELAX= 
##$RELAX= 
$$ Bruker specific parameters
$$ --------------------------
##$DU= <C:\u>
##$EXPNO= 2070
##$NAME= <ADRS>
##$PROCNO= 1
##$TYPE= <nmr>
##$USER= <dgb>
##$AMP= (0..31)
100 100 100 100 100 100 100 100 100 100 100 100 100 100 100 100 100 100 
100 100 100 100 100 100 100 100 100 100 100 100 100 100 
##$AQSEQ= 0
##$AQ_mod= 3
##$AUNM= <au_zg>
##$AUTOPOS= <38 >
##$BF1= 250.13
##$BF2= 250.13
##$BF3= 250.13
##$BF4= 250.13
##$BF5= 500.13
##$BF6= 500.13
##$BF7= 500.13
##$BF8= 500.13
##$BYTORDA= 1
##$CFDGTYP= 0
##$CFRGTYP= 5
##$CHEMSTR= <none>
##$CNST= (0..31)
1 1 145 1 1 1 1 1 1 1 1 1 1 1 1 1 1 1 1 1 1 1 1 1 1 1 1 1 1 1 1 1 
##$CPDPRG= <>
##$CPDPRG1= <>
##$CPDPRG2= <>
##$CPDPRG3= <>
##$CPDPRG4= <mlev>
##$CPDPRG5= <mlev>
##$CPDPRG6= <mlev>
##$CPDPRG7= <mlev>
##$CPDPRG8= <mlev>
##$CPDPRGB= <>
##$CPDPRGT= <>
##$D= (0..31)
0 1 0 0 0 0 0 0 0 0.06 0 0 0 0 0 0 0.0002 0 0 0 0 0 0 0 0 0 0 0 0 0 0 
0 
##$DATE= 1169735163
##$DBL= (0..7)
120 120 120 120 120 120 120 120 
##$DBP= (0..7)
150 150 150 150 150 150 150 150 
##$DBP07= 0
##$DBPNAM0= <>
##$DBPNAM1= <>
##$DBPNAM2= <>
$$ [...]
##$SUBNAM6= <"">
##$SUBNAM7= <"">
##$SUBNAM8= <"">
##$SUBNAM9= <"">
##$SW= 20.6930455092707
##$SWIBOX= (0..15)
0 0 3 0 0 0 0 0 0 0 0 0 0 0 0 0 
##$SW_h= 5175.983436853
##$TD= 65536
##$TD0= 1
##$TE= 293.16
##$TE2= 300
##$TE3= 300
##$TEG= 300
##$TL= (0..7)
0 120 120 120 120 120 120 120 
##$TP= (0..7)
150 150 150 150 150 150 150 150 
##$TP07= 0
##$TPNAME0= <>
##$TPNAME1= <>
##$TPNAME2= <>
##$TPNAME3= <>
##$TPNAME4= <>
##$TPNAME5= <>
##$TPNAME6= <>
##$TPNAME7= <>
##$TPOAL= (0..7)
0.5 0.5 0.5 0.5 0.5 0.5 0.5 0.5 
##$TPOFFS= (0..7)
0 0 0 0 0 0 0 0 
##$TUNHIN= 0
##$TUNHOUT= 0
##$TUNXOUT= 0
##$USERA1= <user>
##$USERA2= <user>
##$USERA3= <user>
##$USERA4= <user>
##$USERA5= <user>
##$V9= 5
##$VALIST= <valist>
##$VCLIST= <CCCCCCCCCCCCCCC>
##$VD= 0
##$VDLIST= <DDDDDDDDDDDDDDD>
##$VPLIST= <PPPPPPPPPPPPPPP>
##$VTLIST= <TTTTTTTTTTTTTTT>
##$WBST= 1024
##$WBSW= 4
##$XGAIN= (0..3)
0 0 0 0 
##$XL= 0
##$YL= 0
##$YMAX_a= 403817
##$YMIN_a= -486228
##$ZGOPTNS= <>
##$ZL1= 120
##$ZL2= 120
##$ZL3= 120
##$ZL4= 120
##$ABSF1= 16.522
##$ABSF2= -4.171173
##$ABSG= 5
##$ABSL= 3
##$ALPHA= 0
##$AQORDER= 0
##$ASSFAC= 0
##$ASSFACI= 0
##$ASSFACX= 0
##$ASSWID= 0
##$AUNMP= <proc_1d>
##$AZFE= 0.1
##$AZFW= 0.1
##$BCFW= 0
##$BC_mod= 0
##$BYTORDP= 0
##$COROFFS= 0
##$CY= 12.5
##$DATMOD= 1
##$DC= 0
##$DFILT= <>
##$DTYPP= 0
##$F1P= 14.0000005364418
##$F2P= -0.99999901652339
##$FCOR= 0.5
##$FTSIZE= 32768
##$FT_mod= 6
##$GAMMA= 0
##$GB= 0
##$INTBC= 1
##$INTSCL= 1
##$ISEN= 128
##$LB= 0.3
##$LEV0= 0
##$LPBIN= 0
##$MAXI= 10000
##$MC2= 0
##$MEAN= 0
##$ME_mod= 0
##$MI= 0
##$NCOEF= 0
##$NC_proc= -3
##$NLEV= 6
##$NOISF1= 0
##$NOISF2= 0
##$NSP= 0
##$NTH_PI= 0
##$NZP= 0
##$OFFSET= 16.522
##$PC= 1
##$PHC0= 219.3312
##$PHC1= 5.91342
##$PH_mod= 1
##$PKNL= yes
##$PPARMOD= 0
##$PSCAL= 4
##$PSIGN= 0
##$REVERSE= no
##$SF= 250.13
##$SI= 32768
##$SIGF1= 0
##$SIGF2= 0
##$SINO= 400
##$SIOLD= 32768
##$SREGLST= <1H.DMSO>
##$SSB= 0
##$STSI= 32768
##$STSR= 0
##$SW_p= 5175.98343685301
##$SYMM= 0
##$S_DEV= 0
##$TDeff= 65536
##$TDoff= 0
##$TI= <Analysis number 999999
Compound Code 99
Book Reference 9
Project Code 9>
##$TILT= no
##$TM1= 0
##$TM2= 0
##$TOPLEV= 0
##$USERP1= <user>
##$USERP2= <user>
##$USERP3= <user>
##$USERP4= <user>
##$USERP5= <user>
##$WDW= 1
##$XDIM= 32768
##$YMAX_p= 505075284
##$YMIN_p= -56831
$$ End of Bruker specific parameters
$$ ---------------------------------
##NTUPLES= NMR SPECTRUM
##VAR_NAME=  FREQUENCY,     SPECTRUM/REAL,   SPECTRUM/IMAG
##SYMBOL=    X,             R,               I
##VAR_TYPE=  INDEPENDENT,   DEPENDENT,       DEPENDENT
##VAR_FORM=  AFFN,          ASDF,            ASDF
##VAR_DIM=   32768,         32768,           32768
##UNITS=     HZ,            ARBITRARY UNITS, ARBITRARY UNITS
##FACTOR=    0.157963299565203, 1,           1
##FIRST=     4132.6476996994, 0,             0
##LAST=      -1043.33573715361, 0,           0
##MIN=       -1043.33573715361, -56831,      0
##MAX=       4132.6476996994, 505075284,     0
$$ Real data points
##PAGE= N=1
##DATA TABLE= (X++(R..R)), XYDATA
$$ [...]
14839a5923K099O935L108K130r113J316J079m842j869q28o635q291P355R785J3984
$$ -15923 -13824 -6889 -3781 -1651 -10764 -9448 -8369 -13211 -15080 -15908 -22543 -30834 -23479 -13694 290
14824B90o116l638j1176m116O445Q10m630n106n508M358K3972J9622L636j3765
$$ 290 -5826 -9464 -20640 -24756 -18311 -17501 -22131 -27237 -32745 -28387 -4415 15207 18843 5078
14810E078j2707R358k326j2296J2869K1328O84k787j560j3125q103P044L909J387
$$ 5078 -7629 1729 -597 -12893 -24 21304 21988 19201 17641 4516 -3587 3457 7366 8753
14796H753K03L506l767j8053j2525J3157J8434l226q101j649K65L007n179J1735
$$ 8753 8956 12462 8695 -9358 -21883 -8726 9708 6482 -1619 -3268 -3003 4 -5175 6560
14782F560J3471k939o279p639o644n478K405j1494m336K2675J9740m890j4380
$$ 6560 20031 17092 10813 3174 -3470 -8948 -6543 -18037 -22373 302 20042 15152 772
14769G72J3013J923P63o043j1978j5025J5076J1838j165r642j46j369q695k348
$$ 772 13785 15708 16471 10428 -1550 -16575 -1499 10339 9174 -468 -614 -1983 -10678 -13026
14755a3026k655O644J519O673l921M777J794M581j1562K054Q699L981J3721K6592
$$ -13026 -15681 -9037 -7518 -845 -4766 11 1805 6386 -5176 -3122 5577 9558 23279 49871
14741D9871o624k4029j5333L685J1197k090k4098J319K657K002n183k378n201
$$ 49871 43247 19218 3885 7570 18767 16677 -7421 -6102 -3445 -1443 -6626 -9004 -14205
14728a4205J9840O840j2081j0523M072L812R215n781j5490J1070J2502j1211j6923
$$ -14205 5635 12475 394 -10129 -6057 -2245 6970 1189 -14301 -3231 9271 -1940 -18863
14715a8863j0171J5232J7036J572q84j346p367j2155k155k228l338j261J4123
$$ -18863 -29034 -13802 3234 4806 3922 2576 -4791 -16946 -19101 -21329 -24667 -25928 -11805
14702a1805Q741m553L288Q649M486k732k47J5889J3599j52j5283n958j0842N536
$$ -11805 -3064 -7617 -4329 4320 8806 6074 5827 21716 35315 35163 19880 13922 3080 8616
14688H616N63r241j0947J1922J6912R944l244j5435R296N883J838p447j1321o693
$$ 8616 9179 -62 -11009 913 17825 27769 24525 9090 18386 24269 26107 18660 7339 646
14674F46n458Q520L843L000r100m401N330l641L00j522r990l31p510k008J4480
$$ 646 -4812 3708 7551 10551 1451 -2950 2380 -1261 -961 -2483 -12473 -12804 -20314 -22322 -7842
14659g842N986l515o871j251j3113K727J1520P361l836j1412O475J2124L966M949
$$ -7842 -1856 -5371 -12242 -13493 -26606 -23879 -12359 -4998 -8834 -20246 -13771 -1647 2319 7268
14645G268l887j0633j1004j1874p468R064P167o149N101J1534k174R34P969N720
$$ 7268 3381 -7252 -18256 -30130 -37598 -28534 -21367 -27516 -22415 -10881 -13055 -12121 -4152 1568
14631A568K880O087m794j1990j0473L418R312J5137n77p903p899n202Q444J6756
$$ 1568 4448 10535 5741 -6249 -16722 -13304 -3992 11145 10568 2665 -5234 -10436 -1992 14764
14617A4764p561j378k902n173m028l43J586R53K982m131l344M787J0441j4117
$$ 14764 7203 5825 2923 -2250 -6278 -6621 -5035 -4082 -1100 -5231 -8575 -3788 6653 -7464
14603g464j343K731J1133J4150o308k0720l516J5674Q554j1057r903O551J8j0966
$$ -7464 -8807 -6076 5057 19207 12899 -7821 -11337 4337 12891 1834 -8069 -1518 -1500 -12466
14589a2466k191K023m085L723P66R980N216j0345q772m006J115l469j5835j713
$$ -12466 -14657 -12634 -16719 -12996 -12230 -2250 2966 -7379 -16151 -20157 -19042 -22511 -38346 -40059
14575d0059J0325J0713J3391Q570j926o755l638Q271R136j3552j1815p284L600
$$ -40059 -29734 -19021 -5630 2940 1014 -5741 -9379 -1108 8028 -5524 -17339 -24623 -21023
14562b1023K167o53M884O811K034l270J899r802M554J3454R984O925j5088j1943
$$ -21023 -18856 -19509 -14625 -7814 -5780 -9050 -7151 -16953 -12399 1055 11039 17964 2876 -9067
14548i067J0919P13j1426l88J341n741l219l5J2559r022l581J5420j269j8069
$$ -9067 1852 2565 -8861 -9249 -7908 -13649 -16868 -16903 -4344 -13366 -16947 -1527 -2796 -20865
14534b0865m532K2972J3690j2775j3980o082N435K5244J4254j5579p314R243N424
$$ -20865 -25397 -2425 11265 -1510 -15490 -21572 -16137 9107 23361 7782 468 9711 15135
14521A5135j3251p089j933N079J2335L761P93R609j3140j0276M736O825k174L371
$$ 15135 1884 -5205 -7138 -2059 10276 14037 14830 24439 11299 1023 5759 12584 10410 13781
14507A3781N119n442r414j44l716M253j124N193k642j0681o44P784q73j3378K569
$$ 13781 18900 13458 4044 3900 184 4437 3313 8506 5864 -4817 -5461 2323 1450 -11928 -9359
14492i359M793L778O415N198k23j3895N906n324j6537j991J2170N746J873J257
$$ -9359 -4566 -788 5627 10825 10602 -3293 2613 -2711 -19248 -21239 -9069 -3323 -1450 -193
14478a93k408R416N745j5096N222q1O407r778o037k322j945O064P379j5058n877
$$ -193 -2601 6815 12560 -2536 2686 2605 9012 -766 -6803 -9125 -11070 -5006 2373 -12685 -18562
14463a8562J1757l322Q634k556j648O982M465j0157m922K638L17n516J1711j652
$$ -18562 -6805 -10127 -1493 -4049 -5697 1285 5750 -4407 -9329 -6691 -6374 -11890 -179 -1831
14449a831K97N214n445J640k107r284M059j1521J0435M012r903l110m948N53Q515
$$ -1831 -1534 3680 -1765 -125 -2232 -11516 -7457 -18978 -8543 -4531 -14434 -17544 -22492 -21939 -13424
14434a3424M049j937M097K996j1324o294N308N107m813l69p60J358K736K848L426
$$ -13424 -9375 -11312 -7215 -4219 -15543 -21837 -16529 -11422 -16235 -16604 -17364 -16006 -13270 -10422 -6996
14419f996r330q947n331K1035J1835J0064L025j7383j6953p660m759j1403p376
$$ -6996 -16326 -25273 -30604 -9569 2266 12330 15355 -2028 -18981 -26641 -31400 -42803 -50179
14406e0179J8033K0258J2453J0316P388k221j2036Q005J2332j6652j7955j323
$$ -50179 -32146 -11888 565 10881 18269 16048 4012 12017 24349 7697 -10258 -11581
14394a1581J0121k795o51R378k896L099m263o160m736Q772Q009j0975K969L152
$$ -11581 -1460 -4255 -4906 4472 1576 4675 412 -5748 -10484 -1712 6297 -4678 -1709 1443
14380A443k7998q572R515Q814J3743N879n870J685Q077J745R403l692j8258j2619
$$ 1443 -26555 -35127 -25612 -16798 -3055 2824 -3046 -1361 6716 8461 17864 14172 -4086 -16705
14366a6705P566M835Q286J34l017J488l856R570P052r108j3410l674K000N57Q232
$$ -16705 -9139 -4304 3982 4116 1099 2587 -1269 8301 15353 6245 -7165 -10839 -8839 -8282 -50
14351e0N140J6990j2451j4924l973J112P776j3633m990M926K0772Q774o226j2880
$$ -50 5090 22080 9629 -5295 -9268 -8156 -380 -14013 -19003 -14077 6695 15469 9243 -3637
14337c637n560p108R586p025j6502L260J9865P102m872L414O525l210L92q859
$$ -3637 -9197 -16305 -6719 -13744 -30246 -26986 -7121 -19 -4891 -1477 5048 1838 2230 -6629
14323f629r770m493M665Q945P808J2776l360j3363k612L814K140m32p46J829L393
$$ -6629 -16399 -20892 -16227 -7282 526 13302 9942 -3421 -6033 -2219 -79 -511 -1257 572 3965
14308C965K256n718l983O77M458m261j3845j3151n45J5754J3207M479m212j2963
$$ 3965 6221 503 -3480 -2803 1655 -2606 -16451 -29602 -30147 -14393 -1186 3293 -919 -13882
14294a3882J180Q448l045j189m971m138M988O071j5205k890J3702M163j3140m110
$$ -13882 -12702 -4254 -7299 -8488 -13459 -17597 -12609 -6538 -21743 -24633 -10931 -6768 -19908 -24018
14280b4018k79N037j228m105j457k564J1362J434L937M459J388J527J3438L962
$$ -24018 -24297 -19260 -20488 -24593 -26050 -28614 -17252 -15818 -11881 -7422 -6034 -4507 8931 12893
14266A2893j7460j322j370n627m189L668K479J255n957j0544J2481J0177k028
$$ 12893 -4567 -5889 -7259 -12886 -17075 -13407 -10928 -9673 -15630 -26174 -13693 -3516 -5544
14253e544K128J443j7922M413J8834N707j0744j944O813j87j113O07j671J5553
$$ -5544 -3416 -1973 -19895 -15482 3352 9059 -1685 -3629 3184 2997 1884 2491 820 16373
14239A6373P681n270j1345l425j271j0182o313N494j570L846J0084j912r152J432
$$ 16373 24054 18784 7439 4014 2743 -7439 -13752 -8258 -9828 -5982 4102 2190 -6962 -5530
14225e530R573P460K737J0076k8449L234K046K98m736J520o472Q61M147l790p018
$$ -5530 4043 11503 14240 24316 -4133 -899 1147 1445 -3291 -1771 -8243 -7382 -3235 -7025 -14043
14210a4043k069O56l758j0185j481L994M514J3579P565M296R264p616r693k606
$$ -14043 -16112 -15456 -19214 -29399 -30880 -26886 -22372 -8793 -1228 3068 12332 4716 -4977 -7583
14196g583L608J0793j3331j2133R407n908M186J1909M138l395M003j0654J1048
$$ -7583 -3975 6818 -6513 -18646 -9239 -15147 -10961 948 5086 1691 5694 -4960 6088
14183F088P117r700Q896P186K195j6586j1521j2824L431K662P015J6586N886K389
$$ 6088 13205 3505 12401 19587 21782 5196 -6325 -19149 -15718 -13056 -6041 10545 16431 18820
14169A8820J3649N478j4224j1533k3465n125Q542J655j4392L934J8136P096j4441
$$ 18820 32469 37947 23723 12190 -11275 -16400 -7858 -6203 -20595 -16661 1475 8571 -5870
14156e870j6573P579q362r468j70J2816J6496J2606j3179j1663J985K398N76p846
$$ -5870 -22443 -14864 -23226 -32694 -32864 -20048 -3552 9054 -4125 -15788 -13803 -11405 -10829 -18675
14142a8675L258O297K926N448o494k2461j1895J7991J0404n397j1011J0434P263
$$ -18675 -15417 -9120 -6194 -746 -7240 -29701 -41596 -23605 -13201 -18598 -29609 -19175 -11912
14129a1912P332q812r34P090J1680P188p021k3829n835j992l71J1046Q194j1439
$$ -11912 -4580 -13392 -14326 -7236 4444 11632 4611 -19218 -25053 -27045 -27416 -16370 -8176 -19615
14115a9615p59R815k009l100l718j253M368M912p055j3456J257M584J4949K6828
$$ -19615 -20374 -10559 -12568 -15668 -19386 -20639 -16271 -11359 -18414 -31870 -30613 -26029 -11080 15748
14101A5748N737k6204j1520m89O821J0010J6099Q853M217k1000j6454k458J0908
$$ 15748 21485 -4719 -16239 -16728 -9907 103 16202 25055 29272 8272 -8182 -10640 268
14088B68J122m571p225l943J3885Q887p057q504r850J4479K476R43L18q750j7187
$$ 268 1390 -3181 -10406 -14349 -464 8423 1366 -7138 -16988 -2509 -33 910 1228 -7522 -24709
14073b4709L563M621j299L877J7342N660n082r299k150l775m994m209O4M301Q648
$$ -24709 -21146 -16525 -17824 -13947 3395 9055 3973 -5326 -7476 -11251 -16245 -20454 -20390 -16089 -7441
14058g441R146L010j0829j4278M878O44M243J1801M534j2235Q118P683j286L430
$$ -7441 1705 4715 -6114 -20392 -15514 -14870 -10627 1174 5708 -6527 1591 9274 7988 11418
14044A1418L379n400p334l85K250L337L719l793l108P358N453K053N724n379r366
$$ 11418 14797 9397 2063 1678 3928 7265 10984 7191 4083 11441 16894 18947 24671 19292 9926
14029I926m397n462J933O390r301L976n157O899K724K788O207K729j2474j5803
$$ 9926 5529 67 2000 8390 -911 3065 -2092 4807 7531 10319 16526 19255 6781 -9022
14015i022O966K628p612n966J212P54O905R954J632J767r29r173K574l321J915
$$ -9022 -2056 572 -7040 -13006 -11794 -11040 -4135 5819 7451 9218 8289 -884 1690 -1631 284
14000B84j4011o451R112o313J888n495K573J112L441R290l553J00j591n163P824
$$ 284 -13727 -20178 -11066 -17379 -15491 -20986 -18413 -17301 -13860 -4570 -8123 -8023 -9614 -14777 -6953
13985f953M376J1572L036q773q503J2721Q273l073r406q538p218J7243J1034k855
$$ -6953 -2577 8995 12031 3258 -5245 7476 15749 12676 3270 -5268 -12486 4757 15791 12936
13971A2936j648k301l912m645m784j3547m253K642j519J1246M977M414k500j651
$$ 12936 11288 8987 5075 430 -4354 -17901 -22154 -19512 -21031 -9785 -4808 -394 -2894 -4545
13957d545m615n03P964j92r346J0360J144q332r060K142J831K765M019Q396J3514
$$ -4545 -9160 -9663 -1699 -1891 -11237 -877 267 -8065 -17125 -14983 -13152 -10387 -6368 2028 15542
13942A5542l276j1804m335l274o918j579L362k652j598J5150J5222J0639M60k884
$$ 15542 12266 462 -3873 -7147 -14065 -15644 -12282 -14934 -16532 -1382 13840 24479 24939 22055
13928B2055j3651j5163j439J0191l057Q629J3953l904j3376o160l534p870L735
$$ 22055 8404 -6759 -8198 1993 -1064 7565 21518 17614 4238 -1922 -5456 -13326 -9591
13915i591k443k138q518L038J5895N074j703j8028J907K236N264J001o5j888r59
$$ -9591 -12034 -14172 -22690 -19652 -3757 1317 -386 -18414 -16507 -14271 -9007 -8006 -8071 -9959 -10918
13900a0918J3492J1958k389j2442j5506P709Q153k552p057j6035Q644J5135j228
$$ -10918 2574 14532 12143 -299 -15805 -8096 57 -2495 -9552 -25587 -16943 -1808 -3036
13887c036M380M891n255o247J0166J9216r867j8778o083k12R737L531j5475j233
$$ -3036 1344 6235 980 -5267 4899 24115 14248 -4530 -10613 -10825 -1088 2443 -13032 -14265
13873a4265J6522M340O101K086j318p679o1k276p024j1522o071k220J82J5764
$$ -14265 2257 6597 12698 14784 13466 5787 5726 3450 -3574 -15096 -21167 -23387 -23205 -7441
13859g441R463J1203j5420m565j3312l493J3820J1529L59L24J747l814K0942k057
$$ -7441 2022 13225 -2195 -6760 -20072 -23565 -9745 1784 2143 2467 4214 400 21342 19285
13845A9285r303J431J3964O01L547j1766n288j209O034j1989O780l15J508L224
$$ 19285 9982 11413 25377 25978 29525 17759 12471 11262 17296 5307 12087 11772 13280 16504
13831A6504k127r282o285l592n799q412q032O081P427N786O399m651j8674n068
$$ 16504 14377 5095 -1190 -4782 -10581 -18993 -27025 -20944 -13517 -7731 -1332 -5983 -24657 -29725
13817b9725L681p892J188Q423J0905q748j89q956r796J2371K2711O840K327j4788
$$ -29725 -26044 -33936 -32748 -24325 -13420 -22168 -22357 -31313 -41109 -28738 -6027 813 3140 -11648
13803a1648j2758J663p944k159K0426J725j611Q774o602n296L543M165J1498R752
$$ -11648 -24406 -22743 -30687 -32846 -12420 -10695 -12306 -3532 -10134 -15430 -11887 -7722 3776 13528
13789A3528M001j1276j0561q729q09J3315l960k136O055K930N836J0276M409J62
$$ 13528 17529 6253 -4308 -13037 -13846 -531 -4491 -6627 -572 2358 8194 18470 22879 23041
13775B3041j4772r76N082J589o127O06K736l281p462m286j2589J2507J0231Q033
$$ 23041 8269 7293 12375 13964 7837 8443 11179 7898 436 -3850 -16439 -3932 6299 14332
13761A4332L440o348L616j2739M637n155M837J8812j785k2532j5008R714p52P442
$$ 14332 17772 11424 15040 2301 6938 1783 6620 25432 23647 1115 -13893 -4179 -4931 2511
13747B511P485p675j8671o478J8119K084j348J6258k695m382j3184j2272k841
$$ 2511 9996 2321 -16350 -22828 -4709 -2625 -3973 12285 9590 5208 -7976 -20248 -23089
13734b3089R854Q529l723K034K4936L490q724j8239j653L288m391r141J2840K150
$$ -23089 -13235 -4706 -8429 -6395 18541 22031 13307 -4932 -6585 -3297 -7688 -16829 -3989 -1839
13720a839j5397j555J5917o232j3847J061J391N410L541J6237k651N68L158k801
$$ -1839 -17236 -18791 -2874 -9106 -22953 -21892 -20501 -15091 -11550 4687 2036 2604 5762 2961
13706B961k657k029m367O440K526L06j1827k06R872J2593o000n265o720J969J1506
$$ 2961 304 -1725 -6092 348 2874 3180 -8647 -8853 1019 13612 7612 2347 -4373 -2404 9102
13691I102j5531k832l220K255J0623P159r519j0704o649J5659J0774J038J839
$$ 9102 -6429 -9261 -12481 -10226 397 7556 -1963 -12667 -19316 -3657 7117 8155 9994
13678I994p926m199R61P100K059Q390j514j4221L272O292J292j5029J0928k502
$$ 9994 2068 -2131 -1170 5930 7989 16379 14865 644 3916 10208 11500 -3529 7399 4897
13664D897j4191m164j1399O996K221M549J004J6693P285j6684j4428p010J3655
$$ 4897 -9294 -13458 -24857 -17861 -15640 -11091 -10087 6606 13891 -2793 -17221 -24231 -10576
13651a0576L355L388M364k114O153J948k104j0737q361N842K084r235N669Q046
$$ -10576 -7221 -3833 531 -1583 4570 6518 4414 -6323 -14684 -8842 -6758 -15993 -10324 -2278
13637b278K0073K145n711O32m449m216j3417j008J3471Q558l092j5804M38l590
$$ -2278 17795 19940 14229 14861 10412 6196 -7221 -8229 5242 13800 10708 -5096 -4658 -8248
13623h248K350L228J256J3500K61l716Q401p459r931J1263J525j7495o204j4166
$$ -8248 -5898 -2670 -1414 12086 12347 8631 17032 9573 -358 10905 12430 -5065 -11269 -25435
13609b5435K0971K3976j2822q250Q371M951K333m617j0786j0845k293K601j683
$$ -25435 -4464 19512 6690 -1560 6811 11762 14095 9478 -1308 -12153 -14446 -11845 -13528
13596a3528J1674J1110j1725j4168J4489M634k10q410m970J1914J481k326N958
$$ -13528 -1854 9256 -2469 -16637 -2148 2486 2276 -6134 -11104 810 2291 -35 5923
13583E923j137l387j1089r522o443o817N85J3732J1011K262R47J509J0427O241
$$ 5923 4786 1399 -9690 -19212 -25655 -32472 -31887 -18155 -7144 -4882 -3935 -2426 8001 14242
13569A4242p601j2865m136n558J5582O902O327P491m238k915j801P332j888o19
$$ 14242 6641 -6224 -10360 -15918 -336 6566 12893 20384 16146 13231 11430 18762 16874 16255
13555A6255n920j2144j016J0430l397L730k046N22n024n657Q562J8801o143q417
$$ 16255 10335 -1809 -2825 7605 4208 7938 5892 6414 1390 -4267 4295 23096 16953 8536
13541H536n712J758J1618J4421r473j2343L645N199k113R839q839p970n056P513
$$ 8536 2824 4582 16200 30621 21148 8805 12450 17649 15536 25375 16536 8566 3510 11023
13527A1023j4091K427K545m62J4221J928j4196k087O560l924q529j144P116L255
$$ 11023 -3068 -641 1904 1442 15663 17591 3395 1308 7868 3944 -4585 -5729 1387 4642
13513D642P87P15l096O452J5554p245j6084j0676R938J5992O223j0514j2175Q709
$$ 4642 5429 6144 3048 9500 25054 17809 1725 -8951 987 16979 23202 12688 513 9222
13499I222k842j146o55J155n178M088K242k363J1542l09m299n898Q193j483j6938
$$ 9222 6380 5234 4579 5734 556 4644 6886 4523 16065 15756 11457 5559 13752 12269 -4669
13484d669L387O47O20J90k571K641M523J427j728P36q413K980R795l083o402k1125
$$ -4669 -1282 -635 -15 175 -2396 245 4768 6195 4467 5203 -3210 -230 9565 6482 80 -21045
13468b1045k0301M825K5365Q470J0521J597m959J608k28R328j0384j646J460l76
$$ -21045 -41346 -36521 -11156 -2686 7835 9432 4473 6081 5853 15181 4797 3151 4611 4235
13454D235J855O689k849o960J2906M29q878j1520J569Q084J0803o318j1467L835
$$ 4235 6090 12779 9930 2970 15876 16305 7427 -4093 -2524 5560 16363 10045 -1422 2413
13440B413J170K840K695M018j5836K435J6377J4040o890j4380J824o757p246k423
$$ 2413 3583 6423 9118 13136 -2700 -265 16112 30152 23262 8882 10706 3949 -3297 -5720
13426e720J8695N177j4161o787O839J5320N374k302j2405r706n234M283K635j007
$$ -5720 12975 18152 3991 -2796 4043 19363 24737 22435 10030 324 -4910 -627 2008 1001
13412A001o434J286N241k226M364q578J1080J895q110M988k544L540Q345m354
$$ 1001 -5433 -4147 1094 -1132 3232 -5346 5734 7629 -481 4507 1963 5503 13848 9494
13398I494j5460k676j0886l091J512J114n272L118n743M584J0624j651O411j0911
$$ 9494 -5966 -8642 -19528 -22619 -21107 -19993 -25265 -22147 -27890 -23306 -12682 -14333 -7922 -18833
13384a8833K466J0141J3193K642o930k348r250l752O101R037J2546R033j364j0037
$$ -18833 -16367 -6226 6967 9609 2679 331 -8919 -12671 -6570 2467 15013 24046 22682 12645
13370A2645j0752R656M717n727n890P922r986p173j0365q29P493R930P35J6028
$$ 12645 1893 11549 16266 10539 4649 12571 2585 -4588 -14953 -15782 -8289 1641 2376 18404
13356A8404J4625j1507j1253k717K622q918n599J0668j501p418j393k045L92R684
$$ 18404 33029 21522 10269 7552 10174 1256 -4343 6325 4824 -2594 -3987 -6032 -5640 4044
13342D044m290j7695o476J7610L611J189k99l574N335k2R188O454n862R674l314
$$ 4044 -246 -17941 -24417 -6807 -3196 -2007 -2306 -5880 -545 -567 8621 15075 9213 18887 15573
13327A5573j6726o110j8597Q466R56L247M922J5963j844N872p050n11j0827j0132
$$ 15573 -1153 -7263 -25860 -17394 -16438 -13191 -8269 7694 5850 11722 4672 4161 -6666 -16798
13313a6798q891Q811M958n377M545O018m36q073J761J4080O846j1237p027OM214
$$ -16798 -25689 -16878 -11920 -17297 -12752 -6734 -7170 -15243 -13482 598 7444 -3793 -10820 -10814 -6600
13298f600J0113J1542N263O604l185j5749q946Q298P649m550L383L656p599l49
$$ -6600 3513 15055 20318 26922 23737 7988 -958 7340 14989 10439 13822 17478 9879 9530
13284I530l774q161p74J2797J1574j1648n985M330R778m54n614j406j0053O392
$$ 9530 5756 -2405 -3179 9618 21192 9544 3559 7889 17667 17213 11599 10193 140 6532
13270F532n155j9124j833J2640J2066j1751j2448j06j724J9346R574j4320r033
$$ 6532 1377 -17747 -19580 -6940 5126 -6625 -19073 -19179 -20903 -1557 8017 -6303 -15336
13257a5336J2606l283r455P297L229r177P104J9368J814P84r532n789k950M488
$$ -15336 -2730 -6013 -15468 -8171 -4942 -14119 -7015 12353 14167 14951 5419 -370 -3320 1168
13243A168r498j9330M212K718J821r82P887r92j128O530l699J026L011Q290J1570
$$ 1168 -8330 -27660 -23448 -20730 -18909 -19891 -12004 -12996 -14124 -7594 -11293 -10267 -7256 1034 12604
13228A2604L09p01K493j1840j687J8341m395j982j2518J08k521n656q696j555
$$ 12604 12913 12212 14705 2865 1178 19519 15124 13142 624 732 -1789 -7445 -16141 -17696
13214a7696J9367n559j1523L733Q893K288n85j2618m276R891J162k639R044P131
$$ -17696 1671 -3888 -15411 -11678 -2785 -497 -1082 -13700 -17976 -8085 -6923 -9562 -518 6613
13200F613k565p857j9573k779k581P463J3227l811M738K848q728l761N815R876
$$ 6613 4048 -3809 -23382 -26161 -28742 -21279 -8052 -11863 -7125 -4277 -13005 -16766 -10951 -1075
13186a075N021p233j441j3692P996J9010R169r44j815L133l7k0497j6028j0924
$$ -1075 3946 -3287 -4728 -18420 -10424 8586 17755 16811 14996 18129 18092 -2405 -18433 -29357
13172b9357N581J1236j945M823L589p006P026N468M810r670m217P893R359l993
$$ -29357 -23776 -12540 -14485 -9662 -6073 -13079 -6053 -585 4225 -5445 -9662 -1769 7590 3597
13158C597j1468j2576K994p566P06J1092P173l001q574o558P150J4201p269N185
$$ 3597 -7871 -20447 -17453 -25019 -24313 -13221 -6048 -9049 -17623 -24181 -17031 -2830 -10099 -4914
13144d914J3455N417k996j63o398j1591m026L268J38M607N842k279k290p253j0793
$$ -4914 8541 13958 10962 10799 4401 -7190 -11216 -7948 -7810 -3203 2639 360 -1930 -9183 -19976
13129a9976R753R550n597n70J768N858N277N521J0434R456j2698j1149r592M154
$$ -19976 -10223 -673 -6270 -6840 -5072 786 6063 11584 22018 31474 18776 7627 -1965 2189
13115B189O918M431k231P454j4800M610m792P356L162n113J2170j650n897p665
$$ 2189 9107 13538 11307 18761 3961 8571 3779 11135 14297 9184 21354 19704 13807 6142
13101F142n845r784j2773J3780J5293P709N405j46m184q78j0003J478k921N392
$$ 6142 297 -9487 -22260 -8480 6813 14522 19927 19781 15597 14719 4716 6194 3273 8665
13087H665J3141l324j186L93o572n502o132J77N962J6322L656r751j0609J780
$$ 8665 21806 18482 17296 17689 11117 5615 -517 -340 5622 21944 25600 15849 5240 7020
13073G020k596k204Q683P674P171Q821Q809N353P270q918l3892l2124M178J0606
$$ 7020 4424 2220 10903 18577 25748 34569 43378 48731 56001 47083 13191 -18933 -14755 -4149
13059d149k737M426P221K319m762O113l208n899P949l258l678k16N680L492p405
$$ -4149 -6886 -2460 4761 7080 2318 8431 5223 -676 7273 4015 337 121 5801 9293 1888
13044A888p32L0L44l822o168J5955J505j1693J2447P073j3164K103J5719P781
$$ 1888 1156 1186 1530 -2292 -8460 7495 9000 -2693 9754 16827 3663 5766 21485 29266
13030B9266K330N172m459J780J7803J7335M4956M2126K0815M059p942k7275m1519
$$ 29266 31596 36768 32309 34089 51892 69227 114183 156309 177124 181183 173241 145966 104447
13017A04447l4591j2378j8443j1559l060q466q484k263L402R046J2564J9624o105
$$ 104447 69856 57478 39035 27476 24416 15950 7466 5203 8605 17651 30215 49839 43734
13004D3734k5522j1285l870j131m462q457M127r72L297J587R057J0421J5173j930
$$ 43734 18212 6927 3057 1926 -2536 -10993 -6866 -7838 -4541 -2954 6103 16524 31697 29767
12990B9767l373L340q507o649Q705q365m510R231J2273J943J1749M7211M9609
$$ 29767 26394 29734 21227 14578 23283 14918 10408 19639 31912 33855 45604 92815 142424
12977A42424L6658K3334q605l8121m5135l8462j7204j1429j5145j7774q281m912
$$ 142424 179082 202416 193811 155690 110555 72093 54889 43460 28315 10541 2260 -2652
12965b652K2553R217k116j6600k219j1714j4100J407Q486J4788J0904m197R862
$$ -2652 19901 29118 27002 10402 8183 -3531 -17631 -16224 -7738 7050 17954 13757 23619
12952B3619J3879o033j7467l600p232j3659L363Q261n473N366K1149P459q838
$$ 23619 37498 31465 13998 10398 3166 -10493 -7130 1131 -4342 1024 22173 29632 20794
12939B0794k1J241J27J1434J5925k05J0793J5762J6296J455j4582j6919j7004
$$ 20794 20773 22014 22141 33575 49500 49295 60088 75850 92146 93601 79019 62100 45096
12926D5096r014l552j1248k1095j0840R645J4120j5869j2825J4194K3210J2300
$$ 45096 36082 32530 21282 187 -10653 -1008 13112 -2757 -15582 -1388 21822 34122
12914C4122j172p362k596J548l0857J784N092L20K939J175J910J2122o261n596
$$ 34122 32950 25588 22992 24540 -6317 -4533 559 879 3818 4993 6903 19025 12764 7168
12900G168j2426R138N409J840N559J4371n297j0360l227j0153j7111q112j1603
$$ 7168 -5258 3880 9289 11129 16688 31059 25762 15402 12175 2022 -15089 -23201 -34804
12887c4804M768J1670J0092J0195p037J289O685K083m782k84P982J2617R87p608
$$ -34804 -30036 -18366 -8274 1921 -5116 -3827 2858 4941 159 -125 7857 20474 21461 13853
12873A3853r861q022O02j859L993J3365P956M463l085j625j3689o234L04O829
$$ 13853 3992 -4030 -3428 -5287 -1294 12071 20027 24490 21405 19780 6091 -143 161 6990
12859F990J1577N365p045n535n415J634L496p22k341M157O08j0889m426l888K081
$$ 6990 18567 23932 16887 11352 5937 7571 11067 10345 8004 12161 12769 1880 -2546 -6434 -4353
12844d353J1856J2887q117j4610K928P63p719P303m901J2133j612p131q622P07
$$ -4353 7503 20390 12273 -2337 591 1354 -6365 938 -3963 8170 6558 -573 -9195 -8488
12830h488J5728O318N617L354O87j1334j5879P647K255J3189J0122j2374l443
$$ -8488 7240 13558 19175 22529 23216 11882 -3997 3650 5905 19094 29216 16842 13399
12817A3399J739l70q071k021O956M703p260m793q497n236p5J2521J2936m375j2845
$$ 13399 15138 14768 6697 4676 11632 16335 9075 4282 -4215 -9451 -9526 2995 15931 11556 -1289
12802a289J0358J2703J048n060p009j2814J0984k741l934l015N459R957N594r723
$$ -1289 9069 21772 22820 17760 10751 -2063 8921 6180 2246 -769 4690 14647 20241 10518
12788A0518j1407J107m111l45P198q018o743J4688K5364P221k2022j0787P665
$$ 10518 -889 218 -3893 -4238 2960 -5058 -11801 2887 28251 35472 13450 2663 10328
12775A0328L88O349L919l192j0266j7202L855Q397J42K160L577m096R273K516
$$ 10328 10716 17065 20984 17792 7526 -9676 -5821 2576 2718 4878 8455 4359 13632 16148
12761A6148N211m141j5483j88J1258m782j2895r366J3092J0100j4218j0656J2417
$$ 16148 21359 17218 1735 1547 12805 8023 -4872 -14238 -1146 8954 -5264 -15920 -3503
12748c503J2903J1367r49o788r092Q34o453j5952J2934J2698j0093j0514O993
$$ -3503 9400 20767 19818 13030 3938 4772 -1681 -17633 -4699 7999 -2094 -12608 -5615
12735e615R834J7760J647j2L839r379k3902j403J028k367J4534J6054J018k1637
$$ -5615 4219 21979 23626 23614 27453 18074 -5828 -7231 -6203 -8570 5964 22018 23036 1399
12721A399r693r604j1393J5634O594n233K901n573J222K902P824L854m791j0994
$$ 1399 -8294 -17898 -29291 -13657 -7063 -12296 -9395 -14968 -13746 -10844 -3020 834 -3957 -14951
12707a4951o172O686J0752Q603N171R465j279j7490n703j820J049j392o188J3120
$$ -14951 -21123 -14437 -3685 4918 10089 19554 18275 785 -4918 -6738 -5689 -7081 -13269 -149
12693a49n85k1446p373J1800J5143J4393J6387m508l460j1541j6859m249P219
$$ -149 -734 -22180 -29553 -17753 -2610 11783 28170 23662 20202 8661 -8198 -12447 -5228
12680e228Q720R627j5212j7313J94L368J5884P169r372j2813P825K7075J0262
$$ -5228 3492 13119 -2093 -19406 -19212 -15844 40 7209 -2163 -14976 -7151 19924 30186
12667C0186o878r835j098N600j2611k419J5930R392j5906K446q461j4648j5075
$$ 30186 23308 13473 12375 17975 5364 2945 18875 28267 12361 14807 6346 -8302 -23377
12654b3377j1314J7385J7350n907M703J5237r107l084p562K232J3112P124n396
$$ -23377 -34691 -17306 44 -5863 -1160 14077 4970 1886 -5676 -3444 9668 16792 11396
12641A1396k048J709K0237M31l673n809L168o142q044K1180J1363n117j4105j3649
$$ 11396 9348 11057 31294 31725 28052 22243 25411 19269 11225 32405 43768 38651 24546 10897
12627A0897M604P22n724O149L51Q30J563j0209p184M375J333J594J2238Q32n978
$$ 10897 15501 16223 10499 16648 16999 17829 19392 9183 1999 6374 7707 9301 21539 22371 16393
12612A6393J1801k584p747L003j369k2939o817Q146J3869K603k478J3659m773
$$ 16393 28194 25610 17863 20866 19497 -3442 -10259 -2113 11756 14359 11881 25540 20767
12599B0767l334O866j2978j7928P864J7460J8299K838p944K021r120q554Q328
$$ 20767 17433 24299 11321 -6607 1257 18717 37016 39854 31910 33931 24811 16257 24585
12586B4585L935L389r304r176N794L021k961m267K983J191J0089j0417k917O542
$$ 24585 28520 31909 22605 13429 19223 22244 19283 15016 17999 19190 29279 18862 15945 22487
12572B2487q275r947P17K167j0339M846j889J426k551P406J8117l824k518p27
$$ 22487 14212 4265 4982 7149 -3190 1656 -233 1193 -1358 6048 24165 20341 17823 17096
12558A7096j1498j2192p752J1671k648m519K1670J3145P16m657p826n388M811
$$ 17096 5598 -6594 -14346 -2675 -5323 -9842 11828 24973 25689 21032 13206 7818 12629
12545A2629l203j5265k640l842J3404N055P703L347M820j1622r384R336J2016
$$ 12629 9426 -5839 -8479 -12321 1083 6138 13841 17188 22008 10386 1002 10338 22354
12532B2354o782p433N989l013K541O172R913n353r479q14j5585j8435n219J5753
$$ 22354 15572 8139 14128 11115 13656 19828 29741 24388 14909 14095 -1490 -19925 -25144 -9391
12518i391J2847J1345R548j77K059K451j3316K67J7687q521r634M57j089l810
$$ -9391 3456 14801 24349 24172 26231 28682 15366 15633 33320 24799 15165 15622 14533 10723
12504A0723J4722M527m844j412R45q548k00l286j0893N418J7679O764j227n453
$$ 10723 25445 29972 25128 23716 24661 16113 15913 12627 1734 7152 24831 31595 30368 24915
12490B4915k341n37N618J0021O228o558n922p091o708p333N459J8844k719o975
$$ 24915 22574 22037 27655 37676 43904 37346 31424 24333 17625 10292 15751 34595 31876 24901
12476B4901n815j547N092R63o892O64Q88P132m0j511l64Q09P245M306j0669j0590
$$ 24901 19086 17539 22631 23594 16702 17366 18254 25386 25346 23835 23471 24280 31525 35831 25162 14572
12460A4572r150M732l766j0435J0948K2715K268o252j219l840L035R22o837k465
$$ 14572 5422 10154 6388 -4047 6901 29616 31884 25632 24413 20573 23608 24530 17693 15228
12446A5228k400O355N645o676k248N310n29P859R011m315q20j750r180J865o307
$$ 15228 12828 19183 24828 18152 15904 21214 20685 28544 37555 33240 32420 30670 21490 23355 17048
12431A7048L56N447p042r600Q972J5825j4514L059L64j627P732J3834N918n756
$$ 17048 17404 22851 15809 6209 15181 31006 16492 19551 19915 18288 26020 39854 45772 40016
12417D0016M315J1916j972j4455j8265l335J575M350m42K313L849j555p264M326
$$ 40016 44331 56247 54275 39820 21555 18220 19795 24145 23703 26016 29865 28310 21046 25372
12403B5372J0852K12K525M319m96m656o627L128M76R471j2113k5014q339P402
$$ 25372 36224 36436 38961 43280 42784 38128 31501 34629 35105 44576 32463 7449 -890 6512
12389F512J9255r794p970J5131K4292N588q941n628P75K651j2426Q081K331q429
$$ 6512 25767 15973 8003 23134 47426 53014 44073 38445 39220 41871 29445 37526 39857 31428
12375C1428k297m053r429m624J3575M716l287o903K206O853m535j236J4632J2513
$$ 31428 29131 25078 15649 11025 24600 29316 26029 19126 21332 28185 23650 22414 37046 49559
12361D9559q809N555m223l94Q405J1545J031l108l860r172k986j030q532K981
$$ 49559 40750 46305 42082 41688 50093 61638 62669 59561 55701 46529 43543 42513 33981 36962
12347C6962q135m414J075M593R099K612r615M142R511J0456n871r693q168k357
$$ 36962 28827 24413 25488 30081 39180 41792 32177 36319 45830 56286 50415 40722 32554 30197
12333C0197K193o875O753j467R69m05N035J085R271R867Q89J0493J2478Q126n293
$$ 30197 32390 25515 32268 30801 31770 31365 36400 37485 46756 56623 57512 68005 80483 88609 83316
12318H3316j6876k0932j4114O15J4454n055p838K181j1129L924N283M54J5952
$$ 83316 66440 45508 31394 32009 46463 41408 33570 35751 24622 28546 33829 34283 50235
12305E0235O57j3743m607J0325J051K938L349l137L358M425p712N080R705r356
$$ 50235 50892 37149 32542 42867 43918 46856 50205 47068 50426 54851 47139 52219 61924 52568
12291E2568l417n578l09O941J3491J020n45q880P279q464j4449J537R784Q140
$$ 52568 49151 43573 43264 50205 63696 64716 64171 55291 62570 54106 39657 41194 50978 59118
12277E9118n96L820J199P795O10q846j1625n818Q948M116L941J264o660j2482
$$ 59118 58522 62342 63541 71336 71946 63100 51475 45657 54605 58721 62662 63926 57266 44784
12263D4784q246K0583O27k963l062N142M487j899k101o208k152M596R267J1130
$$ 44784 36538 57121 57748 54785 51723 56865 61352 59453 57352 51144 48992 53588 62855 73985
12249G3985l68N054l60M251M45m061m895q082K141j90k395K8J5105J5583L506
$$ 73985 73617 78671 78311 82562 83007 78946 74051 65969 68110 67920 65525 65553 80658 96241 99747
12234I9747r264m816o617J755L851L289R857N796l439j5915J459L095J3634n21
$$ 99747 90483 85667 79050 80805 84656 87945 97802 103598 100159 84244 85703 88798 102432 101911
12220A01911k143O609J612j6847p017L697Q213J203M970p876l402L366J1382J2155
$$ 101911 99768 106377 107989 91142 84125 87822 96035 97238 102208 94332 90930 94296 105678 117833
12206A17833n813p435q527L453J663j2049J204J6184J8420J213o819p855O107
$$ 117833 112020 104585 96058 99511 101174 89125 90329 106513 124933 126146 119327 111472 117579
12193A17579p361P147p137j589M342K327Q08j938J2054n470N83M100N781m861
$$ 117579 110218 117365 110228 108639 112981 115308 116116 114178 126232 120762 121345 125445 131226 126365
12179A26365j9817K630J5646j1136p152J3984o880J217m140J3343N958j131L054
$$ 126365 106548 109178 124824 113688 106536 120520 113640 114857 110717 124060 130018 128887 131941
12166A31941Q948L171j385l258m552R618N446M1K101J78J4249m457K696J3475
$$ 131941 140889 144060 142675 139417 134865 144483 149929 149970 152071 152249 166498 162041 164737 178212
12152A78212j815r660j8179j1137J0778K2253O650j0891J519N348P897k681k213
$$ 178212 176397 166737 148558 137421 148199 170452 177102 166211 167730 173078 180975 178294 176081
12139A76081R2j238N685L703N321P287N19P54J86M223J282q682n963M833O338
$$ 176081 176173 174935 180620 184323 189644 196931 197450 198204 198390 202613 203895 195213 189250 194083 200421
12124B00421j811R487N735l472M840P705J8537J5138N152j0068j0520Q715J1561
$$ 200421 198610 208097 213832 210360 215200 222905 241442 256580 261732 251664 241144 249859 261420
12111B61420O686J2495p163Q323J2549j491J1411K45M874K5599K6312Q744j1215
$$ 261420 268106 280601 273438 281761 294310 292819 304230 304475 309349 334948 361260 370004 358789
12098C58789j0120m118N619Q698O27O522R372Q836n861P340J0957J0966k370q910
$$ 358789 348669 344551 350170 358868 359495 366017 375389 384225 378364 385704 396661 407627 405257 396347
12084C96347J5179M943j054J843M874j894l792K1323J4241j650P931p314R676
$$ 396347 411526 416469 415415 417258 422132 420238 416446 437769 452010 450360 458291 450977 460653
12071D60653J8056J7634O612n18J8814n23J8309J2764J1646J8743J4337r046O35
$$ 460653 478709 496343 502955 502437 521251 520728 539037 551801 563447 582190 596527 587481 588116
12058E88116J7467J3134J1883J2037J8033J5509O599K2753N568K4865L0594K3682
$$ 588116 605583 618717 630600 642637 660670 676179 682778 705531 711099 735964 766558 790240
12046G90240O666J3993K8526J9388K2847K9056K4518J6636L5085L3731K0422L0829
$$ 790240 796906 810899 839425 858813 881660 910716 935234 951870 986955 1020686 1041108 1071937
12034A071937K5386L1615K5152K0784K9480L9927L7248M7198N1649M6320M2406
$$ 1071937 1097323 1128938 1154090 1174874 1204354 1244281 1281529 1328727 1380376 1426696 1469102
12023A469102L6803M8858M3029N1580O4981O5975O6760P4854O5067Q2428P9813
$$ 1469102 1505905 1554763 1597792 1649372 1714353 1780328 1847088 1921942 1987009 2069437 2149250
12012B149250Q2640P8551J02038J10804J08114J10313J08754J31875J28960J62144
$$ 2149250 2231890 2310441 2412479 2523283 2631397 2741710 2850464 2982339 3111299 3273443
12002C273443J76998J78869J87821J96036K18274K34821K52805K74837L02269
$$ 3273443 3450441 3629310 3817131 4013167 4231441 4466262 4719067 4993904 5296173
11993E296173L19020L45083L70725L87809M41877M73299N22783N76084O17079
$$ 5296173 5615193 5960276 6331001 6718810 7160687 7633986 8156769 8732853 9349932
11984I349932O70221P26769P92889Q47371Q95346R48250J015700J073554J110793
$$ 9349932 10020153 10746922 11539811 12387182 13282528 14230778 15246478 16320032 17430825
11975A7430825J145778J130677J086089J036084R31142P85330O00953L85605J75288
$$ 17430825 18576603 19707280 20793369 21829453 22760595 23545925 24146878 24532483 24707771
11966B4707771o8444l14080n22646p20652q85027j009904j076377j110450j118831
$$ 24707771 24639327 24325247 23802601 23081949 22196922 21187018 20110641 19000191 17881360
11957A7881360j103396j058924j029225r85396r15731q48350q08082p57361o96430
$$ 17881360 16777964 15719040 14689815 13704419 12788688 11940338 11132256 10374895 9678465
11948I678465o27013n94796n32766m86918m60995m24192l95348l55501l38948
$$ 9678465 9051452 8456656 7923890 7436972 6975977 6551785 6156437 5800936 5461988
11939E461988l03759k84343k61623k46060k28879k23264k03392j75330j63321
$$ 5461988 5158229 4873886 4612263 4366203 4137324 3914060 3710668 3535338 3372017
11930C372017j56084j56388j37050j17557j22797j25171j07183r8172q7796q7785
$$ 3372017 3215933 3059545 2922495 2804938 2682141 2556970 2449787 2351615 2263819 2176034
11920B176034p5106r1698r2809o7857o2223o1683o2057o6226n1740m2355n9187
$$ 2176034 2100928 2009230 1916421 1848564 1786341 1724658 1662601 1596375 1544635 1502280 1443093
11909A443093m7504m2553n3564l8478l2653k6195l9022l0966k7840k9074l6221
$$ 1443093 1395589 1353036 1299472 1260994 1228341 1202146 1163124 1132158 1104318 1075244 1039023
11898A039023m2717k5155k6667k8043k7893k6533k716l1517k9501j3250l586k1741
$$ 1039023 996306 971151 944484 916441 888548 862015 859299 827782 798281 785031 781445 759704
11886G59704j7372j2026j6707k0610k0766k1943j6880r008j5093j9209j0947j5928
$$ 759704 742332 730306 713599 692989 672223 650280 633400 624392 609299 590090 579143 563215
11874E63215k1067P921j0392k8975p193o614r357r858N05L33p563q162q044k740
$$ 563215 542148 550069 539677 510702 503509 496895 487538 477680 478185 478518 470955 462793 454749 452009
11860D52009n108j1410j8882j6178j698p958m495J1986J144r952j4390r078j0830
$$ 452009 446901 435491 416609 400431 398733 390775 386280 398266 399410 389458 375068 365990 355160
11847C55160m427j723l264j0221j2582k611Q166M064j3363k2637k1433p207J876
$$ 355160 350733 349010 345746 335525 322943 320332 328498 332562 319199 296562 275129 267922 269798
11834B69798J6459M750j3764M427j9560r41K0190j4j5204j2147j2808O044j641
$$ 269798 286257 291007 277243 281670 262110 261169 281359 281345 266141 253994 241186 247230 245589
11821B45589j1480L097J518r324o777K0266l403j6283p67j829O895k593j3064
$$ 245589 234109 237206 238724 229400 222623 242889 239486 223203 222436 220607 227502 224909 211845
11808B11845L148j8312K078R472M61K670p786n618j3317q811Q704J1618j0131
$$ 211845 214993 196681 198759 208231 208692 211362 203576 197958 184641 175830 184534 196152 186021
11795A86021q018j187K420O166O392o317j957J3752j574o453n479j5740o481P701
$$ 186021 178003 176816 179236 185402 191794 185477 183520 197272 195698 189245 183766 168026 161545 169246
11781A69246L06r956j4151r077K810M255l048m157L45m850K01J565J930o897Q770
$$ 169246 169552 159596 145445 136368 139178 143433 140385 136228 136573 131723 131924 133489 135419 128522 137292
11766A37292q632o057M32j082r879P432J1326J219k459n702j753L41M814j0522
$$ 137292 128660 122603 123035 121953 112074 119506 130832 132051 129592 123890 122137 122478 127292 116770
11752A16770l864L060j926k901n518Q39J0801l245p666n188j7153j8730J2065
$$ 116770 112906 115966 114040 111139 105621 106460 117261 114016 106350 101162 84009 65279 77344
11739G7344O653n399J9950O724j1027j0911l046k901L714J4682R758n390M935
$$ 77344 83997 78598 98548 105272 94245 83334 80288 77387 81101 95783 105541 100151 105086
11726A05086K048k530j1171n964J917o219P018m97m34p493L234n569K432k708
$$ 105086 107134 104604 93433 87469 89386 83167 90185 89688 89254 81761 84995 79426 81858 79150
11712G9150J5878l722M958k529j2676n558J3387Q467l314j0190l447L187q724
$$ 79150 95028 91306 96264 93735 81059 75501 88888 97355 94041 83851 80404 83591 74867
11699G4867O474O64J4647o518k5546n55L1955J3856j5356j6075k248m416N370
$$ 74867 81341 82005 96652 90134 64588 64033 95988 109844 94488 78413 76165 71749 77119
11686G7119Q092m79N670j6256j4460j3887J0131J7066Q670J280o252J0248j1867
$$ 77119 85211 84732 90402 74146 59686 45799 55930 72996 81666 82946 76694 86942 75075
11673G5075o446Q323n986l806L523j523J1202R557j1853j2420N777R789j0124
$$ 75075 68629 76952 70966 67160 70683 69160 80362 89919 78066 65646 71423 81212 71088
11660G1088n976P816o302j3571j666J1919O056L917l29L565j1342l918o208R905
$$ 71088 65112 72928 66626 53055 51389 63308 69364 73281 72952 76517 65175 61257 55049 64954
11646F4954k579N230j238l692l096j1511r333R40o155P749P535n438k260j402
$$ 64954 62375 67605 66367 62675 59579 48068 38735 39675 33520 41269 48804 43366 41106 39704
11632C9704k337k355n762P944K2147p839o248n547J6480K773k7781q996M268p31
$$ 39704 37367 35012 29250 37194 59341 51502 45254 39707 56187 58960 31179 22183 26451 25720
11618B5720J766m656J228J0393O826j3331o801Q969J2542q460m549L774N845R124
$$ 25720 27486 22830 24058 34451 41277 27946 21145 30114 42656 34196 29647 33421 39266 48390
11604D8390P41L895K273N91m397r522r021j678K680j031j3689Q996K812R785J0870
$$ 48390 49131 53026 55299 55890 51493 41971 32950 31272 33952 32921 19232 28228 31040 40825 51695
11589E1695m787q016p091o06K5705J5229j7703j8290l671M736J6092N616j2441
$$ 51695 46908 38892 31801 31195 56900 72129 54426 36136 32465 37201 53293 58909 46468
11576D6468l278P419J5998J601n392j0217q201q755K64j5310k949J4751K7638
$$ 46468 43190 50609 66607 68208 62816 52599 44398 35643 35907 20597 17648 32399 60037
11563F0037P13j5439L56J0800L430j5357p517m809l49k239J775J0655j4507p858
$$ 60037 60750 45311 45667 56467 59897 44540 37023 32214 31865 29626 31401 42056 27549 19691
11549A9691P363O674M496O444R689N0p934k0900J4473J7599o390l543m415m889
$$ 19691 27054 33728 38224 44668 54357 54407 46473 25573 40046 57645 51255 47712 43297 38408
11535C8408k1890m454K045M944O192O951n856R581J9189J023p064P076k8j5097
$$ 38408 16518 12064 14109 19053 25245 32196 26340 35921 55110 56133 49069 56145 56117 41020
11521D1020l398L774K418M208J3036J0592J9557k833j2832j0298j261r250j9476
$$ 41020 37622 41396 43814 48022 61058 71650 91207 88374 75542 65244 63983 54733 35257
11508C5257m103L468o193o78J967j904j1740k05j502O978J0134K0414k797L689
$$ 35257 31154 34622 28429 27751 29718 27814 16074 15869 14367 21345 31479 51893 49096 52785
11494E2785j7309r46J352p744p365n031Q891Q039r275M566R536j3958j8169k178
$$ 52785 35476 34530 35882 28138 20773 15742 24633 32672 23397 27963 37499 23541 5372 3194
11480C194J0827J9774N918p420l670j575M708j3699J8901J0062Q079k430j7796
$$ 3194 14021 33795 39713 32293 28623 27048 31756 18057 36958 47020 55099 52669 34873
11467C4873m418k428R892M154m615j2862q606l234N714R603M436J318J4803Q485
$$ 34873 30455 28027 37919 42073 37458 24596 15990 12756 18470 28073 32509 33827 48630 57115
11453E7115j7595j4049j0002L367K475q953K339J757J47J0267R514m64Q120N085
$$ 57115 39520 25471 15469 18836 21311 12358 14697 16454 16601 26868 36382 35918 44038 49123
11439D9123o406m639l761P340J4377j271r540j570K3q182M477k788p755r974K90
$$ 49123 42717 38078 34317 41657 56034 54763 45223 43653 43676 35494 39971 37183 29428 19454 19744
11424A9744N029o857q109N705M526Q793l538O00q24k494o71j8091j319J3032o443
$$ 19744 24773 17916 9807 15512 20038 28831 25293 25893 25069 22575 21904 3813 2494 15526 9083
11409I083M891Ol433m266L9J2228O888J648M108o082M621O018L95p239j8113p629
$$ 9083 13974 13980 10547 6281 6320 18548 25436 27084 31192 25110 29731 35749 36144 28905 10792 3163
11393C163K949n184l286J0648J1505L235J443k178K786p127L738J1792J0523l464
$$ 3163 6112 928 -2358 8290 19795 23030 24473 22295 25081 17954 21692 33484 44007 40543
11379D0543K891k768q759P09K747R292J5402j4667j5986K353M290K54j991o283
$$ 40543 43434 40666 31907 32616 35363 44655 60057 45390 29404 31757 36047 36301 34310 28027
11365B8027K17O483o06n661J320k886M777l947k655q82k1079R173J4650J2438
$$ 28027 28244 34727 34121 28460 29780 26894 31671 27724 25069 24187 3108 12281 26931 39369
11351C9369J030J449M197Q061l390k357n692j4602k172J971L520K320k823k4374
$$ 39369 40399 41848 46045 54106 50716 48359 42667 28065 25893 27864 31384 33704 30881 6507
11337F507J81J6465q566o491K0991J2157o70J042J021r318j151P687J3676l85
$$ 6507 6688 23153 14587 8096 29087 41244 40574 41616 42637 33319 32168 39855 53531 53146
11323E3146l503j3700j0240J728O631q164m343J6143L71q962L995k237q425n790
$$ 53146 49643 35943 25703 27431 34062 25898 21555 37698 38069 29107 33102 30865 22440 16650
11309A6650J4353J5861M113p008R00P625m478r444k713M525j0051r476L853m817
$$ 16650 31003 46864 50977 43969 44869 52494 48016 38572 35859 40384 30333 20857 24710 19893
11295A9893R624J0733q84l683q9q021M439J42j489L985j1349P39K643l216N41
$$ 19893 29517 40250 39366 35683 35594 27573 32012 32154 30665 34650 23301 24040 26683 23467 24008
11280B4008J186p492J514j261L173Q217J2684J156o691J950J2780l510p279o760
$$ 24008 25194 17702 19216 17955 21128 29345 42029 43185 36494 38444 51224 47714 40435 33675
11266C3675n379n85J0651o333o767P282K288p787l754Q931R935n144L518N44r62
$$ 33675 28296 27711 38362 32029 25262 32544 34832 27045 23291 32222 42157 37013 40531 41075 40113
11251D0113q288J981j541M236N100q97m190j179l826P276J5826J7847N403k080
$$ 40113 31825 33806 32265 36501 41601 40704 36514 35335 31509 38785 54611 72458 77861 75781
11237G5781j4895J197j0508O286O528j6446J853j810j065P690o030j0555m932
$$ 75781 60886 62083 51575 57861 64389 47943 49796 47986 46921 54611 48581 38026 33094
11224C3094j0098j705p437J0655J713J088j0130l423K181l175J718J5573M384
$$ 33094 22996 21291 13854 24509 26222 27310 17180 13757 15938 12763 14481 30054 34438
11211C4438O397R340o521n03j4116K171O507j938k871J1592J1722N312k0216m058
$$ 34438 40835 50175 43654 43151 29035 31206 37713 35775 32904 44496 56218 61530 41314 37256
11197C7256J3108R381L446N330k488Q246n476Q58o07M939N261K190K2050J6356
$$ 37256 50364 59745 63191 68521 66033 74279 68803 69661 69054 73993 79254 81444 103494 119850
11183A19850O567M922J735M321J6336L1089L3576J5574J9905K0870L9344L8245
$$ 119850 126417 131339 133074 137395 153731 184820 218396 233970 253875 274745 314089 352334
11171C52334N5912P2180N8350N1061M8220L0041R896p575n3560o0576n3098n0605
$$ 352334 408246 480426 538776 589837 638057 668098 677994 670419 616859 556283 503185 452580
11159D52580n3697m9371l1040k7088l4667k9457j6614j5623r769j2088k5304k4464
$$ 452580 398883 349512 318472 291384 256717 227260 210646 195023 185254 173166 147862 123398
11147A23398J844j4412n382Q577l693L708P216Q066R1J290J8220K8455K8708J5871
$$ 123398 125242 110830 105448 114025 110332 114040 121256 129322 129413 130703 148923 177378 206086 221957
11133B21957J5377M3517M0578J2731K852k6089l8619m8883m6600k2891j7484j1490
$$ 221957 237334 280851 321429 334160 337012 310923 272304 223421 176821 153930 136446 124956
11121A24956m765J187N292m213j0265M43j3945j2237j5974L491J2827l712m074
$$ 124956 120191 121378 126670 122457 112192 112635 98690 86453 70479 73970 86797 83085 79011
11108G9011r718k159m675l379J1310R854n002p575l079N887K306n294J3179R076
$$ 79011 69293 67134 62459 59080 70390 80244 75242 67667 64588 70475 72781 67487 80666 89742
11094H9742l403k905k175j493j1678j4662p516j258L100J1831R86j6100o629L022
$$ 89742 86339 83434 81259 79766 68088 53426 45910 44652 47752 59583 60569 44469 37840 40862
11080D0862R919R851J9525K387j4645P764K087L30L552Q408N655K353R010J4613
$$ 40862 50781 60632 80157 82544 67899 75663 77750 78080 81632 90040 95695 98048 107058 121671
11066A21671M872j2919j2663k884l934L386K709R20Q924J107j4879j3015j6738
$$ 121671 126543 113624 100961 98077 94143 97529 100238 101158 110082 111189 96310 83295 66557
11053F6557m634M564J4059J4258N782l120R919K4517J3488P396L448k026J0752
$$ 66557 61923 66487 80546 94804 100586 97466 107385 131902 145390 152786 156234 154208 164960
11040A64960j2142k974N267N681J6086J6272J4372J2556J0380j1222l461K64L538
$$ 164960 152818 149844 155111 160792 176878 193150 207522 220078 230458 219236 215775 216039 219577
11027B19577q070j941m18J9016K1771K6930K1358J7365o512j424K324m135p241
$$ 219577 211507 209566 209148 228164 249935 276865 298223 315588 309076 307652 309976 305841 298600
11014B98600l509k591N714K768R181n378j8614j9191k7768l1072q443r861j7538
$$ 298600 295091 292500 298214 300982 310163 304785 286171 266980 239212 208140 199697 189836 172298
11001A72298q614j0318J4292J898J645O844R01k0405k3800r83R858J5462q494
$$ 172298 163684 153366 167658 169556 171201 178045 178946 158541 134741 133758 143616 159078 150584
10988A50584l470j3004n077r799j322q43M244J2781r827k0284o728Q403j0281
$$ 150584 147114 134110 129033 119234 117912 117069 121313 134094 124267 103983 97255 105658 95377
10975I5377j7878k65r260p848M517P14O556J9067P214J0429K532o830L387K546
$$ 95377 77499 77234 67974 60126 64643 65357 71913 90980 98194 108623 111155 104325 107712 110258
10961A10258J570j076O770L718o606q034n892M422J1939J6944m352M003N646J485
$$ 110258 111828 110752 117522 121240 114634 106600 100708 105130 117069 134013 129661 133664 139310 140795
10947A40795j574J8499J3679n146r552K59J0858l21J6495R033R107Q711J6574
$$ 140795 139221 157720 171399 166253 156701 156960 167818 167497 183992 193025 202132 210843 227417
10934B27417m669p917Q856K8716L6142N2418N3083O5505Q9954J02525J26226J43429
$$ 227417 222748 214831 223687 252403 288545 340963 394046 459551 549505 652030 778256 921685
10922I21685J29483R8305Q2945M9202P732j8430l9002o8491j02292j09452j20280
$$ 921685 1051168 1149473 1232418 1281620 1289352 1270922 1231920 1163429 1061137 951685 831405
10911H31405j28987j10477o7502m6892l0473k2797j8637q351p875q459K66N301
$$ 831405 702418 591941 524439 477547 447074 424277 405640 397289 389414 380955 381221 386522
10899C86522j874M144j5804k5697n682r113Q750N001J6196J7134K3996J5158P268
$$ 386522 384648 388792 372988 347291 341609 332496 341246 346247 362443 379577 403573 418731 425999
10886D25999J744o847p727k1906j2793K896q17l845j5554j6807r216n598J6850
$$ 425999 427743 420896 413169 391263 378470 381366 380549 376704 361150 344343 335127 329529 346379
10873C46379J6718k038j851r460L29K2436J0431N855o358O210J4183o519k0655
$$ 346379 363097 361059 359208 349748 350077 372513 382944 388799 382441 388651 402834 396315 375660
10860C75660J1958K5128J4005P839J5328J612L076q463Q506J3170Q45J5859J3993
$$ 375660 387618 412746 426751 434590 449918 451530 454606 446143 454649 467819 468664 484523 498516
10847D98516J3085L907J5820K1542R350K923Q938J2610J2184J0369J1668J5030
$$ 498516 511601 515508 531328 552870 562220 565143 574081 586691 598875 609244 620912 635942
10835F35942K0919K9629K7574J4934N925J9814K2529K8590L0912K0645J8366J2499
$$ 635942 656861 686490 714064 728998 734923 754737 777266 805856 836768 857413 875779 888278
10823H88278L1203M1113K5746L7016L3977L6031L7989L0020M2720M1707M5126
$$ 888278 919481 960594 986340 1023356 1057333 1093364 1131353 1161373 1204093 1245800 1290926
10812A290926M2726L7175N2716O5934N1667M9593N9554O8335P4130P2620R4106
$$ 1290926 1333652 1370827 1423543 1489477 1541144 1590737 1650291 1718626 1792756 1865376 1959482
10801A959482R1500Q8934J08476J20792J08771J20963J46040J62243J92512J90999
$$ 1959482 2050982 2139916 2248392 2369184 2477955 2598918 2744958 2907201 3099713 3290712
10791C290712K17434K41212K67783L05083L32631L65917M30540M96510N62750
$$ 3290712 3508146 3749358 4017141 4322224 4654855 5020772 5451312 5947822 6510572
10782F510572O56198P47144Q39852R23534J021586J162797J323677J574189J908842
$$ 6510572 7166770 7913914 8753766 9677300 10698886 11861683 13185360 14759549 16668391
10773A6668391K327741K831522L450077M218132N237856O591118Q434188J0815073
$$ 16668391 18996132 21827654 25277731 29495863 34733719 41324837 49759025 60574098
10765F0574098J3613169J6528915J8908604J9666910J7512080J1563937K378925
$$ 60574098 74187267 90716182 109624786 129291696 146803776 158367713 160746638
10758A60746638p755858j5774454j9803250j9984142j7757090j4601572j1527271
$$ 160746638 152990780 137216326 117413076 97428934 79671844 65070272 53543001
10751E3543001q946459o950507n453367m371508l603058k996116k523515k112180
$$ 53543001 44596542 37646035 32192668 27821160 24218102 21221986 18698471 16586291
10743A6586291j763392j472189j215488j052021r51502q71455q06274p27084o57244
$$ 16586291 14822899 13350710 12135222 11083201 10131699 9260244 8453970 7726886 7069642
10734G069642n96102n37399m85257m28107l85635l37809k97449k60149k53328
$$ 7069642 6473540 5936141 5450884 5022777 4637142 4299333 4001884 3741735 3488407
10725C488407k23089k13170j80802j59599j48893j28835j35462j32737j22719
$$ 3488407 3265318 3052148 2871346 2711747 2562854 2434019 2298557 2165820 2043101
10716B043101j07969p9137o8958o4664p1072o0396n3471n5142n4757n8193m1680
$$ 2043101 1935132 1855995 1787037 1722373 1651301 1590905 1537434 1482292 1427535 1369342 1327662
10705A327662m6826l8461k4301k2961l0309l1205k3913k5235k1909k6916j5506
$$ 1327662 1280836 1242375 1218074 1195113 1164804 1133599 1109686 1084451 1062542 1035626 1020120
10694A020120k2339l0799k2525k2432k3616k0799k5344k0051k6200r021j1182
$$ 1020120 997781 966982 944457 922025 898409 877610 852266 832215 806015 796994 785812
10683G85812j3564j4794k4017q747m387j3465j6772l195j0080k033L057J704N482
$$ 785812 772248 757454 733437 724690 720303 706838 690066 686871 676791 674758 677815 679519 685001
10670F85001K0431r00l116n952K4799J4224k095O421J2830n334l105M745m244
$$ 685001 705432 704532 701416 695464 720263 734487 732392 738813 751643 746309 743204 747949 743705
10657G43705n026Q754J9008R602J7270J7703O63J2877K8785L8051K7960P141J5931
$$ 743705 738679 747433 766441 776043 793313 811016 811679 824556 853341 891392 919352 926493 942424
10644I42424L0782J1201J9413L3785K0450L658O760K4536K6897M8096O7778P3019
$$ 942424 973206 984407 1003820 1037605 1058055 1061713 1068473 1093009 1119906 1168002 1235780 1308799
10632A308799O7939P0549O9196O4803P2038Q2906J14563J48545K06114K79646
$$ 1308799 1376738 1447287 1516483 1581286 1653324 1736230 1850793 1999338 2205452 2485098
10622B485098L74042N07379O83142Q60777J102224J338319J497201J449150J068238
$$ 2485098 2859140 3366519 4049661 4910438 6012662 7350981 8848182 10297332 11365570
10613A1365570M37339j37587m04528k82871J21774O32469J245962J917695K567742
$$ 11365570 11802909 11665322 11260794 10977923 11099697 11732166 12978128 14895823 17463565
10604A7463565K976158K776787J670455j4127j460899j972267j565004p11875
$$ 17463565 20439723 23216510 24886965 24872838 23411939 21439672 19874668 19162793
10596A9162793L07535J344151K365041L225636L618575L064651J227888j342551
$$ 19162793 19470328 20814479 23179520 26405156 30023731 33088382 34316270 32973719
10588C2973719l346352l884809l197665k077524r63814N5092R37381J572949J778633
$$ 32973719 29627367 25742558 22544893 20467369 19503555 19558647 20496028 22068977 23847610
10579B3847610J270838l6115j732483k913104l068711k488839j677554r53369
$$ 23847610 25118448 25082333 23349850 20436746 17368035 14879196 13201642 12248273
10571A2248273l59816O6217L52496L82897J15311m35872j084787j489038j508911
$$ 12248273 11888457 11954674 12307170 12690067 12805378 12369506 11284719 9795681 8286770
10562H286770j266098r65930o88700m90500l38030k22756j52834r9251l1303R890
$$ 8286770 7020672 6054742 5366042 4875542 4537512 4314756 4161922 4062671 4031368 4041258
10552D041258L5333P0942R7470J28251J75900K11010K45468K87338L33470M08137
$$ 4041258 4076591 4147533 4245003 4373254 4549154 4760164 5005632 5292970 5626440 6034577
10542F034577M89709N80939O93353Q10021Q98321R96286J064770J173833J279005
$$ 6034577 6524286 7105225 7798578 8608599 9506920 10503206 11567976 12741809 14020814
10533A4020814J427301J659968J975379K404460K990773L811956N021612O776057
$$ 14020814 15448115 17108083 19083462 21487922 24478695 28290651 33312263 40088320
10525D0088320R210488J2575112J6964388K2130036K7124482K9645879K7350842
$$ 40088320 49298808 61873920 78838308 100968344 128092826 157738705 185089547
10518A85089547K1378344J5162141R598108K123587o664084j3838419j9384889
$$ 185089547 206467891 221630032 231228140 233351727 226687643 212849224 193464335
10511A93464335k3441477k7418067k9077899k5319942j9188488j3894312j0057472
$$ 193464335 170022858 142604791 113526892 88206950 69018462 55124150 45066678
10504D5066678p411310n588857m295793l366125k696634k210644j848858j547531
$$ 45066678 37655368 32066511 27770718 24404593 21707959 19497315 17648457 16100926
10496A6100926j331953j203032j134171j062263j007151r39207q69836q05375
$$ 16100926 14768973 13565941 12431770 11369507 10362356 9423149 8553313 7747938
10488G747938p34850o28314n43684m67717m23325l68533l32704k86568k61857
$$ 7747938 7013088 6384774 5841090 5373373 4950048 4581515 4248811 3962243 3700386
10479C700386k40509k12515j90900j67286j59035j54873j38726j26874j12479
$$ 3700386 3459877 3247362 3056462 2889176 2730141 2575268 2436542 2309668 2197189
10470B197189j00135r7427q6315q3163q3759p5359n6785n6161p0733o3268m6349
$$ 2197189 2097054 1999627 1913312 1830149 1746390 1671031 1614246 1558085 1487352 1424084 1377735
10459A377735m1355l8039m8401m3897n0641k5556j3282j8103l0837k5454l3779
$$ 1377735 1336380 1298341 1249940 1206043 1155402 1129846 1116564 1098461 1067624 1042170 1008391
10448A008391k0652j6872l113j4673k2732l1068k0686j7526j6918o340r953k3291
$$ 1008391 987739 970867 967754 953081 930349 899281 878595 861069 844151 837811 827858 804567
10436H04567l0523k2088j3783j9054k1352j2272k0476j4720p757o268k1685j2073
$$ 804567 774044 751956 738173 719119 697767 685495 665019 650299 642542 636274 614589 602516
10424F02516n010N364Q114J310j3581j6968k9953n292k576p389j5883q348k2780
$$ 602516 597506 602870 610984 612294 598713 581745 551792 546500 543924 536535 520652 512304 489524
10411D89524r278Q24p766J543l009m052n963k032j3940J2505J5653J05J710J2493
$$ 489524 480246 481070 473304 474847 471838 467786 461823 459791 445851 458356 474009 474114 475824 488317
10397D88317j8313n080j1252o075L898l586Q571o515j8792j2911j1542R615q31
$$ 488317 470004 464924 453672 447597 451495 447909 456480 449965 431173 418262 406720 416335 415504
10384D15504j2621j0528k025O73j8316o767p385j3730r116N300K735n830o720
$$ 415504 402883 392355 390330 391003 372687 365920 358535 344805 335689 340989 343724 337894 331174
10371C31174n799j0334k943N713K6289K9956O224l421R876J4832K1334L0041L7329
$$ 331174 325375 315041 312098 317811 344100 374056 380280 376859 386735 401567 422901 452942 490271
10358D90271K5589J9240M6562N1399M9258N3057N7954M6826L7383L6906J3173
$$ 490271 515860 535100 581662 633061 682319 735376 793330 840156 877539 914445 927618
10347I27618k5118m8648p1159o7024o5326p2798n5208m0723m4135l7763j8667
$$ 927618 902500 853852 782693 715669 650343 577545 522337 481614 437479 399716 381049
10336C81049k0490m7668j9769K167n774r150n253n482Q99j211j2720j3133k2672
$$ 381049 360559 312891 293122 295289 289515 280365 275112 269630 270529 269318 256598 243465 220793
10323B20793k686m31r169k482m66Q348r325k2133J229j988P114O400q76o500j3011
$$ 220793 218107 217676 208507 206025 205559 213907 204582 182449 183678 181690 188804 195204 194328 187828 174817
10308A74817K971K93M768K814P655l650N258M914k602Q759M095k93K991l994p160
$$ 174817 177788 178081 182849 185663 193318 189668 194926 199840 197238 205997 210092 209799 212790 208796 201636
10293B01636o531j7890j5911j0267j0065j435L796K139j0475j2548n534p857l947
$$ 201636 195105 177215 161304 151037 140972 139537 143333 145472 134997 122449 116915 109058 105111
10280A05111k0556q282J5222J5415J6515K369j1481O884J2149q07J5321N953o556
$$ 105111 84555 76273 91495 106910 123425 125794 114313 121197 133346 132539 147860 153813 147257
10267A47257o321J657K109m977j9411J264l686L376l280j8673o10J338Q349j0756
$$ 147257 140936 142593 144702 139725 120314 121578 117892 121268 117988 99315 98705 100043 108392 97636
10253I7636l505P738K0705J564j8801j3683j1601j188J4841J582j950l482m479
$$ 97636 94131 101869 122574 124138 105337 91654 80053 78865 93706 95288 93338 89856 85377
10240H5377K727k356L261N508O621M192j9527r767Q694o38j526O237p4j094J2664
$$ 85377 88104 85748 89009 94517 101138 105330 85803 76036 84730 84092 82566 88803 88729 87635 100299
10225A00299P316r994p738l310l273k784l202P983q959j0379k580m870j0602L188
$$ 100299 107615 97621 89883 86573 83300 80516 77314 85297 76338 65959 63379 58509 47907 51095
10211E1095J293n821L858m33j726L133m473l799J1535J9955O4n760J615r158q51
$$ 51095 52388 46567 50425 49992 48266 51399 46926 43127 54662 74617 74681 68921 70536 61378 60527
10196F0527K0080N478m645m060k875p218J0679M265K250Q169q593N00K56m012
$$ 60527 80607 86085 81440 77380 74505 67287 77966 82231 84481 92650 84057 84557 84813 80801
10182H0801J6857J2898J0751J0838J871L332m819L477J0729m989k515N2Q59J3190
$$ 80801 97658 110556 121307 132145 134016 137348 132529 136006 146735 141746 139231 139283 140142 153332
10168A53332J8982K2079K4416Q667k0834r065q989j686P398J1902L0558M6317
$$ 153332 172314 194393 218809 227476 206642 197577 188588 186902 194300 206202 236760 283077
10156B83077N4685O4081O8288M3004J6461J1410J1362l163o493l1945k5871k5103
$$ 283077 337762 401843 470131 513135 529596 541006 552368 549205 542712 510767 484896 459793
10144D59793m7346k9201m5586m9301m3199k7601p402o97j0108j5827k6486N680
$$ 459793 412447 383246 337660 288359 245160 217559 210157 209460 199352 183525 157039 162719
10132A62719j640j0554j77J0507Q142K6365m829j4304j3267J314N950J5811J2738
$$ 162719 161079 150525 150348 160855 168997 195362 190533 176229 162962 164276 170226 186037 198775
10119A98775K5347L0127M5546O6078P0386J07150J26785J45440J45646J14320
$$ 198775 224122 254249 299795 365873 436259 543409 670194 815634 961280 1075600
10109A075600R6220P3561Q972l2231n0325q1903j06857j32776j47476j24671r7467
$$ 1075600 1171820 1245381 1254353 1222122 1171797 1089894 983037 850261 702785 578114 480647
10098D80647o9803n3821m6177m2523l9893l4802k9025j5986j4344n010K535M753
$$ 480647 410844 357023 310846 268323 228430 193628 164603 148617 134273 129263 131798 136551
10086A36551j5287N088k129j3005m470L135n225m465j6226j5719k455M258J0198
$$ 136551 121264 126352 124223 111218 106748 109883 104658 100193 83967 68248 65793 70051 80249
10073H0249K589p552j320J1361n032j3867J476K253N687J2285j944j2438r114
$$ 80249 82838 75286 73966 85327 80295 66428 67904 70157 75844 88129 86185 73747 64633
10060F4633q545q463P569L772l399k593P336L879j5369k749L698j6041j0665P289
$$ 64633 56088 47625 55194 58966 55567 52974 60310 64189 48820 46071 49769 33728 23063 30352
10046C0352q584l230n090l136M36R908mp038r32J7813O098q201j778K421M933
$$ 30352 21768 18538 13448 10312 10748 20656 20652 13614 12682 30495 36593 28392 26614 29035 33968
10031C3968J727P798R06k725J104m135O56m032Q975j898k3268m319J3642P429
$$ 33968 35695 43493 44399 41674 42778 38643 39299 35267 44242 42344 19076 14757 28399 35828
10017C5828o720p396p69K81n354R98R543M162j057p072j601j935O84P2J292k338
$$ 35828 29108 21712 20943 21224 15870 16868 26411 30573 29516 22444 20843 18908 19592 19664 20956 18618
10001A8618N568O631L752r49k695q409j3868K666J6607j290j1564m72R540K34
$$ 18618 24186 30817 34569 33620 30925 22516 8648 11314 27921 26631 15067 14595 24135 24369
9987B4369Q838K1814N247j2701m068j4518m027k855n259Q384o245j2104q491R796
$$ 24369 33207 55021 60268 47567 43499 28981 24954 22099 16840 25224 18979 6875 -1616 8180
9973H180J6126k099l017l603j905J583o501o263R097L390o71k127r211Q407J3126
$$ 8180 24306 22207 19190 15587 13682 15265 8764 2501 11598 14988 14317 12190 2979 11386 24512
9958B4512M539j4915j2925J30O151Q331q701K525k678O11L854N46j3692M56K9307
$$ 24512 29051 14136 1211 1341 7492 15823 7122 9647 6969 7580 11434 11980 -1712 -1256 28051
9943B8051R172l257O74j2526R42J5224Q780Q80N352J0775R251K4378L9492N8478
$$ 28051 37223 33966 34640 22114 23056 38280 47060 47940 53292 64067 73318 97696 137188 195666
9929A95666R1395J19680J44531J53335N5492j64603k55998j33935n5260n1863
$$ 195666 287061 406741 551272 704607 760099 595496 339498 205563 150303 98440
9919I8440j3951r298j0243n191p559j0993j2181j4058Q958J0421K607m871r447
$$ 98440 84489 75191 64948 59757 52198 41205 29024 14966 23924 34345 36952 32081 22634
9906B2634m453R630k956r878l178L214M663K731K435l467j5883N641p98M127K1017
$$ 22634 18181 27811 24855 14977 11799 15013 19676 22407 24842 21375 5492 11133 10335 14462 35479
9891C5479j902O24l297k029l238r76O545J3307M625k1631j4099m404j0707J5801
$$ 35479 33577 34201 30904 28875 25637 24661 31206 44513 49138 27507 13408 9004 -1703 14098
9877A4098J0586J288m294j6482n921N655J1940J746j1297J4383k397r742N00j525
$$ 14098 24684 25972 21678 5196 -725 4930 16870 18616 7319 21702 19305 9563 10063 8538
9863H538L101K723K477n075M446j385O194Q089M62O261Q182m842q939L663q662
$$ 8538 11639 14362 16839 11764 16210 14825 21019 29108 29570 35831 44013 39171 30232 33895 25233
9848B5233k095O377m002j5518K957M969N640k067j9231j4425R896O291K744J270
$$ 25233 23138 29515 25513 9995 12952 17921 23561 21494 2263 -12162 -2266 4025 6769 8039
9834H039O292j727M480R550o108j3963o317j33L069P212J1769J611q695J519Q202
$$ 8039 14331 12604 17084 26634 20526 6563 246 113 3182 10394 22163 23774 15079 16598 24800
9819B4800q386J198j728l47J1229M865l879r472q184K4126N079K572m412J913
$$ 24800 16414 17612 15884 15537 26766 31631 27752 18280 10096 34222 39301 41873 37461 39374
9805C9374r641j071P858M571p032K543n511N503O331l525q159K039k151J1856
$$ 39374 29733 28662 36520 41091 34059 36602 31091 36594 42925 39400 31241 33280 31129 42985
9791D2985n157N009q784k3065j297K0022J9485J2670M27O255Q081P809J1798L4397
$$ 42985 37828 42837 34053 10988 9691 29713 49198 61868 62295 68550 76631 84440 96238 130635
9777A30635O9294R5703J54950K03355K13562J03147o8995k18901k29546j53753
$$ 130635 199929 295632 450582 653937 867499 970646 901651 682750 453204 299451
9767B99451q3424n4197l4225l2485l1833j5666k405l057n080q632L180N302o256
$$ 299451 216027 161830 127605 95120 63287 47621 45216 42159 37079 28447 31627 36929 30673
9754C0673J552j0098M915M71J2568k93j2163J6939q146j9061j7360J1094J4615
$$ 30673 32225 22127 27042 27513 40081 39788 27625 44564 36418 17357 -3 11091 25706
9741B5706k980n311M543P104K146K483j6684q50M152l037p552L831N665j2880
$$ 25706 22726 17415 21958 29062 31208 33691 17007 16157 20309 17272 9720 13551 19216 6336
9727F336l22N557N458q811m041n598L806N858P244j487o932r460J8539J4684m237
$$ 6336 6014 11571 17029 8218 4177 -1421 2385 8243 15487 14000 7068 -2392 16147 30831 26594
9712B6594k903o383l832r884j1099o791J7004L477J067j732Q239L464l932K195
$$ 26594 23691 17308 13476 3592 -7507 -14298 2706 6183 7250 5518 13757 17221 13289 15484
9698A5484J0943j842r389J41K868n261j4094O19J529J868J027j783J9026l108
$$ 15484 26427 24585 15196 15337 18205 12944 -1150 -531 998 2866 3893 2110 21136 18028
9684A8028r157L714R583O685J739P480l780k852K433m055J814Q41K357j4796j916
$$ 18028 8871 12585 22168 28853 30592 38072 34292 31440 33873 29818 31632 32473 34830 20034 18118
9669A8118J0364K1042j222k8915p711J6157J5520L234R77J6062K365j1518R278
$$ 18118 28482 49524 48302 19387 11676 27833 43353 46587 47564 63626 65991 54473 63751
9656F3751J9504K4728M2384O3126J02750J36291J97058K09428Q1502j19633k65333
$$ 63751 83255 107983 150367 213493 316243 452534 649592 859020 940522 820889 555556
9645E55556j95890j17395p1999m3443l3038r649n837j0598J551J41j626L199n967
$$ 555556 359666 242271 170272 126829 93791 84142 78305 67707 69258 69399 67773 70972 65005
9632F5005j9000k1343J490J6400l17j3997L090J2380k530M002n101p579j647r534
$$ 65005 46005 24662 26152 42552 42235 28238 31328 43708 41178 45180 40079 32500 30853 21319
9618B1319j278o946M4J6300L60k758p065j283j1525q067l718R06O572J9922J4953
$$ 21319 20041 13095 13139 29439 29799 27041 19976 18693 7168 -899 -4617 -3711 2861 22783 37736
9603C7736o031j047k777l093K387p697j1998j2708O791J0597J2377j1807n427
$$ 37736 31705 30658 27881 24788 27175 19478 7480 -5228 1563 12160 24537 12730 7303
9590G303O516P601J0117M653q567j2485l916k0839P15q238J2704L2880L479j4581
$$ 7303 13819 21420 31537 36190 27623 15138 11222 -9617 -8902 -17140 -4436 28444 31923 17342
9576A7342k252L659J4869R469j42j4481p092K725K483m422Q650k1788P382Q674
$$ 17342 15090 18749 33618 43087 42945 28464 21372 24097 26580 22158 30808 9020 16402 25076
9562B5076N412q106r4J817O67J0820l226L347J0124M677m702o744j3627Q938K87
$$ 25076 30488 22382 22288 24105 24772 35592 32366 35713 45837 50514 45812 39068 25441 34379 34666
9547C4666n315o729m92Q490L572m700j1942M314k762j0695L516J3445N181j1675
$$ 34666 29351 22622 22130 30620 34192 29492 17550 21864 19102 8407 11923 25368 30549 18874
9533A8874j2521k981M935J2365o161k935J3649J9589L952o288m489l988m656l155
$$ 18874 6353 3372 8307 20672 14511 11576 25225 44814 48766 42478 37989 34001 29345 26190
9519B6190O997m241L868M597Q51J1175m86j4082j2456N427N461k841J150K517
$$ 26190 33187 28946 32814 37411 38262 49437 48951 34869 22413 27840 33301 30460 31610 34127
9505C4127o208j0008j576K624J2924J3658j5696o509j414Q720Q633q018k027L900
$$ 34127 27919 17911 16335 18959 31883 45541 29845 23336 21922 30642 39275 31257 29230 33130
9491C3130q694j2139L026L12J565j1887j2065N600o323p447L555J100N316J0223
$$ 33130 24436 12297 15323 15635 17200 5313 -6752 -1152 -7475 -14922 -11367 -10267 -4951 5272
9477E272J0457R862J8749q487j1798M80k640k522J632R2L7J0564l88j1237J1183
$$ 5272 15729 25591 44340 35853 24055 24535 21895 19373 21005 21097 21134 31698 31310 20073 31256
9462C1256O039p233m610O412J1871L130n791l00Q851p789k442l064p226L163R56
$$ 31256 37295 30062 25452 31864 43735 46865 41074 40774 49625 41836 39394 36330 29104 32267 33223
9447C3223J5720N974p562M770j0420j4600n723r434R588K2342k332j061j1020
$$ 33223 48943 54917 47355 52125 41705 27105 21382 11948 21536 43878 41546 40485 29465
9434B9465j2738l444J3128K84J164r97o51J69J216K814J982k593K79p917J4299
$$ 29465 16727 13283 26411 26695 27859 26862 26211 26380 27596 30410 32392 29799 30078 22161 36460
9419C6460J0274n363j5994j634J8272l915j2506J0215K3329j130j0978q056j8675
$$ 36460 46734 41371 25377 23743 42015 38100 25594 35809 59138 58008 47030 38974 20299
9406B0299p706K2058K449j2361n835J3713p842j1867m049J0165K5959J531j2229
$$ 20299 12593 34651 37100 24739 18904 32617 24775 12908 8859 19024 44983 46514 34285
9393C4285o532q603j730J6647N459J1032J4450K109p379j5746J669L968j2977
$$ 34285 27753 19150 17420 34067 39526 50558 65008 67117 59738 43992 45661 49629 36652
9380C6652N065p347j3750k249J0245L089p70K439L390J3040K898j3657q762p151
$$ 36652 41717 34370 20620 18371 28616 31705 30935 33374 36764 49804 52702 39045 30283 23132
9366B3132p177J6633L3806M166j1088p353P140n7o035M966R180l071K38n354M952
$$ 23132 15955 32588 66394 70560 59472 52119 59259 59202 53167 58133 67313 64242 64480 59126 64078
9351F4078K320j435m394j1711L79R8P201k73r503m170J6124Q236l102k1408j7237
$$ 64078 66398 64963 60569 48858 49237 49335 56536 56263 46760 42590 58714 66950 63848 42440 25203
9336B5203P91L362J2190K4337N600j5841m026Q789L361q68j0005o137p83j4849
$$ 25203 25994 29356 41546 65883 71483 55642 51616 60405 63766 62898 52893 46756 45973 31124
9322C1124L36M196j386l009L210o935o197O559R942j972Q792K223r058l124L243
$$ 31124 31460 35656 34270 31261 34471 27536 21339 27898 37840 35868 44660 46883 37825 34701 37944
9307C7944J2701Q548L467k050M679J0700j0614j5775j3302O837J0931J0155j248
$$ 37944 50645 59193 62660 60610 65289 75989 65375 49600 36298 43135 54066 64221 62973
9294F2973m032J0248N411j153o755J027J2294o69j8981n995L066j5454N154J6915
$$ 62973 58941 69189 74600 73447 66692 67719 80013 79344 60363 54368 57434 41980 47134 64049
9280F4049O445J3757l265j4944l967q375j6845J6794J0945J5530N805j2325l1185
$$ 64049 70494 84251 80986 66042 62075 53700 36855 53649 64594 80124 85929 73604 42419
9267D2419l757M585j051P673q089j746J4335J3272q767p13r842j0848j855J3224
$$ 42419 38662 43247 42196 49869 41780 40034 54369 67641 58874 58161 48319 37471 35616 48840
9253D8840M421J3944J6805n906m251k173j4560O986P603j411P842O757n54Q49
$$ 48840 53261 67205 84010 78104 73853 71680 57120 64106 71709 70298 78140 84897 84343 85192
9239H5192L560j2426Qm468N203j118l789Q309n858J1586J1976o76p948q427l17
$$ 85192 88752 76326 76334 71866 77069 75951 72162 80471 74613 86199 98175 97499 89551 81124 80807
9224H0807l05l919p07k295L307R785Q997m611O778N320q544q116j0732O577P387
$$ 80807 80502 76583 75876 73581 76888 86673 95670 91059 97837 103157 94613 86497 75765 82342 89729
9209H9729N653j7370j528n17J007k247J2067J88J266n29l853j0926k1034k4934
$$ 89729 95382 78012 76484 75967 76974 74727 86794 86982 88248 87719 83866 72940 51906 26972
9195B6972p667j828J77r717L289K1238J5451k474l671J278J2200O712L461M612
$$ 26972 19305 17477 17654 7937 11226 32464 47915 45441 41770 43048 55248 61960 65421 70033
9181G0033n997r091o658Q133k12q424j182J223L207K2794J4285j3863N786J5742
$$ 70033 64036 54945 48287 56420 56208 47784 46602 47825 51032 73826 88111 74248 80034 95776
9167I5776J4112P017P650N05j915m061N264O00J6506J7417J1311l237J6727K7859
$$ 95776 109888 116905 124555 125060 123145 119084 124348 124948 141454 158871 170182 166945 183672 211531
9153B11531J1812K7125M1270M0915N0498N2587N2322P8191R8423J00397J11473
$$ 211531 223343 250468 291738 332653 383151 435738 488060 566251 664674 765071 876544
9142H76544J31079J57978J96004J95554J88504J74117J28332M6481l0405q9042
$$ 876544 1007623 1165601 1361605 1557159 1745663 1919780 2048112 2094593 2064188 1975146
9132A975146j44596j73062j91278j93431j75864j50647j01434r6334j08783q6860
$$ 1975146 1830550 1657488 1466210 1272779 1096915 946268 844834 748500 639717 552857
9122E52857o2564n7709m2040l0001m0868k1169j1886j8682p598l610n837j3390
$$ 552857 490293 432584 390544 360543 319675 298506 286620 267938 260340 256730 250893 237503
9110B37503j1543k1054j9855j4756k0150j6201M435L807p632m254j4807p304O204
$$ 237503 225960 204906 185051 170295 150145 133944 138379 142186 134554 130300 115493 108189 114393
9097A14393J3744P524Q03j915q801j5885P568O209N285l575j2887L818k437L866
$$ 114393 128137 135661 136464 134549 125748 109863 117431 123640 128925 125350 112463 116281 113844 117710
9083A17710M54j5607J4345J80j8394k067p50K450L030m539m86M230J7359K0350
$$ 117710 118164 102557 116902 117082 98688 96621 95871 98321 101351 96812 96326 100556 117915 138265
9069A38265j6991l663P523k506N904k434j197J3513J3243r168j1152o033k608
$$ 138265 121274 117611 125134 122628 128532 126098 124901 138414 151657 142489 131337 125304 122696
9056A22696q484L316p940J228N873J5182K5030K0894o940k407J7411Q821l626
$$ 122696 114212 117528 109588 110816 116689 131871 156901 177795 170855 168448 185859 194680 191054
9043A91054j9492k5555j3307J3015k443l464l890l327Q66l623j1116M19J2065
$$ 191054 171562 146007 132700 145715 143272 139808 135918 132591 133457 129834 118718 119137 131202
9030A31202o497j1341j0336J2688M148J82J3082K0726N856q308j061J1266j773
$$ 131202 124705 113364 103028 115716 119864 120046 133128 153854 159710 151402 150341 161607 159834
9017A59834l753N291K159j0072p740j662Q696N054m599p88r698M272k03k343m841
$$ 159834 156081 161372 163531 153459 145719 144057 152753 157807 153208 152420 142722 146994 146791 144448 139607
9002A39607J1755J9714J3002Q178L1476J4594J4928K5332N5649O4681N4608M2039
$$ 139607 151362 171076 184078 192256 223732 238326 253254 278586 334235 398916 453524 495563
8990D95563J8848k135j7685l6830m4184l8293l1868k7589j6443j0159k1923p515
$$ 495563 514411 512276 494591 457761 413577 375284 343416 315827 299384 289225 267302 259787
8978B59787q175p205k862k755L432p823j1661r385J3197J279l91O32M600M609
$$ 259787 251612 244407 241545 238790 242222 234399 222738 213353 226550 227829 227438 228070 232670 237279
8964B37279P91l63r297n938Q384K015j4804j6241l023M210n430r913j60M943o85
$$ 237279 238070 237707 228410 222472 230856 232871 218067 201826 198803 203013 197583 187670 187510 192453 191768
8949A91768J355L941p885R451J659N361p525L653Q941p495l220J7457J4209Q998
$$ 191768 193123 197064 189179 198630 200289 205650 198125 201778 210719 203224 200004 217461 231670 240668
8935B40668J6937J1974M822m057J2660q47l459J2806K0432J417j4773J562n6J028
$$ 240668 257605 269579 274401 270344 283004 282157 278698 291504 311936 313353 298580 300142 300086 301114
8921C01114L145P129L517j86M531J3180J3017j8152j8265K747j0574k2416j3568
$$ 301114 304259 311388 314905 314719 319250 332430 345447 327295 309030 311777 301203 278787 265219
8908B65219J1534Q711J729N621j34n925J4213K757k411o971j830O924l806k262
$$ 265219 276753 285464 287193 292814 292680 286755 300968 303725 301314 294343 292513 299437 295631 293369
8894B93369M659K2007K5965L7521K6554K3741J6443K2360L0437J9842j29N264
$$ 293369 298028 320035 346000 383521 410075 433816 450259 472619 503056 522898 522769 528033
8882E28033N252J5838J4050J5490J2176J5222M279R261P883N264Q842K1441L7434
$$ 528033 533285 549123 563173 578663 590839 606061 610340 619601 627484 632748 641590 663031 700465
8869G00465L4583N8984N6626N0044J7216R518J4808m565k3885j8207j4088J1819
$$ 700465 735048 794032 850658 900702 917918 927436 942244 937679 913794 895587 881499 893318
8857H93318Q712k5432k4346K330L635p376K791P496L944R253J0844J0189J0622
$$ 893318 902030 876598 852252 854582 858217 850841 853632 861128 865072 874325 885169 895358 905980
8844I05980K1922K7512L6980K7390K380J1621N715K0544K5374K6602J1425J6400
$$ 905980 927902 955414 992394 1019784 1022164 1033785 1039500 1060044 1085418 1112020 1123445 1139845
8832A139845J7320L0138M3736L6495K7271K6689K9104M9560M1501M4211N4544
$$ 1139845 1157165 1187303 1231039 1267534 1294805 1321494 1350598 1400158 1441659 1485870 1540414
8821A540414O7413O3987Q7567J11609J35447J50168J62508J45513Q7986r212m1467
$$ 1540414 1607827 1671814 1759381 1870990 2006437 2156605 2319113 2464626 2552612 2543400 2501933
8810B501933m5321m2695R335L8012L8729M8093P1133Q2693Q0817P0204Q6376Q5959
$$ 2501933 2456612 2413917 2423252 2461264 2499993 2548086 2619219 2701912 2782729 2852933 2939309 3025268
8798C025268P7205Q0098Q5760Q1105R7461J06309J08794J04045J13445J23051
$$ 3025268 3102473 3182571 3268331 3349436 3446897 3553206 3662000 3766045 3879490 4002541
8788D002541J35418J50553J53061J68476J78673K04896K28639K16070K23281K45142
$$ 4002541 4137959 4288512 4441573 4610049 4788722 4993618 5222257 5438327 5661608 5906750
8778E906750K47980K62568K95490L47049L88262M26278M51678M89243N27697N81433
$$ 5906750 6154730 6417298 6712788 7059837 7448099 7874377 8326055 8815298 9342995 9924428
8768I924428O36702O93502P69061Q54719R51922J079767J214989J381865J589801
$$ 9924428 10561130 11254632 12023693 12878412 13830334 14910101 16125090 17506955 19096756
8759A9096756J815745K080672K412090K813612L274013L851270M519582N290405
$$ 19096756 20912501 22993173 25405263 28218875 31492888 35344158 39863740 45154145
8751D5154145O195001P226413Q459530J0044139J2254523J5444547J9996179K6209941
$$ 45154145 51349146 58575559 67035089 77079228 89333751 104778298 124774477 150984418
8743A50984418L4232484M3999556N4498169O3386971O6383672N7824061L3765953
$$ 150984418 185216902 229216458 283714627 347101598 413485270 471309331 505075284
8736E05075284k718710l9805941o3799337o9707870o2947357n1415533m0037319
$$ 505075284 502356574 462550633 398751296 329043426 266096069 214680536 174643217
8729A74643217l0635549k3425728j8038642j4063994j1163382r109151p643405
$$ 174643217 144007668 120581940 102543298 88479304 77315922 68206771 60563366
8722F0563366o637192n873009n195839m542279l948765l403698k927555k521839
$$ 60563366 53926174 48053165 42857326 38315047 34366282 30962584 28035029 25513190
8714B5513190k188362j923527j713005j538964j395202j257359j138112j042141
$$ 25513190 23324828 21401301 19688296 18149332 16754130 15496771 14358659 13316518
8706A3316518r59719q61528p62658o92769o35896n80741n01515m63773m61270
$$ 13316518 12356799 11495271 10732613 10039844 9403948 8823207 8321692 7857919 7396649
8697G396649m26577m00554l66636l27000k97720k72065k39893k15224k09190j88527
$$ 7396649 6970072 6569518 6202882 5875882 5578162 5306097 5066204 4850980 4641790 4453263
8687D453263j81007j92488j90281j51316j32854j43496j15317j05371r6539r8744
$$ 4453263 4272256 4079768 3889487 3738171 3605317 3461821 3346504 3241133 3144594 3045850
8677C045850p6978o5533j04445r5923o2895o1941p3482o1107q2503p1820o6369
$$ 3045850 2968872 2903339 2798894 2702971 2640076 2578135 2504653 2443546 2361043 2289223 2222854
8666B222854n3239l9919l8921l1920m5145l2998l1024m8091n3749n7137n9621
$$ 2222854 2169615 2129696 2090775 2058855 2013710 1980712 1949688 1901597 1847848 1790711 1731090
8655A731090l6649k9212k6284m1807l6217l1504l5527k9222m3851k7105j6656
$$ 1731090 1694441 1665229 1638945 1597138 1560921 1529417 1493890 1464668 1420817 1393712 1377056
8644A377056k1199k2940k9372k9677k3806r770k770k3255l6371k5800l2211l4883
$$ 1377056 1355857 1332917 1303545 1273868 1250062 1240292 1237522 1214267 1177896 1152096 1119885 1085002
8632A085002k0477j8187q460r767j4679j1977q588j1581R96P085P62r792j9407
$$ 1085002 1064525 1046338 1037878 1028111 1013432 1001455 992867 981286 982282 989367 990129 980337 960930
8619I60930j1396l561j7429j9377K663J0342k328n799m016j0471l5129l3485k1659
$$ 960930 949534 945973 928544 909167 911830 922172 919844 914045 910029 899558 864429 830944 809285
8606H09285j1220j8435j6995j0888j3683k407k7255l7718k7385j9574j1503m334
$$ 809285 798065 779630 762635 751747 738064 735657 708402 670684 643299 623725 612222 607888
8594F07888J167j4931o194J4265J4616o094j4654j2537o789R94J8150J8388K6860
$$ 607888 609055 594124 587930 602195 616811 610717 596063 583526 576737 577731 595881 614269 641129
8581F41129J8016k131o684j0558j1405j3734k6475j6277j366q714j5021o723j643
$$ 641129 659145 657014 650330 639772 628367 614633 588158 571881 570515 561801 546780 540057 538414
8568E38414k0862j2780p921p390Q418N06k3360k2812j2870j0885k6026j1248j1120
$$ 538414 517552 504772 496851 489461 497879 498385 475025 452213 439343 428458 402432 391184 380064
8555C80064k82K03j105q729o516j2384Q97k525j190j1375J3880O246q273j0977
$$ 380064 379782 379985 378880 370151 363635 351251 352148 349623 348433 337058 350938 357184 348911 337934
8541C37934J859l528j6495O015J251K058K3467J0510r997j1287l705J7925K1595
$$ 337934 339793 336265 319770 325785 327036 329094 352561 363071 353074 341787 338082 356007 377602
8528C77602L0965L4685O3534M8546j24n7825p4524m7182l5758k3429j3849j7838
$$ 377602 408567 443252 506786 555332 555208 497383 422859 375677 339919 316490 302641 284803
8516B84803P717p10P34j911k5082j6541k198Q350m767o878J3520N46q572r207
$$ 284803 292520 291810 292544 290633 265551 249010 246812 255162 250395 243517 257037 257583 249011 239804
8502B39804n196P417J1467N838l760j3598M020J2138N825J119j0706J7625K9496
$$ 239804 234608 242025 253492 259330 255570 241972 245992 258130 263955 265074 254368 271993 301489
8489C01489J0036J1452J6326J3400J8735L1393M5537N9490J05393R8914K2305
$$ 301489 311525 322977 339303 352703 371438 402831 448368 507858 613251 712165 734470
8478G34470j03718j42664r1986n4972l4416l0400j5982o738m974j2431p766Q881
$$ 734470 630752 488088 396102 341130 306714 276314 260332 253594 248620 236189 228423 237304
8466B37304n625j769N877p177j4637j1367j0076n730m957j791M78J764R876M669
$$ 237304 231679 229910 235787 228610 213973 202606 192530 186800 181843 180052 180530 182294 192170 196839
8452A96839k169J5283O582o431j1440P469j684m226K192K374O97K56M9P207K6629
$$ 196839 194670 209953 216535 210104 198664 206133 204449 200223 202415 204789 205486 205742 205791 212998 239627
8437B39627L5115M0368L4531m971n9763p0212m7764l0863l2427j2479L3122J4516
$$ 239627 274742 315110 349641 344670 284907 214695 166931 136068 103641 91162 124284 138800
8425A38800O256p806L07M018L875Q96J344j4959k063J4296j870j4079M882o21
$$ 138800 145056 137250 137557 141575 145450 146346 147690 132731 130668 144964 143094 129015 133897 133276
8411A33276n699m444P124q386R786O745l196p99o674j7011M657l570j857J3123
$$ 133276 127577 123133 130257 121871 131657 138402 135206 134407 127733 110722 115379 111809 109952 123075
8397A23075J1200K1895L893M602l861j3661q71l180o42q538j113O061J2633P323
$$ 123075 134275 156170 160063 164665 160804 147143 146272 143092 142450 133912 132799 138860 151493 158816
8383A58816j5148r913J0080K860m975K307r139k066J4699L580k094J4016Q98m912
$$ 158816 143668 133755 143835 146695 141720 144027 134888 132822 147521 151101 149007 163023 163921 159009
8369A59009M620L094O575K308Q707q96p691j088M500R219O254p58o918N297L2799
$$ 159009 163629 166723 173298 175606 184313 183417 175726 174638 179138 188357 194611 193853 186935 192232 225031
8354B25031K8337J3920J5387J9586L1674J7305K4068N3085O6542O8238Q5538J07053
$$ 225031 253368 267288 282675 302261 333935 351240 375308 428393 494935 563173 648711 755764
8342G55764J29428J55123J95011J93287J59581J50359J52364J33817Q9749L5926
$$ 755764 885192 1040315 1235326 1428613 1588194 1738553 1890917 2024734 2114483 2150409
8332B150409l4695r4216j59807j91175k03231j77328j60669j39015j16711j17955
$$ 2150409 2115714 2021498 1861691 1670516 1467285 1289957 1129288 990273 873562 755607
8322G55607j02336o3153m5444n6679m6707k4861l1961l1403j9078j8332k7249
$$ 755607 653271 590118 544674 487995 441288 416427 384466 353063 333985 315653 288404
8311B88404l5865k7301j0634m639O235n084N576K122J5188N087J864K067P540
$$ 288404 252539 225238 214604 209965 216200 211116 216692 218814 234002 239089 240953 243020 250560
8298B50560L0170Q0382R6319M3794l6530j10487q7526m7084k3862j4859k1538
$$ 250560 280730 361112 457431 501225 464695 354208 266682 219598 195736 180877 159339
8287A59339r905J5498j0332r119m88R335J747l853j1604p701m978j1429n413k0996
$$ 159339 149434 164932 154600 145481 144993 154328 156075 152222 140618 132917 127939 116510 111097 90101
8273I0101k8990l943n471m384P19N638m864j621L677K08j0615n222r346K901K3991
$$ 90101 61111 57168 51697 47313 48032 53670 48806 47185 50862 51070 40455 35233 25887 28788 52779
8258E2779L563k571j186Q746K2388M1059M9899L4797n592m3673m9773k5519j1004
$$ 52779 56342 53771 52585 61331 83719 124778 174677 209474 203882 160209 110436 84917 73913
8245G3913j8763o755j2282q05j229J9526J0204p846p291K195J1667P418P264p510
$$ 73913 55150 48395 36113 35308 34079 53605 63809 55963 48672 50867 62534 69952 77216 69706
8231F9706o243j8195j0377O18J4754O746n090r492l598q485j1023j5585L231P065
$$ 69706 63463 45268 34891 35509 50263 57009 51919 42427 38829 30344 19321 3736 6967 14032
8217A4032J1698O139n715N201J6712q014r708r694j679j8085o271K2760J2805
$$ 14032 25730 31869 26154 31355 48067 40053 30345 20651 18972 887 -5384 17376 30181
8204C0181J6739M340k809J00J797J3617K513m777Q636l505j675L826J6674N515
$$ 30181 46920 51260 48451 48551 50348 63965 66478 61701 70337 66832 65157 68983 85657 91172
8190I1172q345l757J7573J7536J4635K0929L4831K1622L7123L5404m273j5908
$$ 91172 82827 79070 96643 114179 128814 149743 184574 206196 243319 278723 274450 258542
8178B58542k5921l6327l8585j4498j8174q097p646j6005j4739l552n477j0737
$$ 258542 232621 196294 157709 143211 125037 116940 109294 93289 78550 74998 69521 58784
8166E8784j2952L866K374m73l049l208j3508N224k804j2864r261n646Q640O496
$$ 58784 45832 49698 52072 51599 48550 45342 31834 37058 34254 21390 12129 6483 15123 21619
8152B1619M065n97L516R79n832p967j1686K482J2411O651M81l17n746n928P226
$$ 21619 25684 25087 28603 29582 23750 15783 4097 6579 18990 25641 26122 25805 20059 14131 21357
8137B1357R199M324n156j0577r225r906j0156j7732N420J7275R410R358O503O814
$$ 21357 30556 34880 29724 19147 9922 16 -10140 -27872 -22452 -5177 4233 13591 20094 26908
8123B6908j364j4620m133L177L678l387r260j6254M777J2153J3145J2646R044
$$ 26908 25544 10924 6791 9968 13646 10259 999 -15255 -10478 1675 14820 27466 36510
8110C6510q767o39o603K033N6q424K58J48j0490n355L1116J5734R066j1331l681
$$ 36510 27743 27104 20501 22534 22590 14166 14424 14572 4082 -1273 29843 45577 54643 43312 39631
8095C9631M376m016P104L709j1051j4677m377P717P905k704R67l34N50j8974l119
$$ 39631 44007 39991 47095 50804 39753 25076 20699 28416 36321 33617 34584 34250 34800 15826 12707
8080A2707J8626R725j7767Q303O044N256J3912M898q029m003K008r088J310L699
$$ 12707 31333 41058 23291 31594 37638 42894 56806 61704 53675 49672 51680 42592 43902 47601
8066D7601n682M900j2868j5827M143P929p904k781P954j33L467M236r848k5350
$$ 47601 41919 46819 33951 18124 22267 30196 22292 19511 27465 27332 30799 35035 25187 -163
8052a63L866Q171L596o129j2237J1602n510q934m129K0546K1769l114K066M903
$$ -163 3703 11874 15470 9341 -2896 8706 3196 -5738 -9867 10679 32448 29334 31400 36303
8038C6303k908n720j1985j1670L977J2284J3882M052M32j3297P004l738K479K38
$$ 36303 33395 27675 15690 4020 7997 20281 34163 38215 38647 25350 32354 28616 31095 31333
8024C1333j4239j9263R41M763L457K6502J8159o933p775q429k0279r944m426J816
$$ 31333 17094 -2169 -1228 3535 6992 33494 51653 44720 36945 28516 8237 -1707 -6133 -4317
8010d317q09o532J2041J0589J1536J6419j328j0105j4150Q093R899R898j181q085
$$ -4317 -5126 -11658 383 10972 22508 38927 37599 27494 13344 21437 31336 41234 40053 31968
7996C1968j693o723J523J1660m754j6588m934M982l356q654M187J5796m597k752
$$ 31968 30275 23552 25075 36735 31981 15393 10459 15441 12085 3431 7618 23414 18817 16065
7982A6065K834n682L673J1344J3873p139p610j958q246j4905K821J3152M134P086
$$ 16065 18899 13217 16890 28234 42107 34968 27358 25400 17154 2249 5070 18222 22356 29442
7968B9442Q11j361K283M667m420q103L280k216l096J1781M316m841k927o156m790
$$ 29442 30253 28892 31175 35842 31422 23319 26599 24383 21287 33068 37384 32543 29616 23460 18670
7953A8670L533J0461O553r046p736P409O385K03q069k138j2159n566j348O192
$$ 18670 22203 32664 39217 30171 22435 29844 36229 36432 28363 26225 14066 8500 7152 13344
7939A3344L514p68J04r657j6059Q246J7615J8789J4248j1188n393l918L019K171
$$ 13344 16858 16090 16194 6537 -9522 -1276 16339 35128 49376 38188 32795 28877 31896 34067
7925C4067J677k1065o070r034j0460J1876J4328J754n872O725J957j298j1969
$$ 34067 35744 14679 8609 -425 -10885 991 15319 17073 11201 17926 19883 18585 6616
7912F616j5149K000J2790J794j1901O697j330q307J176J1296L114P131M071l390
$$ 6616 -8533 -6533 6257 8051 -3850 2847 1517 -6790 -5614 5682 8796 15927 19998 16608
7898A6608j8392Q188Q780m66j519P871L257j4550R74P30M593J446n612n638j0987
$$ 16608 -1784 6404 15184 14718 13199 21070 24327 9777 10751 11481 16074 17520 11908 6270 -4717
7883d717k305j1638J3554K0428M390J406k383j3882Q523r926l905P355j359j921
$$ -4717 -7022 -18660 -5106 15322 19712 21118 18735 4853 13376 3450 -455 6900 5541 3620
7869C620l623r213q88K88O307M912N378L689O46j148M230n837m582j761J867k642
$$ 3620 -3 -9216 -10104 -9816 -3509 1403 6781 10470 11116 9968 14198 8361 3779 2018 3885 1243
7853A243P311N888p07p696R336O689R370l806j3385n031j784j559L691O710k292
$$ 1243 8554 14442 13735 6039 15375 22064 31434 27628 14243 9212 7428 5869 9560 16270 13978
7838A3978j1943R81p10L938R781J3104N757k488j886o590j3372n826K256m021
$$ 13978 2035 3016 2306 6244 16025 29129 34886 32398 30512 23922 10550 4724 6980 2959
7824B959o945k007L315k94n42o112L438M157O38J5363J3518j0390j699K837j1154
$$ 2959 -3986 -5993 -2678 -2972 -3514 -9626 -6188 -2031 -1393 13970 27488 17098 15399 18236 7082
7809G082q58q223j3557p539J7186J2184Q40j1297J3275K296L219r18k34l142l495
$$ 7082 6224 -1999 -15556 -23095 -5909 6275 7115 -4182 9093 11389 14608 13690 13456 10314 6819
7794F819R817J7990L325j3314m075j3584k630m603K999n046l938Q378N772m171
$$ 6819 16636 34626 37951 24637 20562 6978 4348 -255 2744 -2302 -6240 2138 7910 3739
7780C739p461K236J0502J0325L256M252l388p916l206k853R549m742j720J250
$$ 3739 -3722 -1486 9016 19341 22597 26849 23461 15545 12339 9486 19035 14293 12573 13823
7766A3823J564L927J5268j3037j1868N176Q02l668m514L858j935M223N696q61
$$ 13823 15387 19314 34582 21545 9677 14853 15655 11987 7473 11331 9396 13619 19315 18454
7752A8454o803q536K16J338K243J071l515R213l759j1113k874j5820l716P886
$$ 18454 11651 3115 3331 4669 6912 7983 4468 13681 9922 -1191 -4065 -19885 -23601 -15715
7738a5715R230R844n534q385M306K623J811l29R406o763n824J564N264J0120q958
$$ -15715 -6485 3359 -2175 -10560 -6254 -3631 -1820 -2149 7257 494 -5330 -3766 1498 11618 2660
7723B660o580l460K528N506j848K305l50J1725R389n888j1574L187n594R318J2928
$$ 2660 -3920 -7380 -4852 654 -1194 1111 761 12486 21875 15987 4413 7600 2006 11324 24252
7708B4252K690q51j0615o290p043J1376p496k645J2270q920O014l281O210J2851
$$ 24252 26942 26091 15476 9186 2143 13519 6023 3378 15648 6728 12742 9461 15671 28522
7694B8522j052k1222j2164n10K2505l604k3786r673K989L572M833j970K752L076
$$ 28522 27470 6248 -5916 -6426 16079 12475 -11311 -20984 -17995 -14423 -9590 -11560 -8808 -5732
7680e732J2681j3270n249L926J1474K240L034P642Q540n69o183l178N532n711
$$ -5732 6949 -6321 -11570 -7644 3830 6070 9104 16746 25286 24717 18534 15356 20888 15177
7666A5177j454M652n44j0685j2334L526l38j214n29L987J4765n707j0354K765
$$ 15177 13723 18375 17831 7146 -5188 -1662 -2000 -3214 -3743 244 15009 9302 -1052 1713
7652A713p682Q072j1730m808K097R929L76Q248J0804j4410K363J433L649J471
$$ 1713 -5969 2103 -9627 -14435 -12338 -2409 -2033 6215 17019 2609 4972 6405 10054 11525
7638A1525k055N757j2913m270o325m356m544q591l456m494p27Q897J8209J1189
$$ 11525 9470 15227 2314 -1956 -8281 -12637 -17181 -25772 -29228 -33722 -34449 -25552 -7343 3846
7624C846K808N913m23J831O54m693o977Q269J478K96J0971M516j5842j5744N215
$$ 3846 6654 12567 12144 13975 14629 9936 2959 11228 12706 13002 23973 28489 12647 -3097 2118
7609B118J2218j949r748j1860q854k441N332P6K962Q93k063n754k057l969J4112
$$ 2118 14336 12387 2639 -9221 -18075 -20516 -15184 -15108 -12146 -11253 -13316 -19070 -21127 -25096 -10984
7594a0984J6626K3677P544j5331k0696r972M348J3402P175k662j1229o456K143
$$ -10984 5642 29319 36863 21532 836 -9136 -4788 8614 15789 13127 1898 -4558 -2415
7581b415l257P91J7446J5575j5705j7416R986R858m795j288L099j0335k895l576
$$ -2415 -5672 -4881 12565 28140 12435 -4981 5005 14863 10068 8780 11879 1544 -1351 -4927
7567d927K860J4642N799K955J651k814j2419J0295M70l494J773m44q336l555K856
$$ -4927 -2067 12575 18374 21329 22980 20166 7747 18042 18512 15018 16791 16347 8011 4456 7312
7552G312j2175o795Q687n821P062J648L001j3692N070R192M355j893k852o393
$$ 7312 -4863 -11658 -2971 -8792 -1730 -82 2919 -10773 -5703 3489 7844 5951 3099 -3294
7538c294L175P742J2784o871o647k366Q433J3399k11Q80L499J604j1708k1033
$$ -3294 -119 7623 20407 13536 6889 4523 12956 26355 26144 27024 30523 32127 20419 -614
7524f14k726J2020R352L22q892j0767k227L977j2666M484O271K236j541J06R254
$$ -614 -3340 8680 18032 18354 9462 -1305 -3532 445 -12221 -7737 -1466 770 -771 -665 8589
7509H589Q939o871m57k442RK584M378j009j2974p551P673l628J367O73J3755L922
$$ 8589 17528 10657 10200 7758 7767 10351 14729 13720 746 -6805 868 -2760 -1393 -720 13035 16957
7493A6957j3079o895l627j3132n550P686J2937k585Q32O312J627k053j1083j453
$$ 16957 3878 -3017 -6644 -19776 -25326 -17640 -4703 -7288 -6456 -144 1483 -570 -11653 -13106
7479a3106J967O570J6872Q362r394p182J0596J942J2062r340j8982K007n315J019
$$ -13106 -11139 -4569 12303 20665 11271 4089 14685 16627 28689 19349 367 2374 -2941 -1922
7465a922q484M583j54J506J8240L365J707p503J192N605n829j994m527q557J3290
$$ -1922 -10406 -5823 -5977 -4471 13769 17134 18841 11338 12530 18135 12306 10312 5785 -2772 10518
7450A0518r38m850l532k502O235q21P338J931o158m999L354k248m906K8J003l401
$$ 10518 9580 4730 1198 -1304 4931 4110 11448 13379 7221 2222 5576 3328 -1578 -1550 -547 -3948
7434c948J3433P700n500M857k95j0179M53n684R575O401K54m049j4544j635j233
$$ -3948 9485 17185 11685 16542 16247 6068 6521 837 10412 16813 17067 13018 -1526 -3161 -4394
7419d394k34k867J4637J0505j3051q409K584J2308J3680M528J124q17p804r484
$$ -4394 -4628 -7495 7142 17647 4596 -3813 -1229 11079 24759 29287 30411 29594 21790 12306
7405A2306N695O193p922j4727j4902jJ3696m470R438k135J646r502j2961J2912
$$ 12306 18001 24194 16272 1545 -13357 -13358 338 -4132 5306 3171 4817 -4685 -17646 -4734
7391d734N604J156l763R289L361q523p55k205Q522n374J5o124l634M582L000m449
$$ -4734 870 2026 -1737 7552 10913 2390 1635 -570 7952 2578 2593 -3531 -7165 -2583 417 -4032
7375d032O631J4951l033j0938q938R110o779p336o148O003P752j592j210P6J4621
$$ -4032 2599 17550 14517 3579 -5359 3751 -3028 -10364 -16512 -10509 -2757 -4349 -5559 -5483 9138
7360I138M041k1960n435o461J2344J4763L761q092p661n86O319j0150M980P888
$$ 9138 13179 -8781 -14216 -20677 -8333 6430 10191 2099 -5562 -6148 171 -9979 -4999 2889
7346B889l070j5481N424J5888K753j1495j3385n876K1864k923o68q143n259J6828
$$ 2889 -181 -15662 -10238 5650 8403 -3092 -16477 -22353 -489 -3412 -4080 -12223 -17482 -654
7332f54N582o454j6037K451R932R852K601r358k270o043p175M890P806Q574p852
$$ -654 4928 -1526 -17563 -15112 -5180 4672 7273 -2085 -4355 -10398 -17573 -12683 -4877 3697 -4155
7317d155o274J340J3139j0542j3723n031L268J1143k773J2889J1811k778r471
$$ -4155 -10429 -9089 4050 -6492 -20215 -25246 -21978 -10835 -13608 -719 11092 8314 -1157
7304a157N773K2895K373M966k3071P668R281j5394k1623o09l354m238o92N74K965
$$ -1157 4616 27511 29884 34850 11779 19447 28728 13334 -8289 -8898 -12252 -16490 -17182 -16608 -13643
7289a3643l704m668O916J0697K895J7658K723k1764o382J740J8k12j920k946N509
$$ -13643 -17347 -22015 -15099 -4402 -1507 16151 18874 -2890 -9272 -7532 -7514 -7726 -9646 -12592 -7083
7274g083J1874k398r047m942Q913O537r712j529l442k217O313L408r275N577Q452
$$ -7083 4791 2393 -6654 -11596 -2683 3854 -5858 -7387 -10829 -13046 -6733 -3325 -12600 -7023 1429
7259A429O419J1391J105L96l737p943q252N341N728n793p287j58N629J2012o769
$$ 1429 7848 19239 20344 20740 17003 9060 808 6149 11877 6084 -1203 -1361 4268 16280 9511
7244I511k0933n750J6018P970n645k217Q427r394j1266J0827L366P026l32O513
$$ 9511 -11422 -17172 -1154 6816 1171 -1046 7381 -2013 -13279 -2452 914 7940 7608 14121
7230A4121L933p457j6856N593J5076m395j5137j834j0032j0085r613n896K231
$$ 14121 18054 10597 -6259 -666 14410 10015 -5122 -6956 -16988 -27073 -36686 -42582 -40351
7217d0351J4654O625k90J624N432O242Q489J891L630J074r881j1567j5941L41
$$ -40351 -25697 -19072 -19362 -17738 -12306 -6064 2425 4316 7946 9020 -861 -12428 -28369 -28028
7203b8028R772j35j466Q543L944M69M065O048j4852j455J2579l774j2805k953
$$ -28028 -18256 -18391 -19857 -11314 -7370 -6901 -2836 3212 -11640 -13095 -516 -4290 -17095 -20048
7189b0048p88M107O535M229K57l924l011o33J97J3747n379o479l792q087j119
$$ -20048 -20836 -16729 -10194 -5965 -5708 -9632 -12643 -13276 -13079 668 -4711 -11190 -14982 -23069 -24188
7174b4188Q790p369R894J3658J2771J703J1996N905p435r666j379j299o835k168
$$ -24188 -15398 -22767 -12873 785 13556 15259 27255 33160 25725 16059 14680 13381 6546 4378
7160D378N487j2209O95J4004J6855J1427k657l016q942r028j57j353n953N468
$$ 4378 9865 -2344 -1649 12355 29210 40637 37980 34964 26022 16994 16837 15484 9531 14999
7146A4999n867K94n60O961j705k316j876o0m138p374o429J2215q77j0261P64J2247
$$ 14999 9132 9426 8866 15827 14122 11806 9930 9870 5732 -1642 -8071 4144 3267 -6994 -6230 6017
7130F017L320n883j134P611O276n991j137J4839j2912j1213K007J59o097J0113
$$ 6017 9337 3454 2320 9931 16207 10216 9079 23918 11006 -207 1800 1959 -4138 5975
7116E975R942J338K268j2145J5109N21j4799l050l103K356q630r529M401J1126
$$ 5975 15917 17255 19523 7378 22487 23008 8209 5159 2056 4412 -4218 -13747 -9346 1780
7102A780l993m347Q370N639J52J0826j72j1750m985n925j249N419O499M182L771
$$ 1780 -2213 -6560 1810 7449 7601 18427 18255 6505 1520 -4405 -5654 -235 6264 10446 14217
7087A4217l365k564M764n35l773Q231qo977q071K228j584o454n204M293k622k849
$$ 14217 10852 8288 13052 12517 8744 16975 16967 9990 1919 4147 2563 -3891 -9095 -4802 -7424 -10273
7071a0273J0567O688n485j1254j237N842N05L571O779Q152L957N092K776N434
$$ -10273 294 6982 1497 -9757 -10994 -5152 -4647 -1076 5703 13855 17812 22904 25680 31114
7057C1114p679O50p463l956L287q789P375n254l645j4375j1131Q254R800j072
$$ 31114 23435 24085 16622 12666 15953 7164 14539 9285 5640 -8735 -19866 -11612 -1812 -2884
7043b884M41J390J2583J900O386l130l351O595m034m609l025j36K251l698k133
$$ -2884 -2443 -1053 11530 13430 19816 16686 13335 19930 15896 11287 8262 8126 10377 6679 4546
7028D546j1630p237J0551P289r152K401J1235j522o010j1125j4275n297j713P4
$$ 4546 -7084 -14321 -3770 3519 -5633 -3232 8003 6481 471 -10654 -24929 -30226 -31939 -31865
7014c1865J0109J6160q628j074J3779l049m231L938K1276r820j5321j0339j597
$$ -31865 -21756 -5596 -14224 -15298 -1519 -4568 -8799 -4861 16415 6595 -8726 -19065 -20662
7001b0662J7065M789m884j7130R782N494l979K043K739L052l828m617l103O157
$$ -20662 -3597 1192 -3692 -20822 -11040 -5546 -9525 -7482 -4743 -1691 -5519 -10136 -13239 -7082
6987g082J336n90r421j646J2373j45j0402o20R980L757n885n681N847n1N805J653
$$ -7082 -5746 -6336 -15757 -17403 -5030 -5175 -15577 -16197 -6217 -2460 -8345 -14026 -8179 -8230 -2425 -772
6971g72K532j2260j4555M256J1958K993N229K122J4108Q343P851R495N712L245
$$ -772 1760 -10500 -25055 -20799 -8841 -5848 -619 1503 15611 23954 31805 41300 47012 50257
6957E0257O629m346k8907r749m535j3523m849m182j3089j650N281J5343k343N092
$$ 50257 56886 52540 23633 13884 9349 -4174 -9023 -13205 -26294 -27944 -22663 -7320 -9663 -4571
6943d571m890N804n158q635J2710J2243K47o376K541j6934j1437r43j0116m403
$$ -4571 -9461 -3657 -8815 -17450 -4740 7503 7750 1374 3915 -13019 -24456 -25399 -35515 -39918
6929c9918K3199K8699k275j0637q644R26J479j2453J4655J6983K327p603j3309
$$ -39918 -16719 11980 9705 -932 -9576 -8650 -7171 -19624 -4969 12014 14341 6738 -6571
6916f571r403J009p769j369O141m66Q561P606R275N61M36P731m063r143o70M085
$$ -6571 -15974 -14965 -22734 -24103 -17962 -18428 -9867 -2261 7014 7575 8011 15742 11679 2536 1866 5951
6900E951l879m580J279O76q182L254N333Q555l272r421j266j5923J946O499q164
$$ 5951 2072 -2508 -1229 -553 -8735 -5481 -148 8407 5135 -4286 -5552 -21475 -19529 -13030 -21194
6885b1194J2701J0069o440q799q489J662j893L190L442J1281J1521M439j267n546
$$ -21194 -8493 1576 -4864 -13663 -22152 -20490 -22383 -19193 -15751 -4470 7051 11490 10223 4677
6871D677o176j8898j2592O825J0450O554J8626J2212M379n077m056q771n262r940
$$ 4677 -1499 -20397 -32989 -26164 -15714 -9160 9466 21678 26057 20980 16924 8153 2891 -7049
6857g049M967O203K694m63l09O4n503l010J717J7242j542l162r024M341n229j2840
$$ -7049 -2082 4121 6815 6352 6043 6107 604 -2406 -689 16553 15011 11849 2825 7166 1937 -10903
6841a0903O802k313o266k782K194o950j112J4147J5414N283j0797j5929K957J2070
$$ -10903 -4101 -6414 -12680 -15462 -13268 -20218 -21330 -7183 8231 13514 2717 -13212 -10255 1815
6827A815k576p468j5707n457R480K250J1186N958p887k747J1888Q467J732o097
$$ 1815 -761 -8229 -23936 -29393 -19913 -17663 -6477 -519 -8406 -11153 735 9202 10934 4837
6813D837J681M450p12M837R250j705j1684r23j1906K697o246q940J3596J1498
$$ 4837 6518 10968 10256 15093 24343 22638 10954 10031 -1875 822 -5424 -14364 -768 10730
6799A0730J0472j3638j4088n668N772K228K303j0617j2232N144J469K870k962
$$ 10730 21202 7564 -6524 -12192 -6420 -4192 -1889 -12506 -24738 -19594 -18125 -15255 -18217
6786a8217o64J7344Q671J1235k196K738O258k0j1097j3927M607K591o337j2428
$$ -18217 -18881 -1537 7134 18369 16173 18911 25169 25149 14052 125 4732 7323 986 -11442
6772a1442P53J513k95m78p895j2284l734R937L717J0157m941l356Q056J5063j52
$$ -11442 -10689 -9176 -9471 -9949 -17844 -30128 -33862 -23925 -20208 -10051 -14992 -18348 -10292 4771 4619
6757D619n207J2215J0756j9652r416M837j5698K847R326l917K131M947L91P053
$$ 4619 -588 11627 22383 2731 -6685 -1848 -17546 -14699 -5373 -9290 -7159 -2212 -1821 5232
6743E232k847J0303o86l812j5897L855j60M452o494O048J0109j267N94K134j4338
$$ 5232 2385 12688 12002 8190 -7707 -3852 -4012 440 -6054 -6 10103 8836 9430 11564 -2774
6728b774k246J6315J1863O156j0929k5414r716l525o960N666J1295J7801J8474
$$ -2774 -5020 11295 23158 29314 18385 -7029 -16745 -20270 -27230 -21564 -10269 7532 26006
6715B6006J5207J5550K102j0413k3483k0234k5504o835J5945K1123J4005l143
$$ 26006 41213 56763 58865 48452 24969 4735 -20769 -27604 -11659 9464 23469 20326
6703B0326j0664j734r502j1149Q21O66j483j3045M896O095J488q51N876N729l847
$$ 20326 9662 7928 -1574 -12723 -11902 -11236 -12719 -25764 -20868 -14773 -13285 -14136 -8260 -2531 -6378
6688f378n588l939p295M30N960J0144J4986M648l331k016j992l930N210p449n001
$$ -6378 -11966 -15905 -23200 -22770 -16810 -6666 8320 12968 9637 7621 5629 1699 6909 -540 -5541
6673e541r79l807j768L966R918J3586j701q249q505j0067O55q706k21J0872l25
$$ -5541 -6520 -10327 -12095 -8129 1789 15375 13674 5425 -3080 -13147 -12492 -21198 -21419 -10547 -10872
6658a0872K311l902n597j452P613O863J3999l279q123o039n330j614r499J1066
$$ -10872 -8561 -12463 -18060 -19512 -11899 -5036 8963 5684 -2439 -8478 -13808 -15422 -24921 -13855
6644a3855J1418O721N96N630j6601j2642j0253j0060L562J9047m82j907J3574
$$ -13855 -2437 4284 4880 10510 -6091 -18733 -28986 -39046 -35484 -16437 -16919 -18826 -5252
6631e252J5181l26M358m250m568j3526j7749J3222J7941L332k957q558l937o121
$$ -5252 9929 9603 13961 9711 5143 -8383 -26132 -12910 5031 8363 5406 -3152 -7089 -13210
6617a3210o418J0627R966J418o417l892O715Q798j0823j4129k234l675J5526M714
$$ -13210 -19628 -9001 965 2383 -4034 -7926 -1211 7587 -3236 -17365 -19599 -23274 -7748 -3034
6603c034k552L102m412O06J918N55k020q866J0220J3586p740K9n355m320j2838
$$ -3034 -5586 -2484 -6896 -6290 -4372 -3817 -5837 -14703 -4483 9103 1363 1392 -3963 -8283 -21121
6588b1121j3733J7636M065o844O561J9269J0097q00r613j3673K6K393r263j0002
$$ -21121 -34854 -17218 -13153 -19997 -13436 5833 15930 15130 5517 -8156 -8130 -5737 -15000 -25002
6574b5002J4054J3699j564J562L267r914l455K041P327l4j3534r951r160J3290
$$ -25002 -10948 2751 1187 2749 6016 -3898 -7353 -5312 2015 1981 -11553 -21504 -30664 -17374
6560a7374J5791J0927m903K247j6285j9613L028J1837J11l202Q178R005m480j634
$$ -17374 -1583 9344 4441 6688 -9597 -29210 -26182 -14345 -14234 -17436 -9258 -253 -4733 -6367
6546f367l300m585j0151l327J2453R579R055n932j5167j4213Q850J2292m931J126
$$ -6367 -9667 -14252 -24403 -27730 -15277 -5698 3357 -2575 -17742 -31955 -23105 -10813 -15744 -14618
6532a4618J4424J1376K657j5539j9187k436J6100O461q368p755r961k26J3570
$$ -14618 -194 11182 13839 -1700 -20887 -23323 -7223 -762 -9130 -16885 -26846 -27072 -13502
6519a3502O668J359j643K680j146J625J7904M97j5783O342M74l753j0587o652
$$ -13502 -6834 -5475 -7118 -4438 -5584 -3959 13945 14442 -1341 5001 5475 1722 -8865 -15517
6505a5517R81O529k06J432K765M465p586N425M389m607l957p837k68q049j2354
$$ -15517 -14536 -8007 -8213 -6781 -4016 449 -7137 -1712 2677 -1930 -5887 -13724 -13992 -22041 -34395
6490c4395J1047J7637P258m332J0041j5796q704J2176L592o72N478r881j2679
$$ -34395 -23348 -5711 1547 -2785 7256 -8540 -17244 -5068 -1476 -2148 3330 -6551 -19230
6477a9230J1970M428n269O086L074j4134k092J0257J0978m989q199o294m336l83
$$ -19230 -7260 -2832 -8101 -2015 1059 -13075 -15167 -4910 6068 1079 -7120 -13414 -17750 -18133
6463a8133L007K667M786M36J389P74M445k1541j0605K849P767J0354Q889L821
$$ -18133 -15126 -12459 -7673 -7237 -5848 -5074 -629 -22170 -32775 -29926 -22159 -11805 -2916 905
6449I05K461k286M590Q83j2301j8087m858J2555P500J1924n660k484n408L983
$$ 905 3366 1080 5670 6553 -5748 -23835 -28693 -16138 -8638 3286 -2374 -4858 -10266 -6283
6435f283j3327J120J9617o40K207j0705Q001Q611K081l663p126j7960J744P806
$$ -6283 -19610 -18490 1127 487 2694 -8011 -10 8601 10682 7019 -107 -18067 -16323 -8517
6421h517K537j754j7179Q717K1312N797q003m658K886L401R691o712k484L196
$$ -8517 -5980 -7734 -24913 -16196 5116 10913 2910 -1748 1138 4539 14230 7518 5034 8230
6407H230m407j5108j1951j2646J1393J4517Q997k833p583N196P176r87J111l099
$$ 8230 3823 -11285 -23236 -35882 -24489 -9972 -975 -3808 -11391 -6195 981 -6 1105 -1994
6393a994p843j3839k491J3805K4720J3612k0500J548K007J987K220o734j1081
$$ -1994 -9837 -23676 -26167 -12362 12358 25970 5470 7018 9025 11012 13232 6498 -4583
6380d583j1880j2089J4198J9311L387M087q751j0643J1706M512j3060m843j322
$$ -4583 -16463 -28552 -14354 4957 8344 12431 3680 -6963 4743 9255 -3805 -8648 -9970
6367i970r52J7407M649q315J614N817r673m930j1250R653J3919N646j835j5920
$$ -9970 -10922 6485 11134 2819 4433 10250 577 -4353 -15603 -5950 7969 13615 11780 -4140
6353d140j800J2142K276k0629J0109O804j6649J5465J8486r084k0679o223J5503
$$ -4140 -5940 6202 8478 -12151 -2042 4762 -11887 3578 22064 12980 -7699 -13922 1581
6340A581J6957L12M389p330l132r043p560K613M421K892m943l890O440j256n376
$$ 1581 18538 18850 23239 15909 12777 3734 -3826 -1213 3208 6100 1157 -2733 3707 2451 -2925
6325b925P998J381P780o430j1017Q462J1921j4184n262R559P285J0734m2j0905
$$ -2925 5073 6454 14234 7804 -3213 5249 17170 2986 -2276 7283 14568 25302 25260 14355
6311A4355j0907o00j0025p088j344O711M83N170M512n751R099J289j1911Q46J1837
$$ 14355 3448 2848 -7177 -14265 -15609 -8898 -8415 -3245 1267 -4484 4615 5904 -6007 -5161 6676
6296F676j8282M535N373j451l543P987K3184K091n364j5237k4100J225J1706P705
$$ 6676 -11606 -7071 -1698 -3149 -6692 1295 24479 26570 21206 5969 -18131 -16906 -5200 2505
6282B505p379k480J2287J4835q0K889J550k980o194K236K763O420J0546K336j0546
$$ 2505 -4874 -7354 4933 19768 19688 22577 24127 21147 14953 17189 19952 26372 36918 39254 28708
6267B8708j6468m139Q98m94l61j1441o406m229R303L261J300M220k648q808k132
$$ 28708 12240 8101 8999 8505 8144 -3297 -9703 -13932 -4629 -1368 -68 4152 1504 -7304 -9436
6252i436M959o160p68k71M45J4001O68j2272N103L143K629r812L841J2807l553
$$ -9436 -4477 -10637 -11405 -11676 -11231 2770 3438 -8834 -3731 -588 2041 -7771 -3930 8877 5324
6237E324K774P966j3327j2678K427M574n099J762J1163K977L441q668j7582O149
$$ 5324 8098 16064 2737 -9941 -7514 -2940 -8039 -6277 4886 7863 11304 2636 -14946 -8797
6223h797J7796M5k0973q735K803J3801J0489q742p407l400M708J7739J4333n845
$$ -8797 8999 9044 -11929 -20664 -17861 -4060 6429 -2313 -9720 -13120 -8412 9327 23660 17815
6209A7815j0065p727k183J918J2521j091j9991q636O374J0006K899o461k295J4892
$$ 17815 7750 23 -2160 -242 12279 11188 -8803 -17439 -11065 -1059 1840 -4621 -6916 7976
6195G976J4378j0274j1727j9991j8033O230P21r405L942K2367M496q339N235K566
$$ 7976 22354 12080 353 -19638 -37671 -31441 -30720 -40125 -36183 -13816 -9320 -17659 -12424 -9858
6181i858k348q513O859J7364j999K593J1389o100K052l732l806K830K765j2965
$$ -9858 -12206 -20719 -13860 3504 1505 4098 15487 9387 11439 7707 3901 6731 9496 -3469
6167c469J405J94n804j2702p292J4509J1965M116P874O236n068p693k107n436
$$ -3469 -2064 -1870 -7674 -20376 -27668 -13159 -1194 2922 10796 17032 11964 4271 2164 -3272
6153c272n732j774o897o71J619Q001R35M506l050L614R332R0J046K03r584n551
$$ -3272 -9004 -10778 -17675 -18346 -16727 -8726 -7791 -3285 -6335 -2721 6611 6701 7747 7950 -1634 -7185
6137g185m442k531N682L523o712Q029o7P439K686k562L959k433p071P76r516m143
$$ -7185 -11627 -14158 -8476 -4953 -11665 -3636 -3703 3736 6422 3860 7819 5386 -1685 -909 -10425 -14568
6121a4568J111r587k913P540O063J3111J413L722m358o874j76k777j3616J1524
$$ -14568 -13457 -23044 -25957 -18417 -12354 757 2170 5892 1534 -5340 -5516 -8293 -21909 -10385
6107a0385Q805P518j6778J0692j804r547j071Q656p397j1108o823O886p79m899
$$ -10385 -1580 5938 -10840 -148 -1952 -11499 -12570 -3914 -11311 -22419 -29242 -22356 -23135 -28034
6093b8034k794J732R293K429Q289M292n231n138n811O874P617m844n131j6243
$$ -28034 -30828 -29096 -19803 -17374 -9085 -4793 -10024 -15162 -20973 -14099 -6482 -11326 -16457 -32700
6079c2700m057J3133K5591L509m516n432p600j2261J5660J0528j6q602n410l632
$$ -32700 -36757 -23624 1967 5476 960 -4472 -12072 -24333 -8673 1855 1839 -6763 -12173 -15805
6065a5805j939O563P911O754p711j937M697J2850r391j0901N64n062O611P052
$$ -15805 -17744 -11181 -3270 3484 -4227 -6164 -1467 11383 1992 -8909 -8345 -13407 -6796 256
6051B56o433M784k216m600R43m470q691P41J5696L987p261p931j5418R715m93
$$ 256 -6177 -1393 -3609 -8209 -7266 -11736 -20427 -19686 -3990 -3 -7264 -15195 -30613 -20898 -21391
6036b1391J040j0669Q565Q278o01Q88o888n20M623m4l596q692Q080R342R717n894
$$ -21391 -20351 -31020 -22455 -14177 -14778 -13890 -20778 -21298 -16675 -16719 -20315 -29007 -20927 -11585 -1868 -7762
6020g762r314J3733J1785o829p704R070K506j9782J419J573j1860l95m405r66
$$ -7762 -17076 -3343 8442 1613 -6091 2979 5485 -14297 -12878 -11305 -23165 -23560 -27965 -28931
6006b8931P867O466J4368L92q503k669J1749M094L150o124j9879l73M175P396
$$ -28931 -21064 -14598 -230 162 -8341 -11010 739 4833 7983 1859 -18020 -18393 -14218 -6822
5992f822J1451Q061Q954j7877p810O358j6888k027P129J8587o130N924L502j2018
$$ -6822 4629 12690 21644 3767 -4043 2315 -14573 -16600 -9471 9116 2986 8910 12412 394
5978C94p407l826R970j502n445j789J2320j5875l197k016l668J3493N265j4522
$$ 394 -7013 -10839 -869 -2371 -7816 -9605 2715 -13160 -16357 -18373 -22041 -8548 -3283 -17805
5964a7805m000N678R140K842q002L481O543J738p743k1348n703J6298J7380J1828
$$ -17805 -21805 -16127 -6987 -4145 -12147 -8666 -2123 -385 -8128 -29476 -35179 -18881 -1501 10327
5950A0327P723m547k0491j5968j378J0371M812Q876j2751R712J8117k357l1345
$$ 10327 18050 13503 -6988 -22956 -24334 -13963 -9151 -275 -13026 -3314 14803 12446 -18899
5937a8899J207M275k481o68K670R146Q606o873j2005J1624K8916j091m364j0013
$$ -18899 -17692 -13417 -15898 -16566 -13896 -4750 3856 -3017 -15022 -3398 25518 24427 20063 10050
5923A0050j0665L76m488r448m393Q872L343q05P51Q768J862n479n258N165J817
$$ 10050 -615 -239 -4727 -14175 -18568 -9696 -6353 -7158 -6407 2361 4223 -1256 -6514 -1349 468
5908D68J584j1396j853m691o994K635R74R442J1134J8749j4175p501o746l733
$$ 468 2052 -9344 -11197 -15888 -22882 -20247 -19273 -9831 1303 20052 5877 -1624 -8370 -12103
5894a2103l36Q537k134L833m932o65L118K089n391N050J777R149m041l754o92
$$ -12103 -12439 -3902 -6036 -2203 -7135 -7800 -4682 -2593 -7984 -2934 -1157 7992 3951 197 -495
5879d95R66o655J150j569o847M316Q823o294J834M331R039J940L993j4198K305
$$ -495 471 -6184 -5034 -6603 -13450 -9134 -311 -6605 -4771 -440 8599 10539 14532 334 2639
5864B639P684P99J0630j754k241k36M082J012k401n673k98r962j0056J235j8357
$$ 2639 10323 11122 21752 19998 17757 17521 21603 22615 20214 14541 14243 4281 -5775 -4540 -22897
5849b2897j3875J3349J0958M041j2781r764O415J4039L731J2029K115j6062N672
$$ -22897 -36772 -23423 -12465 -8424 -21205 -30969 -24554 -10515 -6784 5245 7360 -8702 -3030
5836c030p978l110J0277J2443J788j0628O001J0442j1003j320K3551P839j3952
$$ -3030 -11008 -14118 -3841 8602 10390 -238 5763 16205 5202 3882 27433 35272 21320
5823B1320r121j8643j5993o171o42J0925J7181l567P28j1979o497L707N416L436
$$ 21320 12199 -6444 -22437 -28608 -29250 -18325 -1144 -4711 -3983 -15962 -22459 -18752 -13336 -9900
5809i900j119l368r32J1703M161J0716l680j4085k121n701J4772K2822O213j1577
$$ -9900 -11019 -14387 -15319 -3616 545 11261 7581 -6504 -8625 -14326 446 23268 29481 17904
5795A7904j1363q524j665m021R62J2172j242k855m950j6540M845J5487m112l664
$$ 17904 6541 -1983 -3648 -7669 -6707 5465 4223 1368 -3582 -20122 -15277 210 -3902 -7566
5781g566M485J0416o778K291j225L831O792j113J2308j3261j3435J553P240o046
$$ -7566 -3081 7335 557 2848 1623 5454 12246 11133 23441 10180 -3255 -1702 5538 -508
5767e08m17r122k963J1125K277m770p392n955L077k458o726j3644J542J1411n374
$$ -508 -925 -10047 -13010 -1885 392 -4378 -11770 -17725 -14648 -17106 -23832 -37476 -35934 -24523 -29897
5752b9897j968M770n466L695M072Q258p741J145J0026P447l70j4611P85L307R255
$$ -29897 -31865 -27095 -32561 -28866 -24794 -16536 -24277 -23132 -13106 -5659 -6029 -20640 -19855 -16548 -7293
5737g293n305l849q000M475J3725O303m470n876J639L316J823n868J015k117j1128
$$ -7293 -12598 -16447 -24447 -19972 -6247 56 -4414 -10290 -8651 -5335 -3512 -9380 -8365 -10482 -21610
5722b1610Q363K3168J721j735K22k778j4414k492Q101pJ785k426l389m910q684
$$ -21610 -13247 9921 11642 9907 10129 7351 -7063 -9555 -1454 -1461 324 -2102 -5491 -10401 -19085
5707a9085o392L505J7984O198r374q588J5297O033k0867P267K762L091K669p893
$$ -19085 -25477 -21972 -3988 2210 -7164 -15752 -455 5578 -15289 -8022 -5260 -2169 500 -7393
5693g393j4684j175O1K0827J4334J362k824r540j1011J44N903k892L166k104j7387
$$ -7393 -22077 -23252 -23191 -2364 11970 13332 10508 968 -10043 -9899 -3996 -6888 -3722 -5826 -23213
5678b3213L14L41J476L68N617J1549R875M26o79q51p893n526K038R762J71j4664
$$ -23213 -22899 -22558 -21082 -20714 -15097 -3548 6327 6753 6074 5223 -2670 -8196 -6158 3604 3775 -10889
5662a0889j057J273J708j644J1135m939L179J255k548J7380N211p265j7408q545
$$ -10889 -11946 -10673 -8965 -10609 526 -4413 -1234 21 -2527 14853 20064 12799 -4609 -13154
5648a3154k989l366J2002J1114N98M791o26L199K190j3849n111P014n12P489j426
$$ -13154 -16143 -19509 -7507 3607 4205 8996 8370 11569 13759 -90 -5201 1813 1301 8790 7364
5633G364q961J0781k91L196J202M736K471r062k0381o369l02N845Q30K041J827
$$ 7364 -1597 9184 8893 12089 13291 18027 20498 11436 -8945 -15314 -15616 -9771 -8941 -6900 -5073
5618e073K21J434n20J085n422r559j7310j478J8397J2294j658m218J3733n79j0633
$$ -5073 -4852 -3418 -3938 -2853 -8275 -17834 -35144 -36622 -18225 -5931 -7589 -11807 1926 1347 -9286
5603i286j566r993q590m101J0643K9407N870q298k311K424m870j4312o47Q24K680
$$ -9286 -10852 -20845 -29435 -33536 -22893 6514 12384 4086 1775 4199 -671 -14983 -15630 -14806 -12126
5588a2126o119N268J1160m455N26N837k572m769o726O602K268N012N870j1499
$$ -12126 -18245 -12977 -1817 -6272 -5746 91 -2481 -7250 -13976 -7374 -5106 -94 5776 -5723
5574e723J1311L601j3712K936j127N861Q389j0563j2606J002Q198o108j3794p966
$$ -5723 5588 9189 -4523 -1587 -2714 3147 11536 973 -11633 -10631 -2433 -8541 -22335 -30301
5560c0301N239K6135N519j2417M039p948P50J639P969O050M127j156N767o463
$$ -30301 -25062 1073 6592 -5825 -1786 -9734 -8984 -7345 624 6674 10801 9645 15412 8949
5546H949p683l329q123L05J6380L265l235l07j338L702r474n207M33N278J1577
$$ 8949 1266 -2063 -10186 -9881 6499 9764 6529 6222 4884 8586 -888 -6095 -5662 -384 11193
5531A1193n007k256l638L296l213Q320Q366r077O322N258j2017m643J2505m860
$$ 11193 6186 3930 292 3588 375 8695 17061 7984 14306 19564 7547 2904 15409 10549
5517A0549O519L724l129P082n806j1893m624O177p153k455N477k514r339N195
$$ 10549 17068 20792 17663 24745 18939 7046 2422 8599 1446 -1009 4468 1954 -7385 -2190
5503b190N414L363K392j3856M491o143O937j294q841Q541J6103o687p086l963
$$ -2190 3224 6587 8979 -4877 -386 -6529 408 -886 -9727 -1186 14917 8230 1144 -2819
5489b819O61K090q696p240l688j1998M22P095k189J2366J6704J1225o114p254
$$ -2819 -2158 -68 -8764 -16004 -19692 -31690 -31268 -24173 -26362 -13996 2708 13933 7819 565
5475E65o409n424J4540R270K129J0655j093j2165n462K20J3791N546o042p611
$$ 565 -5844 -11268 3272 12542 14671 25326 24233 12068 6606 6826 20617 26163 20121 12510
5461A2510R67L97j1631r308J0611R711r318j4267k809R11M152k345p639j45j917
$$ 12510 13477 13874 2243 -7065 3546 13257 3939 -10328 -13137 -12226 -8074 -10419 -18058 -18203 -20120
5446b0120n460k648M464J9336M334j286j3141n445Q035O419K410J1678p080m204
$$ -20120 -25580 -28228 -23764 -4428 -94 -1380 -14521 -19966 -11931 -5512 -3102 8576 1496 -2708
5432b708K080j0140l443k5812r895J1608K2389J1397m565J1679J793m132j8963
$$ -2708 -628 -10768 -14211 -40023 -49918 -38310 -15921 -4524 -9089 2590 4383 251 -18712
5419a8712K23N139j39J4283L542O04j6483l492N154O24r0j790J6984O196j209
$$ -18712 -18489 -13350 -13489 794 4336 4940 -11543 -15035 -9881 -9257 -9347 -11137 5847 12043 10834
5404A0834j0673j8179p225l464p023Q90K864p84O297J0052J2208N194O598n408
$$ 10834 161 -18018 -25243 -28707 -35730 -34840 -31976 -32760 -26463 -16411 -4203 991 7589 2181
5390B181j0605j212j1896q462J974M275R73M565J9144J0981o225p377j135o20
$$ 2181 -8424 -9636 -21532 -29994 -28020 -23745 -22772 -18207 937 11918 5693 -1684 -2819 -3439
5376c439M646j6154J949J1394J2805o268k237j3610j0482L902P532O428o94l233
$$ -3439 1207 -14947 -12998 -1604 11201 4933 2696 -10914 -21396 -17494 -9962 -3534 -4228 -7461
5362g461j3017m868P229J3910k05Q75p71J0061N819o528j824j4410m275J5431
$$ -7461 -20478 -25346 -18117 -4207 -4412 -3537 -4308 5753 11572 5044 3220 -11190 -15465 -34
5348c4Q179j035n858K470r884j6750R969K6625K319p333j7930J441Q882l547j1755
$$ -34 8145 7110 1252 3722 -6162 -22912 -12943 13682 16001 8668 -9262 -7821 1061 -2486 -14241
5333a4241j4099l097J8640M113p871j5678J1721R814j73R614n437l516q861j4305
$$ -14241 -28340 -31437 -12797 -8684 -16555 -32233 -20512 -10698 -10871 -1257 -6694 -10210 -19071 -33376
5319c3376k0814O822J9423k751J2500J5650L071l041o758m228j0414j4104k786
$$ -33376 -54190 -47368 -27945 -30696 -18196 -2546 525 -2516 -9274 -13502 -23916 -38020 -40806
5306d0806J4044J1860R121J0412n165R365m387j1305j6088J0513O156O907P82
$$ -40806 -26762 -14902 -5781 4631 -534 8831 4444 -6861 -22949 -12436 -6280 627 1409
5293A409m179J521j2708P216J769j1068m655J7854J0967j6106m327O416R12k508
$$ 1409 -2770 -1249 -13957 -6741 -4972 -16040 -20695 -2841 8126 -7980 -12307 -5891 -4979 -7487
5279g487l675M021j637r849P349J2515N87j6310m030K358k207L4q322r492J6742
$$ -7487 -11162 -7141 -8778 -18627 -11278 1237 1824 -14486 -18516 -16158 -18365 -18331 -26653 -36145 -19403
5264a9403J2057o742n417J0214k800J0735L785j0435j01J317J1207R170J3506
$$ -19403 -7346 -14088 -19505 -9291 -12091 -1356 2429 -8006 -8107 -6790 4417 13587 27093
5251B7093j507j5899j1526k282j1061k480O850P529p418n087N667L653J1322m033
$$ 27093 25586 9687 -1839 -4121 -15182 -17662 -10812 -3283 -10701 -15788 -10121 -6468 4854 821
5237H21l080N624j334k075p102L021j3143J657L007p645L379j232k588l268Q869
$$ 821 -2259 3365 2031 -44 -7146 -4125 -17268 -15611 -12604 -20249 -16870 -18102 -20690 -23958 -15089
5222a5089J5135P753r812j461L864j061j2642o546j071l876Q043R310O166l86
$$ -15089 46 7799 -2013 -3474 390 -671 -13313 -19859 -20930 -24806 -16763 -7453 -1287 -1673
5208a673n877n357n034O603m878J117O362j1056p738K868J4834J3416q51R142
$$ -1673 -7550 -12907 -17941 -11338 -16216 -15099 -8737 -19793 -27531 -24663 -9829 3587 2736 11878
5194A1878k037m228o822r868j3015R297J4303O152l372l693j5506k0223n988J6551
$$ 11878 9841 5613 -1209 -11077 -24092 -14795 -492 5660 2288 -1405 -16911 -37134 -43122 -26571
5180b6571K0961J6995o284L680k121l292L410j6404k213m862J96q932N828J8136
$$ -26571 -5610 11385 5101 8781 6660 3368 6778 -9626 -11839 -16701 -16505 -25437 -19609 -1473
5166a473J5497J6959q233j8410m718j559L537p057j2194n2K916N632P977j103
$$ -1473 14024 30983 22750 4340 -378 -1937 1600 -5457 -17651 -17703 -14787 -9155 -1178 -2281
5152b281R085J3459p985J484m018p346J470m291j537k2880L847J5151N669M189
$$ -2281 6804 20263 12278 13762 9744 2398 3868 -423 -1960 -24840 -20993 -5842 -173 4016
5138D016n790o569m461p859J258J8820P611m669K692N278o963o007j2193l288
$$ 4016 -1774 -8343 -12804 -20663 -19405 -585 7026 2357 5049 10327 3364 -2643 -14836 -18124
5124a8124N870P21O683J7334o15K774K858j5737j4351M755J5619K760n327m998
$$ -18124 -12254 -11533 -4850 12484 11869 14643 17501 1764 -12587 -7832 7787 10547 5220 222
5110B22j2760P224J5588l341j661J021l714l451j319o698M595J53O393r936l592
$$ 222 -12538 -5314 10274 6933 5272 6293 2579 -872 -2191 -8889 -4294 -4141 2252 -7684 -11276
5095a1276r346J2182J2562Q810J311L179O083K780J442k622j6333Q490N801j492
$$ -11276 -20622 -8440 4122 12932 14243 17422 23505 26285 27727 25105 8772 17262 23063 21571
5081B1571n759k763j142j1571p178j6056m08J0130M198M4Q456l182q003J0790
$$ 21571 15812 13049 11907 336 -6842 -22898 -23306 -13176 -8978 -8934 -478 -3660 -11663 -873
5067h73J0299K700j6044k300J1930q519n739q943J0074J3761p734P81Q270N226
$$ -873 9426 12126 -3918 -6218 5712 -2807 -8546 -17489 -7415 6346 -1388 -607 7663 12889
5053A2889n606o352N153n61j7243J792j836J691p216r263J2283J0895l532k037
$$ 12889 7283 931 6084 5523 -11720 -9928 -11764 -10073 -17289 -26552 -14269 -3374 -6906 -8943
5039h943q384J2275j233p333P549q131N73J9288K3037j1270j544J6608L164p068
$$ -8943 -17327 -5052 -6285 -13618 -6069 -14200 -13627 5661 28698 17428 15884 32492 35656 28588
5025B8588r831j875j3563j7002p033R46n12n541J1824O741J776K48K881L44k220
$$ 28588 18757 16882 3319 -13683 -20716 -19770 -20282 -25823 -13999 -7258 -5482 -5234 -2353 -2009 -4229
5010d229M712K487r766j063R109q965J122K726L011j1043J042R497o823K95J1440
$$ -4229 483 2970 -6796 -7859 1250 -7715 -6593 -3867 -856 -11899 -10857 -1360 -8183 -7888 3552
4995C552o219j5973p52J0555k572Q002P884j528r156m775J6194p004j1479k194
$$ 3552 -2667 -18640 -19392 -8837 -11409 -3407 4477 2949 -6207 -10982 5212 -1792 -13271 -15465
4981a5465J2035k24L208J0347l462M250n223n604k687p120j7636j0107K2298M168
$$ -15465 -3430 -3654 -446 9901 6439 10689 5466 -138 -2825 -9945 -27581 -37688 -15390 -11222
4967a1222l525j11N04Q057k169j616R10L543J213r519O503P653O732j274N0m516
$$ -11222 -14747 -14858 -14354 -6297 -8466 -10082 -9172 -5629 -4416 -13935 -7432 221 6953 5679 5729 1213
4951A213K882J7493P16r681p498p462r391N660k123J0967p44k4269r462p468n992
$$ 1213 4095 21588 22304 12623 5125 -2337 -11728 -6068 -8191 2776 2032 -22237 -31699 -39167 -45159
4936d5159J074J078O168l72J401J0176P642K772N914Q998J5710O223K00k555j9939
$$ -45159 -44085 -43007 -36839 -37211 -35810 -25634 -17992 -15220 -9306 -308 15402 21625 21825 19270 -669
4921f69P095J0134j678j6673j118J1754N612p676j4641n867j531Q18q646j512
$$ -669 6426 16560 14882 -1791 -2909 8845 14457 6781 -7860 -13727 -15258 -14440 -23086 -24598
4907b4598n291l34Q761J8097J1339k851N800l59p2M29M636j879M148J1046q793
$$ -24598 -29889 -30223 -21462 -3365 7974 5123 10923 10564 10492 10921 15557 13678 17826 28872 20079
4892B0079k4290O35P388R616j5267J240J3900o271j4372J861j447j237n866R361
$$ 20079 -4211 -3576 3812 13428 -1839 -599 13301 7030 -7342 -5481 -6928 -8165 -14031 -4670
4878d670J0064P259m395p945q488q072J819J1464M07k820o887M833J3068L828
$$ -4670 5394 12653 8258 313 -8175 -16247 -14428 -2964 -2557 -5377 -12264 -7431 5637 9465
4864I465K446q553m356O220L329l100j094J411L77j125k013q954n949m557l736
$$ 9465 11911 3358 -998 5222 8551 5451 4357 5768 6145 5020 3007 -5947 -11896 -16453 -20189
4849b0189N641M307K381M701J431R214n233q294J0983Q255n884q693N31j107L505
$$ -20189 -14548 -10241 -7860 -3159 -1728 7486 2253 -6041 4942 13197 7313 -1380 -849 -1956 1549
4834A549l704l334p808Q827J277l015M42j0510p336P220O814M815J5098J150l572
$$ 1549 -2155 -5489 -13297 -4470 -3193 -6208 -5766 -16276 -23612 -16392 -9578 -4763 10335 11485 7913
4819G913k115j0334p775J5649K675q512j5977j613J1044J776p941j9203q125J3670
$$ 7913 5798 -4536 -12311 3338 6013 -2499 -18476 -20089 -9045 -7269 -15210 -34413 -42538 -28868
4805b8868R856M524P334o982n239r713o504J1514J4367J4041r380q962P159L552
$$ -28868 -19012 -14488 -7154 -14136 -19375 -29088 -35592 -24078 -9711 4330 -5050 -14012 -6853 -3301
4791c301J949m849r493j6665j1758J3068O395N160N434K177j0977N143J0777k013
$$ -3301 -1352 -6201 -15694 -32359 -44117 -31049 -24654 -19494 -14060 -11883 -22860 -17717 -6940 -8953
4777h953j785M061L135r562p457J2086J6611m947j528J717J420q294K023J447
$$ -8953 -10738 -6677 -3542 -13104 -20561 -8475 8136 3189 1661 3378 4798 -3496 -1473 -26
4763b6J463k318M14M059k089p214r104k730K467j3568j0913Q238R095l083O028
$$ -26 1437 -881 -467 3592 1503 -5711 -14815 -17545 -15078 -28646 -39559 -31321 -22226 -25309 -19281
4748a9281J4795r874p95n315L879R535n886J4793P171L514q20q31o261p09M93
$$ -19281 -4486 -14360 -15155 -20470 -16591 -7056 -12942 1851 9022 12536 11716 10885 4624 3915 4408
4733D408j3883K594J784k913K312M361J077j4426L04K344O344O126j6338q67L463
$$ 4408 -9475 -6881 -5097 -8010 -5698 -1337 -260 -14686 -14382 -12038 -5694 432 -15906 -16773 -13310
4718a3310O322L81m129J917l930n265k028M577P767O669k760j4685o38L508K415
$$ -13310 -6988 -6607 -10736 -8819 -12749 -18014 -20042 -15465 -7698 -1029 -3789 -18474 -19112 -15604 -13189
4703a3189l917n158j0057O005J4200J824j0985n782j6589k36J954J0438N574M25
$$ -13189 -17106 -22264 -32321 -26316 -12116 -10292 -21277 -27059 -43648 -43884 -41930 -31492 -25918 -25493
4689b5493J0520O351J1709Q390j1759O23k879j0743J3302J2759O380l512J188
$$ -25493 -14973 -8622 3087 11477 -282 341 -2538 -13281 21 12780 19160 15648 16836
4676A6836q570j3320m726k301r422L777J753J7320N721q462o877l829k54l099
$$ 16836 8266 -5054 -9780 -12081 -21503 -17726 -15973 1347 7068 -1394 -8271 -12100 -12354 -15453
4662a5453o461L266J2461O077j2324l225P622N018m900J3070P648p516n989j2863
$$ -15453 -21914 -18648 -6187 -110 -12434 -15659 -8037 -3019 -7919 5151 12799 5283 -706 -13569
4648a3569j0317p956M452J0704N990R429Q835j625p767q593J6440J0279q417K074
$$ -13569 -23886 -31842 -27390 -16686 -10696 -1267 7568 5943 -1824 -10417 6023 16302 7885 9959
4634I959p113K123o545j4494j6704j971N204J2970P252M425O103o984L075Q12
$$ 9959 2846 4969 -1576 -16070 -32774 -34745 -29541 -16571 -9319 -4894 1209 -5775 -2700 -1888
4620a888K316m530l027m65l943K0720P298m469L99k425J97j1020j0734j741Q828
$$ -1888 428 -4102 -7129 -7594 -11537 9183 16481 12012 12411 9986 10183 -837 -11571 -13312 -4484
4605d484J151J485j893P113M417L104r315j430L451M305j1241R887J456j1750
$$ -4484 -3333 -1848 -3741 3372 7789 10893 1578 148 3599 7904 -3337 6550 8006 -3744
4591c744l158o233J2231M445m910J052n957q562j1625J8900R827j955n705L24
$$ -3744 -6902 -13135 -904 3541 -1369 -317 -6274 -14836 -26461 -7561 2266 311 -5394 -5070
4577e070M460O84o889J979k7N393k82M297j060n549K201r916J051J1649q847j3310
$$ -5070 -610 74 -6815 -4836 -4863 530 248 4545 3485 -2064 137 -9779 -8728 2921 -5926 -19236
4561a9236j2079O014O528O95R449J90P33m603l893Q89N244j24o932Q499K082p535
$$ -19236 -31315 -25301 -18773 -18078 -8629 -8439 -7706 -12309 -16202 -15313 -10069 -10193 -17125 -8626 -6544 -14079
4545a4079l91J2267j4993j3858N363K706O514M110k700K610J0310j638l437K286
$$ -14079 -14470 -2203 -17196 -31054 -25691 -22985 -16471 -12361 -15061 -12451 -2141 -3779 -7216 -4930
4531d930j17n669k304j6818q311J5482J6217J224l095N778J298l724K560P583
$$ -4930 -5047 -10716 -13020 -29838 -38149 -22667 -6450 -5226 -8321 -2543 -1245 -4969 -2409 5174
4517E174M475L56o596n192j2519j3201K36k042k022N039L753j114R925O731n20
$$ 5174 9649 10005 3409 -1783 -14302 -27503 -27267 -29309 -31331 -26292 -22539 -23653 -13728 -6997 -7517
4502g517M814p872n536R363L867J193l365m285j835O415k386k0268n44J284J1651
$$ -7517 -2703 -10575 -16111 -6748 -2881 -1688 -5053 -9338 -11173 -4758 -7144 -27412 -27956 -26672 -15021
4487a5021J4804R6j3153M751R293q314M275O299J572k129n413n288M389J3033
$$ -15021 -217 -121 -13274 -8523 770 -7544 -3269 3030 4602 2473 -2940 -8228 -3839 9194
4473I194O296l381j6645n459O571j626L639r890K793L758j1423J352J1254L37
$$ 9194 15490 12109 -4536 -9995 -3424 -5050 -1411 -11301 -8508 -4750 -16173 -14821 -3567 -3230
4459c230j742N112P55K261q762m049J4396R282k546M829l834l920m81o142n35
$$ -3230 -4972 140 895 3156 -5606 -9655 4741 14023 11477 16306 12472 8552 8071 1929 1394
4444A394l641J1261L921j1340r010j383j136m463j421M650m24n573K867J066L670
$$ 1394 -2247 9014 12935 1595 -7415 -8798 -9934 -14397 -15818 -11168 -11592 -17165 -14298 -13232 -9562
4429i562N543m095J3479J1531j5890j7019K575M961L712L009p495m345q258Q262
$$ -9562 -4019 -8114 5365 16896 1006 -16013 -13438 -8477 -4765 -1756 -9251 -13596 -21854 -13592
4415a3592J0285M616K786m450K194p330L69N41N231K1665K88k3913k5023q087
$$ -13592 -3307 1309 4095 -355 1839 -5491 -5122 -4581 650 22315 22603 -1310 -26333 -34420
4401c4420j979J1451J9085r50j6929m463P153J1682m266L282q479o196N195K3761
$$ -34420 -36399 -24948 -5863 -6813 -23742 -28205 -21052 -9370 -13636 -10354 -18833 -25029 -19834 3927
4387C927P729P517p079j6725j1950l320R312N97p029N293R58Q253P252Q652J3725
$$ 3927 11656 19173 12094 -4631 -16581 -19901 -10589 -9992 -17021 -11728 -10770 -2517 4735 13387 27112
4372B7112j6285j688j6293j4309J6769J0420n967m346Q861J9901J504j169r863
$$ 27112 10827 9139 -7154 -21463 -4694 5726 -241 -4587 4274 24175 25679 24510 14647
4359A4647m972r87P348J712K448l364k390j7887k1459L043N282l918m4J0647Q241
$$ 14647 9675 8688 16036 17748 20196 16832 14442 -3445 -24904 -21861 -16579 -20497 -20541 -9894 -1653
4344a653J702J3550K0247j037p825k4341q707J4119p285o164P552J3312L738m042
$$ -1653 49 13599 33846 32809 24984 643 -8064 6055 -1230 -7394 158 13470 17208 13166
4330A3166j2317m680J4747m793n690j346j05N109l256j658j972o475k808q484
$$ 13166 849 -3831 10916 6123 433 -913 -1018 4091 835 -823 -2795 -9270 -12078 -20562
4316b0562j637j346l893Q701Q435K025r125J0251m001M732J2561L779m536k046
$$ -20562 -22199 -23545 -27438 -18737 -10302 -8277 -17402 -7151 -11152 -6420 6141 9920 5384 3338
4302C338m684N419Q088k678J446l6k658M010k934k270j9672J630j985O931O27
$$ 3338 -1346 4073 12161 9483 10929 10893 8235 12245 9311 7041 -12631 -11001 -12986 -6055 -5428
4287e428M711J2017K17j3683K774L695L69P949l167n769r7M960J073q768n472
$$ -5428 -717 11300 11517 -2166 608 4303 4672 12621 9454 3685 3588 8548 9621 853 -4619
4272d619K687L736P409p136o589J5365L990M535o901o574J4124k9p709M64P18
$$ -4619 -1932 1804 9213 2077 -4512 10853 14843 19378 12477 5903 20027 19998 12289 12753 13471
4257A3471m452J161p16q568j065o613k930N811l330m574Q382J1673R208k363j4210
$$ 13471 9019 10180 9464 896 -169 -6782 -9712 -3901 -7231 -11805 -3423 8250 17458 15095 885
4242H85q106l879J6817J1059J964n718j1134j1678r02J3881L44M550J6289L311
$$ 885 -7221 -11100 5717 16776 18740 13022 1888 -9790 -10692 3189 3533 8083 24372 27683
4228B7683j9823n024m832l658K379O829J0206J0256m215j0183R808N791j109p196
$$ 27683 7860 2836 -1996 -5654 -3275 3554 13760 24016 19801 9618 19426 25217 24108 16912
4214A6912l175o947J157r588j7817k856P871M843r689n559p52L977N544j150l778
$$ 16912 13737 6790 7947 -1641 -19458 -22314 -14443 -9600 -19289 -24848 -25600 -21623 -16079 -17229 -21007
4199b1007R494P667J0263m887k417J1100N046j1821l774j410k872j0316Q047J8197
$$ -21007 -11513 -3846 6417 1530 -887 10213 15259 3438 -336 -1746 -4618 -14934 -6887 11310
4185A1310P569Q174j8804j937N33q647m937P97J7069j4045j2419O680L795j1208
$$ 11310 18879 27053 8249 6312 6845 -1802 -6739 -5942 11127 -2918 -15337 -8657 -4862 -16070
4171a6070P130P880L618J1029Q218j917O425Q28o390r583p971p088L562J1782
$$ -16070 -8940 -1060 2558 13587 21805 19888 26313 27141 20751 11168 3197 -3891 -329 11453
4157A1453J9744r60j0080j0514n775n069l952p298M542K3158n35n443q509j0208
$$ 11453 31197 30237 20157 9643 3868 -1201 -5153 -12451 -7909 15249 14714 9271 762 -9446
4143i446j0377L430J6464k58n867K783O630Q642q550n693K12K789n868k853l521
$$ -9446 -19823 -16393 71 -187 -6054 -3271 3359 12001 3451 -2242 -2030 759 -5109 -7962 -11483
4128a1483L468P105p994p033o216j507R797J229N599J0110j7695n885n549K585
$$ -11483 -8015 -910 -8904 -15937 -22153 -23660 -13863 -12634 -7035 3075 -14620 -20505 -26054 -23469
4114b3469P666J2557O131m793R879L223j3495o815K84k550j1795K262P28O68M135
$$ -23469 -15803 -3246 2885 -1908 7971 11194 -2301 -9116 -8832 -11382 -23177 -20915 -20187 -19519 -15384
4099a5384Q817o714P074M591k332j006Q770n752j0287j1790k421P727J754K420
$$ -15384 -6567 -13281 -6207 -1616 -3948 -4954 3816 -1936 -12223 -24013 -26434 -18707 -16953 -14533
4085a4533J7227m486r515o755m658j559J6471J8388k466j6127j371N119M499M10
$$ -14533 2694 -1792 -11307 -18062 -22720 -24279 -7808 10580 8114 -8013 -9384 -4265 234 644
4071F44L090K627m345l001k37P407n080K80N209J6068Q379k3670J737k282j6879
$$ 644 3734 6361 2016 -985 -1222 6185 1105 1385 6594 22662 31041 7371 9108 6826 -10053
4056a0053r964L514r36l102J1221J2246k940m471p931N010J6627M888j3124j0206
$$ -10053 -20017 -16503 -17439 -20541 -9320 2926 -14 -4485 -12416 -7406 9221 14109 985 -9221
4042i221R857N744j049l967L520l865j1185k516j775J025k777K557M555N71n53
$$ -9221 636 6380 5331 1364 4884 1019 -10166 -12682 -14457 -13432 -16209 -13652 -9097 -8526 -9079
4027i079R662q028j9248k476j921R511K378r254j087J223R554R466J0474l956
$$ -9079 583 -7445 -26693 -29169 -31090 -21579 -19201 -28455 -29542 -28319 -18765 -9299 1175 -2781
4013b781m692J057Q11N58r896M193r631R507K2454r573n163P099J2604M291r205
$$ -2781 -7473 -6416 -5605 -5047 -14943 -10750 -20381 -10874 11580 2007 -3156 3943 16547 20838 11633
3998A1633j8672o779Q173L453J4616P863q59j248J889L440J1277j767k5544O530
$$ 11633 -7039 -13818 -5645 -2192 12424 20287 19428 18180 20069 23509 34786 33019 7475 14005
3984A4005K5443o279p881m58k587l595l712N881O011p305q645M502Q02j35n133
$$ 14005 39448 33169 25288 24830 22243 18648 14936 20817 26828 19523 10878 15380 16182 16047 10914
3969A0914l09o753o064N41j281l446k478m001k455M533k026M034J5020n100q891
$$ 10914 10605 3852 -2212 -1671 -2952 -6398 -8876 -12877 -15332 -10799 -12825 -8791 6229 1129 -7762
3954g762N351P640K22j6308j2271n632m064O321R177J588J1170M852j873o171
$$ -7762 -2411 5229 5451 -10857 -23128 -28760 -32824 -26503 -17326 -15738 -4568 284 -1589 -7760
3940g760l604O222J601o509n746RK161L35M71m966P463J0052r191J961m83R443
$$ -7760 -11364 -5142 -3541 -10050 -15796 -15787 -13626 -13291 -12820 -17786 -10323 -271 -9462 -7501 -7984 1459
3924A459R643q059K658l623K472k165N032m50m305r137J110M826j0121K965J7175
$$ 1459 11102 3043 5701 2078 4550 2385 7417 6967 2662 -6475 -5365 -539 -10660 -7695 9480
3909I480n44p334M529r411L687Q380K155j898o56m642j8000q997m693O872J1226
$$ 9480 8936 1602 6131 -3280 407 8787 10942 9044 8388 3746 -14254 -23251 -27944 -21072 -9846
3894i846n126M851R911J0727O15o813J49K701o006o083L576o603R19r88Q728j0225
$$ -9846 -14972 -10121 -210 10517 11132 4319 4468 7169 1163 -4920 -1344 -7947 -7028 -8016 712 -9513
3878i513R926o27n208j997m85R828O9j0240p78R570N925O939J613o800K961L929
$$ -9513 413 -214 -5422 -7419 -7904 1924 1993 -8247 -9025 545 6470 13409 15022 8222 11183 15112
3862A5112J2232K986j2916l385l549j178l615j685L095l682q947M457M70l182
$$ 15112 27344 30330 17414 14029 10480 9302 5687 4002 7097 3415 -5532 -1075 -605 -3787
3848c787J2599K041q069j1069J8510J704O893J6182O82p725j7395j979L762p043
$$ -3787 8812 10853 2784 -8285 10225 11929 18822 35004 35686 27961 10566 8587 12349 5306
3834E306m486q621m032m590o91O703O349m376K170l36n33k640j7662j0490J0831
$$ 5306 820 -7801 -11833 -16423 -17114 -10411 -4062 -8438 -6268 -6604 -7137 -9777 -27439 -37929 -27098
3819b7098J1830k897Q790L754O606o38j0160j0166p304K067K0682J0441K736O944
$$ -27098 -15268 -18165 -9375 -5621 985 347 -9813 -19979 -27283 -25216 -4534 5907 8643 15587
3805A5587q424k0901Q356j718K176K931J604j1109k476K144K996K230l089n227
$$ 15587 7163 -13738 -5382 -7100 -4924 -1993 -389 -11498 -13974 -11830 -8834 -6604 -9693 -14920
3791a4920M508R417l241j1357k978N481O361Q878N103r297r697J0950J2732o67
$$ -14920 -10412 -995 -4236 -15593 -18571 -13090 -6729 2149 7252 -2045 -11742 -792 11940 11273
3777A1273j1818o47l049m575M549N719j313k880n614q682n034K309O843O525o605
$$ 11273 -545 -1192 -4241 -8816 -4267 1452 139 -2741 -8355 -17037 -22071 -19762 -12919 -6394 -12999
3762a2999R866nk493l335O451o845p598P691p62Q344O161M548l494o970o479l
$$ -12999 -3133 -3138 -5631 -8966 -2515 -9360 -16958 -9267 -10029 -1685 4476 9024 5530 -1440 -7919 -7922
3746g922Q276Q146l580J363J7705Q563l873o960j5926j5202n596N93n216l903
$$ -7922 354 8500 4920 6283 23988 32551 28678 21718 5792 -9410 -15006 -14413 -19629 -23532
3732b3532L226J0892M866q463O219R693M827J7293n446r953K696k141j1062k878
$$ -23532 -20306 -9414 -4548 -13011 -6792 2901 7728 25021 19575 9622 12318 10177 -885 -3763
3718c763O023O609j5249j0543j2738l462J4633P859P756l323l939k638l131N862
$$ -3763 2260 8869 -6380 -16923 -29661 -33123 -18490 -10631 -2875 -6198 -10137 -12775 -15906 -10044
3704a0044J2211J3849j7592p299K951N529k29M448J6031j552J743r008J852j0535
$$ -10044 2167 16016 -1576 -8875 -5924 -395 -624 3824 19855 18303 20046 11038 12890 2355
3690B355j0479P462M795P732J116o95j0203j5745r530P383J1217o923r837k029
$$ 2355 -8124 -662 4133 11865 12981 12286 2083 -13662 -23192 -15809 -4592 -11515 -21352 -23381
3676b3381p986m125K894K0474J9635K291j6879m284o161J355J4379R358L864Q26
$$ -23381 -31367 -35492 -32598 -12124 7511 9802 -7077 -11361 -17522 -16167 -1788 7570 11434 12260
3662A2260j0903m499k73k73n782o913j0098J8222R987O726L292j2925K28l350
$$ 12260 1357 -3142 -3415 -3688 -9470 -16383 -26481 -8259 1728 8454 11746 -1179 -951 -4301
3648d301o593Q262J474n379J4428K2158q007j4428p382k109O075k66L515j3277
$$ -4301 -10894 -2632 -1158 -6537 7891 30049 22042 7614 232 -1877 4198 3932 7447 -5830
3634e830m843P68N922o383j1270P773K5340P565r18n161n32R130n326j1495p098
$$ -5830 -10673 -9905 -3983 -10366 -21636 -13863 11477 19042 18124 12963 12431 21561 16235 4740 -2358
3619b358K723o83j334N562Q054R843n131k527N89q802J546R780j547k851O880
$$ -2358 365 -318 -1652 3910 11964 21807 16676 14149 14738 5936 7482 17262 15715 12864 19744
3604A9744L929l370m118k6153n237J0624j707M10k614l110Q4J192Q403P863P727
$$ 19744 23673 20303 16185 -9968 -15205 -4581 -6288 -5878 -8492 -11602 -11518 -10326 -1923 5940 13667
3589A3667J735n449p044k291l542M087l076K894R233N981q229o332r494K349M039
$$ 13667 15402 9953 2909 618 -2924 1163 -1913 981 10214 16195 7966 1634 -7860 -5511 -1472
3574a472k956q334m798O154L421k066m585P61J714K811L936k773k4796Q996P779
$$ -1472 -4428 -12762 -17560 -11406 -7985 -10051 -14636 -13875 -12161 -9350 -5414 -8187 -32983 -23987 -16208
3559a6208o699M066m545K697K1546j389j6193n506K224p978K2085J1274k419J843
$$ -16208 -22907 -18841 -23386 -20689 857 -532 -16725 -22231 -20007 -27985 -5900 5374 2955 4798
3545D798L883K683j726M484k302K278Q564L736k76n902k4281m56o4l17J2599q061
$$ 4798 8681 11364 9638 14122 11820 14098 22662 26398 26122 20220 -4061 -4517 -4581 -4898 7701 -360
3529c60o722M396N985P916r052j4359P653j715o819o869q95J1347O813Q525L104
$$ -360 -7082 -2686 3299 11215 2163 -12196 -4543 -6258 -13077 -19946 -20841 -9494 -2681 5844 8948
3514H948k956p67o894R4j14j0873j050L464k144J1832O533O69k342k1347q902
$$ 8948 5992 5225 -1669 -1575 -1689 -12562 -13612 -10148 -12292 -460 6073 6742 4400 -16947 -25849
3499b5849j2384K575j837N635J9821L903M128Q567J8408K392M695q450j3752o939
$$ -25849 -38233 -35658 -37495 -31860 -12039 -8136 -4008 4559 22967 25359 30054 21604 7852 913
3485I13L653k186O923p464j2981p575j2997J1612J6621j4288N2M384l02P087M142
$$ 913 4566 2380 9303 1839 -11142 -18717 -31714 -20102 -3481 -17769 -17717 -13333 -13635 -6548 -2406
3470b406J8914J054j3489n402L207J518K181J370m141k266Q326j894l175m879
$$ -2406 16508 17562 4073 -1329 1878 3396 5577 6947 2806 540 8866 6972 3797 -1082
3456a082M03R607n68l616o520J256j6928N248J5590J4918K390j1644j5748k3726
$$ -1082 -679 8928 8360 4744 -1776 -520 -17448 -12200 3390 18308 20698 9054 -6694 -30420
3442c0420P828N604P700J3484L943J839L401k583N427n504k560j1282m778k465
$$ -30420 -22592 -16988 -9288 4196 8139 9978 13379 10796 16223 10719 8159 -3123 -7901 -10366
3428a0366k3L73K674P219p409p484j4354m575J5638J8144n07n232o803l026M013
$$ -10366 -10389 -10016 -7342 -123 -7532 -15016 -29370 -33945 -18307 -163 -670 -5902 -12705 -15731 -11718
3413a1718K616L639n977k366l127R130O907N892K324M596M391j535P968k924k3846
$$ -11718 -9102 -5463 -11440 -13806 -16933 -7803 -896 4996 7320 11916 16307 14772 22740 19816 -4030
3398d030q856R1j422L87N769k138q468n930O720o76j865q54O407J3553J3735R464
$$ -4030 -12886 -12795 -14217 -13830 -8061 -10199 -18667 -24597 -17877 -18553 -20418 -21272 -14865 -1312 12423 21887
3382B1887l890r278P978N230R966l873r882L867N972O551m56l503j4364Q26m59
$$ 21887 17997 8719 16697 21927 31893 28020 18138 22005 27977 34528 34072 30569 16205 17031 16572
3367A6572J0305K17q187j5149n534K459J0814J969J76j0005n445q37Q907l761
$$ 16572 26877 27094 18907 3758 -1776 683 11497 13466 13642 3637 -1808 -2645 6262 2501
3353B501r107j1537r791K519K731L686N349O228J1291K066l834k847K584M435
$$ 2501 -6606 -18143 -27934 -25415 -22684 -18998 -13649 -7421 3870 5936 2102 -745 1839 6274
3339F274j5397L820O020J8028l467j7018o34Q307M281n745N20O660J0325o360
$$ 6274 -9123 -5303 717 18745 15278 -1740 -2374 5933 10214 4469 4989 11649 21974 15614
3325A5614j8032K829L166r34L128o173N444R165j0227j60J2531K69j5730m294
$$ 15614 -2418 411 3577 2643 5771 -402 5042 14207 3980 3820 16351 16620 890 -3404
3311c404M919m44k962l768m949O522P742m531p517l79J3079J6253J82o168j078
$$ -3404 1515 1071 -1891 -5659 -10608 -4086 3656 -875 -8392 -8771 4308 20561 20743 14575 13497
3296A3497l324j3983j1734J350J7469J3465j7258j9746R358M311o92J8773J610
$$ 13497 10173 -3810 -15544 -14194 3275 16740 -518 -20264 -10906 -6595 -7287 11486 13096
3283A3096n652j4373j0415R572J7540q695p190M814J176K202k526R462J0814n50
$$ 13096 7444 -6929 -17344 -7772 9768 1073 -6117 -1303 -127 2075 -451 9011 19825 19275
3269A9275j8293j1631K872O844L002n987Q910j0763p433J906J3507k939q030m122
$$ 19275 982 -10649 -7777 -933 2069 -3918 4992 -5771 -13204 -11298 2209 -730 -8760 -12882
3255a2882O088J1430J5670J816k815j6034j7341N586M452K133j1346o144Q705
$$ -12882 -6794 4636 20306 22122 19307 3273 -14068 -8482 -4030 -1897 -13243 -19387 -10682
3242a0682J4458N102m121j1145K21k115J4349l454o680J72q318p487p598O819
$$ -10682 3776 8878 4757 -6388 -6167 -8282 6067 2613 -4067 -3895 -12213 -19700 -27298 -20479
3228b0479J6924L63P767J031o832n940j786K3259P603p977P665j2426q327J000
$$ -20479 -3555 -3192 4575 5606 -1226 -7166 -8952 14307 21910 13933 21598 9172 845 1845
3214A845j3K040p676j5949N545J0662l63J940N58j0835Q072J0130o047j4491R196
$$ 1845 1832 3872 -3804 -19753 -14208 -3546 -3909 -1969 -1411 -12246 -4174 5956 -91 -14582 -5386
3199e386L147r481j0223n552L710J2511R049j9084j2273R266O820J2182Q340p05
$$ -5386 -2239 -11720 -21943 -27495 -23785 -11274 -2225 -21309 -33582 -24316 -17496 -5314 3026 2321
3185B321k482N743j893j0441q912J896P817p246o757M555K751p60K590Q072J3429
$$ 2321 -161 5582 3689 -6752 -15664 -13768 -5951 -13197 -19954 -15399 -12648 -13408 -10818 -2746 10683
3170A0683l362J232J805r441j0370j3710L112Q435J9247Q212K827o58j2364o497
$$ 10683 7321 8553 10358 917 -9453 -23163 -20051 -11616 7631 15843 18670 18012 5648 -849
3156h49j7469n737K561J9390P781L02k3714o245P28P943Q359j945P697P152J1442
$$ -849 -18318 -24055 -21494 -2104 5677 5979 -17735 -23980 -23252 -15309 -6950 -8895 -1198 5954 17396
3141A7396L330N31m675j4394O051N464j365L237p58q019j2219j326N360J3817
$$ 17396 20726 21257 16582 2188 8239 13703 12338 15575 14817 6798 -5421 -6747 -1387 12430
3127A2430J1938p396n330j0733P302l08o280L502m908j356P865O622j3350K875
$$ 12430 24368 16972 11642 909 8211 7903 1623 5125 217 -1139 6726 13348 -2 2873
3113B873J6155k2629j4076J2123O318o802O782p199M483j5l568l995j950P880
$$ 2873 19028 -3601 -17677 -5554 764 -6038 744 -6455 -1972 -1987 -5555 -9550 -11500 -3620
3099c620Q246M539m75l924n124l438P583R172j8243l792j420j996R424J2361M899
$$ -3620 4626 9165 8690 4766 -358 -3796 3787 12959 -5284 -9076 -10496 -12492 -3068 9293 14192
3084A4192J479k572k839j4733l604K707O785j1186p060Q818j182M600n311P615
$$ 14192 15671 13099 10260 -4473 -8077 -5370 1415 -9771 -16831 -8013 -9195 -4595 -9906 -2291
3070b291j852k619k32j0994J934M724O681l883J6277J0412p65Q254l439m124p425
$$ -2291 -4143 -6762 -6994 -17988 -16054 -11330 -4649 -8532 7745 18157 17392 25646 22207 18083 10658
3055A0658n178q684K705k567k461J0965Q749p333m233N473q078J067O665j0461
$$ 10658 5480 -3204 -499 -3066 -5527 5438 14187 6854 2621 8094 16 1083 7748 -2713
3041b713k5268J0128J9259N111Q024K666P685k430j0667q502o953l990L150p467
$$ -2713 -27981 -17853 1406 6517 14541 17207 24892 22462 11795 3293 -3660 -7650 -4500 -11967
3027a1967K714q008N060J4698n481j6575l702O957n937P914Q424k756k731l40
$$ -11967 -9253 -17261 -12201 2497 -2984 -19559 -23261 -16304 -22241 -14327 -5903 -8659 -11390 -11730
3013a1730J3794R545p229p641N011j5430P0p955K393R860P98K817j545j52o617
$$ -11730 2064 11609 4380 -3261 1750 -13680 -13610 -21565 -19172 -9312 -8514 -5697 -7242 -7394 -14011
2998a4011R105J9N071m310R51R14Q99J3084Q392J0843q632k376j2225j0373j0472
$$ -14011 -4906 -4887 184 -4126 -3175 -2261 -1362 11722 20114 30957 22325 19949 7724 -2649 -13121
2983a3121J0978N263j7015M201K481p306J810K2730J3887r136j2334k137k836
$$ -13121 -2143 3120 -13895 -9694 -7213 -14519 -12709 10021 23908 14772 2438 301 -2535
2970b535m330o678L201O264J1331L382j815j112q303k1607k203J6161R31j1629
$$ -2535 -6865 -13543 -10342 -4078 7253 10635 8820 7708 -595 -22202 -24405 -8244 -7313 -18942
2956a8942l922L71J2813J3266Q535K588r63M186k426J030J3877j1609l9439o710
$$ -18942 -22864 -22493 -9680 3586 12121 14709 13746 17932 15506 16536 30413 18804 -20635 -27345
2942b7345J0940p099M647o342j3549L447J5722O329l823k469j1262O655J1141
$$ -27345 -16405 -23504 -18857 -25199 -38748 -35301 -19579 -13250 -17073 -19542 -30804 -24149 -13008
2929a3008P339J3993O534j1877J178l376K586J280m096p026j6562M75J806O505
$$ -13008 -5669 8324 14858 2981 4159 783 3369 4649 553 -6473 -23035 -22560 -20754 -14249
2915a4249R394J177K922p119p048P883K2682o25j0238L475o777o563P763O93p156
$$ -14249 -4855 -3678 -756 -7875 -14923 -7040 15642 15017 4779 8254 1477 -5086 2677 3370 -3786
2900c786q27J0698Q647n314k887n53J2012O950r848j884J662q746j2834j4812
$$ -3786 -4613 6085 14732 9418 6531 5978 17990 24940 15092 13208 14870 6124 -6710 -21522
2886b1522q580J0687P635O248Q099J7392j943k582m832n743K23L064P882j8344
$$ -21522 -30102 -19415 -11780 -5532 2567 19959 18016 15434 10602 4859 5082 8146 16028 -2316
2872b316q235J8112K118j5511j0316N561K3878k284j8020l238K372P074Q811L232
$$ -2316 -10551 7561 9679 -5832 -16148 -10587 13291 11007 -7013 -10251 -7879 -805 8006 11238
2858A1238k025m513N07m035k7k985q76j0290p044o57Q85R220J7578l262n504p895
$$ 11238 9213 4700 5207 1172 1145 -1840 -2716 -13006 -20050 -20707 -19822 -10602 6976 3714 -1790 -9685
2842i685j4322R184M862R06J0793N23K008l356q037P462Q98m037J3346J4731k086
$$ -9685 -24007 -14823 -9961 -9055 1738 2261 4269 913 -7124 338 1236 -2801 10545 25276 23190
2827B3190o893J222r780o959p731J0940J1412M419O817n384o539L614l612N764
$$ 23190 16297 17519 7739 780 -6951 3989 15401 19820 26637 21253 14714 18328 14716 20480
2813B0480Q748O352j9811m972P385m451p916l614o67J414J75k808l582j1654n305
$$ 20480 29228 35580 15769 10797 18182 13731 5815 2201 1534 2948 3123 315 -3267 -14921 -20226
2798b0226N263p823J3467N444j757n032J4740J8366R1j4503m992m245j90l155
$$ -20226 -14963 -22786 -9319 -3875 -5632 -10664 4076 22442 22533 8030 3038 -1207 -1397 -4552
2784d552q42M413K069j0633M425J2093p99K1827L232j1675p32j039N275J0783
$$ -4552 -5394 -981 1088 -9545 -5120 6973 6174 28001 31233 19558 18826 17787 23062 33845
2770C3845n779q14j1601j5732k970k755J085p117j0470m667J7549J9532N638j6733
$$ 33845 28066 27252 15651 -81 -3051 -5806 -4721 -11838 -22308 -26975 -9426 10106 15744 -989
2756i89J1176J4965j5759j3260n847J4907L765l780L310O529j5448j1278N879
$$ -989 10187 25152 9393 -3867 -9714 5193 8958 5178 8488 15017 -431 -11709 -5830
2743e830p938R50L656l139J466p434j684J857l57J4583K0124P159j7592k09l761
$$ -5830 -13768 -12818 -9162 -12301 -10835 -18269 -19953 -18096 -18453 -3870 16254 23413 5821 5612 1851
2728A851j5865m596N460J54o494k263K0295J2231j1954o773N116m686l691r61
$$ 1851 -14014 -18610 -13150 -12996 -19490 -21753 -1458 10773 -1181 -7954 -2838 -7524 -11215 -12176
2714a2176l808P094J149M142J6676O578l024o21m794J909l323j2390k671P461
$$ -12176 -15984 -8890 -7741 -3599 13077 19655 16631 16010 11216 13125 9802 -2588 -5259 2202
2700B202J7468o390j1888p646O500k707n844q378m285K620P905M618L105M466
$$ 2202 19670 13280 1392 -6254 246 -2461 -8305 -16683 -20968 -18348 -10443 -5825 -2720 1746
2686A746p539L412m97J139P843L535P345o475j72L991n833n309J3411k172l789
$$ 1746 -5793 -2381 -2878 -1739 6104 9639 16984 10509 10337 14328 8495 3186 16597 14425 10636
2671A0636M373k1287n921P655Q048l416m006L104L767j368J1919j0762j074L868
$$ 10636 15009 -6278 -12199 -4544 3504 88 -3918 -814 2953 1585 13504 2742 1668 5536
2657E536Q848K152r229k941j454M045R939k45j2695k648N815q353l126J0919P820
$$ 5536 14384 16536 7307 4366 2912 6957 16896 16651 3956 1308 7123 -1230 -4356 6563 14383
2642A4383K315K937j7770q045J188M108M781Q230n461J750j4158q440P537p040
$$ 14383 16698 19635 1865 -6180 -4992 -884 3897 12127 6666 8416 -5742 -14182 -6645 -13685
2628a3685l231R440M878J0493Q174r429r286l70L221R111N088n907J0347p453
$$ -13685 -16916 -7476 -2598 7895 16069 6640 -2646 -3016 205 9316 14404 8497 18844 11391
2614A1391n631r009Q08M377K2552l712j5200j1852n858o398j210J3686J407L726
$$ 11391 5760 -3249 -2441 1936 24488 20776 5576 -6276 -12134 -18532 -19742 -6056 -4649 -923
2600i23O855M64l062o142J566L042N208R55J2200m399q125r202n37L97j443j643
$$ -923 5932 6396 3334 -2808 -1242 1800 7008 7963 20163 15764 7639 -1563 -2100 -1703 -3146 -4789
2584d789o298N312J2730M600j657p955n463M082Q264j0974K753J601q568J0203
$$ -4789 -11087 -5775 6955 11555 9898 1943 -3520 562 8826 -2148 605 2206 -6362 3841
2570C841P051j629j667l101j2426n78P997o523N132l32J9889n650K570R881j0036
$$ 3841 10892 9263 7596 4495 -7931 -8509 -512 -7035 -1903 -2235 17654 12004 14574 24455 14419
2555A4419j2336n18m710p643j0343M132J7004K067k0750R752J8517q442n243N734
$$ 14419 2083 1565 -3145 -10788 -21131 -16999 5 2072 -18678 -8926 9591 1149 -4094 1640
2541A640M384j3458j042J3854R463L250m862j135Q471M321k533o792k948q010
$$ 1640 6024 -7434 -8476 5378 14841 18091 13229 12094 20565 24886 22353 15561 12613 4603
2527D603j3877j0471J5092M949Rm931n231J6780k211r082o038r064n190m129l182
$$ 4603 -9274 -19745 -4653 296 305 -4626 -9857 6923 4712 -4370 -10408 -19472 -24662 -28791 -31973
2512c1973M114K7686J6830K820L700j0256r80J1525j829j4050j4571N056P199
$$ -31973 -27859 -173 16657 19477 23177 12921 11941 23466 21637 7587 -6984 -1928 5271
2499E271J833r679r623J463J0455L688j1728n45K092P883l910J3219j4004n763
$$ 5271 7104 -2575 -12198 -10735 -280 3408 -8320 -8865 -6773 1110 -2800 10419 -3585 -9348
2485i348J0264r392N999j0881K180N148p679L469k569K901k462o301P536k871
$$ -9348 916 -8476 -2477 -13358 -11178 -6030 -13709 -10240 -12809 -9908 -12370 -18671 -11135 -14006
2471a4006j2819n863J7771L894m228J2430J5661p10j5081q007O63J197M588l575
$$ -14006 -26825 -32688 -14917 -11023 -15251 -2821 12840 12130 -2951 -10958 -10295 -9098 -4510 -8085
2457h085J76m29J0747O141J0363P548j2511j0053l725p867J3944P984r177K216
$$ -8085 -7909 -8338 2409 8550 18913 26461 13950 3897 172 -7695 6249 14233 5056 7272
2443G272J2681o79j0786N218J0444k921K310J144r767O027j2638j2109j1658j5571
$$ 7272 19953 19274 8488 13706 24150 21229 23539 24683 14916 20943 8305 -3804 -15462 -31033
2429c1033n116N065J3861M644j175L701L175J0991m023P612l730M151j4676j2574
$$ -31033 -36149 -31084 -17223 -12579 -13754 -10053 -6878 4113 90 7702 3972 8123 -6553 -19127
2415a9127P255J4976k699m651J427J460M624J161j1375k487l714K429M879q957
$$ -19127 -11872 3104 405 -4246 -2819 -1359 3265 4426 -6949 -9436 -13150 -10721 -5842 -14799
2401a4799J330P615k962j0130j003P4l026p93O977n999L682J4914k96j1827o900
$$ -14799 -13469 -5854 -8816 -18946 -19949 -19875 -22901 -23694 -16717 -22716 -19034 -4120 -4416 -16243 -23143
2386b3143M24K3146P392P37l483q24Q852k1907q295j708L734K3177O920R440l132
$$ -23143 -22719 427 7819 8556 5073 4249 13101 -8806 -17101 -18809 -15075 8102 15022 24462 21330
2371B1330k0794q239J1313J0612l984k0384L140M818K754J4843O241j7765j5876
$$ 21330 536 -7703 3610 14222 10238 -10146 -7006 -2188 566 15409 21650 3885 -11991
2358a1991M559J0743J2577m32O34M73N595k812j4065j5512N123K253K410n485
$$ -11991 -7432 3311 15888 15456 16090 16563 22158 19346 5281 -10231 -5108 -2855 -445 -5930
2344e930j436k04K059l905K83l286J0310Q033J0137j0846k1835k0663J901J0835
$$ -5930 -7366 -7570 -5511 -9416 -9133 -12419 -2109 5924 16061 5215 -16620 -37283 -35382 -24547
2330b4547J638n81O568J4113Q86o036L678p080l345J0538J3106P897j1355j4160
$$ -24547 -22909 -23490 -16922 -2809 -1923 -7959 -4281 -11361 -14706 -4168 8938 16835 5480 -8680
2316h680p160j0054l484j686K894J1736J976l011Q021n634J5467M35o48n128k178
$$ -8680 -15840 -25894 -29378 -31064 -28170 -16434 -14458 -17469 -9448 -15082 385 820 172 -4956 -7134
2301g134n561L293p403R878J1819n822j4063P847n587j8342P013Q253L546l038
$$ -7134 -12695 -9402 -16805 -6927 4892 -930 -14993 -7146 -12733 -31075 -24062 -15809 -12263 -15301
2287a5301N229n441J694L756K25J29q99j785n644l214M305J4014P30q309K484
$$ -15301 -10072 -15513 -13819 -10063 -9838 -9709 -10608 -12393 -18037 -21251 -16946 -2932 -2202 -10511 -8027
2272h027K333P657J728M206l755j0126n027p756K0991J0281p953N724J371r27
$$ -8027 -5694 1963 3691 7897 4142 -5984 -11011 -18767 2224 12505 4552 10276 11647 10720
2258A0720m592N631j764j6436m425k211M369J6430Q485q60j263J10j3363p918
$$ 10720 6128 11759 9995 -6441 -10866 -13077 -8708 7722 16207 15347 14084 14194 831 -7087
2244g087K432N904n733M037J4338J2710q792r115r12r237L50P894m402K439p962
$$ -7087 -4655 1249 -4484 -447 13891 26601 17809 8694 7782 -1455 -1105 6789 2387 4826 -3136
2229c136R4L668N152J4168o237n891O972N00M974J4958l524r177n926M081m80
$$ -3136 -3042 626 5778 19946 13709 7818 14790 15290 20264 35222 31698 22521 16595 20676 20196
2214B0196k3021j1431o350O771Q200J157k317L17l925L793J9460m981r602n345
$$ 20196 -2825 -14256 -20606 -13835 -5635 -4478 -6795 -6478 -10403 -6610 12850 7869 -1733 -7078
2200g078O150J2011K482l747J1722l109n993O927J1489k772j6682L997P132q335
$$ -7078 -928 11083 13565 9818 21540 18431 12438 19365 30854 28082 11400 15397 22529 14194
2186A4194n470K036j2259j4771O061Q001M750Q895k116K571m163j3562o0J4448
$$ 14194 8724 10760 -1499 -16270 -10209 -2208 2542 11437 9321 11892 7729 -5833 -5893 8555
2172H555O020K71j45j4210l818m694l218k023j7154o991N177P01N505K5164j390
$$ 8555 14575 14846 14701 491 -3327 -8021 -11239 -13262 -30416 -37407 -32230 -31529 -26024 -860 -2250
2157b250j2460J0932P112J2485N057L506k590k10o072k549m868m552O498N280
$$ -2250 -14710 -3778 3334 15819 20876 24382 21792 21582 15510 12961 8093 3541 10039 15319
$$ [...]
##END NTUPLES=NMR SPECTRUM
##END=
