##TITLE=Analysis number 318939
Compound Code ac 12926
Project Code adrs
Chemist Name acros
##JCAMPDX= 6.0         $$ Bruker NMR JCAMP-DX V2.0
##DATA TYPE= NMR SPECTRUM
##DATA CLASS= NTUPLES
##ORIGIN= Bruker BioSpin GmbH
##OWNER= nmr
$$ XWIN-NMR		Version 3.5
$$ Tue Apr 25 13:03:29 2006 GMT Daylight Time (UT+1h)  MAYBRIDGE\nmr@NMR_250MHZ
##.OBSERVE FREQUENCY= 250.131544655141
##.OBSERVE NUCLEUS= ^1H
##.ACQUISITION MODE= SIMULTANEOUS (DQD)
##.ACQUISITION SCHEME= undefined
##.AVERAGES= 16
##.DIGITISER RES= 18
##SPECTROMETER/DATA SYSTEM= dpx250
##.PULSE SEQUENCE= zg30
##.SOLVENT NAME= DMSO
##.SHIFT REFERENCE= (INTERNAL, DMSO, 0, 16.522)
##AUDIT TRAIL= $$ (NUMBER, WHEN, WHO, WHERE, WHAT)
$$ ##TITLE= Audit trail, XWIN-NMR		Version 3.5
$$ ##JCAMPDX= 5.01
$$ ##ORIGIN= Bruker BioSpin GmbH
$$ ##OWNER= nmr
$$ C:\u/data/dgb/nmr/ADRS/3020/pdata/1/auditp.txt
$$ ##AUDIT TRAIL=  $$ (NUMBER, WHEN, WHO, WHERE, WHAT)
(   1,<2006-04-25 13:03:06.94 +100>,<MAYBRIDGE\nmr>,<NMR_250MHZ>,
      <created by zg, POWCHK disabled, PULCHK disabled
       configuration hash MD5:
       84 BC 41 DB A1 6E 1D 46 DA 25 12 A5 C1 ED C5 3A
       data hash MD5: 64K
       D3 13 00 26 63 87 41 D9 96 5C 98 5C E5 A6 99 2A>)
(   2,<2006-04-25 13:03:19.72 +100>,<MAYBRIDGE\nmr>,<NMR_250MHZ>,
      <Start of raw data processing
       ef LB = 0.3 FT_mod = 6 PKNL = 1 SI = 32K 
       data hash MD5: 32K
       FF 57 68 E2 36 D3 C4 8B D2 99 94 94 04 35 84 EF>)
(   3,<2006-04-25 13:03:21.31 +100>,<MAYBRIDGE\nmr>,<NMR_250MHZ>,
      <apk 
       data hash MD5: 32K
       E6 D3 62 4E E5 B7 49 95 12 C4 C1 DB 81 BE 94 62>)
(   4,<2006-04-25 13:03:22.08 +100>,<MAYBRIDGE\nmr>,<NMR_250MHZ>,
      <abs ABSG = 5 
       data hash MD5: 32K
       C2 D9 73 43 A9 1D A1 BF 00 3E 43 C6 2E 16 A4 C6>)
$$ ##END=
$$ 
$$ hash MD5
$$ 1A 7A 4F FC 39 57 1C FC D2 1D 3E CA CF C2 F4 D4
##$RELAX= 
##$RELAX= 
##$RELAX= 
##$RELAX= 
##$RELAX= 
##$RELAX= 
##$RELAX= 
$$ Bruker specific parameters
$$ --------------------------
##$DU= <C:\u>
##$EXPNO= 3020
##$NAME= <ADRS>
##$PROCNO= 1
##$TYPE= <nmr>
##$USER= <dgb>
##$AMP= (0..31)
100 100 100 100 100 100 100 100 100 100 100 100 100 100 100 100 100 100 
100 100 100 100 100 100 100 100 100 100 100 100 100 100 
##$AQSEQ= 0
##$AQ_mod= 3
##$AUNM= <au_zg>
##$AUTOPOS= <33 >
##$BF1= 250.13
##$BF2= 250.13
##$BF3= 250.13
##$BF4= 250.13
##$BF5= 500.13
##$BF6= 500.13
##$BF7= 500.13
##$BF8= 500.13
##$BYTORDA= 1
##$CFDGTYP= 0
##$CFRGTYP= 5
##$CHEMSTR= <none>
##$CNST= (0..31)
1 1 145 1 1 1 1 1 1 1 1 1 1 1 1 1 1 1 1 1 1 1 1 1 1 1 1 1 1 1 1 1 
##$CPDPRG= <>
##$CPDPRG1= <>
##$CPDPRG2= <>
##$CPDPRG3= <>
##$CPDPRG4= <mlev>
##$CPDPRG5= <mlev>
##$CPDPRG6= <mlev>
##$CPDPRG7= <mlev>
##$CPDPRG8= <mlev>
##$CPDPRGB= <>
##$CPDPRGT= <>
##$D= (0..31)
0 1 0 0 0 0 0 0 0 0.06 0 0 0 0 0 0 0.0002 0 0 0 0 0 0 0 0 0 0 0 0 0 0 
0 
##$DATE= 1145966585
##$DBL= (0..7)
120 120 120 120 120 120 120 120 
##$DBP= (0..7)
150 150 150 150 150 150 150 150 
##$DBP07= 0
##$DBPNAM0= <>
##$DBPNAM1= <>
##$DBPNAM2= <>
##$DBPNAM3= <>
$$ [...]
##$SUBNAM7= <"">
##$SUBNAM8= <"">
##$SUBNAM9= <"">
##$SW= 20.6930455092707
##$SWIBOX= (0..15)
0 0 3 0 0 0 0 0 0 0 0 0 0 0 0 0 
##$SW_h= 5175.983436853
##$TD= 65536
##$TD0= 1
##$TE= 295.16
##$TE2= 300
##$TE3= 300
##$TEG= 300
##$TL= (0..7)
0 120 120 120 120 120 120 120 
##$TP= (0..7)
150 150 150 150 150 150 150 150 
##$TP07= 0
##$TPNAME0= <>
##$TPNAME1= <>
##$TPNAME2= <>
##$TPNAME3= <>
##$TPNAME4= <>
##$TPNAME5= <>
##$TPNAME6= <>
##$TPNAME7= <>
##$TPOAL= (0..7)
0.5 0.5 0.5 0.5 0.5 0.5 0.5 0.5 
##$TPOFFS= (0..7)
0 0 0 0 0 0 0 0 
##$TUNHIN= 0
##$TUNHOUT= 0
##$TUNXOUT= 0
##$USERA1= <user>
##$USERA2= <user>
##$USERA3= <user>
##$USERA4= <user>
##$USERA5= <user>
##$V9= 5
##$VALIST= <valist>
##$VCLIST= <CCCCCCCCCCCCCCC>
##$VD= 0
##$VDLIST= <DDDDDDDDDDDDDDD>
##$VPLIST= <PPPPPPPPPPPPPPP>
##$VTLIST= <TTTTTTTTTTTTTTT>
##$WBST= 1024
##$WBSW= 4
##$XGAIN= (0..3)
0 0 0 0 
##$XL= 0
##$YL= 0
##$YMAX_a= 322986
##$YMIN_a= -486153
##$ZGOPTNS= <>
##$ZL1= 120
##$ZL2= 120
##$ZL3= 120
##$ZL4= 120
##$ABSF1= 16.522
##$ABSF2= -4.171173
##$ABSG= 5
##$ABSL= 3
##$ALPHA= 0
##$AQORDER= 0
##$ASSFAC= 0
##$ASSFACI= 0
##$ASSFACX= 0
##$ASSWID= 0
##$AUNMP= <proc_1d>
##$AZFE= 0.1
##$AZFW= 0.1
##$BCFW= 0
##$BC_mod= 0
##$BYTORDP= 0
##$COROFFS= 0
##$CY= 12.5
##$DATMOD= 1
##$DC= 0
##$DFILT= <>
##$DTYPP= 0
##$F1P= 14.0000005364418
##$F2P= -0.99999901652339
##$FCOR= 0.5
##$FTSIZE= 32768
##$FT_mod= 6
##$GAMMA= 0
##$GB= 0
##$INTBC= 1
##$INTSCL= 1
##$ISEN= 128
##$LB= 0.3
##$LEV0= 0
##$LPBIN= 0
##$MAXI= 10000
##$MC2= 0
##$MEAN= 0
##$ME_mod= 0
##$MI= 0
##$NCOEF= 0
##$NC_proc= -5
##$NLEV= 6
##$NOISF1= 0
##$NOISF2= 0
##$NSP= 0
##$NTH_PI= 0
##$NZP= 0
##$OFFSET= 16.522
##$PC= 1
##$PHC0= 159.4623
##$PHC1= 6.632722
##$PH_mod= 1
##$PKNL= yes
##$PPARMOD= 0
##$PSCAL= 4
##$PSIGN= 0
##$REVERSE= no
##$SF= 250.13
##$SI= 32768
##$SIGF1= 0
##$SIGF2= 0
##$SINO= 400
##$SIOLD= 32768
##$SREGLST= <1H.DMSO>
##$SSB= 0
##$STSI= 32768
##$STSR= 0
##$SW_p= 5175.98343685301
##$SYMM= 0
##$S_DEV= 0
##$TDeff= 65536
##$TDoff= 0
##$TI= <Analysis number 999999
Compound Code 99
Book Reference 9
Project Code 9>
##$TILT= no
##$TM1= 0
##$TM2= 0
##$TOPLEV= 0
##$USERP1= <user>
##$USERP2= <user>
##$USERP3= <user>
##$USERP4= <user>
##$USERP5= <user>
##$WDW= 1
##$XDIM= 32768
##$YMAX_p= 348116401
##$YMIN_p= -705689
$$ End of Bruker specific parameters
$$ ---------------------------------
##NTUPLES= NMR SPECTRUM
##VAR_NAME=  FREQUENCY,     SPECTRUM/REAL,   SPECTRUM/IMAG
##SYMBOL=    X,             R,               I
##VAR_TYPE=  INDEPENDENT,   DEPENDENT,       DEPENDENT
##VAR_FORM=  AFFN,          ASDF,            ASDF
##VAR_DIM=   32768,         32768,           32768
##UNITS=     HZ,            ARBITRARY UNITS, ARBITRARY UNITS
##FACTOR=    0.157963299565203, 1,           1
##FIRST=     4132.6476996994, 0,             0
##LAST=      -1043.33573715361, 0,           0
##MIN=       -1043.33573715361, -705689,     0
##MAX=       4132.6476996994, 348116401,     0
$$ Real data points
##PAGE= N=1
##DATA TABLE= (X++(R..R)), XYDATA
$$ [...]
17194G13K0126K4402j25585q9361k470p4045J0450L6378R6761K9411l8682o993
17182a18895m5218j44555J12370J46711n511J41414l4751q1714p4065j8828k5049
17171a48091K3603r0443P2934P3622K01293p872M8823l8099K2798P9070j24362
17160A13276j30257l9961j69316j98860O0936K48991J50570r4311k534j33689
17150a95155j20289K6434J28500K04955o2327j1293L0482n8616K2438m4298p764
17139h6933j06360J6788M1078N7182R4443l5742J15284j7725n3751o6983k9686
17128g2405o0086k7325M7469J47849R4077j17192p3108O1854q7077J17931P6051
17117A08038j08988o0894l6133J05748N6511m5871J1858m3943n496k7435n5728
$$ y = [713, 20839, 45241, -80344, -169705, -172175, -246220, -235770, -199392, -102631, -73220, -111902, -118895, -164113, -308668, -196298, -49587, -55098, 86316, 51565, -30149, -104214, -123042, -148091, -124488, -214931, -141997, -68375, 132918, 125046, 173869, 135770, 158568, 237638, 113276, -16981, -56942, -226258, -425118, -364182, -115191, 35379, -58932, -61466, -195155, -315444, -289010, -160510, 44445, -17882, -29175, 1307, -57309, -34871, -79169, -86933, -193293, -176505, -135427, -78245, 16198, -19544, 95740, 78015, 24264, -42719, -72405, -132491, -159816, -112347, 35502, 129579, 12387, -60721, 1133, -85944, 31987, 108038, -950, -61844, -97977, 7771, 64282, 18411, 30269, -13674, -19170, -46605, -102333]
17106a02333k8974J37942P9718J2113j96593j29080R6666J29972M135J45049q9809
17095E8806n4932J50817K9272j79867r5652k3815Q3501J38058o8803K9169N5974
17084A22528j15850P0180m768o0428K2445l9066j9280j630L1896j4618o3984j11830
17072a84405O3885j58142J44500P8378j82881j53705J29820Q7142M7420K1167
17062a06821q635P4061J1497l4929j63060l2512O8798j31159O248Q3716Q1984
17051a50812j6601r737J27446N0999j58962l3822J72902L2263j09115j46246j42610
17040c84295j22740J806J89401K44742J9215M92L4273P957J21711j25862p7229
17029i0529J81094J11945o6453j0206j00482N5396l3180j43917k2561Q756n0867
$$ y = [-102333, -131307, 6635, 86353, 98466, -98127, -227207, -130541, -569, 3566, 148615, 58806, 3874, 154691, 183963, 4096, -91556, -115371, -31870, 106188, 37385, 66554, 122528, 6678, 76858, 72090, 11662, 34107, -4959, -24239, -25869, 6027, -8591, -72575, -184405, -120520, -278662, -134162, -55784, -238665, -392370, -262550, -175408, -127988, -106821, -115456, -41395, -29898, -64827, -227887, -260399, -191601, -322760, -316512, -232796, -150812, -167413, -177150, -49704, 1295, -157667, -191489, -18587, 13676, -95439, -241685, -384295, -507035, -505229, -315828, -71086, -51871, -51379, -17106, -9149, 112562, -13300, -90529, 90565, 202510, 136057, 125851, 25369, 80765, 47585, -96332, -118893, -110137, -161004]
17018a61004P4200R3879K65460K9325j22892k1380j14573r1921N7463O6054p3965
17007F46n9655J44224j1547J2113J4405o1468Q1820P4247K4444l931k01110j97449
16995a83261L4182k9010k1102R5325J45905l8620r8224j96552j62852J74378J19827
16984a60004K59579K15240Q0347j22668N7266L9941l31235j58314O9753P9198
16974B9103N854Q7586j0488j40151l4225M3874J29385L14114L2190l10670j6637
16963A29935L3673n4080j13945O5864P3763j09463P5369J5619j5853L6070p6970
16952E9982j02011j88122q7472N8476q2012L6273J59392O8196P7391J12257k5750
16941H6600K9356j8405j25085q4904m4878Q1030L4682j76981Q0916J31898l0811
$$ y = [-161004, -86804, 7075, 272535, 301860, 178968, 157588, 43015, -48906, 8557, 74611, 646, -59009, 85215, 73668, 85781, 100186, 38718, 120538, 194785, 219229, 215298, 14188, -183261, -149079, -178089, -199191, -103866, 42039, 3419, -94805, -291357, -454209, -279831, -160004, 99575, 314815, 395162, 272494, 329760, 369701, 38466, -119848, -50095, 29103, 34957, 122543, 112055, -28096, -62321, -18447, 110938, 425052, 457242, 146572, 129935, 163608, 109528, -4417, 61447, 135210, 25747, 101116, 116735, 100882, 136952, 59982, -42029, -230151, -317623, -259147, -341159, -304886, -145494, -77298, 93, 112350, 86600, 115956, 97551, -27534, -112438, -157316, -76286, -41604, -218585, -137669, -5771, -36582]
16930c6582L0347M2096l5319J01367P0784n0611j66352j51023o4734J12122P3056
16919g4849j7108L6056k777k2667O8207J59670K06034j40063N2740j5264K9193
16908B79172m2410r8811n6537M9213r1404n4399j13043P5137J43435J06143o3756
16897A32740j43725K6523R8781n654j71281n6409M6172J35634l1897j07348j68726
16886b45190j04555k1992L9873O6657O6614p3727J59375N2519J56763R2205j41921
16875D6621k9740p221R5642N18J1189L0673J56632n2832n4767j96349j80246l3020
16863b12900J65134J09360O2314J2956J2321j23225o1867L8779j97706o9057Q7075
16852a76816J30370N8862J46400N6551q5758j61680J1696j4117j5463m3274j87007
$$ y = [-36582, -6235, 35861, 542, 101909, 172693, 122082, -44270, -195293, -260027, -147905, -74849, -91957, -55901, -58678, -81345, -13138, 146532, 352566, 212503, 265243, 249979, 279172, 236762, 137951, 81414, 130627, 39223, -15176, -128219, -53082, 90353, 196496, 132740, -10985, 15538, 114319, 108665, -62616, -119025, -72853, 62781, 30884, -76464, -245190, -349745, -371737, -331864, -265207, -198593, -272320, -112945, -60426, 96337, 188542, 46621, 16881, 9660, 105302, 105820, 117009, 147682, 304314, 251482, 196715, 366, -179880, -212900, -47766, 61594, 123908, 136864, 149185, 25960, -35907, 2872, -194834, -263891, -176816, -46446, 12416, 158816, 215367, 129609, -32071, -20375, -34492, -49955, -93229, -280236]
16841b80236O3726M8889n4468j43272J83157Q0931k375J36073N8784j0166m1261
16830C9782n5957R1612j276l3843p9335M454J3209j40399n5525K40786O8013j52759
16818f1238K7075J54520r2238k54844o4846J43954J24242N8481R2794m5130m3596
16807C9174j49764j16914L6605p4141L0933N6421J18663J86620M8800j71010k6902
16796b1515q3713j03269m2726j21372J28111K25027L8321O3884N5608Q3627o0617
16785A61366k9988m169k0714m3028K5024n2577Q0745o4734m4184j66966J6172
16774a43053L0828j9140K7631P8141K4594j16798P5410P5999J07354l598p5918
16763F1450k54502m2519K13527O0234o7534M5513J5375l4986q5035R4169K19266
$$ y = [-280236, -216510, -167621, -222089, -365361, -182204, -101273, -103648, 32425, 91209, 81043, 39782, -16175, 75437, 74161, 40318, -39017, -34563, -21354, -161753, -217278, 23508, 91521, -61238, -34163, 120357, 28119, -226725, -291571, -147617, -23375, 35106, 127900, 82770, 39174, -110590, -227504, -190899, -265040, -234107, -177686, -59023, 127597, 176397, 5387, -21515, -105228, -208497, -251223, -372595, -244484, -19457, 18864, 82748, 138356, 221983, 161366, 131378, 127209, 106495, 63467, 88491, 35914, 116659, 51925, 7741, -159225, -143053, -112225, -131365, -103734, -25593, -999, -117797, -42387, 33612, 140966, 137368, 61450, -193052, -235571, -22044, 38190, -29344, 16169, 31544, -3442, -88477, 5692, 224958]
16752B24958J539j22519q2831j37849o3856o6299J0333j84591K7378K18434n7461
16741b32764l3805J05814K12634K52862k87177l61916j38301L366J66206N4364
16731b58717L7832J18759N3600O0717q4977l3093j55413j52294K9054J37195J87640
16720e9697M5291M9408J34002j14638j33239o2376K0632O136m1736J09245J10595
16709F3623j6670p3778r9657j54280k9462l8694o7730R2058J38612O4676l7256
16698a58558L7396P9807q5744j50923M7732K3594l4031N1397P0500p7780j01296
16687b97906Q4394J22996J46405K13511J147k3820l1055j38873k17965j57902
16677b99068J13033K09995J95164M9577j16665k74301j43802K65568K28798m6544
$$ y = [224958, 226497, 103978, 21147, -116702, -180558, -246857, -236524, -421115, -393737, -175303, -232764, -266569, -160755, 51879, 304741, 17564, -344352, -482653, -479287, -313081, -258717, -220885, -102126, -48526, 12191, -72786, -105879, -261292, -413586, -384532, -247337, -59697, -14406, 35002, 169004, 54366, -78873, -141249, -120617, -114481, -156217, -46972, 63623, 46953, -26825, -126482, -280762, -310224, -348918, -416648, -324590, -185978, -121302, -158558, -121162, -41355, -127099, -278022, -230290, -206696, -240727, -189330, -118830, -196610, -297906, -213512, -90516, 55889, 269400, 270547, 246727, 215672, 76799, -141166, -299068, -186035, 23960, 219124, 268701, 152036, -122265, -266067, -499, 228299, 181755]
16667A81755p2069n3607N5220Q134L5824k3108j47302j08343j18378J23658j8998
16656a37214q8135j13931J00988J17271R2046J00901Q9945j06692k18617P0829
16646i2609P8490o0685p5703N8572j1212J16232n5322J80806J02690q8604L9105
16635A91760j91777k31776J99705K02572j45592r0167J30592J63812L9133r2116
16625A76146j17775j17568J47335M1729l1747j95185m690J7515L8197J22098o5250
16614A0805k0448Q713m0775j25447j8626K892j44687j15361J56465K69J4099J22358
16602a49743J45501O4342j51836J19988N4575K4319n8541Q6281m3473j08604m6789
16591f3980o0390L7172J66475Q1334j5161j49598r4860l0482K0744M6578J0609
$$ y = [181755, 109686, 56079, 111299, 119433, 155257, 132149, -15153, -123496, -241874, -118216, -137214, -225349, -339280, -238292, -121021, -28975, 71926, 161871, 55179, -163438, -92609, -14119, -74804, -150507, -91935, -103147, 13085, -42237, 138569, 241259, 152655, 191760, -17, -231793, -32088, 170484, 24892, -65275, 65317, 229129, 268262, 176146, 58371, -59197, 88138, 129867, 98120, -97065, -101755, -84240, -46043, 76055, 10805, -9643, -930, -41705, -167152, -185778, -182886, -327573, -442934, -286469, -286200, -272101, -149743, -4242, 60100, -91736, 28252, 82827, 107146, 48605, 134886, 91413, -17191, -63980, -124370, -87198, 79277, 160611, 145450, -4148, -99008, -129490, -108746, -62168, -51559]
16580e1559K4299J64150p4387j54028J1078J21962j91685K6687K5562p1489l1641
16569b01051o7459M8871J56078N8799N453q4638p319o8555o3567j16948O9903
16558b70433n171R9082J72101R963j31197Q415J45825L8510K9546m740m8496q7239
16546d3834M9922j36214j04215l2399K03576J54358J47876j06198l7778o0295
16536C4799o9622j00538p2462m334J23833M4546N318q3567j12929j1703O3678
16525a82981J1885J13185J36866L1230k3017l760K0239J2762p4182P3573j30376
16514a4576r6529k66176o8J40326K02034N3638M3832J5397k8748q1935R5607r9856
16502c7054l3514J8211K08811p7833j69316j04221l6959M1143R7674n8560j17785
$$ y = [-51559, -27260, 136890, 62503, -91525, -80447, 41515, -150170, -123483, -97921, -169410, -201051, -268510, -219639, -63561, -4762, 691, -83947, -91266, -159821, -223388, -340336, -270433, -275604, -176522, -4421, 5542, -125655, -117240, 28585, 67095, 96641, 91901, 43405, -43834, 6088, -130126, -234341, -266740, -63164, 91194, 239070, 132872, 95094, 34799, -34823, -135361, -207823, -212157, -88324, -43778, -38460, -122027, -234956, -246659, -182981, -171096, -57911, 78955, 110185, 87168, 83408, 103647, 116409, 42227, 115800, -14576, -111105, -377281, -377349, -237023, -34989, 18649, 62481, 77878, 49130, -32805, 62802, -37054, -70568, -52357, 156454, 78621, -90695, -194916, -231875, -190732, -93058, -151618, -269403]
16491b69403m7110p0859k741Q1816K39500P7882o969j8964N0209O2801R393j02330
16479C225q7914m8365m1372N403J54705q480n380L175M225N8964O7974J24224
16467B30384p9049J9438k4311q0696J95367p8279q5490j00359k78294j61993J74006
16456b69276J22613q4383l9958K14443K37603l3127p1780N2443L5668j7092j26188
16445B0966J24794j4758k03283J51917M1257k6823r6106j38057J58040Q1963J03670
16434B03580L2347o8377j75780k01086L4709J33320O793J49446j39242k20439
16424b44729N4500K54492P7264k0071j05084k75185j03476K25922J60139K9737
16414E3509m6915j37749R9987j11526q0172J04081O0876P2796J6270K3329J6864
$$ y = [-269403, -316513, -387372, -390113, -308297, -68797, 9085, 2116, -16848, 33361, 96162, 105555, 3225, -84689, -133054, -174426, -169023, -14318, -22798, -28178, -25003, -20778, 38186, 106160, 230384, 151335, 170773, 146462, 65766, 261133, 182854, 97364, -2995, -281289, -443282, -269276, -146663, -231046, -271004, -56561, 181042, 147915, 76135, 128578, 164246, 147154, 20966, 145760, 131002, -72281, 79636, 120893, 94070, -2036, -140093, 17947, 99910, 203580, 235927, 167550, -8230, -209316, -174607, -41287, -34494, 114952, -24290, -244729, -190229, 64263, 141527, 121456, 16372, -258813, -362289, -136367, 23772, 53509, 6594, -131155, -31168, -142694, -222866, -118785, -57909, 14887, 31157, 54486, 71350]
16403G1350j33513j81028N0431O884p1846p6990J43081m0602p7829L7809N8520
16392b13733K9006N6107R1580k0112K2905J4817j1840j33881n0052J96700J6853
16381a650j91894j36154R0283K22956J12885o8337j15478J8587j2788n4285j42950
16370b78825J02436J0610N9644P6544j35803j48621J12417J59479J61887q6385
16360C3383j04431L8780N6304J04643J55070p9734o3512l3138o272k9739q5250
16349a3896l5078k7658M350L3357J85103K9414r3652n9391j16125j08687J45900
16338e6363J4239j580l7199M1441q0458q5997m1205L8478p9041K1812M6754j0541
16326b29660J4785M8820l6242N7375R8990K5148n9092j03031k0444p3604J99808
$$ y = [71350, -62163, -243191, -192760, -185876, -257722, -334712, -191631, -232233, -310062, -272253, -213733, -184727, -128620, -37040, -57152, -34247, -19430, -31270, -165151, -215203, -18503, -1650, -193544, -329698, -239415, -16459, 96426, 28089, -87389, -68802, -81590, -135875, -278825, -176389, -165779, -106135, -29591, -165394, -314015, -201598, -42119, 119768, 33383, -71048, -32268, 24036, 128679, 283749, 204015, 140503, 107365, 101093, 71354, -13896, -48974, -76632, -72282, -38925, 146178, 175592, 81940, 22549, -93576, -202263, -56363, -42124, -43704, -80903, -39462, -119920, -205917, -247122, -208644, -287685, -265873, -219119, -229660, -214875, -166055, -202297, -144922, -45932, -20784, -79876, -182907, -203351, -276955, -77147]
16315g7147N5517Q7410p6528j73596L6436J75750N9810j6301J18017o6566n9168
16304F3634j5499j02459Q3658k9130P3114J00907q7193M5960o5230k56716n0477
16293b39431R8846J10151J40518p7638j25477J5843J23113p0628j21317M5801
16283a00219L5531R5155m1091M7830J125o2328L5666n3331q819J45870R6100K41538
16271D33027J28375o6550l3143j51123j98113j45137q1451o0809P283j49863k0294
16260c37798m9914J28053K41663k430J5323N2303k8626p48k08364k46064p3694
16249e10296j36893J20218K41686J70872M3986J9418J15588J72810j3193M4435
16239B68631Q7456j60318j1272j36593k0254J30336o2613j30097J58153M1566
$$ y = [-77147, -21630, 65780, -10748, -184344, -147908, 27842, 87652, 71351, 189368, 122802, 63634, 48135, -54324, 29334, 204, 73318, 174225, 87032, 132992, 67762, -188954, -239431, -140585, -30434, 110084, 32446, -93031, -77188, 45925, -24703, -146020, -100219, -64688, 30467, -10624, 37206, 38331, -23997, 11669, -41662, -50481, 95389, 191489, 433027, 561402, 494852, 461709, 310586, 112473, -32664, -114115, -174924, -167641, -317504, -337798, -387712, -259659, -17996, -20426, -5103, 47200, 18574, 17826, -190538, -436602, -510296, -647189, -526971, -285285, -114413, -70427, -51009, 64579, 237389, 224196, 268631, 356087, 195769, 184497, 47904, 27650, 157986, 95373, -34724, 123429, 164995]
16229A64995k07974j85987j1408K75734n3185m0096j8218J00147R0213j06049
16219H172j10091k1592M9188N1954l8961r676r4587o9398N4634J9792j26601L4700
16207b52466J7678q476N0891K0553j2755q5398j7220q1423Q3498J48573m320J26872
16195a3993J76342j41981r3951K4750p8367j37052L2312K13112J08043l8400k34439
16184a83624j24454J86472R0206O4095J3717p126k7208n2609J9509j07673J2735
16173a15960q2050n4866K30773N3571k63J11724o2192q112J22310j59428r9529
16162f4022o4706Q3310j2059N3356j06895j11104O1966J25557K6764m8548K4461
16151c1920m9440k2017p2567J8530J11999k29832L873M0948l489M1207n9903M6018
$$ y = [164995, -42979, -228966, -240374, 35360, -17825, -57921, -76139, 24008, 114221, 8172, -101919, -123511, -74323, -22369, -61330, -71006, -165593, -234991, -180357, -160565, -287166, -252466, -234788, -243264, -192373, -171820, -184575, -269973, -287193, -368616, -285118, -136545, -140865, -13993, 162349, 20368, -73583, -48833, -127200, -264252, -231940, -18828, 89215, 50815, -183624, -308078, -121606, -31400, 32695, 46412, 39286, 12078, -40531, -21022, -128695, -115960, -198010, -252876, -22103, 31468, 31205, 142929, 80737, 72625, 194935, 35507, -64022, -128728, -45418, -57477, -4121, -111016, -222120, -160154, -34597, -7833, -56381, -31920, -81360, -103377, -175944, -157414, -45415, -275247, -271374, -230426, -233915, -192708, -252611, -206593]
16139b06593N6005Q2486J16313J29526J27534J1973j25739k1437M8222r5798O6925
16128A89417j54091l9323M3245m6951j35781L8734k2921J06525P6665J48443K877
16117B06839j38293J9563J61667J03909J81766p6099k04032r805K5853m8554m4022
16106A78792o6545r9572L2194K03786O2158P9759j71647N3478J12083m4180o907
16095C33399O8515j30979q97Q7169r7099j56335j08378j03945O9824J69075J07164
16084B37513J55701l8404j01344o0204m707j86959j73648J19134M7035J24142
16074A18259n3152K219m6019n4990J88908J44390m4256j07446r4068K5029m5449
16063C3425j23556J73520N5388j01344r2764j349n6495p1756n8811l4923N4998
$$ y = [-206593, -150588, -68102, 48211, 177737, 305271, 317244, 191505, 170068, 218290, 122492, 189417, 35326, -3997, 39248, -7703, -143484, -104750, -127671, -21146, 55519, 203962, 206839, 68546, 88109, 249776, 353685, 535451, 459352, 255320, 245515, 271368, 222814, 178792, 112247, 12675, 44869, 248655, 310813, 390572, 218925, 272403, 384486, 340306, 333399, 401914, 270935, 270038, 357207, 260108, 103773, -4605, -108550, -38726, 130349, 237513, 393214, 354810, 253466, 193262, 188555, 1596, -172052, -52918, -5883, 118259, 65107, 67326, 21307, -33683, 155225, 299615, 255359, 147913, 53845, 78874, 33425, -90131, 83389, 138777, 37433, -55331, -56680, -113175, -184931, -243742, -278665, -223667]
16052b23667O8233k4883O0682n9511n7774j39885J36595J71116K02749K3151o7707
16041H9099n9966M4419m8709m1346m020J25904n1965n0065J31303K3402j68080
16030a0024j06252j0887M3538O804j35919k66591O49J74782K82207j428j29924
16019a53045K31858J59390q2394k01529j80771j4123J70678N7490p7586Q4244
16009e788k4606P9132J39069J21126M4443L5542j50655J28422L0938m6074j71501
15998A80048k37390j22961J51856R987J15953R2544p5978j32678r0295O9727J79237
15987A40050l3615l9339M0901r1155K1622J27145n8009q5367R5552R5879l0025
15976A83639l7268r972j40878n558L8595j24787K324J59321J78807q9442j41780
$$ y = [-223667, -155434, -180317, -119635, -179146, -236920, -376805, -240210, -69094, 133655, 156806, 89099, 29133, 73552, 24843, -16503, -20523, 105381, 53416, 3351, 134654, 158056, -10024, -116276, -127163, -83625, -76821, -212740, -479331, -478682, -303900, -21693, -23121, -153045, 78813, 238203, 155809, -45720, -226491, -240614, -69936, -12446, -90032, -5788, -30394, 48738, 187807, 308933, 353376, 388918, 238263, 366685, 397623, 351549, 180048, -57342, -180303, -28447, -18460, 97493, 190037, 114059, -18619, -108914, -39187, 140050, 106435, 67096, 107997, 16842, 38464, 165609, 107600, 22233, 117785, 213664, 183639, 146371, 136399, -4479, -10037, 28558, -96229, -93905, 65416, 244223, 154781, 13001]
15965A3001q8774M9381P2552J29973k5308j56326M0999J1273P4053k23913P578
15954i5511P0731J104N4816m645n6358j65616J67577R8446j02868j42817j15624
15943b90765M0786J18573O4295O4900n6394o7757J91803M8822k66746j60733J86126
15932a27090R4287P330j9232P4618m363j50478O2678J50162J702j30461j74557
15921b15404J24374J00775j16563j60368L0032K0361M8707K4730M679k1468J54292
15910e853M9865K3315l247l2650j47916n5764o3426p1999N0974P8445o1697k7013
15898b66966k4930M8795Q17K33647M4620n6601J47936J49541k6985j81479j16494
15887d8099q6449J02134P8015r0596p2400J56320k5960k19084j05619M7183K0223
$$ y = [13001, -75773, -26392, 46160, 176133, 150825, -5501, 35498, 46771, 120824, -103089, -95511, -24780, -23676, 31140, 26495, -29863, -195479, -27902, 70544, -32324, -175141, -290765, -249979, -131406, -67111, -2211, -58605, -126362, 65441, 114263, -152483, -313216, -127090, -32803, -25473, -44705, 29913, 25550, -124928, -62250, 87912, 89614, -40847, -215404, -91030, 9745, -106818, -267186, -237154, -216793, -168086, -143356, -138677, -160145, -5853, 44012, 67327, 64080, 31430, -116486, -172250, -235676, -307675, -256701, -178256, -239953, -266966, -291896, -243101, -242284, -8637, 35983, -20618, 127318, 276859, 249874, 68395, -48099, -134548, -32414, 45601, -44995, -117395, 38925, 12965, -206119, -311738, -264555, -244332]
15876b44332N5416M5911J13973M1941r1520m5884P4637m695Q0371j01673o3574
15865a39429J11690J21634O6086j09864r7626j67244l623J26369K8073P7936k12765
15854a98763m3829R2032Q6745J33400L0283j14666k3053j00822r4378m0692L1064
15843b42679j829n6973M8940Q3571k7470L0010l2173k00541j17517m2214J93158
15832c65717J69606J20241J15894P117J00911m1967j07811Q6661N9280l3309P6189
15821A87095O7105j57184k08976N2354Q6929J02492j7310q0686j04129j81931
15811b54241j4939R1362J76905O1195j32372J53445j0431k00857O8416J1802m7564
15800i7279J49009p0845o7277q494m7763L3241l3327J27167R8444r8839m2878
$$ y = [-244332, -188916, -143005, -29032, 12909, -78611, -124495, -49858, -54553, 25818, -75855, -139429, -27739, 93895, 159981, 50117, -47509, -214753, -218376, -92007, -63934, 14002, -198763, -242592, -150560, -63815, 69585, 99868, -14798, -37851, -138673, -233051, -273743, -242679, -244508, -301481, -252541, -168970, -196440, -166430, -198603, -399144, -516661, -558875, -365717, -196111, -75870, 40024, 47141, 148052, 106085, -1726, 84935, 144215, 110906, 187095, 254200, 97016, -111960, -59606, 27323, 129815, 112505, 31819, -72310, -254241, -269180, -177818, -913, 60282, -72090, 81355, 70924, -129933, -61517, -49715, -97279, 51730, -19115, -86392, -94886, -142649, -109408, -142735, -15568, 82876, -15963, -58841]
15789e8841N9520q4062j9913O9858j58873Q934J57579J22231j90937j57140K9619
15778b22025J09243m7771L6187J6995L0920J64037J70205p2921n1280o0838p5812
15767c060J3418J07629Q5540k07981k36782R6980J91259m6157j29008Q378k5415
15756a45199p9697R7887Q4237O127m2796m0584k03605L0006Q3192R3332J96338
15745G9238J10404j48033n1985j12219N3876l0460n6268J20348J25310L3121L9036
15734A62368m5461k40883o1496M0948J33380P4575l226J19091k75792j43381O1638
15723a78239r3922K0367R4505J46781J44440p7306n5178j01236j1740m2006O4883
15712h8651L8449j32549q2553Q264J28879m087r0110M1981K42063J80176Q4819
$$ y = [-58841, 679, -83383, -103296, -33438, -192311, -183377, -25798, 96433, -94504, -251644, -222025, -112782, -160553, -124366, -107371, -76451, 87586, 257791, 184870, 133590, 72752, -3060, 10358, 117987, 203527, -4454, -241236, -144256, 47003, 846, -128162, -119784, -145199, -224896, -127009, -42772, -36645, -79441, -120025, -323630, -293624, -210432, -117100, 79238, 189642, 41609, -10376, -122595, -68719, -99179, -155447, -35099, 90211, 123332, 162368, 116907, -123976, -185472, -144524, -11144, 63431, 60205, 179296, -96496, -239877, -178239, -272161, -251794, -157289, -10508, 133932, 56626, 1448, -99788, -111528, -153534, -88651, -50202, -182751, -265304, -257040, -128161, -132248, -222358, -180377, 61686, 241862, 326681]
15701C26681K639j24685J3131j57643J6567l3672j8183J67388k6391l7345K04897
15690C33384J52189j74649k46671k0414J4737r4761j61667k4260j0842J11945
15680a21009L39311N4428j6326J34280o5898q7735j78816k29538o3996J37012
15670i8287J07535j22220M5673J85480p7873j38557j3036J39645M2370j13807
15660d3077L8684r1646L8663j7877j22533M2753K65725l7010n375N9784l5816
15649I2275j995r5248K8072o6520j09173P7875J66875q632L1426J22928R5154
15638C33037o1057M0720J02175q212l0576k27757j25577q7753k2732J05358q1074
15627f3448l7743Q4579L8219N8738n1544n0567J4265m9755p9135j02866Q8811
$$ y = [326681, 329320, 204635, 217766, 60123, 76690, 43018, 24835, 192223, 165832, 128487, 333384, 485573, 310924, 64253, 43839, 58576, -36185, -197852, -222112, -232954, -121009, 218302, 272730, 256404, 390684, 324786, 237051, 58235, -171303, -235299, -98287, 9248, -112972, -67299, 118181, 40308, -98249, -111285, 28360, 70730, -43077, -4393, -96039, -57376, -75253, -197786, -155033, 110692, 73682, 68307, 128091, 92275, 90280, -4968, 23104, -43416, -152589, -74714, 92161, 83529, 114955, 237883, 333037, 271980, 312700, 414875, 406663, 376087, 148330, 22753, -65000, -87732, 17626, -63448, -101191, -16612, 21607, 80345, 28801, -21766, -7501, -57256, -136391, -239257, -150446]
15616a50446P7846O7286J1557Q8176j46288p4935J48482J83094k13804j61235
15606a70267N8124L32889J02391k76888l7061L8304l7014j13063k53253K05774
15596a50064J67892J56198p7173j86314r1389J21581l7160j09124l774J19251
15586i0076L3010o1970J66170J50200k36612p7267J927J4407l7200p9754l5144
15575b52309J9866j37773m0842L4886L3488Q6689k0308O5548J01287R606Q3897
15564a5965j3415l2748p4592J01994m8306k3072j61061L5353N6592Q9785J14497
15553B9062P7250j92828j36231M7912K01318J8007Q7752k5207q3140Q5574p9996
15542B9473q133j5501n0701L0463m3882K390n762j08857M7502n5220k3238O1252
$$ y = [-150446, -72600, -5314, 6243, 94419, -51869, -126804, 21678, 204772, -9032, -170267, -112143, 220746, 323137, 46249, 9188, 47492, 10478, -102585, -355838, -150064, 17828, 174026, 96853, -89461, -180850, -59269, -96429, -205553, -209327, -90076, -57066, -119036, 47134, 197334, -39278, -116545, -114618, -100211, -137411, -217165, -252309, -232443, -370216, -411058, -376172, -342684, -255995, -276303, -210755, -109468, -99862, -15965, -29380, -62128, -136720, -34726, -83032, -106104, -267165, -231812, -175220, -85435, 29062, 106312, -86516, -222747, -174835, 26483, 44490, 132242, 107035, 23895, 109469, 29473, 21340, 5839, -44862, -14399, -58281, -55891, -61653, -170510, -123008, -178228, -201466, -140214]
15530a40214o688j52446O1295Q0019Q5363j05064n8073k7282O6225J6333L5554
15519a44978o8620J29860J03216R2279M1001j27731N5678o8508k7476R724J25458
15508A19903J10561m9763j42504R3959N2999m7944j37045o6616n7309o3801j9475
15497b07035l7644J8883M2774J23175L732L8606J22428Q5308l3071k2276q1130
15486E3750J56567K3880q5657k30524j26446K43091J73697J86039n6616k10894
15476A26887P674m7146q6030K4317L3499K2335j19429n1109J82228R6005P0684
15465B59915j91703k15116q5975J77409J08571n271J4401P790J29964m346j19630
15454G6009k11717n5364Q965J07837J24025L0911J14916M3874j79436r5748J09200
$$ y = [-140214, -146902, -299348, -238053, -158034, -72671, -177735, -235808, -263090, -196865, -180532, -144978, -213598, -83738, 19478, 111757, 152758, 25027, 80705, 12197, -15279, -5555, 119903, 230464, 180701, 38197, 132156, 185155, 137211, 166, -66450, -123759, -187560, -207035, -244679, -225796, -183022, -59847, -56115, -17509, 104919, 190227, 157156, 134880, 53750, 210317, 234197, 148540, -81984, -208430, 34661, 208358, 394397, 337781, 126887, 134561, 87415, 1385, 25702, 59201, 81536, -37893, -89002, 93226, 189231, 259915, 68212, -146904, -232879, -55470, 53101, 47830, 62231, 70021, 199985, 195639, 76009, -135708, -191072, -182107, -74270, 49755, 80666, 195582, 239456, 60020, -35728, 73472]
15443G3472r1522p1439N2416P3813j55519N758M7340O1133J11862J23450J9585
15432B50349r9043k82291q187J69795M2952m1135O1388J5375j6310k917J67626
15421B57602O5154r3583j16687m3060L2434o215O3429p3256j39019r5878l9173
15410a88252Q5069O8073N454o2787Q0813J123j0068N465r5507P469J68802N550
15398G1204j06523N3069J41850o5254k12780j821M3458J28727j22708n0414p715
15387a28907J13391p1573j91499n8034o3005J54048J04560j60825P253J94050
15377a00541n6584p3833Q4699n9782q1425J13923N6032J33484L2411j05791K1454
15366c5953K2482p6356J5393J35317p1930j22490j44164O0492L0804m1557j13768
$$ y = [73472, -18050, -89489, -37073, 36740, -118779, -113021, -65681, -4548, 107314, 230764, 250349, 151306, -130985, -139172, 30623, 73575, 32440, 93828, 109203, 92893, 89976, 257602, 322756, 229173, 112486, 69426, 101860, 95645, 159074, 85818, -53201, -149079, -188252, -103183, -35110, -29656, -92443, -11630, -10507, -20575, -15110, -110617, -103148, 65654, 71204, -35319, 17750, 159600, 94346, -118434, -120255, -76797, 51930, -70778, -121192, -128907, -15516, -87089, -278588, -336622, -399627, -245579, -141019, -301844, -294591, -100541, -157125, -230958, -146259, -206041, -287466, -173543, -117511, 15973, 48384, -57407, -35953, -13471, -89827, -74434, 60883, -11047, -133537, -277701, -217209, -186405, -227962, -341730]
15355c41730N8070K03569N3056L5254o1891j68652l9331l5025R1919J71557Q9767
15344E6563K445R2972j8966k38710O7155J39014j17935o027J4939j05265j2371
15333a26186J05230p2909K5073L4449o3650R2412Q1832k8626j9985p578m3383
15322b3321p6671J54292j09527j77310L8217K16091Q1939l6735j34546j35894
15312b03465M72J04208j42774N6051K2128q1194m6998p9985K52308M6927J43477
15301G1155O4284k8955L5629K14069m8858k90980R486p7414K5637Q7647n5331
15290F369L0444k7342P1962j2504k17548m4990P7002L0034m7657j05609l65l4604
15278b74808o0131K1291N4329Q9722o3776Q8224Q7485Q3707J05769p3265j20206
$$ y = [-341730, -283660, -80091, -27035, 8219, -53672, -222324, -261655, -296680, -204761, -33204, 56563, 59008, 151980, 133014, -105696, -38541, 100473, -17462, -23489, -8550, -113815, -126186, -20956, -93865, -68792, -34343, -97993, -5581, 76251, 47625, 27640, 20062, -23321, -99992, 54300, -55227, -232537, -194320, 21771, 103710, 66975, -67571, -203465, -202993, -98785, -241559, -185508, -163380, -244574, -291572, -371557, -119249, -72322, 71155, 135439, 106484, 142113, 356182, 307324, 16344, 25830, -51584, -25947, 61700, 6369, 36813, 9471, 81433, 68929, -148619, -193609, -116607, -86573, -134230, -239839, -240204, -274808, -334939, -313648, -259319, -169597, -233373, -145149, -57664, 26043, 131812, 58547, -61659]
15267f1659k1116N7818p9984J16664J29248q6699K8979l8948p8975o0964n4989
15256a50625j153J30737L7752o7238j1730j30073n910L9826O5041m2687j08354
15245b44414J59647L0068N695J36228l0952j39610J14775P1419M827n180j35304
15234c2801j89922J05704J54793N7856Q6746j20515q3359P6983M8211m757j6809
15223H2130j8900k16522P6484R1503j036j28211o8668p8993L73J33112K0124m361
15211a12965M6261j77520J7839K02240q5031J40635K02197J4336Q760o6440j49577
15200D0735k55015r8077J8625J60629p0491r9390L2197R2896J03081J10710j69530
15189a33630N5481J85926n3512j50287J1300J4672N6027p6828k0103K3507K7483
$$ y = [-61659, -82775, -24957, -104941, 11723, 140971, 54272, 83251, 44303, -34672, -95636, -150625, -151778, -21041, 16711, -50527, -62257, -192330, -198240, -158414, -93373, -136060, -244414, -84767, -54699, -49004, 87224, 56272, -83338, 31437, 102856, 107683, 102503, -32801, -222723, -117019, 37774, 95630, 182376, 61861, -21498, 55485, 103696, 98939, 82130, 63230, -153292, -76808, 14695, 13659, -114552, -183220, -262213, -261840, -128728, -108604, -112965, -66704, -244224, -226385, -24145, -109176, 31459, 233656, 247992, 256752, 190312, 40735, -214280, -312357, -293732, -133103, -203594, -302984, -270787, -177891, -74810, 35900, -133630, -78149, 107777, 54265, -96022, -84722, -70050, -14023, -90851, -110954, -87447, -59964]
15178e9964J11434P3550j22150l8718q4462M0940J51964j0064o0214j49337J05106
15167d1915j26157j95943O4502K5034L7242K06432N321l0212K5789J76511n9038
15156H7566j73374L4362K4136k62603L1362Q698j15025J01034R2696P3334L404
15145i4410M7774J7639p2280m5550J38165j3118r0128J26560j55649j39216o8775
15134c48988R5010n7332J10262J26233P5874R13j908P7768J2406K11081J47839
15123D49158j4057k02308j20665j37612j06118n5814q967j2508J37127N2231J92179
15112A72646P4514r8943P2565M971l5987j69153o2114j9929k0416L3448n1640
15101a00038j33119P1550J2168o7452J07829J4765O4976J93148m6941k0216M5108
$$ y = [-59964, 51470, 125020, 2870, -35848, -120310, -79370, 72594, 62530, 2316, -147021, -41915, -168072, -364015, -299513, -274479, -237237, -30805, -25484, -55696, -29907, 146604, 87566, -85808, -51446, -27310, -289913, -258551, -249853, -364878, -263844, -171148, -97814, -94410, -46636, -28997, -101277, -146827, -8662, -21780, -111908, 14652, -140997, -280213, -348988, -253978, -311310, -201048, -74815, 1059, 1972, 64, 77832, 90238, 301319, 449158, 435101, 232793, 112128, -25484, -131602, -187416, -196383, -208891, -71764, -19533, 172646, 247160, 148217, 220782, 225753, 189766, 20613, -41501, -61430, -81846, -48398, -100038, -233157, -161607, -149439, -216891, -109062, -94297, -29321, 163827, 116886, 96670, 141778]
15090A41778N1995p7090J04988m6091m1018j60119o8797J2633l2779J32384p6292
15079e8408L23j14664k12047O7563P7865n2121l4828O0906o6365n9057M1753K63860
15067h5220J92457j2500k7636j03841J97669J28326p5904l4318P4511p9986j60985
15056A2573p8463P7396Q2712R5701l1204l9810j26181j29640K19424j2521l3342
15045C6645J67114K02300o9868j69958k9705j97421r1652m8837j7738P1060J34427
15034a3633m0388j96125j05274M8860M3423j59815N7598K3369k376r057L33858
15023a9560J07853p4972L6029p0505N0126p1080P8808J0801n5101R5146l2105
15012E5440Q3938K3908N2737j45564j49817O7837p8903K4116J88250j3191J52846
$$ y = [141778, 193773, 116683, 221671, 175580, 134562, -25557, -94354, -81721, -114500, 17884, -58408, -58085, -172749, -384796, -317233, -239368, -291489, -326317, -265411, -331776, -390833, -349080, -85220, 107237, 94737, 67101, -36740, 160929, 289255, 213351, 179033, 253544, 173558, 12573, -65890, 11506, 94218, 189919, 158715, 118905, -7276, -136916, 82508, 69987, 36645, 203759, 406059, 336191, 166233, 136528, -60893, -152545, -201382, -219120, -148060, -13633, -54021, -250146, -355420, -306560, -263137, -422952, -365354, -341985, -344361, -353418, -19560, 88293, 13321, 49350, -21155, 28971, -42109, 36699, 47500, -7601, 87545, 55440, 139378, 163286, 216023, 70459, -79358, -11521, -90424, -66308, 121942, 108751, 261597]
15001B61597n9541k01832j35096k2557m8798K56779K34467j66897j40150O2936
14991D0908L329q1084R9473p7899m9971k8156o270J1821P9729R5790O0098l7986
14979A09782j09630J7316r0602m6365r6209L0573J14027J11098j8368k00111J38484
14968d0005N0660J77779J9866N3428j16425k03127p5169N970j1662L926O2237
14957g2522j00222k6517p6261J34759J37818o6638l1698N4880J31851q427j07478
14946c0455J73852o7159r2127J7672J3372P083j17671M5336j9831m441J98619
14935A24250J3244j09845q6970q6783M6654K53469J6556k2058j12250j78610O9780
14924g2563r488Q9996N9946n3889j67693r2570J79048J55722J68789k2366L1205
$$ y = [261597, 202056, 224, -134872, -157429, -206227, 50552, 285019, 118122, -22028, 40908, 44237, -36847, 62626, -15273, -65244, -93400, -99670, -87849, -8120, 87670, 147768, 109782, 152, 17468, -73134, -119499, -215708, -185135, -71108, 39990, 21622, -178489, -40005, 10655, 188434, 208300, 261728, 145303, -57824, -132993, -127023, -138685, -134759, -72522, -172744, -199261, -275522, -140763, -2945, -69583, -101281, -46401, 85450, 77023, -30455, 143397, 76238, -15889, 1783, 15155, 22238, -95433, -50097, -69928, -74369, 124250, 137494, 27649, -59321, -146104, -99450, 154019, 170575, 148517, 36267, -142343, -72563, -82051, 7945, 67891, 14002, -153691, -246261, -67213, 88509, 257298, 234932, 266137]
14913B66137M1106k7948q0176j57952o5276j46714p9080m6266J52634J57386j87870
14902a74019p4820j98838j0552J38773M3668K4194J45705J10142J1932k1162p9072
14891h4049j01484J29073N176l6536k8698J29430J61845o3656N5710l4137j18240
14880A4434k6656O8457o9798j6242o221K99500m6679r7482j06714j72458o4278
14869b24137o2793J70752K06220j2166k76828j27294N8023n2492J12884J84018
14859b3813K56289p3255j06879L9040j30026j40661J10656k040j55702j29667
14849c56058J01181O7295Q7692J01107J4058q9289m6710L2202K16346J19327p2406
14838A74745P607J30009q0898O3306l05636j40812p944J09279l9514l200K65019
$$ y = [266137, 307243, 279295, 199119, 41167, -24109, -170823, -249903, -296169, -143535, 13851, -174019, -248839, -447677, -458229, -319456, -275788, -251594, -105889, 4253, 16185, -4977, -84049, -185533, -56460, -51284, -87820, -116518, 12912, 174757, 111101, 166811, 132674, 14434, -12222, 56235, -13563, -29805, -36026, 263474, 216795, 119313, 12599, -159859, -224137, -286930, -116178, 90042, 77876, -198952, -326246, -268223, -320715, -207831, -23813, 232476, 159221, 52342, 91382, -38644, -179305, -68649, -70689, -226391, -356058, -254877, -187582, -99890, 1217, 15275, -74014, -120724, -88522, 127824, 247151, 174745, 182352, 312361, 231463, 294769, -10867, -151679, -159623, -50344, -89858, -93058, 171961]
14827A71961r6464j49094j29983J40644K68164J4468P8498O1672j88068j18963
14817E2835m9730Q2474j85178L3567J04609K622P0133R9900K31223K8658j15426
14806C55687o5687p2088j80520l7339m8513R5048R1086L3448j09766j78380m6570
14795a63594J32131m6048L6610O8365K4830L56N8724M1049J33322j96871j57335
14784f8461n284j451J3356J37192K481Q1215j6928J44090N1287j11046j11652
14773A14799K510J49581L1447j57543r2643q8296P1147J21786k9559m8831j40726
14762f6328j4971M1806o5249L2835J07586j45555j50959O4106p843O0378l7495
14751a81689K0131J164N0788J80809J66240j91013k03072j00973P225J15305L9978
$$ y = [171961, 75497, -73597, -203580, -62936, 205228, 219696, 298194, 359866, 171798, 52835, 3105, 85579, -99599, -66032, 38577, 41199, 111332, 211232, 442455, 471113, 355687, 290000, 217912, 37392, 53, -48460, 46588, 137674, 171122, 61356, -117024, -163594, -31463, -77511, -40901, 27464, 52294, 52650, 111374, 152423, 285745, 88874, -68461, -73745, -75196, -61840, 75352, 77833, 159048, 142120, 286210, 337497, 226451, 114799, 117309, 266890, 298337, 140794, 48151, -40145, 31002, 152788, 123229, 74398, -66328, -81299, -39493, -104742, -71907, 35679, -109876, -260835, -196729, -204572, -144194, -181689, -161558, -160394, -109606, 71203, 237443, 46430, -156642, -257615, -250390, -135085, -95107]
14740i5107k2512m9010r7267Q0485j35938m9634N7142M599j28721M2944J28704
14729b64315J03163N2061o2688N4405J16481K49205L4196j86999o4099n1148n6734
14718g6472M7183n1474P204R454J20838r8930J6475K12521L1915p7170P2890p6256
14706A38178j1714Q46p3626j41547j73747P8699R354O1823O6342k4263Q1964J60336
14694A72645J03262l5119o4527J80769j31010k97278j13023J4557J48644O3257
14684D2177J06661J734j25929j12972n519M0681P6178J25657K5606l38780m7302
14673b11808K21535K38836M2000j22317j6183r7366j6479J42097N4668j65464
14663F9519j10860j6820m1218n041K4552K50419K2896j30024k01228j36559L0719
$$ y = [-95107, -117619, -166629, -263896, -183411, -319349, -368983, -311841, -307242, -435963, -393019, -264315, -161152, -109091, -171779, -117374, -893, 248312, 282508, 95509, 31410, -19738, -76472, -29289, -80763, -73559, -64105, 56733, -42197, -25722, 186799, 218714, 141544, 214434, 138178, 126464, 127310, 53684, -87863, -261610, -182911, -173557, -111734, -45392, -69655, 12309, 172645, 275907, 240788, 176261, 357030, 226020, -71258, -184281, -169724, -21080, 42177, 148838, 150572, 24643, -88329, -93848, -53167, 23011, 148668, 174274, -164506, -211808, 9727, 248563, 290563, 168246, 152063, 54697, 38218, 180315, 234983, 69519, -41341, -58161, -99379, -104420, -79868, 170551, 193447, 63423, -137805, -274364, -243645]
14652b43645K28200Q0472j51889R3296P5133M5039o8259j70648j09099J60752
14642f0648l1512L534m2624J7372n0321j30308R9408J95976m735k2905l5740J71460
14630A08957J33493n5299K506P355n8165J7450j3219o3516j24335J03904J13788
14619A72919j19923j22169j21257j24571m1315J39037r0991m2750Q2150J19441
14609a49429j5635J10767L1580p2781O450M2209j32943J2068J04168k5169Q9245
14598E30Q3101k5356J6788j33227Q8622J06357r6786n4639K6615R3314n3559k05626
14586a53866J0621j78856j58833j291J37632R1147L1748O6600N3299m1303L0607
14575a12495l5301p6887J4099K23811J31931n7628j50432j14653j15321j33369
$$ y = [-243645, -15445, 65027, -86862, 6434, 81567, 126606, 58347, -112301, -221400, -60648, -92160, -88626, -131250, -113878, -164199, -294507, -195099, 877, -3858, -26763, -62503, 108957, 242450, 187151, 189657, 197012, 138847, 156297, 143078, 79562, -44773, 59131, 172919, 52996, -69173, -190430, -315001, -356316, -217279, -308270, -351020, -268870, -149429, -165064, -54297, -22717, -95498, -89048, -46839, -179782, -167714, -63546, -88715, 530, 83631, 58275, 75063, -58164, 30458, 136815, 40029, -14610, 12005, 105319, 51760, -153866, -143245, -322101, -480934, -482225, -344593, -253446, -221698, -155098, -101799, -143102, -112495, -147796, -224683, -210584, 13227, 145158, 87530, -62902, -177555, -292876, -426245]
14565d26245J18753J44724j28889k3964P2500Q6628J10859K1356j20467j18668
14555b63413J23444J97715p025J16253q932j90971j29631K6533J07968N7930L7673
14544F7544j48957j22986n3752Q6690J06649J36244j07573k46244K4990K15453
14534d1942n2132o0552N8488J39870K2377N2213j23393O4703m0542L3578k1459
14523C1209n0392k7267j14411J48565J38891j03333j54683r3294M2006K7342K7053
14512a28314n5758J58715r434j34100j31878J15110J75090k2012O8055J01059
14502A36533j25293j0487O7463J3409N8835Q89m1665n8752l837J44717M8392L1193
14490B61397q2033L8259j13710l4409m0404M0606J3650R998n4935q3449k5888
$$ y = [-426245, -307492, -162768, -291657, -315621, -243121, -156493, -45634, -24278, -144745, -263413, -139969, 57746, 50721, 166974, 158042, -32929, -162560, -136027, -28059, 29871, 67544, -81413, -204399, -258151, -171461, -64812, 71432, -36141, -282385, -257395, -41942, -94074, -154626, -96138, 43732, 66109, 118322, -5071, 59632, 19090, 52668, 31209, -19183, -46450, -160861, -12296, 126595, 23262, -131421, -224715, -182709, -155367, -128314, -184072, -25357, -34791, -168891, -300769, -185659, -10569, -32581, 35474, 136533, 11240, 753, 68216, 81625, 140460, 141349, 99684, 40932, 37095, 181812, 230204, 261397, 179364, 217623, 103913, 69504, 29100, 69706, 83356, 93354, 38419, -45030, -70918]
14479g0918M1315J00543R245r8639l7110P1932l3181k88281Q2518J08414Q792
14468a05370J02831k4010r5932p715L157k6324l5273J32476J03455N1934l7529
14457F1700p7498m3915k6188j50488J20834K00877j8697k7253r438j7750m2918
14446c0734J2451p687J51321m07j99167M6154k2769j04003J09358j61668j19240
14435c26391k01617P9440J83282p3264J72123J54265J09655k2504J3299j2166
14425G6122Q4212n1332M537J50626k88241k49193l5498L6807O6642Q6567K8550
14414i0201k8875j38154r3629J86927Q1068k16L5102R597Q6278R3924l3588M678
14402A12911m2214o0558m2463N3262k46245p8500J12423j1936R7443L8676M0191
$$ y = [-70918, -29603, 70940, 80185, -18454, -55564, 16368, -16813, -305094, -222576, -114162, -105370, -2539, -26549, -122481, -130196, -127039, -153363, -188636, -56160, 47295, 99229, 61700, -15798, -59713, -85901, -236389, -115555, 85322, 66625, 39372, 29934, 12184, -30734, -18283, -25970, 125351, 124944, -74223, -28069, -50838, -154841, -45483, -207151, -326391, -528008, -448568, -265286, -338550, -166427, -12162, 97493, 74989, 88288, 76122, 160334, 109002, 113539, 264165, -24076, -273269, -308767, -271960, -205318, -118751, -90201, -119076, -257230, -350859, -163932, -82864, -83080, -47978, -38381, 47897, 141821, 108233, 112911, 70697, 10139, -32324, 20938, -225307, -303807, -191384, -203320, -105877, -67201, -27010]
14391b7010L5805l5190j31626L7835J14469J94977J44131j21817n8790J08356
14381B61140r0048j36464P3589K6697L3637J6465m3515L7790p3677j53771n0622
14370i8779j49937j09693J069N5582J33651M4927K53663J27392j31721j66062
14360c9908j04585n810J49680r9745L6005J80350J38552l3440k82552k02520m8517
14349c12490K02288K4785p7376J67166J26918m6589N7445j84886j52384J17306
14339g7817N8538M6270o285j33353j2562M1274K5733J3763J08305J30082l6819
14328A57129J3878j18346r7602o1326q2525M7280M0532Q378J59608o2185o6825
14317f2004L94R0907Q747J6594J82506l7098j40790p837J23641l393j79758j29666
$$ y = [-27010, 8795, -26395, -158021, -120186, -5717, 189260, 333391, 211574, 152784, 261140, 171092, 34628, 108217, 134914, 168551, 185016, 141501, 179291, 105614, -48157, -98779, -248716, -358409, -357340, -301758, -168107, -123180, 130483, 257875, 126154, -39908, -144493, -150303, -623, -100368, -64363, 115987, 254539, 221099, -61453, -263973, -312490, -110202, -85417, -162793, 4373, 131291, 84702, 142147, -42739, -195123, -77817, -19279, 26991, 20706, -112647, -125209, -83935, -58202, -44439, 63866, 193948, 157129, 171007, 52661, -44941, -106267, -188792, -141512, -100980, -92602, 67006, 4821, -62004, -61610, 29297, 38044, 54638, 237144, 200046, 59256, 51419, 175060, 171667, -8091, -137757]
14305a37757l3766J38397K8467n7976M2660R9617j11770j6886J70781k223n7007
14294F2537Q5366N0687q9814q5045O8021l9864k17140J13629j43389L1544L170
14283a60298k9500k89407n5925K20490J7445M7325J22470L5886M3924R5590l3495
14272A4505O7895J53879q2001j46219j43602k41832J7285J41405R4946K9344J07655
14261A3260K27911J51259k7124R405n9325q4933k21041l4721K2639J85812J08680
14250B91822j27372j39312k28909P8294K41362j1800j3291K6052k27162m5083
14240a55399K2071n3284m1592j8043l4872P9738J63590L3896j01859m7020J29569
14229b3205J84347j50088k7916M8549j91611j31778m9602N9844O0457L9262J55907
$$ y = [-137757, -171523, -33126, -4659, -62635, -19975, 79642, -32128, -49014, 121767, 119544, 62537, 147903, 198590, 108776, 23731, 91752, 51888, -165252, -51623, -195012, -163468, -160298, -189798, -479205, -535130, -314640, -297195, -249870, -127400, -91514, -47590, 48000, 14505, 82400, 236279, 154278, 8059, -135543, -377375, -360090, -218685, -123739, -94395, 13260, 241171, 392430, 365306, 374711, 315386, 230453, 9412, -25309, -2670, 183142, 291822, 164450, 25138, -203771, -125477, 115885, 104085, 90794, 116846, -110316, -155399, -133328, -186612, -228204, -246247, -281119, -201381, -37791, -3895, -105754, -152774, -23205, 161142, 11054, -16862, 31687, -159924, -291702, -341304, -281460, -221003, -181741, -25834]
14218b5834J67170o0922q0478j03702P202J28161J3891j08666K05977J2932k08923
14207e3192k9072J14362J6897j2549j27993K4522K8758m0460r7213J64187J00525
14196H8772J42234L9329j26970j71822n2139r6047J23690L0693k9644O1376j02049
14185i2577N435Q3153l4110p6993M1801J24604L6864o3675J2501j5792j04026
14174h2815j76787R6087Q9483k74850M6362K27641O5187Q5709Q8389j28626k16649
14163a80869j0019N2215N2301J11465p4425q0240m9353n8715n5520P4827J40576
14152g7757j45248j36902J32819J05916q3027k08338J12847J24195J9888K7833
14142a27774K8996j0915K42490k2187q6653K1617n72l8519j35317j29240M3084
$$ y = [-25834, 141336, 80414, -64, -103766, -96564, 31597, 45488, -63178, 142799, 155731, -53192, -82264, 32098, 48995, 36446, -91547, -67025, -38267, -78727, -175940, -11753, 88772, 231006, 270335, 143365, -28457, -80596, -176643, -52953, -22260, -51904, 9472, -92577, -87142, -3989, -38099, -115092, -73291, 51313, 88177, 24502, 37003, 21211, -82815, -259602, -163515, -74032, -348882, -302520, -74879, -9692, 76017, 164406, 35780, -180869, -190888, -138673, -86372, 25093, -49332, -129572, -178925, -237640, -293160, -218333, -77757, -223005, -359907, -227088, -121172, -204199, -412537, -299690, -175495, -155607, -127774, -98778, -109693, 132797, 110610, 23957, 45574, 45002, 6483, -128834, -258074, -214990]
14131b14990M9065O0190n9580J06920O0878O911n1094p2843J2650N0461p7825
14120a29257j2122j08704L9059O9590R536M3782N5398R6894K0835P7631J8213
14109A80855J7202L783o8629L9871j29361k32744J03345J53403N8092Q4487r5445
14098A14859r614k10735Q6488k933j03252O8736Q7384n4785p5963J47204J21574
14087A68963o8905j65394j27778J39720J22829p771Q370J66284j40191k64926
14077a68799q6432P5457k5796J16397N268P5885Q4775J28000P7134J19096k2176
14066C78809k53033r0334m7889r8705l1396J66743J7358r5167m4726n467N89p8227
14054a81445q0084R3587N4734o2713N1988J69403j1827j3687K430J59136K1137
$$ y = [-214990, -165925, -105735, -165315, -58395, 2483, 9394, -41700, -114543, -101893, -51432, -129257, -141379, -250083, -211024, -141434, -131898, -88116, -32718, 64176, 85011, 162642, 180855, 198057, 201840, 133211, 173082, 43721, -189023, -85678, 67725, 125817, 210304, 114859, 105245, -105490, -19002, -21935, -125187, -56451, 30933, -23852, -99815, 47389, 168963, 100058, -65336, -193114, -53394, 69435, 61664, 70034, 236318, 96127, -168799, -255231, -179774, -205570, -89173, -83905, -8020, 76755, 204755, 281889, 400985, 378809, 125776, 35442, -12447, -111152, -142548, 24195, 41553, -53614, -98340, -103807, -103218, -181445, -261529, -167942, -113208, -175921, -123933, 45470, 33643, 19956, 22386, 181522, 202659]
14043B02659j62395r0141n3033J08052J07812m2811n5819k35056r9027K87807
14033c1952n5370j38453o2704J79472J70396q535j2984p4645J19311n7874Q1197
14022A07859J11739j23633j04742N3868L9504m3624j01200K3484K4711J32229
14012A20195P0243l8815j34483n7194q735n6700j1879J04323o7601n1446q8929
14001b21021k6274Q4273M0829J7221n8092P0930n001J21542l8646M0781j1712
13990A4830P7665o0777j53918l5392P6420q1899M5608L42993m7066j44032o9584
13979c5152n1140r1795l6349Q1899J4831Q7485M4993K219j4117j65620j46045
13968c08791M2967j21880J66394K17454J39923L0256k80280o772O4731l2528o067
$$ y = [202659, 40264, -49877, -102910, 5142, 112954, 70143, 14324, -220732, -319759, -31952, -87322, -225775, -288479, -109007, 61389, 52854, 39870, -34775, 84536, 26662, 107859, 219598, 95965, -8777, 45091, 84595, 40971, -60229, -36745, -12034, 120195, 190438, 151623, 17140, -40054, -48789, -105489, -117368, -13045, -80646, -132092, -221021, -247295, -163022, -122193, -104972, -163064, -92134, -97135, 24407, -14239, 26542, 14830, 92495, 31718, -122200, -157592, -81172, -163071, -117463, 225530, 178464, 34432, -35152, -86292, -178087, -214436, -132537, -117706, -30221, 14772, 16991, 2874, -162746, -308791, -265824, -387704, -221310, -3856, 136067, 166323, -113957, -120729, -55998, -88526, -94593]
13957i4593p6150J45157Q6987L4466o0343k0288L4760N0774M7345j14388l5091
13946a364K7045o2946n5089j10561O3840J39927j6437p9213r548j11539j19369
13935c35254p4008J19398O7168Q9685J91727Q8116P546o4784j33119j89421o7288
13924c00234p0093Q1924J9640j64305J02019J99441J0543R8335K49243K35311
13914D61824J44547l06070k60362j54208O7395J43981j85567k5226P0500N535
13904c7651l16460P4922J47079p4741J79156M3317j69061J16821Q1953r2766M6473
13893i58K6787j29643J11395J56645J46982q2028k7242L8764l8228j20457q1004
13882A013p246m2624J4569l4852j56710l1613M5793K34035J9631l2178K1900k5749
$$ y = [-94593, -170743, -25586, 61401, 95867, 35524, 15236, 49996, 100770, 148115, 33727, -1364, 25681, -37265, -92354, -202915, -139075, 852, -15585, -94798, -104346, -215885, -335254, -409262, -289864, -222696, -133011, 58716, 146832, 154378, 89594, -43525, -232946, -300234, -370327, -288403, -268763, -433068, -331049, -131608, -121065, -22730, 226513, 461824, 606371, 300301, 39939, -114269, -46874, 97107, -88460, -113686, -43186, -37651, -354111, -279189, -132110, -206851, -27695, 15622, -153439, -36618, 45335, -47431, -958, 25829, -103814, 7581, 164226, 311208, 229180, 201938, 240702, 202474, 82017, 1013, -6233, -48857, -34288, -69140, -225850, -257463, -211670, 22365, 41996, 9818, 31718, 5969]
13870E969m7961J27082K0127o1524J6163q899N5035p5236j47807k1625J26912
13859a1764J44607j5499p3148l9558J974j18682j09576J4473q7462K9778J60649
13848a04208j49527R6199J19048m2351j00728m7138R6287J36972R1456N9170J0686
13837A65866o6830n8251K7435J21823L0496P6351r0953J04008o4927j88186j882
13826E4950O3119J18048q5684m9505M7024m2301L7363J62685k8911k29996n1842
13815e050n0167J6303L7978P537O8881L0575O6070j32211L4471Q0145j03805r0950
13803d0223j19975o4615J19039R6517L7141N3875P0970n3540m3840j00866k2343
13792f7860l6453Q6895R1281q0246r4856j26702k02428Q6987K62427J44191m0322
$$ y = [5969, -41992, 85090, 105217, 43693, 59856, 50957, 105992, 30756, -117051, -138676, -11764, 132843, 117344, 44196, 4638, 6612, -112070, -221646, -207173, -294635, -264857, -104208, -253735, -157536, -38488, -80839, -181567, -228705, -132418, 4554, 96010, 155180, 165866, 99036, 40785, 68220, 190043, 220539, 296890, 205937, 309945, 245018, 56832, 54950, 118069, 236117, 150433, 100928, 147952, 105651, 143014, 305699, 276788, 46792, -5050, -55217, -38914, -936, 6601, 75482, 106057, 172127, 39916, 74387, 154532, 50727, -40223, -160198, -224813, -105774, -9257, 27884, 81759, 152729, 99189, 55349, -45517, -67860, -104313, -17418, 73863, -6383, -101239, -227941, -430369, -343382, -80955, 63236, 22914]
13781B2914j05509n3462k9760M3789J55552J8989N0153l5704r9400q2967j14760
13770b30165J24702K6737j3848p8940m3900M2124Q7852j28277q5788Q7265K24418
13759A2180K05838q2666M8645l6243j57805j9299n3959k4319r1854M9909K0722
13748a28851n4684p4299n9972J25977J7763J92943O0006r5138J2927O2873j10366
13737e0821J39482n3641o0755j70691j12113O2456K3637O0380J5337O8233P7659
13726h37n0708J15132k8157m048O3479M7504P521O7584K2276j661j40795p3011
13714B4279l4258q546J3365K8998k7776Q78R7036Q9848k04168o79J08005p5306
13702A1676j55410J72947L6499l0890j59892q6089M9897J9846J04378K0236j50355
$$ y = [22914, -82595, -136057, -165817, -122028, 33524, 52513, 102666, 66962, -32438, -115405, -230165, -105463, -78726, -92574, -171514, -215414, -173290, -85438, -213715, -299503, -212238, 12180, 218018, 135352, 183997, 147754, -10051, -29350, -83309, -107628, -199482, -149573, -128851, -183535, -257834, -317806, -191829, -174066, 18877, 78883, -16255, -3328, 59545, -50821, 88661, 35020, -25735, -196426, -308539, -246083, -222446, -162066, -146729, -78496, -837, -51545, 63587, 35430, 31382, 94861, 142365, 149886, 217470, 239746, 238085, 97290, 24279, -9979, -18525, -5160, 23838, -3938, -3060, 93976, 183824, -20344, -21023, 86982, 11676, -143734, 29213, 65712, 34822, -125070, -211159, -161262, -141416, -37038, -16802, -167157]
13691a67157k846N8915l0609M919J5635J4026O2750M6678n6473j58026j42815
13680c55003K71724K30542K8913j31803j59030r8053J8372J14511O2133J49148
13670A31454M3161o084m1120q7400m5934m7750j0397K3585J91483l8185p2905
13659C9908j93260n5316k7489j7695M8494O6390m9723J288L6512J27733L3224
13648A0066j08219m1088J24154R8552j20237J59429J3209k18222l0327R9844N2318
13637C9479M6296j31515L6389J40167J35106p1240j96308k8510o0996j5874K7491
13626g9515M608l8002J02899K9801P2421l56O5810O12J6961j10688J85406J68653
13614D18610j75617l9653n4871r7083o91o8191j40748r9204j90200O4180J95019
$$ y = [-167157, -170003, -111088, -141697, -136778, -121143, -107117, -44367, 2311, -54162, -212188, -355003, -83279, 147263, 176176, 44373, -114657, -212710, -194338, -79827, -17694, 131454, 174615, 168531, 127411, 40011, -5923, -53673, -64070, -40485, 150998, 112813, 39908, -153352, -208668, -236157, -253852, -205358, -138968, -188691, -187403, -150891, -23158, 10066, -98153, -139241, -15087, 83465, -36772, 122657, 135866, -82356, -112683, -12839, 39479, 85775, -45740, -9351, 130816, 265922, 194682, -1626, -30136, -91132, -107006, -79515, -74907, -112909, -10010, 19791, 92212, 91856, 157666, 158278, 175239, 64551, 249957, 418610, 242993, 203340, 148469, 51386, 50695, -17496, -158244, -257448, -447648, -383468, -188449]
13603a88449P8289q8964o1356P8974R0911J31464j01050N1926J4391j86619j2174
13592a92657k2194o1316J45604j6413L3226l3452k775K71282J34980j6443j15483
13581A24359j67896q5208P625N1056N5353r3450n9804R5840P8712k46661j76985
13570d17059j7721J65826J96061N3974o2921L9069L5391J1424L4228p1212o7884
13559a00824k0412j67043o9741J01313K26121o559p4412P3131R4117R4723n5447
13548I4967r3182j04519N3228l2171q3733k5072k8879J41419Q9708k6055j10924
13537a25213m8886K11564r38j95035j18045R028K9111R2950J10302L2484l2870
13526c5548N9786P7234m314j92378o7277O9790O0181O5082o8222r9369r9784R9283
$$ y = [-188449, -110160, -199124, -260480, -181506, -90595, 40869, -60181, -8255, 6136, -180483, -192657, -214851, -276167, -130563, -146976, -113750, -147202, -149977, 121305, 256285, 239842, 124359, -43537, -128745, -121120, -70064, -14711, -108161, -167965, -72125, 6587, -240074, -417059, -434780, -268954, -72893, -18919, -81840, -42771, -7380, 4044, 38272, -32940, -100824, -121236, -288279, -358020, -256707, -30586, -37145, -111557, -38426, 55691, 150414, 94967, 1785, -102734, -49506, -81677, -165410, -190482, -219361, -77942, 11766, -14289, -125213, -174099, 37465, 36527, -158508, -276553, -267525, -238414, -145464, -35162, -2678, -35548, 24238, 101472, 97158, -95220, -162497, -92707, -32526, 32556, -35666, -135035, -234819, -135536]
13514a35536J86388J5590j41967r7163j34874m4069J70851J96358q9187N9511
13504a4098O1056j06547j37252r5849N3457J01575l72J18603j6069m6067J16462
13493C4899k9451o5743J17299L2583l4313l3980j81384o4422J4733R301j16382
13482c16860J9058P0754J69392J1235Q9971J34937R011q6520j0034n6024l8710
13471c790R538j74866m7952l0426q7552O2870J18893J13460Q295J01898j54959
13460h4591k37910K0040J35363K45092P3526j42359n7824P409j41387P7635p896
13449a12902j00984n2125J33045J67850J09053r205j09574j60365N6171j19607
13439a98643J3301K50949M6992j38894j77164p1576q8863K1717Q4402K01488J95207
$$ y = [-135536, 50852, 66442, -75525, -172688, -307562, -351631, -180780, 15578, -73609, -14098, 46958, -59589, -196841, -292690, -239233, -137658, -138030, -19427, -35496, -81563, 34899, 5448, -60295, 57004, 89587, 55274, 21294, -160090, -224512, -209779, -200478, -316860, -297802, -227048, -57656, -46421, 43550, 178487, 187498, 100978, 90944, 34920, -3790, 5748, -169118, -217070, -247496, -335048, -272178, -153285, -39825, -31530, 70368, -84591, -322501, -302461, -167098, 77994, 151520, 9161, -48663, -41254, -182641, -105006, -112902, -213886, -266011, -132966, 34884, 143937, 134732, 25158, -135207, -79036, -198643, -185342, 65607, 112599, -26295, -203459, -275035, -363898, -342181, -257779, -56291, 138916]
13428A38916K9892p9381m4626L2743r0935j43743j09553P5703J12571L06525Q1317
13417C09429o1552k30371p2280J18044p5959L1866M9178r8979L2818n0090o6144
13406a14040r143m6689J2060J12765L6780j63398j43954J14331q025N6131J23146
13395c0036J58080l2667J536J07067q3268k04977j83133j4355N212m4306o7161
13384c88008o2142Q1828Q2139l07P6348J10679j3778j03033M7331O6164j03723
13373b06502j44372P0269J34410R3775J11188r0967r6277j02365o1260K37611
13363e4490J56790k9862m4402J62859j8303k14928J9500J815j60746j00671J47290
13352a35148J32378J66646j5460j49311Q61N2633Q8137j8860q5138l3227k14901
$$ y = [138916, 168808, 89427, 44801, 77544, -13391, -157134, -266687, -190984, -78413, 228112, 309429, 247877, 17506, -54774, 63270, -12689, 19177, 68355, -30624, 2194, -47896, -114040, -123183, -169872, -157812, -45047, -8267, -171665, -315619, -201288, -209313, -153182, -30036, 128044, 95377, 96913, 203980, 120712, -84265, -267398, -281753, -276541, -320847, -388008, -450150, -368322, -286183, -286490, -210142, -99463, -113241, -216274, -168943, -102779, -206502, -350874, -280605, -146195, -52420, 58768, -32199, -128476, -230841, -292101, -54490, 102300, 72438, 28036, 190895, 172592, -42336, -22836, -21021, -181767, -282438, -135148, -2770, 163876, 148416, -895, -34, 52599, 140736, 121876, 36738, 3511, -211390]
13341b11390j71664Q1864R8924J24896j41345O7635J28022Q526J79279R6211j0337
13330B50621k31127J4428K79620P3445j28488n5061Q1168n5016o7539j9727j6177
13319A26147L7499J34952L3788P8541j20393r8715j83663q3186P1352k2615J20325
13308I4032N7254k15404N9883O1544j18964N8969l8998R1119o2690n3181n5291
13297a21727R3693L6577L5896J3848K1264j6225n2512N7215R0418q4608j44110
13286g0271j01321P8763Q9348p9497N6089J62546n3272j28577j98348M253R9888
13275a40399R8893l61J54346l9790r1314P4201J33626j06160j52413j50040r3771
13264c13182J39557J37868L4314o2357p6392L6286L1700j2181m5761J00038Q3708
$$ y = [-211390, -383054, -301190, -202266, -77370, -218715, -151080, -23058, -14532, 164747, 260958, 250621, 19494, 33922, 313542, 386987, 258499, 203438, 284606, 229590, 162051, 142324, 126147, 163646, 298598, 332386, 410927, 290534, 191819, 8156, -75030, -3678, -26293, 94032, 151286, -64118, -4235, 57309, -61655, -2686, -41684, 49435, -13255, -66436, -121727, -28034, 8543, 44439, 58287, 79551, 63326, 10814, 68029, 158447, 73839, -70271, -171592, -92829, -3481, -82978, -26889, 135657, 82385, -46192, -244540, -240287, -140399, -41506, -41867, 112479, 72689, -18625, 55576, 189202, 83042, -69371, -219411, -313182, -173625, -35757, -1443, -63800, -140192, -103906, -72206, -84387, -130148, -30110, 53598]
13253E3598o6486M289j7252n776O5925K0831J17246N0302j367J601m8098j05464
13241F9349P6779Q2809j07578j37378j90655j13565J2543R1424R8128l6292j96010
13230c50446k8826K23346J88743k7827m7872R801R109Q5193j16339p8816q9442
13219b23376J64829J11696r720m656m4133J42607J17454o7794j90290l5867j35262
13208a74512R236M5903k15159j32588K58580L25130m9928j51266P4317O9465Q971
13197F8149j30360o7640J69684J18581N0795J69789L7m9180j12232l9661q1934
13186I6028n7687j52296j1651P1370j7722L9717Q9389j98010J11079J03092j4813
13175E8496R0103j5159m2976K7840p6644L6346J51026L7898L3230N2531r045J3737
$$ y = [53598, -12888, -8599, -25851, -31627, 34298, 55129, 172375, 222677, 221310, 222911, 174813, 69349, 146128, 228937, 121359, -16019, -206674, -320239, -307696, -216272, -118144, -154436, -350446, -379272, -155926, 32817, 4990, -42882, -33081, -23972, 61221, -55118, -133934, -223376, -58547, 53149, 43429, 38773, -5360, 137247, 254701, 186907, -3383, -39250, -174512, -165276, -119373, -334532, -467120, -208540, 116590, 66662, -84604, -10287, 59178, 68149, -62211, -129851, 39833, 158414, 209209, 378998, 379035, 329855, 217623, 177962, 96028, 38341, -113955, -125606, -54236, -71958, -32241, 57148, -140862, -29783, 73309, 58496, 148599, 133440, 90464, 118304, 41660, 78006, 229032, 266930, 300160, 352691, 343646, 357383]
13163C57383l3081J28029L85318J87500J79236O2222k6256k11880l06555k06760
13153E15156j32537L9590k20469L1311K2887k26379j09896p464p7796n5143K66564
13142D5824J24240q1425n7135l6924m61Q0833L6194K934j68933o1552R8742K62375
13130B44712K96847R0046K45826J39403K0551N1303K3528k4160m36162k29613
13120D22281j22998J90628l8289q8584K1660j78307j79912j19282Q8469N7800
13110E3466k8995J9581l1849j6732J039m796j32178N2915M7395J02109m1977j1507
13098H471j6170r5472N63J75442K10974J48348O3046l3282r0398l7941j95527
13087A38054K8195K5358K574j10135r8973j64236R7825J59149Q9183q1611j54087
$$ y = [357383, 324302, 452331, 837649, 1025149, 1204385, 1266607, 1240351, 1028471, 721916, 515156, 382619, 422209, 201740, 233051, 255938, 29559, -80337, -87801, -165597, -220740, 45824, 170064, 88639, 31504, -5420, -5881, 74952, 111146, 114080, -54853, -116405, -17663, 244712, 541559, 631605, 877431, 1016834, 1037385, 1088688, 1112216, 1088056, 651894, 422281, 299283, 489911, 451622, 363038, 384698, 206391, 26479, -92803, -4334, 53466, 24471, 44052, 12203, -4529, -3490, -8286, -140464, -87549, -40154, 61955, 19978, 8471, -7699, -103171, -102608, 72834, 283808, 432156, 495202, 461920, 371522, 333581, 138054, 166249, 191607, 194181, 84046, -14927, -179163, -81338, 77811, 166994, 85383, -68704]
13076f8704N4513p4564J59984O2435q793K5514O0888n416J27526o4302j14094
13065A54987R182J03465q458J8278j10807l8524j7901J14310P3243r0812o4730
13054A42233n8636O1791J99677k0409j20679N641k12441n2081Q4347M7879m9693
13043B7629o7450k8785J58556J41978j05083j39365o4832P6564K46545J3075k05368
13032E3464K6028k347L6202J24482N3794o3182O7899o6068j25670O737r3933M929
13020B2335j2409q661J40861L9582o8454j34198j56377q0211j6454K3426k3220
13009b73780O5858J26063P4724m8566J33182R2868o1329L2723l3942m0379Q2123
12998A49545K0585j26988O8969m4161j00728J04769J10355j00246m2481j31687
$$ y = [-68704, -14191, -88755, 71229, 133664, 124871, 150385, 211273, 205857, 333383, 269081, 154987, 164169, 267634, 259176, 277454, 166647, 128123, 110222, 224532, 297775, 206963, 142233, 83597, 145388, 345065, 324656, 203977, 209618, -2823, -54904, 29443, 77322, 27629, -39821, -68606, 89950, 231928, 126845, -12520, -77352, -788, 245757, 258832, 53464, 79492, 77145, 113347, 237829, 291623, 228441, 296340, 230272, 104602, 111339, 17406, 22335, 9926, 1265, 142126, 181708, 113254, -20944, -177321, -257532, -273986, -250560, -273780, -207922, -81859, -7135, -55701, 77481, 170349, 109020, 141743, 107801, 67422, 149545, 170130, 43142, 112111, 67950, -32778, 71991, 182346, 82100, 39619, -92068]
12988i2068j12190J69215j015n8455J17410O717J4795J13105o975j33528J51023
12977A68034J93440j24516J6041N8147J1716j40510j51951N7438M3339l5723k15602
12966a20147K26087J19540J88156R3724l9865m9935p5591j70056k22715k07665
12956b58467j4690J73285J50505j26894m5304L6879J06541k0362J621K9530R7172
12945A29816N5996j71430J1620J03893J4782j75509r5087j15460j02003J28116
12935b15266K18039M2046O795k8367J05621k156r0185O4279j8966j30951m9179
12924i8290j46440m7762M4348K25722R0980R7588p7553m2319q7972o0048P6867
12913b4879M056L9374j09516k2865j218J51636Q1571N792R8479j1321q9757J0362
$$ y = [-92068, -204258, -35043, -36058, -94513, 22897, 29614, 44409, 157514, 150539, 17011, 168034, 361474, 236958, 252999, 311146, 322862, 182352, 30401, 87839, 131178, 95455, -120147, 105940, 225480, 413636, 507360, 467495, 417560, 341969, 171913, -50802, -258467, -273157, -99872, 50633, -76261, -121565, -84686, 21855, 1493, 3114, 32644, 129816, 185812, 14382, 26002, 129895, 144677, -30832, -125919, -241379, -343382, -215266, 2773, 44819, 51614, 23247, 128868, 126712, 36527, 100806, 81840, -49111, -98290, -244730, -292492, -248144, -22422, 68558, 166146, 88593, 46274, -41698, -101746, -24879, -20823, 18551, -90965, -113830, -115048, 36588, 118159, 123951, 222430, 211109, 121352, 131714]
12901A31714j1230k6305O648k6383N4331m9785o9811l8821l1963l2704P1696K9552
12889F939o993k2204m1173J3952q2854M6283j16790j00798K08707K01880K05074
12878C12023Q596n8998j80846j82787q8270J0823K15857K08064j53690j42122
12868e1350l847R6997j37875m2517j7109K8349J38787L5603j33540K1788J31789
12857F7075Q4193j2653l9690n8224J26345M2118M1104m2496m6285m8107j24410
12846a1030O0963K00011L3842j67007j39180r3702m885r5598P3393P0718n529
12835g8004L8379r5407p4278p3661J54671N3928J3239j42048O9297R9822q8314
12824a22376N1742j23445P7297L15233J10542m3316l3777j00793o6941Q8334Q4585
$$ y = [131714, 120484, 94179, 100827, 74444, 128775, 78990, 9179, -29642, -61605, -94309, -22613, 6939, -54, -22258, -63431, -49479, -132333, -86050, -202840, -303638, -94931, 106949, 312023, 320619, 261621, 80775, -102012, -190282, -179459, 36398, 244462, 90772, -51350, -55197, 41800, -96075, -138592, -155701, -127352, 11435, 47038, -86502, -64714, 67075, 151268, 138615, 98925, 40701, 167046, 209164, 250268, 207772, 161487, 113380, -11030, 49933, 249944, 283786, 116779, -22401, -116103, -120988, -216586, -143193, -72475, -78004, -39625, -135032, -209310, -282971, -128300, -74372, -61133, -203181, -133884, -34062, -122376, -70634, -194079, -116782, 198451, 308993, 265677, 231900, 131107, 64166, 152500, 237085]
12813B37085J34135q6162j15972k16742L5801J36470k3709j3905j5655m4111K3699
12802E0934m2543j09696J8110Q5099P5046l7281l8156j15649r0459Q9921p2830
12791a87504q2262P8303K219j3799P5142J578Q3109l8443l8944j01161m1811O4704
12779a98869k8715N074J11008P0227M9955q8215o4354l7293J27589J31741r219
12768F8929J17909n0454k25998J5319j9062N2650P5231l2740k9522n410Q3735
12757E0587O517j30216K9640J12843J17606j1457n886q2149K0994l5407j6204
12746E6868O4808J20866o2790j71221k2807L1447J13016J09051j14779O7710J93759
12735C85928p8388J6062P9779P3750K239q2600p3600p0523j2873R7204j41886
$$ y = [237085, 371220, 285058, 169086, -47656, -11855, 124615, 100906, 87001, 71346, 27235, 50934, 8391, -101305, -83195, 1904, 76950, 39669, 1513, -114136, -204595, -114674, -187504, -269766, -191463, -189244, -203043, -127901, -126323, -43214, -81657, -120601, -221762, -263573, -198869, -227584, -222510, -111502, -41275, 8680, -79535, -143889, -181182, -53593, 78148, 68929, 186838, 136384, -89614, -74295, -93357, -40707, 34524, 1784, -27738, -33148, 50587, 57104, -73112, -43472, 69371, 186977, 175520, 169634, 87485, 108479, 73072, 56868, 121676, 242542, 179752, 8531, -14276, 17171, 130187, 239238, 124459, 192169, 385928, 307540, 323602, 403381, 477131, 479370, 396770, 323170, 252647, 239774, 336978, 195092]
12724A95092k22056p3907j2932K0596O736L7602O803j07592k2063m2498J56415
12713e7804J96925O000j62615L5553L220P2750P8243k66920j77824J29532P7336
12702f5604R5786P5239m2864N5649j19363o8246j30454J8254N7824J47518m9942
12691b6203Q4655r971P8530J35919N5949j6862m8676j39255R5335J02120O42j21902
12679A90281q4322L7327P3181l5166j39423p5962J45668j9654o2502m6332K10230
12668A93326j17979o4826N6824L0829k4217K4050J04013N2898O916n6683k15551
12657a0400R2056O6504J03455j4684j75345l8275N6005l0190O2036R7562N1702
12646B60426m2774r6073j24879R9135N3252q4010p3873J1223r1111j01381J01587
$$ y = [195092, -26964, -100871, -113803, -93207, -86471, -48869, -42066, -149658, -171721, -214219, -57804, 139121, 145121, -17494, 18059, 21279, 94029, 172272, -94648, -272472, -142940, -65604, 30182, 105421, 62557, 118206, -1157, -69403, -199857, -181603, -123779, 23739, -26203, 58452, 48481, 127011, 262930, 318879, 302017, 253341, 114086, 209421, 311541, 312183, 190281, 105959, 143286, 216467, 181301, 41878, -34084, 111584, 91930, 29428, -16904, 193326, 75347, 10521, 67345, 98174, 73957, 98007, 202020, 254918, 261834, 205151, -10400, 81656, 148160, 251615, 236931, 61586, 23311, 79316, 49126, 111162, 208724, 260426, 217652, 121579, -3300, 95835, 149087, 65077, -8796, 2427, -88684, -190065, -88478]
12635h8478J25243K5723J32695o6771k53244r6279J24562J01329L6354l5750J12948
12624A18332J0279j38051j18733J15929j39286K9783K00596j5160N3501j40149
12614b2959n5330k3786j29167k5435M3761J38760K20518L0680m7540o3472K9690
12603I5720K7877P7973J7432j38656k03597N8899J26986J2688K7432M6180J04781
12592B53715J5025K2916l1841m3232j11198q2698p6540J02019K24120o7135p6984
12581A28167J40894o1233j39892Q4683L6143j42359k87428j05498K8805O4606
12571b53112J90229n0022j16218K11340N2698m7795j85458l0944n6590k1967Q7446
12560b20393L29637M3366J121q2028Q827M3921J28443J4615j79064j46523N3406
$$ y = [-88478, 36765, 62488, 195183, 128412, -124832, -221111, -96549, 4780, 41134, 5384, 118332, 128611, -9440, -128173, -12244, -151530, -121747, 78849, 63689, 117190, -22959, -78289, -102075, -231242, -256677, -212916, -74156, 146362, 177042, 129502, 66030, 95720, 123597, 201570, 219002, 80346, -123251, -64352, 62634, 75322, 102754, 148934, 253715, 268740, 291656, 259815, 216583, 105385, 22687, -53853, 48166, 272286, 205151, 128167, 269061, 207828, 67936, 152619, 188762, 46403, -241025, -346523, -317718, -253112, -62883, -112905, -229123, -17783, 34915, -12880, -198338, -229282, -285872, -307839, -220393, 109244, 152610, 153731, 71703, 80530, 124451, 252894, 267509, 88445, -58078, -4672]
12549d672J16048o0702R9878J00289j12676k56185j21176R7510J25881j50211
12539a66016N6846K2638j13075L5087J02169K07204O0741r5206j86051K7267J57922
12528A09526j6466n3524j45983p8117q122J01994J04221r5230l258P5647K40452
12517B31140k5438o2662m8132j23772J1324J84490j0256k2979J44353J61742L8323
12506D78133j00801j12334J2647m5140p8779K1786J47617J33940M562r8878j71105
12495A91648K544j06111K3471O2161o0034R4917Q7943n2533j46429o6684K2760
12484E3653k3477j7363K4233J00423n8916L3210r0228j58915O5521P0519r2080
12473i3420k2749J11642N365p8780j40891J14748R9924N0717N3532Q1257j351
$$ y = [-4672, 111376, 50674, 150552, 250841, 138165, -118020, -239196, -141686, -15805, -166016, -109170, -86532, -199607, -164520, -62351, 144853, 205594, 110388, -75663, -48396, 109526, 93060, 39536, -106447, -184564, -192686, -90692, 13529, -81701, -84959, -9312, 231140, 205702, 143040, 94908, -28864, -17540, 166950, 156694, 133715, 278068, 439810, 478133, 377332, 264998, 277645, 232505, 153726, 175512, 323129, 457069, 461631, 362753, 191648, 194192, 88081, 111552, 173713, 113679, 208596, 296539, 244006, 97577, 30893, 53653, 30176, 12813, 37046, 137469, 78553, 111763, 21535, -137380, -71859, -1340, -93420, -116169, -4527, 838, -77942, -218833, -104085, -4161, 46556, 100088, 181345, 179994]
12462A79994L1599N3321Q9408j73138j12048j83053j00004n8726Q0866l7041o4895
12451b93717K09752K5651P1004J08211J00348J81058j1573M370J2367R4855j30345
12440C71981j09271O2773j5931o2197j19371q4468O7368j9995k55750R545N5934
12429i9382p760Q6216O0203L182J55530J05374l8190n8912r7031o1922q6100k3064
12417f1856R3293K70618O7394j08488M7222K0915p1633k232j44939j14030m1524
12406d5260K502N3203k2176J12705J02144j6276n1334m7520j09236k4457o8112
12395a13817J46308K8779j94541K11454l7963j40649o2578M1835J63380J12521
12385A54729n5738K9904q090P1489L3120j21670j13635j38024Q847Q9467P8730
$$ y = [179994, 211593, 264914, 354322, 181184, 69136, -113917, -213921, -272647, -191781, -228822, -293717, -83965, -58314, 12690, 120901, 221249, 402307, 390734, 395104, 407471, 502326, 371981, 262710, 325483, 309552, 247355, 127984, 43516, 110884, 90889, -164861, -155316, -99382, -107142, -20926, 39277, 42459, 197989, 303363, 265173, 206261, 109230, 47308, -38792, -61856, 31437, 302055, 369449, 260961, 308183, 329098, 257465, 255233, 110294, -3736, -45260, -42758, 10445, -11731, 100974, 203118, 186842, 135508, 87988, -21248, -45705, -113817, 32491, 61270, -133271, 78183, 40220, -100429, -163007, -121172, 42208, 154729, 98991, 128895, 120805, 192294, 225414, 103744, -9891, -147915, -139068, -49601, 29129]
12374B9129k3419m5122j17283j04406l488j14516o6611K07395K07760k0647o6768
12363a17976M940n608l8172M9360J02910j9624K92012k8477k03529K2978O2669
12352A21483k9692k64651M1116L2282N0526J17486n911n7360O9157J34621O1177
12341B70234m8808j06060M6958J49395o776j01611j91563j8836K2490J08439P2780
12330A96642J9541k3420K17315J2954j45364J2552j03143j27374q2217n416r9571
12319a27501Q1298L2092J20554R8873L4871R8202k7426j15622r6700M8345J12487
12308B59473K4523k10050n7169J73529K00528p7218k8400p2869j51918j79838
12298a19409o3269L53775l5431j42527j23692J31j560L9576J40138Q6158m0939
$$ y = [29129, 5710, -39412, -156695, -261101, -264589, -379105, -445716, -238321, -30561, -51208, -117976, -113036, -118644, -156816, -107456, -4546, -24170, 267842, 239365, 35836, 58814, 121483, 91791, -172860, -131744, -99462, -48936, 68550, 62639, 5279, 74436, 209057, 270234, 221426, 115366, 162324, 311719, 304943, 203332, 11769, -7067, 15423, 123862, 196642, 216183, 192763, 410078, 423032, 277668, 290220, 187077, 59703, -22514, -27930, -127501, -46203, -14111, 106443, 205316, 240187, 338389, 310963, 195341, 98641, 146986, 259473, 283996, 73946, 16777, 190306, 390834, 313616, 285216, 212347, 60429, -119409, -182678, 171097, 135666, -6861, -130553, -130422, -131982, -92406, 47732, 133890, 92951]
12287I2951q5973J53543L90438m7515q0519n4245r7965k6670m5766M5865K9264
12276B73408j29502j09072J67809Q2921j43093k01016k5594j23456Q505N8845
12266a40245J7961J00431J71916r3696o4447Q1926P4083m1956r2463n4065l6943
12255g7498j2576o4398J20316O1475J34558m249j04258K23746K4135k8428K5172
12244B97995m6181l3796j86074J2558J15025J8888R9783J56052N2784j16038k75332
12233I5664j67446P4292o2084q9496l543Q2787R1293J17147N4390Q3733n8045
12222B18692j40362j24984J26685J44812m0148k65501o559l900k8894l4266J18223
12211c6202J20556P2851J54434k7883k9754k0884j3950J14962j31601k3429O5989
$$ y = [92951, 6978, 160521, 550959, 503444, 422925, 368680, 270715, 244045, 198279, 244144, 273408, 143906, 34834, 202643, 285564, 142471, -58545, -84139, -207595, -199090, -140245, -122284, -21853, 150063, 56367, -8080, 73846, 147929, 105973, 13510, -40555, -77498, -90074, -154472, -34156, 27319, 161877, 157628, 53370, 277116, 301251, 272823, 297995, 251814, 218018, 31944, 44502, 159527, 178415, 278198, 434250, 487034, 370996, 95664, -71782, 2510, -59574, -149070, -152613, -69826, 21467, 138614, 193004, 276737, 218692, 78330, -46654, 80031, 224843, 184695, -80806, -87365, -91265, -120159, -154425, -36202, 84354, 157205, 311639, 283756, 254002, 233118, 219168, 334130, 202529, 179100, 245089]
12200B45089l1898q4839j98389J49432J21771o9277o1780n9794L1365k873J55752
12189A94559R5876j79013k5180J34363Q8862J09491j34432k34183P5411K4479
12179A50233m3847r7835j0358J94953l2697M5292J38888k16022p5106L5337o043
12168H2795J48267j388k02228J41361K29703M9750k71304j50104P5312J97336
12158B99500k2523q2212k00735r4521R7071J64204P9747j00035l1191n5820j32351
12147g8866L8344J20676m2166L5461Q9819m5430K7664l9827k7635l627l7254N485
12135D2644N3518j58529k458O2841j41108j90262J31127R5171k33017j923J98615
12124a43381J44933J26526l6322R1283K18854m3196k2385k3063n2514p5651j2084
$$ y = [245089, 213191, 128352, -70037, 79395, 201166, 131889, 70109, 10315, 41680, 38807, 194559, 290435, 111422, 86242, 220605, 309467, 418958, 284526, 50343, 125754, 150233, 106386, 8551, -1807, 193146, 160449, 205741, 344629, 128607, 53501, 88838, 82795, 231062, 229674, 27446, 168807, 398510, 448260, 176956, 26852, 102164, 299500, 276977, 194765, -5970, -100491, -3420, 160784, 240531, 140496, 109305, 53485, -78866, -40522, 80154, 37988, 73449, 163268, 117838, 145502, 105675, 78040, 74413, 37159, 42644, 96162, -62367, -64825, -1984, -143092, -333354, -202227, -107056, -340073, -341996, -143381, 1552, 128078, 91756, 183039, 401893, 358697, 336312, 313249, 260735, 185084, 173000]
12113A73000l2595J8684K82371O2172j33760J52754O5267j77851m5853j37260
12103B26929r244K42356K0622k9950K702p6226o0511L3514J49636M2525r7541
12092D44812L0901J110p7714k175q0102j30006L9787q0369n9080J37600p8894
12081A45870j4982L4417J13203J48638J85115P6622n9453k5383N173J34643K12361
12070I56224J98932K28066O4496n2321k20707p1546J16550J59958L8182j47625
12060A270209Q8303L16070J43495j65496k43129l52361r0004m2349n3988K52445
12050A123195K19080K5156j49669p8753j16292n3500j37835o8607J12238P6165
12040I51178J007N2846P0258K95287l6742k13315j61795o9158R311J93787p0799
$$ y = [173000, 140405, 159089, 441460, 503632, 369872, 522626, 587893, 410042, 364189, 226929, 217685, 460041, 480663, 450713, 453415, 377189, 316678, 350192, 499828, 542353, 444812, 475713, 476823, 399109, 396934, 316832, 186826, 226613, 146244, 87164, 224764, 145870, 130888, 165305, 278508, 427146, 612261, 688883, 629430, 604047, 609220, 743863, 956224, 1155156, 1383222, 1447718, 1395397, 1174690, 1103144, 1219694, 1379652, 1417834, 1270209, 1358512, 1674582, 1818077, 1652581, 1409452, 1057091, 967087, 924738, 870750, 1123195, 1342275, 1367431, 1217762, 1139009, 1022717, 969217, 831382, 762775, 875013, 951178, 952185, 1005031, 1075289, 1370576, 1333834, 1120519, 958724, 889566, 898877, 1092664, 1021865]
12029A021865j96099M9914q6405R8533R4235J11781J32542o9933J13285J0920
12019A280638j39260j8037M8890j62647j03140o2263j7973J07702J13057L1559
12009A078526q4706p323O2577N5915J13645J20727j43779j66760Q2287j4863j72077
11998I24169K5567J31104L7459O4611J27210j6150o7889R055j1738J38090j3153
11987A348335n6472L9482J1766J60242P3468m6783K6674M6075J03554P0725Q6256
11976A863322J99130J89938J52006M6575J32781K70663J44258R9425K79551L40341
11966C717990N1678J27267J50638J04005L14734N06988L47171M27149N01658O31520
11956F880798P47561O73545P26597R73872J219298J117718J433248J766559K293236
$$ y = [1021865, 825766, 875680, 789275, 887808, 982043, 1093824, 1226366, 1156433, 1269718, 1280638, 1141378, 1123341, 1172231, 1009584, 906444, 844181, 826208, 933910, 1046967, 1078526, 993820, 986497, 1049074, 1104989, 1218634, 1339361, 1195582, 1028822, 1111109, 1096246, 924169, 949736, 1080840, 1118299, 1182910, 1310120, 1293970, 1226081, 1235136, 1223398, 1361488, 1348335, 1291863, 1331345, 1343111, 1503353, 1576821, 1530038, 1556712, 1602787, 1706341, 1777066, 1863322, 2062452, 2252390, 2404396, 2450971, 2583752, 2854415, 2998673, 3098098, 3377649, 3717990, 3769668, 3896935, 4047573, 4151578, 4466312, 4973300, 5320471, 5747620, 6249278, 6880798, 7628359, 8301904, 9028501, 10002373, 11221671, 12339389, 13772637, 15539196, 17832432]
11947A7832432L081036L834811M992855O522747Q828545J2254902J7568074K5686087
11939A00601489L6580542M7969574N2006993M4690930L4597080K6204948N464845
11932C48116401k7979271n2519746n7284212m7784012l4468355k3827963j6770683
11925H7482159j1863899q804181o848157n634667m706583l795705l395732k972423
11917C9460812k443259k286964j787260j368053j437186j200317j310103j158690
11909B6468980j056441j003023r55179o17884n31464o79874p20548n33168m90411
11900A9880988o71272n77065n14436m25546n81650n16073m30004k96552l04716
11891A5563674m94880o12298o00758n70732l08946k22615m92058l63886k66169
$$ y = [17832432, 20913468, 24748279, 29741134, 36263881, 45092426, 57347328, 74915402, 100601489, 137182031, 185151605, 237158598, 281849528, 316446608, 342651556, 348116401, 320137130, 267617384, 210333172, 162549160, 128080805, 104252842, 87482159, 75618260, 66814079, 59965922, 54331255, 49624672, 45828967, 42433235, 39460812, 37017553, 34730589, 32943329, 31575276, 30138090, 28937773, 27627670, 26468980, 25412539, 24409516, 23454337, 22836453, 22304989, 21625115, 20904567, 20371399, 19880988, 19209716, 18632651, 18118215, 17692669, 17111019, 16594946, 16164942, 15868390, 15563674, 15068794, 14456496, 13855738, 13285006, 12976060, 12753445, 12261387, 11897501, 11631332]
11882A1631332m15095m71073l54246k18634l85170k19239j13130j91748j93995
11873I069002j20595l06998l02168l02447j92991J0839k30960o2341k7458j51729
11863G382154j11412j66768l31458l42227k30045l2992q8506q2654j01257m6484
11853E848351k18908j71676j77041j25641o3782l091J24172j05034k63660j04463
11843D739227q2662j88473j70276o4843m4461n1226j93814l07299m0315N0626
11833C646484Q1891J21318M2650j07947k0764k81935j29192j1786j07708K9186
11823C262197j38029o6360J3562K40004J14557O0135j79750j26679J01003Q9759
11813C370399K12862K6685P5155O7764n6425l4033K1745l6878M435K3031J547
$$ y = [11631332, 11216237, 10745164, 10390918, 10172284, 9787114, 9567875, 9454745, 9262997, 9069002, 8948407, 8641409, 8339241, 8036794, 7843803, 7854642, 7623682, 7561341, 7533883, 7382154, 7270742, 7103974, 6772516, 6430289, 6200244, 6167252, 6078746, 5996092, 5894835, 5848351, 5629443, 5457767, 5280726, 5155085, 5091303, 5088212, 5212384, 5107350, 4843690, 4739227, 4656565, 4468092, 4297816, 4232973, 4188512, 4137286, 3943472, 3636173, 3595858, 3646484, 3728375, 3849693, 3892343, 3784396, 3763632, 3481697, 3352505, 3340719, 3233011, 3262197, 3124168, 3057808, 3071370, 3311374, 3425931, 3486066, 3306316, 3179637, 3280640, 3370399, 3583261, 3609946, 3685101, 3752865, 3696440, 3662407, 3684152, 3647274, 3651709, 3674740, 3676287]
11802C676287j41198K3369K17178J0907j10472R8638n4774k86828k29883j11833
11792C091391j04270j24018j3759j53081k57157o8851M1756j0856N1917K1166
11782B474238p1825j0250p7858j99779m0480n720J3828j5640j28228K0119j27751
11771A830654j92624o7999N2330r0663k857J02426j02485j14684J55756R8121
11761A667975j51776P1852j29270j79891j65855k1723L4335J16795Q0344j33476
11751A189310j87121J60536Q9253j56266J21224J75397R6587N7135n494J7255
11741A557816l1133k96572j71237j48019R4519J1787r8519M100L1880j0191K80358
11730A224789J36551l10278l0367L8417L8541l3400j14620j13691M1667j82999
$$ y = [3676287, 3535089, 3558458, 3775636, 3786543, 3676071, 3774709, 3719935, 3433107, 3203224, 3091391, 2987121, 2863103, 2849344, 2696263, 2439106, 2370255, 2412011, 2401155, 2453072, 2474238, 2402413, 2392163, 2314305, 2114526, 2074046, 2068326, 2082154, 2066514, 1938286, 1958405, 1830654, 1638030, 1570031, 1622361, 1531698, 1528841, 1631267, 1528782, 1414098, 1569854, 1667975, 1516199, 1588051, 1458781, 1278890, 1113035, 1091312, 1125647, 1242442, 1322786, 1189310, 1002189, 1162725, 1251978, 1095712, 1216936, 1392333, 1488920, 1546055, 1540561, 1557816, 1526683, 1230111, 1058874, 910855, 1005374, 1017161, 918642, 922742, 954622, 944431, 1224789, 1361340, 1051062, 1020695, 1059112, 1097653, 1064253, 949633, 835942, 877609, 694610]
11720F94610j926J53514p7937J25234K6756N3999j11427k7684k06385k57093j24053
11709B47608M9267J51785K39180P3066p6735p1584O0986R3060J04061j81961K2360
11698G11093j32669K3684J57661k2467j63954r8734M4927q560j20529J53561K7298
11687E71311K4655o2151K4593N6043j06516m8486j204P5414J35655j84763j02529
11676C82022n777K54465L1950R9194J3495k34849m0555J66268J84252J91159M76292
11665A517916N56939Q27718Q78744O09381M72717M25519j31471q62362q19714
11656C475387p89999p22520l85840j93617k53339j02308j31893K3250k2408k3380
11646H73333j57679j59180Q4765p7919j68770k7457J7669Q0983K04019J19772
$$ y = [694610, 692684, 846198, 768261, 893495, 920251, 974250, 862823, 835139, 628754, 371661, 247608, 296875, 448660, 687840, 760906, 684171, 612587, 673573, 766633, 870694, 688733, 711093, 578424, 602108, 759769, 737302, 573348, 474614, 519541, 510981, 390452, 544013, 571311, 595966, 533815, 558408, 614451, 507935, 459449, 458245, 533659, 669314, 484551, 382022, 376245, 630710, 662660, 761854, 775349, 540500, 499945, 666213, 850465, 1041624, 1517916, 2074855, 2902573, 3781317, 4390698, 4863415, 5288934, 5157463, 4295101, 3475387, 2685388, 1962868, 1577028, 1383411, 1130072, 1027764, 895871, 919121, 896713, 873333, 715654, 556474, 641239, 563320, 394550, 367093, 384762, 465745, 669764, 789536]
11636G89536M8252J85130L64061L38552K92666M82409P75693O11254L57231L29328
11626D574112N8851m67606r08781q82471m79747l24317k69307j78800p9389q7873
11616I54672J48274Q250k36254n0763M7124r7156J3941j4926j18194j59953n7156
11605D37859j53806J63565J31048n5404j66166O9894R4148K7382m4531j26903
11595C77086k6047J686n5865Q9775k2343J3280J56899P2053Q0509O4047j9208
11584G31872l0065j13780n4664n8692r7833K44j67496J427j3761r4350k0362L1225
11572A13765j0623p977L3590j01574o6968J91670K49907P4143j42802J02830M241
11561D40202j33009n1170p6737j17729J1609L4463M5237j924P8446K8350k34037
$$ y = [789536, 837788, 1022918, 1386979, 1725531, 2018197, 2500606, 3276299, 3887553, 4244784, 4574112, 4632963, 4165357, 3256576, 2374105, 1894358, 1570041, 1300734, 1121934, 1042545, 954672, 1102946, 1111196, 874942, 824179, 871303, 774147, 788088, 773162, 654968, 495015, 437859, 284053, 447618, 578666, 523262, 357096, 426990, 521138, 548520, 503989, 377086, 351039, 352725, 296860, 386635, 364292, 377572, 534471, 606524, 687033, 751080, 731872, 701807, 588027, 533363, 474671, 376838, 377082, 209586, 211013, 197252, 102902, 82540, 113765, 103142, 95165, 128755, 27181, -39787, 151883, 401790, 475933, 333131, 435961, 440202, 307193, 256023, 179286, 61557, 73166, 107629, 152866, 150942, 229388, 257738, 23701]
11550B3701j5007o9626j63935m3428J21217K73739K5520K231J38773j75070m4623
11539G3492J47037M5685O0222j58730r2284k1268J9609K9955J64289J28004j05107
11528B90904k75481J8147m5044Q7619J16318l0344J3255j13401k29852M1423R4505
11517c1951J31416K11406J11339j19599l49426r9877J52941l6630k3510q227N3430
11506h688J115p475K6499m7605m3116p1812k4158J38089M5257J34205m8454k32200
11494a38343l1766O2454K1468P9740k7037o507n0000J56016P8575L1211q3967
11483I1844j10522J22805O4980R9475N9334j7319k8565p2301p0118j44651J9022
11472A3984K1860j51036j4684O835m7671M6157R4063j12125p2148J02111n8852
$$ y = [23701, 8694, -60932, -224867, -268295, -147078, 126661, 152181, 154412, 293185, 118115, 73492, 220529, 266214, 326436, 167706, 75422, 54154, 73763, 103718, 268007, 396011, 290904, 15423, 33570, -11474, 76145, 192463, 162119, 175374, 61973, -167879, -126456, -31951, 99465, 310871, 422210, 302611, -46815, -146692, 6249, -30381, -53891, -62118, -8688, -7573, -15048, 11451, -36154, -79270, -151082, -175240, -37151, 8106, 142311, 93857, -138343, -170109, -107655, -86187, -6447, -33484, -39991, -89991, 66025, 144600, 175811, 91844, -18678, 104127, 169107, 268582, 327916, 310597, 282032, 209731, 139613, -5038, 13984, 35844, -115192, -129876, -123041, -170712, -124555, -30492, -142617, -214765, -112654, -171506]
11461a71506q3162M8536o7793n1940Q1815L21712k8052j530j09566J32466o3828
11450G152j71196Q0513K8659q2454p093j6377Q8839K47594J89405r828k32144
11439A23070j67782J6977J43359n7404o958M1040O1470P6048R6552L5659k82980
11428G9051l3083k7882p3850l2026J557L8139L2505Q533n2945J6019J70249J11141
11416B37408o4726k24388J66073J00454n647r9665J18296J40139J1390j44455
11406B34879j34644k72697j4017J03048R824l5350J07552Q8184r8482n6878J39567
11395G0986K9147Q5199k4310M9933o6553l8693J2139o7361R7089j09599J07729
11384A45706R8894l7833L9370k2226R324J10764n9863l3021J09231R3649o8387
$$ y = [-171506, -254668, -206132, -273925, -325865, -244050, 77662, 49610, 48080, -61486, 70980, 7152, -164044, -83531, -54872, -137326, -144419, -160796, -71957, 175637, 365042, 355214, 123070, -44712, -27735, 115624, 58220, 51262, 92302, 153772, 229820, 326372, 362031, 79051, 45968, 18086, -55764, -87790, -86233, -48094, -15589, -7056, -60001, -43982, 126267, 237408, 172682, -51706, 114367, 214821, 209174, 109509, 227805, 367944, 379334, 234879, 100235, -172462, -186479, -83431, -73607, -108957, -1405, 86779, -11703, -68581, 70986, 100133, 185332, 161022, 210955, 144402, 105709, 117848, 50487, 147576, 37977, 145706, 244600, 206767, 246137, 223911, 233235, 343999, 284136, 251115, 360346, 453995, 385608]
11373C85608l12732j33200r2771m3730O681m4286J11601N4501K8502m8148l3590
11362a21564O575j6820O0897n047L1871J09578j44855J12508J25823N7248r9459
11351A16755r3239j16879O3219m0711R0877q1434p4446M3633J89371Q2465M075
11340A83686O0951r6248j99557J82082J15048j11418k40528p7333J0642K37450
11330F4775Q5428O7478j03422l0749p5452k2108K5341J65121l9717O6639r6938
11319A06396q4396m0301M9071j72602N4132L00486r309j54750j41420R528j00466
11308a83631J26119K5925M285R7649Q3555l8099l8900l8249m9869j1631q7011
11297a09857K2391n0589j6705J07935M7580N0567J89013R5162j09508p4728j37767
$$ y = [385608, 72876, -60324, -153095, -196825, -190144, -234430, -122829, -68328, -39826, -87974, -121564, -114989, -131809, -70912, -75959, -44088, 65490, -79365, 33143, 158966, 216214, 116755, 23516, -93363, -30144, -70855, 20022, -61412, -135858, -92225, 97146, 179611, 183686, 244637, 148389, -51168, 130914, 245962, 134544, -105984, -183317, -172675, 64775, 150203, 217681, 114259, 83510, 8058, -14050, 11291, 176412, 136695, 203334, 106396, 22000, -18301, 30770, -141832, -87700, 212786, 203477, 48727, -92693, -83165, -183631, -57512, -31587, -27302, 70347, 153902, 115803, 76903, 38654, -11215, -22846, -109857, -87466, -138055, -154760, -46825, 755, 51322, 240335, 335497, 225989, 151261, 13494]
11286A3494N5049K72491K12816M8434k32209k31387l9447Q3717L4541M3520j00498
11275A60521o8933R268j1206j45273J49324K91831p280j48106O15J8871l4154
11264B15478J08550M9600j00852q300k91405k02474m584K08172J25470K68959
11254C68614K7355j12198j32948R8591P3428l10204n1710J64453K5840q6669j09319
11243d4767n6923R3059J09151O8481m9923j26159J31169l4240j15963l0O2349
11232C6204J75441N5291q9718L9187j45688K5355P5154j041k650j00018K16979
11221B84496p509j67004O9235l9720k42529o7152m4649P435K08431N4692r9420
11210d3694K1967o6281l0446o8285O2635K6814O1591N2164j07833j37622K38800
$$ y = [13494, 68543, 341034, 553850, 602284, 370075, 138688, 99241, 182958, 217499, 261019, 160521, 91588, 100856, 89650, -55623, 93701, 385532, 378252, 230146, 230761, 249632, 215478, 324028, 373628, 272776, 264476, -26929, -229403, -233987, -25815, 99655, 368614, 395969, 283771, 150823, 249414, 322842, 12638, -39072, 125381, 151221, 64552, -44767, -101690, -8631, 100520, 169001, 119078, -7081, 124088, 89848, -26115, -26145, 36204, 211645, 266936, 177218, 216405, 70717, 96072, 171226, 170185, 167535, 67517, 284496, 276987, 109983, 179218, 139498, -103031, -170183, -214832, -207397, 1034, 55726, -43694, -21727, -88008, -118454, -186739, -124104, -97290, -35699, 16465, -91368, -228990, 9810]
11199I810J36040o5778j00487k9986J20311J40828J46323j55219p9671j8452J16833
11188B20552K8562j1472q0740N442j15944J04841N6307l1411K0282L619j47738
11177E2300j78636o9686P8617J12404J47171j09323k5911J34332n5838L6824N774
11166A28028m9666q8318O8207J4950N0103P4933K1327n1037r4726q5840P8935
11155F6896Q2234J22443J97678P4791j67653k90379p4143Q1697J4250L3692K8281
11144A69787q2275N0162J05419m4845P488j12172j8889M6215P918N2760m925O9051
11132B45694l2589L0223k50607j99208J41584P2959L9745N4711K2329J81566J34110
11121D40517j41803j12005j2369J12366r8581j72727j23994k9378r1184J18618
$$ y = [9810, 145850, 80072, -20415, -50401, 69910, 210738, 357061, 201842, 122171, 103719, 220552, 249114, 237642, 156902, 162344, 46400, 151241, 207548, 176137, 196419, 200038, 52300, -126336, -196022, -117405, -5001, 142170, 32847, 6936, 141268, 85430, 122254, 128028, 78362, -9956, 58251, 73201, 123304, 198237, 219564, 168527, 73801, -12039, 66896, 149130, 271573, 469251, 544042, 376389, 86010, 11867, 93564, 107814, 141506, 169787, 87512, 137674, 243093, 198248, 205736, 93564, 74675, 120890, 128808, 181568, 176643, 245694, 213105, 243328, -7279, -206487, -64903, 8056, 47801, 102512, 124841, 306407, 440517, 298714, 186709, 174340, 286706, 188125, 15398, -108596, -137974, -229158, -110540]
11111a10540j9273r8693j5924m7737N9113J38141o4764k2832Q1862J51099Q1412
11100A31864Q0914m6107j56516J08842Q7027k68315n4529J92750O4592k6857Q4878
11089A98543p9897j70079l758j5158l4887M5752Q720m5320q6800p8418Q7616J44550
11077b9136Q9149j8464M8968O5127M0715j30245j24992O6540m0747k3239M2n2151
11065a08433Q4123J40405R1830n8568L3946Q6281n4337J7250n1756p4930J4888
11054A20699j20717k21175m943K18625K00803M1102J7871K6049J67719l6393j65744
11043B43896K2417N1947k3118J17603J65689J91444j79872j57361P3758P7489
11033E83892K34590R9114J49133L84752M54992J87689M5585J62318K76721Q9449
$$ y = [-110540, -129813, -228506, -244430, -292167, -233054, -94913, -159677, -182509, -100647, 50452, 131864, 212778, 166671, 10155, 118997, 206024, -62291, -116820, 75930, 140522, 113665, 198543, 118646, -51433, -55191, -70349, -105236, -59484, -50764, -96084, -182884, -261302, -173686, -29136, 60013, 41549, 90517, 155644, 196359, 66114, -58878, 7662, -33085, -56324, -56282, -108433, -24310, 116095, 207925, 149357, 183303, 269584, 215247, 232497, 180741, 105811, 120699, -18, -221193, -226136, -7511, 193292, 234394, 252265, 278314, 446033, 409640, 243896, 266313, 318260, 295142, 412745, 578434, 769878, 590006, 432645, 506403, 583892, 818482, 917596, 1066729, 1451481, 1906473, 2094162, 2139747, 2302065, 2578786, 2668235]
11023B668235K4756j31653l18615k36902j71020l3994P3918J69786k9651P2144
11013B087004j11719j06546M7941j81507k11206k5872J52953r6244j40691n5790
11003A358323m8135K63112P4205k33255k19441k30251N5797j0304P3391Q5540
10993A168982k7782N0153k08650j0827k742j08348M3202r2095q5201j5462m3660
10982F67570j5384j54623q774q0820k4190M5507J36128J5769L911j68402j1614
10971D05078m8008j34896o7583o7572N7245O5243J19172R312k7230K24095R0654
10960F25510j20321k11559l3882M3317k4989R3011k4251j12030M842P509J00092
10949C47249N5895j06639j12490q9517j2005j26507k4479l2145j04049k37756
$$ y = [2668235, 2692991, 2561338, 2242723, 2005821, 1834801, 1800807, 1874725, 2044511, 2014860, 2087004, 1975285, 1868739, 1916680, 1735173, 1523967, 1498095, 1651048, 1554804, 1414113, 1358323, 1310188, 1573300, 1647505, 1414250, 1194809, 964558, 1020355, 1010051, 1083442, 1168982, 1141200, 1191353, 982703, 971876, 969134, 860786, 903988, 811893, 726692, 711230, 667570, 652186, 497563, 488789, 407969, 383779, 429286, 565414, 581183, 585094, 416692, 405078, 357070, 222174, 154591, 87019, 144264, 209507, 328679, 337991, 310761, 534856, 625510, 505189, 293630, 259748, 303065, 278076, 371087, 346836, 234806, 239648, 247157, 347249, 403144, 296505, 184015, 94498, 82493, -44014, -68493, -100638, -204687, -442443]
10939d42443j95845J55209K57282J99113J40328J67452O0114j93935j43116m3807
10929c9648n119m2640P4434J68974m2423p6181o9505J02617R2856j7374J09456
10918B55447m7905j13293q7560J04145J70818J30748r0393N777j1811k04417k557
10907A08999P9789m392m6597J7420N2469j43358j7544j31481p0814Q9636O4911
10896i62J52260J50013n8071j74559r7129j15424o2935P2345K12152M0997j45170
10885b6483o3550J60298O1159k5640l5138P5213N0188k5301l948J27384J1504
10874C05686l4434p4139p1448Q8676J9062L5941M1963o4571j29270k0654J48361
10863B45173P6656j2632M7632L0516j16661m4947j3846n4578Q764j02635O516
$$ y = [-442443, -638288, -483079, -225797, -26684, 113644, 281096, 341210, 147275, 4159, -39648, -44767, -87407, -12973, 156001, 113578, 37397, -32108, 70509, 163365, 145991, 255447, 207542, 94249, 6689, 110834, 281652, 412400, 322007, 327784, 315973, 111556, 108999, 188788, 184396, 137799, 155219, 207688, 64330, 46786, -84695, -155509, -65873, -962, 151298, 301311, 243240, 68681, -28448, -143872, -206807, -134462, 77690, 118687, -26483, -90033, 70265, 131424, 105784, 70646, 145859, 196047, 170746, 166798, 294182, 305686, 271252, 197113, 125665, 214341, 233403, 269344, 311307, 246736, 117466, 96812, 245173, 321829, 309197, 356829, 387345, 270684, 225737, 211891, 157313, 166077, 63442, 69958]
10852F9958R2664J30984J56271p4302l0965N747j33960K323M824Q4661K01850
10841E10055p8449j37332J62976J45856J94236j23618j95861J3915J52860N0074
10831F94712j59056j80665r9289j149j03932r6866O0471R3825Q9653J9761m1261
10820B76204P961k7173J45937K48808k8597p6101k116j68583j08572p53P22P3373
10808C41110K2374q7943k12768j68335N6961k2693J0735J00401P1734P8985N6440
10797B47001J34062n4117p2684n0712o54k8464j66143j65397k8718O1435K8095
10786i6296o1582j6677J13022j28535l4677j5392M5971q932P9185J16720n5381
10775f2574j04621j23295J45921L2567o4219J62049N5852R1248J46385M2634j26965
$$ y = [69958, 162622, 293606, 449877, 375575, 344610, 350357, 216397, 218720, 223544, 308205, 510055, 431606, 294274, 457250, 603106, 797342, 673724, 477863, 491778, 644638, 694712, 535656, 354991, 255702, 254553, 150621, 53755, 114226, 208051, 297704, 317465, 276204, 284165, 256992, 402929, 651737, 623140, 547039, 544923, 376340, 267768, 267015, 267737, 341110, 363484, 275541, 62773, -105562, -48601, -71294, -60559, 39842, 111576, 190561, 247001, 381063, 326946, 254262, 203550, 202896, 174432, 8289, -157108, -185826, -124391, -96296, -157878, -174555, -61533, -190068, -224745, -240137, -194166, -203098, -123913, -7193, -62574, -167195, -290490, -144569, -112002, -176221, -14172, 41680, 132928, 279313, 321947, 194982]
10764A94982j51089o9085Q5643M6626j21448J51407K59592k444k95422k06252
10754a07490K99653P0307j09441J6390Q5263R1388J35473M1562P1045J33587o469
10743G21268r9743o8495N5936J50538P4369J41918K351j07022j00879R6309K13705
10732A080255m1643P4392m2345l3984R4023J89946K788M6324J06328J50557J02468
10721A729109J12511K35986J13837p7200r3469n3299j664j22079l3226Q9298Q1311
10710A981115J20139K64385K8584j53869M2523l5959j87729r3727j6452k8672
10700A920338O1935K40218J6289k1927m2145O4174J12422m3294p9289o2769k96690
10689A869262k5453O8906J0771J26446P6227P301P5281L855l1191p8145j67608
$$ y = [194982, 43893, -25192, 60451, 107077, -14371, 137036, 396628, 394184, 98762, -107490, 192163, 262470, 153029, 169419, 254682, 346070, 481543, 523105, 594150, 727737, 721268, 621525, 553030, 608966, 759504, 833873, 975791, 978142, 871120, 770241, 866550, 1080255, 1038612, 1113004, 1070659, 1036675, 1130698, 1320644, 1323432, 1369756, 1476084, 1626641, 1729109, 1841620, 2077606, 2191443, 2114243, 2020774, 1967475, 1965811, 1843732, 1810506, 1899804, 1981115, 2101254, 2365639, 2394223, 2240354, 2282877, 2246918, 2059189, 1965462, 1949010, 1920338, 1982273, 2222491, 2238780, 2216853, 2174708, 2238882, 2351304, 2308010, 2228721, 2165952, 1869262, 1843809, 1912715, 1923486, 2049932, 2126159, 2133460, 2208741, 2212596, 2181405, 2103260, 1935652]
10678A935652N289J93069j059k46948l9017k08465J4681J45089N503o8271j83696
10667A551827j43925J0850O4433J05027J06383L6429m5917P3748j3871j15865
10657A629119R0054r8663l9173J27204K21196R0896j62409m711J07061K13195
10647B173769K68206J44341R4059K77595N01845J38866J28040l2012K0746j53147
10637C562308l50510J42025N4373J3610K05006L85539L95591N83310N24879N82326
10627F098457Q11540Q30263Q67091P69801N83951P28383P04705O85146J006889
10618A3086226J226456J761066K616538L740128M908061O399547Q019308R784507
10610E1541837J0958233J0470103R648338Q199544N887570K889081L78365J88812
$$ y = [1935652, 1940941, 2134010, 2132951, 1886003, 1846986, 1638521, 1653202, 1798291, 1803794, 1735523, 1551827, 1407902, 1418752, 1483185, 1588212, 1694595, 1731024, 1685107, 1758855, 1744984, 1629119, 1719173, 1620510, 1581337, 1708541, 1929737, 2020633, 1858224, 1853513, 1960574, 2173769, 2441975, 2586316, 2680375, 2957970, 3459815, 3598681, 3726721, 3694709, 3715455, 3562308, 3211798, 3353823, 3408196, 3421806, 3626812, 4012351, 4407942, 4991252, 5516131, 6098457, 6909997, 7740260, 8607351, 9377152, 9961103, 10689486, 11394191, 12079337, 13086226, 14312682, 16073748, 18690286, 22430414, 27338475, 33738022, 41757330, 51541837, 62500070, 72970173, 82618511, 90818055, 96705625, 99594706, 99973071, 100161883]
10602A00161883K175307O295042J1513410J6420450J9024620J8681982J6501749
10595A90774443J3007323O596361j948639q181255r196378m948033K889015J1811873
10587B00804710J9456698K3085239K1613320J7382723J1110076N02391j2632720
10580B81322437k2140283k3792992j8801518j0422205j570548N408779Q725643
10573B18729313Q284372N496096R77720o359777j4907954k0504844k0682119j6550769
10565A54482038j1005074n970774k199934m38232k91258j356508l458918o695214
10557A23066126r911641j1842819j1952953j0654764q582257o700806n205752
10550E8215134m262998l338037k870480k365635k050459j867912j842365j398090
$$ y = [100161883, 102337190, 108632232, 120145642, 136566092, 155590712, 174272694, 190774443, 203781766, 210378127, 208429488, 200248233, 191051855, 186103822, 188992837, 200804710, 220261408, 243346647, 264959967, 282342690, 293452766, 293955157, 281322437, 259182154, 235389162, 216587644, 206165439, 204594891, 210003670, 218729313, 227013685, 232509781, 233487501, 227127724, 212219770, 191714926, 171032807, 154482038, 143476964, 137506190, 135306256, 134868024, 134576766, 133220258, 129761340, 123066126, 113154485, 101311666, 89358713, 78703949, 70121692, 63420886, 58215134, 53952136, 50614099, 47743619, 45377984, 43327525, 41459613, 39617248, 38219158]
10542C8219158j370818j317614j230033j154453r70521j012377r91379r20955
10534B9251008r35815p40682o46618p11692p31137m73602n75210n78999o07698
10525B3249555p08974o65142n02036o71516o63586n11733m57135l33110m92217
10516A8244106m45869k33585l30417l39929m27557m82795m69137l41280k14443
10507A4959094j72708k51638l72876k32178m18429o20685l77483j72381k78185
10498A2062531j03851o7233j53408k09195m14022k96897j45174k23513j81472
10489A0267766l17428j03160j09799k85728l25480n7205J09809p5830j38715j13361
10479H850869n1521j57081j75854r9841O2121K4245k38064k30038j15871q1093
$$ y = [38219158, 36848340, 35530726, 34300693, 33146240, 32175719, 31163342, 30171963, 29251008, 28315193, 27574511, 26927893, 26216201, 25485064, 25011462, 24436252, 23857253, 23249555, 22540581, 21875439, 21373403, 20701887, 20038301, 19526568, 19069433, 18736323, 18244106, 17798237, 17564652, 17234235, 16894306, 16466749, 15983954, 15514817, 15173537, 14959094, 14786386, 14534748, 14161872, 13929694, 13511265, 12890580, 12513097, 12340716, 12062531, 11958680, 11891447, 11738039, 11528844, 11114822, 10817925, 10672751, 10449238, 10267766, 9950338, 9847178, 9737379, 9451651, 9126171, 9068966, 9178775, 9102945, 8964230, 8850869, 8799348, 8642267, 8466413, 8366572, 8428693, 8452938, 8214874, 7984836, 7868965, 7787872]
10469G787872Q8565J53648n0930k05764n7496K3714R0212J19080j4556p6974K24519
10458H081890M5561j18706l19292j55148k15649j28823K45304q3742p1997K474
10448G281872P0317K0981j90964j75655j82847K4673K9656L8897j95438j23477
10438F598015O5089J3773k11742j47884k68518j24174j63698r4846p8448q4413
10428E503154m5350j84303j69759k95432j55668j0728j24006j63663k1902k720
10418D329623p9044q221K3409l9723j97458k49690r7351j25789q2061J38893L1854
10407C644442p9554r1646r4503K6775j91220r8799j00076j09381J8428N5032r9604
10396B879894j07063L0615M387j42582l4554N5254R3629R3406R1479j46971j47290
$$ y = [7787872, 7876437, 8030085, 7979155, 7773391, 7715895, 7739609, 7829821, 7948901, 7934345, 7857371, 8081890, 8127451, 8008745, 7689453, 7534305, 7318656, 7189833, 7435137, 7351395, 7279398, 7281872, 7352189, 7373170, 7182206, 7006551, 6823704, 6848377, 6878033, 6916930, 6721492, 6598015, 6663104, 6676877, 6465135, 6317251, 6048733, 5924559, 5760861, 5666015, 5587567, 5503154, 5457804, 5273501, 5103742, 4808310, 4652642, 4641914, 4517908, 4354245, 4332343, 4329623, 4250579, 4242358, 4265767, 4226044, 4028586, 3778896, 3681545, 3555756, 3473695, 3612588, 3644442, 3564888, 3473242, 3378739, 3405514, 3214294, 3115495, 3015419, 2906038, 2924466, 2979498, 2879894, 2772831, 2803446, 2807833, 2665251, 2630697, 2685951, 2779580, 2872986, 2964465, 2817494, 2670204]
10385B670204j91578r2819N4136L1341m702q4359n5621k339k53663j73847J24472
10374B021225K5688j23696M7875K43045p7158j13225n2199R9644J20534k08234
10364A983499k00757p1717l9734j12905k13334Q5088J31714k3327j19521P4323
10354A493329j12430J6564K7186J2480p4351p7439p4315m615J52089O2583l3364
10343A387717k4957l0928Q2879J11388L8953j9160j69742n9624l9963N3155N6951
10332A386669j39663l4370O090j69966m681m9339r6753J86257L1213j2179R365
10321A112643o3515o6910J81844m3710k85628o5040m0157m1651m80N5247Q5288
10310H27931k650p8921n6437K3389o5348o9570o2675l660q839J43448K40484J32352
$$ y = [2670204, 2478626, 2385807, 2439943, 2471284, 2466582, 2382223, 2326602, 2324263, 2070600, 1896753, 2021225, 2046913, 1923217, 1971092, 2214137, 2136979, 2023754, 1971555, 2071199, 2191733, 1983499, 1782742, 1711025, 1671291, 1558386, 1345052, 1430140, 1561854, 1538527, 1419006, 1493329, 1380899, 1397463, 1424649, 1437129, 1362778, 1285339, 1211024, 1206409, 1358498, 1421081, 1387717, 1362760, 1331832, 1414711, 1526099, 1565052, 1545892, 1376150, 1316526, 1276563, 1329718, 1386669, 1247006, 1212636, 1218726, 1048760, 1044079, 994740, 897987, 1084244, 1115457, 1103278, 1112643, 1049128, 982218, 1164062, 1120352, 834724, 769684, 729527, 687876, 687396, 742643, 827931, 825281, 746360, 689923, 713312, 647964, 578394, 515719, 512059, 503220, 646668, 887152, 1019504]
10298A019504m526j58855j90067j49335p3740J69664J38029J768j84118j45814
10288D22510J17009K3432L7207L3724j09336Q9904K8015k12168r4321q3831l5448
10277B16697j9917p6562J12821J91116P5275K2367o0450r6842r1416n3624q5531
10266A33934J43832M3177K2710P0331O0882j19556o5638j86602J26729Q9100m1255
10255B77644k1947m4430q2741l882K3101J08845R6103p1889J46943J34932j55012
10244D07667j82240l38812q0881N7318P4737Q1264P6568q9465R1671J70425P7493
10233C45745P7736Q12k2946l2783J17359J12238l7465j13794o0791J95103L5962
10222F17176k04337j23691j9249p1501J59432m2598k48737p1405N1403N8396R0788
$$ y = [1019504, 1014978, 856123, 666056, 516721, 442981, 612645, 750674, 752442, 568324, 422510, 539519, 562951, 600158, 633882, 524546, 614450, 642465, 430297, 335976, 252145, 216697, 196780, 120218, 233039, 424155, 499430, 521797, 461347, 364505, 273089, 219465, 133934, 277766, 320943, 343653, 413984, 474866, 355310, 289672, 103070, 229799, 318899, 277644, 255697, 211267, 128526, 124644, 147745, 256590, 352693, 280804, 427747, 562679, 407667, 225427, -113385, -194266, -136948, -62211, 19053, 95621, 6156, 97827, 268252, 345745, 423481, 424293, 401347, 368564, 485923, 598161, 560696, 446902, 386111, 581214, 617176, 412839, 289148, 269899, 198398, 357830, 315232, 66495, -4910, 46493, 104889, 195677]
10211A95677J51894P5652o9374j38410j31175q6014k2528N9444O8448M9343j04331
10200D8626r9907j9776P0563J74485K3188j23659Q4481J76409P2126k0816n082
10189C80638j05867j88652l7260j630r3774J2006P5697J32380Q1945J64107o959
10178D12631j29540J9576L2343m4072K72163J51215k9646m3561k28825P9417j1164
10167D80537P6761K940O7075K1562J81621O4770q1618n5250J32586J97517O6774
10156A155275J17777K7317L5588L6155N3527M3834K374J32628J04237J08136Q3341
10145A900189p9972j63199j05123j97611O333J205J7496n677j25177o6397M0912
10134A222979P8728L8179p1857k40338k09490n8820o5755R9471O731p9371j7558
$$ y = [195677, 347571, 423223, 353849, 215439, 84264, -1750, -24278, 35166, 103614, 152957, 48626, -51281, -71057, -494, 173991, 197179, 73520, 158001, 334410, 406536, 385720, 380638, 274771, 86119, 48859, 47229, -46545, -34539, 41158, 173538, 255483, 419590, 412631, 283091, 302667, 335010, 290938, 563101, 714316, 684670, 641109, 412284, 491701, 480537, 557298, 560238, 627313, 648875, 830496, 895266, 813648, 758398, 890984, 1088501, 1155275, 1273052, 1300369, 1335957, 1372112, 1425639, 1469473, 1471847, 1604475, 1708712, 1816848, 1900189, 1820217, 1657018, 1551895, 1354284, 1360617, 1361822, 1379318, 1373641, 1248464, 1182067, 1222979, 1301707, 1339886, 1268029, 1027691, 818201, 759381, 693626, 793097, 799828, 720457, 702899]
10123G02899Q1712J85309Q5662k65090p7922m7030l3556N0870N57j17953k49189
10112C16269j72748N619j1929p32p9858N6296J36883k0804J684J52549J3626r62
10100C95893q6258j38744J55439K5158p7715M2099J43817l3775M0939L2461N3492
10089E52806q4981j08997j22380j93719n6293L0621J15588J71469N078j3093k01527
10078I4572J36983J88442n4295k3306j9429j84350n0048j35360n5799J09213J16508
10067A23131O3082K11094O6446k41231r6288L1824Q7992j5286j39484o9692r091
10056A2497l7801m1781n7335j10232m2188o7656L6653J75336M094N459J73626
10045E0672j08708N0760Q7810N1189M5558J29883j23473k60511K7148j7925P54
$$ y = [702899, 784611, 969920, 1055582, 790492, 712570, 665540, 631984, 682854, 683411, 565458, 316269, 143521, 149140, 137211, 136479, 56621, 112917, 249800, 228996, 230680, 383229, 396855, 395893, 309635, 170891, 326330, 351488, 273773, 315872, 459689, 425914, 466853, 499314, 552806, 467825, 358828, 236448, 42729, -13564, 17057, 132645, 304114, 309192, 296099, 94572, 231555, 419997, 365702, 342396, 322967, 138617, 88569, -46791, -102590, 6623, 123131, 186213, 397307, 463753, 222522, 126234, 158058, 246050, 230764, 91280, 21588, 12497, -25304, -67085, -124420, -234652, -276840, -344496, -307843, -132507, -128413, -122954, 50672, -58036, -7276, 80534, 131723, 177281, 307164, 183691, -76820, -49672, -67597, -66843]
10034f6843n9781j42567J74686L15748J3959L2280L3433j58701k09607M6321P8936
10023E7864J84501O8622j0041j91492j70630j0746k4112n975N314J06186m5010
10012c5519p58Q6356J07123j18250j65306j00612r7693L1617K92853P4217J25087
10001A99115k2571O8024J7518l3943j22651j20584Q816O7825m0849k29406J34037
9990g4669J55668M8067j4226P967O9403l3317J54835M8315m1271J17161k815l06824
9978A28294j53871j16787K8594J7396m650Q2776j64776k3527J0950K82255J49190
9967B35844p2269m4408j74720j32735K9152N8984n6009j4639P3624k0660o5617
9956a83453R7260L7564j90374j78078l750J70623l0162j28814J40669J13872p0696
$$ y = [-66843, -126624, -269191, -94505, 221243, 235202, 267482, 300915, 142214, -67393, -21072, 57864, 242365, 310987, 300946, 109454, -61176, -71922, -96034, -102009, -96695, 9491, -35519, -36277, 50079, 157202, 38952, -126354, -226966, -324659, -293042, -189, 74028, 199115, 176544, 244568, 262086, 228143, 105492, -15092, -6276, 61549, 20700, -208706, -74669, 80999, 129066, 114840, 122807, 192210, 158893, 313728, 362043, 320772, 437933, 435118, 128294, -25577, -142364, -113770, -96374, -101024, -18248, -183024, -206551, -195601, 86654, 235844, 163575, 119167, -55553, -188288, -159136, -100152, -156161, -170800, -97176, -117836, -183453, -86193, -48629, -239003, -417081, -420831, -250208, -280370, -409184, -268515, -154643, -225339]
9945b25339l0269K53624k7164L1355O384j54536o7859J17415J6202q1223q4519
9934b45929Q2246O1444J0163j12678J24311n940K5763P6754j02503L0484O0081
9923D196L23675K84753J25961J61317K5851J97456K7001k34274l96909k7670J17197
9912F08554r0418n3838j07309L4788p0507q2600M6386j36149j35848n9519p7291
9901a23751l7022K32386O5625K42489L5467j58889o9655J6068N5160n7591p8917
9890A21370J0734l0897L8442m1409j09999N2011M5008N266j31579j09956l2366
9879a83375j9085p2158J26516J21943O4323r5688r4189J2261J21746N2272J52496
9868A87062J47612M1357j2385j54524k806o0476o7497j14221l5141J34653o6886
$$ y = [-225339, -255608, -1984, -29148, 2207, 8591, -145945, -213804, -96389, -80187, -161410, -245929, -163683, -102239, -92076, -204754, -80443, -86383, -60620, 16134, -86369, -55885, 4196, 327871, 612624, 738585, 899902, 925753, 1123209, 1150210, 915936, 519027, 491357, 608554, 518136, 464298, 356989, 391777, 321270, 238670, 285056, 148907, 13059, -46460, -123751, -160773, 71613, 137238, 379727, 415194, 256305, 186650, 202718, 257878, 200287, 121370, 132104, 101207, 139649, 98240, -11759, 40252, 85260, 90526, -41053, -151009, -183375, -202460, -274618, -148102, -26159, 38164, -57524, -151713, -139452, -17706, 34566, 187062, 334674, 376031, 363646, 209122, 206316, 145840, 78343, -35878, -71019, 63634, -3252]
9857c252n5597J41117p524m3089q2002O2442K1830j23518l4631k430K25816M824
9845A03986l7976O7166p2956j17352m1456j46118K4772Q8213J27930J01497J2705
9834A10411j827J95460N2498r2416j14534j9211J25020j04460k96896j14978J69371
9823i1562K5351k38375O646J53240J36195J47473J4820q5441j24953l04609M9474
9812c11741K07600j84338j0676J88628K87961J24278k24643J424M7280p5057Q9299
9801A40015q2097J22241k7253j61743n8949J31756K0091p1700N3157n8200k12623
9790b05305j04044K5403J89113l9056q6353Q1135K7729N3153o232j59453q605
9779b32515K7200P3329R190J19831K65969O9038j23327r0751J19317r2207L8711
$$ y = [-3252, -58849, 82268, 74744, 31655, -50347, 12095, 33925, -89593, -124224, -126654, 99162, 103986, 66010, 133176, 60220, -57132, -98588, -244706, -219934, -131721, -3791, 97706, 110411, 108584, 304044, 356542, 264126, 149592, 130381, 255401, 150941, -145955, -260933, -91562, -66211, -304586, -297940, -144700, -8505, 138968, 153788, 68347, -56606, -361215, -311741, -104141, -288479, -299155, -110527, 177434, 301712, 77069, 78493, 125773, 50716, 140015, 57918, 180159, 152906, -8837, -67786, 63970, 84061, 12361, 65518, 7318, -205305, -309349, -283946, -94833, -133889, -220242, -139107, -111378, -58225, -64457, -223910, -232515, -205315, -131986, -122796, -2965, 263004, 332042, 208715, 117964, 237281, 145074, 183785]
9768A83785J71302k9587l67255o2710J61497J42011p7839j05270q9148r3164O5426
9757a00952J96573J23679k6486o8050j59715O9842J04036J43776k53215j14094
9747h4606K8565L858R5740L4134Q219J28477l1252p0504p8130j13527o4814R3507
9735e0333K03504J4949j29096N8073M665j090j2629k0645J96035L0184p7438M990
9723B21169p1223k6561R7678l31j38960q9863L0854O3871J07758j914o5781k24994
9711i8297m0080K09057Q2708M0173J50499j13094k35708m1655L7674j25556M7065
9700h7214J37693r0624q8739L7932k0313j12100k24806M5108Q4511N2481R6012
9689a70059J52071J5026k22852m3606N0924j6333Q9880K00375K243M913j7823
$$ y = [183785, 355087, 325500, -41755, -104465, 57032, 199043, 121204, 15934, -73214, -166378, -100952, 95621, 219300, 192814, 124764, -34951, 34891, 138927, 282703, 29488, -84606, -56041, -52183, 43557, 77691, 85910, 214387, 183135, 112631, 34501, -79026, -143840, -50333, 153171, 168120, 39024, 97097, 101762, 100672, 88043, 67398, 263433, 293617, 216179, 221169, 149946, 123385, 221063, 220732, 81772, -8091, 22763, 86634, 194392, 192478, 126697, -98297, -138377, 70680, 153388, 193561, 344060, 230966, -4742, -46397, -8723, -134279, -87214, 50479, -40145, -128884, -90952, -111265, -223365, -448171, -403063, -318552, -266071, -170059, -17988, -2962, -225814, -269420, -218496, -234829, -144949, 55426, 57669, 62582, 44759]
9678D4759N4748R052m9039j7360r7346N2192j65364K1399M6906R9233J89943J31399
9666C20522M0755k58076k09478R0891K36479l2678j32194j31147J07960Q817k85228
9655b43377O376Q1915L40164K58092J70498R1981J78609J15819j90961l00224
9645E08892k85089k09949j03943l1251M8224K2846m2236n1834n5274k5167N5400
9634a69381n5830Q248O9819L0612K01801J25829O9941j07609j23865J16764R1315
9623B57644j54962m3035M150k7849R0175l3178k4980l6050L4752l6260k4733m5000
9611c9326j85726J66645J15672P5954N2322m2418n8367O8374J7705n4966O6185
9600A82054l9281p569k4837Q7361L0880n4362p8155o9766n5783j8905J16143P865
$$ y = [44759, 99507, 108559, 59520, 42160, -55186, -2994, -168358, -146959, -100053, -820, 189123, 320522, 361277, 103201, -106277, -15386, 221093, 188415, 56221, -74926, 33034, 41851, -243377, -237001, -155086, 185078, 443170, 613668, 705649, 884258, 1000077, 809116, 508892, 223803, 13854, -90089, -121340, -73116, -50270, -92506, -144340, -199614, -224781, -169381, -225211, -216963, -147144, -116532, 85269, 211098, 281039, 173430, 49565, 166329, 257644, 102682, 59647, 63797, 35948, 126123, 92945, 67965, 31915, 66667, 30407, 5674, -39326, -225052, -58407, 57265, 133219, 185541, 143123, 84756, 153130, 170835, 115869, 182054, 142773, 135204, 110367, 197728, 228608, 174246, 96091, 26325, -29458, -48363, 67780, 75645]
9588G5645j40407r6181J04155J36344k2104m0143m1843o6851M485R5874O4939
9577G3913N3898j49306J5470L319M5391l7442n0428N2306N9343j8543j7096q4095
9565e3270m0272j8866L1272O807J06031J39066j21645j91132J49934O4069k5829
9554D6165J5886M1662P220M5282j5826j93282K2375l0276Q713J06876O2086L4527
9542A51408M5666k5716j24231p9382O1459K69268K26005l229j35781j83499O3420
9531B65388O5545l7536q6409o8784K5971M8549r6866k5103m3948n9801J5645j30292
9519a27641J26558R2990j46284q7546j07424J3119J57771j0964m5114j04565m5910
9508b85010K8954J10507k4686m0644l2095p6824m5867K1110L0379K6363P8902
$$ y = [75645, -64762, -160943, -56788, 79556, 57452, 17309, -24534, -91385, -86900, 8974, 73913, 127811, -21495, -6025, -2706, 42685, 5243, -45185, 7121, 66464, 47921, 30825, -53270, -93542, -112408, -81136, -74329, 31702, 170768, 49123, -142009, 7925, 71994, 46165, 62051, 103713, 110933, 156215, 140389, -52893, -30518, -60794, -52081, 54795, 116881, 151408, 197074, 171358, 47127, -32255, 29204, 298472, 524477, 521248, 385467, 201968, 265388, 330933, 293397, 206988, 138204, 164175, 212724, 115858, 90755, 46807, -12994, 2651, -127641, -1083, 91907, -54377, -141923, -249347, -236228, -78457, -89421, -134535, -239100, -285010, -256056, -145549, -170235, -210879, -242974, -319798, -365665, -344555, -314176, -287813, -208911]
9497b08911K15769J52809L4248M67q2906J39813J63698p6690j4001R5631P507
9486D27434q0413k57439k02694j7912K5035J83691q4057m8857p7389n4735j63909
9475c51245J4661J12649J69486L10108J38028K6184n0215r4011k06992K4151k7525
9464F5279l7202Q7596j00826n1584J6204j18378Q1173K01171O3697j09198j756
9453I6176J48558J43658K4831p8597n0627j00077j10496P5470m7110j35344l3482
9442f7040j3076p4737K1680J21029l4339j92277k2062K0753J24484m9337L1912
9431a33010j0046j7248o5566m7412n5142j00855q118k796Q5672J60640O7670J25643
9419e68p9644j48873O5606R6605j2430p1480L7919q0785J76860J55536j57411
$$ y = [-208911, 6858, 159667, 193915, 194382, 111476, 251289, 414987, 338297, 324296, 419927, 427434, 347021, 89582, -113112, -131024, -105989, 77702, -6355, -55212, -132601, -187336, -351245, -336584, -223935, -54449, 255659, 393687, 419871, 369656, 275645, 68653, 92804, 65279, 28077, 115673, 14847, -36737, -20533, -138911, -57738, 143433, 207130, 97932, 96176, 244734, 388392, 413223, 334626, 283999, 183922, 73426, 148896, 101786, -33558, -67040, -80116, -154853, -133173, -12144, -46483, -238760, -260822, -240069, -115585, -164922, -133010, -143056, -160304, -225870, -273282, -328424, -429279, -437397, -440193, -354521, -193881, -126211, -568, -80212, -229085, -163479, -66874, -79304, -150784, -112865, -193650, -16790, 138746, -18665]
9408a8665l960J41917M660j61192m6152K21582K3577M5214L5690j53965P593J28906
9396B25205N1665j84055j51196L8872K9585M3289r9526j32863r2526J23760J54152
9385F362n5968r9020k48721j19687M0384R6218J46728L3872N1267M4415M0486
9374f3664J50496J13648p2786j77928j0720O7757M0077K04615J80118p00j22297
9363C08616j7182K3811o5247k23849j04786m3520j08Q8111J56325J24393l4738
9352B11826j10959j24717j01432M6169L8504O1500L6221J72220J39550r6171j23242
9341A49469j537R0701j23091p8856j00561j60651k7867N4488Q3247q9662K1044
9330a83276J16549o0439k2681J96474J31997j5767L2427m18m2687p0473j09129
$$ y = [-18665, -22625, 119292, 123952, -37240, -83392, 138190, 161767, 206981, 242671, 88706, 96299, 225205, 276870, 92815, -58381, -19509, 10076, 53365, -46161, -179024, -271550, -147790, 6362, -49606, -148626, -397347, -517034, -476650, -380432, -233704, -199832, -148565, -104150, -63664, 86832, 200480, 127694, -50234, -60954, 6803, 46880, 251495, 431613, 430913, 308616, 291434, 315245, 249998, 26149, -78637, -122157, -122265, -34154, 122171, 246564, 211826, 100867, -23850, -125282, -79113, -40609, 20891, 57112, 229332, 368882, 272711, 149469, 147932, 238633, 115542, 36686, -63875, -224526, -252393, -197905, -114658, -204320, -183276, -66727, -127166, -149847, 46627, 178624, 162857, 195284, 194866, 152179, 81706, -27423]
9319b7423j40004m7845j6946l0727P0134K45631r86k7975J48636q1935j78086
9308h7526k34958L1643J03474Q6023p564L1310K06616j17800j74585L4506o7047
9297a95908R4846J51381j6849J14053K5272j5036O9849R9617k10603j90902j684
9286g5964n4661r6859J45828m4610j0559K7593N8550o572j14973q9165m6562l1835
9274c39789P8123j44631K4318K93793J30147n4265r1152N4221l4228m7852m0953
9263a72268p0912j2200n4920K20103O4669N8378n6695l3329J29269Q3615r6460
9252E9250j93220j1195k949n0312J16716O4325J33262o8942m1485N1716J45672
9241B02838P3877Q7104j62163m359n805j38730j35436l2552m6299j01058M385
$$ y = [-27423, -167427, -215272, -232218, -262945, -192811, 52820, 51834, 23859, 172495, 90560, -87526, -322484, -290841, -187367, -101344, -108908, -77598, 129018, 11218, -163367, -128861, -195908, -101062, 50319, 33470, 147523, 172795, 157759, 227608, 327225, 116622, -74280, -75964, -130625, -227484, -81656, -126266, -136825, -109232, -50682, -57254, -172227, -261392, -307954, -339789, -261666, -406297, -381979, -88186, 41961, -12304, -103456, -49235, -83463, -131315, -172268, -243180, -255380, -310300, -90197, -25528, 32850, -23845, -57174, 72095, 155710, 59250, -133970, -145165, -148114, -198426, -81710, -17385, 115877, 46935, 5450, 57166, 202838, 276715, 363819, 201656, 197297, 191492, 52762, -82674, -115226, -161525, -262583, -258198]
9230b58198k8651j09216J09637J70733M1971J65460m2806p2553L1927K8023P4810
9219A11137N0308O0953j53499q7350j3292q3763J17983J42827l2542J8395j60932
9208b9775l4802O2956P2098J14672O3744k06651j95010j8745n7831j61702J83207
9197b07839K18872j07144J01922K9364l6481P1003m6473J9423k8644n001N5424
9186F4426k5893r0345l8283K5244j51525M682Q1275J43614j03577m923K02317
9175A07012j14777m735q1009j9200J99424k3663K605M7977N6187j56935j6039
9164c153J39369O1421o6632m345Q6230L455j26830O5484k1786k1847j22452P787
9152c299J62957j47665m0520m0843R1818R3531j39342L7525N7173q3052Q4519
$$ y = [-258198, -286849, -396065, -286428, -115695, -73724, 91736, 48930, -23623, 8304, 36327, 111137, 161445, 222398, 68899, -18451, -31743, -115506, 2477, 145304, 112762, 131157, -29775, -64577, -1621, 70477, 185149, 248893, 42242, -152768, -171513, -229344, -391046, -207839, 11033, -96111, 5811, 35175, -1306, 69697, 23224, 42647, 14003, 9002, 64426, 38533, -51812, -90095, -64851, -216376, -211694, -130419, 13195, -90382, -95305, 107012, -7765, -12500, -93509, -112709, 86715, 63052, 65657, 113634, 169821, 12886, -3153, 136216, 197637, 131005, 126660, 212890, 216345, 89515, 154999, 133213, 111366, -11086, -3299, 159658, 11993, -28527, -69370, 22448, 115979, -23363, 14162, 71335, -11717, 72802]
9141G2802n9364k4166o5048k7084o7881j23712j45143Q2135R0612J94090J03788
9130C1029o6323J2594j0944p7008P7105L8823j5480j46486R0145J10031k9225
9119A4261j10677j13998r6247r4749K7435J81511J92506M5812P7268j10073j98828
9108a85779k989J21059J00957K1129m386L2377K13497J37228j49862j06403L6638
9097B13466j54579K1474R2163l12861j28621Q247K01939J34887n5358p5993l1830
9086h7066Q9427r2959O214O1456m935o8869m1752R608Q1001p1597K9899J10644
9074B1071m297q8989m3267J52620N6914m4072j84955p9281m443o3713l5473J21527
9062a96358O7559J21026R5628k08848l06172J0097K54665J35934K3138O1739K04811
$$ y = [72802, 13438, -10728, -75776, -102860, -170741, -294453, -439596, -357461, -266849, -72759, 31029, -35294, -22700, -33644, -110652, -33547, 5276, -10204, -156690, -66545, 43486, 14261, -96416, -210414, -306661, -401410, -373975, -192464, 42, 45854, 123122, 13049, -185779, -188768, -67709, 33248, 54377, 49991, 82368, 295865, 433093, 283231, 176828, 213466, 58887, 80361, 172524, -140337, -268958, -260711, -58772, 76115, 20757, -55236, -87066, 2361, -90598, -84384, -22928, -27863, -96732, -138484, -128876, -47875, -119472, -89573, 21071, 16774, -72215, -115482, 37138, 94052, 49980, -134975, -214256, -218699, -282412, -317885, -196358, -128799, -7773, 87855, -120993, -427165, -417068, -162403, -26469, -3331, 58408, 263219]
9051B63219J14120k21392k33911J62871Q5996J42254k8206K794p9811k43369q8970
9040a24405q2795n5481R0427j1630m6309L842J08659J82001O2544j3691n5134
9029E8028q0305j3437K22302J92086r8958r5829j93245J8766m0665J22999M839
9018I6581j53560j17656K4117M7937J00998K2522j01856J48125K5737j20384j21235
9007a48674m4179O0223J47291Q7863p7982j2330K21475O5545r3386m2237k0152
8996A43457M5802J5438j0527k78468p0881J8000J29959P0220l9192K2458M1062
8985H7328N2356j09150k70606q0346L7968J02997n2239M1674J87037J19589j51417
8974c4809J9382J72449L4491J2237l2679q7346k0943J4076l9784j52516M9301
$$ y = [263219, 377339, 155947, -77964, 84907, 170903, 313157, 284951, 287745, 207934, -35435, -124405, -207200, -262681, -172254, -183884, -230193, -226351, -117692, 64309, 126853, 113162, 58028, -22277, -35714, 186588, 378674, 279716, 183887, -9358, 9408, -31257, 91742, 96581, -56979, -174635, -150518, -102581, -1583, 20939, -80917, 67208, 92945, -27439, -148674, -192853, -132630, 14661, 102524, 24542, 12212, 233687, 299232, 205846, 163609, 143457, 189259, 204697, 194170, -84298, -155179, -137179, -7220, 63000, 23808, 46266, 87328, 139684, 30534, -240072, -320418, -282450, -179453, -231692, -190018, -2981, 116608, -34809, -15427, 157022, 191513, 203750, 171071, 83725, 62782, 76858, 37074, -115442, -66141]
8963f6141R0049M521M7984j3532J3158r2889p168q9265j15279j02892L8693N4857
8951b37904J21696K26762k6412p7046l1230j05315N5338p7013L2966k0121K1910
8940a16369J63263n8666N3715Q8973j57617n0813K17774l5655N5054J44598N262
8929C09519l799n7370q4073N430j31038l9989J09799r456N0223j80857J45120
8918A13509M2547J29017O1153j09978p9423j19499k95327j14890J26339M9836
8908a96716n6339k0197M5941j18993R8239N8763N7287k3646j44463J00928J40463
8897e8733Q9768r3367p9380J17919M9700j378m9531J24489P9944j21654j42920
8886h5143O208n4329m0365K0574p4650M8044J48955N8204n7681n2073o5409p4767
$$ y = [-66141, 23908, 28429, 76413, 62881, 76039, -16850, -24018, -113283, -228562, -331454, -292761, -237904, -116208, 110554, 84142, 7096, -24134, -129449, -74111, -151124, -118158, -138279, -116369, 46894, -11772, 41943, 130916, -26701, -77514, 140260, 104605, 159659, 304257, 309519, 305720, 248350, 164277, 169707, 38669, -1320, 108479, 99023, 149246, -31611, 113509, 156056, 285073, 346226, 236248, 156825, 37326, -258001, -372891, -246552, -196716, -253055, -273252, -227311, -346304, -248065, -189302, -132015, -155661, -300124, -199196, -58733, 31035, -62332, -141712, -23793, 25907, 24529, -25002, 99487, 179431, 57777, -85143, -78935, -133264, -173629, -153055, -227705, -179661, -30706, 27498, -30183, -82256, -147665, -222432]
8874b22432J24034Q3589j7001r5252L8037k426o9621o4770j73904n3970J06636
8863c47080J41021j5990N8427O05J36101k4293K2415m2037j74561J34245K61099
8852A49952j9688j74753j29384K16549M9186j35759p5818l063k1724J1586q202
8841a41118j33001L0988N3245P8605K3362j33468J42148Q709J2259R3503j09963
8830g4731j23170J31108J24790o3331j11954Q1675J73098j18033k1688J6070q3693
8819f9859r362k16944j7149J39987N7065J0398Q5536Q8256j24204L0551M4459
8808A8734j62752j12811R6543L02060K5118k68503q0778R5885O3666p4320j17757
8797b14915J34420J16661L7798J589j08311n82j5358J28241j330k3807p1630N8472
$$ y = [-222432, -98398, -14809, -31810, -127062, -89025, -91451, -161072, -225842, -399746, -453716, -347080, -206059, -222049, -163622, -163017, -26916, -51209, -28794, -70831, -245392, -111147, 149952, 130264, -44489, -173873, 42676, 91862, -43897, -119715, -122778, -144502, -132916, -141118, -274119, -243131, -189886, -111281, -87919, -221387, -79239, -70530, -58271, 35232, -74731, -197901, -66793, 57997, -5334, -117288, -35613, 137485, 19452, -2236, 13834, -69859, -79221, -296165, -313314, -173327, -116262, -105864, -20328, 67928, -56276, -25725, 18734, -144018, -256829, -160286, 141774, 166892, -101611, -182389, -86504, -22838, -97158, -214915, -80495, 36166, 73964, 75553, -32758, -33340, -48698, 79543, 78213, 54406, -17224, 41248]
8785D1248O6216J21962M9482j64284j12008k3447k0746L5338p7290j60392j11654
8774c55575p0481J46410K76621N2679l7812k00034j1771Q2849J3997m6400n8068
8763b07585q9228O9781J79949K34393l8774j2196j00340j04992L6082m7274j91805
8752b71989Q8964K56978J59491j9557l2933j87165p1834r3914m898J40437J37321
8741A00901O2449P3108J08590j84622j65572n7008M2251R2438N2249J51415j07772
8730A68427n9591K459p1903j95202Q5634J42302R9469n2127N1133p7851k14404
8719a21654p439j27648o5397J14604J681n4471J44596K46801Q3499K2889M4994
8708B82455j97729j41615k6896j2365j43772k7857J45397J15412K23040K787j95406
$$ y = [41248, 107464, 229426, 278908, 114624, 2616, -20831, -41577, -6239, -83529, -243921, -355575, -426056, -279646, -3025, 49654, 11842, -188192, -199963, -117114, -103117, -149517, -207585, -296813, -227032, -47083, 187310, 148536, 136340, 36000, -68992, -32910, -80184, -271989, -183025, 73953, 233444, 213887, 180954, -6211, -78045, -171959, -176857, -36420, 100901, 163350, 236458, 345048, 160426, -5146, -62154, -19903, 72535, 124784, 276199, 168427, 108836, 111295, 39392, -155810, -70176, 72126, 171595, 119468, 170601, 92750, -121654, -129093, -256741, -322138, -207534, -205853, -260324, -115728, 131073, 214572, 237461, 282455, 84726, -56889, -83785, -96150, -239922, -267779, -122382, -6970, 216070, 218857, 23451]
8697B3451m3395j3182R012r588O5919R486k5157j8624p1297P9120q4139R528l5624
8684a04490j05704p7608Q5538J53196K9786Q4018n2390n472K7860l6289l0082
8673c1637j76502j23134O2720J3252N597Q5207r203j245K63901J13274k05784
8662c554j24297L8804K977O3266l1478o705L3619P9536q6581j21675J08344O4058
8650A6314J2879o1806o2084R4947K7837Q9416k0298P9237q6871k26854M1359J26336
8638C0412L7446K9628J06201P5092J43702o5912k50620q0190N8213K5113P8157
8627A87242L7578j65963P5065l5781j99042q2177J14236L8114m838J15832p6559
8616C707j15789Q983P5515p0815k5372P2763K9956N4817J95740J201j05303o4378
$$ y = [23451, -19944, -33126, -24114, -33702, 32217, 41703, 16546, -2078, -73375, 5745, -78394, -68866, -104490, -210194, -287802, -202264, -49068, -19282, 64736, 12346, 6874, 34734, -1555, -31637, -208139, -331273, -268553, -255301, -249704, -164497, -173700, -174945, 88956, 202230, -3554, -127851, -89047, -86070, -22804, -54282, -60987, -27368, 52168, -34413, -156088, -47744, 16314, 29193, -32613, -94697, 250, 28087, 117503, 97205, 176442, 89571, -137283, -95924, 30412, 67858, 97486, 203687, 278779, 422481, 356569, 105949, 25759, 83972, 109085, 187242, 224820, 58857, 133922, 98141, -100901, -183078, -68842, -30728, -35566, 80266, 3707, -112082, -103099, -27584, -98399, -123771, -51008, -21052, 33765, 229505, 230706, 125403, 61025]
8604F1025k11628n8091J23753J32664j13403M422r799p3010O6097J17535r0332
8593e0767p702Q0703J96531j02756j48322k25167j78815J4265L1164K02957R8999
8582h8910j88228j67106J44795Q8859P3522j64409r2080O9140P6763J60569N9796
8571b7289P7312L40r6745O1664M3697r3533j15629P4844M4567L2355m7721j480
8559d7618J8096K23O7958J42729j9251j16846k12835J4464Q4499J02271K2844
8548E6534l4877j9373m7211j44548j32785R3293R0967J971J62659N5455p3055
8537I030l16054N4435L25290O3260J19182n5490k44067j07414J22821R6623M5233
8526A12849M3691J37323k3634R1236k3321n0384j00723L806j62225j24494Q3297
$$ y = [61025, -150603, -208694, -84941, 47723, -65680, -61258, -71057, -144067, -77970, 39565, -50767, -58469, 22234, 218765, 116009, -32313, -257480, -436295, -422030, -390866, -187909, -88910, -277138, -444244, -299449, -210590, -137068, -301477, -393557, -324417, -247654, -87085, -27289, 50023, 50363, -46382, 15282, 58979, -34554, -150183, -75339, -30772, 1583, -46138, -47618, -29522, -29299, 38659, 181388, 162137, 45291, -167544, -153080, -68581, 33690, 56534, 21657, 2284, -44927, -189475, -322260, -228967, -138000, -136029, 26630, 82085, 9030, -307024, -252589, 72701, 135961, 255143, 199653, -44414, -151828, -29007, 67616, 112849, 156540, 293863, 270229, 361465, 338144, 287760, 187037, 190843, 28618, -95876, -12579]
8515a2579J1153j33220n4037R7606j7512q1189K43019J49855J5689j5436k8687
8504A74662P7790R5567j47487q5949l0257L851R7457Q930l0179j87424m8455n7153
8492a28647J9948m6159J12904R0643j00659j44294j55407m5340M0335J03914Q6378
8481a66384J29753k8114j01691q2500M9953J29612J32704l0939J3364K11848j11453
8470A46153n0001N1488j50852k8318L0736Q8612M8478j07968n769J32429J6899
8459A71887M91p7640j25536l6247O9496O6889l2031o2887J2308R3251J18263k0303
8447A77941P9901l3541j28754N3287k2323k2218q7465p6360k8396J02686J5090
8436B9848k1789J2729r5214K6757Q3854n8047j3080q7926L3135J15110n9452p768
$$ y = [-12579, -1426, -134646, -188683, -91077, -108589, -189778, 53241, 203096, 218785, 203349, 174662, 252452, 348019, 200532, 114583, 84326, 88177, 185634, 194564, 164385, -23039, -71494, -128647, -108699, -154858, -41954, 48689, -51970, -196264, -351671, -397011, -356676, -252762, -166384, -36631, -64745, -166436, -248936, -198983, -69371, 63333, 32394, 45758, 257606, 146153, 96152, 147640, -3212, -31530, -794, 87818, 136296, 28328, 22559, 154988, 171887, 172378, 94738, -30798, -67045, 2451, 69340, 37309, -25578, -13270, 79981, 198244, 177941, 257842, 224301, 95547, 148834, 126511, 104293, 16828, -59532, -87928, 14758, 29848, 8059, 20788, -74426, -47669, 36185, -21862, -34942, -122868, -89733, 25377, -34075, -41843]
8424d1843L7339J0163J23140K7148j79442k4528r0381n4205J65959J91462l488
8413A61324N4224j15966l2931l639R4119J22428j23723j8370j58340n2839K09630
8402A35917J06905k1552Q2302K2767j41174k23687q0769K2521J1110J11240J22563
8391A48143l1958k8817j21406J334K20593P5749j13991o330L7074j09528J60629
8380B31492Q8422R0194j68824k51100j01439P983J18671J08847K8696j67030q5672
8369i9760m4207O5723K23221J09494Q2673r3664o0629L631Q5182J36778o1616
8358C46826j20911n2777Q6600n3738k41700j28129j26505J36984K4253n0048Q4238
8347i4907J3101O8577m9696R0585M2688j7035n0524K7814j66639J1323J79695
$$ y = [-41843, -4504, 5659, 128799, 155947, -23495, -48023, -138404, -192609, -26650, 164812, 161324, 215548, 99582, 66651, 63012, 157131, 279559, 155836, 137466, -20874, -73713, 135917, 242822, 221270, 303572, 326339, 185165, -38522, -119291, -96770, -85660, 25580, 148143, 116185, 87368, -34038, -32704, 187889, 263638, 149647, 143317, 180391, 70863, 231492, 319914, 410108, 241284, -9816, -111255, -103272, 15399, 124246, 152942, -14088, -99760, -143967, -78244, 144977, 254471, 337144, 243480, 182851, 186482, 271664, 408442, 346826, 225915, 173138, 259738, 206000, -35700, -163829, -290334, -153350, -129097, -179145, -94907, -81806, -13229, -62925, 27660, 70348, 53313, 2789, 30603, -136036, -124713, 54982]
8336E4982P2175M0279j83942Q2970O2756r9613N3990L1000o4092j91116r7944
8325b38555j38498l9535k2231j8916J06118K51479N6204L3223J51129r3814j40554
8314i3950J44065J8854m4416k5465K4819N3454J42960k7316j30773K11911M5808
8303C19951r7891j21790q2480Q1681J9694P282k60867j9480R8913J00798P6191
8292A22002p2364L493K7613p2853j58121k9118M6926L2407R3473m3582k0720p3439
8280a44283j6617L074N2099J26543O7028o6986M6050K0305Q7315J47474L4662
8269C56664j29916k57447j63716O5000M0034q3232l1894J59175O0129J39734j3262
8258A41269Q9445L2667o3049r4928j39223j18213j21954M4067R3882J3776J11453
$$ y = [54982, 127157, 167436, -16506, 66464, 129220, 29607, 83597, 114597, 50505, -140611, -238555, -377053, -416588, -438819, -457735, -351617, -100138, -43934, -10711, 140418, 46604, -93950, 50115, 68969, 24553, -912, 23907, 77361, 220321, 193005, 62232, 274143, 319951, 222060, 100270, 17790, 99471, 119165, 126447, -134420, -153900, -54987, 45811, 122002, 49638, 53131, 80744, 7891, -150230, -179348, -132422, -100015, -6542, -50124, -70844, -144283, -160900, -157826, -105727, 20816, 87844, 20858, 66908, 87213, 174528, 322002, 356664, 226748, -30699, -194415, -129415, -89381, -172613, -204507, -45332, 14797, 154531, 141269, 230714, 263381, 200332, 105404, -33819, -152032, -273986, -229919, -136037, -122261, -10808]
8247a0808M6747Q5727q9937K828q4044q0111l4088M8573K26427L9345j5334M4828
8235A80153Q9250K3800j61413j48873j42231J012K2562j54922L8653J74326o9135
8224a46818L2951K10123l1465j6224m8938n0492l0048r048J19492k7755m9436
8213d7658k0507K1363j19086m8212J7554J62283Q7549k1354j85342r3539o4415
8202c11364J83198K76817n13j66360L9339K8888Q7103L5078o4510P9885J23472
8191C11033L9511k0312k56548k14357K1813J87868j56615j81635n5296R167J01377
8180b13994L778J85662J27461r1638J07813R5941k9055r0367p5135n3491k34024
8169b67049J18729J92112L3330J63758r8386l21195j5858N5559L1377q7348l5287
$$ y = [-10808, 35939, 121666, 31729, 34557, -49487, -129598, -163686, -115113, 111314, 150659, 135325, 180153, 269403, 293203, 131790, -17083, -159314, -158302, -135740, -290662, -252009, -77683, -146818, -113867, 96256, 64791, 48567, -371, -50863, -80911, -89959, 29533, 1778, -47658, -68165, -46802, -165888, -214100, -196546, -34263, 53286, 31932, -153410, -246949, -311364, -128166, 148651, 148138, -18222, 21117, 50005, 137108, 172186, 107676, 187561, 311033, 350544, 330232, 73684, -140673, -118860, 69008, -87607, -269242, -324538, -315371, -213994, -210216, -24554, 102907, 11269, 119082, 215023, 185968, 95601, 20466, -33025, -267049, -148320, 43792, 77122, 240880, 142494, -178701, -194559, -139000, -107623, -194971, -230258]
8158b30258P2846m0168J7364J1336j5446K4279K66287j06082j26901o2441K8037
8147a61147o0205m7324J36186N941l1702K1346Q5819M1134N4503O8328n3622j74165
8135a14908M6712m5295j89028J30174J20466J2264J07175j3620j35550j3455j20801
8124b15866l1021M7461K20870Q2188q9625Q0040l0546r4050N4499L127K08672
8113B35749O7891k7582l1681J29986j54303l801J33213j17973k62159j03108j1471
8102a45239k8240J52996J02838j82925P0560j47971j14731J25519K24869R9895
8092A57571o1302j05965R692N8376o3399J1073J9331J62132J6787j17581p1395
8081A5320O8233N805n1253j57728m409J29342l2578j97327M7147L6095J58222
$$ y = [-230258, -157412, -197580, -180216, -168880, -184326, -160047, 106240, 158, -126743, -189184, -161147, -221352, -268676, -132490, -126549, -158251, -136905, -51086, -9952, 44551, 112879, 59257, -114908, -68196, -113491, -302519, -172345, -51879, -39615, 67560, 53940, -81610, -95065, -215866, -246887, -199426, 21444, 103632, 14007, 94047, 63501, -30549, 23950, 27077, 235749, 303640, 276058, 244377, 374363, 220060, 216259, 349472, 231499, -30660, -133768, -145239, -173479, -20483, 82355, -100570, -30010, -177981, -292712, -167193, 57676, 157571, 96269, -9696, -4, 58372, -5027, 6046, 25377, 187509, 204296, 86715, 15320, 83553, 89358, 38105, -119623, -124032, 5310, -27268, -224595, -177448, -141353, 16869]
8070A6869l3440K4292j9743N1264R0591m9502M6011j1042J29q4289j41521j5975
8058a26356J33884m7173k70801J54140K6280j25640K38750J26046Q7723j9491
8048A77362p4901l9855J30227J58990m3371j00386L9765L8827j25867k42332n9465
8037a41006L7860J11485j64521o141J11720J78657J5680j84771j9961L328J2169
8026d5501K6277n7623p4014J4970N9133q7369L2722j23258o6226J33975P4158
8015a12756j0623n4053K2551O1817N1548N0177l7652j86720q8988K56591P3430
8004B5322Q88k26272j7707J52937J91801m9324K8610j6568J04049R0979n4574
7993B30141r2212p6472j53569k1119M6788J2881J01214J16921K2599j64126q4539
$$ y = [16869, -16571, 7721, -12022, 39242, 129833, 80331, 126342, 115300, 115429, 31140, -110381, -126356, 7528, -39645, -310446, -156306, -130026, -255666, -16916, 109130, 196853, 177362, 102461, 62606, 192833, 351823, 308452, 208066, 247831, 286658, 160791, -81541, -141006, -103146, 8339, -156182, -162323, -50603, 128054, 143734, -41037, -60998, -57670, -45501, -19224, -76847, -150861, -135891, -76758, -164127, -131405, -254663, -320889, -186914, -112756, -123379, -177432, -154881, -93064, -41516, 8661, -28991, -215711, -304699, -48108, 25322, 26210, -200062, -217769, -64832, 126969, 77645, 106255, 89687, 193736, 284715, 230141, 137929, 61457, -92112, -113231, -66443, -53562, 47652, 164573, 187172, 23046, -61493]
7982f1493M2796j2754k9925P081J02017j04074l5214k0600P3067J858R4997J21972
7970A79728Q1813j707k05266r3739p5575l5771p0924j19951n2887N7230J35002
7959b02047J05109O0833R0269J48611o2618P0114l3727j2810L2125M1938r3330
7948A44467j23920o7714J40959P8289j52242L1815O3122p7295p1215n2531N8814
7937b7451K6453M9875J46334K1107l5464p2474j17247P7123O9041o5626J9620
7926I1291P4896N5660j8202j63121j0409o0409K4545j04085L3871J72262q4014
7915A2285M5336r4608J8607Q115p4999Q90L6238p7756j06546K0296q8233k1752
7903c22127K36768R2687L8455j68177j60019J8789J16138P4307j43412p945J08878
$$ y = [-61493, -18697, -31451, -61376, -54295, 47722, -56352, -91566, -112166, -39099, -37241, 57756, 179728, 261541, 259834, 54568, -39171, -114746, -150517, -221441, -341392, -394279, -337049, -202047, -96938, -36105, 54164, 202775, 140157, 210271, 176544, 163734, 195859, 237797, 144467, 20547, -47167, 93792, 172081, 19839, 51654, 114776, 37481, -33734, -86265, -27451, -998, 48877, 195211, 216318, 180854, 108380, -8867, 68256, 137297, 71671, 91291, 166187, 221847, 203645, 40524, 30115, -30294, -5749, -109834, -75963, 96299, 12285, 57621, -36987, -18380, -10265, -85264, -84374, -48136, -125892, -232438, -212142, -300375, -322127, -85359, 7328, 45783, -122394, -282413, -263624, -147486, -73179, -216591, -224536, -115658]
7892a15658J59120J24852o2882j56649P669l0930o4017J18616L9987Q6011j26477
7881b0358k9988L1499l8301N6947J2238K9208P2518j5751r9002J56553j36352
7870A9211q7343j38706N0584J44297Q2945J09215K8928j6382J1582l3331j72426
7859a426l9663N2347J97516J15546j14450j34573J10350j3430j16660K1389p4209
7848B737j86245k4090J02293J60398j8074j02093o5210r5301j2025N3579K55667
7837G1636N0011m4919j49634J2935O8258P3553k6003M6685J81384J84464j20846
7826C47524j72742q3293j20963q356K0488r9950Q1850K06434N0364K1441j27447
7815A15350k8399O6074P4735J612r874k3852K8126j50210j77133O7021R2487l6719
$$ y = [-115658, 43462, 168314, 105432, -51217, -43548, -74478, -138495, -19879, 20108, 106119, -20358, -50346, -18847, -57148, -201, 12037, 41245, 113763, 98012, -990, 155563, 19211, -68132, -206838, -156254, -11957, 70988, 180203, 209131, 192749, 204331, 171000, -1426, -41089, 11258, 208774, 324320, 209870, 75297, 185647, 172217, 55557, 76946, 2737, -183508, -207598, -105305, 55093, 37019, -65074, -130284, -225585, -237610, -184031, 71636, 121647, 76728, -72906, -59971, 8287, 81840, 55837, 102522, 283906, 468370, 347524, 174782, 91489, -29474, -37830, -17342, -117292, -35442, 170992, 221356, 242797, 115350, 86951, 153025, 227760, 229372, 219498, 195646, 223772, 73562, -103571, -36550, 55937, 19218]
7803A9218J30195k1871j26642o6777P1256J58535J6308j3529q9244j10088J13723
7792H1084J84571l4838k3319K3081j33212l3991o5480r5963K7596J58786J16238
7781B04553m6631l2692o0704o7581N4616Q2040J6689j55917j83867n1514N4251
7770a86757R104P9081L69814L128k08066n8828K0503N5195K0318j09996n0277
7759e6781J9663L6240J09532P2755p9425k2701j42690r0004K5256Q6371l6070
7748g7854r3144l3833P5992Q9929l8290j3265Q5202P5649N4516j40339l7083N4366
7736A846p5031J08328j08275m9864N7156N2023M788j4458N4857k5778j3831n2267
7724f0506j94331j53029J08959K08191Q6784j6346o3200J4536M9696m8753J6357
$$ y = [19218, 149413, 127542, 900, -65877, 5379, 163914, 180222, 166693, 77449, -32639, 81084, 265655, 230817, 207498, 230579, 97367, 63376, -2104, -98067, -70471, 88315, 204553, 157922, 125230, 64526, -3055, 51561, 133601, 150290, -5627, -189494, -241008, -186757, -177653, -98572, 271242, 274370, 66304, 7476, 27979, 83174, 103492, -6504, -56781, -37118, -878, 108654, 181409, 101984, 79283, -63407, -153411, -128155, -41784, -77854, -170998, -204831, -128839, -38910, -77200, -90465, -5263, 70386, 124902, -15437, -52520, 1846, -73185, 35143, -73132, -122996, -65840, -13817, -9029, -23487, 31370, 5592, -8239, -60506, -254837, -407866, -298907, -90716, -3932, -20278, -83478, -68942, -19246, -67999, -51642]
7713e1642o3309j09482J47235J83983L8767n2608p8750M7271k524K9614L0085
7702A18640k59329j25155l5002Q991m5176K3618P7408J18814N8350m6378P1945
7691c3274P816j79239j62483j40802R0773J05741n7013J62671J04801k0942M4433
7680g7518J3952K3632K8792o3369O2339J03778k5351j2884j8681m7602n4081L32
7668f6661J09866R9553O7356m9683n3118R3073L9270j09069k1627k39788m7084
7657a77912P8818q1901J82366M4006j26718j44684O7766K9423j5996J26203K2921
7646D292j98406o5212J75420K36313J67362R1027j86467j58218J4157j0674N2519
7635A22113P0506O1885N7350r8094P8684j72645r6339j3897K4801p9722n8961
$$ y = [-51642, -114951, -224433, -77198, 106785, 145552, 92944, 14194, 61465, 58941, 88555, 118640, -140689, -265844, -300846, -291855, -337031, -313413, -236005, -117191, -58841, -105219, -33274, -25458, -204697, -367180, -507982, -417209, -311468, -368481, -205810, -101009, -121951, -77518, -63566, -39934, -11142, -74511, -12172, 91606, 66255, 53371, 34690, -12912, -66993, -66661, 43205, 142758, 210114, 160431, 107313, 200386, 239656, 130587, 108960, -130828, -177912, -99094, -180995, 1371, 45377, -81341, -226025, -158259, -128836, -144832, -18629, 4292, -194114, -259326, -83906, 152407, 319769, 410796, 224329, 66111, 80268, 69594, 122113, 192619, 254504, 311854, 213760, 292444, 119799, 23460, 9563, 34364, -45358, -104319]
7624a04319p7976J70980O8737P6697J12692Q665j31218Q6438j24424k7512J16014
7613A74774P1682j72365j05042N5199k9570j29895Q8315R0290N9493J8769j03922
7602A7728q053j12296l8119O9230J90185p044m6856n6078r3443J71944R047j53532
7590e7287j6651q4460m7692N7048M5915J51086Q4055N810K2506j3000J117j5915
7578A32532j85970j88229k0578Q6750L32561K55194k93326j80620m3770J29159
7568B3703J36705r0859k6651j26913p8818j16691j11828L5892O7945o6462p3477
7557d27454P290O8922P9633K17757k6902Q7497J73819k1137n3258R0472q4651
7546A11988j51232q327m7750r6164j30965M419M5484L1067J19733L8535J50667
$$ y = [-104319, -182295, -11315, 57422, 134119, 246811, 255476, 124258, 210696, 86272, 58760, 174774, 246456, 74091, -30951, 24248, -5322, -135217, -46902, 43388, 102881, 121650, 17728, 9675, -102621, -140740, -71510, 118675, 111631, 64775, 8697, -84746, 87198, 96245, -57287, -73938, -158398, -206090, -149042, -103127, 47959, 132014, 137824, 160330, 147330, 148447, 132532, -53438, -241667, -262245, -175495, 157066, 412260, 118934, -61686, -105456, 23703, 160408, 69549, 42898, -84015, -162833, -279524, -391352, -355460, -287515, -353977, -427454, -420164, -351242, -271609, -53852, -80754, 6743, 180562, 159425, 106167, 196639, 111988, -39244, -47571, -95321, -191485, -322450, -318031, -272547, -241480, -121747, -83212, 67455]
7535F7455o874l4270j79019j65818J0817K22017J29411k5180q6796M91p1186q0065
7523b19017J51559N6599k5840J82381n7147k36900R553K1526Q3464q8146j72154
7512b94122r7193K45181J09271m4494J7164J22273M7165j72840L2908k9779j9877
7501h4343q004K0392L5977n9224N0730k1975q8663j88746J64435N4274j29071
7490b54218o6298J14280M5407N5967k3234o9980J94696q871j157L2570j6708K07169
7478B09623R0501j42524m0088q8898j20187j12640j3977J04623K9751N76J07342
7467B4102O8479r2798r4312K14367j65976n1005O8801K2911P5203k9256p443K26935
7455B60008M5198k47250j44083R7503J3282o0151K7431L5257m9826n3919r472
$$ y = [67455, 60581, 26311, -152708, -318526, -307709, -85692, 43719, 18539, -68257, -67766, -138952, -219017, -67458, -10859, -36699, 145682, 88535, -148365, -138812, -117286, -33822, -121968, -294122, -391315, -146134, -36863, -81357, -64193, 58080, 105245, -67595, -34687, -64466, -84343, -92347, -71955, -35978, -95202, -44472, -66447, -155110, -343856, -179421, -125147, -254218, -320516, -206236, -160829, -104862, -128096, -198076, -3380, -12251, -13408, 19162, 2454, 209623, 300124, 157600, 117512, 28614, -91573, -204213, -218190, -113567, -83816, -83240, 24102, 92581, -217, -94529, 119838, -46138, -97143, -28342, -5431, 69772, 40516, 33073, 260008, 305206, 57956, -86127, 11376, 24658, -35493, -8062, 27195, -22631, -76550, -86022]
7444h6022J80962m1339k06786o2858M7133k2408J81944J11990R1898L3739r5872
7433A32381j32686j27426l9309j2051j62692N4033J06794O1557J04008m187j24102
7422a43680N3822R41J1649q1707J60653K52205n5547j56924q7799j11554J45572
7411a2369K626M5123M5941q8391j30434r1587j0639J84084Q0558j1549O1198J24553
7399A99114J00762M253Q7537j35629j26098P314j93751o7156Q9811L2431l7380
7388c8792j36625k8426J6545l5781n3628J00648R7862Q7422J08011j33943k15368
7377b32075J11797J57385q3565o9086J13364J83026R825j25665o0774j85673j45312
7366c26753n4743K29090M9041P7162J57981N3672l3694l5526j69767O4853J79010
$$ y = [-86022, 94940, 53601, -153185, -216043, -168910, -191318, -9374, 102616, 194514, 228253, 132381, -305, -127731, -167040, -179091, -341783, -287750, -180956, -119399, -15391, -19578, -143680, -89858, -88917, -77268, -158975, 1678, 253883, 198336, 41412, -46387, -157941, -12369, -9743, 35380, 81321, -7070, -137504, -229091, -239730, -55646, 24912, 13363, 74561, 199114, 299876, 304129, 391666, 256037, 129939, 137253, -56498, -123654, -33843, -1412, -38792, -175417, -203843, -187298, -223079, -276707, -176059, -78197, 9225, 117236, -16707, -232075, -120278, 37107, -46458, -115544, -2180, 180846, 190671, 65006, 4232, -181441, -326753, -381496, -152406, -103365, -26203, 131778, 185450, 151756, 116230, -53537, 11316, 190326]
7355A90326q6360j95762K29361J07150p8007o1327j51028l9163o0505p3104P5050
7344a43369J21174J31109O7305j2288j63056n2003Q4364K3006J7721j80189p0200
7333a76426M6987m5398M5804O5311l7499J17126r3998m9383J04011O4910p2592
7322c1147j82470k44022J65046J66447J11136Q5313m9303j93091L7607J17554
7312a6930J16020J62314n1179j14865j27592j10531j22829J89767J97456o6986
7302E4645q2236j22210m4338J28729J382m1142j54Q5546J9952j60139l9530P9128
7290a20367O5614N9340j03134j29982l0443J50723q7091q177J85356J00792o5224
7279A7407j663J2528q9590j09279K9263O5445j7309J20179j5483l1796n2824j37498
$$ y = [190326, 103966, -91796, 137565, 244715, 166708, 105381, -45647, -84810, -145315, -218419, -143369, -22195, 108914, 176219, 163931, 875, -51128, 33236, 56242, 73963, -106226, -176426, -129439, -174837, -129033, -63722, -101221, 15905, -78093, -127476, -23465, 41445, -31147, -213617, -457639, -292593, -126146, -15010, 70303, 21000, -172091, -134484, -16930, 99090, 261404, 210225, 95360, -32232, -142763, -265592, -75825, 121631, 54645, -27591, -149801, -194139, -65410, -64028, -105170, -105324, -19778, 174, -159965, -199495, -120367, -54753, 4587, -98547, -228529, -258972, -108249, -195340, -203517, -18161, 82631, 17407, 15744, 28272, -61318, -170597, -141334, -75889, -93198, 26981, 11498, -20298, -73122, -210620]
7267b10620n7747M6806J20268J60464P8008J54288K5047j43340J30777p5681j10068
7256A18202l2454L6146J67711Q5713j26121q0601l9974p2010M7962k2433N5899
7245A38040J2035q2197o1424Q5474J91932k33345j75540P8572j7831Q8121m1832
7234a7995N0656J56226N9594P6250o4971j39871j51025j8982O896J74277R558
7223A40613j8216j79257r2269J52649N0396q5792M7255L9625M741r7632R6415
7212E8528M3466L7002R6446K9903j85562m2982M0180J96906J9843k59992r8289
7201f4551l7832K6603N3023j20642J1915J3803J14361o904J14012R7984L8329
7190B40101m0122J13909j1895M8775j2506p090k6221k25963j05992R6777j21014
$$ y = [-210620, -268367, -221561, -101293, 59171, 137179, 291467, 316514, 173174, 303951, 228270, 118202, 85748, 121894, 289605, 375318, 249197, 168596, 128622, 56612, 104574, 82141, 138040, 150075, 67878, 6454, 91928, 283860, 50515, -125025, -46453, -64284, 23837, -17995, 32661, 188887, 248481, 324731, 259760, 119889, -31136, -50118, -43222, 131055, 140613, 122397, -56860, -149129, 3520, 53916, -31876, 15379, 55004, 59745, -37887, 58528, 101994, 138996, 235442, 265345, 79783, 36801, 76981, 273887, 293730, 33738, -64551, -102383, -75780, -22757, -143399, -131484, -117681, -3320, -10224, 103788, 201772, 240101, 199979, 313888, 301993, 350768, 338262, 331172, 304951, 78988, -27004, 69773, -51241]
7179e1241q7769q3102J44925J39420j32579j32475O0990M9089n9484J08088q0249
7168a24387P1576J26987J37381k9630M5054q9075j47424p728l3427j28827j9859
7157a99359P5669l2279K1996K38834K240K8110R9439R4354l9201j04386o7654
7146A17763q5642o4431O6317O1903Q3377m7906q9852J12633L727j285j68004r4720
7134a06120J9347O3107L5900k45968j23518j5715P0029J70111j04206j12751Q8951
7123b60833R4162n8738j05758l4118O0538R1706J39516j11033j12704R6820m5968
7112b46410n650m0648K2412J23396q740K2690K62151P9054q7699n4239J03696
7101A70013J348j30446p6904J50459k1659J6949m3187L8123k2698M0978Q1623
$$ y = [-51241, -139010, -222112, -77187, 62233, -70346, -202821, -141831, -92742, -152226, -44138, -124387, -52811, 74176, 211557, 181927, 226981, 137906, -9518, -17246, -50673, -179500, -199359, -123690, -155969, -133973, 104861, 107101, 135211, 234650, 329004, 289803, 185417, 117763, 32121, -32310, 34007, 95910, 179287, 131381, 41529, 154162, 157889, 156604, -11400, -106120, -86773, -23666, 12234, -233734, -357252, -372967, -302938, -132827, -237033, -349784, -260833, -166671, -225409, -331167, -365285, -304747, -213041, -73525, -184558, -297262, -200442, -246410, -252060, -292708, -270296, -146900, -155640, -132950, 129201, 208255, 120556, 66317, 170013, 171361, 40915, -35989, 114470, 92811, 109760, 66573, 104696, 81998, 122976, 204599]
7090B04599j9569l4656j08818k6603K8478m8194j07069N3545J32625O7659J10879
7079B52876m6681K0104K2641m2004j10630o9276R3852j04134j03130o662M1071
7068e1973j0873j3646J53832O3865j88564q7469J97273Q3657m622j37135l0507
7057b6162j62320j88326O6876K11425J1982l5513M2268k4720n6287j3467l284
7046a77528K22226O496m0085M5624K9335k02365J47023Q6178L3341J18871J19103
7035C88219j5442l2277j70758l6155J94064j26095j05101j60548k382K6082M7792
7024G399o7050r4832m7617J08184O9350J844k3978k0616j15777J59959J82953
7013A59819L8291j53437j56584J3063Q7025P7167j63970O4793n8473j80804q4960
$$ y = [204599, 185030, 150374, 41556, 14953, 43431, -4763, -111832, -58287, 74338, 141997, 252876, 206195, 226299, 248940, 206936, 96306, 27030, 120882, 16748, -86382, -93044, -51973, -62846, -76492, 77340, 141205, -47359, -134828, 62445, 146102, 141480, 4345, -26162, -188482, -376808, -309932, -98507, -86525, -122038, -79770, -104490, -160777, -174244, -177528, 44698, 51194, 11109, 56733, 86068, -116297, 30726, 116904, 150245, 269116, 388219, 372777, 340500, 169742, 133587, 327651, 201556, 96455, -64093, -66475, -40393, 7399, -59651, -154483, -202100, -93916, -24566, -22722, -46700, -67316, -183093, -23134, 159819, 198110, 44673, -111911, -98848, -11823, 65344, -98626, -33833, -92306, -273110, -358070]
7002c58070L3364Q9899P4572j88507m7635K29635R8894K8879p420L6377j2342
6991b2354L1414Q1166J68076N1181l3698j35400j26973q107p1450L5925M0944
6980A0724P3453j7555J0088L3976l5672k9352m0678o4898Q596N9313O2125o1535
6968H585P2793J39319n310j21397j99479n5203K31750Q1031n7004m8880n7357
6957a1152N3385k3683J04624N145k71087O3568J38610J30650P447j05512Q9707
6946A81702r3501j45034m1844J01880P8115j5287M0867R2636j3362j4811m8054
6935A23307o594J35307K38722J22267l9299j97919j32704k05845j23219n9655
6925a45632R0682L7829J88622M1957k499j14520k794j19029K3052J34786J1562
$$ y = [-358070, -324706, -234807, -160235, -348742, -396377, -166742, -67848, -38969, -46389, -10012, -22354, 9060, 90226, 258302, 309483, 275785, 140385, 13412, 5305, -66145, -30220, 10724, 84177, 66622, 76710, 110686, 75014, 45662, 4984, -59914, -51318, 7995, 70120, 8585, 81378, 220697, 215387, 93990, -105489, -160692, 71058, 152089, 95085, 46205, -11152, 42233, 18550, 123174, 128319, -142768, -79200, 59410, 190060, 197507, 91995, 181702, 88201, -56833, -98677, 3203, 81318, 66031, 106898, 199534, 186172, 171361, 123307, 116713, 252020, 490742, 613009, 573710, 375791, 243087, 37242, -85977, -145632, -54950, -17121, 171501, 213458, 210959, 96439, 93645, -25384, -2332, 132454, 144016]
6914A44016j21629q2737J26221J30367J4335J6278J00335r2692r5478m3205l0991
6903F4820K4408n7386O6849J41497P056j05668m0442j08362l7378j06890o0488
6892b11984n2399M6075J12823j11125l7804L5091L7598J40051o3705j43324O1428
6881a87275K12734J32493P8181j7846r62q9637j86177q1907J83822N8457k7315
6870G4568j416M7578j36852j49348O4646N3309Q6206k8079N0984j49687N9708
6859b8383L3322M9200J07712m7683r6663j08585K0160L7310j1600m720N6495l3901
6847b7336j5055K7765N3054j2179O5543J4760j8217k55254r8376M0482O7608k620
6835a59825Q5366q8596O250R2473j04581r5022J6502J9134O4986K06439J46291
$$ y = [144016, 22387, -60350, 65871, 196238, 210573, 226851, 327186, 234494, 139016, 95811, 64820, 89228, 31842, 98691, 240188, 247244, 141576, 101134, -7228, -44606, -151496, -211984, -264383, -218308, -105485, -216610, -254414, -219323, -181725, -41674, -105379, -248703, -187275, 25459, 157952, 236133, 218287, 217325, 127688, -58489, -140396, 43426, 101883, 74568, 73152, 120730, -16122, -165470, -100824, -47515, 38691, 10612, 61596, -88091, -28383, 4939, 54139, 161851, 114168, 17505, -91080, -70920, -33610, -45210, -49930, 6565, -27336, -42391, -14626, 38428, 26249, 91792, 106552, 88335, -166919, -265295, -224813, -157205, -159825, -74459, -163055, -156805, -64332, -168913, -263935, -247433, -228299, -163313, 43126, 189417]
6824A89417l5156j73j16244M3442N2478j29265J27769R5063l729j46233m786J55195
6812B27778r2033j22955M1172J81819m6296j24705j26572o9697r9460K9056J16590
6801h5303o9556J81570K36286j6145k76513j13406K9872J13207J70882M0353k7392
6790A83855n424Q1826J99716o6470l38621k42559o2618N8270M6999R1364K2972
6779c0690N3892J47043j23707l7669J49166p2893r6474o9538K12490N3162j82787
6768A995p2252j23050J33803q261J9334K14199K5334K1476J51491P2140J8034
6757D54243M2261j23960k39353n2388Q68j15291P4349p1315J40984l7408j11290
6746c8300j39151j01308J14506K15220j3555J3363j27447n380Q9245J38215j19428
$$ y = [189417, 154261, 154088, 37844, 81286, 133764, 4499, 132268, 227331, 223602, 77369, 72583, 227778, 135745, 12790, 53962, 235781, 189485, 64780, -61792, -131489, -230949, -201893, -85303, -154859, 26711, 262997, 246852, -29661, -143067, -113195, 12, 170894, 211247, 183855, 178431, 260257, 459973, 393503, 54882, -187677, -250295, -192025, -145026, -53662, -30690, 23202, 170245, 46538, 8869, 158035, 85142, -11332, -80870, 131620, 184782, 1995, -70257, -193307, -59504, -67765, -48431, 165768, 191102, 212578, 364069, 436209, 454243, 496504, 372544, 133191, 80803, 81671, -33620, 40729, -30586, 110398, 72990, -38300, -177451, -278759, -164253, 50967, 37412, 50775, -76672, -82052, 7193, 145408, 25980]
6735B5980n8577Q7509p7422m6259L5695J4317m4657K0699n1843K5689L4690l6494
6723g0673k0984o0682p586k4226J58949J93682M2588r6808O4148K8933j56884
6712E0457m1068J47208K07946L9034j22351j8516M9337j93460q1299K05115P7446
6701C19849j6320r1668p7208J21850q8523j85101o2398K550O0182O2206N0080
6690I5499L5498O111k71956k02539q0722J35731Q9560j27363M1954P6881K6798
6679a74548p9605K3846K13004q356N7741R3200J9151P5606J07639r7939j29138
$$ y = [25980, -32597, 54912, -22510, -68769, -33074, -18757, -63414, -42715, -94558, -68869, -34179, -70673, -91657, -152339, -159925, -184151, -25202, 168480, 211068, 114260, 178408, 207341, 50457, 9389, 156597, 364543, 403577, 281226, 262710, 312047, 118587, 37288, 242403, 319849, 303529, 211861, 134653, 256503, 167980, -17121, -79519, -76969, -16787, 45419, 95499, 130997, 137108, -134848, -337387, -418109, -282378, -192818, -320181, -278227, -201346, -174548, -254153, -230307, -17303, -25659, 32082, 125282, 144433, 220039, 327678, 229739, 100601]
$$ [...]
##END NTUPLES=NMR SPECTRUM
##END=
