##TITLE=Analysis number 313726
Compound Code ac 13036
Project Code adrs
Chemist Name cuschem
##JCAMPDX= 6.0         $$ Bruker NMR JCAMP-DX V2.0
##DATA TYPE= NMR SPECTRUM
##DATA CLASS= NTUPLES
##ORIGIN= Bruker BioSpin GmbH
##OWNER= NMR
$$ XWIN-NMR		Version 3.5
$$ Tue Sep 20 08:03:58 2005 GMT Daylight Time (UT+1h)  MAYBRIDGE\NMR@NMR_250MHZ
##.OBSERVE FREQUENCY= 250.131544655141
##.OBSERVE NUCLEUS= ^1H
##.ACQUISITION MODE= SIMULTANEOUS (DQD)
##.ACQUISITION SCHEME= undefined
##.AVERAGES= 16
##.DIGITISER RES= 18
##SPECTROMETER/DATA SYSTEM= dpx250
##.PULSE SEQUENCE= zg30
##.SOLVENT NAME= DMSO
##.SHIFT REFERENCE= (INTERNAL, DMSO, 0, 16.522)
##AUDIT TRAIL= $$ (NUMBER, WHEN, WHO, WHERE, WHAT)
$$ ##TITLE= Audit trail, XWIN-NMR		Version 3.5
$$ ##JCAMPDX= 5.01
$$ ##ORIGIN= Bruker BioSpin GmbH
$$ ##OWNER= NMR
$$ C:\u/data/dgb/nmr/ADRS/9660/pdata/1/auditp.txt
$$ ##AUDIT TRAIL=  $$ (NUMBER, WHEN, WHO, WHERE, WHAT)
(   1,<2005-09-20 08:03:32.67 +100>,<MAYBRIDGE\NMR>,<NMR_250MHZ>,
      <created by zg, POWCHK disabled, PULCHK disabled
       configuration hash MD5:
       62 19 C7 07 E1 42 D1 B7 37 6C 3D D0 77 39 F9 E6
       data hash MD5: 64K
       41 50 DD 1C 4B 68 F8 7D FB E3 F0 D3 EC 33 46 25>)
(   2,<2005-09-20 08:03:46.89 +100>,<MAYBRIDGE\NMR>,<NMR_250MHZ>,
      <Start of raw data processing
       ef LB = 0.3 FT_mod = 6 PKNL = 1 SI = 32K 
       data hash MD5: 32K
       8A 7D 33 C1 98 AE 74 98 ED 66 DE 23 B3 DC 14 C5>)
(   3,<2005-09-20 08:03:48.71 +100>,<MAYBRIDGE\NMR>,<NMR_250MHZ>,
      <apk 
       data hash MD5: 32K
       00 1D D9 F2 5A 50 3D 9A 8A 4E 10 4C EB 4D 93 A3>)
(   4,<2005-09-20 08:03:49.77 +100>,<MAYBRIDGE\NMR>,<NMR_250MHZ>,
      <abs ABSG = 5 
       data hash MD5: 32K
       1A C6 B3 C6 AE 84 E5 59 82 04 48 36 C2 09 24 9F>)
$$ ##END=
$$ 
$$ hash MD5
$$ FB 77 81 99 37 9C 94 25 FD 9B 1C C8 A9 FA 4F A2
##$RELAX= 
##$RELAX= 
##$RELAX= 
##$RELAX= 
##$RELAX= 
##$RELAX= 
##$RELAX= 
$$ Bruker specific parameters
$$ --------------------------
##$DU= <C:\u>
##$EXPNO= 9660
##$NAME= <ADRS>
##$PROCNO= 1
##$TYPE= <nmr>
##$USER= <dgb>
##$AMP= (0..31)
100 100 100 100 100 100 100 100 100 100 100 100 100 100 100 100 100 100 
100 100 100 100 100 100 100 100 100 100 100 100 100 100 
##$AQSEQ= 0
##$AQ_mod= 3
##$AUNM= <au_zg>
##$AUTOPOS= <1 >
##$BF1= 250.13
##$BF2= 250.13
##$BF3= 250.13
##$BF4= 250.13
##$BF5= 500.13
##$BF6= 500.13
##$BF7= 500.13
##$BF8= 500.13
##$BYTORDA= 1
##$CFDGTYP= 0
##$CFRGTYP= 5
##$CHEMSTR= <none>
##$CNST= (0..31)
1 1 145 1 1 1 1 1 1 1 1 1 1 1 1 1 1 1 1 1 1 1 1 1 1 1 1 1 1 1 1 1 
##$CPDPRG= <>
##$CPDPRG1= <>
##$CPDPRG2= <>
##$CPDPRG3= <>
##$CPDPRG4= <mlev>
##$CPDPRG5= <mlev>
##$CPDPRG6= <mlev>
##$CPDPRG7= <mlev>
##$CPDPRG8= <mlev>
##$CPDPRGB= <>
##$CPDPRGT= <>
##$D= (0..31)
0 1 0 0 0 0 0 0 0 0.06 0 0 0 0 0 0 0.0002 0 0 0 0 0 0 0 0 0 0 0 0 0 0 
0 
##$DATE= 1127199811
##$DBL= (0..7)
120 120 120 120 120 120 120 120 
##$DBP= (0..7)
150 150 150 150 150 150 150 150 
##$DBP07= 0
##$DBPNAM0= <>
##$DBPNAM1= <>
##$DBPNAM2= <>
##$DBPNAM3= <>
$$ [...]
##$SUBNAM7= <"">
##$SUBNAM8= <"">
##$SUBNAM9= <"">
##$SW= 20.6930455092707
##$SWIBOX= (0..15)
0 0 3 0 0 0 0 0 0 0 0 0 0 0 0 0 
##$SW_h= 5175.983436853
##$TD= 65536
##$TD0= 1
##$TE= 295.16
##$TE2= 300
##$TE3= 300
##$TEG= 300
##$TL= (0..7)
0 120 120 120 120 120 120 120 
##$TP= (0..7)
150 150 150 150 150 150 150 150 
##$TP07= 0
##$TPNAME0= <>
##$TPNAME1= <>
##$TPNAME2= <>
##$TPNAME3= <>
##$TPNAME4= <>
##$TPNAME5= <>
##$TPNAME6= <>
##$TPNAME7= <>
##$TPOAL= (0..7)
0.5 0.5 0.5 0.5 0.5 0.5 0.5 0.5 
##$TPOFFS= (0..7)
0 0 0 0 0 0 0 0 
##$TUNHIN= 0
##$TUNHOUT= 0
##$TUNXOUT= 0
##$USERA1= <user>
##$USERA2= <user>
##$USERA3= <user>
##$USERA4= <user>
##$USERA5= <user>
##$V9= 5
##$VALIST= <valist>
##$VCLIST= <CCCCCCCCCCCCCCC>
##$VD= 0
##$VDLIST= <DDDDDDDDDDDDDDD>
##$VPLIST= <PPPPPPPPPPPPPPP>
##$VTLIST= <TTTTTTTTTTTTTTT>
##$WBST= 1024
##$WBSW= 4
##$XGAIN= (0..3)
0 0 0 0 
##$XL= 0
##$YL= 0
##$YMAX_a= 465311
##$YMIN_a= -433194
##$ZGOPTNS= <>
##$ZL1= 120
##$ZL2= 120
##$ZL3= 120
##$ZL4= 120
##$ABSF1= 16.522
##$ABSF2= -4.171173
##$ABSG= 5
##$ABSL= 3
##$ALPHA= 0
##$AQORDER= 0
##$ASSFAC= 0
##$ASSFACI= 0
##$ASSFACX= 0
##$ASSWID= 0
##$AUNMP= <proc_1d>
##$AZFE= 0.1
##$AZFW= 0.1
##$BCFW= 0
##$BC_mod= 0
##$BYTORDP= 0
##$COROFFS= 0
##$CY= 12.5
##$DATMOD= 1
##$DC= 0
##$DFILT= <>
##$DTYPP= 0
##$F1P= 14.0000005364418
##$F2P= -0.99999901652339
##$FCOR= 0.5
##$FTSIZE= 32768
##$FT_mod= 6
##$GAMMA= 0
##$GB= 0
##$INTBC= 1
##$INTSCL= 1
##$ISEN= 128
##$LB= 0.3
##$LEV0= 0
##$LPBIN= 0
##$MAXI= 10000
##$MC2= 0
##$MEAN= 0
##$ME_mod= 0
##$MI= 0
##$NCOEF= 0
##$NC_proc= -5
##$NLEV= 6
##$NOISF1= 0
##$NOISF2= 0
##$NSP= 0
##$NTH_PI= 0
##$NZP= 0
##$OFFSET= 16.522
##$PC= 1
##$PHC0= -91.17854
##$PHC1= 10.0738
##$PH_mod= 1
##$PKNL= yes
##$PPARMOD= 0
##$PSCAL= 4
##$PSIGN= 0
##$REVERSE= no
##$SF= 250.13
##$SI= 32768
##$SIGF1= 0
##$SIGF2= 0
##$SINO= 400
##$SIOLD= 32768
##$SREGLST= <1H.DMSO>
##$SSB= 0
##$STSI= 32768
##$STSR= 0
##$SW_p= 5175.98343685301
##$SYMM= 0
##$S_DEV= 0
##$TDeff= 65536
##$TDoff= 0
##$TI= <Analysis number 999999
Compound Code 99
Book Reference 9
Project Code 9>
##$TILT= no
##$TM1= 0
##$TM2= 0
##$TOPLEV= 0
##$USERP1= <user>
##$USERP2= <user>
##$USERP3= <user>
##$USERP4= <user>
##$USERP5= <user>
##$WDW= 1
##$XDIM= 32768
##$YMAX_p= 410143789
##$YMIN_p= -466819
$$ End of Bruker specific parameters
$$ ---------------------------------
##NTUPLES= NMR SPECTRUM
##VAR_NAME=  FREQUENCY,     SPECTRUM/REAL,   SPECTRUM/IMAG
##SYMBOL=    X,             R,               I
##VAR_TYPE=  INDEPENDENT,   DEPENDENT,       DEPENDENT
##VAR_FORM=  AFFN,          ASDF,            ASDF
##VAR_DIM=   32768,         32768,           32768
##UNITS=     HZ,            ARBITRARY UNITS, ARBITRARY UNITS
##FACTOR=    0.157963299565203, 1,           1
##FIRST=     4132.6476996994, 0,             0
##LAST=      -1043.33573715361, 0,           0
##MIN=       -1043.33573715361, -466819,     0
##MAX=       4132.6476996994, 410143789,     0
$$ Real data points
##PAGE= N=1
##DATA TABLE= (X++(R..R)), XYDATA
$$ [...]
27558 41794 -135730 -274747 -283064 -178418 -40233 -66291 -107263 -66245 -5941 10629 52232
27547 52232 -23970 -68459 -41178 -27364 -40462 -132654 -128744 -38044 -93507 -16898 5109 85043
27535 85043 90535 -53029 -181628 -262951 -184827 69237 176145 120111 24225 -75192 -41751
27524 -41751 98231 68099 51268 91179 40712 40076 102435 89802 -80110 -191304 -47100
27513 -47100 -49561 26659 29804 -34937 -64547 -89166 -28289 26724 134027 3434 10561 102957
27501 102957 45295 13719 -33882 -19779 -48324 -113532 -144700 -145308 -92908 -37447 -11881 38138
27489 38138 -21806 34720 114979 16174 11664 -61181 -23295 106579 220810 241865 144622
27478 144622 53278 84863 58956 179929 228139 114759 -72337 -118574 -36758 -118630 -76084
27467 -76084 -24426 -11423 -31230 -65185 -62395 -12476 93760 7531 -117601 -129216 -182066
27456 -182066 -147319 -17291 50344 129399 133716 38908 -13577 19079 35486 -1929 -34976
27445 -34976 28480 59667 -16493 -26509 46242 111548 144120 -3398 -133046 -118442 27
27434 27 72106 82039 116753 138926 -21299 -13406 15081 58167 92372 66938 151062 2823
27422 2823 -226872 -77917 18328 35878 -34211 -40869 -2303 84462 53558 -48548 -68117
27411 -68117 22538 49759 -1902 -42221 -92877 -44914 39593 106600 -5169 -78996 -14478
27400 -14478 -46271 -39617 -52286 -40630 14681 89084 132622 101833 41772 12517 13986 38391
27388 38391 137826 182518 57997 -33875 37324 81806 219872 273081 152015 74033 -32812
27377 -32812 -2789 16041 5944 -5203 45676 127647 155970 111580 66850 77728 -34232
27366 -34232 10101 54149 60771 128190 69654 48878 33687 53222 65800 125694 120818 75279
27354 75279 68043 69038 53855 36990 -64094 -101972 -13700 43661 98869 63768 -25468 -76443
27342 -76443 -95995 -42510 33144 34962 38478 -25927 785 -58632 -132668 -54093 -9034 47222
27330 47222 131367 184476 135901 -16339 -31055 48252 25800 26047 46639 48883 6782 24437
27318 24437 -49375 -103577 -88747 -111182 -1135 51282 -33970 -183529 -250517 -232068 -133257
27307 -133257 -48266 -76276 -45641 -71034 -130335 -196822 -188823 -157130 14749 157016 298861
27296 298861 252909 121685 37497 70577 162813 192656 115561 82449 76575 70061 79274 43789
27284 43789 2643 -31170 -99756 -67095 -26517 77104 93605 94203 137097 -36337 -39685 -76512
27272 -76512 -186847 -155068 -59187 -19350 61619 53729 -77630 -60122 58625 171210 164838
27261 164838 116647 132205 175821 178190 121780 147502 145381 2194 -113421 -73410 -11606
27250 -11606 -48458 -76416 -50755 7107 -23479 -38734 -62954 -36826 -55060 30742 128400 103810
27238 103810 20044 -6614 -6995 52956 140088 183022 123779 93133 -69433 -95103 38636
27227 38636 17931 13541 44682 -7892 70816 36946 17973 117317 131260 41353 54368 71912
27215 71912 54710 -863 -112685 -160900 -96234 91976 127428 39516 76913 -63656 -116321
27204 -116321 -173017 -126494 -77160 -21908 -56027 -94291 13946 20172 2883 -83216 -107879
27193 -107879 -73300 12391 -58879 -97909 -26099 71053 35671 -23576 -105244 -25091 69069
27182 69069 131327 100891 157015 80423 43955 42073 58522 1933 63152 53929 -11493 38530
27170 38530 23436 -69988 -51680 57483 74162 47136 54294 86743 140355 88447 21680 2827
27158 2827 73202 143801 196031 277025 61002 -60426 -98983 -93826 -114800 -153233 -177422 -80407
27146 -80407 -113643 -75522 -92509 -11818 37684 42913 9870 -139541 -129481 -50732 -14741 65653
27134 65653 -31994 33932 216392 222709 168335 114455 27898 -35401 -91985 13163 96642
27123 96642 99239 86414 156865 213475 200766 50662 -19043 -52099 -67687 -67112 -47295 -35826
27111 -35826 57055 105141 84512 19086 -37595 -12214 -11498 -50287 -25490 -94601 -148948 -149310
27099 -149310 -40406 -34200 -66257 -57551 -74426 63387 74689 28267 30339 9508 29019 128756
27087 128756 344020 249528 172324 153040 60258 20520 54752 128698 109377 31177 -31649
27076 -31649 -42089 -32274 78335 43398 41482 45046 -30794 -57176 -77547 -82129 -125414 15958
27064 15958 141509 99841 35064 -126360 -183402 -143495 -147114 -84195 15663 11360 -58629 -1834
27052 -1834 77176 28777 33318 -61906 4146 16498 3437 62034 -21131 -111320 -189011 -213301
27040 -213301 -137856 -107320 -115926 -152838 -149019 -142955 -172981 -113569 -75838 -117327 -95958 -29679
27028 -29679 -54134 -90792 52260 198723 188627 133105 23978 5514 28160 71498 187817
27017 187817 235599 101549 84466 109086 83966 50709 103837 121081 132370 106436 130269
27006 130269 258758 153494 14926 -11965 63102 87609 75336 94733 198451 165763 96724
26995 96724 83177 130640 102216 9418 -11683 59211 142780 173330 228079 238396 94765
26984 94765 -86685 -123441 -66397 -65709 -61079 -60845 126374 124145 29699 -18532 -66153 -49748
26972 -49748 15411 47205 23870 -22207 -9000 65040 -14898 -150043 -154106 -82802 -67399 -111158
26960 -111158 -124507 -1046 5360 28330 107241 75641 22774 -249 8883 -26340 -35197 113201
26948 113201 131686 89540 116296 65042 38503 29540 -53987 -22691 34763 33625 13772 32591
26936 32591 66825 58144 -80697 -140820 -108865 -14980 -43035 -127071 -120781 -146755 -209359 -67245
26924 -67245 -68447 -173151 -181546 -175618 -135412 -110155 -33399 21892 42891 137576 153881 171996
26912 171996 194672 85456 115248 140282 158878 124046 174465 93755 39901 2743 869
26901 869 -87351 -153363 -141586 -99341 -109154 -124710 -35097 -35749 7075 -36781 -73818 -71750 -53561
26888 -53561 37368 195074 123031 -6842 70071 64372 -46429 -107743 -21971 -26822 -15396
26877 -15396 10486 42742 115259 2917 -102532 -48444 -24401 -29783 -113146 -310052 -286275
26866 -286275 -203470 -53661 28906 -51732 5530 104912 106341 114241 147465 43309 91230
26855 91230 247494 251762 158099 86090 118573 197816 55614 -25241 -82137 -53424 -22907
26844 -22907 1658 -7330 -76329 -108146 -190738 -90971 63482 77332 -76545 -56985 27750
26833 27750 9389 -42843 53552 218284 230758 175902 176714 134003 59042 -17692 -131473 -148328
26821 -148328 -129920 -83074 -174851 -147069 -217717 -264636 -173786 19352 116740 92931 106983
26810 106983 48570 -51411 -196725 -236238 -28378 -42577 24442 10014 -76088 -206446 -179231
26799 -179231 -163151 -108357 32819 57500 -43761 -70617 7727 -42518 -82865 -67191 -27745
26788 -27745 -9731 44595 130595 157590 152472 152700 164597 120089 60185 320 -17516 -30651
26776 -30651 -9982 -15017 14105 -62227 -37960 -158315 -198139 -129169 -9921 40128 54907
26765 54907 -13397 -78587 -47867 37844 -6175 34428 -10921 21722 150687 142054 154065 181386
26753 181386 117398 83795 -126677 -207806 -145315 -170110 -32433 35323 28621 72801 76390
26742 76390 -18616 -5565 50943 4911 -33086 -24228 -33856 26031 97394 107170 23813 52805
26730 52805 104119 215713 208221 69950 105829 8040 -36413 -28157 -22737 10640 -31339 -82714
26718 -82714 -160544 -142798 -112353 -61142 -38897 -41579 -119959 -114966 -185966 -116375 -48801 20239
26706 20239 36977 -81179 -136139 -145500 -95894 -115324 10512 115628 26927 -53760 -138459
26695 -138459 -133313 -6821 -10934 -25880 -59619 39481 942 -13013 95557 120392 33949
26684 33949 72319 106801 157312 99210 57885 47829 -24468 -54180 -30792 59302 49140 3345
26672 3345 46257 93376 46700 -33260 -79809 -125417 -122227 -73146 -155567 -179138 -164896 -23174
26660 -23174 98809 111950 170721 164364 155477 86344 60723 -133005 -194619 -61219 -44931
26649 -44931 -103728 -31421 -9870 -83002 -137088 -67820 -132506 -163612 -244287 -291087 -319505 -176968
26637 -176968 -139542 -173195 -201891 -70296 -35151 -51239 -57432 -113150 -145653 -112681 -3232
26626 -3232 28031 20672 -18838 -18008 -61918 -10436 -43457 -76532 -189457 -206976 -62989 -5608
26614 -5608 -24408 -4839 15188 50341 203974 127889 -24655 -96470 -11249 -16810 -31386 35997
26602 35997 -317 -64202 -121708 -196186 -335995 -213833 -76315 8470 3916 -88653 -141542
26591 -141542 -18358 9595 -11339 -8709 -467 -36052 2081 -80000 -204263 -132886 -16635
26580 -16635 -87878 -91956 -71125 -59931 -103874 -156411 -237832 -197751 8049 106340 25989 -36578
26568 -36578 -9662 -46636 -76914 -18465 105044 91831 13999 -38483 -69528 -24559 92076
26557 92076 65601 12179 -121241 -132890 -116246 -152276 -61139 46741 54702 -31594 -93980
26546 -93980 -95970 -116643 -34869 -58554 -5031 35418 65249 33718 101569 -56045 -239924
26535 -239924 -292465 -173964 -113457 -146521 -43178 74589 141353 52447 23603 6672 -81826
26524 -81826 -108767 11885 34022 -19050 -18516 76300 93955 130574 129394 82651 11238 36627
26512 36627 30818 109571 106236 40445 -65573 34450 20403 -6653 95877 74385 47028
26501 47028 20798 -36139 -57966 -71072 -80793 -108986 -67924 7687 71608 148778 146743 114101
26489 114101 43609 -47594 -81469 20676 15702 67089 5908 -3103 -101524 -225337 -181179
26478 -181179 28821 147280 157754 62535 79413 137096 188667 129617 130425 143615 132139
26467 132139 245648 340073 179471 184147 124115 39492 -20020 -145621 -101909 -20094 -17083
26456 -17083 -28983 64133 68402 -76828 -28453 55386 48424 -11535 -116424 -90223 -18843 -64213
26444 -64213 -100332 -21710 -9573 -59421 -106608 -128029 -108640 -63479 -35703 -82634 -113178 -85912
26432 -85912 -33647 -5482 16966 -12977 -121526 -158179 -146680 -115060 -89369 -25275 58350
26421 58350 -19614 -12208 109276 80781 120916 80690 68579 43910 38315 -80095 -153134 -49585
26409 -49585 3315 -50830 -98430 -211762 -167831 -9128 -31444 4680 -25016 -10961 -61300
26398 -61300 -33970 -90622 -42048 102421 110513 47802 57573 10794 30469 110409 157593 95476
26386 95476 95532 83438 156181 112312 70030 50854 98165 176521 198811 136348 77023 13711
26374 13711 24850 -85484 -192216 -84319 135135 191571 199820 147577 80492 54630 91153
26363 91153 -15291 -67021 -24725 801 130361 201862 111396 43802 -21388 -175959 -200803
26352 -200803 -103429 11437 75570 28635 -16248 -63364 37908 130055 164279 146507 183097
26341 183097 123625 147428 168797 58762 29677 21428 -67385 -73726 -68493 11500 47735 -6345
26329 -6345 -73265 -64167 -40905 -71581 -114225 -140156 -98346 -80845 -50922 -112135 -222836 -197848
26317 -197848 -211592 -111108 53271 112739 18391 100804 116784 99242 32735 63911 120598
26306 120598 62313 -93874 -159722 -145008 -103830 1780 -2168 -50096 -44217 50475 129748
26295 129748 110203 121985 122116 172875 138356 105826 72816 36682 -29742 55926 96573 -57105
26283 -57105 -41364 -70530 -123140 -112604 -155336 -119411 -155376 -76913 51149 167198 317826
26272 317826 247865 96452 38879 -8744 -11262 3240 59752 52464 84434 9693 -10300 -40827
26260 -40827 -108969 -154533 -114265 -29030 -108976 -119719 -145613 -92292 -28198 -102393 -154545 -83661
26248 -83661 19089 -34414 -61521 -39148 -6619 -53039 -16976 -70864 -74916 51493 60180 -37174
26236 -37174 -11772 -6841 -78083 35467 -18064 -118154 -45228 121822 2862 -125938 -189838
26225 -189838 -72210 -6672 -42900 5513 16531 -24804 -34829 26754 2734 132468 143663
26214 143663 107440 46021 80051 118156 94323 86716 61461 -3624 -68145 -26536 -88063 -53382
26202 -53382 -26245 -77440 -99884 -98753 -97066 -123903 -59918 7956 -42383 11845 187450 125131
26190 125131 65096 96923 18504 29928 -36674 23668 90702 13142 -65256 -91291 -79692
26179 -79692 -68198 29238 35248 -67755 -41851 -68535 33075 27211 95788 105505 82856 87567
26167 87567 -3954 -27219 120391 170233 155328 130472 110095 98624 43554 -56944 -92725
26156 -92725 66309 26924 -32971 -30628 -79610 -94192 -81268 -56417 32589 44893 24752 23578
26144 23578 -30894 -76664 -32161 25760 27397 85917 98890 -23625 -38678 -43240 -36782 29967
26132 29967 -41755 -22981 15088 -12474 72369 85052 830 1531 -273 45619 142576 71808
26120 71808 131376 134759 10866 78155 304617 255509 147086 -28069 -116332 -86531 1433
26109 1433 33976 161390 260318 144991 -15632 -94531 -67651 56556 156903 176195 120138
26098 120138 107714 165972 138787 29366 -78369 -140456 -59123 30655 78454 60218 122707
26087 122707 24804 59456 142572 179874 119919 64621 62284 -16748 -4307 -152 -3282 -18719
26075 -18719 -32015 -53595 -75216 -469 -4528 -105225 -214636 -297298 -223048 -83997 -33332
26064 -33332 16830 138387 134513 83173 104993 188383 95597 72080 192561 189765 211820 241860
26052 241860 172027 132751 16883 -53127 -135559 -120970 -89996 -40882 9128 17958 -10111
26041 -10111 -112775 -19650 -17601 44028 39418 112358 164225 140645 113722 56836 -44411 -121718
26029 -121718 -111563 -58126 -120674 -180890 -74914 29984 -3318 -130744 -35670 33044 111285
26018 111285 66669 1970 92736 -58011 -121824 -76840 -83656 -128213 -97407 -106489 -11202 120556
26006 120556 132581 71217 5031 -32847 -85797 -175099 -110704 -73050 -25154 -24801 -49181 -53528
25994 -53528 -119858 -115266 -142912 -128405 -104285 -28042 11241 -19776 11535 -134101 -238137
25983 -238137 -141670 -112918 -137483 -143768 39443 86708 4647 -9430 -2093 6625 158722 134928
25971 134928 88784 195559 242457 80624 -55680 -12594 60584 29513 59134 179310 210861
25960 210861 103838 -119 -65458 43045 64798 58831 75628 86592 109129 24443 54868
25949 54868 15700 40146 163273 61814 -30091 -10316 -24317 25147 110383 70644 18670
25938 18670 35105 45845 27969 -53635 -85017 -33479 -45252 -103364 -60007 102106 118707
25927 118707 13643 -44324 -8678 19817 16788 -84497 5106 -33603 -3075 -34015 -14487
25916 -14487 -86218 -121839 -42207 98100 142017 76045 109211 128608 156759 145838 143811 191344
25904 191344 123969 156075 192371 151900 126292 110489 70846 85853 142610 135815 38168 -78075
25892 -78075 -138610 -112299 -165992 -34272 94751 -26421 -135414 -179560 -77221 -5795 64972
25881 64972 33804 -77953 -113531 -163506 -163326 -26338 80024 77280 41231 47987 89820 151015
25869 151015 126244 33671 103225 175327 179984 215302 181506 194938 125064 224879 224234 109949
25857 109949 -14798 -14714 86271 196427 209697 38575 25088 60703 89731 -33289 -36278
25846 -36278 -39165 -121911 -158308 -74785 49842 -18841 -81166 -149078 -141988 -95350 -7340 94164
25834 94164 -40948 -114909 -57147 6717 -37237 -93025 -70238 46858 100553 48957 32525
25823 32525 -22756 23059 44775 94790 28741 -71556 -88698 -1216 -40755 -79084 -64620
25812 -64620 69527 91643 63357 50539 60202 89772 72345 3290 49991 35070 -2744 -64249
25800 -64249 -139363 -157071 -207887 -352266 -260600 -92896 87901 135347 131820 131621 55739 -43266
25788 -43266 -102864 -95191 -55965 -25037 42299 -1798 -104000 -47714 30195 41251 140521 200962
25776 200962 188821 152141 167783 180213 92181 101394 20355 -24393 -62076 -117363 -107788 24719
25764 24719 9249 -5153 -23106 -12064 -61469 -49584 -40468 32340 146430 146968 142568 7416
25752 7416 -143363 -157608 -147095 -78425 -105830 -145739 -184725 -78421 5762 -35087 -12922
25741 -12922 5683 25168 64369 76213 5955 -36795 -54420 48863 8342 -41386 -150311
25730 -150311 -73724 8291 13797 -58407 -51393 87447 171328 100052 144003 248896 166922
25719 166922 58686 47520 -3754 -79517 -90796 -165062 -224984 -175504 -4806 62833 87611
25708 87611 120023 145763 150036 88809 126137 108280 139866 133578 87990 -24649 -154717 -95483
25696 -95483 -103754 -114195 -50928 66117 66785 42858 122767 11285 -3169 34770 45615 99170
25684 99170 43201 130 3806 55561 37264 45428 88510 83908 160815 48682 -36508 -133833
25672 -133833 -152309 -137942 -124073 -235746 -134642 14849 102104 118377 60499 32663 -38396
25661 -38396 -91546 -25820 67242 44624 51646 -21806 -8674 -43752 -72603 -77896 -63491 -2011
25649 -2011 -41996 -78070 -72304 -120934 -159340 -164236 -105377 -72050 55060 46415 533 70687
25637 70687 25492 -88875 -160565 -130811 -76676 -105462 -90137 -36692 5614 7109 -51559 22862
25625 22862 142628 220396 347646 300929 142423 2182 -42152 -1013 -47298 -77501 -131974
25614 -131974 -128403 -81561 -54878 -76276 9053 102616 171559 163209 159943 141036 153959 110694
25602 110694 -11481 -6575 79283 61336 -17675 27357 8781 -47912 11711 11384 -50579 -120680
25590 -120680 -114267 -55047 -31515 25424 85697 35496 50572 62012 -20418 66255 24550 -71276
25578 -71276 -97003 -5179 22907 64543 55028 -14140 24735 -50651 -120589 3394 109610
25567 109610 142516 237579 309335 182795 134517 52918 17601 38173 -59753 40983 20985
25556 20985 -33267 61989 121196 161285 92289 -931 -111 -28162 -63404 -93789 -154925 -91621
25544 -91621 -53544 -166531 -253440 -202874 -193885 -237149 -192254 -40698 13313 81437 18911
25533 18911 -77253 -54293 -198872 -217458 -44817 42852 64168 47218 -48492 -71010 -61532
25522 -61532 -239110 -337179 -242166 -190701 -167171 -152247 -193325 -157656 -41189 -78451 -31675
25511 -31675 69961 85049 68790 129393 87387 -43867 -114679 -43802 33915 65561 2485
25500 2485 -111928 -116592 -14729 80844 10979 12484 -8190 15253 36627 41293 -30622 -91833
25488 -91833 -25935 -25060 -39742 15516 35462 -38964 -45608 2322 -39778 -53128 -148992 -172176
25476 -172176 -144348 -193512 -201390 -63478 -130158 -197972 -161726 36099 109863 49855 17489
25465 17489 109158 86325 40237 19776 -78891 52909 64808 66972 65261 115400 102726 26792
25453 26792 -24209 -71201 -98452 -74743 -64805 -43905 -22654 -27068 -51113 -126946 -143369 -62518
25441 -62518 62937 99917 58620 33708 105951 153715 188706 111359 115434 20330 -42403 -57974
25429 -57974 16731 29215 46328 -23864 -115728 -112686 -21110 8137 67026 -63564 -170880
25418 -170880 -85194 -88432 -139902 -77911 -18408 33165 107276 176213 68378 14716 -40258
25407 -40258 -58379 -7595 61287 52552 117885 206519 136097 92473 202825 204486 51893 -6607
25395 -6607 -20847 -25069 37747 -17491 -73371 45628 78914 123685 97590 94503 4422 -18184
25383 -18184 64096 93958 108064 108347 171441 187305 -16788 -16899 69497 -60929 -127714 -188802
25371 -188802 -216332 -147508 -123742 -50053 -119967 -147258 -195100 -105246 -112319 -106932 -57212 -33430
25359 -33430 -4602 50415 64340 -10312 -53587 -15306 104743 133263 201635 224017 115409
25348 115409 27614 45395 7933 -14340 -26691 -20316 -16231 -62900 15416 110802 86787 -31252
25336 -31252 53378 105828 43319 51608 14622 32146 1360 -50344 -131290 -140384 -58083 -72508
25324 -72508 -128134 -76862 -196678 -298819 -286873 -252561 -193666 -50539 -54950 -13157 -19548
25313 -19548 -76096 -128987 -105151 -118408 -163485 -183984 -181252 -154842 -107245 -158026 -101807 53564
25301 53564 115988 170116 230177 180502 97987 60972 -1404 19969 23534 68121 190139 233142
25289 233142 116029 -32999 -31719 16757 -118 1597 910 110987 104060 93531 7745 -57619
25277 -57619 -73334 -73723 -127261 -141616 -97380 20796 44388 -22352 18849 53551 78878 -7962
25265 -7962 -11698 -66460 -116335 -167505 -55972 2886 104395 69962 -11353 1453 -47269 24226
25253 24226 141603 79902 74662 -42384 -54005 -7048 49832 24133 64964 32110 -43207
25242 -43207 -162983 -190902 -113363 -138075 -160042 -113195 -113628 -153887 -91449 9805 -49324 -54142
25230 -54142 -43290 -40038 -91251 -243116 -262785 -294126 -248763 -257052 -258676 -174779 -100618 6531
25218 6531 27003 -65897 -10694 154372 140973 107141 189399 25652 -94092 -154998 -161808
25207 -161808 -199571 -254719 -146051 -7624 -6191 131308 142805 68171 2588 82604 143461
25196 143461 72804 -23024 7157 -39135 -29314 -19528 34123 79004 -32118 -49078 -168553
25185 -168553 -173654 -74766 -15804 -13523 20216 68678 93021 49210 5284 -22028 589 95734
25173 95734 166195 107580 75702 108267 65216 5287 13921 17174 56124 104695 117016 115225
25161 115225 26317 -19210 111509 57355 -9897 -48871 -124249 -146954 -137754 -47447 21212
25150 21212 4737 7188 20540 52525 149502 105811 16330 -48299 -45873 -24842 -105462 -105762
25138 -105762 -26052 -13900 -8790 66400 169219 90202 102058 126747 127526 223334 166990 12333
25126 12333 -67934 -43608 -17773 78860 211965 15280 -141339 -188662 -148990 -57834 -35020
25115 -35020 -57584 19144 181293 213589 52893 -90143 -148818 -42384 -1910 44820 53504
25104 53504 35020 -4533 32729 77577 102797 50858 -60732 2663 -26156 -157001 -183300
25093 -183300 -249850 -264488 -244974 -319421 -300730 -205836 -233491 -199234 -102352 -50289 -72878
25082 -72878 -111024 -53901 -85329 -78269 -38676 -131096 -145063 -96843 -101113 -213693 -236220 -206367
25070 -206367 -201109 -167773 -33017 127905 113215 59720 76053 124808 125449 60885 3119 2534
25058 2534 -138371 -215218 -255282 -196522 -129473 -83882 -187698 -168120 -83014 -63260 -83763
25047 -83763 -76651 48318 116636 84527 63388 61745 24158 109360 167318 93764 -87110 -135077
25035 -135077 -133268 -27125 81764 37207 -9067 -63088 -115027 -64987 -36266 -42770 -116896
25024 -116896 -114342 -131265 -79302 -65281 -46856 54217 -8898 -53268 293 28213 11508
25013 11508 -88254 -104537 134844 116137 96840 -7321 -29851 -29398 15894 -46580 -160618
25002 -160618 -104802 -116515 -174252 -105295 -67577 -42755 14784 -76802 -63986 16516 -83194
24991 -83194 -26374 45812 118746 190857 105205 50189 23685 68810 50533 14938 -116709
24980 -116709 -148613 -211152 -182059 -115520 -21750 38185 54616 87233 178556 61619 6450
24969 6450 63837 47639 38768 -60330 -33866 36381 143316 104132 23961 -59234 -141619 -3365
24957 -3365 134109 115470 32654 105899 141904 178265 87395 8824 25636 130889 232156
24946 232156 230955 125816 71120 25151 -20872 -181536 -262211 -232901 -119428 105381 185450
24935 185450 50624 -23470 22944 138538 80622 -26634 -33740 27384 50290 3408 28412
24924 28412 -52470 -10552 -30617 13380 -53497 -33941 62873 -26560 -117555 -113895 -148818 -108647
24912 -108647 -106104 -192018 -168871 -71438 8506 12009 9806 -23066 -73280 -101864 -21721 -10241
24900 -10241 1602 -39216 -9744 68483 58195 136109 57259 66496 88209 108846 36848 24274
24888 24274 64213 160870 166681 54244 -130780 -278655 -334483 -353107 -314628 -274263 -331004
24877 -331004 -201189 -61096 41972 9 61457 231732 373241 338310 144980 133301
24867 133301 45422 -44592 -55702 -62302 -46392 -4856 53321 59277 -40217 -108735 -145048 -43490
24855 -43490 72955 145023 139911 191430 159474 102502 -6577 -53304 -146006 -313195 -275629
24844 -275629 -165100 -30496 -33021 -52210 63601 120410 123679 100069 101212 63879 10081
24833 10081 -55026 -88444 -100549 -133028 -103456 -52650 -62871 -98494 -70506 106807 55950
24822 55950 -68191 23542 -8447 -83315 -49090 22119 -62213 -157010 -109047 -24810 32418
24811 32418 -47652 51615 99105 28063 14704 19142 1771 85173 169173 58192 -162424
24800 -162424 -123345 -17649 2729 18515 29852 -21600 -110937 -77750 -98230 -242719 -183044
24789 -183044 -68306 -88087 2227 11117 -108156 -16697 -11828 -3646 4924 -40242 -100309 -105389
24777 -105389 -77747 28103 -49224 -176401 -171719 -193284 -41857 128144 141012 -47036 -75446
24766 -75446 39089 -30646 -61797 -37716 20239 12300 -99163 -61079 -1523 102693 174718
24755 174718 198758 142488 18619 -42070 -11433 -19155 -113274 -103176 -244216 -334330 -210919
24744 -210919 -110433 -35845 -12617 -8706 -142924 -126228 -101217 -175278 -123802 -155421 -141572
24733 -141572 -110034 -67891 -35361 -89511 -181720 -230992 -253933 -254220 -244374 -109300 -30449 -19065
24721 -19065 13045 100889 146505 159412 50656 48048 79801 20010 -21665 -98222 -128862 -43278
24709 -43278 31646 38196 7642 -6948 11103 -62796 -206114 -274886 -279536 -109818 75689
24698 75689 68513 -56757 7252 64021 -45826 -111518 -99449 -33422 -74539 -208563 -131884
24687 -131884 36287 76032 162367 220317 206695 176769 73462 -41421 -46217 -30924 -65090
24676 -65090 -131879 -134011 -120957 -162040 -87079 -56527 -70995 -103987 -159238 -167137 -190065 -64233
24664 -64233 106774 82264 141865 179644 97183 -81681 -64092 -53156 -63699 -47519 -138291
24653 -138291 -82174 -29682 5103 35518 131345 92411 423 -3597 -52762 -74071 41936
24642 41936 114941 -30563 -140396 -100492 -107840 -122320 -56187 -74026 41585 71805 -7426
24631 -7426 6381 35130 -48134 7822 60868 173013 201527 25093 -6213 30029 -34981
24620 -34981 -8539 119778 100419 123982 163062 9216 -125055 -50701 111376 265256 249387
24609 249387 200946 70809 -12754 -74782 -33889 55385 114734 188074 88357 133054 101408
24598 101408 85580 79297 45306 -54257 -117221 -206347 -126160 -29117 -64466 -106717 -41350 47797
24586 47797 -55625 -183216 -106755 -59972 -64575 -94989 -160283 -183027 -159778 -211052 -265550
24575 -265550 -182586 103297 25340 -33096 50850 -6441 -54851 -63352 -144689 -127101 15832
24564 15832 -10058 -49015 2823 -16399 -18216 -20786 -82995 -47510 14844 6203 36523 82847
24552 82847 87010 136431 84910 55619 38304 -54289 -66223 -51707 7323 -105668 -55695 18861
24540 18861 93824 87189 30518 -11616 3911 -28458 35765 20763 -35561 -62608 -79397 25736
24528 25736 84872 35698 -71386 -138788 -9685 21291 90683 54962 38542 4475 -75513
24517 -75513 -87546 -108909 -164522 -166938 -190215 -288248 -317864 -277401 -175704 -81031 -6733 -2992
24505 -2992 87689 83977 145509 175840 -9963 -73903 -30606 -40133 -144562 -197246 -106212 18371
24493 18371 72016 75118 83779 25642 60126 37526 7212 73785 77915 -11444 -116412 -152594
24481 -152594 -104025 -47755 -20377 -47549 5629 18332 30616 29386 9187 180616 278038
24470 278038 168157 34933 79061 162654 137471 86057 -6837 62488 26946 17499 -2442
24459 -2442 -25263 -34754 18804 20000 -16194 -41059 15211 -25579 55372 71287 60756 129404
24447 129404 101138 56528 63535 67811 -21015 -114438 -73251 54578 108903 -6898 -5319 -22379
24435 -22379 22430 96821 208412 202259 124506 61132 -21667 22217 -94100 -71920 -111816
24424 -111816 -174980 -122035 -125511 -149530 -128151 -111011 2409 59227 38380 59705 115184
24413 115184 146699 106843 148667 130292 82065 9812 -110695 -132273 -105599 -82594 -26480
24402 -26480 -377 7000 23533 -43189 -143530 -173899 -76368 42011 -51027 -66861 21899
24391 21899 -10215 -64536 -82665 -94279 73417 137500 18834 -50098 -44140 -3154 -59494
24380 -59494 -132901 -192082 -94010 -70566 19702 -18179 -46064 -77623 -108805 -96404 -203462
24369 -203462 -260971 -205894 -61103 56292 124356 124671 74428 65894 81776 67666 54816 -71947
24357 -71947 -79611 -22405 -13438 -85045 -98104 -19232 -52149 -34558 54837 73248 31956 -7397
24345 -7397 32790 95831 53532 44115 94687 151110 44924 -27809 -105783 -117859 -48345 -27300
24333 -27300 -14605 -24682 -75772 37499 205802 207265 127060 44075 37607 -60227 -133997 -144971
24321 -144971 -96795 -16464 58233 -20190 24480 42650 51413 72131 26684 4397 100 32392
24309 32392 23184 44093 45043 -608 2465 32725 -79453 -24836 108892 116603 115137 136232
24297 136232 173840 140813 85016 86451 -23012 -80953 22603 86193 137750 163994 69567
24286 69567 95147 52695 53414 27244 -52968 2486 77506 8505 -118975 -187965 -133209 107139
24274 107139 144110 79681 141409 17749 -4147 14764 -32601 -7798 7780 -6504 -31668
24263 -31668 -129369 -63585 42526 71441 79846 -74317 -86097 29183 44367 -20694 -47009
24252 -47009 8324 57957 -38382 -126853 -97005 -86017 11497 111451 29736 -37906 -68086 -84381
24240 -84381 -188703 -227387 -154479 -83788 -127459 -57291 -27166 25165 55996 -34724 -89029
24229 -89029 -58875 153087 209555 53235 -60612 -13593 42904 15733 28288 22554 51002
24218 51002 6206 51 10890 3874 105630 31805 -72481 -48349 6811 47508 119167 139116
24206 139116 14391 -24717 -73280 -49024 -103639 -151986 -84818 -4077 52068 -14282 -38490
24195 -38490 -48302 -76002 25401 35899 92924 -5250 -93143 111681 137066 45247 89278
24184 89278 57805 18636 124003 146362 126962 -2463 17652 -32447 -86516 -76055 21638
24173 21638 -30773 -27025 35317 57970 87801 40954 -93285 -189364 -168453 8327 17187 -7311
24161 -7311 16035 -12904 -70753 -68266 -23891 -49865 -180602 -146361 -51747 65585 124634 61385
24149 61385 24334 69331 -38839 -101440 -101384 -111144 -89331 -39113 -13221 -35193 -88622 11069
24137 11069 44379 11898 21276 -112821 -93191 -57640 -54191 -46251 -45046 4895 93524 -6450
24125 -6450 -68877 -47284 -10168 -84350 -49568 15389 41285 202279 208006 146415 142734 8341
24113 8341 32625 78765 161436 166553 25588 -84223 -49261 4207 18158 115343 90875 -19357
24101 -19357 -26116 -58522 38477 -46314 -65115 -33038 -11062 -24775 -54704 -34273 -131901 -130903
24089 -130903 -153579 -84708 -45104 -17706 -127565 -56949 69529 160319 182839 104597 -5430
24078 -5430 86618 71015 37652 27377 58932 136843 160117 171774 116243 21431 -180740 -90314
24066 -90314 -84568 -125607 -145290 -132786 -117896 -73858 -74001 -53842 36732 48992 80516 49064
24054 49064 6596 -18852 -35959 38267 -45645 -56190 -40444 28141 -20956 -123870 -96330
24043 -96330 -92976 -77953 105368 207281 227620 196937 127439 103797 -1830 6738 57707
24032 57707 62487 37784 -9577 19455 14306 89645 94094 28667 20415 60010 36407 57665
24020 57665 78133 24345 -70773 -58168 -70676 -27794 27479 -82251 -198447 -70814 -10108
24009 -10108 -162632 -234462 -236723 -173425 -158270 -177310 -193128 -136687 -71853 -130673 -197049 -161912
23997 -161912 -149003 -60833 -61469 -33559 -69151 -123652 -22547 103802 154599 114731 57400
23986 57400 31715 10005 44702 -36754 -101983 -97604 -55060 47964 97317 19920 -16724 -12887
23974 -12887 -25945 -71546 -95399 -91631 -157990 -130913 -83818 -72856 -21523 40094 34456 -41309
23962 -41309 -8619 37837 51965 31298 -6739 65174 169063 107625 6975 19202 119525
23951 119525 136199 112627 146510 34769 -45527 -17083 52852 78976 -43069 -177652 -160994
23940 -160994 -63226 53532 -30768 -95519 -83828 11000 128373 132397 171029 105105 -78751
23929 -78751 -96126 -113455 -130158 27764 94681 85857 69090 56748 75958 126717 45829 143462
23917 143462 227890 235801 248469 225653 162882 120442 123187 76475 92961 194178 123408 -15432
23905 -15432 -25224 -17679 -65655 -143050 -218941 -247625 -257432 -209757 -170641 -208582 -163931 -97980
23893 -97980 -126767 -12589 154531 113766 82913 119528 148518 122639 18710 -61952 33062
23882 33062 151941 178376 195278 35771 -71990 -11332 62995 73595 144025 123424 -5960
23871 -5960 -3382 29246 25757 -32097 -123020 -113377 -145664 -109066 -30270 166967 147137 35563
23859 35563 -21020 71251 113753 157636 195113 251574 104740 56265 34938 -30161 -32606 -2787
23847 -2787 10686 50380 -13600 -50795 52220 114445 53230 3579 114323 124577 207655
23836 207655 161955 21974 -32020 -27538 3309 -47144 -68490 -77977 -22664 85423 98997
23825 98997 21818 28647 14730 -40703 -45693 64116 32545 -1248 54591 -17358 -87134 -16414
23813 -16414 -22998 -88549 -140531 -159411 -237294 -207973 -153583 12976 159242 120965 137658
23802 137658 151616 132930 250211 205205 40310 6773 -16813 -38287 -27320 -37150 -141891
23791 -141891 -92121 -47532 -15538 -81016 -83886 -11308 93839 34237 -20813 -11062 -34607 -17913
23779 -17913 -7267 28166 -1507 -63031 -89755 -109656 -11165 6166 55857 -20873 -111162 -82567
23767 -82567 -53062 5576 65436 18794 -992 -19775 -65048 -31813 93205 50863 -103758
23756 -103758 -37650 -52460 -18104 -13542 -97673 -61425 -24563 -32129 13007 24565 50081 78147
23744 78147 -22752 -110477 -15666 -81056 -94084 37891 71651 81133 23976 -48195 -60278
23733 -60278 67978 26123 -2088 -23218 -33862 -113002 -197103 -136836 -48454 109487 162577
23722 162577 132270 37241 -10512 -35413 -63765 13133 32499 21187 93714 106819 69536
23711 69536 24861 -115345 -214746 -90799 -59936 80278 119487 21747 -86521 -92842 84813
23700 84813 117123 92318 -15761 -125187 -113733 -107484 -70335 -117056 -186817 -174619 -150207
23689 -150207 -97677 -126731 -97600 -121111 -124928 -17549 23502 51808 80416 34972 -40846
23678 -40846 -41927 58223 114212 -18068 -177831 -219596 -237537 -132139 13411 6819 -65946
23667 -65946 -35181 16952 -22207 -85783 -156863 -229279 -53830 92084 108608 -108911 -233799
23656 -233799 -200230 -115535 15067 111845 24598 32081 6700 -91559 -151785 -138659 -188177
23645 -188177 -12283 46153 64301 61527 34297 70167 95629 -20815 88964 138469 -46987
23634 -46987 -93367 6538 43330 20992 78175 112897 40892 -29505 -173152 -114357 -115348 -182824
23622 -182824 -219516 -275976 -225580 -62628 22812 -18153 58430 22133 -412 -3651 -20464
23611 -20464 -6194 37502 33820 10486 -54770 -72972 22197 7559 22921 33938 -77645 -73247
23599 -73247 -72128 -115387 -126736 -76348 44739 -16293 8849 185061 123978 -26408 -50157
23588 -50157 -86206 -33339 -36281 -58352 3164 -30375 -61750 -108245 -109593 -55676 -61962 33889
23576 33889 46146 120963 21944 -159903 -71363 -58305 -70412 -79680 -103065 48605 155915
23565 155915 160153 182571 176180 239764 190307 191034 45545 26333 -133671 -9478 60676 97950
23553 97950 150113 92249 -35137 -41149 107963 30157 87263 125779 141795 157507 82534
23542 82534 32907 21545 -10591 28375 -16446 -92795 -114145 -158981 -227488 -108436 -37024
23531 -37024 -48104 -68954 -22848 30736 73329 197287 95367 16045 -12241 -63833 -101454
23520 -101454 -161069 -248971 -271238 -217227 -132054 -96667 -43206 -21095 -75550 -85786 -175217
23509 -175217 -179883 -33917 90804 65905 54966 59857 126829 213941 86938 -19469 -22290
23498 -22290 -5706 36483 4104 -103509 -156085 -7053 106610 111059 -34602 -60201 -59360
23487 -59360 -118112 -117504 2285 -19237 -18586 -59332 -10312 33835 126835 69125 -57879 -30038
23475 -30038 125652 93345 16068 12738 -16054 -72210 -12258 45290 48174 78183 41221 55678
23463 55678 116535 108776 26512 12824 113650 69731 86834 87943 192196 192685 200068 250285
23451 250285 190890 117227 189270 242259 137720 81777 69781 34710 91207 111113 53785
23440 53785 20019 -22708 -26443 -68681 -72061 -75549 -103831 -110354 -211570 -255665 -143518 -98844
23428 -98844 -44116 -48851 -8099 84120 5342 -16710 -42390 -40357 -40713 -4284 -25165 -195973
23416 -195973 -158051 -159413 -277271 -329921 -335689 -270573 -158087 -175013 -198845 -142712 -78904
23405 -78904 24889 -68781 -230177 -179432 -184398 -88298 -16025 -72937 3911 -13655 -25110
23394 -25110 -16053 -14953 30733 87335 210007 246951 115232 131904 86931 104111 125927 81298
23382 81298 -99383 -205856 -237911 -220287 -180874 -39887 -45936 -230430 -207026 -110390 -35954
23371 -35954 -64719 -57541 -4086 -26080 -34838 2065 83584 -31757 -10399 34798 5558 -32150
23359 -32150 31681 88761 141628 177978 152878 205271 195488 66290 -33373 -25564 -24967 -65900
23347 -65900 -130945 -249499 -247695 -207680 -244841 -188008 -115409 -124746 -125125 -28983 29242 -43718
23335 -43718 -154332 -132926 -82442 -105017 -46353 24311 -5725 -30632 66577 65281 48144 -16579
23323 -16579 70600 106183 57889 21899 -12192 -39189 -72853 -164585 -98117 -3974 -51981 -56210
23311 -56210 -81957 -138337 -196340 -138490 -41002 5679 148697 198844 134146 44995 92130
23300 92130 173690 171161 158876 121864 96419 35883 7096 -57353 -51061 -87867 -94358 -48314
23288 -48314 -6130 -46540 -124086 -171828 -233887 -231591 -153563 -179374 -123681 -125503 -70699 -136010
23276 -136010 10473 118346 87816 41158 -36107 126913 136809 45218 30515 30169 -10644
23265 -10644 -23513 -75807 -11925 61699 107114 57580 -64498 -176497 -155609 -87886 -71370
23254 -71370 -148415 -55600 36923 -8317 -61504 36242 -26232 47813 59141 -24991 -34584 43843
23242 43843 -26841 -112468 -146020 -99575 8350 102124 47699 -7442 -88578 -71203 -182487
23231 -182487 -188873 -59565 -100140 -205615 -248076 -166609 -110310 -147902 -244779 -380112 -321770
23220 -321770 -230254 -178068 -49028 -62625 -85817 -217212 -297682 -329106 -258147 -125632 -73585
23209 -73585 -138185 -178981 -58450 34770 88574 4634 -154759 -66497 32974 141541 109872
23198 109872 -35454 -129506 -217547 -267257 -150777 5580 114032 151978 159643 87686 10034
23187 10034 -29447 -68907 -105166 -40174 10141 77565 110534 144337 107549 96960 165723 194711
23175 194711 152974 90517 67207 172400 251326 171572 100145 120647 115343 102067 11940
23164 11940 26684 94770 71899 -134910 -75080 -15957 -35786 -130405 -144500 5418 35654
23153 35654 -25359 -66878 -26785 10962 -85782 -17124 -65694 -128375 -164114 -85709 -996 92279
23141 92279 141037 126996 61039 -61322 -127928 -24896 -2994 -29613 -27104 -3184 -10242 938
23129 938 86953 158130 81531 48067 -26835 -71680 -9959 36891 -40153 -15399 -713 101003
23117 101003 42782 -100007 -11847 47008 8346 26478 81909 -56725 -86113 -102047 -138526
23106 -138526 -72620 -79499 -68493 -8580 11538 -42950 -67876 -23546 -66338 -217911 -206129
23095 -206129 -86605 -50842 -56568 -74381 -204044 -204043 -7795 70080 -1503 -7211 -63787 -140017
23083 -140017 -107394 -115365 -136706 -85515 -110251 -87470 -79584 68403 128949 49669 18752 66780
23071 66780 41990 66623 14063 20387 -34498 -146467 -85935 -120222 -71820 -282 -28288 -60997
23059 -60997 57901 87353 99986 106735 142183 75727 130370 149928 48121 6102 115779
23048 115779 70282 -15619 -47496 -89524 -95531 -44587 62572 -1627 -76324 27977 137201
23037 137201 112379 52252 -82055 -134262 -129400 -40995 94313 98015 93859 38386 -121328
23026 -121328 -110872 -6094 57303 127260 106877 94914 45307 -4457 -17587 -17694 -6572 25926
23014 25926 -45677 -34479 15329 -12069 83452 122151 80993 136722 133248 75275 33986 -10197
23002 -10197 -49268 -101192 -47810 98724 131414 221556 165106 41947 -28525 -15543 51304
22991 51304 -31252 -38790 -65406 52625 4151 -118992 -75006 26343 68171 -91884 -198155
22980 -198155 -166249 -158857 -210357 -279933 -202993 -128835 -103819 -107908 -43968 -38758 -54666 9888
22968 9888 54905 -7018 -81540 -123960 -125025 -85416 7885 -60799 74630 115163 18746 -72157
22956 -72157 -92141 -134629 -63281 51364 104832 130776 115465 -47297 -173425 -268880 -263628
22945 -263628 -176041 -162408 -226856 -273644 -11480 90727 70713 63447 132019 149130 15005
22934 15005 -150646 -157475 -48594 -7927 61987 93345 35826 116072 165306 177229 165466
22923 165466 -30202 -194719 -150445 -118454 -102812 -67637 -61742 -151777 -150207 -102785 -39928
22912 -39928 -177913 -241354 -154318 -121828 -69735 -72287 -59554 32503 51002 44080 -51945 -106094
22900 -106094 -102176 -114938 -138398 -150435 -62179 17340 68244 18458 -65737 4756 5506 17655
22888 17655 41716 -28321 -110727 -79002 -84548 74505 134759 148693 -54903 -111867 -88642
22877 -88642 -229864 -294873 -229458 -146753 -93682 -42635 746 -57252 -56978 -26975 -26803 -39927
22865 -39927 -38829 -85775 -128237 -107760 -207450 -125005 30474 119575 136460 46281 -56106
22854 -56106 -58803 45884 83699 67651 138866 64072 -97012 -123782 -96101 -112947 -42166
22843 -42166 7485 -92330 -32300 -6814 -62542 -82296 -101652 -72446 33627 52431 30853
22832 30853 23372 12475 8994 -18752 61881 30034 -76319 -63104 -100846 -85761 44323 66257
22820 66257 75443 -6702 -94139 -128646 -59271 -54793 -95799 -103878 -230671 -279741 -188585 -178591
22808 -178591 -74062 39434 -36753 -111421 -83937 -115876 -161081 9804 191899 68398
22798 68398 -17313 -72817 14867 187295 143017 145450 187617 127144 200613 222178 154442 61807
22786 61807 34609 -1173 -78874 -116439 -45998 -12516 -130921 -142637 -109918 -129456 -239906
22775 -239906 -206943 -42668 67617 -11550 -115345 -52370 85722 86787 -85431 -7916 59427
22764 59427 62281 88960 102307 203074 158236 41728 65981 80177 104924 -28582 -146700
22753 -146700 -198549 -92716 -2965 -58040 -126156 -113205 -82083 -82911 -58270 -120102 -26416 2190
22741 2190 98649 91275 36144 6570 -27777 33893 66429 10976 -52566 -68340 95293 72621
22729 72621 22690 -8219 49510 -1747 -156442 -220403 -131002 -91991 -185190 -65852 -90082
22718 -90082 -230125 -159011 -22074 -9363 -83048 -119548 -18445 -2599 14023 -33348 -135810
22707 -135810 -193305 -183675 -185427 -231467 -242804 -220588 -206994 -252055 -269598 -96798 51270
22696 51270 52754 103019 120735 65521 96809 126153 232489 197945 56429 -6183 17729
22685 17729 113281 171314 144363 99717 120131 144821 144544 11059 -106870 -138188 -116549 -197527
22673 -197527 -115767 18778 3251 -110393 -118052 -87217 -90494 -163210 -131252 -118075 -46956
22662 -46956 -47513 -7213 66857 18274 -48070 -81338 -24614 1589 38320 -9578 10970 58407
22650 58407 115838 -5821 -114292 -151052 -102876 -12652 -93015 -131453 -92720 -89051 -32223
22639 -32223 31844 79452 187728 94495 -21614 -40965 7257 -20186 57514 78071 70714
22628 70714 -62524 -82350 -55835 -168291 -154507 -71114 4884 46157 10380 -44373 -90268
22617 -90268 -24332 303 -106424 -44466 -5687 29909 63575 87221 12935 -53264 -81513
22606 -81513 -234440 -281655 -184731 -89944 -65740 -82377 -114874 -119774 -115459 -49808 -67042 -84872
22594 -84872 -43473 16091 19444 -35675 -87534 -113752 -95892 -55231 -81918 -80592 -22771 -1330
22582 -1330 -29450 921 77595 99858 79335 107442 206149 179045 130307 56120 42606 161943
22570 161943 152461 135287 9412 -114995 -181287 -182789 -153772 -147428 -217519 -139925 14597
22559 14597 -3866 -70701 6991 63900 -36784 -150624 -216112 -173435 -257547 -171675 -107814
22548 -107814 -157265 -206093 -201755 -179552 -139005 -176755 -245493 -147424 13197 142719 98518
22537 98518 106109 108535 171751 242977 261084 306838 222889 74006 78212 88096 83928 84609 99366
22524 99366 101323 99447 41372 90054 185083 299075 328404 268298 116702 60875 24295 81852
22512 81852 67785 27820 38110 122 -96684 -205661 -145344 74648 131936 -6834 -37656
22501 -37656 8943 597 -84130 -69432 1409 -6191 -51863 35658 17725 -42426 -103666 11282
22489 11282 64137 126683 81504 37090 -60818 3169 85635 108781 164018 136950 112876 104761
22477 104761 83481 101142 70888 136741 135364 -2592 -92673 -175662 -136564 -58459 -49821 48775
22465 48775 19399 160041 198544 124802 46361 140242 70005 53434 708 -90584 -129176
22454 -129176 -143902 -93935 -52981 -150654 -172459 -173336 -123367 -77650 -61681 7322 53287 10906
22442 10906 -87908 -64313 -129706 -128771 -51612 -28711 5960 65969 71702 174056 183636 148865
22430 148865 65516 24428 7316 27462 21652 85520 -743 -124003 -231361 -309795 -256909
22419 -256909 -50678 -13338 12979 117019 132170 36507 -12394 -225797 -264482 -243704 -53625
22408 -53625 8879 -23706 6246 90579 55861 88903 161682 102813 162930 125812 84222 89652
22396 89652 97181 -23325 -101376 -46550 50185 51821 58502 89361 94639 -11094 -60198 -131859
22384 -131859 -37434 39744 78943 -47892 -58102 -24790 -12063 -40418 -39821 -45664 -106391 -120410
22372 -120410 -42421 -98452 -122861 -168357 -129572 -126441 -18353 19944 166747 158367 57882
22361 57882 35177 114912 -30829 -112826 -138269 -261144 -180046 -9878 84746 75239 41921
22350 41921 -45927 -20089 16022 10160 -47633 -173696 -88433 -31165 18068 -10896 -61248 -91533
22338 -91533 -139677 -96103 -36408 81458 119231 4733 -66446 -73548 -18666 -11516 19686 86952
22326 86952 83038 83378 41243 -54653 -157489 -158347 -117193 -64225 -10390 24497 -91955 -173662
22314 -173662 -257694 -273495 -169614 -68963 -40454 -66730 -120482 -143201 -139636 -154489 -157098
22303 -157098 -103898 9959 -18768 30345 1167 -488 6786 -10372 6555 -83162 -151839 -146199
22291 -146199 -178822 -199867 -137778 -36852 -58273 -49831 -47553 40486 6167 -31449 -44141 -47085
22279 -47085 430 56313 28468 -74333 10203 71187 61266 101598 15583 -97945 -174148
22268 -174148 -237349 -193357 -57857 19176 74235 104485 -24632 38038 63719 79826 40565
22257 40565 -19640 -44746 -62162 -216389 -176322 -145540 -88029 -75343 77558 205069 149535
22246 149535 8011 -82283 -141652 -214577 -40659 -50428 -163861 -203228 -123470 -23239 48377
22235 48377 -62104 -170509 -221390 -127507 -137103 -161886 -36987 -9250 -102049 -54656 49910
22224 49910 78384 119557 110023 51608 64287 185583 163170 59094 12755 12040 -9516 16665
22212 16665 19925 -311 65972 130992 84577 -17344 -115204 -100313 -100982 -101110 -130385 -104338
22200 -104338 -149362 -152805 -127584 -102761 -148295 -113761 23708 21001 -30313 -38583 10961 49341
22188 49341 63865 92536 80792 -8000 -32244 20916 71570 58674 11417 -10507 -68667 -78705
22176 -78705 -33296 -7960 142370 227978 64939 80667 167016 113751 39381 29459 -50503
22165 -50503 -111167 51777 141478 108127 166329 41001 -94528 -88041 72347 58007 38961
22154 38961 6660 68876 71957 100792 9585 -78207 -153294 -103249 -81997 -155358 -227440 -188638
22142 -188638 -85374 -36526 78742 56876 46233 65831 129196 154622 110027 82465 123129
22131 123129 24327 55099 4409 -21851 -24978 -109715 -80467 -67274 -40838 70606 -35889
22120 -35889 -99722 -24679 -15665 -18672 -32138 -44204 64141 201571 121801 -161438 -190097
22109 -190097 -171303 -118704 -41801 -21999 78648 101037 13481 -94445 -151192 -225233 -274164
22098 -274164 -350331 -386803 -299380 -146954 -106266 -89628 39470 156076 173508 47336 -18809
22087 -18809 -99416 -63292 100798 147866 145013 146593 185185 88240 26979 -19917 81211 115333
22075 115333 153901 149354 64025 2203 -20426 128676 189724 146397 8635 -77389 -91528
22064 -91528 -40111 21535 84811 9056 -10500 17489 -34686 -11090 87904 -7240 -51038 -31634
22052 -31634 4832 26832 122966 72753 38158 45118 121686 101844 16166 -63546 -126155 -41257
22040 -41257 21366 78156 80500 66394 73599 84362 165741 186403 148359 167456 107601 50253
22028 50253 31638 -13073 49994 50144 24615 -17569 26428 81230 15182 55427 3822 -144629
22016 -144629 -137233 -127176 -62075 11173 6949 -24712 -16333 -9787 -43336 -71064 28568 34785
22004 34785 -53959 -70137 -11207 -7621 46818 31100 -30230 -10060 -9575 135777 143423 183390
21992 183390 171600 182212 125438 -16221 -99270 -147528 -89174 -68956 -181321 -91232 -24295
21981 -24295 -16128 43810 6644 -39236 56745 122542 33763 55643 24116 -66642 -6475 40399
21969 40399 87819 21071 44500 65130 119429 127432 24316 -94917 -190815 -134088 -50442
21958 -50442 50207 -17812 -39547 3693 18514 -15316 2877 12503 21909 100641 -61228 -93833
21946 -93833 -101345 -122953 -181744 -163821 -60537 -90043 -102647 -125832 -128776 -84124 -140350 -71466
21934 -71466 -1004 16111 8316 74625 83038 59876 81501 42477 -37346 -63658 -87862 18330
21922 18330 -44466 -135692 -60394 14611 76583 105235 168203 200918 206397 200038 121271 104889
21910 104889 94669 -4593 -100587 -60308 -161660 -262692 -360739 -301713 -224328 -204396 -218434
21899 -218434 -195514 -248274 -185839 -45377 33329 -12449 78673 167131 56636 -67139 -163354
21888 -163354 -144226 -195565 -109777 -44077 -40615 42367 149091 106796 -83862 -116337 -58554
21877 -58554 -74492 -138143 -145542 -111122 -3780 -8184 -63209 -81237 45389 -31314 -94768 -94640
21865 -94640 14931 73304 42329 50268 53711 88435 1277 43199 -26311 -117118 -132449 -36575
21853 -36575 38626 -30849 -59430 16760 -87789 -153334 -91565 -93061 -102411 -183498 -215257 -210111
21841 -210111 -236700 -100889 104710 123157 58498 64263 -33213 -144177 -155510 -67294 3393
21830 3393 3601 31523 8032 -67945 3899 4210 86109 86632 21109 20610 111842 12641 -83933
21817 -83933 -125184 -178543 -167774 -233500 -169015 -15942 188661 82204 -34491 -40802 54815
21806 54815 135075 98414 17719 13818 15281 52350 40197 33902 131054 66994 -8651 -34094
21794 -34094 -5465 41026 246575 336678 286882 142225 -18895 -38594 -9300 -75794 -131137
21783 -131137 -81649 72334 98809 802 -62389 -145615 -100165 47625 74784 42077 -16725
21772 -16725 14388 -44959 -18248 -56462 -3553 78424 138510 118462 56340 63322 30327 6858
21760 6858 -6582 69972 90278 90483 44315 55525 19791 18323 -26396 -43533 25049 -20812
21748 -20812 126660 236389 130964 6692 -16264 -55630 -68231 -132183 -106833 -107541 -61229
21737 -61229 48265 92217 39735 2320 -66346 -139463 -39375 62360 157104 163206 88712
21726 88712 52646 78186 54589 2135 -18004 -8522 98147 -13570 -97215 -121004 -42227
21715 -42227 31733 60561 8643 -59274 -37764 -87197 -110670 -38696 69919 87395 122620
21704 122620 82136 121361 116559 79810 61123 -8114 -35990 -55262 -90124 -133307 -111123 -21672
21692 -21672 -86379 -179107 -194768 -171204 -117358 -81596 -80483 -16281 36423 21947 56819 76020
21680 76020 86113 51573 -57684 -74907 -69914 -59148 40800 109682 89716 72693 139396 -1424
21668 -1424 -36480 70495 167891 123724 33921 26083 -30103 -88793 -202412 -180147 -79150
21657 -79150 7877 29316 -9774 -130673 -67844 168 -35612 -131143 -61707 5444 -25370
21646 -25370 -143628 -165290 -26070 120515 149300 115526 12676 -75203 -92332 -191966 -292287
21635 -292287 -166155 -188139 -162179 -36083 12253 -105679 -95553 -193726 -170986 -77453 -92478
21624 -92478 -61393 7528 -1070 -87155 -118039 -22096 1428 14764 23551 50673 17840 21802
21612 21802 -19815 4322 33110 -66873 -29003 -86010 -165090 -101532 -27345 -72823 -35554 -7315
21600 -7315 -31861 92598 105693 -42938 -47404 -21562 -51001 52945 88784 145360 253118
21589 253118 216398 242635 287748 243444 207601 203652 112515 176768 198753 167006 225230 140791
21577 140791 5162 14372 85024 179959 103171 -176690 -221298 -200261 -75440 1230 112503
21566 112503 59183 -63597 -14059 -94390 -136851 -135426 -134211 -109552 -186465 -131395 -59347 -81833
21554 -81833 -232189 -253505 -71282 90601 101035 -40769 -60979 -46734 -95694 -60704 23393
21543 23393 142362 8609 -79415 -93695 -127705 -189884 -176773 -22820 63788 13473 -30370
21532 -30370 -99948 22842 133358 -10846 -89525 -132784 -181035 -192251 -195678 -161885 -33922
21521 -33922 -68807 -14719 -17782 107964 174724 181861 128645 -7749 -39115 -36599 -96623 -69488
21509 -69488 26659 34322 -32246 -131155 -114246 -74934 -121629 -126701 31540 77476 76521 11500
21497 11500 -43974 85190 103340 208168 169207 60042 18133 7713 -12220 -28289 -823
21486 -823 -87680 -78324 1359 -8447 -30798 -72187 -18185 -47748 -22891 43452 150740 184519
21474 184519 211831 97347 11657 79096 65359 -23540 -20200 -92079 -103981 -114389 -209340
21463 -209340 -119038 -35994 -14165 -29965 34600 27699 57863 -47946 -71123 12137 45351
21452 45351 63231 90833 34712 -9548 -47980 -129847 -76577 28534 41391 28580 140011
21441 140011 127811 211028 191945 273592 220188 226694 245522 242867 215077 235499 228067 202627
21429 202627 212039 29384 -34890 -33566 -48556 -52041 -77069 -47812 -10648 -62372 -6497 117412
21417 117412 142991 77267 133083 199205 209824 8734 -115770 -36934 -25097 -56958 -20749
21406 -20749 3420 -20835 23427 64744 -88041 -35594 28748 91431 37160 -111260 -144944
21395 -144944 -140126 -87957 -125246 -202890 -214220 -119126 -139068 -48090 76266 24481 -54949
21384 -54949 -79586 -43730 -54113 -93160 -84211 -118403 -40321 -157018 -128059 -46260 -38613 11851
21372 11851 33882 63253 115580 27772 -4805 -65391 -131469 -118914 -128895 -161276 -104632 -61362
21360 -61362 -46926 -124653 -173642 -145741 -34847 -26388 77032 132294 125037 -38660 -88693
21349 -88693 -5553 -32047 56393 11828 -72591 -105271 49740 93111 -55750 -59093 -60661 -48213
21337 -48213 -93228 -95052 -111524 -133119 -25247 91537 204837 173145 12105 -56991 -39140
21326 -39140 -10612 -5290 95159 108917 62126 -55309 -137938 -67219 83705 138078 95377
21315 95377 59859 48544 -33246 -127812 -47334 -2340 58060 84811 158338 82092 101138 119525
21303 119525 137171 27732 22768 166092 259710 248085 182912 264594 240418 69704 27679
21292 27679 10573 -78027 35051 134755 151086 127256 138335 164499 143717 127659 108494
21281 108494 63229 -70789 2135 70445 144168 147700 111456 41624 -45085 -85468 -91888 -218079
21269 -218079 -178036 -210268 -159311 -103265 -6048 3293 -55869 17462 180618 158928 170439
21258 170439 73764 10066 45907 42119 21465 75379 131313 153545 123126 121867 127521 38256
21246 38256 36264 -48778 -146838 -100268 -53673 9667 4854 30794 60668 63936 73155 -23122
21234 -23122 -75413 -157779 -100602 -89742 -137738 -107821 -50169 35763 147356 187902 200633
21223 200633 203069 233077 166663 62232 -10323 53790 18697 -26495 55198 42519 106491
21212 106491 181341 76943 5574 117925 129481 92001 -12610 -74719 -82071 16048 96038
21201 96038 162032 125379 98440 57716 -23095 -103770 8360 67153 47334 100793 225735
21190 225735 220518 143746 51083 24468 28470 6806 92188 86305 146730 124631 83518 3701
21178 3701 -25060 138978 88477 -36845 -70744 -80831 -71867 -116367 -44330 -106387 -72796 -44691
21166 -44691 -115337 -86417 19433 -27941 -181113 -147951 19595 15830 -22505 53205 136523
21155 136523 76063 25297 64150 122984 149775 241061 234861 103927 14860 -13941 -21852 16767
21143 16767 -779 21307 93097 52996 -60008 -116448 -125099 -163498 -7294 13455 -45252
21132 -45252 -110956 -189157 -149822 -145778 -152178 -122143 -194900 -204142 -183860 -146222 -192805 -156013
21120 -156013 -138757 -49105 19057 -87885 -61854 5321 6723 29002 90035 172225 106249
21109 106249 101815 141023 60876 92456 67173 132179 182490 187948 36128 -90403 -137353
21098 -137353 -137392 -76472 45982 142409 92940 13391 69976 82123 118568 219781 182761 51668
21086 51668 5048 1353 50188 97216 123912 69212 -38235 -73243 -185258 -186597 -64129
21075 -64129 -114015 25849 183785 150864 5790 77637 226814 164677 37891 116530 103588
21064 103588 85713 84820 135722 129529 130613 91539 75427 184166 250750 231784 251363 231442
21052 231442 208708 215971 238199 205299 88422 48748 8016 -43295 -42711 -130263 -115520 -67731
21040 -67731 33729 -24054 -105000 -74767 -79514 12184 74124 131493 80494 -74267 -37884
21029 -37884 140869 185123 163629 84129 41479 44284 41176 94684 137691 133010 128423 64900
21017 64900 4232 -61366 -23260 23431 35026 12667 97392 149787 47237 33344 121472
21006 121472 139875 230759 204252 135282 153060 227782 256428 215220 140242 46993 142172
20995 142172 178666 180115 158314 138959 188766 171905 134139 66369 18497 -8463 2989 -36920
20983 -36920 -29960 -27514 41401 25296 -20721 -130281 -3211 116365 156215 151626 89769 -8006
20971 -8006 -2534 -51761 74214 73910 97355 133972 166020 122001 141622 159450 155813 56036
20959 56036 -3429 -166698 -234269 -203271 -156697 -69048 -87042 -8345 68892 100282 79856
20948 79856 63177 99406 81523 -20279 -33764 39371 9681 16054 133198 38125 12698
20937 12698 67154 152333 120359 90337 77457 68497 110340 96418 154521 53285 22036 3854
20925 3854 -79345 -129565 -139160 -127739 -70185 -94734 -127563 -83840 -74313 -29066 -124463 -98332
20913 -98332 18687 37673 16153 -52011 -95650 -16779 -43462 68235 142771 174180 197207
20902 197207 112259 56619 6423 123037 172117 240570 249721 180386 157989 105680 137583
20891 137583 139697 199080 171255 53834 -13821 -34626 50167 67271 28908 72334 75536 93471
20879 93471 172698 148877 178538 83340 55536 95516 96941 65777 46819 24177 56412 64466
20867 64466 35074 79069 268109 381528 463671 464707 391733 270872 252382 157472 213399
20856 213399 252096 255486 286318 292650 245124 282960 308150 213115 254206 291440 426744 538091
20844 538091 426748 436678 535596 534528 619375 651975 743660 783762 888064 1125823 1203497
20833 1203497 1235356 1328185 1486020 1782079 1834308 1933906 2003762 1936982 1966641 1982529 1803599
20822 1803599 1595744 1405033 1250978 1133788 1082202 1007648 919400 774642 621379 466412
20812 466412 356005 334370 277298 296743 387521 429350 372981 343456 306094 345523 413972
20801 413972 370203 258548 229095 293127 264199 217361 161356 226578 291930 267522 282744
20790 282744 291752 278383 178544 105863 -20965 280 62088 42921 47553 1040 51091 22457
20778 22457 37963 198979 268203 177427 46782 86049 45174 71820 144557 220550 215763
20767 215763 159581 199748 134072 91729 92078 114403 158462 173251 53215 -7352 28750 -66940
20755 -66940 -101525 54859 243221 232595 208469 138393 93094 84827 152413 146342 154721 145562
20743 145562 123425 152126 227461 248284 222776 156941 156866 141928 292187 239988 194700 109844
20731 109844 40000 44366 81917 178411 233737 201232 249316 220735 189819 137378 133707 88481
20719 88481 19616 14289 61240 -64767 -114853 -15594 -28610 -64555 -88512 20388 96534
20708 96534 -32082 -64977 6860 27719 89462 268305 254604 117230 83454 38679 -24298
20697 -24298 -16317 93371 133325 106278 131060 171578 77617 23791 64538 188349 158212
20686 158212 -23802 -38656 -24894 9607 -40547 15230 112255 169459 112730 92980 58987
20675 58987 -47263 -63710 -15803 -31800 -24703 40189 -52274 -26012 -99287 -69631 -5182 59424
20663 59424 53762 56538 133526 220027 241003 219380 252685 220833 134675 99892 255540 210942
20651 210942 174475 109259 104785 104844 84170 106959 124637 48471 14091 95593 113623 144829
20639 144829 203271 91493 69144 42017 -11472 68255 98606 120301 107156 93256 105161
20628 105161 190545 200917 112020 72756 95003 114029 96543 150463 158744 124468 164340 151839
20616 151839 41317 15221 97066 89953 -107594 -246223 -101973 -36978 -85097 -50881 94416
20605 94416 172321 113526 125682 223785 264257 176345 98837 85362 40161 126978 114550 107569
20593 107569 164141 178126 161741 152564 129471 133396 202844 79709 172213 202063 78793
20582 78793 111666 116078 124685 73825 -20848 47942 149085 231750 169176 75872 166108 187400
20570 187400 217292 269781 358875 320411 177781 135861 98001 106156 163672 92429 -6337
20559 -6337 -45152 -38984 -24537 56714 61718 73825 115186 39955 -64075 -20884 24548 12954
20547 12954 103455 50760 -1892 24102 61253 -9939 -68674 -14916 -69814 -104257 -40083 43335
20535 43335 -66030 -24532 73786 60860 -64866 10497 45130 103149 76906 70819 125568
20524 125568 28028 -9746 117347 124628 198107 216147 180883 190120 195597 199955 221737 67480
20512 67480 -77609 -8835 142661 146580 248066 193978 141455 88230 47303 41824 48280 51664
20500 51664 -87637 -90106 48854 133432 178647 94830 150 68620 74767 47442 29170 -20637
20488 -20637 -107314 -93129 -68882 -1438 -31797 -206206 -240721 -155618 -67510 -50151 -75920
20477 -75920 -18011 -6057 29426 20689 78548 103486 132709 133067 125042 85711 23233 -43199
20465 -43199 31490 39147 52259 87262 82345 48395 154543 225296 103409 50039 112493 140606
20453 140606 188393 152538 94148 96247 114804 96249 55393 25226 4204 113293 139804
20442 139804 95188 111295 145524 147560 307636 310507 189144 91050 56432 72299 115671
20431 115671 158726 228109 124659 -8316 76562 184873 89872 40834 14965 -62285 68824
20420 68824 139750 57953 77162 174242 197231 170495 91530 164398 206624 216402 221272 261952
20408 261952 163989 126783 232385 310189 312958 307751 211932 200277 158487 54020 -40207
20397 -40207 -1432 78037 215331 258419 288140 266234 248656 204936 108444 87428 36211
20386 36211 30920 -22825 -2792 14412 78803 155501 49062 95058 177558 187767 110695 132188
20374 132188 253852 287625 223491 159402 212462 245641 92162 53738 112601 149103 123296
20363 123296 206312 258804 207628 237660 326858 268273 157773 117005 -19273 32821 89479
20352 89479 143579 67304 -16922 -12765 113794 222331 197907 180943 164826 193505 249119
20341 249119 195618 214757 193203 272345 293354 220154 12049 -21942 29656 77489 114080
20330 114080 82728 86606 146919 238937 238467 255664 211411 155954 186575 196786 125926 46816
20318 46816 33375 -36678 -9223 86884 105129 165784 188774 191113 127003 83881 50373 43248
20306 43248 148373 178753 83923 78468 209573 263983 250764 194492 188680 108485 96971 206439
20294 206439 147386 84579 110306 150231 208589 220016 177210 105052 59720 46734 78390
20283 78390 119172 241040 269842 178647 179737 220421 234289 280689 278464 215888 29121 -14389
20271 -14389 96062 187962 105032 133735 254008 213958 253793 298898 302894 319677 250123
20260 250123 285638 344399 334273 230810 272196 184492 252540 317670 296134 154347 154854
20249 154854 220975 143008 50997 113388 236883 257863 177521 18335 -109 129795 123129
20238 123129 155687 224447 114578 152907 191487 135835 149306 326699 437606 260179 220049
20227 220049 236834 201688 156706 237290 139392 102281 109874 120252 160273 192455 174606 97678
20215 97678 124835 106320 73481 129206 104937 270699 341710 231277 171468 256952 231917
20204 231917 115494 167359 248235 274494 299694 276977 225062 195595 223586 187628 155692
20193 155692 152943 163967 206501 315500 385550 386362 292317 159961 37523 -52645 -13994
20182 -13994 90571 212527 280449 197706 -21291 -74976 -56993 -25202 90224 123573 105071
20171 105071 150038 306305 310118 325968 296298 352221 344763 245778 293909 287550 383712 433796
20159 433796 468969 437904 386788 380761 402382 366922 300607 274441 224929 187712 154173 221971
20147 221971 302749 355614 334904 285708 208625 157646 67867 83173 175331 357071 379421
20136 379421 307801 356268 410224 393094 214531 94622 119984 242528 288456 245486 285874
20125 285874 258022 122756 147038 232505 269808 340676 381246 335664 221150 205092 323726
20114 323726 357969 289276 317518 385134 289332 102543 67030 111430 185559 198853 223918
20103 223918 214586 183951 271886 274596 250430 139366 55391 51333 73562 -34339 6286 27459
20091 27459 -42109 80513 282451 254094 299404 296284 195222 71325 120109 162443 270397
20080 270397 284034 300740 346913 421956 395574 366093 375274 365010 383008 408794 375229 256799
20068 256799 136772 109533 123459 180024 363237 337699 381253 344725 341951 359154 375934
20057 375934 300370 261095 180892 203667 232429 128227 161400 204766 193676 282474 363883
20046 363883 262254 206535 122504 87452 139590 159328 284493 326149 382252 355169 336042
20035 336042 428099 505339 495605 512998 439181 319326 342668 297028 252116 241938 247556 202592
20023 202592 202636 258194 363763 372808 238193 276518 351041 354944 429489 361625 329864 460527
20011 460527 409117 486356 443808 284739 197907 276957 156364 212591 205570 170785 98908
20000 98908 236873 331460 306560 241516 263854 324833 387471 314982 198870 167960 306284
19989 306284 305564 255628 273778 244356 346049 453130 452534 439298 438305 414803 490078 519133
19977 519133 532385 530485 440259 439982 330746 308641 279086 248351 321605 377786 300893 244301
19965 244301 215169 283558 389871 403827 424120 404020 401640 325179 296337 276991 280187 190100
19953 190100 139983 331886 363596 269871 261106 379915 454729 358601 373786 387713 420848
19942 420848 313086 252778 264587 334929 360334 241155 279683 427908 457276 454516 481978
19931 481978 407000 293964 311521 229807 294259 271449 207636 176073 260786 321297 324952
19920 324952 298450 254312 165580 207254 292135 244486 150262 208426 279557 418748 461230
19909 461230 364005 369582 522029 555415 463380 441195 385635 390567 401777 494597 490609 482725
19897 482725 486293 514753 494852 550544 518894 457532 495498 427776 370019 347807 395408 452315
19885 452315 385480 385714 408487 395230 466416 412179 381007 401063 436397 472254 407125 422371
19873 422371 492704 662778 659472 524560 385819 272935 381727 471445 531782 492615 399748
19862 399748 553021 604979 578526 581709 550699 498650 580718 545341 580339 576305 465212
19851 465212 466363 464776 524466 581380 613834 429861 424102 423216 553885 676381 659251 677546
19839 677546 604339 538491 491337 431378 525036 563618 587973 591067 472852 432128 490054
19828 490054 524397 541689 548763 502436 436557 455887 618779 650765 648526 649996 656011 612215
19816 612215 531121 549680 587520 595575 559601 572342 505564 481932 479030 451076 480456 562888
19804 562888 597184 655314 695653 620375 638135 782993 890017 857823 712405 628614 548929
19793 548929 618507 662412 677077 681444 708455 659974 570651 701414 696648 652246 723120 785715
19781 785715 737360 720595 758098 805858 853184 848677 878148 809497 775459 689286 630725 649051
19769 649051 695386 747652 678754 752694 801973 926473 1005173 972738 902509 839201 617316
19758 617316 601171 668291 698585 652466 587374 660648 795347 835526 817011 784212 810450
19747 810450 679530 674042 690390 790834 902527 965456 851322 867373 910896 888128 927630
19736 927630 867786 797077 822628 900317 842533 803982 650364 687747 790497 764302 731543
19725 731543 717080 848371 903402 927503 918484 894396 874337 927597 861460 843063 946937
19714 946937 960226 939133 992559 1015910 945952 908380 894353 930517 912615 815440 751821
19703 751821 839494 872393 986226 936729 871885 936231 963078 874953 972398 971086 1011236
19692 1011236 970913 898969 961992 995960 967063 937879 903997 922096 1006698 1132547 1212446
19681 1212446 1268808 1278914 1239727 1121272 1097440 1176185 1189779 1078950 1031249 931793 901891
19670 901891 920190 1026782 1208665 1200088 1209062 1231651 1147167 1128033 1169178 1223316 1286327
19659 1286327 1292848 1334766 1373644 1451716 1363787 1199329 1198114 1287697 1388591 1329738 1320598
19648 1320598 1413200 1493904 1456080 1446104 1545471 1558502 1541900 1554883 1571170 1620487 1486369
19637 1486369 1521706 1645140 1610139 1548390 1705266 1705146 1753108 1758490 1699357 1613925 1520581
19626 1520581 1535095 1586581 1679496 1695335 1771122 1760361 1734073 1719072 1894178 2050695 2118501
19615 2118501 2129045 1976846 1840484 1829148 1813361 1735374 1783748 1964358 2012366 1981347 1940489
19604 1940489 1948999 1936805 1987047 2143068 2063912 2085989 2175347 2251849 2321219 2360624 2482527
19593 2482527 2493699 2457269 2463435 2346223 2244904 2309557 2260672 2349604 2335240 2287727 2327780
19582 2327780 2296926 2357479 2441218 2401430 2419364 2449189 2393619 2351483 2394236 2350706 2322528
19571 2322528 2344199 2466871 2543716 2564018 2586420 2606371 2662958 2643758 2694722 2753294 2854636
19560 2854636 2892293 2859741 2856132 2832280 2858250 2814107 2789890 2875063 2940035 2878210 2879056 2957502
19548 2957502 3000783 3046566 2979897 2972403 3027593 3075319 3068060 2989434 3046187 3229729 3282453
19537 3282453 3350061 3343077 3263720 3290970 3420010 3470319 3491119 3547302 3457801 3415735 3466889
19526 3466889 3516879 3640380 3712355 3803528 3779828 3812887 3959724 4064826 4101856 4209938
19516 4209938 4284813 4277815 4218189 4207795 4179913 4274911 4319107 4323283 4442959 4497416 4583475
19505 4583475 4778174 4820932 4756913 4962988 5188425 5249366 5250701 5269801 5306073 5402767 5502392
19494 5502392 5558374 5785461 6026887 6109693 6338860 6510548 6718736 6845820 6883356 6953818
19484 6953818 6970730 7090823 7281568 7422404 7713158 8039607 8343823 8541429 8446990 8560378
19474 8560378 8830070 8975003 9081004 9212087 9266931 9257198 9340578 9242709 9324791 9438383
19464 9438383 9492770 9452986 9546027 9582090 9605023 9629822 9730574 9807559 10065663 10183040 10270929
19453 10270929 10417740 10651907 10792470 10971036 11146261 11422040 11807675 12109459 12335648
19444 12335648 12532046 12771620 13093174 13518026 13922411 14249088 14732536 15272349 15819219
19435 15819219 16249746 16656592 16988865 17383747 17938303 18454804 18867189 19225061 19616186
19426 19616186 20025798 20380946 20933746 21493417 22045816 22629174 23164065 23642884 24374537
19417 24374537 25125369 25696414 26258224 27001375 27725138 28577661 29448966 30486390 31482200
19408 31482200 32468951 33528534 34762281 36143470 37360128 38670620 40127405 41808601
19400 41808601 43505241 45320724 47243924 49278016 51382283 53615816 55970610 58531232
19392 58531232 61357978 64358157 67514560 70771342 74214344 77945950 81983083 86408054
19384 86408054 91140961 96065631 101387753 107116745 113208621 119686056 126720565 134178650
19376 134178650 142260344 150871143 159875378 169486080 179608441 190325404 201550190
19369 201550190 213046401 224771832 236803713 248902209 260753728 272127415 282831174
19362 282831174 292610653 301128700 307950016 313100914 316330022 317434051 316488332 313522109
19354 313522109 308522256 301854596 293740233 284236527 273780788 262702482 251240239
19347 251240239 239426029 227615173 216014438 204683909 193804139 183369007 173159056
19340 173159056 163469068 154301599 145778441 137717288 130234317 123166889 116419677 110149960
19332 110149960 104298469 98837048 93654435 88924280 84563517 80560009 76632042 72997908
19324 72997908 69585396 66380040 63373860 60625619 58027576 55459034 53172860 51001959
19316 51001959 48939178 46879783 45009295 43244306 41623667 39930441 38493935 37171915
19308 37171915 35834754 34487498 33212011 32113356 31102008 30109265 29183464 28332518
19300 28332518 27368092 26567294 25807396 25049119 24302727 23563759 22864859 22232905 21669292
19291 21669292 21012801 20346538 19802842 19256906 18866794 18349376 17867043 17390314 16862548
19282 16862548 16465803 16172563 15726222 15385700 15094095 14750489 14427791 14145254 13706672
19273 13706672 13263433 12965500 12871348 12635954 12343870 12090248 11868787 11650439 11408516
19264 11408516 11207665 10990095 10811334 10659754 10412886 10126208 9876580 9635157 9476889
19255 9476889 9300687 9151004 9010705 8945018 8858602 8639670 8463009 8294831 8133874 7970577
19245 7970577 7932536 7938811 7884567 7849724 7718538 7594242 7468693 7384243 7444615 7496506 7362897
19234 7362897 7207699 7081456 7007596 6933279 6829311 6685653 6675194 6680460 6522835 6292080
19224 6292080 6155025 6172901 6005821 5879341 5844522 5826016 5723517 5581618 5549735 5551822
19214 5551822 5444962 5401101 5279849 5144458 5080668 5054151 5025294 5041295 5001648 4994515 5105708
19203 5105708 5188699 5170887 5110837 5120535 5085622 5013150 4988484 5015794 5025089 5069948 5168455 5370756
19191 5370756 5467733 5501449 5568954 5553839 5642555 5783148 5867453 5935393 5947271 5857761 5743012
19180 5743012 5799347 5799060 5741066 5778693 5905859 5988973 6022034 6314331 6463387 6599365 6790053
19169 6790053 7125898 7394864 7605994 7824216 7985417 8160173 8524210 8812194 9281720
19160 9281720 9976926 10726792 11896844 13302481 14970786 16974049 19336927 22087175
19152 22087175 24840583 27185552 28842682 29577020 29362229 28530770 27546843 26826753 26334954
19143 26334954 26441758 27367185 29294420 31998494 34914887 37533775 39415425 40046672
19135 40046672 39374325 37636280 35235524 32584539 30139581 27779119 25821508 24104362
19127 24104362 22885771 22139495 21803437 22128285 22987331 24394488 26573967 29265038 32034154
19118 32034154 34649576 36938067 38650293 39978955 40854612 41296838 41177128 40514005 39384752
19109 39384752 37987493 36456634 34764960 33174867 31991840 31082367 30300338 29665137
19101 29665137 29357707 29324848 29504146 29934947 30315342 30519610 30864516 31332742 32290510
19092 32290510 33563601 34981380 36131521 36440540 35748099 34018972 31619940 28966074
19084 28966074 26081733 23380234 20854330 18544368 16771908 15334171 14004506 12908001
19076 12908001 12032465 11392311 10865382 10269408 9606276 9017790 8450169 7978253 7672809
19067 7672809 7509324 7224924 7095183 7167756 7194398 6972055 6785770 6745073 6454472 6141669
19057 6141669 5957085 5924976 5891980 5801735 5611555 5562262 5585900 5510691 5287428 5062305
19047 5062305 4984547 4998895 5049481 5234495 5307087 5134052 5065947 4949411 4756782 4604729
19037 4604729 4553517 4481356 4598394 4663100 4733089 4844321 4941526 5065531 5083523 5066057 5239678
19026 5239678 5389863 5600039 5899958 6062850 6145441 6303912 6584627 6900644 7217653 7565435
19016 7565435 8000071 8378062 8864278 9430799 10047775 10898501 11856305 12969184 14123685
19007 14123685 15157224 16338346 17889596 19872231 22683302 26652483 32039192 38318479
18999 38318479 43532871 45759800 45880703 45935636 47282294 51008940 57705398 68538545
18991 68538545 85583223 112278259 153403086 208747476 260373765 279288215 261042129
18984 261042129 229041429 204035286 194905018 204956054 235341062 283822789 342886456
18977 342886456 390300449 397062189 367025512 329334077 294956900 260609653 227980326
18970 227980326 204790649 194949174 194962938 194855592 184943323 162957297 135712833 111435748
18962 111435748 92779733 79262028 69980673 63885800 60671413 60061988 61843481 66288519
18954 66288519 74160708 86332904 102231734 117107792 124407973 122897121 118455632 117318624
18946 117318624 123193293 136846420 154415715 168569890 179752439 198847989 236869278
18939 236869278 298060830 367562858 407494300 395683580 352058812 307968597 278223572
18932 278223572 261143530 251990065 254233465 276614787 322943690 378320208 405838516
18925 405838516 381563844 321052213 252344051 192504435 147002344 114117513 90550424
18918 90550424 73653937 61402082 52527579 45873548 40685570 36280077 32448530 29063045
18910 29063045 25976389 23441660 21338081 19543197 18231009 17262307 16562314 15998181
18902 15998181 15265600 14146876 12863210 11678947 10651672 9773189 9067470 8393026 7800541
18893 7800541 7410628 7030078 6810354 6505327 6164692 5817437 5474573 5219706 4996512
18884 4996512 4869249 4662080 4549398 4610458 4612319 4534612 4246666 4016500 3862851 3745385
18874 3745385 3628568 3545552 3385011 3339251 3338856 3249382 3093050 3056042 3155223 3196762 3128392
18863 3128392 3130981 3346251 3538208 3644671 3498693 3252657 3114177 3000021 2917400 2975750
18853 2975750 3218014 3431027 3671603 3595157 3305328 3086500 2919662 2884681 2905632 2871033
18843 2871033 2555697 2324491 2376910 2451306 2450159 2474789 2498274 2460081 2391452 2435500 2470746
18832 2470746 2567264 2625978 2643540 2637359 2653031 2611353 2536877 2532328 2632099 2625977 2465160 2324017
18820 2324017 2230689 2061523 1863824 1778391 1762076 1646242 1555550 1533508 1454259 1502527 1433042
18809 1433042 1332429 1355646 1234690 1193692 1262071 1370378 1402585 1423872 1369815 1452434 1514326
18798 1514326 1496218 1592975 1636701 1620523 1524733 1559668 1562550 1638192 1621077 1517722 1477939
18787 1477939 1426030 1595699 1827048 1951565 1941741 1950652 2154632 2251597 2115246 2073877 2092691
18776 2092691 2063500 1988463 1907141 1793908 1609215 1485281 1639717 1809652 1872193 1815269
18766 1815269 1793647 1802046 1697616 1619927 1528255 1308618 1087154 927909 818437 922207
18756 922207 903623 907483 928507 983587 956521 975275 1014571 971435 948930 940591 903483 865568
18744 865568 777887 689353 779975 960735 1139032 1299319 1526001 1728777 1819966 1780420
18734 1780420 1790816 1962214 2027986 1988678 2004294 1915059 1855359 1927286 2054445 2113989 2169953
18723 2169953 2197362 2233205 2242530 2131971 2022639 1826883 1623814 1467863 1464563 1281634
18713 1281634 1075974 1019323 1008579 976054 908986 846210 907467 949491 897153 809428 703172
18702 703172 681613 701018 700447 778627 708087 606259 597604 758153 778047 772308 854153 899115
18690 899115 996748 1154436 1196206 1155023 1289955 1382749 1457300 1518711 1634496 1546415 1562258
18679 1562258 1604724 1559840 1493544 1491270 1443104 1343451 1303717 1284312 1208832 1088592 1001815
18668 1001815 915009 906256 913643 945501 888903 789777 655535 687311 856202 946403 872371
18657 872371 823861 722447 720555 830917 873349 910707 884162 788269 707205 701959 578643
18646 578643 497386 515687 609544 530469 489612 520030 542510 585878 559527 616631 742328
18635 742328 680545 685678 721752 700627 672634 577759 521531 494833 468264 577003 673298
18624 673298 633517 696656 836177 671528 536416 518926 518537 530829 580929 675531 804131
18613 804131 810093 775855 773680 687158 760486 835593 843306 744965 696221 707389 754935 668287
18601 668287 555853 598884 585304 586775 713535 667867 635255 659490 734160 801881 788473
18590 788473 870795 860246 814886 770193 683398 722978 711732 777925 748560 598649 592429
18579 592429 593155 654319 574059 563921 592523 563756 626883 669586 629930 513810 541166 617130
18567 617130 614956 530079 564433 659325 628465 575001 595644 658942 691037 531213 486928
18556 486928 468550 496404 543457 559760 543067 551976 617028 627896 618104 608900 510277 426329
18544 426329 483509 573866 592766 551939 512365 405006 433868 465887 532227 548156 666878
18533 666878 702181 748150 799943 743054 732254 601355 548638 639034 717189 856608 994030
18522 994030 1055987 1050770 1046441 1042561 1039200 1003034 1039366 1266442 1328726 1217152 1056441 958802
18510 958802 942714 950385 938479 1009449 1062084 1116927 1162293 1181425 1133078 1223400 1194567 1136622
18498 1136622 1076832 1025650 1027772 1047083 983613 1066529 1207269 1321464 1349446 1352094 1350413
18487 1350413 1462151 1521897 1644941 1889729 2158823 2396600 2553292 2518871 2646255 2486964
18477 2486964 2328267 2331023 2355053 2471034 2566842 2682168 2718716 2701146 2668177 2626717 2595938
18466 2595938 2549274 2501114 2419748 2391414 2224098 2042806 1966905 1855820 1809398 1867045 1854021
18455 1854021 1870633 1885235 1879191 2069171 2158769 2283266 2410526 2341166 2359516 2384695 2345489
18444 2345489 2367361 2473520 2644869 2857565 3006995 3172484 3279509 3349677 3513962 3598316
18434 3598316 3667913 3680260 3606141 3657403 3728839 3840623 4101890 4226159 4351276 4641614
18424 4641614 4971166 5216348 5150910 4982631 4802179 4645226 4481838 4188978 3962782 3854940
18414 3854940 3947995 4037886 4125797 4223522 4415248 4441415 4585922 4755050 5045325 5533656
18404 5533656 6363935 7360875 8835235 11253358 15244609 20565265 25154210 26201199
18396 26201199 24057013 21380639 19814116 19735464 21513101 25891870 34105849 45728656
18388 45728656 55181298 55407096 48140730 39475714 32720493 28266266 26089772 26439854
18380 26439854 29651411 35329512 40478716 40166895 34682419 28136622 23125735 19963454
18372 19963454 18317595 17949371 18721898 20796391 24892481 31131498 37822855 41044832
18364 41044832 39089153 34676158 30657474 27709462 25883795 24898739 24323547 24259186 24772985
18355 24772985 26138929 28225642 31414281 35664528 41260565 48468016 57975318 70383001
18347 70383001 85297544 103026733 127658317 163606645 206590550 241207468 253444350
18340 253444350 243157870 219660636 190528972 163005480 142563854 129971871 122656198
18333 122656198 117186596 111419199 105001282 98740946 94020796 92351271 95279503 104181513
18325 104181513 119755804 138327418 149835893 148655271 140264014 130520217 121097416
18318 121097416 111850015 103065667 95568229 90310324 88373515 91280610 101677468 122877489
18310 122877489 154145295 181327106 185847819 170201715 150547378 137751794 134445824
18303 134445824 140813676 157693173 187292035 232203971 286978700 323686702 314718202
18296 314718202 271030756 222149230 184390852 159824288 146147078 141172630 143643687
18289 143643687 153969383 171675004 188812094 191037091 176322087 157575272 145675237
18282 145675237 141224622 138340678 134365937 132594044 138065753 155361549 189469454 240098810
18274 240098810 290817999 319603281 332981732 355058670 386309520 397513602 377909454
18267 377909454 348552981 319935048 286877963 253327832 229866542 220891369 220027977
18260 220027977 212277128 188678099 156111837 125456449 101559064 83988052 71235490
18253 71235490 61963694 54909847 49633361 45748210 42955571 41175261 40371297 40640637
18245 40640637 41846335 44092438 47679240 53007692 61327689 74400698 94968490 124085471
18237 124085471 154294033 174265164 188020076 205787927 223246997 227920489 221056268
18230 221056268 216974014 226363176 248986674 279628343 321657278 374762912 410143789
18223 410143789 403768272 376000156 352451863 328347224 293348118 254085275 216654707
18216 216654707 181336765 151959931 132576590 123109458 118047114 109715776 95570545
18209 95570545 79346489 65128070 54341776 46560959 40699687 36197220 32655679 29913242
18201 29913242 27832401 26297975 25571715 25805046 27215911 30285879 35758056 44406748
18193 44406748 55079766 63054036 63798563 59476941 55289373 54371863 58568146 70433224
18185 70433224 92934108 123234820 143207151 139068269 123107652 109917030 99170117
18178 99170117 85754497 71562064 60697442 54745473 54104624 59565812 72677620 90845139
18170 90845139 102684166 96974487 78493967 59025101 44104153 33664904 26472896
18163 26472896 21502438 18002198 15349740 13226137 11495277 10026679 8857515 8082289
18155 8082289 7506893 6809491 6221027 5762281 5436646 5048230 4704209 4403707 4155634
18146 4155634 4050949 3821374 3535373 3204807 2967195 2789402 2689653 2494799 2343731 2137827
18136 2137827 2109433 2047542 2025360 1940306 1888592 1956363 1890332 1810482 1572682 1366447 1366480
18125 1366480 1312588 1361855 1493437 1525529 1467307 1323788 1312398 1283421 1218298 1183453 1154245
18114 1154245 1158291 1094166 1028944 1060867 1076991 1126047 1228072 1321898 1462801 1531741 1455650
18103 1455650 1289361 1090891 1063518 969358 852425 759750 701698 638488 689711 654181 552139
18092 552139 440146 489663 539772 409757 375677 433702 525137 538006 529903 478516 425528
18081 425528 411633 596798 675989 607043 565799 615187 623078 545395 509516 490563 519859
18070 519859 581289 549840 596799 682592 644252 674446 608920 580528 573245 528318 517088 487835
18058 487835 476840 484462 380319 275047 243166 306273 408133 454789 460288 404542 283724
18047 283724 166445 241192 294362 298810 426735 355448 245991 255664 206304 163260 233933
18036 233933 298991 223693 314652 341732 366372 363827 344707 213473 197194 224694 249156
18025 249156 285274 256528 239647 317875 307865 94615 22152 135359 151715 136683 226111
18014 226111 277287 310034 332066 253076 165148 92229 102443 43445 -7260 18367 78796
18003 78796 263403 276622 129422 43270 80704 130689 62662 110935 240993 286299 247726
17992 247726 225790 204225 186979 226395 276779 229173 284549 342551 331738 233876 192549
17981 192549 83858 54648 92525 193121 253105 230987 127381 35972 -9914 26609 163226
17970 163226 319299 371086 309588 267948 266410 200856 98866 95657 123739 230285 280959
17959 280959 206558 230183 181417 168918 212148 232551 225240 255053 287459 277361 195632 182997
17947 182997 107111 -31421 -45880 71842 166119 216051 246948 296214 340866 211160 19361
17936 19361 81703 174655 213809 190972 169571 216679 177697 172212 62595 -40257 -19833
17925 -19833 123003 259012 166173 86179 77457 62852 24105 37116 90415 34928 81144
17914 81144 257919 245826 160050 100253 59520 155798 166000 160062 214999 177646 93873 146270
17902 146270 171530 36488 5237 25260 24780 77274 34947 51654 130890 214607 167834 65285
17890 65285 66121 78343 119070 123695 127362 144645 299392 383972 450290 465969 467594 426195
17878 426195 414598 518892 570068 664318 606899 693880 790123 734523 698159 757170 689578
17867 689578 632259 504017 587248 609054 530182 333865 278123 392554 394802 331068 317209
17856 317209 374276 274046 365183 457268 409811 338021 210503 191658 243259 249173 278852
17845 278852 241329 247954 263674 255463 341861 439924 514932 556202 639866 626300 563958 729054
17833 729054 869513 809426 729005 755983 810877 866975 913408 866407 867451 929036 951652
17822 951652 884337 877359 793711 841130 710641 553099 496185 406399 282577 369295 467340
17811 467340 430223 281176 289101 277221 343868 374525 343627 314312 396907 378705 320324
17800 320324 304946 331431 499300 476349 313670 234051 322763 365051 433449 486403 448271
17789 448271 557703 642364 753579 655035 548889 716176 866440 865763 913026 1064802 1142788
17778 1142788 1232580 1291842 1360882 1521632 1493715 1465094 1383592 1365267 1470577 1513979 1612475
17767 1612475 1602542 1371296 1165553 974431 803941 747768 666405 575512 508804 586214 575427
17756 575427 488171 363526 421415 445921 377144 395745 318562 401415 395139 427559 380030
17745 380030 166201 193965 332453 521699 603573 496916 474124 679564 869464 906723
17735 906723 985568 1137387 1360297 1394641 1370214 1552163 1569630 1696042 1868738 1964259
17725 1964259 1954410 1900086 1855326 1880940 1772601 1733253 1766526 1725217 1509078 1269139 953323
17714 953323 744034 642903 559018 546256 401096 420652 386853 361728 224600 114071
17704 114071 180440 134504 102657 200689 264556 283134 342122 214699 105643 173257 233895
17693 233895 48647 -12085 136325 227986 251325 458710 639993 694049 647700 701344 668668
17682 668668 828335 891319 799690 700907 659286 624800 727150 712935 830603 941364 994588
17671 994588 881934 712301 652664 589912 414180 185886 103186 99452 58502 129299 237491
17660 237491 89498 -62623 -70308 -55573 -85394 -91418 -41885 1608 26776 55672 -43950
17649 -43950 -93870 -107678 -122411 -117340 -80531 -128679 -194311 -199163 -136763 -46726 50306 66140
17637 66140 5387 21320 78241 9654 5244 -107081 -68453 -48906 -116004 -151243 -171787 -188156
17625 -188156 -88251 -18593 -74235 -97067 -124155 -142720 -56691 -119231 -179561 -226452 -244936
17614 -244936 -334389 -309776 -200359 -113310 -156533 -161626 -75794 -72947 -204771 -95609 62816
17603 62816 -12677 3764 22829 -6898 -39111 16959 58260 22317 25809 44767 -67997 -146592
17591 -146592 -124021 -96601 -48704 76277 66766 99137 219009 241783 76964 50467 -52780
17580 -52780 -135915 -86679 100158 93010 -33077 -3977 -59233 -190189 -192135 -71478 -13761
17569 -13761 -48980 -90549 -259199 -363021 -244727 -158646 -53427 -96243 -109387 -68253 -40364
17558 -40364 -95748 -168954 -190684 -136344 -31313 39876 66801 105097 125077 71119 62629 -3853
17546 -3853 -45999 -146033 -184220 -179066 -159942 -193152 -160532 -205370 -237422 -221003 -123757 -65404
17534 -65404 -38006 157634 290343 223359 76382 46106 1181 -42532 -55741 37285 102208
17523 102208 77647 -3811 -32110 -66910 -162770 -97458 26240 -76624 -170363 -12524 -25070
17512 -25070 -83833 -109306 -102970 18734 150499 259013 188498 161765 191637 110057 37867
17501 37867 -3480 -35808 -122305 17249 160135 88174 177714 267954 225631 102661 91952
17490 91952 197132 67110 -8754 33307 -29032 -83712 -155485 -254501 -191848 -162539 -69230
17479 -69230 16833 48486 48582 44821 -10075 70163 2275 -101280 -64309 21698 30385 -64242
17467 -64242 -94382 -79218 -171916 -216527 -120786 -54699 -22452 -31245 64877 99379 53789 91517
17455 91517 58868 31723 5003 -522 -123935 -190147 -206013 -118569 48952 127662 45803
17444 45803 -30332 -150998 -240413 -185555 -238596 -225578 -92107 -69968 -141519 -150504 -32871
17433 -32871 -37688 53335 -23986 -166888 -189934 -56310 92399 50437 26297 -40656 -35650
17422 -35650 -56957 -44203 1397 45310 7489 -23484 -49344 -60356 -86706 -72239 -106818 -154323
17410 -154323 25388 36714 -13981 -86163 -113154 -219848 -277996 -256198 -180817 -142656 -59915
17399 -59915 5718 57105 137452 170816 57488 -80887 -148358 -149642 -33753 5514 67763
17388 67763 150554 129693 54517 -67382 -25987 33431 -36049 -47439 -40173 -69363 -209578
17377 -209578 -126793 -111587 -92751 31604 73559 -28485 -68300 -17118 45299 142191 215804
17366 215804 295101 254773 60735 -12419 -98198 -102544 -95966 -131311 -39040 17229 4288 82666
17354 82666 41096 63823 92205 53893 61809 10991 -61567 -88885 -75711 -34271 103860 154540
17342 154540 79478 -99889 -155614 67066 187735 26403 36711 66017 -55919 -55850 -79386
17331 -79386 -182420 -178032 -140773 -220041 -276065 -348923 -259926 -87188 -51903 -40707 -180932
17320 -180932 -118521 62625 54874 39389 39718 10203 75518 23219 -41097 35435 93120 61554
17308 61554 33765 90570 -28561 -137265 -60680 -23732 7292 -3660 -26089 -21187 -88136
17297 -88136 -121025 -162403 -117033 -77063 -43878 -69252 -86238 -73340 -110334 -118838 -81976 -143555
17285 -143555 -156046 -162200 -181243 -146580 -76739 -142678 -163397 -129298 -62317 -22545 14741 148744
17273 148744 283597 316467 212126 107028 -17864 -63807 -152838 -255582 -171572 -57292
17263 -57292 -77394 -72509 -30557 -33047 -75378 -38543 -6671 -92478 -168227 -124922 -88101 -198307
17251 -198307 -199855 -1147 54546 -32923 -166223 -94258 -91889 -122927 -133741 -104725 -191969
17240 -191969 -250670 -244842 -209368 -97083 -167511 -139408 -128221 -196133 -334983 -317759 -270010
17229 -270010 -164682 2312 46496 -60493 -119398 -146800 -166100 -229033 -238474 -115474 57337
17218 57337 134805 66250 4299 3972 93611 20673 26988 34052 18965 -17199 -38462 -2113
17206 -2113 15382 14916 -55108 -53997 -67570 -94073 -118125 -86440 1775 156032 110499 14103
17194 14103 118113 166098 73756 101201 -2895 -20063 -55922 -67601 -76606 -92872 -37585
17183 -37585 -19947 -22908 30471 9758 -29649 -79407 -153223 -12561 83325 83169 29625 38931
17171 38931 39207 77434 110308 40841 10146 -21930 10451 87621 -58135 -91871 -83511 -161021
17159 -161021 -287792 -176039 -138106 -172085 -173862 -107527 8612 35527 2119 -39228 -32281
17148 -32281 -115713 -83573 -59373 -38877 14565 81530 69035 7026 46730 110153 15212 68784
17136 68784 133321 260488 197483 56830 -19297 -28307 -56987 -6918 13561 23103 54167 -34522
17124 -34522 75887 152657 20279 -2410 69386 38103 -40007 -85175 -75433 -102974 15958
17113 15958 171321 211350 -6242 -19041 2425 -103882 -58696 -51866 11902 74812 131978
17102 131978 89488 23107 -33909 -24517 24907 -19103 67693 70443 41167 -69937 8040 107747
17090 107747 119422 111426 24863 -72650 -51808 -37349 -6437 57583 45422 -170996 -224425
17079 -224425 -216404 -211870 -247942 -154030 -52929 -133864 -197556 -124274 -36819 49340 131625 77881
17067 77881 -28485 -71514 -4412 81690 110422 -15639 -61441 58903 102545 190596 250126
17056 250126 110012 36272 62873 17159 30275 102371 125045 63578 15800 7855 19590
17045 19590 137261 119955 51891 -27096 47078 23036 -27637 -154748 -143805 -118931 -135716
17034 -135716 -79480 7999 58085 20652 -89942 -108386 -69971 -95311 -12398 -136302 -222046
17023 -222046 -202992 -96728 -99208 -42801 79344 88810 105652 29103 -20444 -81018 -154247
17012 -154247 -106865 -41646 17850 81777 79946 -19062 -67573 -78807 -13895 -36058 -88081 -46062
17000 -46062 -102771 -56393 -25837 -54443 -155181 -171348 -179109 -109877 26912 18556 -148 129416
16988 129416 195290 280694 310152 243824 215082 84264 -36884 6655 73787 65255 -79427
16977 -79427 -142615 -135945 -197 106581 212422 350578 298779 89534 132473 248941 209746
16966 209746 -4340 -88200 22490 136639 175995 87557 47614 133479 217627 180235 155769
16955 155769 73794 49894 116839 -23663 -169289 -118934 -96811 -61769 62042 33075 -22126
16944 -22126 23521 -76199 -82149 -39984 -76884 -74164 3499 30662 -69946 -122000 -153346 -145458
16932 -145458 -74717 -19638 3815 15111 -34480 32255 52253 69863 219694 199088 170055
16921 170055 226388 165837 160840 106503 -16469 -8198 -62952 -62620 -51581 -99801 -155243 -165419
16909 -165419 -165909 -91033 -117037 -60541 -119597 -106526 -34952 -27240 11490 92989 86081 5131
16897 5131 -8153 -65196 -34760 -163162 -115013 -8104 -60435 -52397 -49205 -45617 -53020 -89944
16885 -89944 -61215 -61966 -103534 -80654 -35500 -4345 -26794 -89145 -101562 -109255 -222689 -243517
16873 -243517 -248939 -328177 -395171 -330037 -128016 -114243 -252734 -229937 -215476 -242428 -205935
16862 -205935 -185013 -46157 4306 -69561 -168069 -111983 -91883 -33110 161555 53357 5369
16851 5369 34236 -11340 -117297 -82891 -64237 -62494 -75025 -149602 -176734 -144305 -180897 -234451
16839 -234451 -234600 -249029 -247368 -221951 -166064 -73158 -113962 -81770 -125623 -59487 -34108 -32616
16827 -32616 -88846 -109521 -42056 68813 137259 126695 21148 -74963 -74213 -95459 -48467 -16729
16815 -16729 -169922 -222386 -154768 -56080 -169006 -281503 -322056 -355708 -174925 -149967 -179881
16804 -179881 -198237 -254195 -193038 -20335 -15834 -51534 -64556 31468 125074 114447 12732
16793 12732 52702 139591 208121 140923 129322 151645 127907 112918 91135 62095 130983 170035
16781 170035 95295 94280 -2735 -166122 -199652 -119564 -59008 11690 49213 121629 89580
16770 89580 117009 80455 9366 -73199 -82761 -198696 -110999 -56433 -145758 -165228 -151615 -155693
16758 -155693 -65679 -104853 -199202 -135649 -73226 -96766 -109156 -105711 -78733 -104551 -111209 -33522
16746 -33522 -26948 -133636 -113740 -88466 -41505 20611 162930 33380 45385 148673 151639
16735 151639 154958 194818 123143 23321 -64338 -28025 -84662 -273875 -166136 -68313 -75512
16724 -75512 -149943 -160249 -115632 -177535 -105018 -87642 -79937 55976 50109 -38711 -92346 -38991
16712 -38991 21894 -22659 -73000 -110923 -130611 -70495 -64398 -61673 -51683 38446 142837 166452
16700 166452 119027 -21100 -58357 28282 -37602 -81765 30411 156965 124334 -60151 -114441
16689 -114441 -141956 -140028 -65114 -53305 -70248 -40374 -27071 33418 -7675 24049 37813 -112707
16677 -112707 -141891 -107255 -19055 105223 151062 112501 91306 34845 -37867 45717 69485
16666 69485 8130 -15036 69041 125093 163957 167748 33448 144579 263961 107852 59514
16655 59514 75287 162393 207165 89276 108210 58430 -111173 -201374 -70327 153435 152139
16644 152139 86194 57203 108330 22566 -27461 -44935 -110433 -70192 -23979 -17069 -40267 -59837
16632 -59837 -31294 10246 -93360 29153 125317 -25194 -24433 19966 3153 -57183 -46734
16621 -46734 -25669 -70639 -239783 -180082 -82018 -62506 -68639 -155733 -218555 -165577 -143590 -47341
16609 -47341 -155549 -209961 -203151 -167863 -109532 -22583 -70895 -95372 -60680 -81321 -100913 -149503
16597 -149503 -107143 -183363 -110713 -55973 -184948 -115633 -133225 -149929 -62910 -118439 -202410
16586 -202410 -194506 -225206 -272920 -252758 -204324 -125571 -76862 -54758 -117981 -93120 -34882 -82356
16574 -82356 -159740 -148302 -53733 -67234 -58518 -73692 -207637 -119378 -60167 -69675 -168448 -191861
16562 -191861 -77573 -58772 -136341 -36672 121439 62638 52506 8461 -9965 103764 125511
16551 125511 99877 207247 126733 -96075 -234795 -253343 -195915 -206656 -198570 -82691 2373
16540 2373 2826 -26980 -88271 -81779 -129288 -114437 -82223 -113131 -202028 -161088 -142965 -114615
16528 -114615 -39284 102521 -3746 -32192 -45241 78418 138061 97285 38156 7725 4228
16517 4228 -55247 -201249 -219282 -164971 -79467 -62920 -86191 -125965 -194933 -103252 -158151 -236402
16505 -236402 -193559 -43872 -34545 -1556 3923 -45352 -20269 -1512 -18182 -61007 -38979 -46168
16493 -46168 -70712 -5045 -16915 81547 186956 192542 70832 -68585 -31253 90743 64598
16482 64598 114888 58178 -75969 -88614 -58144 8984 -45477 -130024 -162022 -107225 -67079
16471 -67079 66408 72517 70386 59439 38619 143888 193595 107354 86858 54952 62157 -6422
16459 -6422 -3834 -7175 -58212 -68358 -41858 -39655 35525 102168 32146 -21833 -139957 -137402
16447 -137402 -24040 -369 3436 -28235 -59929 -61710 -54462 -45355 11899 13423 -45179 -162049
16435 -162049 -109855 -42620 23925 -10109 -181389 -202310 -53972 8386 -73993 -28768 -96318
16424 -96318 -161370 -111653 -124272 -102949 4830 -48682 -124829 -209600 -270279 -222626 -228588 -227619
16412 -227619 -116147 -99909 -26314 44361 56068 -73430 -183538 -160362 -111159 25155 61641
16401 61641 15926 -43709 -68131 -94829 -94950 -131512 15564 22036 -23347 45578 -57383 -186396
16389 -186396 -192640 -165344 -151744 -120708 -44627 -104234 -238532 -292024 -265125 -121872 -136755
16378 -136755 -133024 -98587 52837 47001 -35844 -82376 -60826 19616 42592 -77519 -137120
16367 -137120 -181858 -238536 -148816 -93544 -129190 -112785 -90347 -31120 16475 -20377 -10177
16356 -10177 -8848 -69788 -64216 -6111 291 -44855 -218495 -349118 -370815 -296683 -168836 -155213
16344 -155213 -48114 -69619 -147918 -152579 -171556 -200725 -186180 -77655 28433 70709 47294
16333 47294 73665 101923 59732 -64686 -127535 -52838 37424 110932 5061 -34355 -72486
16322 -72486 -217061 -156470 21080 8557 -33184 27965 102760 207254 248555 163202 -9010
16311 -9010 -110719 -68324 -34044 -30370 -8266 43912 43402 44846 -33304 -23339 -47841 -43755 -89210
16298 -89210 -129620 -95668 70319 192973 112768 -13020 -48534 26071 -23946 27799 64813
16287 64813 -4039 -71786 -129166 -135225 -259565 -274146 -102225 17860 -16633 689 49606
16276 49606 -16177 -74869 -167783 -107335 10916 112038 172267 84247 -100981 -144725 -65404
16265 -65404 -103173 -125988 -97380 -160570 -107456 -91320 -172906 -192260 -1562 -19484 -62846
16254 -62846 32442 105284 56479 9738 -44708 -56887 -61092 -8403 39210 35982 92157 122553
16242 122553 23870 -19122 -105088 -105573 19044 109230 10882 -42104 -141021 -166492 -216585 -195915
16230 -195915 -226899 -91775 -76241 -65782 -49827 82594 19172 119175 37679 -104106 -96354
16219 -96354 31307 34408 9364 -134470 -186396 -65728 12714 119619 135507 -10375 -106111
16208 -106111 -68510 -1278 89665 106701 130247 193090 178361 199499 353174 349887 255221
16197 255221 175745 63042 -15068 -63104 16581 91109 -3327 -24931 -20271 53890 12042
16186 12042 23959 41031 -17919 -61455 -18408 30029 46483 59644 99002 172818 228165 81952
16174 81952 5736 -124400 -196950 -81589 -36540 -98497 -176063 -136857 -203507 -221811 -90074
16163 -90074 -96728 -129811 -95221 -184166 -325504 -212978 -133568 -213731 -261898 -186080 -138453
16152 -138453 -175205 -150490 -80979 -11780 -87110 -156867 -72961 -47229 -101742 -117735 -184521
16141 -184521 -182875 -130039 -47305 27167 403 5276 -111141 -122205 -71887 -4819 -32294 -50193
16129 -50193 19540 -37785 -35025 -180665 -229738 -236171 -233387 -186762 -161904 -63323 -66653 -85777
16117 -85777 42253 6510 -83969 -90511 -181971 -137594 -172190 -128766 -145106 -111866 -134925 -212114
16105 -212114 -224865 -217354 -267389 -176945 -186168 -185220 -142308 -97490 21896 -16501 -49163 81360
16093 81360 120125 25819 79087 136816 8387 32642 52039 49773 99812 -47514 -93786
16082 -93786 -64968 -179432 -206437 -105334 -52110 -127904 -145380 -162969 -157489 -173257 -124806
16071 -124806 64641 86356 36262 -36622 -9566 10508 -53529 -137702 -49312 -73176 21807
16060 21807 113531 197161 279475 220732 183791 48024 -20103 -59473 -5913 -8367 -93252 -169387
16048 -169387 -102598 -132214 -241716 -223507 -71359 -72555 -146695 -58935 22 42842 68507
16037 68507 121830 113339 -58929 -123037 -133093 -137271 -112794 -77294 -77414 -143858 -159370 -248257
16025 -248257 -229693 -181268 -87666 -79192 57655 103594 105647 41194 -16150 -57455 -147414 -148735
16013 -148735 -112627 -158221 -117697 -123091 -269752 -178627 18419 49545 -61095 -55574 -142080
16002 -142080 -194428 -109829 -107543 -120374 -153612 -203841 -182893 -162028 -90010 -41168 -2284 -141792
15990 -141792 -183025 -97898 -156000 -191069 -105135 -864 4360 -117376 -112628 -50116 -18699
15979 -18699 9814 47103 58316 74238 113800 89090 97136 141770 233410 192102 122004 53739
15967 53739 92156 -70300 -124602 -58061 -29305 40510 151335 182175 154507 137404 80394
15956 80394 73947 23648 30083 -123685 -184240 -161069 -88709 -125232 -9520 7574 -81027 -40206
15944 -40206 61357 57099 -50736 -75277 -70375 -73334 -47459 7382 9837 -118616 -127124 -171720
15932 -171720 -198081 -227671 -364796 -410208 -327476 -229976 -219280 -170566 -145039 -123722 -121107
15921 -121107 -158470 -300153 -224083 -71732 -32706 -2079 -99704 -181749 -174604 -141628 -24617
15910 -24617 -27523 -68243 -53870 -79238 -113858 -193202 -172156 -225821 -114237 -33759 -140638
15899 -140638 -106870 64451 12822 -174046 -51074 157048 148087 127504 198325 202344 119622
15888 119622 80122 32457 -132420 -95495 -85740 -172663 -144783 -75511 -110292 -114567 -70965 -105348
15876 -105348 -100490 -45279 -26833 38680 97160 -38862 -52465 -54316 -42008 -104351 -153274 -196350
15864 -196350 -114422 -74719 -77935 -88791 -67188 -120198 -155271 -53909 4268 -28878 26040
15853 26040 40304 59085 55664 -82090 -145147 -143900 -80960 -50474 -86091 -45148 -40673 -26590
15841 -26590 36450 97568 -19365 -47218 -125193 -123635 -83837 -77105 -61148 -16087 70783 167079
15829 167079 30978 -68570 -130789 -105460 -27017 -29012 -52172 -42061 -96251 -222651 -207555
15818 -207555 -111349 19678 47922 94735 101467 45588 -13733 -67155 -131988 -120221 -49198
15807 -49198 58316 134750 80989 -6618 -109316 -207057 -153018 -92642 -59141 -82328 -39530
15796 -39530 41755 123194 118773 66196 -47917 -92112 30420 49891 25727 101266 228449
15785 228449 197538 50634 -75324 -102819 -75494 -161815 -212302 -154976 -48620 34872 60290
15774 60290 89679 116717 78657 31275 8111 -21755 -142469 -165791 -135663 -97078 46273
15763 46273 13783 -62881 -5491 64809 7584 -88902 -147359 3215 -2983 -20753 -19892 13683
15751 13683 -61715 -157316 -143780 -123110 -115253 -43073 7929 -14461 33322 34696 -73065 -134885
15739 -134885 -62948 -31316 -30991 -54866 -70016 28736 10892 -97106 -77712 52673 51880 66311
15727 66311 -53588 -62298 -36974 156432 129457 149093 126005 81969 11231 -25811 28120
15716 28120 48571 7764 76619 35457 -41518 -36884 -84087 -43452 57259 147729 67543 -23243
15704 -23243 -198864 -320001 -169207 -29690 43652 67731 29328 65332 111202 186034 64992
15693 64992 27485 29060 142652 129160 45827 -46969 -53941 -71585 82427 88133 -21894 -75040
15681 -75040 -92668 -95712 -87327 -120130 -143411 -87862 -113223 -50625 -59358 -123085 -96773 54524
15669 54524 235068 235006 165078 81937 19962 34663 -9707 -81648 -120631 49421 163836 102867
15657 102867 -26005 -63205 -46505 -38729 92408 150796 66191 57107 35879 -22300 -24521 -75610
15645 -75610 -80109 16222 113749 133144 118397 106691 26104 97635 121960 47749 4664 -83785
15633 -83785 -68255 -82508 -104156 -33433 -22783 -81416 -191811 -283359 -247374 -264557 -263691 -164107
15621 -164107 1561 106708 11066 -136082 -48727 -68368 15101 83592 50016 -12874 -361
15610 -361 -31077 -174102 -238053 -158609 -44504 53670 154578 113961 -5875 -55318 12352
15599 12352 65867 90243 -446 -180995 -160530 -112552 -52290 114827 105699 115293 8704
15588 8704 -67384 -77954 -38027 -30896 -78083 -52660 -94172 -62753 44479 26221 -47820 -32889
15576 -32889 15828 54126 -105142 -26083 -2828 -139820 -103911 -68883 -67232 -26601 -73980
15565 -73980 -141054 -204946 -198229 -190410 -204646 -180365 -167866 -104935 32478 145866 46844 -63208
15553 -63208 -83292 92723 238008 240560 121999 14025 -103102 -62735 9433 110112 197662
15542 197662 218380 125903 -30503 -86207 -47761 -3894 75350 188421 102615 15551 -109858
15531 -109858 -227329 -236032 -307932 -266426 -187363 -139083 -139458 -220803 -291137 -127658 17524
15520 17524 57356 5067 -16230 76842 40550 -15578 -28808 -14247 -40612 -63235 -115646 50517
15508 50517 125418 44400 -40058 -19388 -21753 52866 110665 72873 42750 -44104 -215018 -215262
15496 -215262 -203338 -152868 -29498 17520 -58049 -165862 -165302 -18905 23367 46600 -47627
15485 -47627 -76463 -36654 64693 75091 75285 94297 68112 -18551 -146800 -177160 -209238 -185923
15473 -185923 -221877 -197820 -69187 -120680 -252994 -209054 -81011 -209347 -216094 -157017 -104053
15462 -104053 -129086 -137478 -66886 -10957 -133094 -87248 -67398 -78131 -156823 -131239 -41598
15451 -41598 -93647 -138213 -74105 12451 -64376 -166031 -246128 -248827 -70204 -34748 -32774 -54422
15439 -54422 -92665 1739 66005 163788 195975 77877 -93696 -143271 -145717 -200231 -233552
15428 -233552 -221517 -188308 -66738 18394 102319 18480 -49079 -33622 20127 -39648 -13403
15417 -13403 23633 9480 -27424 -101082 -120636 -81864 -51779 46122 22740 -97756 -128932
15406 -128932 -105863 -103183 -72537 -66472 -32761 -81443 -55161 -24451 -45621 -33270 19754 -102710
15394 -102710 -245018 -154587 -6597 47620 -47491 -152936 -139058 -19808 94480 24778
15384 24778 -110726 -170527 -62269 34186 134771 -10320 -22269 27586 -32393 -7563 53705
15373 53705 118682 77357 73546 37062 60190 77090 96148 107056 45899 29126 37722 9929
15361 9929 -45175 -170314 -246508 -267256 -204886 -102820 -55673 -137004 -270190 -173088 -114728
15350 -114728 50718 64029 -2442 -8621 -20265 68469 62770 43773 125037 70173 33023 17484
15338 17484 28311 -37747 -95721 -198969 -224129 -170501 -92733 -61951 -22687 -4416 -94236
15327 -94236 -104835 -57349 -38005 -56689 37294 95359 84607 131508 181412 190633 107526 105887
15315 105887 86410 100939 97636 174472 133827 8883 -34998 -33146 42474 -73260 -29392
15304 -29392 17484 19764 126314 81203 -40933 -66181 -56896 -57237 -37415 19281 -12676 -57979
15292 -57979 -50448 31256 -54494 -231525 -284824 -276087 -286322 -238342 -166921 -111829 -62873 -87833
15280 -87833 -103356 -46237 29009 -6831 10123 133351 94216 72883 -5881 -36088 -53153
15269 -53153 7213 38893 9688 -66325 20245 45842 62856 -56021 -68801 -129094 -34748
15258 -34748 111693 6345 -104274 -177114 -187225 -153628 -164840 -170041 -115580 -166756 -158549
15247 -158549 -53668 22228 30919 74220 -5928 -73063 -70766 -50357 6125 24939 -130430
15236 -130430 -227734 -204720 -155496 -85282 -173929 -240516 -137035 -12707 -39809 -52440 -94809
15225 -94809 -74433 -65386 -54248 -147298 -131518 -64738 111697 168573 47785 -16346 -38216
15214 -38216 -120372 -88942 -113080 -129553 -151087 -74270 -43572 -141118 -129783 -76200 -110160 -185522
15202 -185522 -128240 -166673 -80613 4053 23299 85935 40023 28320 -10579 -59216 -10919
15191 -10919 6697 -70262 -96475 -17641 -30881 -85191 -73601 -111671 -124850 -146436 -172941 -107751
15179 -107751 -67309 -85025 -42517 -37127 -65082 5498 -100860 -84290 7649 79968 178991
15168 178991 104613 -17993 -6638 76575 69324 -27538 -147273 -86274 -34815 -39328 -36587 22577
15156 22577 16597 86140 104381 56587 -34402 -87487 -67511 -51180 -9519 53251 80211 -20866
15144 -20866 -12705 3441 -119964 -162381 -121504 -75419 -59116 14546 -16657 -74910 -42955 -63882
15132 -63882 -68348 -143281 -223875 -162869 -80478 -49505 43848 -44449 -64105 -130742 -162862 -253325
15120 -253325 -197683 -221 10503 13571 -5727 6570 27721 -50484 -79973 35642 87191
15109 87191 3922 -46591 -19267 11598 26395 7316 80814 27108 18379 -17458 -174443 -254136
15097 -254136 -145714 -37779 -50502 -122552 -138152 -147199 -148640 -161194 -92851 -91323 -74959 -13595
15085 -13595 -91707 -171520 -200827 -136830 -40578 71290 115723 77772 50939 64051 23953
15074 23953 62317 143501 -10499 -93723 -83862 -89839 -34942 1740 15282 89751 122662 147494
15062 147494 78364 46315 37753 44250 -44991 -42932 -62995 -10796 4598 -41979 -19027 -33907
15050 -33907 73496 82933 143184 101682 48079 31013 -38210 25011 126814 131993 96285 37803
15038 37803 -72260 -35727 4369 -136102 -142951 -57759 -62779 -54037 -121647 -142149 -161649 -83820
15026 -83820 -168698 -121796 -33100 -59377 -39086 -73620 -16470 12425 10626 29758 -74386 -38268
15014 -38268 -20496 -77516 22495 -6284 66716 31711 -4139 74349 185150 141899 174248
15003 174248 145710 157526 92428 -30200 -4866 6325 -58587 -66676 -69195 -113608 22068
14992 22068 7874 -60421 61393 93947 72495 155878 133723 39450 55387 916 -50807
14981 -50807 16741 -47080 -61244 -16804 25740 -3450 5249 -129500 -103070 -37494 -126801 -126322
14969 -126322 -250659 -266155 -178544 -53211 -92605 -65871 -116065 -114795 -11847 -67580 -122851
14958 -122851 -10792 18298 -66059 22700 84072 19158 -160999 -35825 53115 -63503 -74875
14947 -74875 -36405 -37928 -44591 73851 883 -119191 -173109 -127404 -179197 -132418 -149907 -228486
14935 -228486 -309941 -219317 -132236 -70306 -101385 6311 -50729 -61400 -137830 -178494 -164757
14924 -164757 -127123 -91452 -2534 -50036 -87505 -82253 -67941 -106580 -227710 -184893 -77644
14913 -77644 -46771 23710 4047 59929 20184 -32120 -57991 -117418 -146672 -187865 -185025 -115391
14901 -115391 -3868 -38986 -140343 -99371 -19797 -53421 -140590 -141042 -135355 -132883 -44245 10224
14889 10224 20217 33146 -36963 -139808 -130084 -89660 -28118 25128 -4634 46634 -55318 -89006
14877 -89006 -5995 -29739 -80108 -115925 -41804 70876 -58152 -73622 -48412 11925 -48805
14866 -48805 -42652 12635 48203 -6325 -115721 -192059 -159704 -249691 -202139 -254785 -172386 -128547
14854 -128547 -90377 -162009 -158867 -153002 -100368 -52509 39076 211112 170437 46038 -74540
14843 -74540 -7834 -11970 -50677 4278 55027 17190 -63273 -97253 -168574 -41747 112592
14832 112592 127175 91529 68409 -7873 -49713 -146682 -122640 -74 106636 -15196 -121983
14821 -121983 -143076 -117692 -152812 -149181 -120480 -113464 -145706 -167654 -156368 -120340 -152258 -156734
14809 -156734 -184388 -144134 -105818 -58520 -76961 -168468 -220136 -127081 -119050 799 -45182
14798 -45182 -97059 -47233 -32148 29857 -15377 -144470 -143456 -67344 -71111 -85515 -19393 26418
14786 26418 9978 -85129 -42667 13665 61599 48586 31060 36807 -42799 -44205 -43551 -23529
14774 -23529 -52642 -229431 -156905 -80470 -123820 -178383 -240822 -265507 -163218 -137444 -45599
14763 -45599 -41914 -66398 -139763 -111645 -84955 -38119 -11395 32769 -8742 -9747 -3919 -101677
14751 -101677 -133473 -207370 -173011 14987 88589 102567 6016 -83656 -99741 -190850 -291270
14740 -291270 -338533 -244467 -220157 -118806 10494 102174 96764 76043 16960 47353 168095
14729 168095 173579 32070 -122695 -185436 -37593 -115999 -183383 -183312 -136876 -58056 41292 80479
14717 80479 141844 93301 44305 -54506 -73643 -93949 -78267 -23649 41945 69624 20854 -47891
14705 -47891 -135490 -213743 -190991 -120992 -119317 -158111 -288530 -332571 -351233 -186956 18083
14694 18083 82918 118554 94548 1778 32163 9414 11724 40522 105684 143942 72737 -53182
14682 -53182 -82596 -11955 96414 -59965 -182980 -51371 6892 43138 -81151 -148498 -55415
14671 -55415 13140 24169 -44447 -110670 -47704 -59955 -20345 31158 -85785 -143425 -215739
14660 -215739 -177957 -145724 -49589 13502 -7996 -6786 -24820 -36397 27178 -37148 -16526 -123210
14648 -123210 -118575 -82936 -27488 67900 44368 60293 95512 41040 800 51181 50148 4788
14636 4788 -18884 -28229 -184310 -154731 -82289 -8132 14506 -27087 -59596 -55670 -74451 7806
14624 7806 -4220 65186 152927 12873 -111365 -144239 -1947 43264 62522 -63275 -58026
14613 -58026 -7228 -2449 -13318 59122 55693 93918 27852 20040 105364 38557 -181829 -209282
14601 -209282 -153520 -143122 -165634 -68341 -77515 -48969 7550 37091 222354 284924 217585
14590 217585 137189 115055 180352 157936 121688 57882 107278 189162 39244 400 -135580
14579 -135580 -167355 -68806 -63461 -148598 -128519 -91112 -55622 -27176 -50146 8485 27613 111212
14567 111212 96176 41618 36023 -48427 -103451 -137583 -147441 -123897 -113987 -99712 -87940 -45099
14555 -45099 -4587 5322 -53900 -110214 -78261 -62605 -165298 -136119 -180325 -73530 68525
14544 68525 52866 15942 -127876 -126702 28572 8826 -144344 -128433 -23756 108335 138239
14533 138239 -18683 -22942 21314 66877 291 -79596 -159748 -91915 -38269 -55426 -10118
14522 -10118 -154447 -193212 -127728 -151154 -45163 -28460 -104089 -63901 -44273 61118 87542
14511 87542 -60588 -38231 79414 52936 40198 50635 94354 113141 13889 -76796 -71600
14500 -71600 -67585 -140145 -159353 -33794 -4318 -37406 -94562 -107347 -86574 -17040 -30894 -29638
14488 -29638 -49749 -3365 -38027 -107278 -40201 -26143 -60538 -91439 -144647 -93860 -45856 -5088
14476 -5088 -16892 -86899 -83804 -163938 -132717 -130969 -76364 -61108 -110974 -50735 -43941 -71319
14464 -71319 -44288 102410 77780 78942 108475 82414 149941 91426 -8924 -30958 -96925
14453 -96925 -130109 -197024 -187970 -129464 -73716 -62595 -57877 1337 -131047 -152265 -142269 -239971
14441 -239971 -223228 -98469 29221 1308 20803 67671 9270 -56766 -19591 -21987 -1603
14430 -1603 -160293 -141233 -212529 -145273 -9524 -25473 -26856 -84701 -135806 -148782 -144195 -69521
14418 -69521 -39826 -93487 -111970 -41726 88185 61784 37200 62791 6970 6198 67171 48474
14406 48474 -41038 -86059 -218692 -252499 -87129 -164209 -113602 -47818 12115 104842 43524
14395 43524 -51245 93741 116802 74156 -2290 -17110 -117700 -94578 23447 71026 41766
14384 41766 8007 97835 162491 179097 219109 166918 156639 114038 132521 165608 74159 59835
14372 59835 69739 64678 35823 -59808 -81200 -30547 -46897 -7431 93196 28 27800 2928
14360 2928 119137 90483 -57070 -110507 -72513 18360 35568 46499 27781 -17936 -74245
14349 -74245 -64831 36207 77369 -102091 -126031 -138207 -120313 -68768 -11199 -38986 -79444
14338 -79444 -73066 -99319 -141459 -170355 -213301 -262663 -315189 -273778 -144924 -72701 -176243
14327 -176243 -205344 -182811 -150331 -156704 -83090 -84781 -147451 -199345 -203989 -70605 36034 120367
14315 120367 188080 106443 47818 58281 167394 37506 -9985 74479 45058 52699 61256
14304 61256 14676 110534 198587 111031 86661 22587 -87001 -11548 72543 111150 184139
14293 184139 77323 36481 32911 92858 163673 201097 24940 -134040 -162050 -182481 -235571
14282 -235571 -185669 -126017 -153647 -89289 -123400 -93290 -10367 -11105 -133856 -65984 -66070 -172078
14270 -172078 -56584 39943 137614 142307 108262 7848 -82668 -65898 -173409 -312860 -277349
14259 -277349 -157534 1676 152682 126990 33556 92817 196209 217997 216776 160155 124738
14248 124738 88330 99557 106541 -11980 25064 165780 243599 168042 32670 -21819 -49316
14237 -49316 44669 140079 204771 31151 -92922 -32294 3495 74154 137765 117368 103215
14226 103215 173662 110856 85622 102599 18707 91414 201133 125103 65939 150225 212076
14215 212076 93400 17576 -5738 -24206 71261 110693 97569 108830 146536 135416 78387
14204 78387 94583 155384 155952 93958 62394 131240 153666 42431 142875 240136 231148 115078
14192 115078 -110461 -211319 -38789 6731 106660 102266 83012 82070 46066 -21203 144366
14181 144366 167438 152213 260054 290108 233038 132969 35931 132956 132921 86800 75405 51833
14169 51833 -3979 -20066 97227 86222 24380 117452 104966 45070 188426 134131 78520
14158 78520 22471 12469 79267 32943 23165 136394 160099 45711 118215 97067 111760
14147 111760 78417 7784 34817 35694 74524 142567 2702 -141704 -251747 -218838 -140437
14136 -140437 -112840 -223829 -145776 14845 162952 71949 75335 42434 5764 10650 25219
14125 25219 32600 -24652 -116313 -58198 -10238 7184 -55356 -70864 -71957 -144505 -94937 578
14113 578 120840 112326 19358 140 -67841 -36214 7863 -227 213654 101253 -75801 -168416
14101 -168416 -225749 -71531 56310 172843 149434 30978 -38401 -77556 -154861 -99892 -60698
14090 -60698 -33445 14193 -10234 4278 -140752 -137221 -164145 -140990 -96794 -152772 -143993 -79207
14078 -79207 -135370 -197646 -199423 -183361 -114737 -123835 -120408 -80663 7213 88615 100464 -97569
14066 -97569 -183834 -195506 -100543 -33305 23654 6776 -87291 -11529 161052 189276 5188
14055 5188 -128262 -107001 24400 76461 -8757 -4287 39930 10723 112775 69046 123413
14044 123413 151603 48566 -47638 -22479 -60881 -89397 -75749 -83639 -2163 -34348 -115733
14033 -115733 -136159 24788 -6936 -158037 -39100 55504 -21410 -33940 -65455 -51263 -108451
14022 -108451 -153142 -124122 -88152 -25499 -41292 -43159 -76515 -80262 64906 82691 34242 110102
14010 110102 189798 189666 126934 63301 180712 136983 32335 -33658 -42654 -119334 -158883 -88118
13998 -88118 38370 141467 109364 -10877 -127876 -235024 -226687 -225515 -232504 -170360 -168990
13987 -168990 -79966 25789 63832 73403 43152 48060 81990 82237 18384 -115254 -21515 24783
13975 24783 -21274 -124814 -164792 -51020 789 -57965 -70868 47144 34772 94338 86963
13964 86963 100071 98860 23165 -16364 34501 109905 81081 -114464 -226351 -190354 -257861
13953 -257861 -269357 -210072 -24498 -58539 -104093 -122268 -151347 -164819 -170620 -151865 -200838
13942 -200838 -227572 -253736 -232199 -211853 -185106 -60848 43701 -16415 -12967 67790 75603
13931 75603 65401 90607 20638 -37816 -49324 -38499 5049 105778 69628 25517 103818
13920 103818 46462 -35678 -116974 -109331 -74499 66140 -35754 -61436 -64283 -54068 -31155
13909 -31155 46554 163098 164048 946 24211 111789 95785 133456 49156 -117028 -72027
13898 -72027 17932 81595 134647 216195 282585 258819 146006 97950 233382 327976 279043
13887 279043 95558 -62580 -92036 48530 143051 90939 55111 59434 101222 67653 120658
13876 120658 96551 44599 98796 176884 131313 188016 162357 47079 115796 118854 -62566
13865 -62566 -194157 -188746 -89204 -105115 -245330 -227996 -159608 -59747 -37224 12675 11681 136256
13853 136256 204649 67978 -77618 -24717 18314 90710 84472 -13042 -111896 -66449 83748
13842 83748 136522 101487 129402 -149 -85657 -60846 -13581 131 1422 93351 29213 -7344
13830 -7344 -10655 -13227 12596 2238 -4850 -8265 -47116 -16170 69008 54623 44494 119424 239037
13817 239037 245033 149581 28957 -35402 827 -7041 173586 263170 131499 -30446 -79812
13806 -79812 -41808 -6668 -32237 -74922 -39621 -61639 -94617 -52474 -49620 -23067 -19954 -142326
13794 -142326 -118293 -173451 -184729 -121405 -48881 -65099 -32092 74741 117429 89364 119484
13783 119484 112389 38645 13624 25918 46442 -15365 -16597 75082 120138 183503 200158 114432
13771 114432 -15874 49879 21840 -31893 -20857 -10716 44857 42481 122872 140179 85683
13760 85683 12212 31309 -72338 -62542 40673 64748 -20090 -61792 -85231 551 53573
13749 53573 -10772 36159 -72759 -107996 43875 63521 -113022 -89646 40211 106598 141741
13738 141741 88093 100553 48960 730 96528 118914 85716 53397 -21504 -38753 -78348
13727 -78348 -27866 13190 31405 -154176 -235359 -98818 -20483 -72281 -98550 4442 24217
13716 24217 57330 58309 -8395 -56685 -40066 -8361 -80293 -113395 -56268 41009 22187 46513
13704 46513 -69542 74743 133792 -40328 -190300 -62338 8763 -159684 -209231 -79990
13694 -79990 -62883 64820 230835 162410 126679 162703 105799 23005 -6816 36406 -1295
13683 -1295 -143296 -240919 -180641 -70158 65177 92897 8257 -4446 143067 147934 80696
13672 80696 2933 -63516 -100010 -51781 925 73235 139273 127997 121230 127827 95301 52787
13660 52787 -63587 -7239 -4460 -25260 89720 75320 24130 11365 116270 112381 -72300
13649 -72300 -79679 -67749 -70302 126499 216087 203974 288565 245781 82278 139745 276188
13638 276188 356648 255907 135038 80253 147843 126073 109470 1478 -30125 69459 264321
13627 264321 266611 170898 161570 127014 110789 150550 124419 -20366 -58193 -60050 -37442 -4223
13615 -4223 51677 -3898 -54137 7164 -32979 40139 66637 27731 -29668 -140427 -95301 -61933
13603 -61933 8087 72267 -39530 -141415 -91872 -31713 22031 45515 -42344 16319 114589
13592 114589 121079 58813 15415 99731 20629 -54561 -112489 -192033 -120201 38680 74173
13581 74173 -24638 50826 149186 195962 259011 212412 120907 -36466 -63066 -37672 -155134
13570 -155134 -143854 -110325 -64027 71091 75399 67680 112539 58429 48039 71106 33697 95080
13558 95080 138973 145852 232133 156923 148619 145642 108777 96321 166900 274754 380118 198165
13546 198165 117085 117107 2997 -82753 -112237 -149856 -141891 -98378 -52684 -25353 -76021 -37420
13534 -37420 -8609 76810 157282 113984 127343 40966 -24587 -105927 -125822 -191329 -181779 -56762
13522 -56762 59235 74350 93733 221420 269305 186178 86276 -77691 -8789 45367 15374
13511 15374 -73944 -116835 -108561 -25593 -70963 -37171 118283 177362 141730 190896 155484 144468
13499 144468 145437 197057 228446 198137 232428 181624 107403 99809 -20814 -26788 44094 11531
13487 11531 -8771 42586 -15590 -50099 -22389 -12577 53959 -46022 -74149 9589 70326 -12668
13475 -12668 -81560 -133424 -6329 88797 93521 12132 -12368 41512 -30763 -118114 -7385
13464 -7385 117939 65974 14271 -38559 -121485 -184647 -218339 -194190 -76910 22734 181631
13453 181631 142341 87367 -14411 30959 -80238 -115397 -108090 -6402 7863 13622 71707
13442 71707 117250 -5081 -135551 -176535 -40666 -3911 -4943 17161 18744 -68602 7646
13431 7646 64262 39431 1603 30289 23197 -23357 -10953 -79365 -73036 128892 222597 217069
13419 217069 121213 48728 107894 120549 -5114 18247 -89933 -30752 49028 50262 93015
13408 93015 121521 162079 133269 127219 206913 115943 38562 28841 531 119294 186429 284448
13396 284448 322215 195675 168549 195578 228094 137258 118935 198410 154787 82769 30338
13385 30338 84394 125959 145482 65908 -17672 -36469 -26305 -56082 2112 86223 125974 69539
13373 69539 82384 113703 100206 58153 148652 99132 198091 182985 -15076 -53818 -80487
13362 -80487 -192223 -154140 -92520 -173246 -208351 -50004 17107 16519 86134 17796 15843 -35516
13350 -35516 -89178 -71223 -75819 44058 117862 79841 101356 97682 -15722 17598 51502 103609
13338 103609 -1795 -129800 -133947 -84763 -98549 -39821 23842 -38377 -60140 -8229 67845
13327 67845 45808 34425 74019 77324 128498 -14367 -85653 -25374 75600 92454 180916
13316 180916 223817 123920 -30760 -30155 60680 93676 58622 32796 33531 44092 6446 -30449
13304 -30449 -46808 55598 7387 -1390 43580 94784 143547 176663 234944 148523 134754 95206
13292 95206 60176 63536 74673 100944 103215 27369 -98939 -112508 22104 134697 132407 125611
13280 125611 167923 192921 224114 290791 322829 180682 -38704 73426 175224 224901 178712
13269 178712 37163 -97676 -99650 10744 43208 114410 209367 261365 187981 225329 215464
13258 215464 172707 137207 55412 51431 129943 184255 168035 43704 -197 152385 109064
13247 109064 -4822 -61689 -113117 -171439 -176962 -71581 17101 -65646 -91519 -139437 5512
13236 5512 132165 135647 60096 84790 110988 182698 168160 190914 194386 220110 240919 171669
13224 171669 124418 115449 139559 164123 133687 94707 55960 6545 22342 95612 167895 220012
13212 220012 175679 140302 112058 27573 59033 150489 177040 137822 28901 2770 28323
13201 28323 72141 107423 101032 51060 1383 23716 -15708 -18494 -13037 50270 52424 -67785
13189 -67785 -75795 18416 52591 39772 80242 174619 173501 104165 -33536 -31044 -14258 28037
13177 28037 71843 2547 -38639 17579 -37151 -30105 40940 148289 215677 128473 110615 184583
13165 184583 129290 14535 48121 125015 154907 155443 112391 83570 29779 18662 10335 -27138
13153 -27138 46180 81625 124714 216466 289724 219227 194200 155643 91509 73753 144485 105932
13141 105932 96621 145880 122849 -68143 -74638 -28343 -59031 80947 97254 129846 149856
13130 149856 86005 2050 3842 189842 211975 89441 38037 24151 95524 180837 165143
13119 165143 147458 59229 2372 55625 34591 96842 106411 103539 21817 -24359 -4507 -19635
13107 -19635 -56218 -85264 -78180 19752 48189 25151 -125721 -85293 50994 84115 90030 61044
13095 61044 -75157 -173968 -81486 44991 192440 208503 186454 66659 -55546 -51891 -67667
13084 -67667 -29831 36954 130617 167168 126370 81031 -31616 -140743 -173803 -115330 -18448
13073 -18448 -25964 -15700 42987 181826 166971 126671 71006 82857 98358 38081 -23723 -83420
13061 -83420 -151508 -186937 -105789 -65653 -61399 -51591 32634 115071 118315 77841 -7552 112679
13049 112679 217238 239165 168984 121607 141638 86935 114749 147127 169295 263298 181675
13038 181675 116105 154853 67297 59861 29973 17327 135460 187741 167099 194300 229538
13027 229538 354157 442306 576497 597824 608748 440252 185705 32941 16548 -24819
13017 -24819 -28648 2253 30464 -4245 71347 26361 -5745 39847 58675 58840 -4667 -55004
13005 -55004 -90227 -27147 50578 149427 216962 101460 82715 147871 276523 249437 35053
12994 35053 -133143 -187403 -254995 -155115 8239 82509 20496 42415 116425 184242 235692
12983 235692 339666 393286 487849 482278 472642 296419 193322 326137 362957 226760 157793
12972 157793 106946 158703 203634 108126 16336 69655 139855 159344 265312 279171 92518
12961 92518 -25884 -25150 -90815 -31325 40085 87308 125118 237491 200909 73171 72995 136971
12949 136971 137451 115553 140422 109604 79742 90392 79387 49538 106448 118078 61159 49887
12937 49887 175556 230241 284205 322177 110301 -29547 -59154 -71499 -12345 71440 69362
12926 69362 216272 236798 199740 232612 37966 -81756 -142700 -161996 -93259 -67785 -52828
12915 -52828 -69295 -183475 -253128 -147140 -58634 -9810 -1032 60143 7368 27681 13742
12904 13742 42663 27816 -26969 -84502 -148677 -38570 80209 32839 -125305 -111060 2950
12893 2950 10036 140772 162771 115379 130647 132702 178621 182603 137222 96162 30380 65680
12881 65680 169206 114070 -27392 -42682 65434 34949 21821 34263 31606 58920 15790
12870 15790 102534 132690 122997 11337 87360 170802 92154 2158 -12426 72853 116396 110181
12858 110181 110884 79696 43113 78932 188786 309265 283825 128245 103974 194425 118673
12847 118673 124613 139348 112056 77007 170884 350243 344844 296086 133039 -24083 -116975
12836 -116975 -177786 -156798 -96838 -32693 4339 -96702 -136284 -87029 -3342 151 21117
12825 21117 4896 55029 89342 92602 114966 34442 -22079 -31228 13526 82045 152839 65700
12813 65700 -32779 77189 149563 152892 108243 66707 80936 80658 26575 -15635 -19699 -35024
12801 -35024 -10650 101653 96219 68246 -43845 -180291 -192819 -131503 -167992 -50593 17421
12790 17421 5691 41038 120754 96536 14748 -23947 33574 11251 42843 20774 32925 -23985
12778 -23985 145074 172102 70141 94772 187273 227140 370342 267642 118654 128104 98174
12767 98174 147241 169744 256983 277690 150426 66095 105916 139293 151852 230443 226574 120714
12755 120714 77037 172802 160155 -37733 -61412 58903 137570 36135 139301 165794 181510
12744 181510 145163 220528 148444 180883 193128 54977 -89501 -36284 -48345 -60337 -72643
12733 -72643 -18724 -64487 -10908 52041 149237 62692 71559 155281 207183 230261 235126 243512
12721 243512 174154 97301 69781 47732 160137 161522 186777 155289 125046 84436 21362
12710 21362 178346 253763 77013 92788 235620 241312 184314 144847 143016 127326 176669
12699 176669 202227 81579 58333 103680 177022 186156 129137 130825 194991 300241 327732
12688 327732 420681 441924 313070 109561 48340 125996 66285 59201 80028 85789 93015 148867
12676 148867 165968 141594 148091 88385 75745 81014 120228 98375 119377 228925 95724
12665 95724 69530 74519 153929 197652 176413 101408 -14727 -73500 -108366 25697 110569
12654 110569 139789 183237 140734 119329 117549 51087 55082 85356 79870 51841 197137 231169
12642 231169 203203 -6723 -11390 145252 89526 132968 79040 -47901 71875 306027 411779
12631 411779 364362 297336 147030 119936 136346 220239 273678 278837 279666 320792 209890 199814
12619 199814 245222 221196 131775 62090 159038 179231 197606 353606 335187 263413 207593
12608 207593 177761 272132 184182 111281 194218 320012 316216 288267 171466 33627 103198
12597 103198 130721 194273 355732 427956 382409 369816 274291 260625 306215 233792 143029
12586 143029 200439 282698 257703 210713 184559 174231 228396 242411 271505 311022 396580
12575 396580 465575 393145 291910 272707 132557 169034 340870 369236 312474 321005 358490
12564 358490 390593 421606 386723 331174 242658 252496 161275 143343 128604 288189 301577
12553 301577 149872 252270 333117 296116 221342 106155 178544 197929 153170 201587 289093
12542 289093 279917 342278 287400 253299 213049 204365 116423 107977 249354 394972 407016 399080
12530 399080 395264 256786 287295 268489 310877 330804 246988 189402 277931 291301 261457
12519 261457 209259 184957 254971 186280 158694 181010 151336 175538 230127 325875 257807
12508 257807 286315 304418 329620 342395 387977 345411 209864 162007 166338 201983 165004
12497 165004 199262 187600 213976 253145 321442 322015 375606 447266 344912 231599 230517 230725
12485 230725 247223 317803 388651 377452 348108 348507 159623 202042 278804 226760 296326 372750
12473 372750 345643 348857 359440 328511 386445 366971 276060 211657 271293 276492 376438 376073
12461 376073 403438 449011 512928 582034 550259 431801 283225 145005 88922 48050 108284
12450 108284 158940 217482 226804 221991 230727 277162 408789 423827 369302 265642 221810 327481
12438 327481 590726 569049 434010 425144 491247 472252 392896 406633 264689 241634 245102
12427 245102 331942 420588 403445 446869 490123 512703 440130 367720 323454 333123 228503
12416 228503 181595 117753 290187 437983 439776 537782 524533 377270 453073 498971 419515
12405 419515 367594 352950 278201 231910 350561 374063 341201 368097 372954 447026 627020
12394 627020 619326 511122 593932 571745 501306 337817 329914 309174 261210 252757 331429 339459
12382 339459 346153 334290 460450 534971 516288 437569 476772 450096 444523 513400 577149 577824
12370 577824 560012 503942 526991 496044 420200 341217 363196 349836 427101 424114 308230
12359 308230 511623 542112 551436 537379 560667 584137 519708 603665 551829 468408 388682
12348 388682 407493 537084 621982 561339 452981 528228 585804 554996 511824 491778 445193
12337 445193 467065 451058 476120 487675 548915 666535 688086 704183 576303 617761 588516
12326 588516 495203 519729 601567 614260 674395 671864 703576 769626 713025 712968 651061 593021
12314 593021 605576 619063 586735 526103 518989 553415 698286 674973 607520 604088 646381 664899
12302 664899 679416 766700 822501 896610 824641 743344 737410 776742 761987 775258 777415 803531
12290 803531 905243 965329 991820 1034160 1000169 917773 1013401 1065891 1027062 869035 909628
12279 909628 938306 939111 882565 1034128 1015191 979307 1023486 1009750 960494 875227 848194 864213
12267 864213 914634 901318 1038374 1080121 1073518 1110356 1071560 946742 957842 982493 1067522
12256 1067522 1170265 1119032 1024651 1054727 1101718 1163484 1237874 1269965 1124669 1071658 1141197
12245 1141197 1144670 1147859 1232301 1247100 1107902 962637 986712 1117254 1249616 1263172 1285480
12234 1285480 1286893 1367518 1415231 1399462 1390025 1452200 1557341 1489469 1379672 1441852 1460262
12223 1460262 1418201 1481881 1547474 1516042 1523167 1417332 1369385 1303824 1336321 1413387 1403698
12212 1403698 1478881 1527270 1546612 1516420 1519915 1537326 1627812 1692225 1571425 1583246 1597905
12201 1597905 1559189 1595222 1693714 1649867 1600969 1602970 1717035 1694965 1587164 1548494 1579041
12190 1579041 1622188 1566983 1528255 1564023 1678490 1716241 1879378 1950430 2079505 2076077 2039270
12179 2039270 2086579 2112287 2071208 2069486 2036104 2033620 2146738 2207152 2096508 2001123 2139924
12168 2139924 2244977 2216985 2279738 2361029 2475280 2568075 2598179 2500516 2378499 2373549 2515147
12157 2515147 2471534 2470292 2548610 2546596 2481941 2519989 2633072 2684520 2790671 2859215 2890182
12146 2890182 2809190 2835459 2926084 2953616 3017096 3109565 3215926 3277822 3117041 3072959 3044941
12135 3044941 3142517 3180163 3188050 3228388 3261019 3324360 3381204 3390535 3401718 3448759 3435331 3544560
12123 3544560 3523846 3492241 3498177 3558935 3668073 3683541 3644114 3786578 3967251 4078214 4148434
12112 4148434 4245425 4258622 4246473 4260786 4240115 4252905 4346211 4327052 4321946 4489866 4626742
12101 4626742 4668914 4731165 4867770 5021564 4988139 4925665 5021479 5088077 5179964 5333804 5403659
12090 5403659 5377107 5381685 5555775 5651595 5679172 5762023 5938570 6133160 6252586 6439593
12080 6439593 6528466 6528738 6525475 6597725 6828631 7108541 7249172 7387405 7500366 7538955 7486724
12069 7486724 7556038 7726200 7850162 7912092 8026383 8189578 8439312 8709337 8911554 9016924
12059 9016924 9226735 9372093 9491613 9671454 9812945 9946156 10191702 10459463 10641938
12050 10641938 10807082 11064012 11305182 11600364 11797852 11998189 12270653 12546294 12796852
12041 12796852 13093134 13367446 13610464 13793521 13935654 14373206 14712914 14864572 15211817
12032 15211817 15470861 15778636 16079918 16325667 16681280 17078302 17518603 18000104 18442426
12023 18442426 18889347 19361866 19841179 20394890 20809462 21255231 21693926 22177906 22768392
12014 22768392 23225901 23648652 24284370 24949356 25471836 26037144 26598337 27137890 27635977
12005 27635977 28261476 28921609 29538604 30127960 30783189 31436518 32127831 32665942 33301211
11996 33301211 33941411 34608856 35224763 35878897 36480026 37219836 37865360 38506851 39182790
11987 39182790 39792735 40308721 40890992 41402472 41854065 42276097 42699498 43118180 43414935
11978 43414935 43529034 43738138 43907481 44092938 44417895 44529918 44486668 44427989 44373939 44255198
11968 44255198 44039553 43729312 43572586 43391437 43069376 42648226 42275489 41841023 41344589
11959 41344589 40933268 40506809 40078281 39631798 38987028 38345390 37809526 37160552 36537636
11950 36537636 35925788 35279854 34582172 33833768 33164959 32560375 31973581 31305503 30620470
11941 30620470 29976981 29266723 28589439 28040476 27536762 26878527 26212361 25585996 25018238
11932 25018238 24444903 24051042 23599005 23091423 22504620 21936539 21500160 21139046 20677145
11923 20677145 20200427 19679021 19234393 18730718 18304205 17912790 17516846 17179179 16817349
11914 16817349 16547375 16136695 15778310 15420608 15124378 14836353 14554878 14203646 13924957
11905 13924957 13508066 13268632 13097205 12819516 12558091 12243801 11891268 11725625 11553997
11896 11553997 11216589 10915171 10679302 10391253 10225825 10025105 9865763 9752086 9664823
11887 9664823 9465322 9235134 9053553 8858599 8686787 8523759 8511448 8559802 8382603 8164949
11877 8164949 7961980 7729385 7646188 7611349 7533227 7369515 7231505 7089076 6908240 6689883
11867 6689883 6681673 6633987 6416073 6238228 6283026 6216114 6048877 5918449 5889217 5770550
11857 5770550 5711443 5620214 5505661 5459473 5383278 5382519 5279035 5177048 5013687 4875710 4854721
11846 4854721 4711347 4647533 4640977 4675227 4592731 4513860 4490143 4402361 4383521 4420985 4232682
11835 4232682 4129403 4176962 4158077 4068314 3983659 3920933 3929428 3950932 3910441 3759406 3595526
11824 3595526 3572373 3533639 3518979 3552959 3396099 3287148 3182882 3205205 3310791 3259289
11814 3259289 3213309 3212938 3088032 2907340 2845989 2955799 3107398 3090475 2914073 2855283 2688307
11803 2688307 2729991 2821620 2755519 2646615 2678107 2722603 2577414 2572264 2524812 2473403 2425089
11792 2425089 2425395 2363840 2418631 2388750 2276869 2273194 2316400 2297857 2324691 2303327 2370446 2306160
11780 2306160 2105577 2087136 2081314 2110221 2017085 1988718 2036273 2120656 2244472 2183113 2141623
11769 2141623 2039021 1938725 1962092 1971981 2017737 1953206 1880918 1890717 1875381 1823444 1699420
11758 1699420 1656543 1708239 1647040 1687407 1872431 1937060 1869405 1810449 1634607 1561533 1562436
11747 1562436 1668947 1785453 1899529 1799056 1623819 1480111 1419314 1469990 1533259 1553811
11737 1553811 1482416 1527647 1462908 1359483 1445320 1480582 1440867 1436897 1509386 1535646 1596700
11726 1596700 1427911 1270943 1177087 1186244 1211229 1284885 1150499 1140565 1184804 1202595 1214602
11715 1214602 1305673 1323606 1367613 1392746 1324577 1141884 1091988 1166341 1085152 1040774 1041430
11704 1041430 1136874 1093929 1064444 946434 973608 1002667 961305 972126 997506 1086476 1079526
11693 1079526 1038212 1025418 1011065 998901 1043845 1068547 1140293 1015122 990843 1097702 1105039
11682 1105039 1067791 1100615 1007490 901708 929802 917745 920214 849186 863402 796842 753545
11671 753545 817265 867878 756016 715843 709884 690022 615994 641882 719024 691174 735598
11660 735598 794359 841419 857617 813037 829437 767442 695107 679814 724312 841477 992528
11649 992528 1060926 1014297 811670 677922 636314 626117 702158 692881 592714 700184 787840
11638 787840 753755 762441 707105 755659 704820 638690 657619 744745 660324 501492 384799
11627 384799 454039 541800 515333 447361 413358 430498 472917 467329 538631 616623 515234
11616 515234 572503 546812 563406 639274 695469 598171 568140 545735 583154 632493 629708 568933
11604 568933 557218 562185 534398 527052 472061 539484 568752 566538 656836 582593 581254 661807
11592 661807 537173 470944 520152 494181 542500 596500 640407 547470 466383 588639 680485
11581 680485 581524 489715 500869 495225 400952 286427 348251 407439 383490 410422 460561
11570 460561 475678 488902 611186 651146 536374 402665 396908 574700 670777 561631 515147
11559 515147 416356 381856 345607 408757 398878 397439 447666 405283 315484 414744 321133 337790
11547 337790 420625 522331 597128 521809 504861 575863 457393 405157 404202 458539 460561 433275
11535 433275 354673 409966 381681 318253 378487 413953 400775 350829 297749 333617 291205
11524 291205 265737 280452 312329 338129 269970 249084 369236 343487 250495 349065 407730
11513 407730 361351 334318 344468 339014 330115 291546 373834 420767 462519 380243 293835 399046
11501 399046 291872 212106 209124 196031 296202 402526 325877 197037 129711 163641 237660
11490 237660 233651 341021 436645 454663 408698 344474 314642 297864 293848 255939 375978
11479 375978 453669 303323 195260 218425 265430 263843 248425 275903 338982 397031 366620
11468 366620 481757 428290 446885 492055 506237 391135 323725 276931 222422 297585 200108
11457 200108 136568 222405 261064 115598 73861 77450 145494 94172 82324 209683 358364
11446 358364 365347 334707 405338 392312 328760 280526 242449 236944 297033 226758 232634 319351
11434 319351 253368 291342 264071 240370 255336 316478 285915 246591 247020 163337 193853 249983
11422 249983 262453 235355 194015 44431 438 60105 151561 155314 172202 203791 279627
11411 279627 191402 107229 82581 72716 167670 270963 351432 307814 212579 174143 140366
11400 140366 111652 67595 262405 408153 391643 342972 318615 282063 300260 249776 226333
11389 226333 274349 238332 230251 179073 73726 72446 175288 265133 231465 175208 186888
11378 186888 261074 190056 201143 180242 167175 309428 282715 192835 191437 156075 146819 227397
11366 227397 257790 257766 214604 236628 171180 8351 -117099 -74003 47012 178995 198872
11355 198872 207793 228705 165312 181718 165417 143719 207892 280888 321246 396556 436080 400286
11343 400286 309698 233091 113800 82320 75607 176266 215071 221072 228716 158221 -12100
11332 -12100 -101187 -25912 35130 84745 43727 68241 115608 107877 33923 87036 182377 179930
11320 179930 160170 104348 60584 103732 166017 203644 222836 226554 257046 261912 317685 153098
11308 153098 90571 74067 163428 250688 286154 233781 111179 -8055 -48477 30645 72517
11297 72517 134061 234023 253431 231496 204817 269065 250436 255465 299269 214729 180932 275665
11285 275665 148414 189422 216048 162526 211680 390733 353090 189293 51437 -6825 66173
11274 66173 125759 186930 249665 173267 73896 23866 40800 112044 178568 177862 49117 68909
11262 68909 107631 100690 141299 215110 100099 73505 98602 133289 169432 177515 152345 154586
11250 154586 182884 92432 108591 185584 284112 238653 177829 232108 125146 142199 102459
11239 102459 10347 53218 -22110 -44241 -67083 -34210 154038 254676 219548 153035 211413
11228 211413 213456 159767 11886 59895 56393 67921 130654 227304 318630 269832 264710 250849
11216 250849 195138 46574 -18174 34382 46506 -11740 19470 1656 10901 110131 150985
11205 150985 231627 240236 260425 217075 158005 214619 241254 107170 126015 134766 135911 78715
11193 78715 69806 98037 123810 196946 338083 296232 179043 240171 311674 212577 100344
11182 100344 -16007 -49396 45830 93393 57424 127880 116686 165418 95096 -14570 1427
11171 1427 77954 43538 -80597 -48188 -29829 -72628 -97769 51215 71888 -34830 -46050
11160 -46050 -54112 116375 43430 -25527 -149019 -140972 -59325 -13921 -68942 -33460 27321 49839
11148 49839 81321 64063 -28480 214 4254 -34043 15332 -59912 -41135 12382 55681 102019
11136 102019 178746 175102 137548 33777 -29387 -3431 6174 65723 -40084 -55657 43033
11125 43033 7877 -28618 23782 -1864 96310 236190 148457 70373 39793 49288 160609
11114 160609 321496 332236 250942 216346 185934 130674 81557 20816 -7161 65855 62624
11103 62624 31095 124848 171165 148531 87497 74404 184966 212093 203045 143396 117566 197349
11091 197349 107631 -97276 -120257 -57020 -52637 -139255 -136579 74561 123614 117081 96231 -56245
11079 -56245 -90338 -5506 -1935 69022 19955 37478 71275 7167 28785 25830 57544 -143653
11067 -143653 -219799 -147120 -59167 52058 104585 153519 130345 118156 98890 73045 104549
11056 104549 65095 65699 210469 190801 31176 63222 112762 152428 221735 215016 216676 154897
11044 154897 149644 277564 423389 422436 376217 391627 346280 351367 213616 310611 467241
11033 467241 537386 721890 922742 1046510 861819 844833 835175 750980 579384 631300 701309
11022 701309 790786 1022663 1110108 1107680 889921 737783 506303 499782 490749 495071 477061
11011 477061 448978 514019 620737 768427 807816 791908 707819 483790 338121 389268 416577
11000 416577 489490 461711 415263 399924 418664 372804 405162 405608 352573 349641 190790 135952
10988 135952 68004 48259 -22106 -1224 7644 129366 165022 24875 51230 71134 -24785
10977 -24785 42911 130949 185072 109115 63215 111756 159958 112041 39887 64981 61789 53385
10965 53385 104773 50239 31844 -41765 -69121 -7773 -54394 -101719 -33432 51751 -56026
10954 -56026 -17161 -31749 46956 101313 63954 29338 -61427 -48914 -20592 -40951 -42863 -21049
10942 -21049 24206 88664 17211 -53611 -72833 4840 -26491 -52037 21746 79592 140339 86907
10930 86907 -34534 -89464 -97369 -80127 31403 171234 192318 64546 -19206 -2649 811
10919 811 -125541 -192947 -121400 -90538 -18484 1140 -18667 -9014 22509 80996 92656 52580
10907 52580 3416 -52257 -89730 -90396 -73686 55562 -1190 -78456 -34497 132871 95649 5207
10895 5207 -53387 -16123 18080 3029 52900 -11291 -121293 -9833 99579 85050 133027
10884 133027 45106 -13354 -45234 -22317 -42009 -127656 -117464 -144339 -174824 -2330 64584
10873 64584 60597 -39884 30880 113427 183517 92929 85771 186968 133286 -43499 -38890 -29801
10861 -29801 -33074 -5261 11328 25841 35444 47817 40002 66662 19946 -90252 -192106 -167238
10849 -167238 -183179 -144722 -101913 66016 201723 138044 23472 -107202 -85496 7512 -294
10838 -294 100787 49857 6650 23189 51811 43041 28448 -45571 3959 -53370 -36604 87857
10826 87857 8477 -33222 28331 68418 3209 -43020 21900 66451 3649 -373 31833 -85667
10814 -85667 -65670 -51911 -104610 -43630 22385 27412 75400 132159 191080 143774 16230 -44230
10802 -44230 -78652 65315 107925 10496 -75633 -35269 8272 -34474 40458 73238 28430
10791 28430 -5995 -14851 119415 217307 188410 4291 -151815 -154418 -148207 99124 178155
10780 178155 262836 295869 205882 22311 14460 114482 40015 46483 137076 101056 7318
10769 7318 -62978 -195207 -238323 -94075 -39685 -77446 -46688 -19277 19386 49407 -352
10758 -352 2698 28225 106648 20454 -33456 -112366 -167515 -90123 -75744 -226 136448 49012
10746 49012 -51005 -125545 -188447 -97276 -58918 -43143 17860 -7010 -123216 -134206 -140236
10735 -140236 -131840 -128943 -60781 -37930 -11592 32621 88397 58348 50146 134076 206313 128002
10723 128002 44269 -28004 60036 154289 160646 177814 121796 69845 107721 94806 158719 90734
10711 90734 109786 3663 -11854 -40926 27335 157618 222520 71357 142053 214565 206864
10700 206864 298851 297819 139811 92034 104892 49468 -86834 -54612 29822 6074 -63620
10689 -63620 -81246 -89463 -54648 64502 126986 169166 122456 114044 59954 119591 88118 27658
10677 27658 8655 29467 8396 -82510 -12591 -78299 15630 81055 -10635 -28311 -16711 85099
10665 85099 207589 224591 129599 14142 11791 117588 133306 46147 55701 92503 79489
10654 79489 156252 126845 21240 -34793 9069 67624 127541 117039 157016 291183 330767
10643 330767 438535 527598 610403 599425 591905 666348 771538 849312 950131 1118106 1329759
10632 1329759 1654903 1990609 2252692 2609082 2892679 3079930 3523844 3890461 4385067
10623 4385067 5093881 6128939 7516878 9581335 12437774 16332747 21579925 28694932
10615 28694932 37398370 46291587 52822141 55282068 54187318 51629468 49299114 48497850
10607 48497850 50195445 55015786 63887626 77661335 95582703 113356250 124089142
10600 124089142 124167218 116214985 105445130 96250630 90914625 90333406 95321018 106641226
10592 106641226 124725395 147725944 168743119 177841584 170992509 153200326 132868962
10585 132868962 115473289 102865213 95614920 93992479 97774085 106819839 118850754
10578 118850754 128506036 129570133 120195281 104557120 88219934 74433454 64394901
10571 64394901 58058609 55035504 54725215 56586484 59351674 60737321 58795239 53040053
10563 53040053 44958120 36687515 29386265 23504469 18978971 15507204 12795080 10817354
10555 10817354 9276189 8126530 7246266 6510719 5848071 5125088 4560618 4131384 3755924
10546 3755924 3522199 3235623 2968732 2868933 2884075 2821003 2497048 2231054 2106656 2138511
10536 2138511 2102206 2006401 1829727 1631340 1550778 1570239 1507972 1456233 1485035 1374418 1367717
10525 1367717 1315270 1236774 1196544 1202862 1283731 1206361 1285758 1331057 1240508 1141667 1040717
10514 1040717 1029131 1052161 1125766 1116281 1005629 847418 777080 826918 807756 822001 692319
10503 692319 721936 752937 619001 587317 610244 637555 706888 783899 690878 508338 475435
10492 475435 401175 406065 561790 685981 643947 567091 522349 463919 418279 448429 432382
10481 432382 430091 372002 325718 393784 438483 509540 614731 635873 559010 503160 486807
10470 486807 409865 379086 337134 263844 220892 378495 624766 687080 672806 663587 722723
10459 722723 659192 587126 556302 455840 406326 378720 329930 250447 229119 165044 202931
10448 202931 295113 353190 363265 268736 222064 311371 268343 224550 252067 184390 303774
10437 303774 337304 321089 321129 303590 152054 70022 54908 227572 341354 435784 423945
10426 423945 354068 319357 326657 253140 178208 42535 75799 24156 -52111 20513 -3220
10415 -3220 69413 14733 -96417 -114438 -67767 -45631 -66655 -21009 146441 311684 261805
10404 261805 178290 64535 99035 162674 125479 108529 179362 183191 130388 58509 72414
10393 72414 131421 86089 158120 167288 18082 -7099 112608 111810 92385 48090 66740 84190
10381 84190 111999 206935 242519 249757 248818 260003 212794 94715 169170 245189 287279 287088
10369 287088 263333 340763 470915 356049 237388 77558 34281 -23776 -106903 -90694 -3238
10358 -3238 52884 114224 132652 96198 135997 175728 160578 221819 296762 366292 308040 159939
10346 159939 118215 59981 12859 31376 -4131 86621 232602 173794 115848 -2416 53919
10335 53919 108920 106114 166668 191002 252387 215498 126429 92492 15347 -24338 -9054 126813
10323 126813 228957 133476 14712 -16759 58553 175555 180406 147237 162208 167222 193070
10312 193070 210123 344054 366763 258585 290992 304082 260279 208766 171770 173032 181570
10301 181570 212039 217008 108508 28454 6280 56507 121832 53418 123262 229090 295320
10290 295320 283536 295704 209267 -28497 -21607 26605 -58217 -101772 -64031 51811 114072
10279 114072 125179 174383 198570 119202 209447 298158 239619 228174 186638 41834 14385
10268 14385 103393 186180 234271 261917 225671 325624 288424 194343 177850 115864 151966 94777
10256 94777 169018 91646 8900 97563 165306 58599 20285 54550 109507 62567 -1791
10245 -1791 -16516 -100410 10407 127018 97191 92969 -53702 -90985 106243 156353 256307
10234 256307 259104 204102 72483 17037 8026 13140 186341 328847 236986 266037 341321
10223 341321 238480 93737 116637 183510 222917 144120 146293 -9376 -83223 -12737 -2650
10212 -2650 14489 10175 -13147 -78658 -102762 -31062 114111 185869 61640 -17128 46831 72889
10200 72889 158969 196716 280547 207678 186635 84220 -51139 -156897 -90218 -29201 12078
10189 12078 78073 80488 192274 146643 140728 148395 135677 48660 113166 148629 177117 234584
10177 234584 306830 403564 443057 459440 321556 213890 284560 386555 457228 524162 617054
10166 617054 749391 714853 655395 604383 550515 536919 599914 568858 572162 609927 737588
10155 737588 911011 1087194 1179635 1302330 1243074 1024858 890496 821921 715834 630742
10145 630742 540554 553293 669132 739426 772730 796574 782286 784827 560359 379817 318215
10134 318215 260658 330852 424996 478753 412395 346433 290985 287477 164954 114914 203917
10123 203917 268489 306263 329061 90823 -89873 -62542 49998 100921 168274 266093 198226
10112 198226 235185 312906 219172 180581 213841 308721 336795 296471 213415 187490 270270
10101 270270 347377 316505 194748 76519 78779 95237 153459 146490 99351 105668 96477 67842
10089 67842 -50636 -48271 -124598 -177164 -131997 -108104 -188703 -125790 -4141 -11036 -123221
10078 -123221 -175758 -85136 -7894 9322 -6358 -54177 89267 231330 273145 209204 69203
10067 69203 18587 15910 35766 -28990 -116857 -197502 -166702 4285 89281 136478 171186 212203
10055 212203 216377 217366 208360 124796 12287 49504 98935 35599 95529 42740 128125 84105
10043 84105 157018 107300 -1552 -52860 -67082 -155194 -95165 -72287 -27059 46545 143773
10032 143773 29445 -94554 577 56898 48327 23858 -144586 -199006 -144668 -112282 -72957
10021 -72957 -32043 -12211 148851 192416 105324 17362 57729 -16300 -13826 -79 72836 95372
10009 95372 23465 29922 22362 186915 239090 224258 292789 323498 173904 114319 -8602
9998 -8602 -125101 -111832 -4111 30906 -86837 -161910 -123879 -158971 -280670 -281106 -304402 -333743
9986 -333743 -317160 -182017 -71585 -22091 -66712 -195256 -148224 -95960 -98828 -84469 14924
9975 14924 132611 57291 32855 6213 -10532 -31775 -83070 -60738 -78087 -158344 -97238 -86508
9963 -86508 -11900 62167 142086 105650 -111694 -106756 -13655 -46152 -119387 -213723 -177675 -140400
9951 -140400 -55174 103931 127188 67533 46916 49811 -28429 -135291 -100541 -12492 -17304 126998
9939 126998 144647 161811 136789 29680 29625 -44397 -160548 -176909 -243766 -171008 -53627 -43357
9927 -43357 -76564 -69034 -1241 62230 68636 12900 128558 185861 91325 -68457 -111961 -101391
9915 -101391 -47980 -78393 -25885 24423 -107467 -107844 58551 181215 127578 68093 4624
9904 4624 -34468 14072 -13056 35961 27221 23333 75462 62478 -48135 -67949 -107977 -64464
9892 -64464 -45677 -180177 -189190 -136525 -50802 103734 128512 73706 75072 -2086 -35056 54592
9880 54592 68251 89787 64908 16023 -68540 -124722 -229359 -191358 -58403 5138 38699
9869 38699 90861 131789 30441 -19644 -16408 -36834 -60568 -86862 -202586 -148185 13096
9858 13096 105892 125607 52450 -10200 35136 125932 81055 42963 49581 74112 5524 89596
9846 89596 70999 -13361 -97463 -148216 -72555 -31771 14259 -19730 -13874 17049 -19903 -5735
9834 -5735 1393 -36779 -137026 -67663 -62752 -139711 -156950 -121558 -72004 -19726 18926 18170 -9374
9821 -9374 -79422 -42010 -36650 -39838 38342 120798 115057 99982 83518 -4639 18056 166724
9809 166724 247214 141961 90071 54573 59322 74168 120352 89585 83512 -56869 -86283 -12279
9797 -12279 -15938 -32030 -83240 -97359 76264 227843 321702 252251 222943 184804 216104 272006
9785 272006 362116 244512 259023 272194 277489 335594 460507 595019 833031 1185932 1737770
9774 1737770 1950601 1651874 1176528 784670 530332 479322 328393 62399 -17948 159642
9764 159642 216853 180471 207697 224390 273762 347899 271865 135827 180159 171108 40371
9753 40371 20110 -3736 19430 119916 148624 155591 119943 89039 100791 57951 -30435 -39611
9741 -39611 16592 -18719 -66803 -133174 -139615 45886 105909 60030 202572 160590 109137 18885
9729 18885 -53599 -60684 -56131 49385 167135 178096 119543 25924 49110 155969 164638 168772
9717 168772 95088 64094 -48162 -77767 -118573 -23965 142842 111086 190575 172494 98589
9706 98589 -9524 -42842 14997 -43053 -48790 -75228 5656 162814 124393 110949 1948
9695 1948 -23624 23518 -20199 -69354 -38921 4347 43339 88025 13180 -38341 -53880 50819
9683 50819 67613 75057 71502 20557 12448 -20643 13973 71375 18677 -14445 -50991 -163713
9671 -163713 -155067 -206770 -215729 -186284 -38840 -49693 -86465 48001 163643 178599 151349
9660 151349 172650 248436 215899 178432 224388 280023 500784 664869 540640 292553 200293
9649 200293 56859 -146094 -62905 -13502 -65611 -76534 -24129 -79907 -85882 40229 39307 83012
9637 83012 71835 24137 -59675 -85165 -23919 -30053 18895 55266 -10423 92767 192254 177191
9625 177191 73351 -47731 -125849 -141911 -133030 -82948 -101233 -220032 -171328 -132795 -59656
9614 -59656 43532 156612 240252 184028 160324 171940 104657 113540 1714 -114128 -112752
9603 -112752 -32043 75027 171399 188864 3640 -39268 -40772 -17431 -40681 -19396 -88726
9592 -88726 -53317 77362 37086 -86134 -73004 -51204 -122348 -289563 -245744 -133096 -128733
9581 -128733 -126172 31400 97546 156614 150196 8500 104476 104783 104112 88651 34603 2730
9569 2730 76924 28407 -63356 -66833 -31486 36194 94420 106509 122976 11786 -66642 -106484
9557 -106484 -127140 -30618 -69999 -131960 -125961 -104208 -56095 1457 -32858 -76909 -16293 -48911
9545 -48911 -149113 -100686 -106162 -160113 -160455 -212069 -241652 -41351 -30494 -65220 -172684 -136686
9533 -136686 -65452 -72125 -96360 -49345 -7598 22780 78779 -18092 -51573 -110277 -145567 -32221
9521 -32221 176077 184492 143001 -15227 -6032 155634 92421 21503 79470 89937 49394 47308
9509 47308 53551 61242 74141 123170 127750 49071 -90484 -147035 -111567 -153955 -157759 -97689
9497 -97689 54072 132651 76717 16323 51337 20804 29674 16329 7092 2841 139638 187081
9485 187081 167284 96885 -9005 41119 112495 38980 -81202 -101065 -9784 11413 -26450
9474 -26450 -63953 -103249 -90820 -114785 -7463 -3374 -26210 -85201 -85604 -102598 -4726 8135
9462 8135 -23653 -34338 21911 128982 123002 51997 71100 48432 -24638 -16871 -18119 7435
9450 7435 -58102 -74516 -66781 -115343 -160219 -212286 -268026 -222095 -244894 -249105 -151110 -150580 -141792
9437 -141792 -73933 56994 110384 39081 -83569 -162886 -267185 -227293 -140979 -33249 -67425
9426 -67425 -56803 -100207 -67321 -19934 1123 49007 140629 126809 63069 -46929 17987 47523
9414 47523 -76823 -49573 -84575 -3577 94606 -6750 -47391 2545 33782 126088 113640
9403 113640 8728 -101067 6484 29891 -63039 -17906 3916 28970 -20432 43791 -11148
9392 -11148 -127609 -62038 -1525 -47402 -29523 -89818 -144715 -211140 -184314 -232002 -223064 -226671
9380 -226671 -227907 -175928 -202063 -174034 -100987 2628 -1465 69351 -177 -74179 -147171 -168118
9368 -168118 -200384 -188252 -160166 -125256 -79698 10930 26596 79160 37025 -871 -55754 -14483
9356 -14483 -37074 -137660 -177113 -173601 -83129 -37217 -11571 -97178 -111722 -22989 -26070 -89659
9344 -89659 -31443 50020 103452 153758 77138 16285 -31002 13476 24012 104586 75343 -26949
9332 -26949 6359 116538 49641 -43461 -21919 70286 -21801 26049 86151 85194 139872 153077
9320 153077 225777 166595 43549 -17286 41470 -7636 120733 126708 54255 21490 -30548
9309 -30548 -84205 -178550 -132521 56309 65465 91748 100058 97913 153655 186255 216170 193097
9297 193097 207407 224522 171418 105936 18997 53759 41459 -98018 -176199 -208357 -72011
9286 -72011 -60229 -153456 -71744 81214 76945 -17634 38910 124381 89487 88298 128294 183223
9274 183223 254152 183890 52327 -84197 -66971 -67163 -55705 67848 105134 5677 5625 -78208
9262 -78208 -18569 20190 -17865 -26431 -29514 26409 73122 119238 144475 71089 -77574 -129670
9250 -129670 20192 93135 33169 127452 237058 265931 239744 182791 102089 24239 55556
9239 55556 132363 122434 58108 -30780 37652 94099 39669 -17448 -231073 -185467 -46647 -114441
9227 -114441 -128872 -151461 -152530 -107661 -86514 -138012 -91418 -3443 43669 32622 21198 13282
9215 13282 90422 93243 -30779 -115478 -149439 -148156 -115163 -60436 -1909 36152 79337 110885
9203 110885 73172 130491 50811 47338 -31542 -222561 -171933 -58530 -7598 2402 -23803
9192 -23803 7805 -51160 2439 96531 158657 183934 182905 6209 -60031 4442 -45706 -113109
9180 -113109 72403 170203 147074 5803 -52499 164 21656 74448 87093 75918 37223
9169 37223 -75367 -75598 10489 91168 52243 70347 58540 26148 144197 77822 -24461 -49972
9157 -49972 -46159 -77856 -125089 -51158 -6271 193328 189453 98458 41240 97810 58368 -92249
9145 -92249 -104733 -23573 9373 -56758 -73604 54892 137611 15980 -51965 47416 82934
9134 82934 105641 96982 123591 211574 174776 62001 73089 125869 24257 -111989 -61318
9123 -61318 -41476 -45454 -108653 14922 96509 92603 175171 311744 190757 10721 -186993
9112 -186993 -256310 -105454 44936 -5123 -21238 11569 92422 -3264 -25719 -42285 -79368
9101 -79368 -148886 -122518 -70851 14062 43126 -1947 -148605 -223692 -246409 -194768 -98591 -46700
9089 -46700 -51807 -2777 -16518 -50576 -13053 7735 -42594 -152195 -209700 -225718 -128887 -28644
9077 -28644 -38915 -13272 108081 213920 184304 58518 -83403 -84322 -167019 -207619 -94764
9066 -94764 -37582 159 81828 35230 45082 94737 97663 64830 15619 32436 98134 168279
9054 168279 177556 178291 99051 116133 116519 51014 -76911 -129049 -146323 -102543 49843 -6852
9042 -6852 -72644 44708 53478 -23943 -100124 -121884 -145923 -81591 -76972 -56607 -8214 11958
9030 11958 76879 111362 4533 -60127 37905 108783 63127 -44852 -13505 40298 106169
9019 106169 53476 36528 -83660 -179539 -98361 -56727 75384 65736 41182 60806 131224
9008 131224 -21058 -129476 -123968 -91539 -134370 -138753 -62106 -87022 -1376 -11469 -56086 6413
8996 6413 126039 45770 -147356 -218131 -102764 50135 -53282 -141322 -145562 -203978 -235693
8985 -235693 -123722 -74683 -58835 -75774 -35057 35977 -28900 -40158 -7312 77247 159288
8974 159288 1266 -56206 -31265 -13129 -29603 -103982 -179194 -104261 -36230 11192 41855
8963 41855 45638 -38213 -139523 -97280 -70314 -21422 62416 55904 30132 21085 20849 133499
8951 133499 96702 -4646 14921 46948 22282 33459 91722 106945 -24766 -125433 -96116
8940 -96116 -7839 43635 35910 29666 -57983 -116808 -22964 89145 135422 236975 177238 81379
8928 81379 1712 21264 74774 26592 52357 72575 67310 32689 26794 -40833 -80346 -73452
8916 -73452 -89864 -111941 -144648 -215378 -346680 -305475 -230318 -212979 -136889 -75326 -21934 61079
8904 61079 146033 83050 128536 161999 142470 72435 120237 116314 62992 -1982 -32219 -18625
8892 -18625 -61155 -11653 109960 57958 -4503 -48998 -50049 -39717 -127500 -180644 -225026 -105547
8880 -105547 130214 255049 180186 199843 19344 -79556 -25786 79754 70730 -65399 -175940
8869 -175940 -227601 -194981 -127744 -112890 -120636 -162593 -83296 -37104 -133473 -130078 7475 -9367
8857 -9367 -16054 96567 119837 27103 49063 92811 191315 20674 -178761 -109961 -116608 -171887
8845 -171887 -153180 -138405 -66653 -122990 16717 106231 4833 -14763 -107291 -98997 4753
8834 4753 97203 141301 268817 153652 109747 102668 44585 60157 81609 75257 106385 103326
8822 103326 165940 235008 203846 87176 78276 3883 -81166 -83824 -58335 -150452 -159515 -42297
8810 -42297 -3239 -36335 63763 101681 154944 128432 73265 -2880 14821 64603 75140 33032
8798 33032 28731 -42959 -53026 30391 -78550 -110275 -129686 -169861 -75280 -52542 2671 24614
8786 24614 93542 63856 103170 69220 72805 889 -35878 -176317 -189006 -100333 -181595 -148227
8774 -148227 -184352 -281670 -134275 -62895 -36599 -80421 -176836 -210416 -94525 -75253 -74408 8919
8762 8919 69350 125038 205288 101790 172031 119335 173800 105871 57945 60167 148660 267403
8750 267403 126222 157880 126147 -59927 -140311 -192014 -203686 -205063 -125523 -89317 -32165
$$ [...]
##END NTUPLES=NMR SPECTRUM
##END=
