##TITLE=Analysis number 313611
Compound Code ac 13196
Project Code adrs
Chemist Name avocado
##JCAMPDX= 6.0         $$ Bruker NMR JCAMP-DX V2.0
##DATA TYPE= NMR SPECTRUM
##DATA CLASS= NTUPLES
##ORIGIN= Bruker BioSpin GmbH
##OWNER= NMR
$$ XWIN-NMR		Version 3.5
$$ Wed Sep 14 14:33:04 2005 GMT Daylight Time (UT+1h)  MAYBRIDGE\NMR@NMR_250MHZ
##.OBSERVE FREQUENCY= 250.131544655141
##.OBSERVE NUCLEUS= ^1H
##.ACQUISITION MODE= SIMULTANEOUS (DQD)
##.ACQUISITION SCHEME= undefined
##.AVERAGES= 16
##.DIGITISER RES= 18
##SPECTROMETER/DATA SYSTEM= dpx250
##.PULSE SEQUENCE= zg30
##.SOLVENT NAME= DMSO
##.SHIFT REFERENCE= (INTERNAL, DMSO, 0, 16.5167)
##AUDIT TRAIL= $$ (NUMBER, WHEN, WHO, WHERE, WHAT)
$$ ##TITLE= Audit trail, XWIN-NMR		Version 3.5
$$ ##JCAMPDX= 5.01
$$ ##ORIGIN= Bruker BioSpin GmbH
$$ ##OWNER= NMR
$$ C:\u/data/dgb/nmr/ADRS/9460/pdata/1/auditp.txt
$$ ##AUDIT TRAIL=  $$ (NUMBER, WHEN, WHO, WHERE, WHAT)
(   1,<2005-09-14 14:32:41.55 +100>,<MAYBRIDGE\NMR>,<NMR_250MHZ>,
      <created by zg, POWCHK disabled, PULCHK disabled
       configuration hash MD5:
       62 19 C7 07 E1 42 D1 B7 37 6C 3D D0 77 39 F9 E6
       data hash MD5: 64K
       7E 26 FA FD 21 86 D9 2D B1 C0 F3 EF 01 B7 7E 92>)
(   2,<2005-09-14 14:32:55.83 +100>,<MAYBRIDGE\NMR>,<NMR_250MHZ>,
      <Start of raw data processing
       ef LB = 0.3 FT_mod = 6 PKNL = 1 SI = 32K 
       data hash MD5: 32K
       4E 68 27 6C 84 0B F5 88 D6 9A C4 A2 16 56 F7 96>)
(   3,<2005-09-14 14:32:57.69 +100>,<MAYBRIDGE\NMR>,<NMR_250MHZ>,
      <apk 
       data hash MD5: 32K
       F7 FD 2B D5 41 E7 22 74 F7 C7 24 8B FC 05 14 A5>)
(   4,<2005-09-14 14:32:58.44 +100>,<MAYBRIDGE\NMR>,<NMR_250MHZ>,
      <abs ABSG = 5 
       data hash MD5: 32K
       9F F5 2F B3 B8 C6 6A 36 DB 05 A6 5A F6 61 D4 6B>)
$$ ##END=
$$ 
$$ hash MD5
$$ 70 DF 19 2C 24 C2 D3 D0 07 BB 29 1A F6 15 B0 51
##$RELAX= 
##$RELAX= 
##$RELAX= 
##$RELAX= 
##$RELAX= 
##$RELAX= 
##$RELAX= 
$$ Bruker specific parameters
$$ --------------------------
##$DU= <C:\u>
##$EXPNO= 9460
##$NAME= <ADRS>
##$PROCNO= 1
##$TYPE= <nmr>
##$USER= <dgb>
##$AMP= (0..31)
100 100 100 100 100 100 100 100 100 100 100 100 100 100 100 100 100 100 
100 100 100 100 100 100 100 100 100 100 100 100 100 100 
##$AQSEQ= 0
##$AQ_mod= 3
##$AUNM= <au_zg>
##$AUTOPOS= <37 >
##$BF1= 250.13
##$BF2= 250.13
##$BF3= 250.13
##$BF4= 250.13
##$BF5= 500.13
##$BF6= 500.13
##$BF7= 500.13
##$BF8= 500.13
##$BYTORDA= 1
##$CFDGTYP= 0
##$CFRGTYP= 5
##$CHEMSTR= <none>
##$CNST= (0..31)
1 1 145 1 1 1 1 1 1 1 1 1 1 1 1 1 1 1 1 1 1 1 1 1 1 1 1 1 1 1 1 1 
##$CPDPRG= <>
##$CPDPRG1= <>
##$CPDPRG2= <>
##$CPDPRG3= <>
##$CPDPRG4= <mlev>
##$CPDPRG5= <mlev>
##$CPDPRG6= <mlev>
##$CPDPRG7= <mlev>
##$CPDPRG8= <mlev>
##$CPDPRGB= <>
##$CPDPRGT= <>
##$D= (0..31)
0 1 0 0 0 0 0 0 0 0.06 0 0 0 0 0 0 0.0002 0 0 0 0 0 0 0 0 0 0 0 0 0 0 
0 
##$DATE= 1126704760
##$DBL= (0..7)
120 120 120 120 120 120 120 120 
##$DBP= (0..7)
150 150 150 150 150 150 150 150 
##$DBP07= 0
##$DBPNAM0= <>
##$DBPNAM1= <>
##$DBPNAM2= <>
$$ [...]
##$SUBNAM7= <"">
##$SUBNAM8= <"">
##$SUBNAM9= <"">
##$SW= 20.6930455092707
##$SWIBOX= (0..15)
0 0 3 0 0 0 0 0 0 0 0 0 0 0 0 0 
##$SW_h= 5175.983436853
##$TD= 65536
##$TD0= 1
##$TE= 295.16
##$TE2= 300
##$TE3= 300
##$TEG= 300
##$TL= (0..7)
0 120 120 120 120 120 120 120 
##$TP= (0..7)
150 150 150 150 150 150 150 150 
##$TP07= 0
##$TPNAME0= <>
##$TPNAME1= <>
##$TPNAME2= <>
##$TPNAME3= <>
##$TPNAME4= <>
##$TPNAME5= <>
##$TPNAME6= <>
##$TPNAME7= <>
##$TPOAL= (0..7)
0.5 0.5 0.5 0.5 0.5 0.5 0.5 0.5 
##$TPOFFS= (0..7)
0 0 0 0 0 0 0 0 
##$TUNHIN= 0
##$TUNHOUT= 0
##$TUNXOUT= 0
##$USERA1= <user>
##$USERA2= <user>
##$USERA3= <user>
##$USERA4= <user>
##$USERA5= <user>
##$V9= 5
##$VALIST= <valist>
##$VCLIST= <CCCCCCCCCCCCCCC>
##$VD= 0
##$VDLIST= <DDDDDDDDDDDDDDD>
##$VPLIST= <PPPPPPPPPPPPPPP>
##$VTLIST= <TTTTTTTTTTTTTTT>
##$WBST= 1024
##$WBSW= 4
##$XGAIN= (0..3)
0 0 0 0 
##$XL= 0
##$YL= 0
##$YMAX_a= 287964
##$YMIN_a= -256156
##$ZGOPTNS= <>
##$ZL1= 120
##$ZL2= 120
##$ZL3= 120
##$ZL4= 120
##$ABSF1= 16.51674
##$ABSF2= -4.176432
##$ABSG= 5
##$ABSL= 3
##$ALPHA= 0
##$AQORDER= 0
##$ASSFAC= 0
##$ASSFACI= 0
##$ASSFACX= 0
##$ASSWID= 0
##$AUNMP= <proc_1d>
##$AZFE= 0.1
##$AZFW= 0.1
##$BCFW= 0
##$BC_mod= 0
##$BYTORDP= 0
##$COROFFS= 0
##$CY= 12.5
##$DATMOD= 1
##$DC= 0
##$DFILT= <>
##$DTYPP= 0
##$F1P= 14.0000005364418
##$F2P= -0.99999901652339
##$FCOR= 0.5
##$FTSIZE= 32768
##$FT_mod= 6
##$GAMMA= 0
##$GB= 0
##$INTBC= 1
##$INTSCL= 1
##$ISEN= 128
##$LB= 0.3
##$LEV0= 0
##$LPBIN= 0
##$MAXI= 10000
##$MC2= 0
##$MEAN= 0
##$ME_mod= 0
##$MI= 0
##$NCOEF= 0
##$NC_proc= -4
##$NLEV= 6
##$NOISF1= 0
##$NOISF2= 0
##$NSP= 0
##$NTH_PI= 0
##$NZP= 0
##$OFFSET= 16.51674
##$PC= 1
##$PHC0= -90.17054
##$PHC1= -1.046168
##$PH_mod= 1
##$PKNL= yes
##$PPARMOD= 0
##$PSCAL= 4
##$PSIGN= 0
##$REVERSE= no
##$SF= 250.130001314305
##$SI= 32768
##$SIGF1= 0
##$SIGF2= 0
##$SINO= 400
##$SIOLD= 32768
##$SREGLST= <1H.DMSO>
##$SSB= 0
##$STSI= 32768
##$STSR= 0
##$SW_p= 5175.98343685301
##$SYMM= 0
##$S_DEV= 0
##$TDeff= 65536
##$TDoff= 0
##$TI= <Analysis number 999999
Compound Code 99
Book Reference 9
Project Code 9>
##$TILT= no
##$TM1= 0
##$TM2= 0
##$TOPLEV= 0
##$USERP1= <user>
##$USERP2= <user>
##$USERP3= <user>
##$USERP4= <user>
##$USERP5= <user>
##$WDW= 1
##$XDIM= 32768
##$YMAX_p= 416440591
##$YMIN_p= -281770
$$ End of Bruker specific parameters
$$ ---------------------------------
##NTUPLES= NMR SPECTRUM
##VAR_NAME=  FREQUENCY,     SPECTRUM/REAL,   SPECTRUM/IMAG
##SYMBOL=    X,             R,               I
##VAR_TYPE=  INDEPENDENT,   DEPENDENT,       DEPENDENT
##VAR_FORM=  AFFN,          ASDF,            ASDF
##VAR_DIM=   32768,         32768,           32768
##UNITS=     HZ,            ARBITRARY UNITS, ARBITRARY UNITS
##FACTOR=    0.157963299565203, 1,           1
##FIRST=     4131.33239774945, 0,            0
##LAST=      -1044.65103910356, 0,           0
##MIN=       -1044.65103910356, -281770,     0
##MAX=       4131.33239774945, 416440591,    0
$$ Real data points
##PAGE= N=1
##DATA TABLE= (X++(R..R)), XYDATA
$$ [...]
18618b7004j3940o0614M1433M5471j0661k8641m8890R766j2251M7989N9830P5368
18606G7856J3068m1327m1055n3647l4827L4163K6416j8172k7705R137O169j0173
18594f0097J0275N4081J06245o661o8930q6973L7114M0069J712l8954n3861K0514
18582d5466N7629j6136m4097o8336P044K3841O1748J7831p1540j2822Qk2335k0331
18569a32962O7129N0717J9717M8730J9268o464m9241K8674l9782Q77l733K4511
18557B7441K4065p8760m4170N1712K9997l8669m786J8599O51K0200J6038l3579
18545a1261n8465n2252J2236Q1662L9618k5573k5974N2861L0034j862k0063K1594
18533D2555J4974K4205p0117j12116m8584L7497M1264j5680L405L1281o8065O912
$$ y = [-27004, -40944, -101558, -60125, -14654, -25315, -53956, -102846, -93080, -105331, -57342, 2488, 77856, 90924, 49597, 8542, -45105, -79932, -45769, -19353, -37525, -65230, -56093, -49924, -60097, -49822, 4259, 110504, 103843, 34913, -52060, -14946, 25123, 26835, -12119, -65980, -45466, 12163, -3973, -48070, -116406, -109362, -85521, -23773, -5942, -77482, -90304, -90296, -112631, -132962, -65833, -15116, 4601, 53331, 72599, 66135, 16894, 45568, 5786, 6663, 2930, 27441, 51506, -27254, -71424, -19712, 10285, -28384, -33170, -14571, -13920, 6280, 22318, -11261, -69726, -121978, -109742, -28080, 11538, -14035, -40009, 12852, 42886, 41024, 20961, 42555, 57529, 81734, 11617, -100499, -149083, -111586, -70322, -86002, -82597, -51316, -119381, -112469]
18521a12469k6447K6835P896j0883K3678K2233J2206M1146L9137L6811m5772n2347
18509c7976o880n0921R908r2k9116K2671J3545n394K6809o650P851L3802R68p400
18495b8875m7607J0151j7641M4909M6118j396j1314P5253k9617m0900K4214k8118
18483d823l5360l7051l8850L9482L7637K5472N1440m186l1901l8708j0497M5449
18471a896k3674Q413m721m5908o1409n319O3527q244k3707M276L0341N8914J8086
18458H679o354Q561j4580k1141l2932Q90K342j200J8986j474J7821P6039j0503
18445D5134l7918K4557R717o2723m0389j7197j1472J3921J04K2737M726m5574
18433i4377L1567P3286K3587j9397o657k4218n7235j3258L0281n253l0236L1469
$$ y = [-112469, -138916, -112081, -104185, -115068, -91390, -69157, -56951, -15805, 23332, 60143, 14371, -37976, -44856, -95777, -85869, -85961, -115077, -92406, -78861, -84255, -57446, -64096, -56245, -22443, -21475, -28875, -76482, -66331, -83972, -39063, 7055, 5659, -5655, 69598, 39981, -919, 23295, -4823, -40183, -77234, -116084, -76602, -38965, -13493, 37947, 33761, 1860, -36848, -47345, -1896, -25570, -17157, -21878, -67786, -129195, -134514, -70987, -79231, -102938, -98662, -68321, -9407, 8679, 2325, 10886, -3694, -24835, -57767, -56877, -54535, -55735, -36749, -38223, -20402, 55637, 45134, 7216, 31773, 41490, -21233, -61622, -78819, -90291, -76370, -76266, -53529, -48803, -94377, -62810, 10476, 34063, 14666, 8009, -16209, -73444, -86702, -56421, -61674, -91910, -60441]
18421f0441j1858L670M276J3781K0521N046o1489K6043K8999L6389l3968L3706
18409D675L6233r41k2062m7000k3421K6317K9879j6009j06917k7735R6583k556
18397e2954m4634K5234M2852J9138O629K3181l1508n5027j8868K3605P2969l372
18385G245m8103j04794n643O2969K2432M2125K9322M0765k9568n1627m1934n828
18373h2639K1217j1857k9105K4202k04J0186m6969j0190o139m0620K2417K1876
18361a27825K3116K1761K9831j1113N456N3403J3190J2849k1073p2669m9936n3548
18349a76558J1442L3633l5495L8536O0930J9363q244l9338n033J77K0649j831
18337h1769R618l9337K7595L8368J6271n1794k9702J4129Q1180J3500J2763j9389
$$ y = [-60441, -72299, -68629, -64353, -50572, -30051, -25005, -86494, -60451, -31452, 4937, -29031, 4675, 40908, 39967, 17905, -29095, -52516, -26199, 3680, -12329, -119246, -146981, -50398, -52954, -97588, -72354, -29502, -10364, -3735, 19446, -12062, -67089, -85957, -62352, 10617, 7245, -40858, -145652, -151295, -88326, -65894, -23769, 5553, 46318, 16750, -34877, -76811, -82639, -61422, -73279, -102384, -78182, -78386, -68200, -115169, -125359, -131498, -172118, -149701, -127825, -104709, -82948, -53117, -64230, -58774, -5371, 7819, 20668, -405, -73074, -123010, -176558, -165116, -131483, -166978, -128442, -67512, -48149, -56393, -95731, -100764, -100587, -79938, -81769, -72151, -111488, -83893, -45525, -29254, -81048, -110750, -96621, -15441, -1941, 10822, -8567]
18325h567l7456m2868J2917J2246l5989Q784L2205m630r159J5701L0991J1129
18313a4696j580J9552m4120q4631J2366L2085O442j1780O2286j1241j0996m369
18301e0682n8345j5775N3653J2481m9904M79J00434j5920K8308p179m8163n2958
18289a03571k5547o139o772J5134M7521m8095o3216R628R3856P6942J2376j5775
18277a3658l339k8228k8208l2755R926O595j4341K936N999M8884l4497k4450R2388
18264a2748J0057p864n4795J2564K8585j5697P3338N032o7557l3002M381J6559
18252d1147j1309j6726m4433k2192R226j3239k0825K2110L3316J8302K3820p1285
18240a34382M434o705K2708L6011L071j9190l5569O370O822L1452M6453R575N091
$$ y = [-8567, -46023, -88891, -75974, -63728, -99717, -90933, -58728, -63358, -72517, -56816, -25825, -14696, -16276, 3276, -40844, -125475, -113109, -81024, -74582, -86362, -24076, -35317, -46313, -50682, -109027, -124802, -71149, -58668, -108572, -108093, -7659, -23579, 4729, -2450, -50613, -103571, -129118, -135257, -142029, -126895, -79374, -127469, -190685, -181057, -87201, -10259, 2117, -13658, -16997, -45225, -73433, -106188, -96262, -89667, -104008, -101072, -95073, -46189, -80686, -105136, -12748, -2691, -10555, -65350, -52786, -24201, -39898, 33440, 38472, -29085, -62087, -57706, -41147, -52456, -69182, -113615, -135807, -126581, -139820, -160645, -138535, -105219, -86917, -63097, -134382, -129948, -136653, -113945, -77934, -74863, -94053, -129622, -123252, -116430, -84978, -38525, -28950, -23859]
18227b3859M723l0295l0641P089K3235M4326L2492p877l7756l4791l2370J0290
18215g5434N9846j1190o32M16m7363p2226k0138j2402M1085J4070m4243l5155
18203b03366Q2580L4478q932k3938J0022N3460L1958j6866L9130O2774k5238L0480
18191F6542J4213l8019p8308l4126J0615J7269J9077k4172J2021j0156l163k9621
18179g7828r917l8412o3089n886N1172M9510L4918K1952j1363l7365m2559o543
18167a35410Q835J648O085j4772l0927N1757L9613K7875M5161K8413Q181n6404
18155a9945k8302m451j8642J2019L589m2078J3042n176J8769j753l1604L4791
18143f9741M1211k4447j4709M9083J4178p952l7515m0644M6963K2033m5920k4429
$$ y = [-23859, -19136, -49431, -80072, -72983, -49748, -5422, 27070, 19193, -18563, -53354, -85724, -75434, -15588, -26778, -27410, -26994, -74357, -146583, -166721, -179123, -138038, -123968, -168211, -203366, -120786, -86308, -95240, -119178, -109156, -55696, -23738, -40604, -1474, 61300, 36062, 66542, 80755, 42736, -35572, -69698, -59083, -41814, -22737, -46909, -34888, -45044, -48207, -77828, -87745, -126157, -189246, -195132, -143960, -94450, -59532, -37580, -48943, -86308, -128867, -135410, -126575, -124927, -118842, -133614, -164541, -112784, -73171, -45296, -135, 28278, 36459, -19945, -48247, -52698, -71340, -59321, -55732, -97810, -84768, -89944, -71175, -72928, -104532, -69741, -28530, -52977, -67686, -18603, -4425, -12377, -49892, -90536, -43573, -21540, -67460, -91889]
18131i1889O3908K4106n9334o725L5306k1001j8048j5398j5615L3490r257N8650
18119b1807R646m7925k9356j835K663O9307L2926k0845n525l5837o3698n926K0803
18106i7409L1081K979l2679M1748M5419L0081J401n1589m5244L6925J8597L1803
18094A3113R882P5445N0225j44160r1025K2187J0575l4973r666L4333k6111l0643
18082a20818P2211J5326k2856q3637o5830q151j8601m9414K6679L7906L2728K5697
18070a58760M6639L7545P6218K4228m6612j2873k434k1533o074K8303L3457L1704
18058B9808l8986l3268m990l0354k841m1787m4584J2563M867R4671L3439m2306
18046f3768k0043J7972K4254L8523m4118j6201L4557K974k1822k6082l3665j8458
$$ y = [-91889, -27981, -3875, -63209, -69934, -34628, -55629, -73677, -89075, -104690, -71200, -80457, -21807, -12161, -60086, -89442, -91277, -88614, -19307, 13619, -7226, -12751, -48588, -112286, -118212, -97409, -66328, -63349, -96028, -54280, -8861, 21220, 22621, -28968, -74212, -37287, -18690, 13113, 22995, 98440, 148665, 4505, -86520, -64333, -53758, -88731, -98397, -64064, -90175, -120818, -48607, -33281, -56137, -139774, -205604, -213755, -232356, -281770, -255091, -217185, -184457, -158760, -112121, -74576, 1642, 25870, -20742, -33615, -36049, -57582, -63656, -35353, -1896, 29808, -9178, -42446, -47436, -77790, -80631, -122418, -167002, -154439, -149572, -54901, -21462, -63768, -83811, -65839, -41585, -3062, -47180, -63381, -28824, -25850, -47672, -73754, -107419, -125877]
18034a25877K0780m414M3796j4152K922J4790J6647n1618M78m104J9515J332J4585
18021f5320N4392M5546K0053n4162l1937k6804l940k644j8452K0124k15J9165
18009d4194l0862m8348J4571P8722K7180K733J5000O1310K4684j3804L0125n9610
17997E7507j00505K4997L0585K1801N947p4331l4441k0732k7721K9571m5208k4432
17985a56962L7271O6960L5963q0636L3010O7543l301o444J8544K3859j2367m1836
17973a8396l7252m5486k1588K2660O7764P0980l3794l4876n1800P710k6240j980
17961a02298j1583M5201K6644l8810O056j3218L4471O0206j0697L2706K0046m9389
17949f65n9458k6926K6958O6657K8950n642J8115o0526q7458l2872K7435L3909
$$ y = [-125877, -105097, -109511, -65715, -79867, -76945, -62155, -45508, -97126, -96648, -100752, -81237, -79905, -65320, -10928, 34618, 54671, 509, -31428, -58232, -62172, -64816, -83268, -63144, -63359, -44194, -75056, -123404, -108833, -30111, -2931, -198, 14802, 76112, 100796, 86992, 117117, 57507, -42998, -18001, 12584, 34385, 40332, -33999, -68440, -89172, -116893, -87322, -132530, -156962, -119691, -52731, -16768, -97404, -64394, 3149, -152, -6596, 11948, 35807, 23440, -18396, -55648, -101134, -122722, -100062, -32298, 38682, 4888, -29988, -81788, -74078, -100318, -102298, -113881, -68680, -42036, -80846, -74790, -88008, -53537, 6669, -4028, 28678, 48724, -665, -60123, -87049, -60091, 6566, 35516, 29874, 47989, -12537, -99995, -132867, -105432, -71523]
17937g1523j2246P706l6244k2277J1594O9504k9350M0207P7621j3041p0287M445
17925d3891J0312O117l6361p2415n564k274j35M6141N8022J6062K2225k2409J3919
17912a0251N3203k1927n3087K29k001L3446k3622j7962q991k0439Q715l9461M5707
17899e6441L9370m7814l6912j4518P2081L6886j385J4087l3522j9334m7750n508
17887a00760L6104M7882n405Q002K8512l964m0094j7700J8079K461J7919J1419
17875B455l4045k3406J216r514J15835J2453n3401n1283l4003N8215j0996j5114
17863d1588p836l0037J055O0976j2427K1458m7453j6447Q000k4812P899J0205
17851g1007l6951m7370J8564M6126K5892N6490M2480k0338k2985k0391m1424n4486
$$ y = [-71523, -83769, -76063, -112307, -134584, -122990, -53486, -82836, -42629, 34992, 21951, -48336, -43891, -33579, -27462, -63823, -136238, -141802, -144076, -144211, -98070, -40048, -23986, -1761, -24170, -10251, 42952, 21025, -32062, -31833, -33834, -388, -24010, -41972, -50963, -71402, -62687, -102148, -56441, -17071, -64885, -101797, -116315, -44234, -7348, -8733, 5354, -28168, -47502, -95252, -100760, -64656, -16774, -22179, -14177, 14335, 10371, -29723, -47423, -29344, -26883, -8964, 2455, -31590, -54996, -53780, -63294, 52541, 64994, 11593, -39690, -73693, -15478, -26474, -41588, -49424, -79461, -78406, -17430, -29857, -8399, -55852, -72299, -64299, -89111, -81212, -71007, -107958, -155328, -136764, -90638, -64746, -8256, 34224, 13886, -9099, -29490, -70914, -125400]
17839a25400O464M4091K9686K5636J0348J2331N141m798j4881J6472J3280L8135
17827E6505P2341N778k8336j1944q3345p935J890k6636l3929l9237L4848O0234
17815B34M2753R497l8078l6204l7215o1589l0196k2909N4847L6274M5517j6655
17803e3724J0779J7552j3418J4892M1621L1684j1381m2217m552l0283j1367l1074
17791h1488K1402Q628N4081j4861J7074J5929L1866l6486l0291j7418m2914k3961
17779i8439K4514L6446j6140l3384J1526L6093j3005M4714l1508J5853M7491J9058
17767D3219M3907q696p4550l5312l490L6098l9342k422L5311R64j9094j2925k7930
17754f4262k5016M1270j1534m9183J5145M2823j8658k4912m2939r037P8268Q9245
$$ y = [-125400, -118936, -74845, -45159, -19523, -9175, 3156, 8297, 3499, -11382, 5090, 18370, 56505, 128846, 134624, 106288, 94344, 10999, 3064, 4954, -21682, -55611, -94848, -60000, 234, 42987, 52484, 14406, -21798, -59013, -120602, -150798, -173707, -118860, -82586, -37069, -53724, -42945, -25393, -38811, -23919, 17702, 49386, 38005, -4212, -8764, -39047, -50414, -81488, -60086, -51458, 2623, -12238, 4836, 20765, 52631, 16145, -14146, -31564, -74478, -98439, -73925, -37479, -53619, -87003, -75477, -39384, -52389, -7675, -39183, -23330, 24161, 43219, 87126, 78430, 3880, -31432, -34922, 1176, -38166, -40588, -5277, -4313, -23407, -36332, -64262, -89278, -48008, -59542, -108725, -93580, -50757, -69415, -94327, -137266, -146303, -68035, 21210]
17742B1210k9563j5914K42q429M6204n8671l4627K6672R0211L8310j2070l0895
17730C2680o028l5334J4757L180k9542J0621K4662P646K2903n6013k366k1652
17718c4486n1962J1259L214M8259Q648r8321L3743L8397q537j8436k8892M9880
17706d7234M4445m3312k9944k143q196m432K757K4896Q26n0511k2247O135k5823
17693a54783J4989L9040L8985N773o725L8214J0184k7642l0694M0120K8564J1693
17681G718k8233m1041J5071J5639l7088l8719M0611L3285j0052L776M3847j8497
17669a3683l0543k4995j684O638k7045J1740L5559O6350K9793n7641p0405l0696
17657a06612l0929N053L145K2889N9421R6023l566q8800j9493o75M5386M9887
$$ y = [21210, -8353, -24267, -24025, -32454, 13750, -44921, -79548, -52876, 37335, 75645, 63575, 32680, 26652, -8682, 6075, 9255, -20287, -9666, 14996, 22642, 45545, -10468, -12834, -34486, -86448, -75189, -71975, -23716, -15068, -113389, -79646, -41249, -49786, -68222, -97114, -47234, -2789, -46101, -76045, -78188, -86384, -90816, -88059, -63163, -62337, -112848, -135095, -128960, -154783, -139794, -100754, -61769, -55996, -62721, -24507, -14323, -41965, -72659, -32539, -3975, 7718, -20515, -61556, -46485, -30846, -67934, -106653, -66042, -32757, -42809, -39033, 4814, -13683, -44226, -69221, -70905, -64267, -91312, -79572, -44013, 22337, 52130, -5511, -75916, -106612, -137541, -132488, -129343, -106454, -47033, 48990, 45424, -43376, -62869, -63544, -18158, 31729]
17645C1729l9544j126l5845l2260j4749j0615L6914p107k840J1336J8489J8921
17633b6697k4735m822n9064L7035N7885K9511l7360K8479l7035j03000m6148P8229
17621a07722M8348K4877L2145M124j215n2661J1154N1336o4746o6336n1115k984
17609a74795Q7739J4063J2008m4219N823l0610k622N1821Q0775j9861j5677l8377
17597g3932k9002P884P0038J2720J9538k1034o9134K5674N8428p1547j335M6218
17585b5484M3262k8909m7348J714M602J2197j2130n0127N285N9616L6026L6001
17573C4705k6329r9047l3366Q4545L2049m1608R18M2520j6469p3839N1511M6548
17561B138n3788q894j3284q300N0456K0476k2659m2296k0256m708L478L9554l9562
$$ y = [31729, -7815, -8941, -44786, -77046, -91795, -102410, -65496, -72603, -75443, -64107, -45618, -26697, -51432, -56254, -115318, -78283, -20398, 9113, -28247, 232, -36803, -139803, -185951, -107722, -59374, -34497, -2352, 1772, 557, -52104, -40950, 10386, -54360, -120696, -171811, -174795, -87056, -72993, -60985, -105204, -99381, -129991, -132613, -80792, -17, -19878, -35555, -73932, -102934, -95050, -25012, -12292, 7246, -13788, -82922, -57248, 1180, -70367, -71702, -25484, 17778, -11131, -58479, -56765, -52163, -39966, -52096, -102223, -96938, -37322, -1296, 34705, 8376, -90671, -124037, -39492, -7443, -49051, -48133, -5613, -22082, -95921, -44410, 2138, -51650, -60544, -73828, -82128, -31672, -11196, -33855, -76151, -96407, -101115, -97637, -58083, -97645]
17548i7645k1595K433K7463n4068M3152P6121J8748m1191K420m3237n615R463
17536h3551J2524p299j6007k3864N1859j0182L5192N0803j0857p3609k8339K1777
17524h1553L0936P4233N4014l98n4003l7493J5759j1039j3581m485k6262k4652
17512g8524J1183o4120l852O0781L0736J1311N8514j3765o5184m5832R667N0168
17500c8917n09O46k0803j1055K7602J0818K4025M2848p6056K0009K7631L0487
17488C6726L4361o942n5294p3339o9179j5357M0926K9718K7168K6116K1543N90
17476b963O148J4168m0577m1435o899J3042l0585O339m3484p08J7551k004k8287
17463a39694L7729L6087M6414K9932p0774q988K7135J3419J6913J5440J0941O065
$$ y = [-97645, -119240, -116807, -89344, -143412, -100260, -24139, -5391, -46582, -44162, -87399, -93014, -83551, -71027, -78326, -94333, -118197, -66338, -76520, -41328, 9475, -1382, -74991, -103330, -81553, -50617, 23616, 77630, 77232, 23229, -14264, 1495, -9544, -23125, -27610, -53872, -78524, -67341, -131461, -135313, -74532, -43796, -32485, 26029, 12264, -52920, -98752, -89085, -38917, -39426, -38780, -59583, -70638, -43036, -32218, -8193, 34655, -41401, -21392, 6239, 36726, 71087, 64145, 8851, -64488, -133667, -149024, -108098, -78380, -51212, -25096, -3553, -2963, 3185, 17353, -23224, -64659, -71558, -58516, -89101, -82762, -126246, -126954, -109403, -111407, -139694, -101965, -65878, -19464, 10468, -60306, -69294, -42159, -28740, -11827, 3613, 14554, 20619]
17451B0619j9897N735N0491j9278o9887J2842k1666k8733O9981M0086K0193P460
17439F7946n2124Q406j4035r840j9506k0721K353J6990l6443n967l8861l5947
17427a37749Q511J9473O836M5107K0547L8585k978J2979n402j376m669K0366n962
17414A4268j5318M4448l4239R650K5085m2504r6931K8935M6834M739K3140m6393
17402c8286l8590l3947K8077J5745O71J8684L2624j548m293P236J0981J9597K8477
17389D5428l6997j3247j4735n0717p08n3931j1800P3028Q4460m8679j7174L7391
17377g681j4776k787k3672N4908N6428o8429p1410O394P4820K8349k3054k3467
17365a4377N704q175n7650j9337p556j9958N1953J6171J8742j686k5035p580m0972
$$ y = [20619, 722, 6457, 56948, 37670, -32217, -19375, -41041, -69774, 207, 40293, 60486, 67946, 15822, 24228, 10193, 353, -19153, -39874, -37521, -20531, -56974, -62941, -101802, -137749, -129238, -109765, -102929, -57822, -37275, 1310, -1668, 11311, 5909, 4533, -136, 20230, 14268, -1050, 43398, 9159, 18809, 43894, 1390, -95541, -66606, -19772, -15033, 8107, -38286, -76876, -110823, -82746, -67001, -66330, -47646, -15022, -16570, -20863, -13627, -2646, 16951, 45428, 8431, -4816, -19551, -70268, -70976, -124907, -136707, -63679, 20781, -27898, -45072, -7681, -22457, -25244, -48916, 5992, 62420, -6009, -77419, -71025, 3795, 32144, 9090, -14377, -8673, -16848, -74498, -93835, -101391, -121349, -69396, -53225, -34483, -36169, -61204, -68784, -109756]
17352a09756K5627O7627J9765n5839q560K4246O3853p152j5098J087j9510j8823
17340c2533j2973k2026k4707M9605L1360L9718m8952j2993J1895K929j4190j2153
17328d5020k1266L651K516P143J0843N310k0409k398K8642M0025M3360j7825l0742
17315C830o1333l8718k7351m9233n1138K7906J03025l3235J6328N3621K1816J5637
17303a8845l095J5600j5085J3941J1720J3663m4304m6083M6761l0097j6335J7820
17291e4339K9791M3367n756l8928o511K149m8133j9208j194L88P0256j5115j4374
17278e7607n789J4628J1637L9982N7208l7176n1798J155Q242J2104N1396l8784
17266E198p0978K8721J6767O780P438j0751n9078m6063k2209O3927O2612M3063
$$ y = [-109756, -84129, -16502, 3263, -52576, -61136, -36890, 26963, 19811, 4713, 5800, -13710, -32533, -45506, -67532, -92239, -42634, -11274, 28444, -20508, -33501, -21606, -18677, -32867, -45020, -66286, -62635, -60119, -52976, -42133, -36823, -57232, -59630, -30988, 9037, 52397, 34572, 3830, -57503, -96221, -123572, -172805, -223943, -196037, -93012, -126247, -109919, -56298, -34482, -18845, -21940, -6340, -21425, -7484, 4236, 17899, -26405, -72488, -25727, -55824, -72159, -54339, -24548, 18819, 13063, -25865, -32376, -30227, -78360, -97568, -98762, -98374, -28118, -43233, -57607, -63396, -48768, -37131, 2851, 60059, 22883, -28915, -27760, -19518, -7414, 43982, 5198, -65780, -37059, -20292, -13512, -6074, -16825, -75903, -121966, -144175, -80248, -17636, 25427]
17254B5427r129m054M3293k9411L8122l6432o2125J3619K9618O7868O997o1423
17242B2370n7369j5817j6554n7497K4068L8370P3832M2217m5188n3391J6248l5179
17230f3890l3591k2940K6084O9681r522m4479J7102J1611L5159K7697n0731l0020
17218f7839N1074J1090K3413N8343j3772j0055J5350j7401l0862k2166K3484N523
17206B6182l5276J766j5840l6155j8727N337L5422M6709M3033J0520m8086l0563
17194a5678m147n9893r0648p198J1136J9866M9465Q642K8040k4586n372L9513
17182e0860L4286L9149K0423j5550K022j6622j3554J9270l9676l6351j2519P241
17170f2741j7296L1879N346Q635N4643j439m5429j3609K2872r550j3294j7421
$$ y = [25427, 16298, 12244, 55537, 26126, 64248, 27816, -34309, -20690, 8928, 76796, 83793, 22370, -34999, -50816, -67370, -124867, -100799, -62429, 11403, 53620, 8432, -44959, -28711, -63890, -97481, -120421, -94337, -24656, -34178, -78657, -61555, -49944, -14785, 12912, -37819, -67839, -16765, -5675, 17738, 76081, 62309, 52254, 67604, 50203, 19341, -2825, 20659, 26182, -9094, -7328, -23168, -59323, -78050, -72713, -37291, 9418, 52451, 62971, 14885, -15678, -19825, -79718, -170366, -177564, -166428, -146562, -97097, -88455, -60415, -85001, -90373, -50860, -16574, 22575, 42998, 27448, 29470, 12848, -706, 18564, -21112, -57463, -69982, -62741, -80037, -48158, -42812, -34177, 20466, 19027, -26402, -40011, -17139, -26689, -39983, -57404]
17158e7404L104j9305p148K7437L6253J5148j6719n363l0955L5944P632p2034
17146h3410J217O2862O2811J1003J93o141n9753l838K2474j0594J6248J9704k0821
17133A1955m6426k0940M1226M5674L6738J9706k0831k2988l0765k5150j5315K4407
17121b709m966j2367M0023m1762l5745k41m6503q935J1081j6695R876p31r820
17108a19494M1300K9015l999l3938r4714N2077Q6661J9752R834k3745m1838j3143
17096i2232j818k8837M6022O1647j3282k6081p718J1687N8395k583k7203n754
17084b7757L1484k658n8825m9524O761J3758j0327M465J731j6648l6587m2493
17072a86620N5299O5690N0034M5777k5351M420M4764M1141k7168m8799k3661o7776
$$ y = [-57404, -54300, -73605, -80753, -53316, -17063, -1915, -18634, -23997, -54952, -19008, -11376, -83410, -82193, -19331, 43480, 54483, 54676, 48535, -11218, -15056, 7418, -3176, 13072, 32776, 11955, -34471, -55411, -14185, 31489, 68227, 87933, 67102, 44114, 13349, -11801, -27116, -2709, -7675, -20042, 19981, -21781, -57526, -57767, -104270, -113205, -102124, -118819, -108943, -109674, -119494, -78194, -49179, -53178, -87116, -181830, -129753, -43092, -23340, -13506, -37251, -79089, -92232, -94050, -122887, -76865, -15218, -28500, -54581, -62299, -50612, 7783, 5200, -22003, -27757, 3727, 1069, -57756, -107280, -100519, -86761, -97088, -92623, -90892, -107540, -144127, -186620, -131321, -65631, -15597, 30180, 4829, 9249, 54013, 95154, 67986, 19187, -4474, -72250]
17060g2250m2211K314O4790J0007j6888L3123J5363k9154j3155N451K0147K2066
17048c97l0698m845J6178o1835K0873M2569K5811M5356k3657l6746l4152K207
17036c9336J449j6176j4178j082k5146J3630R192j2339N1059P3866l0473J3971
17024B4437l5013n4907m1992O6256P1o1730j1645K7794K8527R605k0251r873l1698
17011a10419R897O2590J7999N6613j2883r0797q70L7422N5552j1126J39N444l247
16998A6314p971L2130L991m2504j3058J3041q710J7532N3862M2288n0969o2198
16986f252l3724M778L6364J4702k0590m6082n8171M2244o514J9026J498j9943
16974g2664K824J5571O159m8313j1783N1035K9335j1334l536j747o952j5137N7749
$$ y = [-72250, -114461, -112147, -47357, -37350, -54238, -21115, -5752, -34906, -48061, -42610, -22463, -397, -31095, -35940, -19762, -81597, -60724, -18155, 7656, 53012, 29355, -7391, -41543, -39336, -37887, -54063, -68241, -69323, -94469, -80839, -71647, -83986, -32927, 40939, 10466, 24437, -10576, -65483, -107475, -41219, -41148, -102878, -114523, -86729, -58202, -48597, -68848, -78721, -110419, -100522, -37932, -19933, 36680, 23797, -67000, -67870, -30448, 25104, 13978, 14117, 19561, 16314, 8343, 40473, 44464, 1960, -11098, 1943, -6767, 10765, 64627, 106915, 55946, -6252, -39976, -35198, 1166, 15868, -4722, -50804, -108975, -66731, -73245, -54219, -52721, -72664, -69840, -54269, -48110, -96423, -108206, -57171, -27836, -39170, -42706, -44453, -51405, -66542, -8793]
16961h793N6067m6172k6230k3038K5565L6854L7o8987j3331J8299j9253M0782
16949b8200K2134M3447P660m7333o1716L6289K9185l1023m9611j9546M3377N2763
16937b574p890L4809m8746m6393l6175k2844q826O7145L8796k4807m2938m2253
16925a42696K3638M2527N0748J8406m2895m0219l9233L1648O7343j0231n5650
16914i6614l9627K039L649K7813J9634N095R032n254L2657P3724m4340j0965j061
16901b4218q185J1144L5756K9466l4759n4450Q620k5013k6386K2870o680l7807
16889a09642M5061K1603L7747J7680L9001J977n4888q637l4039k0108m5364p701
16877a17310M9457K3153K1804n1504o1146n7258K0650L9116J0780P087M4365K8978
$$ y = [-8793, 47274, 1102, -25128, -48166, -22601, 14253, 14290, -54697, -68028, -49729, -68982, -28200, -6066, 37381, 45041, -2292, -64008, -27719, 1466, -29557, -79168, -98714, -55337, -2574, -10464, 24345, -24401, -70794, -106969, -129813, -138639, -71494, -32698, -57505, -100443, -142696, -119058, -76531, -25783, -7377, -50272, -90491, -129724, -98076, -30733, -40964, -96614, -136241, -134202, -130553, -102740, -83106, -78011, -68979, -74233, -41576, 32148, -12192, -23157, -24218, -32403, -21259, 14497, 43963, 9204, -45246, -36626, -61639, -88025, -65155, -71835, -109642, -64581, -42978, -5231, 12449, 51450, 53427, -1461, -10098, -44137, -64245, -109609, -117310, -67853, -44700, -22896, -74400, -135546, -192804, -172154, -133038, -122258, -115171, -70806, -41828]
16865d1828N1975l6200J1968Q7890K0714k9720m3302O64Q813p541m3005l1501
16853e1073j2203N4238K9169m3893j720q743k7147O46n4206j6303J8381M9530
16841f3324J0589N419r204M1632j9998K5474j897p461K4338p800l1170K994q813
16828c9221J9409l3582n1699J8488P0655K2667p0410J6887K00J6066k4071J1091
16816d3520k0042J6414L9332j0739N1046L7903j6228J1873n7787k8260M6274L4940
16804F1206q8688j9975M8262O9427M5657k996p4648n9834j533k809q576M8791
16792A4284L3091M2676M0191n5641l1539k3603o1705K4630M4478L4482o4013k7759
16780c0428J2609j2826K3908k0380n3712l9458n019P2816J7510k076p394L874
$$ y = [-41828, 10147, -26053, -14085, 73805, 94519, 64799, 21497, 22161, 30974, 23433, -19572, -51073, -63276, -9038, 20131, -23762, -25482, -34225, -61372, -60726, -114932, -131235, -112854, -63324, -52735, -47316, -56520, -14888, -34886, -9412, -11309, -18770, 5568, -2232, -33402, -30408, -39221, -19812, -53394, -105093, -86605, -15950, 6717, -63693, -46806, -46606, -30540, -54611, -43520, -63562, -47148, -7816, -18555, 32491, 70394, 54166, 66039, 8252, -20008, 26266, 61206, -27482, -47457, 805, 70232, 115889, 112893, 38245, -21589, -23122, -25931, -34507, 14284, 47375, 90051, 130242, 74601, 43062, 19459, -42246, -17616, 26862, 61344, -2669, -30428, -17819, -30645, -6737, -27117, -80829, -120287, -125306, -52490, -34980, -37056, -44450, -40576]
16768d0576l1898k0492M6755O950n4268L6195k795M315Q854m85n3067k4177q186
16755a32875P8127P4106K4242j7363j3411l7726l7241N3751Q1744k6604k3181
16744B3569J5241m9454J242K8606L338K732m9666j4516j3578K8375m8111J4913
16732e7309L7789k6222m3021N606Q463J4529M0065k6030l1566k2126Q272j7010
16720a08560M5616k8003j6920K6596k1214m263k4218k5037J8096O6430K0320L7251
16708a3906J7213K8646K331l6465K0278K7766n097o846k2719q849N6033K663r3252
16695c2204j695J7206k0862j4084O0614J3638M223O940l7971m1623J695l3508
16683g7631j4346R462j450K4884l6641l177M8640L8994n0394l9124K2844O8328
$$ y = [-40576, -72474, -92966, -46211, -39261, -93529, -57334, -60129, -55814, -46960, -47445, -100512, -124689, -132875, -54748, 19358, 43600, 26237, 12826, -24900, -62141, -8390, 73354, 46750, 23569, 38810, -10644, -9402, 19204, 22542, 25274, -24392, -38908, -52486, -24111, -72222, -57309, -19520, -45742, -88763, -83157, -74694, -60165, -20100, -46130, -77696, -99822, -91550, -108560, -62944, -90947, -107867, -81271, -102485, -106748, -130966, -156003, -137907, -71477, -51157, -13906, 3307, 31953, 34284, -2181, 18097, 45863, 40766, 33920, 11201, 2352, 58385, 61048, -32204, -33899, -16693, -37555, -51639, 8975, 22613, 26836, 33776, -4195, -45818, -44123, -77631, -91977, -82515, -83965, -59081, -95722, -98899, -50259, -11265, -61659, -100783, -77939, -9611]
16671i611K1686k369J803n6512j2993M2977O8120k203m7635m4240K755N467j1426
16658d4181L2760O6237l1260l9907j29O337k94k7968J519K9661n999K8866J7655
16645C3297j8006n1447m3003K3461M986o6256M359L1474K9314K4510j7215J5469
16633b9057M3967m0904M4203J022p496j0537n1973q3601L1729J14958P7299m140
16621H5470k9120k8794q2138j9073N9037O1188J7113P320n3200L171r226k3248
16609a1500j1097m4577l3357o8595k769N0219j9595L0218M3715l4219l1739k51
16597a33547K0499N3389O9493Q556k8526o6616K0987N7681M5722l0894l8751k073
16585b4080l1793Q591O4239m5987k2333j3109j1317K882m7747j665J8615L2123
$$ y = [-9611, 12075, 9706, 11509, -45003, -57996, -15019, 53101, 50898, 3263, -40977, -38222, -32755, -44181, -11421, 54816, 23556, -16351, -16480, -10143, -10437, -38405, -36886, -7225, -13224, 15642, 33297, 15291, -36156, -79159, -55698, -50712, -116968, -112609, -81135, -51821, -27311, -44526, -29057, 14910, -25994, 18209, 19231, 11735, 1198, -50775, -134376, -102647, 12311, 89610, 85470, 56350, 27556, -54582, -73655, -14618, 46570, 63683, 71003, 17803, 20974, 11748, -11500, -22597, -67174, -100531, -169126, -171895, -121676, -141271, -111053, -67338, -101557, -133296, -133547, -113048, -59659, 9834, 18390, -10136, -76752, -55765, 1916, 47638, 16744, -22007, -24080, -55873, -47282, 16957, -29030, -51363, -64472, -75789, -72907, -120654, -122319, -103704, -71581]
16573g1581K3720M7048M4019n4605o6425J1308M9703j6290j7885k813P646n800
16561e1955j109j640L555l698R782j2410n9846j6408l450J1256P8697l7019L786
16548h0459M9343m796j7331M8746K2236j1490j9622l7184l5524L5027j0799j2939
16536g4792M5303m2338K0330o8760K3944O6542K949l4439M96J6083j7966k0741
16524h3389J7671J1912q21L2058J3397J0808Q924n3270o3057k1736L1175M701
16512i1627l1046K4931J9264N8983J5433m29J6762k5421k9185J5860O1717m0200
16500d958P664M1527L8148n9787k0487m1137l1272k2477K013K1294m5201J3678
16488a00995J0286Q408N2349n2255k2110Q6487L1809l5742J9481K4816J2788R254
$$ y = [-71581, -47861, -813, 43206, -11399, -77824, -66516, -16813, -33103, -50988, -53801, -46155, -51955, -53064, -54704, -51149, -54847, -45065, -57475, -117321, -133729, -137179, -125923, -47226, -84245, -80459, -31116, -35912, -53243, -4497, 17739, 6249, -13373, -50557, -86081, -51054, -61853, -74792, -29489, -71827, -51497, -120257, -96313, -29771, -26822, -61261, -60765, -44682, -62648, -83389, -65718, -53806, -54627, -22569, -9172, 1636, 10560, -42710, -105767, -127503, -96328, -91627, -122673, -97742, -78478, -19495, -4062, -4491, 12271, -13150, -42335, -26475, 35242, -4958, 2706, 44233, 82381, 22594, 2107, -39030, -70302, -92779, -90766, -69472, -114673, -100995, -90709, -82301, -29952, -82207, -104317, -17830, 13979, -21763, -2282, 22534, 35322, 44576]
16476D4576k8089l3620k5634N5390L9382n383J5152j7030Q18K5673k2167o4277
16464a5209P726J5127l4875k49L7639J42K0777j1243K6529k3457n0072k4333k4799
16451g6297k5580L3439J9949r394K8862l4380J199M3506J56q594L9859l096l6995
16438b7366P594K103k6807m4664L6850M4600q652m5310M5250o083J2069K528o294
16425a4182m9630J0934P52k2248J7461j9761R744L1820J1867n254k6204N5037
16413C36j3997N144N3977j9277k2118L842j7170q4055j3547K3530l5673L5046
16401h3962R27O772Q804N7682O1157k2839q3528j8463M4537J1381J1512l2771
16389c8791n142M4654j8988O03K0280J589J032l5126L4089L4761J0574J4724n0451
$$ y = [44576, 16487, -17133, -42767, 12623, 52005, 46622, 61774, 44744, 45562, 71235, 49068, -15209, -7483, 7644, -27231, -27480, 10159, 10301, 31078, 19835, 46364, 22907, -27165, -51498, -76297, -101877, -68438, -48489, -57883, -29021, -63401, -62202, -18696, -18540, -27134, 12725, 9629, -27366, -19772, -17669, -44476, -89140, -52290, -7690, -16342, -61652, -16402, -22485, -10416, -7888, -14182, -63812, -52878, -52126, -74374, -56913, -76674, -66930, -35110, -23243, -28497, -54701, 336, -13661, -8517, 45460, 26183, 4065, 7907, -9263, -93318, -106865, -83335, -119008, -83962, -83035, -76263, -67459, -9777, 51380, 28541, -54987, -73450, -28913, -17532, -6020, -38791, -43933, 721, -18267, -17664, 2616, 4205, 5237, -29889, 4200, 38961, 49535, 64259, 13808]
16376A3808o3337R209l3608R073M6429j3268J4181l7334l9021L8696P2244M4570
16364F1642J4936l5165j4920j2737P717m276m085o326M0994J7912o2859m1675
16352c8842M774n412l6537L1124L2850o153j8932K2270L350J6027J7322l8608
16340a6767o243m555L3958l3940L2194o376M0495N102k9808k8831l3926J6782
16328c1915M505K027M5147k4222j4703j225J87L6766q785O046j6630o4487K8008
16315c9281M9202J9442k1005j1801K592j0195J4317m4264l535J811J115l1008
16303g2610M7575k2970J1846M2726L070k7969k1076K3893J0157J3485j5502K1617
16291A4242r697M0579k8818j08148l9627K8266N3548K6462j9904L466k6858M664
$$ y = [13808, -49529, -40320, -73928, -64855, -18426, -31694, -17513, -54847, -93868, -55172, 17072, 61642, 76578, 41413, 26493, 13756, 21473, 17197, 13112, 6786, 47780, 65692, 2833, -38842, -34068, -39480, -76017, -44893, -12043, -18196, -37128, -14858, -11508, 4519, 21841, -16767, -23010, -27565, 6393, -27547, 4647, -1729, 38766, 43868, 14060, -14771, -48697, -31915, -27410, -25383, 19764, -4458, -19161, -20386, -20199, 16567, 7782, 13828, -2802, -67289, -39281, 9921, 29363, 8358, -3443, -851, -11046, 3271, -40993, -44528, -42717, -41602, -72610, -25035, -48005, -36159, 6567, 9637, -18332, -39408, -15515, -5358, 8127, -7375, 14242, 4545, 45124, 16306, -91842, -131469, -103203, -49655, -23193, -43097, -39631, -66489, -61825]
16279f1825L6232k5737j0660q519L8389J2428J5000K7105J6270N2358n362j7938
16267F7741l5667L977K7070n4322L7611r569l6063K6951L404m7385r421O6446
16255D0773j0164K3699O455j8090l6393L3897m2989o3256q947o597K5010n634
16243f2236J2808N8956J9577J0084m9825p97J8392o2789q242J0096j1212l2600
16231i7788J8781O0109L0350j3243J3556j4470M3325J2725q926m4874k4662m137
16219b9254J1550K7410M3313q664k124m5054j9724Q2760L1215o8999q1723R089
16207e0205J4795j6278L1938R3427Q987n5127k2680K3012K6882n3985k6564k0964
16195d6762J9138n904o4164o6262J1933N3618K9438p176J4053J9362k2295k5714
$$ y = [-61825, -25593, -51330, -61990, -70509, -32120, -19692, -4692, 22413, 38683, 91041, 85679, 67741, 32074, 36051, 63121, 8799, 46410, 36841, 778, 27729, 31133, -16252, -25673, 40773, 30609, 54308, 60763, 42673, 6280, 40177, -2812, -66068, -75015, -81612, -56602, -62236, -49428, 9528, 29105, 39189, -10636, -11433, 6959, -55830, -64072, -53976, -65188, -97788, -79007, -18898, 11452, -1791, 11765, -2705, 40620, 53345, 44419, -455, -25117, -29254, -17704, 9706, 53019, 44355, 42231, -2823, -22547, 60213, 91428, 22429, -59294, -50205, -35410, -51688, -19750, 73677, 82664, 27537, 4857, 27869, 54751, 766, -25798, -46762, -27624, -33528, -97692, -163954, -152021, -98403, -68965, -76141, -62088, -42726, -65021, -90735]
16183i0735Q3592L820o1916k6630o713N279Q4739K7242j0343J8199Q390J3348
16171D8272J4748Q216Q832j9314m412M403J0593K0213j4109m657k877j905m5974
16158B2029j9299J6098m5507J6542K9103n1952K7904M9993j7289K0034o6009l3319
16146e1672J3255P916l934M709L5547K7996l4771j840m9174P842J2573n170J8904
16133a7819k55J2410K3786k0224m1229m0606P569J2755J5968k0429N151P4028
16121A1105J5605l8056J6700K8020N40q455l3008j8148P030K0960P894L4410M6450
16108I1047J2033m2166j8735N365m034l3086K1578L5782k6541K916L7970l9243
16096D2886j1908j4961q859L88M123N2540l9263o6608k3263l97r262k5362j9890
$$ y = [-90735, -7143, -3323, -65239, -91869, -98582, -93303, -8564, 18678, 8335, 26534, 34924, 48272, 63020, 71236, 80068, 60754, 56342, 60745, 71338, 91551, 77442, 72785, 69908, 68003, 22029, 2730, 18828, -26679, -10137, 18966, -32986, -5082, 44911, 27622, 47656, -18353, -51672, -38417, -30501, -34435, -29726, 5821, 33817, -954, -2794, -51968, -44126, -31553, -36723, -17819, -18074, -5664, 18122, -2102, -43331, -83937, -76368, -63613, -47645, -68074, -62923, 11105, 26710, -11346, 5354, 33374, 33914, 25459, -7549, -25697, -18667, 2293, 10187, 44597, 91047, 103080, 60914, 42179, 47544, 43510, 10424, 32002, 67784, 41243, 44159, 82129, 42886, 30978, 16017, 7158, 7546, 11669, 64209, 24946, -41662, -64925, -65322, -74584, -99946, -119836]
16083a19836q319J08790q739j3390L7223L777j0975q890N3109J3424o0046l6418
16071e0290k5299K9369K5810o895l799r140J0203M2926K8980J848k4351k5826
16059f464j0258M146Q950k4116l3652L6216J1858q234l2105r446k5881m538L3134
16046f0390N7015L7506M2338m5863j0552J6886N3000K2936k5318o244n5117m7014
16034b0817j0208l1342k2730j191J4138j1421k0398L8480O2758n619m4590l7867
16022i0807L1364O574r481K4918K6056Q081J842L6403J4400J9587r145l2244j0203
16009A7345l1740m0639L2366K2117K6621J4247K3929J1703r78n6157k9472l9012
15997d9670K4545L3199M3576j2772K009l0005M1004R490m2206j211k4730K2878
$$ y = [-119836, -128155, -19365, -28104, -41494, -4271, -494, -11469, -20359, 32750, 46174, -13872, -50290, -75589, -46220, -20410, -27305, -31104, -40244, -30041, 12885, 41865, 43713, 19362, -6464, -16722, -12576, -3626, -27742, -61394, -25178, -13320, -21554, -53659, -63105, -88986, -93524, -60390, -3375, 34131, 76469, 30606, 20054, 36940, 89940, 112876, 87558, 81314, 26197, -20817, -31025, -62367, -85097, -86288, -72150, -83571, -103969, -65489, -2731, -8350, -52940, -90807, -59443, -52869, -62350, -37432, -11376, -3295, -1453, 34950, 49350, 68937, 59792, 27548, 17345, -14395, -55034, -22668, -551, 26070, 40317, 64246, 75949, 74971, 18814, -10658, -49670, -25125, 8074, 51650, 38878, 40887, 10882, 51886, 61376, 19170, 17959, -6771, 16107]
15985A6107k8648l0969n0703J2720M8540M0241K1859M161K4820k2350l0963j8874
15973a4059M8367k942n4253P179L602R5835L0161K168n5586j2047J1526L1466
15961I1417m3495J0605J6335M3543j777m7459k3002K3462k3580j4265l0329m2199
15949d0744M751k6793M4474K3060K5704L6488m6093n698L0043n4384n452K4661
15937A0017M272M0535J730k3739l8697L1778O426m4389m1166k8526M2031L1742
15925g986R369j8465o1187L6698Q7263K3759j7446m1849j5923L2209J9818m000
15913D2260j2747k4103O244q966j7177L7424M3997k8694j5247j1909L4065l7949
15901G198n983M3214N3825m3048p5304m2081j6848J7319n81L444K2961Q494M1644
$$ y = [16107, -12541, -43510, -94213, -81493, -32953, 7288, 29147, 33308, 58128, 35778, 4815, -14059, 34308, 31366, -22887, -15708, -12106, 83729, 113890, 116058, 60472, 48425, 59951, 91417, 47922, 58527, 74862, 118405, 116628, 69169, 46167, 69629, 46049, 31784, 1455, -40744, -35993, -62786, -18312, 4748, 30452, 66940, 20847, 15149, 45192, -9192, -14644, 10017, 14289, 54824, 56554, 32815, -5882, 25896, 32322, -12067, -53233, -81759, -39728, -7986, 1383, -17082, -78269, -41571, 45692, 69451, 52005, 10156, -5767, 26442, 46260, 42260, 29513, 5410, 11654, 2688, -14489, 22935, 66932, 38238, 22991, 11082, 45147, 7198, 1215, 44429, 98254, 55206, -20098, -62179, -79027, -61708, -62289, -58845, -35884, -27390, 14254]
15888A4254K6883R389m9606k8434K2094J8035r475m450O1445O6508J7239l7387
15876A06495l6699j3432N5690K3189j0437j826l1920M857K8635l6133L7278p3810
15864E1887p2080L4417M8535m1804j4755j4207Q934Q3205J6080m8345m2882l8986
15852c0001J744j5815j6293M167K3492M3295N4427p1649o3918L8431k6838R523
15840d9435n201j0514J9366j2886P0294K4207q1333l0008L4686J9879M005M382
15828a2558j145q946K8389m0452J4456L1430J2690m4193M021j877N3183P694J4720
15815E7412k9139j0616Q81j1451k9783J6178M4793m5074n4527M1738J8090k6410
15803b7908m0709j0326q460K9685P7630M5193J7834q2272n7539j2711K6876o779
$$ y = [14254, 41137, 50526, 920, -27514, -5420, 12615, 3140, -1310, 60135, 126643, 143882, 106495, 69796, 56364, 112054, 135243, 124806, 122980, 91060, 95917, 124552, 88419, 125697, 51887, -20193, 14224, 62759, 20955, 6200, -8007, 927, 84132, 100212, 51867, 8985, -30001, -28257, -44072, -60365, -56198, -32706, 10589, 65016, -6633, -70551, -32120, -58958, -49435, -54636, -65150, -45784, -58670, 11624, 35831, -45502, -75510, -40824, -20945, -16940, -12558, -13703, -22649, 5740, -34712, -20256, 11174, 23864, -20329, -16308, -18185, 34998, 42692, 57412, 28273, 17657, 18538, 7087, -22696, -6518, 38275, -6799, -61326, -19588, -1498, -27908, -68617, -78943, -87403, -57718, 19912, 65105, 82939, 667, -56872, -69583, -42707, -49486]
15791d9486N8732k4327l6003j2163r683L5577L3229j168Q142P27k7049m2145M981
15778f0636j5851K9151L195j4144R73q370J5951M2758N8741k5020k2139M9637
15766E4246m1419k5541K2862l4103k7009k1088L8684K4049J5308K922K5865q122
15754B6654K2607P915l6741m3240j6834n3123k7239k0871l136O5805K6055m7590
15742i9738O27J374o408N4571N1664J7008j1897n6449j4648O1404N6136k2358
15730C1286p1535l3487P2534K6115J8136n1416l2187N591L6824L2437k0837m4736
15718c1275l205L3180M74r879M2671N723k2197L0866j7862n7210o7312M4441l3892
15705h5477m4613P4422P5479K4729n8526k5383k584O4520l8323k4789N3367J0907
$$ y = [-49486, 9246, -15081, -51084, -63247, -72930, -37353, -4124, -5292, 2850, 3577, -23472, -65617, -60636, -76487, -47336, -44141, -58285, -57312, -65682, -49731, -6973, 51768, 26748, 4609, 54246, 12827, -12714, 10148, -23955, -50964, -72052, -33368, -9319, 5989, 8911, 34776, 26654, 49261, 57176, 20435, -22805, -39639, -92762, -120001, -140872, -144008, -78203, -52148, -99738, -99111, -97737, -104145, -49574, 2090, 19098, 7201, -49248, -63896, -2492, 53644, 31286, -40249, -73736, -1202, 24913, 43049, -8367, -40554, -34963, 1861, 34298, 13461, -31275, -34480, -1300, -826, -10705, 31966, 37689, 15492, 46358, 28496, -28714, -96026, -51585, -85477, -130090, -55668, 19811, 44540, -13986, -39369, -41953, 22567, -15756, -40545, 12822, 23729]
15693B3729L146j8972o674l6159O5506R614l7636J3259k4015j6324L6565M3507
15681E5546K5483k3973l0548K0558L2542Q342j853m0131o4583n1772q81M1987
15669b9283J833k8801J6035J8324R514P2437j0002k7256k3773l8347l6140M8772
15657b6687J9871L2963k3024k2817J852N7092Q6991l8805n2182m9154l1947J5116
15645c0731O2684M6045k8002J6613O918j6452K4533q124r734J0483r837n0185
15633A4211j5943J572N565K8516l4769k6729M4389k7555K432N850k1078j286j655
15620b6480K6315L2188K5421J0470k8519K1449k9696m3476p350k4368J3327j5067
15608d5786M765j8810N0030N5201l03l3706j267m4695l0042K4042j1348q13M5219
$$ y = [23729, 26875, 7903, 1229, -34930, 30576, 40190, 2554, 15813, -8202, -24526, 12039, 55546, 81029, 57056, 26508, 47066, 79608, 87950, 86097, 45966, -18617, -70389, -71270, -29283, -27450, -56251, -40216, -21892, -12378, 60059, 50057, 22801, -972, -39319, -75459, -26687, -6816, 26147, 3123, -19694, -17842, 39250, 126241, 87436, 35254, -13900, -45847, -30731, 31953, 77998, 49996, 66609, 73527, 57075, 81608, 73484, 63750, 74233, 64396, 14211, -1732, -160, 5405, 33921, -848, -27577, 16812, -10743, -8311, -2461, -23539, -24825, -26480, -165, 32023, 57444, 67914, 39395, 60844, 31148, -12328, -19678, -44046, -30719, -45786, -41021, -59831, -9801, 45400, 45097, 11391, 10124, -34571, -64613, -40571, -51919, -52732, -7513]
15595g513r797K684j2820j0340l9273l015L1548M5571M7154K9401N1483J1275
15583A36358j06621q1558J1406O5854j4180m0961n625K9215L832K8059l0658k4754
15571b9633j3267l140k6035K3880p994k430P1886M2770k1706m2499p0957j4033
15559i3158k4509m5435Q1681O3376K7531J5502o357M275L2514J1411m6561M4565
15547F4835j9443o5482R9J4166k2574M6527M2560l8484k8970M8239Q649m2294
15535G828j9349p7183q90M8091K2454J8199K204N771J6247n6105Q065M7659l6691
15522a3700j8438p047M1317L5918l298j5805j1279R721L4755o30O498k7420j7730
15509A2862M580J5679m0451J1390K5206k095k6201n5587j2570J7530L8408J2294
$$ y = [-7513, -17310, -14626, -27446, -37786, -77059, -80074, -48526, -2955, 44199, 73600, 125083, 136358, 29737, -51821, -40415, 25439, 11259, -29702, -35327, -6112, -2280, 25779, -4879, -29633, -42900, -46040, -72075, -48195, -56189, -58619, 13267, 56037, 34331, -8168, -79125, -93158, -117667, -163102, -81421, -18045, 9486, 24988, 18631, 22906, 55420, 66831, 20270, 64835, 45392, -20090, -19991, -5825, -28399, 18128, 60688, 22204, -6766, 41473, 50122, 7828, -11521, -88704, -89594, -41503, -19049, -850, 1354, 7125, 23372, -32733, -24668, 22991, -13700, -32138, -39185, 2132, 38050, 34752, 18947, 7668, 17389, 52144, 51514, 58012, 30592, 12862, 17442, 33121, -7330, 4060, 29266, 27171, 970, -54617, -67187, -49657, -11249, 1045]
15497A045l9812J0258K2175n345j227N5495M8710l8236l8735m032Q0168J9813
15485A10277l6134o2037o5392j1917M882j0342n357O445J5795M0020L5306R392
15473C0938n3749n115J4780L1888L0575J3585J5369n7662k683j1432m8394j2914
15461e4814l0719J5776K3209M1780J8274L2781K647j9079m1416j6901J250K1076
15449f136l382J969O950P506l5444Q774m8310n439l2438P086L5156O2888J2518
15436A1698K2102R958l7125l0698J0953K9471K1088M5102N3011o4927j08352J8345
15424a9374P9827N7074l6494l8327k2442k8781O217j8961k2196J5828K4152J7482
15412A4005J5079l8837K464L3865J2271J8544l2604m135o046k0119K7086m125
$$ y = [1045, -38767, -28509, -6334, -11679, -12906, 42589, 91299, 53063, 14328, 10296, 90464, 110277, 74143, 12106, -53286, -65203, -60321, -70663, -76020, -69575, -53780, -13760, 21546, 30938, -22811, -27926, -13146, 18742, 49317, 62902, 78271, 20609, 17926, 6494, -41900, -54814, -85533, -69757, -46548, -4768, 13506, 46287, 48934, 29855, -11561, -28462, -27212, -6136, -9518, -7549, -599, 6907, -28537, -19763, -68073, -73512, -105950, -98864, -63708, -820, 11698, 33800, 43758, 6633, -24065, -13112, 16359, 37447, 82549, 135560, 70633, -37719, -19374, 60453, 117527, 81033, 42706, 20264, -8517, -2300, -21261, -43457, -27629, -3477, 14005, 29084, -9753, -7289, 26576, 38847, 57391, 24787, 20652, 14606, -5513, 21573, 17448]
15400A7448r020p809k4983N0307J6893m5800K1504m2809J6976J0438L0616J028
15388C4789k318O192q5027j9858J6448K1844P8525J8552j818K9700n192p6226
15376A5611l220K8483k8088j4158K2660N3589L2856j6348k9840k68k7554n2907
15364a9184l3666m721P6265L4080k1868K71J6546J9009q5352o1632P884J1750
15352f0618K6793L5902J3088j2044K4289L8418M0194Q255k7264j1486O2602r1771
15340D6358p2625K5328J4410M3982m5841m6440n066J5035j1869k2078M0133N4496
15328C5823l4182j456m4186P012J5331N983K9703j0853j2944K6724j3451R783
15316A3287n476Q985k0808J6847J1132J3512j3806j9818k9723N8100N4506Q161
$$ y = [17448, 8428, 619, -24364, 25943, 42836, -2964, 18540, -24269, -7293, 3145, 33761, 34789, 32471, 38663, -46364, -66222, -49774, -27930, 50595, 69147, 67329, 97029, 91837, 15611, 12391, 40874, 12786, -1372, 21288, 74877, 107733, 91385, 61545, 61277, 33723, -19184, -52850, -57571, 18694, 52774, 30906, 31177, 47723, 66732, -18620, -80252, -72368, -60618, -33825, 2077, 15165, 3121, 27410, 65828, 106022, 114277, 87013, 75527, 138129, 46358, -26267, -939, 13471, 57453, 11612, -34828, -39894, -24859, -36728, -58806, -18673, 35823, 1641, 185, -44001, -36989, -21658, -15675, 14028, 3175, -9769, 16955, 3504, 13287, 7811, 16796, -4012, 12835, 23967, 37479, 23673, 3855, -25868, 32232, 86738, 94899]
15304I4899o2267o2331N119k3134K7667O825M8369l9922o5147K4360o991l9669
15292i2222m6491M8479P1757p240L861N0342J3805O468N3260l5634k4258k8349
15280A3778q353J4176O241K4176j1397j9491n027J2517j5275k6378K2665j0817
15268c185j6849J06292p0705q0719K7472N7200l7770k6869j5010j4573J2224j8464
15256h0956L3534O3414N3265j7938m0630p1268k6979J7140N0443J6883j2738j963
15244a7793J5604R324J6236K6078L1757P3361l4773l8556K6817j5639p3086K628
15232B1958N6734j8144K2836j4303O7959L0754j2421n6451n3478k6102o372P764
15220B0734M1432o6663l8659K9066r408J2461r589m0739K159L4134K407J5252
$$ y = [94899, 32632, -29699, -24580, -47714, -20047, -13222, 35147, -4775, -69922, -45562, -52553, -92222, -138713, -90234, -18477, -25717, -21856, 28486, 42291, 48759, 102019, 66385, 42127, 13778, 5425, 19601, 25842, 50018, 38621, 19130, 14103, 26620, 11345, -15033, 7632, -3185, -20034, 86258, 15553, -65166, -37694, 19506, -18264, -45133, -60143, -74716, -62492, -80956, -47422, 15992, 69257, 51319, 10689, -60579, -87558, -70418, -19975, -3092, -15830, -17793, -2189, 7135, 23371, 49449, 81206, 154567, 119794, 81238, 108055, 92416, 19330, 21958, 78692, 60548, 83384, 69081, 137040, 167794, 155373, 98922, 45444, 19342, 12970, 20734, 62166, -4497, -43156, -14090, -23498, -11037, -20626, -61365, -59206, -25072, -22665, -7413]
15208g413j8052l8288L318K4528J8159k8286J6267M2948M4628l9251m8965L5770
15196E363l298j4220l5356J5659O409k7118k3844J0609J1295j5294l3266k6992
15184a30053M2659M4081N1607K5968J5201n2500m9634M781l6527m8317M0567O3739
15172b8428J924k6354J456P3318K9041p4238j5394L0323l474J5310o287m552L0922
15159B3567J2340N079O229N7072K5645l2793j9933l4270j5912l4310j00871J577
15147a06580M8283q108J6947J3109j14K3216K1404m4479n0055M0172J5988J1062
15135a9155k0766l5342J5045Q2979N4569k691q88l9734l2994N2993P8288J3776
15123A46080j6594k842n2885j8108L2463j3090o6717m0039n226Q225j6487m6539
$$ y = [-7413, -25465, -63753, -60435, -35907, -17748, -46034, -29767, 13181, 57809, 18558, -30407, 5363, 2065, -12155, -47511, -31852, -25443, -52561, -76405, -65796, -54501, -69795, -103061, -130053, -87394, -43313, 8294, 34262, 49463, -3037, -52671, -47890, -84417, -132734, -92167, -28428, -26504, -52858, -51402, 21916, 50957, -23281, -38675, -8352, -11826, 3484, -2803, -7355, 23567, 35907, 40986, 47215, 104287, 129932, 97139, 77206, 42936, 27024, -7286, -108157, -106580, -58297, -66405, -49458, -36349, -36463, -13247, 8157, -36322, -86377, -46205, -30217, -19155, -39921, -75263, -60218, 22761, 77330, 74639, 73751, 34017, 1023, 54016, 132304, 146080, 129486, 126644, 73759, 55651, 88114, 75024, 8307, -31732, -36958, -28733, -45220, -91759]
15111i1759k5641M3622O6729J5924j9527J5346L2303L6486k4995k4555j5795l9233
15099c1095Q271M5838K6301L0702L008j2206j8495l671l6476m9127N368J7369
15087a4213m6554m3197N7934L3166J0050L9710J6057n156k2629o3042j9484n6391
15075a13749M3150J01090R6639k2489k9592l9403Q802p276j7517N0958j3322j01919
15063d4628m9302M240M4240L4766L4776j7170o963m4681N145N6296L0215k101
15051D4833p531k0118l7319J3190j1506n9364K3521O2638N6698P69m9173j0934
15039E704q989j5721l6012M3580J2331o269j1643L8489j5675P537J7716N9502
15027I0550m033j1934l6648q5239q4663L2347O3321R295L9033j55k281K4418j2407
$$ y = [-91759, -117400, -73778, -7049, 8875, -10652, 4694, 36997, 73483, 48488, 23933, 8138, -31095, -22824, 23014, 49315, 80017, 83025, 70819, 52324, 48653, 12177, -36950, -31582, -14213, -60767, -103964, -46030, -12864, -2814, 36896, 52953, 47797, 25168, -37874, -57358, -113749, -70599, 30491, 127130, 104641, 75049, 35646, 44448, 37172, 19655, 70613, 57291, -44628, -93930, -89690, -45450, -10684, 24092, 6922, -41, -44722, -39577, 16719, 46934, 44833, 37302, 17184, -20135, -6945, -18451, -77815, -54294, 8344, 65042, 65811, 16638, 5704, -3285, -19006, -55018, -11438, 893, -5376, -17019, 21470, 5795, 13332, 31048, 90550, 86517, 74583, 37935, -47304, -131967, -99620, -36299, -27004, 12029, 11874, 9593, 34011, 21604]
15014B1604p58P7646j627o5486n4075L6883R830j4974j5415l4153L3001L9097
15002C1573M922J8356L2475Q08j8478l4044n9446M6349M2529l85L3132j2186o2340
14989B3265J7699O1579J6941j4290n5353k1930N0962m4084L7326N0530k515l4341
14977H5789L426K5909K3101K1034O38m9269k3219k1823m5192J307K3825R505P583
14964F2614l0885M7827k7376n6985k3945j6286N909P399L9994Q641o5976j337
14952e0406L4418N2953j6740j9758K6573O5791L422M584J2481l1187l3497K9198
14940G7832n6755j9503L1859M5896M7184J1056l9702M915n766j6150K2171k1817
14928H1220m4318j9053L9492p46l2241j917L183M1291j0433l0982o8736N025M4496
$$ y = [21604, 20846, 98492, 96865, 31379, -22696, 14187, 24017, 9043, -6372, -40525, -7524, 31573, 36495, 54851, 87326, 88134, 69656, 35612, -23834, 22515, 65044, 64659, 97791, 85605, 23265, 40964, 102543, 119484, 105194, 49841, 27911, 78873, 34789, 72115, 122645, 120130, 85789, 89215, 115124, 138225, 159259, 159897, 110628, 87409, 65586, 20394, 21701, 45526, 55031, 62614, 31729, 79556, 52180, -4805, -28750, -45036, -39127, -31728, 8266, 16907, -49069, -50406, -15988, 36965, 20225, 467, 27040, 92831, 96253, 100837, 113318, 82131, 48634, 77832, 21077, 1574, 33433, 79329, 126513, 137569, 97867, 102782, 97016, 80866, 103037, 81220, 36902, 17849, 57341, 56595, 24354, 22437, 25620, 66911, 56478, 25496, -43240, -38215, 6281]
14915F281J696q407NK1033R796K4571P285N2818n6594l1595p4071q7608N4276
14902h0514J06276n932l369P1680L8280k0483l4257n7211l1765K5390J8927J1621
14890C8643j6495J014k9358k9135j7383J0240L2480R1444o027m3223o6928K4356
14878a0372K4866j3767L780N573K6734K268J2004j0084j793N0405K9404R902q632
14865A20288q790N987k775l475n0486o8194M8390O250o788l4077q016j9283P3412
14852E2443L1261l9176j7808Q442K5937j714m2727k7653N6381l4902J5032l9109
14840a3593k9610k4654O217K914L1944L3955o485J1034k1544K6690q512L4478
14828D2834J7191m3424m6904N2155k621m7694K294K7807M6341L3555K3057J7663
$$ y = [6281, 7977, -430, -425, 20608, 30404, 54975, 62260, 115078, 58484, 26889, -47182, -134790, -80514, 25762, 19830, 16461, 88141, 126421, 105938, 71681, 14470, -17295, 8095, 27022, 38643, 22148, 23162, -6196, -35331, -52714, -42474, -9994, 81450, 75423, 32200, -34728, -10372, 14494, 727, 4507, 10080, 36814, 39082, 51086, 41002, 39209, 89614, 119018, 128920, 120288, 111498, 117485, 114710, 111235, 60749, -7445, 40945, 47195, 40407, 6330, -1686, -20969, 52443, 83704, 44528, 26720, 35162, 61099, 59385, 16658, -10995, 45386, 10484, 25516, -13593, -43203, -67857, -61640, -58726, -26782, 7173, 688, 11722, -9822, 16868, 8356, 42834, 60025, 16601, -30303, 21852, 19231, -28463, -26169, 1638, 47979, 81534, 104591, 122254]
14816A22254o591m3912m0996m2095l2051m8251N2440J10266O0925k2223o7689
14805D2077j4282J8464J786Q746j3004J3758K7494N058k9171l851n5927j6576
14793a5428O8625O2537L0300o0058p543L5773K5159l21n3643l3714K2396N5039
14781A29122M018m8104p8188L1614K950K6048M4418k8585o9939J3883N8704N045
14769I0986j4911k3345J1869K5351j1121M624K6417k5292p4414n1728l5107k6554
14757a03225j2839K7052L7482M6179K0478m0352N2125J7999L8213M0865o5581
14746E8396o7249J46R819L6076J603k4119J6979o4937N811O93j2795L8442N3757
14733E2622K1270k1883k1380P480j9541n1290O049L1585l7341M0153m2510K9266
$$ y = [122254, 115663, 71751, 30755, -11340, -43391, -91642, -39202, 71064, 131989, 109766, 42077, 27795, 46259, 48045, 56791, 43787, 57545, 85039, 90097, 60926, 57075, 1148, -15428, 53197, 115734, 146034, 85976, 78433, 114206, 139365, 139044, 85401, 51687, 74083, 129122, 133140, 85036, 6848, 38462, 41412, 67460, 111878, 83293, 13354, 27237, 85941, 90986, 76075, 52730, 64599, 89950, 78829, 83453, 109870, 84578, 10164, -41564, -76671, -103225, -116064, -89012, -51530, -5351, 15127, -25225, 26900, 44899, 83112, 123977, 58396, -8853, -8707, 1112, 37188, 38791, 14672, 31651, -33286, -27475, -26782, -39577, -1135, 52622, 73892, 52009, 30629, 38109, 18568, -32722, -26673, 4912, -32429, 7724, -34786, -5520]
14721e520J2655m64k5156J0860J7717k8973J8933j43k0356L814K6283L6439L3353
14708G9442n2532o533p400J0705r054O322J5598j4379k9640p6801m5224K0213
14696a09283O363N3617K2783J7018J7668L3291n3920l7026N6028j2467L5158k8058
14684A172j4912K5072j3482l1036k6970M1300m755K919O4628M0213J9590l4118
14672F9621p2648j5431L4320J7533J4335O3391N562K1976J0456j1763J6995k4292
14660A30055m7316n2453n665J9083o4600l6363Q976N8866l4343J4248L4951O421
14648C1860J6686K7570J0739J0273P3K2986m9939j3671r884k1682K937k2100K2504
14635B8352M4677K3131q133k6759p702J8179K0867j8448K003m0J5324R355n4761
$$ y = [-5520, 7135, 6671, -18485, -7625, 10092, -18881, 52, -91, -20447, -16633, 9650, 46089, 79442, 26910, 20377, 12977, 23682, 14628, 20950, 36548, 22169, -7471, -84272, -129496, -109283, -102920, -49303, -26520, -9502, 8166, 41457, -12463, -49489, 6539, -5928, 29230, 1172, -13740, 11332, -2150, -33186, -60156, -18856, -23611, -20692, 43936, 84149, 103739, 69621, -3027, -18458, 15862, 33395, 47730, 111121, 116683, 138659, 149115, 137352, 154347, 130055, 82739, 30286, 24621, 43704, -20896, -57259, -48283, 10583, -23760, -9512, 25439, 31860, 48546, 76116, 86855, 97128, 97201, 120187, 70248, 56577, 46693, 25011, 27948, 5848, 28352, 73029, 96160, 88027, 61268, 53566, 71745, 92612, 74164, 76167, 76127, 91451, 100806, 46045]
14622D6045k1347k7915k3079L6966K3088j552N2323k7676k7377O2221J1754l0426
14610G3025p9600m5653R330K2909Q132k2619L0116L2185R038J7536K8529M756
14598H7684l3600l9206k59O0124K7705n5971k4152J7706J2083K8243n82j9511
14586F0264k0870j0859L1640q123k2646j2394R492k4070L7450M0584K8217n0591
14574E8094j9809o8584j0490N3144M788j8896J9864N7090L9204l7309O036N1809
14562A34941q130m7647o6841p794p997m5384Q1299k8420k3023K5401J9456j1202
14550A4659k3366K2027K0471k9166K9351j2435J2359J124K1717l9309l0330J9154
14538F256L5589J9939J8108o14M310l3405o7404r783M9111N2810p412K7598K9384
$$ y = [46045, 24698, -3217, -26296, 10670, 33758, 32206, 84529, 56853, 29476, 91697, 103451, 73025, -6575, -52228, -42898, -19989, -11857, -34476, -4360, 27825, 36863, 54399, 82928, 87684, 54084, 14878, 14619, 74743, 102448, 46477, 22325, 40031, 52114, 80357, 79775, 60264, 39394, 28535, 60175, 52052, 29406, 17012, 26504, 2434, 39884, 80468, 108685, 58094, 38285, -30299, -40789, 12355, 17143, -1753, 18111, 75201, 114405, 77096, 83132, 134941, 126811, 79164, 12323, 4529, -3468, -48852, 32447, 4027, -18996, 6405, 25861, 14659, -8707, 13320, 33791, 4625, 33976, 21541, 33900, 35024, 56741, 17432, -12898, 6256, 41845, 61784, 79892, 79278, 83588, 50183, -17221, -27004, 22107, 74917, 67505, 95103, 124487]
14525A24487l3481k2764o8823j3719K1607N2490K599N0954J2546j091J595m0728
14513H5672k1511N5236o139q685k9914J7698l898k2135J6011m4059K8329K2110
14501H8715k2266m9698k167O5742L4137l6319o6866m6423m401J1603M1353M4420
14489E7830j3606n1747P7033J6669o7540J8447J7533k0745K3455M7741L8289k0954
14477A22405n6027Q441L3655m515p991j8060L0194n809J8546L5418m4649p5148
14465C6460j6226J1953M7195j9171n2495n564M7249J11951l9290r1529L3050k0952
14453D2631M8347J3924o2174J9649J5162K1621L7520k3930j3970l3243n4862L3613
14441D4288L0357l8851j0986k3879n0309o028l7838L5823J03390m7210n4406J0774
$$ y = [124487, 91006, 68242, -581, -14300, 7307, 59797, 62396, 113350, 125896, 124805, 126400, 85672, 64161, 119397, 113258, 104573, 74659, 92357, 88459, 66324, 82335, 38276, 66605, 88715, 66449, 16751, 14584, 80326, 114463, 78144, 11278, -35145, -39546, -27943, 13410, 57830, 44224, -7523, 69510, 86179, 18639, 37086, 54619, 33874, 57329, 105070, 143359, 122405, 66378, 74819, 108474, 103959, 95968, 77908, 108102, 102293, 120839, 156257, 111608, 36460, 20234, 32187, 79382, 60211, 7716, 2152, 49401, 161352, 122062, 30533, 63583, 42631, 90978, 104902, 42728, 62377, 77539, 99160, 136680, 112750, 98780, 65537, 10675, 44288, 74645, 35794, 24808, 929, -49380, -55408, -93246, -57423, 45967, -1243, -55649, -44875]
14429d4875O5818J188J4550J0161l1791k0665K8587J2941j8486L5405n3839l8336
14417c9342j9202J1512J4093J1698j6075J7970O5746Q842m6592Q230J3129M92
14405C0501j6972k7144j6089J3483J4833M9611P2073q918l0929N3264m3894m8210
14393D1609j8917J6210L2710L1495K132p3253J8388N3128M456J9336n0310j3750
14381F3234L4710J3601L7908L476n4243l2248P0786N429q4713k2973j9570J9687
14369C5084L7642M7399k1454p9694m2940J4240J4414k4188n990L3741K732n1261
14357d0275j0190M7681j9531j2165O1057M6786j3392m9981O18O8178P763P657
14345I4206K0384k7812j2735p0029M4163k7761J9038N5144k2603j9606L083j9451
$$ y = [-44875, 20943, 22131, 36681, 46842, 15051, -5614, 22973, 35914, 17428, 52833, -1006, -39342, -58544, -47032, -32939, -21241, -37316, -19346, 46400, 55242, 8650, 16880, 30009, 30501, 13529, -13615, -29704, -16221, -1388, 48223, 120296, 111378, 80449, 133713, 89819, 41609, 22692, 38902, 71612, 103107, 105239, 31986, 50374, 103502, 107958, 127294, 76984, 63234, 97944, 111545, 149453, 152929, 98686, 66438, 137224, 142653, 57940, 34967, 15397, 35084, 72726, 120125, 98671, 18977, -23963, -9723, 4691, -19497, -25487, 8254, 10986, -40275, -50465, -2784, -22315, -34480, 26577, 73363, 59971, 9990, 10608, 78786, 86549, 94206, 114590, 86778, 74043, 4014, 48177, 20416, 39454, 94598, 71995, 52389, 55472, 36021]
14333C6021k9453M3978P173k1773J2391M5310j9095K0462j1754J2029K3150J443
14321A19882k7985r0146K9273Q7838L3439n5146j7589k3415l0320K5954Q709M5210
14309A05704O9535m0707k9989J0202J1724j8226R514o0845K1701K2299K5462q590
14297A17784l0489j7289j7511l3016m588q766P008L4528N4448Q1646k6188l2858
14285A24709K387m2111l7552M5098L1685K745j2021n3100m5219q224L7829K9531
14273G5757N199p40N8073j5964J1170n6485l9104M1423K9308J0956k3701k8559
14261F7333J5011J1326k6975j1397L4543J8285K2940L9884L6255o511n3224o5851
14249H1619r3716R899K7250M583k7373l4090N1604J1435l488L4029K2840l4468
$$ y = [36021, 6568, 50546, 57719, 35946, 48337, 93647, 74552, 95014, 83260, 95289, 118439, 119882, 91897, 1751, 31024, 118862, 152301, 97155, 79566, 56151, 25831, 51785, 60494, 105704, 175239, 134532, 104543, 114745, 126469, 108243, 117757, 56912, 78613, 100912, 126374, 117784, 87295, 70006, 52495, 19479, 14891, 6125, 13133, 47661, 102109, 183755, 157567, 124709, 127096, 84985, 47433, 92531, 124216, 126961, 114940, 61840, 16621, 8397, 46226, 75757, 80956, 80216, 138289, 122325, 133495, 77010, 37906, 79329, 108637, 119593, 95892, 67333, 82344, 93670, 66695, 55298, 89841, 108126, 131066, 170950, 207205, 200694, 147470, 81619, -12097, -2198, 25052, 29635, 2262, -31828, 19776, 31211, 27723, 61752, 84592, 50124]
14237E0124r347P008N195M7181K7400j8013k9048K4269K9792j3248j2595m3873
14225F4845j0935K2120k918k4876K3943l512M0915Q7799n614j11966j42215j922
14213f4336N8369J7129N226j6808L2084J2283l6855L7364L6436j3640o3723m0922
14201c7393J1361N0671O736j6617J8559J5524k87L2783J3024J458o947O100m3910
14188E1062n68J3184K5023M9372R066l560M4464j6997p9672l9773K9241K4936
14176A05778j9244k0530l791K2909k573j6245m1835L1834M5701M4035k8231n2352
14164F5456n9122l2173J740J5128R0048K4468R820K2924k7936J6744J3497k5350
14152A15244k8929m5678J4549J601l4248j9324M7378P9512J8204M838o939k7693
$$ y = [50124, 40777, 47785, 52980, 100161, 127561, 109548, 80500, 104769, 134561, 121313, 108718, 64845, 53910, 76030, 73112, 48236, 72179, 68667, 109582, 197381, 191767, 79801, -62414, -64336, -5967, 11162, 16388, -420, 31664, 43947, 7092, 44456, 80892, 67252, 3529, -37393, -26032, 24639, 31375, 14758, 33317, 48841, 48554, 81337, 94361, 95819, 88872, 94972, 51062, 50494, 63678, 88701, 138073, 147139, 143579, 188043, 171046, 91374, 51601, 80842, 105778, 86534, 66004, 62213, 85122, 82549, 66304, 24469, 56303, 102004, 146039, 117808, 65456, 6334, -25839, -24099, -8971, 81077, 105545, 115365, 138289, 110353, 127097, 140594, 115244, 86315, 40637, 55186, 56787, 22539, 3215, 50593, 130105, 148309, 153147, 146208, 118515]
14140A18515K9173J3371m3738K1522l8251m0854k731K6703J4240k3061R796K5020
14128A09705K0448o265o4379k1245N795O0335l7681k6221p6549l9839N2077L2875
14116I056n498K1676O8802J5329l0271k3943m0534M8347J3315N023K3559J2826
14104A17687M8482q832p0334m562K6548k6919O216J1407n3418k2852l416k3215
14092c208k7092k2018Q893Q9023j1139L0464j4240p6690m1018j4079N4214j423
14080b8313m8107k1362L8909N4743l606L0679L2210M241j1684m5810K703L487
14068H090M8395J9458M2498n3568p1939n1824L9274O9603l7996p2644Q2121P4947
14056I6415J9000J339l6130J4462k540k021r965K3554l0362l0834k3443L6894
$$ y = [118515, 147688, 161059, 117321, 138843, 100592, 59738, 57007, 83710, 97950, 74889, 84685, 109705, 130153, 123888, 59509, 38264, 44059, 104394, 66713, 40492, -36057, -75896, -23819, 9056, 3558, 25234, 94036, 109365, 79094, 55151, 14617, 62964, 76279, 81302, 104861, 117687, 166169, 157337, 87003, 82441, 108989, 82070, 88286, 99693, 46275, 23423, 20007, -3208, -30300, -52318, -43425, 45598, 34459, 64923, 50683, -26007, -67025, -81104, -26890, -28313, -76420, -97782, -58873, -4130, -7736, 22943, 55153, 59394, 47710, 1900, 4603, 8090, 56485, 75943, 118441, 64873, -7066, -58890, -19616, 49987, 11991, -60653, 21468, 96415, 115415, 116754, 80624, 95086, 92546, 90525, 80560, 104114, 73752, 42918, 19475, 56369]
14044E6369J0141n7174Q094L9753K5190L1464l0305r134j5861K2812k4803j8398
14032C8148l3597Q889L007l223R7182o2216N883R835R843O988j4444m6169p588
14019A2538R8761O2128n7717o2247L43o450k5825k2293j6769K8431P890J7479
14007C6269O9115m530j5319K1430l0316k5071m0994l6705J5985P996L456M676
13995E992N0744N3166K2453j5654l1650k4563P0913J8451m6395L4512q804p9158
13983E0007m5924M3635L3525j7487j9451K2210J9107K0312M5533J3046j1193l8689
13971A14631J3285N166n1178L426j2703j5933L2590N9372j5702m9686j5783o4043
13959C442J4462R900L905M7538K7803o0333p2581O2931J04752L6606n0807l1481
$$ y = [56369, 66510, 9336, 17430, 57183, 82373, 113837, 83532, 74398, 58537, 81349, 56546, 38148, 4551, 13440, 16447, 13224, 110406, 48190, 54073, 63908, 73751, 80739, 66295, 20126, 12538, 111299, 173427, 115710, 53463, 53806, 47356, 21531, -762, -17531, 10900, 18790, 36269, 105384, 100854, 85535, 106965, 76649, 51578, 10584, -26121, -10136, -2140, 1316, 5992, 56736, 109902, 132355, 116701, 85051, 60488, 131401, 149852, 103457, 137969, 129165, 50007, 4083, 47718, 81243, 63756, 44305, 66515, 85622, 105934, 151467, 164513, 153320, 114631, 127916, 133082, 81904, 85330, 72627, 56694, 89284, 148656, 132954, 83268, 67485, 3442, 17904, 27804, 31709, 79247, 107050, 46717, -25864, 37067, 141819, 178425, 127618, 96137]
13947I6137k0537m1702j3001N7694p537l5317m4122L921M6144j314K6482K5834
13935I2682J441J788P036M338k7766K2998j67k3923k4369j5908O847N534j5690
13922C4841M044n5137L2290J06174M1568j5773m0570p4788n2625L350N0597j9737
13910A4234J4230Q42m1729L0257K9378n595N385L8770O9423K6041n3519k2971
13898A04746o4070k1015O9497J7888l8739o518M788j1418J3391N182L0313l7598
13886F6447J5015m462M586q624l2824j5623O4877k539M7644L4093L023j2297k6024
13873A33292k9191P908l5238j3424M1373j1650n3177N1895L7553k5763k2746k827
13861G8005m3925J9400M6590K8546p1638n5122P1020L9018N1408K0986m3746o8069
$$ y = [96137, 75600, 33898, 20897, 78591, 71054, 35737, -8385, -4464, 41680, 40366, 66848, 92682, 94123, 95911, 102947, 107285, 79519, 102517, 102350, 78427, 54058, 38150, 44997, 50531, 34841, 38885, -16252, 16038, 122212, 163780, 148007, 107437, 32649, -19976, -16626, 33971, 14234, 28464, 29306, -12423, 17834, 47212, 41617, 47002, 85772, 155195, 181236, 127717, 104746, 40676, 19661, 89158, 107046, 68307, 61789, 66577, 55159, 68550, 73732, 104045, 66447, 81462, 77000, 81586, 72962, 40138, 24515, 89392, 86853, 134497, 168590, 171613, 159316, 133292, 104101, 112009, 76771, 63347, 104720, 93070, 39893, 91788, 129341, 103578, 80832, 78005, 34080, 53480, 100070, 128616, 56978, 1856, 72876, 111894, 163302, 184288, 140542, 72473]
13849G2473M0538K0235n3280L2537M612j5103O366l9116J3506l5677l4932n3095
13837d0936J1662m29M0348Q9182q926m0525M6621M4540R993M406K8057N0824j9701
13824B15116k9066j926j6205o0756n7146M4988K7068L8921j6621l338M941M3805
13812A89781k3236n5526k1271j568n568K6601P574o0896j8807Q5014M0433o3751
13800I8780k5870k698l1093O239J0510K8874K4829K3040O10J9467k7390r9888
13788B5410j0666N3397M4026K4343l6756J0073P4048K0411n4163m3579l0134j6576
13776E9834L7938j0277m514N352N590L8923j3503l7996M0155M4721r252m8441
13764A08530o8688k2996J3660m1434j962N2878l510o3900q586J17544O5293P377
$$ y = [72473, 113011, 133246, 79966, 112503, 117115, 102012, 108378, 69262, 82768, 47091, 12159, -40936, -29274, -29703, 10645, 99827, 90901, 50376, 96997, 141537, 151530, 155936, 183993, 234817, 215116, 186050, 184124, 167919, 107163, 50017, 95005, 122073, 160994, 144373, 141035, 145976, 189781, 166545, 111019, 89748, 88180, 82612, 109213, 116787, 55891, 37084, 122098, 162531, 98780, 72910, 70212, 39119, 45358, 55868, 84742, 109571, 132611, 133221, 152688, 125298, 25410, 14744, 68141, 112167, 136510, 99754, 109827, 183875, 204286, 150123, 106544, 76410, 59834, 97772, 87495, 82981, 88333, 93923, 132846, 119343, 81347, 121502, 166223, 156971, 108530, 39842, 16846, 30506, -10928, -12890, 39988, 36478, -27422, -36008, 81536, 146829, 154206]
13752A54206l4900m2065J0600k5557q0934K4268K8339M4087M9204L3915M7079
13741B08242m5631n3915m4301k9935K8823L7090j6926o081J8636K2291j2997l4603
13729G0693j0926J9095q994m4218j2624J7360j4047L1404M6306o334k1081K4248
13717I0882N6670J2766m3268L2321l1113j444L5937J8099k4628l5075k4636L2232
13705A18743K5161k0712Q383j4746l6679m2323K8155O6158J1401m8851j5681l1952
13693D7057P773p653J4461K0469K3393l1286M1135L1307N5651Q103l1399q2118
13681I6893K0316N8730K3785k4038j2779p4863J5532J1212r362N683k9197p6073
13669E839l5479P6246L8529n7219j4819K5794k6713M2401J0112M691J2696k9622
$$ y = [154206, 119306, 77241, 87841, 62284, -18650, 5618, 33957, 78044, 127248, 161163, 208242, 162611, 108696, 64395, 34460, 63283, 100373, 83447, 77366, 96002, 118293, 105296, 70693, 59767, 78862, 69868, 25650, 13026, 30386, 16339, 47743, 94049, 87715, 66634, 90882, 147552, 160318, 117050, 149371, 118258, 116814, 152751, 170850, 146222, 111147, 86511, 118743, 143904, 123192, 131575, 116829, 80150, 37827, 65982, 132140, 143541, 94690, 79009, 47057, 54830, 47177, 61638, 82107, 105500, 74214, 115349, 146656, 202307, 210410, 179011, 96893, 117209, 175939, 199724, 175686, 162907, 88044, 103576, 114788, 105426, 111109, 81912, 5839, -29640, 46606, 85135, 27916, 13097, 38891, 12178, 54579, 64691, 69382, 82078, 52456]
13657E2456j3214l4716l153M6758N048K6852M9640N871l1736l1937L7979M8236
13645A58084J3683j0868P487l6738l938K8792R558m5288p8682M5455O7379J5595
13633A70519K5844q4991o1773j1099j6447K8315L6640P3811M8392p5141q7991
13622D6079m3277J5837O9707K0247l2951O3320J6360j7328J8237J9242O977r652
13610A72798N6743l2711o633l9502J5560m8942J3576J8761J6407n1994M7620M671
13598A66354m7372l0247n1488K8854P8613K2678K4668l3311K0349K6367J222n454
13586B01233n9004k4950L82J328k0562k3620m6406J5727K1455n685K0982O5827
13574A46707L8521K0407R310K526o4983m8931M7577J4300M179k7259j1015L5322
$$ y = [52456, 39242, 4526, 1373, 48131, 53179, 80031, 129671, 135542, 103806, 71869, 109848, 158084, 171767, 160899, 168386, 131648, 127710, 156502, 166060, 120772, 42090, 87545, 154924, 170519, 196363, 111372, 49599, 38500, 22053, 50368, 87008, 160819, 209211, 134070, 46079, 2802, 18639, 88346, 108593, 75642, 138962, 155322, 137994, 156231, 175473, 182450, 172798, 229541, 196830, 190197, 150695, 166255, 117313, 130889, 149650, 166057, 114063, 161683, 166354, 118982, 88735, 37247, 66101, 144714, 167392, 192060, 158749, 179098, 205465, 206687, 201233, 142229, 117279, 117661, 118989, 98427, 74807, 28401, 44128, 65583, 59898, 80880, 146707, 185228, 205635, 214945, 217471, 152488, 103557, 151134, 165434, 169613, 142354, 131339, 166661]
13562A66661K782o87J3591l7131j7627m059Q1L71k8484l5575k8541O0778P5308
13549A67468m025p731l0476Q982M8111k3766j3545o1712K3753r083L4789L80J4465
13536A47610J6177L5267l6786J6335K1242l4372N970m6418p2169K4331L6372M9019
13524A62578M1683p579j1274j6670r079q8382l2527J3753j4689M843N0791K3328
13512A16776k0955k0710p794k6729L6983K9224p898L3714K9668n7096m6962n59
13500E7662K8813K9745l4651M496O0538J5600p070N522K7532k7485m2594p451
13488A10657J0154j5051N6591J0986m3737j4228K1911K8514J6178j1435R397L0598
13476B10535N810k1243J8651k0693l8336j1860j0005m3288Q967K8501q945j600
$$ y = [166661, 169443, 168756, 182347, 145216, 127589, 123530, 123611, 123982, 95498, 59923, 31382, 92160, 167468, 163443, 155712, 125236, 134218, 182329, 158563, 145018, 83306, 107059, 97976, 132765, 133145, 147610, 163787, 199054, 162268, 178603, 199845, 165473, 171443, 125025, 52856, 77187, 113559, 162578, 204261, 196682, 185408, 168738, 159659, 71277, 38750, 52503, 37814, 42657, 93448, 116776, 95821, 75111, 67317, 40588, 77571, 106795, 98897, 132611, 162279, 105183, 58221, 57662, 86475, 116220, 81569, 86065, 146603, 162203, 155133, 160655, 188187, 160702, 118108, 110657, 120811, 105760, 162351, 173337, 129600, 115372, 137283, 165797, 181975, 170540, 179937, 210535, 216345, 195102, 213753, 193060, 154724, 142864, 132859, 89571, 98538, 127039, 118094, 116494]
13464A16494J4171N9890J7682l7361j1944N741N755l3821J4630L0665N0631L3235
13452B65768o5275N80J7682j2407K2578L6393j2103r3271J2996M028K1404l1517
13440A66856j1821M5029l1357j4910j9451J6897J6477M888J0122N5299j1098l5392
13428A91539l8206L9578J8547j9662J2443J7050k9903p505l5798K8482j2148m0018
13416A24399M437N8781N0047M8203l6351P994M3951p081l4416p535J320m5147
13404B08602m6950L1787M2943l3765p4738J9236O3882M6645o38m0939l9507k1498
13392A55060k7572L2611Q3860K5783K3800o4334l9521J9207j6342K1843M832M0187
13380B59414J0039m3159o904J820k8038m9386L8381M3255J5303L1904n88j6042
$$ y = [116494, 130665, 190555, 208237, 170876, 158932, 164673, 170428, 136607, 151237, 181902, 232533, 265768, 200493, 201073, 218755, 206348, 228926, 265319, 253216, 159945, 172941, 176969, 198373, 166856, 155035, 200064, 168707, 153797, 134346, 151243, 167720, 172608, 182730, 238029, 226931, 191539, 153333, 192911, 211458, 191796, 204239, 221289, 191386, 183881, 148083, 176565, 164417, 124399, 128836, 187617, 237664, 285867, 249516, 257510, 301461, 294380, 259964, 252429, 253749, 208602, 161652, 193439, 236382, 202617, 127879, 147115, 210997, 257642, 257004, 216065, 176558, 155060, 127488, 160099, 243959, 269742, 293542, 229208, 189687, 208894, 192552, 214395, 219227, 259414, 269453, 226294, 219390, 221210, 193172, 143786, 182167, 225422, 240725, 272629, 272041, 255999]
13368B55999N746J3863l0033L12k6209r206J9137k2108m6070j6946l999O2908
13356B03394N681j8622l2026K4855O128K487L0137K8419L2427n7282l3527K4851
13344B16922K3915j2882j7660J0408J723j6653J717Q7526M7957p9251l1413m1466
13332A90843j2692J7614K7112L7085m6641j6965J71k4717K8954L7728K0290k5773
13320B33009j9164j4776k6834M2616P4476O4416j0343l3058j0784L0359L250L1483
13308C64650N3090M2805k3444j8877J2458L1651P6102J13970N0487P2203Q7493
13297H62588J16134J36330J93805J48552J13983J13631J33541J55821O5245j4011
13287B025619r1359q6011j85874j85702q0492r7515j81833j52402j32677p8732
$$ y = [255999, 261745, 275608, 245575, 245887, 219678, 210472, 229609, 207501, 161431, 144485, 140486, 203394, 209075, 190453, 158427, 183282, 189410, 191897, 222034, 250453, 282880, 225598, 192071, 216922, 240837, 227955, 210295, 220703, 222426, 205773, 207490, 295016, 342973, 263722, 232309, 190843, 178151, 195765, 222877, 259962, 213321, 196356, 196527, 171810, 200764, 238492, 258782, 233009, 213845, 199069, 172235, 214851, 289327, 353743, 343400, 310342, 299558, 329917, 333167, 364650, 417740, 460545, 437101, 418224, 430682, 462333, 538435, 652405, 702892, 775095, 862588, 978722, 1115052, 1308857, 1457409, 1571392, 1685023, 1818564, 1974385, 2039630, 2025619, 1934260, 1848249, 1662375, 1476673, 1396181, 1298666, 1116833, 964431, 831754, 753022]
13277G53022p7218n5784n5546k6314o0257l713J8314j0063m9337k7326K9095K1373
13265D56246p3271n9095O2393J5460J8562j3499m3564m9260k8764j4533j0614
13254B60061r562K722L7561j6637N670L4810k4139m0914k4228M554M3488J6430
13242B89816m7946l6772m7239L8433Q3400J1926j1979Q116K5607k504q81N4140
13230C64117R827k6473p7078J4945l054l0058K4121P4001k53m6732J3911l737
13218C13537j9561K178J1402l5381K9917J7255k4264l7076l9683l0911N6321P5043
13206C18777N2756l0309j19953j267j338r159J7814m2396P7120K368N23L2509
13194B97445L0918Q384J108J9604N011J654N581m020q938J6577M2422m7182n4981
$$ y = [753022, 675804, 620020, 564474, 538160, 477903, 474190, 492504, 482441, 433104, 405778, 434873, 456246, 382975, 323880, 386273, 401733, 420295, 406796, 363232, 313972, 285208, 270675, 260061, 250499, 253221, 290782, 274145, 279815, 314625, 290486, 249572, 225344, 229898, 273386, 289816, 241870, 205098, 157859, 196292, 279692, 291618, 279639, 287755, 313362, 310858, 309977, 364117, 373944, 347471, 270393, 285338, 282284, 252226, 276347, 350348, 350095, 303363, 317274, 313537, 293976, 296154, 307556, 272175, 302092, 319347, 295083, 258007, 218324, 187413, 243734, 318777, 371533, 341224, 221271, 220004, 218666, 209507, 227321, 184925, 262045, 264413, 264936, 297445, 328363, 336747, 337855, 357459, 362470, 364124, 369705, 365685, 356747, 373324, 415746, 368564, 313583]
13181C13583o529J5576q279O754J6743L7337M9218l8241J963M6425L1994l1100
13169D35444L337N3816k5647k4444k7813m2649j1647N7488l505P50K7520K8366
13157D71016J9512j0244k9014k4104n074J7141l2153J3340J1155M0715R785k7224
13145D54851J4582N4670L0932k1581N678R552K7121j5310J0111m0583N9748Q3061
13133F72832J4490n338l5070j1207l6536j5964K0837J0758n3058n4099Q011J3530
13121E29186J1156K7040N244n3412n9411J2087j0836J0474N1129J8159n2969J3249
13109E01096J3655O236j4089m3269L3957j0056k0989K3459n822l4719M3445l9663
13097D53241m4688j8262J9703N5765r409m2480l513J0333n518K3553L4993L4758
$$ y = [313583, 307054, 322630, 314351, 321105, 337848, 375185, 424403, 386162, 388125, 434550, 466544, 435444, 438781, 492597, 466950, 442506, 414693, 372044, 360397, 417885, 414380, 415130, 442650, 471016, 490528, 480284, 451270, 427166, 422092, 439233, 407080, 420420, 431575, 472290, 482075, 454851, 469433, 524103, 555035, 533454, 539132, 548684, 575805, 560495, 570606, 530023, 589771, 672832, 687322, 681984, 646914, 635707, 599171, 583207, 604044, 614802, 561744, 507645, 515656, 529186, 540342, 567382, 572626, 519214, 459803, 471890, 461054, 471528, 522657, 540816, 487847, 501096, 514751, 520987, 506898, 463629, 497586, 487530, 466541, 490000, 484178, 449459, 492904, 453241, 408553, 390291, 409994, 465759, 456350, 413870, 410357, 420690, 415172, 438725, 473718, 508476]
13085E08476j4026m7347P2322K6406j6219l8180l2563K1749N8383L3843P0769
13074F43613M8140j7797L8636j2204j1314K2985L922L546p2458l3028O1271P6399
13062G51711N1581m0757k5379R637j2399m1470k8053q2624N2838N2003j4823k1773
13050F50492k2482m9382l6799L8648Q2639K0834L1441M6877l0352m1287Q547R0833
13038G90009q909j06039m5781r545m8590J0955M4815M3548J5745m862p50O1107
13026G41703J3220p483K5711j0437k1112L5999R126L3788J0950J1755K272L479
13014H48971M6967K3794k6946M3265M3072j5283m8039l9159M0732P6919K6682
13003A020975j6498P1354M7962k9698l9283n0152j1859q029p423P2623P5230K486
$$ y = [508476, 494450, 447103, 519425, 545831, 529612, 491432, 458869, 480618, 539001, 572844, 643613, 691753, 673956, 712592, 700388, 689074, 712059, 715981, 719527, 647069, 614041, 675312, 751711, 803292, 762535, 737156, 746793, 734394, 692924, 664871, 582247, 635085, 687088, 672265, 650492, 628010, 578628, 541829, 580477, 663116, 683950, 715391, 762268, 731916, 690629, 699176, 790009, 781100, 675061, 629280, 619735, 571145, 582100, 626915, 670463, 686208, 681346, 680596, 741703, 754923, 747440, 773151, 762714, 741602, 777601, 786727, 820515, 831465, 843220, 845492, 848971, 895938, 919732, 892786, 936051, 979123, 963840, 915801, 876642, 917374, 994293, 1020975, 1004477, 1075831, 1123793, 1094095, 1054812, 1004660, 992801, 984772, 977349, 1049972, 1125202, 1127688]
12991A127688j9750k8584o5850l967j9551K2910L3747M6912Q7501N2553n6672
12980A176937l3735J2809k3485K4145K1768J4444M1982N3296J3865J8233L1311
12969A351570K1328N0113P3419O0020L1562j6434K6977K9754M6312r249K4586
12958A689958L5528R9824M791n2168K523O8944O2176M4864o994L521M6058N8754
12946B057779P4360K3597P5287R5064O6981M1724O9127j2666O3692J12183P6024
12935B743152Q5721J55480J65769N6737P6254J60327J05598J11116J28076J84031
12925C972261K16314J58301K28971K20020J47635J43669K30278L11348L12113
12916E940910L35147L60741L79341M36525N13349N52138P00210P77443Q59047
$$ y = [1127688, 1107938, 1079354, 1013504, 1009537, 989986, 1012896, 1046643, 1093555, 1181056, 1233609, 1176937, 1143202, 1156011, 1132526, 1156671, 1178439, 1192883, 1234865, 1288161, 1302026, 1320259, 1351570, 1372898, 1423011, 1496430, 1556450, 1588012, 1571578, 1598555, 1628309, 1674621, 1665372, 1689958, 1725486, 1825310, 1830101, 1777933, 1780456, 1849400, 1911576, 1956440, 1949446, 1952967, 1999025, 2057779, 2132139, 2155736, 2231023, 2326087, 2393068, 2434792, 2503919, 2491253, 2554945, 2667128, 2743152, 2828873, 2984353, 3150122, 3206859, 3283113, 3443440, 3549038, 3660154, 3788230, 3972261, 4188575, 4346876, 4575847, 4795867, 4943502, 5087171, 5317449, 5628797, 5940910, 6276057, 6636798, 7016139, 7452664, 7966013, 8518151, 9218361, 9995804, 10854851]
12907A0854851R76480J048876J110906J304018J426801J559502J659782J675493
12899B1616709J863150J986343K094569K265895K524768K901479L499701M378394
12891D3131008N639906P381455R798617J3213867J7858912K3884796L1028160
12884A51936721L8220079M4222878M7679291M6941947M1089958L0448240J5901477
12877D16440591o67641j6855473l0588663m0264515m5116425m5509518m2251702
12870A95186654l6699358l0259716k4112020j8898040j4591700j1165428q550619
12863E0909773o688144n275466m165835l437424k950372k606012k313982k135206
12855B1337332j874470j754921j615305j404855j316761j239421j124999j010646
$$ y = [10854851, 11831331, 12880207, 13991113, 15295131, 16721932, 18281434, 19941216, 21616709, 23479859, 25466202, 27560771, 29826666, 32351434, 35252913, 38752614, 43131008, 48770914, 56152369, 65950986, 79164853, 97023765, 120908561, 151936721, 190156800, 234379678, 282058969, 329000916, 370090874, 400539114, 416440591, 415772950, 398917477, 368328814, 328064299, 282947874, 237438356, 195186654, 158487296, 128227580, 104115560, 85217520, 70625820, 59460392, 50909773, 44221629, 38946163, 34780328, 31342904, 28392532, 25786520, 23472538, 21337332, 19462862, 17707941, 16092636, 14687781, 13371020, 12131599, 11006600, 9995954]
12847I995954r57975r24681q04906o98498n40074n39804m46804l18163k88106
12838D476943l11126l05952k62860j74794k29414k02690k08702k09994j39085
12829B432326j18363j08883p7548r3746j31053q4959r7031q2853l9535l7403j08558
12818A452394p7641n467k9765o1821j3576n886j09190j02319l2074m1560m7512
12807I25583j03554m8341j1663j9365K6444n1663m5245l5479j1545K531n029l0664
12795E92010K7082l7411l8591p1438n5104L9012L3369L8378K3221l5071l7443
12784D78014k7769j7728q6286n7907L2165L1705n7647k8267j1929n573O0550N305
12772C14633m1654k0353k6942k5354j2265r512l2939M171N2939L5474o4971q358
$$ y = [9995954, 9037979, 8113298, 7308392, 6609894, 6069820, 5530016, 5083212, 4765049, 4476943, 4165817, 3859865, 3597005, 3422211, 3192797, 2990107, 2781405, 2571411, 2432326, 2313963, 2205080, 2127532, 2033786, 1902733, 1817774, 1720743, 1637890, 1598355, 1560952, 1452394, 1374753, 1369286, 1339521, 1277700, 1264124, 1258238, 1149048, 1046729, 1014655, 973095, 925583, 822029, 773688, 762025, 742660, 769104, 717441, 672196, 636717, 625172, 627703, 622674, 592010, 619092, 581681, 543090, 471652, 416548, 455560, 488929, 527307, 550528, 515457, 478014, 450245, 432517, 346231, 288324, 320489, 352194, 294547, 266280, 254351, 248778, 309328, 314633, 272979, 252626, 225684, 200330, 188065, 178553, 145614, 149785, 202724, 238198, 173227, 164869]
12760A64869L6988k8474K4622R171Q7117M3222J6286l9971K2065m336m579j1865
12748C15115L7967N0230J4304m4255r4192J1121l2844n3309k6686m8457l533K6856
12736A52317l345J2268M4422k292o9612p9377k6699M002J3354L5010J6188m7343
12724D8893j0139L859L515M3723o391j7310k3214j5237p2221j5261q4242k8550
12712a72575P7431N6051J3490R314J3601j0527q2835k6674o524K6628P627L1897
12700f3096K0056J7995j306m1334r352r002n0698J9282K6878l1528K4605m6405
12688a43905m0953K3323k0471R115L7351K4076j5418J7655P1274M6450j9090j9982
12676c0575O8642L3837j414l5569N3826R4824K2632K7140L4369R2619L3180N8964
$$ y = [164869, 201857, 173383, 198005, 207176, 294293, 337515, 353801, 313830, 335895, 331559, 326980, 315115, 353082, 403312, 417616, 373361, 279169, 290290, 257446, 204137, 177451, 128994, 125461, 152317, 148972, 161240, 205662, 203370, 133758, 54381, 27682, 31684, 45038, 80048, 96236, 48893, 38754, 42613, 46128, 89851, 83460, 66150, 42936, 27699, -44522, -59783, -144025, -172575, -95144, -39093, -25603, -16289, -2688, -13215, -96050, -122724, -129248, -102620, -94993, -63096, -43040, -25045, -26351, -67685, -77037, -86039, -136737, -117455, -90577, -122105, -97500, -143905, -184858, -161535, -182006, -172891, -135540, -111464, -126882, -109227, -37953, 8497, -10593, -30575, 38067, 71904, 70490, 34921, 88747, 183571, 206203, 233343, 267712, 360331, 393511, 452475]
12664D52475J75389R2896N1850n6541j09530o6056o1526r2255o0731p2521o9095
12653A84355J7867j320L235L5074M2340r089k8710m4761O4968L3609l3540N8259
12641C22287O5383K265L6223K365O1568M5924R6562N3820J9133L2112J00022N6045
12629H93709n961q3436p3414j23448n0011j6615p2298m6234p970n988m2111J2654
12617C78877k5168m3129K5708p308p1455j12303M11J3412k5992l2007Q1577N6979
12605B39602L403M3179Q8463J16465J35651J11690P2395K2750o1978j40179j31605
12594D99836p1920q9778j43376r4520m6459o782l7537j6593l6420l5277j1404
12583i0230K3854k5467k3764J9129J8442L8926J1421j7830l5370l3226N4069P5178
$$ y = [452475, 627864, 720760, 772610, 716069, 606539, 540483, 478957, 386702, 325971, 253450, 184355, 202222, 200902, 204137, 239211, 281551, 272462, 243752, 198991, 263959, 297568, 264028, 322287, 387670, 389935, 426158, 428523, 490091, 536015, 632577, 686397, 705530, 737642, 837664, 893709, 887748, 804312, 730898, 607450, 557439, 540824, 468526, 422292, 414322, 408334, 366223, 378877, 353709, 310580, 336288, 328980, 257525, 145222, 145633, 159045, 133053, 101046, 182623, 239602, 243005, 286184, 374647, 491112, 626763, 738453, 810848, 833598, 771620, 631441, 499836, 427916, 338138, 194762, 100242, 53783, 47001, 9464, -7129, -43549, -78826, -90230, -66376, -91843, -115607, -96478, -78036, -39110, -27689, -45519, -80889, -114115, -60046, 15132]
12571A5132O730o7507l9101j4539O186m896l1555j845M7303N6369N323k7081o012
12558e5493l0157k1732L5743k5217K639J0135j5494k1957j4346P6579P7247N4868
12546G2815m5122o3424m5556m4508J2186K6897l413j2829J4057J4966q71R596
12534f5206Q623K1789M0139J8814K8673L2192j7676r9493m2650j0718K9686M769
12522e1058o170N4778K4460l6075k1943m3081J4842M784n240m2290J4033K9855
12510f3105K0112L8183k2454m6457L5715J0623K2438n120m4880R365j3636L2008
12498b7208L9481m882k493K5474k5828l2035K785J5758J7022R252p270L3508J5231
12485E8795L2124L6142k7295o1998K2564M9714K36N5334O3151L5603l3555j9861
$$ y = [15132, 21862, -45645, -84746, -99285, -93099, -97995, -129550, -131395, -84092, -27723, -22400, -49481, -55493, -85650, -107382, -71639, -96856, -94217, -84082, -99576, -121533, -135879, -59300, 17947, 72815, 27693, -35731, -81287, -125795, -113609, -86712, -90125, -102954, -88897, -73931, -74802, -65206, -56583, -34794, 5345, 24159, 52832, 85024, 67348, -32145, -74795, -85513, -55827, -51058, -57228, -2450, 22010, -14065, -36008, -79089, -64247, -59463, -64703, -106993, -92960, -63105, -42993, -4810, -27264, -73721, -38006, -27383, -4945, -10065, -54945, -45580, -59216, -27208, 12273, 7391, 4898, 30372, 4544, -27491, -24706, -8948, 8074, 17326, 10056, 43564, 58795, 90919, 127061, 99766, 37768, 60332, 110046, 110282, 165616, 228767, 264370, 230815, 210954]
12473B10954O9954J43845J21452R7724J07502J51237J06785J74083K09208K35734
12463A628478J50738R698J7007k0226j07783j68890j86374j58710j49117j66007
12453H48814j36988j08860j24455k4363n4939o5183p1178l6648j0945P022K3889
12442B46166m1183m1871M527K2918p7353k1462k2814o1335l0789L7048K9747k4619
12430A8980k5926M5429j5940j6029n094M1863j4217j3533k5566l4655m3910k2951
12418a11549L5683J3860l855K4087n2657L1958M4407j4179K0874J2132J7227J2409
12406C0397o6989l1356l023m3065M6009M3531M5824p1868m3091K330L6591K412
12394e2298j2122j5163r645j8651p329r888L4022M5763M113O731n513r749m6997
$$ y = [210954, 280908, 424753, 546205, 643929, 751431, 902668, 1009453, 1183536, 1392744, 1628478, 1779216, 1788914, 1805921, 1785695, 1677912, 1509022, 1322648, 1163938, 1014821, 848814, 711826, 602966, 478511, 454148, 399209, 334026, 262848, 226200, 215255, 222277, 246166, 204983, 163112, 167639, 190557, 113204, 91742, 68928, 7593, -23196, 13852, 43599, 18980, -6946, 38483, 22543, 6514, 1420, 43283, 29066, 15533, -10033, -44688, -88598, -111549, -75866, -62006, -65861, -41774, -94431, -62473, -18066, -32245, -11371, 761, 17988, 30397, -36592, -67948, -70971, -114036, -68027, -24496, 21328, -50540, -93631, -91301, -54710, -52298, -64420, -79583, -89228, -107879, -115208, -125096, -91074, -45311, -41198, -34467, -39980, -49729, -96726]
12381i6726J6659k9413j8623O9027q557j6468k029m5317M6767m90k0856m0415
12369a46441o8508p039K6926L4566J0082J0689M1517r139k653J3949J3386L2774
12357d9891N0428M4212L9600k5838k3725j6802k3843n1813o262k5387l8906M737
12345a23490k2998J1849K4699J7658M7099k0566o8676M3888N5161j856j1511M308
12333d4435J3037N7619J9814j3437m3558J7537L9413o9404o7809R814n4585J2923
12321a23071R0820L3453k7820j0877J3496k2050N951K5784O058J4593L8696j6404
12309B8629l0351K2105l4219r4971j2725P4739j8872m9090P489O9187N6927l659
12297A5189p2208l0142J1401M0697M0382J5324j1106n2776k4671J3699j5430k2439
$$ y = [-96726, -80067, -109480, -128103, -59076, -67633, -84101, -86130, -131447, -84680, -85170, -106026, -146441, -214949, -221988, -195062, -160496, -150414, -139725, -98208, -107347, -110000, -96051, -82665, -49891, 537, 44749, 84349, 58511, 34786, 17984, -5859, -57672, -63934, -89321, -128227, -123490, -146488, -134639, -109940, -92282, -45183, -65749, -134425, -90537, -35376, -37232, -48743, -44435, -31398, 26221, 46035, 32598, -10960, 6577, 45990, -23414, -91223, -81409, -135994, -123071, -32251, 1202, -26618, -37495, -23999, -46049, -40098, -14314, -8256, 6337, 45033, 28629, -1722, 20383, -13836, -108807, -121532, -46793, -65665, -114755, -107266, -38079, 18848, 15189, -57019, -87161, -75760, -35063, 5319, 20643, 9537, -43239, -67910, -54211, -69641, -92080]
12285i2080K4078p0198n063K5768L9310K130m9551p0408N2393J7139J3284J8612
12273i4586k0805j7263m136O74R0472P0419J9545n5593k4146j0245k7319k9829
12261a02812M1545L5059J8537N0622j2213p6973o9141J0462p231Q199k0977l772
12249a28695j4958k0750J6638N7101O5097J3927l482m1404q8929r16M8235K0697
12237g7439L9683K3149l451r6480p7894L0564Q5813j6927j2145J1205n99n71Q96
12224i4196m8765N040J0448M945J0643l0381M9691l1942L8995J20972J4905o9548
12212a9193m0168n7932j3425L5708R574k168K2039P178m8023l8401L9210K1349
12200h4252R828k6268M0043L6874K0895J4240N635J7092K8544m5712m3689l6976
$$ y = [-92080, -68002, -138200, -143263, -117495, -78185, -76055, -125606, -196014, -143621, -126482, -113198, -94586, -115391, -132654, -136790, -136116, -45644, 24775, 44320, -11273, -35419, -45664, -72983, -102812, -61267, -26208, -7671, 42951, 30738, -46235, -115376, -104914, -112145, -103946, -124923, -128695, -143653, -164403, -147765, -90664, -25567, -11640, -15122, -56526, -145455, -146371, -98136, -77439, -37756, -14607, -18058, -114538, -192432, -161868, -76055, -92982, -105127, -93922, -94521, -95092, -94196, -142961, -137921, -127473, -122528, -111885, -142266, -92575, -124517, -85522, 35450, 50355, -19193, -59361, -117293, -130718, -95010, -85436, -87604, -65565, -58387, -106410, -144811, -105601, -84252, -74424, -100692, -60649, -23775, -2880, 11360, 16995, 34087, 62631, 16919, -26770, -63746]
12188f3746K9794P14L3940K2293l9646l3063l7404M1071J0077L6594K8321J1224
12176D0169o4030o2017L1449K3836M2349K0692M716L3008p8936n1135L0723j0505
12164c9681N0546J0150o7319P617K8913k1147k9285L9122M9368o2518o4154L6618
12152f1770L0191k0346k4050N4684Q600q812P953k9049L1288j4616l090m8396
12140g7413k0022L7726R4135N2990O6964M9066k788j5724m7712n7593m8376q532
12128B2721L7069n3818o647m989p4016n726k0059J282K6672M613k4844r066J8912
12115h7896L1172J62J3419L3816K9974n6781k2612L0718j1756j2973k3152O9190
12103f719J1074j4839j6297r799k9271q10N3047k7038l9335l429n1628K5071N0863
$$ y = [-63746, -33952, -33238, 702, 22995, -16651, -49714, -87118, -46047, -35970, 624, 28945, 40169, -23861, -85878, -54429, -30593, 11756, 32448, 37164, 70172, -8764, -59899, -29176, -39681, 10865, 21015, -46304, -38687, -9774, -30921, -60206, -21084, 28284, -34234, -98388, -61770, -31579, -51925, -75975, -21291, -12691, -21503, -13550, -42599, -11311, -25927, -29017, -77413, -97435, -59709, 34426, 87416, 154380, 203446, 200658, 184934, 137222, 79629, 31253, 22721, 59790, 5972, -675, -5664, -79680, -85406, -105465, -104183, -77511, -72898, -97742, -106808, -87896, -56724, -56562, -43143, -9327, 20647, -36134, -58746, -28028, -39784, -52757, -75909, -6719, 4355, -10484, -26781, -36580, -65851, -66661, -13614, -40652, -79987, -83416, -135044, -109973, -59110]
12090e9110q528n8956n0832q152J4997O0628M3412K743j1083l0567k2230k254
12078a29932M903O4483m195o7649J5863J2558J0219J0993M7056Q153N0j2475l9357
12065g9330j4303L561P647L288K8403K2270Q397L1795L2941m0870m8531r052r666
12052f3450J7727K6042p18M4318M746j5464N1409L645l755l2288l8924m1997J6145
12039c2564L6021l9242j5022O05N125O4262L1113p2285k8518j8941O792J5326
12027d7328m6328M7900r082l2790N0319L2994l0759P2411k2717m7315k8672Q2613
12015B1246L4682l9380j1555l865n3905j688J6672k1586L6636M7630Q454M36m464
12002B9313o8677K4777N6704J8420M355k1375p091m6976p2731K6438M4249K6436
$$ y = [-59110, -67638, -126594, -177426, -185578, -170581, -109953, -66541, -63798, -74881, -105448, -127678, -129932, -125029, -60546, -64741, -132390, -116527, -103969, -93750, -82757, -35701, -27548, -27498, -39973, -79330, -93633, -90072, -82425, -79137, -50734, -28464, -20067, 11728, 44669, 3799, -44732, -53784, -63450, -45723, -19681, -20399, 23919, 28665, 13201, 64610, 68255, 64500, 32212, -6712, -48709, -32564, 3457, -35785, -50807, -50202, -45077, 19185, 50298, -21987, -50505, -69446, -62654, -47328, -93656, -45756, -54838, -87628, -37309, -4315, -35074, 37337, 14620, -32695, -61367, 21246, 55928, 16548, 4993, 1128, -52777, -54465, -37793, -59379, -22743, 24887, 33341, 33777, 29313, -39364, -14587, 42117, 60537, 64892, 43517, 36426, -10550, -83281, -56843, -12594, 13842]
11990A3842L1996K0711M5860J6867l1361K2749j3222M513k5241n6197m43j8686
11978A1388Q6j613l3037k8274L301j987O173k8028J4141M6157j0419q3345N8109
11965d7348L6587j291o6375j0192P2711n577l2173K6025L0670J9822j4139n037
11953C683l2547J966l3701n5531j5460M6531N0729K5769n0o1354j5109L2291l0068
11940h2851R646R3583L8342j3488n5484n7633r591M2613K5404k676j7678J8935
11928a0878q489M403j2309J1245r089k7192Q7596N7492n4726j7155m0342p8716
11916i8160J3779Q8031L0591k3179P2523J9639l3518k3372l8726m4636K4170q569
11904b1427j8931J5786n2765k7575O3573J073K5207j8372J0079q4161m8637M295
$$ y = [13842, 45838, 66549, 112409, 129276, 97915, 120664, 107442, 111955, 86714, 30517, 30074, 11388, 11474, 9861, -23176, -51450, -48149, -50136, -43963, -71991, -57850, -11693, -22112, -105457, -47348, -10761, -12052, -78427, -88619, -15908, -21485, -53658, -27633, 3037, 22859, 8720, 3683, -28864, -26898, -60599, -116130, -131590, -85059, -34330, -8561, -8611, -69965, -85074, -52783, -82851, -73205, 20378, 58720, 45232, -10252, -67885, -77476, -34863, -9459, -12135, -29813, -10878, -19367, -14964, -27273, -16028, -25117, -52309, 35287, 92779, 38053, 20898, -19444, -98160, -84381, 3650, 34241, 11062, 83585, 103224, 69706, 46334, 7608, -37028, -12858, -21427, -40358, -24572, -77337, -104912, -41339, -40266, -15059, -33431, -23352, -107513, -156150, -151855]
11892a51855J0977M1662L3155J0105K5946K8732l0486n2413l350O2282M3260N532
11880B3547m5421k8549N7703k9811k5991J8969K8493O7980L0384k1600m1066k2503
11868A2135P321K5310k2490N9718l1264k8507m3342k6243j1848k4991j6069J6614
11856h3656N8169K05k695j5945k1702K7933O8837K8509j4279P450j8635L0263
11844F4454m2084o2104j3519L0551J2971L6305N0592k0075n0554k095p536Q563
11832E469J3004o1607j0449M3789K028o894J2493M0850l8530j7344N4903k257
11820C5455q4564p7949M7621J6116K8700J9654k390j7862l0580P738j927o454
11808f6442O6936N2640J4247j8443q2626n2456M2528L4125j770l0355l1581O273
$$ y = [-151855, -140878, -99216, -66061, -55956, -30010, -1278, -31764, -84177, -87527, -25245, 18015, 23547, -21874, -50423, 7280, -22531, -48522, -29553, -1060, 66920, 97304, 75704, 34638, 12135, 19456, 44766, 22276, 81994, 50730, 22223, -21119, -47362, -59210, -84201, -100270, -83656, -25487, -25282, -27977, -43922, -65624, -37691, 31146, 59655, 45376, 52826, 34191, 64454, 22370, -39734, -53253, -22702, -9731, 26574, 77166, 57091, 6537, 4442, -3094, 5469, 18473, -43134, -53583, -9794, -7766, -14660, -2167, 38683, 153, -17191, 37712, 35455, -49109, -127058, -79437, -63321, -34621, -14967, -17357, -35219, -65799, -58061, -59988, -66442, 494, 53134, 67381, 48938, -33688, -86144, -43616, -9491, -11261, -41616, -73197, -66924]
11796f6924j4368k7865Q39L6114k2007N3855P7568m011k2827J3854J5865l5682
11784D411K5240j8487j1309L6239k3299O1966J1181j1575l0595m1950J4978n0668
11772c3868l0089N4738N6652L2684j480l5181J61l0222o9376K4845K1152J7369
11760G385q595M581k4224J5593m6802m0490j2782p227P5611o118o4587J8096J2878
11747g6681Q624m927J2998l9391L5469N2838Q312O20M752m718l7963r032m775
11734e3874J6206N7457J5436o8262p4608O1251O0327J9955l349k8212K6952m4281
11722a5002K8287l9763l1954L8864J1919j6400j0030L2706J8127R077J2425j237
11710C7019l097K4823P3870L3429k673m5978n2512n5354q753J2028k0861Q5n714
$$ y = [-66924, -81292, -109157, -108318, -72204, -94211, -40356, 37212, 33201, 10374, 24228, 40093, 4411, 29651, 11164, -145, 36094, 12795, 74761, 85942, 74367, 43772, 1822, 16800, -33868, -63957, -9219, 47433, 80117, 78637, 43456, 43617, 13395, -55981, -31136, -9984, 7385, -1210, 3371, -20853, -5260, -52062, -92552, -105334, -112561, -36950, -43068, -107655, -89559, -76681, -68057, -72984, -59986, -99377, -63908, -11070, -2758, -2138, 2614, -2104, -40067, -49099, -53874, -37668, 19789, 35225, -33037, -107645, -46394, 13933, 33888, 30539, 2327, 29279, -15002, 13285, -26478, -58432, -19568, -7649, -24049, -34079, -1373, 16754, 25831, 38256, 37019, 33922, 58745, 132615, 166044, 163371, 117393, 64881, 9527, 774, 12802, -8059, -7974, -13688]
11697a3688l2654n606q408J569O106L5242k3293P8877M39n4839r605K3834k0545
11684b2571k8658J3451J1391J9742L7762m7051j9182J2267N1298m0327j2165J4304
11672i739m0562n8337P0514O8628K1652r766K2331R329o0464m4529L7548M6708
11660E3313L3696q366j710m5884k7808J1598l4813j9233J6451k655j935K3445
11648c901L3833l0853m0882j7424J4012K8209M9611k1435j2045J5472n6676k5668
11636f7747M6455L684m3274l03M8578Q2047m166o5547J4599J5640j7944J7913
11624B9935L9601l2113l3701N369O982n289P526L9642j1877o5048r957k8185K8214
11611b8901O0744L1975m8j3313l6910K1419Q988p2667m1473L1826O5337O4026
$$ y = [-13688, -46342, -51948, -60356, -58787, -52681, -17439, -40732, 38145, 38584, -16255, -25860, -2026, -22571, -51229, -37778, -26387, -6645, 31117, -15934, -35116, -22849, 28449, -11878, -24043, -9739, -50301, -108638, -38124, 30504, 52156, 42390, 64721, 74050, 13586, -30943, 6605, 53313, 87009, 78643, 76933, 31049, 3241, 14839, -19974, -39207, -22756, -25411, -27346, -3901, 29932, -921, -41803, -59227, -45215, -17006, 32605, 11170, -875, 14597, -42079, -67747, -21292, -17608, -60882, -61185, -12607, 69440, 65274, -273, 14326, 29966, 12022, 29935, 69536, 37423, 3722, 9091, 16073, 10784, 18310, 57952, 46075, -18973, -28930, -57115, -28901, 31843, 63818, 63770, 50457, 13547, 34966, 43954, -28713, -70186, -38360, 26977, 91003]
11599I1003l4284l9772l3723k9762m5080n072M6391L2453J5813J1032n6543j494
11587d9038J1408O743Q6043n903l1633j3424q489j5683j3025l7499k8485O191
11575i2794J2921j0041M599N4561M6606k562l222k3773m6317l506L2407Q5384
11563E4263l3275n4275j5075N6571m638k7785N961N2802P7269m6446m0448L3707
11551E8631L4489l328n719l4171L119M5582K8248j2559P882l2588n6435J4591
11539D7742N6484L7374K959k937n643n468n7327k2849n5449m6404N3191J1878
11527A3551k501K4265m6192k7997p33L0958l162J4695k0834O7176N2368L0637
11515A32231k3546j1841N0383L283J0417r650m639R357L9990k5002J1166k9143
$$ y = [91003, 56719, 16947, -16776, -46538, -91618, -96690, -50299, -17846, -2033, 8999, -47544, -49038, -37630, -30887, 55156, 49253, 17620, 4196, -4293, -19976, -33001, -70500, -98985, -92794, -79873, -89914, -85315, -30754, 15852, 13290, 10068, -13705, -60022, -63528, -31121, 54263, 20988, -33287, -48362, 8209, 3571, -24214, -18253, 34549, 111818, 65372, 24924, 58631, 93120, 89792, 84073, 49902, 53021, 98603, 126851, 114292, 122174, 89586, 33151, 47742, 104226, 141600, 144559, 141622, 135979, 130511, 73184, 50335, -5114, -51518, 1673, 13551, 11050, 35315, -10877, -38874, -39607, -8649, -11811, 2884, -17950, 49226, 101594, 132231, 108685, 96844, 147227, 150510, 160927, 151277, 146638, 155995, 195985, 170983, 182149, 153006]
11503A53006k7638m57k2575r622P4958J2659j3012L0574L58k7703M3797M1622
11491B55967M9880M7621L2743k273J6532k8481J4897o232m3464Q0505O3778J4908
11479D96381M8064J4354k4619n8324k5344p780l575J1234N0567m4485m8973J6978
11467D24478J2592l1486J98L4871M3572J4939o5032j3399L4352K548M6795O3762
11455E68190R146k6066j2949J5864M698N6094k0438J2838k236j3327K9761j8535
11443F03040p6077n5109k6141J0949m1732n9098n93L625L3662L1252m3458P445
11431C87765J9030M3096J6369k2193m61J8147m4250q964M9101J5276l1250j2256
11419D29410j1601N0951j203k9N5424o3420p8870o0971J7647J5949o5482l0198
$$ y = [153006, 125368, 124911, 102336, 92714, 167672, 180331, 167319, 197893, 198251, 170548, 214345, 255967, 305847, 353468, 386211, 383938, 400470, 371989, 386886, 380654, 337190, 417695, 481473, 496381, 544445, 558799, 534180, 475856, 450512, 442732, 439157, 450391, 500958, 456473, 407500, 424478, 437070, 405584, 405782, 440653, 484225, 499164, 434132, 420733, 455085, 457633, 504428, 568190, 577336, 551270, 538321, 554185, 558883, 614977, 594539, 607377, 605141, 591814, 621575, 603040, 526963, 471854, 445713, 456662, 414930, 355832, 355239, 358864, 392526, 423778, 380320, 387765, 406795, 449891, 466260, 444067, 443606, 461753, 417503, 408539, 457640, 472916, 441666, 429410, 417809, 468760, 467557, 467528, 522952, 459532, 380662, 319691, 337338, 353287, 287805, 257607]
11407B57607J7738m969l9752L994n227J4857q9620q0979J8676M9705k6174Q952
11395A24808j1467O515K918j8440R855L0938J8267K6922l0144p4519m0944L5346
11383H0055k1385l159m7763J5049l221l541Q3898M1476l1759o5832j4858N9934
11371H8894N413r090o9328J2344N143k4756j9423J1356j5079l421J4059J2276
11359H388M1793j1020J7301k8835O197K9461k5029l2281k9291K1840J1950M1450
11347E1924J5910o3438j325K8421M2770R93L1108k8595j3019k0174k7980M6132
11335F2727j5774m6399n4765L9848N0438N6782l7002r221L0570L3002o2578q0802
11323c3174n7717L7182N0617N5013l2088J7619n28j1499m3555J2008L9756l2189
$$ y = [257607, 275345, 270376, 230624, 234618, 229391, 244248, 154628, 73649, 92325, 142030, 115856, 124808, 113341, 119856, 122774, 104334, 114189, 145127, 163394, 190316, 160172, 85653, 44709, 80055, 58670, 55511, 7748, 22797, 19576, 16035, 99933, 141409, 109650, 43818, 28960, 88894, 94307, 85217, 15889, 28233, 33376, 8620, -10803, 553, -14526, -17947, -3888, 8388, 50181, 39161, 56462, 27627, 33824, 63285, 38256, 5975, -23316, -1476, 10474, 51924, 67834, 4396, 3071, 31492, 74262, 75255, 106363, 77768, 64749, 44575, 16595, 62727, 46953, 554, -54211, -14363, 36075, 92857, 55855, 46634, 77204, 110206, 47628, -33174, -90891, -53709, -3092, 51921, 19833, 37452, 36924, 25425, -18130, -6122, 33634, 1445]
11311A445l4402k5311k3239J7076K5120O0688j2124n7108M9624m615l306M6950
11299D0798m909K9970J1919O6127J3342k6599k0628l069l1849n255l5596n619
11287B8632M5395L690O614j4724N188L6644j0993j1259K8963l9700k8005n9182
11275h737m5146J1261M3730R1762N4101k7921l4303l9097l2696n19M1684L1165
11263H5284k8998L9545K4494m659j3948L5591j4132l8336j0406J8812J7420K5256
11251A35923k2127k8965j6740o036K617m2560l1598J9389K0927M4466J5829j7620
11239G3505J2140L9100J4104N9443K9958o3947j22250l3447o641K7381N7971L8897
11227A26214m0636n0488K9773l0678k7169L652j0334k3048K3049O2503M5445k9351
$$ y = [1445, -32957, -58268, -81507, -64431, -39311, 21377, 9253, -47855, 1769, -2846, -6152, 40798, 35889, 65859, 77778, 143905, 157247, 130648, 110020, 106951, 75102, 69847, 34251, 28632, 74027, 77717, 84331, 69607, 74795, 111439, 100446, 89187, 118150, 78450, 50445, -8737, -53883, -42622, 1108, 92870, 146971, 119050, 84747, 45650, 12954, 12435, 54119, 85284, 56286, 95831, 120325, 115666, 101718, 137309, 123177, 84841, 74435, 93247, 110667, 135923, 113796, 84831, 68091, 62055, 64672, 22112, -9486, 9903, 30830, 75296, 91125, 73505, 85645, 124745, 138849, 198292, 228250, 164303, 42053, 8606, 1965, 29346, 87317, 126214, 85578, 35090, 64863, 34185, 7016, 10668, 334, -22714, 335, 62838, 108283, 78932]
11215G8932K5906M2819k3990p6456k3867j7208l7112J0529L8560k6332j9616L7248
11203I413J3965O372K8951l3024K4029m3711k6010n496j5044q6872J3326P7204
11191c6897K1807l826m775q456J6349J5096M0468J516m5904j1725r594q346L6459
11178B172O9029k8218o6581L6953N303j8743N5765O2617j6346k6390O583m82m5360
11165C6302j9895j5090Q9684N579J8934k7745j2878j0116J9270L7603L243r193
11153A15698p5116q1742k9611J7350N1931J1860L7741L8367J5524l1911k7648
11142D2443O845J4711K6205l4281n2900q100K9650k3961J184k0658N3298J0145
11130D4581K1720n4405J8179M684j7484l482j4398l7683p786L2038J06160M5732
$$ y = [78932, 104838, 147657, 123667, 47211, 23344, 6136, -30976, -20447, 18113, -8219, -27835, 9413, 23378, 29750, 58701, 25677, 49706, 5995, -20015, -25511, -40555, -127427, -114101, -36897, -15090, -18916, -23691, -32147, -15798, -702, 39766, 41282, -4622, -16347, -25941, -34287, 2172, 71201, 42983, -23598, 13355, 18658, -85, 55680, 118297, 101951, 75561, 82144, 81662, 36302, 16407, 1317, 91001, 96580, 115514, 87769, 74891, 64775, 84045, 121648, 124891, 115698, 40582, -41160, -70771, -53421, -1490, 10370, 48111, 86478, 102002, 70091, 42443, 49288, 63999, 90204, 55923, 3023, -5077, 24573, 612, 1796, -18862, 34436, 44581, 66301, 11896, 30075, 34759, 17275, 13793, -605, -38288, -46074, -14036, 92124, 137856]
11118A37856m5543m906J2490k5925j9056M5867J5199q7610k1967M3583P079n7671
11106f04Q276M4365K8375J78m2244K3502L3355J5345m878j6600r3476M0759J7965
11093E4318J64J4080O1595J3491q0181m3806P386O442J8971k3625K4331L0398
11081H3564K2951l5541J4291n6335r2987N058O4793J1092L866K1507j4753J3292
11069D0798K1555K5318J0153k4487j4133K3523j6597L1769N115k2072l8605m5740
11057c403k8127K7954j7656j272M4970N3814J3953l9048j3512K0854l7167M0956
11045F2316J31810O032l2066k1438k50r026L6648J8588l2125r766M7788R2299
11033B90810P9710Q89q3573l8274j298l9836l5000N3490J7717J3174N4835P4783
$$ y = [137856, 92313, 87407, 99897, 73972, 54916, 100783, 115982, 28372, 6405, 49988, 57067, -604, 7672, 52037, 80412, 80590, 38346, 61848, 95203, 110548, 105670, 89070, -4406, 36353, 54318, 54482, 68562, 130157, 143648, 63467, 19661, 27047, 33489, 52460, 28835, 53166, 83564, 106515, 70974, 85265, 28930, -64057, -58999, 5794, 16886, 20752, 42259, 27506, 40798, 62353, 87671, 97824, 73337, 59204, 82727, 66130, 97899, 103014, 80942, 42337, -3403, -31530, -3576, -21232, -22504, 22466, 76280, 90233, 51185, 37673, 58527, 21360, 62316, 194126, 200158, 168092, 146654, 146404, 137378, 174026, 192614, 160489, 150723, 198511, 290810, 370520, 371409, 287836, 249562, 248264, 208428, 173428, 226918, 244635, 257809, 312644, 387427]
11021C87427L2226q69J321n6463k8259j2882l7541l1598r557M2328p693K40O6912
11008C45592L0819k6589j5535o4830n5824l2249k8146M6583N1556p0333k5888
10997A55156p845O704M6359k4727m0923o2101k3038O0928L7047K472l3291q983
10985A07758m5092l6008k8214m2949J996Q5878n508M898m627l4245N3228K3067
10973H0182l3025m3809m2186N2602M7880m122L5463J3367k1558L434k9314k299
10961E6615J8489l4232m7923L2877K7894P142P73l5532j2970K1286M2968K518
10949G9905l6334l858N066R120J006J8073L9347m1063l9999m7945J4192N6472
10937E3982J6173m9267L1020N9239L7824j2819K7335k2772k4656j4035k4672l9084
$$ y = [387427, 419653, 418784, 420105, 363642, 335383, 322501, 284960, 253362, 243805, 286133, 278440, 278680, 345592, 376411, 349822, 334287, 269457, 213633, 181384, 153238, 199821, 251377, 181044, 155156, 147311, 154015, 200374, 175647, 134724, 72623, 49585, 110513, 147560, 150032, 116741, 107758, 62666, 26658, -1556, -44505, -42509, 43369, 37861, 42759, 38132, 3887, 57115, 80182, 47157, 3348, -38838, 13764, 61644, 57522, 92985, 106352, 84794, 88228, 58914, 56615, 75104, 40872, -7051, 25826, 53720, 60862, 61635, 26103, 13133, 34419, 77387, 79905, 43571, 39713, 44779, 53899, 54905, 72978, 112325, 71262, 31263, -16682, -2490, 53982, 70155, 20888, 51908, 111147, 148971, 136152, 163487, 140715, 116059, 102024, 77352, 38268]
10925C8268K7029O0193l6378M479l5724k915j7984k6242L9531p283n4592Q288
10913c330P8396J5795K139l1625j1132K854M2978j8683m8274n8950K9545j1971
10901a2258k5561R0879O8844K571j4830j367O961k1391m5545l4683K6030J7825
10889E7475m9111o94O760K9651O5043L2360k2497j7774n8713l5405J2943J3761
10877C3799J9050R9899N2942n4878r0183m1783l3242J2192M0641j6417k9285j1383
10865a8648K614N2968N3886J066J7413n84J0667N3651o2539n7488M2738P80j762
10852I4762J6385m4359l3667N9357J236p732J3368m4190j2279M4383R1004N0218
10840B28486K3340k7721R275p5232p9791N186k2759K986Q0021P647p1864J8123
$$ y = [38268, 65297, 125490, 89112, 93591, 57867, 54952, 36968, 10726, 50257, 42974, -11618, -3330, 75066, 90861, 93000, 61375, 50243, 53097, 96075, 77392, 29118, -29832, -287, -12258, -37819, 53060, 121904, 124475, 109645, 108278, 115239, 93848, 48303, 13620, 39650, 57475, 8364, 7670, 14430, 44081, 109124, 141484, 118987, 101213, 42500, 7095, 20038, 33799, 52849, 152748, 205690, 150812, 60629, 18846, -14396, -2204, 38437, 22020, -7265, -18648, -16034, 36934, 90820, 91886, 109299, 108715, 119382, 173033, 110494, 53006, 95744, 96524, 94762, 111147, 66788, 33121, 92478, 93714, 85982, 99350, 55160, 42881, 87264, 178268, 228486, 251826, 224105, 233380, 158148, 78357, 83543, 60784, 63770, 143791, 151438, 79574, 97697]
10828I7697L3076j4533K9835l3854q941M2709N4131k6536j214l6876j02127k6950
10816F417R3045J9066j2799K6425M4234p780J159K2823l8005m3436K7068l0122
10804A08095p985L7007J6865J232J8147Q607r380m3333p909M5085K6916l8475
10792A54872j6877o024N7828N963J4755N255j08151m9751J6684J5068p574J9526
10780A01574J01841N8493m0004l5513J8248n86m6189j09617L404Q1696O3794m539
10768A92602o097r244P689J6329Q819O245M4002j0807j1624k9016Q213L9386j9309
10755B37188m0525J9874N34k1604N067n4454K1626J1314K3347j0804m0607p1609
10743G9347j9260N5934J4571O0l6524K7568K9236O4939L4978m3411o869k3928
$$ y = [97697, 130773, 116240, 146075, 112221, 103280, 145989, 200120, 173584, 172370, 135494, 33367, 6417, 99462, 118528, 105729, 132154, 176388, 168608, 169767, 192590, 154585, 111149, 138217, 108095, 100110, 137117, 153982, 155214, 173361, 181968, 172588, 129255, 121346, 166431, 193347, 154872, 137995, 131971, 189799, 195762, 210517, 215772, 107621, 57870, 74554, 89622, 82048, 101574, 203415, 261908, 221904, 186391, 204639, 204053, 157864, 48247, 51651, 133347, 197141, 192602, 186505, 177261, 184950, 201279, 210098, 216343, 260345, 249538, 237914, 208898, 217111, 256497, 237188, 196663, 216537, 217071, 195467, 200534, 146080, 167706, 179020, 202367, 191563, 150956, 79347, 60087, 116021, 130592, 130652, 94128, 121696, 150932, 215871, 250849, 207438, 200569, 176641]
10731A76641K6095J8160m5201J9017J5103K9624M7664m619J083n1907J6921M7968
10719B96549L6987k2518J2125L4004O870Q40k8708k8203m2917K6497j6039j6834
10707B58653m4187o28L6267k625o5442j2801O6661K1009l9925K8564o306j3131
10695B26109J1507L5102Q213k1148L9122J3825J814M4696P037n195j3788j3855
10683C33439J5364J1533m1050N8301Q56p0845L8561O4210k1931K6292M6484L5280
10671D96494k0073n5423o2660O6922N5964o316P441j9607K0904M4105M7523L6644
10659F11918j827k8294k6186L3132k3025j4828L78N0216K4832L0683L0752Q0179
10647G67930Q9688m1167o7892j4452K8824M4800J03526P2770J3538K2489Q1064
$$ y = [176641, 202736, 220896, 175695, 194712, 209815, 239439, 287103, 282484, 283567, 231660, 248581, 296549, 333536, 311018, 323143, 357147, 364017, 364857, 336149, 307946, 265029, 291526, 275487, 258653, 214466, 213838, 250105, 247480, 182038, 169237, 235898, 256907, 216982, 245546, 239240, 226109, 237616, 272718, 280931, 259783, 298905, 312730, 314544, 359240, 366277, 361082, 347294, 333439, 348803, 360336, 319286, 377587, 378443, 307598, 346159, 410369, 388438, 414730, 461214, 496494, 476421, 420998, 358338, 425260, 481224, 474908, 482349, 462742, 483646, 527751, 575274, 611918, 610091, 581797, 555611, 588743, 565718, 550890, 551268, 601484, 626316, 656999, 687751, 767930, 857618, 816451, 748559, 734107, 762931, 807731, 911257, 984027, 997565, 1020054, 1101118]
10636A101118N9392N1504Q5018J24278J19549R3750J58275J57364J52531J87077
10626B289856J63752K12208K97266M10261N85553P03781Q52321J219057J603434
10617H337489K163791K732428L183389L068707K066354O85108k75267n63799m78716
10608B0919484J44808J042298K244381L707839N250219O281082N620064K903915
10600D8114090m91617k727124l320647k785071j403723L63740K244723M476310
10592D4470681O657053P715029O224013J690735l316324o197667o806327n873454
10584D4563739m245757k381673m26460J473821L096199L701566K395998o74038
10576D7503395l853183n559424n659844m820642l564846k290616j063067m7830
$$ y = [1101118, 1160510, 1212014, 1297032, 1421310, 1540859, 1634609, 1792884, 1950248, 2102779, 2289856, 2453608, 2665816, 2963082, 3373343, 3958896, 4662677, 5514998, 6734055, 8337489, 10501280, 13233708, 16417097, 19485804, 21552158, 22237266, 21961999, 21398200, 20919484, 21064292, 22106590, 24350971, 28058810, 33309029, 39590111, 45210175, 48114090, 47622473, 44895349, 41574702, 38789631, 37385908, 37749648, 39994371, 44470681, 51127734, 58842763, 65066776, 66757511, 63441187, 57243520, 50437193, 44563739, 40317982, 37936309, 37509849, 38983670, 42079869, 45781435, 48177433, 47503395, 43650212, 38090788, 32430944, 27610302, 24045456, 21754840, 20691773, 20643943]
10568B0643943M76446O08998O9697j166601k345744k956110k891526k556289k161062
10559G721752j650321j192987r75325p62520n96469m56952l03763k77202k29613
10550A276600k33447j85685j76222j46489j07852n7508n4954l0149l2527j8776
10540B32991o6685j5834j1190o9014l1812J9830P297j0908l7641K2936J7532Q153
10528F5655P58O3088p470m5460O085J9171r8235n1919m660J4920n4155l2254j0070
10515a34546M504K2008n1425J786N5458O0764l7105l4869K6921n7809k4761L0614
10503a38460N9170O0903j3450m898m0175k0136j5519l9800q681M4635J276K9919
10491h5216L6082n3003q0278j6120p641O0036R582O7535J7952l9474j5127l9866
$$ y = [20643943, 21120389, 21729387, 21799084, 20632483, 18286739, 15330629, 12439103, 9882814, 7721752, 6071431, 4878444, 3903119, 3140599, 2544130, 2087178, 1783415, 1506213, 1276600, 1043153, 857468, 681246, 534757, 426905, 369397, 314443, 284294, 251767, 232991, 166306, 150472, 139282, 70268, 38456, 58286, 65583, 54675, 17034, 39970, 57502, 65655, 66413, 129501, 122031, 76571, 82656, 101827, 3592, -48327, -52987, -38067, -92222, -124476, -134546, -130042, -108034, -159459, -157673, -102215, -41451, -78556, -113425, -86504, -144313, -169074, -138460, -79290, -18387, -31837, -36735, -76910, -97046, -112565, -152365, -161046, -116411, -115135, -85216, -49134, -102137, -182415, -198535, -206176, -146140, -136558, -69023, -51071, -90545, -105672, -145538]
10479a45538P454N520j5666n395o184p7058O0297K7286M5195K0287L7220k0269
10467f6851k4774o7283K3790M7319j1069k6457K3508J2150k1795j8010k8633l3913
10455a92018N3683M1964M2084J92j8400M5550k2058Q763k345l5056j03110m0063
10443b20814J9599N077O1194R5917P5409l3919o6787k900m0085J2269n6092l7105
10431a88237j8069r275L6686N4697N5047J0011J6328j6577l583j4462k8449n373
10419a11256l8997N6440K6241m6981n4851j0189L5057K1520K7015K5145n9665
10408a30521K4884j5265q714n51l2844m1594K997O6463M4645K6145o9378j6324
10396a50057O1748J6887K446r368J3571R993n9468p1177N1015P6417j2135k0611
$$ y = [-145538, -138084, -132564, -148230, -153625, -159809, -236867, -176570, -149284, -104089, -83802, -46582, -66851, -91625, -158908, -135118, -87799, -98868, -125325, -101817, -89667, -111462, -129472, -158105, -192018, -138335, -96371, -54287, -54095, -72495, -26945, -49003, -40240, -42585, -77641, -180751, -220814, -201215, -196138, -134944, -39027, 36382, 2463, -64324, -67224, -107309, -95040, -151132, -188237, -206306, -215581, -178895, -124198, -69151, -59140, -42812, -59389, -62972, -77434, -105883, -111256, -150253, -93813, -67572, -114553, -169404, -179593, -144536, -123016, -96001, -70856, -130521, -105637, -120902, -129616, -130167, -163011, -204605, -201608, -135145, -90500, -64355, -133733, -150057, -88309, -71422, -68976, -78344, -64773, -54780, -114248, -185425, -134410, -57993, -70128, -90739]
10384i0739j8364K5927K7634L830l7958o0475k1024L5347P2907K5609l046j3429
10372e3781l6276N214P2606J1229r264l4084o6907R27O474o223j9804O5157J3969
10359e0763p9893J1604K6354n2752l0053R43L0721K5647O6707j4732n0791m3561
10347a60569o568J9622J7839r742j8590p773J7390L1056J1547J2566j251L5127
10335e9346N893L3508o72n3603K2377j0623l8095L1410k9645k6210l1905k6190
10323a83101N3328L4465L5539K9000K8239L4036m5394n7455J3555j4776J7980
10312e4584k1964K5678L907k9371l4553M1201J1531K1941K9268k404N753l1890
10300c5487m5528k7555L4976o049m6010J2111O8783K1868j6680k3911K5240m4524
$$ y = [-90739, -109103, -83176, -55542, -51712, -89670, -150145, -171169, -135822, -62915, -37306, -40352, -53781, -90057, -84843, -12237, -1008, -10272, -44356, -111263, -110336, -103862, -110085, -129889, -64732, -50763, -130656, -119052, -92698, -145450, -175503, -174560, -143839, -118192, -51485, -66217, -117008, -160569, -167137, -147515, -129676, -139418, -158008, -165781, -148391, -117335, -105788, -93222, -94473, -59346, -53453, -19945, -20617, -74220, -51843, -62466, -100561, -69151, -98796, -125006, -156911, -183101, -129773, -95308, -59769, -30769, -2530, 31506, -13888, -71343, -57788, -72564, -54584, -76548, -50870, -46963, -76334, -110887, -69686, -58155, -36214, -6946, -9350, -3597, -35487, -81015, -108570, -73594, -79643, -125653, -113542, -44759, -22891, -39571, -63482, -38242, -82766]
10288h2766p7509L0195o0714o249Q3328K0166L4987O0825J1827o2265k8489O203
10276g0461k9281K8892J3138q019j8621L9324q371L5658k4136L0835j3948k0479
10264d5469k6784N376K7302n464j0568j070o061j6404k1104K0865K0305j4805
10252g3881k6990o226k8661l110M630r663N5683M3411N1276O949m9445m7234R281
10239g3980J8458L6731j6146L0144L6716o1621n8198K775M7805K6408J9935p651
10227A376m8933K2138O9100l212n9024j02580n2637j2479Q237N9460K5531k871
10215i5894K3722k8323P455k6517m7001k195Q1981R6578M2877J5030J8300n0889
10203C5124p0446p553j1086L1897n876j2135K3895J2169n3527m890N8480p4245
$$ y = [-82766, -160275, -130080, -190794, -197043, -113715, -93549, -58562, 2263, 14090, -48175, -76664, -70461, -99742, -70850, -57712, -65731, -84352, -45028, -53399, -17741, -41877, -11042, -24990, -45469, -72253, -66877, -39575, -45039, -55607, -56677, -62738, -79142, -100246, -79381, -59076, -73881, -100871, -107097, -135758, -138868, -134238, -143901, -88218, -44807, 6469, 13418, -36027, -83261, -73980, -55522, -18791, -34937, -4793, 31923, -29698, -87896, -85121, -37316, -10908, 9027, 1376, -47557, -25419, 43681, 40469, -18555, -121135, -173772, -186251, -178014, -118554, -93023, -95894, -72172, -100495, -93040, -119557, -166558, -168753, -86772, 9806, 52683, 67713, 86013, 35124, -35322, -42875, -53961, -22064, -27940, -40075, -16180, -4011, -57538, -62428, -3948, -78193]
10191g8193r147K0241O2571R3040k4333q6332J5734L9618J9096j8461J1739J5608
10179F1181L5260K3315j111n5008j3217K3832O725J518l3551K3551P5815N9701
10167B08011M2751J3383q0962m1538J0812L3916O4759P845K115M439j8734M711
10155B51508N5314O194K5685l8190l8118m4703R876o12q285p0290j553L1537M6462
10142B24825R043K0703n7522m4949m4840Q177k1398J2451K3087m7916q1603J0225
10130A0283L3054M3857J9295k2311Q631k6903q6781j8572k8587K4600O6063J7384
10118D0013o029P052m2562l3846l6472j241L0558M6989K4795k5075m5727j9648
10106f1193N7764J05204J1422n8710j2501Q604K1288k2589J5766l0498p0634k0048
$$ y = [-78193, -87340, -67099, -4528, 88512, 64179, -22153, -6419, 33199, 52295, 33834, 45573, 61181, 96441, 119756, 118645, 63637, 50420, 74252, 80977, 82495, 48944, 72495, 148310, 208011, 250762, 264145, 183183, 141645, 152457, 186373, 251132, 258977, 261092, 265531, 246797, 251508, 306822, 313016, 338701, 300511, 262393, 217690, 227566, 226954, 218669, 148379, 146826, 178363, 224825, 233868, 254571, 197049, 152100, 107260, 115437, 94039, 106490, 129577, 81661, 58, 10283, 43337, 87194, 106489, 84178, 92809, 65906, -20875, -39447, -68034, -43434, 22629, 40013, 33984, 41036, -1526, -35372, -71844, -73085, -42527, 4462, 29257, 4182, -41545, -61193, -3429, 101775, 113197, 54487, 41986, 50590, 71878, 49289, 65055, 34557, -36077, -56125]
10094e6125O3557K3981k7896K1894J2836q1096k8985L9317m8737J7506m670J3294
10082e5124J332K5251k2221l2785k8337m27j1874j3175r662L0198O5879K8150
10070b2795j0016L7620k6462o964k4049m7857j188N2593Q6783j7569J1916K1318
10058E3330k7044k6798j0201m0409k5231K2735L8185J1491k7143j4203l3220n610
10046h4118m89N162P515L5277J467N2866j4566K3260J6246j6984p5685l6759J479
10033h5329K5607j4602P013m060k5224k8262j7220L3362N4275M421l0413L4586
10021d5846Q219l3375j6771K5496P09K9455r654k4270m3242P4156J8260Q863l1166
10008c9166r932N6459J7484N791k2744l6423m3288L7637L5174M67j1902n9300
$$ y = [-56125, 7432, 31413, 3517, 25411, 38247, -42849, -71834, -32517, -81254, -63748, -68418, -55124, -53792, -28541, -50762, -83547, -111884, -112311, -124185, -137360, -147022, -116824, -50945, -22795, -32811, 4809, -21653, -28617, -52666, -100523, -101711, -49118, 37665, 20096, 32012, 53330, 26286, -512, -10713, -51122, -76353, -53618, -15433, -3942, -31085, -45288, -78508, -84118, -84607, -79445, -71930, -36653, -35186, 17680, 3114, 26374, 42620, 25636, -50049, -86808, -85329, -59722, -74324, -67311, -71371, -96595, -124857, -142077, -108715, -54440, -50019, -80432, -45846, -37627, -71002, -87773, -62277, -61568, -32113, -41767, -66037, -109279, -35123, -16863, -8000, -39166, -49098, 7361, 24845, 30636, 7892, -28531, -71819, -34182, 992, 1459, -10443, -69743]
9996f9743J8842p424j0391j9251K0058O422K817m2310J9999N2808J1878K6369
9984A0074K3718k5969j1728j2862k1375j4095l2827J6906m571J8392N4477K8026
9972B8166k3586l9799K9280K0564j01458n4478N1734j2551Q556K2035J3203K0336
9960c7998n5574P687M4729Q1169j3987j6766n7212j860P6804K2554k4041p608
9948A7897j3312q397J7695n0775p936L6907R310l5345l0891j9878M9656L4081
9936i88L129J8079K6177k958o6663k8742Q97j2221L7659O3465q878j9188k9345
9923a9577r519J7615j1558p5173n833L8985r687J5218P4328O018k9357l6345p022
9910e1907M1128q377k0663j6272O0686K0230k3474O931m1943j6768K4568q77k8068
$$ y = [-69743, -50901, -58325, -68716, -87967, -67909, -61487, -58670, -100980, -80981, -28173, -16295, 10074, 33792, 7823, -3905, -16767, -38142, -52237, -85064, -68158, -72729, -54337, 140, 28166, 4580, -35219, -5939, 14625, -86833, -141311, -89577, -102128, -93572, -71537, -58334, -37998, -93572, -85885, -41156, 40013, 26026, 9260, -47952, -49812, 26992, 49546, 25505, 17897, 4585, -3812, 13883, -36892, -44828, -7921, 1389, -33956, -64847, -84725, -35069, -988, 2141, 20220, 46397, 43439, -23224, -51966, -51069, -63290, -25631, 37834, 28956, 9768, -19577, -29096, -11481, -23039, -98212, -104045, -65060, -74747, -59529, 14799, 20817, -8540, -44885, -51907, -10779, -19156, -39819, -56091, 4595, 24825, 1351, 8282, -33661, -50429, -25861, -26738, -54806]
9897e4806N9663K9849m2466J0560j5336J3802M5101q730m5326k944l4791l79K9899
9884a5904P603k7175n9966J6970M6411j0695l4883Q816J885K5941m5971k8502
9872a15470L7047J5868k9050Q452k4311m662K1649M5745J8587J3322j9209J8032
9860a4000m0775m0292q272Q6333K2942q703K83K6095L8410n947l3619M6211P4809
9847A43475l6677q3144j8496K931K0457L3391q2002l5861K3854l664O5072R3672
9835A23008k7848o4183r949M3698M891q963q2302k6560K6481K1452j0337J4983
9823D371M9028Q0470P261k5522n5444m7996J0470J3036k1058k2531N798J5717
9811A3600J4796q332r7817m4148K9936N4828O097k368j8519m566N7490K6257m0530
$$ y = [-54806, 4857, 34706, -7760, 2800, -12536, 1266, 46367, 37637, -7689, -10633, -45424, -45803, -15904, -8301, -35476, -95442, -78472, -32061, -42756, -77639, -68823, -66938, -40997, -86968, -115470, -78423, -62555, -91605, -83153, -107464, -112126, -90477, -44732, -26145, -12823, -32032, -14000, -54775, -95067, -103339, -17006, 5936, -2767, -2484, 23611, 62021, 56074, 22455, 68666, 143475, 106798, 23654, 5158, 8089, 28546, 61937, -20065, -55926, -32072, -35736, 29336, 123008, 95160, 30977, 21028, 64726, 69617, 60654, -21648, -48208, -21727, -275, -10612, 4371, 53399, 133869, 141130, 115608, 60164, 12168, 22638, 35674, 14616, -7915, -2117, 13600, 28396, 20064, -77753, -121901, -91965, -37137, -31040, -33408, -51927, -56493, 997, 27254, -13276]
9798a3276M123K8162j3739j3415N6651L0931m8579n8539l0783k7718L1085J4502
9786d0595j0214J3956j5151j6767l0050k171K0632K4608j330k0879J7722N0757
9774i482R181L7610q541r7716m060M4617M4183l3997N6963R4886j7438j02850
9762A3356n3085L1821K1510J2544j4372m2674m8530m3224O931O2330P4657N3757
9750G5021l774j6929j1344j1923M8769J7966o4417m1049o2189k2688J7180M3215
9738c2162M6670K9629k4645l4800K6984j5501n452J1413M4931k0104j7916M998
9726A4045r018k0082j5322k7897R840J4002M4146j1611k5495Q09l7018l5352j8570
9713a17523K8512N6687K6676m8795L6414L8039J1055j7771l5980k923k3481l141
$$ y = [-13276, -9153, 19009, 5270, -8145, 48506, 79437, 30858, -27681, -58464, -86182, -55097, -40595, -50809, -36853, -52004, -68771, -98821, -100992, -80360, -55752, -57082, -77961, -60239, -9482, -301, 37309, 28768, -68948, -73008, -28391, 15792, -18205, 38758, 133644, 116206, 13356, -39729, -7908, 13602, 26146, 11774, -30900, -79430, -122654, -115723, -53393, 21264, 75021, 71247, 54318, 42974, 31051, 79820, 97786, 33369, -7680, -69869, -92557, -75377, -32162, 14508, 44137, 19492, -15308, 11676, -3825, -9277, 2136, 47067, 26963, 9047, 14045, 5027, -15055, -30377, -58274, -48434, -34432, 9714, -1897, -27392, -26583, -63601, -98953, -117523, -89011, -32324, -5648, -54443, -18029, 20010, 31065, 13294, -22686, -25609, -49090, -52231]
9701e2231k5769K6407P0018J1270k7191N478K9950l0312m1253M6261L7578l0590
9689A9616m7472P2698M4923q367o5741j20359l8515K8863m41k4223N5910M2822
9677d0286N944j1189n3209L1908k5170N2831M5554j4788J6320J5629k2273n152
9665c881j921M4024o577k3787k8395l4313L8667k2063L7288M8619K4800K2879
9653I5340J6668k0901O1169Q5392J19841K01744L56722L06052j04533k95076k15047
9642F07371j52009j62991j19262L0388J1921p8897n7292k852J1256l633m2231
9631D1769k0919M49n4297n3990L7k7948k2140M9727j9382R87n2284j815L0573
9618a29233Q635N5634L6525j411Q021O513K869M4838k691m5117J88j9476N475
$$ y = [-52231, -78000, -51593, 18425, 29695, 2504, 7982, 37932, 7620, -33633, 12628, 50206, 19616, -27856, 44842, 89765, 81398, 15657, -104702, -143217, -114354, -114795, -139018, -83108, -40286, -34342, -45531, -98740, -66832, -92002, -39171, 6383, -8405, 7915, 23544, 1271, -3881, -5802, 38222, 31645, 7858, -20537, -54850, -16183, -38246, -958, 47661, 72461, 95340, 112008, 91107, 152276, 237668, 357509, 559253, 915975, 1222027, 1117494, 822418, 607371, 455362, 292371, 173109, 203497, 215418, 136521, 79229, 76377, 87633, 84000, 41769, 20850, 21299, -32998, -86988, -86951, -114899, -137039, -87312, -106694, -105707, -157991, -159806, -129233, -120598, -64964, -28439, -29850, -21829, -15316, -12447, 32391, 29700, -15417, -15229, -34705, -29230]
9605b9230n8464r3249M0247O8915k7705k451n248j7978M3585M8654J3712j3276
9593c2488K1558k4812n5738N7945R236k5181K4979L5240m4023j1632L7431J4480
9581F995n2044j065j4558J626j1785K7507P3726N3118P230m4526n1345J5582o473
9568C988j9790m0752k6078M5881Q1420o0484o6860J5962N9048M3990k204m3894
9556i773l7639k4292p853J2555j6079j8326j4626m4348K2078L9259K2614K1357
9544e5073o611J5336k303K5586M2106j90l4209j6416M852j1798J8246m745J2147
9531a3072K3619m9808j300K0284N915K5682L4721l4770L532K4863J6306l1276
9519B4696K685j5032j2630K1917n56K843L3896K4883k4782l6408n9417n2710j6583
$$ y = [-29230, -87694, -180943, -140696, -71781, -99486, -101937, -107185, -125163, -81578, -32924, -19212, -32488, -10930, -35742, -91480, -33535, -24299, -49480, -24501, 10739, -33284, -44916, -7485, 6995, -45049, -46114, -60672, -59046, -70831, -43324, 30402, 83520, 90750, 46224, -5121, 10461, 3988, -15802, -56554, -82632, -36751, 44669, -15815, -82675, -66713, -7665, 36325, 34121, -9773, -47412, -71704, -79557, -67002, -83081, -101407, -116033, -160381, -138303, -99044, -76430, -55073, -61684, -46348, -48651, -23065, 19041, 18851, -15358, -31774, -26922, -38720, -20474, -25219, -13072, 10547, -39261, -40561, -20277, -14362, 11320, 46041, 11271, 14803, 39666, 55972, 24696, 27381, 12349, -281, 21636, 21080, 23923, 57819, 82702, 57920, 21512, -37905, -90615, -107198]
9506a07198l7350R149K367O0073N4455l3655l0738J349J410M1824k459n3586K3074
9493g1285M6203q47J3998M5885J5056l6066k5889J5805r550O411J881j914N5184
9480E4872J9207l6028M3773j3963l7741k0483j6197P393k995K3528L121j2696
9468A1791J2280K9740j9619R658M9370J1935K4167j5665p1251r331K0915l8040
9456A5950k3818m1915j1280L7297O10K2025k3686m704J0253k3163L2616J8717
9444H902m1061j6092l8666M0949L5376L5203L64k2194n748J4878j1985K4125O110
9431C0161q192j4147j0379N2817j1789l001j7393m961L3351O222j2533j0354j726
9418B8076m345K6091M0372o0617l4371j2788J405L2352K6021n7605k5195M6496
$$ y = [-107198, -144548, -135399, -133032, -72959, -18504, -52159, -82897, -81548, -80138, -38314, -40773, -94359, -71285, -25082, -25929, -11931, 33954, 49010, 12944, -12945, 2860, -6690, -279, 1602, -312, 54872, 74079, 38051, 81824, 67861, 30120, 9637, -6560, 833, -2162, 21366, 24487, 11791, 24071, 53811, 34192, 43850, 93220, 105155, 129322, 113657, 42406, 33075, 53990, 15950, -7868, -49783, -61063, -23766, -23156, -1131, -24817, -29521, -19268, -42431, -9815, 8902, -32159, -48251, -86917, -45968, -10592, 24611, 24975, 2781, -2967, 11911, -74, 24051, 30161, 21969, 7822, -2557, 50260, 38471, 35470, 18077, 13116, 46467, 52689, 40156, 29802, 28076, 23731, 49822, 90194, 29577, -4794, -17582, -16177, 16175, 42196, -15409, -40604, 5892]
9406E892M3962k7885j2578L3543q817j7164J6356l3892m839k9348l0307m7506
9394a12583n3514N6875N5466K438k322K0454M8539L0289m4072q7197o681N3107
9382c9201M5634J6807J3827n7626n3828L0521O1589l219l6083l229k960M935l26
9369b3159J0268k8235m3328L0223M6571K3936K2832n3240j7409o3015n3207O19
9357a47144l607K1074L8249p241N578N2919l837J8814L2362m275K6232J7851n4353
9344g378n3643l882q387P498J6936J1514K4034j2533j12246n5129k15q057J3379
9331a88109L0104l718J3300K3634j2138k9392j7119N956K3433L1621N788K3902
9319i2738K2122J3803R7149K4965j3699k0222o345j150q52l766k5145l8442k0814
$$ y = [5892, 49854, 21969, 9391, 42934, 34117, 16953, 33309, -583, -5422, -34770, -65077, -112583, -166097, -109222, -53756, -51318, -53640, -33186, 15353, 45642, 1570, -85627, -92308, -39201, 6433, 23240, 37067, -20559, -74387, -43866, 17723, 14504, -21579, -24808, -27768, -22833, -23159, -12891, -41126, -84454, -54231, -7660, 16276, 39108, -14132, -31541, -94556, -147763, -147144, -150751, -129677, -91428, -98669, -93091, -40172, -44009, -25195, 7167, 2892, 29124, 46975, -7378, -61021, -64903, -73290, -65792, -48856, -37342, -13308, -25841, -138087, -193216, -193431, -201488, -188109, -158005, -161723, -148423, -124789, -136927, -166319, -183438, -177482, -154049, -122428, -116640, -92738, -70616, -56813, 40336, 65301, 51602, 31380, 25035, 23885, 23033, 19267, -5878, -44320, -65134]
9306f5134P7J0242L1388J6998k2361q0563J1208K2834M9674P0147L129j23623
9294g5984k5517J3062L1008j1160L1329K6215j7053k5213l1997J8753L2488J3554
9282b0515l8594k2530N1122M0747l0530k1459M132k1411o852M434P246P7773K0102
9269D3665k8508k349j158J41o041L6578P826l0883o8512O202K6647m7994k0510
9256h4896M0603J166M5455M4209M3987o644n8196l637L1199k0585l3759j5425
9244a6523l3909J0633m6337n7044M8340l2424L7772P2370k110k3774L1105r718
9232b1619N793J5227J1417k8175n1579P9143L7921l2612m5014k0012k5596l4767
9220a09873K8157K1309L7503n9026L961J655P503J6174K4615m2477J7406K2771
$$ y = [-65134, -65057, -54815, -23427, -6429, -28790, -109353, -98145, -75311, -25637, 44510, 47639, -75984, -101501, -88439, -57431, -68591, -37262, -11047, -28100, -53313, -85310, -66557, -34069, -20515, -59109, -81639, -30517, 10230, -20300, -41759, -37627, -59038, -65890, -61456, -54210, 23563, 43665, 15157, 12808, 11650, 11791, 5750, 42328, 50154, 19271, -49241, -43039, -16392, -64386, -84896, -44293, -43127, 2328, 46537, 90524, 83880, 25684, 22047, 53246, 32661, -1098, -16523, -50432, -39799, -86136, -143180, -94840, -127264, -89492, -17122, -19232, -43006, -11901, -21619, -15826, -599, 10818, -17357, -68936, 10207, 48128, 15516, -29498, -49510, -75106, -109873, -81716, -60407, -22904, -81930, -77969, -76314, -68811, -52637, -28022, -70499, -53093, -30322]
9208c0322M654J723J2547K5621K9838j9858O755J911K6406M841n6005o5543p3189
9195a30621j3821L5792N8639r348K9272K9700L66K7866K1345k548p3669j3049
9183d0076K8953k5527o063j8357J6943Q0150N2255r078q2305p4445o434O0591
9171b3393M815K5505N0221k5329m2559O489p864n474P981k4913Q0109M0526j278
9158H4836J1378M3565m2744k4781j1497n381k4050j9750O829q683m0221K3704
9146f795K0593K5778p506K9035j5289n841l2830n8499l0660N2290N8247j4649
9134A3874j0140k0710m360K602q049k6511k205J0223O480m903q712K6205K0235
9121e971k7950R183M8079q084R359J7512M32j4580l7648K3174K7080k0384l7215
$$ y = [-30322, -25668, -23945, -11398, 14223, 44061, 24203, 30958, 32869, 59275, 64116, 8111, -57432, -130621, -144442, -108650, -50011, -59359, -30087, -387, -21, 27845, 49190, 46642, -27027, -40076, -11123, -36650, -42713, -61070, -44127, 36023, 88278, 79200, -3105, -77550, -83984, -23393, -18578, 6927, 57148, 31819, -10740, -4251, -12115, -17589, -9608, -34521, 45588, 86114, 84836, 96214, 139779, 97035, 72254, 60757, 55376, 31326, 11576, 18405, 9722, -30499, -6795, 13798, 39576, 32070, 61105, 45816, 39975, 7145, -51354, -82014, -29724, 28523, 13874, 3734, -16976, -21336, -18734, -26783, -53294, -55499, -45276, -38796, -43699, -52411, -26206, -5971, -33921, -24738, 23341, 15257, 24616, 42128, 42560, 27980, -9668, 13506, 40586, 20202, -17013]
9108a7013j7629j0511p0934o1581L8376P8606M0412K4316M5257K1522k1234N989
9096E5576m6852j9801K601P1041m3885o0586p678J1222Q592J3122K9122j602m4740
9083c3868J916l702j6002j1455J4730M010R0387j0683j1634o7697k8730j1064
9071h3792P4494N3813m0103k0451o393K2326J0082m6617J3924p132K4468j4865
9059b0246K6860r566j0441k2664k9746L6759J604O0030j0096k0843n3988r855
9047f2192M5598k790N0956j8682l3828o852R777K2292j4282n5528j4306M3313
9035c6524M0096j6612l070l9705j7368K7316l4131n0723N443M1876J6972k477
9023f8907M9950J2555K6496Q474j3943R609m6501n204N4674n428n0464l893j7737
$$ y = [-17013, -34642, -45153, -116087, -177668, -139292, -60686, -20274, 4042, 49299, 70821, 49587, 55576, 8724, -11077, -8476, 62565, 18680, -41906, -49584, -38362, -29770, -16648, 12474, 10872, -33868, -31952, -35654, -51656, -63111, -48381, -44371, 46016, 35333, 23699, -43998, -72728, -83792, -9298, 44515, 4412, -16039, -22432, -106, 9976, -36641, -22717, -29849, -5381, -20246, 6614, -2952, -13393, -36057, -65803, -29044, -27440, 32590, 22494, 1651, -52337, -62192, -16594, -19384, 31572, 12890, -20938, -27790, -18013, 4279, -10003, -65531, -79837, -36524, 3572, -13040, -16110, -55815, -73183, -45867, -79998, -130721, -125278, -83402, -66430, -68907, -18957, -6402, 20094, 28568, 14625, 24234, -22267, -27471, 27203, 21775, -28689, -32582, -50319]
9010e0319k0115k3428J3459j8030L3619L2975j9022L4240L1725N398K7278K3312
8998G1092p573l3580J6422J8102m3173j5328M4083n3912j3080R154o3016K8550
8986d2259L82J8591O6565L0857k5257o6531l5935j3534M5577Q3274m3124k8559
8974i953K905j5691K8245m0719m0649N0596n80j4415O986N7000J1218k8705J266
8961G504j2306J6920K9118l6812p6622P370K7417L1036o6059J874Q5759J5266
8949C0465n1155r329J7250L3680K6548J3846q395n5940k0031j1933K2690L3810
8937B1506o4900j02796J7015P1731k05N5174J0500k9744K4157j7852J4155K1939
8925B0680K8609n4788l7539L5975l9409j2981j4054M1896n2146k5183N1591k8781
$$ y = [-50319, -70434, -93862, -80403, -98433, -64814, -31839, -50861, -16621, 15104, 20502, 47780, 71092, 63519, 29939, 46361, 64463, 21290, 5962, 50045, -3867, -16947, -7793, -70809, -42259, -41877, -23286, 43279, 74136, 48879, -17652, -53587, -67121, -21544, 61730, 18606, -9953, -7048, -22739, 5506, -35213, -75862, -25266, -25846, -40261, -33275, 23725, 34943, 6238, 7504, -4802, 12118, 41236, 4424, -72198, -64828, -37411, -6375, -72434, -70560, 15199, 30465, -20690, -30019, -12769, 20911, 47459, 61305, 52910, -3030, -23061, -34994, -12304, 21506, -43394, -146190, -129175, -57444, -57649, -2475, 8025, -21719, 2438, -15414, -1259, 20680, 49289, -5499, -43038, -7063, -46472, -59453, -73507, -31611, -83757, -108940, -57349, -86130]
8913h6130K9104R900j9522R117k5813N736K6180N8756L9740k2444K1335Q1286
8901A27245j9135q9897J6276M9087O593l2509k6419K0665j4037N823K7948l6124
8889C5516p773M676l1884k7495L805J7892o910K040O0694L4166m1477n0893j0078
8876a7721j7804L3649j4852m0000J0965O9329J4446q776K0000q338k7476n068
8864H354O8958L2899o6555m4012J3370J1693J4073m4299p8231P310K5727K2695
8852b8018k8320J0659N4692K1965j9209m6139J6490L3258R025p772n3242j5469
8840e2080K4002j85m3138L8741O1674P2626k9169r697m449l0188q532J542J3318
8827C4465j5629o3825O368M3503L9440l9053m9214l3652N1756L8346j7067k8353
$$ y = [-86130, -57026, -47126, -66648, -57531, -83344, -77608, -51428, 7328, 47068, 24624, 45959, 127245, 108110, 18213, 34489, 83576, 90169, 57660, 31241, 51906, 37869, 43692, 71640, 35516, 27743, 32419, 535, -26960, -23155, -5263, -12173, -10133, 50561, 84727, 43250, -7643, -17721, -35525, -1876, -16728, -56728, -45763, 23566, 38012, 29236, 49236, 40898, 13422, 8354, 77312, 110211, 43656, -356, 13014, 24707, 38780, -5519, -83750, -76440, -50713, -28018, -56338, -45679, 9013, 30978, 11769, -34370, -17880, 15378, 24403, 16631, -36611, -52080, -28078, -28263, -71401, -32660, 29014, 101640, 72471, 62774, 58325, 28137, 19605, 21147, 34465, 18836, -44989, -38621, 4882, 44322, 5269, -43945, -77597, -25841, 12505, -4562, -32915]
8815c2915J3675j373n6305M2338K1908N938L4854p94K4894q652j5762N8924M2636
8802A29366j1783k4608m8480o7200j950k9071k0019L0876N3712N1135R168P325
8790G8471l3050k1719L0304n644l5158m2497k0699k304M1510K4399j996j1581
8778C6o58l4446P807L970N2837J0368n6094K4439K0110r22J235J6028k1495j5006
8764H209N083j6801P157j1089j5050j2422n1909j3536K5729O7605J9411M881J6932
8751C4200K3769O974m3844J2919M1131K993p594j0709K3799L7814m5082l0393
8739D5977M448j2825K706K4894m0501k2139l4414l5331L5658K1736M2250n3842
8727b1383n8739m7733J9053K5823k8477N5533J7452J324L3324O4745j9854L244
$$ y = [-32915, -19240, -20613, -76918, -34580, -12672, -6734, 28120, 27326, 52220, 43568, 27806, 86730, 129366, 117583, 92975, 44495, -22705, -24655, -53726, -73745, -42869, 10843, 61978, 71146, 78471, 45421, 23702, 54006, 48362, 13204, -29293, -49992, -52296, -10786, 13613, 11617, 36, -622, -35068, -27261, -23291, 29546, 39914, -16180, 8259, 28369, 27447, 28682, 44710, 23215, 8209, 13292, -3509, 3648, -7441, -22491, -34913, -86822, -100358, -74629, -7024, 12387, 17268, 34200, 57969, 64943, 21099, 34018, 75149, 78142, 70548, 59839, 83638, 121452, 76370, 45977, 50425, 37600, 40306, 65200, 24699, 2560, -31854, -67185, -31527, -9791, 32459, -21383, -80122, -127855, -108802, -82979, -111456, -55923, -38471, -37147, -3823, 60922, 41068, 44312]
8715D4312P589o5444q0429M5939J2762l3958L5963P5759p6408O495M3005M38L665
8702A9688l5088l828l2044k6703N0087N9581l4011j2206p569n3386k1812K1708
8690g5583N9870N1626l1950L697l4700J3857k2965r301p612J385k6423K7338K5400
8677b5361n922k1513o007L5108r925O6042N784L4169J4726m8100p9991j1114J2356
8664c9748P168k071k708j7325O5158O8551J9235J5524k3623j5023m85n4481n3168
8651c2996J2090K3433O2366M639Q513L0932L5052m5343j08303j2833O0882j0178
8639B8254j2812J4637r309j3047M6224J7273j7409q141r743m2859J8985j4266
8627b213N4799Q550j8373r2098l1028j8930l200P5142K6997J8629k1040K8698
$$ y = [44312, 51901, -13543, -93972, -48033, -35271, -69229, -33266, 42493, -33915, -27420, 15585, 16023, 19688, -15400, -19228, -51272, -77975, -27888, 31693, -2318, -14524, -22093, -75479, -97291, -75583, -15713, 35913, 3963, 7660, -27040, -13183, -36148, -45449, -53061, -51676, -78099, -50761, -25361, -31283, -52796, -58803, -23695, -33620, 32422, 38206, 72375, 87101, 39001, -40990, -52104, -39748, -32580, -34651, -37359, -54684, 10474, 79025, 98260, 113784, 90161, 75138, 74653, 20172, -32996, -20906, 2527, 64893, 69532, 78045, 108977, 144029, 98686, -9617, -22450, 38432, 28254, 15442, 30079, 20770, 7723, 53947, 71220, 53811, 45670, 35927, -6932, 12053, -2213, 52586, 61136, 42763, -49335, -80363, -99293, -102493, -27351, -354, 18275, -2765, 25933]
8615B5933n147o8419j1703N6000M8451j5734m7262L8804j1882O230O6800M9515
8603A31586K9143j5234n6578k9446N2427k3916p4849N381M2322J8395j2500K55
8591F6986l1778j8869l4556L7544M4526o898j5532k6599q172j5163j6402P019
8579a7894K4766K9025O7477k8791l238K6162k4021N873m0349m9831K6689R596
8567B5464J5394N4673N5488n9646k2511l1401R46J554Q06K5902O9068M043K250
8554A42030n0442Q555j3177j6470k8114K6747M2125N861p974L140q423n4848l3671
8541A5339J3349j6997M621J732J4077m2504n8683j8772K3436L7678J0160J6735
8529A71j3428j2395O5567J9320m8492k6706Q625r032j4676K6399Q110L621p97
$$ y = [25933, 20786, -47633, -59336, -3336, 45115, 29381, -17881, 20923, 9041, 15271, 82071, 131586, 160729, 145495, 88917, 59471, 111898, 87982, 13133, 18514, 60836, 79231, 66731, 66986, 35208, 16339, -18217, 19327, 63853, 56955, 41423, 14824, 6652, -8511, -24913, -17894, 6872, 35897, 103374, 74583, 71345, 97507, 73486, 79359, 39010, -10821, 15868, 25464, 40858, 95531, 151019, 91373, 68862, 37461, 38407, 39961, 40767, 66669, 135737, 139780, 142030, 91588, 100143, 86966, 70496, 42382, 69129, 111254, 117115, 109141, 112281, 103858, 49010, 15339, 28688, 11691, 16312, 18044, 32121, -10383, -69066, -87838, -64402, -26724, -16564, 171, -13257, -25652, 39915, 59235, 10743, -15963, -7338, -16370, -31046, -4647, 3463, 7084, 6287]
8516F287m5401k2450k6108j5622j6090O389M2270K3677m017P916k753o2913k2414
8503a31229k3298N5788Q4725l2598K6797N0394J6231J435k492m350K1336n2754
8491I985o176N301j5932k005K2933k4209p7718m6078R5448Q4720j010n7203L0866
8478A8922k4025o8078j8739M5819O299l8545M826J702n9902R912n951K8358O6258
8465c3144L0703L0469l8904N036j2696J554N991L4651N6321K744l2675L510q989
8452D4571j2837k5377o070M7924n1233l8299k6362N3290M2373K6772M1540K5972
8440A22264o4834n1045n775P5858M4165p2802o6366M5874O1272L3286k215p2344
8428D7338m3745O066L3237k0914L2974M9897L8654j0037k7696m669k0765J8265
$$ y = [6287, -39114, -61564, -87672, -103294, -119384, -112995, -70725, -47048, -51065, -43149, -45902, -108815, -131229, -154527, -98739, -14014, -46612, -19815, 30579, 46810, 48245, 45753, 41403, 62739, 9985, 3809, 9110, -6822, -8827, 14106, -10103, -87821, -133899, -38451, 46269, 45259, -11944, 18922, -5103, -73181, -91920, -46101, -39802, -78347, -73521, -71819, -131721, -121809, -127760, -99402, -33144, -2441, 28028, -10876, -5840, -18536, -16982, -10991, 23660, 79981, 82725, 50050, 53560, 44571, 31734, 6357, 287, 48211, -3022, -41321, -67683, -14393, 27980, 54752, 96292, 122264, 57430, 6385, 610, 76468, 120633, 47831, -18535, 27339, 88611, 121897, 119682, 47338, 3593, 9659, 42896, 21982, 54956, 104853, 143507, 133470, 105774, 101105, 80340, 98605]
8416I8605l0450p0679P113q079P646M5181m1697P194K2679j0447J7401o0060j8494
8403c4087M1802J7994o312k7285j763p769n6556l5636N1920O521J7867j6521K2310
8390b7515L8721o1792k6072Q675K9141Q3907L8119m799l3460L1568q3902j27493
8378a34902l916K1856L0014L7948M3104r586J3461Q6094O538m7772n0077O006
8366a232J0678P370J6202J9375J1916J0745p0398m1043O4248O0259k3869n1495
8354A2756k5243j2408p4m6888n2526O117J4698j9927l835L1951L3943M0310J7788
8341c338q644J8748l8504o9561J2506Q5544k045n6191n4335O8819O3029J4739
8329C0767P360J9451k0174m1483N5289j1538m2436q4953j3347n332J4845K91O7236
$$ y = [98605, 68155, -2524, 4589, -3490, 4156, 49337, 7640, 14834, 37513, 27066, 44467, -15593, -34087, 7715, 25709, 19397, -7888, -9651, -17420, -73976, -109612, -57692, -51171, -33304, -49825, -27515, 11206, -50586, -76658, -67983, -38842, 45065, 83184, 78385, 44925, 76493, -7409, -134902, -138818, -116962, -86948, -49000, -5896, -15482, -2021, 84073, 90611, 42839, -7238, -1232, 9446, 16816, 33018, 52393, 64309, 75054, 4656, -36387, 27861, 88120, 64251, 12756, -12487, -24895, -24969, -71857, -124383, -118266, -103568, -123495, -127330, -95379, -61436, -21126, -3338, -11982, 6766, -31738, -101299, -88793, -3249, -5294, -61485, -115820, -47001, 16028, 30767, 38127, 57578, 37404, -4079, 51210, 39672, -2764, -87717, -101064, -106396, -91551, -91260, -24024]
8316b4024K9171k1094m0695L9781K9247j4431M7201j4688p7738L2551M4406P5427
8304A05114N8518K64q0469k4597n765j6848k2232l235K2567k7136M4983P234l4355
8291B4043K115J3741k191n5690j2590p723j2460l1410N9884N0778M7118j9255
8279E6360m7724l4235M2415M4857k1822P27M9704m6327l9809N905M5608l2496
8267B3163l3056J0880m7615L986L399M0878K8922M926l851m1350o5509k9317K2658
8254h1886N7490M2515O4768o9112k7923K2587j6807J9258N3558n9118m9818P302
8242c7186J8171j6941J0596P6907K2552L4454M401o2418j9890N2511o0588O950
8230B9519O3458Q828j9328m1242K3590M388m1874o9911L458J1054L1460m1294
$$ y = [-24024, 5147, -15947, -56642, -16861, 12386, -2045, 45156, 30468, -47270, -14719, 29687, 105114, 163632, 163896, 83427, 58830, 53065, 36217, 13985, 10750, 33317, 6181, 51164, 58398, 24043, 26158, 39899, 37708, -17982, -30572, -38295, -50755, -82165, -22281, 28497, 75615, 56360, 8636, -25599, 16816, 61673, 39851, 40578, 90282, 43955, 4146, 10051, 55659, 23163, -9893, 987, -46628, -42642, -39243, 1635, 30557, 35483, 31632, -9718, -75227, -104544, -81886, -24396, 18119, 82887, 13775, -14148, 8439, -8368, 10890, 64448, 5330, -44488, -37186, -19015, -35956, -25360, 51547, 74099, 108553, 112954, 50536, 30646, 83157, 22569, 29519, 92977, 101805, 82477, 41235, 64825, 69213, 27339, -42572, -39114, -28060, 3400, -37894]
8218c7894k749L2630k7736q1806J2737J8000r457L4311Q110M731M7201L58j0948
8205a2512j7391M2678K2876o09K5866Q28J3590l8886l7928k6614L6280N5957J289
8192F5424l2680j9090K0152J2937l216j6965j8904p0352l6198O1966L5789m621
8180e758M7335o962m2921n339k6038J5081j2689O644O0790K3632l8590l6751l5020
8167e6586k1716K1688L252N8783J5219k0996j5858K339m1179O459K7432K8596
8155G433j530J7542P635M744J5046l6705k7568K7350k1089l5335j7886n85K392
8142e8556r149j1092J2767L2067L6496L4379n9302o4843J247L3133J5076L200
8130c4577J8503q406L3824K0367r263N365m2891J8392l983M0583l1280k9580K0472
$$ y = [-37894, -40643, -8013, -35749, -117555, -104818, -86818, -96275, -61964, -53854, -49123, -1922, -1564, -12512, -29903, 12775, 35651, 35042, 60908, 61736, 75326, 36440, -1488, -28102, 8178, 64135, 65424, 32744, 13654, 33806, 46743, 43527, 26562, 7658, -62694, -98892, -36926, -1137, -5758, 41577, 34615, -8306, -13645, -39683, -24602, -37291, -30647, 30143, 53775, 15185, -21566, -56586, -78302, -56614, -53362, 5421, 20640, -356, -16214, -13875, -55054, -48595, -21163, 7433, 5903, 23445, 31080, 35824, 50870, 14165, -13403, 13947, -7142, -42477, -60363, -60948, -58556, -67705, -78797, -66030, -33963, 2533, 36912, -22390, -87233, -85986, -52853, -37777, -34577, -16074, -24480, 9344, 29711, 20448, 25813, -17078, 1314, -2669, 37914, 6634, -22946, -2474]
8117b474J5847j2512L417L7521l286l6276l7586p334N9403J8498k460j8338Q989
8104B3409L2056l4265j3860M6429J7005k9589K8904J0782k4568m2528k5760N4065
8092D2080K5979p3021j8941J1565m3254N3759M3295l5383J01L9730j0382m6135
8080a0607r300K2966J7138L9678o2472J0136J9577L3280p3883p4028O4709P5948
8068E3142J3510r573p429K8748j5036l6590j4288K2069l5099M0374j221J356o334
8055C3629l9353j1005J8414K0770K5096k6896J12M1770j9711q0660l1119J7881
8043e1072J5081j394O5818K4732Q407j1060m8287j3976n1458L270N8255k371k1440
8030b5495J0576n215O6900J4954o5737L9924P5850N2541m5899n0519l0245o7115
$$ y = [-2474, 13373, 861, 4278, 41799, 38513, 2237, -35349, -42683, 16720, 35218, 32758, 14420, 23409, 55465, 21200, 7340, 53769, 70774, 41185, 70089, 80871, 56303, 13775, -11985, 42080, 68059, -4962, -23903, -12338, -55592, -1833, 41462, 6079, 6180, 45910, 35528, -10607, -19907, 3059, 20197, 59875, -2597, 7539, 27116, 60396, -13487, -87515, -22806, 53142, 66652, 57079, 49650, 78398, 63362, 26772, 12484, 34553, -546, 39828, 38607, 39963, 33629, -5724, -16729, 1685, 22455, 47551, 20655, 20767, 62537, 42826, -37834, -68953, -51072, -35991, -37385, 28433, 53165, 61572, 50512, 2225, -11751, -63209, -59939, -1684, -4055, -25495, -14919, -20134, 46766, 61720, -4017, 35907, 111757, 164298, 118399, 67880, 37635, -29480]
8018b9480J6886p258L9530K2083J7138K5367k6675Q366k2019k5559k0650k3721
8006b5992k204K6860J0453k764O2087L0552m410k1789p0187m6229M5849M187K608
7993I021J4690m3196o1592N4984K6697n100j1493K7214L1326p124k297N2766K9952
7980A15848l5191k313M2219j8266o0757n0876l2446K3218j015K8504M0293L1613
7968H0831N0336k8762m0927n5050k4100K7068O2256m3188k1886j3618k0876M6002
7956A8086K9060Q945j9090J3880k1620k3320N0582n8709k5764k0003j8881N54
7944f6280K507M9655o5656K0360P3310l0284l7760m093j1798N105M8546K1415
7932E027j3606M430M850o908l0307N5658N4571L9651K148l1199p8465O603O2049
$$ y = [-29480, -12594, -19852, 19678, 41761, 58899, 84266, 57591, 65957, 43938, 18379, -2271, -25992, -28196, -1336, 9117, 6353, 68440, 98992, 94582, 72793, 2606, -43623, 2226, 6413, 9021, 23711, -19485, -81077, -26093, 604, -4496, -15989, 11225, 42551, 35427, 33130, 85896, 115848, 80657, 78344, 120563, 102297, 41540, -9336, -41782, -18564, -19579, 8925, 49218, 80831, 131167, 102405, 61478, 6428, -17672, 9396, 71652, 28464, 6578, -7040, -27916, 18086, 47146, 56091, 37001, 50881, 29261, 5941, 56523, -2186, -27950, -47953, -66834, -66280, -63773, -14118, -79774, -59414, 13896, -16388, -54148, -58241, -70039, -64934, -16388, 5027, -8579, -4149, 701, -6207, -36514, 19144, 73715, 113366, 115514, 84315, 5850, 12453, 74502]
7919G4502r966j8037M6776L027J576k4091n1639L4505M8323k4234l3577K1328
7907F8493p477m2504j6958l4473L8039M2444j9552m8106J4287L6693N1001J3192
7895I5079k1088k5889p9483m06L9400M7148N3479L754K4105j9705l7152Q987j5275
7882G2954m5774m4674O095K1361K7457k6393j8015r615L2333K674j51O69o344
7869A2577K1188l6504j4044n1734J9988J01076j1556n9944l8259L1185M4235N0331
7857F8539n7269j9737l4185k9837J3179P089k878J1505q210L8308Q3j1007p036
7844c1456N249J0128L1675o909J1647r35L1042K5068J8787O404k5790k4120l2580
7831A8210K9798J6966m3542p90P3102J6196n2137o017K4753K7092j5099r207k6734
$$ y = [74502, 64536, 46499, 93275, 96302, 97878, 73787, 22148, 56653, 104976, 80742, 47165, 68493, 61016, 18512, 1554, -32919, 5120, 47564, 28012, -20094, -5807, 30886, 81887, 95079, 73991, 48102, -31381, -31787, 7613, 54761, 108240, 111994, 136099, 116394, 79242, 88229, 72954, 27180, -17494, -11399, 9962, 37419, 11026, -6989, -16604, 15729, 18403, 18252, 18921, 12577, 33765, -2739, -16783, -68517, -48529, 52547, 40991, -18953, -57212, -26027, 18208, 68539, 11270, -8467, -42652, -72489, -59310, -52221, -55099, -43594, -51804, -13496, -13413, -24420, -31456, -26207, -16079, 15596, 8687, 20334, 19399, 50441, 75509, 94296, 100700, 74910, 50790, 18210, 48008, 64974, 21432, 20642, 93744, 109940, 57803, 51786, 76539, 103631, 88532, 79325, 52591]
7818E2591N123l6285k1900Q035j7803M0594L0131n550o6066j6589N8930L0140
7806F1351m0495K0083k6379L3784J1267p4721q254Q7497j5663n943L6158n456
7794G3229M789l5792K9034l8225q657k5311k9963j9096K1900M8990M2863J5014
7782G8775j6812j0463O469J135p654l044k3599J3352k3375l9211m411L1049k8617
7769b6406k8487n0217J1056M0897L8436K1822j5834j7752K3794L4876K4565r452
7757D7298K8955k0197l0933P710j0173J4035L0699j3814q3635n429K3505m4691
7745e6670j8235O6215K4589K1098K4502q632K8595L0922L3154m8419l1903l4485
7733C0731O2585M7004o5572l1958J224n485o113K9115J2782R037l1144j8487l0001
$$ y = [52591, 57714, 21429, -471, 7564, -10239, 30355, 60486, 54936, -11130, -27719, 31211, 61351, 20856, 40939, 14560, 48344, 59611, -15110, -23364, 64133, 48470, 42527, 78685, 73229, 78018, 42226, 71260, 33035, 24378, -933, -30896, -49992, -28092, 20898, 63761, 78775, 61963, 51500, 57969, 59104, 51450, 48406, 24807, 38159, 14784, -24427, -28838, 2211, -26406, -54893, -105110, -94054, -53157, -14721, 7101, -8733, -26485, -2691, 32185, 56750, 47298, 76253, 56056, 25123, 32833, 22660, 36695, 67394, 53580, -30055, -35484, -11979, -56670, -74905, -8690, 15899, 36997, 61499, 52867, 81462, 112384, 145538, 97119, 65216, 30731, 93316, 140320, 74748, 42790, 44014, 38529, 32416, 61531, 74313, 83350, 52206, 33719, 3718]
7720C718l0849J6774k8681J6975K4401l6908J1104k6404n59J2236M7886N6322
7708F6015K4237l0927k5795M299k3883j0722M3786K1623P950p4374n0169L5854
7696a2106K2932j4226N917k619N9446L3104L3652k1852p9866J0494K8388J6036
7684G9300k6981J3314o988m1100K5201M5216J5599q5300o9323Q522j0300J3374
7672c9466L4014n095j5379k4572n0997J104Q9778J4048l0807K250n87N530j6729
7659c6908k7588N889K1516K8344R907l4326j2556M2123K5259L2189P795m0592
7647B1052l3156L764K0761J6981j8314j3974R808l3494o5865R547O4473O4467
7635D6050O776K3639M896k72k8529n2546k7702R437m7609j7019K8478K0511J8663
$$ y = [3718, -27131, -10357, -39038, -22063, 2338, -34570, -23466, -49870, -50429, -38193, 9693, 66015, 90252, 59325, 33530, 37829, 13946, 3224, 47010, 68633, 76583, 2209, -47960, -12106, 10826, -3400, 2517, -102, 59344, 92448, 126100, 104248, 24382, 34876, 63264, 79300, 52319, 65633, 58645, 17545, 42746, 87962, 103561, 18261, -51062, -42540, -52840, -39466, -5452, -10547, -25926, -50498, -101495, -100391, -10613, 3435, -27372, -25122, -25709, -20179, -36908, -64496, -58607, -37091, -8747, 1160, -33166, -45722, -3599, 21660, 53849, 61644, 21052, -12104, -8340, 12421, 29402, 11088, -2886, 6922, -26572, -92437, -82890, -18417, 46050, 52826, 76465, 81361, 81089, 52560, 14, -27688, -18251, -65860, -82879, -54401, -33890, -15227]
7622a5227q732k6045j2652L4949M5057k9058k3621N8165O6298O5583j0765o0009
7610H3943J0804L614j3227J2017Q668J9047j9429k7240m1783k2170K4439M567
7598D3250l7122n6536M958N7587Q550L707Q1242K3924k2601m8720k8721K0947
7586E0465J4177m9002l2213J6694j4206J0071J8803l5479n357l9535O8227K3139
7574B5784L3111J5499o2218k9070j4944n408N1693J7789K875k0951J7692J827
7562C3679k4428j9419n0912M3738M8844K4862k7607n9248J2136L7452m2812M6290
7550B2575K5899m5488l1366n3539q059m8197J5986N3097l5779K5914Q1196O29
7538B868j8476k6331Q364j1950l4643N8890O8342K2003k0244j2627o0821j469
$$ y = [-15227, -23959, -50004, -62656, -27707, 17350, -11708, -35329, 22836, 89134, 154717, 143952, 83943, 94747, 98361, 85134, 97151, 105819, 124866, 105437, 78197, 36414, 14244, 38683, 43250, 6128, -50408, -45450, 12137, 20687, 24394, 105636, 129560, 106959, 58239, 29518, 50465, 64642, 15640, -16573, 121, -14085, -4014, 14789, -20690, -26047, -65582, 2645, 25784, 58895, 74394, 12176, -16894, -31838, -37246, 14447, 32236, 35111, 14160, 31852, 33679, 9251, -10168, -61080, -17342, 31502, 56364, 28757, -30491, -18355, 19097, -23715, 22575, 48474, 2986, -28380, -81919, -89978, -138175, -122189, -69092, -104871, -78957, 2239, 2868, -15608, -41939, -33575, -45525, -80168, -21278, 47064, 69067, 48823, 36196, -24625, -26094]
7526b6094N2971P419j2337k954j0847k3820j1841J0731L5721l2772K5923j9165
7514g065o222J915q566K1825N0660J8763m0274K2306q415j3451j9520O408m7931
7501b9567K443N327Q052Q1124N0940j5406j5063O8J146o6942n6437Q111j6994
7488d3198L4899J4881l2239j5827K5050K4002L8213M9207J2325r22J335L893K535
7475A14154l0265m2203k7559k4065n438R064K0640R461o8444P475M4812L7802
7463D5434N1402l6242J5542j5174n6514l4005M797K0479J5947J2336k2171j1759
7451i928N8245l771m8617m3412M9766k9342K4375k818m2889j3507M284J3818k4296
7438f8092J8161K5473J199j0502R425K4854N005l3686M999K9490J7192J1447p205
$$ y = [-26094, 26877, 34296, 21959, 19005, 8158, -15662, -27503, -16772, 18949, -13823, 12100, -7065, -13287, -11372, -19938, 1887, 52547, 71310, 31036, 53342, 44927, 31476, 11956, 18364, -29567, -27124, -21797, -13745, 67379, 118319, 102913, 87850, 87918, 89064, 22122, -34315, -26204, -43198, -8299, 6582, -25657, -41484, -16434, 7568, 45781, 94988, 107313, 106391, 107726, 111619, 114154, 83889, 41686, 14127, -9938, -15376, -6312, 14328, 23789, -44655, -37180, 7632, 45434, 96836, 60594, 76136, 60962, 4448, -29557, -24760, -4281, 11666, 24002, 1831, -9928, 48317, 44546, -4071, -47483, 2283, -27059, -2684, -5502, -48391, -61898, -57614, -43796, -68092, -49931, -24458, -23259, -33761, -24336, 518, 5523, -28163, -23164, 6326, 23518, 34965, 27760]
7425B7760n8222l5806r004l3697Q2816P9460N008p3316j7428J3414M1419l7949
7413a5545q5278J4222M4397O4455Q3206J4504k9260j1366l4991j9096k697k1399
7401A152o8877J4293Q6982O3479L00N618k4535o7805O8969l5072K5263M1758j7490
7388I4035o4747p0899k4991m416J4393O3550j5l6999j0107j5485j3450j1295K7634
7375e2792K1950L3099O18j2321M4316P2845l8929k9320j3014k7880l0383O1067
7363B9256Q2674K8182j2194k2288o8174j7510n0714l5343J4446N8868j094p184
7351a075J1250n5155l5110k6529K231N1874K5082j920L3676j4317k799K1781N0397
7338E9386k477q8257m7800O4878O39l1706M9378j6839k8099L1796j3710N609q810
$$ y = [27760, -30462, -66268, -75272, -108969, -26153, 53307, 58315, -15001, -32429, -19015, 22404, -15545, -100823, -86601, -42204, 22251, 105457, 119961, 90701, 79335, 44344, 25248, 22551, 1152, -67725, -53432, 33550, 97029, 97329, 102947, 78412, 10607, 79576, 44504, 69767, 111525, 94035, 29288, -41611, -66602, -71018, -56625, 6925, 6910, -30089, -40196, -55681, -69131, -80426, -52792, -30842, 2257, 2875, -9446, 34870, 107715, 68786, 39466, 26452, -1428, -31811, 29256, 111930, 140112, 127918, 105630, 37456, 19946, -30768, -66111, -51665, 7203, 6109, -1075, 10175, -44980, -80090, -106619, -104388, -52514, -27432, -29352, 4324, -9993, -12792, 8989, 59386, 56909, -31348, -79148, -14270, -13631, -45337, 4041, -12798, -40897, -9101, -22811, -17202, -26012]
7325b6012M5300K689J111l8789k05L8383J4391J9013R212j3385l7857o666l0835
7312b3650l6421L7372N6360l1889k6786J8082k0836M9395N788m2025j3890L2899
7300D399k191r4799n197O5846k6065j6203P7274O6077k754o001j2685r4280n9756
7287a06335J6592K858K7963K2065n6975l1911N4285O0061j4485j1141K3307k5747
7275c9463m8833M4855L5599O626j6160K5632l5833k3048r417m4000k2770N9252
7263f7560N3885J3072N994j0790k8201j9274M1880M3819O922m9860l4826K5190
7251a9749l5924Q032K5650O0008K3980k7765n8459j7030J7371L6428K6345K3388
7239F2275j8488j3587m5622l7560j662M1777L9627K7137l9170l9242J2446R671
$$ y = [-26012, 19288, 21977, 23088, -15701, -15906, 22477, 36868, 55881, 65093, 51708, 13851, 7185, -23650, -60071, -22699, 33661, 1772, -25014, -6932, -27768, 21627, 27415, -14610, -28500, 4399, 2208, -92591, -97788, -31942, -58007, -74210, 3064, 69141, 66387, 60386, 47701, -46579, -106335, -89743, -86885, -58922, -36857, -93832, -125743, -71458, -11397, -25882, -37023, -13716, -39463, -88296, -43441, -7842, -1216, -17376, 8256, -27577, -50625, -60042, -104042, -126812, -67560, -13675, -603, 5391, -5399, -33600, -52874, -10994, 32825, 39747, -10113, -44939, -19749, -55673, -47641, -21991, 38017, 61997, 34232, -24227, -41257, -23886, 12542, 38887, 62275, 43787, 30200, -15422, -52982, -54644, -12867, 26760, 53897, 14727, -24515, -12069, -2398]
7227b398m6340k4512M7962L2141k5126l2325K6504M2125K8288j3615k1076o8210
7215e6582j5170L8839m044M3264K8066o956J698K034r453m3369k6363j0856L8281
7202b0611m7374K8188J3290l5658N5884R164k1105l4151r682J3045Q724k1557
7190f1843k427J5542J0460J317L3611K61n6088J6164j586J7205J423o0354J8227
7177f8088K7631M012P25J090L5037o512m332k7922J6995Q7490Q871m0001J9229
7164E4225m173j1583J4495k3741l7054l8729j5490L3902N5329l9260k6617K6218
7152a2478L3116k6339l2437K8734N8005K9037k009J216N354L918L9309n8681k69
7139F6476n7686R465P25l3978J3000j9840O371R1559J5480q8250L2427j4344o4089
$$ y = [-2398, -48738, -73250, -25288, 6853, -18273, -50598, -24094, 18031, 46319, 32704, 11628, -56582, -71752, -32913, -36957, 6307, 34373, 27417, 29115, 31149, 21696, -21673, -48036, -58892, -20611, -67985, -39797, -26507, -62165, -6281, 2883, -18222, -52373, -62055, -49010, -40286, -61843, -64270, -48728, -38268, -36951, -3340, -3079, -59167, -43003, -44589, -27384, -25961, -86315, -68088, -40457, -36445, -35720, -34630, 407, -6105, -10437, -38359, -21364, 66126, 74997, 34996, 54225, 50052, 38469, 52964, 29223, -7831, -46560, -62050, -28148, 27181, -12079, -38696, -12478, 20638, -5701, -38138, -9404, 48601, 77638, 75629, 76845, 82199, 86117, 125426, 66745, 66476, 8790, 18255, 18980, -14998, -1998, -21838, -15467, 76092, 91572, 3322, 35749, 21405, -42684]
7126d2684N0617j6059o5833R40j8185K5697M8604N0963p990n5893m4288J4379
7114e9732L8965j5749k4571P400L4740O1575J7405j6721J8100k781k9052n0586
$$ y = [-42684, 7933, -8126, -73959, -73019, -91204, -65507, -16903, 34060, 26070, -29823, -74111, -59732, -20767, -36516, -61087, -53687, -18947, 42628, 60033, 43312, 61412, 58631, 29579, -21007]
$$ [...]
##END NTUPLES=NMR SPECTRUM
##END=
