##TITLE=Analysis number 315019
Compound Code ac 13366
Project Code adrs
Chemist Name stores
##JCAMPDX= 6.0         $$ Bruker NMR JCAMP-DX V2.0
##DATA TYPE= NMR SPECTRUM
##DATA CLASS= NTUPLES
##ORIGIN= Bruker BioSpin GmbH
##OWNER= NMR
$$ XWIN-NMR		Version 3.5
$$ Thu Nov  3 09:11:01 2005 GMT Standard Time (UT+0h)  MAYBRIDGE\NMR@NMR_250MHZ
##.OBSERVE FREQUENCY= 250.131544655141
##.OBSERVE NUCLEUS= ^1H
##.ACQUISITION MODE= SIMULTANEOUS (DQD)
##.ACQUISITION SCHEME= undefined
##.AVERAGES= 16
##.DIGITISER RES= 18
##SPECTROMETER/DATA SYSTEM= dpx250
##.PULSE SEQUENCE= zg30
##.SOLVENT NAME= DMSO
##.SHIFT REFERENCE= (INTERNAL, DMSO, 0, 16.522)
##AUDIT TRAIL= $$ (NUMBER, WHEN, WHO, WHERE, WHAT)
$$ ##TITLE= Audit trail, XWIN-NMR		Version 3.5
$$ ##JCAMPDX= 5.01
$$ ##ORIGIN= Bruker BioSpin GmbH
$$ ##OWNER= NMR
$$ C:\u/data/dgb/nmr/ADRS/11840/pdata/1/auditp.txt
$$ ##AUDIT TRAIL=  $$ (NUMBER, WHEN, WHO, WHERE, WHAT)
(   1,<2005-11-03 09:10:13.35 +000>,<MAYBRIDGE\NMR>,<NMR_250MHZ>,
      <created by zg, POWCHK disabled, PULCHK disabled
       configuration hash MD5:
       62 19 C7 07 E1 42 D1 B7 37 6C 3D D0 77 39 F9 E6
       data hash MD5: 64K
       EE AA 0F 8D F6 00 79 55 05 56 5C D3 F8 21 A0 8B>)
(   2,<2005-11-03 09:10:38.27 +000>,<MAYBRIDGE\NMR>,<NMR_250MHZ>,
      <Start of raw data processing
       ef LB = 0.3 FT_mod = 6 PKNL = 1 SI = 32K 
       data hash MD5: 32K
       FB E7 C5 EA CA 0B BF 1D 2E 9F 19 30 D4 EF 63 C6>)
(   3,<2005-11-03 09:10:40.47 +000>,<MAYBRIDGE\NMR>,<NMR_250MHZ>,
      <apk 
       data hash MD5: 32K
       C0 78 EE 08 98 64 69 3B 77 69 36 F5 46 68 E0 63>)
(   4,<2005-11-03 09:10:41.58 +000>,<MAYBRIDGE\NMR>,<NMR_250MHZ>,
      <abs ABSG = 5 
       data hash MD5: 32K
       93 96 B6 CB 7D 6B E4 A2 E9 CD B8 CE CD 3E B9 E5>)
$$ ##END=
$$ 
$$ hash MD5
$$ FF 82 5A 78 E6 FF 83 4F 8D F9 E3 0C B9 BF F4 16
##$RELAX= 
##$RELAX= 
##$RELAX= 
##$RELAX= 
##$RELAX= 
##$RELAX= 
##$RELAX= 
$$ Bruker specific parameters
$$ --------------------------
##$DU= <C:\u>
##$EXPNO= 11840
##$NAME= <ADRS>
##$PROCNO= 1
##$TYPE= <nmr>
##$USER= <dgb>
##$AMP= (0..31)
100 100 100 100 100 100 100 100 100 100 100 100 100 100 100 100 100 100 
100 100 100 100 100 100 100 100 100 100 100 100 100 100 
##$AQSEQ= 0
##$AQ_mod= 3
##$AUNM= <au_zg>
##$AUTOPOS= <1 >
##$BF1= 250.13
##$BF2= 250.13
##$BF3= 250.13
##$BF4= 250.13
##$BF5= 500.13
##$BF6= 500.13
##$BF7= 500.13
##$BF8= 500.13
##$BYTORDA= 1
##$CFDGTYP= 0
##$CFRGTYP= 5
##$CHEMSTR= <none>
##$CNST= (0..31)
1 1 145 1 1 1 1 1 1 1 1 1 1 1 1 1 1 1 1 1 1 1 1 1 1 1 1 1 1 1 1 1 
##$CPDPRG= <>
##$CPDPRG1= <>
##$CPDPRG2= <>
##$CPDPRG3= <>
##$CPDPRG4= <mlev>
##$CPDPRG5= <mlev>
##$CPDPRG6= <mlev>
##$CPDPRG7= <mlev>
##$CPDPRG8= <mlev>
##$CPDPRGB= <>
##$CPDPRGT= <>
##$D= (0..31)
0 1 0 0 0 0 0 0 0 0.06 0 0 0 0 0 0 0.0002 0 0 0 0 0 0 0 0 0 0 0 0 0 0 
0 
##$DATE= 1131009012
##$DBL= (0..7)
120 120 120 120 120 120 120 120 
##$DBP= (0..7)
150 150 150 150 150 150 150 150 
##$DBP07= 0
##$DBPNAM0= <>
##$DBPNAM1= <>
##$DBPNAM2= <>
$$ [...]
##$SUBNAM7= <"">
##$SUBNAM8= <"">
##$SUBNAM9= <"">
##$SW= 20.6930455092707
##$SWIBOX= (0..15)
0 0 3 0 0 0 0 0 0 0 0 0 0 0 0 0 
##$SW_h= 5175.983436853
##$TD= 65536
##$TD0= 1
##$TE= 296.16
##$TE2= 300
##$TE3= 300
##$TEG= 300
##$TL= (0..7)
0 120 120 120 120 120 120 120 
##$TP= (0..7)
150 150 150 150 150 150 150 150 
##$TP07= 0
##$TPNAME0= <>
##$TPNAME1= <>
##$TPNAME2= <>
##$TPNAME3= <>
##$TPNAME4= <>
##$TPNAME5= <>
##$TPNAME6= <>
##$TPNAME7= <>
##$TPOAL= (0..7)
0.5 0.5 0.5 0.5 0.5 0.5 0.5 0.5 
##$TPOFFS= (0..7)
0 0 0 0 0 0 0 0 
##$TUNHIN= 0
##$TUNHOUT= 0
##$TUNXOUT= 0
##$USERA1= <user>
##$USERA2= <user>
##$USERA3= <user>
##$USERA4= <user>
##$USERA5= <user>
##$V9= 5
##$VALIST= <valist>
##$VCLIST= <CCCCCCCCCCCCCCC>
##$VD= 0
##$VDLIST= <DDDDDDDDDDDDDDD>
##$VPLIST= <PPPPPPPPPPPPPPP>
##$VTLIST= <TTTTTTTTTTTTTTT>
##$WBST= 1024
##$WBSW= 4
##$XGAIN= (0..3)
0 0 0 0 
##$XL= 0
##$YL= 0
##$YMAX_a= 361288
##$YMIN_a= -262354
##$ZGOPTNS= <>
##$ZL1= 120
##$ZL2= 120
##$ZL3= 120
##$ZL4= 120
##$ABSF1= 16.522
##$ABSF2= -4.171173
##$ABSG= 5
##$ABSL= 3
##$ALPHA= 0
##$AQORDER= 0
##$ASSFAC= 0
##$ASSFACI= 0
##$ASSFACX= 0
##$ASSWID= 0
##$AUNMP= <proc_1d>
##$AZFE= 0.1
##$AZFW= 0.1
##$BCFW= 0
##$BC_mod= 0
##$BYTORDP= 0
##$COROFFS= 0
##$CY= 12.5
##$DATMOD= 1
##$DC= 0
##$DFILT= <>
##$DTYPP= 0
##$F1P= 14.0000005364418
##$F2P= -0.99999901652339
##$FCOR= 0.5
##$FTSIZE= 32768
##$FT_mod= 6
##$GAMMA= 0
##$GB= 0
##$INTBC= 1
##$INTSCL= 1
##$ISEN= 128
##$LB= 0.3
##$LEV0= 0
##$LPBIN= 0
##$MAXI= 10000
##$MC2= 0
##$MEAN= 0
##$ME_mod= 0
##$MI= 0
##$NCOEF= 0
##$NC_proc= -4
##$NLEV= 6
##$NOISF1= 0
##$NOISF2= 0
##$NSP= 0
##$NTH_PI= 0
##$NZP= 0
##$OFFSET= 16.522
##$PC= 1
##$PHC0= 73.98991
##$PHC1= -0.8838233
##$PH_mod= 1
##$PKNL= yes
##$PPARMOD= 0
##$PSCAL= 4
##$PSIGN= 0
##$REVERSE= no
##$SF= 250.13
##$SI= 32768
##$SIGF1= 0
##$SIGF2= 0
##$SINO= 400
##$SIOLD= 32768
##$SREGLST= <1H.DMSO>
##$SSB= 0
##$STSI= 32768
##$STSR= 0
##$SW_p= 5175.98343685301
##$SYMM= 0
##$S_DEV= 0
##$TDeff= 65536
##$TDoff= 0
##$TI= <Analysis number 999999
Compound Code 99
Book Reference 9
Project Code 9>
##$TILT= no
##$TM1= 0
##$TM2= 0
##$TOPLEV= 0
##$USERP1= <user>
##$USERP2= <user>
##$USERP3= <user>
##$USERP4= <user>
##$USERP5= <user>
##$WDW= 1
##$XDIM= 32768
##$YMAX_p= 300618688
##$YMIN_p= -773089
$$ End of Bruker specific parameters
$$ ---------------------------------
##NTUPLES= NMR SPECTRUM
##VAR_NAME=  FREQUENCY,     SPECTRUM/REAL,   SPECTRUM/IMAG
##SYMBOL=    X,             R,               I
##VAR_TYPE=  INDEPENDENT,   DEPENDENT,       DEPENDENT
##VAR_FORM=  AFFN,          ASDF,            ASDF
##VAR_DIM=   32768,         32768,           32768
##UNITS=     HZ,            ARBITRARY UNITS, ARBITRARY UNITS
##FACTOR=    0.157963299565203, 1,           1
##FIRST=     4132.6476996994, 0,             0
##LAST=      -1043.33573715361, 0,           0
##MIN=       -1043.33573715361, -773089,     0
##MAX=       4132.6476996994, 300618688,     0
$$ Real data points
##PAGE= N=1
##DATA TABLE= (X++(R..R)), XYDATA
$$ [...]
15623c80955j12397J73540J78469j19510K6305J72079J08376J12935J8673K5549
15613B03064n8275r1420K69868j01036l3385K0262j3848o4730J06767m1780j29804
15602F5683M2825j02949k11752L0529N6217l9669R3129j03811N5319J39765P9871
15591A05157m7075J03149J6932L9563J01785j23048j55392k23889j24756J48471
15581a59103J5347J20888R9024o7268M5972l1425j7555o4738l8946P127k2206
15570a12883j3881P2378J3878m537J47950n3088n2670j66166p5840L8292r035
15559b15602o3513J83908Q5563O5751J56745L0834r016o4359l9047j27837n1869
15548d8442J73229R8345k1256j04222j45979L0068n4299n9053l7526j28192N3982
$$ plain form
15623 -380955 -493352 -319812 -141343 -260853 -234548 -62469 45907 158842 177515 203064
15613 203064 144789 53369 323237 222201 188816 209078 195230 130500 237267 195487 65683
15602 65683 108508 5559 -206193 -175664 -119447 -159116 -65987 -169798 -114479 25286 105157
15591 105157 58082 161231 178163 217726 319511 196463 41071 -182818 -307574 -159103
15581 -159103 -143756 -22868 76156 8888 54860 23435 5880 -58858 -97804 -90677 -112883
15570 -112883 -126764 -54386 -40508 -45045 102905 49817 -2853 -169019 -244859 -206567 -215602
15559 -215602 -279115 -95207 -9644 56107 212852 243686 234670 170311 131264 3427 -48442
15548 -48442 124787 223132 201876 97654 -48325 -18257 -72556 -131609 -169135 -297327 -243345
15537b43345J13336o5254J07417n3376j36576j96102N1356J72423K3867R2574
15527a33680j97407K22055J02126n9989j85252j09193O1354J03220L4285n3747
15517b16228j39882P5957J38223J31598P8252L1299j73173L6020J12127m4608
15507B9585q4600J18917J11582p4788P8605k36568r9034R0859o5737O6733o1390
15496a25836n8982n7943P7782M4024K26168J19329j03902j8733P1139m867k55652
15485h7473j1310J10327Q0325j06953k25535p6920q9166k9387k203J83548J18086
15474a36661o862r3621O0523J63720K5504j27369n6057j6413n7862j6858J08915
15463a53041Q8583J7539O7576p6016J79930L0255o3554R0819j14189L1290j7003
$$ plain form
15537 -243345 -130009 -195263 -87846 -141222 -277798 -473900 -422544 -250121 -226254 -133680
15527 -133680 -331087 -109032 -6906 -66895 -252147 -361340 -299986 -196766 -162481 -216228
15517 -216228 -356110 -280153 -141930 -10332 67920 99219 -73954 -37934 74193 29585
15507 29585 -55015 63902 175484 100696 179301 -57267 -156301 -65442 -131179 -64446 -125836
15496 -125836 -184818 -242761 -164979 -120955 105213 224542 120640 101907 173046 168179 -87473
15485 -87473 -98783 11544 91869 -15084 -240619 -317539 -406705 -436092 -438295 -254747 -136661
15474 -136661 -143523 -237144 -176621 -12901 12603 -114766 -170823 -187236 -245098 -261956 -153041
15463 -153041 -64458 -46919 20657 -55359 124571 154826 91272 182091 67902 99192 82189
15452H2189J15820j88494p914K02772K39858J29352j6534k06389k80186M0135
15442A10609J32266l9862p6860j83223k53427L2623J05691J87051K0959J22196
15432A58023J15703J43202Q5227O4007j75952l91869j55652j76348J33970K49615
15422D9926p9359j34752J55699Q0459j09452k3328k24743n505J36407J42689J12921
15411A00962K14423R0025j79325k23489r73o6767P4421L4666j33331j47864J02068
15400a35184J08659j4701q212j59946Q9656K04832Q6864k57486j37136j15724
15390c38378k1411M5517J05911J1898k8950J0414J04879r8381m6312N3875k150
15379b03088J9291J4732J43780m5681j20127M1082n195J0142l5343q2168M8416
$$ plain form
15452 82189 198009 9515 1601 204373 444231 573583 557049 350660 70474 110609
15442 110609 242875 203013 126153 -57070 -310497 -277874 -172183 14868 35827 158023
15432 158023 273726 416928 502155 566162 390210 -1659 -157311 -333659 -199689 49926
15422 49926 -29433 -164185 -8486 71973 -37479 -60807 -285550 -291055 -154648 -11959 100962
15411 100962 315385 405410 226085 2596 1623 -65144 9277 43943 -89388 -237252 -135184
15400 -135184 -26525 -41226 -49438 -209384 -119728 85104 171968 -85518 -222654 -338378
15390 -338378 -359789 -314272 -208361 -196463 -225413 -214999 -110120 -208501 -254813 -200938 -203088
15379 -203088 -183797 -169065 -25285 -70966 -191093 -150011 -155206 -145064 -180407 -262575 -214159
15368b14159j00977j11002J26729J45639R2522P9526j11853o8082J3711N2287
15358i5659K58198J8011M7863j4146r5157j47920K4400j66876Q8909J27282K39470
15347B84375l594m2221R8024J50901P957k17647j2479j6398k43415k23985J77223
15336d1259n436o7553O9769J52164J8858k12562m1855l9702M1651o4745k24188
15325d14858P2742P4829N0234K687j83065j64039O8650K92606N3595R4350J65937
15314A13668o1552j26072l6772K31881k27391k06083N7848K85780J43788j43133
15304C1962J99469m5989l53569j47479J00798Q31L05374m7085j71335n1824Q2470
15293i6377J56922o7454L3000r0637J1498L2726K7157J41170M0843j37333k23179
$$ plain form
15368 -214159 -315136 -426138 -299409 -153770 -61248 18278 -93575 -161657 -147946 -95659
15358 -95659 162539 180550 228413 214267 119110 -28810 -4410 -171286 -82377 44905 284375
15347 284375 280781 238560 336584 487485 495442 277795 265316 248918 5503 -218482 -41259
15336 -41259 -46695 -114248 -44479 107685 126543 -86019 -127874 -167576 -125925 -190670 -414858
15325 -414858 -342116 -267287 -217053 -214366 -397431 -561470 -492820 -200214 -146619 -52269 113668
15314 113668 52116 -73956 -110728 121153 -106238 -312321 -254473 31307 175095 31962
15304 31962 231431 185442 -168127 -315606 -214808 -213977 91397 44312 -127023 -178847 -96377
15293 -96377 60545 -6909 26091 -64546 -53048 -20322 6835 148005 188848 51515 -171664
15282a71664L9898Q0241M9142q3590O5069J9868P186j74632P6291j64717p0152
15271c27060o6065j1291J6988J65646O2823L8213j5619n886p3616l7111J32975
15260a20003N8217m4947L5159J21134j140j25137j03710J76343P0107n9753l4840
15249b8570R565M267J9243O1482j4856o5369m3576j56219Q0400l921Q6278M9325
15237a951M832j10359J76010q2220k39642J0776J18262K09976M8345k26645m4309
15226a36925l0789j07405Q6677l1739m7391j03954J32515R1279Q1132J55568n4634
15215C4334m9605j22466p2213J29239N5053n2116m1544N5819j72149j36053R780
15204c61921j70536o2315O7868K9702K08749J71874m5863n3526O6783R837J2136
$$ plain form
15282 -171664 -131766 -51525 -2383 -85973 -20904 -1036 6150 -168482 -92191 -256908 -327060
15271 -327060 -393125 -404416 -387428 -221782 -158959 -120746 -136365 -142251 -215867 -252978 -120003
15260 -120003 -61786 -106733 -71574 49560 48420 -76717 -180427 -4084 66023 6270 -28570
15249 -28570 -19005 -14738 4505 65987 51131 -14238 -57814 -214033 -133633 -137554 -51276 -1951
15237 -1951 2881 -107478 68532 -13688 -253330 -242554 -124292 85684 134029 -92616 -136925
15226 -136925 -167714 -275119 -188442 -220181 -267572 -371526 -239011 -147732 -66600 88968 34334
15215 34334 -15271 -137737 -209950 -80711 -25658 -77774 -119318 -63499 -235648 -371701 -361921
15204 -361921 -532457 -594772 -526904 -497202 -288453 -116579 -162442 -215968 -149185 -139348 -127212
15193a27212k26397P3100K20971J39106j61448M1803P12N2736J4779j77457l0607
15182a79914k3154j93997J4378Q8864P9582L8622p8429J83813J37566j15607J06243
15171E7967l5500q191O4290J122J20442K34105m7536j86709k27311r6116j05725
15160b29162j6063L3994Q2413J05215o7921K9319O5555J09816J19774j05296j10517
15149A7127m5236Q7931o7985R7761N7692j26191j70473l00939p5743K55319J59781
15138a10956K6762r4833J49627M8487l0978j1805m2655Q7315N2338j9984n2859
15127D59M1198m6106n092q4655r2206J86319J26436n0592K3834r0349N6195J75613
15115B41054O2890j46486j32231J09841K09942k10660j42050q8570r2845J66928
$$ plain form
15193 -127212 -353609 -280509 -59538 79568 -81880 -40077 -39365 13371 28150 -149307 -179914
15182 -179914 -203068 -397065 -382687 -293823 -214241 -175619 -254048 -70235 67331 -48276 57967
15171 57967 22467 14276 78566 79688 200130 434235 386699 199990 -27321 -123437 -229162
15160 -229162 -245225 -211231 -128818 -23603 -91524 -62205 3350 113166 232940 127644 17127
15149 17127 -28109 59822 -8163 89598 147290 21099 -149374 -450313 -526056 -270737 -110956
15138 -110956 -84194 -179027 -29400 19087 -11891 -23696 -66351 20964 73302 53318 459
15127 459 41657 -4449 -9541 -94196 -186402 -83 126353 75761 99595 9246 65441 241054
15115 241054 303944 157458 25227 135068 345010 134350 -7700 -96270 -189115 -22187
15105b2187J72227p2417p8875j25570N1539r2065m8862J1830J98957J67499J66361
15094C28437q0205j4714k2476n7214j62692j61400J34720K78889O8365j85145
15084A26565j37590K5448k9170p2713p1042M2645R689l3662j11406n4335J14726
15073a90845J57830r655n4347k70135j2588J89149r0m6984J00861J10572J2050
15062a4182m6687K49968J15388r1686j67441k09726p7711j00137J63056K16023
15052C6865P0409o8459m4748q8261J708J17617Q267j05819j18067n7659O7031
15041a81116L7592M446J07975j11301K709M8578q5969m3566k0466J78328J05553
15030D2763p6833l2230L577J27003K10528j6680R2962j22244k24255j65259p0319
$$ plain form
15105 -22187 150040 77623 -1252 -126822 -75283 -167348 -216210 -204380 -5423 162076 328437
15094 328437 248232 233518 211042 153828 -8864 -170264 -35544 243345 311710 126565
15084 126565 -11025 14423 -14747 -87460 -158502 -115857 -106168 -139830 -251236 -305571 -190845
15073 -190845 -33015 -42670 -97017 -367152 -379740 -190591 -190681 -237665 -136804 -26232 -14182
15062 -14182 -60869 189099 304487 212801 45360 -164366 -242077 -342214 -179158 36865
15052 36865 107274 38815 -5933 -94194 -92486 25131 33398 -72421 -190488 -248147 -181116
15041 -181116 -143524 -139078 -31103 -142404 -139695 -91117 -177086 -220652 -241118 -62790 42763
15030 42763 -34070 -66300 -62723 64280 274808 258128 351090 228846 4591 -160668 -230987
15019b30987J01129J36302o8872k69927J11485J43284m716K0561n6138J29653
15009A1774k4246J00768k7412J9909j30628j52751l0515J95887J02065n1731j76802
14998a63682m1459J5863L04565N9050N5667j73357j80656Q07J14190J01495j64132
14987g1649J49595L5304j44067j05810j68597k10168P244K69965L15723J75145
14977B52685j26379o3754L0987k12182j18334N7651L5577k7256J75233O593J5067
14966B5888o444j0847j9363Q450K05728L5794q2286P4147j8837j11009j48977
14955d7756K7328j42294j08439p2216m99J18283J53678q3455o3001J07524o2447
14944a73294j0873M5249K33761J1526k3595M4364o0275j38879m1950L5303J90987
$$ plain form
15019 -230987 -129858 6444 -62428 -332355 -220870 -77586 -82302 -61741 -117879 11774
15009 11774 -12472 88296 60884 80793 -49835 -202586 -233101 -37214 64851 13120 -163682
14998 -163682 -205141 -189278 115287 174337 230004 56647 -124009 -123202 -9012 92483 -71649
14987 -71649 77946 113250 -30817 -136627 -305224 -515392 -508148 -238183 77540 252685
14977 252685 126306 62552 93539 -118643 -236977 -179326 -143749 -171005 4228 10821 25888
14966 25888 19444 8597 -10766 -2316 203412 239206 156920 231067 212230 101221 -47756
14955 -47756 -20428 -162722 -271161 -343377 -343876 -225593 -71915 -155370 -218371 -110847 -173294
14944 -173294 -184167 -138918 94843 106369 82774 127138 66863 -72016 -113966 -78663 112324
14933A12324M7724o2746j53861J58622K61651N0399K322N8317l38844k29543r2489
14922a86124O3749N0315J81097Q2628k01855j61137L8213K46986j25803q4671
14912i6602R7717M6765j78175o5419K99482K19340p9376j84882q0016M8241L4580
14901F1655J02533P050j41381j15601P5688J61406j40280o09l04864l3626P9210
14890b48819k2717R2296R9605p4480O9108j29982k11488j7305k1281p107K35961
14879b36209L10627j10872j87460J8381J16174K01215Q563J18672k3422j55824
14869E9845k9395o2872J6195P7521K954L7393m2426P862n4771M1138K8386K38260
14857C20090O4336l31052J4960N6599r7286O6905O2150J95006j4666l556j18984
$$ plain form
14933 112324 160048 97302 -56559 102063 363714 414113 416435 474752 135908 -93635 -186124
14922 -186124 -122375 -72060 109037 191665 -10190 -171327 -133114 113872 -11931 -96602
14912 -96602 1115 47880 -130295 -195714 103768 323108 243732 58850 -21166 27075 61655
14901 61655 164188 171238 29857 -85744 -10056 151350 11070 10461 -294403 -328029 -248819
14890 -248819 -271536 -179240 -79635 -154115 -85007 -214989 -426477 -443782 -465063 -472170 -236209
14879 -236209 74418 -36454 -223914 -205533 -89359 111856 120419 239091 215669 59845
14869 59845 30450 -32422 -16227 61294 64248 101641 59215 67077 12306 53444 81830 320090
14857 320090 384426 53374 68334 124933 27647 94552 156702 351708 337042 333486 214502
14846B14502j06097l7302j44145n0088P5095J12835J80334Q082m3496n6163L9775
14835A93332L3309j09934j21750P8815J26800J9509q7136j75579j16511O8957
14825i0188j7688P2942J41974k46486j61141m6000J77751J81698K17050J22672
14815C52584M4562j1071m1779j27202J7555J20358j37824k22332q280J42630m8001
14804H1200j66917j18669J51287J44289k32492j46168J95438K21077L8686p8044
14794H9687n7688P2465J0306j66589j23763L4814J3490J05809k22555m9303K20744
14783g2583j03641J15383L0685m4221J34743k6646j75492Q3184p7782j02895J69606
14772f9659P8248r6414q3497N843n3855L5512J5536M4232L8360j30485q4081m7980
$$ plain form
14846 214502 108405 71103 -73042 -123130 -48035 64800 245134 253216 209720 153557 193332
14835 193332 226641 116707 -5043 73772 200572 220081 132945 -42634 -159145 -90188
14825 -90188 -107876 -34934 107040 -139446 -300587 -346587 -168836 12862 229912 352584
14815 352584 397146 386075 344296 217094 234649 355007 217183 -5149 -13429 129201 81200
14804 81200 -85717 -204386 -53099 91190 -141302 -287470 -92032 129045 167731 89687
14794 89687 31999 104464 114770 -51819 -175582 -140768 -127278 -21469 -244024 -293327 -72583
14783 -72583 -176224 -60841 -30156 -74377 60366 33720 -141772 -58588 -136370 -239265 -69659
14772 -69659 8589 -87825 -171322 -165479 -219334 -183822 -168286 -124054 -85694 -216179 -300260 -348240
14760c48240j2974j21130o2912J16050J46692O8650Q695J17873p1247k21030Q2713
14749b96860K23500J44803q8729k47560Q5935j52771k2541K24008P8747m5171
14739i6639L8351K05646N2246j29677p6336J06416m9138o2979p2242L2861m4874
14728i6365J2007K02242J94144l3600j22099j54177j28921q0080J21234J28601
14718D2986j8958n1344l4420M5541K8922j43170L1680K8194r3420M3777J27220
14707G008l2220r8897l0758P1551K03247O7704J7627j4860j9717j2197Q4379M731
14695B47598j57260p2467o5519q7763l4787J05553j0593O924M2585r4940k0108
14684a40777r2162m9974M7025J19241J18678K0665j27654J19420J41949j65282
$$ plain form
14760 -348240 -361214 -482344 -545256 -429206 -282514 -213864 -205169 -87296 -158543 -379573 -296860
14749 -296860 -73360 71443 -17286 -264846 -178911 -331682 -354223 -130215 -51468 -96639
14739 -96639 -58288 147358 199604 69927 -6409 100007 50869 -12110 -84352 -51491 -96365
14728 -96365 -84358 117884 312028 278428 156329 2152 -126769 -206849 -85615 42986
14718 42986 24028 -27316 -61736 -16195 12727 -130443 -98763 -70569 -163989 -120212 7008
14707 7008 -25212 -124109 -154867 -83316 119931 187635 205262 190402 170685 158488 242867 247598
14695 247598 90338 17871 -47648 -135411 -170198 -64645 -75238 -68314 -25729 -120669 -140777
14684 -140777 -232939 -282913 -235888 -116647 2031 22696 -104958 14462 156411 -8871
14674h871o5781J0595J16110L2183k17143r3048J71398J22940j56597j42170p0349
14663c00733P8920j65161L6858K22484K21676p8387j76694R0246n1098L6274J8535
14652f7080J33399J25018J5386m6800j78287K8316j05179j48324K1647q197j21814
14641c51915L3335J6184J07988M7694M0802J92879J01715j5806l2240n3266o8899
14630A8471p6953l469n2172J66697p7293o6360r9433k1169n4147J06720n6390
14619b15498J7472J17926L6106o1615q5702O5856p3067j7816Q7113j54320O3282
14608b20263M1264J48706j13307o6278N5899J2569J19167J88849j8828M686l7957
14597A14507l0026j21111P5787m5881k66621j22860J83826J29137J15495J4256
$$ plain form
14674 -8871 -74652 -64057 52053 84236 -132907 -225955 -54557 68383 -88214 -230384 -300733
14663 -300733 -221813 -386974 -350116 -127632 94044 15657 -161037 -70791 -121889 -85615 -67080
14652 -67080 66319 191337 206723 159923 -18364 9952 -95227 -243551 -221904 -230101 -351915
14641 -351915 -318580 -302396 -194408 -146714 -105912 86967 188682 172876 140636 87370 18471
14630 18471 -58482 -61951 -114123 52574 -24719 -91079 -190512 -211681 -265828 -159108 -215498
14619 -215498 -198026 -80100 -43994 -105609 -191311 -125455 -198522 -216338 -129225 -283545 -220263
14608 -220263 -178999 -30293 -143600 -209878 -153979 -141410 -22243 166606 147778 152464 114507
14597 114507 84481 -36630 39157 -6724 -273345 -396205 -212379 -83242 32253 46509
14587D6509j18055J0339M9905j93746l318P6662J56266J48934m4857p2256p9756
14576b3373J19483j7744P6500j55541p6318n8567j27483J29168L56780K41537
14566D64442j34321l57698j17950j2347P8371P9792K05895j23964j10480j61939
14556a90199r0750m0609k472L2372J65124J35541q1196l6458j02125k43020K22322
14545b31470J77793j37290j80971j4002Q4729J76596J11345O9067m7646L6716
14535D4867r6647j01493J11407n0709K3367N5488j46252l8107J69058j58689p2142
14524b59852r31K0080K1855M6448p7147J16610j51173j02659L2963K1167M7593
14513b85046K6899q149j0522K0129j00151K2909j11717K8807L28874J24883N190
$$ plain form
14587 46509 -71546 -61207 -11302 -205048 -208366 -131704 24562 173496 128639 56383 -23373
14576 -23373 96110 78366 154866 -675 -76993 -135560 -263043 -133875 222905 464442
14566 464442 330121 -27577 -145527 -157874 -79503 289 206184 82220 -28260 -190199
14556 -190199 -280949 -321558 -324030 -291658 -126534 9007 -72189 -108647 -210772 -453792 -231470
14545 -231470 -53677 -190967 -371938 -385940 -301211 -124615 -13270 55797 8151 44867
14535 44867 -51780 -153273 -41866 -92575 -69208 -13720 -159972 -198079 -29021 -187710 -259852
14524 -259852 -260783 -240703 -218848 -172400 -249547 -132937 -284110 -386769 -353806 -332639 -285046
14513 -285046 -258147 -266296 -276818 -256689 -356840 -333931 -445648 -416841 -87967 36916 42106
14502D2106j11784j17037n7899j20938J24155J71728Q5997J03292k2983J07278
14492B03915j37916o3863k4495k8465p4051J80757j963N9592j8779Q6703J55291
14481C36726p1316r5310n8565R0046p231j20343O161j01294L4733n2210m8188
14470h6791K72985K04937j70412j70039j6196l2571J9530O7540J30076m587j51725
14459F2747j71466M6135o9492p7524J07639j03108J01860J55184o256Q4591j61257
14448c0947k21770l6663q0775J08566J44088j11095j39849K31404J9130j25540
14438b43451N398J57651J20582j87878q3165M6798m0147L7975R187J34170K22889
14427A80009q9804j47738Q0380Q6192q0325o2716M6860J77800J43302n2059j72031
$$ plain form
14502 42106 -69678 -186715 -244614 -365552 -241397 -69669 16328 119620 96637 203915
14492 203915 65999 2136 -22359 -50824 -124875 55882 53919 113511 94732 181435 336726
14481 336726 265410 170100 111535 201581 194350 74007 80168 -21126 13607 -38603 -86791
14470 -86791 186194 391131 220719 50680 34484 1913 21443 88983 219059 214472 62747
14459 62747 -108719 -62584 -132076 -209600 -101961 -205069 -103209 51975 45719 130310 -30947
14448 -30947 -252717 -289380 -370155 -261589 -117501 -228596 -368445 -137041 -117911 -243451
14438 -243451 -238053 -80402 40180 -147698 -230863 -184065 -224212 -186237 -177050 -42880 180009
14427 180009 90205 -57533 22847 109039 28714 -34002 12858 190658 333960 281901 109870
14416A09870k5231K07013p643j34894q2111j61980L9350J28545j58794Q0146J26029
14405A20300J43281O215j08542J8672K1094n752q8474k40252q562J86495J94135
14394B38610j493q1708k96485l3845P3619L4702k08117m2860m4270R111J812J20922
14382b30002J50174J67353j92877k73985J67363K08718O8472j52732L7456N5937
14372E877N7388p1182k1310o7802N9741K47869J21229K8138q7405j21895k1300
14361A29348j96411j28074J61274O1952n3056j32531K4089J74220j26165j11778
14351a97132N9533m9298J08430J6268q0332Q4682O6032K1451M8046J2852p3195
14340A7337J68993J44678k02493N6049M4953J2681o4898K902j88373J41177P1390
$$ plain form
14416 109870 84639 291652 284009 149115 67004 -94976 -55626 72919 -85875 -5729 120300
14405 120300 263581 269796 161254 179926 201020 195268 106794 -133458 -142020 44475 238610
14394 238610 237117 155409 -141076 -174921 -101302 -66600 -274717 -317577 -361847 -352736 -350924 -230002
14382 -230002 -79828 87525 -105352 -379337 -211974 -3256 65216 -87516 -50060 5877
14372 5877 63265 -7917 -29227 -97029 -37288 210581 331810 359948 272543 150648 129348
14361 129348 -67063 -195137 -33863 28089 -24967 -157498 -133409 40811 -85354 -197132
14351 -197132 -137599 -186897 -78467 -62199 -142531 -57849 8183 29634 77680 90532 17337
14340 17337 186330 331008 128515 184564 229517 242198 177300 180202 -8171 133006 204396
14329B04396j27172J02710Q717N1370j48521k11406l9309P5782J36622J56260
14319B09449J39445P2285j22190j50834j98885J62494j18568O2166M5955j8815
14309H2502J60884J75499p7434j79172j9286k5057K28791Q2611k48937k71145
14299i0744J21236K02422J13783Q5249j72142J39906K4929l44325j49638m9957
14289a19281K22541K96117j47744j77962j70759K9835Q1269N0579r694j39773
14279h4872L9289n0768l0243K29391J95097O5422L4689k6442k06635j26082M6519
14268H5365L7285l4262N3448j41390n7554L1043J18822J59661P0718j56028o6895
14257A00213j46533J04914J14726P7663j39693j64509m1708k12305J5988L1508
$$ plain form
14329 204396 77224 179934 188651 240021 91500 -119906 -159215 -83433 53189 209449
14319 209449 348894 421179 298989 148155 -50730 111764 -6804 55362 101317 82502
14309 82502 243386 418885 341451 162279 142993 117936 346727 429338 180401 -90744
14299 -90744 30492 232914 346697 431946 259804 399710 424639 80314 -69324 -119281
14289 -119281 103260 399377 251633 73671 -97088 -67253 14016 64595 54901 -84872
14279 -84872 -45583 -96351 -126594 102797 297894 363316 398005 371563 164928 38846 85365
14268 85365 122650 88388 141836 446 -57108 -26065 92757 252418 323136 167108 100213
14257 100213 -46320 58594 173320 250983 111290 -53219 -94927 -307232 -291244 -259736
14247b59736K6024R4861J12159j89781J09477R119j49087K08969M2665Q290j34157
14236a21197J00183P6800m3784r2694p0479l1325L50411K76230o3770j70662k57140
14225d7427q4742M8604J70346q2143k13279Q884N1120l3730j9102J9010K18803
14214C6344Q520Q8177J39522Q2057J0264j86917l51389j11410R3808k2646J39630
14203g4040K60906K2992l1232j97911j57839J14874r081j50367M4900N3086Q7985
14192c5727K17741l3139O9247R4075l8253K3928N0229O1472N0535k1499j59729
14181B78880j11253j82692K64157j25545j96017l0145R9887o2503m3866l4448
14171a43545K82135J34528Q636J3636N0975j04364k35039n4651J11130J58117
$$ plain form
14247 -259736 -233712 -138851 -26692 -216473 -106996 -97877 -246964 -37995 4670 12960 -121197
14236 -121197 -21014 55786 12002 -80692 -151171 -182496 167915 444145 380375 209713 -47427
14225 -47427 -132169 -83565 86781 4638 -208641 -199757 -148637 -182367 -201469 -182459 36344
14214 36344 44864 133041 272563 354620 364884 177967 -173422 -284832 -191024 -213670 -74040
14203 -74040 186866 209858 178626 -19285 -177124 -62250 -71331 -221698 -176798 -123712 -35727
14192 -35727 182014 148875 218122 312197 273944 297872 348101 409573 460108 438609 278880
14181 278880 167627 -15065 249092 123547 -72470 -102615 -2728 -65231 -109097 -143545
14171 -143545 138590 273118 281754 295390 346365 242001 6962 -47689 63441 221558
14161B21558k3807j84961o4002l5019R5021K8623J70753O6539j44255r7703j19088
14150h6341Q7111J86072l5021n124q8744j07135P5147j58306r1867Q9245K27320
14139I2357J48901j78309q0455k3903O0139J15631J14216Q8336K9142k2549q3051
14128B60455k54952o1251j39096N4559J98950Q5356R6108J81792o2234j78205
14118A81482L3297j86626j33861J69025K40002j56597j90861J66052Q5092N3194
14108B60199J37814P2529j77044l13712k3526K04854K36701j00148J6173j34643
14098A79197k25128j37745j16954l0265Q3668J35259J28728M3997j12661M5008
14088f896M9716l8594K57636j37923j98018J73461K48531M8585l0158j58630J27370
$$ plain form
14161 221558 197751 12790 -51212 -86231 8790 37413 208166 274705 130450 32747 -86341
14150 -86341 770 186842 151821 146697 57953 -49182 25965 -132341 -224208 -134963 92357
14139 92357 241258 62949 -17506 -41409 18730 134361 248577 336913 366055 343506 260455
14128 260455 5503 -55748 -194844 -140285 58665 144021 240129 421921 359687 181482
14118 181482 214779 28153 -105708 63317 303319 146722 -44139 121913 207005 260199
14108 260199 398013 470542 293498 -20214 -43740 161114 397815 297667 313840 179197
14098 179197 -45931 -183676 -300630 -330895 -247227 -111968 16760 60757 -51904 -6896
14088 -6896 42820 4226 261862 123939 -74079 99382 347913 396498 366340 207710 335080
14077C35080j53288j88264o8713J42829J78997j10312j44060L3540q3254o9795
14067a27240O742J85078R1813m9418N1946J60106R8447k72954k30818J63781O8620
14056A46103l79418j55249M854K55648K06004k9505q341P5103K17221J97259l9368
14045D90311n6618l7173j48844r1953O5735j6157r4631r7901m717N0135m7169
14034A1018K07971J70098p5836j99606q5695P8061J08121p4018J35437J548j92373
14023H4726j37390P6494J97114j20474k21501q9546J20608J37057J9307K1585
14013H7980J68655J3075j60989J4452M5752p2812o2395N9232R5012j86648o5415
14002f4101O5629K2252Q2392J2068j31372o7514J7317K26008M7451k62708j68957
$$ plain form
14077 335080 181792 -6472 -75185 67644 246641 136329 -7731 25809 -57445 -127240
14067 -127240 -120498 64580 156393 106975 158921 319027 417474 144520 -86298 77483 146103
14056 146103 -233315 -388564 -383710 -128062 77942 48437 40096 115199 332420 529679 490311
14045 490311 433693 396520 247676 155723 221458 205301 110670 12769 8052 58187 11018
14034 11018 218989 389087 313251 113645 27950 106011 214132 140114 275551 277099 84726
14023 84726 -52664 23830 220944 100470 -121031 -210577 -89969 47088 66395 87980
14013 87980 256635 269710 108721 123173 168925 96113 33718 92950 187962 1314 -64101
14002 -64101 1528 23780 106172 118240 -13132 -80646 -63329 162679 210130 -52578 -221535
13991b21535L9021J07908J00647J54875J57629k39921j25124K33351o3475o1826
13981H1550j58204r7963M6248J01948J61915j1406j36615j91906k06867K64494
13971a46806K76755P8067J23856j77956k22061L5997m4194k35500N2901j7434
13961b76375O4598L02575O736p6085K8029L26697q1815k08063k02563P8558J40682
13950A02974J24474n6310J00559j35871k70845j05281J49133P8783j13999J54480
13940B8097o0393q3941p1878J04564P5814J26789j14788q7779J14384J35257J50580
13929C16706N3455j05599l0202j42831j93164K8580J19454K32244j45548k58329
13919a25234K3935J05334J6837j01254q4604L07157m2139O1730O0004j17982k31138
$$ plain form
13991 -221535 -182514 -74606 26041 180916 338545 98624 -26500 206851 143376 81550
13981 81550 -76654 -174617 -128369 -26421 135494 124088 -12527 -204433 -411300 -146806
13971 -146806 129949 208016 331872 153916 -68145 -32148 -76342 -311842 -258941 -276375
13961 -276375 -211777 90798 97534 21449 49478 376175 294360 86297 -116266 -37708 102974
13950 102974 227448 171138 271697 135826 -135019 -240300 -91167 -12384 -126383 28097
13940 28097 -32296 -116237 -188115 -83551 -7737 119052 4264 -83515 30869 166126 316706
13929 316706 370161 264562 234360 91529 -101635 -73055 46399 278643 133095 -125234
13919 -125234 -101299 4035 20872 -80382 -164986 142171 100032 161762 221766 103784 -127354
13908a27354k85016o5609L71160K64724O5657r2585N7958P9458k6707k45990k1829
13897b6133Q2206P9857M0232m1969r6344q8683N5638q3314n6358l1688O9795O6421
13885c0340J10243J11850Q8444j70792k35728k48921j0720J47887l0466J20219
13875a48324K65350O5578l9353q5971k61005j6106J17961O2647k61653r4215p2289
13864d67380q1539O5749J24547m1705J88602L649L7204J40694J73162J2611m5297
13853A10297O2914J08976M2663j63539n8657j75j23948J53038m8710r6977K33089
13842B18971K15004J8099m1606k2786r6244n0956m4558l7109j36949J66388N824
13831A94078j08207n8333K9489J76M2207j9913P4573k00743k4609K94406O1691
$$ plain form
13908 -127354 -412370 -477979 -106819 157905 223562 130977 188935 268393 241686 -4304 -26133
13897 -26133 56073 135930 176162 134193 37849 -50834 4804 -78510 -134868 -166556 -96761 -30340
13885 -30340 79903 191753 280197 109405 -126323 -375244 -385964 -238077 -268543 -148324
13875 -148324 117026 182604 143251 57280 -203725 -219831 -101870 -39223 -300876 -395091 -467380
13864 -467380 -548919 -483170 -358623 -400328 -211726 -208077 -170873 -30179 142983 155594 110297
13853 110297 173211 282187 324850 161311 102654 102479 -21469 131569 82859 -14118 218971
13842 218971 433975 452074 410468 387682 291438 240482 195924 158815 21866 188254 194078
13831 194078 85871 27538 57027 57203 99410 79497 154070 -46673 -71282 223124 284815
13820B84815j73228j17304K28031J31717m3354q8790j33001k4465J4106R1123
13810A69650M5809j02114p152M994J25010L2782k03059j25126J87023K17000J67833
13799E12650j14465j19031R595r0907j39720K35236j04414k80621k9199m9333
13789a70209R2815J84385O0227K5692J03077j31492j45209n2835l0084j08571
13779a72204l7649j03107j7696o0338K1995k3448J8096J54228J66499R0408m2198
13768e414K24357J41527P5903n7366j14975k02003k3957L5018K12692J25623J09051
13757E20456j05893l6692L1675J29970N4350l87894k22032O5776l3658L142J39097
13746A58297R4798M9229m8505j83448J1601J38179N8188L2248K346P7246m719
$$ plain form
13820 284815 111587 -5717 222314 354031 310677 221887 88886 64421 78527 169650
13810 169650 215459 113345 106193 111187 236197 268979 65920 -59206 127817 344817 512650
13799 512650 398185 279154 288749 197842 58122 293358 188944 -91677 -120876 -170209
13789 -170209 -77394 106991 167218 192910 295987 164495 19286 -33549 -63633 -172204
13779 -172204 -209853 -312960 -330656 -390994 -368999 -392447 -374351 -220123 -53624 36784 -5414
13768 -5414 218943 360470 436373 379007 264032 62029 38072 73090 285782 411405 520456
13757 520456 414563 377871 409546 539516 593866 205972 -16060 49716 16058 19200 158297
13746 158297 253095 302324 253819 70371 81972 220151 278339 310587 312933 390179 385460
13735C85460r4958N0679j14818K2921J35207l06749j87794K7800o2422n8752Q5437
13724a17989J21805l9383Q8316J41463J11549P2893N9631L4602l20572M8238K10216
13713D10769l1855m23019j2721L053J01280J92428L375j8385L0317K3551p9223
13702A99570l8838k91872j75818O2165J55062j32217j27271R2148J51794N1023
13692e4254L5863M5099j06915N0294R3670P0119j7149k4818q7869J14836l9068
13681G9808j19564q778k8576P9317k407j5415j30486n4605K47160J24923j65031
13670F346k32360J88539O1324J54080L1496Q6059N736k6577o3066K09466J50459
13659E71502M5557l0272L1451l22243l61505K0688p590j6689R2810N6638n1502
$$ plain form
13735 385460 290502 341181 226363 249284 384491 77742 -110052 -82252 -144674 -203426 -117989
13724 -117989 3816 -35567 52749 194212 305761 378654 438285 472887 152315 200553 410769
13713 410769 378914 -44105 -56826 -53773 47507 239935 243310 224925 255242 278793 199570
13702 199570 160732 -131140 -306958 -244793 -89731 -221948 -349219 -257071 -105277 -54254
13692 -54254 -18391 26708 -80207 -29913 63757 133876 116727 91909 4040 118876 79808
13681 79808 -39756 -48534 -77110 2207 -200 -15615 -146101 -200706 46454 171377 6346
13670 6346 -226014 -37475 23849 177929 209425 295484 301220 274643 211577 421043 571502
13659 571502 617059 586787 618238 295995 -65510 -44822 -52412 -69101 23709 80347 28845
13648B8845J21476J80577q4782o9047P2902J51618O2178j15158q9662m0538K4818
13637B43227J25814j02981l7965k28369J4610N4458J96967J96835J13739o1417
13627E14918r3529k7335n8089J72483k35031k4171P6921J11634J16796K32153
13617G86750K28029j3734k10571P5891J80907M1811J679j05476J96310K73441
13607A455037K93758J21258l1411J46908M12774L26499K08426J94922L33692M19644
13597C881507O7516Q7699L79601K21516J60763K45178N4033K80367J36383J42290
13587E656853k40306r2353j55118k47292j99829n3328R2784n0759J7494r3092
13577D635054m828J92136K81280k7960j0860N19057M99066J82818J90739K28019
$$ plain form
13648 28845 150321 330898 246116 177069 249971 401589 463767 348609 258947 218409 243227
13637 243227 369041 266060 228095 -274 14336 68794 265761 462596 576335 514918
13627 514918 421389 394054 335965 508448 273417 249246 326167 437801 554597 786750
13617 786750 1014779 1001045 790474 866365 1047272 1089083 1090762 985286 1181596 1455037
13607 1455037 1748795 1870053 1838642 1985550 2398324 2724823 2933249 3128171 3461863 3881507
13597 3881507 3949023 4036722 4416323 4637839 4798602 5043780 5097813 5378180 5514563 5656853
13587 5656853 5416547 5324194 5169076 4921784 4721955 4668627 4761411 4710652 4728146 4635054
13577 4635054 4630226 4822362 5103642 5075682 5064822 5583879 6082945 6265763 6456502 6684521
13567F684521K8522M2125l41609l78093l14364k55236n08178m60863m21678m66654
13557C608493l86202K3810j28983m01168j16751k93311k65167P4150K87725j13520
13547B289076j01063J9501j25517j78210p6602J22177k3739l6937M2409K24820
13537B155915p7957j57081K01981K24082L14934J32134K97686M04166K62017L12546
13527D070423K25468L52006L57227R8677J01337M64139M60116K61944O7543K14734
13517F673614J40492m798q13j86248k34849l49386m07911l75699l04350j56759
13507D793293L0607P8191J1656o8316L2824J79623J16081J50767K22512J57004
13497E704242O5490J52997J962J29251O1429l5763j47902l19165l17163m14768
$$ plain form
13567 6684521 6713043 6755168 6413559 6035466 5721102 5465866 4957688 4496825 4075147 3608493
13557 3608493 3222291 3246101 3117118 2715950 2599199 2305888 2040721 2114871 2402596 2289076
13547 2289076 2188013 2207514 2081997 1903787 1827185 1949362 1925623 1888686 1931095 2155915
13537 2155915 2077958 1920877 2122858 2346940 2661874 2794008 3091694 3495860 3757877 4070423
13527 4070423 4295891 4647897 5005124 5103801 5205138 5669277 6129393 6391337 6458880 6673614
13517 6673614 6814106 6809308 6808495 6622247 6387398 6038012 5630101 5254402 4950052 4793293
13507 4793293 4823900 4902091 4913747 4845431 4878255 5057878 5173959 5324726 5547238 5704242
13497 5704242 5769732 5922729 5924691 6053942 6115371 6079608 5931706 5612541 5295378 4880610
13487D880610m41267k97282n46292o15860m96136j18925j06087n7228j54228l9503
13477B007802j21199j09734q0980l6379r5710K5695k65066j84423o947j89706
13467I43353k32284R925J79249l05077k00976O6590K57587R8379L8623R334r7426
13456G67277k44544L686j6853j34911j35228K15995L7867k57313j21785J24947
13446B39138j1879O5748j7198j56681K2477K40466k5080J09417j0899q6282J98211
13435E67438L1460l2741O0352J32228r0954j33946j93750j98870j6160K15669
13425C40726J41575l7616J7832j13521M857J34474J13294r9657j27131n9274j01982
13414B13577J8162l3647M6378J19593R6347L9158N3741L4880M7369R2576K8858
$$ plain form
13487 4880610 4439343 4142061 3595769 2979909 2483773 2364848 2258761 2201533 2047305 2007802
13477 2007802 1886603 1776869 1695889 1659510 1563800 1589495 1324429 1140006 1133059 943353
13467 943353 711069 720994 900243 595166 394190 460780 718367 816746 855369 864703 767277
13456 767277 522733 526419 509566 374655 239427 455422 493289 235976 114191 239138
13446 239138 227259 293007 275809 119128 141605 382071 356991 466408 455509 369227 567438
13435 567438 598898 566157 626509 758737 667783 533837 340087 141217 125057 340726
13425 340726 482301 444685 462517 348996 353853 488327 601621 501964 374833 315559 213577
13414 213577 231739 198092 244470 364063 460410 499568 553309 588189 635558 728134 756992
13403G56992j93996k78995J11845j2778j13138N1407P7732P367P021J34272j07671
13392D40058j24214Q6662M4631L0744j5166J954j1703j19924L7239J38402j61913
13381C46770j48235j3644J46608P0189K1930P9138q4925j45841j80702K2568O5147
13370A79003j14389R0466M6334j82692J91469L26225N1125M6780q7784l27076
13360B19461j46382P0040M3147O8339J4778n6762m1422J0941J2504Q9693J70108
13349D54445l280J03793k23438j57677r1141k5668N3018r5726Q0111J81919o7946
13338B08410j08930J71334q9735r9359L91842J33606J19310r1035j25814p1195
13328D38434r0789p5253j25888J72780K16327k3903M4521M529j98938R5854j21277
$$ plain form
13403 756992 562996 284001 395846 383068 269930 321337 399069 406436 413457 547729 440058
13392 440058 315844 402506 447137 477881 462715 464669 452966 333042 370281 508683 346770
13381 346770 198535 184891 331499 401688 423618 502756 417831 271990 91288 113856 179003
13370 179003 64614 155080 201414 18722 210191 536416 587541 634321 546537 219461
13360 219461 73079 143119 186266 254605 269383 212621 171199 182140 194644 284337 454445
13349 454445 451165 554958 331520 173843 82702 57034 110052 14326 94437 276356 208410
13338 208410 99480 270814 181079 81720 473562 607168 726478 635443 509629 438434
13328 438434 347645 272392 146504 319284 535611 511708 556229 560758 361820 457674 336397
13317C36397m9100q0124N7784M5914J54598J58960n3626m00171r4447k959J08857
13306A82083P1822j73600J0333J18430P9808j31M0411j00597q9158P4059J85641
13295C99101P1799p4608k559k40340m2853J03256M1559J25542k0167k7850L1389
13284C64269j59427j37775L3934p493O691P5709n4825Q0723J82980j93705o7199
13273A23882J86482j71834k30665p6452J86067J00241q0429o9282Q0127N9619
13263A07756j66512r7713j37341J64116J33682J7386L4394M6805J71773J94288
13253D68634l5689k40381k93421O1754J65469J35046Q8497J30030K15529p5q0304
13242F15089m4046l19638j33386J50980J64907j80421o5938J14649Q4302L3499
$$ plain form
13317 336397 287297 207173 264957 310871 465469 624429 570803 170632 76185 73226 182083
13306 182083 253905 80305 90638 209068 288876 288745 329156 228559 139401 213460 399101
13295 399101 470900 396292 393733 153393 110540 213796 255355 380897 360730 332880 364269
13284 364269 204842 67067 101001 93508 100199 175908 121083 201806 384786 191081 123882
13273 123882 310364 138530 -92135 -168587 17480 117721 37292 -31990 48137 107756
13263 107756 -58756 -156469 -293810 -129694 3988 21374 55768 102573 274346 468634
13253 468634 432945 192564 -100857 -39103 126366 261412 349909 479939 695468 695393 615089
13242 615089 571043 251405 118019 268999 433906 253485 187547 302196 386498 419997
13232D19997J28675j31570j82094n2036J71756L51009L1895m3777N6391J35820
13222H86066j73481l76156K18798K52476j09943k56939j96339O3820N266N4253
13212C67821K8700j59716j63685K5920J0540j36381j49575J98168L60671j1260
13202C71203j2778l4153l3375k903j97330J39262J15339n2512n9892o6224q54
13191A65783j32450J61425M8831o2504O4930J20816Q3456l7402o1123J90799r0878
13180D51683j262P9877o7917j14848m3180J31758L8141k4845m0728n6427J21779
13169D74031N3991L2921n2113J38603J000k1271k72839j05774J14678j34897r5881
13158A32449N2437J97785K35472Q9984L699j84955j23072J05391J24219N0696
$$ plain form
13232 419997 548672 417102 235008 182972 354728 705737 737632 693855 750246 886066
13222 886066 712585 336429 555227 807703 697760 440821 244482 308302 313568 367821
13212 367821 396521 236805 73120 99040 109580 -26801 -176376 21792 382463 371203
13202 371203 358425 324272 290897 287994 90664 229926 345265 292753 232861 166637 165783
13191 165783 33333 194758 243589 181085 246015 366831 450287 412885 351762 542561 451683
13180 451683 450421 530298 462381 347533 304353 436111 474252 449407 408679 352252 474031
13169 474031 528022 560943 508830 647433 648433 627162 354323 248549 363227 228330 132449
13158 132449 184886 382671 618143 708127 711826 526871 403799 509190 633409 684105
13148F84105J41322L2521n994l4202j44244M3761j62609M4993p5363j80418R4955
13137D38827J55872M4854k25383J03245L7337m4847k06622M3453O4335K4913R1217
13126E27201j2666M3817j00820O5007j1248l9761p548P7527J41526j23314j27287
13115D32434j3754J38974r60j22188n467j32132J5989m7701J39364J2283j04505
13104C12337n4749p392M334J04786p0126l5747j74738r79O3207l2362j75593m4939
13092a11961J73053K98098R6243k13665j5307O8312p6496p5375o475m7981k8627
13081E9819P1120J39644O7463J27084N4415o4334o3426J0504p8951j37393o2156
13070A23789n9996J12634K77650J69687J41366j91729q2323R8074J56002j99621
$$ plain form
13148 684105 825427 857948 851954 817752 673508 717269 554660 599653 524290 343872 438827
13137 438827 594699 639553 414170 517415 554752 509905 303283 346736 411071 435984 527201
13126 527201 514535 558352 457532 522539 511291 471530 463982 541509 683035 559721 432434
13115 432434 418680 557654 556694 434506 429039 296907 312896 265195 404559 416842 312337
13104 312337 257588 250196 254530 359316 289190 253443 78705 77726 140933 108571 -67022 -111961
13092 -111961 61092 359190 455433 241768 226461 294773 218277 142902 136427 88446 59819
13081 59819 130939 270583 338046 465130 519545 455211 391785 402289 323338 185945 123789
13070 123789 63793 176427 454077 623764 765130 573401 491078 589152 745154 545533
13060E45533o1768J73658l9905O7424J18389k87492q9893J45859k46681k11791
13050A13333J13380J61649L9740K9318j34028k3067J80813J2063p8399J99602
13040F14404J2407J04687J86636j0967k8814o9530M1393q2462k57597Q324k57168
13029B61313k6942N3199L2151o5047P4185J34373R1423Q729m5098j9241J41118
13018F40163q5325K7690J11804m8894j10403L4562O464O7874N0903n7510r9827
13007E37501J7779n2462l00700j11037M4230J54718K79224J77439J05296j14837
12997G37151j88906m4522K7542j85513p4015o06n323J49531K23677j195k89568
12986C48253k9381Q5583O7637Q761j69152k20859K17499P4569j39440O9119L27238
$$ plain form
13060 545533 483765 657423 617518 684942 803331 515839 425946 571805 325124 113333
13050 113333 226713 388362 428102 457420 323392 300325 481138 493201 414802 614404
13040 614404 626811 731498 918134 907167 878353 808823 850216 767754 510157 518481 261313
13029 261313 234371 287570 319721 254674 328859 463232 554655 563384 518286 499045 640163
13018 640163 554838 582528 694332 645438 535035 569597 576061 643935 694838 637328 537501
13007 537501 555280 502818 202118 91081 135311 290029 569253 746692 851988 737151
12997 737151 548245 503723 531265 345752 271737 271131 265808 415339 639016 637821 348253
12986 348253 318872 404455 472092 480853 311701 90842 308341 382910 243470 312589 639827
12975F39827K57255m3540n8818J01833j7161l57769j72698J31960L01820j01426
12965F81283j64618J40070J8411L6111N0640R4589o8328j76034r6384m5834O5783
12954E35689O3726o4850J15365m8844q0988r0603K16113j5191j85317N8291J06570
12943F09961p2393K2595K64606j35489j83772J36676N5623n9751j95852J0053
12933D52257J59139L05771M4526j723M0634j37227k8230j12618j51275j30285
12923D40969J52677P5463Q8235j3965J22189j21490j0953Q6410k86968o1748J10180
12912E80999K3468j408k25183p6856J54387R7926K72836J0820j3862q0247j38203
12901F04677q0288j69569O6454K02415m1249M7227R2988q1208J14923j1407j62540
$$ plain form
12975 639827 897082 853542 794724 896557 879396 521627 348929 480889 782709 681283
12965 681283 516665 656735 675146 711257 761897 856486 788158 612124 515740 469906 535689
12954 535689 599415 534565 649930 601086 520098 429495 645608 630417 445100 503391 609961
12943 609961 537568 560163 824769 689280 505508 642184 697807 638056 442204 452257
12933 452257 611396 917167 961693 959970 1000604 863377 835147 722529 571254 440969
12923 440969 593646 669109 757344 743379 865568 744078 733125 819535 532567 470819 580999
12912 580999 604467 603059 377876 301020 455407 553333 826169 836989 823127 742880 604677
12901 604677 524389 354820 421274 623689 582440 629667 722655 641447 756370 744963 582423
12890E82423J5599j09205P8266L3558q7374J1799N6702P3637l143J44233J69107
12879I65602j79554j00255j42393l7097K1196l7538p7274j65780j5998N2921J33375
12868D17205J47580J19776K0926m8903P9141m1606Q7013m9113k31196J8j0103
12857D90738l9185L0302J95192L7519Q4517N0080J8155n0099j79678j18228L7648
12846E56961P3668J2609p3776j14153j04463K91734J43523K33776L6137k36043
12836H19973j06417J12041j85133j6927K8907J24145L66104k1584j32864j01120
12826H87125l3440p0485J58881K28714l9139j55993j56431j31172J31905m8394
12816G71571R6822o433r1227j66135j77550J1754J72271P5031J05993j2929l5951
$$ plain form
12890 582423 598022 488817 567083 600641 513267 525066 581768 655405 652262 796495 965602
12879 965602 786048 685793 543400 506303 527499 489961 412687 246907 230909 283830 417205
12868 417205 564785 684561 705487 656584 735725 694119 781132 732019 500823 500841 490738
12857 490738 451553 481855 677047 714566 799083 849163 867318 817219 637541 519313 556961
12846 556961 630629 643238 569462 455309 350846 642580 786103 1019879 1056016 819973
12836 819973 713556 825597 640464 623537 652444 776589 1142693 1121109 988245 887125
12826 887125 853685 783200 942081 1170795 1131656 975663 819232 688060 819965 771571
12816 771571 868393 861960 770733 604598 427048 438802 611073 686104 792097 779168 743217
12805G43217n795n374M1694J37874j9073j66891m8812q0027k563J66805J74025
12794I35080j01965M7244J07463j47439j4524m3329n9048R2393K77281J05302
12784A198458N2493K3007j68585j22954j15425j96415j72410J15849J94730J36178
12774I44926p1182l7076j41282j60845K5275N1760O1541j7243n0754P4971K58632
12763I38723J46732l487p8266q7597k16092n6160J10853N9830N5030k4861O4654
12752I09359J2727O0415Q741J03342J15367n021m2900j19464j56339l3598J22467
12741I75096Q2053l2435L9620J7481k9957n9532j0211l2983K9208M8025K3070
12730A049435K4741j91319k65017K11444K84729j00932l799J42611J96543k4280
$$ plain form
12805 743217 737422 732048 773742 911616 892543 725652 676840 596813 594250 761055 935080
12794 935080 833115 880359 987822 840383 825859 782530 723482 815875 1093156 1198458
12784 1198458 1250951 1273958 1105373 982419 866994 670579 498169 614018 808748 944926
12774 944926 873744 836668 695386 534541 559816 611576 673117 655874 605120 680091 938723
12763 938723 1085455 1081968 1003702 916105 700013 643853 754706 814536 869566 844705 909359
12752 909359 922086 982501 991242 1094584 1209951 1204930 1162030 1042566 886227 852629 975096
12741 975096 1057149 1024714 1064334 1081815 1051858 992326 982115 949132 978340 1026365 1049435
12730 1049435 1074176 882857 617840 829284 1114013 1013081 1009282 1151893 1348436 1324156
12720A324156k83891j68656L9000j55804M2183N8962J30569j23580o1396J81035
12710I82578m5605m4014J35058J3430J24127P1948k5150j87294n9865j00047o2878
12699H02288K57497Q8678p5850k8434l3462J07321l2489k02597l2500K16490J9521
12688A086463R2842J10737j05473J79691l0203j54900L5166j39414j18871J71889
12678A127927l3359k1818L183P1235L2724J06832K85324q0503l2739k8138j50443
12667A280225r4027Q5213J7211j1830j00600j45156J49538L5354J06984l732m023
12656A315157l5012r6695R4986J24675L0459Q6423j56026l01193j94970J67506
12646A035310J99132J63258q4434J17868q8993j39846j09277k4183J2388K8944
$$ plain form
12720 1324156 1040265 871609 910609 754805 796988 855950 986519 862939 801543 982578
12710 982578 936973 892959 1028017 1041447 1165574 1237522 1212372 1025078 965213 865166 802288
12699 802288 1059785 1148463 1072613 1044179 1010717 1118038 1085549 882952 850452 1066942 1086463
12688 1086463 1179305 1290042 1184569 1364260 1334057 1179157 1214323 1074909 956038 1127927
12678 1127927 1094568 1072750 1075933 1147168 1179892 1286724 1572048 1491545 1458806 1430668 1280225
12667 1280225 1186198 1271411 1288622 1276792 1176192 1031036 1180574 1215928 1322912 1319180 1315157
12656 1315157 1280145 1183450 1278436 1403111 1433570 1519993 1363967 1062774 867804 1035310
12646 1035310 1234442 1397700 1313266 1431134 1342141 1202295 1093018 1068835 1081223 1110167
12636A110167J98920j00637l3404R988N835l6319J82581m577q4311j61R2467J46100
12624A486649P3706j26985r3184k8246L1711m6587J32223o3508J70482J38303
12614A674564r1120j91685l8077l3476p3947J43020Q1807j9415L466k40282n4351
12603A160504J5983J00775J73160J00691j36311l3826n4239P916K04792P8018
12593A617463k05604N5311J11852j37368j53456J08161J10961J17037J50242M6101
12583A820700j2995N3312O0004j88739j754N4248o8244k7763J17595K78721j3315
12572B071770k22160l12592k8339Q6139Q8666m892q9923N5207r0864O6163K8616
12561A647791K35508j42013j59501Q898L9555J83469L4313M4342O0659M6647M5632
$$ plain form
12636 1110167 1309087 1208450 1175046 1185034 1190869 1154550 1337131 1332554 1248243 1248082 1340549 1486649
12624 1486649 1560355 1433370 1340186 1311940 1343651 1297064 1429287 1365779 1536261 1674564
12614 1674564 1583444 1391759 1353682 1320206 1246259 1389279 1471086 1451671 1455137 1214855 1160504
12603 1160504 1176487 1277262 1450422 1551113 1414802 1380976 1326737 1334653 1539445 1617463
12593 1617463 1411859 1467170 1579022 1441654 1288198 1396359 1507320 1624357 1774599 1820700
12583 1820700 1807705 1861017 1921021 1732282 1730528 1784776 1716532 1688769 1806364 2085085 2071770
12572 2071770 1849610 1537018 1508679 1594818 1683484 1678592 1588669 1643876 1553012 1619175 1647791
12561 1647791 1883299 1741286 1581785 1590683 1630238 1813707 1848020 1892362 1953021 1999668 2045300
12550B045300O0263N0020n0811Q9769j52516m8992k4545j51300R520J49685P971
12539A984364j03707J38415j57039K82432L98724K55492J07298l35787j66007
12530B404185Q2747J51243K21232K33569J57814Q2125P0746K60070K79564L59806
12520D303101L40503K95523L46607O39688M18547L31332J14533K02874N42R9387
12510G092637K6127j55960j05637L0973k00688j21369j57422k19135o4204m06234
12500E719088k45450R8125K13562J13000J42732O5778J83906M23967J14628J60506
12490F989842J71212J31429N7721K41135J06013m5111p9129m24061l75874l46547
12480F426630m53120k40399k96933m42794l86965j36097J62784k30173j92797
$$ plain form
12550 2045300 2105563 2155583 2104772 2194541 2042025 1993033 1968488 1817188 1826708 1976393 1984364
12539 1984364 1880657 2019072 1862033 2144465 2543189 2798681 2905979 2570192 2404185
12530 2404185 2486932 2638175 2859407 3092976 3250790 3332915 3403661 3663731 3943295 4303101
12520 4303101 4643604 4939127 5285734 5925422 6343969 6675301 6789834 6992708 6993250 7092637
12510 7092637 7118764 6962804 6857167 6888140 6687452 6566083 6408661 6189526 6125322 5719088
12500 5719088 5473638 5571763 5785325 5898325 6041057 6106835 6290741 6714708 6829336 6989842
12490 6989842 7161054 7292483 7350204 7591339 7697352 7652241 7573112 7149051 6773177 6426630
12480 6426630 5973510 5733111 5436178 4993384 4606419 4470322 4633106 4402933 4210136
12471D210136j09706l39940j75347j438J15152O971j60333k41990j54891J19214
12461C267828j71271l5123K59955J8151n8972m418Q4740l6913j4507O6962n7846
12450C318586O6791N5884M2522J01322L5516J35680P8412n9981P2868K28011M90834
12439D566445O36347K85726J70212K98259M26919M09762M43062N03485N77804
12430H318021M46720L50890J70466J76105R011k4396O0701j5500l1355k93114
12420I167549n02581m74371j49093k05713l13893m6068J54184K54J85148K11985
12410H027401j1175J93415L00426Q3419L40279K81325K8398k1781J12849J6197
12400I350753k69004j49479j92487j81332l92365m80807m37531l93814m78849
$$ plain form
12471 4210136 4100430 3760490 3585143 3583705 3698857 3705828 3545495 3303505 3148614 3267828
12461 3267828 3096557 3061434 3321389 3339540 3280568 3276150 3360890 3323977 3309470 3376432 3318586
12450 3318586 3385377 3441261 3483783 3585105 3620621 3756301 3834713 3774732 3847600 4075611 4566445
12439 4566445 5202792 5488518 5658730 5956989 6383908 6793670 7236732 7740217 8318021
12430 8318021 8764741 9115631 9286097 9462202 9471213 9446817 9507518 9492018 9460663 9167549
12420 9167549 8664968 8190597 8041504 7835791 7521898 7475830 7630014 7630268 7815416 8027401
12410 8027401 8016226 8209641 8510067 8593486 8933765 9215090 9243488 9221707 9334556 9350753
12400 9350753 9081749 8932270 8739783 8558451 8166086 7685279 7247748 6853934 6375085
12391F375085j81181r3382m33208m22293j35640p6576k27574R8245j77850j52856
12381D572770j44931k6P4422j29188N6281j2013j58553n949P1645j0497j81784
12370D132177m0271j14933k14230m7732R8879N1822m6828k82398J0862J75226
12360C722574J49506J49085r8593j02698O8006Q6147P7398J365L2201j55521q5850
12349C843620j39469M5327K2779l987j47132j71477L55193K91399j05556q8797
12339C901900P0111k7674M1977j02740m2789r2154n270l2250J86793O2556p6429
12328C884031J1138O3564J67245J32815O7717k01748j42044J06774J37339M9893
12318D276724J68613j46772j74421q286J32328n4472k08557L4304L8653J37288
$$ plain form
12391 6375085 6193904 6100522 5667314 5245021 5109381 5032805 4805231 4903476 4725626 4572770
12381 4572770 4427839 4427813 4502235 4373047 4429328 4417315 4258762 4252813 4324458 4313961 4132177
12370 4132177 4091906 3976973 3762743 3715011 3813890 3865712 3818884 3536486 3547348 3722574
12360 3722574 3872080 4021165 3922572 3819874 3887880 3974027 4051425 4052790 4084991 3929470 3843620
12349 3843620 3704151 3749478 3772257 3768270 3621138 3449661 3804854 4096253 3990697 3901900
12339 3901900 3972011 3944337 3986314 3883574 3840785 3748631 3743361 3711111 3897904 3960460 3884031
12328 3884031 3895169 3958733 4125978 4258793 4326510 4124762 3982718 4089492 4226831 4276724
12318 4276724 4445337 4298565 4124144 4115858 4248186 4193714 3985157 4019461 4058114 4195402
12308D195402K15146K4070J25005J12217j8290K6981p1555Q9284r3013k30719
12298D374528k2976O5660J15151O9405j32508J50219J57349j05224o0347K43386
12288D854643J57813O6457m1368M3060l3078l39710r7513j58722J14835K82609
12278D849026J73913L6225L2719O3845N684m1404R2657p3899k09950M5214J8545
12267D992575o8366m4330P1457Q5035O0846K61016J31387k051o925m1318L7480
12256E476806j02557m3430p8120J02409K79756q8136j02817J36388J35803K12142
12246E928244Q8392j75432j80601r3132j01183J16125M443n690Q1020J80025N8499
12235E900710J54946Q4515N3433j30454K296q558J14981K87550K32531J12535
$$ plain form
12308 4195402 4410548 4434618 4559623 4671840 4653550 4680531 4608976 4698260 4605247 4374528
12298 4374528 4351552 4417212 4532363 4601768 4469260 4619479 4776828 4671604 4611257 4854643
12288 4854643 5012456 5078913 5037545 5080605 5047527 4707817 4610304 4451582 4566417 4849026
12278 4849026 5022939 5059164 5091883 5155728 5161412 5120008 5212665 5138766 4928816 4974030 4992575
12267 4992575 4924209 4879879 4951336 5036371 5097217 5358233 5489620 5487569 5480644 5439326 5476806
12256 5476806 5374249 5330819 5252699 5355108 5634864 5546728 5443911 5580299 5716102 5928244
12246 5928244 6016636 5841204 5660603 5567471 5466288 5582413 5586856 5581166 5662186 5842211 5900710
12235 5900710 6055656 6140171 6193604 6063150 6065446 6056888 6171869 6459419 6691950 6804485
12225F804485k1844j10389k15211k72308J71732J79523j28770q2778K82899K68688
12215F876027Q1442k6078q0313k3654K64461J68450P3619J82522R5499J75559
12205G787534Q0050P1921j443O08M43830N11560J13733K9943J13102R1816J04941
12194I347595J42391J81964J74110K62152J79801R2412K60351L11628K95300M52996
12184A1700700L16334O4751O2599K64668M799j51333j84450L6244k6440q5522
12174A2002350j9377J5504J23478j16789p5532j76513m1516R6731L05350p5485
12164A2038201j49619k7751k98512j89347l12266l5355k3309k62045k65646l590
12154A0470761P4072P254j93914p9622l28942k5391L25588k7100j86917J46962
$$ plain form
12225 6804485 6782641 6672252 6457041 6184733 6356465 6535988 6407218 6324440 6607339 6876027
12215 6876027 6957469 6931391 6851078 6827424 7091885 7260335 7333954 7516476 7611975 7787534
12205 7787534 7867584 7939505 7938062 7938670 8382500 8894060 9007793 9037736 9150838 9242654 9347595
12194 9347595 9489986 9671950 9846060 10108212 10288013 10380425 10640776 10952404 11247704 11700700
12184 11700700 12017034 12081785 12144384 12409052 12413851 12262518 12078068 12114312 12087872 12002350
12174 12002350 11982973 11998477 12121955 12005166 11929634 11753121 11711605 11808336 12113686 12038201
12164 12038201 11888582 11860831 11562319 11372972 11060706 11025351 11002042 10739997 10474351 10470761
12154 10470761 10544833 10552087 10358173 10278551 9949609 9924218 10249806 10222706 10035789 10182751
12144A0182751J38032J72853J37975K4752J43951J73610R9173M06093N5987K31782
12134A1766959L03742J40096M06659N26526M49299L23610M38339M71472L71262
12125A5197964M99903O02345N42372O19462N80394L81290M82127J15262J25327
12116A9146446K25539K90084K35j13702M3400J95711N4725J13151J34450L27911
12106B0417950M8782j21684m0948J12810J30008J76250p0136p7127O7171N7008
12096B0700084j95411l54605j43410n2866k18931o01467n36518m28714m55574
12087A7712588m52702m73340l90853k51227k57535j48659L6281k54421k69744
12078A5250388l78180m49574j05351k62995J7007j24277k85218l06352j61450
$$ plain form
12144 10182751 10320783 10493636 10631611 10656363 10800314 10973924 11073097 11479190 11535177 11766959
12134 11766959 12070701 12210797 12617456 13143982 13593281 13916891 14355230 14826702 15197964
12125 15197964 15697867 16300212 16842584 17462046 18042440 18423730 18905857 19021119 19146446
12116 19146446 19371985 19662069 19662304 19548602 19592002 19787713 19842438 19955589 20090039 20417950
12106 20417950 20466732 20345048 20304100 20416910 20546918 20723168 20653032 20575905 20643076 20700084
12096 20700084 20504673 20150068 20006658 19953792 19734861 19133394 18596876 18168162 17712588
12087 17712588 17259886 16786546 16395693 16144466 15886931 15738272 15774553 15520132 15250388
12078 15250388 14872208 14422634 14317283 14054288 14071295 13947018 13661800 13355448 13193998
12069A3193998L5222K5259J80281J58886J0203l107R4962N0668l545k4137O6565
12058A3785255L25467N41961N30490L36910Q7858m0288K34481K48050J69924K08065
12048A6428173J24586K17861K86227J58893J33993k31626J40177m2132o4234N8084
12038A7210002N1111J57420O5978j59859j38161p6637j06225J9050j50583k23638
12028A6648458l77141l55080j93574r9520j83709N0760j09505k59817l1305j64754
12018A4924813k11867k49068j52432p3838m4282j18010m97093k20807j12033l03518
12008A2941865k97738j64041r7784k3238k95639k65884o4989n1632j39364j85658
11998A1355898k45341J67654p6886j20679J16508K2593j17337k13601l25031n2297
$$ plain form
12069 13193998 13229220 13254479 13434760 13593646 13603849 13600742 13695704 13746372 13742827 13718690 13785255
12058 13785255 14110722 14652683 15183173 15520083 15607941 15567653 15802134 16050184 16220108 16428173
12048 16428173 16552759 16770620 17056847 17215740 17349733 17118107 17258284 17216152 17151918 17210002
12038 17210002 17261113 17418533 17484511 17324652 17186491 17109854 17003629 17022679 16872096 16648458
12028 16648458 16271317 15916237 15722663 15623143 15439434 15490194 15380689 15120872 15089567 14924813
12018 14924813 14712946 14463878 14311446 14237608 14193326 14075316 13578223 13357416 13245383 12941865
12008 12941865 12644127 12480086 12382302 12359064 12063425 11797541 11732552 11680920 11541556 11355898
11998 11355898 11110557 11278211 11201325 11080646 11197154 11219747 11102410 10888809 10563778 10511481
11988A0511481J54419l8596r0127J99295N4132n7176p4601l9012k6924K7147J22885
11977A0742923p5943k15553j66700J10669O6582j18129Q6871m1414P9734R5446
11967A0564486o3199j72019j1297L8897m2991l6715m031O7150J48349n0378p1476
11956A0366776j4633M7441m9959Q3092j39571j91557q1747j60660J31218J6875
11946A0007275p5985o3725j9929n3682j28186m2508K26496P800r3587R4046J79753
11935A0037768k71278l29288J7597J09711Q5879O1141j85446k29636J51693J45943
11925I594084Q5235p1803j24669k00852j15886m2014J35430Q0371J9561L8307
11915I397764j09535j66330j49881J28152J67344J8709r4886J2336k3723J5323
$$ plain form
11988 10511481 10665900 10627304 10537177 10736472 10790604 10733428 10658827 10619815 10592891 10620038 10742923
11977 10742923 10666980 10451427 10284727 10395396 10461978 10343849 10430720 10389306 10469040 10564486
11967 10564486 10501287 10329268 10317971 10356868 10313877 10277162 10273131 10340281 10488630 10438252 10366776
11956 10366776 10352143 10399584 10349625 10432717 10293146 10101589 10019842 9859182 9990400 10007275
11946 10007275 9931290 9867565 9847636 9793954 9665768 9623260 9849756 9857556 9763969 9858015 10037768
11935 10037768 9766490 9437202 9454799 9564510 9650389 9711530 9526084 9296448 9448141 9594084
11925 9594084 9679319 9607516 9482847 9281995 9166109 9124095 9259525 9339896 9359457 9397764
11915 9397764 9288229 9121899 8972018 9100170 9267514 9286223 9191337 9203673 9179950 9195273
11905I195273N2996K9024M720J87529K36562N2255L14998J70891L84871L66908
11895A0996027J36195j33044J73420L35987M63211N28796N87828O11508M66627
11886A4166555N83703N54196N39025M86536L62212N25398J60356k22277m38144
11877A6717560k45939l56796o32205n73836m02360m61843m65337l43242m86611
11868A2749391l62746n24815l20206j47575k36097j73038k09579k17559k20847
11859A0336929k17953l31451q3837Q1962O3834m6283m34332l63158m16343k21739
11849H367629J20203M7447n0428J20682L022J33814O3943l299j33605k75774n2104
11838H341530n9926M3786J80711j26816K31313J91046j98505p497J50242K27556
$$ plain form
11905 9195273 9248269 9277293 9282013 9469542 9706104 9758359 10073357 10244248 10629119 10996027
11895 10996027 11132222 10999178 11172598 11508585 11971796 12500592 13088420 13699928 14166555
11886 14166555 14750258 15304454 15843479 16330015 16692227 17217625 17377981 17155704 16717560
11877 16717560 16471621 16114825 15482620 14908784 14506424 14044581 13579244 13236002 12749391
11868 12749391 12386645 11861830 11541624 11394049 11157952 10984914 10775335 10557776 10336929
11859 10336929 10118976 9787525 9703688 9785650 9849484 9803201 9368869 9005711 8589368 8367629
11849 8367629 8487832 8535279 8484851 8605533 8608555 8742369 8806312 8803013 8669408 8393634 8341530
11838 8341530 8281604 8325390 8506101 8379285 8610598 8801644 8603139 8595642 8745884 8973440
11828H973440J54390J095K18518L58340L42392L52886J47090K78504O31177Q01486
11818A2259318M98025N13661O38812O08859M89626N38125M81841O67131N63170
11809A7258568M72017M50041K81744L8063K637L6342J17454r8578P4214k08849
11799A8423653r1804o8059J57776O919O7j29392m32489n89640p05708n92040n52997
11788A5426286o54517n70482o17811o34562o79912m75137m81942n54740n49356
11779A0207827n54047k90896k32959m77905m32666p1624j78218k48993j02361
11770G618158k09634J2846k41475j58005J65065k6428k11781k24619j40932J4802
11760F597997Q7732m8814N8000J4994j65397j38803k71849m2704Q6653J23422
$$ plain form
11828 8973440 9127830 9128925 9347443 9705783 10048175 10401061 10548151 10826655 11457832 12259318
11818 12259318 12757343 13271004 13909816 14518675 15008301 15546426 16028267 16695398 17258568
11809 17258568 17730585 18180626 18462370 18500433 18503070 18539412 18656866 18558288 18632502 18423653
11799 18423653 18331849 18263790 18421566 18428485 18428552 18299160 17866671 17277031 16571323 15979283 15426286
11788 15426286 14771769 14201287 13583476 12948914 12269002 11793865 11311923 10757183 10207827
11779 10207827 9653780 9362884 9129925 8652020 8219354 8147730 7969512 7720519 7618158
11770 7618158 7408524 7421370 7179895 7021890 7186955 7160527 6948746 6724127 6583195 6597997
11760 6597997 6685729 6636915 6694915 6709909 6544512 6405709 6133860 6091156 6177809 6301231
11750F301231l4650J85021J87534Q6758N6911J6638j21070K5896j13017J62570
11740F753822L16746J65875M3669J40866M13972M23076L34673M47361L11165K72233
11730I623458L72623M56968P30179O35309N97180M41224J36734K18726J36121
11721A3348522j43927m14608m96486k32037k31122l41665m90199m35293l31067
11712A0232118l96450l70125j86032j25077q5281j68612j36354k04144k34638
11703H325405k29497k89648k96689l30570m9573j40842m17555j84505P1676n8372
11693F399830q4423K85888l33602m22534k1029J93739j19334O0996K7397J95300
11683F182228J97737R5642L12661J94445M7140N4007J58542L37311O342o2596
$$ plain form
11750 6301231 6266581 6451602 6639136 6725894 6782805 6799443 6678373 6704269 6591252 6753822
11740 6753822 7070568 7236443 7280112 7420978 7834950 8258026 8592699 9040060 9351225 9623458
11730 9623458 9996081 10453049 11183228 11818537 12415717 12856941 12993675 13212401 13348522
11721 13348522 13204595 12789987 12293501 12061464 11830342 11488677 10998478 10563185 10232118
11712 10232118 9835668 9465543 9279511 9154434 9069153 8900541 8764187 8560043 8325405
11703 8325405 8095908 7806260 7509571 7179001 7129428 6988586 6571031 6386526 6458202 6399830
11693 6399830 6315407 6601295 6267693 5845159 5824130 6017869 5898535 5959531 5986928 6182228
11683 6182228 6379965 6475607 6788268 6982713 7029853 7083860 7242402 7579713 7586055 7523459
11673G523459J72168J05822J37622k5493j68773k46848N6981L0590j18732j4630
11663G452166J43721j50328M9824M9042O788L2259N7078R4413p2416k4120K4613
11652G663040k53193q1821R4381O5318J18262l13429M8385l9036n02508m50177
11642F349222m7406o7101k14080m40684k76681j09585q5425J8377Q8374K12495
11632E427506j34402j77592j30244L7674k35886l01484J747M5463N5760o0551
11622D527991R9145l9884j54154l8945J41222p7357j35931k93639N7182J40844
11612D226474J79213K27678J85100K4231L8696J76966j59378o3612J95780Q0730
11602E111878K37047L16452K65395L19455K68478K42702J15765P5202K09214J29814
$$ plain form
11673 7523459 7695627 7801449 7939071 7913578 7744805 7497957 7554938 7585528 7466796 7452166
11663 7452166 7595887 7445559 7495383 7544425 7551213 7583472 7640550 7734963 7662547 7638427 7663040
11652 7663040 7409847 7328026 7422407 7487725 7605987 7292558 7340943 7301907 6799399 6349222
11642 6349222 6301816 6234715 6020635 5579951 5303270 5193685 5108260 5126637 5215011 5427506
11632 5427506 5293104 5115512 4985268 5022942 4787056 4485572 4487319 4532782 4588542 4527991
11622 4527991 4627136 4587252 4433098 4394153 4535375 4458018 4322087 4028448 4085630 4226474
11612 4226474 4405687 4633365 4818465 4842696 4881392 5058358 4898980 4835368 5031148 5111878
11602 5111878 5348925 5665377 5930772 6250227 6518705 6761407 6877172 6952374 7161588 7291402
11592G291402J26689m5697P1874K087J73578J42258j418k61359k63982k04656
11582G030776l10728k53564j29729J09693N5426j36056o5216N5403J15434M7080
11572F518519j07073k1531K8178o9145o9828j00033j12650P449M2952r1672m18542
11561E606624l47663k19421j58246j45948J56448j12963k53926l62556k61106
11552C901243k10439j43274O0251p1655k16975j10361R8566M2600q8400o1741
11542C199815j31487k2356R7682R2128k6677J11152N9879j14513j46329j52671
11532B966623j87882k8475n4812J23557J11283J66006N3373N6402J20898M7295
11522C374268L4526J78251P6719n9220J66039K2919K998O0445q4899r8020m0901
$$ plain form
11592 7291402 7418091 7372394 7444268 7446355 7619933 7762191 7760773 7499414 7235432 7030776
11582 7030776 6720048 6466484 6336755 6446448 6501874 6365818 6300602 6356005 6471439 6518519
11572 6518519 6411446 6389915 6418093 6348948 6279120 6179087 6066437 6073886 6116838 6025166 5606624
11561 5606624 5258961 5039540 4881294 4735346 4891794 4778831 4524905 4162349 3901243
11552 3901243 3690804 3547530 3607781 3536126 3319151 3208790 3307356 3349956 3261556 3199815
11542 3199815 3068328 3045972 3143654 3235782 3209105 3320257 3380136 3265623 3119294 2966623
11532 2966623 2778741 2750266 2695454 2819011 2930294 3096300 3149673 3206075 3326973 3374268
11522 3374268 3408794 3587045 3663764 3604544 3770583 3793502 3796500 3856945 3772046 3674026 3633125
11511C633125j05648J06919J11023O5076J23231j24659j35291P0427j29329j34213
11501C480661M7537l5116j16390J44227r8056o2444L08031j55366k33576R8100
11491C377608q6183j82932k37123k58524r3808J25232K60104k48073k75507J23180
11481B503974j32551j60874j17348j1725Q3664K3778m4697k35295j76988Q3423
11471A815361J11404j4584L6425J12400j80012j20887J9179J13534J46129j2864
11461B026085l5231j5412L7271j32584j85502j40807l0122r5003P8079R525R2627
11450A608926K65157Q7979j15007j92382q7928r9158l1459J14267K28361J53722
11440A932478j41302k27021j56726j4679l5465J19733J73971k0507j3431Q471
$$ plain form
11511 3633125 3527477 3634396 3745419 3810495 3933726 3809067 3673776 3744203 3614874 3480661
11501 3480661 3528198 3493082 3376692 3520919 3422863 3360419 3668450 3513084 3279508 3377608
11491 3377608 3291425 3108493 2871370 2612846 2519038 2644270 2904374 2656301 2380794 2503974
11481 2503974 2371423 2210549 2093201 2081476 2165140 2188918 2144221 1908926 1731938 1815361
11471 1815361 1926765 1912181 1948606 2061006 1880994 1760107 1779286 1892820 2038949 2026085
11461 2026085 1990854 1975442 2012713 1880129 1694627 1553820 1523698 1428695 1506774 1516299 1608926
11450 1608926 1874083 1962062 1847055 1654673 1566745 1467587 1436128 1550395 1778756 1932478
11440 1932478 1791176 1564155 1407429 1392750 1357285 1477018 1650989 1630482 1617051 1625522
11430A625522K2695O4493L2481j11775O5939j44352j37540J67578L5420j29536
11420A490925p7635P1070O7030j20251l4390Q6481M8764n1502J83300O3190p2500
11409A654482j83688j59748L3584L6620P3228j2349j85324q7520R5695J63126
11399A428106J90048j30354O8613r6866j60349J38020K25798j2622j05986j41932
11389A402476r8459J28970J9673Q0797j9316l13670r8351L05338Q7790j28843
11379A366405k87203n8431J46324j0836q1743L02924M2992j93378o076J24130
11369A345108m9692q2280k33462q3944K16663R6610r7782k30912j29208L867J84297
11358I39265J33578N372J52465j61617j30829J80606J70328Q149j49629k32170
$$ plain form
11430 1625522 1648217 1712710 1745191 1633416 1699355 1555003 1417463 1585041 1620461 1490925
11420 1490925 1413290 1484360 1551390 1431139 1396749 1483230 1531994 1480492 1663792 1726982 1654482
11409 1654482 1470794 1311046 1344630 1381250 1454478 1442129 1256805 1169285 1264980 1428106
11399 1428106 1618154 1487800 1556413 1459547 1299198 1437218 1663016 1650394 1544408 1402476
11389 1402476 1304017 1432987 1452660 1533457 1514141 1200471 1102120 1407458 1495248 1366405
11379 1366405 1079202 1020771 1167095 1156259 1074516 1377440 1420432 1227054 1220978 1345108
11369 1345108 1295416 1213136 979674 895730 1112393 1209003 1111221 880309 751101 754968 939265
11358 939265 1072843 1078215 1230680 1069063 938234 1118840 1289168 1297317 1147688 915518
11348I15518k969P133J216L9858P437k05648J92136K78440p8377j65137q7692
11337I01915m27J16591j76765j79522J79737J49482j18218l0019J7654J96366
11327A056794L38387O3139m0913m1760l15375j70079q498M05485M4303r827k01734
11316A119922O4965n9276j64922k33755N4761J66419j37900k66913M556K55387
11306H03244K34872J52928J97350n2389j30679p4896L7661K27762j34855k07110
11296A053888L2974N0644p2723r7420K0169Q0524j83731K17370J53064k9775k86216
11285I38768k18352k24682n8733J92186n0889J91538K27395o6340M9158o7694
11275I12355J3064L3288q383q7458q2115k494k4680p9064J25781J49586K8252
$$ plain form
11348 915518 912549 919682 920898 960756 968193 762545 954681 1233121 1154744 989607 901915
11337 901915 901488 1018079 841314 661792 841529 991011 872793 842774 860428 1056794
11327 1056794 1395181 1458320 1417407 1375647 1060272 890193 881695 1287180 1331483 1321656 1119922
11316 1119922 1184887 1125611 960689 726934 781695 948114 810214 543301 547857 803244
11306 803244 1038116 1191044 1388394 1336005 1205326 1130430 1168091 1395853 1260998 1053888
11296 1053888 1086862 1137506 1064783 967363 987532 1068056 884325 1101695 1254759 1224984 938768
11285 938768 720416 495734 437001 629187 578298 769836 997231 930891 980049 912355
11275 912355 925419 958707 950324 862866 780751 778257 753577 674513 800294 949880 978132
11264I78132q3986j90332R745L3551j5190Q8378O1998J09212J11233j50062l61069
11253E91610j160J24237P0641J02414j17962j05201J5418J61094J30733O9875
11243A041699M3237p266O6732p7240j37862m7556j32688O9922J48707M6197q616
11232A005266n6397j16724r7890q1807P9234L6433j44697J3210K38941L61828
11222A237397k15183l61551L1524P2148n1071J57227j10648k8783K10346r0211
11212H51195j26271O534L9081J78660M8455j66112L7663J460k433J10192j39809
11201H38615k76768q1591j50236M1210K36407J87089j25273r8625k8799j76023
11191C66006K8783J67939J63297J65837l6496j89354J52119J71535M085k7188
$$ plain form
11264 978132 894146 703814 713559 747110 731920 820298 882296 991508 1102741 952679 591610
11253 591610 590450 714687 785328 887742 769780 664579 679997 841091 971824 1041699
11243 1041699 1084936 1077670 1144402 1067162 929300 881744 749056 818978 967685 1013882 1005266
11232 1005266 948869 832145 734255 652448 731682 768115 623418 636628 875569 1237397
11222 1237397 1022214 660663 692187 764335 713264 870491 759843 731060 941406 851195
11212 851195 724924 731458 770539 949199 997654 831542 869205 870665 868232 978424 838615
11201 838615 561847 480256 330020 371230 607637 794726 669453 570828 542029 366006
11191 366006 394789 562728 726025 891862 855366 666012 818131 989666 993751 966563
11181I66563l0932m0931j6766P1443J92584K0276k47123k28696o4334R6877j00607
11170F18354k12232K0323J17703l2519q2069r6182K73J88028K20785j04799K7955
11159F65620j52585K0121P8443J76958q8384J6051K13551q3032j97133K6048J36858
11148H12516j73400o6070J00409j03371k0844N1021R7039l8447M3848o384o6017
11137F30300j43262M2695J18610J06114N3427n111J10531K5051m9718j7753k01688
11126F69196k37176J16728J38711j2209o8135J36778J22699n7054n8947J36353
11116H86944M2329k09287j64999m71N6387j17223L7733J31880j6041J66318k11493
11105F02077k88440Q3752M3766n3643m5066J0136j31476J3611J45734J1501J28261
$$ plain form
11181 966563 935631 894700 877934 949377 1141961 1162237 915114 686418 622084 718961 618354
11170 618354 406122 426445 544148 511629 429560 333378 333651 521679 742464 637665 665620
11159 665620 513035 533156 611599 788557 700173 716224 929775 846743 649610 675658 812516
11148 812516 639116 573046 673455 570084 549240 600261 697300 658853 702701 696317 630300
11137 630300 487038 529733 648343 754457 807884 802773 913304 938355 888637 870884 669196
11126 669196 432020 548748 687459 675250 607115 743893 866592 809538 750591 886944
11116 886944 929273 719986 554987 554516 610903 493680 531413 663293 647252 813570 602077
11105 602077 313637 397389 441155 387512 342446 352582 221106 234717 380451 391952 520213
11094E20213M7309q3530K4868r1668N1059O6207p4097P8375K84217M3977j53513
11083G13417n2428J613j85531j99647J19145j9603j66506K59919K07593j03867
11073E74105J17279N1111r716J8950M8105J23475j15157k41542j01977l6613o0181
11062C67839n6600R5924r6064j00628l7878N1526R2565J47072q3333Q0438o3342
11051C97519j95944K21483J74910J86552Q8766j2892r3901j45264k69520p7502
11041B74207J2070J28666L4475Q6378J80582M6303n8715R7217J01452N9723j42167
11030H20191O9843K39233j0329J72316O4824J29610J10504j41263j42358K2426
11020A334997P1534R6635K4170J99602K66742l330J29486P9502k26457J00972
$$ plain form
11094 520213 567522 483992 508860 417192 468251 534458 460361 538736 822953 866930 713417
11083 713417 660989 662602 477071 277424 396569 376966 210460 470379 677972 574105
11073 574105 691384 742495 732779 751729 799834 923309 808152 566610 464633 428020 367839
11062 367839 311239 407163 311099 210471 172593 224119 316684 463756 380423 460861 397519
11051 397519 201575 423058 597968 784520 873286 860394 766493 621229 351709 274207
11041 274207 286277 414943 449418 535796 716378 762681 703966 801183 902635 962358 820191
11030 820191 890034 1129267 1118938 1291254 1356078 1485688 1596192 1454929 1312571 1334997
11020 1334997 1406531 1503166 1527336 1726938 1993680 1990350 2119836 2199338 1972881 2073853
11010B073853l43699l23094M777j29599p7912J68067O6143J71162n5518o8636
11000A485544l2510k78916k46669j12274J01414j97221O9388K55071J13617r3146
10990A064298p2957j42977k28988m842l7853P4480P4247R3673j02259j91667j1837
10979E13318K9051j09835k2479J5576k0866M8140J5175j5332M208j59401k2579
10968B74976K86946p071r7466O2919J4415j81820j26245n0869p9876q7645J39491
10957A47755K80504J12119j06377j10504P6354o8164J4502J1668Q892j08902m4360
10946B13487J54377Q413o7108k7426q279Q1848J1204R0393J00346n2018q3033
10935D22204M3102j46412j77186q0770R9572j42118j2793K73684J73820R3647
$$ plain form
11010 2073853 1730154 1407060 1411837 1282238 1204326 1372393 1438536 1609698 1554180 1485544
11000 1485544 1453034 1174118 927449 815175 916589 719368 788756 1043827 1157444 1064298
10990 1064298 991341 848364 619376 614534 576681 651161 725408 819081 716822 525155 513318
10979 513318 542369 432534 410055 425631 404765 452905 468080 452748 456956 297555 274976
10968 274976 561922 554851 457385 520304 534719 352899 226654 175785 95909 8264 147755
10957 147755 428259 540378 434001 323497 399851 331687 346189 357857 366749 257847 213487
10946 213487 367864 376277 309169 281743 273464 355312 366516 456909 557255 505237 422204
10935 422204 465306 318894 141708 60938 160510 18392 5599 279283 453103 546750
10925E46750J4589k08580J5476m0046j81015k7253j7728l9985M8094K4782J94012
10914C29096Q6966P2893P5485j03776r0922k64116p3083j2074J96156J37874o4626
10903B89873j27293p9628j20086n5802K83973j9753k06572j61922L208j07310
10893c01312Q3606Q8745J44813J60429l9830j78101m4329J06085J21919j10945
10883C1080j87399j31557l2346L85332P2345o5773j02654j20179J96536N3436
10873I8821r0298K66034P6779j94775j01876J08615K2062j9982p4585O3925L3875
10862A88595J25241M0454R7268J07062m3628l01660j69905K3958K23186r4086
10852A96485p263L3557j24441o5054J18026J81839p7621j42950J13732l541p62
$$ plain form
10925 546750 561339 352759 368235 328189 147174 119921 102193 62208 110302 135084 329096
10914 329096 416062 488955 564440 460664 369742 105626 32543 20469 216625 354499 289873
10903 289873 162580 82952 -37134 -92936 191037 171284 -35288 -197210 -194002 -301312
10893 -301312 -217706 -128961 15852 176281 136451 -41650 -85979 20106 142025 31080
10883 31080 -156319 -287876 -320222 65110 137455 71682 -30972 -151151 45385 98821
10873 98821 8523 274557 351336 156561 54685 163300 185362 165380 90795 154720 188595
10862 188595 313836 354290 451558 558620 514992 213332 43427 67385 290571 196485
10852 196485 189222 222779 98338 33284 151310 333149 255528 112578 226310 222769 222007
10841B22007m1316k1453N4579M8737J21144n7449K4920j1300k9988p0708j47701
10830I1472J48955N8458K3329k2471j06614K8112l4670L1873K562m2660N6966
10819B35312O3922J32939j00115j80447n1613Q5536M9977m7826K34797M6802l65223
10808A04061k23889j37434K51889N2217K3388J03971o3432k11157l1091q9504
10798b20981j53744j6816L70009K9171n8154M5356O7190p5266p7876o2216q8118
10787b41445j07434n8151J56885K64869J32527j24938j2834m6575n2528L3638
10777e5986j97157j4001J22619L310K25788N1965j11479J7046L1904j55060j98959
10766b80010M436J77354J08048K83986J33885J9025j7927J60174J78159M1991
$$ plain form
10841 222007 180691 159238 213817 262554 383698 326249 351169 339869 309881 239173 91472
10830 91472 240427 298885 322214 299743 193129 221241 186571 218444 221006 178346 235312
10819 235312 299234 432173 332058 151611 99998 185534 235511 187685 422482 469284 104061
10808 104061 -119828 -257262 -5373 46844 70232 174203 110771 -100386 -131477 -220981
10798 -220981 -374725 -391541 -21532 7639 -50515 -5159 62031 -13235 -91111 -153327 -241445
10787 -241445 -348879 -407030 -250145 14724 147251 22313 9479 -37096 -89624 -55986
10777 -55986 -253143 -267144 -144525 -141215 84573 136538 25059 42105 74009 -81051 -280010
10766 -280010 -275574 -98220 9828 293814 427699 446724 428797 588971 767130 809121
10756H09121l09884p2406l053j06812J61680Q0326m2209M4568j36893m8249m6576
10745C29613K7916K09655J2446J73903K36132O9764o087j07274k02960O676j5824
10734G33960R3688n0843k81776j9534J18521R4803J5926K22788J2027j26295o8205
10723G45060j54531p3013K3165N5615J0725J8643j8272L1877q0021l5638k9689
10712D93921Q5022l19477m2266K67201K8877j68333r7395K2984P1557M8739M7212
10701D38042J17032k71903m7260O1036j07563N5435j34378Q0074L6533O5824J85256
10690D78128m3107j14524j70356J03484r4605N1089k171k9886J12216n0415j15173
10679A24680p567l8188j39693L5463N371j61834k73366J47715K29343m8161o3964
$$ plain form
10756 809121 499237 426831 423778 316966 478646 558972 516763 561331 424438 376189 329613
10745 329613 357529 567184 579630 753533 989665 1059429 1053342 946068 743108 749784 733960
10734 733960 827648 776805 495029 475495 594016 688819 704745 927533 939560 813265 745060
10723 745060 590529 517516 540681 596296 607021 625664 607392 639269 559248 523610 493921
10712 493921 578943 259466 217200 484401 513278 344945 247550 270534 342091 390830 438042
10701 438042 555074 283171 235911 296947 189384 244819 110441 190515 227048 292872 478128
10690 478128 435021 320497 150141 253625 159020 210109 207938 178052 290268 239853 124680
10679 124680 117113 78925 -60768 -25305 -19934 -181768 -455134 -307419 -78076 -126237 -190201
10668a90201J11431j1281k6725O4194J48801J09610l7021j29366n1492J7532K93
10657E775o2560o0699J70303L31585j0312j54079J77414r0097L1613J89787k4550
10646E04180l4872j58147r2932j16227J71252J95352J35627m7892K34776K22928
10636A014045q7786j83919j13767K54678L25306K36006K17729K46807L83753K77816
10626B570668L27858L87964N01996N41861M01210L93499M39314Q60184J069373
10617G493927J491257K039222K637836L673506N163537P120219R785229J2532824
10609E1937557J4389255J4235969J0357629L634517k324225m866711m182659r97281
10601H2184051L733159R482419J6414237K3947319K9280713K8230829J7360028
$$ plain form
10668 -190201 -78770 -90051 -116776 -52582 96219 205829 168808 39442 -12050 5482 5775
10657 5775 -56785 -117484 52819 384404 374092 220013 397427 307330 338943 528730 504180
10646 504180 469308 311161 218229 102002 273254 468606 604233 556341 791117 1014045
10636 1014045 926259 742340 628573 883251 1208557 1444563 1662292 1909099 2292852 2570668
10626 2570668 2898526 3286490 3788486 4330347 4731557 5125056 5564370 6424554 7493927
10617 7493927 8985184 11024406 13662242 17335748 22499285 29619504 39404733 51937557
10609 51937557 66326812 80562781 90920410 94554927 92230702 87363991 83181332 82184051
10601 82184051 85917210 95399629 111813866 135761185 165041898 193272727 210632755
10594B10632755J19028j4158225j9550436j6635277r134047J98928J0407385K1214841
10586A83094952L1395303L7446970L3533482J5147981j1378628l0970637l6679015
10579B21590408l1602958k1678041j1066717j169449Q229401J6287888J9906600
10572B00497132J5741478K212051j5177829k6917778k9062294k4254538j7222774
10565A05815448j0337664m213358Q74388L951756N050735K663984l188669r479880
10557I1136740j3773998j4527467j2791851j0119645p571492n877164m238748
10550B2236375l006719k439011j717332j317945r91899p45943r20846r17327q23847
10541I355506o73451n72070o61874k81479m00983m87617j75274o6766j00233k67706
$$ plain form
10594 210632755 210751783 196593558 177043122 160407845 151273798 151472726 161880111 183094952
10586 183094952 214490255 251937225 285470707 300618688 289240060 258269423 221590408
10579 221590408 189987450 168309409 157242692 156073243 164302644 180590532 200497132
10572 200497132 216238610 218450661 203272832 176355054 147292760 123038222 105815448
10565 105815448 95477784 91264426 92138814 96090570 101141305 103805289 100616620 91136740
10557 91136740 77362742 62835275 50043424 39923779 32352287 26475123 22236375
10550 22236375 19229656 16790645 15073313 13755368 12763469 12017526 11096680 10179353 9355506
10541 9355506 8682055 8109985 7448111 7166632 6765649 6278032 6102758 6035992 5935759 5668053
10531E668053m57399k12543j63184n8308k50326l5215k61328k65533r0200J7737
10521C891754m9538k36544k65357m8432p2440j65688o0240k012J7205p5333o8523
10510B864852k74953k02109J05001J62802q7458P026j06764j46704J20166k0246
10500B421613N3114K00689R5354r0089q6730l29741j38069M6527r5924n3857j5145
10489B007742j55193o972k22960l0235j26786J07288J64572m0826o7581J04353
10479A733402r9070k45158n8587l7016J76602J33643j4396l67o8126j00739o6311
10468A353877J05526L2846O8662q685j36619J2407N6162j07131j69411J7264l8297
10457A186601k99170j77067J08303L1149K0923l3193m6565k6922m7751M2911r530
$$ plain form
10531 5668053 5210654 4998111 4834927 4776619 4526293 4491078 4229750 3964217 3874017 3891754
10521 3891754 3842216 3605672 3340315 3291883 3219443 3053755 2993515 2991503 3008708 2933375 2864852
10510 2864852 2589899 2387790 2492791 2655593 2568135 2575161 2468397 2321693 2441859 2421613
10500 2421613 2474727 2675416 2770770 2680681 2593951 2264210 2126141 2172668 2076744 2022887 2007742
10489 2007742 1852549 1845577 1622617 1592382 1465596 1572884 1737456 1696630 1629049 1733402
10479 1733402 1634332 1389174 1330587 1293571 1470173 1603816 1589420 1589053 1520927 1420188 1353877
10468 1353877 1459403 1492249 1560911 1552226 1415607 1428014 1484176 1377045 1207634 1224898 1186601
10457 1186601 887431 710364 818667 849816 870739 837546 790981 764059 716308 759219 749689
10446G49689M6895M7041j55408n2218P3422j17223R1629K9443L7344j4819j41033
10435E94762J6853R5059L3983j36138r7731L6145k62424o8224K30604J56721K16490
10424H16100m2266R632o6937j02861n6804J87210J08723L2514k4896m8548n9686
10413G52181K4658K44203J68207k63753k56557k06128j08035J09393K39284M96391
10403A199844p668k58338M4971m0457k7341N1157P3165p8189j58054p7684J44399
10392H65805J6704L4731N8451q5499j07963Q0327L19662n7174j89893j90328N3498
10381G98321N7798R1636L0263K15411n0239n2718k51587j04258J34653K45686
10371A114966L0149l13266k3183J06487r3142K51037M6406k76095j70803L9250
$$ plain form
10446 749689 796584 843625 688217 635999 709421 592198 683827 713270 750614 735795 594762
10435 594762 611615 706674 740657 604519 506788 542933 280509 212285 442889 599610 816100
10424 816100 773834 783466 716529 613668 556864 744074 852797 885311 860415 811867 752181
10413 752181 776839 1021042 1189249 925496 668939 462811 354776 464169 703453 1199844
10403 1199844 1192176 933838 978809 938352 911011 962168 1035333 957144 799090 721406 865805
10392 865805 882509 917240 975691 890192 782229 862556 1182218 1125044 935151 744823 798321
10381 798321 856119 947755 978018 1193429 1143190 1090472 838885 734627 869280 1114966
10371 1114966 1145115 831849 808666 915153 822011 1073048 1119454 843359 672556 711806
10361G11806K3130j53795j26595j45085J24150J75141j89991k1675J6194J82331
10351E95611J61799k599R0249n7713J26628q1377j4892K42479Q1126j95989l99821
10340E45501j81589J54150J91690J13O0041P9758j97858q4042k0812O3864j78769
10329D32047j46008O8467K40624J85121k321K2162M9876n3285J67721K1672k20222
10318G65854q4403R7792j8220n4263q6713L4167O1436P8798J26767j16186k34437
10307E70592o697l8941j58250Q2418m3422J37803j17355N6885j56466j68776K28465
10296C86256K25320K16170Q6282l47201k54170J78533K1449N2625r7866O874J40227
10285F14499j56501r8682P4156j13527p5810J13921K65040K14375L2626J4913
$$ plain form
10361 711806 734936 581141 454546 309461 433611 608752 418761 397086 413280 595611
10351 595611 757410 754811 845060 787347 913975 832598 817706 1060185 1141311 945322 545501
10340 545501 363912 518062 709752 709865 769906 849664 651806 567764 546952 610816 432047
10329 432047 286039 354506 595130 780251 777930 800092 849968 796683 964404 986076 765854
10318 765854 681451 779243 761023 706760 620047 654214 715650 794448 921215 805029 570592
10307 570592 563895 524954 366704 449122 405700 543503 426148 483033 326567 157791 386256
10296 386256 611576 827746 914028 566827 312657 491190 512639 565264 467398 474272 614499
10285 614499 457998 359316 433472 319945 244135 358056 623096 837471 870097 885010
10275H85010J70616j91203j81160J84681P66R0349J9546k10104j21731M7046l7475
10264F56341J12466N3995r6831J29804J64124o5284o7923l14595r0474j32807
10254C48816P8020J00608J6610n402J62824N7628j05480K002J3137K7309n7064
10243F39008q3910j40467l3560o7135K6597r7640j27659J81575K47571M6794j40770
10232D50404j09027j21561N1727N0960M28816L04743k29388k09829q3103O3039
10222E96781J41204O234l7959j04957j27192N7737R7959k9883q1548j39764o1399
10211C17213Q8634k6754J05245P1240j62608k10861R8264J76310L8483p1511R1831
10200E15486J8095m7419o9599m2726n2161N6351J74807k28480j17442L3476m3614
$$ plain form
10275 885010 1055626 864423 683263 867944 868710 959059 978605 768501 646770 693816 656341
10264 656341 768807 822802 725971 855775 1019899 954615 886692 572097 481623 348816
10254 348816 426836 527444 544054 538652 701476 759104 653624 655626 668763 696072 639008
10243 639008 555098 414631 381071 313936 340533 242893 115234 296809 544380 591174 450404
10232 450404 341377 219816 271543 322503 751319 1056062 826674 616845 533742 596781
10222 596781 737985 744219 706260 601303 474111 531848 629807 599924 518376 378612 317213
10211 317213 405847 379093 484338 555578 392970 182109 280373 456683 495166 423655 515486
10200 515486 533581 486162 416563 373837 321676 378027 552834 324354 206912 240388 196774
10189A96774K2046P171O7964N0637J06531J39630q3381l6781j91332p6885J4054
10178B16428j00382P4338K75775M55203j0764k79772j10592L18714J91511L9473
10168A069932r5094j2545j08189m2359R8554O730l4034K81891K80265J29488J22480
10157A697119j1352k01537l29875o0295o921l4154K39453L07028K55528K32955
10147B087949l8558m7749n6599k06659l39717l61180q5534J37215j7707k9523
10137A041938J81185R6605J11012r4007q8656o8841l38698j27408J24053O2390
10127H99573j20973O8126j31873K5036J1267p6185m1546J24852j18501j43427
10117D96349p1961R929Q3906r5421o7716j20719K0685N5241o5854Q8464L2430
$$ plain form
10189 196774 218820 225991 293955 344592 451123 590753 507372 470591 279259 202374 216428
10178 216428 116046 190384 466159 921362 910598 630826 520234 838948 1030459 1069932
10168 1069932 974838 962293 854104 811745 910299 917029 882995 1164886 1445151 1574639 1697119
10157 1697119 1685767 1484230 1154355 1094060 1087139 1052985 1292438 1599466 1854994 2087949
10147 2087949 2049391 2001642 1945043 1738384 1398667 1037487 951953 1089168 1071461 1041938
10137 1041938 1223123 1319728 1430740 1336733 1248077 1179236 840538 713130 837183 899573
10127 899573 778600 846726 714853 739889 751156 674971 633425 758277 639776 496349
10117 496349 424388 434317 518223 422802 355086 234367 255052 310293 244439 332903 365333
10106C65333M049K7543J8608K6372Q773o229k8813j32441k0736p9346j77613k4619
10094a9119K53691J23383J75564j55789o6658j20281L27284J18249j26214j32151
10084C77959j4678o0118J39930m6180j33655l01567L2323J50595q883M825J24953
10073B65504Q2233P4136L9705j37153j58620j36318j18314O4363K80057K03806
10063D59399P2637M9785j17768k25713Q2371l4315j93788K6445J49776q8348r4717
10052H5764Q5493R3752J41925J35434m6042l8909P7749J76263L3070n0009J14382
10041H08872R0886k51969k51212j59953j65689N3153J5776Q5115Q2004q0729j04365
10030A21889o0529Q8997J27157N7749l838R9920j71149j13442K5604m4477O9434
$$ plain form
10106 365333 369382 396925 415533 441905 450678 444449 415636 283195 262459 183113 5500 -19119
10094 -19119 234572 357955 533519 377730 311072 190791 518075 636324 510110 377959
10084 377959 363281 303163 443093 396913 263258 -38309 -5986 144609 135726 140551 265504
10073 265504 347737 421873 461578 324425 165805 29487 -88827 -24464 255593 459399
10063 459399 532036 581821 464053 238340 320711 286396 92608 119053 268829 180481 85764
10052 85764 171257 265009 406934 542368 496326 457417 535166 711429 744499 694490 808872
10041 808872 899758 647789 396577 236624 70935 124088 139864 224979 306983 226254 121889
10030 121889 61360 150357 277514 335263 331425 431345 260196 146754 172358 127881 197315
10019A97315o2342n5206J95770R5251P6122j34899J46046O7414l46k71110k24161
10008B9854J42608j53370k9181K94658J94298K52643Q2732k74618K8449R346j80679
9997C96740L1092O9408Q1811M4746J14124j16031j57376n0760j72321o8480O866
9986A79819J59722P2746J96802k74214j22394r0556j92546n3731J42510R0662
9976A08820l2532M0415j01366o6024N4471R7740n2860O5620K2517J9400J13926
9965B70127K81628P3644k02951P1987j42137l77202k161J80649Q2284J78758k8971
9954C85655l3645j35110j43895j39469K44114K26345k1109m2061j74555j71659
9944e389N7215N9893K14622J09236M8816M5100k05248m0479o319o0716r5704l5441
$$ plain form
10019 197315 134973 79767 275537 370788 446910 312011 458057 525471 525125 254015 29854
10008 29854 172462 19092 -10089 284569 478867 731510 814242 539624 568073 577419 396740
9997 396740 427832 497240 579051 623797 737921 621890 464514 413754 241433 172953 179819
9986 179819 339541 412287 609089 334875 212481 121925 -70621 -124352 18158 108820
9976 108820 76288 116703 15337 -50687 3784 101524 48664 114284 136801 156201 270127
9965 270127 551755 625399 422448 494435 352298 -24904 -27065 153584 235868 414626 385655
9954 385655 352010 216900 73005 -66464 177650 403995 382886 340825 166270 -5389
9944 -5389 51826 111719 326341 435577 484393 529493 324245 283766 277447 216731 121027 85586
9932H5586k03454j7827k325P5358J75896K70844O3482P061Q137N1275P4144l7747
9920E50430j27005q7804N8334n0473p6883K4558q3193k21930L3354j6120J96999
9909B00267K32172j0031k58484j946Q4240m5400Q9873j32810l5709R2693j11257
9898A03608K09727p9150o8986r5898j25745K9095J79284K7822o6822j39330l725
9887c0120J45568L0276j57795r5318J04062R9139J66454n9825J40384K12720J08394
9876F63939j48512k06609j77883K9547j22952j13328j3182J18582l2563P9341
9866G6380J27753O9108N3861J838N05Q6511Q493q9846O6044J48455J31029Q7251
9854G67382n2258j47944r7666j09588J86561J34681k07214k02451j8764O4665
$$ plain form
9932 85586 -117868 -135695 -138020 -62662 113234 384078 447560 454621 462758 514033 588177 550430
9920 550430 423425 335621 393955 343482 266599 291157 207964 -13966 19388 3268 200267
9909 200267 432439 422408 163924 161978 246218 200818 290691 157881 122172 214865 103608
9898 103608 313335 234185 165199 69301 -56444 -27349 151935 179757 112935 -26395 -30120
9887 -30120 115448 145724 -12071 -107389 -3327 95812 262266 202441 342825 555545 663939
9876 663939 515427 308818 130935 160482 37530 -75798 -88980 29602 -2961 76380
9866 76380 204133 273241 327102 328940 329445 415956 424449 334603 400647 549102 680131 767382
9854 767382 715124 567180 469514 359926 546487 681168 473954 271503 252739 317404
9844C17404p3603j3183l8330j56000J47491J00475j43530j00229R8975N5795O3349
9833B58614Q8415k33388r8801J24470K9821p1416p5916J81028L13336r8563k39241
9822A78359p0527O5961J50830N5032p0265q4459M8913R050o8393k17009o3j37693
9810a40264p8873K41983L07791m1676L5810J07648k17475p0481Q2950K16764J67579
9799F11756l4536m1490L1080q965Q1812k9887p1005k37383l17221k93922J74697
9788a35064K82743N3039O0615l406m6723K9594l2965J1610j07459o8140K0693
9777F4537k1686J3533J41186J7123k2810O4541n0099j66803j72700O7099K53007
9766A86928n7127j57906K29527k688M8367k133k26071j4304L13070L24374j62192
$$ plain form
9844 317404 243801 230618 192288 36288 183779 284254 140724 40495 139470 195265 258614
9833 258614 347029 113641 14840 139310 169131 97715 21799 202827 516163 417600 178359
9822 178359 107832 173793 324623 379655 309390 224931 273844 282894 214501 -2508 -2571 -140264
9810 -140264 -219137 22846 330637 288961 324771 432419 214944 144463 227413 444177 611756
9799 611756 577220 535730 566810 557845 639657 609770 538765 301382 -15839 -309761 -135064
9788 -135064 147679 200718 261333 257927 211204 240798 207833 219443 111984 43844 64537
9777 64537 42851 56384 197570 214693 191883 256424 206325 39522 -133178 -66079 186928
9766 186928 129801 -28105 201422 198734 247101 244968 18897 4593 317663 642037 479845
9755D79845o3193j49153j89470J9158L2652Q101j89890Q394m4809J9902j30701
9744a99164n6985J43348J99577j57921L4717J21950J23965q5592J2183K25047
9734C61125J0753Q9602j17867j7615n0035O2405p309m3019M3237k9131j7181r1210
9722A93755J6995R1092N8657j93125n8757J15848J73036l9643k66328j1496J43752
9711B23786J53840O836Q441n5010P9669m5996j67368m0512O7326J37079J67153
9700E35244q6067k35616j90980J5837N4089M2006Q9464O2470K15468R5057o2588
9689E34384k06556j68356j89771q7810n412O8944k3462N0151O708P770l3234p2705
9677a19349l1750J79979N5879o4960L16239J81904j24601p6743J06051n0104n9523
$$ plain form
9755 479845 416652 267499 78029 97187 129839 137940 -51950 -43556 -88365 -68463 -199164
9744 -199164 -256149 -112801 86776 -71145 -36428 85522 209487 123895 136078 361125
9734 361125 371878 461480 343613 325998 275963 338368 331059 288040 331277 302146 284965 193755
9722 193755 210750 301842 360499 167374 108617 224465 397501 357858 91530 80034 223786
9711 223786 377626 384462 392903 337893 417562 371566 204198 163686 231012 368091 535244
9700 535244 449177 213561 22581 38418 92507 134513 223977 286447 501915 596972 534384
9689 534384 327828 159472 -30299 -118109 -123521 -54577 -78039 -27888 -21180 -13410 -46644 -119349
9677 -119349 -151099 28880 84759 19799 336038 517942 393341 316598 422649 372545 313022
9666C13022m2560j03341J9876N1931o1234M3718q8771j80710J34024N5061R0767
9655B31783J23469m9348J02745K38852M3146j16523k01468K309M2859J89721M4653
9644F52198O5233J2763p0099j54636k60642k7822J10144j99857k16697l2214K01893
9633H0264J67764j18603N2827K12920j71824j34835o8916K1184J52980P8027P2773
9622C44561j779m9194l0661M9394J8847M5196J06229J51873Q7143p2464j71425
9611D77720k4679P6657P9925k12873k37221m0165p49q0827j60866J95970K19481
9600B92373J37565o9096K3196J80994j05953n0794J06701p3569j49174N514P0360
9589C68117j56387j38351k49893o634N4672j6843J78412L9112J1362m626p58J08145
$$ plain form
9666 313022 270462 167121 186997 238928 177694 221412 132641 -48069 85955 141016 231783
9655 231783 355252 305904 408649 647501 690647 574124 372656 374965 417824 607545 652198
9644 652198 717431 730194 660095 505459 244817 216995 327139 127282 -89415 -121629 80264
9633 80264 248028 129425 182252 395172 223348 88513 19597 40781 193761 271788 344561
9622 344561 342782 293588 262927 312321 331168 376364 482593 634466 721609 649145 477720
9611 477720 453041 529698 609623 396750 159529 119364 118615 37788 -123078 72892 292373
9600 292373 429938 360842 384038 565032 459079 408285 514986 441417 292243 297757 368117
9589 368117 211730 73379 -176514 -183148 -128476 -145319 33093 72205 83567 78941 78183 186328
9577A86328j49192r008K82000J1646l22141k7300J8114J41780L5907Q1081j1036
9566B38179j25145k23831Q7713J77069Q833R3984j433j0315l9639L458l0903o7119
9554A10851J25009o324O3348j507N4958j6629N3525k91103n8761k393J81821P8388
9542B91183j82002P5976m9581J4897L6067m2609j31779J78586L23404q1495j05965
9531C26682p1255j4455j31134n3983m307J92330p7634j6839p9310J688J18687
9520A90470J82981q3328M3262p5811M141K48254k54742j68617j3681j60341N91
9509h6821J96762o9561l5256m5762N274n22j1639j25428R5523J17086M5901J00493
9497A86050L2341j15686k3317m7366j66236N7918m7874J67452p6361j98297L1948
$$ plain form
9577 186328 37136 28128 310128 321774 -367 -27667 -9553 132227 168134 249215 238179
9566 238179 113034 -110797 -23084 153985 162818 256802 255369 245054 205415 208873 177970 110851
9554 110851 235860 229536 292884 291377 346335 329706 383231 92128 33367 30974 212795 291183
9542 291183 109181 185157 135576 150473 186540 143931 12152 190738 514142 432647 326682
9531 326682 255427 240972 109838 55855 51548 243878 166244 149405 70095 71783 190470
9520 190470 373451 290123 333385 257574 261715 509969 255227 86610 72929 -87412 -86821
9509 -86821 109941 40380 5124 -40638 -35364 -35886 -47525 -172953 -77430 39656 85557 186050
9497 186050 218391 102705 79388 32022 -134214 -76296 -124170 43282 -33079 -231376 -199428
9486a99428O8213J80408J09344R0657m2742p5750J40787R6710N7053j55732n2201
9475B17319k8973J30883n6259j66606o9885J75835J66834m6341r6548p9873o7786
9464G8600J03885O588K02663k28706o186J579j79780j70j7913k2634j17613J11959
9452f7728l5356L112Q1174P8872L4943k47456k38855J05429J19304K54318p0464
9441A7293J04535J12908j27679L0367O1625n0272m8989P3812J9642P9805K82752
9430E55799o402j65687j44357J9111p48l3796p537o9675l12437o3110K02446O7683
9418D1290j18365R4238J03812K07085L7367p9907j72315j00652J0418Q9959J15230
9407B28160n4572j45546K7003K84435l6675j12808k07180j1373J92450p7883j5581
$$ plain form
9486 -199428 -131215 49193 158537 249194 206452 130702 271489 368199 425252 269520 217319
9475 217319 188346 319229 262970 96364 26479 202314 369148 322807 226259 146386 78600
9464 78600 182485 189073 391736 163030 156844 158423 -21357 -21527 -39440 -62074 -179687 -67728
9452 -67728 -103084 -99972 -18798 60074 95017 -152439 -391294 -285865 -166561 87757 17293
9441 17293 121828 234736 107057 137424 199049 148777 99788 173600 193242 273047 555799
9430 555799 549397 383710 239353 258464 257716 223920 216383 146708 -165729 -228839 -26393 41290
9418 41290 -77075 17163 120975 328060 365427 285520 113205 12553 22971 112930 228160
9407 228160 173588 28042 55045 339480 302805 189997 -17183 -28556 163894 86011 70430
9396G0430k12752j16949J3381k2930M8558J77564J83111J67009k23886j44198
9386f0662J37680m0742K6788L592p4021O3622J37197j68887k16510J62078Q9577
9375E9712o1941o3742j00451K05327K3383l30564o8070J94994J36791J32658m1346
9364H6751j20536l577J28782K38925n707m9725Q7925J15392J30922k70226k44128
9353I4798p0488L10797L148j50929j45649j18428K01063L87269J07105k72432
9343C46254l8057K2271k17787K153k23221L15013K07378j14271k01123J05932
9333B04542l8652m68179J5569K76185J407L0450O8056M2312j31821P0843n3306
9322A7406J05061Q5121k01309M827O5552j8869J01698L16767j10283o5072O4736
$$ plain form
9396 70430 -142322 -259271 -245890 -268820 -220262 -42698 140413 307422 83536 -60662
9386 -60662 77018 36276 63064 66656 -7365 56257 193454 24567 -191943 -29865 59712
9375 59712 -2229 -65971 -166422 38905 62288 -268276 -336346 -141352 -4561 128097 86751
9364 86751 -33785 -37362 91420 330345 324638 274913 362838 478230 609152 338926 94798
9353 94798 24310 335107 338255 187326 41677 -76751 124312 511581 618686 346254
9343 346254 308197 330468 112681 114834 -108387 206626 414004 299733 98610 204542
9333 204542 165890 -302289 -286720 -10535 -9128 21322 89378 131690 -131 70712 17406
9322 17406 122467 207588 6279 11106 76658 57789 159487 476254 365971 300899 365635
9311C65635j67373k79673r5909Q0226L6121L97933N8158j83025k71405o0103o5345
9300a84760j5197J41801m1073o199p2100P0302Q1858R7383k4080j5361R5993m715
9288A23852m7891j31365L1099O1943L1192l510j12154n8686J81495J05596m1964
9277A39607P3474L20633J22275k25011l27924p2091R1799p7025j06644K4453J56164
9266A19710M7963q9324J81622J18718j60168j40763K413J55507j44830k0969j2669
9255E7210J42441L1764p9351j24723j94343J49556P1227p523n6677p379J04084
9244H6286J34311P2894j80450K0310J07745L4703Q3314J16635J9808l22151o6047
9233A07358O9800l9855J29143p65k97406o2755K52864P9863k1893O5572j06064
$$ plain form
9311 365635 198262 -81411 -177320 -97094 -60973 336960 395118 212093 -59312 -119415 -184760
9300 -184760 -199957 -58156 -99229 -105428 -177528 -107226 -25368 72015 47935 32574 128567 123852
9288 123852 75961 -55404 -24305 37638 68830 65320 -46834 -105520 75975 181571 139607
9277 139607 213081 533714 655989 430978 103054 30963 122762 45737 -60907 -36454 119710
9266 119710 167673 78349 259971 378689 218521 77758 80171 235678 90848 69879 57210
9255 57210 199651 231415 152064 27341 -167002 -17446 53781 46258 -10419 -17798 86286
9244 86286 220597 293491 113041 133351 241096 275799 359113 475748 495556 173405 107358
9233 107358 177158 137303 266446 265681 -31725 -94480 158384 238247 216354 281926 175862
9222A75862o7644J61175K9860m307O3625J66756J42144J25040r7973k59665k27284
9211B07589j39783J53894k420j17507N235M7875K3592j54225r7018O9824N2354
9200D9410K90699J12497j84262j67155k70767q4225n6725L7820K19522n0118j24525
9189b27829O8922j14853m1543R5785K12584J62751q7216k02448J12562J4286j56026
9178a63025J4652k77565O0586K48103k8273k8563O9268J30400j00620j23171j13935
9167c12143j8743J407o6092K48909P9450M34Q8141n1453K51830p7458j61757N7931
9155D0456L05838r4317j48600K37165l60j18156j17134O7919P1564r5948j34168
9144A4259q0044O8712M9536O8786P5646l1602Q490p5831m8163q6776p5552J99475
$$ plain form
9222 175862 108218 269393 299253 294946 358571 525327 667471 792511 694538 434873 207589
9211 207589 67806 221700 219280 101773 107008 154883 178475 24250 -72768 -2944 49410
9200 49410 340109 452606 268344 101189 -169578 -253803 -310528 -272708 -53186 -103304 -227829
9189 -227829 -158907 -273760 -315303 -219518 -6934 155817 68601 -133847 -21285 -6999 -163025
9178 -163025 -148373 -425938 -365352 -117249 -145522 -174085 -104817 25583 -75037 -198208 -312143
9167 -312143 -330886 -329479 -395571 -146662 -67212 -66778 21363 -30090 221740 144282 -17475 40456
9155 40456 346294 251977 103377 340542 340182 222026 104892 172811 244375 148427 14259
9144 14259 -65785 2927 52463 121249 196895 165293 173783 97952 49789 -36987 -112539 86936
9132H6936R0086m7156L14397M6107m9359n7825q9360j08640J15642j12523j11754
9121G6551k0719m0664j37190J92532K71816J39758n7480k55141j66178J51667
9111A54952K2478k2363J44290j59076m0833M4995j78332j80772N91O0415N9113
9100i4542K97526N8078o6892n2842J14073m2497p3732Q5423r0043o4502j29380
9089e9330p4933n8299m5705J59910J98706P7993J36824K5438p692p446N4776j85131
9077B15111j22781j88003k42814P6991K32320Q3162j4820n1649o2427j5204P7778
9066a2336J52782j42163K428M26333j93068k42728k2710k50967K0057Q5373L0660
9055a46339K04106J69705J2719j44277K41624K4131k24302l5494m0257Q1936J8865
$$ plain form
9132 86936 177022 129866 444263 490370 441011 383186 293826 185186 300828 188305 76551
9121 76551 55832 15168 -122022 70510 342326 482084 424604 169463 3285 154952
9111 154952 177430 155067 299357 140281 99448 144443 -33889 -214661 -214070 -153655 -94542
9100 -94542 202984 261062 194170 141328 255401 212904 139172 224595 134552 70050 -59330
9089 -59330 -134263 -192562 -238267 -78357 120349 198342 335166 360604 352912 345466 400242 215111
9077 215111 92330 -95673 -338487 -261496 -29176 53986 39166 -12483 -74910 -90114 -12336
9066 -12336 140446 -1717 711 427044 233976 -8752 -31462 -282429 -262372 -176999 -146339
9055 -146339 57767 227472 240191 95914 337538 361669 137367 101873 61616 143552 162417
9044A62417m8208j01855J17607J6531j61534q2998j4319J77683P8826l0745o2840
9033E0565K03990K9813j28646j02970N1003j03575j07275r6913K9006K321J15916
9022e6765O690j10238K33208J19175J5431Q6121j05422q0320Q66j1092n6578M4387
9010H5463J52474p1363j98746J01012K11517M0683L984o240j81779k87118k98922
8999d49035p9132J60002m6280P9399K86539J59165J10832J67495l01696j05917
8989a8628R0040J06510M0771p6936j82975K1380l7941j23273J09169K07718Q4703
8978B20538q4942r7415k7025R262K6725j06700j08581q5293N5778K67420L5762
8967A05529j50071j05176L5531j19500K31469K87562j37215n0380j02396N8346
$$ plain form
9044 162417 114209 12354 129961 146492 -15042 -98040 -112359 65324 144150 113405 50565
9033 50565 254555 284368 155722 52752 103755 180 -107095 -204008 -175002 -172681 -56765
9022 -56765 -50075 -160313 72895 192070 207501 293622 188200 107880 108746 97654 41076 85463
9010 85463 237937 166574 -32172 68840 280357 321040 325024 318784 137005 -150113 -449035
8999 -449035 -528167 -368165 -414445 -335046 -48507 110658 221490 388985 87289 -18628
8989 -18628 71412 177922 218693 141757 -41218 -19838 -57779 -181052 -71883 135835 220538
8978 220538 135596 38181 11156 20418 47143 -59557 -168138 -253431 -197653 69767 105529
8967 105529 -44542 -149718 -114187 -233687 -2218 285344 148129 97749 -4647 53699
8957E3699Q9028o4997J01033l3848N348P2445O0750j47713O963Q6212m2496j34957
8945E1467j82834O8273L08707J21622M1024n0085j01064o7065J3982j48953r0393
8934c5319R8813l2555j78049L784k39879N4609l1923O3451K17143K81472k9814
8923A71733L4806l0435J76927O3036l15913k72977J2177m2214p6019P2815K31435
8912B5371O7504r3761j81369J1397P2325L6508Q2621l6987O7554J05849j03645
8901E3367j93993K9265K83142Q4792n1912j08204k76840j0975K2388k3715K07374
8890A4689p0558J37974J80839n1833k1525m7304N8050q0952R5419R4294m8515
8879B60578l9143q5098l84558n7099K2482n6990R5507R4147J55019J16082K881
$$ plain form
8957 53699 142727 77730 178763 144915 150263 222708 283458 135745 142708 228920 186424 51467
8945 51467 -131367 -63094 245613 367235 408259 358174 257110 190045 204027 55074 -35319
8934 -35319 63494 30939 -147110 -143326 -383205 -328596 -360519 -297068 -79925 201547 171733
8923 171733 206539 176104 353031 416067 100154 -172823 -160646 -202860 -278879 -206064 25371
8912 25371 92875 -886 -182255 -170858 -98533 -62025 20596 -16391 51163 157012 53367
8901 53367 -140626 -111361 171781 256573 204661 96457 -180383 -191358 -168970 -192685 14689
8890 14689 -55869 82105 262944 211111 189586 142282 200332 119380 214799 309093 260578
8879 260578 221435 136337 -248221 -305320 -282838 -339828 -244321 -150174 4845 120927 123808
8868A23808j50612K8472q0087j53045K0492L6396j62585J16943N4110j0822q3130
8857b60060L5204j5525r4982L9758j5369Q6895J42197J41772J09883k2022j32207
8846A5544l9034j15308K1355K28542J42956q2251m0337N6771p2879j50520j22893
8835a58054M9397J70221K06171p6446j51378j56887J15096P1922j84494J20949
8825F497Q0980J40610J29225j25224q150J75551o2535j73546k19095N9824N3073
8814E7210J06815J73060j28308k58385j054J31332n9658K9844J51578O678q7929
8803A21183j5004p7605k7535m8437q8347Q9927J25989K9799k6781j74762j23133
8792b14706N3987l7286j3189l6590P9194O38o13M9366L0005k0843j0340R5447
$$ plain form
8868 123808 -26804 1668 -78419 -231464 -210972 -174576 -337161 -220218 -166108 -176930 -260060
8857 -260060 -224856 -240381 -335363 -295605 -310974 -224079 -81882 59890 169773 147751 15544
8846 15544 -23490 -138798 -117443 111099 254055 171804 131467 188238 115359 -35161 -158054
8835 -158054 -108657 61564 267735 191289 39911 -116976 -1880 70042 -114452 6497
8825 6497 87477 228087 357312 232088 223938 399489 336954 163408 -55687 4137 57210
8814 57210 164025 337085 208777 -49608 -50662 80670 21012 50856 202434 209112 121183
8803 121183 106179 28574 1039 -47398 -135745 -45818 80171 109970 83189 -91573 -214706
8792 -214706 -160719 -198005 -211194 -247784 -168590 -167952 -168565 -119199 -89194 -110037 -120377 -24930
8780b4930R9349J85963q5269M4469q2475J2339K1165J2629j8849n9030M1705j14353
8768C2713P6308K53449m349p629k6547j7108K0618j04791M1694Q0206R4712J11087
8756E50363k01991k07055k55918j48483P336K32692O7008L141j16337m7839J41812
8745B4729o4008j11799M2278J43501k6008K0364K1898j50677O0422O5777r1546
8734f5069k3595O0487O412k5003m6459k82736Q7613P0873J14756M9335k14077
8723b67463m0817J31733K88055R674n4112J86320P6854m052q3999r132m066p3407
8711A55588k36996N4278J84621N1930j68749l4494j02407L2909n6016M4843J76747
8700A02254J3729j18913K04597J88551J45454k57346j26719J1554k1391j90314
$$ plain form
8780 -24930 74419 260382 175113 219582 137107 149446 170611 183240 164391 105361 147066 32713
8768 32713 109021 362470 358121 350492 323945 306837 327455 222664 264358 344564 439276 550363
8756 550363 348372 141317 -114601 -263084 -255748 -23056 43952 47093 -69244 -117083 24729
8745 24729 -39279 -151078 -108800 34701 8693 29057 50955 -99722 -39300 26477 -65069
8734 -65069 -88664 -28177 -21765 -46768 -93227 -375963 -288350 -217477 -102721 -53386 -267463
8723 -267463 -308280 -176547 111508 121182 67070 253390 330244 326192 242193 233061 228995 155588
8711 155588 -81408 -27130 157491 209421 40672 6178 -96229 -63320 -119336 -74493 102254
8700 102254 115983 -2930 201667 390218 535672 278326 151607 163161 141770 -48544
8690d8544K9781R1771K24833j1945n0678K44918M4114j54296O4440O9136j1610
8679D91920Q5298j444J86750K98771K73920J00549K69988O09798O31783K15501
8669C162834k97015m50123n04218n21977k94033j39960j99546k32686j10711j92168
8659B20397J66646J30537j0115j97148j12496j01423J01238l2692k18010q7051
8649a40117o7881K827l9809Q9916J09081n5162k033J32693J99089K4724j95206
8638E8122m9646J08962J38433j56634n9651k31602J03867o3383M3810J6907j1620
8627a02435Q564J03947J55649J50941J7172J43951K44473j96751p8688j04368
8617C42455n9610l5914o6344r0066K81020K00783j00887k69654r342K45768l0908
$$ plain form
8690 -48544 -18763 73008 297841 285896 235218 480136 524250 369954 434394 503530 491920
8679 491920 577218 575774 762524 1061295 1335215 1435764 1705752 2315550 2947333 3162834
8669 3162834 2865819 2415696 1911478 1389501 1095468 955508 755962 523276 412565 220397
8659 220397 387043 517580 507465 310317 197821 96398 197636 164944 -53066 -140117
8649 -140117 -207998 -205171 -244980 -155064 -45983 -101145 -103178 29515 228604 253328 58122
8638 58122 8476 117438 255871 99237 39586 -192016 -88149 -151532 -107722 -90815 -102435
8627 -102435 -93871 10076 165725 316666 333838 477789 722262 525511 446823 342455
8617 342455 282845 246931 180587 90521 371541 572324 471437 201783 192441 438209 407301
8606D07301q9512M9004m2887J6730J25776L7707O620L200K09138M2470k26743
8595E38804O0468O6390j17062j60033j04755J72138k8791j98342k38033M620l2229
8584c6825J17281L8095m276m4211p1324J28939R3216N7777j88495q3249J51371
8573A58299P0112J37064R9020l9284l39617o5025q1328j02077q420K57158J35727
8562B21629R71j70860J02415R081j45838l1253o985J31406m650k78880m3385P3435
8550a42914J47490J81019l3434k17445N5111L0661j8916n048j00122K9402J73011
8539I8815K69159Q1383k82712k06181J06609J42732j28665o1939j29786Q5534
8529b5051p2489O3624M9112J44182K5137o3175j16006K304K99506J26731r6346
$$ plain form
8606 407301 317789 366793 323906 340636 466412 504119 510739 513939 723077 765547 538804
8595 538804 599272 665662 548600 388567 283812 455950 427159 228817 -9216 -4596 -36825
8584 -36825 80456 118551 114275 70064 -1260 127679 220895 278672 90177 6928 158299
8573 158299 228411 365475 464495 425211 85594 20569 -60759 -162836 -171256 85902 221629
8562 221629 222600 51740 154155 163236 17398 -13855 -20840 110566 105916 -172964 -216349 -142914
8550 -142914 4576 185595 152161 -65284 -10173 20488 1572 -3476 -103598 -74196 98815
8539 98815 367974 449357 166645 -39536 67073 209805 81140 19201 -110585 -25051
8529 -25051 -97540 -33916 15196 159378 184515 121340 5334 7638 307144 433875 337529
8518C37529j67065j94393L0060M6175P5087P4705j71544J7830J5835o7486k07867
8507b11134j02799J32354P8984N8604j29560J13733M6887P9095M0116p6792K22343
8496B51831P4625R980p5619j85864o5846J9974j66892j90764K19581J13847j06926
8485a02073j06173N0831J50326j07181q0712m1910m683j82099J15499K95367p208
8474b0016l3508o5198j09493j5800J0413P8471O729k3628j72438J38224Q3605
8463a22639J07852P3447m5978N1136j13931Q8848k1424K45409Q202j41198J05002
8452B34726J43117K6375n5274j36443q9701n4702K75410J40635l6165j8861J15918
8441E45035O515J39658j82849k26359j52395j93510O2903K854k3616J80486P0000
$$ plain form
8518 337529 170464 -23929 6131 52306 127393 202098 30554 48384 64219 -3267 -211134
8507 -211134 -313933 -181579 -102595 -43991 -173551 -59818 -12931 66164 106280 29488 251831
8496 251831 326456 336436 260817 74953 9107 29081 -137811 -328575 -108994 4853 -102073
8485 -102073 -208246 -157415 -7089 -114270 -194982 -236892 -241575 -423674 -308175 -12808 -20016
8474 -20016 -53524 -118722 -228215 -244015 -233602 -155131 -148402 -172030 -344468 -206244 -122639
8463 -122639 -14787 58660 12682 63818 -50113 38735 17311 262720 270922 129724 234726
8452 234726 377843 404218 348944 212501 122800 68098 343508 484143 447978 429117 545035
8441 545035 551550 691208 508359 282000 129605 -63905 -1002 1852 -21764 158722 228722
8430B28722L1355M6326m6057k67233p7753P8448k42398j77801K11992Q93k355
8419b15861M2471K86656M8005J0013J05506l9629q3515j30519r4287K90731k5595
8408A93976j65782J1885J87582R650n8242J02769r2672j1186j04181k74235n4414
8397b54850o4613J48192R1434o5489L6724K77253n7834q1192l7202P0490J48376
8386B11289L9292R8446j2212j42617j7130j30021Q9517P4934k20415k28663j14992
8375c52572m2488J05024j12747J8862J68231J46325O2820q4784M8255K5945o9952
8364h7081M3001M3130n3005n3704Q018Q8280R074J10427Q7280k19137k27948n793
8352b57458L50242K41569P408k60188j15551J24124J99177j57234r998l1530j6837
$$ plain form
8430 228722 260077 306403 260346 -6887 -84640 -6192 -248590 -426391 -214399 -213506 -215861
8419 -215861 -173390 113266 161271 171284 276790 237161 153646 23127 -71160 219571 193976
8408 193976 28194 40079 227661 237311 179069 281838 189166 177980 73799 -200436 -254850
8397 -254850 -319463 -171271 -79837 -145326 -108602 168651 110817 29625 -7577 62913 211289
8386 211289 250581 349027 336815 194198 177068 47047 136564 211498 -8917 -237580 -352572
8375 -352572 -395060 -290036 -402783 -383921 -215690 -69365 -6545 -91329 -43074 -17129 -87081
8364 -87081 -44080 -950 -53955 -107659 -99641 -11361 -2287 108140 195420 -23717 -251665 -257458
8352 -257458 92784 334353 341761 81573 -33978 90146 289323 132089 122091 90561 73724
8341G3724r7119j59706K42144J71871L7443m3742n5966p2440Q2495M1972M0381
8330B61057N0823J16312O2879j5122r9413o8130J45458k3434j88926n8532L0230
8319B13202r0826q0830k0192P796o8808p4348k19956P9660L56985o650q9744j9703
8307a3414m793n7514J17503L1318M3879L3882m3505J00572J9372k5424J00563
8296C02439r7396k43665k30208o8960Q9888K84653R1955o1162l67735q3486R3763
8285b89914M9708Q384M9655K34130L939q6520o251j30707r2442J96251K72185
8274B08418n0000j35581q5597J10411K07528k3302O4912K8009j10394j89803J2820
8263C7421N1909P6711k4906J04751n3259k44596J19974j19970k1554J49494K18273
$$ plain form
8341 73724 -23395 -183101 59043 230914 268357 224615 168649 96209 178704 220676 261057
8330 261057 311880 428192 491071 475949 376536 308406 453864 430430 241504 182972 213202
8319 213202 122376 41546 21354 29150 -39658 -114006 -333962 -254302 102683 96033 6289 -13414
8307 -13414 -18207 -75721 41782 73100 116979 150861 107356 207928 227300 201876 302439
8296 302439 205043 -38622 -268830 -337790 -247902 36751 128706 67544 -300191 -383677 -289914
8285 -289914 -240206 -231822 -182167 51963 55902 -30618 -36869 -167576 -260018 -63767 208418
8274 208418 158418 22837 -62760 47651 255179 231877 296789 324798 214404 24601 37421
8263 37421 89330 166041 141135 245886 192627 -51969 68005 -51965 -73519 75975 294248
8252B94248l4428j85547p0566l4611n0250j882Q7337J76660K44139q2256j12486
8241B30358r8580j91542k02257j17011J1481J28537O9378J37110L3415J2709k4175
8230a0577r2768K32193j75228L4103P8141j67041k6732J24221P7283j58156k64916
8219c49477O4327J83742J78143r8416O3997J21634j36425j94175M5846J10329
8209a0475J09341q4068M03k07759j20157l6949k6629L2401J62849K44921J04287
8198A68165j22487k39466N3734O2287R059j07259j38879P5252L11878J68715Q6064
8187C27063j30693k02188r0667j3691n3772L1772J40935J56717J38160p736l9913
8176B55987p5075n764r0040l0617j12955O5398K6571O9382K1374k36983j93345
$$ plain form
8252 294248 259820 74273 3707 -30904 -81154 -83036 4301 180961 425100 342844 230358
8241 230358 131778 -59764 -262021 -379032 -367551 -239014 -169636 -32526 889 13598 -10577
8230 -10577 -103345 128848 -46380 -12277 65864 -101177 -127909 -3688 73595 -84561 -349477
8219 -349477 -285150 -101408 76735 -21681 42316 163950 27525 -166650 -120804 -10475
8209 -10475 98866 14798 15201 -192558 -312715 -349664 -376293 -343892 -181043 63878 168165
8198 168165 45678 -193788 -140054 -77767 -68708 -175967 -314846 -239594 72284 240999 327063
8187 327063 196370 -5818 -96485 -110176 -163948 -132176 8759 165476 303636 295900 255987
8176 255987 180912 175148 85108 54491 -58464 6934 33505 102887 124261 -112722 -306067
8165c06067k5156o161m8423L524J20975J13908J50004q1506q0564M8593J73999
8154F3126m2173q8053p4618j82826J06053j7212J67642J27088Q0793k23047N428
8143g7799J20669k1270j45933l9778O8605m4476N7844M1181J44226L2818P4858
8132B10945N6755J34349j08097k08172p916J47314k7712N6418k24721k88214p1907
8121c30958R5932J73092m8926M0354K8864K9128j24837p2315R640J35385m5535
8110a10176J99338J81514J1459m5976j79039L4053j75621J46499r0509j94439
8100b22897K88818J58407j30991k12304j7301J47469K13773R5559j60320j14162
8090D6051l207Q0702J36903k8530k29218o7120M2157L3103O8022j33539n8914
$$ plain form
8165 -306067 -331223 -337384 -385807 -382283 -261308 -147400 2604 -78902 -159466 -110873 63126
8154 63126 20953 -67100 -141718 -324544 -218491 -235703 -68061 59027 139820 -83227 -77799
8143 -77799 42870 21600 -124333 -164111 -95506 -139982 -82138 -40957 103269 136087 210945
8132 210945 267700 402049 293952 85780 77864 225178 197466 253884 29163 -259051 -330958
8121 -330958 -235026 -61934 -110860 -70506 -41642 -12514 -137351 -209666 -200026 -64641 -110176
8110 -110176 89162 270676 282135 236159 57120 91173 -84448 62051 -28458 -222897
8100 -222897 65921 224328 93337 -118967 -136268 11201 224974 320533 160213 46051
8090 46051 42844 123546 260449 231919 2701 -64419 -22262 10841 78863 -54676 -113590
8079a13590N6015j01372J62711M3524o4898r2849r5686J03024J47392J07004K39451
8068C90726M8237j39733j26076j00311j97483j31758J49424K13963q9642k52227
8058b34880L3174N1362o0681m5155J63738K29456j5633k7841j26474k3250N1611
8047d573J73148j52858p3020K31382J08337k58369j46580p0232K9748o0413J41083
8036h2347R0716J09178O7437j19026o1825M8732J09601j24876Q8157M3173J76399
8025C45319M218k61746J6348J14208r8439j40413j54214J15275P5677K26812j2826
8014B30219j89162j56283j7836L3359J56057K21910j1864j70065r2293O3459K6895
8003I4396l8869K3325m4538r2033l4079N2706J23909O4180j63695j44740J22915
$$ plain form
8079 -113590 -57575 -158947 3764 47288 -17610 -110459 -206145 -103121 44271 151275 390726
8068 390726 438963 299230 173154 72843 -124640 -256398 -106974 106989 17347 -234880
8058 -234880 -201706 -150344 -211025 -256180 -92442 137014 121381 93540 -32934 -56184 -4573
8047 -4573 168575 15717 -57303 174079 282416 24047 -122533 -192765 -163017 -223430 -82347
8036 -82347 8369 117547 184984 65958 4133 52865 162466 37590 125747 168920 345319
8025 345319 349537 87791 104139 218347 119908 -20505 -174719 -59444 16233 243045 230219
8014 230219 41057 -115226 -133062 -99703 56354 278264 266400 96335 4042 67501 94396
8003 94396 55527 78852 34314 -57719 -91798 -39092 84817 148997 -14698 -159438 -36523
7992c6523j68952J62951N2458L7907m4202o9960j26037K56888N0332k44197l1464
7981a60799P7322m679J2351L7377N4656O2756l5743j20689N0878R1506l0699P0034
7969A04271n340r4175r0076L4611R1261p0251l4543l0537O02l9312Q0705j7743
7957g0527O8792m4161k02153J00J73401J13967P5270n3888j43990r5521K7462
7946a51248K61593l6933l0948n3774r2687N8101J11848R9843J78317L6349K9506
7935D09967r1225r4608Q2145K1904k08497k78555K3394J14981K2756J42122j64026
7924a9642j15698O3263J29587p261J8404k405J9939J74052o7182n9404m5220p118
7912H1315L0698L1198k3383j87186j12110P3418J71923J8345l4903L9896M1347
$$ plain form
7992 -36523 -205475 -42524 9934 47841 3639 -66321 -192358 64530 114862 -129335 -160799
7981 -160799 -83477 -88156 -75805 -38428 16228 78984 43241 -77448 -26570 64936 34237 104271
7969 104271 98931 4756 -85320 -50709 40552 -29699 -64242 -94779 -94177 -133489 -52784 -70527
7957 -70527 -1735 -45896 -248049 -247949 -74548 39419 114689 60801 -83189 -178710 -151248
7946 -151248 110345 73412 42464 -11310 -103997 -45896 65952 165795 344112 380461 409967
7935 409967 318742 224134 306279 328183 119686 -158869 -135475 -20494 2262 144384 -19642
7924 -19642 -135340 -72077 57510 50249 68653 66248 86187 260239 193057 133653 88433 81315
7912 81315 112013 143211 119828 -67358 -179468 -106050 65873 84218 49315 89211 130558
7901A30558j41059j07224l8870j64506q2252K14184K59999j69836o4520J8535
7891a44991N7926J39817k7499o3676K3498K1367o7924O5430j7558r8617n2742
7880a64969K51310L4509J9431K2052M563r4700j35273L4435J04841N4504P0146
7869B00849j29171j58366o572k4348n9092K20225p8426j2632J42168j39094j43750
7858a88209Q9704J30554j2248R0196L6446q00k25943j67853j2961J79779P2383
7847h952q3672k12885j08398P5327J96691J54696L418l4038O6187q0476l0101
7836f2203L1348k63M0380J59383N3882M5414m9600r859k80252k06081P0330K30611
7824B3090O7742O1921n4594q1140q8531O7585K8561m7128J80422J990m9109q444
$$ plain form
7901 130558 -10501 -117725 -156595 -321101 -403353 -189169 70830 -99006 -163526 -144991
7891 -144991 -87065 52752 25253 -38423 -14925 6442 -61482 3948 -13610 -112227 -164969
7880 -164969 86341 120850 140281 162333 166896 72196 -63077 -28642 76199 130703 200849
7869 200849 71678 -86688 -93260 -117608 -176700 43525 -34901 -47533 94635 -44459 -188209
7858 -188209 -98505 32049 19801 109997 146443 145643 -80300 -248153 -261114 -81335 -8952
7847 -8952 -92624 -305509 -413907 -338580 -141889 12807 16225 -17813 48374 -32102 -62203
7836 -62203 -30855 -31118 9262 168645 222527 267941 218341 208482 -71770 -277851 -207521 23090
7824 23090 90832 152753 98159 17019 -71512 -3927 24634 -22494 157928 159918 110809 102365
7812A02365l6473M9855l9028P5590n9471J2978J08480k8974L591R360J65058n0183
7800C13148m4159j63608j52809L5092k0438L8295Q157J49005J21898j23377k53726
7789i2522k65816j17072K13967N9588J0618o282P2794Q7804J43398L0143k08196
7778g1576o1722j02578j63995J10011O0600m7747j78347q4352j376K13799K62797
7767f4486N480K3013q8363j5929j51661N3999j09499j28408O9824L80406J9909
7756e715m4482j7725P7021j80706q6297n0027J02955K41537K17544J5713l93740
7745a23922j81445K75403K54119k22820q714j07568j40560K83096m3148j8976
7735c4535J8784N987n2891j11253j84711j803J59489j12199N2218N5947K8807
$$ plain form
7812 102365 65892 115747 76719 152309 92838 105816 214296 185322 188913 198273 363331 313148
7800 313148 268989 105381 -47428 -12336 -32774 5521 13678 162683 284581 161204 -92522
7789 -92522 -358338 -475410 -261443 -201855 -191237 -197519 -124725 -36921 106477 136620 -71576
7778 -71576 -133298 -235876 -399871 -289860 -229260 -277007 -455354 -539706 -541082 -327283 -64486
7767 -64486 -59006 -35993 -124356 -140285 -291946 -237947 -347446 -475854 -406030 -25624 -5715
7756 -5715 -50197 -67922 9099 -171607 -257904 -307931 -204976 36561 254105 269818 -123922
7745 -123922 -305367 -29964 224155 1335 -7379 -114947 -255507 27589 -15559 -34535
7735 -34535 -15751 -9764 -62655 -173908 -358619 -360422 -200933 -313132 -260914 -204967 -176160
7724a76160J53777j01531k02979j01900L207J41617M4360J28129J62106J60141
7714B10767p9811j62136j71996j15389k3986L5488r5074P0985O9657Q6567J0218
7703a64710K38639J64523J47780k49336j34957O3248K20928J80309p3005k42084
7693A51335k05619N3514M007j94302j87199L4098J4925K28490J62905k7169L6704
7682G1689O6J7816p1253j58565l54526k25845P0169J69097M74541K36900P0016
7671C00105K8919k73306k30146K14545m5810q5910K00049K17446k3462k8097j13237
7660A61096j87840J66524J47014j52044r0669j9620o4742J11238J16258r1274
7650I5941o7703k0589j77715J3651J19671K7261n2139M8551M07629J70000l19504
$$ plain form
7724 -176160 -22383 -123914 -326893 -428793 -425586 -283969 -239609 -111480 50626 210767
7714 210767 130956 -31180 -203176 -318565 -342551 -307063 -402137 -331152 -261495 -174928 -164710
7703 -164710 73929 238452 386232 136896 1939 65187 286115 466424 393419 151335
7693 151335 -54284 -770 3237 -191065 -378264 -344166 -329241 -100751 62154 34985 71689
7682 71689 71755 89571 18318 -140247 -494773 -720618 -650449 -481352 -6811 230089 300105
7671 300105 329024 55718 -174428 40117 -5693 -91603 108446 325892 302430 274333 161096
7660 161096 -26744 139780 286794 134750 44081 24461 -40281 70957 187215 95941
7650 95941 28238 7649 -170066 -156415 -36744 -9483 -61622 -13071 394558 564558 245054
7639B45054j32140O5499o8493j32726j15894J5509M4873M6271P3397k9318j22991
7628a10959l8022j73587j39483K79627l9733J9093j3954L8934J27693O8699J65236
7617A83544J13771l5869P6511r6226r4183M802j61524j70410m1231m2853N7514
7606b06154J97678J76301K8999r9113j31450j3318o1501k09384n0029L5269m5196
7595c77898K29493M8814J08526n858j84087Q4170K00385K2511P8976R2689L7324
7584C35045l6824q0979p8403K781l48194k22502r2695j01478l0460K23065J18980
7573c11664K13427m3642R6674L3170K2637L3298l671M2228k5854m8713j32220
7562a24330j12365j08828J00813k0571m5894O6098K34583J30250k551j08355p47
$$ plain form
7639 245054 112914 178413 109920 -22806 -138700 -123191 -78318 -32047 41350 12032 -110959
7628 -110959 -148981 -322568 -462051 -182424 -222157 -203064 -217018 -178084 -50391 18308 183544
7617 183544 297315 261446 337957 241731 147548 152350 -9174 -179584 -220815 -263668 -206154
7606 -206154 -8476 167825 196824 97711 -33739 -47057 -108558 -317942 -367971 -332702 -377898
7595 -377898 -148405 -99591 8935 3077 -181010 -96840 103545 126056 205032 297721 335045
7584 335045 298221 217242 138839 141620 -206574 -429076 -521771 -623249 -653709 -430644 -311664
7573 -311664 -98237 -141879 -45205 -12035 10602 43900 40229 82457 56603 7890 -124330
7562 -124330 -236695 -345523 -244710 -265281 -311175 -245077 -10494 119756 117205 8850 8103
7551H103l018J9185M0670M3914r6990q9077j70465L0496K50300m6582K5935K08449
7539B20920p852Q5162J94658j81074k05066J2360K2751L0002J1143K3925p0624
7528A36305j76410j39510N9312J63j00048R4532J76585N8824l8106j21224K06778
7517A57201J45202k1895k64251j37043J27236J42071j18797k11423q8823K96234
7507B5712M2136J3322p9845l4433j12078J70256j65432j12784Q7605K68890J3035
7496A16384j44618n5929J02482l3166M8699M9569N5011j80157o4909K57655J04173
7485B55194n2137Q0424j24510l0967J72141J5370j53653l25962J21858n4764n3047
7474a50053n7785L5548J69084K5929p2815l52519N0977K797P6815K4810J86258
$$ plain form
7551 8103 5085 24270 64940 108854 11864 -77213 -247678 -217182 33118 -13464 12471 220920
7539 220920 213068 298230 492888 311814 106748 119108 141859 171861 183004 206929 136305
7528 136305 -40105 -179615 -120303 -120140 -220188 -125656 50929 109753 71647 -49577 157201
7517 157201 302403 280508 16257 -120786 6450 148521 29724 -181699 -270522 25712
7507 25712 67848 81170 1325 -33108 -145186 25070 -140362 -253146 -165541 103349 116384
7496 116384 -28234 -84163 18319 -14847 33852 83421 138432 -41725 -106634 151021 255194
7485 255194 203057 283481 158971 128004 300145 315515 161862 -164100 -42242 -97006 -150053
7474 -150053 -207838 -172290 -3206 22723 -50092 -402611 -351634 -348837 -272022 -247212 -60954
7463f0954M4518j52621L2564J24801j45577n7606L7212Q2797J56483R3140N7098
7452B11855j16220j88044K123K00413N7132j59296J4953K24833l7994l7116m4577
7441A28062R548K514J31346Q8892M2376l9900k06589k77321r6104J53920p1453
7430a34709R1750K28449l047k51666j23080J79418Q0420j03268j9726q7345q5559
7419b28363l9848K46808M1151k54493k10230o3011K7683J30333K3159J63854J99772
7408C6815P2668O807j46878o4098O6021j2120L9812Q5546j602R676j11544L2040
7396A3143K55410j74076k56294N2232P5766l4590p8317q5768l0474Q5813J94873
7385A7718j60205l4142n5926k1424J76277J08170p668M6418j45272o5002K58532
$$ plain form
7463 -60954 -16436 -169057 -136493 -11692 -157269 -214875 -177663 -94866 61617 154757 211855
7452 211855 95635 -92409 -90286 110127 167259 7963 22916 247749 209755 172639 128062
7441 128062 137610 140124 271470 360362 402738 362838 156249 -121072 -217176 -63256 -134709
7430 -134709 -42959 185490 182443 -69223 -192303 -12885 67535 -35733 -55459 -142804 -228363
7419 -228363 -268211 -21403 19748 -234745 -444975 -507986 -480303 -349970 -326811 -162957 36815
7408 36815 109483 116290 -30588 -94686 -28665 -40785 -973 84573 82971 92647 -18897 13143
7396 13143 268553 94477 -161817 -109585 -33819 -68409 -146726 -232494 -262968 -177155 17718
7385 17718 -142487 -176629 -232555 -253979 -77702 30468 22800 69218 -76054 -141056 117476
7374A17476J41874N127j844k6988k3267o6685l785k5669O9319J36924q0398O828
7362B48912J58545P7861P1580j10825o5151k47838r8561k0865k4963J93878M2960
7351B25533j70041n4322j3425N0790k4783j816O7959k4442j10768j52746K05481
7340b580J23964m035o7420J0522J26050r0533p307q7168m728p4576K5168J61183
7328A08540M741j49765j37211J32950j25985o3031O6625p0640q6993J60384K53384
7317I2999J4156n866J2453R4361M6728q5337j1114N1044j65119j92289m8363K02345
7305E998O8150j5719j68447o5905N5235J21961O9111p9067k828p4321J9651N5577
7293a0604j2743J24661J53466J01897j34486j161j91834k27122j4312J16144O5726
$$ plain form
7374 117476 259350 264477 262633 235645 212378 145693 141908 116239 185558 322482 242084 248912
7362 248912 407457 485318 556898 446073 380922 133084 34523 13658 -11305 182573 225533
7351 225533 55492 1170 -12255 38535 13752 11936 79895 55453 -55315 -208061 -2580
7340 -2580 121384 117349 49929 60451 186501 95968 88661 1493 -3235 -77811 -52643 108540
7328 108540 113281 -36484 -173695 -40745 -166730 -229761 -163136 -233776 -320769 -160385 92999
7317 92999 107155 101289 113742 208103 254831 169494 158380 209424 44305 -147984 -196347 5998
7305 5998 74148 58429 -110018 -175923 -120688 1273 70384 -8683 -11511 -85832 -66181 -10604
7293 -10604 -23347 101314 254780 356677 222191 221030 29196 -197926 -212238 -96094 -30368
7282c0368k9119J09721K6000j26035J76949j66247m9204j07134o6270R5258n730
7271a72179l5761O2563J76926M4751R6445q281j41256j37447P6982R5058j0356
7260D7445o6484n0978O0974J73634p7875r6691p4495j78242j1343p9924K4549
7249c29430K76413J85210L2537n3708j31327j33573M3454J6639K32528o2579k85194
7238b09030q2767M0430j02739n2987K74912K6522m1775K52202J89004j23459j9530
7227A50783n8860j2747o8732m1656l5894j7999L344J14874j9579j2974j66381
7216a65821j5528k089Q3224J08132P6780j33567K8921J63554q1325p5244r2379
7205a05342J20328l9953l6746o8697m9660K2657P5559J78387q6966j59110P5331
$$ plain form
7282 -30368 -59487 50234 76234 -49801 127148 -39099 -88303 -195437 -261707 -166449 -172179
7271 -172179 -207940 -145377 31549 76300 172745 164464 23208 -114239 -37257 57801 47445
7260 47445 -19039 -70017 -9043 164591 86716 -9975 -84470 -262712 -274055 -353979 -329430
7249 -329430 -53017 132193 164730 111022 -20305 -153878 -110424 -93785 138743 76164 -209030
7238 -209030 -291797 -251367 -354106 -407093 -132181 -105659 -147434 104768 293772 170313 150783
7227 150783 91923 79176 10444 -31212 -67106 -85105 -81761 33113 13534 560 -165821
7216 -165821 -181349 -183438 -100214 7918 84698 -48869 -19948 143606 62281 -12963 -105342
7205 -105342 14986 -24967 -61713 -130410 -180070 -157413 -81854 96533 9567 -149543 -74212
7194g4212j01828l1169K91388j88020j06032M1237k18436J11224J79973K8601
7184f7274Q5307r7433j41259k886L80024J65849j39043k88988r7035l0478P3164
7173a60052Q9920J42580q1953q4789P5006J01116k3945j24357j98885m9765J18874
7162a96250P5162J43716k412K8933R8440J77102p2300P3665q2230k29609m7063
7151c2846J3535P6692J86328m0202k50782O0596O6520J9025r8707k63032o1893
7140c24766j9224l551k1339K60454J95312K20543m3298l53687m5396k0565L627
7129a51890o4140K71452J44586o100M785r8778k15381l3499R7290J30598J73739
7118B52662J58131k32138k64186P4141J82914p202m7043R2656l8635j72515j38631
$$ plain form
7194 -74212 -176040 -207209 84179 -103841 -209873 -168636 -387072 -275848 -95875 -67274
7184 -67274 18033 -79400 -220659 -223545 156479 322328 183285 -105703 -202738 -233216 -160052
7173 -160052 -70132 72448 -9505 -94294 -19288 81828 57883 -66474 -265359 -315124 -196250
7162 -196250 -121088 22628 20216 49149 147589 324691 252391 326056 243826 14217 -32846
7151 -32846 -19311 57381 243709 203507 -47275 13321 79841 98866 159 -262873 -324766
7140 -324766 -343990 -347541 -368880 -108426 86886 307429 264131 -89556 -134952 -155517 -151890
7129 -151890 -216030 55422 200008 193908 198693 99915 -115466 -148965 -51675 78923 252662
7118 252662 410793 178655 -85531 -11390 171524 164322 117279 209935 171300 -1215 -139846
7107a39846J3750K9403J60099Q2296j45047L4207J3442j09576j33576J07565J04058
7096A6775M0278j37414J03361J77505m5558j10560n5571O6014k39k7997k7137
7085e43q7372j41772J31910m2457K3051k2991j46461L3267K02630P9371J13840
7074A42473k71067p6957J92528J12272j13486q4665K84247J08990k08056Q6709
7064A72988j47135n3090R5964r6829p7822k38472n7860J61071J45020N2545J09707
7053F6087K0973r097L4024k50058j14830M8978L3702J803L5104J46955R8518J51706
7041B63865j05604j0920j10226j86433r2251J13096P4271J4747N2517J12925j07078
7030A8909J70388j15208l41190L857L00978N1150n8795J11645P7466k00520j96549
$$ plain form
7107 -139846 -126096 -96693 63406 145702 655 34862 48304 -61272 -194848 -87283 16775
7096 16775 57053 -80361 23000 200505 154947 44387 -11184 54830 54591 26594 -543
7085 -543 -87915 -229687 -97777 -140234 -117183 -140174 -286635 -253368 -50738 28633 142473
7074 142473 -128594 -205551 -13023 99249 -14237 -98902 185345 294335 86279 172988
7064 172988 25853 -27237 68727 -28102 -105924 -344396 -402256 -241185 -96165 -43620 66087
7053 66087 87060 77963 111987 -138071 -252901 -203923 -170221 -168418 -133314 13641 112159 263865
7041 263865 158261 147341 37115 -149318 -241569 -128473 -54202 -39455 13062 125987 18909
7030 18909 189297 74089 -267101 -263244 37734 88884 30089 141734 219200 18680 -177869
7019a77869j1038o9680k8946J93201J53467J2986R7844J68024m6002l63398j79244
7008b50655J47223J56334r850j54023m2966J76440J57060k39852q684N1790M382
6997a2801R9513K1191j49505J49344L6098p968J01162P7378k21539k2746Q7812
6986A57939l3835j4395Q8327p8428q525r2443k16005P1741J59689R7688l0084
6975A01669N1882j33339K8511J6677m0752Q1781n4269J3484J03124J3385l97672
6964b15519k9581J04464L427L0848k4505j734J79305O9507p3770R7343K3368k86729
6952a23576k42390n7769j7709L50535O618j17158R0227J60180j47420j52254M2593
6941b08123m670o5365j2796Q4037l1763J03694Q0626N111P0057j48501k6190q5655
$$ plain form
7019 -177869 -188907 -258587 -287533 -94332 59135 72121 169965 337989 291987 -71411 -250655
7008 -250655 -103432 52902 43052 -110971 -153937 22503 179563 -60289 -68973 -17183 -12801
6997 -12801 86712 107903 -41602 107742 143840 135872 237034 314412 92873 70127 157939
6986 157939 124104 109709 198036 119608 111083 18640 -197365 -125624 34065 131753 101669
6975 101669 153551 20212 48723 65400 24648 106429 52160 65644 168768 182153 -215519
6964 -215519 -245100 -140636 -137209 -106361 -130866 -132600 46705 116212 42442 139785 163153 -123576
6952 -123576 -365966 -423735 -441444 -90909 -84291 -201449 -111222 48958 -98462 -250716 -208123
6941 -208123 -212793 -278158 -290954 -206917 -238680 -134986 -54360 -49249 20808 -127693 -153883 -239538
6929b39538R9091N1019j74591l47089J46703J60905J18022N3183q0643j35620
6919c48558j46191J3343K10048K30602L191j21346P0192r2591m1577J24174J16692
6908A7979j08376j66310R3424M5756j26267P8748Q1985r1133r5540J64157M767
6897a00810J24808K15028R1636n9937l40981R1636J50433k0027j01765r2736M0471
6886b244P8693j45503k8904p2902j55762J07465J93907p6310j6418M5512J0615
6875f1851P1898r7714Q5356M3741o7849J24264J43034J22866j2982m3657j11314
6864A95792q1382P1667j23768j38463J1623K21577J1009n3297n4179O373l3410
6853C3542m9207r3441k3579p5573R5846o7972J17187O6634p634n957j09908m5880
$$ plain form
6929 -239538 -140447 -89428 -264019 -611108 -464405 -303500 -185478 -132295 -212938 -348558
6919 -348558 -494749 -481406 -271358 -40756 -37565 -158911 -88719 -181310 -222887 -98713 17979
6908 17979 -90397 -256707 -163283 -117527 -243794 -165046 -83061 -174194 -269734 -105577 -100810
6897 -100810 23998 239026 330662 270725 -70256 21380 171813 151786 50021 -42715 -2244
6886 -2244 76449 -69054 -97958 -170860 -326622 -219157 -25250 -101560 -117978 -72466 -61851
6875 -61851 10047 -87667 -2311 41430 -26419 97845 240879 363745 350763 307106 195792
6864 195792 114410 186077 62309 -76154 -64531 157046 168055 114758 60579 66952 33542
6853 33542 -15665 -109106 -132685 -208258 -112412 -180384 -63197 3437 -4197 -10154 -120062 -165942
6841a65942O8467k9773o2057P4992P8033J18409j5499k044J03130J94k36478r4689
6829a63257j64476j17486P1244L1431J51370J60036N6216j47466m6156j2808R9241
6818h2111M5401P2280J40551l3595j05655j18452J69179J88852k35617r6015l5321
6807i0503N4489J8144k6705n8299L229j6873J15664L2235r3876r6514o2036J13015
6795a08030n3137k78753r8374J95353Q4338Q4049N7992J40977j16225J9105j7273
6784h9978m0750j61426j09501P6466j17942n8469K65112O6459J78611J84625j07504
6773H5703l8201k23781m104L7993k45Q508j55370L14127J52453L4150l6504j69174
6761E555J013J84410k29053j41236n9942P4416O5679J8529K29639k58493n09N247
$$ plain form
6841 -165942 -97475 -127248 -189305 -114313 -36280 82129 66630 64586 167716 167910 -68568 -163257
6829 -163257 -327733 -445219 -373975 -342544 -191174 -31138 25078 -122388 -168544 -181352 -82111
6818 -82111 -36710 35570 176121 142526 36871 -81581 87598 276450 40833 -55182 -90503
6807 -90503 -36014 -17870 -44575 -102874 -99645 -116518 -854 31381 -62495 -159009 -221045 -108030
6795 -108030 -161167 -439920 -538294 -342941 -258603 -174554 -116562 24415 -91810 -72705 -89978
6784 -89978 -130728 -292154 -401655 -325189 -443131 -501600 -236488 -170029 8582 193207 85703
6773 85703 47502 -176279 -180383 -142390 -142635 -134127 -289497 24630 177083 211233 174729 5555
6761 5555 6568 190978 -38075 -179311 -239253 -164837 -99158 -80629 149010 -109483 -109992 -104745
6749a04745J54812K79889j81111j09762j7347K1322n3903j47814N2901p9975p545
6738a93278O9661K44714O9877r2681K54310J41029N0941j29897o9659R5272n8108
6727C82181m5008k33198k54687r8282J8028m2246n136K59673J34325o6698J05261
6716A54213J99305O4969r4445k22300r2568O4112q623o6158J13460L19514j71523
6705B59956k31839k18160j08170K23075J611n5729j99424K25835K23013K43740
6695C63908R8813J08201j53354k61080R2828j3607j6911L3934Q5964m0912j07315
6684A90469n5065r6858m6932N161l6811N9695j06501M77R6422j83405j65276N0162
6672b88462K42136K02375J46220j38799j24411P1168j27278o0798j95437L1746
$$ plain form
6749 -104745 50067 329956 148845 39083 21736 43058 -10845 -158659 -105758 -185733 -193278
6738 -193278 -123617 121097 190974 98293 352603 493632 544573 414676 345017 440289 382181
6727 382181 337173 103975 -150712 -248994 -230966 -273212 -278348 -18675 115650 48952 154213
6716 154213 353518 418487 324042 101742 9174 73286 64663 -1495 111965 431479 259956
6705 259956 28117 -190043 -298213 -75138 -73527 -129256 -328680 -102845 120168 363908
6695 363908 462721 570922 417568 156488 249316 235709 218798 252732 338696 297784 190469
6684 190469 135404 38546 -8386 -3225 -40036 19659 -86842 -86365 10057 -173348 -338624 -288462
6672 -288462 -46326 156049 302269 163470 39059 110227 -17051 -77849 -273286 -241540
6662b41540R7809k2070j04624J32356M9178J6873N1902p67J07240j9151p5788
6651h582j54675J2688K49997K596j98127o782p2106L2557J36194j3760r9077M5452
6639g3625K29365j28107o9221j41150j38446Q293J18243J06376M5573O6907J74982
6628A99190j66273k96723J29197J12122J06525o3146k32794k71031R1504K01632
6618a89797O6243L6242J37Q4649J31015J7014J74593p3814j27927l0401K3959
6607A11913k4217j03652l3759J18426k6328j39225j29105k6403k3231R2205K9257
6596a54119k890o8734l5539J3815J55813J64540q2751l92745m5195J37694J29417
6585a80694J04440p4850J37146J54438K1817L8357Q456J12211j9124q0554j93967
$$ plain form
6662 -241540 -143731 -165801 -270425 -138069 -88891 -72018 -20116 -20883 86357 67206 -8582
6651 -8582 -163257 -150569 99428 102024 -96103 -102885 -174991 -142434 -6240 -20000 -119077 -73625
6639 -73625 155740 27633 -41588 -182738 -321184 -312891 -194648 -88272 -42699 24208 199190
6628 199190 32917 -263806 -134609 -22487 84038 20892 -211902 -482933 -391429 -189797
6618 -189797 -123554 -87312 -87175 -2526 128489 145503 320096 246282 118355 87954 111913
6607 111913 87696 -15956 -49715 68711 42383 -96842 -225947 -252350 -275581 -183376 -154119
6596 -154119 -157009 -225743 -261282 -247467 -91654 72886 -9865 -402610 -447805 -310111 -180694
6585 -180694 -76254 -151104 -13958 140480 162297 200654 209110 321321 302197 221643 27676
6574B7676j84526L14q1891k8867M8925J07951P0623j23159K789K15969N9068P833
6562A22705j23756j46410l6222J3745J90509k2979n7595J01919J9619o1997m928
6551e390J75509R0040P6584j19190q6118o1991j66745L6411J44866j63252j43464
6540b22740P328R3065O1524M5753Q448n2225K7355J88355K09173n443j84171N1352
6528B27774L5286J43267j04450k50689m4429j28593M7531J02674j45288q0463
6518a97380k3109k45875N978J83416O8388p4927J07128J08959R6799r2794k5112
6507h8529j8664J69587J25345k08398K0624k4999P6568J1073j35112j51451L001
6496b20955j5880n6493J05765N4759R5029k61m09239q2103J43651Q4622k03611
$$ plain form
6574 27676 -156850 -156536 -238427 -267294 -218369 -110418 -39795 -162954 -160165 55804 114872 122705
6562 122705 -1051 -147461 -183683 -169938 20571 -2408 -60003 41916 61535 -462 -5390
6551 -5390 170119 260159 336743 217553 131435 69444 -97301 -60890 83976 -79276 -222740
6540 -222740 -215412 -122347 -60823 -15070 -6622 -58847 -31492 156863 366036 360593 176422 227774
6528 227774 263060 406327 301877 51188 6759 -121834 -74303 28371 -116917 -197380
6518 -197380 -220489 -466364 -460386 -276970 -208582 -283509 -176381 -67422 29377 -63417 -88529
6507 -88529 -107193 62394 187739 -20659 -35 -25034 51534 62607 -72505 -223956 -220955
6496 -220955 -236835 -293328 -187563 -132804 -37775 -38036 -447275 -529378 -385727 -301105 -504716
6485e04716r380J23504K2547J89056l7298q107J49346J8184j47350j73251N4570
6474c22895N8489j7290J9208O1928J32389J2968k34796o9056K15560L5472l9843
6463a47866n0102J49925l0785o5033j80073j32804J03168J45340j2299J07491
6453a13038J25992K4777j4723q5398q6735O9573R5773M5127J50653K00956j76465
6442B36492k28275n0247q3944J6394L07302L04608n7906l5045n2164k230J2820
6431C67805o249o6354J01368k24583o3478l2605K8192M0662j25862J44636k9375
6420A34157P4822j34862j45515j63494J49838r1722p3137j51176Q239J36337m0932
6409b97445J07154J73733n5482P9832k11118l70883J10127J68789J419J16923
$$ plain form
6485 -504716 -514096 -390592 -368045 -178989 -216287 -224394 -75048 -56864 -204214 -377465 -322895
6474 -322895 -264406 -281696 -262488 -200560 -68171 -55203 -289999 -359055 -143495 -108023 -147866
6463 -147866 -197968 -48043 -78828 -143861 -323934 -456738 -353570 -208230 -220529 -113038
6453 -113038 12954 37731 23008 -62390 -149125 -79552 16221 61348 212001 412957 236492
6442 236492 8217 -42030 -125974 -109580 197722 502330 444424 409379 357215 354985 367805
6431 367805 361556 295202 396570 171987 108509 75904 104096 144758 18896 163532 134157
6420 134157 208979 74117 -71398 -234892 -85054 -176776 -249913 -401089 -392850 -256513 -297445
6409 -297445 -190291 -16558 -72040 7792 -203326 -574209 -464082 -295293 -293874 -176951
6399a76951J8676Q8475k32056M0576J31428N1893N0610o5462j7099J7675J05304
6388A3069J16840j15811j24926O0776O0176P9519N7475J23191K3779n5589j79927
6377E8572j75342j32057k8407L2048J82325P9151K15280o8211j34248k57417k5006
6366b53312L4696J55919M0870K9240P925K04885k3831l1784j21216m1026r3070
6355i0704j04012J0039J24975P4376J19623O5229j47992J5672j51641m5261j03315
6344b33011R9700J2040J15817K25002o0478K2531j8746n224m1549J3914J09907
6333B39903L10681j16424l59290j73339J2169J15367q9932j06021j3720k02021
6323c82627K21860J53954r5111k9781j32123L3800o05J6527K52480J94156j83794
$$ plain form
6399 -176951 -158275 -69800 -301856 -261280 -129852 -77959 -27349 -92811 -109910 -92235 13069
6388 13069 129909 14098 -110828 -50052 10124 89643 147118 270309 294088 238499 58572
6377 58572 -116770 -248827 -277234 -245186 -62861 16290 231570 163359 29111 -228306 -253312
6366 -253312 -218616 -62697 -21827 7413 15338 220223 196392 164608 43392 2366 -90704
6355 -90704 -194716 -184677 -59702 14674 134297 199526 51534 67206 -84435 -129696 -233011
6344 -233011 -133311 -121271 -5454 219548 159070 181601 162855 157631 116082 129996 239903
6333 239903 550584 434160 74870 -98469 -86300 29067 -60865 -166886 -180606 -382627
6323 -382627 -160767 -6813 -101924 -131705 -263828 -230028 -230633 -214106 38374 232530 48736
6312D8736L7953K44497n1070k33858j53940J10055K79250P3661N1749m17207k09878
6301b20052K0001J48508j0235j01979j08626K8199J41029L0167k10613j17567
6291d01168N188J22789O3726K340P1168O223o7518O5203k1898P4897K8671m0906
6279i1285N1141O1285l9089o5624J20398J17107K78447q0083k67825k42189k63926
6268d21643J79097K56279K9007L3187J14394j40062k09556K08143K56829r9471
6258B06204j97994N4430l4655j61313j45105J28552O9163J02037K27289k16778
6248C1830p3218K1001J49577O1122n7251j76156k84909O6948J45254L6613N6056
6237b3133j30305P7237N4647n0231P1378K56752M0425o7567j25023r3558m2150
$$ plain form
6312 48736 86689 331186 280116 46258 -107682 2373 281623 355284 407033 -10174 -220052
6301 -220052 -200051 -51543 -61778 -163757 -272383 -244184 -103155 -72988 -283601 -401168
6291 -401168 -395980 -273191 -209465 -207125 -135957 -129734 -197252 -132049 -153947 -79050 -50379 -91285
6279 -91285 -40144 21141 -17948 -83572 36826 153933 432380 352297 84472 -157717 -421643
6268 -421643 -242546 13733 42740 75927 190321 50259 -159297 48846 305675 206204
6258 206204 8210 62640 27985 -133328 -278433 -149881 -80718 21319 248608 31830
6248 31830 -41388 -20387 129190 190312 133061 -43095 -328004 -261056 -115802 -79189 -23133
6237 -23133 -153438 -76201 -21554 -71785 -407 256345 296770 229203 104180 10622 -31528
6226c1528k79696L27j46393k9731L00474J59143K45169J08275k05968l9699p0056
6215A0317k45607M843J51657O4946j66390j68650m0561r305J4232L31557J27646
6204G4685k48101j41303q0481N6424K07768K3860j55581M1732J27696k4378j1283
6193a28962M9873J0427j8156K9681r1891K30235J7305J08437M7257n7842k47777
6182e1413q355Q3099Q261m3767l1305J53956j41304k46777R2232M1937j40878
6171b84314j27865n1977M7667N9971J41349J04182p2776l7788j79113p303J22592
6160b85375M0757j85144N7789J23529J27690J0496j6391j1559Q0819k9862K3852
6149f3399K38100J61764o5600k49369k59782R4309R8692o7457j57562j47051L5013
$$ plain form
6226 -31528 -311224 -310897 -457290 -487021 -186547 -27404 217765 326040 120072 80373 10317
6215 10317 -235290 -230447 -78790 -13844 -180234 -348884 -389445 -398750 -384518 -52961 74685
6204 74685 -173416 -314719 -395200 -338776 -131008 -107148 -262729 -220997 -93301 -117679 -128962
6193 -128962 -79089 -68662 -86818 -57137 -149028 81207 98512 206949 254206 196364 -51413
6182 -51413 -59768 23331 31592 -12175 -43480 110476 -30828 -277605 -185373 -143436 -284314
6171 -284314 -412179 -464156 -416489 -356518 -215169 -110987 -183763 -221551 -400664 -407967 -285375
6160 -285375 -244618 -429762 -371973 -248444 -120754 -110258 -126649 -138208 -57389 -87251 -63399
6149 -63399 174701 336465 270865 21496 -238286 -143977 -45285 -112742 -270304 -417355 -382342
6138c82342O3467J55606J80727m3892l8656k3935j2068Q7749p570L7809j5601
6127A294j44354p8631O485J50506J45549o8061r6857K18802p8765j85830q9121
6116b18983J07734J84438J05222j07666J4552r1929J8229K04632q7302k4983l8785
6105F5159M2162k0426j22244n4999J10044l0073j13089k79479l0181M5838K69763
6094a17525J24732j69038p5394o4361M9424M6018P2786R1415J16589L1560N0890
6083A57096L0605N753q2395m6542k06883J09513L878n1218q8699o5481J12937
6072a21436K10633P8659j17357q6299o8103n8267J18875j9806P5124k5259n3697
6061f6933m4873J46728Q5926o0798j77357l2735r1937O0591R1053L9259P4973
$$ plain form
6138 -382342 -318875 -163269 17458 -26434 -65090 -89025 -101093 -13344 -20914 16895 1294
6127 1294 -143060 -221691 -215206 -64700 80849 12788 -84069 134733 55968 -129862 -218983
6116 -218983 -111249 73189 178411 70745 85297 -6632 11597 216229 128927 103944 65159
6105 65159 107321 86895 -35349 -90348 19696 -10377 -123466 -402945 -433126 -387288 -117525
6094 -117525 7207 -161831 -237225 -301586 -252162 -206144 -133358 -41943 74646 106206 157096
6083 157096 187701 193454 111059 64517 -142366 -32853 -28975 -80193 -168892 -234373 -121436
6072 -121436 89197 167856 50499 -35800 -103903 -162170 -43295 -63101 12023 -13236 -66933
6061 -66933 -111806 34922 120848 60050 -117307 -150042 -241979 -181388 -90335 -51076 23897
6050B3897o7955j41307r8927j5045L3897N7505K26688K42768M2558j47675l78868
6039b22464n7317k9152k1035O0314J53327O6146J18434J02950j3574r6642L6353
6028I7340j50716j4996J5043K3133j5422j42477j51669k7164J34260J40823j8575
6017a10420j89166N8175o923k7609l582O3471K18584J12406k4052j61188N9002
6006a1302K09555P1381j96436K7354n2478q9862j2825o8095K7912j4995N744j09263
5994b13310J4118J04551J00311J17543J4582J42088j26895P0387J17437r6561
5984B44251k25674K05648j38952j80823K1896J05427m0119O27n8620r8671j70441
5973c35451p989J00905M12565R1738j46141l1291Q706o7661l4348L6835O0149
$$ plain form
6050 23897 -44058 -185365 -284292 -299337 -265440 -207935 18753 261521 304079 156404 -222464
6039 -222464 -279781 -308933 -329968 -269654 -116327 -50181 68253 171203 157629 60987 97340
6028 97340 -53376 -68372 -53329 -30196 -45618 -188095 -339764 -366928 -232668 -91845 -110420
6017 -110420 -299586 -241411 -248334 -275943 -279525 -216054 2530 114936 90884 -70304 -11302
6006 -11302 198253 269634 73198 100552 48074 -41788 -54613 -122708 -94796 -109791 -104047 -213310
5994 -213310 -199192 -94641 5670 123213 137795 279883 152988 223375 340812 244251
5984 244251 18577 224225 85273 -95550 -73654 31773 -8346 -7719 -66339 -165010 -335451
5973 -335451 -343440 -242535 170030 261768 115627 84336 93042 25381 -8967 27868 88017
5962H8017J08816n9848k56767j0203K730J04895l6181N6519M6985k7455K2172
5951C9680J8630O0156Q0830p4651j99394N8423l0425L944n390J15442N3717P8880
5939A99842j46746j17508p7776o8341R2806P5724O8113j53234M2613J55050J69368
5928B39911m3869l3182P2481k1741j19653j34157K24255J80315j76842r5353p0255
5917B1910o1109J29096N3642q0825j08419J59178O8057l13721K20615K28915j68721
5906A48618j88928l7046j55469q6517R7823J43958l8124Q4662r8030L929J45J15710
5894i269o941m6702l6103J341J461j15587p7177M105K37412n5872k610J04064
5882a878J40302r7395r9777R9109j6686m8301j06467j2033j03493J96793K14845
$$ plain form
5962 88017 196833 136985 -119782 -129985 -127255 -22360 -58541 -2022 44963 17508 39680
5951 39680 58310 118466 199296 124645 -74749 -16326 -46751 -42807 -48197 67245 120962 199842
5939 199842 53096 -64412 -142188 -210529 -117723 -41999 26114 -127120 -84507 70543 239911
5928 239911 196042 162860 235341 213600 93947 -40210 184045 364360 187518 92165 21910
5917 21910 -39199 89897 143539 62714 -45705 113473 181530 -132191 88424 317339 148618
5906 148618 -40310 -77356 -232825 -319342 -221519 -77561 -115685 -31023 -129053 -125124 -124979 -9269
5894 -9269 -16210 -62912 -99015 -97674 -96213 -211800 -288977 -284872 -47460 -103332 -105942 -1878
5882 -1878 138424 41029 -58748 40361 23675 -24626 -131093 -143126 -246619 -49826 165019
5871A65019j70172k29640K8J02228m271Q120J37629K00400j68666j6382o8310
5860d4017J62888p1567j05264N5638p4006k23826j41450J11989K45840R03j24932
5849b07804K26713J87021L098m369N9606L4098n6429k54784p7128K25968Q2544
5838B18534j0309l17586j75404J02313P1672l6949p0621J04635K9284r50J1952
5827g3429R0335q1645j04173j10760M1975N3644k9101l3109J72147J13494r8276
5816e8898P9161j53872k20282K37385J31414j1132Q7457k21870j14570J78387
5806f6820J33170l194j13744Q8755j24625j45771M7374R6938J42696j14525j32808
5795a92554n9184N5800J15795M3334K14487l68322k41575K1301K7014J05731J53647
$$ plain form
5871 165019 -5153 -234793 -234765 -132537 -136808 -128688 8941 209341 40675 24293 -44017
5860 -44017 118871 47304 -57960 -2322 -76328 -300154 -441604 -329615 -83775 -82872 -207804
5849 -207804 18909 205930 209028 204659 264265 298363 241934 -12850 -89978 135990 218534
5838 218534 208225 -109361 -284765 -182452 -110780 -147729 -218350 -113715 -84431 -85381 -73429
5827 -73429 16906 -64739 -168912 -279672 -237697 -184053 -213154 -246263 -74116 39378 -58898
5816 -58898 20263 -133609 -353891 -116506 14908 3776 91233 -130637 -245207 -66820
5806 -66820 66350 63156 -50588 38167 -86458 -232229 -184855 -87917 54779 -59746 -192554
5795 -192554 -251738 -195938 -80143 -36809 177678 -190644 -432219 -410918 -383904 -278173 -124526
5784a24526j34933j30843l2030O9304N9098Q3220O4037j2803J39563m9540k0718
5773i0171O5475M6368n57O1624q3008M5424J40892j69886p9783J22726J69011
5762B28115Q335M614j59050k34668K9911J81030J40115O0542j72174j35602j05153
5751a53985j8588J2958o9577p004J09519R7400j0972L0563j24765K3941L3124
5740g7386J44822J13429m032j52669j77673L1540J06008j9890n6232j43029j60350
5729c95462J2332J65675J10525J5141j9393o2463R559O5706J37056K8106M8049
5718A14831j54464j58967m704k9669K46060Q7238j44024j99929j81154J92934
5708b31848J70739J82490J3007k16l8038L05726P2653n3492j11064K6169j32034
$$ plain form
5784 -124526 -259459 -390302 -422332 -353028 -293930 -210710 -146673 -159476 -19913 -69453 -90171
5773 -90171 -24696 21672 21115 82739 -269 45155 186047 16161 -63622 59104 228115
5762 228115 236450 241064 82014 -152654 -122743 58287 198402 258944 86770 -48832 -153985
5751 -153985 -172573 -159615 -229192 -236196 -126677 -29277 -40249 -9686 -134451 -110510 -77386
5740 -77386 67436 180865 176833 24164 -153509 -121969 -15961 -35851 -92083 -235112 -395462
5729 -395462 -383130 -217455 -106930 -91789 -111182 -173645 -164086 -98380 38676 66782 114831
5718 114831 -39633 -198600 -203304 -232973 13087 100325 -43699 -243628 -424782 -231848
5708 -231848 -61109 121381 134388 134172 96134 401860 474513 421021 309957 336126 204092
5697B04092j60231r4186j43613n4716l3155n6094m9635N5553R6081J21757J72075
5686E7928k9271J6151Q8687r7996J15537N9464n9650j83488k9330l3101k9340
5675a24409J61934J05539r4495k58201j37785m6413j12835j00888Q9237j0803
5665e29119J31977K03553J72609J24240k3740j94741n8503K60J2851K91266J42464
5654B73117k47703m2469k9058K5140J95534j19846m13618j00336J83471K05348
5644g0420J86524R3908R1558j11821k93093j28772m4659j3750K10280J87268j02760
5633D263K3767j33956J3588N0372q7882j11134P9176l4366o133J3647J37612k7728
5621g8774M1215M209p9553L4443N1086n8359R0299j11143j86019J18478K57313
$$ plain form
5697 204092 43861 -50325 -193938 -248654 -281809 -337903 -387538 -331985 -235904 -114147 57928
5686 57928 28657 44808 133495 35499 151036 210500 150850 -32638 -61968 -95069 -124409
5675 -124409 37525 143064 48569 -209632 -347417 -393830 -506665 -607553 -518316 -529119
5665 -529119 -397142 -193589 -20980 103260 79520 -115221 -173724 -173464 -160613 130653 273117
5654 273117 25414 -17055 -46113 -20973 174561 54715 -358903 -459239 -275768 -70420
5644 -70420 116104 210012 301570 189749 -103344 -232116 -276775 -290525 -80245 107023 4263
5633 4263 28030 -105926 -92338 -41966 -129848 -240982 -161806 -196172 -202305 -188658 -51046 -78774
5621 -78774 -37559 -33350 -112903 -78460 -27374 -85733 4566 -106577 -292596 -174118 83195
5610H3195n575J19202J30683j83317k21584L0272p9866O0480J04132J97034N6320
5599B90976k00993l3743n2776O184J62503l1844j13641j85856j424J65999O9443
5588G4828J0520m0742j28210j59483p4943J93957J85711L3975j0618l5670m4074
5577E251r055l21737J986K77916J88246K02844j2876j71447J17040J14283j12003
5566B80448j60767j65065O1150k9103P7685J055j77352j24768O2290K01061j33861
5555a07227R0478J3724j72726m3507J3528k4642n7144l8671K4201J99730J86289
5544H4033o9440Q5621Q8768j23014J83854M2901r2305j55520j24185j12334Q5086
5533a06535K21525j22799q5624L9471J39572q9856j70629l5225K8020J52197j83597
$$ plain form
5610 83195 77620 196822 327505 144188 -77396 -47124 -126990 -66510 37622 234656 290976
5599 290976 89983 56240 3464 9648 172151 140307 26666 -159190 -160614 5385 74828
5588 74828 85348 44606 -83604 -243087 -318030 -124073 61638 95613 84995 49325 5251
5577 5251 -3804 -325541 -323555 -45639 142607 345451 332575 161128 278168 392451 280448
5566 280448 119681 -45384 15766 -13337 64348 65403 -111949 -236717 -174427 26634 -107227
5555 -107227 -16749 -3025 -175751 -219258 -205730 -230372 -287516 -326187 -301986 -102256 84033
5544 84033 14593 100214 188982 65968 249822 292723 200418 44898 -79287 -191621 -106535
5533 -106535 114990 -7809 -93433 -53962 85610 -4246 -174875 -210100 -182080 -29883 -213480
5522b13480j29506q2116J33373l7033Q3092L2003Q866J17794K5771M5562J66553
5511A50879j11046j72493r6761j24717J35906J36118L3690l4566N2566q8898l8680
5500a58002j8253J39402P2985J35285j31055j38820j69031J90769n558M3336J71661
5489A32719q9456j94134r4980o9836K1206Q2323M6787N2566j09424K414P1122
5478a48693j8815j98820J18427J28528l1161R6505R4133R892J62256J72408q0863
5467C03797k76731K4247n9769r6731P4728Q0588q5809J6912k4516j1998J20837
5456F5555j98672q0518K9332k2112l6968n8148K04170J04396l7114M3031J4039
5445B6991j2955j21450j23613j85414P6884J70022K1257J08438j0585m9094J17176
$$ plain form
5522 -213480 -342986 -425102 -291729 -328762 -245670 -213667 -204801 -87007 -61236 -15674 150879
5511 150879 39833 -132660 -229421 -354138 -218232 -82114 -48424 -82990 -30424 -119322 -158002
5500 -158002 -176255 -36853 36132 171417 40362 -98458 -267489 -76720 -82278 -38942 132719
5489 132719 43263 -150871 -245851 -315687 -294481 -212158 -165371 -112805 -222229 -219815 -148693
5478 -148693 -167508 -366328 -247901 -119373 -150534 -54029 40104 49996 212252 384660 303797
5467 303797 27066 51313 -8456 -105187 -30459 50129 -35680 -18768 -43284 -55282 65555
5456 65555 -133117 -213635 -184303 -206415 -243383 -301531 -97361 7035 -30079 12952 26991
5445 26991 14036 -107414 -231027 -416441 -339557 -169535 -148278 -39840 -50425 -99519 17657
5434A7657J89246q8227L0909k8037J33468k00794K4213l6354r7430M0253M4951
5423B9855k03133j88697J93946L7708R0545J70684N1024q526l1135m9536r9863
5412g128j2044O9373k2282l6149k23590r9594K74174J75823M3362l82441j55036
5401c75532L46721K31006K08782j61364o7990J31980O5603K0685j90419j60444
5391D9028m9365M1504P9415j09884J32409j27826R1361K31590k4765o7007N5766
5380C02226O9432o6265k32022j04074K3268m0606p6830l04407r9404O0009J14071
5369c54602L6486L45124K68829J1062r8471j15374R5378Q6202l49427q1195J41487
5358a4501O1613K1803q8744q7742k02264J23359K02735k6352J34391n65k02557
$$ plain form
5434 17657 206903 118676 149585 121548 255016 54222 78435 42081 -55349 -15096 29855
5423 29855 -173278 -361975 -168029 -130321 -39776 130908 181932 173406 142271 92735 -7128
5412 -7128 -19172 50201 27919 -8230 -231820 -331414 -57240 118583 161945 -220496 -375532
5401 -375532 -28811 202195 410977 249613 181623 313603 379206 399891 209472 49028
5391 49028 -337 41167 120582 10698 143107 15281 106642 338232 313467 246460 302226
5380 302226 371658 305393 73371 -30703 -7435 -48041 -124871 -429278 -528682 -468673 -354602
5369 -354602 -318116 27008 295837 306899 208428 93054 188432 274634 -74793 -155988 -14501
5358 -14501 47112 68915 -19829 -107571 -309835 -186476 16259 -10093 124298 123733 -78824
5347g8824J30109J70550r1497M1074k83563k49868Q9347q5290j1157J50891J47479
5336g0749N9097l7525O5628P9643p2064N9435R581l49953j26295J41359J29190
5325a12653J15304L0980j07369P6495p2359k0669L565k863j68495r3345J51836
5314a99573l4027q9828J8548J11987J62469Q1867K7620q4396p2482O4925R8612
5303H5722J5412p7553k5470j64883M4891m24J51122M6118j55625k00086M8905
$$ plain form
5347 -78824 51285 221835 130338 171412 -112151 -362019 -272672 -357962 -369119 -218228 -70749
5336 -70749 -11652 -49177 16451 96094 24030 83465 93046 -256907 -383202 -241843 -112653
5325 -112653 2651 33631 -73738 2757 -69602 -90271 -86706 -89569 -258064 -351409 -199573
5314 -199573 -233600 -323428 -304880 -192893 -30424 51443 79063 -5333 -77815 -12890 85722
5303 85722 101134 23581 -1889 -166772 -121881 -122305 28817 74935 -80690 -280776 -231871
$$ [...]
##END NTUPLES=NMR SPECTRUM
##END=
