##TITLE=Analysis number 318804
Compound Code ac 13699
Project Code adrs
Chemist Name acros
##JCAMPDX= 6.0         $$ Bruker NMR JCAMP-DX V2.0
##DATA TYPE= NMR SPECTRUM
##DATA CLASS= NTUPLES
##ORIGIN= Bruker BioSpin GmbH
##OWNER= nmr
$$ XWIN-NMR		Version 3.5
$$ Tue Apr 18 14:18:33 2006 GMT Daylight Time (UT+1h)  MAYBRIDGE\nmr@NMR_250MHZ
##.OBSERVE FREQUENCY= 250.131544655141
##.OBSERVE NUCLEUS= ^1H
##.ACQUISITION MODE= SIMULTANEOUS (DQD)
##.ACQUISITION SCHEME= undefined
##.AVERAGES= 16
##.DIGITISER RES= 18
##SPECTROMETER/DATA SYSTEM= dpx250
##.PULSE SEQUENCE= zg30
##.SOLVENT NAME= CDCl3
##.SHIFT REFERENCE= (INTERNAL, CDCl3, 0, 16.522)
##AUDIT TRAIL= $$ (NUMBER, WHEN, WHO, WHERE, WHAT)
$$ ##TITLE= Audit trail, XWIN-NMR		Version 3.5
$$ ##JCAMPDX= 5.01
$$ ##ORIGIN= Bruker BioSpin GmbH
$$ ##OWNER= nmr
$$ C:\u/data/dgb/nmr/ADRS/2690/pdata/1/auditp.txt
$$ ##AUDIT TRAIL=  $$ (NUMBER, WHEN, WHO, WHERE, WHAT)
(   1,<2006-04-18 14:18:08.50 +100>,<MAYBRIDGE\nmr>,<NMR_250MHZ>,
      <created by zg, POWCHK disabled, PULCHK disabled
       configuration hash MD5:
       84 BC 41 DB A1 6E 1D 46 DA 25 12 A5 C1 ED C5 3A
       data hash MD5: 64K
       E4 81 82 E0 93 42 74 20 18 F3 83 89 98 69 2B 73>)
(   2,<2006-04-18 14:18:22.09 +100>,<MAYBRIDGE\nmr>,<NMR_250MHZ>,
      <Start of raw data processing
       ef LB = 0.3 FT_mod = 6 PKNL = 1 SI = 32K 
       data hash MD5: 32K
       31 28 AA F5 10 69 52 EC 01 57 87 02 AE 12 C0 2E>)
(   3,<2006-04-18 14:18:23.89 +100>,<MAYBRIDGE\nmr>,<NMR_250MHZ>,
      <apk 
       data hash MD5: 32K
       07 AE E5 F1 CB C7 8D AC A0 EF 72 5A 7A 05 CD 16>)
(   4,<2006-04-18 14:18:24.64 +100>,<MAYBRIDGE\nmr>,<NMR_250MHZ>,
      <abs ABSG = 5 
       data hash MD5: 32K
       D0 C4 07 70 9C 0B 90 B0 3E B7 BB 64 BF E9 17 60>)
$$ ##END=
$$ 
$$ hash MD5
$$ F6 31 0C C0 56 C6 23 66 F2 16 F0 BC 1F D9 CD 68
##$RELAX= 
##$RELAX= 
##$RELAX= 
##$RELAX= 
##$RELAX= 
##$RELAX= 
##$RELAX= 
$$ Bruker specific parameters
$$ --------------------------
##$DU= <C:\u>
##$EXPNO= 2690
##$NAME= <ADRS>
##$PROCNO= 1
##$TYPE= <nmr>
##$USER= <dgb>
##$AMP= (0..31)
100 100 100 100 100 100 100 100 100 100 100 100 100 100 100 100 100 100 
100 100 100 100 100 100 100 100 100 100 100 100 100 100 
##$AQSEQ= 0
##$AQ_mod= 3
##$AUNM= <au_zg>
##$AUTOPOS= <50 >
##$BF1= 250.13
##$BF2= 250.13
##$BF3= 250.13
##$BF4= 250.13
##$BF5= 500.13
##$BF6= 500.13
##$BF7= 500.13
##$BF8= 500.13
##$BYTORDA= 1
##$CFDGTYP= 0
##$CFRGTYP= 5
##$CHEMSTR= <none>
##$CNST= (0..31)
1 1 145 1 1 1 1 1 1 1 1 1 1 1 1 1 1 1 1 1 1 1 1 1 1 1 1 1 1 1 1 1 
##$CPDPRG= <>
##$CPDPRG1= <>
##$CPDPRG2= <>
##$CPDPRG3= <>
##$CPDPRG4= <mlev>
##$CPDPRG5= <mlev>
##$CPDPRG6= <mlev>
##$CPDPRG7= <mlev>
##$CPDPRG8= <mlev>
##$CPDPRGB= <>
##$CPDPRGT= <>
##$D= (0..31)
0 1 0 0 0 0 0 0 0 0.06 0 0 0 0 0 0 0.0002 0 0 0 0 0 0 0 0 0 0 0 0 0 0 
0 
##$DATE= 1145366287
##$DBL= (0..7)
120 120 120 120 120 120 120 120 
##$DBP= (0..7)
150 150 150 150 150 150 150 150 
##$DBP07= 0
##$DBPNAM0= <>
##$DBPNAM1= <>
##$DBPNAM2= <>
$$ [...]
##$SUBNAM7= <"">
##$SUBNAM8= <"">
##$SUBNAM9= <"">
##$SW= 20.6930455092707
##$SWIBOX= (0..15)
0 0 3 0 0 0 0 0 0 0 0 0 0 0 0 0 
##$SW_h= 5175.983436853
##$TD= 65536
##$TD0= 1
##$TE= 294.16
##$TE2= 300
##$TE3= 300
##$TEG= 300
##$TL= (0..7)
0 120 120 120 120 120 120 120 
##$TP= (0..7)
150 150 150 150 150 150 150 150 
##$TP07= 0
##$TPNAME0= <>
##$TPNAME1= <>
##$TPNAME2= <>
##$TPNAME3= <>
##$TPNAME4= <>
##$TPNAME5= <>
##$TPNAME6= <>
##$TPNAME7= <>
##$TPOAL= (0..7)
0.5 0.5 0.5 0.5 0.5 0.5 0.5 0.5 
##$TPOFFS= (0..7)
0 0 0 0 0 0 0 0 
##$TUNHIN= 0
##$TUNHOUT= 0
##$TUNXOUT= 0
##$USERA1= <user>
##$USERA2= <user>
##$USERA3= <user>
##$USERA4= <user>
##$USERA5= <user>
##$V9= 5
##$VALIST= <valist>
##$VCLIST= <CCCCCCCCCCCCCCC>
##$VD= 0
##$VDLIST= <DDDDDDDDDDDDDDD>
##$VPLIST= <PPPPPPPPPPPPPPP>
##$VTLIST= <TTTTTTTTTTTTTTT>
##$WBST= 1024
##$WBSW= 4
##$XGAIN= (0..3)
0 0 0 0 
##$XL= 0
##$YL= 0
##$YMAX_a= 471207
##$YMIN_a= -380160
##$ZGOPTNS= <>
##$ZL1= 120
##$ZL2= 120
##$ZL3= 120
##$ZL4= 120
##$ABSF1= 16.522
##$ABSF2= -4.171173
##$ABSG= 5
##$ABSL= 3
##$ALPHA= 0
##$AQORDER= 0
##$ASSFAC= 0
##$ASSFACI= 0
##$ASSFACX= 0
##$ASSWID= 0
##$AUNMP= <proc_1d>
##$AZFE= 0.1
##$AZFW= 0.1
##$BCFW= 0
##$BC_mod= 0
##$BYTORDP= 0
##$COROFFS= 0
##$CY= 12.5
##$DATMOD= 1
##$DC= 0
##$DFILT= <>
##$DTYPP= 0
##$F1P= 14.0000005364418
##$F2P= -0.99999901652339
##$FCOR= 0.5
##$FTSIZE= 32768
##$FT_mod= 6
##$GAMMA= 0
##$GB= 0
##$INTBC= 1
##$INTSCL= 1
##$ISEN= 128
##$LB= 0.3
##$LEV0= 0
##$LPBIN= 0
##$MAXI= 10000
##$MC2= 0
##$MEAN= 0
##$ME_mod= 0
##$MI= 0
##$NCOEF= 0
##$NC_proc= -4
##$NLEV= 6
##$NOISF1= 0
##$NOISF2= 0
##$NSP= 0
##$NTH_PI= 0
##$NZP= 0
##$OFFSET= 16.522
##$PC= 1
##$PHC0= 17.24329
##$PHC1= 4.468028
##$PH_mod= 1
##$PKNL= yes
##$PPARMOD= 0
##$PSCAL= 4
##$PSIGN= 0
##$REVERSE= no
##$SF= 250.13
##$SI= 32768
##$SIGF1= 0
##$SIGF2= 0
##$SINO= 400
##$SIOLD= 32768
##$SREGLST= <1H.CDCl3>
##$SSB= 0
##$STSI= 32768
##$STSR= 0
##$SW_p= 5175.98343685301
##$SYMM= 0
##$S_DEV= 0
##$TDeff= 65536
##$TDoff= 0
##$TI= <Analysis number 999999
Compound Code 99
Book Reference 9
Project Code 9>
##$TILT= no
##$TM1= 0
##$TM2= 0
##$TOPLEV= 0
##$USERP1= <user>
##$USERP2= <user>
##$USERP3= <user>
##$USERP4= <user>
##$USERP5= <user>
##$WDW= 1
##$XDIM= 32768
##$YMAX_p= 344466804
##$YMIN_p= -50422
$$ End of Bruker specific parameters
$$ ---------------------------------
##NTUPLES= NMR SPECTRUM
##VAR_NAME=  FREQUENCY,     SPECTRUM/REAL,   SPECTRUM/IMAG
##SYMBOL=    X,             R,               I
##VAR_TYPE=  INDEPENDENT,   DEPENDENT,       DEPENDENT
##VAR_FORM=  AFFN,          ASDF,            ASDF
##VAR_DIM=   32768,         32768,           32768
##UNITS=     HZ,            ARBITRARY UNITS, ARBITRARY UNITS
##FACTOR=    0.157963299565203, 1,           1
##FIRST=     4132.6476996994, 0,             0
##LAST=      -1043.33573715361, 0,           0
##MIN=       -1043.33573715361, -50422,      0
##MAX=       4132.6476996994, 344466804,     0
$$ Real data points
##PAGE= N=1
##DATA TABLE= (X++(R..R)), XYDATA
$$ [...]
16157b460J4034j778j3860q70j807N107J0738k848j7891k0340n104J8115R052
16144i912J0583L740N43n293j895o2n486o849Q62J7346R37l989p146M18l832q749
16128a8784l814J4089R999qq684L280j1132j3534n476N243J6961Q439Q724l610
16114A693J173n320r038O903L00m430r198N585J9159m272j0548j232Q414j7099
16100a7910k2769R396K7405J9706k006j0158R354J263m353o388P507j4337O072
16087B782J4211O833j3828k4820p033m05L474J2759O332k327P070j506j2430j172
16073a0060L386J629L950J0195o341J4622L67j807m914l34M406k431j2876%l989
16058d197J2726m779q882j634L012q439J413J2548j5146L042l293l714M865J295
$$ plain form
16157 -2460 11574 9796 -4064 -4934 -6741 -1634 9104 6256 -11635 -31975 -37079 -18964 -9912
16144 -9912 671 4411 4954 -339 -2234 -2296 -7782 -14631 -13769 3577 4514 525 -6621 -6203 -10035 -18784
16128 -18784 -22598 -8509 1490 1482 -7202 -3922 -15054 -28588 -34064 -28821 -11860 -3421 5303 1693
16114 1693 2866 -2454 -11492 -4589 -4289 -8719 -17917 -12332 6827 2555 -7993 -9225 -811 -17910
16100 -17910 -40679 -31283 -3878 15828 13822 3664 13018 14281 9928 3540 11047 -3290 2782
16087 2782 16993 23826 9998 -14822 -21855 -22260 -18786 -6027 305 -2022 5048 3542 -8888 -10060
16073 -10060 -6674 -5045 -1095 9100 2759 17381 17748 15941 11027 10693 15099 12668 -208 -208 -4197
16058 -4197 8529 3750 -5132 -6766 -3754 -12193 -10780 1768 -13378 -10336 -13629 -17343 -12478 -11183
16044a1183K905R096k938O112O439n768j0014j200R927O096J569R28j1504j1525
16030a1060p797K842J5304q86q43K322n064Q957j1790q837k648Q65J0153J3310
16016D828l045l752k258K998R413K68Q40p749L812q62p384p384N508O604P076
16001H913R203q4n169j1335o723K448Q982k166j4718j5002n646k341J6529p899
15987b5008J526P647l212J4274J0674J1984J2616L933o122j9770j9991L292K2800
15974A4643J040L442j2972j6488M224m657N851J1434J803j4637o903R711P270
15961C761N719n145J479p426o549o553P778J4687M407J422K957m988j7493j5709
15947b1653Q381K187j656K192L394Q9n499J0050J6203J3798j0870j8772O578M242
$$ plain form
16044 -11183 -8278 818 -2120 3992 10431 4663 -5351 -6551 3376 9472 11041 11969 465 -11060
16030 -11060 -18857 -16015 -711 -1597 -2440 -118 -5182 3775 -8015 -16852 -19500 -18635 -8482 4828
16016 4828 1783 -1969 -4227 -1229 8184 8452 9292 1543 5355 4493 -2891 -10275 -4767 1837 8913
16001 8913 18116 18032 12863 1528 -5195 -2747 6235 4069 -10649 -25651 -31297 -33638 -17109 -25008
15987 -25008 -23482 -15835 -19047 -4773 5901 17885 30501 34434 28312 8542 -11449 -8157 14643
15974 14643 15683 19125 6153 -10335 -6111 -10768 -4917 6517 8320 -6317 -13220 -3509 3761
15961 3761 9480 4335 5814 -1612 -8161 -14714 -6936 7751 12158 13580 16537 11549 -5944 -21653
15947 -21653 -13272 -11085 -12741 -10549 -7155 -7066 -12565 -2515 13688 27486 16616 -2156 4422 8664
15933H664N366j599p703r00q64L344K320m728p844q591J8846N854l383N702r115
15918E369n407Q786N366M787J1543l295k1070j6535N082Q611j3894o786J2422
15905e021Q081j2562J871P834O730J83n492J4809O733r327L653o436j2250j4252
15891a5446o348O133N548L964m338J5644r26p967n146K21P117J027P170M783Q361
15876A9797n280K494L652j816n314R65p879o920p167K95J915p993o275J490R406
15861h630j4503K313K1119L664p840J837J5623J2678k424m644L277j9131k1479
15848a8140r12J7886J2326l619J731K197J144L862j1111j8368p873J08Q60K707
15834a7202J1877k590J2058M452N336q731r766n103N07O121k4835Q66L3135J7204
$$ plain form
15933 8664 14030 12431 4728 3828 2964 6308 8628 3900 -3944 -12535 6311 12165 8782 14484 5369
15918 5369 -38 8748 14114 18901 30444 27149 6079 -10456 -5374 3237 -10657 -17443 -5021
15905 -5021 3060 -9502 -7631 203 6933 7116 1624 16433 23166 13839 17492 11056 -1194 -15446
15891 -15446 -21794 -15661 -10113 -6149 -10487 5157 4231 -3736 -8882 -8661 -1544 -517 6653 11436 19797
15876 19797 14517 17011 20663 18847 13533 14498 6619 -301 -7468 -7173 -5258 -13251 -19526 -18036 -8630
15861 -8630 -23133 -20820 299 3963 -3877 -2040 13583 26261 23837 19193 22470 3339 -18140
15848 -18140 -19052 -1166 11160 7541 9272 11469 12613 16475 5364 -13004 -20877 -20769 -19909 -17202
15834 -17202 -5325 -7915 4143 8595 13931 5200 -4566 -9669 -9162 -3041 -27876 -27010 6125 23329
15820B3329j3655k0462N212N759o087J554J3831r427n692N987j3893m789L581
15807a4752L775J0311N17J3046L427j9355j7737L901J0145J4118Q033j5508j0630
15794a0709M1J3818J5420m98m712m65j185K748n886j4534o667L084q268j2380
15780c0193n117n012J1619K7869k297r955l932l915l143N858j324o474p861N097
15766b8780J0352j1633J1524O072R939k935O360j258q524q380L692m946p571j816
15752b7904J0979R061J898J571N519P571j199k467j545j2581p223L706J19j428
15738a3923j0992r79J80J3247J1616J3695j0824k7873p755J5117P472K821k223
15725a0421J8348k504p513r574J1741Q170J30n467j3514N85J4434q552o338j1619
$$ plain form
15820 23329 9674 -10788 -5576 183 -5904 -4350 9481 54 -5638 349 -13544 -18333 -14752
15807 -14752 -10977 -666 -149 12897 16324 -3031 -20768 -16867 -6722 7396 15429 -79 -10709
15794 -10709 -10668 3150 18570 18072 13360 12895 11710 14458 8572 -5962 -12629 -9545 -17813 -30193
15780 -30193 -35310 -40322 -28703 -834 -3131 -13086 -17018 -20933 -24076 -18218 -19542 -26016 -33877 -28780
15766 -28780 -18428 -30061 -18537 -12465 -2526 -5461 899 -359 -8883 -17263 -13571 -18517 -26088 -27904
15752 -27904 -16925 -7864 -5966 -4395 1124 8695 7496 5029 3484 -9097 -16320 -12614 -12495 -13923
15738 -13923 -24915 -25894 -25714 -12467 -851 12844 2020 -25853 -33608 -18491 -11019 -8198 -10421
15725 -10421 7927 5423 -2090 -11664 77 8247 8377 2910 -10604 -10019 4415 -4137 -10475 -22094
15711b2094P374N277Q670J630r578L049R931J3181n665k670j12n686m205J347
15697D49j2977j6007K76K1009K1747N023R273j3446j0370n605q647k289J758L644
15683f162M992N20O962o480j9992j158J1773O577k687n798J1470J2142Q880m068
15669A6971j3334q684o830k278K945k533J87J1366k833j4435n127l749M123R404
15655a4807O99J741l032K197j69L016m982r241Q027j638J155L670J877J1833O946
15640G292M7o827m577K851j959p579R208m219L035N5p832L322P441n067j7430
15625b2239k127Q274K789J079J2902P215j624O850M690p14j4571j4819k658o887
15611b1840k21m731L619M789L810J4291j1944j2858N78m637K271K875J744J0335
$$ plain form
15711 -22094 -14720 -9443 -773 857 -8721 -5672 4259 17440 11775 9105 8993 3307 -898 449
15697 449 -12528 -28535 -28259 -7250 14497 19520 28793 15347 4977 -628 -9275 -11564 -9806 -6162
15683 -6162 -1170 -650 6312 -168 -20160 -21318 -9545 -2968 -5655 -11453 17 12159 21039 16971
15669 16971 3637 -5047 -11877 -14155 -11210 -13743 -13556 -2190 -5023 -19458 -24585 -28334 -24211 -14807
15655 -14807 -14108 -12367 -15399 -13202 -13371 -10355 -15337 -24578 -16551 -18189 -17034 -13364 -11487 346 7292
15640 7292 7339 512 -4065 -1214 -3173 -10752 -1544 -5763 -2728 -2673 -10505 -7183 258 -4809 -22239
15625 -22239 -24366 -16092 -13303 -12224 678 7893 6269 13119 17809 17095 2524 -12295 -14953 -21840
15611 -21840 -22061 -26792 -23173 -18384 -14574 -283 -12227 -25085 -24507 -29144 -26873 -23998 -22254 -11919
15597a1919j821j563l99j018n899O463J1989L616M033k880r964L454L022n763
15583h649P471J3434O927j5911n220m119r169K282n12N560N78p983k36J4360J0517
15568I330j6745m165O545L886J513j4479l743Q556Q131J6945P967o309j0866j4486
15554g920n265m794P849L637J0727J3469N141k164j3914k2575r773L303N646R854
15540f779Q417Q541L386r220j1944J9363q2o262r55P240L214K167l643n128j0000
15525a685O715J2165j0634r699k1498K189n455J5225J5206J414J416p396j4534
15512a6571k163l218J1455J4025Q984n008q693p96o874J136J223l457K780n895
15498a3072L679M515l18R105J090J979p961j257j1333K55Q022O018q191M666j73
$$ plain form
15597 -11919 -13740 -15303 -15702 -16720 -22619 -16156 -4167 -551 3482 602 -9362 -5908 -2886 -8649
15583 -8649 -1178 12256 19183 3272 -1948 -6067 -15236 -12954 -13466 -7906 -7328 -15311 -15547 -1187 9330
15568 9330 -7415 -11580 -5035 -1149 364 -14115 -17858 -9302 -1171 15774 23741 17432 6566 -7920
15554 -7920 -13185 -17979 -10130 -6493 4234 17703 22844 20680 6766 -15809 -25582 -22279 -16633 -6779
15540 -6779 1638 10179 13565 4345 -7599 11764 11682 5420 4465 11705 14919 17086 13443 8315 -1685
15525 -1685 5030 17195 6561 -3138 -24636 -22447 -27902 -12677 2529 3943 5359 -2037 -16571
15512 -16571 -18734 -21952 -10497 3528 12512 7504 -1189 -1985 -8859 -7723 -6500 -9957 -7177 -13072
15498 -13072 -9393 -4878 -5196 3909 4999 6978 -983 -2240 -13573 -13318 -5296 722 -7469 -2803 -2976
15483b976q307k332m285L927J0080J106p007K228L11p884N076l789j45Q871m713
15468i839P116O964n033n741j4944M553K5253m09p719j2145J1629L184q142j5723
15454b0996j3103N714J673R600J6262k646R163J4960j0557j103k300r585j311
15441d229K57R389L088j6821m371j26j1488o771O071J2611J018J068P322r484
15427a2466J916Q506J2109K032j0606p511L086r731n635P083L381o205L494O818
15413c729j989O237O019k252r489j164K163M5j0307J32M225K710O039j4159L350
15398a2169J3561o972q921k077O513Q053l876j4589l265j399R320P500L974K493
15384a854J6458j424n019j0031n916p756p936m127Q456R456Q294J0926m99j6715
$$ plain form
15483 -2976 -11283 -13615 -17900 -13973 -3893 -2787 -9794 -7566 -7255 -15139 -10063 -13852 -13997 -5126 -9839
15468 -9839 -2723 4241 -792 -6533 -21477 -16924 8329 7920 201 -11944 -315 2869 -5273 -20996
15454 -20996 -34099 -28385 -26712 -17112 -850 -3496 5667 20627 10070 8967 6667 -2918 -4229
15441 -4229 -3972 5417 8505 -8316 -12687 -12813 -24301 -31072 -25001 -12390 -11372 -10304 -2982 -12466
15427 -12466 -10550 -2044 10065 12097 1491 -6020 -2934 -12665 -18300 -11217 -7836 -14041 -10547 -3729
15413 -3729 -5718 519 6538 4286 -5203 -6367 -4204 -4159 -14466 -14334 -10109 -7399 -1360 -15519 -12169
15398 -12169 1392 -5580 -14501 -16578 -10065 -2012 -5888 -20477 -23742 -25141 -15821 -8321 -4347 -1854
15384 -1854 14604 13180 8161 -1870 -7786 -15542 -23478 -27605 -19149 -9693 -1399 9527 9028 -7687
15370g687J0567n088k4618m505P001K2819L312q634P366J3537J2153j3363j0271
15357B589j8174l594J2793k161q889J578j2629J226J9561P346j0563n125p815
15344b3857q52P782J1599O830R539j2377o008n033j3729q071K5152J8258k437
15331F796j5673m678K382o559Q18K105P452k518j3281j0610j193k052N337J2338
15317a9336j083M911J0088N107o140K868K27L774O861p511l361M847K2387N945
15303B9584n111k106Q0n125j1906l6K333P488J0768j0234j7185O901r314r553
15289a3416J2000J0559K081p010o793J364L940M148K88P783n991j5664j0285n957
15275b2953M254J1748Q171J3495n317j5746O178n890j1704p681j46O983M091l383
$$ plain form
15370 -7687 2880 -2208 -26826 -31331 -24330 -1511 1801 -6833 533 14070 26223 12860 2589
15357 2589 -15585 -19179 -6386 -8547 -17436 -15858 -28487 -27261 -7700 -354 -10917 -16042 -23857
15344 -23857 -24709 -16927 -5328 1502 11041 -1336 -7344 -12377 -26106 -34177 -9025 9233 6796
15331 6796 -8877 -13555 -11173 -17732 -16914 -14809 -7357 -9875 -23156 -33766 -34959 -37011 -31674 -19336
15317 -19336 -20419 -15508 -5420 -313 -6453 -3585 -3358 416 7277 -234 -3595 1252 23639 29584
15303 29584 24473 22367 22447 17322 5416 5380 7713 15201 25969 15735 -1450 5451 -3863 -13416
15289 -13416 -1416 9143 11224 4214 -2579 -1215 2725 6873 7161 14944 8953 -6711 -16996 -22953
15275 -22953 -18699 -6951 1220 14715 9398 -6348 -170 -6060 -17764 -25445 -25591 -18608 -14517 -17900
15261a7900J1038Q166k624M534P8N836P464k365p805n870M33J2857N226k3608
15247d540j6764J9668J9562j8014n988k1353K640J0803O957Q612J343N871J4124
15234B2921M000j4642j1380q972j0941o41O675n875j2377m797q419N727K5982
15221a2739K3269N413j799n724j3783J3127J3401j2693k0905j3592K626N354l817
15208b1862J0194J1030R426M71j8849m044J7794J0499j5869j3344J0433Q270J214
15195E363o318l169N503O321n919L732r020j896j92j4505q552P028N089J240Q136
15180g159M961o549j4993j427J0582n440M22J3168j807m811o381J0670R530J487
15166B253m394k4833p082J1660J5033L604L176p229q915p2R467J4080l450l368
$$ plain form
15261 -17900 -6862 1304 -1320 3214 3292 9128 16592 14227 6422 552 985 13842 19068 -4540
15247 -4540 -21304 -1636 17926 -88 -6076 -27429 -24789 -13986 -7029 1583 2926 8797 22921
15234 22921 26921 12279 899 -8073 -19014 -19655 -12980 -18855 -31232 -36029 -44448 -38721 -12739
15221 -12739 10530 15943 14144 8420 -5363 7764 21165 8472 -12433 -26025 -23399 -18045 -21862
15208 -21862 -11668 -638 8788 9259 -9590 -13634 4160 14659 -1210 -14554 -4121 4149 5363
15195 5363 -955 -4124 1379 7700 1781 5513 -3507 -5403 -5595 -20100 -28652 -21624 -16535 -15295 -7159
15180 -7159 -2198 -8747 -23740 -25167 -14585 -20025 -19603 -6435 -8242 -13053 -19434 -8764 766 2253
15166 2253 -2141 -26974 -34056 -22396 -7363 -3759 -583 -7812 -16727 -16799 -7332 6748 3298 -70
15152g0j242J0458L568j6554j3838K125O56J243n826q722m109K2326M40n239j0022
15137b4806O202J694m846k567J6567N530J476J833J0456J2943k794n977j8082
15124b371j0327k102J2040R007N610k877P228J165Q614l622j5567j0460p440k377
15110a3479o446M412O291L594J1346Q628M40M830J8734r245j1617j3093k0829
15097a6434j652O779N906n681o587n538l837M175O980J469k379j945n687n770
15083c0201L181L173N155k604K850P554J5715r66m751n176J311q018r477M007
15069a8247O351k021K112n360J2272M743j277j616l176o078M637J617N645j2560
15055a2958j3759l16J3032J5669j0948R733j4377q717P739K91jO234R203L938
$$ plain form
15152 -70 -1312 9146 12714 -3840 -17678 -15553 -14897 -13654 -19480 -28202 -32311 -9985 -9545 -14784 -24806
15137 -24806 -18604 -16910 -21756 -24323 -7756 -2226 -750 1083 11539 24482 21688 15711 -2371
15124 -2371 -12698 -14800 -2760 6247 11857 8980 16208 17373 25987 22365 6798 -3662 -11102 -13479
15110 -13479 -19925 -15513 -9222 -5628 5718 14346 14786 19616 38350 29105 17488 4395 -16434
15097 -16434 -18086 -11307 -5401 -11082 -17669 -23207 -27044 -22869 -15889 -14420 -16799 -18744 -24431 -30201
15083 -30201 -27020 -23847 -18692 -21296 -18446 -10892 4823 3857 -894 -6070 -4759 -12777 -22254 -18247
15069 -18247 -11896 -13917 -11805 -17165 -4893 -150 -1427 -3043 -6219 -12297 -7660 -6043 -398 -12958
15055 -12958 -26717 -27033 -14001 1668 -9280 453 -13924 -22641 -14902 -14611 -14612 -8378 825 4763
15041D763l974j2561o116J2801J002p869L037N446l663j30K179J736j0944Q256
15027f037P171M697n665k737L664L319j886L747j3727j6722k791K2200J6768N278
15013A7279p728j853J733k494J742o533r744q263J3984M069j0921q456r362N694
14999b0853J1581m896O643J3528k305q787j2207K548K73m771J1114M507M433o2
14985G46n847j1823J3587J15N126O114N183k210j9964q620L565m425Q217M964
14971e272p457j7774n463J5829J1023k620j975q877n500J1281n998P080J9693
14958C970J2661m36m197j5292K840J0004J776j1169q695j331l689R007J1399m480
14944B368q706j7319J4990J1271o882O095q186j7467M701p297j6681k128P378
$$ plain form
15041 4763 789 -11772 -17888 -5087 -4085 -11954 -8917 -3471 -7134 -7264 -5085 -3349 -14293 -6037
15027 -6037 1134 5831 166 -2571 1093 4412 2526 6273 -7454 -24176 -26967 -4767 12001 17279
15013 17279 9551 7698 9431 6937 8679 2146 -7598 -15861 -1877 2192 -8729 -17185 -26547 -20853
14999 -20853 -9272 -14168 -7525 6003 3698 -5089 -17296 -14748 -14475 -19246 -8132 -3625 808 746
14985 746 -5101 -16924 -3337 -3222 1904 8018 13201 10991 -8973 -17593 -14028 -18453 -10236 -5272
14971 -5272 -12729 -30503 -35966 -20137 -9114 -11734 -13709 -22586 -28086 -16805 -22803 -15723 3970
14958 3970 16631 16195 11998 -3294 -454 9550 11326 157 -8538 -9869 -13558 -4551 6848 2368
14944 2368 -6338 -23657 -8667 2604 -4278 1817 -6369 -23836 -19135 -26432 -43113 -45241 -37863
14931c7863o967O211Q654P467N64L867M840j5446j1571P924J8658K989M198N273
14917a202l301K619L70J0654n869p786m052k635l784M335j3303j912l460J8224
14903a1102M135M933J335n113Q9m868J6595P085j0667j2752j3504M865R273j1508
14889b1204n57J4415k752j5227L504j137L683M678k805P263J3369M069p500O020
14875E819J3186j364o114M203j65p164j2903j692J231P744M492o401j6522j3125
14861b8775K771j391k254P2R900J7654J5749q460q788J797o292j2559j1544j031
14847c3151J1450K323K167J1359P657J514J0204j1693j7162j0466J10L181Q625
14834a3882M660o884L067n69J0014R101J5588M090L022j2107j3052m505l75j8966
$$ plain form
14931 -37863 -44830 -38619 -29965 -22498 -21934 -18067 -13227 -28673 -40244 -32320 -13662 -10673 -6475 -1202
14917 -1202 -4503 -1884 -1514 9140 3271 -4515 -8567 -11202 -14986 -10651 -23954 -25866 -29326 -11102
14903 -11102 -6967 -2034 -699 -5812 -5723 -10591 6004 13089 2422 -10330 -23834 -18969 -9696 -21204
14889 -21204 -21761 -7346 -10098 -25325 -21821 -22958 -19275 -14597 -17402 -10139 3230 7299 -201 5819
14875 5819 19005 17641 11527 15730 15565 8401 -4502 -6194 -4963 2781 7273 872 -15650 -28775
14861 -28775 -26004 -27395 -29649 -29577 -19677 -2023 13726 5266 -3522 -1725 -8017 -20576 -32120 -33151
14847 -33151 -21701 -19378 -17211 -5852 1805 3319 13523 1830 -15332 -25798 -25688 -22507 -13882
14834 -13882 -9222 -16106 -13039 -13608 -3594 5507 21095 25185 28207 16100 3048 -1457 -1832 -20798
14820b0798r30M927l462N613J0118j02j0016n2R772M382Q191q154k055n965M91
14805h040J0689k063O341J0934N472j2257j6180o784q562M32O292P344J3342l503
14791C457k314l807j3372R764Q504k270j361m304r13j4884P22J2396O963J8340
14777A6921j0881m704k676j2766L121J2099n728P145N568l122j033j5099l469
14764a4624L550K4812J1574j6339j6212o060o886r509M876p35J3985J2474j2945
14751a2039p665J3422R445N475K146O427n002L233j375j0022P176l86J118j1930
14737B3q036j170m429R78Q589J2282J0627j6113q841K320k479L358j1837j824
14723a6552N826q667k263J6774L761Q460R465L244l926n739o043n227o370K032
$$ plain form
14820 -20798 -21728 -16801 -20263 -14650 -4532 -4634 -14650 -14702 -4930 -548 7643 -511 -2566 -8531 -8040
14805 -8040 2649 586 6927 17861 23333 11076 -5104 -11888 -20450 -20018 -13726 -6382 6960 3457
14791 3457 1143 -2664 -16036 -6272 2232 -38 -1399 -5703 -6616 -21500 -20778 -8382 -1419 16921
14777 16921 6040 1336 -1340 -14106 -10985 1114 -4614 2531 8099 4977 3944 -11155 -14624
14764 -14624 -11074 13738 25312 8973 -7239 -13299 -20185 -29694 -24818 -25553 -11568 906 -12039
14751 -12039 -19704 -6282 3163 8638 10784 17211 12209 15442 14067 4045 11221 10835 11953 23
14737 23 -8013 -9183 -13612 -12634 -4045 8237 18864 2751 -6090 -3770 -6249 -2891 -14728 -16552
14723 -16552 -10726 -19393 -21656 -4882 -1121 7339 16804 20048 16122 10383 4340 -887 -7257 -5225
14709e225j0786q113L640Q354J0154R221r899n562J3724N43L487k560q181J3447
14695A2244K61j871r06M34R665m521n418j5611k544J1218L201L20j1969l604n17
14680i618M518L08R959p167Q053m137J752N606r819o08K55o345R923L992M114
14665A0786j5197n927J4388J818p051n958j2001k239L62N593K49L586J996j6J459
14650h152J710L491M948k614r699j0043j818K056n146P427l432n300O319P206
14636a3047J8193l438n434o45k726j231r304o092j545R064P364L711J2649q133
14622f14j0680j617Q884r14P390n179l891J249m046Q055J47k92J6553J6751k3371
14607H425m835J592R616o216o647r489j66L148k461j3396m953j149J1668J1564
$$ plain form
14709 -5225 -16011 -24124 -20484 -12130 -1976 7245 -2654 -8216 5508 6051 9538 6978 -1203 12244
14695 12244 12505 10634 9728 10162 19827 15306 9888 -5723 -8267 2951 6152 6472 -5497 -9101 -9618
14680 -9618 -5100 -4792 5167 -2000 6053 1916 3668 9274 -545 -1153 -898 -7243 2680 6672 10786
14665 10786 -4411 -10338 4050 5868 -1183 -7141 -19142 -21381 -21019 -15426 -15177 -11591 -9595 -9611 -8152
14650 -8152 -6442 -2951 1997 -617 -10316 -20359 -22177 -20121 -25267 -17840 -21272 -26572 -20253 -13047
14636 -13047 5146 1708 -3726 -4371 -7097 -8328 -17632 -23724 -25269 -16205 -8841 -5130 7519 -614
14622 -614 -11294 -12911 -4027 -4941 2449 -2730 -6621 -5372 -9418 -1363 -1216 -1508 15045 31796 8425
14607 8425 3590 5182 14798 8582 1935 -7554 -7720 -4572 -7033 -20429 -25382 -26531 -14863 -3299
14593c299j792o696l282R116M626k473k063K758N823L347q443o318K582M694M780
14578C360j5820L929K3246O55K069j9725m426l986m797P902J0120N119j1481L112
14564g23M293o332L168r2q494o96J948j573r046O696J0844Q958j2313L21n291
14549h332k216L02O966N059l369k372Q736J3658N187L61N35j0231j5912l070J568
14534c130k514J4783m703k0077O107R308n631L184P072J8739k399k1611n699M048
14520b523n559J0286N883j2257j1559p759l709Q996J945J7679N642L333j0250
14507A48l536L23k0902M817j478k01R931J1377J402j4738J570O903J3476j21q826
14492A45q888r756J292Q059Q15O021j369m62j2223p492k625J556K714K0827J4711
$$ plain form
14593 -3299 -5091 -11787 -15069 -5953 -1327 -3800 -5863 -3105 2718 6065 -2378 -8696 -6114 -1420 3360
14578 3360 -12460 -8531 14715 15370 17439 -2286 -6712 -10698 -15495 -7593 2527 7646 -3835 -723
14564 -723 3570 -2762 406 314 -8180 -8876 -6928 -8501 -17547 -10851 -7 8951 -3362 -3041 -8332
14549 -8332 -10548 -10246 -3280 1779 -1590 -3962 4774 18432 23619 23980 24515 14284 -1628 -4698 -3130
14534 -3130 -5644 9139 4436 -15641 -9534 -226 -5857 -2673 4399 23138 20739 -872 -6571 -2523
14520 -2523 -8082 2204 8087 -4170 -15729 -23488 -27197 -18201 -16256 1423 7065 10398 148
14507 148 -3388 -3065 -23967 -19150 -20628 -20829 -10898 479 1881 -12857 -11287 -4384 9092 8971 145
14492 145 -8743 -18499 -17207 -9148 -8333 -2312 -3681 -4143 -16366 -23858 -26483 -24927 -22213 -1386 13325
14477A3325j0445p121L474L55K293k882N888N827r73o95o008j811j849m716k225
14462g563L613k103j365p090J2041J4907j0830q994p710j1723n259N623K1066
14449e387m34q229m519J8213J6505j2795n473K3148J771j3481J028n731r793J052
14435d125j2002m948J4254K7066r694n825J4995J0025k6050k5630j3266J287Q565
14422b5348N47m099J571P553n33m830Q464P04j6919O089M718J4463M370j9520
14408b2770q924R181J5629Q160M162r619j036J398n354k869J8441k882j2518N523
14394c478o801l090o31J722p216r766M195O973J720N380K0440p004j5099j1916
14380b4571k612K214q824Q965J3879o759r261J6397O933n953J689n523M119n21
$$ plain form
14477 13325 2880 -4241 -767 -412 1881 -1001 4887 10714 9741 9046 3038 1227 -622 -5338 -7563
14462 -7563 -3950 -6053 -7418 -14508 -2467 12440 1610 -7384 -15094 -26817 -32076 -26453 -5387
14449 -5387 -5821 -14050 -18569 -356 16149 3354 -2119 21029 22800 9319 10347 4616 -5177 -4125
14435 -4125 -16127 -21075 -6821 20245 10551 4726 19721 29746 3696 -21934 -35200 -33913 -25348
14422 -25348 -24801 -28900 -27329 -19776 -20309 -25139 -16675 -15971 -32890 -26801 -22083 -7620 -3250 -22770
14408 -22770 -31694 -22513 -6884 1276 5438 -4181 -5217 -3819 -9173 -12042 6399 3517 -9001 -3478
14394 -3478 -10279 -13369 -14000 -12278 -19494 -29260 -25065 -18092 -16372 -10992 9448 2444 -12655 -24571
14380 -24571 -27183 -24969 -33793 -24828 -10949 -17708 -26969 -10572 -3639 -9592 -7903 -13426 -9307 -9828
14366i828P492r196q917O464n984j5758P701o795j575K528J052j012K477J4956
14352a6395J1822j4658p749J6326R503l448j913L370P209Q227P34l632K656p939
14338D113j5198K976o352J09N757n263M425K577j1141j4327j6744K804J7180K695
14324b6389R155Q658N625K025R897j5731j7732j994k271J3705J0031j785J1116
14311D310N667J254j6210k775K523m93J532j62N284l526j0060J882J6711J2951
14297A8888j0629j2410j2973q829J3287l60K836o226N467J4047R137j1441p01
14284I3R179j48k43r84r579N675J446q354O588P444n16n051j2555q551R990R843
14268D277j0488j1166q097M039J0521k710K773R81M436P084O862j0221o766O515
$$ plain form
14366 -9828 -2336 -11532 -20449 -13985 -19969 -35727 -28026 -34821 -36396 -33868 -32816 -33828 -31351 -16395
14352 -16395 -4573 -19231 -26980 -10654 -1151 -4599 -6512 -3142 4067 12294 13028 9396 12052 4113
14338 4113 -11085 -8109 -14461 -14352 -8595 -13858 -9433 -6856 -17997 -32324 -49068 -46264 -29084 -26389
14324 -26389 -17234 -8576 -2951 -926 8971 -6760 -24492 -26486 -28757 -15052 -5021 -6806 4310
14311 4310 9977 11231 -4979 -7754 -5231 -5724 -4192 -4354 930 -2596 -12656 -10774 5937 18888
14297 18888 8259 -4151 -17124 -25953 -12666 -13026 -10190 -16416 -10949 3098 12235 794 93
14284 93 9272 9124 8881 7897 -1682 3993 5439 -2915 3673 11117 10601 5550 -7005 -15556 -5566 4277
14268 4277 -6211 -17377 -25474 -21435 -10914 -13624 -10851 -9870 -5434 1650 8512 -1709 -8475 -1960
14254a960k021j6463o087J3561K2732J979L567R367M424j2602j1838r512Q397
14241C544R430q743j3502r733N985P852n605k936r22N59K720r737J512k841r979
14226c2396J1728P542k150L20l468j1924K889J2660Q538j791J984N766m053j230
14212e585j0884N843l19L689K964n175l159l791L600l540K24j1691k385P097Q456
14197a4656q21j1040N07K767K797N086o495J2500K498j0671q83M58l845N610J0802
14182e386l572l785J0911J895p796J0314m908J174J590r751Q009J204n96n234
14168e931M088Q614J630J9033K023j0924l797n074k577j2115p053J0445J248j943
14154b333j858J757P397N774L49q179j3333n630K607l034r73J3382M371N477j1622
$$ plain form
14254 -1960 -3981 -20444 -26531 -12970 9762 11741 15308 24675 29099 16497 4659 -4853 3544
14241 3544 12974 4231 -9271 -19004 -13019 -5167 -10772 -13708 -14630 -14071 -11351 -21088 -19576 -22417 -32396
14226 -32396 -20668 -13126 -15276 -14956 -18424 -30348 -27459 -14799 -6261 -8052 -6068 -302 -4355 -5585
14212 -5585 -16469 -10626 -10945 -7256 -4292 -9467 -12626 -16417 -12817 -16357 -16133 -27824 -30209 -23112 -14656
14197 -14656 -15477 -26517 -26010 -23243 -20446 -15360 -21855 -9355 -6857 -17528 -18411 -17953 -21798 -16188 -5386
14182 -5386 -8958 -12743 -1832 63 -7733 2581 -2327 -1153 437 -9314 -1305 -101 -697 -5931
14168 -5931 -1843 6771 8401 27434 29457 18533 14736 9662 7085 -5030 -12083 -1638 -390 -2333
14154 -2333 -4191 -2434 4963 10737 11086 2907 -10426 -16056 -13449 -16483 -17456 -4074 297 5774 -5848
14139e848q91m181p220J258L123M575k305n165J1750K502o663r170o43J3172M503
14124a203K518O046l794m544k892k449p718j792n012J2074k462P510N311K412
14110D005q48m649j167M337r235l810J1619J0168p793n700k468K962R990N647
14096A3058q450O709n020j0327J986j857o086M680J985j3018q487M852Q37o095
14082b5233q024N789m293K994M312P047o511Q732Q136L393J748K087J753o658
14068d728r854n19O592l53Q681J2719L652q1q095r889r635j213q396n663j735
14053b8517j695J1918K130P537M133J1327P103J945j1063o39k952q373R566n545
14039c125j564P828O10o045n693O712M931k0145K138j06L032J5044Q136p691N765
$$ plain form
14139 -5848 -6739 -10920 -18140 -16882 -13759 -9184 -11489 -16654 -4904 -2402 -9065 -18235 -18878 -5706 -1203
14124 -1203 1315 7361 3567 -977 -3869 -6318 -14036 -15828 -20840 -8766 -11228 -3718 1593 4005
14110 4005 3157 -1492 -2659 1678 -7557 -11367 252 10420 2627 -3073 -5541 -2579 7411 13058
14096 13058 4608 11317 6297 -4030 -2044 -3901 -9987 -5307 -3322 -16340 -24827 -19975 -19138 -25233
14082 -25233 -33257 -27468 -31761 -28767 -24455 -17408 -23919 -15187 -7051 -3658 -1910 177 1930 -4728
14068 -4728 -14582 -15101 -8509 -8862 -181 12538 16190 16109 8014 -1875 -11510 -12723 -21119 -26782 -28517
14053 -28517 -30212 -18294 -16164 -8627 -4494 6833 13936 15881 4818 4179 1227 -7146 2420 -3125
14039 -3125 -4689 3139 3749 -2296 -7989 -1277 3654 -16491 -14353 -14459 -11427 3617 11753 4062 9827
14024I827J617o011q685L711N145O057j4270j5079N655J8980k799j2937M813L604
14010c72O103j237l764m470m326J0016J6276J3334l477r916j1494j3484k809o530
13996a6150k131P543J6544m970j332l321J2018P921J975p696j1691q543Q09M780
13982d244J1351k385j0804k181M817M342j6638M737L805J377k454j275L625R635
13968C708m949k0029r301J1719J3903R2J0146O597J1506j307r493j0254r98P277
13954H617P863L197j2210q36L412K182R912p115j2433n112j0699l794N283J7187
13940E454Q420q174q657M256p13j5547q90Q23J584K771m30j489j71m899p819J087
13924b4394R290l641J7184K2588n29j3254j8646L509K0894L205o698m747M945
$$ plain form
14024 9827 11444 5433 -3252 459 5604 11661 -2609 -17688 -12033 6947 4148 -8789 -3976 -372
14010 -372 5731 4494 730 -3740 -8066 1950 18226 31560 28083 18167 6673 -6811 -9620 -16150
13996 -16150 -18281 -10738 5806 836 -496 -3817 8201 16122 18097 10401 -1290 -9833 -9024 -4244
13982 -4244 7107 4722 -6082 -8263 -3446 896 -15742 -11005 -7200 -5823 -8277 -9552 -5927 3708
13968 3708 -1241 -21270 -30571 -18852 -4949 -4857 5289 11886 23392 22085 12592 2338 1340 8617
13954 8617 16480 19677 7467 6631 10043 12225 22137 15022 2589 -2523 -13222 -17016 -11733 5454
13940 5454 13874 5700 -2957 1299 586 -14961 -15851 -15028 -13444 -10673 -11103 -12592 -12763 -17662 -25481 -24394
13924 -24394 -15104 -18745 -1561 21027 20498 7244 -11402 -7893 13001 16206 9508 4761 9706
13911I706q18j2847j799l183R559O334m144o573r529j036o936J9968N016j4527
13897a0809o559J5002J4290M780j815j6934n531p735j1799j5818P155K4693J251
13884i829J1111Q902l562j3356p214J4788j307j4405j453P92L868r917Q7J4937
13870f558P683P52K033o905j0732j66K0757P512o527q779j4029Q564L181o16j2390
13855a6220l132J872K3569J3665n587o090o347r090L100O43R173N192n982j4986
13841a0220j6851Q270J0434J9886R228r908j4412q596J2128q34q330n39r01j4681
13827b5326k975q145r436R823L02J0241J2523J0468J0651J4495q118q136l670
13814B697K134Q448J5866m06m191l135q88j4835l579k933J096Q921j0091Q165
$$ plain form
13911 9706 8888 -3959 -5758 -8941 618 6952 2808 -3765 -13294 -14330 -21266 -1298 3718 -10809
13897 -10809 -17368 -2366 11924 16704 14889 -2045 -7576 -15311 -27110 -42928 -35773 -11080 -9829
13884 -9829 1282 10184 6622 -6734 -13948 840 -467 -14872 -16325 -15533 -11665 -21582 -21495 -6558
13870 -6558 1125 1877 3910 -2995 -13727 -13893 6864 14376 7849 -930 -14959 -6395 -3214 -3830 -16220
13855 -16220 -19352 -17480 6089 19754 14167 8077 1730 -7360 -4260 -3617 5556 10748 4766 -10220
13841 -10220 -27071 -18801 -8367 11519 20747 10839 -3573 -12169 -41 -875 -9205 -9744 -10645 -25326
13827 -25326 -28301 -36446 -45882 -36059 -35757 -25516 -12993 -2525 8126 22621 14503 6367 2697
13814 2697 4831 13279 29145 28739 24548 21413 20525 5690 2111 -822 274 9195 -896 7269
13800G269J2460j2839j6207J3146P202o192k009p36k615r027j1743P202K290L299
13786h500o193K859J0404l2Q542k878n755R110N340j538O856o169o696n600k438
13771b688J0266M10j9762R2P124O725j856q562K84O414q727r313k041M588P695
13756i351J8055N736j998j10M73O54p836o679m577m890O933J269j447O162K054
13741D448p879L63N05n00L689o790l316M271J0438R635O159j0420k969J87j1087
13726c266r275j005Q516o534J8907R115P623q927M99j3285l415N233o299P373
13712E260r512r676n008m28o296K0527J2890P243L488L640j5983j3309p25N311
13698b578j517l202k590n62N602M30j0981q842O634J6272P114r549j0604O931
$$ plain form
13800 7269 19729 6890 -9317 3829 11031 4839 2830 2094 -521 -9548 -21291 -14089 -11799 -8500
13786 -8500 -14693 -11834 -1430 -1462 7080 4202 -1553 7557 12897 11359 18215 12046 5350 -250 -2688
13771 -2688 7578 7988 -11774 -11682 -4558 2167 311 -8251 -7967 -1553 -10280 -19593 -21634 -17046 -9351
13756 -9351 8704 14440 12442 12332 12805 13459 5623 -1056 -5633 -10523 -3590 -2321 -3768 2394 4448
13741 4448 -3431 -3068 -2563 -3063 626 -6164 -9480 -5209 5229 14864 21023 10603 7634 7821 -3266
13726 -3266 -12541 -13546 -5030 -11564 7343 16458 24081 15154 15653 2368 -1047 4186 -2113 5260
13712 5260 -4252 -13928 -18936 -19364 -25660 -5133 7757 15000 18488 22128 6145 -7164 -7889 -2578
13698 -2578 -4095 -7297 -9887 -10449 -4847 -4417 -15398 -24240 -17606 -1334 5780 -3769 -14373 -7442
13684g442K755o804Q774R691j7472j5617Q49M132m132m841J0575J3483l168j090
13670a0307l738k854P762N461J3396J2067k81r291k1002j2980l288J9562J0770
13657E277O33o390k464q220o394J938J5442N834N421q134r897k465p282P842J1109
13642B250J3710q714k0722n171M409j0223p971J2730P921J1650o854J4014m421
13629B608M27P529l92K258j0693J724O91N948r657r569R70J860j2508M746J3362
13614f96j0971N586R955q305K238J6320j0791J72j2900n000J3308J4101J234q448
13600E803k758J9431k474l0846q255J0623P644o756j1916j0465m985J2933M323
13587a7698J7216J041J827L160J885J996m976p908N478N797p042J78k571j4873
$$ plain form
13684 -7442 -4687 -11491 -2717 6974 -10498 -26115 -25266 -21134 -25266 -30107 -19532 -6049 -9217 -10307
13670 -10307 -14045 -16899 -9137 -3676 9720 21787 21506 12215 -8787 -21767 -25055 -5493 5277
13657 5277 5910 -480 -2944 -11164 -17558 -15620 -178 5656 11077 2943 -6954 -9419 -16701 -8859 2250
13642 2250 15960 7246 -13476 -18647 -14238 -24461 -32432 -19702 -11781 -131 -6985 7029 2608
13629 2608 3035 10564 10172 12430 1737 3461 4152 10100 443 -9126 -8156 -6296 -18804 -14058 -696
13614 -696 -11667 -6081 3874 -4431 -2193 14127 3336 3508 -9392 -14392 -1084 13017 14251 5803
13600 5803 3045 22476 20002 -10844 -19099 -8476 -832 -7588 -19504 -29969 -34954 -22021 -17698
13587 -17698 -482 559 2386 5546 7431 9427 4451 -3457 2021 7818 776 954 -1617 -16490
13573a6490n81P334J3362L577m191r790j2299L404n223l468J6458M246K694l188
13559d155p84K923M379J631O321M693j4103j5892J2P412o004m19M469n641O646
13544h512m761J2007P294M420o404q105j1415l850Q092O984J8010M516n521k702
13530A0053n453k1138j4228N507Q379p976Q432L702k663p363J3875l869l459L893
13516a2308L533L486j1344n469K1394K4334K890M256j7298j969m958q178j3084
13503a4715m259O612N639R807J1972j7946j6587J1212J390r025P02R488j704K841
13489d573j1078j1539K1861J3254k844j3041P916k258M6J3178J9534k714n890
13476B1852n795j6881J080K730O56k139j0708j6421J506O586J0583J6429N185
$$ plain form
13573 -16490 -17071 -9737 3625 7202 3011 -6779 -19078 -15674 -20897 -24365 -7907 -3661 -967 -4155
13559 -4155 -4939 -2016 2363 3994 10315 15008 905 -14987 -14975 -7563 -13567 -13986 -9517 -15158 -8512
13544 -8512 -13273 -1266 6028 10448 4044 -4061 -15476 -19326 -11234 -4250 13760 18276 12755 10053
13530 10053 4600 -16538 -30766 -25259 -16880 -24856 -16424 -12722 -15385 -22748 -8873 -12742 -16201 -12308
13516 -12308 -8775 -5289 -16633 -22102 -708 23626 26516 30772 13474 11505 6547 -1631 -14715
13503 -14715 -18974 -12362 -6723 3084 15056 -2890 -19477 -8265 -6875 -15900 -15198 -5710 -7414 -4573
13489 -4573 -15651 -27190 -5329 7925 5081 -7960 -44 -2302 -2256 10922 30456 27742 21852
13476 21852 16057 -824 256 2986 3642 1503 -9205 -25626 -24120 -17534 -6951 9478 14663
13463A4663q674l779L014q827k0173Q291J8291L386M487l135l765j5382r933K011
13449a9525K0808m740n392M840J047N901L248j435L260J0692k526j1051J5553
13436B0680p59P13L96p983n170m742K051R364q102n334j4852K124N339p802O319
13421g758J610M820P353P368J1815J383j8269p453q138j523j376K132Q679J0566
13407A1209j472r242J652K0367n256j6797m02M834R359J3824N172j3943k23O350
13393B5432p218o102m51j971r159K172Q918l667q777l361L45M844M154o087j0879
13378a1807J925J0385J3419k949p397J102L038j173K466K641n132j8316k097J4194
13364B99O43K902q56p545P025Q66j0628r486n98J3179K172n529n007n87N602O161
$$ plain form
13463 14663 5989 2210 5224 -3603 -23776 -15485 2806 6192 10679 7544 3779 -11603 -21536 -19525
13449 -19525 1283 -3457 -8849 -4009 -2962 2939 6187 4752 8012 18704 16178 5127 20680
13436 20680 19921 20634 21030 13047 7877 3135 5186 14550 6448 1114 -13738 -11614 -6275 -14077 -7758
13421 -7758 -6148 -1328 6025 13393 25208 26591 8322 869 -7269 -8792 -10168 -8036 643 11209
13407 11209 9737 495 2147 22514 17258 461 59 4893 14252 28076 33248 19305 19082 25432
13393 25432 18214 12112 11661 9690 531 2703 11621 7954 -823 -4184 -3839 1005 5159 -928 -11807
13378 -11807 -9882 503 13922 10973 3576 4678 7716 6543 9009 11650 6518 -11798 -13895 299
13364 299 942 3844 2988 -4557 2468 3334 -7294 -16780 -17378 -4199 -2027 -7556 -12563 -13150 -7548 -1387
13348a387K133N440K129q348K334l014O273n505j2240J2355J0255p529O179m546
13334D529j4878p267O64Q16J2744J3195j340j402j0742m211K267P17k502R319
13320A909L343j2299j831J3027k427k52J4828Q69q420k038N504Q754Q858r717
13306B0108j6571P470j2798j6546O265J3133O858j539M854r428o470M931R33K684
13292C884P682p030L202J3596Q8j3870J240M931K306j5318Q032J515n714J0022
13278A4566P977J67o91j7227r495J109Q857o017J553N047m45n505M260o60k62
13263C234P202j916n326j137K17r384R090L903q408j0520m67J1562J0807k544
13249F313J466l234l87k04J286p568k4J23j4582L782L735o884P192J1019K983
$$ plain form
13348 -1387 746 6186 8315 -33 2301 -713 5560 55 -12185 170 10425 2896 9075 4529
13334 4529 -10349 -17616 -16952 -16136 -3392 9803 8463 7061 -3681 -7892 -5625 -4908 -7410 1909
13320 1909 5252 -7047 -8878 4149 1722 1470 16298 17167 8747 6709 12213 20967 29825 20108
13306 20108 3537 11007 -1791 -18337 -12072 1061 7919 6380 11234 1806 -4664 267 1200 3884
13292 3884 11566 4536 7738 21334 21422 7552 8792 13723 16029 711 8743 10258 4544 14566
13278 14566 22543 22710 22019 4792 -4703 -3594 5263 -754 799 5846 5401 -104 4156 3496 3234
13263 3234 10436 8520 3194 2057 2274 -7110 1980 5883 -2525 -13045 -13512 -1950 8857 6313
13249 6313 7779 4545 4158 3954 5240 -2328 -2352 -2229 -16811 -13029 -9294 -16178 -8986 2033 5016
13234E016j694P749N769o563j314R2l635p23J205j0836n738m611L697J0357J6900
13219A5671J3402m558J241j225L487J292j5500q33M400k846J2181q746M213J5428
13205C7607n750o383j1372l050l983J459j587m779L56R26J3978O895j4848j5005
13191e536k392J5219J1753j233R455J322K073Q970k996j3450j854O329N601n553
13177B7708M793J8487J4227N233n532q841q203n083L829O623J5219j986k591o018
13163E7865j6725K546J0524n145j0342n28Q018O459j4898l040M439P923J8193
13150F5289J251r917j3866j4137j006J4354J8026o325p186O916N455m960n049
13137D8845R312j728J235j944O751P352q250q853j4Q552J792j5611J0887k822
$$ plain form
13234 5016 3322 11071 16840 10277 8963 9055 5420 4697 5902 -4934 -10672 -15283 -11586 -1229 15671
13219 15671 29073 24515 25756 24531 28018 29310 13810 12977 17377 14531 26712 17966 22179 37607
13205 37607 31857 25474 14102 11052 7069 8528 6941 2162 2518 3444 17422 24317 9469 -5536
13191 -5536 -7928 7291 19044 17811 27266 28588 30661 39631 36635 23185 21331 27660 33261 27708
13177 27708 32501 50988 65215 70448 64916 56075 47872 42789 46618 53241 68460 66474 63883 57865
13163 57865 41140 43686 54210 49065 38723 38195 46213 52672 37774 34734 39173 47096 65289
13150 65289 66540 56623 42757 28620 27614 41968 59994 53669 46483 53399 58854 53894 48845
13137 48845 58157 56429 57664 55720 62471 69823 61573 52720 52706 61258 63050 47439 58326 55504
13123E5504q225j0493o680N73J1578P659m480m632l809J1484J8619k119L903M993
13109G3875L125j30j4683j1206l439J501q253l645J227N849K513J2138J8615l183
13095G4304j0089q010j988l988J651Q87J2116j038k800J074L280r6m63m039L145
13080F3946P031R210k338l417J7795N897n138j8495n492K18K097L140M56o754
13066F8156P202k173P70J7069k84O142K050q965q464l350L05p451J504L467j608
13051G4370l783j058J1583J59J3545K770n527p839k123k578o042n567P952m178
13037G1684j735Q333K2083L781j2962j8497q681l38O188j0695n403R154p059N187
13023F1040J5892O029m402l956k707L603m303m50l287J714J1058l105K789o00
$$ plain form
13123 55504 47279 36786 30106 30679 42257 49916 45436 40804 36995 48479 67098 64979 68882 73875
13109 73875 77000 76870 62187 50981 47542 49043 40790 37145 38372 44221 46734 58872 77487 74304
13095 74304 64215 56205 54217 50229 51880 52767 64883 63845 61045 62119 65399 65303 64840 60801 63946
13080 63946 70977 80187 77849 74432 92227 98124 92986 74491 68999 69217 71314 74454 74910 68156
13066 68156 75358 73185 73955 91024 90740 96882 98932 89967 81503 78153 78458 71007 72511 75978 74370
13051 74370 70587 69529 81112 81271 94816 97586 92059 84220 82097 79519 73477 67910 75862 71684
13037 71684 69949 78282 100365 104146 91184 72687 64006 63668 69856 59161 53758 62912 55853 61040
13023 61040 76932 82961 78559 74603 71896 75499 71196 70746 67459 69173 80231 77126 79915 79315
13009G9315j7514p635l503n095p673J3769M970J822k171O340J5687n150L005j1641
12995F4526m154o62k288r560j0591m940k448L692K737o906j7877N989p119P188
12981A7587O375j0052R961J0352Q870j036p767j2363j725J459r057N797L884m207
12967A8078M370k173k580l22l89N796J1328L950M056j249Q82O605j3502k3107
12953A1743P147J6957L605J0864n455n750j5457Q888J6062j5134j3041O570p493
12940A9506o338L92l895P212J3655n40n764j0510K880J1337l313j364m192J1638
12926C0704K208K648J0643M596j3375o436o439l097n771J845j0479M69q215o189
12912f888N572J7434K707j2248M793Q315j4310o206K342O903o329J2450Q571q110
$$ plain form
13009 79315 61801 54166 50663 45568 37895 51664 56634 58456 56285 62625 78312 73162 76167 64526
12995 64526 60372 59710 57422 47862 37271 32331 29883 33575 36312 29406 11529 17518 10399 17587
12981 17587 23962 13910 23871 34223 43093 42057 34290 21927 20202 21661 12604 18401 22285 18078
12967 18078 22448 20275 17695 17373 16984 22780 34108 38058 42114 40865 41747 48352 34850 11743
12953 11743 18890 35847 39452 50316 44861 39111 23654 32542 48604 33470 20429 26999 19506
12940 19506 13168 13560 9665 16877 30532 29992 24228 13718 16598 27935 24622 23258 19066 30704
12926 30704 32912 35560 46203 50799 37424 30988 24549 21452 15681 17526 7047 7516 -699 -6888
12912 -6888 -1316 16118 18825 6577 11370 19685 5375 -831 1511 8414 2085 14535 23106 14996
12898A4996j3890r539L363K0613J3431M058j9001l214L120j0860J517O058m824
12885E828o846PL872Q942O616k510j6142K530P054O515m249o016K403q399j69
12870e64L973J0455j239k410J297O605N736j9278J571J4122O462N469L503r855
12856B5847k650P442o003k549M485L142j583N532p831N34M348M42q582k044j6566
12841C964n672O239j776l894K47n157m703m089J4121J3173M467m136l94o260L877
12826A0007N735p66p518L628J6827M06O164J7861o232k2040j9085M274J3501M559
12812B7321j579l189J39J2090J0644j5507r325j710P111n501P674k079j6346j724
12798H019J344l805M075O37m077M630p53n74O743r718j0768N019J2912p491j3158
$$ plain form
12898 14996 1106 -8433 -5070 15543 28974 33032 14031 10817 13937 3077 4594 10652 5828
12885 5828 -1018 -1011 2861 11803 18419 15909 -233 2297 9351 15866 11617 5601 8004 -395 -564
12870 -564 3409 13864 12625 10215 11512 18117 23853 4575 6146 20268 26730 32199 35702 25847
12856 25847 23197 30639 24636 22087 26572 29714 28131 33663 25832 26366 30714 31156 22574 20530 3964
12841 3964 -1708 4531 2755 -1139 -892 -6049 -10752 -14841 -720 12453 16920 12784 12390 6130 10007
12826 10007 15742 14976 7458 11086 27913 28319 34483 52344 46112 24072 4987 9261 22762 27321
12812 27321 25742 22553 22692 34782 45426 29919 20594 18884 25995 20494 28168 26089 9743 8019
12798 8019 9363 5558 9633 10270 6193 10823 10070 9496 16239 6521 -4247 772 13684 6193 -6965
12783f965m258J8024O322j984M677J20m050J9774P585n441M63l957k615p33m171
12768B2791p017k31k369r825L604j2441l534J3915J5806O966m677j488K708K581
12754B6789j1561q085N17j205p30R872J012M356k023o43O593n105N974M180r422
12739B0519P62p413k109J162j217O245P89l224J1432q501J281P093J6343o113
12725C7049q022p918L695Q645k848n610k337o797J1739N174r941r904k537R947
12711B0335J2813q938m750K982M900m877J2552L577k9j260o480K089r84Q721m75
12696D0176O218p208j2779j2517n8O95K273m602J040j8590M861O246P35J1091
12682A7581K783k444j3002N084K2556J1635k1491j0826J6379K3894j0649l2099
$$ plain form
12783 -6965 -11223 6801 13123 11139 15816 15936 11886 31660 39245 33804 34267 30310 27695 26962 22791
12768 22791 15774 15543 13174 3349 6953 -5488 -9022 4893 20699 27665 22988 21500 24208 26789
12754 26789 15228 7143 7660 6455 5725 15597 16609 20965 18942 18299 24892 19787 25761 29941 20519
12739 20519 21281 13868 11759 12921 11704 17949 18738 15514 26946 18445 19726 26819 43162 37049
12725 37049 29027 21109 24804 33449 30601 24991 22654 15857 27596 32770 22829 12925 10388 20335
12711 20335 33148 24210 19460 22442 27342 22465 35017 38594 38565 37305 30825 32914 31930 40651 40176
12696 40176 46394 39186 26407 13890 13832 14527 16800 12198 13238 -5352 -491 5755 6490 17581
12682 17581 20364 17920 4918 10002 32558 44193 22702 11876 28255 52149 41500 9401
12670I401p986N594J0531K316q320R952j907J091q859L320J8810l084n900J470
12656B6429N959l806j4290O941q96j5360O93J7148J1337q155j336k924r74J3713
12642C4479Q46j374L638J9653L994j2781k0370j5858j0433K0069j045j4469j1534
12629e185l99J2912J0570O800J737J1150P166j937j1913q454J754j0167p287L266
12615A0013J0379J1085L214O36j654m885j4563P13K0801J8829Q006j1545m584
12602D6445j571q776p973J3032J4879N111j6610R21J1761K443j4124j2609j3965
12589A8964m399K953m392j035p468o662M117K7009J3889o242l105j1190o263J2402
12575B8578K985K928M901Q18j497J993J4378p348o599O286N268j380J7070L9j9566
$$ plain form
12670 9401 1415 7009 17540 19856 11536 21488 19581 20672 11813 15133 33943 30859 24959 26429
12656 26429 32388 28582 14292 21233 20337 4977 5670 22818 34155 26000 24664 21740 20766 34479
12642 34479 35325 33951 37589 57242 61236 48455 28085 12227 1794 21863 20818 6349 -5185
12629 -5185 -5584 7328 17898 24698 26435 37585 44751 42814 30901 22447 24201 14034 6747 10013
12615 10013 20392 31477 34691 35327 33673 28788 14225 14938 35739 54568 62574 51029 46445
12602 46445 44874 36098 28125 41157 56036 61147 44537 45458 57219 59662 45538 32929 18964
12589 18964 14565 17518 13126 12091 4623 -2039 2078 29087 42976 36734 33629 22439 16176 28578
12575 28578 31563 34491 39392 40210 38713 40706 55084 47736 41137 47423 52691 51311 68381 68420 48854
12560D8854K323j780j3693Q498p082J4806K5163j4562k3932K625J1149J408N094
12547E8871L328K279N313k343J171p731r359l933L124J0324l59l708p92L96O517
12532F3098q127p368m227J1613J1429O965q341j2754j1547n605O827J4056p416
12519D8603j853J3171J3846R35K613l120K482R224M62q10k856O293J4007O997
12505A09994L17L813P884k307k0932k2400M635J9033K370K091O302l891j0662
12492I6247p230P759L321j4227M553P599K4650J5034j7722m295n022m229J4706
12479A21144J6840j4811J0345J6978o15J2872j283k0732J7783K3531o999n580
12467A69473Q116j445j3205j4698O609J1474O482Q574m3o896r50L7558L7455K4398
$$ plain form
12560 48854 51177 49397 35704 44202 37120 51926 77089 62527 38595 41220 52369 53777 58871
12547 58871 62199 64478 69791 67448 68619 60888 51529 47596 50720 61044 60685 56977 56185 56581 63098
12532 63098 54971 47603 43376 54989 66418 73383 65042 52288 40741 35136 41963 56019 48603
12519 48603 46750 59921 73767 74702 77315 74195 76677 85901 86363 85553 82697 88990 102997 109994
12505 109994 110311 114124 122008 119701 98769 76369 81004 100037 102407 104498 110800 106909 96247
12492 96247 89017 96776 100097 85870 90423 98022 122672 137706 119984 115689 110667 106438 121144
12479 121144 137984 123173 133518 150496 149881 162753 161470 140738 158521 182052 175053 169473
12467 169473 177589 176144 162939 148241 154850 166324 172806 181380 181337 174441 173491 211049 248504 272902
12453B72902J6335J2294J615j3059n863j6185n457J0896M850l397j511q382Q53
12440B65891j2141l684K23L225N254N376N431L678j806o90k363K1203K2841J4816
12426C27254J4129J0880O924J1596L1357J6941K0225K475L139M317O729p625j5215
12413D33126j8753o436j0369p076k0291j2931N222l32P42O754k24m785q203o248
12399C50196O719O843j028J2407m32l836K230L201R547J3217J4760K7453M7167
12386D88444L0074J5574o622k0527m0920m2203j8597j3951k2085j9026k0464j7104
12374C12593R211J9272M669K750K1316K4871O206K3471M2415N6158O3671N8555
12362F45158J5610l4155n2503n7464l2628k7345j6544r316j3758q578J5283l69
$$ plain form
12453 272902 289237 301531 303146 290087 284224 268039 262582 273478 278328 274931 273420 265038 265891
12440 265891 253750 250066 250289 253514 258768 264144 269575 273253 271447 270757 268394 289597 312438 327254
12426 327254 341383 352263 359187 370783 402140 419081 439306 441781 444920 449237 455966 448341 433126
12413 433126 414373 407937 397568 390492 370201 357270 362492 362160 362902 369656 369432 364647 356444 350196
12399 350196 356915 363758 362730 375137 374705 370869 373099 376300 385847 399064 413824 441277 488444
12386 488444 518518 534092 527470 506943 466023 423820 405223 391272 369187 350161 329697 312593
12374 312593 321804 341076 345745 348495 369811 394682 400888 424359 466774 522932 586603 645158
12362 645158 660768 626613 574110 516646 484018 456673 440129 430813 417055 408477 423760 423391
12350D23391n021l4522k3113j5849q959q675l954j1028K380R622l892l279N918
12337C23019K8939K5449K5073M2353O8200P5844P1479N9765M0452M802k0605m5949
12325F98821n0881n1655m6441n2138n4181k6046p471J2149J3323k3352l2413j1911
12313C67804j0579j4746j8981p558j8265k2817j6525o333K4558J1570J410r522
12301B80016J888K0251L5351K4355M5038N9952O9259N3604J9603k7565p6096q1999
12289D23657o5199l0259l1932l3013l9351j9915O757J1500J074l550l455j3092
12277B03222j2375N9j159j3725j8723L068J3507Q137p234R281K9216j0851j7033
12264A85390j3093l506r407M607J1661J713j5187j2953L582o135p801n639m145
$$ plain form
12350 423391 418370 383848 360735 344886 335927 327252 323298 312270 314650 324272 320380 317101 323019
12337 323019 351958 377407 402480 444833 513033 588877 660356 720121 760573 765375 744770 698821
12325 698821 647940 596285 549844 497706 443525 417479 410008 422157 435480 412128 379715 367804
12313 367804 357225 342479 323498 315940 297675 274858 258333 252000 276558 288128 289538 280016
12301 280016 281904 302155 337506 361861 406899 466851 536110 589714 609317 581752 505656 423657
12289 423657 358458 328199 296267 263254 223903 203988 210745 222245 223319 219769 216314 203222
12277 203222 190847 190906 189747 176022 157299 160367 173874 182011 174777 184058 213274 202423 185390
12264 185390 172297 168791 159384 163991 175652 177365 162178 149225 152807 146672 138871 133232 129087
12251A29087n401P349L92j3360r434p268K947J0345J6544R077j6222O69J2124
12238A36849p319j5045P162j238L44k781j0602R343k137K40l067R98R18J115r519
12223A05261k1060o644J662J3728P778j0537N857m637o692q702P793J066l466
12210H1407n835j806O747Q379J0168j851j2348Q297R554j0232n398j2369m163
12197G0550M456J874O279m491j6256l708K560J0180P115k455P26j0590N487Q935
12183H0662r917P907k358k453J5623o045k555j3196J3762J1582j1699o511P833
12170H2635m766p823Q018J1823r161k273Q661p988p878J413R332o003p629M729
12156G3090J3562j3467j6380P41J9253R667p884L46J2229J142j4077m196O83P828
$$ plain form
12251 129087 123686 131035 131427 118067 108633 101365 104312 114657 131201 140278 124056 124725 136849
12238 136849 129530 114485 121647 120409 120753 117972 107370 116713 114576 114816 111749 112747 113665 114780 105261
12223 105261 84201 77557 79219 92947 100725 90188 96045 91408 84716 76014 83807 84873 81407
12210 81407 75572 73766 80513 88892 99060 97209 84861 93158 102712 92480 87082 74713 70550
12197 70550 75006 76880 83159 78668 62412 58704 61264 71444 78559 76104 76830 66240 71727 80662
12183 80662 70745 78652 76294 73841 89464 83419 80864 67668 81430 93012 81313 74802 82635
12170 82635 77869 70046 78064 89887 80726 78453 87114 79126 71248 72661 81993 75990 68361 73090
12156 73090 86652 73185 56805 57546 76799 86466 78582 78928 91157 92299 78222 74026 74709 82537
12142H2537K55j6203j2808N448p149P318N552L19M324J1449J200j8861j43J0632
12128G3870O118K414o99j830j4722j967J4095J1685l308j8312k328P00p734l768
12114E4214J0103J6738k548k0592J3168J3715o339k5968l085J970J698N659o505
12101E2228J384K496j1249O551K2587J26q868j859l1N680K752K68m870J0820l928
12086G4087J923o675J2985Q694k447R701L31k447j5147l93p046j8997J820J3850
12072G0239L420J4972O921Q333J0269J3939m814j6595k017p285l163j5141j0526
12059F8552K41q716l952J8546J4539K406L619l8J0987j696N65N908L68q420M58
12044A03367L09K029M167q435l511n069J1107l437o204O435n288p034k932p321
$$ plain form
12142 82537 82792 66589 53781 59229 52080 59398 64950 65269 69593 81042 82242 63381 63238 73870
12128 73870 79988 82402 81703 79873 65151 63184 77279 88964 85656 67344 65016 65716 57982 54214
12114 54214 64317 81055 78507 57915 71083 84798 78459 52491 49406 51376 53074 58733 52228
12101 52228 53612 56108 44859 51410 73997 74123 65255 63396 63365 69045 71797 72065 67195 78015 74087
12086 74087 76010 69335 82320 91014 88567 98268 98599 96152 81005 80612 73566 54569 56389 70239
12072 70239 73659 88631 95552 103885 114154 128093 123279 106684 104667 97382 94219 79078 68552
12059 68552 68793 60077 56125 74671 89210 91616 95235 95197 106184 104488 105053 110961 111329 102909 103367
12044 103367 103676 105705 109872 101437 97926 92857 103964 100527 94323 100758 95470 88436 85504 78183
12030G8183J581k513K180M915n243l013J4683N236M685K298l072O901n474m807
12016I6540k246r88M549Q703J2591L871j7708n796L366P508J3361q767j0400l084
12002A01500j9512M134P994J282Q006n742J257P007r237j309J7191q607J508Q379
11988A13851o383p072j8098j0756N038P404Q691J1716J752rj3817p901N847O130
11974I6393N596J058J1035J7104j140k0184O490k29p895o130l538j0634N306p09
11960I2523p980R33P961O228J2116k480j3896L995J6366J5087J017j3715j2642
11947A05513j95O845m960j149O807o263M358J367p296K728L418n366j7873J214
11933H9148J3531K743P791L295o631o384k2713O771R246J0158m58j6484J1552
$$ plain form
12030 78183 79764 77251 79431 84346 79103 76090 90773 96009 100694 102992 99920 106821 101347 96540
12016 96540 94294 93306 97855 106558 119149 123020 105312 99516 102882 110390 123751 114984 104584 101500
12002 101500 81988 86122 94116 95398 103404 97662 98919 105926 96689 95380 112571 103964 105472 113851
11988 113851 107468 100396 82298 71542 76580 83984 92675 104391 106143 106134 92317 84416 90263 96393
11974 96393 101989 103047 114082 131186 130046 109862 116352 116123 108228 102098 98560 87926 93232 92523
11960 92523 84543 85476 93437 99665 111781 109301 95405 99400 115766 130853 131870 118155 105513
11947 105513 105318 112163 107203 106054 112861 106598 110956 112323 105027 107755 111173 105807 87934 89148
11933 89148 102679 105422 113213 116508 109877 103493 80780 87551 96797 106955 106497 90013 101565
11920A01565Q362J9413J2292j1002r446j0602k778P59L309K5128J0982j6777p046
11907A24159R197o049j2955n828p527J4704Q084j4460n544k730J4686Q907o797
11894A17847O235O595L131j6648k541l746J6682L819j8105j3279m411P444N91
11881A03614M145R512O838L184j3320q218J500R965R16o837r612j1978K61M966
11867I4936J152K532J653J2989r530o539K773n524J0027O231J5108J4402j5658
11854A24552j0579K543P765J8876n994o693j369J77l383L53Q248j495l41J1366
11840A44026K421l091l974j3439J3919L1415L537k753R913J8596J3489J0599J5449
11827B40107L0549M1702L6890O8352P5848P6838O9040M7964R877m2643n7329n9654
$$ plain form
11920 101565 109927 129340 141632 130630 121184 110582 107804 108563 111872 137000 147982 131205 124159
11907 124159 133356 127307 114352 108524 100997 115701 123785 109325 103781 101051 115737 124644 117847
11894 117847 124082 130677 133808 117160 114619 110873 127555 131374 113269 99990 95579 103023 103614
11881 103614 107759 117271 124109 127293 113973 105755 107255 117220 118136 111299 101687 89709 89970 94936
11867 94936 96088 98620 100273 113262 103732 97193 99966 94442 104469 110700 125808 140210 124552
11854 124552 113973 116516 124281 143157 137163 130470 129101 129278 125895 126248 134496 133001 132660 144026
11840 144026 146447 143356 139382 125943 139862 171277 174814 172061 181974 200570 214059 224658 240107
11827 240107 270656 312358 349248 417600 493448 570286 639326 687290 697167 654524 597195 537541
11815E37541o0341l1162l5563l3700J494M736J134o75j249O884J4365K2837M1333
11802D67634L5955L0074K8821M335K763K6316L2667L5333M6184K3634Q682J7063
11790G59461J0406J4095r943j8547j3358j1034j4625k5482M384o478j6088p799
11778F64992l051o451k0922k4737l2581k3881q930m408j012j3328o491q22K5104
11765E43482L4736M7021O8244P7575P8161N7946K4865q469n0523p3201q5152o9245
11753F45440o1336n6536l9800j9832l3894j5779j4157j6403j7640p95j7472j4662
11741C37134j3844o738K360o309p8Q865m417j4956n476K594Q73J0574Q003O595
11727C25180r595J1422R287j1142j7662j4651K555L967J7355k958m021L122P307
$$ plain form
11815 537541 477200 446038 410475 376775 378269 383005 384139 383464 382215 389099 403464 426301 467634
11802 467634 503589 533663 562484 566819 569582 595898 628565 663898 710082 733716 742398 759461
11790 759461 769867 783962 774019 755472 742114 731080 716455 690973 695357 688879 672791 664992
11778 664992 661941 655490 634568 609831 577250 553369 544439 540031 539019 525691 519200 518378 543482
11765 543482 578218 625239 693483 771058 849219 907165 932030 923561 873038 799837 714685 645440
11753 645440 584104 527568 487768 467936 434042 418263 404106 387703 370063 369268 351796 337134
11741 337134 323290 316552 318912 312603 312525 321390 316973 302017 296541 299135 300008 310582 318585 325180
11727 325180 315585 327007 336294 325152 307490 292839 295394 299361 316716 313758 309737 312859 320166
11714C20166j3550j0642l932n957p506L479J3222P505j0124k0182j308J748J4066
11701B86985J1604m932j5664j1245j3733M506J7647J3597R171P198K8802K7567
11689C61503J864j8147q455J1659Q324j988M907R72Q410R093j2495k5143r765
11676C30739R789n240j3239o373j1903j5758k187Q458l247j0255N893j232n432
11663B80013R897J1677l24J7665J7304L278Q328P970K2467L1580K4054J8743L8770
11650D91422K7036Q003O336P568j4264j4132j4371k2752k0866j3238P91j079m057
11637D36397K913K920j5426p267m241N418n105K0115J0255n541j0877J4261J5438
11624D59260m529O005N200q400J253J9563O128Q88Q307K6504K2607Q752R858m173
$$ plain form
11714 320166 306616 295974 292042 286085 278579 282058 295280 302785 292661 272479 271171 272919 286985
11701 286985 298589 293657 277993 266748 253015 257521 275168 288765 297936 305134 333936 361503
11689 361503 363367 345220 336765 348424 356748 354760 359667 360639 369049 378142 365647 340504 330739
11676 330739 340528 335288 322049 315676 303773 288015 285828 294286 291039 280784 286677 285445 280013
11663 280013 289910 301587 301263 318928 336232 339510 347838 355808 378275 409855 433909 452652 491422
11650 491422 518458 526461 532797 540365 526101 511969 497598 474846 453980 440742 441533 440454 436397
11637 436397 439310 442230 426804 419537 415296 420714 415609 435724 445979 440438 429561 443822 459260
11624 459260 454731 460736 465936 457536 458789 478352 484480 485368 493675 520179 542786 551538 561396 557223
11610E57223m14l23l41n340l02L44j0027q871k4382k7214j7597m963k0814Q779
11596D45758j0951j3162L39p8m781l783r210m645j1946j1244j57J1921N866j2262
11582C81665N2K629J9159O472Q520J8052J9077m036M97P38j5169j8227k0475n830
11568C93124L050j4512j8202R454K583l849j173J2653L8254K8684M4262L6258
11556E30586L5313K9911K3045J7378J782l954J5581J1398R619j3924k2999j9558
11544F14178j4787k454L944R542P169J7889K6575L6977L1122L7153M7137M9908
11532H64353M8616M3360L4206L8362M8103Q2445R2739P5752N7834L7816K7179
11521A450765J3693q092j2035k4778j9980k1045l3853p358J5970J9221K8752L6048
$$ plain form
11610 557223 556809 556486 556145 550805 550503 550847 540820 531949 507567 480353 462756 457793 436979 445758
11596 445758 434807 421645 421984 421906 417125 413342 404132 399487 387541 376297 376140 388061 393927 381665
11582 381665 381717 384346 403505 409977 418497 436549 455626 451590 452087 452825 437656 419429 398954 393124
11568 393124 396174 381662 363460 372914 375497 371648 370475 383128 421382 450066 494328 530586
11556 530586 565899 595810 618855 636233 638015 634061 649642 661040 670659 656735 633736 614178
11544 614178 599391 596937 600881 610423 617592 635481 662056 699033 730155 767308 814445 864353
11532 864353 912969 956329 990535 1028897 1077000 1159445 1252184 1327936 1385770 1423586 1450765
11521 1450765 1464458 1456366 1444331 1419553 1399573 1378528 1344675 1337317 1353287 1372508 1401260 1437308
11509A437308L0528L5726K3663L3192L3234L8421L4699J5828K1638L8404N3522
11498A796163M4390N9542N6929L8305L3160M337j9854j4162j0449k1660j4536
11487A952165r980m55L545J5035Q387n154k0890j8165k6343k6394l0974k1678
11475A819099k5250j6779j1838n425Q030K3441L6906L3366O1281O3604O8225O6529
11463B121189N8550J8707j8575k9407l3638m3893m6772l2325k2077j3012p083
11452A951664p353j986J240j015O297r446o910p240J2297J6195J4494J1903J1291
11439A991431K2519K4291J2941K4059L6018L1759L1441N2842P3027O9433P3387
11428B443148Q2227Q0690J00856J34232J39261J47664J57214J83982K07733K31783
$$ plain form
11509 1437308 1467836 1503562 1527225 1560417 1593651 1632072 1666771 1682599 1704237 1742641 1796163
11498 1796163 1840553 1900095 1957024 1995329 2028489 2032826 2012972 1998810 1988361 1966701 1952165
11487 1952165 1942185 1941730 1945275 1960310 1968697 1963543 1942653 1924488 1898145 1871751 1840777 1819099
11475 1819099 1793849 1777070 1765232 1759807 1767837 1791278 1828184 1861550 1922831 1986435 2054660 2121189
11463 2121189 2179739 2198446 2179871 2150464 2116826 2072933 2026161 1993836 1971759 1958747 1951664
11452 1951664 1944311 1942325 1943565 1942550 1948847 1939401 1932491 1925251 1937548 1953743 1968237 1980140 1991431
11439 1991431 2013950 2038241 2051182 2075241 2111259 2143018 2174459 2227301 2300328 2369761 2443148
11428 2443148 2525375 2606065 2706921 2841153 2980414 3128078 3285292 3469274 3677007 3908790
11418C908790K76323L36373L82843M30941M80687N61983O35322P12632Q54296
11409H580190J099969J415282J876200K493296L261911M334154N778369P609188
11401C6448559R650140J1387975J2033013J0831820P574538K833143k209342o207169
11393H2342677q343096q676442p823249o373287m780473l243608j835410n69279
11385D0697833N68514J622960K648691L662745M610871N448214O131231O605657
11377G1996716O847239O878141O698812O265984N633350M819698L850689K693615
11369A15684244J385115k1451j428857k649534l565484m061142m165854l983487
11361I7193550l543232k867247j995413j044457k52363K00068J99082j90864q85314
$$ plain form
11418 3908790 4185113 4521486 4904329 5335270 5815957 6377940 7013262 7725894 8580190
11409 8580190 9680159 11095441 12971641 15464937 18726848 23061002 28839371 36448559
11401 36448559 46098699 57486674 69519687 80351507 87926045 90759188 88549846 82342677
11393 82342677 73999581 65323139 57499890 51126603 46346130 43102522 41267112 40697833
11385 40697833 41266347 42889307 45537998 49200743 53811614 59259828 65391059 71996716
11377 71996716 78843955 85722096 92420908 98686892 104320242 109139940 112990629 115684244
11369 115684244 117069359 117047908 115619051 112969517 109404033 105342891 101177037 97193550
11361 97193550 93650318 90783071 88787658 87743201 87490838 87690906 87889988 87699124 86813810
11352H6813810j668069k340285k843376l046454k896388k311836j278600K21064
11344G0649866K241659M871048Q107990J1771029J5242543J7355713J6670748
11337A46910596J2190329M443499m768675j3012719j7986663j8878661j6810238
11330I2087468j3624020j0522245p985836o054277m654788l665039k986200k502735
11322D0092328k148588j906161j724587j582077j483742j396782j299585j182594
11314B7368212j090202r93742r06437q12106p46178p08391o79509o32268n86721
11305B0212658n66979n53000n31106m91983m68935m55766m29636l98315l62909
11296A5954029l40641l27765l10063k92755k97543l11527l24533l10543k99232
$$ plain form
11352 86813810 85145741 82805456 79962080 76915626 74019238 71707402 70428802 70649866
11344 70649866 72891525 77762573 85870563 97641592 112884135 130239848 146910596
11337 146910596 159100925 163544424 158775749 145763030 127776367 108897706 92087468
11330 92087468 78463448 67941203 59955367 53901090 49246302 45581263 42595063 40092328
11322 40092328 37943740 36037579 34312992 32730915 31247173 29850391 28550806 27368212
11314 27368212 26278010 25284268 24377831 23565725 22819547 22111156 21431647 20799379 20212658
11305 20212658 19645679 19092679 18561573 18069590 17600655 17144889 16715253 16316938 15954029
11296 15954029 15613388 15285623 14975560 14682805 14385262 14073735 13749202 13438659 13139427
11287A3139427k96323k84415k80772k69859k62895k47529k22535k07954j90758
11278A0876387j78204j63965j43954j14052j40196j59736j59742j60455j72539
11269I483544j87517j96807j81225j51458j62508j74186j52533j49907j23855
11260H003548j06266q4419q9474o0369j0211O819J7406L2519N0112N7483N6483
11249G873631N5702O6279Q5076J18651J49196J35525J13960Q0791J8062n6921
11239H639952j19728j92397k40056k38152k45664k06512j68194j38945j09294
11230F981010q1506k9405j0323J4238L2862M6557P0048J02186J08788J03672O6086
11219G404213K0005k9656p5625j08989j17243j20895j26995j19625j26843j46258
$$ plain form
11287 13139427 12843104 12558689 12277917 12008058 11745163 11497634 11275099 11067145 10876387
11278 10876387 10698183 10534218 10390264 10276212 10136016 9976280 9816538 9656083 9483544
11269 9483544 9296027 9099220 8917995 8766537 8604029 8429843 8277310 8127403 8003548
11260 8003548 7897282 7812863 7723389 7663020 7652809 7659628 7677034 7709553 7759665 7817148 7873631
11249 7873631 7929333 7995612 8080688 8199339 8348535 8484060 8598020 8678811 8696873 8639952
11239 8639952 8520224 8327827 8087771 7849619 7603955 7397443 7229249 7090304 6981010
11230 6981010 6899504 6870099 6859776 6874014 6906876 6953433 7023481 7125667 7234455 7338127 7404213
11219 7404213 7424218 7394562 7318937 7209948 7092705 6971810 6844815 6725190 6598347 6452089
11209F452089j56423j42238j37730j32878j46219j17881j16809j07335q5733p6887
11199E231956p7658o3539m1243l9285k6296l7230n0831m1201l7509l4014l1186
11188D751964n1342n5202m2147m3127l9234l6729k8569l1536k0634j4917j5217
11177D373310n473p212o319o255r13O639J3761K0684J7880J6972K7506M6647L2881
11164D530108K3750K7854M1926M6666N1241N7927P5932J04496J21661J41812J53249
11153E376622J59089J95763K32752K60692K89609L42086M07422M93645N65361
11144H323041O31909P30625Q32245R75614J139340J344213J609255J965193K453031
11135B0004466L073146L917690N024038O489927Q324724J0528264J2807622J4567567
$$ plain form
11209 6452089 6295666 6153428 6015698 5882820 5736601 5618720 5501911 5394576 5308843 5231956
11199 5231956 5154298 5090759 5049516 5010231 4983935 4946705 4895874 4854673 4817164 4783150 4751964
11188 4751964 4700622 4645420 4603273 4560146 4520912 4484183 4455614 4424078 4403444 4388527 4373310
11177 4373310 4367837 4360625 4354306 4348051 4347138 4353777 4367538 4388222 4406102 4423074 4450580 4497227 4530108
11164 4530108 4553858 4581712 4623638 4670304 4721545 4779472 4855404 4959900 5081561 5223373 5376622
11153 5376622 5535711 5731474 5964226 6224918 6514527 6856613 7264035 7757680 8323041
11144 8323041 8954950 9685575 10517820 11493434 12632774 13976987 15586242 17551435 20004466
11135 20004466 23077612 26995302 32019340 38509267 46833991 57362255 70169877 84737444
11127H4737444J5064927J3561013R810854M396085j512412o503866r542983j0504182
11119I9506880r846782q186218n967345l707320j597400K37903J732192K864619
11111G5036529L430206L278354K379815R05885p15071k017676k605578k403078
11103G7289386j559667l27932J122081K664701M289612N867035P167158P862667
11095A04375041P614860O260086L884895R34850j935581m044978m976048m808615
11087A07304510m004889l073544k487562k535071l090255l862879m556419m918380
11079G8775511m888557m503032l824476k992961j999142q75797L23931J586031
11071F1601508K901974M178160N268792N953369N993989N170183L431281R75096
$$ plain form
11127 84737444 99802371 113363384 123174238 127570323 126057911 119554045 110011062 99506880
11119 99506880 89660098 81473880 75506535 71799215 70201815 70439718 72171910 75036529
11111 75036529 78466735 81745089 84124904 85030789 84315718 82298042 79692464 77289386
11103 77289386 75729719 75401787 76523868 79188569 83478181 89345216 96512374 104375041
11095 104375041 111989901 118249987 122134882 123069732 121134151 117089173 112113125 107304510
11087 107304510 103299621 100226077 97738515 95203444 92113189 88250310 83693891 78775511
11079 78775511 73886954 69383922 65559446 62566485 60567343 59691546 60015477 61601508
11071 61601508 64503482 68681642 73950434 79903803 85897792 91067975 94499256 95474352
11063I5474352j805942m379958o272286p276168p493869p082768o241660n258436
11055D9663265m325298l546108k933872k471913k119053j861730j622319j447850
11047B9335122j317012j203753j100545j006073r19887q43633p95958p23648o65885
11038B0758728o35383n95993n69533n42750n11810m98364m75316m41235m27207
11029A6061137m06762l81033l64958l45015l38762l17610k97827k96633k76827
11020A3035710k73987k67365k53669k45184k50638k39428k14708k22761k16731
11011A0851239k12261k09577k05908k16403k05911j90113j47708j53155j55813
11002I154390j46542j20220j31113j43738j61455j66075j76025j59402j49458
$$ plain form
11063 95474352 93668410 89288452 83016166 75739998 68246129 61163361 54921701 49663265
11055 49663265 45337967 41791859 38857987 36386074 34267021 32405291 30782972 29335122
11047 29335122 28018110 26814357 25713812 24707739 23787852 22944219 22148261 21424613 20758728
11038 20758728 20123345 19527352 18957819 18415069 17903259 17404895 16929579 16488344 16061137
11029 16061137 15654375 15273342 14908384 14563369 14224607 13906997 13609170 13312537 13035710
11020 13035710 12761723 12494358 12240689 11995505 11744867 11505439 11290731 11067970 10851239
11011 10851239 10638978 10429401 10223493 10007090 9801179 9611066 9463358 9310203 9154390
11002 9154390 9007848 8887628 8756515 8612777 8451322 8285247 8109222 7949820 7800362
10993G800362j52038j58775j43324j25287j13329j12597r4262q5922q7075r2964
10983F634789q5447r0136r2518q1167j10379j16305r7421p9709o7169n6445m4667
10972E713426m7968o0376m6840n6159p3626p6373p7146n1294l3375k2990j4079
10961E153200n720j9730m8616o5542q0430q0361r7101r3616p7708q1071p3870
10950D429435n6263m2890k4885j4208o831O220j979l1515l9745n0906q1327q1348
10938D003758m5119m2674n9531m4969m5024m5929m5153n9961n7067o2871m2895
10927C452565k7398n4413n4632n5218o8965p9232o8660n9915p1486p7876p4474
10916B760296p0037o3710n4694n3898m5702l7951l4985k4437o256N566J5516K6272
$$ plain form
10993 7800362 7648324 7489549 7346225 7220938 7107609 6995012 6900750 6814828 6727753 6634789
10983 6634789 6549342 6459206 6366688 6285521 6175142 6058837 5961416 5881707 5814538 5758093 5713426
10972 5713426 5665458 5605082 5558242 5502083 5428457 5352084 5274938 5223644 5190269 5167279 5153200
10961 5153200 5147480 5127750 5079134 5013592 4933162 4852801 4755700 4662084 4584376 4503305 4429435
10950 4429435 4373172 4330282 4305397 4291189 4284358 4290578 4288599 4257084 4217339 4166433 4085106 4003758
10938 4003758 3958639 3915965 3856434 3811465 3766441 3720512 3675359 3615398 3558331 3495460 3452565
10927 3452565 3425167 3370754 3316122 3260904 3191939 3112707 3044047 2984132 2912646 2834770 2760296
10916 2760296 2690259 2626549 2571855 2517957 2472255 2434304 2399319 2374882 2368626 2374192 2389708 2415980
10904B415980p26N35j2995l6915m1009m5275n6150n3075n9308o5082o6363o1103
10892A918514m4668n6459m4198l2577k8177n1639m2420l5105k7201k3378l6406
10881A496286j4774j5590k0569j9397k4448k8405k5229j8265j8480l0228r144
10870A271757j0644k3087k4643k1377m983j1631l6874l1169j4968j8705j5607
10859A058069m914j3663j3598j4397r741o587j3586l1118k3740j0400j9391k235
10847H94699j479n206j7640j8804j3198m281m483L692j0663j4958q513j3265l979
10834G81922j5405j8962j0535q374r544n429r609j8321J672l629j2266l750j5001
10821F52769j5566o335p846k428J1538j198k2247p598K610n452K57n850j9126
$$ plain form
10904 2415980 2415254 2415789 2402794 2365879 2324870 2279595 2223445 2170370 2111062 2045980 1979617 1918514
10892 1918514 1873846 1817387 1773189 1740612 1712435 1660796 1618376 1583271 1556070 1532692 1496286
10881 1496286 1481512 1465922 1445353 1425956 1401508 1373103 1347874 1329609 1311129 1280901 1271757
10870 1271757 1261113 1238026 1213383 1192006 1187023 1175392 1138518 1107349 1092381 1073676 1058069
10859 1058069 1053155 1039492 1025894 1011497 1001756 995169 981583 950465 926725 916325 896934 894699
10847 894699 893220 888014 870374 851570 838372 834091 829608 833300 822637 807679 799166 785901 781922
10834 781922 766517 747555 737020 728646 719102 713673 704064 685743 687415 683786 671520 667770 652769
10821 652769 637203 630868 623022 620594 632132 630934 608687 601089 603699 598247 598504 592654 573528
10808E73528k1491k107k555j3474j0742m141k521j6932j8896M287N3q619j023
10795D75367O144j1378n442l58N510p584q735j684r019P845L842j2382r742m835
10781D27549l795J2048R957j8011j3313j1945q634N146Q252j1898K829K3055P280
10768D28520p949J867L630k1305k2184q072r735m981k36J250R355J2582R944j4053
10754C78633j4979o251J3389l256n35k747J714J218j3132Q728K4327J2441k3091
10741C76459j8070k706o300m065k261J0885M607k603J281J3505J295o872q552
10728C56603k997M556k709j7418J478Q599j815L088k913k475J0539N538j0873
10715C49201N176K2626P346P450P013J3827J1812J1022M813K0163L4035M7713
$$ plain form
10808 573528 552037 549930 547375 533901 523159 519018 516497 499565 480669 484956 485009 476390 475367
10795 475367 481511 470133 464691 464333 469843 462259 453524 451840 442821 450666 454508 442126 432384 427549
10781 427549 423754 435802 445759 427748 414435 402490 393856 399002 407254 395356 398185 421240 428520
10768 428520 420571 422438 426068 404763 382579 374507 364772 359791 359555 360805 370160 382742 392686 378633
10754 378633 363654 357403 370792 367536 367001 364254 365968 367186 354054 362782 387109 399550 376459
10741 376459 358389 355683 349383 345318 343057 353942 358549 355946 357227 370732 372027 365155 356603
10728 356603 353606 358162 355453 338035 339513 348112 346297 349385 346472 343997 354536 360074 349201
10715 349201 354377 377003 384349 391799 398812 412639 424451 435473 440286 460449 494484 542197
10703E42197N8462O7245M3044N4335L5754K7619K3796Q741j1406k0824m3986k7236
10691G57741k7856l7565k8702k3364J60O631J3585K6948K7633J4304K3471J9060
10679G72046M19j1040J1008K756J7403J4086K3964L8994N4273N9976Q3409R2278
10667A159572R4339P7884L1144l9103q3476q3861p3284n3582l0529k6116j8959
10656I54029k741Q451p278j3749j9656l1457j4379r646j1558j2575Q689J6385
10644H64515K5069K6809K9841L5393M1230O8618P3020N5580M9497K5259K0510
10633A315341K2428j7057j3918o933j9892o6995q7291p4091p1158o6609n0809
10622H63016k8040j7403r964n014j3345j8722j9007k1963r182m5952l4174j8468
$$ plain form
10703 542197 600659 667904 710948 765283 801037 828656 852452 861193 849787 828963 784977 757741
10691 757741 729885 692320 663618 640254 640414 647045 660630 687578 715211 729515 752986 772046
10679 772046 772465 761425 772433 775189 792592 806678 830642 869636 923909 983885 1067294 1159572
10667 1159572 1253911 1331795 1362939 1323836 1240360 1156499 1083215 1029633 999104 972988 954029
10656 954029 951288 959739 952461 938712 919056 887599 873220 863574 852016 839441 848130 864515
10644 864515 889584 916393 946234 981627 1022857 1091475 1164495 1220075 1269572 1294831 1315341
10633 1315341 1337769 1320712 1306794 1299861 1279969 1212974 1125683 1051592 980434 913825 863016
10622 863016 834976 817573 807609 802595 789250 770528 751521 729558 720376 674424 640250 621782
10610F21782q338K073l767k4450L373P062O303J0611K2481K6465K4083L0416N1644
10597G69738M2443K1760j3905m8348q3348o8807l7223k1928k9126k3547l390P660
10585E11979N035J1742J1273J4173L153j0165q97M365L815J1105L2203O8201J17168
10572G83150J79646K19270K54333K59993K29457J62242Q5574K2853p9418j41428
10562A975672j78416k29554k23800k00465j55909r5874q1635o2437m8251l2452
10552F66879l3149m52m624k3934j4147p012r994k1156j4101j4248j9930j9482
10540D84650j5656j1358l960q438j1567j7216N271j7333j7666k0378j6155m740
10528C45454r906L938m979j891j3153j1567m161J0317Q534J6605Q604K0227J3982
$$ plain form
10610 621782 613444 615517 611750 587300 590673 597735 604038 614649 637130 663595 687678 718094 769738
10597 769738 812181 833941 820036 771688 688340 619533 582310 560382 531256 507709 504319 511979
10585 511979 517014 528756 540029 554202 557355 547190 546293 550658 554473 565578 597781 665982 783150
10572 783150 962796 1182066 1436399 1696392 1925849 2088091 2173665 2196518 2117100 1975672
10562 1975672 1797256 1567702 1343902 1143437 987528 891654 810019 747582 699331 666879
10552 666879 633730 633278 628654 604720 590573 583561 573567 552411 538310 524062 504132 484650
10540 484650 468994 457636 453676 445238 433671 416455 421726 404393 386727 366349 350194 345454
10528 345454 335548 339486 334507 332616 319463 307896 303735 314052 322586 339191 347795 368022 382004
10515C82004J1657K0719L1062L6601K9566M185j9775l5363l8877k6642o784j0790
10503C77563j4311j9434p196q948R493O114l627k1913k5563j5882O331K250K693
10490B87570j799j2329j403k000O336Q027n250p382J123M301J755o115r819K798
10476B65813J0874O410Q110O051p769p623K246J096J028p961M91R360n03O03L377
10461B91603L807j349O140M900p343n078k872n482M004k267n532M424l32l297
10447B81326N60O740M291M550m921J2313R245J813J9905L940l752n751j6542k311
10433C11406n558K700j2986j0403Q382O499M521J9289J9745L4786L7658J9595
10421D35634J0166J6096o421L971K839n306j7029k4168l6869k5788l9658l0662
$$ plain form
10515 382004 393661 414380 445442 482043 511609 515794 496019 460656 421779 395137 388353 377563
10503 377563 363252 343818 336622 327674 337167 343281 339654 317741 292178 276296 282627 284877 287570
10490 287570 285771 273442 272039 270039 276375 284402 279152 271770 272893 277194 278949 272834 263015 265813
10476 265813 276687 283097 291207 297258 289489 281866 284112 285208 286236 278275 278766 288126 287623 288226 291603
10461 291603 295410 294061 300201 305101 297758 292680 289808 284326 288330 286063 280531 284955 284623 281326
10447 281326 281886 288626 292917 297467 292546 304859 314104 315917 335822 339762 336010 330259 313717 311406
10433 311406 305848 308548 295562 285159 293541 300040 304561 323850 343595 378381 416039 435634
10421 435634 445800 461896 455475 459446 462285 456979 439950 415782 378913 353125 313467 282805
10409B82805j9259r011L820k951k0044q158J120M535k83q687p563K402m488N649
10395B19887N101L013n774N381p974k0087j1525J6136J8339M674k281O888o926
10382B24852q815n565j144o223o04j934j6525j3254p587o542m889p801M046J5644
10368A63659r725k4552J032p763j3451j9478k3373j1364j256j0103j8358j70J0254
10355C5352J8783K1094J4865Q773J8770J0134L027R453Q127J0723P002k163J7003
10342A80943L0179L121j999o046k799J6859Q902J4376J7562J7938L4182L7726
10330C50944J7072J947m652o320k7824j3561j1156j027K3408K6850L7055N5312
10318D48048P7925J17607J45526J73273J50015J01566L1856o0958j38101j50364
$$ plain form
10409 282805 263546 254535 258355 255404 235360 227202 228322 232857 232574 223887 216324 218726 214238 219887
10395 219887 224988 228001 222227 227608 219634 199547 188022 204158 222497 227171 224890 231778 224852
10382 224852 216037 210472 209328 203105 202501 200567 184042 170788 163201 156659 151770 143969 148015 163659
10368 163659 153934 129382 130414 122651 109200 89722 66349 54985 53729 43626 25268 25098 35352
10355 35352 54135 75229 90094 98867 117637 127771 130798 140251 148378 159101 166103 163940 180943
10342 180943 211122 214243 212244 206198 203399 220258 229160 243536 261098 279036 313218 350944
10330 350944 368016 369963 365311 358991 331167 317606 306450 305423 328831 355681 392736 448048
10318 448048 525973 643580 789106 962379 1112394 1213960 1245816 1184858 1046757 896393
10308H96393j20723o6955m3087r426M693J4067K3702N0893Q8800J46482J84728
10297A169567K01939K07473J96132J81093J33158R5882L1201l6377p9618j22808
10287A977642j36795j22443j00494q6379o7093n6011k7970k5839j6285j9687l4738
10276A283908k9805k2630k2626l7132l8106l9552j7736j5932r906l896j1893j5160
10264A019534p068j333J5496J5119O542m239o471K2240J8387J5954L370R23J7733
10251A116187m059j2387k3637k1409k2751j2986j2674o296k355p679R465K941
10239A002360q812j1903j1693J4507o009O212K4253K0838K2176K1826K4722K5544
10227A124021K5133K8059K2672J1635L6208N0470L1738L1451R257J4402K4539
$$ plain form
10308 896393 775670 708715 665628 656202 660895 674962 698664 749557 838357 984839 1169567
10297 1169567 1371506 1578979 1775111 1956204 2089362 2185244 2216445 2180068 2100450 1977642
10287 1977642 1840847 1718404 1617910 1531531 1464438 1408427 1380457 1354618 1338333 1318646 1283908
10276 1283908 1254103 1231473 1208847 1171715 1133609 1094057 1076321 1060389 1050483 1046587 1034694 1019534
10264 1019534 1012466 1011133 1026629 1041748 1048290 1044051 1037580 1059820 1078207 1094161 1097531 1098454 1116187
10251 1116187 1112128 1099741 1076104 1054695 1031944 1018958 1006284 999988 997633 989954 999419 1002360
10239 1002360 993548 981645 969952 984459 978450 984662 1008915 1029753 1051929 1073755 1098477 1124021
10227 1124021 1149154 1177213 1199885 1211520 1247728 1298198 1329936 1361387 1370644 1385046 1409585
10216A409585L3522L776J6353N3003O1635L9171M6186P3599P5010R5349R0402
10205A997591Q5289Q9686J02575J30938J38904J48251J69512J91887K14915K36902
10195C506450K62193K87325L62022M39455N38477P12052Q89338J012975J122810
10186I133097J229061J264060J314756J378679J508473J709004K014274K563515
10178B2114919L415773M882032P220736J1244348J7975860K7566575L7248478
10171A31668721M5647733N0432135M4648886L7067772K5087215R914342k066792
10164C42400012j7919421k8599927m0920839m5368913m2118469l6201428k6026390
10157A05244625j7021975j1273799p834444n737727m413287l628923l126127k880879
$$ plain form
10216 1409585 1443107 1446883 1463236 1516239 1577874 1617045 1663231 1736830 1811840 1907189 1997591
10205 1997591 2082880 2172566 2275141 2406079 2544983 2693234 2862746 3054633 3269548 3506450
10195 3506450 3768643 4055968 4417990 4857445 5395922 6107974 6997312 8010287 9133097
10186 9133097 10362158 11626218 12940974 14319653 15828126 17537130 19551404 22114919
10178 22114919 25530692 30412724 37633460 48877808 66853668 94420243 131668721
10171 131668721 177316454 227748589 272397475 309465247 334552462 344466804 342400012
10164 342400012 324480591 295880664 254959825 209590912 167472443 131271015 105244625
10157 105244625 88222650 76948851 69114407 63376680 58963393 55334470 52208343 49327464
10149D9327464k702065k540372k428902k267497k159333k025737j901372j763025
10141C1539161j566040j403653j230088j082880r72884q87533q09091p55693p11147
10132B2120152o56387n93755n80066n16637m37956l86103l64420l48241l34837
10123A7901750l17521l43667l64703l80838l93510m13075m09912m17629m06037
10114A4454858l81336l61897l47372l10041l01971l06046k93000k76103k55072
10105A1622020k48295k51939k52269k53897k38967k38120k39218k39567k30655
10096I429093k20185k06924k04885k03146k16459k08093j78850j80673j90825
10087G619053j86152j76831j54516j61102j69325j37174j23513j25308j34268
$$ plain form
10149 49327464 46625399 44085027 41656125 39388628 37229295 35203558 33302186 31539161
10141 31539161 29973121 28569468 27339380 26256500 25283616 24396083 23586992 22831299 22120152
10132 22120152 21463765 20870010 20289944 19773307 19335351 18949248 18584828 18236587 17901750
10123 17901750 17584229 17240562 16875859 16495021 16101511 15688436 15278524 14860895 14454858
10114 14454858 14073522 13711625 13364253 13054212 12752241 12446195 12153195 11877092 11622020
10105 11622020 11373725 11121786 10869517 10615620 10376653 10138533 9899315 9659748 9429093
10096 9429093 9208908 9001984 8797099 8593953 8377494 8169401 7990551 7809878 7619053
10087 7619053 7432901 7256070 7101554 6940452 6771127 6633953 6510440 6385132 6250864
10078F250864j33716j32776j29434j19565j13922j14795j09880q1994q7239j16129
10068E111414r6102j05053r6674q6729q7909j05225j03918q3794q3680p1973p1057
10057D119300r1237p8115p2080p7015n3870l2372k2166n26K7206N4754J04674
10046C878553J21251J31102J40313R9101O8142L9345O535m2782j04394j12756
10036D224410j45497j47774j38564j29396j19099r6683j12981j09405q5906p4164
10026C064941p5250o9381n3955o0245o5078m0723m3221n4041l5071m9825n7820
10015B460331m8448m5655m7584m9685m1429l6987m9969m6177m5036l5856k8136
10004A985369j5921j9507k2624k0392k9892k7670m1417k9764k3917l1544m1206
$$ plain form
10078 6250864 6117148 5984372 5854938 5735373 5621451 5506656 5396776 5314782 5227543 5111414
10068 5111414 5015312 4910259 4813585 4726856 4638947 4533722 4429804 4346010 4262330 4190357 4119300
10057 4119300 4028063 3949948 3877868 3800853 3746983 3714611 3692445 3691919 3719125 3773879 3878553
10046 3878553 3999804 4130906 4271219 4370320 4438462 4477807 4484342 4441560 4337166 4224410
10036 4224410 4078913 3931139 3792575 3663179 3544080 3447397 3334416 3225011 3139105 3064941
10026 3064941 2989691 2920310 2866355 2806110 2741032 2700309 2657088 2603047 2567976 2518151 2460331
10015 2460331 2411883 2366228 2318644 2268959 2227530 2190543 2140574 2094397 2049361 2013505 1985369
10004 1985369 1969448 1949941 1927317 1906925 1877033 1849363 1807946 1778182 1754265 1722721 1681515
9993A681515k4304k1717m7818m2635k1681l2534k6794k1441j0540j8670P211M615
9981A425207j7376j3325k127j0804j3359M736n591p584j4151j9914l4673l8874
9969A252165m4889l5393m0832l3306k0233p34O84l173j2849j7476N131P450o604
9956A049941P160M192o633L588j5551L009J6927O170J1452M7345N5041J26670
9944A309311K06868L11684M09417N16014N52268N01630M96610L57721K27453J22390
9934E011366j04962j93895l53269m65328m65707m86406m45655l45602k47360j85616
9924A717566j35636j08230p8768m6441k7197k2983j2764P616K8709L0627J9409
9913A371908K1257J8617p753k2152m3702o8877q0145q9626r1716o4232n7171m4821
$$ plain form
9993 1681515 1657211 1635494 1587676 1545041 1523360 1490826 1464032 1442591 1432051 1413381 1420592 1425207
9981 1425207 1407831 1394506 1392379 1381575 1368216 1372952 1367361 1359777 1345626 1325712 1291039 1252165
9969 1252165 1207276 1171883 1131051 1097745 1077512 1076778 1077462 1074289 1061440 1043964 1049095 1056545 1049941
9956 1049941 1057101 1061293 1054660 1058248 1042697 1045706 1062633 1068803 1080255 1127600 1182641 1309311
9944 1309311 1516179 1827863 2237280 2753294 3305562 3807192 4303802 4661523 4888976 5011366
9934 5011366 4906404 4712509 4359240 3893912 3428205 2941799 2496144 2150542 1903182 1717566
9924 1717566 1581930 1473700 1394932 1348491 1321294 1298311 1285547 1293163 1321872 1352499 1371908
9913 1371908 1393165 1411782 1404029 1381877 1338175 1269298 1189153 1099527 1007811 943579 886408 841587
9901H41587l2480k5797j9119k3567k1498J0503J1777o989j9874j1944l4620k6901
9889F41078j5135j9922j9167k2064o754j6124p581K897j2226n265M972n795j9113
9876D99801k5541j3005n765j9372j854Q331O185j3607L232l433J110j1851q020
9863D16211j933j757o954M574J110j1252p206j1930j4153q526j5728k1075r410
9850C11971k285q264k5615j1846j706l574J732m090Q427J778l5j4865j7301N930
9836B40257j648k83n641l267m222j847M190p835J0385K583k9203j0274P802Q456
9822B09453k2644j0616r631J433J6131O472J865Q979j378O660j582L270j9328
9809A89084k2602J1194J0876J06P55j559m936L241J138o78q524j1093j4984N343
$$ plain form
9901 841587 809107 783310 764191 740624 719126 729629 741406 734417 714543 702599 667979 641078
9889 641078 625943 606021 586854 564790 558036 541912 534331 537228 525002 519737 524709 518914 499801
9876 499801 474260 461255 455490 436118 434264 442595 448780 435173 438405 434972 436082 424231 416211
9863 416211 414278 412521 405567 410141 411251 399999 392793 380863 366710 358184 342456 321381 311971
9850 311971 309686 301422 275807 263961 262255 258681 260413 256323 264750 266528 266493 251628 234327 240257
9836 240257 238609 238326 232685 229418 225196 223349 227539 219704 230089 232672 203469 193195 200997 209453
9822 209453 186809 176193 166562 167995 184126 190598 192463 201442 200064 206724 205142 208412 189084
9809 189084 166482 177676 188552 188658 189413 187854 182918 186159 187297 186619 178095 167002 152018 157361
9795A57361R129L372R842J921q990j4853N749q321j1281N533J9026J1328Q696
9782A88512M588R85P725O968Q641J3817J932J0497l547K005K2927N4992O4103
9769C84145R9408J35641J84600K43654K51221K37121K04083J47379P7895p449
9759A957698j02844j46019k15633k58048k31976j96600j32929r7610n6175m6380
9749D73484m6259k4065j3982P376k4063k5685j8613o185j7475j1099k2960k1269
9737B49205j8254o639L033L281K898Q219l611j8825m957r844q919N859K323J163
9723B04932K662j1616q157n611K626j523j211l552r269k804k224o806o943L590
9709A54094R131N39m28k233Q81L50j0235l415J1292K864o909L531j0764m423M387
$$ plain form
9795 157361 166490 169862 179704 181625 172635 157782 163531 155210 143929 149462 168488 179816 188512
9782 188512 193100 194085 201810 208778 217419 231236 233168 243665 240118 242123 265050 320042 384145
9769 384145 483553 619194 803794 1047448 1298669 1535790 1739873 1887252 1965147 1957698
9759 1957698 1854854 1708835 1493202 1235154 1003178 806578 673649 576039 519864 473484
9749 473484 427225 403160 389178 396554 372491 346806 328193 322008 304533 293434 270474 249205
9737 249205 230951 224312 227345 230626 233524 241743 238132 219307 214350 204506 195587 201446 203769 204932
9723 204932 207594 195978 187821 182210 184836 183313 182102 178550 169281 166477 164253 157447 150504 154094
9709 154094 163225 163764 163336 161103 161984 162334 152099 148684 159976 162840 155931 159462 148698 144275 148662
9694A48662k281q569K669q927r150J0511j91p355K08p848j0610L433j213k525
9680A06814N926N367J1990Q402r372j0636J951J361J023k0849k6845m177J3182
9667H4137Q706Q973n501o989j275o769r289J5227P374j9366j4822J5503J0897
9654H6806ko79p182l520r47Q600J973O430j2024j3429l578q232l544O833J0569
9639F8074n677r65P121m717M715P783J3251M006L297k0227p417N370J4233q296
9625H0551l763K133j602M86j480K957J685l062l981P391L968j0619j6907q394
9611D9363J390J4242O569m277P160l37N258N077J1416o323j5564r522N182k40
9597F9394n378o258Q728J1680j766k202l190k290J5856Q645m467p147m842J0422
$$ plain form
9694 148662 146381 137812 140481 131554 122404 132915 132724 125369 125577 117729 107119 110552 109339 106814
9680 106814 112740 118107 130097 138499 129127 118491 120442 121803 122826 101977 75132 70955 84137
9667 84137 92843 101816 96315 89326 88051 81282 71993 87220 94594 75228 60406 75909 86806
9654 86806 86804 86125 78943 75423 74476 83076 85049 91479 79455 66026 62448 54216 50672 57505 68074
9639 68074 62397 61432 68553 63836 68551 76334 89585 93591 96888 76661 69244 74614 88847 80551
9625 80551 76788 78921 77319 77805 76325 79282 80967 77905 73924 81315 85283 74664 57757 49363
9611 49363 50753 64995 71564 67287 74447 74110 79368 84445 95861 89538 73974 64452 69634 69394
9597 69394 64016 57758 66486 78166 76400 74198 71008 68718 84574 93219 88752 81605 76763 87185
9583H7185l556M452M07j410j2329l483Q578Q781Q476N787q448n379m38O057J827
9568I6507k3030j550K1218J0954j3544q084L804P104J979j5671j1559j782K114
9555F8460j247J4717R887M182o998P926R092L896k569R426j2297j9863R212J1128
9541A04952j206J1667L778j9201m971l093l478k923J5161Q88l956P93J07k936
9527I5582P15k518P801L172P45Q606o069j0569n302k0158Q372J6357R424p235
9513I8923j8872j0760Q574J2196r676j6910N538Q360P999L682K96k210j987j4591
9499G0562j4231o020K426J2744K1961j575m163r81k31K219J3599R998l557n966
9485I6785j775J5383P95j472j0695r181p358k756K246K0673J564K257k054P820
$$ plain form
9583 87185 83629 88081 88488 87078 74749 71266 79844 88625 97101 102888 94440 89061 88623 94680 96507
9568 96507 73477 71927 93145 104099 90555 82471 86275 93379 95358 79687 68128 66346 68460
9555 68460 67213 81930 91817 95999 89001 96927 106019 109915 107346 116772 104475 84612 93824 104952
9541 104952 103746 115413 119191 99990 95019 91926 88448 85525 100686 101574 97618 98411 98518 95582
9527 95582 96297 93779 101580 104752 105497 114103 108034 97465 92163 72005 80377 96734 106158 98923
9513 98923 80051 69291 77865 90061 80385 63475 69013 77373 85372 89054 89350 87140 85153 70562
9499 70562 56331 50311 52737 65481 87442 85867 81704 80723 80492 82711 96310 106308 102751 96785
9485 96785 95010 110393 111188 109716 99021 89840 82482 79726 81972 102645 104209 106466 104412 112232
9471A12232J1372j845j814j0706j1156n44j3076l179L755J7790J3393M978j2199
9458A09001j3648k70M059j2466L915Q761K5625O470n147k887L672m075k193Q672
9444A29489m215P09p995k37n287n353P612Q136N427M118J230M642r753r033q555
9429A10935P513K4550N399j3890j945M876P663j0341L299K825j877n484p798n342
9415A20383J397P546m39O319k419j707J3183l63J3660P097K057j210o289j0436
9401A48779j1509Q233j25Q258J2753q197k1211l949O290J5917J3564j4921q459
9388A45423J0264N532L158J0152l551m037K747L239o331p233J2098J7844J881
9375A91186j5554J009m39o837M810o777K465K36L967m974o199M441L144m582j10
$$ plain form
9471 112232 123604 121759 119945 109239 98083 97539 84463 81284 85039 102829 116222 121200 109001
9458 109001 95353 95083 99142 86676 90591 99352 124977 131447 126300 123413 127085 123010 120817 129489
9444 129489 125274 125983 117988 117751 112464 107111 114723 122859 128286 132404 133634 138276 128523 119490 110935
9429 110935 118448 142998 148397 134507 132562 137438 145101 134760 138059 140884 139007 133523 125725 120383
9415 120383 121780 129326 128887 135206 132787 131080 144263 143900 157560 164657 166714 165504 159215 148779
9401 148779 137270 145503 145378 153636 166389 158192 136981 133032 139322 155239 168803 153882 145423
9388 145423 155687 161219 164377 174529 170978 166941 169688 172927 166596 159363 171461 189305 191186
9375 191186 175632 176641 176202 169365 174175 167398 169863 170099 174066 169092 162893 167334 170478 165896 165786
9360A65786j6632J1133J6062P894P607J1023r467O63l973j3790J464J1520p73
9347A88517O045l132j934p857n973P786M446O427J003L189J6818J2685k238l126
9333B22656q758J2076k114k0479P061J6938P180K224n610m576L080Q341L930K12
9319B42161J731k369L795L237P254j4807q367J7883M835k27Q457k874L158l574
9305B60293j2219K761k526q536R088Q421J5532K196K195p846l923L846J7698K0679
9291C07659P714P636L653j82j5832p696J950l60k964k752p277L894P095M787L883
9276C11208J1400Q066M783M462o180p32l004m987K9794Q374J0419l310K748R996
9262C83037j386j5831p653K37L592l237j429J1303Q016N077O85Q328J6257J8512
$$ plain form
9360 165786 149154 160287 176349 184243 191850 202873 193406 194069 190096 176306 177770 189290 188517
9347 188517 194562 191430 189496 181639 175666 183452 187898 194325 195328 198517 215335 228020 225782 222656
9333 222656 213898 225974 223860 203381 210442 227380 234560 236784 231174 226598 229678 238019 241949 242161
9319 242161 243892 241523 245318 248555 255809 241002 232635 250518 255353 255126 263583 260709 263867 260293
9305 260293 248074 250835 248309 239773 248861 257282 272814 275010 277205 269359 265436 269282 286980 307659
9291 307659 315373 323009 326662 326480 310648 302952 304902 304542 301578 298826 291549 295443 302538 307325 311208
9276 311208 322608 330674 335457 339919 333739 333007 330003 325016 354810 363184 373603 370293 373041 383037
9262 383037 381651 365820 358167 358404 361996 358759 357330 368633 376649 381726 382411 390739 406996 425508
9248D25508k801R914L716R880J0602J0093p747m264M801K2154l959j114Q731J632
9234D87146p196p695J370O259k414J6460J3608M341O78m17J5189K223q237M689
9220E26004J2672J3734Q039J3287N796O699J4173J7286K151K6407J5530J4124
9208F75902P862J131J93J417M278K147k556J5776J5282J5547L568L038L614J5183
9194G62382J4844L550K8633J8968K0347K359p45J9848P795J3190L673P337K6131
9181I28312K6884K5135J5973J4452J0713J5896J6144K0433K4227K7621J1453K2079
9169A159322K5074R341K638K285J6883K3966J9867K5772J8669K2949K7656J4521
9157A368943J2554J6226J5635J9822J3454K3113L1416J9551J9176K538K2558L3777
$$ plain form
9248 425508 422707 432621 436337 446217 456819 466912 459165 454901 459702 481856 477897 476783 485514 487146
9234 487146 479950 472255 473625 479884 477470 493930 507538 511879 512557 512140 527329 529552 521315 526004
9220 526004 538676 552410 560449 573736 579532 586231 600404 617690 619841 646248 661778 675902
9208 675902 683764 684895 685088 686505 690783 692930 690374 706150 721432 736979 740547 743585 747199 762382
9194 762382 777226 780776 809409 828377 848724 851083 850338 870186 877981 891171 894844 902181 928312
9181 928312 955196 980331 996304 1010756 1021469 1037365 1053509 1073942 1098169 1125790 1137243 1159322
9169 1159322 1184396 1193737 1196375 1198660 1215543 1239509 1259376 1285148 1303817 1326766 1354422 1368943
9157 1368943 1381497 1397723 1413358 1433180 1446634 1469747 1501163 1520714 1539890 1542428 1564986 1598763
9145A598763J7757J3785J4777J6850K8642M0689L1054M1428L4728K7097K0112
9134A885682K3782L6520L7128K9091L1917L4220K5696K7356M9324N5138M4274
9123B280128N5722M9788M7834M7114M4468N5499N0879N8075N3974N7230N7331
9112B858042O8259P4079O5017P0598P3888P7869Q7489Q3112R5038R3676Q1900
9101C728967Q5386R6538J08636J26384J19852J20584J34908J32644J31106J46461
9091D931466J59273J48418J52729J81184J78848J99069K11377K10975K08862K31777
9081F813978K46402K45146K59083K84638K83933K95054L21713L41151L52225L67786
9071I811109L70688M12037M42040M38097M55633M83553N02720N06175N29067N57832
$$ plain form
9145 1598763 1616520 1630305 1645082 1661932 1690574 1731263 1762317 1803745 1838473 1865570 1885682
9134 1885682 1909464 1945984 1983112 2012203 2044120 2078340 2104036 2131392 2180716 2235854 2280128
9123 2280128 2335850 2385638 2433472 2480586 2525054 2580553 2631432 2689507 2743481 2800711 2858042
9112 2858042 2926301 3000380 3065397 3135995 3209883 3287752 3375241 3458353 3553391 3647067 3728967
9101 3728967 3814353 3910891 4019527 4145911 4265763 4386347 4521255 4653899 4785005 4931466
9091 4931466 5090739 5239157 5391886 5573070 5751918 5950987 6162364 6373339 6582201 6813978
9081 6813978 7060380 7305526 7564609 7849247 8133180 8428234 8749947 9091098 9443323 9811109
9071 9811109 10181797 10593834 11035874 11473971 11929604 12413157 12915877 13422052 13951119 14508951
9061A4508951N55738N67432O06441O17344O09673O27989O28456O37083O18865
9052A9977972O11770N79721N61754N31302M85353M32203L93467L42140L00492
9043B4216174K25047J38263Q3282J4306o3030j17646j64104k14574k77555l36048
9033B3504115l63637m06736m41055m60325m77190m82144m95552n03297m95668
9024A9378511m98999m97543m98732m87836m70329m65798m47802m33531m41723
9015A5136218m21119m08044l91032l61741l60323l58071l62126l37802l17493
9006A1818467l05002k85393k74464k58733k56516k57650k45167k36795k18814
8997I479933k17907k10757k05198k04027k05775j95005j99125j91196j88555j68216
$$ plain form
9061 14508951 15064689 15632121 16238562 16855906 17465579 18093568 18722024 19359107 19977972
9052 19977972 20589742 21169463 21731217 22262519 22747872 23180075 23573542 23915682 24216174
9043 24216174 24441221 24579484 24662766 24677072 24614042 24496396 24332292 24117718 23840163 23504115
9033 23504115 23140478 22733742 22292687 21832362 21355172 20873028 20377476 19874179 19378511
9024 19378511 18879512 18381969 17883237 17395401 16925072 16459274 16011472 15577941 15136218
9015 15136218 14715099 14307055 13916023 13554282 13193959 12835888 12473762 12135960 11818467
9006 11818467 11513465 11228072 10953608 10694875 10438359 10180709 9935542 9698747 9479933
8997 9479933 9262026 9051269 8846071 8642044 8436269 8241264 8042139 7850943 7662388 7494172
8987G494172j63226j71628j47874j32975j43722j34504j30879j11447j37368j35707
8977F084842j21805j22350j27601j20648r7505j00515j18585j17521q8323q7642
8967D982347q8697q3575r0172q3586q3850q2868q5263p1021p1724p9171q3797
8956D078623p9544p4511p8038p7605p5709m8761m2881o9987q8943n4417l5463
8945C352764l8938o2044o0527o8822l0270l4748m0411m4709m1822m2686n4656
8934B833131m8647m1680l9599l1286l5643m1891k5383k6815m9700m4725l1748
8923B416014k9106m1074m1244k6079j2290k5430l1040k6765l6629k7768l7057
8912B081532l0955o973j8740k9345l5922l8474l5307j1067j3834l9988k9745j9500
$$ plain form
8987 7494172 7330946 7159318 7011444 6878469 6734747 6600243 6469364 6357917 6220549 6084842
8977 6084842 5963037 5840687 5713086 5592438 5494933 5394418 5275833 5158312 5069989 4982347
8967 4982347 4893650 4810075 4719903 4636317 4552467 4469599 4384336 4313315 4241591 4162420 4078623
8956 4078623 3999079 3924568 3846530 3768925 3693216 3644455 3601574 3531587 3442644 3388227 3352764
8945 3352764 3313826 3251782 3191255 3122433 3092163 3057415 3017004 2972295 2930473 2887787 2833131
8934 2833131 2784484 2742804 2703205 2671919 2636276 2594385 2569002 2542187 2492487 2447762 2416014
8923 2416014 2386908 2345834 2304590 2278511 2266221 2240791 2209751 2182986 2146357 2118589 2081532
8912 2081532 2050577 2043604 2024864 1995519 1959597 1921123 1885816 1874749 1860915 1820927 1791182 1771682
8900A771682k4197m389j3096j7059k8812l2119j9018k6657l3775k2004j8228j4671
8888A517657l2311j2251k8511k2077j5626j2479j6337k8999j2654j6144k7063
8877A293205j5120j8152o894k4307k3357j5592j2881j8713r690k967k5281k1856
8865A098395q767l662q244j9983j8844k1125j3616k499m516j6526k2746j6877
8853I40990N192R99j4666j5166o768j3719p508j0039j2545n480m936j4406j2957
8840H28991j2153k6941r410m263j050j771n582l311j3665k3705l455j4168j7063
8827F92454j5141l888j7024o8j0280o487J5581j085j1099r930j2922n297o19k0763
8813E93432j7810q277r745n972K119j381K81m892j4321j4472M946J4994L36k1868
$$ plain form
8900 1771682 1747485 1743096 1730000 1712941 1684129 1652010 1632992 1606335 1572560 1550556 1532328 1517657
8888 1517657 1485346 1473095 1444584 1422507 1406881 1394402 1378065 1349066 1336412 1320268 1293205
8877 1293205 1278085 1259933 1253039 1228732 1205375 1189783 1176902 1158189 1148499 1145532 1120251 1098395
8865 1098395 1089628 1085966 1077722 1057739 1038895 1017770 1004154 1001655 997139 980613 957867 940990
8853 940990 946182 947181 932515 917349 910581 896862 889354 879315 866770 861290 856354 841948 828991
8840 828991 816838 789897 780487 776224 775174 773403 767821 764510 750845 727140 723685 709517 692454
8827 692454 677313 673425 656401 656333 646053 639566 655147 654062 642963 633033 620111 614814 614195 593432
8813 593432 575622 567345 557600 551628 553747 552366 552647 547755 533434 518962 523908 538902 539238 517370
8799E17370k3390R214N050n545m527j0475j009q438j4622j3718o453J437L617
8786D48511m151k4664q649O321J1888m461l3593r633L197n941n438l308l56J953
8772C71676O522L658j4504j4191o330o746J1776J289Q388n597j0752J783N677
8759C52649j649l168l356j1147n874n542j421O239j2439j2816n334j4315r899
8746B71928j880J6219N097k889j1092J90J06O76r18J2514L287K793P401o892n482
8731B91058j1021j1387j2137N762p631k992k1861r597J6369J3843l568r619m072
8718B33147p143M730j00p568O842N240J1749j8909k2694q177l333R976p721Q599
8704B04638j338j0895j164O844J1300J1813L930q053o93j6025p365n566q970q515
$$ plain form
8799 517370 493980 503194 508244 502699 498172 487697 486688 478250 463628 449910 443457 444894 448511
8786 448511 444360 419696 411047 417368 429256 424795 391202 381569 384766 378825 373387 370079 369723 371676
8772 371676 378198 381856 367352 353161 346831 340085 351861 353150 361538 355941 345189 346972 352649
8759 352649 351000 347832 344476 333329 327455 321913 320492 326731 314292 301476 296142 281827 271928
8746 271928 270048 286267 291364 288475 277383 277573 277679 278355 277437 289951 293238 296031 303432 296540 291058
8731 291058 280037 268650 256513 262275 254644 251652 229791 220194 236563 250406 246838 237219 233147
8718 233147 226004 230734 230634 223066 229908 235148 246897 227988 205294 197117 193784 203760 196039 204638
8704 204638 203300 192405 191241 198085 209385 221198 225128 217075 216382 200357 192992 187426 178456 169941
8690A69941J5872O421n356j6805j3069J9112J9520k510m972j4302Q813R056m244
8677A87477p702j4794q274L198q542J2245O416k414Q2q486K330j3923j1611k174
8663A33828m343j855O697J6977j031P438o841k265m41N090K642j987r018l867
8649A41024q336j5058O092Q741N500j1363k9863Q249J4270o623j8834n168J1579
8636A00210M145L925j674k711J5650L58n594K388J4075K0948q62j3986p386j3295
8622A16191r648k421M030P982j209n025l260j6367j6041J2452J4022o916q815
8609H4975n287J5344J4843m367N701R926q401j0889N223O921q405j8556q353K671
8595H1346J066J0632P036r145o625L321J2653J2024O730q55J80J314P86P55j1059
$$ plain form
8690 169941 185813 192234 186878 170073 157004 176116 195636 193126 188154 173852 182665 191721 187477
8677 187477 179775 164981 156707 159905 151363 163608 170024 167610 167692 159206 161536 147613 136002 133828
8663 133828 129485 127630 134327 151304 150273 157711 150870 148605 148164 153254 155896 153909 144891 141024
8649 141024 132688 117630 123722 132463 137963 126600 96737 104986 119256 112633 93799 88631 100210
8636 100210 104355 108280 106606 103895 119545 119903 114309 116697 130772 151720 150858 136872 129486 116191
8622 116191 106543 104122 108152 116134 114925 109900 106640 90273 74232 86684 100706 93790 84975
8609 84975 79688 95032 109875 105508 111209 121135 112734 101845 107068 113989 105584 87028 78675 81346
8595 81346 82412 93044 100080 90935 84310 87631 100284 112308 119038 118183 118363 119677 120463 121218 110159
8580A10159q248l214q321l3o173P833J1596J939p886j1736J533N646p252N742
8566I1585O086m597j1930j3017J4433J137j7742M575N847N438l630q523J0799
8553H0461J0070L642j563M27n007p417j0271p101Q005K4857l320r755k0968p303
8539E4757M953q918q023Q050J9770J6607m280j8687J2183P093L411K922j4687
8526G5151j2718l091M121j98M221q160j772o483j465j3380J666J89J7284R552
8512F4917K932J664l276N000J750k996Q763K1787o6j2745k4840j1548M614J5099
8498G1055O518n495j4249j0009j304k171l735J0807l805l513J6308J788M226M830
8484G1251m754K146o15m850n692K998j446J3676j0347o716k835M16O847m217j4832
$$ plain form
8580 110159 101911 98697 90376 90343 84170 92003 103599 105538 97652 85916 87449 93095 85843 91585
8566 91585 97671 93074 81144 68127 82560 83697 65955 70530 76377 81815 78185 69662 80461
8553 80461 90531 94173 92610 93037 88030 80613 70342 63241 71246 96103 92783 83028 62060 54757
8539 54757 59710 50792 42769 50819 70589 87196 82916 64229 76412 83505 86916 89838 75151
8526 75151 62433 59342 63463 63265 67486 59326 57554 51071 49606 36226 37892 38081 55365 64917
8512 64917 67849 69513 66237 71237 72987 69991 78754 100541 100475 87730 62890 51342 55956 71055
8498 71055 77573 72078 57829 47820 46516 44345 40610 51417 47612 44099 60407 62195 66421 71251
8484 71251 66497 68643 68028 63178 57486 60484 59038 72714 62367 55651 52816 53232 60079 55862 41030
8469D1030k229M425q889M20N591P77M291R161L110J157q412j339O96k506K89m383
8453D3189J8008L750O08j7968n394J2983o916q137l282k436R102p632l525J2800
8439D5150J1804J34J6295J4812J4588J7384K1785K0360K647k2526p666j6559k6034
8426I2174p417m492r520j2614q895K037r333J098R117J1127r07o295r902O899
8412E3077J200p619J2881m375j1401m506o123J1538J8578M74J369l757o476n148
8398D9712M198O269l85j3122O944J0925L918O226J3588L7712N3966N6616K4035
8385B60602q375m0432m2321l0433k0522k1582j3551k080j5094j7576j8140N234
8373C5730O197r77n05J3105J1029j0696N14j389K309R030k993r20l441K04J406
$$ plain form
8469 41030 38801 43226 34337 34757 40348 41125 45416 54577 57687 58844 50432 49093 49789 47283 47572 43189
8453 43189 61197 64947 65555 47587 42193 55176 48260 40123 36841 34405 43507 35875 32350 45150
8439 45150 56954 57088 73383 88195 102783 120167 141952 162312 164959 142433 134767 118208 92174
8426 92174 84757 80265 70745 58131 49236 51273 41940 43038 52155 63282 62375 56080 46178 53077
8412 53077 54277 46658 59539 55164 43763 39257 33134 44672 63250 63724 65093 61336 54860 49712
8398 49712 53910 60179 59794 46672 53616 64541 68459 74685 88273 125985 179951 236567 260602
8385 260602 252227 211795 169474 139041 118519 96937 83386 81306 66212 48636 30496 35730
8373 35730 41927 40950 40445 53550 64579 53883 54397 53008 55317 64347 61354 60434 56993 57197 58603
8358E8603m918J6758N136j1411j4928J414m211k670K868k634r95P086J759J6204
8344F8061M973J8882J5996J3006r00J4222r584k0695j0326o412m548j7597p522
8331E7556j0373q180L984l211j965J675p14N794q062O880J5679p358k093Q11n000
8316D5423K618p853n401J388j2028n810o14M646k768n066J1682j540k714J1107
8302C3070J977j802L301J921N878m819n153n93j293O70Q700j5391j967j297Q089
8287C1291j589R919O668k2802k329M041M392N158N663P582m731q010m366j951
8273B8936O363p89m291j6869N141M664o929j4408m61J3718q012J051m50N010o012
8258F662m775N101O309O669J854R675J0250J103q345J022o95m692r356O393j081
$$ plain form
8358 58603 53685 70443 75579 64168 49240 50654 46443 43773 46641 44007 43012 50098 51857 68061
8344 68061 73034 91916 107912 120918 120018 134240 124656 103961 93635 87223 82675 65078 57556
8331 57556 47183 39003 42987 39776 37811 39486 38772 44566 36504 43384 59063 51705 49612 50423 45423
8316 45423 48041 40188 34787 36175 24147 18337 17723 22369 19601 14535 26217 24677 21963 33070
8302 33070 35047 33245 36546 38467 44345 39526 34373 33780 32487 33157 41857 26466 24499 23202 31291
8287 31291 29702 39621 46289 23487 21158 25199 29591 34749 40412 47994 43263 35253 30887 28936
8273 28936 35299 34510 30219 13350 18491 23155 16226 1818 1357 15075 7063 8114 7664 12674 6662
8258 6662 1887 6988 13297 19966 21820 31495 41745 42848 34503 35525 34830 30138 20782 27175 26094
8243B6094M032p45o053r911j4639m982J4697J9683r357j0151j815l680R01J1993
8229A6067J2957k238M171M730P658k716n557l729j1195O319R583J800q394K457
8215C1913K090n131J509M56r610J843J3544j577n960J2370L804j5893j2210p231
8201I917M661O43r373P062O553J686k615k441j0415K570m328n415J5628J1643
8187B5776m671r696P418M399j4741j9413N433J576J3457J28l269r965J6089O214
8173A8735m26p128q898j0259J0497N596L723l410p344p685P624O274J7886K927
8159B8112l41m349j1178j537l332J5532K857j0661j2768m716N342J847L564j2300
8145c928k0320N689R341J0318m983P309N213R076J2524K325o153j0875j891P264
$$ plain form
8243 26094 30126 29381 23328 13417 -1222 -6204 8493 28176 18819 8668 6853 3173 4074 16067
8229 16067 29024 26786 30957 35687 43345 40629 35072 31343 20148 26467 36050 37850 29456 31913
8215 31913 34003 28872 30381 30837 21227 23070 36614 35037 29077 41447 45251 29358 17148 9917
8201 9917 14578 15221 5848 12910 19463 21149 18534 16093 5678 8248 3920 -1495 14133 25776
8187 25776 21105 11409 18827 23226 8485 -10928 -5495 -3919 9538 9666 6397 -3568 12521 18735
8173 18735 18309 11181 2283 -7976 2521 8117 11840 8430 1086 -6599 1025 7299 25185 28112
8159 28112 27771 23422 12244 10707 7375 22907 25764 15103 2335 -2381 2961 4808 8372 -3928
8145 -3928 -24248 -18559 -9218 1100 -3883 3426 8639 17715 30239 32564 26411 15536 13645 20909
8131B0909j1138m954L16J7067J2067j7492j1658M177K802j350R00j3614N27R27
8117e14l910K170P120n132J187M197p50J2051L760k978j025k883n079J0207J2896
8102C1317M456K575j544j0927k522q710P294l705m705R139p209r129K949N608
8088A4887R593M976k581n127k851r246L504J9511O492j6090j0194q652l30M424
8074H316J601m401J784J1848k533O442K825J886l72N384m408k6891N437O092J0963
8059B3973q186p120l985n141r58Q829k049p28j2886L985J2860Q541p970p238m228
8044b301J0859o879k882r152m470n505K701K009P001k639p406J5370J1483Q69
8030I058L284M115k770l522k082M606N570L592l973o396p298k375K118M497J2188
$$ plain form
8131 20909 9771 4817 5133 22200 34267 16775 5117 9294 12096 10746 11646 -1968 -1441 -514
8117 -514 -4424 -2254 4866 -266 921 5118 4368 16419 20179 17201 16176 13293 8214 18421 31317
8102 31317 35773 38348 36804 25877 23355 14645 21939 18234 13529 22668 15459 6330 9279 14887
8088 14887 24480 29456 26875 21748 18897 9651 13155 32666 39158 23068 12874 4222 3892 8316
8074 8316 9917 5516 7300 19148 16615 23057 25882 27768 27396 32780 28372 1481 6918 13010 23973
8059 23973 15787 8667 4682 -459 -1417 7412 5363 4635 -8251 -4266 8594 17135 9165 1927 -2301
8044 -2301 8558 1679 -1203 -10355 -14825 -20330 -17629 -15620 -8619 -11258 -18664 -3294 8189 9058
8030 9058 12342 16457 13687 10165 8083 12689 18259 21851 17878 11482 4184 1809 3927 8424 20612
8015B0612j8198j6355p21j1430J771N084O884P963k330J9044J0202q508p392k313
8001D313L679L614R037M894J725N803Q795j8232k870O944j2409o684R40j65N160
7986A4544M852n417n720J1764N822K769p006j1153j0396j0199J007L837J3933
7973H637M399j0955q263o011N415R318N861p662n639J9441o624O438J0206Q039
7959C2600j7012j2830m24K0622M077k609R602n294j6264q852K170J669N576J0068
7945B3099J4506j4902n583J0433j756o955l649k077J3266L562j7524n113j4003
7932f696j103N345J1003J0272k906j526k539J299R514Q200m613j1757r120N381
7918A0754o372m574P486q344l301L967m209l646p7k462L553j3200M733Q964J1386
$$ plain form
8015 20612 2414 -13941 -14662 -26092 -24321 -19237 -12353 -4390 -6720 12324 22526 14018 6626 4313
8001 4313 7992 11606 20643 25537 27262 33065 41860 23628 20758 27702 15293 8609 9549 9384 14544
7986 14544 19396 13979 8259 20023 25845 28614 21608 10455 59 -10140 -9133 -5296 8637
7973 8637 13036 2081 -6182 -12193 -6778 2540 8401 739 -4900 14541 7917 14355 24561 32600
7959 32600 15588 2758 2334 22956 27033 24424 34026 28732 12468 3616 5786 7455 13031 23099
7945 23099 37605 22703 17120 27553 25797 18842 15193 13116 26382 29944 12420 7307 -6696
7932 -6696 -7799 -2454 8549 18821 15915 14389 11850 13149 22663 30863 26250 14493 5373 10754
7918 10754 4382 -192 7294 -1050 -4351 -384 -4593 -8239 -8316 -10778 -7225 -20425 -15692 -6728 4658
7903D658L867k678P331J2659r83Q578l612j1598o324j686q379O34R387R446j353
7888A9947q770L856p630Q76O359j1160J2059J846o963M710J0007k262n082o286
7874A1507n531M386P027q531j3607R601M032L426j7167J983J0444r054p447N321
7860c610J0910o87k625j428N379L650K655j3819n831r087K385M531r166J5178
7846a565J8668K287o26K35j8644O051J0500k309n847q903Q339J3646J9050O736
7832D7618j4642n407k16j1016n764L984o058j902L70J010J0668K866m021j961
7818A5529j0961R890k584L56p423j2536M141p788j174P164M480M60q426k550J1635
7803B13J9743l630j2360j0747l24P669J838M699r712m402p388j548N513K21J0920
$$ plain form
7903 4658 8525 5847 13178 25837 24854 33432 29820 18222 11898 10212 1833 2467 11854 21300 19947
7888 19947 11177 15033 7403 8279 14638 3478 15537 17383 10420 15130 25137 22875 17793 11507
7874 11507 5976 10362 17389 8858 -4749 4852 8884 12310 -4857 -2874 7570 -1484 -8931 -3610
7860 -3610 7300 6613 3988 2560 7939 11589 14244 425 -5406 -14493 -12108 -7577 -16743 -1565
7846 -1565 17103 19390 18764 18999 355 6406 16906 14597 8750 -153 8186 21832 40882 47618
7832 47618 32976 27569 27353 16337 10573 14557 8499 6597 6967 7977 18645 21511 17490 15529
7818 15529 4568 14458 11874 12230 4807 -7729 -3588 -11376 -12550 -5386 -906 -446 -8872 -11422 213
7803 213 19956 16326 3966 -6781 -7105 564 2402 7101 -2611 -7013 -14401 -15949 -10436 -10215 705
7788G05J0363Q609L86o908j2613J409j2083j0250n706O240K2679J8538O96n649
7774A6416r327m452m692q36n022N134k342J5859R941N091j3680j7399o161m055
7760a5525J4194j180l819p087J3938m304N027l496l481L015P408J107q433o735
7746i371j002n07J568P667q51N07j2772J0219K1392n001l901m317K429K0514m082
7731B2492m851n536j4264L152J3260J3012j0388r076K526n805p296J0006m585
7718B647k111o907m502L430p085N012K903Q55M63M57o715j0372K318O978O485
7703f144L219L77J177K992k705j567O260o874L985P864M819J1616l517o583O968
7688B1887j0179j2040J935J7007L914q020r548p185j3087J1253P840j133k911
$$ plain form
7788 705 11068 19677 20063 13155 542 1951 -10132 -20382 -26088 -19848 2831 21369 22065 16416
7774 16416 7089 2637 -2055 -2891 -7913 -2779 -5121 10738 20679 25770 12090 -5309 -11470 -15525
7760 -15525 -1331 -2511 -6330 -13417 521 -3783 1244 -2252 -5733 -2718 4690 5797 -2636 -9371
7746 -9371 -10373 -10880 -9312 -1645 -2496 -1989 -14761 -4542 16850 11849 7948 3631 6060 26574 22492
7731 22492 17641 12105 -2159 993 14253 27265 16877 7801 10327 4522 -2774 7232 2647
7718 2647 536 -6371 -10873 -7443 -14528 -9516 -6613 -5758 -5295 -4838 -11553 -21925 -19607 -12629 -6144
7703 -6144 -2925 -2548 -1371 1621 -1084 -2651 3609 -3265 720 8584 13403 25019 21502 14919 21887
7688 21887 11708 -332 1603 18610 22524 14504 4956 -2229 -15316 -4063 3777 2644 -267
7675b67o894J793K324j1609o556o549R778Q287L37o810J5743Q600l950j374P717
7660A0570O960o016j350P687q580r247J1487k505o98q028n492M259P107l243J555
7645D466P624j1166n407K364N564K960p506m855Q987m687Q437R122k733p492L593
7630I271J9525O399k851o330n787M271j4627j7260N689M430K674j1021j1170j4169
7616c0956k443J244K3517J6468L740j4008J2939N695j1903n46j629L41j0161p491
7602a5193k372J956J0880J091J137l542K02J4527j218j4480j3762J05J8904N085
7588C320L325k317L79J146j8617j0305P993M231O764K589j3153P830Q259l539
7574b095k697l932j488Q515j3723o748J2111J5701k1287r973M119Q352l485J050
$$ plain form
7675 -267 -7161 -5368 -3044 -14653 -21209 -27758 -17980 -9693 -9356 -16166 -423 8177 4227 2853 10570
7660 10570 17530 11514 10164 17851 9271 24 11511 9006 8308 280 -5212 -953 6154 2911 4466
7645 4466 12090 924 -4483 -2119 3445 6405 -1101 -5956 3031 -1656 6781 15903 13170 5678 9271
7630 9271 28796 35195 32344 26014 20227 24498 9871 -7389 -1700 2730 5404 -5617 -16787 -30956
7616 -30956 -33399 -32155 -8638 7830 11570 -2438 10501 16196 4293 3747 2118 2459 -7702 -15193
7602 -15193 -17565 -15609 -4729 -3638 -2501 -6043 -5841 8686 7468 -7012 -20774 -20669 -1765 3320
7588 3320 6645 4328 4707 5853 -12764 -23069 -15076 -10845 -4081 -1492 -14645 -6815 1444 -2095
7574 -2095 -4792 -8724 -10212 -1697 -15420 -22168 -10057 5644 -15643 -25616 -21497 -13145 -16630 -15580
7560a5580J631P643J079j056p097j1312J3568j588Q457J6358o379k189k55M211
7546G491r02M543j603j3060q871Q974l547r764l044Q391J6179j011j5186j1763
7532b3173R762J743j666N585m364J095j0596j2272o406J0355J3610N332k230o740
7518a9965N952N437L956L769p319O54Q664L132j8610m749j787k691P748J0402
7504e407m617K87J6267m964j5254J2463J1791n342P038p046J0804K799j951r526
7490G342J0506k240k063p361m155j472m332K137j143j0335N93O127r657p302K574
7475b0781P897J1443j183n309m8k903K344p361j4259j23Q856J2272K661m92P539
7460E53J8416Q37k527n430j1881m778j490n291J551P445q23r352q449n336Q05
$$ plain form
7560 -15580 -13949 -6306 -5227 -6283 -13380 -24692 -11124 -12712 -4255 12103 5724 3535 3280 7491
7546 7491 6589 11132 9529 -3531 -12402 -3428 -6975 -16739 -19783 -11392 4787 3776 -11410 -23173
7532 -23173 -13411 -11668 -13334 -7749 -12113 -11018 -21614 -33886 -40292 -29937 -16327 -10995 -13225 -19965
7518 -19965 -14013 -8576 -4620 -851 -8170 -7516 1148 4280 -14330 -19079 -20866 -23557 -15809 -5407
7504 -5407 -10024 -9737 6530 1566 -13688 -1225 10566 5224 12262 5216 16020 18819 16868 7342
7490 7342 17848 15608 13545 6184 2029 557 -3775 -1638 -2781 -13116 -12523 -6396 -16053 -23355 -20781
7475 -20781 -12884 -1441 -2624 -7933 -7981 -10884 -8540 -15901 -30160 -30283 -21427 -9155 -6494 -6986 553
7460 553 18969 19806 17279 11849 -32 -4810 -6300 -11591 -10040 -2595 -3418 -12770 -21219 -26555 -25750
7445b5750k336r796M835o087P161L925J2004K366O044n66P488j1468r029K485
7431a8724P116j4644Q902J0065K765p12R007m420P385P899r124j3977m067k191
7417a4720k693j087Q558L048R567J51j0503l331k179R9J1761m023m322R793q96
7402g77k738M901k349n426r349O092O715l493r85q532J0815J2014J16j7049Q6
7387i959K419no255J2543o539r32J3395Q785J15n552j238L22N727m252n978p281
7371d685k378O426P305j1852j0463l52O087m228M772Q177K233P598o845Q047R692
7356A9534J071j0698j4643n60j290P609P348q825M285j0239j6107p82O285q16
7342a7828j165L959P98J511q389l291K0319O189M567j2152j0381J295J0512J0613
$$ plain form
7445 -25750 -28086 -37882 -33047 -39134 -31973 -28048 -16044 -13678 -7634 -8200 -712 -12180 -21209 -18724
7431 -18724 -11608 -26252 -17350 -7285 -4520 -5232 3775 -645 6740 14639 5515 -8462 -12529 -14720
7417 -14720 -17413 -18500 -9942 -6894 2673 2824 -7679 -11010 -13189 -13090 -1329 -5352 -9674 119 -777
7402 -777 -3515 1386 -963 -6389 -15738 -9646 -2931 -6424 -7409 -15941 -5126 6888 7004 -10045 -9959
7387 -9959 -7540 -7545 -13800 -1257 -7796 -8728 4667 13452 13567 8015 6777 7099 12826 8574 2596 -4685
7371 -4685 -7063 -637 6668 -5184 -15647 -15999 -9912 -14140 -9368 -1191 1042 8640 1795 9842 19534
7356 19534 20605 9907 -4736 -5296 -6586 1023 8371 -454 3831 -6408 -22515 -23297 -17012 -17828
7342 -17828 -18993 -15034 -14236 -12725 -21114 -24405 -4086 2103 6670 -5482 -15863 -14568 -4056 6557
7328F557M563O369Q38q166k1508l818R932l539m888n91o839K0848O498l908P677
7313A0025R337o802r281J2344J425j2748j1449p057M641J8664O302p370j7959
7300i928m198P444N975j2296n423Q139K149j7500Q204J5317M988L639K445J779
7286A0734j4817q05P734J101n906j1137q691K3874J3000j804o855j22k958k925
7272D23n977o510r783Q33O194q293L721M165J0818K211k556J6100M199r063j3487
7257g005p29O773M131r06j9116o835J288P838Q365R098l289j845o660o693J4204
7242a381N488k944M162q895k768n486q919n720J8605J3332K836j2732j224J4909
7228I263K637r113J217p779J0788N794j3331M686q556L293J1879J0634j0144q556
$$ plain form
7328 6557 11120 17489 18327 10161 -11347 -15165 -5233 -8772 -13660 -14251 -21090 -242 6256 2348 10025
7313 10025 19362 12560 3279 15623 17048 4300 -7149 -14206 -9565 9099 15401 8031 -9928
7300 -9928 -14126 -6682 -707 -13003 -18426 -10287 -8138 -25638 -17434 -2117 2871 6510 8955 10734
7286 10734 -4083 -4888 2846 3947 -1959 -13096 -21787 2087 15087 13283 6428 6306 3348 423
7272 423 -5554 -12064 -21847 -21014 -14820 -23113 -19392 -15227 -4409 -2198 -4754 11346 15545 6482 -7005
7257 -7005 -7734 -961 3170 2264 -16852 -23687 -22399 -14561 -6196 2902 -387 -2232 -8892 -15585 -1381
7242 -1381 4107 1163 5325 -3570 -6338 -11824 -20743 -26463 -7858 5474 8310 -4422 -5646 9263
7228 9263 11900 2787 4004 -3775 7013 12807 -524 4162 -4394 -1101 10778 21412 11268 2712
7214B712r712L968q896J847L903P462J126l18o999j757j874K932n887J6129O010
7199A0646R31N746j214K186n160j6163j1657j5106J463R912p805J0243J3937P877
7185E836l879n352j310N87K706l103o631l486j853p574k628J1406L731r023o880
7170b7453R02J8226R471q871K359R922Q152j5023R34R216O569L680o434j8302
7156f652J084P804m249j5780p672J8548J1512k696n296j1754J203J3021J4463
7143A3536M848j948j7085j1996P064k667r4P54k292j1100Q18J6410K282Q94j2325
7128a2901l009j1678m371j003M501J218m191k190o083P942J0340j769J0777R818
7114b599r241j0127k005J1920J2594r670k929P650o398l964J6000O7r086n932
$$ plain form
7214 2712 -7000 -3032 -11928 -10081 -6178 1284 2410 2092 -4907 -6664 -8538 -5606 -11493 4636 10646
7199 10646 11577 17323 16109 18295 13135 -3028 -14685 -29791 -28328 -18416 -26221 -15978 -2041 5836
7185 5836 1957 -3395 -4705 -4118 -1412 -4515 -11146 -14632 -16485 -24059 -26687 -15281 -11550 -20573 -27453
7170 -27453 -26551 -8325 1146 -7725 -5366 4556 12708 -2315 -1381 7835 14404 18084 11650 -6652
7156 -6652 -5568 2236 -2013 -17793 -25465 -6917 4595 1899 -3397 -15151 -13948 -927 13536
7143 13536 18384 16436 -649 -12645 -5581 -8248 -8342 -7588 -9880 -20980 -20162 -3752 -1470 -576 -12901
7128 -12901 -15910 -27588 -31959 -32962 -28461 -27243 -31434 -33624 -39707 -31765 -21425 -23194 -12417 -2599
7114 -2599 -11840 -21967 -23972 -12052 542 -9128 -12057 -4407 -10805 -14769 1231 1298 -7788 -13720
7100a3720J8389J8867r164p032k152j307J136n075p604r396J1547j4523j1112
7087c1146K3476R802p098n85k470j91j264q855q601R450J2513J1990m652j5040
7073a2671K499j579M658P963N465m016m343j5544j8763l942Q199R994M673l158
7059b0565m008J3173J2176n240m490M270L462m757n277q48O315j170j4654j631
7045b3244J6533O13j0362r085J202J1882J1414J5789k272l175j1049j1066L236
7032i584j316Q30p040j4008Q235J3734J3678P578l320j0582P258P2p584p013q095
7017a7157j0050L00r914Q946J0744P840J6913l061j4348j31l718R63J800P70Q328
7002a775J4721K376k879r032O78r321j2602p145j2320J5105K4530n467j9267O282
$$ plain form
7100 -13720 4669 23536 14372 7340 5188 3881 5017 -58 -7662 -17058 -5511 -20034 -31146
7087 -31146 -7670 2132 -4966 -5551 -8021 -8212 -9476 -18331 -26932 -17482 -4969 7021 2369 -12671
7073 -12671 -10172 -11751 -7093 870 6335 2319 -2024 -17568 -36331 -40273 -32074 -22080 -17407 -20565
7059 -20565 -24573 -11400 776 -4464 -8954 -4684 -1222 -5979 -11256 -12104 -5789 -6959 -21613 -23244
7045 -23244 -6711 -6098 -16460 -25545 -24343 -12461 -1047 14742 12470 9295 -1754 -12820 -9584
7032 -9584 -10900 -10070 -17110 -31118 -22883 -9149 4529 12107 8787 -1795 5463 5535 -2049 -9062 -17157
7017 -17157 -27207 -26907 -36821 -27875 -17131 -9291 7622 4561 -9787 -9918 -13636 -12673 -10873 -10103 -1775
7002 -1775 12946 15322 12443 3411 4089 -5232 -17834 -24979 -37299 -22194 2336 -3131 -22398 -16116
6988a6116J0018O123j2303m403j0627j1076K0447Q343l868j6299R182J0293N254
6975e032q382m29L733j1657R645L647j7121O065J5144O075M250k899j821k906
6961a688j4542O170P840J4080K355j0877n142o659k392P018R42j6679J2847N704
6947a023R835Q281L474p314k2625j6505n46K043J5948L619M067L319j8885l332
6933a9644l992K63J6055J3037j4604o749K019L440J988L282P057o989q613n632
6919a9082J7431J3624o485L18J0267J780k4267r449Q926n622P670j2656j0417
6906b7962J3336K2239N762j730r726j0320o046k06m55m47N427K237j3942k493
6892b4326J6131L506l766L111O733j0492n606J0724J7493J5403l843p232r448
$$ plain form
6988 -16116 -6098 25 -12278 -16681 -27308 -38384 -17937 -9594 -13462 -29761 -20579 -10286 -5032
6975 -5032 -13414 -13843 -10110 -21767 -12122 -8475 -25596 -19531 -4387 1688 5938 3039 1218 -1688
6961 -1688 -16230 -10060 -2220 11860 14215 3338 -1804 -8463 -10855 -3837 -2895 -19574 -6727 -1023
6947 -1023 8812 17093 20567 13253 -9372 -25877 -26423 -24380 -8432 -4813 -746 2573 -16312 -19644
6933 -19644 -23636 -23373 -7318 5719 -8885 -15634 -13615 -10175 -8187 -4905 2152 -4837 -13450 -19082
6919 -19082 -1651 11973 5488 5806 16073 17853 -6414 -15863 -6937 -12559 -4889 -17545 -27962
6906 -27962 -14626 7613 13375 11645 1919 -8401 -14447 -14653 -15108 -15555 -10128 -7891 -21833 -24326
6892 -24326 -8195 -4689 -8455 -5344 1389 -9103 -14709 -3985 13508 28911 25068 17836 8388
6879H388q496j2102J1909O397m602j3967r993J7380K0345L562o609j4275Q283
6866F220o180m466N659O967M036k927p659L791N941m393n474j0279K870N164M19
6851c11J5313M985j3361M232j010L573J011L356o490L92M894m0j8553O001Q406
6836A2398j06j4279k821q051J0069q638K925J0394P606O695J3364n598o109q611
6822I238n637L885L115j465L951o781p613m1J498P258k240r537p739p504P042
6807a2570J7819M421J536j0607n350K73k859j2704p882r92L183j542K701J0170
6793a4403o6J1429J1320J2716q998l95k531j585r347K046p295q08M904Q768O906
6778A2661o713q585J2707M804j4311j1772J8627L650o880j253l49l776o171k245
$$ plain form
6879 8388 -108 -12210 -301 6096 1494 -12473 -22466 -5086 15259 18821 12212 -2063 6220
6866 6220 40 -4426 1233 8200 12236 9309 1650 5441 11382 6989 1515 -8764 -5894 -730 -311
6851 -311 15002 19987 6626 10858 9848 13421 14432 17788 11298 11690 16584 16544 -2009 3992 12398
6836 12398 12292 -1987 -4808 -12859 -2790 -11428 -8503 1891 9497 16192 29556 23958 17849 9238
6822 9238 3601 7486 10601 9136 13087 6306 -1307 -1348 150 7408 5168 -4369 -12108 -19612 -12570
6807 -12570 5249 9670 11206 599 -4751 -4478 -7337 -20041 -27923 -28915 -25732 -27274 -24573 -14403
6793 -14403 -14469 -3040 8280 20996 11998 11603 9072 7487 -1860 186 -7109 -7917 -3013 5755 12661
6778 12661 5948 -2637 10070 14874 563 -11209 7418 11068 4188 2935 2586 -1190 -7361 -9606
6764i606l570p407j5547Q379O716N377K939Q698M620K089j3334L99O599k208r828
6749a5684p015k422m260P505J2499J78J6115J6371r114j8318L381K369J4040p992
6735G653n176N342R15j1061q04L145j392O030K777N865K16L656r184n916j1616
6720i550j8618n68K2381J4036r423j861J0821m033j0726j2665J0589J2165j2133
6707i585l097J877J0552o630j7328J6322O147N83R90j05j0282K696J2838o218
6693a240m431N002L807p653q869k249m802K176P188n51L903O055q789n104K094
6678a3463P319J011p714m45L145Q948J2228L52J5324K010j1932k1288p640O021
6664f124J048r724P835O011o060o656J6097N178n427P299j3182Q24N351j3138
$$ plain form
6764 -9606 -13176 -20583 -36130 -27751 -21035 -15658 -12719 -4021 599 2688 -10646 -10247 -3648 -5856 -15684
6749 -15684 -22699 -25121 -29381 -21876 -9377 -9199 6916 23287 14173 -4145 -764 1605 15645 7653
6735 7653 2477 7819 8734 -2327 -3131 14 -1378 4652 7429 13294 13510 17166 7982 2066 -9550
6720 -9550 -28168 -28736 -6355 7681 -1742 -3603 7218 3185 -7541 -20206 -9617 2548 -9585
6707 -9585 -12682 -10805 -253 -6883 -24211 -7889 -1742 -1159 -169 -274 -10556 -7860 4978 -1240
6693 -1240 -5671 -669 3138 -4515 -13384 -15633 -20435 -18259 -11071 -11622 -7719 -1664 -10453 -15557 -13463
6678 -13463 -6144 -5133 -12847 -13292 -10147 -1199 11029 11381 26705 28715 16783 -4505 -12145 -6124
6664 -6124 -5076 -14800 -6965 -954 -7014 -13670 2427 7605 2178 9477 -3705 -2881 2470 -10668
6650a0668K381P256L35M053J3650q974j0987Q914J0187R471l925j1088j5864r000
6636a4259K576m435L862L186O452k518j1343n196q712k275J6573O008j1451j4723
6622c6255K673J3356M225O480P661K519P653o440l661k990k688k026J4011l150
6608A368o460k062m4M805m023Q564J2789K508j0445r442l464j69j2721o631q637
6593c4064m720k482l383J0001J766J2423L744M796j293m967L469K434r785N469
6579a6592J6334K747J67j621k264p989m196J4046n73j8321P154J0064M808q958
6565e194o078J702q54K884n521k814m514k010Q813m907n593J6733O963O8N238
6550D916q591r16m671j249j1027J6769Q496L820o560j659o448p941k683o858p452
$$ plain form
6650 -10668 -8287 -1031 -696 3357 17007 8033 -2954 5960 16147 25618 21693 10605 -5259 -14259
6636 -14259 -11683 -16118 -12256 -9070 -2618 -5136 -16479 -21675 -30387 -32662 -16089 -10081 -21532 -36255
6622 -36255 -33582 -20226 -16001 -9521 -1860 659 8312 1872 -1789 -4779 -7467 -9493 4518 1368
6608 1368 -5092 -7154 -7198 -2393 -6416 2148 14937 17445 7000 -2442 -5906 -6075 -18796 -25427 -34064
6593 -34064 -38784 -41266 -44649 -34648 -32882 -20459 -16715 -11919 -13212 -18179 -14710 -12276 -22061 -16592
6579 -16592 -258 2489 2656 1035 -1229 -9218 -13414 632 59 -18262 -11108 -1044 3764 -5194
6565 -5194 -11272 -9570 -10424 -7540 -13061 -15875 -20389 -22399 -13586 -18493 -24086 -7353 -390 -322 4916
6550 4916 -3675 -4591 -9262 -10511 -21538 -4769 3727 7547 987 -672 -7120 -15061 -17744 -24602 -32054
6535c2054k274K9477K1456L688j7282p741P644O473J550k170L061O964j183r62
6521A6647k2584k879J0369l167J907q589o237J0849J954J952m433J2885J0210
6508A8884j6012n965M656n280k325o35J4549n579J431k886q597P83P235L154j5101
6493a1688j1661L230O851O73l024N140m71L504n063p182R022M409j1386J4807
6479b839J773l554R357j0747q055K531P807j975j2929K4J6344J3072N604r119
6465G294n945N946J0722k91P008J219p858j0027R324J949M218L180j3319r26j3110
6450f16k422m765k0507L741M230R600n312K693L136p778K686J647q32r57R735
6435e721p030p323o196j592P609L597J1912o05j596m966Q955J393m246p10j514
$$ plain form
6535 -32054 -34328 -4851 16605 20293 3011 -4730 2914 9387 10937 8767 11828 18792 17609 16647
6521 16647 -5937 -8816 1553 -1614 293 -8296 -14533 -3684 -1730 222 -4211 8674 18884
6508 18884 2872 -3093 1563 -3717 -6042 -6677 7872 2293 3724 838 -7759 -6976 259 3413 -11688
6493 -11688 -23349 -20119 -13268 -12595 -15619 -10479 -10950 -7446 -12509 -19691 -10669 -6260 -17646 -2839
6479 -2839 -1066 -4620 4737 -6010 -14065 -11534 -3727 -5702 -18631 -18607 -2263 10809 16413 7294
6465 7294 1349 7295 18017 17726 24734 25953 18095 8068 17392 19341 23559 26739 13420 12494 -616
6450 -616 -3038 -7803 -28310 -24569 -20339 -10739 -16051 -13358 -10222 -18000 -15314 -13667 -14499 -15456 -5721
6435 -5721 -12751 -20074 -26270 -27862 -20253 -16656 -4744 -5349 -6945 -11911 -2956 -1563 -5809 -6519 -8033
6420h033Q826N765K472j343n86n912L711M474j6303j0308J2992l132N338M089
6406B050k2306m522J9728J0312j5611M95Q886j1183j0722J6873J3870r837J748
6393b19j129P971R504j396j7356j2717J846N548Q831J7715p21p584o923j2559
6379i189l379j998J3175K1085j2048j1248L731j0483j852Q712q928j796o889k801
6365b3908J4038M072j1193R184q20l569L836J267j1624k259J0860M667M233r500
6351a0716o721J476J3276J717l280K513J6607N116j3083l593L269k898K853j3428
6337f892p140J1094j103O336P715l294o123K139n386L3p80k300m248r057M035
6322a4971J351J5239J252k6179j6831R418J3718J2991J8456P646p730k1312j3369
$$ plain form
6420 -8033 793 6558 9030 7687 7101 1189 4900 9374 -6929 -17237 -4245 -7377 -2039 2050
6406 2050 -20256 -24778 -5050 5262 -10349 -9854 -968 -12151 -22873 -6000 7870 -1967 -219
6393 -219 -1348 6623 16127 14731 -2625 -15342 -13496 -7948 883 18598 17877 10293 3370 -9189
6379 -9189 -12568 -14566 -1391 19694 7646 -3602 129 -10354 -12206 -3494 -12422 -14218 -21107 -23908
6365 -23908 -9870 -5798 -16991 -7807 -8627 -12196 -8360 -7093 -18717 -20976 -10116 -5449 -1216 -10716
6351 -10716 -17437 -15961 -2685 -968 -4248 -1735 14872 19988 6905 3312 6581 3683 6536 -6892
6337 -6892 -14032 -2938 -4041 2295 10010 6716 593 2732 -2654 -2621 -3401 -5701 -9949 -19006 -14971
6322 -14971 -13620 1619 2871 -23308 -40139 -30721 -17003 -4012 14444 22090 14360 -6952 -20321
6309b0321P415q276m749m533M053n26o865L174O699J2931K0080J735o058o426
6295a667j0843k625k958j866j712J4226J3223j0807j767J6205K0350o874q384
6282A4501n871k605J487J138L226j2979j1068m902O100Q365M089l151m205n100
6268a0975m240J1458J2640l925p906L748p702o233k754j4618j1125O591J6630
6255a8411O816R548J785m596n536k643n270K110J0935J0327r716Q57J2450N845
6241A4501p134m002k946q969O441N135O997q863j214L646r006r789J5262J1427
6227A1486o850N24Q821J1056l227q760r326k324J0485K418J662j3765N926p180
6213I46L178J0278J638k060o189O847k714j8914p429k636j417j126n489k752P611
$$ plain form
6309 -20321 -12906 -21182 -25931 -30464 -26411 -26937 -33802 -30628 -23929 -10998 9082 10817 4759 -1667
6295 -1667 -12510 -15135 -18093 -19959 -21671 -7445 5778 -5029 -6796 9409 29759 22885 14501
6282 14501 8630 6025 7512 8650 11876 -1103 -12171 -17073 -10973 -2608 1481 -1670 -5875 -10975
6268 -10975 -15215 -3757 8883 4958 -2948 800 -6902 -13135 -15889 -30507 -41632 -35041 -18411
6255 -18411 -11595 -2047 -262 -4858 -10394 -13037 -18307 -16197 -5262 5065 -4651 -3794 8656 14501
6241 14501 7367 3365 419 -8550 -2109 3026 10023 1160 -54 3592 -5414 -15203 59 11486
6227 11486 4636 5160 13981 25037 21810 13050 3724 1400 11885 14303 15965 2200 8126 946
6213 946 4124 14402 16040 13980 7791 14638 11924 -6990 -14419 -17055 -18472 -19598 -25087 -27839 -20228
6198b0228l85k185l440p98P629L701P872J1579o382j467k245K29p229q184M793
6183a6740J4938M219J0591M669j1147j4386k566M88M225J0241l167r35L810j4765
6169a0525o481R145J722j766J678k777j618j0521j7133J0595J2366J842M936O051
6155b486J1102L168m089n579j720J082p702M19R700J969k165L687p227J823J658
6140C640p455p764j0157P469K3714N844n750j745j1675o0p87l707K702J0906L921
6125I096p727l335J686j8378j0005N763P141Q522L370m666O333N645p797m791
6111i143o653Q280L694n682K929j750r612J3652L662l936j1567m143J1612Q933
6097B76J1452J1929j7520r312n300J969K332K876J898Q792P586k0441j752R308
$$ plain form
6198 -20228 -20613 -22798 -26238 -27036 -19407 -15706 -7834 3745 -2637 -4104 -6349 -6120 -13349 -21533 -16740
6183 -16740 -1802 2417 13008 17677 6530 -7856 -10422 -9934 -5709 4532 1365 430 4240 -10525
6169 -10525 -17006 -7861 -6139 -7905 -6227 -9004 -10622 -21143 -38276 -27681 -15315 -13473 -8537 -2486
6155 -2486 8616 11784 7695 2116 396 1478 -6224 -5805 3895 5864 3699 7386 159 1982 3640
6140 3640 -3815 -11579 -21736 -14267 9447 15291 9541 7796 -3879 -3939 -4726 -8433 -5731 5175 9096
6125 9096 1369 -1966 -280 -18658 -28663 -22900 -15759 -7237 -3867 -8533 -2200 3445 -4352 -9143
6111 -9143 -15796 -7516 -3822 -9504 -6575 -8325 -17937 -4285 -623 -4559 -16126 -20269 -8657 276
6097 276 11728 23657 6137 -3175 -8475 -6506 -4174 -1298 600 9392 16978 -3463 -5215 4093
6083D093J0289l525l083n506j2198P817J387N934K014L601j053K693o960j33j824
6068C546r676N418M580n335p576l316P287J440k569J1805j700R097M961L856j6670
6053E148j1453k0189J597J6491J375K702j646k081P221Q658K369m263L768O31
6039A0328j2972O519j392j8094N565R443l135j3406M741j243J519m472m085o547
6025b7231r714N547J5800j6363R80O628J3809K520o429k578J0170K2220J527l910
6011A2976q126l426p920O478O551k930Q55m518o675j412j3685Q327R805P153J43
5996C596j2391K214R485O478K372r253p106L235J0348p669L904L91n939J885J875
5981C425P29j430j1660n565R797P241j807K29j3218j2017J6012K319j038k795
$$ plain form
6083 4093 14382 10857 7774 2268 -9930 -2113 -726 5208 7222 10823 9770 12463 5503 5370 3546
6068 3546 -6130 -712 3868 -1467 -9043 -12359 -5072 -3632 -6201 5604 3904 13001 17962 21818 5148
6053 5148 -6305 -26494 -24897 -8406 -7031 -4329 -5975 -8056 -835 7823 10192 5929 9697 10328
6039 10328 -2644 3875 2483 -15611 -10046 -603 -3738 -17144 -12403 -13646 -12127 -16599 -20684 -27231
6025 -27231 -36945 -31398 -15598 -31961 -30981 -24353 -10544 -8024 -14453 -17031 -6861 15359 16886 12976
6011 12976 4850 1424 -6496 -18 6533 3603 4458 -60 -6735 -8147 -21832 -13505 -3700 3453 3596
5996 3596 -8795 -6581 2904 9382 11754 2501 -4605 -1370 8978 1309 5213 5604 -335 1550 3425
5981 3425 4154 2724 -8936 -14501 -4704 2537 730 959 -12259 -24276 -8264 -5945 -6983 -9778
5967i778K716M087o369j3648J717J2567Q190J250Q836k608p032j9973q345N226
5953b3164P619P218R15N712O050r503O301K508N170p890r467r625o120K388K1330
5938e58Q245K402j3341j5134N148J4338j2055r712M666J229m052l044j30K353
5924a9645Q875J1604K370j72q027M40p87q4J166p632o602M728Q028K878j720r131
5908a3711j515J1340j529N555p032j769J3762J5444j2665q747o043M3r224r746
5894b5837j1671J9804K4129J341l869N676n529o620q714j2320M208J2917l143
5881i628n942J4225N9o108K074j07j0489l954P133j0311N320Q325O974M882L394
5866E847j1311j5908R223J4769L324M410N940j5062r106J3114j999j378j3211
$$ plain form
5967 -9778 -7062 -2975 -9344 -22992 -21275 -8708 -518 732 9568 6960 -72 -20045 -28390 -23164
5953 -23164 -15545 -8327 -7412 -1700 4350 -5153 1148 3656 8826 936 -8531 -18156 -24276 -21888 -558
5938 -558 7687 10089 -3252 -18386 -13238 1100 -10955 -20667 -16001 -14772 -18824 -21868 -21998 -19645
5924 -19645 -10770 834 3204 3032 -4995 -4555 -5342 -5426 -4260 -11892 -18494 -13766 -5738 -2860 -4580 -13711
5908 -13711 -15226 -3886 -5415 140 -6892 -8661 5101 20545 7880 -867 -6910 -6867 -16091 -25837
5894 -25837 -37508 -17704 6425 7766 3897 9573 4044 -2576 -11290 -23610 -19402 -6485 -9628
5881 -9628 -15570 -1345 -1286 -7394 -5320 -5427 -15916 -19870 -12737 -23048 -17728 -9403 -2429 2453 5847
5866 5847 -5464 -21372 -12149 2620 5944 10354 16294 1232 -7874 5240 3241 1863 -11348
5853a1348j2047K826K3180Q944q495K840n293O882P652j3140j7382Q401M991K758
5839G69K448J0635P330M770j9285k3954j2188J1339R83k411N802O337J4523m074
5825C024m261j3429j2466R237Q245l768m818q430M084Q006k930Q472J1309J197
5811C472j1880j789J616M259K368K297n190j0630j782J1768m862q314L92J0443
5797g832M036l239n489p667J1759L877K433k9l261N59k925N379M964M863K630
5782A0058n889J4616q935j3114n726K542m000p568o651L16L907O895l417p71J2680
5767e057L466O863O447j859N114L394N775j0932k0954l795j1497Q254K901L299
5753h581J7649J1132l33j922j201n629j7887j2013Q04N364Q370m73O681J966j1331
$$ plain form
5853 -11348 -23395 -20569 2611 11555 3060 5900 607 7489 15141 2001 -15381 -6980 -1989 769
5839 769 3217 13852 21182 25952 6667 -17287 -29475 -18136 -17153 -19564 -13762 -7425 7098 3024
5825 3024 -1237 -14666 -27132 -17895 -9650 -13418 -18236 -26666 -22582 -14576 -17506 -9034 2275 3472
5811 3472 -8408 -10197 -8581 -4322 -1954 343 -4847 -15477 -17259 -5491 -10353 -18667 -18275 -7832
5797 -7832 -3796 -7035 -12524 -20191 -8432 -4555 -2122 -2151 -5412 -4853 -7778 -2399 2565 7428 10058
5782 10058 4169 18785 9850 -3264 -8990 -6448 -10448 -18016 -24667 -24351 -20444 -13549 -16966 -17737 -5057
5767 -5057 -1591 5272 11719 9860 14974 18368 24143 13211 -7743 -11538 -23035 -14781 -11880 -8581
5753 -8581 9068 20200 19867 17945 16744 11115 -6772 -18785 -17981 -12617 -4247 -4720 1961 3927 -7404
5738g404L253l85n551O218J0266p58L645P025k958j1350q335j228j963K675n158
5723a2008k310J542J225J7934P352k75O066o842j1273p962L596j974j5512p319
5709b7760J5258J5761J4797j1917j5634j1359J3034J2263o754k194K347N970K934
5696F746p916r354K509k978q6J595N349k427m779J1116k377r197l072J301Q395
5681e175J825J2j3636j1992P368K1938J8541k803o116L391o043m18J4817J059
5667B2768q883o489j0780m743J8636J4291l803q290k2950j0622J64l280p103L429
5653b7655K837J1333J4008j0382p256j749L965O730J3666L339q5M347j6186N335
5639B247K065j8040N18K6652J0578o313M790r972k1879j9689N232J3296J600K136
$$ plain form
5738 -7404 -4151 -4536 -10087 -3869 6397 5639 9284 16309 13351 2001 -6334 -7562 -9525 -6850 -12008
5723 -12008 -14318 -12776 -11551 6383 13735 13460 19526 12684 1411 -6551 -2955 -4929 -20441 -27760
5709 -27760 -12502 3259 18056 6139 -9495 -20854 -7820 4443 -2311 -4505 -2158 3812 6746
5696 6746 -1170 -10524 -8015 -10993 -11079 -9484 -4135 -6562 -11341 -225 -2602 -11799 -14871 -13570 -5175
5681 -5175 -3350 -3338 -16974 -28966 -21598 340 18881 16078 9962 13353 7310 6892 21709 22768
5667 22768 13885 7396 -3384 -8127 10509 24800 20997 12707 -10243 -20865 -20701 -23981 -31084 -27655
5653 -27655 -24818 -13485 523 -9859 -17115 -18864 -14899 -8169 5497 8836 8751 13098 -3088 2247
5639 2247 4312 -13728 -13210 13442 24020 17707 22497 12525 -9354 -29043 -23811 -10515 -8915 -6779
5625f779j856j66l656L755M852J414k455N25L418l331k1401j5738J2526J3434
5611a5458L316J726j959q203k9L273Q229Q122l672m857P1n385j2879L732J1368
5596a2605K466j2149M505M602l609M041r31L569l684O430o178J4046K4113o33
5582B3983q757m195j5994l211Q075L046N454r440r455O272J7319J0806o8j0152
5568A3683j4318R743J2261M276K8L007m852R496j2553j6499M288p26N170l854
5554I150J51q125j6738n976J002J6623p353K114P992J1570M417k9018j5632J0820
5540a9003K0048K870j3269j6814q740N788m785o505K3657P598O67L213J8648K444
5526A5817k16o752o467l727l671J027R824j1151j39O686J032j4557p830L103P332
$$ plain form
5625 -6779 -8635 -8801 -12457 -8702 -3850 -2436 -4891 -4366 -948 -4279 -25680 -41418 -28892 -15458
5611 -15458 -12142 -10416 -12375 -20578 -20607 -17334 -9105 -983 -4655 -9512 -9441 -14826 -27705 -23973 -12605
5596 -12605 -10139 -22288 -17783 -13181 -16790 -12749 -13680 -10111 -13795 -7365 -13543 503 24616 23983
5582 23983 15226 11031 -4963 -8174 -99 2947 8401 -1039 -10494 -4222 13097 23903 23835 13683
5568 13683 -635 9108 21369 25645 25673 28680 23828 33324 20771 4272 8560 7834 13004 9150
5554 9150 9301 1176 -15562 -21538 -20536 -3913 -11266 -9152 -1160 10410 14827 -14191 -29823 -19003
5540 -19003 1045 3915 -9354 -26168 -34908 -29120 -33905 -40410 -16753 -9155 -8488 -5275 13373 15817
5526 15817 15601 8849 2382 -1345 -5016 -3989 5835 -5316 -5455 1231 2263 -12294 -20124 -17021 -9689
5511i689R687J5684L83j3705j2234m846J778Q946K1631M515K44L506j0897j0940
5497D063l979N607L803K423O268m490j0363j0696J28n721M405p521K069J0759
5483c245k950r506k779l460p766J0508K45k509R278J2975k684l309q003O55Q723
5468c827N493J124j1763M059R756J1009N277m846M619l818l13J955M874o046k995
5453A4558L911O724r768N664R00L59j9825L330q110p682k923J2162K4288q426
5439A5162j368j7688j6424J135N742k912J010M957N379l395l9n499L617n01O68
5424a0156N791q562L217Q320l925o867o236J2820Q655m950J3384J0683R585m872
5410B6887p628m101o938l081O186m187o123n494Q348P737J0100j3140j4265n910
$$ plain form
5511 -9689 -2 15682 16065 2360 -9874 -14720 -12942 -3996 17635 22150 22394 25900 15003 4063
5497 4063 84 5691 9494 11917 18185 13695 3332 -7364 -7236 -12957 -8552 -16073 -14004 -3245
5483 -3245 -6195 -15701 -18480 -21940 -29706 -19198 -18953 -21462 -12184 791 -1893 -5202 -13205 -12550 -3827
5468 -3827 1666 2790 -8973 -4914 4842 15851 21128 16282 20901 17083 16770 18725 23599 17553 14558
5453 14558 18469 25193 15425 21089 21989 22348 2523 5853 -2257 -9939 -12862 -700 23588 15162
5439 15162 13794 -3894 -20318 -19183 -13441 -16353 -15343 -10386 -5007 -8402 -8441 -13940 -10323 -10824 -10156
5424 -10156 -4365 -12927 -9710 -1390 -5315 -12182 -18418 -5598 3057 -1893 11491 22174 31759 26887
5410 26887 19259 15158 8220 5139 11325 7138 1015 -4479 3869 11606 21706 8566 -5699 -11609
5396a1609J466O73O750l224j2327n59J3947k051L817Q33r227p920K122Q380M107
5381d822L350L513k478M805M216n714j1208m418K935o043j117N318L771P935O873
5366F916O715m624r443j2981j201k352M539J7761R439j4674j1262J0096K6556
5353B5485k587j0513m082m507q435K140N063j916L288o627L094Q924p95p539R76
5338A969J1021j4831p189M371J925J190M787O909Q218L286p154m463Q420J4187
5324C2646l090k4955j8198j1621J607J3456Q429K160j433K40J0944j2170n616
5311g601j1953M378P902j969P566M572j433j3437J593M336n836J109O457J4609
5297A0293q043o386M279m830L596R478P854p772j8804J762J6868k721q188O703
$$ plain form
5396 -11609 -10143 -9470 -2720 -5944 -18271 -18830 -4883 -6934 -3117 -2284 -11511 -19431 -17309 -8929 -4822
5381 -4822 -1472 2041 -437 4368 8584 2870 -8338 -12756 -9821 -15864 -16981 -11663 -7892 43 6916
5366 6916 13631 9007 -436 -13417 -14618 -16970 -12431 5330 14769 95 -11167 -1071 25485
5353 25485 22898 12385 8303 3796 -4639 -2499 2564 648 3936 -2691 403 9327 8532 993 1969
5338 1969 12990 -1841 -9030 -4659 -2734 -1544 3243 10152 18370 21656 14502 10039 18459 32646
5324 32646 29556 4601 -13597 -25218 -23611 -10155 -1726 434 -999 -759 10185 -1985 -7601
5311 -7601 -19554 -15176 -7274 -9243 -1677 2895 1462 -11975 -10382 -6046 -11882 -10773 -4316 10293
5297 10293 2250 -4136 143 -4687 -1091 8387 16241 8469 -10335 -8573 8295 5574 -2614 4089
5283D089M348j1535j1592j873J2504L025j376Q373J90R64o006j5477j9820Q932
5269b5254p117j116J4283J7435J087O796m474r69j576J4614J858l668k1770j7395
5255b7266R027M204K825o425l880k058m272P726Q947j3075m276M189P978J0878
5241e478J470p259l674J7872n28p871j484j516L858J687Q788N718k596o848m192
5226b053m889l78M563K111M349M433Q726j920K41k776k3235j3187Q823q36P840
5211h188m048K480L027O123j739N178R158j446q116n031M762P712P762j3663n258
5196a287J303J431J312M592P74P911j0698m246K0283J5837j4595k7301m547m18
5182i649j0719L394M848M408K789K030n359q628K626p299j690K3005J5301o71
$$ plain form
5283 4089 8437 -3098 -14690 -16563 -4059 -1034 -2410 5963 6153 7117 1111 -14366 -34186 -25254
5269 -25254 -32371 -33487 -19204 -1769 -682 6114 1640 671 -905 13709 15567 11899 -9871 -27266
5255 -27266 -18239 -14035 -11210 -17635 -21515 -23573 -27845 -20119 -11172 -24247 -28523 -24334 -16356 -5478
5241 -5478 -4008 -11267 -14941 2931 2403 -5468 -6952 -8468 -4610 -2923 5865 11583 8987 2139 -2053
5226 -2053 -6942 -7320 -2757 -646 3703 8136 16862 14942 15183 12407 -10828 -24015 -15192 -16028 -8188
5211 -8188 -12236 -9756 -6729 -606 -2345 2833 11991 10545 2429 -2602 2160 9872 17634 3971 -1287
5196 -1287 16 1447 2759 7351 8125 16036 5338 1092 21375 37212 22617 -4684 -9231 -9649
5182 -9649 -20368 -16974 -12126 -7718 -4929 -2899 -8258 -16886 -14260 -21559 -23249 -244 15057 14386
5168A4386q766p134P98j040L112p024j323N86J4358L184j3087Q11q364R515O737
5153F749n664k089k771j217L494N804L534j0181q048j5672r307L314J4346J796
5139a5912p681q459M75K6248J7445l917l262k874l498k466q980j125J1535L909
5125A438l324n472j3042J8371L417j10M076J3002J7660o481n202n358j3743r697
5111d465Q113R844j2270q532J0854J735J306o268n434l166J2906j553j9057l319
5097a9306J3959J2006J990m771N200j2063j6269R728N555J1187j1839j909J8047
5084A1515L222p270j3440j0882q93n403J4966J9510J4052p419j6606j8808M54
5071a7002L642R881J6556j0411n716l134m809j5529M303J7244K599n898O024J3375
$$ plain form
5168 14386 5620 -1514 -716 -1756 1356 -5668 -6991 -6405 7953 11137 -1950 -1139 -9503 12 6749
5153 6749 1085 -1004 -3775 -4992 -1498 4306 7840 -2341 -10389 -26061 -35368 -32054 -17708 -15912
5139 -15912 -23593 -32052 -31577 -5329 12116 8199 4937 2063 -1435 -3901 -12881 -14006 -2471 1438
5125 1438 -1886 -7358 -20400 -2029 1388 1278 5354 18356 36016 29535 24333 18975 5232 -4465
5111 -4465 3648 13492 1222 -7310 3544 5279 6585 317 -5117 -8283 4623 3070 -15987 -19306
5097 -19306 -5347 6659 8649 3878 9078 -2985 -19254 -9526 -3971 7216 -4623 -6532 11515
5084 11515 14737 7467 -5973 -16855 -17748 -23151 -8185 11325 25377 17958 1352 -17456 -17002
5071 -17002 -13360 -3479 13077 2666 -3050 -6184 -10993 -26522 -22219 -4975 -2376 -8274 -2250 11125
5057A1125j4034j392P848L61N76m544j0301L028J793l078O013j50m64J7604J698
5042A6083j6823k1500M916J4571k246P438p283j0102P510J0913n152j633J003
5029b305m242M136J5094j3257j0358l014k302j309R013J0360J245l087j2438M715
5015g749J3356P435j0299K301m156K49R649q573r930J3188r964j2477j4931P901
5001b4000N251r606j1429L303M256q9r689M618R854J8259n119k909k231j0456
4987b9987J5829N41j119P790j418l656j4773k165O581O764K0959P852r137J0772
4973A4833Q146j9294L017j0811n746J7456Q167j0321j8835o214K0642J0409j4696
4960c247j2149N598J1874j994M693P195q458m294l563P667r968k272j295K080
$$ plain form
5057 11125 -2909 -4301 3547 3908 4484 -60 -10361 -7333 -5540 -8618 -2605 -2755 -3219 14385 16083
5042 16083 -740 -22240 -17324 -2753 -4999 2439 -4844 -14946 -7436 3477 -1675 -3308 -2305
5029 -2305 -6547 -2411 12683 -574 -10932 -13946 -16248 -17557 -8544 1816 3061 -26 -12464 -7749
5015 -7749 5607 13042 2743 5044 888 1137 10786 2213 -7717 5471 -4493 -16970 -31901 -24000
5001 -24000 -18749 -28355 -39784 -36481 -32225 -32314 -42003 -37385 -27531 -9272 -14391 -17300 -19531 -29987
4987 -29987 -14158 -13617 -14736 -6946 -8364 -12020 -26793 -28958 -22377 -15613 5346 13198 4061 14833
4973 14833 22979 3685 6702 -4109 -9855 7601 15768 5447 -13388 -19602 1040 11449 -3247
4960 -3247 -15396 -9798 2076 82 4775 11970 3512 -782 -4345 3322 -6646 -8918 -10213 -8133
4946h133J065J0379O966n593J845j4535m26J7968m482p844N492J626l186l095
4932a953J810p147q90O96N646l494L877M746L406n22K808n40o311K556M1q518
4916c789j3512K133J1773l00nR452N50J507Q117j0660m25O82L336N59p456o607
4900d645Q79j0099p32M873J4663K402J145o587M936P465j4034j804K919N113N517
4885A2011N982N540K934p689m837N934j0071p106M87N88J4986J632m571J972m542
4870A3250q723n420J6022O69q996M946N018J0348l460L015r734k1499o600l169
4856a4333J264J5604J0284J918P51j1863K514j534j158m98k1683j3189R603J7812
4842d508J3003J865j7269q527k156R951L210o611K567K077K034P356Q704r798
$$ plain form
4946 -8133 -7068 3311 10277 4684 6529 -8006 -8432 9536 5054 -2790 2702 4328 1142 -1953
4932 -1953 -143 -7290 -8180 -7484 -1838 -5332 -1455 3291 6697 6175 8983 8443 2132 4688 4729 -3789
4916 -3789 -17301 -15168 -3395 -3695 -3700 5752 6302 7809 15926 5266 4841 5523 8859 9418 1962 -4645
4900 -4645 -3766 -13865 -14597 -9724 4939 7341 8486 1899 6835 14300 266 -1538 1381 6494 12011
4885 12011 17993 23533 26467 18778 13941 19875 9804 2698 3185 3773 18759 20391 15820 17792 13250
4870 13250 4527 -893 15129 15798 6802 11748 16766 27114 23654 26669 16935 -4564 -11164 -14333
4856 -14333 -13069 2535 12819 14737 15488 3625 6139 4605 3447 2949 -18734 -31923 -22320 -4508
4842 -4508 8495 10360 -6909 -15436 -17592 -7641 -4431 -11042 -8475 -6398 -4364 2992 11696 1898
4828A898j6439Q951M560L008j34N872q016j3235j618p356M172K836J6454M674
4814E627J581K423j1380j0785j825O722N059P121j0090O464O413p405O932J238
4800H095q588q997J624N234J2259q667r491m490q59O139r87k525M321p087J0232
4785c787Q233J3112K739j1519K187J517M20n305p382q57J143K514k509Q70R64
4770B340j641j816J0034o396k3690J410m134o486J5340J5248l988n735J602R054
4756A142j0650k0596q377J1376J2690n473l765J4774O072M916l053l026O364M490
4742F884R888L878p278k0116n025j361K108j028q896P845R291k765j4404q655
4728b9634l047R513J1202J4158K180N75j0240J3248O279o323q474p196J7579L754
$$ plain form
4828 1898 -14541 -5590 -1030 1978 1844 7716 -300 -13535 -15153 -22509 -18337 -15501 953 5627
4814 5627 7208 9631 -1749 -12534 -14359 -7637 -2578 4543 -5547 917 7330 -75 6857 8095
4800 8095 -493 -9490 -7866 -2632 9627 960 -8531 -13021 -13880 -7741 -8728 -11253 -6932 -14019 -3787
4785 -3787 4446 17558 20297 8778 10965 12482 12902 7597 215 -642 501 3015 506 1376 2340
4770 2340 699 -1117 8917 2521 -21169 -19759 -23893 -30379 -15039 209 -3779 -9514 -7912 1142
4756 1142 -9508 -30104 -38481 -27105 -14415 -19888 -23653 -8879 -2807 2109 -944 -3970 2394 6884
4742 6884 16772 20650 13372 -6744 -11769 -13130 -11022 -12050 -20946 -13101 -3810 -6575 -20979 -29634
4728 -29634 -32681 -23168 -11966 2192 4372 4947 -5293 7955 14234 7911 -563 -7759 9820 13574
4714A3574o814M951o878j296m858P594n135J0834J492m345j3686j0997j3006O285
4700b2285K1447J2475J1977m282K219L0j0455L16o119P364J1236k024L933L497
4686B9329J252O884m475o551p237p395J167j5113l3J4814J865j1151j0421j517
4672h582Q281Q831o740m060J0544O256k19O836N40o575l129k0318n72O316O301
4657C710J305N275J3860J4082m033j7468k0880l965N29m172K432M29j1710K510
4643a8096Q839R943P617P429O241k215r966j621m579j0174j6052J550J6735P472
4629C123j6061n442o406K236k8P631R758J240K259K6q93J0261j111o892n894J4006
4613G813r8l473k027o975n747j4588M195Q398j4280m10J5957J3366J685m382j5067
$$ plain form
4714 13574 6760 11711 4833 3537 -1321 6273 1138 11972 13464 9119 -4567 -15564 -28570 -22285
4700 -22285 -838 11637 23614 19332 21551 21581 11126 11442 5323 12687 23923 21899 25832 29329
4686 29329 30581 37465 32990 26439 19202 11807 12974 -2139 -2172 12642 14507 3356 -7065 -8582
4672 -8582 -301 8530 1790 -2270 8274 14530 14311 21147 21687 15112 11983 -8335 -8907 -2591 3710
4657 3710 5015 10290 24150 38232 34199 16731 -4149 -8114 -7585 -11757 -9325 -8896 -20606 -18096
4643 -18096 -9257 686 8303 15732 21973 19758 9792 8171 3592 -6582 -22634 -21084 -4349 3123
4629 3123 -12938 -18380 -24786 -22550 -22578 -14947 -5189 -3949 -1690 -1664 -2557 7704 6593 -299 -6193 7813
4613 7813 7715 4242 2215 -4760 -10507 -25095 -20900 -12502 -26782 -27192 -11235 2131 3816 -566 -15633
4598a5633K050j606m051O39N607J5573L688R04p299m888K418O847O327P223J556
4583A9355m509j1552J3N229r206q407J523J5626Q634P541j0433k275O56j6317
4569d122p481L964O053P558j0315l9j774R494m230K890o923j0488k742o019M063
4554b0111P218R978k923r855k072P52j011m672N218J1765P805O48j6383j2098
4540b5741L262N129J501j921O110N446j0799K158N435R868j874j6542j1330P105
4526b2193K050J702O368j529R250K0638p039n688L653r751Q55O601M947l123j1951
4511e210m872j691k49Q944N702P266Q862K780j9675J0395J0689r037n687J044
4497I261j9688M770J2942K993o099M339j2191M801Q182M10n774q54O52k392m483
$$ plain form
4598 -15633 -13583 -15189 -19240 -18601 -12994 2579 6267 7171 -128 -5016 -2598 4249 10576 17799 19355
4583 19355 14846 3294 3307 8536 -670 -9077 -7554 8072 16706 24247 13814 11539 12195 -4122
4569 -4122 -11603 -7639 -1586 5972 -4343 -4382 -6156 3338 -892 1998 -4925 -15413 -18155 -24174 -20111
4554 -20111 -12893 -2915 -5838 -15693 -17765 -17013 -18024 -22696 -17478 -5713 2092 2740 -13643 -25741
4540 -25741 -22479 -17350 -15849 -17770 -11660 -6214 -17013 -14855 -9420 448 -1426 -17968 -29298 -22193
4526 -22193 -20143 -18441 -12073 -13602 -4352 16286 9247 3559 7212 -2539 -1684 4917 9864 6741 -5210
4511 -5210 -10082 -11773 -12022 -3078 2624 9890 18752 21532 1857 12252 22941 13904 8217 9261
4497 9261 -10427 -5657 7285 10278 4179 8518 -3673 1128 9310 9720 3946 3092 3744 1352 -3131
4482c131q42j2997p046M75J3685J952J161J2094k245Q000M429n027j6251k850
4468h593J273J5351M559j0991n659L961m160J3028P017k273R44J4722q700L503
4454B3982L925j1544j3840j8811P00K251O810N623m321N259M79J417k845p053
4440g968k188j035p38J906p47j671R612Q417m693M086r586o944Q632n579m56L880
4424e072J281r713k154Q711O788K919o385o228J994P470J2109k928j4935m03R961
4409C415J3630O282n211k2475k153M589n010m03J139J5016Q742o377J0027Q94
4395B2105K644j6722j3076q569j88j301l139O860J8843K2223q732k0925J877l363
4381a463J0864k373l99R598p030j1590o847q958j0927P660J5670J0199Q956o134
$$ plain form
4482 -3131 -3973 -16970 -24016 -23541 -9856 -7904 -6743 5351 3106 11106 15535 10508 -5743 -8593
4468 -8593 -7320 8031 12590 1599 -4060 -99 -4259 8769 15786 13513 14457 29179 20479 23982
4454 23982 27907 16363 2523 -16288 -15588 -13337 -6527 -904 -5225 34 513 1930 -915 -7968
4440 -7968 -10156 -11191 -11929 -10023 -10770 -12441 -2829 5588 895 4981 -4605 -11549 -2917 -8496 -8952 -5072
4424 -5072 -3791 -13504 -15658 -6947 -159 2760 -3625 -9853 -7859 -389 11720 8792 -6143 -6546 3415
4409 3415 17045 23327 18116 -4359 -6512 -1923 -6933 -7336 -6197 8819 17561 11184 21211 22105
4395 22105 24749 8027 -5049 -13618 -13806 -15107 -18246 -11386 7457 29680 20948 23 1900 -1463
4381 -1463 9401 7028 6629 16227 9197 -2393 -9240 -18198 -29125 -21465 -5795 4404 13360 7226
4367G226r236p820J1614J1212m78j0216r806o040J5474P687n492m84n925n367
4353g651j814p04M264l81L377L390k173R225j0084l959P215K196n192R645p494
4338a40N535P140n424j619j0517m227L740k792J859J5252m894p506R21N342K1916
4323B4586q113j7502K059k137o83O841O038P178r353n536N6r480j244O907J4097
4308A3714j691o377r291N805j3415m737m818N634J3380k168n118o687j6492O199
4294b6062J3347j5070l368J5835Q172m769J25K934P378j821L868j761o217n905
4280a3314j895J5646J594r295N533J3043M344J2073M709n802M5o326j0011q722
4266A622M797j835L682O829m02J282l101l587M670n662o509k992Q040Q487r986
$$ plain form
4367 7226 -2010 -9830 1784 12996 12518 2302 -7504 -13544 1930 9617 4125 3641 -2284 -7651
4353 -7651 -9465 -10169 -5905 -6286 -2909 481 -1692 7533 -2551 -6510 705 2901 -2291 7354 -140
4338 -140 5395 12535 7111 5492 -5025 -9252 -5512 -8304 -6445 8807 3913 -3593 -2672 2670 24586
4323 24586 16473 -1029 1030 -1107 -1790 5051 11089 18267 8914 3378 3434 -6046 -7290 -383 13714
4308 13714 12023 5646 -3645 2160 -11255 -15992 -20810 -15176 -1796 -3964 -9082 -15769 -32261 -26062
4294 -26062 -12715 -27785 -31153 -15318 -7146 -11915 -11790 -8856 -1478 -3299 569 -1192 -7409 -13314
4280 -13314 -15209 437 2031 -7264 -1731 11312 15656 27729 32438 26636 26681 20355 10344 1622
4266 1622 6419 4584 8266 15095 14693 15975 12874 9287 13957 8295 1786 -1206 6834 15321 5335
4251E335q251l675Q572P225j443K48n009O590M348p337k055J7495k720r767j3855
4236d299j5516Q452J1315Q333q48L955j7972q805n777J079Q030q344l684m67P407
4221a7141K1036P183o430n18k741K099r61k709N15j2043o476n669M654J3384n086
4206a0903L890p747j341N034N275J0917p15r393q341k966J764K059j549J797O9
4191a2150j0790m453J4868J0611m792n039J2207J3756j0642l094M294k95l113
4178A368J45k746l348o249r901l465L1330J3718K66j8476j0533j4072p04J7300
4164e367n300m083k494J587Q798p221j3886m57J1395R197p86J4190K2367j8348
4150I592k3262o712P513J4339n993O728O857n568j2746p815m410J1479J1412N365
$$ plain form
4251 5335 -2916 -6591 1981 9206 7763 8011 3002 9592 13940 6603 4548 22043 19323 9556 -4299
4236 -4299 -19815 -11363 -48 8285 7437 11392 -6580 -15385 -21162 -20083 -12053 -20397 -24081 -24548 -17141
4221 -17141 3895 11078 4648 4130 1389 3488 2527 -182 333 -11710 -18186 -23855 -19201 -5817 -10903
4206 -10903 -7013 -14760 -16101 -11067 -5792 5125 4410 -4983 -13324 -16290 -14526 -12467 -14016 -12219 -12150
4191 -12150 -22940 -27393 -12525 -1914 -6706 -11745 462 14218 3576 482 4776 4481 1368
4178 1368 1513 -1233 -4581 -10830 -20731 -24196 7134 20852 21118 2642 -7891 -21963 -22667 -5367
4164 -5367 -10667 -14750 -17244 -15657 -6859 -14080 -27966 -28423 -17028 -7831 -8617 5573 27940 9592
4150 9592 -13670 -20382 -12869 1470 -4523 2205 9062 3494 -9252 -17067 -21477 -9998 1414 6779
4136F779q988L731p56K330r226J452N494j75K735n970j0639p154n76N941M804
4121a0218n510J5748J7743l08j6375o549j1891M98P675J037K724J1647n020n622
4107d421o243k288L654J2001Q975J3660m784k910k496j2200n391L54m635j0220
4093a6944M233O121o713p383O391M188m025J1302P808O178r486j0276J2701R63
4079E058j0302j2126L389J4932L816r42J497O518L482m181p856n519k150j907
4065f291L379j561r052O017m58P79P724n135J162J5171R29j3248j5308j9764m000
4050c9656J582J3695K1687K078q772J0876J0218p964p758k391n358o012L766n449
4036a9458M303J0727J2812O45k284o433J88m445J1600Q537L499m904n500k0985
$$ plain form
4136 6779 -2209 1522 766 3096 -6130 -4678 816 641 3376 -2594 -13233 -20387 -20963 -15022 -10218
4121 -10218 -15728 20 17763 17455 1080 -5469 -17360 -16862 -9187 -8150 -5426 6221 1201 -4421
4107 -4421 -10664 -12952 -9298 2703 11678 25338 20554 17644 15148 2948 -2443 -2089 -6724 -16944
4093 -16944 -12711 -6590 -13303 -20686 -14295 -10107 -14132 -2830 4978 11156 1670 -8606 4095 5058
4079 5058 -5244 -17370 -13981 951 4767 3825 5322 11840 15322 11141 3285 -2234 -4384 -6291
4065 -6291 -2912 -4473 -13525 -7508 -7966 -7187 537 -4598 -3436 11735 12664 -584 -15892 -35656 -39656
4050 -39656 -38074 -24379 -2692 -614 -9386 1490 11708 3744 -4014 -6405 -11763 -17775 -14009 -19458
4036 -19458 -15155 -4428 8384 9029 6745 312 500 -3945 7655 16192 19691 14787 9287 -11698
4022a1698j1807q586k71J7833J1527J8405L787q757q260j6157n806J460m21J3291
4008e460L47J1964J2100k312j5254j1469Q11L219K54n927M963K020O584q13n115
3993d088Q40o594n977K52r704k77j035K0758J3004j1210r485n931P525J0749P105
3978E932O951p784j1232m377R167J058k560K305P667o045j3261j049L112j2424
3964b2540n672p07K814M835O632j0405N982J6621K939K40J5211L202j9448r273
3950i569L410L278m46j4589j086l442K842J0320j5187J488Q390K1759N059l254
3936H973M091r86m136l127l826q730L074j66o05M268J3127N762j6933q400r619
3921a7233Q616Q953M260n31N303j080o631l224m156M91o963K133M055M219N447
$$ plain form
4022 -11698 -23505 -32091 -32362 -14529 -3002 15403 19190 10433 2173 -13984 -19790 -18330 -18751 -5460
4008 -5460 -5113 6851 18951 16639 1385 -10084 -9273 -6054 -5800 -11727 -6764 -4744 1840 1027 -4088
3993 -4088 -3248 -9842 -15819 -15567 -25271 -25548 -26583 -5825 7179 -4031 -13516 -19447 -11922 -1173 5932
3978 5932 12883 5099 -6133 -10510 -1343 -285 -2845 -540 7127 1082 -12179 -13228 -10116 -22540
3964 -22540 -28212 -28919 -26105 -21270 -14638 -25043 -19061 -2440 499 739 15950 19152 -296 -9569
3950 -9569 -6159 -2881 -3327 -17916 -19002 -22444 -19602 -9282 -24469 -22981 -14591 7168 12227 8973
3936 8973 13064 12078 7942 4815 989 -7741 -4667 -4833 -5438 -1170 11957 17719 786 -7614 -17233
3921 -17233 -8617 336 4596 4065 9368 8288 1657 -1567 -5723 -5232 -12195 -10062 -6007 -1788 3659
3906C659O1j316j1881j9240R4O488J6399P279O864N921Q457o268O084K0719o52
3891D2668j3444j937j0m430J689q548O093k011j3016j7072j7217J9765L070O212
3877A812J789J296Q697m411p576j3519n336J222O441R906L610j1399o23J6069
3863G978q169j5951K349J383M007J0870N816l528J319k513p547j1384j2640k746
3849c0756M99J5122K1018J5405J175p462J5184j5342k0367R134J0348j7399j841
3836e282J6475R597Q248Q659J386r352j6335J338n738n444J188M919Q376j386
$$ plain form
3906 3659 3720 2404 -9477 -28717 -28623 -22135 -5736 1543 8407 14328 22785 16517 22601 43320 42668
3891 42668 29224 27287 27277 22847 24536 15988 22081 20070 7054 -10018 -27235 -7470 -4400 1812
3877 1812 3601 4897 13594 9183 1607 -11912 -17248 -16026 -9585 321 3931 -7468 -8091 7978
3863 7978 -191 -16142 -13793 -12410 -8403 2467 8283 4755 6074 3561 -3986 -15370 -28010 -30756
3849 -30756 -30257 -15135 5883 21288 22463 15001 30185 14843 -5524 3610 13958 -3441 -5282
3836 -5282 11193 20790 29038 37697 39083 29731 13396 14734 8996 3552 4740 9659 18035 16649
$$ [...]
##END NTUPLES=NMR SPECTRUM
##END=
