##TITLE=Analysis number 318935
Compound Code ac 25995
Project Code adrs
Chemist Name acros
##JCAMPDX= 6.0         $$ Bruker NMR JCAMP-DX V2.0
##DATA TYPE= NMR SPECTRUM
##DATA CLASS= NTUPLES
##ORIGIN= Bruker BioSpin GmbH
##OWNER= nmr
$$ XWIN-NMR		Version 3.5
$$ Tue Apr 25 12:18:16 2006 GMT Daylight Time (UT+1h)  MAYBRIDGE\nmr@NMR_250MHZ
##.OBSERVE FREQUENCY= 250.131544655141
##.OBSERVE NUCLEUS= ^1H
##.ACQUISITION MODE= SIMULTANEOUS (DQD)
##.ACQUISITION SCHEME= undefined
##.AVERAGES= 16
##.DIGITISER RES= 18
##SPECTROMETER/DATA SYSTEM= dpx250
##.PULSE SEQUENCE= zg30
##.SOLVENT NAME= DMSO
##.SHIFT REFERENCE= (INTERNAL, DMSO, 0, 16.522)
##AUDIT TRAIL= $$ (NUMBER, WHEN, WHO, WHERE, WHAT)
$$ ##TITLE= Audit trail, XWIN-NMR		Version 3.5
$$ ##JCAMPDX= 5.01
$$ ##ORIGIN= Bruker BioSpin GmbH
$$ ##OWNER= nmr
$$ C:\u/data/dgb/nmr/ADRS/2980/pdata/1/auditp.txt
$$ ##AUDIT TRAIL=  $$ (NUMBER, WHEN, WHO, WHERE, WHAT)
(   1,<2006-04-25 12:17:51.61 +100>,<MAYBRIDGE\nmr>,<NMR_250MHZ>,
      <created by zg, POWCHK disabled, PULCHK disabled
       configuration hash MD5:
       84 BC 41 DB A1 6E 1D 46 DA 25 12 A5 C1 ED C5 3A
       data hash MD5: 64K
       C1 74 8E C5 17 0A 6A 7E 71 C9 DB 0A 18 8E D9 50>)
(   2,<2006-04-25 12:18:07.87 +100>,<MAYBRIDGE\nmr>,<NMR_250MHZ>,
      <Start of raw data processing
       ef LB = 0.3 FT_mod = 6 PKNL = 1 SI = 32K 
       data hash MD5: 32K
       A7 C7 02 9F 54 A9 CD 18 BE 2C B6 84 4E 71 C1 98>)
(   3,<2006-04-25 12:18:09.76 +100>,<MAYBRIDGE\nmr>,<NMR_250MHZ>,
      <apk 
       data hash MD5: 32K
       1C E3 05 20 6D 41 F0 17 11 B3 0E 02 51 C0 2F 51>)
(   4,<2006-04-25 12:18:10.50 +100>,<MAYBRIDGE\nmr>,<NMR_250MHZ>,
      <abs ABSG = 5 
       data hash MD5: 32K
       BE 14 E3 9B AE 7F 18 E3 51 25 63 7D C2 9E 38 60>)
$$ ##END=
$$ 
$$ hash MD5
$$ 8B E0 A3 50 7F EE 4B 73 42 0D DE 55 29 ED 98 79
##$RELAX= 
##$RELAX= 
##$RELAX= 
##$RELAX= 
##$RELAX= 
##$RELAX= 
##$RELAX= 
$$ Bruker specific parameters
$$ --------------------------
##$DU= <C:\u>
##$EXPNO= 2980
##$NAME= <ADRS>
##$PROCNO= 1
##$TYPE= <nmr>
##$USER= <dgb>
##$AMP= (0..31)
100 100 100 100 100 100 100 100 100 100 100 100 100 100 100 100 100 100 
100 100 100 100 100 100 100 100 100 100 100 100 100 100 
##$AQSEQ= 0
##$AQ_mod= 3
##$AUNM= <au_zg>
##$AUTOPOS= <27 >
##$BF1= 250.13
##$BF2= 250.13
##$BF3= 250.13
##$BF4= 250.13
##$BF5= 500.13
##$BF6= 500.13
##$BF7= 500.13
##$BF8= 500.13
##$BYTORDA= 1
##$CFDGTYP= 0
##$CFRGTYP= 5
##$CHEMSTR= <none>
##$CNST= (0..31)
1 1 145 1 1 1 1 1 1 1 1 1 1 1 1 1 1 1 1 1 1 1 1 1 1 1 1 1 1 1 1 1 
##$CPDPRG= <>
##$CPDPRG1= <>
##$CPDPRG2= <>
##$CPDPRG3= <>
##$CPDPRG4= <mlev>
##$CPDPRG5= <mlev>
##$CPDPRG6= <mlev>
##$CPDPRG7= <mlev>
##$CPDPRG8= <mlev>
##$CPDPRGB= <>
##$CPDPRGT= <>
##$D= (0..31)
0 1 0 0 0 0 0 0 0 0.06 0 0 0 0 0 0 0.0002 0 0 0 0 0 0 0 0 0 0 0 0 0 0 
0 
##$DATE= 1145963870
##$DBL= (0..7)
120 120 120 120 120 120 120 120 
##$DBP= (0..7)
150 150 150 150 150 150 150 150 
##$DBP07= 0
##$DBPNAM0= <>
##$DBPNAM1= <>
##$DBPNAM2= <>
##$DBPNAM3= <>
$$ [...]
##$SUBNAM7= <"">
##$SUBNAM8= <"">
##$SUBNAM9= <"">
##$SW= 20.6930455092707
##$SWIBOX= (0..15)
0 0 3 0 0 0 0 0 0 0 0 0 0 0 0 0 
##$SW_h= 5175.983436853
##$TD= 65536
##$TD0= 1
##$TE= 295.16
##$TE2= 300
##$TE3= 300
##$TEG= 300
##$TL= (0..7)
0 120 120 120 120 120 120 120 
##$TP= (0..7)
150 150 150 150 150 150 150 150 
##$TP07= 0
##$TPNAME0= <>
##$TPNAME1= <>
##$TPNAME2= <>
##$TPNAME3= <>
##$TPNAME4= <>
##$TPNAME5= <>
##$TPNAME6= <>
##$TPNAME7= <>
##$TPOAL= (0..7)
0.5 0.5 0.5 0.5 0.5 0.5 0.5 0.5 
##$TPOFFS= (0..7)
0 0 0 0 0 0 0 0 
##$TUNHIN= 0
##$TUNHOUT= 0
##$TUNXOUT= 0
##$USERA1= <user>
##$USERA2= <user>
##$USERA3= <user>
##$USERA4= <user>
##$USERA5= <user>
##$V9= 5
##$VALIST= <valist>
##$VCLIST= <CCCCCCCCCCCCCCC>
##$VD= 0
##$VDLIST= <DDDDDDDDDDDDDDD>
##$VPLIST= <PPPPPPPPPPPPPPP>
##$VTLIST= <TTTTTTTTTTTTTTT>
##$WBST= 1024
##$WBSW= 4
##$XGAIN= (0..3)
0 0 0 0 
##$XL= 0
##$YL= 0
##$YMAX_a= 387205
##$YMIN_a= -583577
##$ZGOPTNS= <>
##$ZL1= 120
##$ZL2= 120
##$ZL3= 120
##$ZL4= 120
##$ABSF1= 16.522
##$ABSF2= -4.171173
##$ABSG= 5
##$ABSL= 3
##$ALPHA= 0
##$AQORDER= 0
##$ASSFAC= 0
##$ASSFACI= 0
##$ASSFACX= 0
##$ASSWID= 0
##$AUNMP= <proc_1d>
##$AZFE= 0.1
##$AZFW= 0.1
##$BCFW= 0
##$BC_mod= 0
##$BYTORDP= 0
##$COROFFS= 0
##$CY= 12.5
##$DATMOD= 1
##$DC= 0
##$DFILT= <>
##$DTYPP= 0
##$F1P= 14.0000005364418
##$F2P= -0.99999901652339
##$FCOR= 0.5
##$FTSIZE= 32768
##$FT_mod= 6
##$GAMMA= 0
##$GB= 0
##$INTBC= 1
##$INTSCL= 1
##$ISEN= 128
##$LB= 0.3
##$LEV0= 0
##$LPBIN= 0
##$MAXI= 10000
##$MC2= 0
##$MEAN= 0
##$ME_mod= 0
##$MI= 0
##$NCOEF= 0
##$NC_proc= -6
##$NLEV= 6
##$NOISF1= 0
##$NOISF2= 0
##$NSP= 0
##$NTH_PI= 0
##$NZP= 0
##$OFFSET= 16.522
##$PC= 1
##$PHC0= 151.8129
##$PHC1= 12.76166
##$PH_mod= 1
##$PKNL= yes
##$PPARMOD= 0
##$PSCAL= 4
##$PSIGN= 0
##$REVERSE= no
##$SF= 250.13
##$SI= 32768
##$SIGF1= 0
##$SIGF2= 0
##$SINO= 400
##$SIOLD= 32768
##$SREGLST= <1H.DMSO>
##$SSB= 0
##$STSI= 32768
##$STSR= 0
##$SW_p= 5175.98343685301
##$SYMM= 0
##$S_DEV= 0
##$TDeff= 65536
##$TDoff= 0
##$TI= <Analysis number 999999
Compound Code 99
Book Reference 9
Project Code 9>
##$TILT= no
##$TM1= 0
##$TM2= 0
##$TOPLEV= 0
##$USERP1= <user>
##$USERP2= <user>
##$USERP3= <user>
##$USERP4= <user>
##$USERP5= <user>
##$WDW= 1
##$XDIM= 32768
##$YMAX_p= 400054433
##$YMIN_p= -891919
$$ End of Bruker specific parameters
$$ ---------------------------------
##NTUPLES= NMR SPECTRUM
##VAR_NAME=  FREQUENCY,     SPECTRUM/REAL,   SPECTRUM/IMAG
##SYMBOL=    X,             R,               I
##VAR_TYPE=  INDEPENDENT,   DEPENDENT,       DEPENDENT
##VAR_FORM=  AFFN,          ASDF,            ASDF
##VAR_DIM=   32768,         32768,           32768
##UNITS=     HZ,            ARBITRARY UNITS, ARBITRARY UNITS
##FACTOR=    0.157963299565203, 1,           1
##FIRST=     4132.6476996994, 0,             0
##LAST=      -1043.33573715361, 0,           0
##MIN=       -1043.33573715361, -891919,     0
##MAX=       4132.6476996994, 400054433,     0
$$ Real data points
##PAGE= N=1
##DATA TABLE= (X++(R..R)), XYDATA
$$ [...]
15361H0465j58219J5443j01174K4740J85952P6715N9225l5992k08313L726M9963
$$ 80465 -77754 -62311 -163485 -138745 47207 123922 183147 147155 -61158 -57432 -7469
15350g469l7750J05131J7426q7997k44488R0963K58865P1303j8449k63595k74948
$$ -7469 -45219 59912 77338 -10659 -255147 -164184 94681 165984 147535 -116060 -391008
15339c91008K60856J18283j37311J68262M1102J39336p5208p962k9238j89460
$$ -391008 -130152 -11869 -149180 19082 60184 199520 124312 116350 87112 -102348
15329a02348q7862J1349n0589J19652j05269L440J13249O6207N6038j01124O1387
$$ -102348 -190210 -178861 -229450 -109798 -215067 -211627 -98378 -32171 23867 -77257 -15870
15318a5870J30526n0095j2956j78825j88276O6903N7067K9523J44703K42462P5300
$$ -15870 114656 64561 51605 -127220 -315496 -248593 -191526 -162003 -17300 225162 300462
15307C00462O2765P7754o9926k767m6851q0439k38610j843J02908J37069O6650
$$ 300462 363227 440981 371055 368288 321437 240998 2388 545 103453 240522 307172
15296C07172m2596r0016l2387j4101J87504l7275j4921J95746o0485J3739J3905
$$ 307172 264576 174560 142173 128072 315576 278301 263380 459126 398641 412380 426285
15285D26285P6311O2593l4705j52411j48169j08303o1940r425j69549N5430O1904
$$ 426285 502596 565189 530484 378073 229904 121601 59661 50236 -119313 -63883 -1979
15274a979r855P1355P854j47489L8193Q6721j01556N0887M2675m840r0955n6570
$$ -1979 -11834 59521 67375 -80114 -41921 44800 -56756 -5869 36806 31966 -58989 -115559
15262a15559j41385j71014k8562K01602J87901N5311o0284m8051K5077j2208J01496
$$ -115559 -256944 -427958 -456520 -254918 -67017 -11706 -71990 -120041 -94964 -107172 -5676
15251e676J44032l1657J7134k93139k20019M3451K17791J56299J24047k79926
$$ -5676 138356 106699 123833 -169306 -389325 -345874 -128083 28216 152263 -127663
15241a27663j29178o3980J46683K57863n4705Q8327p3701k22771l7988J11089
$$ -127663 -256841 -320821 -174138 83725 29020 117347 43646 -179125 -217113 -106024
15231a06024k14486N0834J89089Q9085N3052l4890j05540J05518J16285N6093
$$ -106024 -320510 -269676 -80587 8498 61550 26660 -78880 26638 142923 199016
15221A99016j87501l51983n1792J28354N8249L4849K44978J29679M3776j55786
$$ 199016 11515 -340468 -392260 -263906 -205657 -170808 74170 203849 247625 91839
15211I1839j88110O8365N2887k2785n6391l2165J39206O4999k4300j8902k0496
$$ 91839 -96271 -27906 24981 2196 -54195 -86360 52846 117845 93545 74643 54147
15200E4147J32669J5803j12864l0472J499j58318j47216L6000R3945K9967j8063
$$ 54147 186816 202619 89755 59283 60782 -97536 -244752 -208752 -114807 -84840 -102903
15189a02903j20906p5565n53J36021K14921r953m5719O5030L3992J6027r7692
$$ -102903 -223809 -299374 -299927 -163906 51015 41062 -4657 60373 94365 110392 12700
15178A2700q6736j43594P2673J04288j55206J3676l0078k45572M6790J05976Q5181
$$ 12700 -74036 -217630 -144957 -40669 -195875 -182199 -212277 -457849 -411059 -305083 -219902
15167b19902Q1872k6748n407k6472q3258Q3762R8339l6404j53952j13336N8328
$$ -219902 -138030 -164778 -170185 -196657 -279915 -196153 -97814 -134218 -288170 -401506 -343178
15156c43178J08320K707L1837N4467n7625P1131J01485R2763J01906r3419k33134
$$ -343178 -234858 -232151 -200314 -145847 -203472 -132341 -30856 61907 163813 70394 -162740
15145a62740j90831J11287p6619n9499J67027J77269m6434J40197J77796J93927
$$ -162740 -353571 -242284 -318903 -378402 -211375 -34106 -80540 59657 237453 431380
15135D31380j38100k51253Q6959L3048l9443l4836j20419m2605J0160M2259j08898
$$ 431380 293280 42027 128986 162034 122591 87755 -32664 -75269 -65109 -22850 -131748
15124a31748j16706o8827Q5553J56254m7110N9693n8348r5076L0227J0766m7306
$$ -131748 -248454 -317281 -231728 -75474 -122584 -62891 -121239 -216315 -186088 -175322 -222628
15113b22628K1241l0138j2267l7373l5987J78901O193L1733k1887R8271J18205
$$ -222628 -201387 -231525 -243792 -281165 -317152 -138251 -132058 -100325 -122212 -23941 94264
15102I4264j74309Q690R1724j5169j47426k8731M7539k823N3884k0519P2174P1271
$$ 94264 -80045 -71355 20369 5200 -142226 -170957 -123418 -126241 -72357 -92876 -20702 50569
15090E0569j7864j06375k6802m259p0336K1568K44913j3243k51327j25204J07328
$$ 50569 32705 -73670 -100472 -104731 -175067 -153499 91414 78171 -173156 -298360 -191032
15079a91032M4953N4662k36663r585L10616O1246j57710r7750K25659Q8229j75808
$$ -191032 -146079 -91417 -328080 -337665 -27049 34197 -123513 -221263 4396 92625 -83183
15068h3183j77767J5341j3693J5104J44031Q687k4323o1600k8703j15521M7694
$$ -83183 -260950 -245609 -259302 -244198 -100167 -91480 -115803 -177403 -206106 -321627 -273933
15057b73933J98351L2459j18065N917j53235j18900M6392K36999N8619O2777j27677
$$ -273933 -75582 -43123 -161188 -155271 -308506 -427406 -381014 -144015 -85396 -22619 -150296
15046a50296m8065q9457R7894n9021o2960n6606k0409K6210J81251J64559j34593
$$ -150296 -198361 -287818 -189924 -248945 -311905 -368511 -388920 -362710 -181459 -16900 -151493
15035a51493k0333l3512R2332J29940K6853p5385m2231R5285n1420j57500j663
$$ -151493 -171826 -205338 -113006 16934 43787 -31598 -73829 21456 -29964 -187464 -189127
15024a89127P446j03429j03747J29266N7414J88016K43615j01580J27622k21873
$$ -189127 -181681 -285110 -388857 -259591 -202177 -14161 229454 127874 255496 33623
15014C3623q4071N3350L8392K926l35916n4771n2062J30046r0308J1027R429J17193
$$ 33623 -50448 2902 41294 44220 -291696 -346467 -398529 -268483 -358791 -347764 -338335 -221142
15002b21142J09540k4549p8541J06755J62343P6308j31373N122N4444J4405J8544
$$ -221142 -111602 -136151 -214692 -107937 54406 130714 -659 4463 58907 73312 91856
14991I1856J14178j11061k83263p1102P8212J78896j4620j71268j45710r5702
$$ 91856 206034 94973 -188290 -259392 -181180 -2284 -16904 -188172 -333882 -429584
14981d29584K30111j9652N0978j92866l0037J21404J7034J06366j1430Q9400J41943
$$ -429584 -199473 -219125 -168147 -361013 -391050 -269646 -252612 -146246 -157676 -68276 73667
14970G3667J7812L2880k27107k26457J18110K922M4441k2122l3278n5674l0437
$$ 73667 91479 124359 -102748 -329205 -211095 -208173 -163732 -185854 -219132 -274806 -305243
14959c05243P4416K89888K5424p6465q7939j14662j09812m9486m060N1968J46278
$$ -305243 -230827 59061 84485 8020 -79919 -194581 -304393 -353879 -357939 -305971 -159693
14948a59693J39622j04623L6217R3232N5826j30579K6526J04761J08118m914j7114
$$ -159693 -20071 -124694 -88477 4755 60581 -69998 -43472 61289 169407 164493 147379
14937A47379j48336k69721R6782J49350j47951o5968J94689J8341M6747n2120
$$ 147379 -957 -270678 -173896 -24546 -172497 -238465 -43776 -25435 21312 -30808
14927c0808P6427J50662q1110j82416K00579j22930n9723M1734k155J29228n7136
$$ -30808 45619 196281 115171 -67245 133334 10404 -49319 -7585 -9740 119488 62352
14916F2352p0330r1490n5120J00683R9022M4158n7578l1982L100M154j8664m9305
$$ 62352 -7978 -99468 -154588 -53905 45117 89275 31697 -285 2815 6969 -11695 -61000
14904f1000p2883N2284p8098J12857l096L2055Q9332j6331l230k4819r0741J5294
$$ -61000 -133883 -81599 -159697 -46840 -49936 -17881 71451 55120 51890 27071 -63670 -48376
14892d8376Q0650K6310n0291n0658O1787M9285n9521j8438M8443j39250k5817
$$ -48376 32274 58584 8293 -42365 19422 68707 9186 -9252 39191 -100059 -125876
14881a25876J74096R4019p2548r8359m8011r3447J07405k7313j286k7377N8536
$$ -125876 48220 142239 69691 -28668 -76679 -170126 -62721 -90034 -91320 -118697 -60161
14870f0161K16322p0526K6137J8559q8471j61912j42976J27150O9907J34511j02887
$$ -60161 156161 85635 111772 130331 41860 -120052 -263028 -135878 -65971 68540 -34347
14859c4347p1401j63257n2966J69720J72107R7378k01168k88461k3799J38372
$$ -34347 -105748 -269005 -321971 -152251 19856 117234 -83934 -372395 -396194 -257822
14849b57822n3890m8552J08811j7841q0105N820L5200k8376J62592K019m1626
$$ -257822 -311712 -360264 -251453 -269294 -349399 -343579 -308379 -336755 -174163 -172144 -213770
14838b13770j24504j32880N422J66551J16124N7749k9866O4291O8360j73797k2745
$$ -213770 -338274 -471154 -465732 -299181 -183057 -125308 -155174 -90883 -22523 -196320 -219065
14827b19065J39027j7829L819J96930R4363r7440k74001k01195r8644J92798J36188
$$ -219065 -80038 -97867 -94048 102882 197245 99805 -174196 -375391 -474035 -281237 -145049
14816a45049J95892j46790O4325K3794L5171J6340k7774j13664o4001R7159m501
$$ -145049 50843 -95947 -31622 -7828 27343 43683 15909 -97755 -161756 -64597 -69098
14805f9098P0542J37562j46548k26985J89096J50180j44389o9924P3655j8112
$$ -69098 1444 139006 -7542 -234527 -45431 104749 -39640 -109564 -35909 -54021
14795e4021j58191k436N7631O2834j17311q9400p2629Q2684r4113j51784J16953
$$ -54021 -212212 -214648 -157017 -94183 -211494 -300894 -373523 -290839 -384952 -536736 -419783
14784d19783J77561m9335J08510L4274j6116o0037k8874r909J92089J97612q1569
$$ -419783 -242222 -291557 -183047 -148773 -164889 -224926 -253800 -263709 -71620 125992 44423
14773D4423r2724j60553J33934j58430n661j4634j3837L3204o0406J1011K55198
$$ 44423 -48301 -208854 -74920 -233350 -239011 -253645 -267482 -234278 -294684 -283673 -28475
14762b8475J73600l07629k73888j08199o8621r4627J77618L76022J06183q5725
$$ -28475 145125 -162504 -436392 -544591 -613212 -707839 -530221 -154199 -48016 -133741
14752a33741j2613J80655J6758j334J7461L2061P0119P2815m6889k03267J12761
$$ -133741 -146354 34301 51059 49725 67186 99247 169366 242181 195292 -7975 104786
14741A04786J37819k73130m5266N9210j59418o5190j96205j84915J82677K05463
$$ 104786 242605 -30525 -75791 -16581 -175999 -241189 -437394 -622309 -439632 -234169
14731b34169l7684M5841j16052j82627l59984p244K50155J18087Q8880K45886
$$ -234169 -271853 -226012 -342064 -524691 -884675 -891919 -641764 -523677 -434797 -188911
14721a88911K54610n6751j77909l3759k7396N3915K20456N6952j65721j69217
$$ -188911 65699 8948 -168961 -202720 -230116 -176201 44255 101207 -64514 -233731
14711b33731j77470r89j04884J24366K65729K69079j5884j54801j14403M1044
$$ -233731 -411201 -412190 -517074 -392708 -126979 142100 126216 -28585 -142988 -101944
14701a01944O5174j73796O6985K1601j18994r7470m8654K9693Q6916K07219N868
$$ -101944 -36770 -210566 -143581 -121980 -240974 -338444 -387098 -357405 -270489 -63270 -57402
14690e7402j8936J70056L9113j12671k13270j9594J39450K5340J68525o1071l11011
$$ -57402 -76338 93718 132831 20160 -193110 -212704 -73254 -47914 120611 59540 -251471
14679b51471R1991J70450J8776j58651j20491K15417N0280K0870j00338P2936
$$ -251471 -159480 10970 29746 -128905 -249396 -33979 16301 37171 -63167 9769
14669I769j26208q3162j1444j11771k1489R0796J22689P870O8865O1069j247J15984
$$ 9769 -116439 -199601 -211045 -322816 -344305 -253509 -130820 -122950 -54085 6984 5737 121721
14657A21721p2404j17746k31271k71322J78505J65307Q5728J02943R3891L8472
$$ 121721 49317 -68429 -299700 -571022 -392517 -227210 -141482 -38539 55352 93824
14647I3824j11844p7629Q3643j46185j0528L8507j1298j23374p3257N4235n1528
$$ 93824 -18020 -95649 -12006 -158191 -168719 -130212 -141510 -264884 -338141 -283906 -335434
14636c35434k0144J64430J87928k2250r8679q4113J07717l4909J39366Q0378q0284
$$ -335434 -355578 -191148 -3220 -25470 -124149 -208262 -100545 -135454 3912 84290 4006
14625D006j6536j857J8096k3953j85061m880J37749j08291j31544k35K96920N19
$$ 4006 -12530 -14387 3709 -20244 -205305 -210185 -72436 -180727 -312271 -312506 -15586 -15067
14613a5067k02331o2407j22283O6551J54635J02475K55279N4268j88764j89699
$$ -15067 -217398 -279805 -402088 -335537 -180902 -78427 176852 231120 42356 -147343
14603a47343j44563L0047J98674K19342K0257l08259J70885M9297j10559J07704
$$ -147343 -291906 -261859 -63185 156157 176414 -131845 39040 88337 -22222 85482
14593H5482k5313k39458m0361M8075J7058q8462O0097l7163j72891J00333Q4373
$$ 85482 60169 -179289 -219650 -171575 -154517 -242979 -182882 -220045 -392936 -292603 -208230
14582b08230J13411L5102p9068j67394K5975o0078O0442J02999N5738K5672J08545
$$ -208230 -94819 -59717 -138785 -306179 -280204 -340282 -279840 -176841 -121103 -95431 13114
14571A3114L5187j10457Q6781K6963M2652J22548R1773j73108j47818K714L3159
$$ 13114 48301 -62156 24625 51588 94240 216788 308561 135453 -12365 -9651 23508
14560B3508J11569J7101k30929k14559K238l8917J34471J28793L4579J04455k7877
$$ 23508 135077 152178 -78751 -293310 -291072 -329989 -195518 -66725 -32146 72309 44432
14549D4432k71198R2960j5233j12568L3286l3909L4503J13228M1069N0489o4648
$$ 44432 -226766 -133806 -149039 -261607 -228321 -262230 -227727 -114499 -73430 -22941 -87589
14538h7589K0827k6340j23561j26472j476J10210Q278J4315j09978J03568J2325
$$ -87589 -66762 -93102 -216663 -343135 -344611 -234401 -226123 -211808 -321786 -218218 -205893
14527b05893M7862n161j48225l0038P0462o4802m0720J62146Q4453O7227q2448
$$ -205893 -158031 -163192 -311417 -341455 -270993 -335795 -376515 -214369 -129916 -62689 -145137
14516a45137L8850j47083q5646j60217R2895R9625L145M5991K62038j28479m5445
$$ -145137 -106287 -253370 -339016 -499233 -406338 -306713 -303568 -257577 4461 -124018 -169463
14505a69463J50475P939Q1354M4144q3768j303L513K24676J58165J5022k9741
$$ -169463 -18988 -11049 70305 114449 30681 29378 32891 257567 415732 430754 401013
14494D01013k95654j93397K6236K40076R611k21620j5945R4446L5319j08350l4666
$$ 401013 105359 -88038 -61802 178274 187885 -33735 -49680 44766 80085 -28265 -62931
14483f2931J75397J03535L4575j60530q3335J15999j32708j67931k3675J70083
$$ -62931 112466 216001 250576 90046 6711 122710 -9998 -177929 -201604 -31521
14473c1521K08501Q2348j08737l13185n4651L0580J65894J24726q9906K4544m2290
$$ -31521 176980 259328 150591 -162594 -217245 -186665 -20771 103955 14049 38593 -3697
14462c697j8469R4800j33845j23058Q513N7718J22895J19310P3885p5184k20288
$$ -3697 -22166 72634 -61211 -184269 -175756 -118038 4857 124167 198052 122868 -97420
14451i7420m7249Q7165k44858j89236J60657J21490j91261o1440R1418L00433
$$ -97420 -144669 -57504 -302362 -491598 -330941 -209451 -400712 -462152 -370734 -70301
14441g0301j4961N5506k2828J16533J35431j84955L6276K6180Q5320m3725j01666
$$ -70301 -85262 -29756 -52584 63949 199380 14425 50701 76881 162201 118476 16810
14430A6810j50450k2646J47492r5971j026N1724P1435j24824j66379j99154k4075
$$ 16810 -133640 -156286 -8794 -104765 -105791 -54067 17368 -107456 -273835 -472989 -497064
14419d97064J10325J46183r7172j15140k5891J29599P4997P8498N6189K8110N7324
$$ -497064 -386739 -240556 -337728 -452868 -478759 -349160 -274163 -195665 -139476 -111366 -54042
14408e4042j14073j34462J10646Q4421P8897l3761r3048q3031j6265K4437l7232
$$ -54042 -168115 -302577 -191931 -107510 -28613 -62374 -155422 -238453 -254718 -230281 -267513
14397b67513O9490l13547Q2434J70973n09j47826j47273Q3641M6163L28226p469
$$ -267513 -198023 -511570 -429136 -258163 -258672 -406498 -553771 -470130 -423967 -95741 -103210
14386a03210j45624j4703M2414j6072q2135n6329j33913K5078J47995L45824l3268
$$ -103210 -248834 -263537 -221123 -237195 -319330 -375659 -509572 -484494 -336499 9325 -23943
14375b3943r2024J3989m9696j00198J03381P8786M3328l7201N7733J01166m086
$$ -23943 -115967 -101978 -151674 -251872 -148491 -69705 -26377 -63578 -5845 95321 91235
14364I1235p7582N4569l2906p3665n6066j15306K0527Q7316J03319r2718k66238
$$ 91235 13653 68222 35316 -38349 -94415 -209721 -189194 -101878 1441 -91277 -357515
14353c57515J08677J69883M4013J47970K8456j93746k60477O9487R6196J31690
$$ -357515 -248838 -78955 -34942 113028 141484 -52262 -312739 -243252 -147056 -15366
14343a5366L4977J36157N2013Q7011N1992j42034k27843k50898m6436N9603n591
$$ -15366 19611 155768 207781 294792 346784 204750 -23093 -273991 -320427 -260824 -266415
14332b66415L9101J3965l1872J36991J30026K5306j78157o815J86477p125k19594
$$ -266415 -227314 -213349 -245221 -108230 21796 47102 -131055 -137870 48607 41482 -178112
14321a78112o4662M962o612J21042J27241k2872n5733m0671L4556n3735J7820
$$ -178112 -242774 -237812 -244424 -123382 3859 -19013 -74746 -115417 -80861 -134596 -116776
14310a16776m962j49173j12846J79769J90165J73338O878J5558P8044l9049m9452
$$ -116776 -121738 -270911 -383757 -203988 -13823 159515 166393 181951 259995 220946 171494
14299A71494N106n2743j8844P169l5770l3693j04785K14004l4201j66065j45993
$$ 171494 176600 123857 105013 112182 76412 42719 -62066 151938 117737 -48328 -194321
14288a94321Q5738k5308j08255J0490j31630O089K0415k423L7146j78855K43796
$$ -194321 -108583 -133891 -242146 -231656 -363286 -357197 -336782 -339205 -302059 -480914 -237118
14277b37118J6285k8480n003L3316J82925l711j6747R5149L0819k16499M7032
$$ -237118 -220833 -249313 -254316 -221000 -38075 -41786 -58533 36616 67435 -149064 -102032
14266a02032P0911P4029L8904o9375J09494K2278l4574j916j87556o7374J06418
$$ -102032 -31121 42908 81812 12437 121931 144209 109635 107719 -79837 -147211 -40793
14255d0793P7671J7287j09654j67908P0388J57397P0257M0910N3666J371j73224
$$ -40793 36878 54165 -55489 -223397 -153009 4388 74645 115555 169221 170592 -2632
14244b632j80888P1591J95525m2054m9114J80736j0241Q2955p1362l8302K30129
$$ -2632 -183520 -111929 83596 41542 -7572 173164 162923 245878 174516 136214 366343
14233C66343K77291K71247n5360j28320k3641J36319r6737J2193J87155k9212
$$ 366343 643634 914881 859521 731201 707560 843879 747142 759335 946490 917278
14223I17278P0058j32269j00643N0867k21078k03823l236K2657Q204M9948J9104
$$ 917278 987336 855067 754424 805291 584213 380390 377154 399811 408015 457963 477067
14212D77067k651q5638k1575j4885K522J5842p0037N1148J44893o1742j35136
$$ 477067 474416 388778 367203 352318 354840 370682 300645 351793 496686 434944 299808
14201B99808j42503J29592k5556N9685K59316J29657q5782n1270q4308o8130n8359
$$ 299808 157305 286897 261341 321026 580342 709999 624217 572947 488639 420509 362150
14190C62150K8166K024J95660R175N1095M41929J86708L10579L30431L32528L29955
$$ 362150 390316 392340 588000 597175 648270 1090199 1276907 1587486 1917917 2250445 2580400
14179B580400K97249J74110k4517J30105K24916J11804j6520r1143J68550J85305
$$ 2580400 2877649 3051759 3027242 3157347 3382263 3494067 3477547 3386404 3554954 3740259
14169C740259J8271q8970j06919j01053j88659j05769q5334k62299k12074l6199
$$ 3740259 3758530 3669560 3562641 3461588 3272929 3167160 3081826 2819527 2607453 2571254
14159B571254j64493k7952p6791n0547K19587P338k25968m66412k50065J9402
$$ 2571254 2406761 2378809 2302018 2251471 2471058 2478396 2252428 1786016 1535951 1555353
14149A555353j65109l8143l09597r4076j09867j51614r9853J54279o6921O3353
$$ 1555353 1390244 1352101 1042504 948428 838561 686947 587094 741373 674452 737805
14139G37805K3953j65009j6465O4819J31789J26444k4206m5637j03n7127P2265
$$ 737805 761758 596749 580284 645103 776892 903336 879130 833493 833390 776263 848528
14128H48528L2749J7333l8862J50452N2805J31598J74751K08272L29823j8969
$$ 848528 881277 898610 859748 1010200 1063005 1194603 1369354 1577626 1907449 1888480
14118A888480l25063M0499O2033J8736L1880m1163k8489P0501j88480n8458J48102
$$ 1888480 1563417 1603916 1665949 1684685 1716565 1675402 1646913 1717414 1528934 1470476 1618578
14107A618578l2423l01129M2997K27054l0717j24631j95972o0762N0064j28544
$$ 1618578 1586155 1285026 1328023 1555077 1524360 1399729 1203757 1142995 1193059 1064515
14097A064515J5924J71224P6058L3727r4567k20579L6377Q1917k07504j00354
$$ 1064515 1080439 1251663 1327721 1361448 1266881 1046302 1082679 1164596 957092 856738
14087H56738l9637r6425j17203M4023p9377J50949L6327j09171k22090p9851k5052
$$ 856738 817101 720676 603473 647496 568119 719068 755395 646224 424134 344283 319231
14076C19231J32037J9729j24084M0361J98782K58796L08944Q7772o314N2424K0864
$$ 319231 451268 470997 346913 387274 586056 844852 1153796 1241568 1235254 1287678 1308542
14065A308542K7972j1613p9828P7156n7960j28965q5840j95099j32272n5826o866
$$ 1308542 1336514 1324901 1245073 1322229 1264269 1135304 1049464 854365 722093 666267 659401
14054F59401o3682J34817o6451M2320j42217n6336Q4813K51728k26686j00432
$$ 659401 595719 730536 664085 706405 564188 507852 592665 844393 617707 517275
14044E17275L3145P524j36281j7468K62206n7639j22075k1892j91308O123K96340
$$ 517275 550420 557944 421663 404195 666401 608762 486687 464795 273487 279610 575950
14033E75950J9460L9918l6525l56352k00891P9251L2828J53941J12138M4059J13796
$$ 575950 595410 635328 598803 242451 41560 120811 153639 307580 419718 463777 577573
14022E77573j69447j50565J29650O4893J03253k8392o2409o0021N7624K0919K04338
$$ 577573 408126 257561 387211 452104 555357 526965 464556 404535 462159 483078 687416
14011F87416K46157J46918P8857R9400J6912p0259n9204j22063j90998l865J22429
$$ 687416 933573 1080491 1159348 1258748 1275660 1205401 1146197 1024134 833136 829271 951700
14000I51700J0305m0583j8079M7231J75038K38701J03670J326j31157j30671J6718
$$ 951700 962005 921422 903343 950574 1125612 1364313 1467983 1469309 1338152 1207481 1224199
13989A224199n601j48348k29965j76951j2524J45637J64960j484K04934M3113
$$ 1224199 1218598 1070250 840285 663334 650810 796447 961407 959923 1164857 1207970
13979A207970n2325p6428j46780M5154J28381j03220k02687j64563Q258j02971
$$ 1207970 1155645 1079217 932437 977591 1105972 1002752 800065 635502 643760 540789
13969E40789j42464j08617J35289l9834j0709M6545j46222M0881n3298J11695
$$ 540789 398325 289708 424997 385163 374454 420999 274777 315658 262360 374055
13959C74055J5404J57785Q5571j55063l846j23762q4233N6706J89311J53941j4213
$$ 374055 389459 547244 632815 477752 473906 350144 265911 322617 511928 665869 651656
13948F51656j8557L5841J3953J06807J55228J97573K36160K35091n7254L9521
$$ 651656 633099 668940 682893 789700 944928 1142501 1378661 1613752 1556498 1596019
13938A596019J53665J23802N9578q2740j79119Q756j30900j29880k16063k59092
$$ 1596019 1749684 1873486 1933064 1850324 1671205 1679961 1549061 1419181 1203118 944026
13928I44026l3449j14563K2222J90561M0665l0456j32301q3078J87877J26757
$$ 944026 910577 796014 818236 1008797 1049462 1019006 886705 803627 991504 1118261
13918A118261j09739o4592O5763l1580l16053N6269L6899J01019K24549o8376
$$ 1118261 1008522 943930 1009693 978113 662060 718329 755228 856247 1080796 1012420
13908A012420q2082O5006J1328O8932K2957j92845q8520P9153p8188l11709l47087
$$ 1012420 930338 995344 1006672 1075604 1098561 905716 817196 896349 818161 506452 159365
13897A59365m4047L0454J53147J59745J556j59501l6579P3557N4692J37698Q5164
$$ 159365 115318 145772 298919 458664 460220 300719 264140 337697 392389 530087 615251
13886F15251N5644k7741M6886O9134n1669j3233K2069R3081J18123o5564k357
$$ 615251 670895 643154 690040 759174 707505 694272 716341 809422 927545 861981 859624
13875H59624R0524K03288J26273j84408j7008J31769J79004J93914l0439j52267
$$ 859624 950148 1153436 1279709 1095301 1078293 1210062 1389066 1582980 1552541 1400274
13865A400274o7756k10865p5267O4734J31896j40633o8828l0850K20845m5295
$$ 1400274 1332518 1121653 1046386 1111120 1243016 1102383 1033555 1002705 1223550 1178255
13855A178255j06064J9250r8016j40396J7449J64427N9890M7695j84132j76341
$$ 1178255 1072191 1091441 993425 853029 870478 1034905 1094795 1142490 958358 782017
13845G82017M9699o7498k06877j04687j08428K15775J06739r451j59461l2509
$$ 782017 831716 764218 557341 452654 344226 560001 666740 657289 497828 465319
13835D65319K2307j45135n4791O4755o4955N4476J2906l2440m4048J08755o3500
$$ 465319 487626 342491 287700 352455 287500 341976 354882 322442 278394 387149 323649
13824C23649O1715J33451J23254N6670o1053J14408K47976J46111K07001M21838
$$ 323649 385364 518815 642069 698739 637686 752094 1000070 1146181 1353182 1775020
13814A775020K94669J34360J63685K38901J03050K24044K45440J7187k7287Q2644
$$ 1775020 2069689 2204049 2367734 2606635 2709685 2933729 3179169 3196356 3169069 3251713
13804C251713j11449j77362L04l2659j24875l7166q2761k13609p4128j05842k29622
$$ 3251713 3140264 2962902 2963206 2930547 2805672 2768506 2685745 2472136 2398008 2292166 2062544
13793B062544P1772M9255j30715j77411j08291N1357Q577k32527j42666L5382
$$ 2062544 2134316 2183571 2052856 1875445 1767154 1818511 1827088 1594561 1451895 1487277
13783A487277L4753j72668Q9320L5323m5914j4847J5472N4233J24812J06122m837
$$ 1487277 1522030 1349362 1438682 1474005 1428091 1413244 1428716 1482949 1607761 1713883 1709046
13772A709046J39616K76848Q6756J6915K0911q9187J23027L70934M19742M53587
$$ 1709046 1848662 2125510 2212266 2229181 2250092 2160905 2283932 2654866 3074608 3528195
13762C528195L26314M24935L66570N20726N78070M90888P88348R10084R50510
$$ 3528195 3854509 4279444 4646014 5166740 5744810 6235698 7024046 7934130 8884640
13753H884640J211527J689557J709253J946157K809140L917979N345442O820189
$$ 8884640 10096167 11785724 13494977 15441134 18250274 22168253 27513695 34333884
13745C4333884Q128866R215273R757814R476571R266132R100656Q755729Q350809
$$ 34333884 42462750 51678023 61435837 70912408 80178540 89279196 98034925 106385734
13737A06385734P015446N052969K424789J00881j532073j987434k332451l215574
$$ 106385734 113401180 118454149 120878938 120979819 119447746 117460312 115127861 111912287
13729A11912287n401304q234492j0825680j2345547j1538342r519022p224480
$$ 111912287 106510983 98276491 87450811 75105264 63566922 54047900 46823420
13722D6823420n557187m295337k949884k370279k083133j675449j341804j004668
$$ 46823420 41266233 36970896 34021012 31650733 29567600 27892151 26550347 25545679
13714B5545679q24952q15504p04674p05456o19388j81087j64344j2419K03228
$$ 25545679 24720727 23905223 23200549 22495093 21875705 21694618 21530274 21517855 21721083
13705B1721083L59152L66269M55127R28673J124062J153185J317732J838323K332459
$$ 21721083 22080235 22446504 22901631 23830304 24954366 26107551 27425283 29263606 31596065
13696C1596065K806142L470327M671502O574046Q656275J1752237J6015634K0734713
$$ 31596065 34402207 37872534 42544036 49118082 57774357 69526594 85542228 106276941
13688A06276941K4706654K6767723K6577768K5547114K4431701K3444272K2724572
$$ 106276941 130983595 157751318 184329086 209876200 234307901 257752173 280476745
13681B80476745J9539689J3495575N703828j496046o208503p773316p520961p744589
$$ 280476745 300016434 313512009 319215837 317719791 311511288 303737972 296217011 288472422
13673B88472422j1215187j7604437k4625215k9658448k9819976k6418775k1276467
$$ 288472422 277257235 259652798 235027583 205369135 175549159 149130384 127853917
13666A27853917j6291019j2392018r306835p243226n759318m860920m295717l619646
$$ 127853917 111562898 99170880 89864045 82620819 76861501 72000581 67704864 64085218
13658F4085218l206552k817290k464807k212447j976503j893968j517033j253839
$$ 64085218 60878666 58061376 55596569 53384122 51407619 49513651 47996618 46742779
13650D6742779j333438j198304p29251m20882k20819l16960j24629J33095M01767
$$ 46742779 45409341 44211037 43481786 43060904 42840085 42523125 42398496 42531591 42933358
13641D2933358O50652J102825J598304J787378K770764M203864N621851P822834
$$ 42933358 43584010 44686835 46285139 48072517 50843281 55047145 60668996 68491830
13633F8491830J0814809J3827536J5959810J6775941J6190292J5245534J4807781
$$ 68491830 79306639 93134175 109093985 125869926 142060218 157305752 172113533
13626A72113533J4507868J2888677R311298M431579O2426l230902m700177m601150
$$ 172113533 186621401 199510078 208821376 213252955 213315381 210084479 205384302 200783152
13618B00783152l836630l866561n202579p442324q911641q401849n145513Q95624
$$ 200783152 196946522 193079961 187877382 180435058 171523417 163121568 157976055 158871679
13610A58871679P873211J3165463J5148161J4287168J1926444R414720P547455
$$ 158871679 166744890 179910353 195058514 209345682 221272126 230686846 238234301
13603B38234301M215621k481080j1499434k0222140k5390244k5464834k2122006
$$ 238234301 242449922 239968842 228469408 208247268 182857024 157392190 135270184
13596A35270184j7859057j3721052j0593979q401390o568246n100049m298032
$$ 135270184 117411127 103690075 93096096 84694706 78126460 73026411 68728379
13589F8728379l474473l227698k790562k355143j896974j900924j781966j440400
$$ 68728379 65253906 62026208 59235646 56880503 54983529 53082605 51300639 49860239
13581D9860239j588880j482592j340861j106330r64095o13307o96830m41081l83987
$$ 49860239 48271359 46788767 45447906 44341576 43377481 42764174 42067344 41626263 41242276
13572D1242276m38191l68979k06341k7369J60232L81839Q97575R48051R01708
$$ 41242276 40804085 40435106 40228765 40201396 40361628 40743467 41641042 42589093 43490801
13563D3490801J137904J549731K218215K731594L667779N580286P708548J0783792
$$ 43490801 44628705 46178436 48396651 51128245 54796024 60376310 68084858 78868650
13555G8868650J5338387K0654148K4887803K5697346K2885528J8875925J5253459
$$ 78868650 94207037 114861185 139748988 165446334 188331862 207207787 222461246
13548B22461246J3461576J0308976L351797p571220j8189638k4650333k3901706
$$ 222461246 235922822 246231798 249583595 242012375 223822737 199172404 175270698
13541A75270698j7640334r221512K12474R368437J7024480K1031863K0531634
$$ 175270698 157630364 148408852 148621326 157989763 175014243 196046106 216577740
13534B16577740J6525760J2074947R800589Q063228L027525p479692k0425427
$$ 216577740 233103500 245178447 254979036 263042264 266069789 258590097 238164670
13527B38164670l0558051l3146024k9103388k2386671j6054402j1576803q459929
$$ 238164670 207606619 174460595 145357207 122970536 106916134 95339331 86879402
13520H6879402o370412m839273l916181l020204k745043k262567j901945j496253
$$ 86879402 80508990 75669717 71753536 68733332 65988289 63725722 61823777 60327524
13512F0327524j214925q09045q14876o80021j82654O4015P61832J489330K087460
$$ 60327524 59112599 58303554 57488678 56808657 56626003 56690018 57451850 58941180 61028640
13503F1028640L388690M516073O252911Q534406J1110978J3161209J3519520J1703441
$$ 61028640 64417330 68933403 75186314 83720720 94831698 107992907 121512427 133215868
13495A33215868R598015Q071084O813195M773838L42395n525740j0199178j1432041
$$ 133215868 142813883 150884967 157698162 162472000 162814395 157288655 147089477 135657436
13487A35657436r601987o444081k054132K949481Q109898J3488059J8451139K1112831
$$ 135657436 126055449 119611368 117557236 120506717 128616615 142104674 160555813 181668644
13479A81668644K0471038J7415338J3722410J0770874P820492K642977n812128
$$ 181668644 202139682 219555020 233277430 244048304 251868796 254511773 248699645
13472B48699645j5771521k3888310k7208545k5235723k0278527j4821172j0085427
$$ 248699645 232928124 209039814 181831269 156595546 136317019 121495847 111410420
13465A11410420n931427k351171J093268N058841R239460J2927975J4310027J1728812
$$ 111410420 105478993 103127822 104221090 109279931 118519391 131447366 145757393 157486205
13457A57486205Q056293O217444O122342M743955l31617r234984j7383070j9391610
$$ 157486205 165542498 171759942 177882284 182626239 182294622 173059638 155676568 136284958
13449A36284958j6811317j2491546q378232m814865j359609J667758M575032O731079
$$ 136284958 119473641 106982095 98603863 93788998 92429389 94097147 98672179 105403258
13441A05403258P456211O443375N145986M644769M404455L728237J381267k339528
$$ 105403258 112859469 119302844 124448830 129093599 133498054 137226291 138607558 136268030
13433A36268030m913031l960280M4947N472472R819367J0932706Q781792N894067
$$ 136268030 131354999 127394719 127439666 132912138 142731505 153664211 162446003 168340070
13425A68340070M865167M717267K684291l109350j1846966j8292206j9411729
$$ 168340070 173205237 177922504 180606795 177497445 165650479 147358273 127946544
13418A27946544j6617416j2794119r569925p020418m883142l784621k507358j383433
$$ 127946544 111329128 98535009 88965084 81944666 77061524 73276903 70769545 69386112
13410F9386112n03717L52363J515001L352846N387719P413342R455278J0001818
$$ 69386112 68882395 69234758 70749759 74102605 79490324 86903666 96358944 106360762
13402A06360762Q646400O730275N661049N836195N094465K401464k367783n758605
$$ 106360762 115007162 121737437 127398486 133234681 138329146 140730610 138362827 132604222
13394A32604222n436029j610442L463288P669949R556899Q544595O298542N042709
$$ 132604222 127168193 125557751 129021039 136690988 146247887 154792482 161091024 166133733
13386A66133733M149351K139955k692896r659139j5462140j7159331j5073188
$$ 166133733 170283084 172423039 169730143 160071004 144608864 127449533 112376345
13379A12376345j1634856p846353m472106j171191K488847O343106R289259R261758
$$ 112376345 100741489 92895136 88423030 87251839 89740686 96083792 105373051 114634809
13371A14634809O372732L766567L492242M142048K869072k253701j0076211j5295941
$$ 114634809 121007541 124774108 128266350 132408398 135277470 133023769 122947558 107651617
13363A07651617j5450292j2435108q989077o413647m977059m121518l147154k361192
$$ 107651617 92201325 79766217 70777140 64363493 59386434 55264916 52117762 49756570
13355D9756570j863893j523237j319771r58549j046288o39104n89345o83208n38791
$$ 49756570 47892677 46369440 45049669 44091120 43044832 42405728 41816383 41133175 40594384
13346D0594384j83409K16666J01095M35127J026236J539030J983135K931147M474216
$$ 40594384 40410975 40627641 40728736 41163863 42190099 43729129 45712264 48643411 53117627
13337E3117627O200581Q035577R481422R400237P733658N628532M233162L483428
$$ 53117627 59318208 67353785 76835207 86235444 93969102 99597634 103830796 107314224
13329A07314224J907724j708101o451945j0411644j1813337j0759116q667529
$$ 107314224 109221948 107513847 101061902 90650258 78836921 68077805 59410276
13322E9410276o306545n057489m076510l201384k735728k143944j502404j375318
$$ 59410276 53103731 48046242 43969732 40768348 38032620 35888676 34386272 33010954
13314C3010954j343894j224946r84773q14353q78834p79947o38542n23696p08568
$$ 33010954 31667060 30442114 29457341 28642988 27764154 26984207 26345665 25821969 25113401
13305B5113401n44973n46958m19451n09932n11514m16725n97828m82375m59274
$$ 25113401 24568428 24021470 23602019 23092087 22580573 22163848 21566020 21083645 20624371
13296B0624371m30730m59148n59459m19833m13476m81848j86032j40372l54573
$$ 20624371 20193641 19734493 19175034 18755201 18341725 17859877 17673845 17533473 17178900
13287A7178900m06647l79046m98930m01361R2023O4137j07379k24136k74630k23841
$$ 17178900 16772253 16393207 15894277 15492916 15584939 15649076 15541697 15317561 15042931 14819090
13277A4819090J9793l3695j10070j27343k25551l60611j33018R171l89468l90739
$$ 14819090 14838883 14805188 14695118 14567775 14342224 13981613 13848595 13857766 13468298 13077559
13267A3077559j22330r3950l1788l13612l31987k7194M31k4094j08965k95185
$$ 13077559 12955229 12861279 12829491 12515879 12183892 12156698 12157129 12133035 12024070 11728885
13257A1728885K1366J98742k13251m10635k32883j49407j19615O3252J18505k59596
$$ 11728885 11750251 11948993 11735742 11325107 11092224 10942817 10823202 10886454 11004959 10745363
13247A0745363j57200j93574j81916m2576K08235j20955k39714j31855k03606
$$ 10745363 10588163 10394589 10212673 10170097 10378332 10257377 10017663 9885808 9682202
13238I682202j04452J87468j4655l12916j35906j64150j10156j62014k7712L5709
$$ 9682202 9577750 9765218 9750563 9437647 9301741 9137591 9027435 8865421 8837709 8873418
13228H873418l03368j2267m5614k54759j33879O4029j61155r6944l42147k09389
$$ 8873418 8570050 8557783 8512169 8257410 8123531 8187560 8026405 7929461 7587314 7377925
13218G377925j0005l6003p4643p642l24189p8958r1443J9362O7281M9590R5184
$$ 7377925 7367920 7331917 7257274 7249632 6925443 6846485 6755042 6774404 6841685 6891275 6986459
13207F986459O2100k0160K5711j17932m3300j24593r8167j16569l01805P7448
$$ 6986459 7048559 7028399 7054110 6936178 6892878 6768285 6670118 6553549 6251744 6329192
13197F329192k2343j46773K2379j38239n8434N9297m2779k6545j2240j95129L2271
$$ 6329192 6306849 6160076 6182455 6044216 5985782 6045079 6002300 5975755 5963515 5768386 5800657
13186E800657k2467K9574J55151K98687Q5144o8562L3173O5787J03769q1622j45262
$$ 5800657 5778190 5807764 5962915 6261602 6346746 6278184 6311357 6377144 6480913 6399291 6254029
13175F254029j74491L8064j03666j16131O1102M4461j85238j38762j12906j30746
$$ 6254029 6079538 6117602 6013936 5897805 5958907 6003368 5818130 5679368 5566462 5435716
13165E435716j78881k1254o3012q2414j84735j35496K7287O2896k8204r2865m7957
$$ 5435716 5256835 5235581 5172569 5090155 4905420 4769924 4797211 4860107 4831903 4739038 4691081
13154D691081Q8152R4551j86657R16n756n1172J38214J86306k219k50391n1549
$$ 4691081 4779233 4873784 4687127 4688043 4682287 4631115 4769329 4955635 4953416 4703025 4651476
13143D651476N8890R318J00834L27089O5768L8613m3726M1246M2036j889q2823
$$ 4651476 4710366 4719684 4820518 5147607 5213375 5251988 5208262 5249508 5291544 5289655 5206832
13132E206832m4201k11232j82977L9014k0223J32702N6144O9096J02401j3707
$$ 5206832 5162631 4951399 4768422 4807436 4787213 4919915 4976059 5045155 5147556 5133849
13122E133849l22867j87916N7330q7658j10088j7600o6817n3162K50895J70232
$$ 5133849 4810982 4623066 4680396 4592738 4482650 4465050 4398233 4345071 4595966 4766198
13112D766198k8096r9231l20032k49462L5928P6155J08574j19640o0529j4446
$$ 4766198 4738102 4638871 4318839 4069377 4105305 4181460 4290034 4170394 4109865 4095419
13102D095419P5819j0724J52994J02385l5902p7869j74289j41425o7679r7915
$$ 4095419 4171238 4160514 4313508 4415893 4379991 4302122 4127833 3986408 3918729 3820814
13092C820814Q9042Q1735k01604j33137j04855K39037J50480J50863Q0614J0700
$$ 3820814 3909856 3991591 3789987 3656850 3551995 3791032 3941512 4092375 4172989 4183689
13082D183689M5202K0115J36030J62289R3877j20632k09834k71348k5776Q5686
$$ 4183689 4228891 4249006 4385036 4547325 4641202 4520570 4310736 4039388 4013612 4099298
13072D099298j16286j69487M7290J27030O9622J04313L3364J99299n6870o6313
$$ 4099298 3983012 3813525 3860815 3987845 4057467 4161780 4195144 4394443 4337573 4271260
13062D271260L0957J145O7334j08577k59192k74033k0823n6239l6601j16155p8754
$$ 4271260 4302217 4303362 4370696 4262119 4002927 3728894 3708071 3651832 3615231 3499076 3420322
13051C420322k4758P0174l19803j55029k08341l31592l1518J90709J39659R7288
$$ 3420322 3395564 3465738 3145935 2990906 2782565 2450973 2419455 2610164 2749823 2847111
13041B847111j30508M1909k56321o2146O4123K53050N230o6699J38136O652k5517
$$ 2847111 2716603 2758512 2502191 2440045 2504168 2757218 2762448 2695749 2833885 2840537 2815020
13030B815020J05631L2514m4825k40280j52560K6946l798J31308m5794o7019J28789
$$ 2815020 2920651 2953165 2908340 2668060 2515500 2542446 2538648 2669956 2624162 2557143 2685932
13019B685932k7058J8813k6359J12211L75711J55263j41232L0773J29122K50647
$$ 2685932 2658874 2677687 2651328 2763539 3139250 3294513 3153281 3184054 3313176 3563823
13009C563823K09518m7516j07174O2219K58422R846k57654l66597j19704K85809
$$ 3563823 3773341 3725825 3618651 3680870 3939292 3949138 3691484 3324887 3205183 3490992
12999C490992k6606p565n2715r8499r3548o9892K7741M4577K2715j76736k00409
$$ 3490992 3464386 3456821 3404106 3305607 3212059 3142167 3169908 3214485 3237200 3060464 2860055
12988B860055p5657m8797l7032l24439k7992P1847K3434P1880q876R7078O7489
$$ 2860055 2784398 2735601 2698569 2374130 2346138 2417985 2441419 2513299 2504423 2601501 2668990
12977B668990J32149j86294p0648P2378J2306J24183q130r2112Q6873J56388J09958
$$ 2668990 2801139 2614845 2544197 2616575 2628881 2753064 2744934 2652822 2739695 2896083 3006041
12966C006041J65487M5658L5307j64111n8044k6448k5600j27676j88318q5463
$$ 3006041 3171528 3217186 3252493 3088382 3030338 3003890 2978290 2850614 2662296 2576833
12956B576833M6479Q8412R0200j06501r6648Q795J02051L7854J82036M4360k03900
$$ 2576833 2623312 2711724 2801924 2695423 2598775 2607570 2709621 2747475 2929511 2973871 2769971
12945B769971r367Q5641J64580J47672J4956l8931p213J09002j85046j93821N8075
$$ 2769971 2760604 2846245 3010825 3158497 3173453 3134522 3127309 3236311 3051265 2857444 2915519
12934B915519k0011J10265P8975K3591J30011P682j56685p8352j84611j14143
$$ 2915519 2895508 3005773 3084748 3108339 3238350 3246032 3089347 3010995 2826384 2712241
12924B712241l488k05117K4771J87971k7618r437o9959K7903K0546m5950m5974
$$ 2712241 2708753 2503636 2528407 2716378 2688760 2679323 2609364 2637267 2657813 2611863 2565889
12913B565889L5896K78724j44643J63654J40811J04799N054L5256m2117q1150
$$ 2565889 2601785 2880509 2735866 2899520 3040331 3145130 3150184 3185440 3143323 3062173
12903C062173n8946q6050J0195j38015M2706J50111n9005j72113J16155J77577
$$ 3062173 3003227 2917177 2927372 2789357 2832063 2982174 2923169 2751056 2867211 3044788
12893C044788J52228M2164j24700j30090j28540k33901k7255J09242j10329j65420
$$ 3044788 3197016 3239180 3114480 2984390 2855850 2621949 2594694 2703936 2593607 2428187
12883B428187j4874J32621K46548q507j86583L8294N7879J53895J81961m7276
$$ 2428187 2413313 2545934 2792482 2783975 2597392 2635686 2693565 2847460 3029421 2982145
12873B982145j25641o1282j03437q0513J7092n1617N214k8799k6640m9740n500
$$ 2982145 2856504 2795222 2691785 2611272 2628364 2576747 2581961 2553162 2526522 2476782 2471282
12862B471282n8018R2188k99120N7168q6982J4768j22102k4105M0843Q3904J64384
$$ 2471282 2413264 2505452 2206332 2263500 2176518 2191286 2069184 2045079 2085922 2169826 2334210
12851B334210P2033m9018p0019k17749J38930K68031J28041j86713J27541K46389
$$ 2334210 2406243 2357225 2287206 2069457 2208387 2476418 2604459 2417746 2545287 2791676
12841B791676L152J62416j20290p0305J5635n3056j01788k9189j26729Q6723J69055
$$ 2791676 2794828 2957244 2836954 2766649 2782284 2729228 2627440 2598251 2471522 2558245 2727300
12830B727300M4567P4546M7152j52301j8710R2978O3228M8133m450k57817j8914
$$ 2727300 2771867 2846413 2893565 2741264 2722554 2815532 2878760 2926893 2922443 2664626 2645712
12819B645712J29744J08144J1660K71735J4800J16452M6384J8248J27124L62284
$$ 2645712 2775456 2883600 2895260 3166995 3181795 3298247 3344631 3362879 3490003 3852287
12809C852287M74632K83152M53426M90198M55722K29448K9624j56315L9625R8681
$$ 3852287 4326919 4610071 5063497 5553695 6009417 6238865 6268489 6112174 6151799 6250480
12799F250480l19947k31635k52734k58155l57707p9891j5726j73755k95235k72091
$$ 6250480 5930533 5698898 5446164 5188009 4830302 4750411 4734685 4560930 4265695 3993604
12789C993604J36696n147Q214n739l5422k1055j83176J74736N3797J18188L43646
$$ 3993604 4130300 4125153 4133367 4127628 4092206 4071151 3887975 4062711 4116508 4234696 4578342
12778D578342J84005L99730M90788J71303L74013K09429L73119L75389K96224
$$ 4578342 4762347 5162077 5652865 5824168 6198181 6407610 6780729 7156118 7452342
12769G452342K32009K87846K69673N5244k49338R8506J28608J42124K97962J58734
$$ 7452342 7684351 7972197 8241870 8297114 8047776 8146282 8274890 8417014 8714976 8873710
12759H873710L96454L45387o2589j11591j45187l96672n98857m28069l89731l84786
$$ 8873710 9270164 9615551 9552962 9441371 9296184 8899512 8300655 7872586 7482855 7098069
12749G098069m32725m83277l76549l16126k37747m967P8905j55695M2569M7552
$$ 7098069 6665344 6182067 5805518 5489392 5251645 5246678 5325583 5169888 5212457 5260009
12739E260009j45302l9878J10275q8147o25K19408L40552R4609K78375M25518
$$ 5260009 5114707 5074829 5185104 5096957 5096332 5315740 5656292 5750901 6029276 6454794
12729F454794K50235J70810K79360L69817L93758J31065R7754J02145j88766k63722
$$ 6454794 6705029 6875839 7155199 7525016 7918774 8049839 8147593 8249738 8060972 7797250
12719G797250k21162m23042m18326k43269j39779j35157M273K1301l8922n14132
$$ 7797250 7576088 7153046 6734720 6491451 6351672 6216515 6220788 6242089 6203167 5689035
12709E689035j79012j2183p1977k60949j99221k25556o9907j72999j14839k42119
$$ 5689035 5510023 5497840 5425863 5164914 4965693 4740137 4670230 4497231 4382392 4140273
12699D140273k29623p11r4453j24316m338q193O9520Q5001L2333J4886j3480J0947
$$ 4140273 3910650 3909939 3815486 3691170 3686832 3678639 3748159 3833160 3865493 3880379 3866899 3877846
12687C877846k178q3662j33342k8436P0482J58533l223j88646N8852K1458k2914
$$ 3877846 3875668 3792006 3658664 3630228 3700710 3859243 3856020 3667374 3726226 3747684 3724770
12676C724770O7065L0298j89903j33735J01287k8441K9620j51294l9047J76773
$$ 3724770 3791835 3822133 3632230 3498495 3599782 3571341 3600961 3449667 3410620 3587393
12666C587393o2436q8097j65336O7876n917P6725j5120j87594L9899n794j69039
$$ 3587393 3524957 3436860 3271524 3339400 3333483 3410208 3395088 3207494 3247393 3241599 3072560
12655C072560Q376P2532r2047j3180J80925J87090l2243l6585o9349j69885J09137
$$ 3072560 3080936 3153468 3061421 3048241 3229166 3416256 3384013 3347428 3278079 3108194 3217331
12644C217331O055l9535o161j83194p5925j11011q5849j4002J68442K12356j6472
$$ 3217331 3223386 3183851 3177690 2994496 2918571 2807560 2721711 2707709 2876151 3088507 3072035
12633C072035j5555j9725Q972J20298m2883P6766r8671k11J33251n3653j15838
$$ 3072035 3056480 3036755 3045727 3166025 3123142 3199908 3101237 3101026 3234277 3180624 3064786
12622C064786o8947j44129n1116K21668J48901n7932k60944q1182Q7045P881K09870
$$ 3064786 2995839 2851710 2800594 3022262 3171163 3113231 2852287 2771105 2858150 2866031 3075901
12611C075901K918k13385P8342r8225N4126Q5670j7278J0114j04392R758K08750
$$ 3075901 3078819 2865434 2943776 2845551 2899677 2985347 2968069 2978183 2873791 2883549 3092299
12600C092299n191j0118m2124r4402j788n2989j97836K02072J29265k01853j97816
$$ 3092299 3087108 3076990 3034866 2940464 2938676 2885687 2687851 2889923 3019188 2817335 2619519
12589B619519J10975p5799o7841k933q6904Q0769J18180N4146J23384k5010j1834
$$ 2619519 2730494 2654695 2586854 2583921 2497017 2577786 2695966 2750112 2873496 2848486 2836652
12578B836652N3394p5316k22849j3676J13522P6288K35534R6828l8371N2465n7836
$$ 2836652 2890046 2814730 2591881 2578205 2691727 2768015 3003549 3100377 3062006 3114471 3056635
12567C056635j39492j74615L5217J21901K22103r489j46936j91392J42915K15939
$$ 3056635 2917143 2742528 2777745 2899646 3121749 3112260 2965324 2773932 2916847 3132786
12557C132786j51669j91494O4259K38333J8440j84774N0823J6056k33270Q9789
$$ 3132786 2981117 2789623 2853882 3092215 3110655 2925881 2976704 2992760 2759490 2849279
12547B849279j0079J22617l180m4938L5011m040P8174k51681j49171j34012J65926
$$ 2849279 2839200 2961817 2958637 2913699 2948710 2944670 3022844 2771163 2621992 2487980 2653906
12536B653906K07152P492j58127l9130O9050p3519k5304R2784J71480O9475j65458
$$ 2653906 2861058 2868550 2710423 2671293 2740343 2666824 2641520 2734304 2905784 2975259 2809801
12525B809801M3688k377j05450L8977K18265R2453j7458k18738o379L0002M8546
$$ 2809801 2853489 2851112 2745662 2784639 3002904 3095357 3077899 2859161 2852782 2882784 2931330
12514B931330J90340m0971j50474j12882Q3476N2555J4148R9136O6078p272r7253
$$ 2931330 3121670 3080699 2930225 2817343 2900819 2953374 2967522 3066658 3132736 3125464 3028211
12503C028211J6132o4419j90582p1208j9351J92435K952l4344L1802K00787N3669
$$ 3028211 3044343 2979924 2789342 2718134 2698783 2891218 2894170 2859826 2891628 3092415 3146084
12492C146084n9829L1901j08771M5507P9146n1681m3513j72427q408r0246Q3889
$$ 3146084 3086255 3118156 3009385 3054892 3134038 3082357 3038844 2866417 2858009 2767763 2851652
12481B851652P4727K15592J59994m6776m9720j32391j77135J50233L04446K8780
$$ 2851652 2926379 3141971 3301965 3255189 3205469 3073078 2895943 3046176 3350622 3379402
12471C379402j56253j31983L4299L3360j71098P8542J20268r738m8022j72247
$$ 3379402 3223149 3091166 3125465 3158825 2987727 3066269 3186537 3176799 3128777 2956530
12461B956530j33743j84416J18065P9661J35210J53278l4533j50983J22054K51342
$$ 2956530 2822787 2638371 2756436 2836097 2971307 3124585 3090052 2939069 3061123 3312465
12451C312465j75356M0867J63291j23602k26577K4898J43976N766j38282J5000
$$ 3312465 3137109 3177976 3341267 3217665 2991088 3015986 3159962 3165728 3027446 3042446
12441C042446J28247J33050k519q8645J9690P9234k3944j71972j4478j1630j26829
$$ 3042446 3170693 3303743 3301224 3212579 3232269 3311503 3287559 3115587 3101109 3089479 2962650
12430B962650Q8119j8501r3314M7678L7251m5760O3035O2804J34965J26843q9961
$$ 2962650 3050769 3032268 2938954 2986632 3023883 2978123 3041158 3103962 3238927 3365770 3275809
12419C275809L5248J39062l2988j80015N4377J28924M318j11945j7062j2400q6546
$$ 3275809 3311057 3450119 3417131 3237116 3291493 3420417 3424735 3312790 3295728 3283328 3196782
12408C196782n5888o70J61412R0020O2583N011O1911L3367K05952n024k27343
$$ 3196782 3140894 3140224 3301636 3391656 3454239 3459250 3521161 3554528 3760480 3755456 3528113
12397C528113R2566l0248l2558j65663P904Q1818N9879J1164P7861k25541j78183
$$ 3528113 3620679 3590431 3557873 3392210 3400114 3481932 3541811 3552975 3630836 3405295 3227112
12386C227112K2602K10949j4961Q7629J6586j99459k41971M4297J05407J69577
$$ 3227112 3249714 3460663 3445702 3533331 3549917 3350458 3108487 3152784 3258191 3427768
12376C427768K3965J50596J48456j04309K1737j37198M3214j38530O1778P3444
$$ 3427768 3451733 3602329 3750785 3646476 3668213 3531015 3574229 3435699 3497477 3570921
12366C570921P2378K10030J68931J48791k38407k86201J08823j9402M749k5910
$$ 3570921 3643299 3853329 4022260 4171051 3932644 3646443 3755266 3735864 3740613 3714703
12356C714703J84027J32628M3191Q1378J6891r2630j17754K9907Q1262j9772K8308
$$ 3714703 3898730 4031358 4074549 4155927 4172818 4080188 3962434 3992341 4073603 4053831 4082139
12345D082139K6521J6681m9425J60166j3894j04005o9483N1028J7481m1448J05186
$$ 4082139 4108660 4125341 4075916 4236082 4222188 4118183 4048700 4099728 4117209 4075761 4180947
12334D180947r5906M738N7838k02542j77689M8605J20242r1593L2334Q5589O6536
$$ 4180947 4085041 4089779 4147617 3945075 3767386 3815991 3936233 3844640 3876974 3962563 4029099
12323D029099k12826P5876L32747K3524j50627k6144Q7479K76498L0570j53797
$$ 4029099 3816273 3892149 4224896 4248420 4097793 4071649 4159128 4435626 4466196 4312399
12313D312399J66536J57518J12015j30207m9410O819L5163M3378M1871K4709P6809
$$ 4312399 4478935 4636453 4748468 4618261 4568851 4575670 4610833 4654211 4696082 4720791 4797600
12302D797600n688m1758J42108J17978L1157K8623J79499K59656J12791M8729
$$ 4797600 4791912 4750154 4892262 5010240 5041397 5070020 5249519 5509175 5621966 5670695
12292E670695j61216N5238J46452K5861J0564L77484K90610N79514N85633N03322
$$ 5670695 5509479 5564717 5711169 5737030 5747594 6125078 6415688 6995202 7580835 8084157
12282H084157K70296N46553O93582R27366P03865N25282M32316M68414N09643
$$ 8084157 8354453 8901006 9594588 10521954 11225819 11751101 12183417 12651831 13161474
12273A3161474K24867n9400l22355o04976m88144m57599n19258k88794j75198
$$ 13161474 13386341 13326941 13004586 12399610 11911466 11453867 10934609 10645815 10470617
12264A0470617l75980l88675k47112l00564k12752j95702o3788j05102J49158
$$ 10470617 10094637 9705962 9458850 9158286 8945534 8749832 8686044 8580942 8730100
12255H730100J64746k259J8971J51664M97807L95543K54255K48622N01974O11037
$$ 8730100 8894846 8892587 8911558 9063222 9561029 9956572 10210827 10459449 10961423 11572460
12245A1572460O84923P31348J052112J153253J227703J500984J562883J273487
$$ 11572460 12257383 12988731 14040843 15194096 16421799 17922783 19485666 20759153
12237B0759153J123282J052448Q43719Q03905J81157o63396p89017j009139j359947
$$ 20759153 21882435 22934883 23778602 24582507 24763664 24100268 23311251 22302112 20942165
12228B0942165j412341j269768j029606j057924q41972p99761p56559o32702o26198
$$ 20942165 19529824 18260056 17230450 16172526 15330554 14530793 13774234 13141532 12515334
12219A2515334n72675l21140j40400J8771k45648j39169j24175p1316j55203o9964
$$ 12515334 11942659 11621519 11481119 11499890 11254242 11115073 10990898 10919582 10764379 10694415
12209A0694415L5294J18166J57988J57669K78572N30760O30860L97515N22001
$$ 10694415 10729709 10847875 11005863 11163532 11442104 11972864 12603724 13001239 13523240
12200A3523240L73380L24669M10731M01654N34224N14487J91182K5295m14249
$$ 13523240 13896620 14221289 14632020 15033674 15567898 16082385 16273567 16298862 15884613
12191A5884613l86606m63967p44112o39716o37275o96100m31515l97308m87146
$$ 15884613 15498007 15034040 14289928 13650212 13012937 12316837 11885322 11488014 11000868
12182A1000868l40617k57667j42729l30447m36360j89198q9374k78334j57571
$$ 11000868 10660251 10402584 10259855 9929408 9493048 9303850 9214476 8936142 8778571
12173H778571p8681k65425n2566p2990j67766q8483N4947Q6380l73434j96131
$$ 8778571 8699890 8434465 8381899 8308909 8141143 8052660 8107607 8193987 7820553 7624422
12163G624422J61951l7107l12695j22238K8833O5361L5367l0397K7414M7675L885
$$ 7624422 7786373 7749266 7436571 7314333 7343166 7408527 7443894 7413497 7440911 7488586 7492471
12152G492471N4651j09385k38O6609J45156O1632k57147p7137n9508k7804L6307
$$ 7492471 7547122 7437737 7437499 7504108 7649264 7710896 7453749 7376612 7317104 7289300 7325607
12141G325607K15353r2109l02101j74668r5557j10288N2836n9225o192Q9480J86486
$$ 7325607 7540960 7448851 7146750 6972082 6876525 6766237 6819073 6759848 6753656 6843136 7029622
12130G029622m0052p0511k588k4971m5513j02654J08153q9535P5344R5111j8280
$$ 7029622 6989570 6919059 6916471 6891500 6845987 6743333 6851486 6761951 6837295 6932406 6914126
12119F914126k74180q7753O6029j11835j27538n9311Q7686q3547J25087M1187
$$ 6914126 6639946 6552193 6618222 6506387 6378849 6319538 6407224 6323677 6448764 6489951
12109F489951r31N7104o2739o4591j08352r9811P9770K5116j4524M1374m0617
$$ 6489951 6489020 6546124 6483385 6418794 6310442 6210631 6290401 6315517 6300993 6342367 6301750
12098F301750N791J34011k69321p8977P1500P1385K31790Q215J6711O2526m9231
$$ 6301750 6307541 6441552 6172231 6093254 6164754 6236139 6467929 6476144 6492855 6555381 6506150
12087F506150j13157L2017J71961p259j44960j77405L7974K6863K1727Q4948M6443
$$ 6506150 6392993 6425010 6596971 6589712 6444752 6267347 6305321 6332184 6353911 6438859 6485302
12076F485302k27628P5925K26340j17744l11704N2026J10205j37620j6429K29742
$$ 6485302 6257674 6333599 6559939 6442195 6130491 6182517 6292722 6155102 6138673 6368415
12066F368415K5804k371J31706r204j3286j10496j82405j44051J37684J00474
$$ 6368415 6394219 6391848 6523554 6514350 6501064 6390568 6208163 6064112 6201796 6302270
12056F302270J23422j19016K4978N8501j2304k36033j05743L946N7759o1021J40380
$$ 6302270 6425692 6306676 6331654 6390155 6377851 6141818 6036075 6040021 6097780 6036759 6177139
12045F177139J4737o0053o5264N9507J03562j4078J82786n9410k86200j81287
$$ 6177139 6191876 6131823 6066559 6126066 6229628 6215550 6398336 6338926 6052726 5871439
12035E871439K63593J4533j73111l9590O3779J64790o1162j94164k393J62297
$$ 5871439 6135032 6149565 5976454 5936864 6000643 6165433 6104271 5910107 5907714 6070011
12025F070011P1379l41293k9533M4774l3378K14168K0004j45783K4764P9108L8620
$$ 6070011 6141390 5800097 5770564 5815338 5781960 5996128 6016132 5870349 5895113 5974221 6012841
12014F012841j41238j4910l9873P6536J9491j39207k02843J04194J42274L39775
$$ 6012841 5871603 5856693 5816820 5893356 5912847 5773640 5570797 5674991 5817265 6157040
12004F157040J21577m0475k18067o0619J0844N7731m046k1958j22568K38451m3664
$$ 6157040 6278617 6238142 6020075 5959456 5970300 6028031 6023985 6002027 5879459 6117910 6074246
11993F074246j33815l4039N4963R5100p3380q0620j3879J31236J65575l4984j18178
$$ 6074246 5940431 5906392 5961355 6056455 5983075 5902455 5888576 6019812 6185387 6150403 6032225
11982F032225j5565k8199J84109o11o7850J32514r1261Q2018Q4859j92426p4871
$$ 6032225 6016660 5988461 6172570 6171959 6104109 6236623 6145362 6227380 6312239 6119813 6044942
11971F044942j4019L5546J06625L730r3363m8111q9508j93824j26816r6233J65208
$$ 6044942 6030923 6066469 6173094 6176824 6083461 6035350 5945842 5752018 5625202 5528969 5694177
11960E694177J84970J51865Q2477J039r769k1652m6993p2832J82251N6530j31241
$$ 5694177 5879147 6031012 6113489 6114528 6104759 6083107 6036114 5963282 6145533 6202063 6070822
11949F070822R7171q189j25956p5515N2144N7208J41013p5208j99807j4764o2066
$$ 6070822 6167993 6159804 6033848 5958333 6010477 6067685 6208698 6133490 5933683 5918919 5856853
11938E856853m162j88282o4110J07008J00884L8695q3900j19011O4290J11151
$$ 5856853 5852691 5664409 5600299 5707307 5808191 5846886 5762986 5643975 5708265 5819416
11928E819416j00940j67312R2393J22875P2090J04241j16116O3890P5215p0968
$$ 5819416 5718476 5551164 5643557 5766432 5838522 5942763 5826647 5890537 5965752 5894784
11918E894784j32991J17451J35925K0J3168r0812J2464J13528R3248p3071L238
$$ 5894784 5761793 5879244 6015169 6015189 6028357 5937545 5950009 6063537 6156785 6083714 6086952
11907F086952m9489k31160o6940n0266J75308r9002R0603m58m7753j42309J13896
$$ 6086952 6037463 5806303 5739363 5689097 5864405 5765403 5856006 5855548 5807795 5665486 5779382
11896E779382J98661m4861j09241j64785Q8045o0929m3903j0947L685J37363o7780
$$ 5779382 5978043 5933182 5823941 5659156 5747201 5686272 5642369 5631422 5635107 5772470 5704690
11885E704690j00336k51876N4290K8450k602n7625o7510J39364L39331j06760
$$ 5704690 5604354 5352478 5406768 5435218 5432616 5374991 5307481 5446845 5786176 5679416
11875E679416k81122O1385J74475N7651Q661n0504j02101O5759P910m3437J30743
$$ 5679416 5398294 5459679 5634154 5691805 5700466 5649962 5547861 5613620 5621530 5578093 5708836
11864E708836O3398n7589j72837j59940p4691K3668J30840J2358j07618j8698
$$ 5708836 5772234 5714645 5541808 5381868 5307177 5330845 5461685 5474043 5366425 5347727
11854E347727K14354L9971j48287k01670j16363o0656L5306J46344N4273J27199
$$ 5347727 5562081 5602052 5453765 5252095 5135732 5075076 5110382 5256726 5310999 5438198
11844E438198M648j57403q3159M7208L6459j90048P5402K12626R2218N1059M719
$$ 5438198 5442846 5285443 5202284 5249492 5285951 5095903 5171305 5383931 5476149 5527208 5531927
11833E531927J19269O0760J08476k49675k93763l8482N4946j58524M5801M9481
$$ 5531927 5651196 5711956 5820432 5570757 5276994 5238512 5293458 5134934 5180735 5230216
11823E230216K4215j07765K9316J54510L3189J14737o0356k38065j23897q4226
$$ 5230216 5254431 5146666 5175982 5330492 5363681 5478418 5418062 5179997 5056100 4971874
11813D971874N1878J87490j12715j92555J987J11717Q5770K61408J4163m0708
$$ 4971874 5023752 5211242 5098527 4905972 4907959 5019676 5105446 5366854 5381017 5340309
11803E340309K8307n7078j84409p7517j56456M8248r374N3237M4752l3029K6064
$$ 5340309 5368616 5311538 5127129 5049612 4893156 4941404 4932030 4985267 5030019 4996990 5023054
11792E023054N680O685j17412j52451J68329J41587N5618N0896k8147n0914j63959
$$ 5023054 5028734 5035419 4918007 4765556 4933885 5075472 5131090 5181986 5153839 5102925 4938966
11781D938966j10843o6054k2605N5866J30470K647n7608J07011J3163L4878O674
$$ 4938966 4828123 4762069 4739464 4795330 4925800 4928447 4870839 4977850 4991013 5025891 5032565
11770E032565j32881j63839K9223p4575j41407O5151J22596J90124j12521K2272
$$ 5032565 4899684 4735845 4765068 4690493 4549086 4614237 4736833 4926957 4814436 4836708
11760D836708K93001J7335r7027k01356r1324J67729J42709M7674K712j92345
$$ 4836708 5129709 5147044 5050017 4848661 4757337 4925066 5067775 5115449 5118161 4925816
11750D925816K6588p7663j09025O047L2009P1009j37361j37879l2847K41618j28011
$$ 4925816 4952404 4874741 4765716 4771763 4803772 4874781 4737420 4599541 4566694 4808312 4680301
11739D680301k76795R4423J79203Q178J24499J1671j54563J14336J48460j62293
$$ 4680301 4403506 4497929 4677132 4685310 4809809 4821480 4666917 4781253 4929713 4767420
11729D767420j79964j35609k0016J69688J27134k14068K167J18395q6524p5512
$$ 4767420 4587456 4451847 4431831 4601519 4728653 4514585 4516752 4635147 4548623 4473111
11719D473111L9085P636R4373K3800k9083K1848l77397J50038J48855q6569p1371
$$ 4473111 4512196 4519832 4614205 4638005 4608922 4630770 4253373 4403411 4552266 4465697 4394326
11708D394326j37305l074K25067J59570j44163q3192q4690P2330J86380L4561
$$ 4394326 4257021 4253947 4479014 4638584 4494421 4411229 4326539 4398869 4585249 4619810
11698D619810j07173P829r1639k6076j4235K5806P6466k67285m7893p449k32995
$$ 4619810 4512637 4520466 4428827 4402751 4388516 4414322 4490788 4223503 4175610 4168161 3935166
11687C935166O5728J47985j06347r1031L0969r4218m8302K87499J71720o6297
$$ 3935166 4000894 4148879 4042532 3951501 3982470 3888252 3839950 4127449 4299169 4232872
11677D232872J02909Q8443p7360k71281j58642l9433j43943l1435J08522J15028
$$ 4232872 4335781 4424224 4346864 4075583 3916941 3877508 3733565 3702130 3810652 3925680
11667C925680K30118j21396o2129J10817O3917j09091J32981l8413j19979J68172
$$ 3925680 4155798 4034402 3972273 4083090 4147007 4037916 4170897 4132484 4012505 4180677
11657D180677K589L06786O2830K2291K37905K22066j67615k48224O1489M3049
$$ 4180677 4183266 4490052 4552882 4575173 4813078 5035144 4867529 4619305 4680794 4723843
11647D723843o8810k20393j6338P9869j1564m51123l14398J75603J21463j58334
$$ 4723843 4655033 4434640 4418302 4498171 4486607 4035484 3721086 3896689 4018152 3859818
11637C859818j39119q099R7694L7517k28201m3727O7165Q5357m8209P9256j26732
$$ 3859818 3720699 3712600 3810294 3847811 3619610 3575883 3643048 3728405 3680196 3759452 3632720
11626C632720L5351k2750L3208K0406J93171l0628P0998l2818r0525k09405N6032
$$ 3632720 3668071 3645321 3678529 3698935 3892106 3861478 3932476 3899658 3809133 3599728 3655760
11615C655760J87930Q9727m0342M9380k495J02044l68749j69886N0881K2503m9776
$$ 3655760 3843690 3933417 3893075 3942455 3939960 4042004 3673255 3503369 3554250 3576753 3526977
11604C526977P7692J74151P5674k991O0459J11230k79647k3255j8254l07082o7852
$$ 3526977 3604669 3778820 3854494 3851503 3911962 4023192 3743545 3720290 3702036 3394954 3327102
11593C327102J70350k8561l19042j39918K22807J09437O1291q5515J0576j85582
$$ 3327102 3497452 3468891 3149849 3009931 3232738 3342175 3403466 3317951 3328527 3142945
11583C142945j45635J702J59095O266J20719J36616l4745o2817l854R3523J32480
$$ 3142945 2997310 2999012 3158107 3164373 3285092 3421708 3386963 3324146 3320292 3413815 3546295
11572C546295J27366Q6059j86053j05773p6103j00800N4145M9969n90p6776j27227
$$ 3546295 3673661 3759720 3573667 3467894 3391791 3290991 3345136 3395105 3394515 3317739 3190512
11561C190512o4556Q3144r3680j56198j03610o5739K69383P4830Q6361j33833
$$ 3190512 3125956 3209100 3115420 2959222 2855612 2789873 3059256 3134086 3220447 3086614
11551C086614J3500j8307M0126J16325r0001k48071q0494l7476Q9178r437n732
$$ 3086614 3100114 3081807 3121933 3238258 3148257 2900186 2819692 2782216 2871394 2861957 2856225
11540B856225O4301K0937J92482q9723j3060Q0589p5826p9306j45812P9231M7026
$$ 2856225 2920526 2941463 3133945 3044222 3031162 3111751 3035925 2956619 2810807 2890038 2937064
11529B937064N1455p2807k41324P9693Q3346J45062Q021J4516O4885O531k57474
$$ 2937064 2988519 2915712 2674388 2754081 2837427 2982489 2990510 3005026 3069911 3076442 2818968
11518B818968r6057l3582R4424J28041L3228j38992k45556j0309J95072Q4030
$$ 2818968 2722911 2689329 2783753 2911794 2945022 2806030 2560474 2550165 2745237 2829267
11508B829267P1471j6717p5495o6873J38682R3863J22023j51436j92453j32713
$$ 2829267 2900738 2884021 2808526 2741653 2880335 2974198 3096221 2944785 2752332 2619619
11498B619619M1818J53219O9448k29944j36363l0608J47820J6615P9564R399r7484
$$ 2619619 2661437 2814656 2884104 2654160 2517797 2487189 2635009 2651624 2731188 2740587 2643103
11487B643103N6892K9771k73496j27283J99780O4174j21240j00333R4193j9626
$$ 2643103 2699995 2729766 2456270 2328987 2528767 2592941 2471701 2371368 2465561 2445935
11477B445935k8314O9047n9422j8307J08675J51659j4789Q2556J34858r1905j61933
$$ 2445935 2417621 2486668 2427246 2408939 2517614 2669273 2654484 2737040 2871898 2779993 2618060
11466B618060p2695j42267j38847p9560J44586K69971m1680O0333J45802o7298
$$ 2618060 2545365 2403098 2264251 2184691 2329277 2599248 2557568 2617901 2763703 2696405
11456B696405r183K40259m9063q1027l3874l11437k458J12132j49902j36104j05906
$$ 2696405 2687222 2927481 2878418 2797391 2763517 2452080 2449622 2561754 2411852 2275748 2169842
11445B169842N4596J76344l1210l4140K20590k8704L2968l2979J06681J24458
$$ 2169842 2224438 2400782 2369572 2335432 2556022 2527318 2560286 2527307 2633988 2758446
11435B758446p5970r3369j64746k39615o8108L2205J59324P0087M2124j53581
$$ 2758446 2682476 2589107 2424361 2184746 2116638 2148843 2308167 2378254 2420378 2266797
11425B266797k31838j5877K7055K42848P8653l3768j60889q2105Q0635K37856
$$ 2266797 2034959 2019082 2046137 2288985 2367638 2333870 2172981 2090876 2171511 2409367
11415B409367P8613m6561l4307l3386j12161j01825n6088n7511j3783j30715j6684
$$ 2409367 2487980 2441419 2407112 2373726 2261565 2159740 2103652 2046141 2032358 1901643 1884959
11404A884959k7645L41814J09860P7259p9373k12971q8136l7457r3776l7905j5648
$$ 1884959 1857314 2199128 2308988 2386247 2306874 2093903 2005767 1968310 1874534 1836629 1820981
11393A820981M5294m2819j51573j1455J20596k13852k7325J64756J05484J00796
$$ 1820981 1866275 1823456 1671883 1660428 1781024 1567172 1539847 1704603 1810087 1910883
11383A910883P1566q870j11003j02733J25064n8378m7468M9433R339l6959k9177
$$ 1910883 1982449 1973579 1862576 1759843 1884907 1826529 1779061 1828494 1837833 1800874 1771697
11372A771697j8397R7003Q7733k15226j09539j10556j04532Q8811K51611k4578
$$ 1771697 1753300 1850303 1938036 1722810 1613271 1502715 1398183 1486994 1738605 1714027
11362A714027k01171q0601J81433J58625Q6533p960J8636L5109j12914n5370J00538
$$ 1714027 1512856 1432255 1613688 1772313 1858846 1850886 1869522 1904631 1791717 1736347 1836885
11351A836885l5958J0569j26241J057K3275Q9911J27551N7620P771K7985m3857
$$ 1836885 1800927 1811496 1685255 1686312 1709587 1799498 1927049 1984669 1992440 2020425 1976568
11340A976568p1240J24530k6084O4788r1085j77728N8315J99450J48256M8417
$$ 1976568 1905328 2029858 2003774 2068562 1977477 1799749 1858064 2057514 2205770 2254187
11330B254187J2617J70694K04529L7357p5362n4725r079P3378O5752j55937j76546
$$ 2254187 2266804 2437498 2642027 2679384 2604022 2549297 2540218 2613596 2679348 2523411 2346865
11319B346865p3399J09910n6992k39482l3516j08367j16577j28197J18744q8764
$$ 2346865 2273466 2383376 2326384 2086902 2053386 1945019 1828442 1700245 1818989 1730225
11309A730225j04606r7203J32257J79856R8496j27502L6859J46205O0100j6261
$$ 1730225 1625619 1528416 1660673 1840529 1939025 1811523 1848382 1994587 2054687 2038426
11299B038426q5497l3075R2113N6525l4j00444k9534q7841R1725R19K31019K8091
$$ 2038426 1952929 1919854 2011967 2068492 2068458 1968014 1938480 1850639 1942364 1943283 2174302 2202393
11287B202393r4390o5157J35167j04772k18526p4548L600k13331J40966O4473
$$ 2202393 2108003 2042846 2178013 2073241 1854715 1780167 1783767 1570436 1711402 1775875
11277A775875j74379J9622J50558N9650J6975n9110j20644J2928K1814j12095
$$ 1775875 1601496 1621118 1771676 1831326 1848301 1789191 1668547 1681475 1703289 1591194
11267A591194q8996M6142M0551N3858J51525J47134J23920J01870J50017N2754
$$ 1591194 1502198 1548340 1588891 1642749 1794274 1941408 2065328 2167198 2317215 2369969
11257B369969k5140J53761j4998l0064n698r9459l1830o0460j48296L2197j2251
$$ 2369969 2344829 2498590 2483592 2453528 2447830 2348371 2316541 2256081 2107785 2139982 2127731
11246B127731j26839l15326l20504J12094N5392J25424O5244M2431j14108r4910
$$ 2127731 2000892 1685566 1365062 1477156 1532548 1657972 1723216 1765647 1651539 1556629
11236A556629k1485Q1324k6502k5328K23973K39931N3290j1602J24268J99119
$$ 1556629 1535144 1616468 1589966 1564638 1788611 2028542 2081832 2070230 2194498 2393617
11226B393617j66147r1509J4141J36864k0822n4890J1752L22798O4090J71428
$$ 2393617 2227470 2135961 2150102 2286966 2266144 2211254 2223006 2545804 2609894 2781322
11216B781322K95175L16701L23441L28132N09003R68907J147095J057302J151091
$$ 2781322 3076497 3393198 3716639 4044771 4553774 5522681 6669776 7727078 8878169
11207H878169J706747K025973K842166M350221O795435J1535846K0000909L0364297
$$ 8878169 10584916 12610889 15453055 19803276 26598711 38134557 58135466 88499763
11199H8499763L1897061J8728264O160516O124037J2139516J9094491J4277213
$$ 88499763 120396824 139125088 145285604 151409641 163549157 182643648 196920861
11192A96920861j2913125l9615744m0292913k7975929j7569310j0987056o912709
$$ 196920861 184007736 144391992 104099079 76123150 58553840 47566784 40654075
11185D0654075m628180l628243k981583k290248j901667j939337j887469j210102
$$ 40654075 36025895 32397652 29416069 27125821 25224154 23284817 21397348 20187246
11177B0187246r71714j186252r78995p63772n40078n34606o71229m11201p01560
$$ 20187246 19215532 18029280 17050285 16286513 15746435 15211829 14540600 14129399 13427839
11168A3427839m89536m19308n79463m86122k66156n03076k55601q4135k32008
$$ 13427839 12938303 12518995 11939532 11453410 11187254 10684178 10428577 10344442 10112434
11159A0112434k15270l51959m82500k43352j20165n6520j46593k29106k52171
$$ 10112434 9897164 9545205 9062705 8819353 8699188 8642668 8496075 8266969 8014798
11150H014798k4456p7945l8945j94364k66253j03408j02746j68499o8240k48237
$$ 8014798 7990342 7912397 7873452 7679088 7412835 7309427 7206681 7038182 6969942 6721705
11140F721705o9902l65k34485k95547q3895P009j51455j14082j28808q819k9450
$$ 6721705 6651803 6651438 6416953 6121406 6037511 6044520 5893065 5778983 5650175 5641356 5611906
11129E611906j19491j95015k65414q7935j99553j37560o8784L2312J78N4449L9404
$$ 5611906 5492415 5297400 5031986 4944051 4744498 4606938 4538154 4570466 4570644 4625093 4664497
11118D664497j67614p1336k046j8466j69062o0282M4302k19822j77241K47j35266
$$ 4664497 4496883 4425547 4423501 4405035 4235973 4175691 4219993 4000171 3822930 3823177 3687911
11107C687911r8440L6986J51159J5401o7850p7896o653J1632J21394k7312j43801
$$ 3687911 3589471 3626457 3777616 3793017 3725167 3647271 3640618 3652250 3773644 3746332 3602531
11096C602531j31103l18375j17687J4772J9630J44198j29533m3648k22112l177
$$ 3602531 3471428 3153053 3035366 3050138 3069768 3213966 3084433 3040785 2818673 2815496
11086B815496N9955r5411J40334P4506j51273J13516J29360P6082K48966o5702
$$ 2815496 2875451 2780040 2920374 2994880 2843607 2957123 3086483 3162565 3411531 3345829
11076C345829j30543J25966P5929L213N5160J12225k092n8290j93718r1265Q2097
$$ 3345829 3215286 3341252 3417181 3420394 3475554 3587779 3585687 3527397 3333679 3242414 3324511
11065C324511J57136j4570k29050j57515J861n975j40805k19493j52140J29948
$$ 3324511 3481647 3467077 3238027 3080512 3082373 3076398 2935593 2716100 2563960 2693908
11055B693908l0478K9555O5125p6457J15512k15142k33043j03801o7401N2079
$$ 2693908 2663430 2692985 2758110 2681653 2797165 2582023 2348980 2245179 2177778 2229857
11045B229857Q9824j77109p5631j15690j49879J75085J3537O1206r3882j36675
$$ 2229857 2319681 2142572 2066941 1951251 1801372 1976457 1989994 2051200 1957318 1820643
11035A820643N2962J02673J78260K13135j15325q2089P1650K05348L15518j42404
$$ 1820643 1873605 1976278 2154538 2367673 2252348 2170259 2241909 2447257 2762775 2620371
11025B620371R8736K26635k3191J45849Q7551p5602k6608p1085J59105m6426Q244
$$ 2620371 2719107 2945742 2922551 3068400 3155951 3080349 3053741 2982656 3141761 3095335 3103579
11014C103579j9245m0254J83649L1067K6473l99341j42668l7291L9646q1153r4095
$$ 3103579 3084334 3044080 3227729 3258796 3285269 2885928 2743260 2705969 2745615 2664462 2570367
11003B570367o6927R6580J64566j17792M539n966q9510k09101j83865l9634j38760
$$ 2570367 2503440 2600020 2764586 2646794 2651333 2645367 2555857 2346756 2162891 2123257 1984497
10992A984497n990j09204j92175n6800Q2194J61871k45785j73780j1418o9977
$$ 1984497 1978507 1869303 1677128 1620328 1702522 1864393 1618608 1444828 1433410 1363433
10982A363433R5046j53657q9067j19334j00436q1674q5629k7103J09493o4242
$$ 1363433 1458479 1304822 1215755 1096421 995985 914311 828682 801579 911072 846830
10972H46830n6544m0739l8369J1584K65617N9728M154j35522q7821j32396j00137
$$ 846830 790286 749547 711178 722762 988379 1048107 1052261 916739 828918 696522 596385
10961E96385J0388k6580n6509J02983L47142L6407j20934j16994k4343k49034
$$ 596385 606773 580193 523684 626667 973809 1010216 889282 772288 747945 498911
10951D98911P6380J20224O8926n0333Q8061j96813q8105Q6866j20011j72996j1809
$$ 498911 575291 695515 764441 714108 802169 605356 517251 604117 484106 311110 299301
10940B99301o3151R3535q0498m9643K17501O7419j44549l5490J35130J89685P6762
$$ 299301 236150 329685 249187 199544 417045 484464 339915 304425 439555 629240 706002
10929G06002k87116q3254J28704K1445p6258J23489k8043q065L525l8601P6210
$$ 706002 418886 335632 464336 485781 409523 533012 504969 496904 500429 461828 538038
10918E38038l1271r2168k7J26903m0004O2783l4013k19558k17054j34642P12J51095
$$ 538038 506767 414599 414572 541475 501471 564254 530241 310683 93629 -41013 -40301 110794
10906A10794J0163K01250J57381O5024J8449j62515j82990j05729J34282q0438
$$ 110794 120957 322207 479588 544612 563061 400546 217556 111827 246109 165671
10896A65671j10319K3001J99089J55645K1634K0232j0846p0915r5859J17553J9638
$$ 165671 55352 78353 277442 433087 454721 474953 464107 393192 297333 414886 434524
10885D34524K6258o7540j57678j71721M3611K86500K18464O0285J37449j71110
$$ 434524 460782 393242 235564 63843 107454 393954 612418 672703 810152 639042
10875F39042l1375R9418L7997m8937J19702k6361o3536q8511k87845n4177J11969
$$ 639042 607667 707085 745082 696145 815847 789486 725950 637439 349594 295417 407386
10864D07386J72267K73192k311k83860j09872M9269K66592L9122j00732n5009
$$ 407386 579653 852845 850534 566674 456802 506071 772663 811785 711053 656044
10854F56044Q1002k6119l3637K23068R7005K3647J3432j9322J3128L1619o6674
$$ 656044 737046 710927 677290 900358 997363 1021010 1034442 1015120 1028248 1059867 993193
10843I93193J4564K56970K52398k3717j25135l34790m03251q7230J40387O190
$$ 993193 1007757 1264727 1517125 1493408 1368273 1033483 630232 543002 683389 689579
10833F89579J1603K5957J35901j82118J05554J08660K10609p8539l45032J236
$$ 689579 701182 727139 863040 680922 786476 895136 1105745 1027206 682174 683410
10823F83410k7802M5845Q0136J01518m577J47635o5562r8695p2165p5961p4957
$$ 683410 655608 701453 781589 883107 878530 1026165 960603 861908 789743 713782 638825
10812F38825J4382P2757o9155Q1104L774j5226k43765R0216K20963J78504J2738
$$ 638825 653207 725964 656809 737913 741687 726461 482696 572912 793875 972379 985117
10801I85117k03214Q976Q3918P2441K3286n2161p4188j29061o3600q7509k00804
$$ 985117 781903 790879 874797 947238 970524 918363 844175 715114 651514 564005 363201
10790C63201K43309P5037K9433O1924J67458j5741k3734J73914q9524J59462K16217
$$ 363201 606510 681547 710980 772904 940362 924621 900887 1074801 985277 1144739 1360956
10779A360956J72171K9000P6305M3159L02551K35700R3858k1873K00581L19693
$$ 1360956 1533127 1562127 1638432 1681591 1984142 2219842 2313700 2291827 2492408 2812101
10769B812101J72428K57028M07417K78727M66935Q32667J045347J158955J611575
$$ 2812101 2984529 3241557 3648974 3927701 4394636 5227303 6272650 7431605 9043180
10760I043180J952657K669069L589957M340075N200069N681516N410766M988207
$$ 9043180 10995837 13664906 17254863 21594938 26795007 32476523 37887289 42875496
10752D2875496N001451N045397M730586M070791K999085J451921j66176j043115
$$ 42875496 47876947 52922344 57652930 61723721 64722806 66174727 66008551 64965436
10744F4965436r43058r36233r67272j624307l427377n397363o219115n681973
$$ 64965436 64022378 63086145 62118873 60494566 57067189 51669826 45450711 39768738
10736C9768738m904867l943760k976984k317248j812835j212727q18862n46857
$$ 39768738 34863871 30920111 27943127 25625879 23813044 22600317 21781455 21234598
10728B1234598m75118l32675L7053M98721P81819Q44745J361268K359769L312814
$$ 21234598 20759480 20426805 20463858 20962579 21744398 22589143 23950411 26310180 29622994
10719B9622994M513608N860496O515154O062269N197045M759667N105664N555193
$$ 29622994 34136602 39997098 46512252 52574521 57771566 62531233 67636897 73192090
10711G3192090M585714K228736l33087j915943j881886r28261j03885M65965O56300
$$ 73192090 77777804 80006540 79673453 77757510 75875624 74947363 74843478 75309443 75965743
10702G5965743K42293p05235j063119m34960K01255O03962J249352K087327K933392
$$ 75965743 76208036 75502801 74439682 74004722 74205977 74809939 76059291 78146618 81080010
10693H1080010L024661K143885J053804j60463j146219j274682p51013j96413
$$ 81080010 84104671 86248556 87302360 87141897 85995678 84720996 83969983 83773570
10685H3773570o38956k401384l867473m480821l383604p31866J819874L940896
$$ 83773570 83134614 80733230 76865757 72384936 69001332 68269466 70089340 74030236
10677G4030236N388165N418220M942075M923780N353762N804781M990345L274293
$$ 74030236 79418401 84836621 89778696 94702476 100056238 105861019 110851364 114125657
10669A14125657J081997p74153j302823o74140O14780J720614J862065K24918
$$ 114125657 115207654 114433501 113130678 112456538 113071318 114791932 116653997 116878915
10661A16878915k174133l691254m157871l097518j091417P83985J565463M50899
$$ 116878915 114704782 111013528 106855657 103758139 102666722 103450707 105016170 105467069
10653A05467069j590985l268159l531891k920256j849540p43575n52389j658818
$$ 105467069 103876084 100607925 97076034 94155778 92306238 91562663 91010274 89351456
10645H9351456l362577m098139l157683j095818J510153L979658N372574N390038
$$ 89351456 85988879 81890740 78733057 77637239 79147392 83127050 88499624 93889662
10637I3889662M708679M523739N029801N451521M461837J791784j077890k263585
$$ 93889662 98598341 103122080 108151881 113603402 118065239 119857023 118779133 116515548
10629A16515548k272409j300865j75059N85796O80849k36842o80600m11097K35867
$$ 116515548 114243139 112942274 112767215 113353011 114033860 113797018 113116418 112705321 112941188
10620A12941188J067451J615792K353742M153945N945140O609923O675224O813568
$$ 112941188 114008639 115624431 117978173 122132118 128077258 134687181 141362405 148175973
10612A48175973P354623P778941P670422P730239O897347N590097L058800l42782
$$ 148175973 155530596 163309537 170979959 178710198 185607545 191197642 194256442 193913660
10604A93913660l518770m940290l366297J225998P107347J1895050J3510833J2101273
$$ 193913660 190394890 185454600 182088303 183314301 190421648 202316698 215827531 227928804
10596B27928804J0908654J1217453J1646455R642162L921965k032239l202776
$$ 227928804 238837458 250054911 261701366 271343528 275265493 273233254 270030478
10589B70030478K072346J0447574J7402501J9589318J8573486J7735987J7783641
$$ 270030478 272102824 282550398 299952899 319542217 338115703 355851690 373635331
10582C73635331J6304062J0115040j152314j1939204j5762217j2273965o335714
$$ 373635331 389939393 400054433 398902119 386962915 371200698 358926733 352591019
10575C52591019k127992j133264k310777k605498j693955k045718p053190j6136770
$$ 352591019 350463027 349329763 347018986 344413488 342719533 340673815 333620625 317483855
10567C17483855k4744756k7775407k4643075j8254711j2853431r385179p548962
$$ 317483855 292739099 264963692 240320617 222065906 209212475 199827296 192278334
10560A92278334o464468o161335o612029q291306j1072003j3067129j3613912
$$ 192278334 185813866 179652531 173040502 164749196 153677193 140610064 126996152
10553A26996152j2473030j0259985q288863o558327n274214m219906l573117l164832
$$ 126996152 114523122 104263137 95974274 89415947 84141733 79921827 76348710 73183878
10545G3183878k807290k339709k181243k396295k075282j802182j644933j653773
$$ 73183878 70376588 68036879 65855636 63459341 61384059 59581877 57936944 56283171
10537E6283171j715241j595765j432454j399166j283766j076964r37323j157359
$$ 56283171 54567930 52972165 51539711 50140545 48856779 47779815 46842492 45685133
10529D5685133j036071r67124q78982q72632j061126q28897q33484p36475r19353
$$ 45685133 44649062 43681938 42802956 41930324 40869198 40040301 39206817 38470342 37550989
10520C7550989p76970p52191p68040q07557q64146o90617l86264l59982o20084
$$ 37550989 36774019 36021828 35253788 34446231 33582085 32891468 32505204 32145222 31525138
10511C1525138p15561n92772n41399n35273n58688n97268m62457m32391m48388
$$ 31525138 30809577 30216805 29675406 29140133 28581445 27984177 27521720 27089329 26640941
10502B6640941l55165n10541n11982l90799m37354m16514o66060l15720l36101
$$ 26640941 26285776 25775235 25263253 24872454 24435100 24018586 23352526 23036806 22700705
10493B2700705n44711j90255k54844l13248k73288l14263l84400p8263j43546
$$ 22700705 22155994 21965739 21710895 21397647 21124359 20810096 20425696 20347433 20203887
10484B0203887l22596l35168k72611j54053l26041m53630P408j72953k57152j10438
$$ 20203887 19881291 19546123 19273512 19119459 18793418 18339788 18347196 18174243 17917091 17806653
10474A7806653k23819R1273m3012O793J2649n1349K4777m8491j86963l55408l68200
$$ 17806653 17582834 17674107 17631095 17637888 17650537 17599188 17623965 17575474 17388511 17033103 16664903
10463A6664903k27768r4183M7302m3280n9837n5186J02907L8253R276p7323k03207
$$ 16664903 16437135 16342952 16390254 16346974 16287137 16231951 16334858 16373111 16382387 16305064 16101857
10452A6101857k23206j74767j11227k34301k66745j11560r6149j06822k62428
$$ 16101857 15878651 15703884 15592657 15358356 15091611 14980051 14883902 14777080 14514652
10443A4514652m12555k19788k57384k02974j78925k74922k09895m83850m41149
$$ 14514652 14102097 13882309 13624925 13421951 13243026 12968104 12758209 12274359 11833210
10434A1833210k91280p7931j33039j41349k15210l08526j44177m8890k12778j01867
$$ 11833210 11541930 11463999 11330960 11189611 10974401 10665875 10521698 10472808 10260030 10158163
10424A0158163j50095j85148p0503j54649k27100j22435j02641j80210k32608
$$ 10158163 10008068 9822920 9752417 9597768 9370668 9248233 9145592 8965382 8732774
10415H732774j69820j44372J53763k1524k31979l61941J2338O786k24518k31024
$$ 8732774 8562954 8418582 8572345 8550821 8318842 7956901 7969239 7976025 7751507 7520483
10405G520483K3738Q2212l14589l66768J37460j2102j04645j0311l7047r6835
$$ 7520483 7544221 7626433 7311844 6945076 7082536 7070434 6965789 6955478 6918431 6821596
10395F821596o8955j54829k6041j22138k23139m7405L3757m9632m2583J598M1260
$$ 6821596 6752641 6597812 6571771 6449633 6226494 6179089 6212846 6163214 6120631 6122229 6163489
10384F163489j04089q0185l3874k7860K9890J08757M4689k05008n8578Q8837k28366
$$ 6163489 6059400 5979215 5945341 5917481 5947371 6056128 6100817 5895809 5837231 5926068 5697702
10373E697702k74130K7671j02102k44670N4993J37752q4420j06178j24637k00967
$$ 5697702 5423572 5451243 5349141 5104471 5159464 5297216 5212796 5106618 4981981 4781014
10363D781014j39038M3311q1916m5734K8421n4580j79803l27562j00444J66184
$$ 4781014 4641976 4685287 4603371 4557637 4586058 4531478 4351675 4024113 3923669 4089853
10353D089853O4124j13089j45887o7033j28888j8143j14882P7960J63930j12740
$$ 4089853 4153977 4040888 3895001 3827968 3699080 3680937 3566055 3644015 3807945 3695205
10343C695205P9574Q4129k31579p8772q3433P4642j13735k41898j06601o2921
$$ 3695205 3774779 3858908 3627329 3548557 3465124 3539766 3426031 3184133 3077532 3014611
10333C014611R7091r3927k51422N3132J05369o6457L4560J31004R2051L7097N9996
$$ 3014611 3111702 3017775 2766353 2819485 2924854 2858397 2892957 3023961 3116012 3153109 3213105
10322C213105j0015R3715J4496j18535j29488J63558p726O944n0842o777j8686
$$ 3213105 3203090 3296805 3311301 3192766 3063278 3226836 3219110 3226054 3175212 3168435 3149749
10311C149749J54260J39634O6508m5109J85114K26966N3767j0194j06867k12502
$$ 3149749 3304009 3443643 3510151 3465042 3650156 3877122 3930889 3920695 3813828 3601326
10301C601326p2322j3449m2357n2850R6851k0047j73195k31637n458K45766Q0354
$$ 3601326 3529004 3515555 3473198 3420348 3517199 3497152 3323957 3092320 3086862 3332628 3412982
10290C412982J2383J80198j06672k40514j95532o4479J8976l528L4294L49998
$$ 3412982 3425365 3605563 3498891 3258377 3062845 2998366 3017342 3013814 3048108 3398106
10280C398106J81684j8589J22072q5755l5106K73478M42185L58502L26632K38532
$$ 3398106 3579790 3561201 3683273 3597518 3562412 3835890 4278075 4636577 4963209 5201741
10270E201741L43987K11565L25980M42076P33047O10236J123740J620896J811936
$$ 5201741 5545728 5757293 6083273 6525349 7258396 7868632 8992372 10613268 12425204
10261A2425204K394604K870764L809167N264659O084096O335141N939549N033224
$$ 12425204 14819808 17690572 21499739 26764398 32848494 39183635 45123184 50156408
10253E0156408M096301L180270K007067L17241k105626m906247o586323o456955
$$ 50156408 54252709 57432979 59440046 59757287 57651661 52745414 46159091 39702136
10245C9702136n475808m355736l502296k891914k250365j527202j315048j180042
$$ 39702136 34226328 29870592 26368296 23476382 21226017 19698815 18383767 17203725
10237A7203725p90364p71133p07434o18152n92158n26135o19613n26933o8575
$$ 17203725 16413361 15642228 14934794 14316642 13724484 13198349 12578736 12051803 11983228
10228A1983228j58276l92348m34361m05903m03970K603K00637J14684l9960M9550
$$ 11983228 11824952 11432604 10998243 10592340 10188370 10190973 10391610 10506294 10466334 10515884
10218A0515884j43111L7080K77625K5972J19978K54890N65526M88580N41164O86924
$$ 10515884 10372773 10409853 10687478 10713450 10833428 11088318 11653844 12142424 12683588 13370512
10208A3370512O85315J115056J369456J510059K216751K890472M092421N443869
$$ 13370512 14055827 15170883 16540339 18050398 20267149 23157621 27250042 32693911
10200C2693911O790614P555087P563397O676940N552015N228820N005890M065953
$$ 32693911 39484525 47039612 54603009 61279949 66831964 72060784 77066674 81132627
10192H1132627J922375n64127j425049J1756L058777N626412P259562Q207479
$$ 81132627 83055002 82490875 81065826 81077582 84136359 89762771 97022333 105229812
10184A05229812Q973051Q928526Q187740O359370L379328M73202k041888m381705
$$ 105229812 114202863 123131389 131319129 137678499 141057827 141531029 139489141 135107436
10176A35107436o361480p316058p274202p031308p220773q220550r094750r192813
$$ 135107436 128745956 121429898 114155696 107124388 99903615 91683065 82588315 73395502
10168G3395502q217202o788063n395091m345291l632323k941383k347684j947926
$$ 73395502 65178300 58390237 52995146 48649855 45017532 42076149 39728465 37780539
10160C7780539j660813j465945j271931j247369r50871q84133o09486q50408q66486
$$ 37780539 36119726 34653781 33381850 32134481 31183610 30299477 29689991 28839583 27973097
10151B7973097n93219k31132p4200r9329k61023r3431M6527J13158K34503L09331
$$ 27973097 27379878 27148746 27074546 26975217 26714194 26620763 26667290 26780448 27014951 27324282
10141B7324282L43492O88407J079158J231046J642106K160629K737586L691717
$$ 27324282 27667774 28356181 29435339 30666385 32308491 34469120 37206706 40898423
10133D0898423N005225O509748Q079186R702492J0663639J1434676J2146704J2084359
$$ 40898423 45903648 52413396 60492582 70195074 80858713 92293389 104440093 116524452
10125A16524452J0911538R064492P000187M897835K993305Q08589k109719m089544
$$ 116524452 127435990 136500482 143500669 148398504 151391809 152200398 150090679 146001135
10117A46001135l777994j659274K04507M54265k85367m41079J148862L414132
$$ 146001135 142223141 140563867 140768374 141222639 140937272 140496193 141645055 145059187
10109A45059187M253951K703928n2895j827459k155867k473504l899641o421874
$$ 145059187 149313138 152017066 151964171 150136712 147980845 145507341 141607700 135185826
10101A35185826q658628r481731j0043156j0514237j0432702r509998p804505
$$ 135185826 126527198 117045467 107002311 96488074 86055372 76545374 68740869
10094F8740869o323358n050126m047336l312538k752346k537836k153069j792681
$$ 68740869 62417511 57367385 53320049 50007511 47255165 44717329 42564260 40771579
10086D0771579j391787j264874j072790j018014r63770q82331r03445p24852n29566
$$ 40771579 39379792 38114918 37042128 36024114 35060344 34178013 33274568 32549716 32020150
10077C2020150p03566m58172k67705k62445k59192p1601j90199J10346L98222
$$ 32020150 31316584 30858412 30590707 30328262 30069070 29997469 29807270 29917616 30315838
10068C0315838N58005P35669O48883R99207J229990J858730K639668L638906M594977
$$ 30315838 30873843 31609512 32258395 33257602 34487592 36346322 38985990 42624896 47219873
10059D7219873O002462P272158P660219P818943P811543Q179285Q466201P940794
$$ 47219873 53222335 60494493 68154712 75973655 83785198 91964483 100430684 108371478
10051A08371478O774625M403629K081048P22559n20323j677457l132685l854377
$$ 108371478 115146103 119549732 121630780 122353339 121833016 120155559 117022874 113168497
10043A13168497m640139n650352o713961o977631n428053k737749p59018j52495
$$ 113168497 108528358 102878006 96164045 89186414 83758361 81020612 80261594 80109099
10035H0109099k70938k81649k40708R0411q91150l411001o167273p377733p127689
$$ 80109099 79838161 79556512 79315804 79406215 78515065 75104064 68936791 61559058 54431369
10026E4431369o021209m825812l557480k808997k310349j766652j317503j329317
$$ 54431369 48410160 43584348 40026868 37217871 34907522 33140870 31823367 30494050
10018C0494050j349543j062320r14507r81536r12411o65450n60983o14467m03401
$$ 30494050 29144507 28082187 27167680 26186144 25273733 24608283 24047300 23432833 23029432
10009B3029432l88583m14316n19286m67617k20528l65766k99506k95720l36623
$$ 23029432 22640849 22226533 21707247 21239630 21019102 20653336 20353830 20058110 19721487
10000A9721487o1244K8422j49605q6891j30761o2847n7527P7886J14271L84792
$$ 19721487 19660243 19688665 19539060 19452169 19321408 19258561 19201034 19278920 19393191 19777983
9990A9777983K18648R626L86469N22970P29224J124641J690952J913233K666299
$$ 19777983 19996631 20006257 20392726 20915696 21644920 22769561 24460513 26373746 29040045
9981B9040045L784389M350890M128028L573283K720344J840561J227744N20462
$$ 29040045 32824434 37175324 41303352 44876635 47596979 49437540 50665284 51185746
9973E1185746j278185l091219m605693m787797m496097l763756k855699k364565
$$ 51185746 49907561 46816342 42210649 37422852 32926755 29162999 26307300 23942735
9965B3942735j861072j307092j184642j087270q77486p69628n38818m85562m28516
$$ 23942735 22081663 20774571 19589929 18502659 17625173 16855545 16316727 15831165 15402649
9956A5402649n30061l04027j54995k87026o60555o17821n28140k01097j88793
$$ 15402649 14872588 14568561 14413566 14126540 13465985 12848164 12320024 12118927 11930134
9947A1930134l77252k93411q8261k44908j13675p0621j75353q2997j24714k70907
$$ 11930134 11552882 11259471 11171210 10926302 10812627 10742006 10566653 10483656 10358942 10088035
9937A0088035j24501k72392j96802R2709J4618j13709k65759r7748o5892O4297
$$ 10088035 9963534 9691142 9494340 9587049 9601667 9487958 9222199 9124451 9058559 9122856
9927I122856J17733J94359m8655j75318l32504k25347k5597m4022J564m09220
$$ 9122856 9240589 9434948 9386293 9210975 8878471 8653124 8627527 8583505 8585069 8175849
9917H175849k36167r6492R029r2870q7603j44565K7977j62154k23936J01306m6407
$$ 8175849 7939682 7843190 7852219 7759349 7671746 7527181 7555158 7393004 7169068 7270374 7223967
9906G223967n4861l1164l44039j29570j69327j22816j33860L4922R4785J9083
$$ 7223967 7169106 7137942 6793903 6664333 6495006 6372190 6238330 6273252 6368037 6387120
9896F387120j66505q6834K1388l0220J1835k17673k01468K7983k1324j25332j98463
$$ 6387120 6220615 6133781 6155169 6124949 6136784 5919111 5717643 5745626 5724302 5598970 5400507
9885E400507j56646O1417j58375j86165P3764P5265J6337m6918k06569q6809m7726
$$ 5400507 5243861 5305278 5146903 4960738 5034502 5109767 5126104 5079186 4872617 4785808 4738082
9874D738082m1310r5197o4476j30988J85581M3808j87559K8000j5818M7811Q314
$$ 4738082 4696772 4601575 4537099 4406111 4591692 4635500 4447941 4475941 4460123 4507934 4516248
9863D516248J82675R197j10242j14218n6176P3138m5667P7525j23049j33563o2677
$$ 4516248 4698923 4708120 4597878 4483660 4427484 4500622 4454955 4532480 4409431 4275868 4213191
9852D213191k17297L1505K44592M4900K23515o2243j16239N5064j40412j36940
$$ 4213191 3995894 4027399 4271991 4316891 4540406 4478163 4361924 4416988 4276576 4139636
9842D139636J36960j33204j29760m4875j15683J30225K2912J46057O8861L5586
$$ 4139636 4276596 4143392 4013632 3968757 3853074 3983299 4006211 4152268 4221129 4256715
9832D256715J5429J0426k3545k3588O1875J5009j74131k54210j83787L6879J04198
$$ 4256715 4272144 4282570 4259025 4235437 4297312 4312321 4138190 3883980 3700193 3737072 3841270
9821C841270R5621k7440k12405J0377r6033J49739j8193m8218j8035k75123L7181
$$ 3841270 3936891 3909451 3697046 3707423 3611390 3761129 3742936 3694718 3676683 3401560 3438741
9810C438741J35825q3761j29577o0994K007J11922J89776J62686M7480j49456
$$ 3438741 3574566 3490805 3361228 3300234 3302241 3414163 3603939 3766625 3814105 3664649
9800C664649l0696K39601J18641J89519p8008K2512J42061q0952q9858q6338q1094
$$ 3664649 3633953 3873554 3992195 4181714 4103706 4126218 4268279 4187327 4097469 4011131 3930037
9789C930037Q5614L6796j30728k07147k53490o9561Q8202r4865q1975l3502q7337
$$ 3930037 4015651 4052447 3921719 3714572 3461082 3391521 3479723 3384858 3302883 3269381 3182044
9778C182044l974O7669r1912l65n2279j15204J54466K63368J23307j96451j73862
$$ 3182044 3178070 3245739 3153827 3153462 3101183 2985979 3140445 3403813 3527120 3330669 3156807
9767C156807N9884L14718J92617J70209K70068J62299N8756J21844K4807J58963
$$ 3156807 3216691 3531409 3724026 3894235 4164303 4326602 4385358 4507202 4532009 4690972
9757D690972M1501L01921K09357J92489J54402m8045j71800j82088O7205o2684
$$ 4690972 4732473 5034394 5243751 5436240 5590642 5542597 5370797 5188709 5255914 5193230
9747E193230o1120J77912J70179J41584o3801l28240k50818k90785j37768m5126
$$ 5193230 5132110 5310022 5480201 5621785 5557984 5229744 4978926 4688141 4550373 4505247
9737D505247n7104n9305l3957r7945q3775O0894n3477j86407K3362M9498j69320
$$ 4505247 4448143 4388838 4354881 4256936 4173161 4234055 4180578 3994171 4017533 4067031 3897711
9726C897711P4347J77820P4118p9164J12950M05670K68249J09353r8305M8248
$$ 3897711 3972058 4149878 4223996 4144832 4257782 4663452 4931701 5041054 4942749 4990997
9716D990997K70278K39429P8398N0958R5181P8625J40469J88039N3174K30296
$$ 4990997 5261275 5500704 5579102 5630060 5725241 5803866 5944335 6132374 6185548 6415844
9706F415844R1346K92238L57089J86137J07150L5785J59476m6895l39106m28864
$$ 6415844 6507190 6799428 7156517 7342654 7449804 7485589 7645065 7598170 7259064 6830200
9696F830200l22123k89489k08404j27333j32113j09514j62268j49312q2761j29871
$$ 6830200 6508077 6218588 6010184 5882851 5750738 5641224 5478956 5329644 5246883 5117012
9686E117012k25154j08884L5174J61298K02439M4838m8627j0503J01048k356J658
$$ 5117012 4891858 4782974 4818148 4979446 5181885 5226723 5178096 5167593 5268641 5266285 5267943
9675E267943K50009J46396J74798Q1949K51021K37884J32657J84249K55628J18349
$$ 5267943 5517952 5664348 5839146 5921095 6172116 6410000 6542657 6726906 6982534 7100883
9665G100883P401J84910n6670l15080j83757k75226m12581j29241k40065n02925
$$ 7100883 7108284 7293194 7236524 6921444 6737687 6462461 6049880 5920639 5680574 5177649
9655E177649l37148J89597j22077k05923q1873R9188j26336j09138n4905n8804
$$ 5177649 4840501 5030098 4908021 4702098 4620225 4719413 4593077 4483939 4429034 4370230
9645D370230R4850k4057q4472m315P7356K12833J56603L26496L03803J1481J72638
$$ 4370230 4465080 4441023 4356551 4352236 4429592 4642425 4799028 5125524 5429327 5440808 5613446
9634E613446K35086M75102N30955J74508K26707M4704j35990j08177N822j05697
$$ 5613446 5848532 6323634 6854589 7029097 7255804 7300508 7164518 7056341 7062163 6956466
9624F956466p6729j08684j62507k38968j85052j71666j64093j40445j13954j60415
$$ 6956466 6879737 6771053 6608546 6369578 6184526 6012860 5848767 5708322 5594368 5433953
9614E433953L5n1167m11124l70498o0612l2528K3552O5598J5048J05269O3552
$$ 5433953 5433988 5382821 4971697 4601199 4540587 4508059 4531611 4597209 4612257 4717526 4781078
9603D781078J45839L53849P1961J29918J86239L80735J68006K16967L27969K45998
$$ 4781078 4926917 5280766 5352727 5482645 5668884 6049619 6217625 6434592 6762561 7008559
9593G008559O5455P4515k2039k64110o9918n516r6546n1853o2642n8850j58295
$$ 7008559 7074014 7148529 7126490 6862380 6792462 6786946 6690400 6638547 6575905 6517055 6358760
9582F358760k67639j5586j93203l73773q8426k32031l19434j48813j05993r4756
$$ 6358760 6091121 6075535 5882332 5508559 5420133 5188102 4868668 4719855 4613862 4519106
9572D519106k17030j37798K17872P3964r0847j3839o36r1J32583N2007K09921
$$ 4519106 4302076 4164278 4382150 4456114 4365267 4351428 4350792 4350701 4483284 4535291 4745212
9561D745212O7205j34168K12760M01800K68146p4821L40151J93118R2411K69741
$$ 4745212 4812417 4678249 4891009 5292809 5560955 5486134 5826285 6019403 6111814 6381555
9551F381555K86551R8662R5549K0383j19178j43962p9904m33999k40219j27513
$$ 6381555 6668106 6766768 6862317 6882700 6763522 6619560 6539656 6105657 5865438 5737925
9541E737925m06290m91694j88386k93700k00545J5655o5441k92976j78196l8985
$$ 5737925 5331635 4839941 4651555 4357855 4157310 4172965 4107524 3814548 3636352 3597367
9531C597367o7614j1137M1455K4258j34002k37882j98303Q0227N9252j16028M045
$$ 3597367 3529753 3518616 3560071 3584329 3450327 3212445 3014142 3094369 3153621 3037593 3041638
9520C041638R1145l0758Q2282O4762J73277K43740J66455J91570J39167K2197
$$ 3041638 3132783 3102025 3184307 3249069 3422346 3666086 3832541 4024111 4163278 4185475
9510D185475K4576K13596j4878j8154J88903k12639r6614m2927m9112m3742q022
$$ 4185475 4210051 4423647 4408769 4390615 4579518 4366879 4270265 4227338 4178226 4134484 4126462
9499D126462k48322k51516n876j83613j93683k5245M1284m083j35419k49033j28597
$$ 4126462 3878140 3626624 3620748 3437135 3243452 3218207 3259491 3255408 3119989 2870956 2742359
9488B742359K2240m5010p0517J12089O9617r049p7705j19187J1805j98910j10966
$$ 2742359 2764599 2719589 2649072 2761161 2830778 2821729 2744024 2624837 2636642 2437732 2326766
9477B326766q9039j54968r2016K13496l5026m845J12136M7295J36538J28926K0225
$$ 2326766 2237727 2082759 1990743 2204239 2169213 2164368 2276504 2323799 2460337 2589263 2609488
9466B609488J22286K55834K6464o5206O1572q0386K1492J42677J4628K8221m9992
$$ 2609488 2731774 2987608 3014072 2948866 3010438 2930052 2951544 3094221 3108849 3137070 3087078
9455C087078p9698j23494j49872o9562j21759j09564j42993p3530p9701q3272
$$ 3087078 3007380 2883886 2734014 2664452 2542693 2433129 2290136 2216606 2136905 2053633
9445B053633Q1973q378j4451j40921n016l838j54335P8893K26571J23749q6935
$$ 2053633 2135606 2127228 2112777 1971856 1966840 1963002 1808667 1887560 2114131 2237880 2150945
9434B150945R8789R5701n0813j56235j54748j33822l1475Q3645L2211J17217r2228
$$ 2150945 2249734 2345435 2294622 2138387 1983639 1849817 1818342 1901987 1934198 2051415 1959187
9423A959187n9314j80990K4138J23033J2538N7952J27329r2068k43375O0850L84
$$ 1959187 1899873 1718883 1743021 1866054 1878592 1936544 2063873 1971805 1728430 1789280 1789664
9412A789664j09535j25796o665o5225O6797J13807j03573r8471P1019J83787M4631
$$ 1789664 1680129 1554333 1547668 1482443 1549240 1663047 1559474 1461003 1532022 1715809 1760440
9401A760440j16292k20055j82702J04483m5814M8903J10825q4009N7265j4453
$$ 1760440 1644148 1424093 1241391 1345874 1300060 1348963 1459788 1375779 1433044 1418591
9391A418591l416R526j6815p2417P9949M586r8589j16680j32989m5414k6130J23025
$$ 1418591 1415175 1424701 1407886 1335469 1415418 1420004 1321415 1204735 1071746 1026332 1000202 1123227
9379A123227J17495Q7511j02598L1219J07716m5516m763l08781q2913O5974k8468
$$ 1123227 1240722 1328233 1225635 1256854 1364570 1319054 1314291 1005510 922597 988571 960103
9368I60103N0894M8450j20461J85937N3694j17795J32211l4797j87713O4609M4968
$$ 960103 1010997 1059447 938986 1124923 1178617 1060822 1193033 1158236 970523 1035132 1080100
9357A080100R6654J51646l6899k18520p345J69181J39179j56166r6223P3447R3900
$$ 1080100 1176754 1328400 1291501 1072981 1065636 1234817 1373996 1217830 1121607 1195054 1288954
9346A288954K7453M3206j70402o057J73897o1926k52837q0976P6234J98554J32391
$$ 1288954 1316407 1359613 1189211 1183154 1357051 1295125 1042288 961312 1037546 1236100 1368491
9335A368491j11929j56164o9992j48929J47346j75637k82654K6090J39040R1814
$$ 1368491 1256562 1100398 1030406 881477 1028823 853186 570532 596622 735662 827476
9325H27476J20132j13067j71012j19906p5552J10859L2506J01936K69379J93829
$$ 827476 947608 834541 663529 543623 468071 578930 611436 713372 982751 1176580
9315A176580l348K1485j0568k1502j76430q5955j00196k65695J95558O6562M381
$$ 1176580 1173232 1194717 1184149 1162647 986217 900262 800066 534371 729929 796491 800872
9304H00872J55076l0200q1115M4451J03610K4836j39289j13148j36157J23177
$$ 800872 955948 925748 844633 889084 992694 1017530 878241 765093 628936 752113
9294G52113K01359L01201O4909r6356m3880J41698J05975l5250j3118k04523K0836
$$ 752113 953472 1254673 1319582 1223226 1179346 1321044 1427019 1391769 1378651 1174128 1194964
9283A194964k6945k1451P6363L09470j36682j02443j80244M0701J07383p5236
$$ 1194964 1168019 1146568 1222931 1532401 1395719 1293276 1113032 1153733 1261116 1185880
9273A185880p5425R1467q808k348q6692Q024j91253j12545n1067k218j14028J3614
$$ 1185880 1110455 1201922 1193114 1190766 1104074 1112098 920845 808300 757233 755015 640987 654601
9261F54601K197Q7115R5366L0933R144Q604m6814K492K36988L7987K2814o877
$$ 654601 656798 743913 839279 870212 879356 887960 841146 843638 1080626 1118613 1141427 1134550
9249A134550M4160j19205k79560Q0723J28868j62712r967J09956K8285p1049o7421
$$ 1134550 1178710 1059505 779945 860668 989536 826824 816857 926813 955098 884049 816628
9238H16628k04254P7132O3982J67586K37162P5117Q256k23293j92340O5032J12106
$$ 816628 612374 689506 753488 921074 1158236 1233353 1241609 1018316 825976 891008 1003114
9227A003114j29477o9706k774J1375L4343k1156j26300l317M5545j2349j0159
$$ 1003114 873637 803931 801157 812532 846875 825719 699419 696102 741647 729298 719139
9216G19139P1234J16532L22436R1091k24068j63854J01177n8151j19079n2187
$$ 719139 790373 906905 1229341 1320432 1096364 932510 1033687 975536 856457 804270
9206H04270N9172j00770K9269O1315q2266j73895Q6534J46422n4801j27983j30586
$$ 804270 863442 762672 791941 853256 770990 597095 683629 830051 775250 647267 516681
9195E16681P0640P903j25785q3225p2640j9428J9480J75383K41186j10298j42071
$$ 516681 587321 595224 469439 386214 313574 294146 313626 489009 730195 619897 477826
9184D77826q0205L08911Q6814j78766M3438J21447k9169k7577j9697K6542K4349
$$ 477826 397621 706532 793346 614580 658018 779465 750296 722719 703022 729564 753913
9173G53913k2387j09621N1831J54990j32268o0383j0257J7599J3586N003l3961
$$ 753913 731526 621905 673736 828726 696458 636075 625818 643417 657003 662006 628045
9162F28045q4540J9655N1411L1363j01977J5793j3354J17893l2204m8593J9858
$$ 628045 543505 563160 614571 645934 543957 559750 546396 664289 632085 583492 603350
9151F03350P1518k4175j42273p286M7792R5711J58395L3119r8621L3154N524m7549
$$ 603350 674868 650693 508420 501134 548926 644637 803032 836151 737530 770684 776208 728659
9139G28659J6781j50961k47842j1545J30959P9027J49252m0499r7952r6463J2630
$$ 728659 745440 594479 346637 335092 466051 545078 694330 653831 555879 459416 472046
9128D72046q250Q983n8313P7641O1438n2525K3946R8406n7323J1429J46219r051
$$ 472046 463796 472779 414466 492107 553545 501020 524966 623372 566049 577478 723697 714646
9116G14646J04468p9588o7344J042j23047j3862L4551J37076O3304j84878m5105
$$ 714646 819114 739526 672182 673224 550177 536315 570866 707942 771246 586368 541263
9105E41263J43080j88084K4273J58750n2757l0077j29153J66970J49450k2016
$$ 541263 684343 496259 520532 679282 626525 596448 467295 634265 783715 761699
9095G61699j25597j54556O9239K56888O3451k03957j40357J17269k16544N6171
$$ 761699 636102 481546 550785 807673 871124 667167 526810 644079 427535 483706
9085D83706L10889J270R2964Q1655k98222k05664q8165J57348O5354j20608J50139
$$ 483706 794595 795865 888829 970484 672262 466598 378433 535781 601135 480527 630666
9074F30666K63032J62691k7279k46186j542n498j35506j835o394l4458N3192l997
$$ 630666 893698 1056389 1029110 782924 781382 775884 640378 638543 632149 597691 650883 646886
9062F46886Q083m5723M8998Q8132j32266J1478J14103J1358r4115r9548K6592
$$ 646886 654969 609246 658244 746376 614110 625588 739691 751049 656934 557386 583978
9051E83978J89591j9408m9585j91655o4976J79573j38616l68736K38076K81963
$$ 583978 773569 754161 704576 512921 447945 627518 488902 120166 358242 640205
9041F40205L6624M5456k7609k47203j28134J69155O5916p5433j64951j04192K58471
$$ 640205 676829 722285 694676 447473 319339 488494 554410 478977 314026 209834 468305
9030D68305J65687K1405q7712P8494o6239r8775p4839J59386J46595j725k18212
$$ 468305 633992 655397 567685 646179 579940 481165 406326 565712 712307 710582 492370
9019D92370o0543j0950J35073q6169k5506J4925k7995j0282j33054k00015o3607
$$ 492370 431827 420877 555950 469781 444275 459200 431205 420923 287869 87854 24247
9008B4247J13090J80725N5103J57282P5202Q2601j15901n6053n08q404j08058
$$ 24247 137337 318062 373165 530447 605649 688250 572349 516296 515788 507384 399326
8997C99326K69363K68868Q1635j45135j15440j78714Q3538j10493p7453Q8760
$$ 399326 668689 937557 1019192 874057 758617 579903 663441 552948 475495 564255
8987E64255M0516P1419j42498q9888J2979K6683N0215J07312M6482R5866r4250
$$ 564255 604771 676190 533692 443804 456783 483466 533681 640993 687475 783341 689091
8976F89091r2632k81031M6384K28457k0246r738m6144O6137J61223p3445k60815
$$ 689091 596459 315428 361812 590269 570023 560285 514141 580278 741501 668056 407241
8965D07241j21062O2114K83553J50500j58684n4285P3584J7660k5168j77417j41821
$$ 407241 286179 348293 631846 782346 623662 569377 642961 660621 635453 458036 316215
8954C16215j23409L8165K19183K57481o2457q1667R935J03386J213j95163k20482
$$ 316215 192806 230971 450154 707635 645178 563511 573446 676832 678045 482882 262400
8943B62400P6521k7230p0333K28271J13014j25104m4627J74703l9345r7486j37529
$$ 262400 338921 311691 241358 469629 582643 457539 412912 587615 548270 450784 313255
8932C13255J48591Q7525J00630J45980q6006L5860o6769p9395K281j00618j45538
$$ 313255 461846 549371 650001 795981 709975 745835 679066 599671 601952 501334 355796
8921C55796j2923j86342j40510Q5406J01293j3295j39735K92186P4827n8544Q3911
$$ 355796 342873 156531 16021 101427 202720 189425 49690 341876 416703 358159 442070
8910D42070j1246N6752J19541J57148L9323j75802j74015N345J02302p8180l4659
$$ 442070 430824 487576 607117 764265 803588 627786 453771 459116 561418 483238 448579
8899D48579J73204r4851J147J47479J44959K29144j4459k33671p3210j6068o2958
$$ 448579 621783 526932 528079 675558 820517 1049661 1035202 801531 728321 712253 649295
8888F49295j81629j90722L364J12448q5396K4650J20742r3660p2583O1519m7538
$$ 649295 467666 276944 280308 392756 307360 332010 452752 359092 286509 348028 300490
8877C00490L5526J23450j15056j86495J53821k23846j38278J90038O5154j52633
$$ 300490 336016 459466 344410 157915 311736 87890 -50388 139650 204804 52171
8867E2171K1675M08480J38949k26130j54196O5079J35226n1023R1215Q9670k33935
$$ 52171 73846 482326 621275 395145 240949 306028 441254 390231 481446 571116 337181
8856C37181k15967J98708L5973K6819r8074l1513o2747o361K00116l4773K9464
$$ 337181 121214 319922 355895 382714 284640 253127 190380 184019 384135 349362 378826
8845C78826R0743J9155m2224J3756m8683P5211r1487j37489j02239J59255K74674
$$ 378826 469569 488724 446500 460256 411573 486784 395297 257808 155569 314824 589498
8834E89498p1946o5831r4039o4181J22494J35813J99695l8674o6244K360q6116
$$ 589498 517552 451721 357682 293501 415995 551808 751503 712829 646585 648945 562829
8823E62829q916K31756M6280j91719j56899k112L9302j06123n3865O7815r392
$$ 562829 553913 785669 831949 640230 483331 481219 520521 414398 360533 428348 418956
8812D18956k9501k3842N3324l6850N5463N6501R2359j15978O4743K02250P7518
$$ 418956 389455 365613 418937 382087 437550 494051 586410 470432 535175 737425 814943
8801H14943K0284m2914N0255j3578j60122k28438k51731J87234J00132J43972
$$ 814943 835227 792313 842568 828990 668868 440430 188699 375933 476065 620037
8791F20037J50117N1128j91078j27776N5748O8957N2068L3911j68327r0637P8298
$$ 620037 770154 821282 630204 502428 558176 627133 679201 713112 544785 454148 532446
8780E32446K6561L9653q3883o0858P2762R582o0425J99822O2085p2317j72814
$$ 532446 559007 598660 514777 453919 526681 536263 475838 675660 737745 665428 492614
8769D92614j90626M1835R1723N5229O1822p8340L9835R5140m3334o0679j68047
$$ 492614 301988 343823 435546 490775 552597 474257 514092 609232 565898 505219 337172
8758C37172j14303L8831J17649O4890o505j31277J06876M1719r5797J5082R2622
$$ 337172 222869 261700 379349 444239 437734 306457 413333 455052 359255 374337 466959
8747D66959p021R2311Q8335l0645r5847n7554k5682K11373J16172j616j16061
$$ 466959 459938 552249 640584 609939 514092 456538 430856 642229 758401 756785 640724
8736F40724O0275K2452j00997k29393j85117j18142R9728J38623J60613K68290
$$ 640724 700999 723451 622454 393061 207944 89802 189530 328153 488766 757056
8726G57056J50941k09020j80156j14584N6976J07426P6090r443O9896K1028j11324
$$ 757056 907997 698977 518821 404237 461213 568639 644729 635286 705182 726210 614886
8715F14886L4666j75874l6149O8377K6084R2122J6851Q4485J9810k55415j78955
$$ 614886 649552 473678 437529 505906 531990 624112 640963 725448 745258 489843 310888
8704C10888k17955o1243J09436J66147J1803K75515K3593j00616P8986J01954
$$ 310888 92933 31690 141126 307273 319076 594591 618184 517568 596554 698508
8694F98508O6105j48243k26515q0955O3041P015l099j5751J74130K4205m385r7378
$$ 698508 764613 616370 389855 308900 371941 378956 375857 360106 534236 558441 554056 456678
8682D56678J93157J46963r7591P8405J44021l835j81997k05525k33337p5707J13949
$$ 456678 649835 796798 699207 777612 921633 917798 735801 530276 296939 221232 335181
8671C35181J09676k676J23725O8310j9629l0541j84345R0288J7503j51631M3144
$$ 335181 444857 442181 565906 634216 614587 584046 399701 489989 507492 355861 399005
8660C99005j8798m2402Q2943M9153J23306M2175k34754j06825K7569j23430R4995
$$ 399005 380207 337805 420748 469901 593207 635382 400628 293803 321372 197942 292937
8649B92937J84104R1317M3155q2767o6391j05130j3695K00975J20395k07572q1471
$$ 292937 477041 568358 611513 528746 462355 357225 343530 544505 664900 457328 375857
8638C75857J59455K9882L2444O8475N5146p9897o0758j89697p8693o9744J77848
$$ 375857 535312 565194 597638 666113 721259 641362 580604 390907 312214 242470 420318
8627D20318o5947m09822j1774L42527L47615q677j86798K509M2861j52616O8595
$$ 420318 354371 -55451 -67225 275302 622917 614240 427442 429951 472812 320196 388791
8616C88791Q2815J34104N3178p4948m8966R4310m350o1144l5081P1219o7897j5335
$$ 388791 471606 605710 658888 583940 534974 629284 624934 563790 528709 599928 532031 516696
8604E16696J76115o3049p4337k6562o4939q2739J03428j04472j77106j43740m4906
$$ 516696 692811 629762 555425 528863 463924 381185 484613 380141 203035 59295 14389
8593A4389J23958L6266K09086K31307l34977K07481K06076r3990j10336P80k81611
$$ 14389 138347 174613 383699 615006 280029 487510 693586 599596 489260 490040 208429
8582B08429k10186k2973J02802J03830Q8104J68265O0893p4363j73669p6053J44061
$$ 208429 -1757 -24730 78072 181902 270006 438271 499164 424801 251132 175079 319140
8571C19140J00443k5817n5695j28907J58389J78387n175L237L7997p7437J18918
$$ 319140 419583 393766 338071 209164 367553 545940 540765 544002 581999 504562 623480
8560F23480q856N6482j09872r0338j74657j40494Q6851o3133K6089j48998N1546
$$ 623480 614624 671106 561234 470896 296239 155745 242596 179463 205552 56554 108100
8549A08100J24033p5684J85729K38920M9165j49331l4761M3643l0776n20M9708
$$ 108100 232133 156449 342178 581098 630263 480932 446171 489814 459038 458518 508226
8538E08226o3485k6558J16182j05048j92975R3299R2021J4750j67009P1435J9187
$$ 508226 444741 418183 534365 429317 236342 329641 421662 436412 269403 340838 360025
8527C60025J18504J23674o6120j6991j25857j29254r0720o2938N0258J35398R3906
$$ 360025 478529 602203 536083 519092 393235 263981 173261 110323 160581 295979 389885
8516C89885m0180J16952L2955j2318J07720N7734j56581J32237N7376j05682o3657
$$ 389885 349705 466657 499612 487294 595014 652748 496167 628404 685780 580098 516441
8505E16441o0569j49104p7587J20864j89232j37888O1589m0456K85840K53522
$$ 516441 455872 306768 229181 350045 160813 22925 84514 44058 329898 583420
8495E83420j7112j9883n033r7193k53170j30796K43459J07759j30568r4147K6110
$$ 583420 566308 546425 541392 444199 191029 60233 303692 411451 280883 186736 212846
8484B12846J75387M4459l5224q8347j30597N2255q8729J24487Q0404J05781j34104
$$ 212846 388233 432692 397468 309121 178524 230779 142050 266537 346941 452722 318618
8473C18618O9157L16724j14188l56840k79654M8285J12725J72453k1267J27325
$$ 318618 387775 704499 590311 233471 -46183 2102 114827 287280 266013 393338
8463C93338Q2157k0001k08756p2853q5973n0858J27661J02563q676j10579o3941
$$ 393338 475495 455494 246738 173885 87912 37054 164715 267278 258602 148023 84082
8452H4082j1745N7415L3513N2113Q7922q4594K0696J25601P653P891q3731j15586
$$ 84082 72337 129752 163265 215378 303300 218706 239402 365003 372656 380547 296816 181230
8440A81230J18758m9994L033k4951k45854l4478j3507L0248n5167J27136O2387
$$ 181230 299988 249994 253027 228076 -17778 -52256 -65763 -35515 -90682 36454 98841
8429I8841R2957Q7514R4083N436K11421R409j02361l3295q1381M2507j29005k02239
$$ 98841 191798 279312 373395 378831 590252 599661 497300 464005 382624 425131 296126 93887
8417I3887L3489P1953P0862p646P8067l5802l6469M3935j73839M1011J41694l6562
$$ 93887 127376 199329 270191 262545 340612 304810 268341 312276 138437 179448 321142 284580
8405B84580o2714k8638n499p8032P4419J38248J63911Q351n158L2645N4217j37225
$$ 284580 221866 193228 187729 109697 184116 322364 486275 494626 489468 522113 576330 439105
8393D39105o9364j90846j25435J33752O9083N9003J11496L2536l767L4123p0418
$$ 439105 369741 178895 53460 187212 256295 315298 426794 459330 455563 489686 419268
8382D19268q6470r7631M2384R0361j60978M8241K25983m537m2383k2953k1084
$$ 419268 332798 235167 277551 367912 206934 255175 481158 476621 434238 411285 390201
8371C90201K14682Q3241j67821p5101j57889j55100j50774o3006J38382l2791
$$ 390201 604883 688124 520303 445202 287313 132213 -18561 -81567 56815 24024
8361B4024J52814L36274N7558k00615j69073o1248K66592N5771q9672o6605l4957
$$ 24024 176838 513112 570670 370055 200982 139734 406326 462097 372425 305820 270863
8350B70863K2422j04014K50043K96747J4632k21520p9679N4739K2466k0693J0455
$$ 270863 293285 189271 439314 736061 750693 529173 449494 504233 526699 506006 516461
8339E16461j5223o4699M880N4572j10401m0623R0150p8966r6916k6420O5693j4874
$$ 516461 501238 436539 441419 495991 385590 344967 435117 356151 259235 232815 298508 283634
8327B83634j74172j40918r322j0677L6596m7112P7229M7770J82763J55197j74174
$$ 283634 109462 -31456 -40778 -51455 -14859 -61971 15258 63028 245791 400988 226814
8316B26814n8254j07104L4113J02746J27027n2469l450m4256J02810O6569M8444
$$ 226814 168560 61456 95569 198315 325342 272873 269423 225167 327977 394546 442990
8305D42990J32326R9696k50818j25517k3504J3886o6894l0069J48975P7945p398
$$ 442990 575316 675012 424194 298677 275173 289059 222165 192096 341071 419016 411618
8294D11618K2704J42174J6701j71154J8935K5135J59460l7910O476k25559j74274
$$ 411618 434322 576496 593197 422043 440978 466113 625573 587663 594139 368580 194306
8283A94306J86844k0943K0360k6461j84104j33016P689m3487J07541J40762n4123
$$ 194306 381150 360207 380567 354106 170002 36986 44675 1188 108729 249491 195368
8272A95368q5002L0663K05025m1859j41984o4894m1211o07L253j16063J19116
$$ 195368 110366 141029 346054 304195 162211 97317 56106 55499 58752 -57311 61805
8261F1805N8171Q6805J37217R9871l7306J21908J86789r2384j78398p1493m6818
$$ 61805 119976 206781 343998 443869 406563 528471 715260 622876 444478 372985 326167
8250C26167J50553j9210P033Q7888l7796j61036r4688q9923Q2994J58898l8223
$$ 326167 476720 457510 464543 552431 514635 353599 258911 168988 251982 410880 372657
8239C72657J4202J7801J7003n9556q2629J58888j02705k51443j79472Q54J15087
$$ 372657 386859 404660 421663 362107 279478 438366 335661 84218 -95254 -94400 20687
8228B0687M5774o0650J45226N2583J89086J61378q936q3480J20001O272m75835
$$ 20687 66461 5811 151037 203620 392706 554084 545148 461668 581669 587941 112106
8217A12106j62716L2653O1094p451M293J68685K50959q2434j23374k66926N902
$$ 112106 -50610 -17957 43137 35686 39979 208664 459623 377189 253815 -13111 -7209
8206g209K22107J62497j9269j00189j49750J05814q0323n9504M0977J5961J17351
$$ -7209 214898 377395 358126 257937 108187 214001 133678 74174 115151 131112 248463
8195B48463r7798K6130J18792k3895L5685J86929Q7524j68951q3260J23413J54994
$$ 248463 150665 176795 295587 271692 307377 494306 581830 412879 329619 453032 608026
8184F08026k21171k24167j69703m1869J54932J21013Q4894j4480o8934j5805P5465
$$ 608026 386855 162688 -7015 -48884 106048 227061 311955 297475 228541 212736 288201
8173B88201R7673J6190p8901j16861K7814K5613J42009p4737N2602j6080p2120
$$ 288201 385874 402064 323163 206302 234116 259729 401738 327001 379603 363523 291403
8162B91403m422o4028r4903j81375j29671K16418L6131K28232J6341j40955J02593
$$ 291403 286981 222953 128050 -53325 -182996 33422 69553 297785 314126 173171 275764
8151B75764O8233q1724J26445J26604j45657k37099N0502J67955J01728J4562
$$ 275764 343997 262273 388718 515322 369665 132566 183068 351023 452751 467313
8141D67313k3244j02113N8374j15598m42N4750q565j49842n1718j63139j08011
$$ 467313 444069 341956 400330 284732 284290 339040 330475 180633 128915 -34224 -142235
8130a42235J18923K00462J2515K593J63356O1498l0931k96314O528J05517o1917
$$ -142235 -23312 177150 189665 192258 355614 417112 386181 89867 96395 201912 139995
8119A39995q3740M3688J53645M9753o9083k40515R5301M0934R0936j2741K0477
$$ 139995 56255 99943 253588 303341 234258 -6257 89044 129978 220914 208173 228650
8108B28650M6383r7905m0319k5978J18830J12066l6295j89921o5968J80456K0117
$$ 228650 275033 177128 136809 110831 229661 341727 305432 115511 49543 229999 250116
8097B50116n6950L9425j16508J42861Q3673j7827p1336R5584j27480k6762k91
$$ 250116 193166 232591 116083 258944 342617 324790 253454 349038 221558 194796 194505
8086A94505p563L1402j35334p8686J52552J88999J12256n10M5871L9353r9813
$$ 194505 186942 218344 83010 4324 156876 345875 458131 457621 503492 542845 443032
8075D43032L490j7966j91257M6988n6287R1411J02578n7065j58440k23791j43535
$$ 443032 446522 428556 237299 284287 228000 319411 421989 364924 206484 -17307 -160842
8064a60842k1564L03673J35741o3135j16973Q6315J47571q5667m3276l1293m4134
$$ -160842 -182406 121267 257008 193873 76900 163215 310786 225119 181843 150550 106416
8053A06416n1875J3289R6025Q0709j91113j95706K45160K04911J44391o72l4515
$$ 106416 54541 67830 163855 244564 53451 -142255 102905 307816 452207 451535 417020
8042D17020N4612n9873M4354J00184L5551j5937P2344J46487j49028l1161J17696
$$ 417020 471632 411759 456113 556297 591848 575911 648255 794742 645714 614553 732249
8031G32249J41332o9104j05280O0385J5175j10789j44134l7734m7249J8095Q4838
$$ 732249 873581 804477 699197 759582 774757 663968 519834 482100 434851 452946 537784
8020E37784q6163p1399o4096J31889P2912R6060J2025j54954j54416J93187K43586
$$ 537784 451621 380222 316126 448015 520927 616987 629012 474058 319642 512829 756415
8009G56415J88691p2687k10079n988M3561j51432k30J64148j64852j89859q3299
$$ 756415 945106 872419 662340 656352 699913 548481 548251 712399 547547 357688 274389
7998B74389j69491j2580M6854j49294J21171P4721J13458L0880o4768n5569P9680
$$ 274389 104898 92318 139172 -10122 111049 185770 299228 330108 265340 209771 289451
7987B89451O531P0000J37745m9818l52019j26348K84320K17798q4487q0169Q0258
$$ 289451 295982 365982 503727 453909 101890 -24458 259862 477660 393173 313004 393262
7976C93262j01732J54288J56751j9520O2016K1204o1803p9722K627j13460o5860
$$ 393262 291530 445818 602569 583049 645065 666269 604466 524744 527371 413911 348051
7965C48051N4438j9510K09642J24676l1444l5743K9129r4235j27867q085j94605
$$ 348051 402489 382979 592621 717297 685853 650110 679239 585004 457137 449052 254447
7954B54447q9176N7922J07830R6799L2474o8532j48455j80723K14980J55447k5751
$$ 254447 165271 223193 331023 427822 460296 391764 243309 62586 277566 433013 407262
7943D07262K9904L5793j71214L4238J24820N714m482J31818o55k22060k01186
$$ 407262 437166 472959 301745 335983 460803 466517 462035 593853 593198 371138 169952
7932A69952J7935J58735k9414j21767q8148K9566l2476l8710k4969N2971N9101
$$ 169952 187887 346622 317208 195441 107293 136859 104383 65673 40704 93675 152776
7921A52776K10581P6285j94798j45410j25640Q7602K28335j30248m5074J00096
$$ 152776 363357 439642 244844 99434 -26206 61396 289731 159483 114409 214505
7911B14505j3010j41520n4373K38655j2378p6482j72256J15167K3687Q1810j0312
$$ 214505 201495 59975 5602 244257 231879 155397 -16859 98308 121995 203805 193493
7900A93493j86735O8511J94100M2750J04990j21629l41237j53045q3177K06510
$$ 193493 6758 75269 269369 312119 417109 295480 -45757 -198802 -281979 -75469
7890g5469J22937k4986K65993P0432l4421j63438j3281M4913J88923P4191j71794
$$ -75469 47468 22482 288475 358907 324486 161048 147767 192680 381603 455794 284000
7879B84000K7374n3105K51977j91988k29749R1983J18075J1203k42987K3639P2653
$$ 284000 311374 258269 510246 318258 88509 180492 298567 309770 66783 90422 163075
7868A63075J00868j4933J85524m2052K4079j77310L8988R3047O7502J2044l1987
$$ 163075 263943 249010 434534 392482 416561 239251 278239 371286 438788 450832 418845
7857D18845j33111o9357l7395j5090j87167N0193J69949r2851r4259R5808K0361
$$ 418845 285734 216377 178982 163892 -23275 26918 196867 104016 9757 105565 125926
7846A25926j75763J67020O3702r6996j24857k8797J07884J96819N7294o5476N3719
$$ 125926 -49837 117183 180885 83889 -40968 -69765 38119 234938 292232 226756 280475
7835B80475j23992j33786R3652J32684K06137l1326j21180l6477k1203J09578
$$ 280475 156483 22697 116349 249033 455170 423844 302664 266187 244984 354562
7825C54562p5462j21320O8173J07j61621R0218N4872K3345J331J42822k05753
$$ 354562 279100 157780 225953 226060 64439 154657 209529 232874 234205 377027 171274
7814A71274l7600R749r7784k494J69085J19337R3714J02733j18295k15663j04215
$$ 171274 133674 143423 45639 43145 212230 331567 425281 528014 409719 194056 89841
7803H9841m7522J79683L3661J07312J30574j23350j66106N0239K78139J750k20103
$$ 89841 42319 222002 255663 362975 493549 370199 204093 254332 532471 534221 314118
7792C14118j7756J93070j53773p2066j48956J82016l9684k22798o8515K56369
$$ 314118 296362 489432 335659 263593 114637 296653 256969 34171 -34344 222025
7782B22025K0423m6089r4069P384m9768M6303N1093o3871l6661J76030J67670
$$ 222025 242448 196359 102290 109674 59906 106209 157302 93431 56770 232800 400470
7771D00470j12097p8708p3006k6069N6904j22125p111Q0065Q4129L2833K18187
$$ 400470 288373 209665 136659 110590 167494 45369 38258 118323 202452 235285 453472
7760D53472J01306k1415M9189J4078j03044k42519k87703L3912P7770m4052O4166
$$ 453472 554778 533363 582552 596630 493586 251067 -36636 -2724 75046 30994 95160
7749I5160j92321o1972l0567L3641K69527J21773J32926k5265k32681J39418J57000
$$ 95160 -97161 -159133 -189700 -156059 113468 235241 368167 342902 110221 249639 406639
7738D06639j26267o2837j0392N8893P0841k21853r307K7794n6989l1791j19290
$$ 406639 280372 217535 207143 266036 336877 115024 105717 133511 76522 44731 -74559
7727g4559j76577N0930J7668P2753K49227J50186o0367q8827p8388O0615P1729
$$ -74559 -251136 -200206 -182538 -109785 139442 289628 229261 140434 62046 122661 194390
7716A94390M7146k2549j54700J4452J59636J72237J3254Q1454K0575k35229j07350
$$ 194390 241536 218987 64287 78739 238375 410612 423866 505320 525895 290666 183316
7705A83316p0177j6684k09154l5717K85846n1358k56436r6816J72908N6565J73857
$$ 183316 113139 96455 -112699 -148416 137430 86072 -170364 -267180 -94272 -37707 136150
7694A36150J27667p0320j10465l6188j84428q8996J60468K00377R5814o6857J07422
$$ 136150 263817 193497 83032 46844 -137584 -226580 -66112 134265 230079 163222 270644
7683B70644N6694p8427j07652L0483j05167J79913K3770j32105o7156O4065K25042
$$ 270644 327338 248911 141259 171742 66575 246488 270258 138153 70997 135062 360104
7672C60104L240j06995o0269n7170j49217O5660P2644J22527J2570m6433L3044
$$ 360104 363344 256349 196080 138910 -10307 55353 127997 250524 263094 216661 249705
7661B49705j27470j08350J85J50824K28919J950k04869J3414J39785p8431p2541
$$ 249705 122235 13885 14070 164894 393813 395763 190894 204308 344093 265662 193121
7650A93121j78271l6991j17860O7616K6137n9159R4162N2047r2095j18312L0868
$$ 193121 14850 -22141 -140001 -72385 -46248 -105407 -11245 40802 -51293 -169605 -138737
7639a38737j57061P3597J72194R2098P5340J49704j04660n3567N9640N6701K915
$$ -138737 -295798 -222201 -50007 42091 117431 267135 162475 108908 168548 225249 228164
7628B28164o7892J0921R2801R47j80026p2108j60804J26524J28273J08006m8132
$$ 228164 160272 171193 263994 264941 84915 12807 -147997 -21473 106800 214806 166674
7617A66674j15202p8776K1321M2536r4511O8448O3046j09102J63937K323r716
$$ 166674 51472 -27304 -5983 36553 -57958 10490 73536 -35566 128371 130694 120978
7606A20978L5393m236k9229k53J20122l3859J41236J25179q7168j42244j46883
$$ 120978 156371 152135 122906 122653 242775 208916 350152 475331 388163 245919 99036
7595I9036O6773J61697o2533j67786J42068J32388p8772M6193j44419q6546J42175
$$ 99036 165809 327506 264973 97187 239255 371643 292871 339064 194645 108099 250274
7584B50274Q7480o6970j46871m664o4754j4506j09567p0142m8210J53496O5311
$$ 250274 337754 270784 123913 119249 54495 39989 -69578 -139720 -187930 -34434 30877
7573C0877K4462J03752K26534L6558K64m4215k84866r6790j0665n5739l4910q5321
$$ 30877 55339 159091 385625 422183 422447 378232 93366 -3424 -14089 -69828 -104738 -190059
7561a90059N6088R9929N7908j90860J43235J38516K749K49L7741l2472n4069r0493
$$ -190059 -133971 -34042 23866 -166994 -23759 114757 117506 117755 155496 123024 68955 -21538
7549b1538k4141k7881K3617M4598j4582j11556j44275N6372j1569J32952p5337
$$ -21538 -45679 -73560 -49943 -5345 -19927 -131483 -275758 -219386 -230955 -98003 -173340
7538a73340P564j5093j55688J87869J42126k9159J45050M4043L7354J4521J5160
$$ -173340 -165776 -180869 -336557 -148688 -6562 -35721 109329 153372 190726 205247 220407
7527B20407l6548m9420O398J37401o1102o1366L7665n9470n4000K08388m9604
$$ 220407 183859 134439 140837 278238 217136 155770 193435 133965 79965 288353 238749
7516B38749p6097J94033K45471K4369k34385k36232j54495j1267o4952q1906n2551
$$ 238749 162652 356685 602156 626525 392140 155908 1413 -9854 -74806 -156712 -209263
7505b09263K01421L15165m0509N2524j42466l20489J35228p479j45820J28487
$$ -209263 -7842 307323 266814 319338 176872 -143617 -8389 -15868 -161688 -33201
7495c3201R0823n9620j44139J23068M0197j396J0572k7016R1370J91860q970m2792
$$ -33201 57622 -1998 -146137 -23069 17128 15732 26304 -712 90658 282518 273548 230756
7483B30756j1194o0134J71108j45715k24394J3544O3435m3523N5616K33443j38120
$$ 230756 219562 159428 330536 184821 -39573 -26029 37406 -6117 49499 282942 144822
7472A44822j74947P1776J53930O9860j08005j0465K3039O8463j05770j11402k3875
$$ 144822 -30125 41651 195581 265441 157436 146971 170010 238473 132703 21301 -2574
7461b574j02183j37302k8212J59292o5272J23081J52414J39945j79492j98862
$$ -2574 -104757 -242059 -270271 -110979 -176251 -53170 99244 239189 59697 -139165
7451a39165j04938j5814O3305J81855Q794O2987j79197J10806M1953J01345L2087
$$ -139165 -244103 -259917 -196612 -14757 -5963 57024 -122173 -11367 30586 131931 164018
7440A64018p7869q9639K01895J00858p5828j66982J38973o8884n7072l0084J13133
$$ 164018 86149 -3490 198405 299263 223435 56453 195426 126542 69470 39386 152519
7429A52519R4431r7373j22414N5612j14861j05116L6412P4265j8070J06163K98417
$$ 152519 246950 149577 27163 82775 -32086 -137202 -100790 -26525 -44595 61568 359985
7418C59985o2606j94893j9962J08477k0105p6253Q6993q1104J06316M0326P9058
$$ 359985 297379 102486 82524 191001 170896 94643 181636 100532 206848 247174 326232
7407C26232j64010n3537K7995L4438j2762l2403n6353J73104J28680L80j46333
$$ 326232 162222 108685 136680 171118 158356 125953 69600 242704 371384 371764 225431
7396B25431j95251o7673P1407Q5965J44544J58319r2442n7109O1291j53293k12801
$$ 225431 30180 -37493 33914 119879 264423 422742 330300 273191 334482 181189 -31612
7385c1612Q4055J11500J51179M9165k4835J6817j81197j81272o3401K04662j4903
$$ -31612 52443 163943 315122 364287 339452 356269 175072 -6200 -69601 135061 120158
7374A20158k31076R2579o379m160k885k09599K15316K06013k10113n9125k5673
$$ 120158 -110918 -18339 -24718 -28878 -31763 -241362 -26046 179967 -30146 -89271 -114944
7363a14944l13967j07684J22858q3617J14592j15009j08063K99205J37896K10127
$$ -114944 -428911 -536595 -413737 -497354 -382762 -497771 -605834 -306629 -168733 41394
7353D1394J24386N5864j15823L7095J27426K0283J28887j8356j57575k9410o489
$$ 41394 165780 221644 105821 142916 270342 290625 419512 401156 243581 214171 207682
7342B07682j84531k46648N8984J32469J94924j6050q9938j40402k9146K26929
$$ 207682 23151 -223497 -164513 -32044 162880 146830 56892 -83510 -112656 114273
7332A14273J32563n9270j05657k5533J70913j95093L4217n7857r0519m6049p8083
$$ 114273 246836 187566 81909 56376 227289 32196 66413 8556 -81963 -128012 -206095
7321b06095M5408Q8921L7859M8109O5631j01188o39j27529N3905M0168K0978J67739
$$ -206095 -160687 -71766 -33907 14202 79833 -21355 -21994 -149523 -95618 -55450 -34472 133267
7309A33267R3423K80318J79640l73555j63013J69048r9605k91042j35105R7721
$$ 133267 226690 507008 686648 313093 150080 319128 219523 -71519 -206624 -108903
7299a08903Q3372P9721k0593L0310J13462j17866o3162J20157N5936j24056J7249
$$ -108903 -25531 54190 33597 63907 177369 59503 -3659 116498 172434 48378 65627
7288F5627Q5535j40340Q5207j43821m86j3916K3552J30830L5750k85751j77131
$$ 65627 151162 10822 96029 -47792 -48278 -62194 -38642 92188 127938 -157813 -334944
7277c34944j2304J69779K00784J01462L8168j6690j64204k93524P0389K09450
$$ -334944 -347248 -177469 23315 124777 162945 146255 -17949 -311473 -241084 -31634
7267c1634L5619j21511J89217p8617j48890J53143J15716J46468j41852P6153
$$ -31634 3985 -117526 71691 -6926 -155816 -2673 113043 259511 117659 193812
7257A93812J551Q126K2446k2454m6804n5324r7881L111J64300K49066n9502j64439
$$ 193812 195363 203489 225935 203481 156677 101353 3472 6583 170883 419949 360447 196008
7245A96008p9905j4614j1862j25034M6775J52565j58698n2030m8454K4741N7011
$$ 196008 116103 101489 89627 -35407 11368 163933 5235 -46795 -95249 -70508 -13497
7234a3497k6180j09420N3593J17451O0354r7804l7232j42039j45817l058N0490
$$ -13497 -39677 -149097 -95504 21947 82301 -15503 -52735 -194774 -340591 -343649 -293159
7223b93159K15613K35572Q1066m9349n1477j28000j6315K3833q5130Q0671N3950
$$ -293159 -77546 158026 239092 189743 138266 10266 -6049 17784 -67346 13325 67275
7212F7275P818o6488O5612J77247q4759j9392r7839Q2985O8276J11625Q2287m4301
$$ 67275 75093 8605 74217 251464 166705 147313 49474 132459 200735 312360 394647 350346
7200C50346o1714j8404o9146j46523o187j25262N1930q9564k412q622K2073r3818
$$ 350346 288632 270228 201082 54559 48372 -76890 -24960 -114524 -116936 -125558 -103485 -197303
7188a97303q9015J63883K38641J2693o4805J67214r2959k0486J06798k22894q3294
$$ -197303 -286318 -122435 116206 128899 64094 231308 138349 117863 224661 1767 -81527
7177h1527l8563K3819o2253j06474J70006R2442L3601K32683J32117m9717j9523
$$ -81527 -120090 -96271 -158524 -264998 -94992 -2550 31051 263734 395851 346134 326611
7166C26611n3622j40391k36788j05604J9630k6431q6173l3988P4821R7858J89552
$$ 326611 272989 132598 -104190 -209794 -190164 -216595 -302768 -336756 -261935 -164077 25475
7155B5475J5702N7891o3119j05138J22512K1940q108l4251J68168N2543k46092
$$ 25475 41177 99068 35949 -69189 53323 75263 67155 32904 201072 253615 7523
7144G523j65452m527J42112L4537J95783L00848K1533l79700j41540J77214K2313
$$ 7523 -157929 -162456 -20344 14193 209976 510824 532357 152657 11117 188331 210644
7133B10644J08866Q5319k31709k45375M251j47284J37944R3283r959L9604m7315
$$ 210644 319510 404829 173120 -72255 -68004 -215288 -77344 15939 5980 45584 -1731
7122a731j15660J26742R7953l4318Q8603j7986k352J0715J49724J23975p3730
$$ -1731 -117391 9351 107304 72986 161589 143603 141251 151966 301690 425665 351935
7111C51935j72426j19715k2029J40426j34683j57616J01867J41258O4109q4089
$$ 351935 179509 59794 37765 178191 43508 -114108 -12241 129017 193126 109037
7101A09037o7963N9087N2864M9642M5745j23596o0258j65390j569J80863J05143
$$ 109037 41074 100161 153025 202667 248412 124816 64558 -100832 -102401 78462 183605
7090A83605j45373J2744J53078K0292l26326r4190J0332J02583J02274k6588L59739
$$ 183605 38232 50976 204054 224346 -101980 -196170 -185838 -83255 19019 -7569 352170
7079C52170k157j44399j42446l06127m6818j6912o5580N3394J8388J56583P0580
$$ 352170 350013 205614 63168 -242959 -289777 -306689 -372269 -318875 -300487 -143904 -73324
7068g3324M7075l3962r8865l3177P0989J13499j40419j78783O5236M8557R9078
$$ -73324 -26249 -60211 -159076 -192253 -121264 -7765 -148184 -326967 -261731 -213174 -114096
7057a14096J41246j03657l92J15762j8573r5071p7606J8935J11002j3227j67060
$$ -114096 27150 -76507 -76899 38863 20290 -74781 -152387 -133452 -22450 -35677 -202737
7046b02737J80322J90579n2151J4977O7103j3570j8114k34217Q3269J3833j2465
$$ -202737 -22415 168164 116013 130990 198093 184523 166409 -67808 15461 29294 16829
7035A6829J46719j39397k40965O8400K17719q58n5784J6858j15498l6500M3804
$$ 16829 163548 24151 -216814 -148414 69305 68447 12663 29521 -85977 -122477 -78673
7024g8673K72603k5761l9037o053j7437J376l5388l07638N622J59788J93198Q0251
$$ -78673 193930 168169 129132 123079 105642 107018 71630 -236008 -230386 -70598 122600 202851
7012B02851J56364O0114r5217J6742P551O6014Q6432j69267j51030J22356O4536
$$ 202851 359215 419329 324112 340854 348405 414419 500851 331584 180554 302910 367446
7001C67446j94846j32317j08296j65460j57637J93017L47523j8720o5317j74171
$$ 367446 172600 40283 -68013 -233473 -391110 -198093 149430 130710 65393 -108778
6991a08778O9118J13242K11375j9330j72562j52624l2428J96061J62065o1051
$$ -108778 -39660 73582 284957 265627 93065 -59559 -91987 104074 266139 205088
6981B05088J4793j15037r4666k7153r4791K741j00718P4862J08491k7615p3163
$$ 205088 219881 104844 10178 -16975 -111766 -109025 -209743 -134881 -26390 -54005 -127168
6970a27168J25473K98721J44430k79949k05220J8169J35000J1917L4513J05063
$$ -127168 -1695 297026 441456 161507 -43713 -25544 109456 121373 155886 260949
6960B60949j34966o6211O6842J21252o7713R3639R5500k60115j17969j3537M5393
$$ 260949 125983 59772 126614 247866 180153 273792 369292 109177 -8792 -22329 23064
6949B3064O0341p1296J4313R420r2827P7005P9090j15031n978J37358K99177Q991
$$ 23064 83405 12109 26422 35842 -56985 20020 99110 -15921 -21899 115459 414636 423627
6937D23627l08403j92151N53R7495q2207J30195J41752o2789K4831M2180J0354
$$ 423627 115224 -76927 -76374 21121 -61086 69109 210861 148072 172903 215083 225437
6926B25437j57139k16398L9484J02948k17886n592Q3173o8059n3940J83402K47543
$$ 225437 68298 -148100 -108616 -5668 -223554 -229146 -145973 -214032 -267972 -84570 162973
6915A62973j44785m8118o2221o1292Q9847J14176j45268J32184l9343j1531K8696
$$ 162973 18188 -29930 -92151 -153443 -63596 50580 -94688 37496 -1847 -13378 15318
6904A5318R0504L2841j68918r5992J15109J01869Q5473K5400K5537M3480P8380
$$ 15318 105822 138663 -30255 -126247 -11138 90731 176204 201604 227141 270621 349001
6893C49001k1054K0912j63176k56601n0561P6779j22698J68439j40684K6107m0306
$$ 349001 327947 348859 185683 -70918 -121479 -44700 -167398 1041 -139643 -113536 -153842
6882a53842q3907Q0549L0264o3662j34635k8806R6451L4450J59910N4696j05647
$$ -153842 -237749 -157200 -126936 -190598 -325233 -354039 -257588 -223138 -63228 -8532 -114179
6871a14179J10209K2241j16757J50873J35115P6535j29169m8704j04349q6553
$$ -114179 -3970 18271 -98486 52387 187502 264037 134868 86164 -18185 -104738
6861a04738J35889J79283q0304j41508J4611M1943J56007q0763K0537j30627m0273
$$ -104738 31151 210434 130130 -11378 3233 45176 201183 120420 140957 10330 -29943
6850b9943p3150J81046j09186j02360J40944n379p2301l383k30124N7095K1406
$$ -29943 -103093 77953 -31233 -133593 7351 1972 -70329 -73712 -303836 -246741 -225335
6839b25335K0425K36599R7064J73644j25729K1018j35933j0419R7572j70834j00180
$$ -225335 -204910 31689 128753 302397 176668 197686 61753 51334 148906 -21928 -122108
6828a22108L0042J30379j2660J06429P4003k51k5258j12041o8993j53219j69863
$$ -122108 -92066 38313 25653 132082 206085 205834 180576 68535 -458 -153677 -323540
6817c23540k6614J42596N3783J04420M2244k05027J42057J70065p3615k63992
$$ -323540 -350154 -207558 -153775 -49355 -7111 -212138 -70081 99984 26369 -237623
6807b37623n1975K83134J35729o5998j6203J16244j21203J58773O8917n8860j41662
$$ -237623 -289598 -6464 129265 63267 47064 163308 42105 200878 269795 210935 69273
6796F9273j52781J6875k8531M5400O0035r4547R4305J97007K8711k06370k39053
$$ 69273 -83508 -66633 -95164 -49764 10271 -84276 10029 207036 235747 29377 -209676
6785b09676J46473q3085J07451o688j4726N9213P4249p978M0159k00224j37299
$$ -209676 -63203 -146288 -38837 -45525 -60251 -1038 73211 65233 105392 -94832 -232131
6774b32131K04875J09103J9380l9366l3773O6815j32865j65272J38619K5564l0589
$$ -232131 -27256 81847 101227 61861 28088 94903 -37962 -203234 -64615 -39051 -69640
6763f9640k9853P5812R5798J05099K52744l532k34746r3188p7336n6531q2762
$$ -69640 -99493 -23681 72117 177216 429960 426428 191682 98494 21158 -35373 -118135
6752a18135Q2128K44139q6253l1098o7251j02003Q5003J87993j85873n2603J8045
$$ -118135 -36007 208132 121879 90781 23530 -78473 6530 194523 8650 -43953 -25908
6741b5908M25p6812N3146J54057O0564k99212j24166R1205Q1241R1532K5343m3017
$$ -25908 -25483 -102295 -49149 104908 165472 -133740 -257906 -166701 -85460 6072 31415 -11602
6729a1602l4598o796J67685j56864j34425j9569j1507m4188K3773J53570J61477
$$ -11602 -46200 -52996 114689 -42175 -176600 -196169 -207676 -251864 -228091 -74521 86956
6718H6956q5986N7917m038j30159J39463M5529N8207M2350J11087n1012j27708
$$ 86956 970 58887 54849 -75310 64153 109682 167889 210239 321326 270314 142606
6707A42606K7540j20850q2330R4452K33619K3543m700J21336J33494j24565r3599
$$ 142606 170146 49296 -33034 61418 295037 318580 313880 435216 568710 444145 350546
6696C50546j81721k02899Q4183Q2447q6148j9895J01859R1292j5263l6924M4587
$$ 350546 168825 -34074 50109 132556 46408 26513 128372 219664 204401 167477 212064
6685B12064q2901o6687l46434r7075K42235J71214k3125r1039j41533j61357Q6448
$$ 212064 129163 62476 -283958 -381033 -138798 32416 9291 -81748 -223281 -384638 -298190
6674b98190J84134j4902L3353p4385J22719N6087K6766J29098m7428r0114m1721
$$ -298190 -114056 -128958 -95605 -169990 -47271 8816 35582 164680 117252 27138 -14583
6663a4583j4606p554N8813l9043R61J78413N7597o0122p3022k11507k25252j7838
$$ -14583 -29189 -36743 22070 -16973 -16012 162401 219998 159876 86854 -124653 -349905 -367743
6651c67743J89744N1790j86645L8130J53274J41411R9597L505r9190K8301K6142
$$ -367743 -177999 -126209 -312854 -274724 -121450 19961 119558 123063 23873 52174 78316
6640G8316j34980J2168J10560J24287p175j64490o4510n5162J43319J39510J87031
$$ 78316 -56664 -44496 66064 190351 183176 18686 -45824 -100986 42333 181843 368874
6629C68874J6099m1321k90736L7827K08746r4275J5644J7990k59579J9944p8361
$$ 368874 384973 343652 52916 90743 299489 205214 220858 238848 -20731 -787 -79148
6618g9148J36462l8203M3950r8458Q6143J32600k26384k00925J14224J52849o7493
$$ -79148 57314 19111 63061 -35397 50746 183346 -43038 -243963 -129739 23110 -44383
6607d4383j2161j00N6666J4095O4424m3999J6423J6454J4735L7623j38901o5228
$$ -44383 -56544 -56644 22 14117 78541 34542 50965 67419 82154 119777 -19124 -84352
6595h4352j2102L4995N1938j5418j84746J71111K14726N5805k34709k15360R9606
$$ -84352 -96454 -61459 -9521 -24939 -209685 -38574 176152 231957 -2752 -218112 -118506
6584a18506J41937j38770r7834n5782l5264o5835J22745K21316J26648j28218
$$ -118506 23431 -115339 -213173 -268955 -304219 -370054 -247309 -25993 100655 -27563
6574b7563m4116K4094Q1171o8848k5182P8934J14901k62079j54225k8341J7257
$$ -27563 -71679 -47585 33586 -35262 -60444 18490 133391 -128688 -282913 -311254 -293997
6563b93997O9466P0026J05214L48886J38374M9075l21412j4274j94056j97769
$$ -293997 -224531 -154505 -49291 299595 437969 487044 165632 151358 -42698 -240467
6553b40467J21155M8283J11517j0199m422n9836J37875Q5121J45955k04532k67393
$$ -240467 -119312 -71029 40488 30289 25867 -33969 103906 189027 334982 130450 -136943
6542a36943p5927J51150m8R4692N9537j70890r4524R6302k3286n8159P4621J16608
$$ -136943 -212870 -61720 -61768 32924 92461 -78429 -172953 -76651 -99937 -158096 -83475 33133
6530C3133l4038J6816r7752p8667M2594R4458L2723j3430O492j06661M1629O050
$$ 33133 -905 15911 -81841 -160508 -117914 -23456 9267 -4163 2329 -104332 -62703 -56653
6518e6653K27617J08096k25610j17435L8743R8942P0580j22246k9940N9928m4186
$$ -56653 170964 279060 53450 -63985 -25242 73700 144280 22034 -7906 52022 7836
6507G836L169J20952n3109m7806j78213j17621J99615J08542O9846L9957k05017
$$ 7836 11005 131957 78848 31042 -147171 -264792 -65177 43365 113211 153168 -51849
6496e1849j42092P9854p3999n136J57895j17832o0014K152Q7156K4299j48647
$$ -51849 -193941 -114087 -188086 -193222 -35327 -153159 -213173 -211021 -123865 -99566 -248213
6485b48213J59096J66447J41170r4691j57498j16335Q2201Q3144K90331N2648
$$ -248213 -89117 77330 218500 123809 -33689 -150024 -67823 15321 305652 358300
6475C58300j17726j26988q0518Q7742k6310j710p3640J7881J85202l7104j63359
$$ 358300 240574 113586 33068 120810 94500 92790 19150 37031 222233 185129 21770
6464B1770k55107K12614J15083Q8849J09931o3447k59083n3571J92570o3746R8196
$$ 21770 -233337 -20723 94360 183209 293140 229693 -29390 -82961 109609 45863 144059
6453A44059O9642k16596j44153K044M929M5903L8400J74523P5664R212j3210j44045
$$ 144059 213701 -2895 -147048 -145004 -140075 -94172 -55772 118751 194415 203627 190417 46372
6441D6372l14866k2632Q6620L5941J68363p5741p2043j54951j18410L6366J72936
$$ 46372 -268494 -291126 -204506 -168565 -202 -75943 -147986 -302937 -421347 -384981 -212045
6430b12045K24783J55994J31796J01759J12383l9846k12413j29893m1907j60222
$$ -212045 12738 168732 300528 402287 514670 474824 262411 132518 90611 -69611
6420f9611M6876J26137L0107j7037j4012K25618n6473k27733j37170j09875J0131
$$ -69611 -22735 103402 133509 116472 102460 328078 271605 43872 -93298 -203173 -193042
6409a93042O976J49551J32701N7884J9835k4466R2482j31766j62431J09311J25372
$$ -193042 -186066 -36515 96186 154070 173905 149439 241921 110155 -52276 57035 182407
6398A82407p0066m9008P2363j56859l8580J27362j23130k87034m5054M9335L12640
$$ 182407 112341 63333 135696 -21163 -59743 67619 -55511 -342545 -387599 -338264 -25624
6387b5624K53532o2089j21650n8389L7728n7974p0771Q76R4388k06408r0049J52878
$$ -25624 227908 165819 44169 -14220 23508 -34466 -105237 -104361 -9973 -216381 -306430 -153552
6375a53552J15157L7146m5816M2060J25781P3012j34285N7431N3928r1990r234
$$ -153552 -38395 -1249 -47065 -5005 120776 193788 59503 116934 170862 78872 69638
6364F9638m0163l8047J09761O0109L9005o8757R0124K32461j53408k46181K1797
$$ 69638 29475 -8572 101189 161298 200303 131546 221670 454131 300723 54542 76339
6353G6339Q9432j8967J29931j0026j52m9093j18217p9251j87698q0558J76999
$$ 76339 165771 146804 276735 266709 266557 217464 99247 19996 -167702 -248260 -71261
6342g1261J58710J6487L9235J05999p0388p3087j40873l5350M6785o9583R519
$$ -71261 87449 103936 143171 249170 178782 105695 -35178 -70528 -23743 -93326 -83807
6331h3807K6688J94015p0762j19242k37182o2415K35738O2742L1524P7765p4215
$$ -83807 -57119 136896 66134 -53108 -290290 -352705 -116967 -54225 -22701 55064 -19151
6320a9151j50031j06788o0113J23335K45986M2583L4948K13J1641o5798P1960
$$ -19151 -169182 -275970 -336083 -212748 33238 75821 110769 110982 122623 56825 128785
6309A28785O560K8183j88530j64057p7583L568k2461m3469M9466K50704K82810
$$ 128785 135345 163528 -25002 -189059 -266642 -263074 -285535 -329004 -279538 -28834 253976
6298B53976m090j36082l0362Q9100l0012o9098r804l8629J635n3547j51162J31822
$$ 253976 249886 113804 83442 172542 142530 73432 63628 24999 26634 -26913 -178075 -46253
6286d6253J8262P0424Q5310P2743p4833q0007n2767j34070n1907J39864o1050
$$ -46253 -27991 42433 127743 200486 125653 45646 -7121 -141191 -193098 -53234 -114284
6275a14284j24622o5339P0356J64348m5759j3255L0794P0940j15569M7830K6529
$$ -114284 -238906 -304245 -233889 -69541 -115300 -128555 -97761 -26821 -142390 -94560 -68031
6264f8031j1409J05840J10225R6318j53875L4953J07814P9r513o1382k19938j08966
$$ -68031 -79440 26400 136625 232943 79068 114021 221835 221914 212401 151019 -68919 -177885
6252a77885O4230j7160k0773q2904L3100Q0589k6616J44798K0794M6096j23801
$$ -177885 -113655 -130815 -151588 -234492 -201392 -120803 -147419 -2621 18173 64269 -59532
6241e9532j34995j2952J86015J95814n7581j88495j30285q9175K792j15724J18484
$$ -59532 -194527 -207479 -21464 174350 116769 -71726 -202011 -291186 -288394 -404118 -285634
6230b85634J08926J87832J02913m1988k63196j6120l6735j41955l0656J69253
$$ -285634 -176708 11124 114037 72049 -191147 -207267 -244002 -385957 -416613 -247360
6220b47360K88178J67765N0407m1970r8696j9850J7971m3126R0996j020j11222
$$ -247360 40818 208583 258990 217020 118324 98474 116445 73319 164315 163295 52073
6209E2073K8906m2015j07691k2049R154n8114J23718K13982j5193k9619j01954
$$ 52073 80979 38964 -68727 -90776 -81622 -139736 -16018 197964 182771 153152 51198
6198E1198J43978p053M6811q2247k51333L3919l7152k153r0242q0772J72956J98469
$$ 51198 195176 188123 234934 152687 -98646 -64727 -101879 -104032 -194274 -275046 -102090 96379
6186I6379J91831o0111j57361j0344n3640l0822K3312j4791j05100N7963L5411
$$ 96379 288210 228099 70738 60394 6754 -24068 -756 -15547 -120647 -62684 -27273
6175b7273K6328O2671k3111k30426k25121K2120J55980J75457J32592m7809r953
$$ -27273 -945 61726 38615 -191811 -416932 -394812 -238832 -63375 69217 21408 11455
6164A1455q4047p898N9459j27557P4416P4691M9K8160j10288j3161M3976J30875
$$ 11455 -72592 -80490 -21031 -148588 -74172 519 568 28728 -81560 -94721 -50745 80130
6152H0130N1738J5364q6045j66471j9992J53711K5234J15862p1954j18300j46386
$$ 80130 131868 147232 61187 -105284 -125276 28435 53669 169531 97577 -20723 -167109
6141a67109Q7769M2679J80661N9263o8529j09974j50705Q5328Q3960j36990n5314
$$ -167109 -79340 -36661 144000 203263 134734 24760 -125945 -40617 43343 -93647 -148961
6130a48961N0703J28402j12289R9312J22406j4988o8835Q4779j32805j97855J24970
$$ -148961 -98258 30144 -82145 17167 139573 124585 55750 140529 7724 -190131 -65161
6119f5161N1341n3677n8311O0061Q484M8668J39649K76581l6493j56185j64275
$$ -65161 -13820 -67497 -125808 -65747 -57263 -8595 131054 407635 371142 214957 50682
6108E0682N8148J53205j66966M8916J70082j79114R8086J7732o8253j34669q5157
$$ 50682 108830 262035 95069 143985 314067 134953 233039 250771 182518 47849 -37308
6097c7308J20525m9722o7284j5385k88863j39100J25157J22584P8555n539j33953
$$ -37308 83217 33495 -33789 -49174 -338037 -477137 -351980 -229396 -150841 -156380 -290333
6086b90333K8931k7894L7852K75016K5823p9997j18470j24362n9069K04110J47286
$$ -290333 -261402 -289296 -251444 23572 49395 -30602 -149072 -273434 -332503 -128393 18893
6075A8893K14835j21924k49887j9872K74592m9890j09870k46097j75184J13331
$$ 18893 233728 111804 -138083 -157955 116637 66747 -43123 -289220 -464404 -351073
6065c51073L2979n0274N389K1405j3552K36843o491p7804K1970Q0901J50273K2195
$$ -351073 -318094 -368368 -362979 -341574 -355126 -118283 -124774 -202578 -180608 -99707 50566 72761
6053G2761k08326m6888Q283q0108J64201J1101j35336j22199J88623R8182K8064
$$ 72761 -135565 -182453 -174170 -254278 -90077 -78976 -214312 -336511 -147888 -49706 -21642
6042b1642J58729r9489j66604k8998R6080m8918l4580P2520j02554m7184J08175
$$ -21642 137087 37598 -129006 -158004 -61924 -110842 -145422 -72902 -175456 -222640 -114465
6031a14465J41165K442R2648J41605j21529q2006Q1632P0175n5792j34673O6610
$$ -114465 26700 29142 121790 263395 141866 59860 141492 211667 155875 21202 87812
6020H7812l1952r6286j3820l4591J767J27822j62107j43466L26224J48896j33709
$$ 87812 55860 -40426 -54246 -88837 -87070 40752 -121355 -264821 61403 210299 76590
6009G6590q2622j80892J00658O200P988J72301j41273p4306J00729k6323L6792
$$ 76590 -6032 -186924 -86266 -80066 -72078 100223 -41050 -115356 -14627 -40950 -4158
5998d158R914j83103o8640Q7137j01069m3435J23303J01874n244p3567l9589N8336
$$ -4158 5756 -177347 -245987 -158850 -259919 -303354 -180051 -78177 -83421 -156988 -196577 -138241
5986a38241P5605J092M5600l8107K5754m4290K04832Q2898j15789j38248k3816
$$ -138241 -62636 -61544 -15944 -54051 -28297 -72587 132245 215143 99354 -38894 -62710
5975f2710r4720q3793n7511Q3856L8171K092L117q0359Q2508J38433r4457j79465
$$ -62710 -157430 -241223 -298734 -214878 -176707 -174615 -171498 -251857 -169349 -30916 -125373 -304838
5963c04838n6400n2700o4472O8466J14883J63748J37968n7806m8608R9232K73767
$$ -304838 -361238 -413938 -478410 -409944 -295061 -131313 6655 -51151 -99759 -527 273240
5952B73240J72538k44692j38542r7056K68948J6327j65906k37111m8505L5143
$$ 273240 445778 201086 62544 -34512 234436 250763 84857 -152254 -200759 -165616
5942a65616J81243J13693j8276L912p5547K674J21607R3795j22797L017n8109
$$ -165616 15627 129320 111044 114956 39409 42083 163690 257485 134688 137705 79596
5931G9596l863l8012r9017J52943J33150J2191J1145k61759j24403P8237j46272
$$ 79596 75733 37721 -61296 91647 224797 236988 248133 -13626 -138029 -59792 -206064
5920b06064O004K9738J18788m1319k24196k04287J36085K8644j1724J11212K131
$$ -206064 -200060 -170322 -51534 -92853 -317049 -521336 -385251 -356607 -368331 -257119 -254988
5909b54988p1474K1833J71516P0615j24854j35826Q8641M4098J82551L8603j7006
$$ -254988 -326462 -304629 -133113 -62498 -187352 -323178 -234537 -190439 -7888 30715 13709
5898A3709P8929k3127P6308q3625o5741j06723q0943K7988o9105R4094J14095
$$ 13709 92638 69511 145819 62194 -3547 -110270 -191213 -163225 -232330 -138236 -24141
5887b4141M3401P4975l9029j09027j93452l3395J2830J6883J43576J54002N2855
$$ -24141 19260 94235 55206 -53821 -247273 -280668 -267838 -250955 -107379 46623 99478
5876I9478k0981m0136l415J26976M2256j44659N4989l799K0211l21860j69411
$$ 99478 78497 38361 34946 161922 204178 59519 114508 110709 130920 -190940 -360351
5865c60351r541L0443J57470J05179L5992n2918j1167L5066l0687O1717M1075
$$ -360351 -369892 -339449 -181979 -76800 -40808 -93726 -104893 -69827 -100514 -38797 2278
5854B278Q3637j4931J1607j03983J10114M9097m577j34471l1585m7816J60685
$$ 2278 85915 70984 82591 -21392 88722 137819 133242 -1229 -32814 -80630 80055
5843H0055J89679J437q893j79120q9955l7003q870r8347k70479l9611K0839n5614
$$ 80055 269734 271171 262278 83158 -6797 -43800 -52670 -151017 -421496 -461107 -440268 -495882
5831d95882p931L70225K38269o4110L7825r2233m0217Q1038J19052J28289j15106
$$ -495882 -503813 -133588 104681 40571 78396 -13837 -54054 26984 146036 274325 159219
5820A59219j05268N3496j9364j10746R803M8664l51J28670j37810K1895j0075
$$ 159219 53951 107447 88083 -22663 -12860 35804 35453 164123 26313 48208 38133
5809C8133L0757J26598K06699j81105j59409j70037j9956n2258O5590o771q696
$$ 38133 68890 195488 402187 221082 61673 -108364 -128320 -180578 -114988 -121759 -130455
5798a30455K43200J72268o5065j30656j83033k43314M4714K05662O362j831K3882
$$ -130455 112745 285013 219948 89292 -93741 -337055 -292341 -86679 -80317 -82148 -58266
5787e8266L4583r4802j23514J02972J17499k06803q3112O3262R5625J44009J59292
$$ -58266 -23683 -118485 -241999 -139027 -21528 -228331 -311443 -248181 -152556 -8547 150745
5776A50745j32393p4117j73252m8344k20965R2452P3563n0610J82016J38392l9667
$$ 150745 18352 -55765 -229017 -277361 -498326 -405874 -332311 -382921 -200905 -62513 -102180
5765a02180p9968m5134J52896N7386J14909j70697j7013Q0009N0938J05647l0365
$$ -102180 -182148 -227282 -74386 -17000 97909 -72788 -89801 -9792 41146 146793 116428
5754A16428o9425q6851p9380O0865M0126Q0121j2857j1180r3855M6991Q0334j0191
$$ 116428 47003 -39848 -119228 -58363 -18237 61884 49027 37847 -56008 -9017 71317 61126
5742F1126J65649j79039m7428P1725L661q6906n0374m7790q84Q3712N5786j79768
$$ 61126 226775 47736 308 72033 75694 -11212 -61586 -109376 -110260 -26548 29238 -150530
5730a50530R3552J73447m5141N877n698r1022m0348n160n0921P5564J24165Q5069
$$ -150530 -56978 116469 71328 77205 71507 -19515 -59863 -65023 -115944 -40380 83785 168854
5718A68854J06606q2190j89251r1035J12251K98944r5222m5024q751j37217j01562
$$ 168854 275460 193270 4019 -87016 25235 324179 228957 183933 175182 37965 -63597
5707f3597j45926k290m2582j14783L1124J23882K3340J10587N2232j4184n740
$$ -63597 -209523 -211813 -254395 -369178 -338054 -214172 -190832 -80245 -28013 -42197 -47937
5696d7937J57642K02322o1771j47146L1009j90225o0200q7393R3374M1888j87946
$$ -47937 109705 312027 250256 103110 134119 -56106 -116306 -203699 -110325 -68437 -256383
5685b56383j23730J01936j7611J29797j01411p7197J30120K50150j5808k68080
$$ -256383 -380113 -278177 -295788 -165991 -267402 -344599 -214479 35671 19863 -248217
5675b48217k10082N986J93923J17808P2105K58240J78083J8622K0434m7550k19992
$$ -248217 -458299 -452313 -258390 -140582 -68477 189763 367846 386468 406902 359352 139360
5664A39360k33021P5480j05941j5224J90711J49335k27319j23484O5177O320r0026
$$ 139360 -93661 -18181 -124122 -139346 51365 200700 -26619 -150103 -84926 -78606 -168632
5653a68632J5424J37118J47742J59521P0189r945p3458k13416M8039K164l1455
$$ -168632 -153208 -16090 131652 291173 361362 351417 277959 64543 112582 114746 83291
5642H3291k4509m9658m9181L3900J0638R0104l4314k4020P9814j66566k18128
$$ 83291 58782 9124 -40057 -6157 4481 94585 60271 36251 116065 -50501 -268629
5631b68629K246q255k5415q8367J7806J79030J77044R9584j9117j11252k23753
$$ -268629 -266383 -274638 -300053 -388420 -370614 -191584 -14540 85044 65927 -45325 -269078
5620b69078q0722m9705J28585N3207n4457o6276J32245J74142j38945j95090J66449
$$ -269078 -349800 -399505 -270920 -217713 -272170 -338446 -206201 -32059 -171004 -366094 -199645
5609a99645J49012j32311o6694K10818l488J25719J85303q3552j33944m49026
$$ -199645 -50633 -182944 -249638 -38820 -42308 83411 268714 185162 51218 -397808
5599c97808j54642L26474K37325q274N8817o5762j64380n4280o8188q3200N3793
$$ -397808 -552450 -225976 11349 3075 61892 -3870 -168250 -222530 -290718 -373918 -320125
5588c20125q2984J27141K52422k1089Q9164o7049P2737J67766O4149m58559j35318
$$ -320125 -403109 -275968 -23546 -44635 44529 -22520 50217 217983 282132 -176427 -311745
5577c11745R787O1946R2870N9701j63690J41927O5136j81464L9947K13750l1634
$$ -311745 -301958 -240012 -147142 -87441 -251131 -109204 -44068 -225532 -185585 28165 -3469
5566c469n5471R6040L0036M5644L42737Q8983j86211j46159k5065J3402M2790
$$ -3469 -58940 37100 67136 112780 455517 544500 358289 212130 187065 200467 243257
5555B43257j75377j3179p0727P739N5652p1699j81551r6119n5819K08833j6111
$$ 243257 67880 54701 -16026 -8287 47365 -24334 -205885 -302004 -357823 -148990 -165101
5544a65101L160L3451J5780M53k59710L5766L08176m8001l3625P6032p6800k92997
$$ -165101 -161941 -128490 -112710 -112257 -371967 -336201 -28025 -76026 -109651 -33619 -110419 -403416
5532d03416Q5972J85267K56073q264q9327J44114R1810O1805q6221j53316r91
$$ -403416 -317444 -132177 123896 115632 26305 170419 262229 324034 237813 84497 83506
5521H3506k80348M71O5116P7863J0196K4924n5410M8708P0964r5195J6507L8553
$$ 83506 -196842 -196371 -131255 -53392 -43196 -18272 -73682 -24974 45990 -49205 -32698 5855
$$ [...]
##END NTUPLES=NMR SPECTRUM
##END=
