##TITLE=Analysis number 318934
Compound Code ac 27651
Project Code adrs
Chemist Name acros
##JCAMPDX= 6.0         $$ Bruker NMR JCAMP-DX V2.0
##DATA TYPE= NMR SPECTRUM
##DATA CLASS= NTUPLES
##ORIGIN= Bruker BioSpin GmbH
##OWNER= nmr
$$ XWIN-NMR		Version 3.5
$$ Tue Apr 25 12:10:40 2006 GMT Daylight Time (UT+1h)  MAYBRIDGE\nmr@NMR_250MHZ
##.OBSERVE FREQUENCY= 250.131544655141
##.OBSERVE NUCLEUS= ^1H
##.ACQUISITION MODE= SIMULTANEOUS (DQD)
##.ACQUISITION SCHEME= undefined
##.AVERAGES= 16
##.DIGITISER RES= 18
##SPECTROMETER/DATA SYSTEM= dpx250
##.PULSE SEQUENCE= zg30
##.SOLVENT NAME= DMSO
##.SHIFT REFERENCE= (INTERNAL, DMSO, 0, 16.522)
##AUDIT TRAIL= $$ (NUMBER, WHEN, WHO, WHERE, WHAT)
$$ ##TITLE= Audit trail, XWIN-NMR		Version 3.5
$$ ##JCAMPDX= 5.01
$$ ##ORIGIN= Bruker BioSpin GmbH
$$ ##OWNER= nmr
$$ C:\u/data/dgb/nmr/ADRS/2970/pdata/1/auditp.txt
$$ ##AUDIT TRAIL=  $$ (NUMBER, WHEN, WHO, WHERE, WHAT)
(   1,<2006-04-25 12:10:11.94 +100>,<MAYBRIDGE\nmr>,<NMR_250MHZ>,
      <created by zg, POWCHK disabled, PULCHK disabled
       configuration hash MD5:
       84 BC 41 DB A1 6E 1D 46 DA 25 12 A5 C1 ED C5 3A
       data hash MD5: 64K
       72 EF 59 6E E3 61 DD A6 5E 0C 5F 1E AF 04 18 BE>)
(   2,<2006-04-25 12:10:31.16 +100>,<MAYBRIDGE\nmr>,<NMR_250MHZ>,
      <Start of raw data processing
       ef LB = 0.3 FT_mod = 6 PKNL = 1 SI = 32K 
       data hash MD5: 32K
       00 EF A6 4D 35 6A AD A8 70 DF C1 55 A9 8C FA 54>)
(   3,<2006-04-25 12:10:32.86 +100>,<MAYBRIDGE\nmr>,<NMR_250MHZ>,
      <apk 
       data hash MD5: 32K
       EF 52 F9 C8 D7 27 5C CD F8 55 DB 67 BE 35 D8 44>)
(   4,<2006-04-25 12:10:33.64 +100>,<MAYBRIDGE\nmr>,<NMR_250MHZ>,
      <abs ABSG = 5 
       data hash MD5: 32K
       9C 98 FF E5 64 8A CC F9 35 A9 F9 42 68 7D 4E 78>)
$$ ##END=
$$ 
$$ hash MD5
$$ C3 AD 43 31 D3 F7 83 8C D8 40 D8 62 03 2D 9A C7
##$RELAX= 
##$RELAX= 
##$RELAX= 
##$RELAX= 
##$RELAX= 
##$RELAX= 
##$RELAX= 
$$ Bruker specific parameters
$$ --------------------------
##$DU= <C:\u>
##$EXPNO= 2970
##$NAME= <ADRS>
##$PROCNO= 1
##$TYPE= <nmr>
##$USER= <dgb>
##$AMP= (0..31)
100 100 100 100 100 100 100 100 100 100 100 100 100 100 100 100 100 100 
100 100 100 100 100 100 100 100 100 100 100 100 100 100 
##$AQSEQ= 0
##$AQ_mod= 3
##$AUNM= <au_zg>
##$AUTOPOS= <26 >
##$BF1= 250.13
##$BF2= 250.13
##$BF3= 250.13
##$BF4= 250.13
##$BF5= 500.13
##$BF6= 500.13
##$BF7= 500.13
##$BF8= 500.13
##$BYTORDA= 1
##$CFDGTYP= 0
##$CFRGTYP= 5
##$CHEMSTR= <none>
##$CNST= (0..31)
1 1 145 1 1 1 1 1 1 1 1 1 1 1 1 1 1 1 1 1 1 1 1 1 1 1 1 1 1 1 1 1 
##$CPDPRG= <>
##$CPDPRG1= <>
##$CPDPRG2= <>
##$CPDPRG3= <>
##$CPDPRG4= <mlev>
##$CPDPRG5= <mlev>
##$CPDPRG6= <mlev>
##$CPDPRG7= <mlev>
##$CPDPRG8= <mlev>
##$CPDPRGB= <>
##$CPDPRGT= <>
##$D= (0..31)
0 1 0 0 0 0 0 0 0 0.06 0 0 0 0 0 0 0.0002 0 0 0 0 0 0 0 0 0 0 0 0 0 0 
0 
##$DATE= 1145963410
##$DBL= (0..7)
120 120 120 120 120 120 120 120 
##$DBP= (0..7)
150 150 150 150 150 150 150 150 
##$DBP07= 0
##$DBPNAM0= <>
##$DBPNAM1= <>
##$DBPNAM2= <>
##$DBPNAM3= <>
$$ [...]
##$SUBNAM7= <"">
##$SUBNAM8= <"">
##$SUBNAM9= <"">
##$SW= 20.6930455092707
##$SWIBOX= (0..15)
0 0 3 0 0 0 0 0 0 0 0 0 0 0 0 0 
##$SW_h= 5175.983436853
##$TD= 65536
##$TD0= 1
##$TE= 295.16
##$TE2= 300
##$TE3= 300
##$TEG= 300
##$TL= (0..7)
0 120 120 120 120 120 120 120 
##$TP= (0..7)
150 150 150 150 150 150 150 150 
##$TP07= 0
##$TPNAME0= <>
##$TPNAME1= <>
##$TPNAME2= <>
##$TPNAME3= <>
##$TPNAME4= <>
##$TPNAME5= <>
##$TPNAME6= <>
##$TPNAME7= <>
##$TPOAL= (0..7)
0.5 0.5 0.5 0.5 0.5 0.5 0.5 0.5 
##$TPOFFS= (0..7)
0 0 0 0 0 0 0 0 
##$TUNHIN= 0
##$TUNHOUT= 0
##$TUNXOUT= 0
##$USERA1= <user>
##$USERA2= <user>
##$USERA3= <user>
##$USERA4= <user>
##$USERA5= <user>
##$V9= 5
##$VALIST= <valist>
##$VCLIST= <CCCCCCCCCCCCCCC>
##$VD= 0
##$VDLIST= <DDDDDDDDDDDDDDD>
##$VPLIST= <PPPPPPPPPPPPPPP>
##$VTLIST= <TTTTTTTTTTTTTTT>
##$WBST= 1024
##$WBSW= 4
##$XGAIN= (0..3)
0 0 0 0 
##$XL= 0
##$YL= 0
##$YMAX_a= 347390
##$YMIN_a= -500249
##$ZGOPTNS= <>
##$ZL1= 120
##$ZL2= 120
##$ZL3= 120
##$ZL4= 120
##$ABSF1= 16.522
##$ABSF2= -4.171173
##$ABSG= 5
##$ABSL= 3
##$ALPHA= 0
##$AQORDER= 0
##$ASSFAC= 0
##$ASSFACI= 0
##$ASSFACX= 0
##$ASSWID= 0
##$AUNMP= <proc_1d>
##$AZFE= 0.1
##$AZFW= 0.1
##$BCFW= 0
##$BC_mod= 0
##$BYTORDP= 0
##$COROFFS= 0
##$CY= 12.5
##$DATMOD= 1
##$DC= 0
##$DFILT= <>
##$DTYPP= 0
##$F1P= 14.0000005364418
##$F2P= -0.99999901652339
##$FCOR= 0.5
##$FTSIZE= 32768
##$FT_mod= 6
##$GAMMA= 0
##$GB= 0
##$INTBC= 1
##$INTSCL= 1
##$ISEN= 128
##$LB= 0.3
##$LEV0= 0
##$LPBIN= 0
##$MAXI= 10000
##$MC2= 0
##$MEAN= 0
##$ME_mod= 0
##$MI= 0
##$NCOEF= 0
##$NC_proc= -4
##$NLEV= 6
##$NOISF1= 0
##$NOISF2= 0
##$NSP= 0
##$NTH_PI= 0
##$NZP= 0
##$OFFSET= 16.522
##$PC= 1
##$PHC0= 152.5988
##$PHC1= 20.26391
##$PH_mod= 1
##$PKNL= yes
##$PPARMOD= 0
##$PSCAL= 4
##$PSIGN= 0
##$REVERSE= no
##$SF= 250.13
##$SI= 32768
##$SIGF1= 0
##$SIGF2= 0
##$SINO= 400
##$SIOLD= 32768
##$SREGLST= <1H.DMSO>
##$SSB= 0
##$STSI= 32768
##$STSR= 0
##$SW_p= 5175.98343685301
##$SYMM= 0
##$S_DEV= 0
##$TDeff= 65536
##$TDoff= 0
##$TI= <Analysis number 999999
Compound Code 99
Book Reference 9
Project Code 9>
##$TILT= no
##$TM1= 0
##$TM2= 0
##$TOPLEV= 0
##$USERP1= <user>
##$USERP2= <user>
##$USERP3= <user>
##$USERP4= <user>
##$USERP5= <user>
##$WDW= 1
##$XDIM= 32768
##$YMAX_p= 537229885
##$YMIN_p= -808084
$$ End of Bruker specific parameters
$$ ---------------------------------
##NTUPLES= NMR SPECTRUM
##VAR_NAME=  FREQUENCY,     SPECTRUM/REAL,   SPECTRUM/IMAG
##SYMBOL=    X,             R,               I
##VAR_TYPE=  INDEPENDENT,   DEPENDENT,       DEPENDENT
##VAR_FORM=  AFFN,          ASDF,            ASDF
##VAR_DIM=   32768,         32768,           32768
##UNITS=     HZ,            ARBITRARY UNITS, ARBITRARY UNITS
##FACTOR=    0.157963299565203, 1,           1
##FIRST=     4132.6476996994, 0,             0
##LAST=      -1043.33573715361, 0,           0
##MIN=       -1043.33573715361, -808084,     0
##MAX=       4132.6476996994, 537229885,     0
$$ Real data points
##PAGE= N=1
##DATA TABLE= (X++(R..R)), XYDATA
$$ [...]
18648A4187353j513503q54777k21778K09432K03667J97041J18972j29727p66861
18639A1429819j275544j266845r39621n60982n59066l60630k88388j70482j43000
18630E865261k2406K8628j52615j98432j01341L8310K7527j45315k11331j33223
18620D995063k56426k22218j77749q3779L9496j11355r9888o1451j19289j01209
18610C801195O3772N8309L9396L3937O1380J2438p7996p5228j33366j22147r1462
18599C570228j36725k66536j08176k2435k8318o4745j20021j12810j59050r1527
18589B459885n3895J28760J02669K1317m5189j18317k70161n6270J17347J59554
18579B445700L8567r7319j08675N4125k4651j3723j70138M1035P523l7268p0293
$$ plain form
18648 14187353 12673850 11819073 11597295 11806727 12010394 12207435 12326407 12196680 11429819
18639 11429819 10154275 8887430 7947809 7386827 6827761 6467131 6178743 6008261 5865261
18630 5865261 5842855 5871483 5718868 5520436 5419095 5457405 5484932 5339617 5128286 4995063
18620 4995063 4738637 4516419 4338670 4254891 4294387 4183032 4083144 4021693 3902404 3801195
18610 3801195 3864967 3923276 3962672 3996609 4057989 4070427 3992431 3917203 3783837 3661690 3570228
18599 3570228 3433503 3166967 3058791 3036356 3008038 2943293 2823272 2710462 2551412 2459885
18589 2459885 2405990 2534750 2637419 2658736 2613547 2495230 2225069 2168799 2286146 2445700
18579 2445700 2484267 2386948 2278273 2332398 2307747 2294024 2123886 2164921 2172444 2135176 2064883
18568B064883o8572r2069Q4733L5399j56113n0327Q75k26314j14201j0401Q2303
18557A550196J65159r6987j23701J2118m7518l7421k8896J4837O6649m9068m9649
18546A375719j06246J8812L3578r495j22125j52137n0884j3806N2441j1550m2602
18535I71705O623M235k1328p1901j19618k298J24869m392r9868p885Q084j53724
18523F34502k24330K4546J52003O5400Q3563n5564j2687j44921j1543j9793M3569
18512E34745N4428O3326n8372q0320M4258Q6586J7264m547J19407j55312j91432
18501D30031n3892R3920O7327L3002j45209l1002K7328m212L09O2156J10828j8135
18489E72451j71859p5892o3737n9820J41019K38373l8864j77144j10686N822J54184
$$ plain form
18568 2064883 1996311 1904242 1988975 2024374 1868261 1817934 1818809 1592495 1478294 1467893 1550196
18557 1550196 1715355 1618368 1494667 1506785 1459267 1421846 1392950 1407787 1474436 1425368 1375719
18546 1375719 1269473 1288285 1321863 1312368 1190243 1038106 987222 973416 1025857 1014307 971705
18535 971705 978328 982563 961235 889334 769716 767418 892287 887895 788027 780142 788226 634502
18523 634502 410172 434718 586721 652121 735684 680120 667433 522512 510969 491176 534745
18512 534745 589173 652499 594127 513807 558065 644651 661915 657368 776775 621463 430031
18501 430031 376139 470059 537386 570388 425179 394177 421505 417293 417602 479758 590586 572451
18489 572451 400592 324700 260963 201143 342162 580535 541671 364527 253841 259663 413847
18478D13847O0392q4876j66351K1310M9804o5503o910j3379m7946K4047J3287
18467A97722L5861m3359o0053M2666N5765N1846m4223p3971J0647K0281k3053
18456A70129k3922O5340k0760k110m2995n6929j30559N0080J24648M4333j20829
18445E6426o2074N6487L8807Q669j20262n8472J15933N798M3789K08368m2101
18434B51368j9062m4815r259R253N9224m8043l6760k0565P3509q1745O7938o2215
18422A38828j44002p3735M3131J37016J75607R3262m5397j77485j31044l9534
18412b3353P763J4682k8406K4362J2588q36k4406N6500M500L1555q5834q5109
18400i5994O9363J20890j1922j26612q1132j9385Q5037Q7399J272p5442p0714
$$ plain form
18478 413847 474239 389363 223012 244322 294126 228623 221713 208334 160388 184435 197722
18467 197722 233583 190224 130171 172837 228602 280448 236225 162254 172901 193182 170129
18456 170129 146207 211547 190787 188677 145682 88753 -41806 8274 132922 177255 56426
18445 56426 -5648 50839 89646 98315 -21947 -80419 35514 41312 85101 293469 251368
18434 251368 232306 187491 178232 187485 246709 198666 161906 141341 214850 133105 201043 138828
18422 138828 -5174 -78909 -35778 101238 276845 370107 324710 147225 16181 -23353
18412 -23353 -15590 -908 -29314 -4952 7636 6800 -17606 38894 43394 74949 -10885 -95994
18400 -95994 -26631 94259 82337 -44275 -125407 -144792 -59755 27644 28916 -46526 -117240
18389a17240J3989J12549l089k5278j00399j94017m58J25445L3487N0831Q3279
18378b0901J3020k9223J51489J55220l1366p8395j27344j50378n5051J82231R0024
18367I9326p5110J805m719L9373L9170k366l0329k2011J17197j718q7162l7514
18355C5942R5351J40468r0565k07966j37345P14J3815N8636M6020q5418l1126
18344a61474O0435r708l0405J57760k6835p2857P6476L2345L0446j46653k2882
18333a13352J17321L8051k01292J02689J33661M5655p480p1234J9253J8204j21
18322H1355p2861O8255R2791p3885q5746k7928R3451M207j5865Q1094P8221K7748
18310B50837p1333N3205p052j8980J4668k8561m9718P6656L9956m3657j24337
$$ plain form
18389 -117240 -103251 9298 6209 -19069 -119468 -313485 -313943 -188498 -155011 -104180 -20901
18378 -20901 -7881 -37104 114385 269605 238239 159844 32500 -117878 -172929 9302 99326
18367 99326 24216 26021 21302 60675 99845 97479 67150 45139 162336 160618 73456 35942
18355 35942 131293 271761 181196 -26770 -164115 -163401 -149586 -90950 -44930 -130348 -161474
18344 -161474 -101039 -110747 -141152 16608 -10227 -83084 -6608 25737 56183 -90470 -113352
18333 -113352 3969 42020 -159272 -56583 77078 122733 115253 44019 63272 81476 81355
18322 81355 8494 76749 169540 95655 9909 -18019 75432 79639 63774 144868 223089 250837
18310 250837 179504 232709 225657 206677 221345 192784 143066 219722 259678 216021 91684
18299I1684l4491p3155j7917Q2905r224j41275j5173K4387M8061j422M5446p7005
18287g7179O0288J06702O3364K5262j17533o189M4949m8122J3636N8705M768k824
18275A25827N458m7503k8973j09793J1558k0243m2749L1951M6137k1907n6902
18264a07139N320o101j13940m0470Q5180J07778J03450p8366l1159k6803r905
18253a12155j2040J6169M5158O3688j0005K0488M4014K3892j0189m8784N803p3753
18241d7714r2231j6544P8458J21029K9992J15829M8192R1896J01598j05053j74189
18230A51263J9831M4326Q3094j11379o3631p242L6059q6870j39488R3509J5959
18219C5431j2056l1783j28934J9214O7117l7118k3005P8966P3165J0571j01644
$$ plain form
18299 91684 57193 -15962 -33879 49026 39802 -101473 -116646 -92259 -44198 -45620 -174 -77179
18287 -77179 -16891 89811 153175 178437 60904 54715 99664 51542 65178 123883 128651 125827
18275 125827 131285 83782 54809 -54984 -43426 -63669 -106418 -74467 -28330 -50237 -107139
18264 -107139 -101819 -107920 -221860 -262330 -177150 -69372 34078 -44288 -75447 -102250 -112155
18253 -112155 -124195 -108026 -62868 820 -9185 11303 55317 79209 69020 20236 26039 -47714
18241 -47714 -139945 -156489 -78031 42998 72990 188819 237011 328907 430505 325452 151263
18230 151263 171094 215420 298514 187135 123504 116262 152321 65451 -74037 19472 35431
18219 35431 23375 -8408 -137342 -118128 -51011 -88129 -111134 -32168 40997 51568 -50076
18208e0076K0074N4430m3882n228q457l2934o0618L865O6934M5878J9375L7363
18196D6724R80n2649L8806j884n1276K3926J05874Q1867n6199K3336n4011M4882
18184A50376J49204J05053p6527r4993m8300M9174l3456m0227O0705o7356l0623
18173A23030j4528Q9543j3019j17274l1117K8673J1306q6786o9141M7791R3075
18162F1553l7409p3454R8976N8064r5973j52840Q3476Q3636m8257j3644m7465
18151h3337P3943J36399L031p0420K4877L21n1983k1894o601J63617P8823j04570
18139A42206j79729K8252k6627n5234M3537R3327j018k824J05408q6991q0199
18128a9892n2072p7390K2170l6739j7427l8839l3778N2058j419O5203J06545M9549
$$ plain form
18208 -50076 -30002 24428 -19454 -24682 -33139 -66073 -126691 -122826 -55892 -10014 9361 46724
18196 46724 47704 -4945 33861 31977 -19299 4627 110501 192368 136169 159505 105494 150376
18184 150376 299580 404633 328106 233113 184813 233987 200531 160304 221009 153653 123030
18173 123030 108502 198045 185026 67752 36635 65308 76614 -10172 -79313 -31522 61553
18162 61553 24144 -49310 49666 107730 11757 -141083 -57607 26029 -22228 -35872 -83337
18151 -83337 -9394 127005 130036 59616 84493 84814 32831 10937 4336 167953 246776 142206
18139 142206 -37523 -9271 -35898 -91132 -47595 45732 44714 41890 147298 60307 -19892
18128 -19892 -71964 -149354 -127184 -163923 -181350 -220189 -253967 -201909 -203328 -138125 -31580 17969
18116A7969j565p654O0453L8053q7152j12707n1077o5534m5188Q0477J14386N4942
18104d597j30278o8529J27753J06482m4125j6078M1765m0088r0626j6872K1920
18093a13273O7976L714j16852j06776r128J92519K9161l7459O646j2783R5450
18082h05J7307o0558j7733K3248j8038N89J4541l3385l0113j54558j9688J70031
18070a09162n5117j02467k4973n796P6353J3797L9586J38702R4292m0429r0457
18059f5671j13480j669Q192Q4033K1293p2279n3890N0086J40974k3488j29310
18048a55209K3028J6748J07190N3034J11540l0691j53294q9408O8157q087M7884
18037i108L92J6634l1391l868j47418k6713J6015k8780J6949J67267J11428j45852
$$ plain form
18116 17969 16404 8750 69203 107256 20104 -92603 -143680 -209214 -254402 -173925 -59539 -4597
18104 -4597 -134875 -203404 -75651 30831 -13294 -29372 12393 -27695 -118321 -135193 -113273
18093 -113273 -45297 -41583 -158435 -265211 -274339 -81820 -52659 -90118 -83472 -96255 -805
18082 -805 16502 -44056 -61789 -38541 -56579 -55990 -41449 -74834 -104947 -259505 -279193 -109162
18070 -109162 -164279 -266746 -291719 -297515 -221162 -207365 -167779 -29077 65215 24786 -65671
18059 -65671 -179151 -180820 -172628 -88595 -67302 -139581 -193471 -143385 -2411 -25899 -155209
18048 -155209 -132181 -115433 -8243 44791 156331 125640 -27654 -117062 -48905 -56992 -9108
18037 -9108 -8716 7918 -23473 -27341 -174759 -201472 -185457 -214237 -197288 -30021 81407 -64445
18025f4445j02536m6475j00492N5691J10450m6504m3964K6368J06197j6742p7347
18014a99799l9126r1717M086J12224J27544R8080R5370M0659J2220m9917q9746
18003A9878j09577J2863n6436K1888Q1173N9546K3034j15864l230l0706M9931
17992d7500J07340J3854n2990j09747q1450N6597K2220K3394J42285j04054n3663
17981h3714Q3070J5139j45302j34862o160R1276Q9366J05321J91286J5182j31467
17970H9135r0842J0904k4504o9941J39578k944j1066n6574o7679O6697Q7540K5569
17958I5873j45957m0255r2178Q0928J49730J11935j9894R26j0901o3873j41267
17947g4933L7043R6695l2311n4298N1249N5757l3250r3472k2821K6659l10J06342
$$ plain form
18025 -64445 -166981 -213456 -313948 -258257 -147807 -194311 -238275 -211907 -105710 -122452 -199799
18014 -199799 -238925 -330642 -326556 -214332 -86788 11292 106662 147321 159541 109624 19878
18003 19878 -89699 -76836 -133272 -111384 -30211 29335 52369 -63495 -66725 -97431 -47500
17992 -47500 59840 73694 20704 -89043 -170493 -113896 -91676 -68282 74003 -30051 -83714
17981 -83714 -644 14495 -130807 -265669 -271829 -180553 -91187 14134 205420 220602 89135
17970 89135 -1707 9197 -15307 -85248 54330 51386 40320 -16254 -83933 -17236 70304 95873
17958 95873 -50084 -90339 -182517 -101589 48141 160076 140182 141108 130207 66334 -74933
17947 -74933 -37890 58805 26494 -27804 23445 79202 45952 -47520 -70341 -43682 -43992 62350
17935F2350Q5334J26878k8021k5231J3520K2112k5233n8588j7915n5691r0896
17924H619q2416K4311Q6862O9938K9706o2017L7343J5023o3892o0801J48194R7701
17912B48571r6342p4429k9895l8150P7941K2636j3478P3761l4585o9418P0877
17901A37489K6800j6308Q8266j5265K1358J35653J27905l8361p4830q1092n0142
17890B61473O550M1626K2795r1218o3460J2742P9604j20193k3612q7336m7532
17879h561q6249k7945L689J2043J48144Q4522q0495J0154L7486j318p0318r1382
17867g0230j5267N0817O9559M1339K6691M6455l6005k9210J9734r656K4121K0448
17855A38796J03413O5333l1184O7418o0554l086M0715M1580j05576p2783j27492
$$ plain form
17935 62350 147684 274562 246541 221310 234830 256942 231709 173121 155206 99515 8619
17924 8619 -73797 -49486 37376 107314 137020 75003 112346 127369 63477 2676 150870 248571
17912 248571 152229 77800 47905 9755 87696 110332 96854 170615 136030 66612 137489
17901 137489 164289 147981 236247 220982 242340 377993 505898 467537 392707 311615 261473
17890 261473 268023 309649 332444 241226 177766 190508 270112 149919 126307 38971 -8561
17879 -8561 -94810 -122755 -119066 -107023 41121 125643 45148 55302 92788 91470 21152 -70230
17867 -70230 -85497 -34680 34879 76218 102909 149364 113359 84149 103883 94227 118348 138796
17855 138796 242209 307542 276358 343776 283222 280136 320851 362431 256855 184072 56580
17844E6580l1701j2546M7881p8944k7937L7726O9074R6168J16617Q7617j31311
17833B29224k6828Q2958P136M9348P3410Q1963L7652N6475m7258j56301r9185
17822B88594J3036n8189n336J48581p2837j26701j5846k943P8181m0420p289o8777
17810A30054j1254J0768l3518J19399L4272J6873q4689m1174n976K5956R4880
17799B55591j7326M8888P2297L9706J34484K6343N3194n0359r5862K190k4424
17788D44722J13953l4758j40121j03252K9182r1266r187j2891k5652m430N3279
17777B19579p3699J1869J36700P0019N0513N074j18523m0121o6628p9252j55J13409
17765B28785K5161q908j00412L7758K6778k1320o5524j26769K6685R995l0698
$$ plain form
17844 56580 24879 12333 60214 -18730 -46667 -8941 60133 156301 272918 360535 229224
17833 229224 202396 285354 292490 341838 415248 497211 534863 591338 544080 387779 288594
17822 288594 301630 243441 238105 386686 313849 187148 171302 168359 246540 206120 198831 130054
17810 130054 118800 129568 96050 215449 249721 266594 181905 140731 134755 160711 255591
17799 255591 238265 287153 359450 399156 533640 559983 613177 562818 466956 469146 444722
17788 444722 558675 523917 383796 280544 309726 218460 209273 196382 170730 166300 219579
17777 219579 145880 157749 294449 364468 414981 420055 301532 261411 194783 115531 115376 228785
17765 228785 253946 245038 144626 182384 209162 187842 122318 -4451 22234 32229 1531
17754A531K4463Q1203M9357Q798J41208J31465j04974o5344N9567P6755j23325
17743B80704k0504J19104N1069j18340j83215j7529J02960R9024J2810j60609
17733A65474j00420l7662L919O787N0223M2038L5926l259J573J4679M8207L1749
17721B59234O4741J07536r9664N3826Q1152P2639R091J5806J47015K2365j90282
17710E43459k23626o1182m8454J6311j2682o0304o5335p670P5814k0265j54912
17699a8846l357O9231j8815N3424K8957k8093j39070o1403n5965j3058R0945J21717
17687B5667K6318p3509K0293J80812J6745J11089J08589J59900K09016L5649K9159
17676H49728N3303k578O2559l7235j3896J2019J39243K82086J93304N6168q331
$$ plain form
17754 1531 25994 107197 156554 165352 306560 438025 333051 267707 327274 404029 280704
17743 280704 260200 379304 430373 312033 128818 111289 214249 313273 326083 165474
17733 165474 65054 27392 31311 38098 88321 130359 166285 163026 164599 179278 227485 259234
17721 259234 323975 431511 331847 385673 466825 539464 548555 564361 711376 733741 543459
17710 543459 319833 258651 210197 226508 213826 153522 88187 80517 156331 136066 -18846
17699 -18846 -22203 47028 28213 81637 110594 82501 -56569 -117972 -173937 -186995 -96050 25667
17687 25667 51985 -21524 -1231 179581 196326 307415 416004 575904 784920 820569 849728
17676 849728 903031 900453 963012 925777 911881 923900 1063143 1345229 1538533 1594701 1586370
17665A586370p2797q1023Q8797L6920j36175j53122j40299j88111j38665j17823
17655F84072n0032j35632j61155j17469J4721J57546J0119M987J6680q011R6016
17644E11842O3371K5427Q4770J58254l2071l35724j55466j20797O701K9902J16895
17633C53104J02724j172m0728r1921k7223k8506J6584R7923m1837m4065p6432
17622B18451o5483q9551l4268L8582Q5510O4173K4756p4500m755n1984o6859L4403
17610G8475k6379p532r6762K564O3218l7121r7369K6361j2737k3397M9021j2532
17598i4190k0392q1178p3242J3055l5923J05031Q5550L0345J26061P6591j18879
17587A2829m013l2175m4676J33726P6701j00605j02152J8622L9082R2430K957
$$ plain form
17665 1586370 1513573 1432550 1521347 1558267 1422092 1268970 1128671 940560 801895 684072
17655 684072 634040 498408 337253 219784 234505 392051 402170 407157 423837 415826 511842
17644 511842 575213 600640 685410 843664 811593 475869 320403 199606 206307 236209 353104
17633 353104 455828 454656 413928 322007 294784 266278 282862 380785 338948 294883 218451
17622 218451 152968 63417 29149 67731 153241 217414 242170 167670 162915 110931 44072 78475
17610 78475 52096 44564 -52198 -49634 13584 -23537 -120906 -94545 -107282 -130679 -81658 -94190
17598 -94190 -114582 -195760 -269002 -255947 -291870 -186839 -101289 -70944 55117 131708 12829
17587 12829 8816 -23359 -68035 65691 142392 41787 -60365 -41743 -2661 89769 92726
17576I2726N3052r5172k7106O8553O5545M1395N1771J1226q2513l4129K4606J09551
17564B79505m7745n8828j38886l2803j0841j14806l0601O0479L4547m0034k2824
17553a22837j26346m0332L7915R9536J0143N894Q6642j6551j9557N0370O0771
17542B5648N1575o4837l1863J2268r0161m5678N5408M3840O4021k836P9796K2730
17530A19911L3019r5396K0105P0085R2236l1840o5457r4748j551l2237m4666o782
17518c7321J35811O6999n662k6833j36761q2243q5931L3898P5983J07814J14386
17507A60140J9084j21554m1905j9109p786N6360R145m2638k3803p6358L0802l3960
17495i1582m2161J7502M6466L2011O8343J3913R4182j2521n6872p3018K7246j56345
$$ plain form
17576 92726 145778 50606 23500 92053 157598 198993 250764 261990 179477 145348 169954 279505
17564 279505 231760 172932 34046 1243 -9598 -124404 -155005 -94526 -59979 -100013 -122837
17553 -122837 -249183 -289515 -251600 -152064 -141921 -136027 -49385 -65936 -85493 -35123 25648
17542 25648 77223 12386 -19477 -7209 -97370 -143048 -87640 -43800 20221 17385 97181 119911
17530 119911 152930 57534 77639 147724 239960 208120 142663 47915 46364 14127 -30539 -37321
17518 -37321 98490 165489 159827 132994 -3767 -86010 -171941 -138043 -62060 45754 160140
17507 160140 179224 57670 15765 -3344 -11130 45230 54375 11737 -12066 -88424 -57622 -91582
17495 -91582 -133743 -116241 -69775 -37764 30579 44492 138674 126153 69281 -3737 23509 -132836
17483a32836O6764J03319P1976J6453j4328l470j21359n6982j1264p3539n94L0816
17471a25044l3950l5941J54860N4660M6546m4590k9802J26842k9675o9749k4168
17460a0011M8219j34625k9287M0672M4751L1880J7140k7199M9344q444j195l3621
17448a2376k5842M2774N8905N2599q5976m4650N8111l059m98k6838q1930m6029
17436a14809K9047N7023J36963q663j44666n6211m693J10230L2010n5311j77010
17425a96090j54524M5499K30149J63973J15171n3684n5003n8364j95000m4202
17415b02075p0939j4347J10326J1659J199J1742O1635R5891N1665j3862O5333
17404A08227j3970o1462o3482M7995N1948M3975j73014P9457O0810o730k7875
$$ plain form
17483 -132836 -66072 37247 109223 125676 111348 107878 -13481 -70463 -81727 -155266 -155860 -125044
17471 -125044 -158994 -194935 -40075 14585 61131 16541 -13261 113581 83906 14157 -10011
17460 -10011 38208 -96417 -125704 -85032 -40281 -8401 8739 -18460 30884 22440 21245 -12376
17448 -12376 -38218 4556 63461 116060 30084 -14566 43545 40486 39988 13150 -68780 -114809
17436 -114809 -85762 -28739 108224 99561 -45105 -101316 -106009 4221 36231 -19080 -196090
17425 -196090 -350614 -305115 -74966 89007 204178 150494 95491 37127 -157873 -202075
17415 -202075 -273014 -287361 -177035 -165376 -164177 -152435 -90800 5091 56756 42894 108227
17404 108227 94257 32795 -30687 17308 69256 113231 -59783 19674 80484 73754 45879
17393D5879n0062r5702J6978L3947m3431p271M196M3116O604O8638l4907K6218
17381A4203Q1717k2j6924q0693j09955o2617q988K3457j2606N4867J00191J64471
17369A47101j0578k41426j30411J20576N7872o9217J01401j7937q936J7475m5065
17358g9145M0599K8853n4820j38859L5155N0830j6085m0748j47025J0268P6647
17347b34330M8027L6768n303J18750R8039K4451K428o7461j23274j6984j2190
17336a31079o6322N901J34012P49L0915J39210r1786o4572L3205M5088O7365M5080
17324A47766m7853p0089j36595n0166L1941R1720L5197l0937m8139R0606m3019
17313b9568l188R5099j34370p6169O0825R8715J09973n3947j77423K4825O958
$$ plain form
17393 45879 -4183 -99885 -82907 -48960 -92391 -99662 -95466 -52350 -45746 22892 -12015 14203
17381 14203 95920 95898 78974 -1719 -111674 -174291 -183279 -159822 -172428 -117561 -17370 147101
17369 147101 136523 -104903 -235314 -114738 -56866 -126083 -24682 -42619 -51555 -34080 -79145
17358 -79145 -38546 -9693 -64513 -203372 -168217 -117387 -133472 -174220 -321245 -310977 -234330
17347 -234330 -186303 -149535 -154838 -36088 61951 86402 88830 21369 -101905 -118889 -131079
17336 -131079 -197401 -191500 -57488 -56739 -25824 113386 21600 -42972 -9767 35321 102686 147766
17324 147766 99913 29824 -106771 -156937 -124996 -33276 1921 -29016 -77155 13451 -29568
17313 -29568 -32756 62343 -72027 -148196 -87371 11344 121317 67370 -110053 -85228 -78270
17302g8270k6194k9282J7420O6424j15173j42452p1104O9697K9225K0674J15063
17291a43972J55294P3151m0102j3014O4103j04014j03707M2334n2819K4664L5045
17280f3037M1184K1388o6467j72668m1128j3220Q0400P9863R1827o209p9279o3172
17268a90518q994P0333P0391P8525L9344j38197N2124J73483K6963j65278q0126
17257g1950o6278J6250J11903n6328p2403q2110P2090K6618o566P8097M4247q6613
17245i3043N0537n9914r080j9688l4439m1273n3487J7211J58346M8744K3303k1293
17233c4076p3337J04247Q1063l9233n3604j7368R3895l5160j7971l9617r4895
17222a26056J5329M5206q497n6330K3545P0462j032o5937o5301J00656K3182Q4503
$$ plain form
17302 -78270 -104464 -133746 -116326 -49902 -165075 -307527 -378631 -308934 -279709 -259035 -143972
17291 -143972 11322 84473 44371 31357 95460 -8554 -112261 -69927 -122746 -98082 -63037
17280 -63037 -21853 -465 -66932 -239600 -280728 -293948 -213548 -133685 -41858 -48067 -127346 -190518
17268 -190518 -199512 -129179 -58788 19737 59081 -79116 -26992 146491 173454 8176 -71950
17257 -71950 -138228 -121978 -10075 -66403 -138806 -220916 -148826 -122208 -128774 -50677 -6430 -93043
17245 -93043 -42506 -102420 -111500 -131188 -165627 -206900 -260387 -243176 -84830 -36086 -12783 -34076
17233 -34076 -107413 -3166 77897 38664 -14940 -32308 61587 26427 8456 -31161 -126056
17222 -126056 -110727 -65521 -74018 -130348 -106803 -36341 -37373 -103310 -168611 -67955 -44773 39730
17210C9730p0424j09291o178K5763n7419r3824O2417J09724R8147J5718m1038
17199b6675j4138N6478l6108j71461q554n8097O1654m3508O6029M9801O3871q1884
17187a42592j2283P9409J282K4568J45868o0396n4234Q898K7573k19050K4344
17176a76613M6137m690p526J2640J58860P8501n9151j11850K0540j46J3015M4953
17164A4670l4276M3139L2687K9695K7945L4592j61890j42406R8383R8093N172
17153D5804L8726n0554N4993l6339p4955M5161o6575l0363N9714r160J7268N9219
17141E2939K9530m3308N0144j55031k198m5622p3075k6361K4811L8632L0499J3977
17129a05063k1306L211n0465j0968P4703j2672l6491J3552M3724o9722N961P4726
$$ plain form
17210 39730 -30694 -139985 -146163 -120400 -177819 -271643 -209226 -99502 -1355 14363 -26675
17199 -26675 -40813 15665 -20443 -191904 -200458 -258555 -196901 -240409 -174380 -124579 -60708 -142592
17187 -142592 -154875 -75466 -74184 -49616 96252 35856 -18378 -9480 18093 -200957 -176613
17176 -176613 -130476 -135166 -142692 -130052 28808 107309 48158 -63692 -43152 -43298 -30283 14670
17164 14670 -19606 23533 56220 85915 113860 148452 -13438 -155844 -57461 40632 45804
17153 45804 84530 33976 88969 52630 -22325 22836 -43739 -74102 -14388 -23548 -6280 52939
17141 52939 82469 39161 89305 -65726 -67924 -113546 -186621 -212982 -188171 -149539 -119040 -105063
17129 -105063 -126369 -123158 -173623 -184591 -109888 -122560 -159051 -145499 -101775 -171497 -165536 -90810
17117i0810K02372N3348q3483q8243r4063l1885M9875J4474L1595m6639q8126
17106a71585R1521J30169K5783k8145p488p5104q9068k5771M3992J6880j9740
17095a08556j6721J23287J10905j44598j10440O1809O3609j07196p3078L0113
17085a70866P1332m7700j06165J56100M1569P295k9862j60497o1171Q745J3307
17074b77913L3441J06848Q8532J12979K0783p512m7767j8169O5840m0658p7606
17063d1202k6156J3472L0124q8751M5523N1277r601R2769J71194r04k18979J03244
17051A22010L9603o9713j16505j16694O6764K0300J0102p4053j6193O4988o344
17040g5735O9890O4310q2162R2163n7977n6034j1653k447O1503r048j7635o935
$$ plain form
17117 -90810 111562 164910 81427 -6816 -100879 -132764 -82889 -68415 -36820 -83459 -171585
17106 -171585 -80064 50105 75888 47743 40255 -34849 -123917 -149688 -105696 -88816 -108556
17095 -108556 -125277 -1990 108915 -35683 -146123 -84314 -20705 -127901 -200979 -170866
17085 -170866 -99534 -147234 -253399 -97299 -55730 -48435 -78297 -238794 -299965 -291220 -277913
17074 -277913 -244472 -137624 -49092 63887 84670 77158 29391 11222 77062 36404 -41202
17063 -41202 -67358 -53886 -23762 -112513 -66990 -15713 -25314 67455 238649 237745 18766 122010
17051 122010 161613 91900 -24605 -141299 -74535 -54235 -44133 -118186 -134379 -69391 -75735
17040 -75735 -5845 58465 -23697 68466 10489 -45545 -57198 -59645 1858 -7190 -24825 -31760
17028c1760j74207j37634P8132J94255P4595l1338p1394j1771n8313p0921l1092
17017b71448R9145O5842Q87k8250L4970n632k6965n4612O7696M0480J01056L2966
17005E6135l45R2906Q2308j46673j32779L5486P5387j3436j54722J0866K15346
16994A20479O6530O796J17987k7832q4107p7694l6301p4086r3971J16612M3017
16983G7430P676o9666j10606j17933O318K8872N4143L2116O9019K9836K0640n4027
16971b6182Q3376j2160p3708O460m0729N8831J09637R7697j22805j10237l0725
16960f0545J9922q2728J7466o67M4307M6119J30059N7109Q07j3981j0325r811
16948A37732r5023m1016J8140K5870J00223K2076m0804L9082m2072j23971P1243
$$ plain form
17028 -31760 -205967 -343601 -265469 -71214 3381 -27957 -99351 -111122 -169435 -240356 -271448
17017 -271448 -172303 -106461 -105574 -133824 -98854 -104486 -131451 -186063 -118367 -77887 23169 56135
17005 56135 55790 148696 231004 84331 -48448 -12962 62425 48989 -105733 -94867 120479
16994 120479 187009 193805 311792 283960 199853 122159 85858 11772 -82199 34413 77430
16983 77430 85106 15440 -95166 -213099 -206781 -177909 -123766 -91650 -22631 7205 27845 -26182
16971 -26182 57194 45034 -28674 -22214 -62943 -4112 105525 203222 80417 -29820 -60545
16960 -60545 -40623 -123351 -105885 -106552 -62245 -16126 113933 171042 171849 157868 147543 137732
16948 137732 42709 1693 19833 45703 145926 168002 127198 166280 124208 237 71480
16937G1480Q4251M8926n8961o700q8057p3286n1292J17932L2467n1444j59589
16926a34273p8249M0242O0622M4468l8524k6232n8886L9552Q2891M1200r64q835
16914c6988j64844l3282P8457L8493N8569J50058J02457m0170p7905n5718j45385
16903a26258o6147N5982K5224l852J24289j10326j84828R250R4897O8756J14409
16892A396M5466o5993m8192n4558M9960O3630o7659J6502N4307O7086j7002q0709
16880c5766n5941K5936l5773j2035K6721j7236P1629M1289j69732j2483M404l7646
16868b06633R7985J0930Q4188J9920J0983q2003j67079j77446l4606R6889J27818
16857b19054O2544K8921M7147M3127o3973M6060j5090L5342O7618J17783n5482
$$ plain form
16937 71480 155731 204657 145696 138996 50939 -22347 -73639 44293 76760 25316 -134273
16926 -134273 -212522 -172280 -111658 -67190 -105714 -131946 -190832 -151280 -68389 -27189 -28153 -36988
16914 -36988 -201832 -235114 -156657 -118164 -59595 90463 192920 152750 74845 19127 -126258
16903 -126258 -192405 -136423 -111199 -115051 9238 -101088 -285916 -276666 -181769 -113013 1396
16892 1396 46862 -19131 -67323 -121881 -71921 -8291 -75950 -59448 -5141 61945 44943 -35766
16880 -35766 -91707 -65771 -101544 -113579 -86858 -104094 -32465 8824 -160908 -173391 -168987 -206633
16868 -206633 -108648 -97718 -13530 6390 17373 -64630 -231709 -409155 -443761 -346872 -219054
16857 -219054 -156510 -127589 -80442 -37315 -101288 -55228 -70318 -34976 32642 150425 94943
16846I4943j47205j38925J082Q1739M0929l6982l2428R0379J46777K0295J9449
16835A40053r3697J9137N9479m4312j327j138p1772j34472j325J27507R5397N8322
16823A51852k77n126j41003Q1139O9595n2954n7083k0376J4749L1045m4835m0241
16811a3515L1377j00379K4147M0122J68830p5724O0820O6940n1340r6424M9759
16800A04613q4061p1779P9299m906K1746R1680j3296J8086m5041j5163j00170
16789a8992m402P7019J67322J216m959K6966J3754j00008n8433o633n808p7523
16777I519n1086o2539j09780N8539J15287L4992K7197p6296k7750k8091j1170
16766a21178Q4014Q3498o0668p2587l0937j7518O5598R3609p652p2488j8915j0292
$$ plain form
16846 94943 -52262 -191187 -190105 -108366 -67437 -104419 -136847 -46468 100309 120604 140053
16835 140053 46356 65493 124972 80660 79333 78195 6423 -128049 -129374 -1867 93530 151852
16823 151852 151575 146449 5446 86585 156180 103226 46143 25767 40516 71561 26726 -13515
16811 -13515 17862 -82517 -58370 -18248 150582 74858 135678 202618 151278 54854 104613
16800 104613 20552 -51227 28072 23166 44912 136592 123296 141382 96341 81178 -18992
16789 -18992 -23394 53625 220947 222163 217204 244170 257924 157916 99483 92850 87042 9519
16777 9519 -41567 -104106 -213886 -155347 -40060 -5068 22129 -54167 -81917 -110008 -121178
16766 -121178 -37164 46334 -14334 -86921 -117858 -135376 -69778 23831 16179 -56309 -75224 -85516
16754h5516J69380m1038q2362m0203R2134J00533k656k1028J900J4680j26872
16743b1048j17632J03078J5886l3817M9008J24290P885m5461k7024J0990k0168
16732D5987J0540l3707j7622N6251J09389j9729j42972k5196M8059m5420r0612
16721a05032j3214J27756j83L6724N8392P8348m7118j31248P300N9872m9759m4514
16709b2676j0039N119k6413j5404O6643j3122l00j7625j8936j29824K153J08685
16697g1739K0698k9559Q7739N7958o3738j9323j30634m3325N8612J04023j02349
16686a31637K385M7673R7315K1174N153n5486k0773K5889k09249L8653J86584
16675G681o8991k8106Q740M3001J15860L5724J14234P3853j00021m8644l1022
$$ plain form
16754 -85516 83864 42826 -39536 -79739 12395 112928 110272 89244 91144 105824 -21048
16743 -21048 -138680 -35602 -19716 -53533 -4525 119765 127650 82189 55165 66155 45987
16732 45987 56527 22820 5198 61449 170838 151109 8137 -17059 31000 -14420 -105032
16721 -105032 -118246 9510 9327 46051 104443 182791 135673 4425 11725 71597 21838 -22676
16709 -22676 -32715 -27596 -54009 -69413 -2770 -15892 -16192 -33817 -52753 -182577 -180424 -71739
16697 -71739 -51041 -80600 7139 65097 1359 -17964 -148598 -191923 -133311 -29288 -131637
16686 -131637 -129252 -81579 15736 36910 42063 -13423 -34196 -8307 -217556 -178903 7681
16675 7681 -61310 -89416 -80676 -37675 78185 113909 228143 301996 201975 153331 122309
16664A22309j20418j45672o9507J35936J30159K8061L6214L5597q1478N0434p8522
16653D3113r3786P1567M9894L6909m9794m4516n5526N1484k5491K5102n271j16290
16641a12605n1420j3698L0848J02473J17620k370j43469q378M4696j555J43672
16630A05814K6754p6141j08217J4292p4150k09452J45141N1245N2391k7766L3314
16619f6775Q1935j06729J3553R4308N7273m5550o6298p8173O4860J1904k7447
16608f7139Q8694L638o5989o9350J21596N6913L3651M7978r5924j45153k2460
16597a13545l9035L9471J25795J6371K6719O0246l4351j9513J0322n2713P0445
16586I0212O0063K4962n1506r214q9382j4929j2144M3255P6297p8323l3649M4038
$$ plain form
16664 122309 1891 -143781 -213288 -77352 52807 80868 117082 152679 71201 121635 43113
16653 43113 -50673 20894 70788 107697 57903 13387 -42139 9345 -16146 8956 3685 -112605
16641 -112605 -164025 -177723 -146875 -44402 73218 70848 -72621 -80999 -36303 -37858 105814
16630 105814 132568 56427 -51790 -37498 -111648 -321100 -175959 -124714 -72323 -100089 -66775
16619 -66775 15160 -91569 -78016 16292 73565 28015 -38283 -116456 -51596 -39692 -67139
16608 -67139 21555 25193 -40796 -110146 11450 68363 102014 149992 54068 -91085 -113545
16597 -113545 -152580 -113109 12686 29057 55776 116022 81671 62158 72480 19767 90212
16586 90212 150275 175237 123731 114517 25135 10206 -1938 41317 117614 39291 5642 49680
16574D9680L1810n5547l1724j8775m3638O9678J3322j8698L621p7123L7775R8155
16562E8536J0042o0714j7153K2422J13973N1227l1575m9519k504l9246j38310
16551h2821M2104M0642P0379r27o0537J1710n1488L38M3401J65722m6116j04839
16539B7568l0473Q5910N6501K7196j07448j66670j3443R4203N6754q6478j9552
16528g5932j8940j8642j16812R0337J82688m7778M9683J4038k8227P7959j19527
16517a1153m3842O5992j1021j02348l1599N8854O9086j9317K5047J48107R3969
16506B41775j10616j34061m7938j87112L6122N1283m5884O6221R2548n8110K1629
16495g4143J60669Q4632J3158o1305k6072q7279l8591r315O7740J31101M5861
$$ plain form
16574 49680 81490 25943 -5781 -24556 -68194 1484 14806 -3892 -271 -77394 -39619 58536
16562 58536 68578 7864 -9289 13133 127106 178333 146758 97239 94735 55489 -82821
16551 -82821 -40717 -75 70304 69377 8840 20550 -30938 -30600 12801 178523 132407 27568
16539 27568 -2905 83005 139506 166702 59254 -107416 -120859 -26656 30098 -56380 -75932
16528 -75932 -94872 -113514 -230326 -139989 42699 -5079 44604 58642 30415 108374 -11153
16517 -11153 -54995 10997 -24 -102372 -133971 -75117 -6031 -25348 -301 147806 241775
16506 241775 131159 -2902 -50840 -237952 -201830 -150547 -196431 -130210 -37662 -95772 -74143
16495 -74143 86526 171158 184316 123011 96939 9660 -28931 -38246 29494 160595 206456
16484B06456n9223o3198p5477l3766n7106j7320K7438J13896J14921N1502K9581
16473B37704j42073j57368N9415K6271L555K3368j7822q8092p4951P1044q244
16462f7193j6887L3620l7272K3016J01325n6387o6865K358J5810j3543L550m4407
16450a22875j33253O9017J63834N3336L8567M6513K6634L867j17504j25426p1522
16439a68812J05356r4130j14482R1798Q1717J51554R5243j4763j1562P04p7876
16428D4747o305j0365J2004j3641m7994j2150L4525r988n6343n9639o4398j6964
16416b06511R2586Q6684k0953j18454J65114K03064k9589n9214j25865j10575
16406a23713P6300J35592N7583j8150m2858k529l3009Q806K477l5687n5791j0690
$$ plain form
16484 206456 147233 84035 8558 -25208 -82314 -99634 -72196 41700 156621 208123 237704
16473 237704 95631 -61737 -2322 23949 27504 50872 33050 -55042 -129993 -58949 -67193
16462 -67193 -84080 -50460 -87732 -64716 36609 -19778 -86643 -84285 -68475 -82018 -78468 -122875
16450 -122875 -256128 -187111 -23277 30059 68626 115139 141773 145640 28136 -97290 -168812
16439 -168812 -63456 -157586 -272068 -180270 -98553 53001 148244 133481 121919 122623 44747
16428 44747 38442 28077 40081 26440 -21554 -33704 821 -9167 -65510 -125149 -189547 -206511
16416 -206511 -113925 -27241 -48194 -166648 -1534 201530 171941 112727 -13138 -123713
16406 -123713 -47413 88179 145762 127612 84754 82225 49216 58022 60499 24812 -30979 -41669
16394d1669N2954J04852j389P9008r2202q9276N6831j4814o1781J2618P7834n2734
16382C0232m4245n965o1909n1985P179N1218K7129p531P8756J4817M3391p7939
16370C148r5349j26416M0242M2187K3268O1516Q1613J08206K192o0109P8087J9263
16358A77848r2721j49876P2561J43924j8623q7930m3895K434l7073O1023J08028
16347A35700P4390j44105O7053j04809j15539l2577N9295P8432O6861k6879j14468
16336e6646j02659r565K9028J2476P613n9095l5525J90110J86946p1361q1122
16325A0200j10619N6256P1538O8936m9640l373J5144J6431r1340M9630R96m6656
16313a2497J86327O2143j41207J9871m9383o4582n9644P739J47091j0583o4887
$$ plain form
16394 -41669 11285 116137 114748 193756 101554 12278 69109 54295 -7486 5132 82966 30232
16382 30232 -14013 -19978 -81887 -133872 -126693 -75475 -48346 -55877 22879 37696 81087 3148
16370 3148 -92201 -218617 -178375 -136188 -112920 -51404 30209 138415 140607 80498 158585 177848
16358 177848 85127 -64749 7812 151736 133113 45183 1288 3722 -33351 27672 135700
16347 135700 210090 65985 133038 28229 -87310 -119887 -60592 17840 84701 57822 -56646
16336 -56646 -159305 -168870 -139842 -127366 -119753 -178848 -214373 -24263 162683 91322 10200
16325 10200 -100419 -44163 27375 96311 46671 43298 58442 74873 -16467 33163 34159 -12497
16313 -12497 173830 235973 94766 114637 65254 672 -58972 -51233 95858 85275 20388
16302B0388m1094J21186J74923O790n5994J7210j38441j22054m418M7712k7014
16291h06M830Q1452M6202j8040l7423M06Q3347r6078j72464J23968m4259N7631
16279B8766L0771L6653j849O163k1063p6655J4598L8907M2337J593N5406P7092
16267B32719j4855M685j58045N535J02324p6821j06688k0021J18037J50552m5288
16256A92134p5376j65997p3704L334N5882p0359r787M2194L4747J09437O6208
16245A08713R9231n9579j78200n7811J20655o2218m5406n3827j45238J4512N6628
16234b02540O4650J21364p5608o2941J37250O8289J999K401j19158j12010j48842
16223c25146Q2949J58019M4483n0712q1673n5603Q9876M7341J04239N0293P449
$$ plain form
16302 20388 -20706 100480 275403 282193 226199 243409 104968 -17086 -21504 26208 -806
16291 -806 4024 85476 131678 113638 76215 76621 159968 63890 -108574 15394 -28865 28766
16279 28766 59537 96190 94341 100504 79441 2786 17384 56291 98628 100221 155627 232719
16267 232719 217864 222549 64504 70039 172363 95542 -11146 -31167 86870 237422 192134
16256 192134 116758 -49239 -122943 -119609 -63727 -134086 -143873 -101679 -66932 42505 108713
16245 108713 207944 148365 -29835 -87646 33009 -29209 -74615 -128442 -273680 -259168 -202540
16234 -202540 -137890 -16526 -92134 -155075 -17825 50464 52463 54864 -64294 -176304 -325146
16223 -325146 -242197 -84178 -39695 -90407 -172080 -227683 -137807 -90466 13773 64066 71515
16212G1515j318o8944j05044P407J96478l8474L2072O031q5592l7147R6732P724
16200H1440p9729l1223N2494k8997j18056o4687J00375J77563K3407j11212P6166
16189G7541P435l4069q9757o1394P5526O8926N1988M3948J3397o8500l2688q6619
16177c4266O0479K6870p1817L6576k0293j1964o1246M1407Q9844M6563j09636
16166g483r5376Q0006R6563J16142j4427j45840j15693r970N6522Q9980P9526
16155A29950L3814o8265J7952l6148j22817R429M2632N9837M0208J9893l4163
16144I2322K9013q3394q8056o8073P6039K185N2196N4283j8368p5704J759J8240
16132g558J5945J52822m9818j04001m2021L4724O7504R1957p4071r9517k5972
$$ plain form
16212 71515 70197 1253 -103791 -96384 100094 61620 93692 99723 14131 -23016 73716 81440
16200 81440 1711 -29512 22982 -6015 -124071 -188758 -88383 89180 112587 1375 77541
16189 77541 84976 50907 -38850 -100244 -24718 44208 96196 140144 153541 85041 52353 -34266
16177 -34266 26213 53083 -18734 17842 -2451 -14415 -75661 -34254 55590 102153 -7483
16166 -7483 -102859 -22853 73710 189852 175425 29585 -86108 -96078 -39556 50424 129950
16155 129950 163764 95499 113451 77303 -45514 -36085 6547 66384 106592 126485 92322
16144 92322 121335 37941 -50115 -118188 -42149 -39964 12232 66515 48147 -27557 -25798 -7558
16132 -7558 8387 161209 111391 7390 -34631 93 67597 159554 85483 -14034 -40006
16121d0006O6923m4410o4631j3988M1898j1546K0431n036J9115O5824O8578q410
16109I4742p0205q2219J16144p2674p0432O2433j3699R1352L033K9346Q8605K910
16097A79336l0794j3573J6614r3307r398Q3537J06044M1961r5684k01246m0499
16086e7009O3311n1916N6462J0178j08228L27M7270J29847l3401r0386l3701l2414
16074i9660j10813k2352P8025N1239J20033J4555j00871m4003j4198o6747M7973
16063a46819J00503L0859o330L6427R5640n8117q4964Q5010R4988m2630L8384
16052A42951M984l3479J7513q5371K9707l904j7537J8976q7283Q1444P912o8710
16040G203L2680L7831j9696q94n6987J6178j1584L6865n0060J52676J62046K057
$$ plain form
16121 -40006 26917 -17493 -82124 -96112 -54214 -65760 -45329 -50365 -31250 34574 103152 94742
16109 94742 24537 -57682 58462 -14212 -84644 -22211 -35910 55442 58475 87821 176426 179336
16097 179336 148542 134969 151583 58276 48878 132415 238459 280420 184736 -16510 -57009
16086 -57009 6302 -45614 10848 21026 -87202 -86875 -39605 90242 56841 -33545 -67246 -99660
16074 -99660 -210473 -232825 -154800 -103561 16472 31027 -69844 -113847 -128045 -194792 -146819
16063 -146819 -46316 -15457 -21787 14640 110280 52163 -32801 52209 147197 104567 142951
16052 142951 147935 114456 131969 46598 76305 72401 54864 73840 -13443 68001 75913 7203
16040 7203 39883 77714 58018 57124 137 16315 4731 41596 -8464 144212 306258 308315
16028C08315o2566q8414m7349O6654p7660o6915M9170n2841j79819M0275O2686
16017d8464N9974p2979K2777J6111K348L6196n568M4772k323j19627J33795O0245
16005A27257q3830p6254q9588J25288J08564J7815j02770n5395l6033n6267R696
15994a11517R7365P4800o5301k5603P2891Q7914j00899n1990L8122O8654J01307
15983A85743j39267j25547k1953J16233Q8886j824p4185j01805j51594r0805J26518
15972a89600J19443M7644k2882j27787J6901j0281O8921M6230q97J44317Q1012
15961A73021q1627p1273J1168k8768o5963P2635K7716N8186p5452n0394j8355
15950d9106J72245R2067j63494K834L735P2812O443j4345N1854l5475q6073P6287
$$ plain form
16028 308315 245749 157335 109986 176640 98980 32065 81235 28394 -151425 -111150 -48464
16017 -48464 11510 -61469 -38692 -22581 -20233 15963 10395 55167 52844 -66783 67012 127257
16005 127257 43427 -32827 -122415 2873 111437 129252 26482 -28913 -64946 -121213 -111517
15994 -111517 -14152 60648 -4653 -30256 42635 130549 29650 -22340 15782 84436 185743
15983 185743 46476 -79071 -101024 15209 104095 102271 28086 -73719 -225313 -316118 -189600
15972 -189600 -70157 -22513 -45395 -173182 -156281 -166562 -97641 -51411 -52308 92009 173021
15961 173021 91394 20121 31289 2521 -63442 9193 36909 95095 19643 -30751 -49106
15950 -49106 123139 215206 51712 54546 58281 131093 137536 123191 175045 139570 53497 129784
15938A29784J24053q5638l19005j20265L0713l768J05389L0467L6661N9667L486
15927h456K3541L0826n676o370J53278r240j15623O1971j07670r0163j301J12704
15915C7821P5231L8822L6744j34306r9945J67394Q7155j3563R0450j02961j59833
15904B3009M1921J34534l1647o2338o5404m2273j3636j47307N2194R0801P9100
15893E8954k4585j1823J14474N3227q1364q705L6506L7344J2794q6244o2570n6043
15881a8035k5889l173J3267r3082n044l1450j0122J28508n3213q1757N0892K5005
15869a04093O0842N5912p4622r103N6881R3143M3692j19326l5104M6893N4765
15858F9880l596O0145N0828r396K0843j13845n9324M7965j9746O4459J45580J9265
$$ plain form
15938 129784 253837 168199 -150806 -271071 -240358 -244126 -138737 -108270 -71609 -11942 -8456
15927 -8456 15085 45911 40235 33865 187143 177903 62280 124251 16581 -73582 -74883 37821
15915 37821 113052 151874 188618 54312 -45633 121761 208916 195353 285803 182842 23009
15904 23009 64930 199464 167817 105479 40075 -2198 -15834 -163141 -110947 -20146 58954
15893 58954 34369 22546 137020 190247 108883 100178 136684 174028 186822 100578 38008 -18035
15881 -18035 -43924 -47097 -33830 -126912 -131956 -163406 -173528 -45020 -98233 -179990 -129098 -104093
15869 -104093 -43251 12661 -61961 -71064 -14183 78960 122652 3326 -31778 15115 69880
15858 69880 66284 126429 177257 167861 188704 74859 15535 63500 43754 108213 253793 273058
15846B73058r5621j80506j76629p2136M3796J18652K155p018R5096P8912l1114
15835D8645j13265P6891J5383L2190J18067Q0293R6364j02516j73095O091L6872
15824A21920R395j65586N159l9283q0049j03286n1524J82571J1281M9093N8884
15813a425l0092J00546r122J16422O2886p8667L9426p1534r1451l2497J03054
15802A07546J07949L2577O6123R788q8110j17878j58354n5101J8105r7929m2508
15791b17792O9791O4830L4379k0848N2036j1786k1050R0163k21k7347Q78Q422
15779B1455j35482j8040l6599L7651Q4432J59041P6799r184L9615l7500M3632
15768B25820n2300p1827L3023J4008j57388j0134Q2842O0740n0195j8556j27471
$$ plain form
15846 273058 177437 -3069 -179698 -251834 -208038 -89386 -87231 -94249 847 79759 48645
15835 48645 -64620 12271 27654 59844 177911 258204 354568 252052 78957 85048 121920
15824 121920 131315 -34271 -29112 -68395 -148444 -251730 -303254 -120683 -109402 -60309 -1425
15813 -1425 -31517 69029 59907 176329 239215 160548 199974 128440 36989 4492 107546
15802 107546 215495 248072 314195 323983 235873 117995 -40359 -95460 -77355 -175284 -217792
15791 -217792 -148001 -83171 -48792 -69640 -17604 -29390 -50440 39723 39502 12155 13033 21455
15779 21455 -114027 -132067 -168666 -131015 -46583 112458 189257 180073 219688 182188 225820
15768 225820 173520 101693 134716 148724 -8664 -18798 64044 124784 74589 56033 -71438
15757g1438j5656j53J44143J21329j36545m0316O0598P0896M9192j19193p5812
15746a2955L9795J34421m9615K1552k8145j29489Q197J82253K29542M4629j26731
15735C13454j36070p8060l4150l498l6435k6780l9966O7563j9854J13346j06287
15724A3263r980k8891K8331O9698n0445K2283k4089q9161o574L2986r938m6891
15712i9408N5460j0642J4258J20524Q296n230m5642j10051k8913M3648N4797K314
15700e89L980m5288k6482O8091L9501p1299l3474l5045m4659P8210N9503R2403
15688H4852o8812q7394K6515P1031O2916P3544k5892N1640r9209l6476p2185q9401
15676a08871P3833R4511m7919K0193m0607o5053K4448P5881M1689r728j7470J35970
$$ plain form
15757 -71438 -87094 -87247 56896 178225 41680 1364 61962 132858 182050 62857 -12955
15746 -12955 26840 161261 111646 133198 105053 -24436 -16239 166014 395556 440185 313454
15735 313454 177384 99324 65174 61676 25241 -1539 -41505 26058 6204 119550 13263
15724 13263 3283 -25608 2723 72421 21976 44259 20170 -68991 -75565 -42579 -52517 -99408
15712 -99408 -43948 -54590 -40332 80192 88488 83258 37616 -72435 -101348 -57700 -2903 -589
15700 -589 3391 -41897 -68379 -288 39213 -32086 -65560 -100605 -145264 -67054 -7551 84852
15688 84852 16040 -71354 -44839 26192 89108 162652 136760 188400 89191 52715 -19470 -108871
15676 -108871 -35038 59473 11554 31747 -8860 -73913 -49465 26416 68105 58377 40907 176877
15664A76877n3393M19k0598l108J08408m3629p1368n0456p2833O5210M9906j05312
15652a9877l0213j6572r8336j3477Q8482J63224J50426j110q2853p8813o0436
15641D45o2519M3763J05608M5775j24764k4618o271N7817O4386k2402j3326Q5616
15629A49510J01500j0023j7805m2141L265n4765J2273K6662k3164j32541j63484
15618a50713O3219J42734N7055l8343p4966m578N7447J48213j9270l8507o4743
15607G7548N3438m5495j21266J11475O3475q5372r2386n9870O1137J04252N6239
15596A23175o3259J4278M8344M9077q0331o6853m0474j12986R7779R4064m0795
15585B2019q9356M5836P7551R3961M4951k4214p2419j6845L652K6731p8819J3648
$$ plain form
15664 176877 123484 123903 103305 100197 208605 164976 93608 43152 -29681 35529 85435 -19877
15652 -19877 -50090 -66662 -164998 -178475 -89993 73231 223657 222547 139694 60881 445
15641 445 -62074 -18311 87297 133072 8308 -16310 -22581 35236 99622 77220 63894 149510
15629 149510 251010 240987 223182 181041 184306 129541 141814 168476 145312 12771 -150713
15618 -150713 -87494 55240 112295 73952 -1014 -5592 51855 200068 180798 142291 77548
15607 77548 130986 85491 -35775 75700 139175 53803 -38583 -98453 -37316 66936 123175
15596 123175 59916 74194 122538 171615 91284 24431 -16043 -129029 -31250 62814 22019
15585 22019 -67337 -21501 56050 150011 194962 170748 98329 81484 85136 111867 33048 46696
15573D6696k830k35978p9108J31677P2164J42284J06333n0506q6343k0629o6568
15562d2808l8593Q0779N6924o3030K1130L900J44420N2998m4067o2571j24564
15551a5482J15748O0263j30029m0677N9957J08422K4278l1621j52863K6676N5119
15540G9791m84j04725m6734Q6568o757l2627l1307R6656P2961L0383p2104j38947
15528f7326r5001l9661O4509M74P6741Q2389q844r7882j7369M8194o0770r6973
15516b11519K2928R5344J03059J45297M8669p0146j8289K4463j1943j45j09204
15505A8514o4109p000J09453l705j90001l6475L5979l3913l6244O0019J37399
15494a0083J08481K4516n1712R2578j8934j92577p1602J15022J31513N5161p0
$$ plain form
15573 46696 43866 -192112 -271220 -139543 -67379 74905 181238 130732 44389 23760 -42808
15562 -42808 -81401 -622 56302 -6728 14402 18302 162722 215720 171653 109082 -15482
15551 -15482 100266 160529 30500 -10177 49780 158202 182480 150859 -2004 24672 79791
15540 79791 79307 -25418 -72152 14416 7659 -24968 -56275 40381 113342 143725 71621 -67326
15528 -67326 -162327 -201988 -137479 -137005 -60264 22125 13281 -84601 -101970 -53776 -114546 -211519
15516 -211519 -188591 -93247 9812 155109 203778 133632 115343 139806 127863 127718 18514
15505 18514 -45595 -52595 56858 53153 -136848 -173323 -137344 -171257 -207501 -147482 -10083
15494 -10083 98398 122914 71202 163780 144846 -47731 -119333 -4311 127202 182363 182293
15483A82293n2726M286k585j32024j0759l2145J2835k5977P6435N0645O7926L9747
15471A77951k9156K2576m7459l1498k6867p5023k1966m607o5230l6771N824j2045
15459a44271Q5053Q6563L1872l3195r3150Q3918p892o871M900R259K6501m6724
15447d037Q0175N887p2850K165J036J06034J44527J0092n0712j5663L2051r57
15435B37748r6809K5823p9368m0887j7487m1439M9724N0478j12721j3144o3773
15424a01855J7828n095K2510K6379p5170K4950O8180j7521n1317J9422k3061n7215
15412a51965K1106K2755J0454J6574M2003K7155M1603l8871P0299K477K6176k4995
15400F4771K9339j18559k0514N710o2642o0594j19387J17051R1286j33209K3217
$$ plain form
15483 182293 129567 133853 131268 -756 -11515 -43660 -30825 -56802 19633 70278 138204 177951
15471 177951 148795 171371 123912 92414 65547 -9476 -31442 -36049 -101279 -138050 -132226 -144271
15459 -144271 -59218 27345 59217 26022 -67128 16790 8898 2027 6927 16186 42687 -4037
15447 -4037 76138 82025 9175 11340 12376 118410 262937 273029 222317 206654 238705 237748
15435 237748 140939 166762 87394 46507 29020 -12419 37305 87783 -24938 -38082 -101855
15424 -101855 -84027 -89122 -66612 -40233 -115403 -90453 -22273 -39794 -91111 -71689 -94750 -151965
15412 -151965 -130859 -108104 -97650 -81076 -39073 -11918 29685 -9186 61113 63590 89766 64771
15400 64771 94110 -24449 -44963 -39253 -101895 -162489 -281876 -164825 -73539 -206748 -183531
15389a83531R8067J27768L5563l0772l2390J1453N134m0123N2631j7037p334o8205
15377d8776k25454r347J32965P3184O0172O4540p4393j0341L695r660O645J4790
15365b1980R172M7473L0122o1954o2233l7210R0884Q2137j26935n3143J41696
15354C8029Q619j1527j14315J6182Q7710J3563k2009k4120M3501J14960o2077
15343H8516Q417K5051j4188l0438n593k2676j32136Q2962O2791q8796p2270J09892
15331A1532L9132R8494J918j13137q3244J1786j48273j19830Q2775Q2971Q9815
15320d6061O0562l6967r7374j74918m6500R8122K1680O9821J26396k4454l2102
15309h1795K6870M4201m3865O9305k8188l3522L1867N3075N2224j42825k7320
$$ plain form
15389 -183531 -85464 42304 77867 47095 14705 26158 31292 -8831 43800 26763 19429 -48776
15377 -48776 -274230 -283577 -150612 -77428 -17256 47284 -27109 -37450 -33755 -43415 -36770 -21980
15365 -21980 -12808 34665 64787 2833 -59400 -96610 -5726 76411 -50524 -103667 38029
15354 38029 46648 35121 -79194 -63012 24698 38261 16252 -7868 35633 150593 88516
15343 88516 96933 121984 107796 77358 71765 49089 -83047 -85 62706 -26090 -98360 11532
15331 11532 50664 149158 151076 37939 -45305 -33519 -181792 -301622 -218847 -135876 -46061
15320 -46061 14501 -22466 -119840 -294758 -341258 -243136 -221456 -151635 -25239 -49693 -81795
15309 -81795 -54925 -10724 -54589 14716 -13472 -46994 -15127 37948 90172 -52653 -79973
15298g9973K7980R4464O2717l2438J393l2685j566K6913K483M8850J73905l0798
15286B61245j93320o2463m9476K9934J00450N767M2849K9518j07838p9259l1251
15275e3844Q8736R278Q833o6274n8468J3624J22910j8519K3509l6725o8250o9960
15263a05150j0979M4601L6882j3668K5060o0998o1381m69J02148J11404K7653
15252I5103K8672j43342j51751k5223J19712J6086L7938J43658k3896N2881n8606
15241I1232L702l9176k699N1474l0039l7274j25447j3191M1710N2004N5216k4416
15229B3096O2359q4739l09m138J2372j1950L4056j31205p6415p0009M0690J38776
15217f7416O6953m9909N0410L4452m0863N5025r3899R541k5201k699o1286K9214
$$ plain form
15298 -79973 -51993 42471 105188 72750 74143 41458 39892 66805 69288 118138 292043 261245
15286 261245 67925 5462 -44014 -14080 86370 92137 134986 164504 56666 -22593 -53844
15275 -53844 34892 44170 53003 -13271 -71739 -58115 64795 46276 69785 33060 -35190 -105150
15263 -105150 -116129 -71528 -34646 -48314 -23254 -84252 -145633 -146102 -43954 67450 95103
15252 95103 123775 -19567 -171318 -196541 -76829 -60743 -22805 120853 96957 149838 91232
15241 91232 94934 55758 53059 104533 74494 37220 -88227 -101418 -59708 -7704 47512 23096
15229 23096 85455 716 407 -3731 8641 -3309 30747 -100458 -176873 -246882 -206192 -67416
15217 -67416 -463 -50372 38 34490 -6373 48652 -45247 -35706 -60907 -63606 -124892 -95678
15205i5678m4362o7140P1108P4267j700P5157n165J1832M1406m434j02314l7986
15193h5009P4207J32465J07310j17206q2658R0487M6982l7979M0216P953O4198
15182B40966k8648m6758n7303m0465o6145L7084J05703M533l1835r5322K8627
15171E0437L7905m0957m880j32655j6835M2770L3133P4472L6867r2949n6070j8754
15159h7516R5653J29523k0991n9771l0910k2296o9186m5616J8735L2006Q217J12241
15147F0089J48109J544o0941p0520N7569j3923j45592q0968n326O0193Q7977k1801
15135A6410M4459P0815R4548N9965j90525j70214R1008Q4397q280K4801O5588
15124A82972N2651n499l988l1586j37370j6037l3623n613p8305n3973M2594J37101
$$ plain form
15205 -95678 -140040 -207180 -136072 -61805 -63505 11652 6487 18319 59725 55291 -47023 -85009
15193 -85009 -10802 121663 228973 111767 29109 119596 166578 128599 168815 176768 240966
15182 240966 212318 165560 108257 67792 1647 38731 144434 148967 117132 21810 50437
15171 50437 88342 47385 42505 -90150 -106985 -64215 -31082 43390 80257 -12692 -68762 -87516
15159 -87516 8137 137660 116669 56898 25988 3692 -65494 -111110 -92375 -60369 -52152 60089
15147 60089 208198 209742 148801 78281 135850 121927 -23665 -104633 -109959 -49766 38211 16410
15135 16410 60869 131684 226232 286197 95672 -74542 16466 100863 92583 117384 182972
15124 182972 235623 230124 226136 194550 57180 41143 7520 1907 -76398 -130371 -87777 49324
15112D9324K9999k0514J9434k747L758m8290n5737L393Q2984J13964q1382N6993
15100A51179Q2730q1233r4736K5064k3237L7515q5363P6730l1034j12117l5985
15089i0487L0609Q3319m8645j11592q632R7058R7613M7094o9416n4721L8850j1556
15077e06q4485k0428m3501N7908J43810J15560j2952n8953q6866r7916Q4290Q1709
15065G7670j1921J1892r0035j19047M0747Q6165Q6422L0254K0965p0876L8179
15054A00415n9370l24K4484L4176K466n4212m2053j3763K8884J59752l8577j35193
15042F685L5907l3071J03385N0398j34815l2659N6504O5688k1617k0861j6366
15031E9178J6163J819N5024K2894k0919j51357o0882j0042J4096J2581j0919K2131
$$ plain form
15112 49324 79323 58809 78243 75496 79254 30964 -24773 -21380 61604 175568 94186 151179
15100 151179 233909 152676 57940 83004 59767 97282 11919 88649 57615 -54502 -90487
15089 -90487 -59878 23441 -25204 -136796 -145428 -48370 49243 96337 26921 -27800 11050 -506
15077 -506 -84991 -105419 -148920 -91012 52798 168358 155406 96453 9587 -88329 -4039 77670
15065 77670 65749 77641 -12394 -131441 -90694 -4529 81893 112147 133112 62236 100415
15054 100415 41045 40721 65205 99381 101847 47635 5582 -8181 20703 180455 141878 6685
15042 6685 42592 9521 112906 163304 28489 -4170 52334 118022 96405 75544 59178
15031 59178 75341 77160 132184 155078 134159 -17198 -78080 -88122 -74026 -61445 -72364 -50233
15019e0233K072N3195q7870j22927P8608J15398J24325K6939P0018M0774m9373
15008B00926n4262j55973m2140L1205n2993k7330o9466P8795j312M7304J48720
14997A03474p095n0415J0722p2759J05190N5190j08051l5291N879k3916p05m2176
14985e9953L5638M2452q0991j6100J23305J58301O9972R757K8608O6975j15710
14974B62254j17995j38227m5169n512q4859J1966k2399q7409K1771N5428l5083
14963a85234K9804M4084P5051M6929O1531j4404l534o4109L054L2384k928l632
14951A8996Q0733K7420n0948l9437j8280j14647J24051R911r1939m0825J00290
14940E325n4772j18785N1574P6812j6470m9609J71907J05530q0726Q128l7142
$$ plain form
15019 -50233 -48161 5034 -82836 -205763 -127155 -11757 112568 139507 209525 250299 200926
15008 200926 146664 -9309 -51449 -20244 -73237 -100567 -170033 -91238 -92550 -45246 103474
14997 103474 96379 45964 56686 -16073 89117 144307 36256 965 6844 -17072 -17777 -59953
14985 -59953 -24315 18137 -62854 -78954 44351 202652 272624 282381 310989 377964 262254
14974 262254 144259 6032 -39137 -44649 -129508 -117542 -139941 -227350 -205579 -150151 -185234
14963 -185234 -155430 -111346 -36295 10634 72165 57761 54227 -9882 -6828 25556 22628 18996
14951 18996 99729 127149 76201 36764 18484 -96163 27888 37799 -54140 -94965 5325
14940 5325 -49447 -168232 -116658 -39846 -56316 -105925 65982 171512 90786 98914 61772
14929F1772p632j16348o4957O717J39770J6938m1215j358Q9266m5102J03648m472
14917A37027j31375P5698j422p8723j17486J4468q7898j5370l866J41560J32455
14906F5068L8900N6235Q2581k0603m6809r185K2327p9093j06181j50337L3919
14895a13178L4252K9288j1006L8164J8644k0800n0766o2678m0299N5040N5924
14884f7415R5972P0046k1047j2022J0218n326n6119r9507L5397o4183o036J69592
14872D9570L9541p175J0334j35586J1292J06505O7598j5285j02654P0297L7608
14861A32045r9238n7206J07529J36509o3837r864j4556q4302l5977K4888l8989
14850b998N5479J29353M1896l758K7411o6580m5965l6505m8616q2802Q2385Q0953
$$ plain form
14929 61772 54140 -62208 -127165 -120448 19322 36260 -4955 -6313 82953 37851 141499 137027
14917 137027 5652 81350 79928 1205 -116281 -101813 -189711 -205081 -208947 -67387 65068
14906 65068 103968 160203 242784 222181 175372 166187 188514 109421 3240 -147097 -113178
14895 -113178 -78926 -49638 -60644 -22480 -3836 -24636 -75402 -138080 -178379 -123339 -67415
14884 -67415 28557 98603 77556 65534 75752 70426 14307 -85200 -49803 -113986 -120022 49570
14872 49570 89111 81936 92270 -43316 -32024 74481 142079 126794 24140 94437 132045
14861 132045 32807 -24399 83130 219639 155802 145938 131382 47080 11103 35991 -2998
14850 -2998 52481 181834 223730 219972 247383 180803 134838 98333 49717 -33085 49300 130253
14838A30253M7884p4423o0423n4430m8950j01931o6382J98313J79279M817L1550
14827A85557j28242j67263k3019N9863M4594J02109m1470j12621L8271n381p2066
14816a19668J20968q858q0476o1082J20114J12236l1885J9904J0950k6767Q66
14805E6302P9187N3582J1352N4209J1893Q832l2141p7121o7549p1416Q959q1613
14793d5524K2315L3111O9572n6727j16261J45377L6942r7924k5108N8559L9877
14782F4209j92778n9603M430K6583r410k7139J3392K7692R2765L0488N40j5844
14770d4675r655K7250J37405M1856P8675n1370J5400m1984Q442K24469K8686j80253
14758B34246r9970n9311O8624N7229j955j2938o3623n9263r1283n0838L6221J078
$$ plain form
14838 130253 178137 103714 43291 -11139 -60089 -162020 -228402 -30089 149190 154007 185557
14827 185557 57315 -109948 -132967 -73104 -28510 73599 32129 -80492 -42221 -47602 -119668
14816 -119668 1300 -7558 -88034 -149116 -29002 83234 51349 71253 82203 55436 56302
14805 56302 135489 189071 200423 254632 266525 275357 243216 166095 98546 27130 36089 -45524
14793 -45524 -23209 9902 79474 22747 -93514 51863 88805 -9119 -34227 24332 64209
14782 64209 -128569 -188172 -183742 -157159 -166569 -193708 -180316 -152624 -59859 -29371 -28831 -44675
14770 -44675 -54330 -27080 110325 152181 230856 179486 194886 152902 161344 385813 414499 234246
14758 234246 134276 74965 143589 200818 198863 185925 122302 63039 -28244 -79082 -42861 -41783
14746d1783k1773l0150O4145k6943L2309n3975l6516M2009P9044N617o0987L3138
14734a5865M505p6788o632O324L2995Q0002N4577R0543j4196j7764p2306n7466
14722G929o139M0455P679M8198p502l4659l8593l878L9683L6896k2121Q4225Q16
14709A52989N0153M8615j12211j51338p0586j814m720N4928J4412Q4236j0236
14698E4428q963k5897j05601l1787K6005J91294L5402J1671K9406N4663R98O6586
14686B98205j03527j41568l9901k0889J5926L0719l4799M5822J2894O6587P4677
14675B04146o593j40012r1200J5407Q847j0453J09649N5640K51n911p3886j17800
14663e1915L6779M9096n4849J0533M9417n5852j4077M3989o3263N5548k4966o1906
$$ plain form
14746 -41783 -63556 -93706 -29561 -56504 -24195 -78170 -114686 -72677 6367 11984 -49003 -15865
14734 -15865 -11360 -88148 -94780 -88456 -55461 24541 79118 169661 155465 137701 65395 7929
14722 7929 1790 42245 49924 98122 90620 55961 17368 13490 53173 90069 67948 152173 152989
14709 152989 203142 251757 139546 -11792 -82378 -84192 -88912 -33984 -19572 64664 54428
14698 54428 45465 19568 -86033 -117820 -91815 99479 134881 146552 175958 230621 231619 298205
14686 298205 194678 53110 13209 -7680 8246 38965 4166 49988 62882 129469 204146
14675 204146 197553 57541 -33659 -18252 -9405 -19858 89791 145431 145682 139771 65885 -51915
14663 -51915 -15136 33960 -20889 -10356 39061 -16791 -30868 13121 -50142 5406 -19560 -81466
14651h1466l7492J12395K06413j3324j21137r9768j32034M4928O5762K3477j02592
14640a34838m6318N9383L0258N5130M7025j5126k9650J1098P0190L3501O5592
14629A46245o981k0870n6180j19320j32328k9280J13372J05887P059N5564k7050
14618C6118r8851L7200o8265k4952O2434L7938J35898j00324O6J3007L146P4554
14606A07969P6418j41j2337K7116q495j9903j6502m1858P8573M7513j12798q1525
14594D4030k1573O541n072q6125o4297L3583j259n313P4252k3637o5769Q600J21246
14581A5207P8071M0598J2751l2460J8914r653J4878M3951o5561n9116n0285l1830
14569b4535l5034L6170O6399P0122r1313r0394J5931j21031j5267L7605N8967
$$ plain form
14651 -81466 -118958 -6563 199850 186526 65389 -34379 -166413 -121485 -55723 -32246 -134838
14640 -134838 -181156 -121773 -91515 -36385 10640 -4486 -34136 -23038 47152 80653 146245
14629 146245 139264 118394 62214 -57106 -189434 -218714 -105342 545 7604 63168 36118
14618 36118 -62733 -25533 -93798 -118750 -56316 -18378 117520 17196 17262 30269 33415 107969
14606 107969 184387 184246 171909 199025 190530 170627 154125 112267 190840 238353 125555 44030
14594 44030 22457 28998 23926 -62199 -126496 -92913 -94172 -99485 -25233 -48870 -114639 -106039 15207
14581 15207 93278 133876 146627 114167 133081 123428 138306 182257 116696 57580 7295 -24535
14569 -24535 -59569 -23399 43000 113122 21809 -68585 -52654 -173685 -188952 -151347 -92380
14558i2380P6322J04745j18096j1926M3345q6526q5716R4057J00025q6550k6462
14547h9162l1381M013m3070Q350j8508J48483p3862k9127O5583J8148l3844j02751
14535a77128J05831J24829J2589n6251j06625L6950L8000M3336Q73Q008P1311
14524A01723L1725J2632j21154q3182L6424k270J3005p2366L0720M2345M9609
14513C9211o9143m1439J20690o4379r4097j22388J0802J25304K8888m2067J04548
14502d070N4238n7768L1474J50570J30723m3226p188j04553j7094J9528j19841
14491C2793o0943j657J19497J21154j47186n8913P7876k7093J1118l078n4367
14480I201j00963J25107K4473p9281j48550r2334J06819O0837R9358J28819j02630
$$ plain form
14558 -92380 -16058 88687 -29409 -41335 2010 -84516 -170232 -76175 23850 -62700 -89162
14547 -89162 -120543 -116530 -159600 -151250 -169758 -21275 -95137 -124264 -58681 -40533 -74377 -177128
14535 -177128 -71297 53532 66121 9870 -96755 -59805 -21805 21531 22404 30412 101723
14524 101723 133448 146080 24926 -58256 -21832 -24102 -11097 -83463 -52743 -10398 39211
14513 39211 -29932 -71371 49319 -15060 -109157 -231545 -220743 -95439 -66551 -108618 -4070
14502 -4070 50168 -7600 23874 174444 305167 261941 254753 150200 133106 152634 32793
14491 32793 -28150 -29807 89690 210844 63658 4745 82621 55528 66646 63568 9201
14480 9201 -91762 33345 57818 -21463 -170013 -262347 -155528 -94691 4667 133486 30856
14469C0856j30149P1553R3325m8225r6357m9254N6519L2445j127n1662J6845N0683
14457b4548m641J6124k9366N866Q9266M2271j9649n2702m6353J18575P597l3539
14445F8901m8631P579Q0175Q6291m0560j28450K0512Q3101J20420j56832k1733
14434G0773m9984p641Q1432q8406J5626k3460K5381l4962o5921k4886M3356P9583
14422B0891M9033K195K0216N9865p1541q1439k2568J5413l1452K1881Q2270K1102
14410H5866r8017j02939j3173M8756O8147K9193K8609n314O7572l37o2201j07674
14398f1512n0357j6684J3654K6502Q4466R9436k7338K5897k1663p4870Q2584L6180
14386A16295m307o6052n8439L7154n3521K6980n5734l0076J18310m7128j31708
$$ plain form
14469 30856 -99293 -27740 65585 17360 -78997 -128251 -71732 -39287 -40414 -92076 -75231 -24548
14457 -24548 -29189 -13065 -42431 -36565 52701 94972 75323 22621 -23732 94843 102440 68901
14445 68901 20270 27849 108024 194315 153755 25305 45817 128918 249338 92506 70773
14434 70773 20789 13148 94580 6174 21800 -1660 23721 -11241 -77162 -102048 -58692 20891
14422 20891 69924 72119 92335 152200 80659 -780 -23348 -7935 -39387 -17506 64764 85866
14410 85866 -12151 -115090 -128263 -79507 -11360 17833 46442 41128 108700 108363 46162 -61512
14398 -61512 -111869 -128553 -114899 -88397 -3931 95505 68167 94064 72401 -2469 80115 116295
14386 116295 111988 45936 -12503 24651 -28870 -1890 -57624 -87700 30610 -16518 -148226
14375a48226M3594L5619l8407M2338n036J05152m6091o0480j4739l7752M5859
14364g8169O936l8180M7422P0410k4370J9945O0200J46253k2091r8240j89906
14353i9790m7657J62352j04785j36742R5699R130j23884O442K6966O5225k6766
14342a73810p0834Q1852J51294N8406l2020L3115P4851J11193l4816j10448p6834
14331A1949j10351q3443J9968m836L400k7615R3815J70397J0446p9268J03028
14320A07490J2996m8973J5794l3444R684Q5225R0784o1607o0321j67674j14260
14309a64306N3954N1630Q7952J0745r055p2717J5821K02928R0468r4732j1495
14298A61193r59j3278n3914K1223K0402j57268k10155O818O1772J29165l962k036
$$ plain form
14375 -148226 -104632 -69013 -107420 -65082 -70118 35034 -11057 -71537 -86276 -124028 -78169
14364 -78169 -71233 -109413 -61991 8419 -15951 3994 64194 210447 188356 90116 -99790
14353 -99790 -147447 14905 -89880 -226622 -130923 -121793 -245677 -239235 -212269 -147044 -173810
14342 -173810 -244644 -162792 -11498 46908 14888 48003 122854 234047 199231 88783 11949
14331 11949 -98402 -181845 -161877 -166713 -163313 -190928 -97113 73284 83730 4462 107490
14320 107490 120486 71513 87307 53863 63547 148772 239556 177949 117628 -50046 -164306
14309 -164306 -110352 -58722 29230 39975 30920 -41797 -25976 176952 267420 172688 161193
14298 161193 160234 146956 93042 114265 134667 -22601 -232756 -225938 -164166 -35001 -38963 -40999
14286d0999J1574K3350n1196K5200O4565L7836O3381J8607Q7756K3661j01091
14275A62644k68441O3178J36010N0799j04913j34872K741P4202p9878R3438K6754
14264B1662m8715l2149k5224M3775L9524Q1553n2142l4375P4730J2908J25684
14253B07231l5546o2901j04516q908M7476N8277Q3555Q6972l7651j38174l3396
14242F2419m0688L8839J16279Q7008O3665k4968j33176k21081j0256M4587P1308
14231E3936J28388M4432K6310q2790m5914k8615j6109O4988L2098m4358k2920
14220A09446n1188o9318k9226O7225j5674l5013l4730n1283j1943K0443n393M0645
14208f6009L943j9907K5423l0301k8356M1173n2667J01475R1365J7498o0377N9807
$$ plain form
14286 -40999 -29425 -6075 -57271 -32071 32494 70330 133711 152318 240074 263735 162644
14275 162644 -105797 -42619 93391 144190 39277 -95595 -92854 -18652 -98530 -5092 21662
14264 21662 -27053 -59202 -84426 -40651 -1127 80426 28284 -6091 68639 81547 207231
14253 207231 171685 108784 4268 -4640 42836 101113 184668 271640 233989 95815 62419
14242 62419 21731 60570 176849 263857 327522 302554 169378 -51703 -61959 -17372 53936
14231 53936 182324 226756 253066 170276 124362 95747 79638 144626 176724 132366 109446
14220 109446 58258 -11060 -40286 26939 11265 -23748 -58478 -109761 -121704 -101261 -106654 -66009
14208 -66009 -62066 -81973 -56550 -86851 -115207 -74034 -126701 -25226 66139 83637 23260 83067
14196H3067r3370l7067o4813k4510N0940R1673P51j36537j0606N8234j1012j8639
14184a11889J141j9922M5496R5604N9471J6095j6105N5037j34428n8987M9549
14173a8938q2160j8091J53574J8675L506j8959k8039n366m3508L3812K9784o6271
14161d1981N3964K07718L713j64026j27527r2929l6528Q1939J3339l8397J04579
14150c6136o173j0873J24918n8974n0449m5020m5595M1213o1542J8529Q7418Q0999
14138C8315n1603r482N6954M7751L909j04693l4709Q6723J12728j07316r2009
14127e3432o9174l5321M763N0621P4725p3097n1462J939J01845Q9044J8215m9248
14115I418j6928p5497P3620o4296o6295P946o687n0210o216R5151K9387j91976
$$ plain form
14196 83067 -10303 -47370 -112183 -136693 -85753 5920 6671 -129866 -140472 -82238 -93250 -111889
14184 -111889 -110748 -130670 -85174 10430 69901 85996 69891 124928 -9500 -68487 -18938
14173 -18938 -101098 -119189 34385 53060 56566 37607 9568 4202 -39306 -5494 24290 -41981
14161 -41981 11983 219701 223414 59388 -68139 -161068 -197596 -115657 -102318 -140715 -36136
14150 -36136 -42309 -53182 71736 12762 -37687 -82707 -128302 -87089 -148631 -130102 -42684 38315
14138 38315 -13288 -22770 34184 81935 85844 -18849 -53558 33165 145893 38577 -53432
14127 -53432 -122606 -157927 -153164 -102543 -27818 -100915 -152377 -150438 -48593 40451 58666 9418
14115 9418 -7510 -83007 -9387 -73683 -139978 -132032 -138719 -188929 -195145 -99994 -70607 -262583
14103b62583j94159P708L0399L21469P6093r5820Q0421M7289k7183M6880R0811
14092A21325r727j84977j20248J00698J35612J9483p006j32788o6201M3715K3583
14081g6531K3713M2764q7389j5964J5238N010P3438L1296l6302J2909J5340o8807
14069f5285j002Q6820P3843k8372O178j344M881q6611J5914M0041M1074L1909
14057A18046n800j56847k8377M35M1067J4811J46513R2398r4839L0408J2884P0832
14045B41531n4939p0000p4552K0369j4046l2331l068J5663n3041j2409p8483p605
14033a22911J30803J38258k3411L6950R032J2032j2740M8687m7245j03582r0028
14022b4155J55917J05367l9297r08J6070j07658p5771j18186q5315L016K8252
$$ plain form
14103 -262583 -456742 -449034 -418635 -97166 -21073 -116893 -36472 10817 -16366 30514 121325
14092 121325 111598 -73379 -193627 -92929 42683 62166 55160 -77628 -143829 -100114 -76531
14081 -76531 -52818 -10054 -97443 -113407 -98169 -93159 -19721 11575 -24727 -11818 3522 -65285
14069 -65285 -66287 20533 94376 66004 72182 70838 75719 -10892 5022 45063 86137 118046
14057 118046 112246 -44601 -72978 -72543 -31476 -16665 129848 222246 127407 157815 170699 241531
14045 241531 186592 116592 42040 62409 48363 16032 12964 28627 -24414 -36823 -115306 -122911
14033 -122911 7892 146150 122739 159689 168721 180753 168013 216700 169455 65873 -24155
14022 -24155 131762 237129 197832 196924 212994 105336 29565 -88621 -173936 -170920 -142668
14011a42668k1904m9932K96P6198j10593m2914O1771N4860J68481P0954n1727
14000A2822o1950K4122j3397l3487o4880O9926O8048O094r8340p6854L8846J50585
13988B1535n7123P2209K4221p9595j5290o764K8209K1451K5345l6150J8451o9149
13976e2650J33562m1538j1601J31171m0952o776k3195k0599q6481r3561o7372
13965a79992M2530J26434R287K7125k1140q8842k5055l0012O2675O3443p6045
13954h9592j26323R0551l5944l2669J24573l4790J5474l7536R7140q726j7254
13943e5096j5721Q5667N2247j24679l2179l9283N5066J84209N0365m4139j03591
13932A2866O4940J2960q2832j60376L9797M4868K3197K9999N244M0608R1185j40564
$$ plain form
14011 -142668 -164572 -214504 -214208 -138010 -248603 -291517 -229746 -174886 -6405 64549 12822
14000 12822 -49128 -25006 -38403 -71890 -136770 -66844 1204 7298 -91042 -167896 -129050 21535
13988 21535 -35588 36621 60842 -18753 -34043 -40807 -12598 8853 34198 -1952 16499 -52650
13976 -52650 80912 39374 27773 158944 117992 111216 88021 67422 -19059 -112620 -179992
13965 -179992 -137462 -11028 -1741 25384 4244 -84598 -109653 -139665 -76990 -13547 -89592
13954 -89592 -215915 -125364 -161308 -193977 -69404 -104194 -88720 -126256 -29116 -37842 -55096
13943 -55096 -70817 14850 67097 -57582 -89761 -129044 -73978 110231 160596 116457 12866
13932 12866 77806 90766 7934 -152442 -112645 -67777 -44580 -14581 -9337 31271 122456 -18108
13920a8108j95706J6999J21963p8315R7162J14416J8545l801N8236R0181q7625
13909A33947q9655J3068N2954k747j34039j46484j3315N801N0762m1611N1875
13898a19444m761l09N9201m1122R2913O7249l6532J09973j598p2659q2357M6430
13886A6984K2829K7960J31453l4667j4642k7938j11955l3852j13676Q3011J02670
13875D8177J04414j10571r3056l3158l2975N0809N6825p1204o0983k6379M8992
13864a19109L1521o3743M3117J22568k0657N2310M0338J00278p1815M0447R511
13853A64766M938j18586l4063L930l0144j37989j8448Q9536J0306j11685p582
13842a85021J65183P5969m8336M5563j3402J23715L0184q726j04749j08096o9870
$$ plain form
13920 -18108 -213814 -196815 -74852 -153167 -56005 58411 76956 73155 131391 221572 133947
13909 133947 44292 57360 110314 107567 -26472 -172956 -186271 -180470 -129708 -171319 -119444
13898 -119444 -124205 -124514 -65313 -106435 -13522 53727 17195 127168 125570 52911 -29446 16984
13886 16984 39813 67773 199226 164559 149917 121979 10024 -23828 -137504 -54493 48177
13875 48177 152591 42020 -51036 -84194 -117169 -66360 -9535 -80739 -141722 -168101 -119109
13864 -119109 -87588 -151331 -108214 14354 -6303 46007 86345 186623 114808 155255 164766
13853 164766 169704 51118 17055 20985 -9159 -147148 -165596 -76060 -65754 -177439 -185021
13842 -185021 -19838 56131 7795 53358 39956 163671 193855 185129 80380 -27716 -97586
13831i7586q1419J6125r268J40463o2116K7086J60518P3057O5684k4253j88082
13820B0209l1552m0633j16796j15621J57926N8946J02691j15733L9172l4523o1822
13809a37736k8742M3616J00697P6420o231m0695L1368J00079k1483q9056l1910
13798c673M5416Q5501n365M1534L5007Q4363o9663k0869r0319K2376k949j09364
13786A1995m3447L5782Q052j97922o5280K2599n6184R0180R2760m1697m2328L3536
13774a51954R3933Q3618K4850j61205r6058l449Q4174J12734O264J13095Q6817
13763A92819q3322K7737K4586j08509r1433n7555P7979n9961K1236J18411J3827
13752G5815O2826k9970o3030J0120l3982j34177L7226J52790J07389j05578k3479
$$ plain form
13831 -97586 -179005 -162880 -172148 -31685 -93801 -66715 93803 166860 232544 208291 20209
13820 20209 -11343 -51976 -168772 -284393 -126467 -67521 35170 -80563 -41391 -75914 -137736
13809 -137736 -166478 -122862 -22165 54255 48024 7329 38697 138776 117293 28237 -3673
13798 -3673 41743 127244 121879 163413 198420 282783 213120 192251 101932 124308 121359 11995
13786 11995 -31452 4330 12382 -185540 -250820 -228221 -284405 -194225 -101465 -143162 -185490 -151954
13774 -151954 -58021 25597 50447 -110758 -206816 -210265 -126091 -13357 -7093 106002 192819
13763 192819 109497 137234 161820 53311 -38122 -95677 -17698 -77659 -56423 61988 75815
13752 75815 138641 108671 45641 55761 21779 -112398 -75172 77618 185007 79429 55950
13741E5950P196m9238M7477P5099o37j227q6199r432l0764q2392n1933O6107J6705
13728d3288J4072J9454m518L7258l467J15364L956q7115M707l9972l1750K3118
13716G819m0416k4323l6700P530O1759j2224J50290J9637m4263o4001L5072J00614
13704A60794o3747o0810J56953J65849O8959M141j9041M8700M3431j103P6234
13693E80360K25257J83657K68204L54139L85460K44769K12310J70578j87135m62536
13683A975063n40509m07247k57478k4839m9863q605o0795J7465k6029j20800N3148
13672E49511L1171k1931j1175j22307j18212o7371q6926m5592K0534l5367J478
13661I3813N9544m9536k0649m5526n1788L6650r3802M9570J49980J37051J3556
$$ plain form
13741 55950 63146 13908 61385 136484 135847 134620 48421 38989 8225 -74167 -126100 -59993 -43288
13728 -43288 -29216 -9762 -14280 22978 19511 134875 138831 51716 56423 16451 -15299 7819
13716 7819 -32597 -56920 -93620 -86090 -24331 -36555 113735 133372 89109 25108 60180 160794
13704 160794 97047 36237 193190 359039 427998 432139 413098 461798 505229 504126 580360
13693 580360 805617 989274 1257478 1611617 1997077 2241846 2454156 2624734 2437599 1975063
13683 1975063 1434554 1027307 769829 744990 695127 686522 625727 643192 617163 496363 549511
13672 549511 580682 558751 547576 425269 307057 239686 152760 107168 127702 92335 93813
13661 93813 153357 103821 83172 37646 -14142 22508 -71294 -21724 128256 265307 278863
13650B78863j30213j57550P1811J00J6109k5004O9757O2120l7561j91612j49277
13639a92457Q0530J05099K8178l82M9743J16239R627j6701j29814m2386r039j14847
13627a16210q2382Q8872K6310k6498o260j3487N7404J22702q3299q4466L1472
13616h5842M753j4325O6246J34374j1017l3462M3993j53192o0138P9816L2436
13605C642J0741P1613J7596k218K1184p6067j24659M129J02749k4822P7813O5953
13593A47654r1175L2221P3241k031r603n4730q9394o5866l0241L932L3245m8295
13581a01042k1974J4183m5125l2134m8638L9801J22426O6019K048J3904n3068
13570d3600j68920M0013M8871J10344N3674l9807j12449m999N7680N1025L154
$$ plain form
13650 278863 148650 -8900 62911 63011 79120 54116 123873 185993 148432 -43180 -192457
13639 -192457 -111927 -6828 21350 20968 70711 186950 196577 179876 50062 7676 -1363 -116210
13627 -116210 -198592 -109720 -83410 -109908 -116168 -129655 -72251 50451 -32848 -117314 -85842
13616 -85842 -81089 -95414 -29168 105206 94189 60727 104720 -48472 -108610 -28794 3642
13605 3642 14383 85996 103592 101374 122558 46491 -78168 -74039 28710 3888 81701 147654
13593 147654 56479 88700 161941 159910 150307 95577 6183 -59683 -89924 -85992 -52747 -101042
13581 -101042 -123016 -108833 -153958 -186092 -234730 -194929 -72503 -6484 -4436 9468 -43600
13570 -43600 -212520 -172507 -123636 -13292 40382 575 -111874 -116873 -59193 -8168 -5014
13559e014k3684k5244m7220r7254o0213q9542Q4999P6393q289m3044J30722J45193
13547C7803j22327o0879j06186l3621L4599J26296J42726m9016P2080J1875R6699
13536A50049m2509J43L7514p6992m1811j24230j07441J01809R5980K6931j09877
13525i0434j98948L8583M6587L5835n519L0845L2501p8643o3509N2763q1526K4352
13513b57113J30735L3530j6203K1025R1624j1653q9599n9616o5704l7817R9278
13502a61513J03965N1693J511M872Q7424J17741j3685R2934N9267r7645M0958
13491B87522J7280j01459l8859P2911q5069k6244M4606k5232M2995O0292k4633
13480B24110m9897j35424k0291Q8515q0214r95Q3596k2599j8531k9320j56456
$$ plain form
13559 -5014 -28698 -53942 -101162 -198416 -258629 -348171 -263172 -186779 -195068 -238112 -107390 37803
13547 37803 -84524 -145403 -251589 -285210 -250611 -124315 18411 -30605 41475 53350 150049
13536 150049 107540 107683 145197 68205 26394 -97836 -205277 -103468 -7488 19443 -90434
13525 -90434 -289382 -250799 -204212 -168377 -173896 -143051 -110550 -189193 -252702 -199939 -281465 -257113
13513 -257113 -126378 -92848 -109051 -88026 3598 -8055 -97654 -157270 -222974 -260791 -161513
13502 -161513 -57548 -5855 -4344 528 87952 205693 192008 284942 344209 246564 287522
13491 287522 304802 203343 164484 237395 152326 126082 170688 145456 188451 248743 224110
13480 224110 174213 38789 18498 107013 26799 25804 109400 86801 68270 38950 -117506
13469a17506p8322O4335J5525Q790M0259L9149k8044n4359M9992n164K2508Q6645
13457D3808r793j7525K5828O9822K4075o516j40392k3327L8960P5076R204R6982
13445A86202m0609L0254O3231m4344J23886P3915j21944q8704j38453j95093o8803
13434b20462o1737q64N0591Q4564p608o1290j00324J097l9984J7445o4005N7348
13422c45229Q1359j5887J8074J42470J01466m022k0741j57356j10067j5031Q1827
13411b43137J02581R3581O5182o8015L1567j35812j7947O2814M3954p1567j07730
13400b44529l9001N7907l2974q9315K1127k277L6692N0487K8190j32310J71474
13389a74529J72518J0732p1049j7730j4907j66927l8863l1762m3401J16777K1395
$$ plain form
13469 -117506 -195828 -131493 -115968 -107178 -66919 -27770 -55814 -110173 -60181 -65345 -42837 43808
13457 43808 34015 16490 42318 112140 136215 129699 -10693 -34020 4940 80016 89220 186202
13445 186202 145593 175847 239078 194734 318620 392535 270591 181887 43434 -151659 -220462
13434 -220462 -282199 -283063 -232472 -147908 -155516 -216806 -317130 -316033 -356017 -338572 -402577 -345229
13422 -345229 -263870 -279757 -261683 -119213 -17747 -21769 -42510 -199866 -309933 -324964 -243137
13411 -243137 -140556 -46975 18207 -49808 -18241 -154053 -172000 -109186 -65232 -136799 -244529
13400 -244529 -283530 -225623 -258597 -347912 -326785 -329062 -292370 -241883 -213693 -346003 -174529
13389 -174529 -2011 8721 -62328 -80058 -94965 -261892 -300755 -332517 -375918 -259141 -237746
13378b37746r6037K519k8196Q2357K49000n6796l6232N9984J48082K54980L64056
13367G05971L82927K71147J03405L61972L04457K73355J99628J91660r018K3287
13357B808791m0117j86772j44255n9354j72394k54527j85285Q7991J20846O089
13347A981013K4479J1662j08233j36814o5748p6500k59107N2966P4038r8339l7897
13336A361520p1328K2947Q9169l1506j0101j6753n0387P1600o094m0590l0924
13325A287553O4619M821j9298j4033n7189j52142m2001Q4150O510j850n6161j79176
13313I25803K090J8031J5317N823R613L0508r6815J00133R7559R2473J9366r2143
13301A127758o037N4021L2540R2796j049P534N1300J06480N4269J0342J10263
$$ plain form
13378 -237746 -333783 -331264 -359460 -277103 -28103 -84899 -121131 -61147 86935 341915 705971
13367 705971 1088898 1360045 1463450 1825422 2129879 2403234 2602862 2794522 2785504 2808791
13357 2808791 2768674 2581902 2437647 2378293 2205899 1951372 1766087 1854078 1974924 1981013
13347 1981013 2005492 2017154 1908921 1772107 1706359 1629859 1370752 1423718 1497756 1399417 1361520
13336 1361520 1290192 1313139 1402308 1370802 1360701 1343948 1293561 1365161 1359067 1318477 1287553
13325 1287553 1352172 1356993 1337695 1323662 1266473 1114331 1072330 1156480 1162990 1161140 1104979 925803
13313 925803 927893 945924 961241 967064 976677 1007185 910370 1010503 1108062 1200535 1219901 1127758
13301 1127758 1121721 1175742 1208282 1301078 1300029 1307563 1358863 1465343 1519612 1529954 1640217
13290A640217J10877j15027K5967J07036M9871m6454J11197R5157j6550j04306
13280A857985N6665K06335K51725J2287J49832K07011J05003J41559J40872N9691
13270C188965J91533J42649K17820K11185J21154M45119L88454L82965M02983
13261E692827M38258O68118P23781P93749Q83071J011376J269530J472572J824046
13252A4777328K245237K701245L332314M155988M937728N990830P355302R551399
13244E5047371J2836386J8019427K6240031L9334958N6503422P3408091Q0942410
13237C62332096O7615369N0933607M3794068J2554745m8594256r2928727r2599122
13230C03107780o8601178m6017912l0817650k2023375j6744317j2858626r972399
$$ plain form
13290 1640217 1751094 1636067 1662034 1769070 1818941 1772487 1883684 1978841 1962291 1857985
13280 1857985 1914650 2120985 2372710 2384997 2534829 2741840 2846843 2988402 3129274 3188965
13270 3188965 3380498 3523147 3740967 3952152 4073306 4518425 4906879 5289844 5692827
13261 5692827 6131085 6799203 7522984 8316733 9199804 10211180 11480710 12953282 14777328
13252 14777328 17022565 19723810 23056124 27212112 32149840 38140670 45495972 55047371
13244 55047371 67883757 85903184 112143215 151478173 207981595 281389686 362332096
13237 362332096 429947465 480881072 524675140 537229885 488635629 395706902 303107780
13230 303107780 234506602 188488690 157671040 135647665 118903348 106044722 96072323
13223I6072323q029210o937071o179391n397454m811553m266273l786682l547294
13215E3117395l197598k549528k295244k256804j998067j757508j381762j349506
13207C6331378j176373j160149j094010r45694r10492r49275j043160q70803q24429
13198B7356993q91677p48254o71200o53388p07168o48796p43401p40076m62196
13189B1090837l73046m50646n61490n42329n39213l84084l37252m15330m80279
13180A7007168m25825l75089l21510k92039l78659l77490l28167k09599k39435
13171A4059355k97737k89577k94015k29946k15719k42958k66768m10781m03225
13162A1408629k58820j91632j66044l14979k85059k13026k66564k47516j11454
$$ plain form
13223 96072323 88043113 81106042 74926651 69529197 64717644 60451371 56664689 53117395
13215 53117395 49919797 47370269 45075025 42818221 40820154 39062646 37680884 36331378
13207 36331378 35155005 33994856 32900846 31955152 31044660 30095385 29052225 28181422 27356993
13198 27356993 26465316 25717062 25045862 24392474 23685306 23036510 22293109 21553033 21090837
13189 21090837 20717791 20267145 19705655 19163326 18624113 18240029 17902777 17487447 17007168
13180 17007168 16581343 16206254 15884744 15592705 15214046 14836556 14508389 14298790 14059355
13171 14059355 13761618 13472041 13178026 12948080 12732361 12489403 12222635 11811854 11408629
13162 11408629 11149809 10958177 10792133 10477154 10192095 9979069 9712505 9464989 9353535
13153I353535j98408k00193k12535k87768k76915k22276j60973j34608j41409
13144G518450j52167k46238j49284j69255k05706n9828Q034j7442j72253k27076
13134F127235j56175j38229r6581j30299j38259j40271j21358m6483j95073j20587
13124D843920J3034l029M6368n623N3718J03513Q3435J1927J76305J78609K05043
13113E707220K27928J60455J74784K98009J4618n9176j3955r0784n9738l3700
13103F325661Q3733j200j61033k18443k53103k68018j63829o2324j80344m6230
13093E054870j1564K49j22505j32827l4097k5839r5634j98437k70210j94175o3048
13082C906783R6987l2014q0451j37090n3632K7183N2176K1438r6816j10988j18742
$$ plain form
13153 9353535 9155127 8954934 8742399 8454631 8177716 7955440 7794467 7659859 7518450
13144 7518450 7366283 7120045 6970761 6801506 6595800 6535972 6544006 6526564 6354311 6127235
13134 6127235 5971060 5832831 5736250 5605951 5467692 5327421 5206063 5159580 4964507 4843920
13124 4843920 4856954 4853925 4900293 4894670 4948388 5051901 5135336 5147263 5323568 5502177 5707220
13113 5707220 5935148 6095603 6270387 6568396 6583014 6523838 6509883 6419099 6359361 6325661
13103 6325661 6409394 6408194 6247161 6028718 5775615 5507597 5343768 5281444 5101100 5054870
13093 5054870 5043306 5043555 4921050 4788223 4754126 4728287 4632653 4434216 4164006 3969831 3906783
13082 3906783 4003770 3971756 3891305 3754215 3700583 3727766 3779942 3801380 3704564 3593576 3474834
13071C474834j96906p8555n4549j18130m6149l8811J4193L3450l3890j22737j41072
13060B691678j33087n3658K8875O9466o5903k0003m8294j17709j20329J22588
13050B353624N4930n5727j34020k9065K3750N8211j65201j71886L8649O4554p1539
13039A966280p4455R6562R26m3510K674j10954j85397k09214O758q9922k51529
13028A108219j53587Q5640q895K1267m134j1399J04788K16698L2510m9753q3677
13017A257677n2700K6490J39634J39180j941j71952j31160o6669l1866r375Q882
13006A106200J7535J05289L2108j22383o9830k8896M5990q0267q5028j0556k025
12995I08137j1682O765O2737R2487l674q1246J7377R6862p878p8648q902J16709
$$ plain form
13071 3474834 3277928 3199373 3144824 3026694 2980545 2941734 2955927 2989377 2955487 2832750 2691678
13060 2691678 2558591 2504933 2533808 2603274 2537371 2517368 2469074 2351365 2231036 2353624
13050 2353624 2408554 2352827 2218807 2189742 2213492 2271703 2106502 1934616 1973265 2037819 1966280
13039 1966280 1891825 1988387 1989313 1945803 1948477 1837523 1652126 1442912 1449670 1359748 1108219
13028 1108219 954632 1040272 1031377 1052644 1048510 1037111 1141899 1358597 1391107 1341354 1257677
13017 1257677 1204977 1231467 1371101 1510281 1508340 1336388 1205228 1138559 1106693 1097318 1106200
13006 1106200 1123735 1229024 1261132 1138749 1068919 1040023 1086013 1005746 920718 910162 908137
12995 908137 896455 903220 965957 1058444 1054770 973524 990901 1087763 1079885 1001237 992335 1109044
12983A109044P7227r9563J1294k6688k7025p8979K7756P984l5452l5379k9786
12972I00433P6172J05372l7631o1974j03326j29900P1583P7336J7852l6636p2552
12961H06729p4002q7601j5527L6044J5014r341k5116m888K6055L0533o6640n3015
12949E78245O3683O6632Q6156r9366r2392j8234L5468m4035P2276O4875P548j16051
12937F04805j12612N8306N6503P0957O8526O4476j13294j33788l7827m7112K0883
12926D99823Q732O6917J17648j27522q0838N1943j3573j04453k6706J51580M6105
12915E89656j05505k1115k4108Q4421J3189j5018n8698K1643l0397j30025N7095
12904C81138J41430j03633O7556N885j450p6786k1369N3168j6808q3076j3068
$$ plain form
12983 1109044 1186271 1086708 1098002 1071314 1044289 965310 993066 1001050 965598 930219 900433
12972 900433 976605 1081977 1044346 982372 879046 749146 820729 898065 915917 879281 806729
12961 806729 732727 645126 629599 665643 680657 671316 646200 641312 667367 697900 631260 578245
12949 578245 641928 708560 794716 695350 602958 584724 620192 576157 648433 713308 720856 604805
12937 604805 492193 550499 607002 677959 746485 810961 697667 563879 526052 478940 499823
12926 499823 508555 575472 693120 565598 484760 536703 523130 418677 391971 543551 589656
12915 589656 484151 463036 438928 523349 536538 521520 462822 484465 454068 324043 381138
12904 381138 522568 418935 486491 492376 490926 414140 392771 445939 429131 346055 332987
12893C32987Q6590K560j11142j805Q9490j365L7677P7030M191j59238j08343n611
12881B43021L1372l9492J2309O1768j5691P3278O7743m1814o2130j5855q7137
12870B27372j24626J9664L8373l2107Q7550J11637R7980n7441j0627M0383k1741
12859C76417J0314o1979q3582k9108P4274Q011J543N0166m1322L0975P0341j2456
12847C93594q7260L0810l1122j5247N6464L4301j8174N1995N8789n2458r0436
12836C31256o9087R8026n3218l7330k0607Q799l3546q965O1259j23741j00293
12825E2553L4684k3246M2465J17247L1829p729l5332J4243J01935o6696N726l4477
12813B33202k7371O5414P5627p3104L712o8960J3166p2225l7324M6827J7803J2
$$ plain form
12893 332987 419577 422137 310995 309190 398680 397315 434992 512022 516213 356975 248632 243021
12881 243021 274393 234901 247210 308978 293287 366565 434308 392494 330364 314509 227372
12870 227372 102746 122410 160783 128676 216226 327863 425843 368402 357775 398158 376417
12859 376417 386731 324752 241170 212062 286336 294347 295890 346056 304734 335709 406050 393594
12847 393594 306334 337144 306022 290775 347239 381540 363366 415361 474150 421692 331256
12836 331256 262169 360195 306977 269647 249040 257839 224293 215328 276587 152846 52553
12825 52553 87237 63991 106456 223703 255532 247803 212471 226714 328649 261953 267679 233202
12813 233202 205831 271245 346872 273768 277480 208520 221686 149461 112137 158964 176767 176779
12801A76779J31012J1040N9890M3421o4111j18048n2953l1831Q6333M5559o5004
12790B22087O1853L1602K14842o3831O622P5645J23118J79713M5552J30049K34357
12779A261609K23236M32824K36299K24946K97697K9882l64070m48640l07669j83960
12769A402154j42735k27367k28349j36045n1434p5045K8696j9092j8012N539J7776
12758E56086R1974j27852O8455n9980n8148N1852Q0554K4662j64470J765J5272
12747D80170K1608M7270Q5506L0420j64625j65615k3385K1783R497J9638n561
12736C56706j19133m8887J8426J7606o44N4393R2956Q4023p9361M0923P525j32284
12724B92249j3603P8277M2050j60440k07715N8546J37248J11686M5709r0523j30184
$$ plain form
12801 176779 307791 318831 378721 422142 358031 239983 187030 155199 241532 287091 222087
12790 222087 283940 315542 530384 466553 473175 548820 671938 851651 897203 1027252 1261609
12779 1261609 1484845 1917669 2153968 2378914 2676611 2706493 2342423 1893783 1586114 1402154
12769 1402154 1259419 1032052 803703 667658 616224 541179 569875 550783 532771 538310 556086
12758 556086 648060 520208 588663 528683 470535 522387 602941 627603 463133 464898 480170
12747 480170 501778 549048 634554 664974 500349 334734 311349 333132 342629 362267 356706
12736 356706 237573 188686 207112 224718 224074 278467 371423 455446 376085 417008 424533 292249
12724 292249 278646 356923 398973 238533 30818 89364 226612 338298 384007 293484 163300
12713A63300J17226J10936n4993j33541M1065J57654J2280o2948j07391j07092
12703A36496J41486N6932r7775p2282j27934p2739J48956J88200m1655J4505p5992
12692A98198n4741K2092N7041L9493r5417o404j01534o4403j0565o154J69272
12681A46878L0332M1065n6030k1461m5646n4622j1790J13031m3444j5369P3387
12670A56331k0849k4711L2168J00379N0584p9792r4675Q2601N9218j48563j59907
12659d7216j31819M5098J88273J17109Q8274m2722l0821M2163m0723K6581o805
12648B07392K2890j4957j42302p9457O9449p0126K931P5372J03356n1662L3603
12637A56489N6521J8904L9203j7446o183O8285J1838n6566j6218M0370q5509r0345
$$ plain form
12713 163300 280526 391462 336469 202928 243993 401647 413927 350979 243588 136496
12703 136496 277982 334914 237139 164857 36923 -35816 113140 301340 259685 274190 198198
12692 198198 143457 165549 222590 262083 166666 160262 58728 -5675 -16240 -22394 146878
12681 146878 177210 218275 162245 140784 95138 40516 28726 141757 98313 82944 156331
12670 156331 135482 110771 142939 243318 293902 214110 119435 202036 261254 112691 -47216
12659 -47216 -179035 -133937 54336 171445 259719 216997 186176 228339 187616 214197 207392
12648 207392 230282 215325 73023 -6434 63015 -7111 -4180 71192 174548 122886 156489
12637 156489 213010 231914 271117 253671 247488 315773 327611 271045 254827 295197 209688 119343
12625A19343l5038K5078n2536M542M195J5134N305O8923M988j993J9300q3749
12613I3492m7147j8140J41767l2548k5161L9899j551q3713K1928l7284m1193L5768
12601D6117R7640K8147m9556j01004L4156O0998J1863R8166M5723J063k2520q1301
12589A69492P8093n5357m4667j18495j03160q0300J14673O2210p6190l9812J9248
12578g4265r1937J04803J03060k9808O0591P0048p8438r3455o788m1268L3180
12567d4277J02363P3542o068N5073K3111m6141n3706j22783j08322R3126K15201
12556A81119O0163j04141q9528j14650K3636j6513n6535L031O2161K2166J19620
12545I0529K3895l7863m5867o9027J149K1001J56948P8765r4712j29904K6326
$$ plain form
12625 119343 84305 109383 56847 61389 65584 80718 86023 154946 159934 157941 177241 93492
12613 93492 46345 28205 169972 137424 112263 152162 150611 66898 88826 51542 10349 46117
12601 46117 143757 171904 122348 21344 55500 116498 128361 226527 272250 273313 250793 169492
12589 169492 247585 192228 147561 29066 -74094 -154394 -39721 22489 -53701 -93513 -74265
12578 -74265 -166202 -61399 41661 11853 72444 142492 64054 -29401 -36189 -77457 -44277
12567 -44277 58086 131628 125560 180633 203744 157603 103897 -18886 -127208 -34082 181119
12556 181119 241282 137141 47613 -67037 -43401 -59914 -116449 -113418 -51257 -29091 90529
12545 90529 114424 76561 30694 -38333 -37184 -16183 140765 219530 124818 -5086 21240
12534B1240k1351Q313L653p219K4782N1378O6820m4287N9145K2459R0043J4396
12522B89372o8701o2757p0223l5382O4903O9258k8085n0325j7622R924O0688M255
12510A65305l8759o0830m2953j4570N2516o3774o436J00628L4451J3385l9777
12499I9186J01795J60196N4352j54265j92057k9943L788J11765O8261j03895n6893
12488F2290n992Q9693p2037R893L141R4556Q9851j85478j45881J68109M4465j03249
12476D9361j6195m9593Q8066j00214J0530L9679q6695J03871Q1705m5557N900
12465H0858J8596l0256m5545k6550r1435N0637M9883J04953J06324n6867k13665
12454e3067P5042l445k8222O0030N1843Q4210k3300o2508m5238j01376m23j37194
$$ plain form
12534 21240 -111 8202 11855 4636 29418 80796 147616 103329 162474 184933 274976 289372
12522 289372 220671 157914 87691 52309 117212 186470 158385 108060 90438 100362 161050 165305
12510 165305 126546 65716 22763 8193 60709 -3065 -9501 91127 125578 138963 99186
12499 99186 200981 361177 415529 261264 69207 39264 43052 154817 223078 119183 62290
12488 62290 56298 145991 73954 83847 86988 181544 271395 85917 -59964 108145 152610 49361
12476 49361 33166 -16427 71639 -28575 -18045 21634 -65061 38810 120515 74958 80858
12465 80858 99454 69198 23653 -2897 -94332 -43695 6188 111141 217465 160598 -53067
12454 -53067 21975 18530 -9692 50338 102181 186391 163091 100583 55345 -46031 -46454 -183648
12442a83648K2706J24997J7825l7235m5958J21161L7243K2845j47248m9770K741
12431a14341m3834k7304L6936Q8163q9762j1491m414O5313J07009K3214O3733
12420I3222P807j5104j42598k06820J8040J23546J20399k4224J9053k2440L1990
12409B871j589J3085O7897j4995Q384j5235j05817r9876J16268N1966K760m2796
12397a7077k9473M8035j0093m4025M0618L952K8906M7923L2528O085R5272Q0245
12385B82896n9840j38701n615P0752O7595L297j10785J4236n4376r2010m143n2679
12373g9373K2754N1063Q8425J14985p9770j11837K7868k0878k7098P8109N1270
12362A15518j838j5233q7890m0219k5757k3621m8221K7917K24397K6793n7142
$$ plain form
12442 -183648 -160942 -35945 -18120 -55355 -101313 19848 57091 79936 -67312 -117082 -114341
12431 -114341 -158175 -185479 -148543 -60380 -150142 -161633 -166047 -100734 6275 29489 93222
12420 93222 101029 85925 -56673 -263493 -245453 -121907 -1508 -25732 -6679 -29119 2871
12409 2871 1282 14367 82264 67269 75653 60418 -45399 -145275 -29007 22959 25719 -17077
12397 -17077 -46550 1485 -8608 -52633 -12015 -8063 20843 68766 101294 107379 202651 282896
12385 282896 223056 84355 78740 149492 217087 220384 109599 123835 69459 -22551 -26694 -79373
12373 -79373 -56619 -5556 82869 197854 118084 6247 34115 13237 -13861 64248 115518
12362 115518 113680 98447 10557 -29662 -55419 -79040 -127261 -99344 125053 151846 94704
12351I4704j40616o1923O9272L1216o0560M4787K5547M0632j01842m4689l479
12340a06951j022l9933P8613N851M946P3099n6325m4364N7791J15964P389r8840
12328c782N4110N1877m7691L2745O5375M723q4761q0828m0501j8372n6384J42831
12316A9342J07176O7895j01038J7624N4637Q5021o7945o4875L4339j9235l6209
12305I6732M7317L3294j10529o9239k7515j38792n2474J38682M576n6355j03406
12294b37709J8425N2956J09809K09797L2542r9024L38o7793k0769j3241j03395
12283a18064L869P9947J02011l564q9298o6504j61100j4296J96017K006n7237
12272a26213j20687J5057p748N7942K15808M9341k3611L3512m2303k7454j41026
$$ plain form
12351 94704 -45912 -107835 -38563 -7347 -67907 -23120 2427 43059 -58783 -103472 -106951
12340 -106951 -107973 -147906 -69293 -63442 -58496 14603 -41722 -86086 -28295 87669 95058 -3782
12328 -3782 50328 102205 54514 87259 152634 157357 72596 -8232 -48733 -67105 -123489 19342
12316 19342 126518 194413 93375 110999 165636 250657 182712 117837 152176 132941 96732
12305 96732 144049 177343 66814 -2425 -29940 -168732 -221206 -82524 -77948 -134303 -237709
12294 -237709 -219284 -166328 -56519 153278 185820 86796 87134 19341 -1428 -14669 -118064
12283 -118064 -114195 -34248 67763 64199 -25099 -91603 -252703 -266999 -70982 -68976 -126213
12272 -126213 -246900 -231843 -239591 -181649 34159 83500 59889 93401 51098 23644 -117382
12261a17382j55206J8859O3209j9936J556Q0743m4329n049n2099L6613Q540p0272
12249b54753J2405R7918R2129J05534K5451o6625k1035Q5333q2459j9400P9848
12238E4346R008j07297j02411R0279j7670j70319M1287J70558J22056k3171L714
12227G0380J4669j4995K0724j05305j06701M2552J35507j6822q0405J849O0570
12216B2023J7278o1739m3923N234Q3819j15144o0653o5244M3468R3112J00111
12205A8342O1617p3051L6955j00871j04449k4272J4272J13560M1162K2158O5231
12194G0654l2819M9923J4821j7296m4562r5312p8195o5457l6136M5603j7169J29584
12182g6361K01454k9459j54753p9839N807K3252J10874N4987j19575J8746m0130
$$ plain form
12261 -117382 -272588 -253729 -190520 -210456 -208900 -128157 -172486 -177535 -229634 -193021 -184481 -254753
12249 -254753 -242348 -144430 -52301 53233 78684 12059 -8976 76357 -6102 -25502 54346
12238 54346 63354 -43943 -146354 -56075 -73745 -244064 -202777 -32219 89837 66666 70380
12227 70380 85049 70054 90778 -14527 -121228 -78676 56831 40009 -40396 -38547 22023
12216 22023 39301 -22438 -66361 -61127 22692 -92452 -153105 -218349 -174881 -81769 18342
12205 18342 79959 6908 43863 -57008 -161457 -185729 -171457 -57897 -16735 5423 70654
12194 70654 37835 87758 102579 85283 40721 -54591 -132786 -198243 -234379 -188776 -205945 -76361
12182 -76361 125093 95634 -59119 -138958 -133151 -109899 975 55962 -63613 -44867 -84997
12171h4997N927P205k5808k3132J20781j0109p6850q8695j03914Q7039J34205
12160e8348K2711O0742J3732m1418k2145n3633l6321M2191l8056j7988J60208
12149C1675n43j6061J16251J17457m0419j74733j30780j9677K267m4104n0026
12138b08693J9241O250L9697j6904j5j9847M6842k5891M8927J576n1608j9864
12126a80289n0358q445J54P5579J0659P7675J8630k2074Q6344J7455q343j92419
12114a75432n9395Q8142P1122o3985r6797o5980P0094J06326n510o0623M0193
12103a51845J5130J52209P8038j6861L9024J53107n9973j57107m0688r219l4048
12092c2233M3011l7717L4133N2038k2024l2167O124N5598m2091o464O4567P3116
$$ plain form
12171 -84997 -79070 -71865 -97673 -120805 -24 -10133 -86983 -175678 -279592 -192553 -58348
12160 -58348 -35637 25105 38837 -2581 -24726 -78359 -114680 -72489 -110545 -128533 31675
12149 31675 31132 15071 131322 248779 208360 33627 -97153 -116830 -114563 -158667 -208693
12138 -208693 -189452 -183202 -143505 -160409 -160424 -180271 -133429 -159320 -110393 -108817 -160425 -180289
12126 -180289 -230647 -239092 -238938 -163359 -152700 -75025 -56395 -78469 7875 25330 16987 -175432
12114 -175432 -234827 -146685 -75563 -139548 -236345 -302325 -232231 -125905 -131415 -192038 -151845
12103 -151845 -136715 15494 93532 76671 115695 268802 208829 51722 11034 1815 -32233
12092 -32233 10778 -26939 7194 59232 37208 5041 11165 66763 24672 18208 82775 155891
12080A55891m7874p1364o9221J6623K0885m2534p882l3849j5059P5163M9127O1569
12068I1475O0401P1857j44540j91067J31135J35402j62512j58538j3880q954J15796
12057g3425J64444L1699j08970k6406J39099N4712Q93O856L7281p8495K1440p4899
12045I4229m1169j2549q2553M076K35827P5920m0132J8893j3508k19594M342k0793
12033B989j8516R9590L0821q7266m0708q2902m4582J21421j0026r1529J1729P2183
12021c6796n3040J6676J415j7289o9152N6074P103J17586O8191O476q216n9896
12009B9132J45433M4760q5143L3086m6645k1380k8096r3504L0310K624j00086
11998h9509j12676M8835M4591m3743k8344P182Q3946J32942J19371j0250m8195
$$ plain form
12080 155891 108017 36653 -32568 -15945 4940 -37594 -45476 -79325 -94384 -19221 29906 91475
12068 91475 151876 223733 79193 -111874 19261 154663 -7849 -166387 -180267 -189221 -73425
12057 -73425 91019 122718 13748 -12658 126441 181153 182046 188902 226183 147688 169128 94229
12045 94229 53060 40511 -42042 -37966 197861 273781 233649 252542 239034 19440 23782 2989
12033 2989 -15527 84063 114884 27618 -13090 -95992 -140574 -19153 -29179 -120708 -108979 -36796
12021 -36796 -89836 -73160 -71745 -89034 -158186 -102112 -95009 22577 90768 97244 89028 29132
12009 29132 174565 219325 134182 167268 120623 99243 71147 -22357 7953 10577 -89509
11998 -89509 -202185 -153350 -108759 -152502 -180846 -173664 -89718 43224 162595 152345 104150
11987A04150O0866j46899o4381J03075K4606k1397m5837j11496m5087R586k3281
11976a56095j1883K04445O4809J4107J2777J4555j42678o95p587K9686l1963k0036
11964c0558Q1702j54104L393P4402o4695N261j5504k3370k019P475j1966p0788
11952b00771m960m50l5018Q9520R012l9879M2914L4954R9568p5720j16868O2730
11940a34968M7701P006P5431j9032M6175M7913l913J6242R8733K9478L4310n8768
11928A86308j43973k0401o2318l1294j6162l580P9725J18201N8138j23002j26973
11917h5331N5363n4647j4186J46719L4171K0563m8729k9207L0413m8992J89588
11906A95725J16214j48483r1228j2300L4390n7641j13286n2482k1202O6707N2982
$$ plain form
11987 104150 165016 18117 -46264 56811 81417 60020 14183 -97313 -142400 -132814 -156095
11976 -156095 -167978 36467 101276 115383 128160 142715 37 -658 -8245 21441 -10522 -30558
11964 -30558 51144 -102960 -99567 -25165 -89860 -84599 -100103 -123473 -125492 -118017 -129983 -200771
11952 -200771 -205731 -206181 -241199 -151679 -142667 -182546 -139632 -104678 -5110 -80830 -197698 -134968
11940 -134968 -87267 -80261 -4830 -23862 22313 70226 66313 82555 181288 210766 245076 186308
11928 186308 42335 21934 -40384 -71678 -87840 -91420 -11695 106506 164644 41642 -85331
11917 -85331 -29968 -84615 -98801 47918 82089 102652 53923 24716 55129 6137 195725
11906 195725 311939 163456 72228 59928 94318 36677 -76609 -129091 -150293 -83586 -30604
11895c0604J0340n7899M6875j1196J54924J32448P5602J10833K02464K33900N52669
11884A420356O53193O19810N11634M08668L12924k6758n84014r45807p00485m12986
11874A256535k30388j48542q6076j64558j7144p3655o3980j40155j0548P2118
11864C93607j07021j69002m7577o878K1467n4678P6850K6098J05935K874o4197
11853A77478k5417J2612L5367M5615j73808J8354j5745J03922K7045k5886J44144
11842C23681j64534j16613o0000p8782L3657M6967j9363J08511k8161M564m1301
11831H626o491J39180N5185N3723M448L8363o0673j46241n9385Q4953k9605L3783
11819A15866L5876j17970J0101K9421L9080L7831k0598j1280O7659K589O6904
$$ plain form
11895 -30604 -20264 -78163 -31288 -42484 112440 244888 320490 431323 633787 867687 1420356
11884 1420356 2073549 2693359 3204993 3613661 3926585 3899827 3315813 2370006 1669521 1256535
11874 1256535 1026147 877605 791529 626971 609827 536172 472192 332037 321489 393607
11864 393607 286586 117584 70007 63129 84596 29918 106768 132866 238801 241675 177478
11853 177478 152061 164673 200040 245655 71847 90201 74456 178378 205423 179537 323681
11842 323681 159147 42534 -17466 -96248 -62591 -15624 -34987 73524 45363 49927 8626
11831 8626 2135 141315 196500 250223 254671 293034 232361 86120 26735 111688 82083 115866
11819 115866 151742 33772 43873 73294 112374 150205 129607 118327 185986 188575 255479
11808B55479k8582K6135J03903J07488J57599L22307M27618N52709O99514O91506
11798C315676M92602N66686L51357j17429n71145r10112q65167n45118k40892
11789A476458k02270k96778j36833l5305n9581j42156o2824O8289o3276o7135
11779D78589n6840l1198q9208m913O3921J6346M7366K1838K96j42417j29131l8411
11767A36238K8093j04078K6452M3737O6376K5399r0932o7686j02773r2644J05522
11756b6296J0690R769R673O8934j3308j3446L4441N5195M826o8228k2516J22065
11744A71799O1562j95323o5118J00846o5337N5039Q6449L876R032M6281m3800
11733A65306Q2079j3302j85006j65595N4790K15999Q0876r7094m9547o8793K950
$$ plain form
11808 255479 226897 253032 356935 464423 622022 944329 1371947 1924656 2624170 3315676
11798 3315676 3808278 4374964 4726321 4608892 4037747 3127635 2262468 1717350 1476458
11789 1476458 1274188 977410 840577 805272 745691 603535 540711 609000 545724 478589
11779 478589 421749 390551 301343 296430 360351 376697 424063 445901 446197 303780 174649 136238
11767 136238 164331 60253 86705 130442 196818 222217 131285 63599 -39174 -131818 -26296
11756 -26296 -15606 -5837 3836 72770 59462 46016 80457 135652 140478 72250 49734 171799
11744 171799 233361 38038 -27080 73766 8429 63468 149917 153793 162825 209106 165306
11733 165306 247385 234083 49077 -116518 -61728 154271 235147 138053 88506 19713 22663
11722B2663J6820n5277m7549L5787L700j1378k9421M4039J05892M2709l8432J33462
11710B23015R6980j10936j01514k0536k1051o0820l4222q2277L1715r40M5736
11699c4850j4858k0158L5633O1040m1081M8633P5535j01702j34320Q484Q1180
11688c6464L1388M9650L6984M0106N3723k1062k9115j75041L1916K8756k4332
11677a3491k5305O9185J4552J41138q6906n9376R3301j8139J8026k3679n8101
11666E1205o3466J6958N4454l1822o0434J21140j2017j25140o5037j4334n3172
11655a81665j4608O8952J8745r5251k6702P4996j0412K3946J22093j28955q1915
11644b30776k9320J00963N2439K2568k6792j50396P5859Q6129l5475n4183M9202
$$ plain form
11722 22663 39483 -15794 -63343 -27556 -23856 -35234 -64655 -20616 85276 127985 89553 223015
11710 223015 319995 209059 107545 87009 65958 5138 -29084 -111361 -79646 -80586 -34850
11699 -34850 -49708 -69866 -34233 26807 -14274 34359 109894 8192 -126128 -117644 -36464
11688 -36464 -5076 44574 81558 121664 175387 154325 125210 -49831 -17915 10841 -13491
11677 -13491 -38796 30389 44941 186079 99173 39797 133098 114959 132985 109306 51205
11666 51205 -12261 4697 59151 27329 -33105 88035 76018 -49122 -114159 -128493 -181665
11655 -181665 -196273 -127321 -108576 -203827 -230529 -155533 -165945 -141999 -19906 -148861 -230776
11644 -230776 -260096 -159133 -106694 -84126 -110918 -261314 -185455 -99326 -134801 -188984 -139782
11633a39782N7022r0278n2262m65J02571r939J64472J15617j1062L9075q0919
11622I4050q4966m5191m2037J0997R8214o8853j51756O109O3877j2403l6810J3919
11610a54850K9527q286o8206J2821j2241P4073O1281o3310N260O3810L7613N0548
11598B8040q3123j262q1277p7199L3117J06501L4653m5828n4489N2121m9612P124
11586a31234Q5792P8394r1931n8541l8225J09173P49r2761R2982m1134j09935
11575a96671N0006P0540J40233j09443k28406k4760L2463J5024Q573o5615n7457
11564c65513O8670J5709K04640R6553l1098Q0080N2538K7278j49733j41088k6007
11553a67971J32473o578R944k4502m2913L0936k7208O458j30610L6651J96370
$$ plain form
11633 -139782 -82760 -173038 -225300 -225765 -123194 -133133 31339 146956 135894 174969 94050
11622 94050 9084 -36107 -78144 -67147 31067 -37786 -189542 -183433 -119556 -131959 -168769 -154850
11610 -154850 -125323 -133609 -201815 -188994 -201235 -127162 -65881 -129191 -123931 -60121 -22508 28040
11598 28040 -55083 -56345 -137622 -214821 -181704 -75203 -40550 -86378 -140867 -88746 -138358 -131234
11586 -131234 -45442 32952 -58979 -117520 -155745 -46572 -45823 -138584 -45602 -86736 -196671
11575 -196671 -146665 -76125 64108 -45335 -273741 -298501 -266038 -251014 -242441 -308056 -365513
11564 -365513 -296843 -281134 -76494 20059 -11039 69041 121579 148857 -876 -141964 -167971
11553 -167971 -35498 -42076 -32132 -56634 -99547 -68611 -95819 -89361 -219971 -183320 13050
11542A3050R7074j50732J2080M7584J4514J7726k6792j39514j11819K4516Q4638
11531a17675l741l4669K1591O7611P5954m4408O1254P1978m1539p6644m7720l9494
11519a07502j2465R6959J19278o9009n050K1655m6987k3496r7851k3415l444j8752
11507a70079M8762M6403P11n0472k8220n3358J21771l9260O9120L7815m3439j05148
11495a65394O8900M3936m0005l1726j03471n8196N577m6769N8490J39157j4523
11484a44024O5006l8343N712Q7941l4580L961M115n7833j98430j6198R6987k1477
11472b47163L1686J13402J49486k3401j59003N401J28847N9305K077p977M1282
11461I3942r5330j76344p7960K029J34790J05568K7865m3926J6739j62057j20361
$$ plain form
11542 13050 110124 -40608 -28528 19056 33570 51296 24504 -115010 -226829 -202313 -117675
11531 -117675 -121416 -156085 -134494 -66883 9071 -35337 25917 97895 56356 -20288 -68008 -107502
11519 -107502 -119967 -23008 96270 27261 22211 43866 -3121 -26617 -124468 -147883 -151327 -170079
11507 -170079 -121317 -74914 -74203 -124675 -152895 -206253 -84482 -123742 -54622 -16807 -60246 -165394
11495 -165394 -96494 -52558 -92563 -124289 -227760 -285956 -280379 -327148 -268658 -129501 -144024
11484 -144024 -79018 -117361 -111649 -23708 -58288 -54327 -50212 -108045 -306475 -322673 -225686 -247163
11472 -247163 -215477 -102075 47411 24010 -134993 -129592 -745 58560 60637 52660 93942
11461 93942 -1388 -177732 -255692 -253663 -118873 -13305 14560 -29366 -12627 -174684 -295045
11450b95045J34978R5919m7165r9073N7179R8192L9951L1359J20196r3459j06583
11439f3551m6575J6056Q4142l2096j10515L574q39L2583k5622N1640L0813k1326
11427h1716j33457j39735L0373Q4437l5267J6520L5963Q0473J08799N2922l2865
11416a3553m5151L4498k4054M1544N3960j1746j47642p6986j9046q306j7074P8614
11404a54942L163r986n380J50250J9614j43953o2033K2195O0622J16379P067l6492
11392c3496N770j5307m5713R8920P6326o8843J9125n3613n8472l8453n2950j0478
11380a77184N9035P144l0669l0479l4075Q4698Q2757M4424q1475P8296j7777m5572
11368f0877m2375j2924o3519p045M2579J17919K4052l6211Q9349j6100j3784r0401
$$ plain form
11450 -295045 -160067 -64148 -111313 -210386 -153207 -55015 -15064 16295 136491 43032 -63551
11439 -63551 -110126 -94070 -9928 -42024 -152539 -148965 -149804 -117221 -142843 -91203 -60390 -81716
11427 -81716 -215173 -354908 -324535 -240098 -275365 -258845 -222882 -142409 -33610 19312 -13553
11416 -13553 -58704 -24206 -48260 -6716 47244 35498 -112144 -189130 -208176 -216482 -233556 -154942
11404 -154942 -151779 -161765 -167145 -16895 2719 -141234 -203267 -181072 -120450 -4071 2996 -33496
11392 -33496 -27726 -43033 -88746 10174 86500 17657 36782 -16831 -75303 -113756 -166706 -177184
11380 -177184 -118149 -111005 -141674 -172153 -206228 -121530 -38773 5651 -75824 2472 -15305 -60877
11368 -60877 -103252 -116176 -179695 -186740 -144161 -26242 -2190 -38401 50948 34848 21064 -69337
11356f9337p1407Q3136j1926j68810Q3269J21972N7887l9863r3527M1431O4913
11345b262n369n0910k2305j09326k4532O416M0012M6557l9533L3881Q820j9017
11333a37568K7973o6961r6387n0625P3472Q343J1928Q7473J23197L0168j5196
11322d183J7916k1547L1698o7090q4516N515L5730o1817m4151Q0508k1264J9854
11310a13347J425k5432J3915P4496n2495l309m8296r0085O797J0124O2949N8607
11298a04651J77953m2391m1400p5499R0942J15632p0976j6712L6690M2095o445
11287A05238j02393j56404l8954j0137K1947J05047j60523p075K079J4225j4424
11276b41374O0072O6523o7631j6128j4366r216R1323r656L7010m3008J19222j1116
$$ plain form
11356 -69337 -140744 -57608 -69534 -238344 -155075 -33103 24784 -15079 -108606 -67175 -2262
11345 -2262 -7631 -58541 -80846 -190172 -214704 -208288 -168276 -121719 -161252 -127371 -118551 -137568
11333 -137568 -109595 -176556 -272943 -323568 -250096 -241753 -229825 -142352 -19155 11013 -4183
11322 -4183 13733 -7814 23884 -43206 -127722 -122207 -86477 -148294 -192445 -111937 -133201 -113347
11310 -113347 -111922 -137354 -123439 -48943 -101438 -104747 -153043 -243128 -236331 -226207 -163258 -104651
11298 -104651 73302 30911 -10489 -85988 4954 120586 49610 32898 69588 111683 105238
11287 105238 2845 -153559 -192513 -202650 -180703 -75656 -236179 -243254 -241175 -226950 -241374
11276 -241374 -181302 -114779 -182410 -198538 -212904 -222120 -130797 -140453 -103443 -146451 -27229 -38345
11264c8345o6842j26899k0560Q0346r4953j11622M2728R9384o0522J26498J21100
11253d9687J24929O8776q8762j01859J090M8740j47029q761K7878J8100j83416
11242b90001l9417J14548l1638q3046L4141Q3609J06117J2400m090n3564l9697
11231a90638k9069J00585m6730r6892J00130J08579O8790J36850n7685q8339m8946
11220d3365m9966n6614J3301J03412N5732j3466o801P344M541m8960j39780q4825
11208b59447N1053J2673K6973J6817P1085m0189m1951m5093k9449m8130j13717
11197c99375K511L2545M7424J43728Q2947K0567k4200Q4177K3881j5124M106l1935
11185b8748L292l4035q925O4637l0222L4893n6541q6311K027M3233J1369k8960
$$ plain form
11264 -38345 -105187 -232086 -252646 -172300 -267253 -378875 -336147 -236763 -297285 -170787 -49687
11253 -49687 75242 144018 55256 -46603 -45513 3227 -143802 -152563 -124685 -106585 -290001
11242 -290001 -329418 -214870 -246508 -329554 -295413 -211804 -105687 -93287 -97377 -150941 -190638
11231 -190638 -219707 -119122 -165852 -262744 -162614 -54035 14755 151605 93920 5581 -43365
11220 -43365 -93331 -149945 -136644 -33232 22500 9034 2233 9577 14118 -34842 -174622 -259447
11208 -259447 -208394 -195721 -168748 -151931 -80846 -121035 -162986 -208079 -237528 -285658 -399375
11197 -399375 -396864 -364319 -316895 -173167 -90220 -69653 -93853 -9676 14205 -919 3187 -28748
11185 -28748 -25456 -59491 -68416 -3779 -34001 892 -55649 -141960 -139933 -96700 -85331 -114291
11173a14291K3332M1042k5229m1676J5390m415P5128K2352L9158m8986j55298
11162a73493J8341o2158J7934M177M4647L4945p7756j11657J36931J52001J0355
11151e733r8251k1788P2749q3178j38116p752J08816n8624n3217r622r0623J44407
11139b40932Q4485N5256R786j00074l3976P4264K242q7016l9235j9672Q0309J39214
11127g5349l0817k634l7836M8707l4748r8084j17156J26647j6280r4265p1232
11116d03047J12956K31720j2952Q208j25126q4697N7109O5071l9993r0567l6219
11105c17537P5464m2509l6383q6239K9360Q2686J9815j8384r1236N6749J20178
11094b08036M7171P6414R6563j0365p8554o1763k571J0878J6335L6783o6866k0874
$$ plain form
11173 -114291 -90959 -49917 -75146 -116822 -101432 -105847 -30719 -8367 30791 -18195 -173493
11162 -173493 -155152 -217310 -199376 -195199 -150552 -115607 -193363 -305020 -168089 -16088 -5733
11151 -5733 -103984 -125772 -53023 -136201 -274317 -282069 -173253 -231877 -285094 -294716 -385339 -240932
11139 -240932 -156447 -101191 -91405 -191479 -225455 -151191 -148949 -235965 -275200 -294872 -214563 -75349
11127 -75349 -106166 -108800 -146636 -97929 -132677 -230761 -347917 -221270 -237550 -331815 -403047
11116 -403047 -290091 -58371 -71323 -63115 -188241 -272938 -215829 -150758 -190751 -281318 -317537
11105 -317537 -242073 -284582 -320965 -407204 -377844 -295158 -275343 -293727 -384963 -328214 -208036
11094 -208036 -160865 -84451 12112 1747 -76807 -138570 -141141 -130263 -113928 -77145 -144011 -164885
11082a64885K785R1791l874j09472l6429M0288m3649Q205j7370L8291L9185l296
11070a58430K7878K2182j45926k512J08110j8304q6135N5825J42232J2782j33320
11059a75618J3112O4351k7001l0535K0195q2931p5157N9754m8279O39O4397K7866
11047a89207K1486M5874J08129N2847n5240j32661p7545M0990J22060O8015J3496
11036A8244O059J66789j3586r6357o9094N5192P8551O7481L1425J16183K27873
11025E88760J83796L1769n1264j99553p0768l8761j7179O4570J24073K28368J21228
11014I65039l2704m3775P7276k3186r8421j20499j51468o8722M058p2764k3475
11003D11359J76979J48799j25770K6676R5643q4282j38616l2630K0731r7036j40327
$$ plain form
11082 -164885 -162100 -70309 -74183 -183655 -220084 -179796 -223445 -215240 -232610 -194319 -155134 -158430
11070 -158430 -130552 -108370 -254296 -256808 -148698 -167002 -253137 -197312 -55080 -42298 -175618
11059 -175618 -162506 -98155 -125156 -155691 -135496 -218427 -293584 -233830 -282109 -281470 -217073 -189207
11047 -189207 -167721 -121847 -13718 39129 -16111 -148772 -226317 -185327 -63267 4748 18244
11036 18244 24303 191092 177506 81149 12055 67247 145798 213279 244704 360887 588760
11025 588760 772556 804325 753061 553508 482740 443979 426800 491370 615443 843811 965039
11014 965039 932335 888560 965836 942650 844229 723730 572262 503540 507598 434834 411359
11003 411359 588338 737137 611367 638043 733686 649404 510788 478158 498889 401853 261526
10992B61526n6413Q570n8909q5996J15920O3270j06735n4962l3139k4288j60078
10981a31234k3447L4598J2121O294R3193o2023j09011J3496J57798L209o1092
10970f6098q2074R466J627l3708J6484n2141r6942L0904j6569j1687Q1257m9637
10958b69118q8228N1082Q5607J48546k2386n9420n5363l8895O4153N3557j22807
10947b53272j39030Q4562L6359q0149Q1753L8342R539M2573J51875L9407j13147
10936a01188O479O3052M4530m2484m1540K8646j23974j33771R15K6386K6923Q5731
10924a60295R9118p7591Q153P489K5435k9956p8049o0810N0825o5534o9417P186
10912c43446R712J35360n0978j56541K2133P4568J9772P684n2114q9818r4407
$$ plain form
10992 261526 205113 213683 154774 68778 184698 247968 141233 86271 53132 28844 -131234
10981 -131234 -154681 -120083 -107962 -101668 -8475 -70498 -179509 -166013 -8215 -5006 -66098
10970 -66098 -148172 -138706 -137079 -170787 -154303 -206444 -303386 -272482 -289051 -300738 -219481 -269118
10958 -269118 -357346 -306264 -220657 -72111 -94497 -153917 -209280 -248175 -184022 -130465 -253272
10947 -253272 -392302 -307740 -271381 -351530 -269777 -231435 -221896 -179323 -27448 11959 -101188
10936 -101188 -94709 -31657 12873 -29611 -71151 -42505 -166479 -300250 -299335 -272949 -246026 -160295
10924 -160295 -61177 -138768 -130615 -123126 -97691 -127647 -205696 -266506 -215681 -281215 -350632 -343446
10912 -343446 -333734 -198374 -249352 -405893 -383760 -309192 -289420 -281736 -333850 -423668 -518075
10901e18075R6730J20293P4779l5556N5683j20188j24422J39275M5853p1829J7698
10890c19759Q2444K0389j25554J09016J53529M0771n0609j59815j07174o756M4394
10879c19124J1186j12418j5945J15256K00690O606j6113p8880q4372r9871n7219
10868d50204J44191J87387o798q1687N6608J10110j24300j67632j7145Q7695K0205
10857b41570L9598L0348q1143j8820n153O2514j2394j03522J09985j38479q5868
10846d44504O8884N8429Q3514M7030M2726k5986K5452k5946p9469K2733L3207
10835a93930Q387j14064J277p5931m5786r3989L3492Q2268K7507m000J22365k1203
10823b73607r6550j77650J6013J17010Q6392j6120q3252P4067M5873Q1957M6560
$$ plain form
10901 -518075 -421345 -301052 -226273 -261829 -206146 -326334 -450756 -311481 -265628 -337457 -319759
10890 -319759 -237315 -216926 -342480 -233464 -79935 -39164 -89773 -249588 -356762 -363518 -319124
10879 -319124 -307938 -420356 -436301 -321045 -120355 -113749 -129862 -208742 -293114 -392985 -450204
10868 -450204 -306013 -118626 -125424 -207111 -150503 -40393 -164693 -332325 -349470 -261775 -241570
10857 -241570 -201972 -171624 -252767 -271587 -276740 -214226 -226620 -330142 -220157 -358636 -444504
10846 -444504 -375620 -317191 -233677 -186647 -143921 -169907 -144455 -170401 -249870 -227137 -193930
10835 -193930 -185543 -299607 -298330 -374261 -420047 -514036 -480544 -398276 -370769 -374769 -252404 -273607
10823 -273607 -370157 -547807 -531794 -414784 -328392 -344512 -427764 -353697 -307824 -225867 -179307
10812a79307R895L3186P5429j4693m6803q1569o1637L0485J8705n7562o5357k3192
10800c62420J3674j1822k1883j1147J03744R4515l394L2259J58852o0026k08693
10789b76341j86679l6630J03406n1756k3772J5990k285Q4415R941P0786J5386
10778b77539k32j60284q6463m3004k0645m7214k381L2830J2297P370J6331o1736
10766f30670n8568N0542J5881m6351J0324j888k4855J10167p5597L417m2679p928
10754f98205J3268q526O6788M2638R0852j7414k4091j02264j71130J6867J49494
10743f41723J74234l6427J4907K5027K7822R048O4314k159m3889L955P084K9870
10731c67937q0428m3156r608K31876O9196j03O9275j3822l3935M9785J38738J87881
$$ plain form
10812 -179307 -169412 -136226 -60797 -75490 -122293 -203862 -265499 -235014 -216309 -273871 -339228 -362420
10800 -362420 -348746 -360568 -382451 -393598 -289854 -195339 -198733 -166474 -7622 -67648 -276341
10789 -276341 -463020 -499650 -396244 -448000 -471772 -455782 -458067 -373652 -363711 -292925 -277539
10778 -277539 -277771 -438055 -524518 -567522 -588167 -635381 -637762 -604932 -592635 -585265 -568934 -630670
10766 -630670 -689238 -638696 -622815 -669166 -658842 -660730 -685585 -575418 -651015 -647598 -690277 -698205
10754 -698205 -684937 -693463 -626675 -584037 -493185 -510599 -534690 -636954 -808084 -791217 -641723
10743 -641723 -467489 -503916 -489009 -463982 -436160 -427112 -362798 -364957 -408846 -404891 -397807 -367937
10731 -367937 -448365 -491521 -501129 -269253 -200057 -200160 -130885 -144707 -178642 -128857 9881 197762
10719A97762O9829m3870L1268P3711M7920k5558P883O1498J58443j1146m3007
10708E24733N7430K418m8917j8468N678K059K2075O5792M8192Q0360K34059J25535
10696A100946q6974K3168M3277m1829j62507q2309j6681M5536n9246p282N9459
10685H15558o9172j86174j07424k9917m7351k9252j9209q5408p7815N9146J6807
10674B39789N3361n8800M9235P1907p9490l6929M7212K9994o3067J1081O537j31917
10662A38913n9092N6022L4502n9761j73773j02051j08634L6268J28212J81244
10652G1850J07093m5226J3719O4458J04548K07954K34607Q3736R7910K9686P9547
10641A049882k4689l6982L696j91842k97315M2386J3723P1025J36046J89752K45603
$$ plain form
10719 197762 267591 223721 254989 328700 376620 351062 358945 420443 578886 567740 524733
10708 524733 582163 584581 535664 517196 522874 524933 547008 612800 660992 741352 975411 1100946
10696 1100946 1013972 1037140 1080417 1038588 876081 793772 777091 822627 763381 756099 815558
10685 815558 746386 560212 452788 422871 375520 346268 327059 241651 163836 222982 239789
10674 239789 293150 234350 283585 355492 276002 239073 286285 316279 253212 264293 270830 138913
10662 138913 79821 135843 170345 110584 -63189 -165240 -273874 -237606 -109394 71850
10652 71850 178943 133717 147436 211894 316442 524396 759003 842739 940649 970335 1049882
10641 1049882 1025193 988211 991907 800065 502750 545136 558859 629884 765930 955682 1201285
10630A201285L73197K92625L82802M60005M83994O17884O33249L83277K87008
10621E115326K61342K25442L17440P81927J409931J894924K643674L470822M460433
10612B0581261N424186O648177P466509P401554O822140N814636M075659J791669
10604F6025791L1031n1859J645988M562516Q233208J1646322J3451220J3444679
10596A18988896J2166063R639233M807160j681949o528453o930094l251441K617251
10588A29826666Q934066J3759770J6287840J5693054J3085846Q478009M76341
10581B06541592r555719j6665538j7177524j2601489o333759l86440M198963O328578
10573A54348664O150553M201657R54311m474112j0915626j4889915j4741476j1332078
$$ plain form
10630 1201285 1574482 1867107 2249909 2709914 3193908 3811792 4445041 4828318 5115326
10621 5115326 5376668 5602110 5919550 6701477 8111408 10006332 12650006 16120828 20581261
10612 20581261 26005447 32653624 40120133 47521687 54343827 60158463 64234122 66025791
10604 66025791 66056822 66004963 67650951 72213467 80446675 92092997 105544217 118988896
10596 118988896 131154959 140794192 145601352 143919403 137390950 130460856 127209415 129826666
10588 129826666 138760732 152520502 168808342 184501396 197587242 206065251 206541592
10581 206541592 196985873 180320335 163142811 150541322 144207563 143821123 148020086 154348664
10573 154348664 160499217 164700874 165655185 161181073 150265447 135375532 120634056 109301978
10565A09301978p234936l604561j386328k89200n0630p08572k378734m873804
10557H8775213p327629q648594q414539p273250n884151m438613l562985l091972
10549D0133480k426445j975499j816241j604368j339641j164081j025860r76346
10541B7804999j037981q38592p95460p92420q28251o69625n35202n45932n10674
10532B1250862n55255n16679n52924n29099m69876m48702m18104m70900m65041
10523A6824282l03181j70957l11095m57673n02419l98079l36244l32902j72364
10514A3839368j10587k55223l74128m31939l31867j80790j12637j46570k26258
10505A1669369l10530l19892k53316l31160j47511k50961k45747k95240k41702
$$ plain form
10565 109301978 102067042 98462481 97076153 96786953 96736323 96027751 93649017 88775213
10557 88775213 81447584 72798990 64384451 57111201 51227050 46788437 43225452 40133480
10549 40133480 37707035 35731536 33915295 32310927 30971286 29807205 28781345 27804999
10541 27804999 26767018 25928426 25132966 24340546 23512295 22842670 22307468 21761536 21250862
10532 21250862 20695607 20178928 19626004 19096905 18627029 18178327 17760223 17289323 16824282
10523 16824282 16521101 16350144 16039049 15581376 15078957 14680878 14344634 14011732 13839368
10514 13839368 13728781 13473558 13099430 12667491 12335624 12154834 12042197 11895627 11669369
10505 11669369 11358839 11038947 10785631 10454471 10306960 10055999 9810252 9515012 9273310
10496I273310j00637j83536j89650k25129j58982j70668n1154j53974k05424j74876
10486G659280q6075o1671j99959o7136j07510j22072k5988j93304j27051J630
10476F670144l4132k0430K7370M2620r8580j49463L767J0892j16638q3206o8453
10465F183891J15643O2141p7550j09337m22O3384n6585j27721n064P8429K456
10454F129265k3312J52288r6379k30663j12420L6636k1996n4211K182p6834o0559
10443E643997n7204l6715m2420j10399q6746j97478j76908o0110o4655k40618
10433D570744p9048N0568R89o7015J5580r7141r5851k9630l171r4175n8055j17456
10421C996339j5111j04619r3850M2977j31432j30312l0331N8704p5088j20400
$$ plain form
10496 9273310 9172673 8989137 8799487 8574358 8415376 8244708 8193554 8039580 7834156 7659280
10486 7659280 7573205 7511534 7311575 7244439 7136929 7014857 6988869 6795565 6668514 6670144
10476 6670144 6636012 6615582 6642952 6685572 6586992 6437529 6441296 6452188 6335550 6252344 6183891
10465 6183891 6299534 6361675 6284125 6174788 6174366 6237750 6181165 6053444 6048380 6126809 6129265
10454 6129265 6105953 6258241 6161862 5931199 5818779 5855415 5833419 5779208 5781390 5704556 5643997
10443 5643997 5586793 5550078 5507658 5397259 5310513 5113035 4936127 4876017 4811362 4570744
10433 4570744 4491696 4542264 4543253 4476238 4491818 4394677 4298826 4269196 4266025 4171850 4113795 3996339
10421 3996339 3981228 3876609 3782759 3825736 3694304 3563992 3533661 3592365 3517277 3396877
10411C396877o6747m8817L5658P3786j23801r7725j5442l3687j20161j22689m8768
10400B828484q4287m9348J48210n1156j45480r4742k5216J7813r5005J9834Q0836
10389B549943m4716j24734p6124J06911o2289k4043o0975p1041k70216k0280J61498
10378B063934P4253j15163l1449p0985N311j5950j83405O9165l204j13218j0749
10367A668540J51195r9002j58194m0213N7233J0495K9847O3780q3976r3337J0698
10356A517066m6898k6591j9561o0708K5174l9924q8406l0800K5635O4527Q1384
10345A400898m7481Q2120m9298j25042O0697N0006n0184l2000j09116m0303P6078
10334A216375k2426p1845m2558P9657R5104J2987r730r8405n6093m46n2836M703
$$ plain form
10411 3396877 3330130 3281313 3316971 3390757 3266956 3169231 3153789 3120102 2999941 2877252 2828484
10400 2828484 2744197 2694849 2843059 2791903 2646423 2551681 2526465 2544278 2449273 2469107 2549943
10389 2549943 2505227 2380493 2304369 2411280 2348991 2324948 2263973 2192932 1922716 1902436 2063934
10378 2063934 2138187 2023024 1991575 1920590 1925901 1909951 1726546 1795711 1792507 1679289 1668540
10367 1668540 1819735 1720733 1562539 1522326 1579559 1590054 1619901 1683681 1599705 1506368 1517066
10356 1517066 1470168 1443577 1424016 1363308 1388482 1348558 1260152 1229352 1254987 1319514 1400898
10345 1400898 1353417 1435537 1386239 1261197 1321894 1371900 1321716 1289716 1180600 1140297 1216375
10334 1216375 1193949 1122104 1079546 1159203 1254307 1267294 1257564 1159159 1103066 1102620 1049784 1054487
10322A054487L6600l5673P009K2121M6756j29869m0874J08761L4474j29005j2894
10311I61893L0665J6462n0147j18905k7349R3448J8423K5139j37765j19280M4836
10300G37420m4521Q5536P6273R2316l1427l447p9092l3092Q2604N9819M4153o8664
10288I17878j8024m1645j23135o0121J76510N1001j78932j84977J15826O3075
10278G17456J61021O9068j94743j12340j09810M145J06950P5697R479m6162N2145
10267G32906Q0562K5940k2016N2116j419n0137j32477n8250J1762q0967p6620
10256D81400K9601m1809J2749L8248k7983k652R4747n4934r4327K5347R8976J05531
10244F64894R5304n0416j7054j16121o2665m8177j7476J74254P1265r8612j42449
$$ plain form
10322 1054487 1091087 1055414 1062423 1084544 1131300 1001431 960557 1069318 1103792 974787 961893
10311 961893 992558 1009020 958873 839968 812619 906067 924490 949629 811864 692584 737420
10300 737420 692899 778435 854708 947024 915597 912150 833058 799966 882570 942389 986542 917878
10288 917878 899854 858209 735074 674953 851463 902464 723532 538555 654381 717456
10278 717456 878477 947545 752802 640462 530652 534797 641747 717444 726923 680761 732906
10267 732906 813468 839408 817392 869508 868089 817952 685475 627225 638987 558020 481400
10256 481400 511001 469192 481941 520189 492206 489554 584301 529367 435040 460387 559363 664894
10244 664894 760198 709782 692728 576607 513942 465765 448289 622543 693808 595196 452747
10233D52747R323m2953o28J4142P5166J1174q517N0245M9692k01555j16170P0744
10221C63410M7032k437k4582J6185n6025r1689j5844O2182O3148R8204K5073o8124
10209D16533j01024M5410L0920j3316Q3575J16855m4102j53992l1537K6398j32367
10198B43353l9231N0954o00R8691j0006j96996n2527j27959P5890J88526j4421
10187B15674K5374J41552N5216m1421j15061l4983M4443J19921L5674L5484J1164
10176D93037n4114N8501Q4400R7265N5157L2967n2437j37065o2309Q0144O8113
10165F63659N9484j4437P0543R8996J38363J48803O2507n0669K6852m1579o4098
10154A098424n0834l0918J36825M6785o5381J58973K67598O268n8380j18599j81305
$$ plain form
10233 452747 462070 419117 418489 432631 507797 518971 510454 560699 610391 408836 292666 363410
10221 363410 410442 408005 383423 399608 343583 251894 236050 298232 361380 459584 484657 416533
10209 416533 315509 360919 391839 378523 462098 578953 534851 380859 349322 375720 243353
10198 243353 204122 255076 254476 353167 343161 146165 93638 -34321 41569 230095 215674
10187 215674 241048 382600 437816 396395 281334 246351 290794 410715 446389 481873 493037
10176 493037 438923 497424 581824 679089 734246 767213 714776 577711 515402 595546 663659
10165 663659 723143 708706 779249 878245 1016608 1165411 1227918 1177249 1204101 1162522 1098424
10154 1098424 1047590 1016672 1153497 1200282 1134901 1293874 1561472 1567740 1509360 1390761 1209456
10143A209456l7612j5566k3077r9613k5988Q3800R628o8187R0674L08O9197j11517
10131A081503j72462j52463m2870J12765J0822p9060n5024O5347J30613P7050
10121I76221j16492o4020q5574j18550p4584m9842M1289o6919j62138j1296N4471
10110C22566n2715o3112J11477N7604N6133J36888k5530j70678j03969m9015m0269
10099A79380P6047N2164l2491J64618N1391o0283j90756k5850N8630n2387K8730
10088B49193K6014p6025L9985p1704N2606L5719j33382j2367O2636O11P7686k6102
10076B24870r2622L9953J25575K7414K3625q6526j46308L0478J42283K4708j65315
10065A48135j9285J22549N9946j10307M03J07678O625m6994m151K1930k7353k285
$$ plain form
10143 1209456 1171844 1156278 1133201 1033588 1007600 1091400 1101028 1032841 1123515 1123823 1193020 1081503
10131 1081503 909041 756578 713708 826473 837295 758235 703211 768558 899171 976221
10121 976221 859729 795709 710135 591585 517001 467159 508448 441529 279391 268095 322566
10110 322566 269851 206739 318216 375820 431953 568841 543311 372633 268664 219649 179380
10099 179380 255427 307591 275100 439718 491109 430826 240070 214220 272850 220463 249193
10088 249193 275207 199182 239167 167463 220069 255788 122406 110039 172675 173286 250972 224870
10076 224870 132248 172201 297776 325190 348815 262289 115981 146459 288742 313450 148135
10065 148135 128850 251399 311345 201038 201441 309119 315744 268750 264599 286529 259176 256891
10053B56891P3078l8312o1127P651M2186J10770r2409j5354Q3535p6774P7891
10042C68026l5512j32053r3307l4498p6054O7715J77321m6992q1160J02097Q80
10031B16463L1554P4951O6382r3556p9440o668N1449N6330O6417O0178r065o8033
10019C66962j73125j42640J05460K6096q4598M8654P2287k6845j41370n0781k5723
10008b5623J2590J38196J10772j48918r9400p619P0901L6154L228n6580N8675
9997I2376R4009O5812J69284l4314j58144k8948J3870K8684q629j71722p7436
9986a5158P4080K1713M979m0115J5882L8192r462K4031n2756l5476p2758l4448
9974h1296M6435J02773Q1564R8367q5127j35610l9438n5818o1674J43288N7869
$$ plain form
10053 256891 329969 291657 230530 238181 280367 391137 298728 283374 366909 290135 368026
10042 368026 332514 200461 107154 72656 -3398 64317 241638 194646 113486 215583 216463
10031 216463 248017 322968 389350 295794 216354 209686 261135 317465 383882 444060 434995 366962
10019 366962 193837 51197 156657 182753 98155 146809 219096 192251 50881 100 -25623
10008 -25623 -13033 125163 235935 87017 -12383 -20002 50899 87053 90281 33701 92376
9997 92376 186385 252197 421481 387167 229023 200075 213945 242629 234000 62278 -15158
9986 -15158 58922 80635 85614 45499 61381 99573 90111 114142 61386 25910 -46848 -81296
9974 -81296 -34861 67912 149476 247843 162716 27106 -12332 -68150 -129824 13464 71333
9963G1333K8638M7714r3741j40225R4268N6724J29154m978N0779K2734j56092
9952A06308o8507j83333K1120J51890J6732j67693M1293J0761m5120k5413M8893
9941i3069J46167J33833J18530k1459j25749j7637J24301j642r5528j1086m264
9930A52397q4001P8551P5294n4525j06486l8870R7624r22q5531j07755N1691J19527
9918I6994J36872q3645j28318J20065M8919p016k0253q4037n9799l9978J6360
9907c836n5r2934J06512L9176L4543O1706k9017N757J11216k4377j00042l6444
9895G2205o44q045M1098j7907m0016Q4205Q5957n2427p5570K5994M4400j7077
9883A42173n0322Q2650J306o1326J1641O943R08O3820m2557M1319R6554J5782
$$ plain form
9963 71333 99971 147685 53944 -86281 7987 64711 193865 188887 239666 262400 106308
9952 106308 37801 -145532 -124412 27478 44210 -123483 -82190 -71429 -116549 -141962 -93069
9941 -93069 53098 186931 305461 284002 158253 140616 264917 263275 167747 156661 152397
9930 152397 68396 146947 222241 167716 61230 22360 119984 119062 33531 -74224 -22533 96994
9918 96994 233866 150221 21903 141968 190887 183871 163618 79581 19782 -20196 -3836
9907 -3836 -3891 -96825 9687 48863 83406 145112 116095 121852 233068 208691 108649 72205
9895 72205 71561 63516 104614 86707 46691 130896 216853 164426 88856 114850 159250 142173
9883 142173 91851 174501 175807 114481 126122 133065 133973 197793 155236 196555 293109 308891
9871C08891j29935n7876N8366L2954J11574J09574P5j06963j40890j01168M5515
9860A30117P3326J1192n0423j20481J5020J85845J28082n62j7851o7411m8326
9849B38528L058n9472r9965O1758J08357l5001N965L1750j7395P770O6646m900
9837C07099l6567j789K9731l5674j41163M03Q80O5885L0718Q7002K2242p6090
9825B52677q773j9416p4570r8146k4092J75651o2742q4189m6238k401j5042K2330
9813A5049J2434k9914J03152O4827q640O7421l8824m7705j5793q0937J72887j3201
9801B00756k04655M2979j6851L1222k8926O8988m3636p9642P5551M915j4025J6857
9789E3533R986O4559L385r8223j2404Q2600k6158n6870k0307k8718l4991O03j3223
$$ plain form
9871 308891 178956 121080 179446 212400 323974 433548 433623 326660 185770 84602 130117
9860 130117 203443 214635 164212 43731 58751 244596 372678 372116 354265 286854 238528
9849 238528 241586 182114 82149 143907 252264 217263 223228 254978 237583 245353 311999 307099
9837 307099 270532 268743 298474 262800 121637 122040 122920 188805 219523 306525 328767 252677
9825 252677 243904 224488 149918 51772 27680 203331 140589 56400 10162 7761 -7281 15049
9813 15049 27483 -2431 100721 165548 156908 224329 185505 137800 122007 41070 213957 200756
9801 200756 -3899 39080 22229 53451 24525 93513 49877 -29765 45786 50701 36676 53533
9789 53533 63519 128078 131463 33240 20836 103436 77278 20408 101 -28617 -63608 -63005 -76228
9776g6228m3375J18420J30885J4221k6081j34115J18001n910l434j8063L744M2961
9764A21026J8767Q237J5135O9731n2826k6955M8949n4639r4587Q7821J1098J23262
9752B75019j7606p3341j19019r14J4584j1982k1257p2937j4365Q0549J23524k1121
9740A41134p4639p8127m83j0745J4016M5415o7242L0285J39468R0995l528n9389
9728A67160r4889K6581J34430k1576l8692q5110j13700k1865P5707P4157l1039
9717G1164k9268J59864j32648q2452j0507Q5487m9634N5411j9660k0504m3190
9706a5937P7576j5850Q156L2539p1981K2610K8192j4259J01279J03028l1494l8125
9694A85734j02479P7564J37060n9508k10108m3194p5137N9610J18874J70882j02335
$$ plain form
9776 -76228 -119603 -1183 129702 143923 117842 -16273 101728 95818 92384 74321 78065 121026
9764 121026 139793 148030 163165 232896 180070 153115 202064 147425 52838 140659 151757 275019
9752 275019 257413 184072 65053 64139 78723 66741 45484 -27453 -41818 38731 162255 141134
9740 141134 66495 -11632 -12115 -22860 -8844 36571 -30671 -386 139082 230077 226549 167160
9728 167160 72271 98852 233282 211706 173014 87904 -25796 -47661 28046 102203 71164
9717 71164 41896 201760 69112 -13340 -23847 61640 12006 67417 47757 27253 -15937
9706 -15937 61639 45789 53945 86484 14503 37113 65305 51046 152325 255353 223859 185734
9694 185734 83255 160819 297879 238371 28263 -14931 -90068 -30458 88416 259298 156963
9683A56963p8280j2807j0932k8829l9873L5331J65959n8374J270j5097j0651p076
9671I7604M89J2407J11258m2694j7262J26594O7031K8299J2122j6508L4719O6434
9659D80493K6761p9192j42498n2289m4439n6041j78138J5155J0300K665M9326
9648C2103Q4939J86430K36382k488l3738Q494n1263j20629k743j5630r2185q6828
9636A42844j03850P1050J7617p1941L4146J02229o7120l8177K3123l6265j3973
9625E9683M5160l5762L5936q2625J8474l9726K8524O6974j05832j27463q708K5257
9613a20108J13108m3521m4215L3940r9688m454L0502J01174J29710N1701O5403
9602B13552q7229j19913m3806j8469k8277K059l0389K9955j9151J8303P8744P2648
$$ plain form
9683 156963 78683 65876 54944 26115 -13758 21573 187532 129158 130428 115331 104680 97604
9671 97604 98093 110500 221758 179064 161802 288396 355427 383726 395848 379340 414059 480493
9659 480493 507254 428062 285564 233275 188836 132795 -45343 -30188 -19888 -17223 32103
9648 32103 117042 303472 539854 537366 503628 512122 460859 340230 337487 321857 229672 142844
9636 142844 38994 110044 127661 55720 89866 192095 124975 86798 109921 73656 59683
9625 59683 104843 69081 105017 22392 40866 1140 29664 96638 -9194 -136657 -145365 -120108
9613 -120108 -7000 -50521 -94736 -60796 -160484 -164938 -134436 -33262 96448 148149 213552
9602 213552 126323 6410 -37396 -55865 -84142 -82083 -112472 -82517 -101668 -83365 -4621 68027
9590F8027O523J06244M8075p3192j80068j10770J25259M2112J06787L9175k4083
9579A54089j6755k4845K5388L6938l4906o9865J3964o5657R0476O62r4816J7123
9567C1796J02054l6987k6398J7904M9799o855j20962l6919q422O4047J52847K6106
9555B08010p7347j32671l6251J17758j01525K3047o3289j9843J3377L1723J0516
9544b6495N8961K8609O0210q2193n3586k8754n9841k5286P9621K1552k9185O4263
9532G876J44432K716K7354R4857q8437j39204o1225j7142M7792J7427l906p3104
9520d0564N4423j06965p3733P0732J52043O8504P8175o4656q8438j02250J64369
9509A11640J61544M0822J1158j99250j22682n153J65525J0199J1327p6185m9247
$$ plain form
9590 68027 74550 180794 228869 155677 -24391 -135161 -9902 32210 138997 178172 154089
9579 154089 137334 112489 137877 174815 139909 70044 84008 18351 108827 109489 14673 31796
9567 31796 133850 96863 70465 88369 138168 131313 10351 -26568 -34990 29057 181904 208010
9555 208010 130663 -2008 -38259 79499 -22026 1021 -62268 -82111 -68734 -37011 -26495
9544 -26495 32466 61075 121285 39092 -14494 -43248 -103089 -128375 -48754 -27202 -56387 7876
9532 7876 152308 155024 182378 277235 188798 49594 -11631 -28773 19019 36446 32540 -40564
9520 -40564 13859 -93106 -166839 -96107 55936 124440 202615 137959 49521 -52729 111640
9509 111640 273184 314006 325164 125914 3232 -1921 163604 173803 185130 108945 59698
9498E9698k8408M4738O4926O691K9687q7759O172k5072o1870P8881L3681R2931
9486B14296m7700j6472n5023q9059q9304R8909J24775m9232j41946p6687Q5708
9475d1735J59546n4925q1448N9681N2861K5878n5205m923n4688k6748l6744o4226
9463a22676L1975L4210m9209q6528M1021N4411J22807J10678N7737p8896r5708
9452A9822m8408J6352q584q9765O6205Q2265N3318O4003O1250n3130n7534l033
9440A02761j01087p1817Q0383J20500K0113N1748l3447j04393j40803O4470Q160
9429c412n7513J41349M2173r3465M4345N9468k3786j0297p815l4025J7424q1312
9417f866o2479J22244J00366L0269P5742q5396K0841j8287j20142n5363j11451
$$ plain form
9498 59698 31290 76028 140954 147645 177332 89573 95745 70673 8803 87684 121365 214296
9486 214296 166596 150124 95101 6042 -83262 15647 140422 91190 -50756 -127443 -41735
9475 -41735 117811 62886 -18562 41119 93980 119858 64653 59730 5042 -21706 -58450 -122676
9463 -122676 -90701 -56491 -105700 -192228 -151207 -96796 26011 136689 194426 115530 19822
9452 19822 -28586 -12234 -20818 -110583 -44378 37887 91205 155208 216458 163328 105794 102761
9440 102761 1674 -70143 10240 130740 150853 202601 169154 64761 -76042 -11572 -3412
9429 -3412 -60925 80424 122597 29132 73477 132945 109159 98862 91047 57022 74446 -6866
9417 -6866 -69345 52899 153265 183534 259276 173880 194721 176434 56292 929 -110522
9406a10522j11220L829J43330L2898L6464L0875K7495l8987K363m0947o2698l2689
9394a19809O6100J26077R1357o8286K3396q6213k0273M399q7160k28m6110M8807
9382f7943L5078k2851K2301J21402N1077m9959J3477P7436j5103p2285Q8435L2228
9370B13293l4053r4532p9674o7228p9578K4137J14427J0565L7401J33017N271
9359A83046J5560p4399j10703J07711L5631J8871n0416j43954o1586n1984M7206
9348h5017Q2976L5157k1682J8418j8025o5862R047l3261k9333J01012N4878j52898
9336a04590j46511l9819O9749J57862N6273j2459j17888q3848K4077J40664P0693
9325A4203l0296k1629l3178J54679P5631j30513Q2828L9180j30182m4591n4576
$$ plain form
9406 -110522 -221742 -217913 -74583 -41685 -5221 25654 53149 14162 16525 -24422 -87120 -119809
9394 -119809 -53709 72368 163725 95439 118835 32622 12349 16748 -70412 -70640 -116750 -67943
9382 -67943 -32865 -55716 -33415 87987 139064 89105 102582 180018 164915 92630 181065 213293
9370 213293 179240 84708 5034 -62194 -141772 -117635 -3208 7357 44758 177775 183046
9359 183046 198606 124207 13504 121215 156846 175717 125301 -18653 -80239 -132223 -85017
9348 -85017 -2041 33116 11434 29852 11827 -54035 -44988 -78249 -107582 -6570 48308 -104590
9336 -104590 -251101 -290920 -221171 -63309 -7036 -19495 -137383 -221231 -197154 -56490 14203
9325 14203 -16093 -37722 -70900 83779 159410 28897 111725 150905 20723 -23868 -78444
9314g8444k6522J0176J38941P3511P0941q1569j16627J412J85599M2508L5309
9303B55235q9041m7448p6754l9151N5601l003J8969Q9328M6167k8448p319j5243
9291A58893o8452l8804J2823P5716k4256l1229m761J05630J5769j64959L9447
9280G5817K0899N8076Q5938j88898j39955j6598P0281R2598j05292m4368K4156
9269f7346L7737p571J06014N6785r4218j33900l5797J83085M7488J1277m7960
9258E5594K648j36532j8874J6469J01263J34828l4776J6926M0603j00019o2836
9247A5294J02129J27856q0904j49164o7530K816L0215R0125R3844N5264L4021
9236B53966l0269j87056q773K65045J96502j95932k09101r0153l0016J4219q4705
$$ plain form
9314 -78444 -104966 -94790 44151 117662 188603 107034 -9593 -8181 177418 219926 255235
9303 255235 166194 118746 41992 2841 58442 55439 74408 163736 209903 181455 174136 158893
9291 158893 90441 51637 64460 140176 115920 84691 79930 185560 201329 36370 75817
9280 75817 96716 154792 240730 51832 -88123 -104721 -34440 58158 -47134 -91502 -67346
9269 -67346 -29609 -37180 68834 125619 31401 -102499 -138296 44789 92277 103554 55594
9258 55594 58242 -78290 -97164 -80695 20568 155396 120620 137546 178149 78130 15294
9247 15294 117423 245279 164375 15211 -52319 -49503 -19288 70837 164681 219945 253966
9236 253966 223697 36641 27868 292913 489415 293483 84382 -5771 -35787 -21568 -106273
9225a06273o303J31277J1219k3496P0665p0247o4760o7647N4896J58327J09428
9214A97086L3497j29659j06007M7678J16418L6866j31864K8708O6185o8234p3332
9203A7342n3234Q358L0190R6033J1523r1729M6236n0718k5030P6744J6591o6774
9191A5532j33763J10538K2062L0550J06720l7701j42243o2117l4712P0311J01277
9180D6454R759P1330r272o2507K9066j5418l27o1728j5732L1834n3815L3344n664
9167b676r6550J5074O8818m8496j10832m1866J27243J73091K0030j23837o0042
9156h0043l214o2689L8912L6207M7138n6706o3627N9836R1420k9798K194O6065
9144D5695l9610k4313p087l8446m656L9461l4354m0120p8615j9847J17631J9589
$$ plain form
9225 -106273 -112576 18701 29920 6424 77089 6842 -57918 -125565 -70669 87658 197086
9214 197086 230583 100924 -5083 42595 159013 195879 64015 92723 158908 90674 17342
9203 17342 -35892 -27534 2656 98689 110212 18483 64719 14001 -11029 65715 82306 15532
9191 15532 -118231 -7693 14369 44919 151639 113938 -28305 -90422 -125134 -54823 46454
9180 46454 56213 127543 118271 55764 84830 69412 69085 7357 -8375 23459 -30356 2988 -2676
9167 -2676 -99226 -84152 -15334 -63830 -174662 -216528 -89285 83806 103836 -20001 -80043
9156 -80043 -83257 -145946 -107034 -70827 -23689 -80395 -144022 -84186 7234 -22564 -20370 45695
9144 45695 6085 -18228 -25315 -63761 -68417 -28956 -63310 -103430 -182045 -201892 -84261 -64672
9132f4672m5755p4731Q352K0482L0724J37916J09217K2253N829J1474L6621M3858
9120B41568j82534q8783L7817N6812J10177M6760K5900j12340j75277m6875J0079
9109g6696J08201J92028L9848q8845j04886o4347J76365K6519n6043J1744k6714
9098A37174k7311L3541n8718j14862K1773j45503n0859J14521L5288j8895L2545
9087d1306Q0372P9785j30652q2224q6805J03610J33739j21191n8630q2581j5561
9076b21444P2939J83048J9071q516p5795r6930q7046m0058M24M9340O7282O1254
9064g6431k5722J0020M4617L956Q8684M8256J8268L8896l8261l6888K8001R6217
9052A99613L621l2206j61621p8956l8270q871l8447O8597K5958o8274j75776K1060
$$ plain form
9132 -64672 -110427 -185158 -176806 -156324 -125600 12316 121533 143786 149615 161089 197710 241568
9120 241568 59034 -29749 8068 64880 175057 221817 247717 135377 -39900 -86775 -76696
9109 -76696 31505 223533 263381 174536 69650 5303 181668 208187 152144 163888 137174
9098 137174 109863 143404 84686 -30176 -8403 -153906 -204765 -90244 -54956 -73851 -41306
9087 -41306 39066 118851 -11801 -94025 -180830 -77220 56519 -64672 -123302 -205883 -221444
9076 -221444 -148505 34543 53614 45098 -30697 -127627 -214673 -254731 -254307 -204967 -137685 -76431
9064 -76431 -102153 -92133 -47516 -43560 45124 93380 111648 150544 112283 75395 103396 199613
9052 199613 203234 171028 9407 -69549 -107819 -116690 -155137 -86540 -60582 -128856 -304632 -283572
9040b83572J07567Q4959L7060N3122M6600L7029l4494L6410Q7009j61O35N1340
9028B23504m8802k7924J07530l6704j17685k799L5869N7489n1156j13015j23536
9017i7229J0023N2051P1354P1755L550l1829l4087k5467l9110n1643O1702L4528
9005B5598K8030n7906P1978o0002P9102M0240m0132l4855j11362q859m2091n8583
8993a68842j02007J09269J92735P4521j9584l7141L7418o2185n8399m9478M2363
8982d1330J15417P3467K1037r4406P061o8501N9351K4767M373K7301J5067j0339
8970A33265m054j07485n9204K6286l231O4648J23296k8200m1685r0050L0518j631
8958D2473j7150l3629j0544o0779K9837J49817J2957j9098o7974j26532R6132
$$ plain form
9040 -283572 -176005 -91046 -53986 -864 45736 82765 48271 84681 171690 171529 172164 223504
9028 223504 174702 146778 254308 217604 99919 97120 132989 190478 139322 26307 -97229
9017 -97229 -87206 -35155 36199 107954 111504 79675 45588 20121 -18989 -70632 -8930 25598
9005 25598 53628 -4278 67700 7698 86800 127040 86908 52053 -59309 -68168 -110259 -168842
8993 -168842 -270849 -161580 31155 105676 86092 48951 86369 24184 -34215 -83693 -41330
8982 -41330 74087 147554 168591 74185 81246 12745 72096 96863 101236 128537 143604 133265
8970 133265 129211 21726 -37478 -11192 -14423 50225 173521 145321 103636 13586 44104 42473
8958 42473 25323 -8306 -18850 -79629 -49792 100025 112982 93884 25910 -100622 -4490
8947d490R1648k471j64362m6776j1181K8687K8775m2093N6081P0918R2527j7414
8935G9849M5225N8360j21018l3760J71871J331q8664m5082j62317r2174J9769
8924a66610K2458J9663n2608o9283k6071J07428N1533r5771M1275R5926J01113
8913B9053R4350j6500J3205k8025o615j39281j13982k5481j9867N8006o097O6443
8901i4791l431j88350J96871P0638k1739j07707o7261L5524o17J14396J6332j6969
8889f7104P3176m941j17936K7444k7046m4586O7225J12158L565r932o8403j18816
8877a75196M9067Q64m7841L5359M7862K16334J01062q4531n8720r498R340r8864
8865a4762k3978j189m5273N0678k7500l6982k3196K3100J62099R4567m5089o6187
$$ plain form
8947 -4490 87158 84687 -79675 -126451 -137632 -108945 -80170 -122263 -66182 4736 97263 79849
8935 79849 125074 183434 62416 28656 200527 201858 113194 68112 -94205 -186379 -166610
8924 -166610 -144152 -124489 -177097 -246380 -272451 -165023 -113490 -209261 -167986 -72060 29053
8913 29053 123403 106903 120108 92083 85468 -53813 -167795 -193276 -213143 -155137 -161234 -94791
8901 -94791 -98222 -286572 -89701 -19063 -40802 -148509 -215770 -180246 -180863 -66467 -50135 -67104
8889 -67104 6072 1131 -116805 -89361 -116407 -160993 -93768 18390 21955 12023 -56380 -175196
8877 -175196 -126129 -125265 -173106 -137747 -89885 126449 227511 142980 84260 74762 84102 -14762
8865 -14762 -38740 -39929 -85202 -34524 -62024 -99006 -122202 -99102 62997 157564 112475 46288
8853D6288Q089k9771q3071m4563r8988p279O2793j8705L9966j9302n73J12436
8841c2680J31655o452j36915k4629O406M8384J05084J5607o1371M0991L3570o6043
8829E3607M0198m266o0777m6456R5252J06073K4637k3072K8618n1909O5714K3430
8817B51049q7317j11315j40112m0483J61516K0956N0409o4678n8866n4465L8889
8806c4417l629l7547M475p2796N2028K8128P5488J08461L7077O0738K1590p7154
8794A62442o0321P3392j0399n5616K0168r9958j37215J08017l492Q63k5028k1887
8782d9034J1552J6533o6360p8864O5835P0915J58191k0177j5284k6408r7856o1624
8770i2581K6767k3666o2749L9371K02722O5394m1215p7938L1983K9338M539q7983
$$ plain form
8853 46288 54377 24606 -58465 -103028 -202016 -209295 -146502 -165207 -125241 -144543 -145116 -32680
8841 -32680 98975 92523 -44392 -69021 -62615 -14231 90853 106460 45089 86080 119650 53607
8829 53607 93805 89539 28762 -17694 77558 183631 208268 185196 213814 161905 227619 251049
8817 251049 163732 52417 -87695 -128178 33338 54294 104703 40025 -18841 -73306 -34417
8806 -34417 -38046 -75593 -71118 -143914 -91886 -63758 11730 120191 157268 218006 239596 162442
8794 162442 102121 175513 165114 109498 129666 29708 -107507 510 -2982 -2119 -27147 -49034
8782 -49034 -37482 -20949 -87309 -166173 -100338 -29423 128768 108591 93307 66899 -30957 -92581
8770 -92581 -65814 -89480 -152229 -112858 89864 155258 114043 36105 68088 97426 101965 13982
8758A3982k8962J9999n0147p903P4323r2209o1568m1855J26855L300j20653N0312
8746a14526L6807K157o3977o2173J44998J14977j497r0014j5300r177m9948J32110
8734B4437Q6216r1156j75602r4639J39756J76047O5708m4599m417p5220k20865
8723b14334p5943Q5937J31414Q0878l2861L5591J7953M5744Q3464r8775k03475
8712a44407l7945J30072R3194j15138M3646O0552j27403r4619J75810J82504r0701
8701G5565m9022r6635j10683K5449J07141J31337r0107n1516l6541j1176J63782
8690E7594R5019j29336q5259M423Q012m2648R4514P6593q0364K6669K3342q7686
8678c9127n2411K9763J06444P2127l9781j35435J8900O7387j9287J38221o64m3896
$$ plain form
8758 13982 -14980 5019 -45128 -53031 21292 -70917 -132485 -174340 -47485 -44185 -164838 -114526
8746 -114526 -77719 -75562 -139539 -201712 -56714 58263 56766 -33248 -48548 -57725 -107673 24437
8734 24437 110653 19497 -156105 -250744 -110988 65059 130767 86168 81751 6531 -214334
8723 -214334 -290277 -204340 -72926 7952 -24909 10682 28635 74379 157843 59068 -144407
8712 -144407 -182352 -52280 40914 -74224 -30578 29974 -97429 -192048 -16238 166266 75565
8701 75565 26543 -70092 -180775 -155326 -48185 83152 -6955 -58471 -95012 -106188 57594
8690 57594 152613 23277 -61982 -57559 -49547 -92195 2319 78912 -1452 25217 48559 -39127
8678 -39127 -91538 -61775 44669 116796 77015 -58420 -39520 27867 8580 146801 146137 102241
8666A02241J34711J02795j17840n5251m2128j23950o3537L0543J17172r571l0911
8655D4274l736K2873J6198K145L2062j19847j17555l9743J55486J18587j31270
8644b0526j07315J0087p4936M445J43517J9209M7531m3764q6157n2796j04132
8633b64837K7790O2425O4712l9565J25354R4555O8856P9074j34027k10522J4630
8622a11555l418J04393R0446P909j44125m4790N4845K6710m3302J2479p870K2236
8610c6042k7393k2312K9944K2121J16985j1901k5611q6358k8965P7636O8680j99947
8598a23163q2964R7704J07467L3419k4812q9719j00817N5580J21273J11917Q0988
8587A86873j02281q6368k6983L2976l3617J9049J25940j3606j2079N5209n4191
$$ plain form
8666 102241 236952 339747 221907 166656 124528 578 -62959 -32416 84756 75185 44274
8655 44274 40538 63411 79609 81754 113816 -6031 -123586 -163329 -7843 110744 -20526
8644 -20526 -127841 -117754 -192690 -188245 -44728 -25519 22012 -21752 -107909 -160705 -264837
8633 -264837 -237047 -174622 -109910 -149475 -24121 70434 139290 218364 84337 -126185 -111555
8622 -111555 -114973 -10580 79866 87775 -56350 -101140 -46295 -19585 -62887 -50408 -58278 -36042
8610 -36042 -63435 -85747 -55803 -33682 83303 71402 45791 -40567 -69532 8104 76784 -123163
8598 -123163 -206127 -108423 -956 32463 7651 -82068 -182885 -127305 -6032 105885 186873
8587 186873 84592 -1776 -28759 4217 -29400 -10351 115589 101983 89904 145113 90922
8576I0922k9327J30031O8522r3764Q8411p1386k24376o3433r6041P664P0633R3676
8564b8468N0511O0197n5150N3776Q831M032J2772J3375q7193o3170O6137L3690
8552F9340l4469J5238R035k8775p3429O55J60330Q160q6824j00983O3533N0435
8540E2246n0674m9789k8618J0509N9171R24j8952N1944q1436j04782j161M5541
8528a15077J59315M3223r2086O4237K4656j8664L4706j0773n486J22221L8219
8517B44491j16321p9842Q229m1268l8053p7884Q3488J11231R6343m4206j00991
8506D5217R6498k2343J29375P4528p7683K828k6284o7594l7946M6313M1163q6254
8494A17818O1709j02259q516j7973K8080k8881j16970j10174N0726J8566K1152
$$ plain form
8576 90922 61595 191626 260148 166384 254795 183409 -40967 -104400 -200441 -192777 -122144 -28468
8564 -28468 22043 82240 27090 80866 89697 93729 106501 119876 32683 -30487 35650 69340
8552 69340 34871 50109 59144 30369 -43060 -42405 117925 126085 39261 -61722 1811 52246
8540 52246 1572 -48217 -76835 -66326 -7155 -6231 -25183 26761 -54675 -159457 -160618 -115077
8528 -115077 44238 87461 -4625 59612 84268 65604 100310 89537 84051 206272 244491
8517 244491 128170 48328 56557 15289 -22764 -100648 -17160 94071 190414 146208 45217
8506 45217 141715 119372 248747 323275 245592 248420 222136 154542 116596 162909 204072 117818
8494 117818 179527 77268 68752 50779 78859 49978 -66992 -177166 -126440 -107874 -86722
8483h6722l0733M4962M8387J14602k7522j06809m6786K3789n9969Q5863J3525
8472b7413m3586r6531O9853Q6811J13700J1366k5479k3094j19385k8624L1955
8461e0427J49904o6174J2908n8384K1816J00809J10972m3756m47M9974J6003r7282
8449A45916O106R241o8080k8428L8006n0832n9727r4474Q2501P7265R6171K1086
8437A74751j08424q9798O7049Q5622l1971j36497L9681J54850m093m5377Q5785
8426A91578n2495O850r2831j49346l7271J14970J23099J4877r9099o8104Q400
8415c9372M2386n7830m9438N9965r668p883P0278n3954p2996L9683J34213n9833
8403d449l3113K4806J8818o7677K195J34409l6992l9067N1554N6405j00267R7180
$$ plain form
8483 -86722 -117455 -72493 -24106 90496 62974 -43835 -90621 -66832 -126801 -40938 -27413
8472 -27413 -70999 -167530 -97677 -10866 102834 114200 88721 65627 -53758 -82382 -50427
8461 -50427 99477 33303 46211 -12173 9643 110452 221424 177668 177221 227195 243198 145916
8449 145916 152022 161263 93183 64755 102761 51929 -7798 -102272 -19771 57494 153665 174751
8437 174751 66327 -23471 43578 129200 97229 -39268 413 155263 151170 105793 191578
8426 191578 139083 145933 53102 -96244 -133515 -18545 104554 119431 20332 -47772 -39372
8415 -39372 3014 -54816 -104254 -44289 -53957 -61840 8438 -45516 -118512 -78829 55384 -4449
8403 -4449 -37562 -12756 6062 -61615 -59420 74989 37997 -1070 50484 106889 6622 103802
8391A03802O7519j06855l5799o8064j10023j7704j2074j9074N579K1486J05028
8380f6179R329n1718R09l3462K4560J32575R3118k2621j34425Q6791J57666J4783
8368B11326o3663o5825K2290J8635q8357j03951j11472l98L1796Q3735Q9063L7160
8356F0339N3531M6261r1615j53293j24069n5667J19409P0179l8911l7174M1312
8345a09698j1050J29394J18766n8289q1965j76864k4352L6495N680Q6437n656
8334i1102j8510O7868n0875k0600O9888R6053o3473j26605M0286J47800P0941
8323A21671q0901r2450j5726N8920m7523q9681j8200l1340k6852J26947K2810
8312g2325Q4571j20206P0061O8001M3830p599j05157r2109M0291L9865P6022j6985
$$ plain form
8391 103802 171321 64466 28667 -39397 -149420 -167124 -179198 -198272 -192693 -171207 -66179
8380 -66179 -56850 -108568 -107659 -141121 -116561 16014 109132 86511 -47914 38877 196543 211326
8368 211326 147663 81838 104128 122763 34406 -69545 -181017 -181415 -149619 -65884 23179 60339
8356 60339 113870 160131 68516 -84777 -208846 -264513 -145104 -74925 -113836 -151010 -109698
8345 -109698 -120748 8646 127412 69123 -12842 -189706 -214058 -177563 -171883 -85446 -91102
8334 -91102 -109612 -41744 -92619 -113219 -43331 52722 -10751 -137356 -97070 50730 121671
8323 121671 40770 -51680 -67406 -8486 -56009 -145690 -163890 -195230 -222082 -95135 -72325
8312 -72325 12246 -107960 -37899 30102 73932 66333 -38824 -130933 -90642 -50777 25245 8260
8300H260l8499O1681l2175K8325R6002m1444n6466J8778L4658K0292N5017k0749
8288A33680q3997j2506r5262n4495N1036L7080J0017j7734P8279P2938p3587m4534
8276I15j0517J06205O7346m6215j69158j28844j4598O8728J18516N7714K6646
8265G6738Q0084J58018l8410q6189J12600r6867l4594k5708j11472L2930J50296
8254B17426k2006j86124r801M7817p4868n0614J23767K9749j09886j36800K2345
8243a48995O7510M4875N257M6253m907R1102J7736k5297j23470r1808j8015J3750
8231a26009L2035O3717L7466k5921n9662L6637o3507N4437P8514n193p8915M5049
8219a1352M7860n3659p8004M0705M538L5700R3249M1993q2000j16262j57111j0902
$$ plain form
8300 8260 -30239 31442 -733 27592 123594 82150 25684 44462 79120 99412 154429 133680
8288 133680 49683 37177 -58085 -112580 -61544 -24464 -14447 -32181 46098 119036 45449 915
8276 915 -9602 96603 163949 117734 -51424 -180268 -194866 -126138 -7622 50092 76738
8265 76738 156822 314840 276430 190241 302841 205974 171380 145672 34200 67130 217426
8254 217426 195420 9296 -505 47312 -27556 -78170 45597 75346 -34540 -171340 -148995
8243 -148995 -81485 -36610 -31353 14900 9993 101095 118831 93534 -29936 -121744 -139759 -126009
8231 -126009 -93974 -30257 7209 -18712 -78374 -41737 -105244 -50807 27707 22514 -56401 -11352
8219 -11352 36508 -17151 -95155 -54450 -49912 -14212 79037 121030 39030 -77232 -234343 -245245
8207b45245K15456K47353N3585n7319r8326j12559L4760J1079K7574o8179n5313
8196d7134k3585k8729N706J11332K8520Q0656P028k8638o7922m4847M1346J54470
8184A88203j5103j31411q4485P9625p1289k52k1398o7948m9977K0165M5525j5757
8172a24102J41934J24697J9974j9614j40943p1594j5051J64618N0183p4471k6509
8161B9122o2218K5461N1423J43942r0367q6125o0734n4740J8431l9783N2793O9126
8149c669L8693r7573j4649p4506j6591N2226Q6456K3985N9627Q3655R560m7089
8137A00125o8676o0856N2089m9441q4827N6136k029J9860K0580M6061J2248J9889
8125F1159l0703Q4248J06618k9317j29439M6551m6867q3648L3850j38501M1083
$$ plain form
8207 -245245 -29789 217564 271149 213830 115504 2945 37705 48784 76358 8179 -47134
8196 -47134 -70719 -99448 -93742 17590 46110 126766 133794 105156 37234 -7613 33733 188203
8184 188203 173100 41689 -42796 36829 -34460 -34712 -56110 -124058 -174035 -153870 -108345 -124102
8172 -124102 17832 142529 162503 142889 1946 -69648 -84699 79919 130102 55631 29122
8161 29122 -33096 -7635 43788 187730 97363 11238 -49496 -104236 -85805 -125588 -72795 -3669
8149 -3669 35024 -62549 -77198 -151704 -168295 -116069 -29613 -5628 53999 137654 147214 100125
8137 100125 31449 -29407 22682 -26759 -111586 -55450 -57479 -37619 -17039 29022 41270 61159
8125 61159 30456 114704 221322 192005 62566 109117 62250 -21398 12452 -126049 -84966
8114h4966L5473n830L3819k6897o4758p1157Q3687R2511Q1523m7236r1692l2683
8102i8206n3382P8706L3562O2552j50311m7385K9792L8774p147K8007n2876o7452
8090b05366J69552R0539r466j399k9514l2258M5642L6807M5910j5093n9749j22829
8078h7224k3230N1329L2462P1374j52404K1335N0978L8335N9335r7218r2026n9128
8066a86082O0772K9180M6254P1532k5464k7884J02168J28581j16023n8347K254
8055B6941m2328n8009l4462L5107O8708N9742N3418q9799j0267m3592l2158j53506
8043b20205j11559L2129J22457j4232q2398J59096O7127J8213M5318O3109m3754
8032C5301j02814K9997l6301K5631P3279L4597m6895K8853N0905o1954r104p1752
$$ plain form
8114 -84966 -49493 -55323 -21504 -48401 -113159 -184316 -100629 -8118 73405 26169 -65523 -98206
8102 -98206 -151588 -72882 -39320 23232 -127079 -174464 -144672 -105898 -113045 -85038 -137914 -205366
8090 -205366 -35814 54725 45259 43860 14346 -17912 27730 64537 110447 95354 35605 -87224
8078 -87224 -110454 -59125 -26663 44711 -107693 -86358 -35380 2955 62290 -34928 -126954 -186082
8066 -186082 -125310 -96130 -49876 21656 -3808 -31692 70476 199057 83034 24687 26941
8055 26941 -15387 -73396 -107858 -72751 -4043 55699 109117 19318 9051 -34541 -66699 -220205
8043 -220205 -331764 -299635 -177178 -191410 -273808 -114712 -47585 -29372 15946 79055 35301
8032 35301 -67513 -37516 -73817 -48186 25093 59690 12795 41648 92553 30599 21495 -50257
8020e0257l1785M6495r669J18130R1126l6173k9752K332j4956K7289m3213l104
8008F6463j02056j4636O1268O2272L4515J12614l6664p022k2568n4693m1270o3434
7996e211M309P0575O961l4803m4256k7885l4176L1730M8235j00936j427J15998
7984B9114j7604j44982M3507R0397M41J48222Q0236l7047m1091J6957P4175Q2849
7972C25174j5683k28269q3721r3890l3556P6226j02146j9951N6526m5248J07648
7961e6890N9189J9338J02953K0421j21713Q0614M9572r3146j23918n3055r6839
7950b13474P9174J44784K2436o8686J5137P8463K6504o6681j69457j45327k2855
7939c19982O6229R8767P6209N9924m5015L4000O9607Q0507j0132j08928r1733
$$ plain form
8020 -50257 -82042 -35547 -45216 72914 164040 127867 98115 100447 85491 112780 69567 66463
8008 66463 -35593 -50229 11039 73311 107826 220440 183776 176754 154186 99493 58223 -5211
7996 -5211 -902 69673 76634 41831 -2425 -30310 -64486 -32756 15479 -85457 -86884 29114
7984 29114 11510 -133472 -89965 432 873 149095 229331 192284 151193 168150 242325 325174
7972 325174 309491 81222 -2499 -96389 -129945 -53719 -155865 -175816 -119290 -164538 -56890
7961 -56890 2299 21637 124590 145011 23298 103912 153484 60338 -63580 -116635 -213474
7950 -213474 -134300 10484 32920 -35766 -20629 57834 84338 17657 -151800 -297127 -319982
7939 -319982 -253753 -154986 -78777 -18853 -63868 -29868 39739 120246 110114 1186 -90547
7928i0547q8353j36187M1463J54456j3394l0629m754Q0458J32433J383J03450
7917A49779p7091r1854j8039K4948L3948l5467M4504O0968j4247o6763l4952o8741
7905i3007J37448M621K2767N3306O7899M6337n2203j43410j4510K4472L3661j32172
7893d4791M008J293K8158R2806n5007l4984q6935n0203J3709O4669K9622K3911
7881a3744l6301J3413N3675Q2378m0611n9250l7060q4102O1213k373l1878K0882
7869g3758m6106J36933K5577n3303j9244l4700J53019O7340k0059J8873j6269
$$ plain form
7928 -90547 -178900 -315087 -273624 -119168 -132562 -163191 -167945 -87487 44946 46329 149779
7917 149779 72688 -19166 -37205 -12257 21691 -13776 30728 91696 77449 10686 -24266 -93007
7905 -93007 44441 49062 71829 125135 193034 239371 187168 43758 29248 53720 87381 -44791
7893 -44791 -40783 -39490 -11332 81474 26467 -8517 -95452 -145655 -131946 -67277 -37655 -13744
7881 -13744 -50045 -36632 17043 99421 58810 -440 -37500 -121602 -60389 -62762 -94640 -73758
7869 -73758 -119864 17069 42646 -10657 -29901 -64601 88418 155758 135699 154572 138303
$$ [...]
##END NTUPLES=NMR SPECTRUM
##END=
