##TITLE=Analysis number 318808
Compound Code ac 29196
Project Code adrs
Chemist Name georganics
##JCAMPDX= 6.0         $$ Bruker NMR JCAMP-DX V2.0
##DATA TYPE= NMR SPECTRUM
##DATA CLASS= NTUPLES
##ORIGIN= Bruker BioSpin GmbH
##OWNER= nmr
$$ XWIN-NMR		Version 3.5
$$ Tue Apr 18 14:56:36 2006 GMT Daylight Time (UT+1h)  MAYBRIDGE\nmr@NMR_250MHZ
##.OBSERVE FREQUENCY= 250.131544655141
##.OBSERVE NUCLEUS= ^1H
##.ACQUISITION MODE= SIMULTANEOUS (DQD)
##.ACQUISITION SCHEME= undefined
##.AVERAGES= 16
##.DIGITISER RES= 18
##SPECTROMETER/DATA SYSTEM= dpx250
##.PULSE SEQUENCE= zg30
##.SOLVENT NAME= DMSO
##.SHIFT REFERENCE= (INTERNAL, DMSO, 0, 16.522)
##AUDIT TRAIL= $$ (NUMBER, WHEN, WHO, WHERE, WHAT)
$$ ##TITLE= Audit trail, XWIN-NMR		Version 3.5
$$ ##JCAMPDX= 5.01
$$ ##ORIGIN= Bruker BioSpin GmbH
$$ ##OWNER= nmr
$$ C:\u/data/dgb/nmr/ADRS/2730/pdata/1/auditp.txt
$$ ##AUDIT TRAIL=  $$ (NUMBER, WHEN, WHO, WHERE, WHAT)
(   1,<2006-04-18 14:56:10.14 +100>,<MAYBRIDGE\nmr>,<NMR_250MHZ>,
      <created by zg, POWCHK disabled, PULCHK disabled
       configuration hash MD5:
       84 BC 41 DB A1 6E 1D 46 DA 25 12 A5 C1 ED C5 3A
       data hash MD5: 64K
       08 DB A6 08 41 8D A8 EC 81 A7 75 72 45 F8 2A C2>)
(   2,<2006-04-18 14:56:28.09 +100>,<MAYBRIDGE\nmr>,<NMR_250MHZ>,
      <Start of raw data processing
       ef LB = 0.3 FT_mod = 6 PKNL = 1 SI = 32K 
       data hash MD5: 32K
       46 BA 02 95 A7 42 85 88 2B 67 02 F5 59 D9 5E E7>)
(   3,<2006-04-18 14:56:29.70 +100>,<MAYBRIDGE\nmr>,<NMR_250MHZ>,
      <apk 
       data hash MD5: 32K
       1E C7 65 10 23 83 B8 F1 E5 FA 72 EE 86 12 7A F6>)
(   4,<2006-04-18 14:56:30.53 +100>,<MAYBRIDGE\nmr>,<NMR_250MHZ>,
      <abs ABSG = 5 
       data hash MD5: 32K
       46 95 FA CE F3 F8 84 70 9D 84 D0 A1 2A 02 A1 4B>)
$$ ##END=
$$ 
$$ hash MD5
$$ BA 9A 87 98 2F F5 F2 5C 64 09 A1 0C B5 DB A6 32
##$RELAX= 
##$RELAX= 
##$RELAX= 
##$RELAX= 
##$RELAX= 
##$RELAX= 
##$RELAX= 
$$ Bruker specific parameters
$$ --------------------------
##$DU= <C:\u>
##$EXPNO= 2730
##$NAME= <ADRS>
##$PROCNO= 1
##$TYPE= <nmr>
##$USER= <dgb>
##$AMP= (0..31)
100 100 100 100 100 100 100 100 100 100 100 100 100 100 100 100 100 100 
100 100 100 100 100 100 100 100 100 100 100 100 100 100 
##$AQSEQ= 0
##$AQ_mod= 3
##$AUNM= <au_zg>
##$AUTOPOS= <55 >
##$BF1= 250.13
##$BF2= 250.13
##$BF3= 250.13
##$BF4= 250.13
##$BF5= 500.13
##$BF6= 500.13
##$BF7= 500.13
##$BF8= 500.13
##$BYTORDA= 1
##$CFDGTYP= 0
##$CFRGTYP= 5
##$CHEMSTR= <none>
##$CNST= (0..31)
1 1 145 1 1 1 1 1 1 1 1 1 1 1 1 1 1 1 1 1 1 1 1 1 1 1 1 1 1 1 1 1 
##$CPDPRG= <>
##$CPDPRG1= <>
##$CPDPRG2= <>
##$CPDPRG3= <>
##$CPDPRG4= <mlev>
##$CPDPRG5= <mlev>
##$CPDPRG6= <mlev>
##$CPDPRG7= <mlev>
##$CPDPRG8= <mlev>
##$CPDPRGB= <>
##$CPDPRGT= <>
##$D= (0..31)
0 1 0 0 0 0 0 0 0 0.06 0 0 0 0 0 0 0.0002 0 0 0 0 0 0 0 0 0 0 0 0 0 0 
0 
##$DATE= 1145368567
##$DBL= (0..7)
120 120 120 120 120 120 120 120 
##$DBP= (0..7)
150 150 150 150 150 150 150 150 
##$DBP07= 0
##$DBPNAM0= <>
##$DBPNAM1= <>
##$DBPNAM2= <>
$$ [...]
##$SUBNAM7= <"">
##$SUBNAM8= <"">
##$SUBNAM9= <"">
##$SW= 20.6930455092707
##$SWIBOX= (0..15)
0 0 3 0 0 0 0 0 0 0 0 0 0 0 0 0 
##$SW_h= 5175.983436853
##$TD= 65536
##$TD0= 1
##$TE= 294.16
##$TE2= 300
##$TE3= 300
##$TEG= 300
##$TL= (0..7)
0 120 120 120 120 120 120 120 
##$TP= (0..7)
150 150 150 150 150 150 150 150 
##$TP07= 0
##$TPNAME0= <>
##$TPNAME1= <>
##$TPNAME2= <>
##$TPNAME3= <>
##$TPNAME4= <>
##$TPNAME5= <>
##$TPNAME6= <>
##$TPNAME7= <>
##$TPOAL= (0..7)
0.5 0.5 0.5 0.5 0.5 0.5 0.5 0.5 
##$TPOFFS= (0..7)
0 0 0 0 0 0 0 0 
##$TUNHIN= 0
##$TUNHOUT= 0
##$TUNXOUT= 0
##$USERA1= <user>
##$USERA2= <user>
##$USERA3= <user>
##$USERA4= <user>
##$USERA5= <user>
##$V9= 5
##$VALIST= <valist>
##$VCLIST= <CCCCCCCCCCCCCCC>
##$VD= 0
##$VDLIST= <DDDDDDDDDDDDDDD>
##$VPLIST= <PPPPPPPPPPPPPPP>
##$VTLIST= <TTTTTTTTTTTTTTT>
##$WBST= 1024
##$WBSW= 4
##$XGAIN= (0..3)
0 0 0 0 
##$XL= 0
##$YL= 0
##$YMAX_a= 343169
##$YMIN_a= -419115
##$ZGOPTNS= <>
##$ZL1= 120
##$ZL2= 120
##$ZL3= 120
##$ZL4= 120
##$ABSF1= 16.522
##$ABSF2= -4.171173
##$ABSG= 5
##$ABSL= 3
##$ALPHA= 0
##$AQORDER= 0
##$ASSFAC= 0
##$ASSFACI= 0
##$ASSFACX= 0
##$ASSWID= 0
##$AUNMP= <proc_1d>
##$AZFE= 0.1
##$AZFW= 0.1
##$BCFW= 0
##$BC_mod= 0
##$BYTORDP= 0
##$COROFFS= 0
##$CY= 12.5
##$DATMOD= 1
##$DC= 0
##$DFILT= <>
##$DTYPP= 0
##$F1P= 14.0000005364418
##$F2P= -0.99999901652339
##$FCOR= 0.5
##$FTSIZE= 32768
##$FT_mod= 6
##$GAMMA= 0
##$GB= 0
##$INTBC= 1
##$INTSCL= 1
##$ISEN= 128
##$LB= 0.3
##$LEV0= 0
##$LPBIN= 0
##$MAXI= 10000
##$MC2= 0
##$MEAN= 0
##$ME_mod= 0
##$MI= 0
##$NCOEF= 0
##$NC_proc= -5
##$NLEV= 6
##$NOISF1= 0
##$NOISF2= 0
##$NSP= 0
##$NTH_PI= 0
##$NZP= 0
##$OFFSET= 16.522
##$PC= 1
##$PHC0= 160.2703
##$PHC1= 13.03964
##$PH_mod= 1
##$PKNL= yes
##$PPARMOD= 0
##$PSCAL= 4
##$PSIGN= 0
##$REVERSE= no
##$SF= 250.13
##$SI= 32768
##$SIGF1= 0
##$SIGF2= 0
##$SINO= 400
##$SIOLD= 32768
##$SREGLST= <1H.DMSO>
##$SSB= 0
##$STSI= 32768
##$STSR= 0
##$SW_p= 5175.98343685301
##$SYMM= 0
##$S_DEV= 0
##$TDeff= 65536
##$TDoff= 0
##$TI= <Analysis number 999999
Compound Code 99
Book Reference 9
Project Code 9>
##$TILT= no
##$TM1= 0
##$TM2= 0
##$TOPLEV= 0
##$USERP1= <user>
##$USERP2= <user>
##$USERP3= <user>
##$USERP4= <user>
##$USERP5= <user>
##$WDW= 1
##$XDIM= 32768
##$YMAX_p= 416007997
##$YMIN_p= -686195
$$ End of Bruker specific parameters
$$ ---------------------------------
##NTUPLES= NMR SPECTRUM
##VAR_NAME=  FREQUENCY,     SPECTRUM/REAL,   SPECTRUM/IMAG
##SYMBOL=    X,             R,               I
##VAR_TYPE=  INDEPENDENT,   DEPENDENT,       DEPENDENT
##VAR_FORM=  AFFN,          ASDF,            ASDF
##VAR_DIM=   32768,         32768,           32768
##UNITS=     HZ,            ARBITRARY UNITS, ARBITRARY UNITS
##FACTOR=    0.157963299565203, 1,           1
##FIRST=     4132.6476996994, 0,             0
##LAST=      -1043.33573715361, 0,           0
##MIN=       -1043.33573715361, -686195,     0
##MAX=       4132.6476996994, 416007997,     0
$$ Real data points
##PAGE= N=1
##DATA TABLE= (X++(R..R)), XYDATA
$$ [...]
27596 10378744 10345275 10308729 10297824 10099343 10107268 10078522 9967180 10137567 10234097 10249665 10350308
27585 10350308 10553557 10486080 10390094 10355685 10535713 10816327 10848412 10604403 10515795 10750649
27575 10750649 10805946 10855733 10819957 10629587 10539474 10536205 10414108 10378113 10341026 10657203 10891219
27564 10891219 10817858 10816322 10862522 10875568 10884633 10883811 10949256 10924723 10891708 10849814 11000447 11083990
27552 11083990 11226790 11222591 11175650 11021689 10923098 10981903 11068480 10897778 10945951 10989141 10957064
27541 10957064 10929393 11000266 11022736 11026326 11159651 11203660 11214768 11112688 11119861 11125425 11198665
27530 11198665 11259558 11295926 11297890 11356192 11322210 11035154 10835009 10784073 10852819 11103283 11124986
27519 11124986 11099413 11057426 10993246 11048462 11180774 11159420 11206596 11239070 11230198 11164758 11258574
27508 11258574 11367794 11358469 11300736 11271464 11180042 11103205 11250910 11305582 11303701 11290008 11259858
27497 11259858 11320452 11368525 11242013 11170204 11324582 11411957 11334928 11308508 11258724 11352968 11188875
27486 11188875 11053455 11209815 11202009 11167119 11360174 11520431 11559814 11410384 11281921 11218412
27476 11218412 11141521 11230260 11153944 11088631 11174276 11099413 11054097 11013453 11030943 10914443 10894029
27465 10894029 11033852 11112437 11341862 11424949 11328273 11334445 11238141 10981721 10916508 10908814 10980764
27454 10980764 11026481 11013584 10923340 10806370 10815643 10851495 10736140 10607027 10695234 10835302
27444 10835302 10874790 10767549 10650257 10582063 10538825 10536464 10687988 10884479 10822398 10561846
27434 10561846 10451603 10509539 10451363 10319321 10178878 10129553 10182508 10416591 10495192 10308650
27424 10308650 10327667 10398084 10627473 10719685 10495791 10276488 10222258 10131674 10060196 10081526
27414 10081526 9934120 10091873 10164516 10088062 10081146 10165098 10160126 10128976 10021911 9942585 9976293
27403 9976293 10032467 9972325 9816403 9732499 9681138 9616363 9533637 9413749 9546808 9602343 9642649
27392 9642649 9606886 9572680 9513917 9567378 9543191 9467328 9500562 9476192 9422153 9456133 9348185
27381 9348185 9372833 9188056 8910837 9015582 9297474 9331867 9355170 9241158 9258433 9062924
27371 9062924 9074240 9032602 9002729 8842783 8754344 8784663 8862690 8960048 8921167 8979623 8900740
27360 8900740 8758453 8751178 8791587 8800480 8829992 8702023 8637560 8754891 8921166 8903255 8688625
27349 8688625 8617129 8785389 8634228 8549237 8430998 8267128 8390295 8493086 8560873 8459948
27339 8459948 8394818 8231097 8244800 8301660 8272306 8271389 8293063 8277420 8328248 8291636 8182942
27328 8182942 8171009 8052250 7793986 7756534 7785527 7857349 7973961 7933146 7903484 7899178 7957375
27317 7957375 7862450 7786794 7790136 7667793 7521620 7442271 7553588 7541777 7423265 7361788 7310262
27306 7310262 7435154 7458471 7499185 7370221 7274099 7242629 7242451 7286061 7199711 7047243 7056891
27295 7056891 7014582 7046271 7140345 7200821 7133220 7067539 6958346 6887785 6916174 6808349 6690431
27284 6690431 6813197 6987677 6822479 6695847 6719731 6773141 6747589 6727374 6788620 6702814
27274 6702814 6520288 6537497 6608385 6702338 6622896 6515424 6479686 6412809 6433114 6548917 6681979
27263 6681979 6521393 6411050 6222124 6079729 6114578 6000875 5906617 6034786 6016406 5880019
27253 5880019 5969352 6023542 6162186 6340909 6155393 6068684 6186590 6104262 5998023 6224512
27243 6224512 6065353 6037847 5975448 5817067 5823870 5870938 5800246 5690438 5550805 5523264 5588148
27232 5588148 5809512 5882256 5807522 5800362 5817488 5877877 5802053 5746301 5548609 5349158 5427423
27221 5427423 5450842 5256504 5232755 5224488 5213533 5278067 5378392 5510431 5551074 5417587 5249766
27210 5249766 5147349 4936215 4910034 4820292 4948355 5090309 5002166 5066293 5107360 5010739
27200 5010739 4790221 4656836 4839047 4965100 4985084 4891031 4950180 4896809 4776596 4863795
27190 4863795 4864815 4878056 4855960 4805523 4701348 4688226 4785009 4750382 4687793 4597066 4498983
27179 4498983 4540282 4594806 4592484 4646874 4821121 4960356 4968954 4798003 4780247 4802058 4782469
27168 4782469 4867483 4808697 4757546 4681534 4641904 4627067 4794246 4693912 4483612 4294310
27158 4294310 4106954 3974441 4169436 4245695 4075705 4041136 4129467 4232316 4354517 4347410
27148 4347410 4210529 4107931 4121733 4161018 4205863 4369104 4325983 4199002 4085119 4160802
27138 4160802 4126977 4307691 4321098 4114060 4067527 4079238 4000218 4133125 4088465 3995980 3926646
27127 3926646 3996232 3983133 4001476 3776985 3659469 3624118 3575809 3525927 3607431 3827388 3824610
27116 3824610 3776802 3701258 3567273 3559860 3548310 3518301 3720010 3800323 3691672 3673155 3548224
27105 3548224 3567585 3737230 3714040 3761608 3779083 3759958 3712784 3444027 3503529 3570166 3598553
27094 3598553 3703538 3792169 3701907 3599118 3534222 3381566 3378332 3466321 3429444 3366361 3385560
27083 3385560 3390565 3437454 3474536 3367288 3219932 3227122 3326547 3262593 3388059 3166136 3102773
27072 3102773 3207280 3286224 3259931 3240572 3106232 3117356 3285801 3378261 3436934 3400245 3385601
27061 3385601 3240535 3267226 3250214 3262568 3348171 3260718 3152314 3027614 2921912 2776316
27051 2776316 2940989 3102074 3099457 2852630 2746051 2870543 3068677 3022492 2860520 2863364
27041 2863364 3003732 2886644 2764984 2918526 3046621 2992035 2748736 2822364 3009177 2957559
27031 2957559 2952068 2869423 2976360 3111233 3001388 2916919 2844684 2929678 2901153 2826857 2739328
27020 2739328 2715969 2617564 2638575 2524106 2531128 2699193 2767697 2880662 2787993 2639673 2705293
27009 2705293 2814232 2692279 2634989 2592025 2647826 2766808 2863198 2797492 2744914 2523067
26999 2523067 2534685 2637388 2678079 2564984 2522633 2528488 2522012 2532026 2540969 2526054 2416327
26988 2416327 2276859 2344947 2472940 2581586 2582010 2516527 2579120 2669954 2534300 2509518 2343982
26977 2343982 2278140 2264611 2289967 2139481 2329951 2544110 2536529 2400305 2434475 2464334 2492952
26966 2492952 2486847 2519619 2646650 2675424 2742226 2656177 2577636 2458476 2184318 2135440 2152038
26955 2152038 2176068 2092073 2054663 2189387 2195579 2128997 2085657 1963927 2040354 2081449 2061370
26944 2061370 2036772 2107469 2213427 2298922 2379871 2366661 2373872 2254555 2115385 2068506 2141818
26933 2141818 2267493 2268506 2163564 2195158 2123718 1917256 1870525 2045890 2193706 2056332
26923 2056332 2000914 1972955 2042405 2310222 2386820 2386652 2228057 1942621 2016882 2042253 2039675
26912 2039675 2103667 2061245 1944837 2050519 2044640 2006478 1923233 2014040 2056235 2124565 2180262
26901 2180262 2227328 2281733 2212247 2174559 2137828 2187503 2040881 1880719 1799290 1880908 1920013
26890 1920013 2034636 2017514 2039492 1821713 1838145 1954714 2049327 1858970 1800454 1925109
26880 1925109 1941045 1867419 1789036 1711639 1550111 1734804 1854308 1766245 1865750 1792952 1756294
26869 1756294 1817555 1626034 1602003 1757119 1851356 1777604 1701669 1747453 1842864 1919876 1884467
26858 1884467 1924167 1667201 1556093 1690312 1610744 1590265 1579578 1665153 1574590 1526962 1533468
26847 1533468 1518716 1480142 1321326 1233481 1522695 1806352 1724273 1612940 1404636 1403797 1523941
26836 1523941 1578816 1507765 1512915 1467606 1352609 1328557 1258185 1420557 1648444 1571824 1512119
26825 1512119 1598109 1516588 1555582 1660372 1629640 1695861 1603210 1512996 1353261 1370766 1380688
26814 1380688 1551920 1432371 1422517 1578115 1721649 1818839 1658503 1459560 1364528 1276469
26804 1276469 1171836 1238445 1450355 1573591 1542459 1511985 1484972 1406915 1283281 1209752
26794 1209752 1143579 1301135 1430093 1508017 1537161 1435419 1359559 1231715 1180891 1291024
26784 1291024 1434232 1419245 1506164 1546372 1574554 1415617 1471362 1463323 1402475 1297706 1421476
26773 1421476 1500439 1510907 1500241 1444472 1359292 1270356 1503143 1535156 1407587 1299357 1412979
26762 1412979 1467371 1412970 1371631 1388706 1327824 1357090 1464068 1404996 1300103 1224938 1305889
26751 1305889 1315150 1319326 1258423 1201844 1188175 1140498 1093849 1079487 1119714 1176608 1209137 1051458
26739 1051458 1167825 1234334 1099898 1122870 1308638 1315853 1271205 1381562 1433964 1323324
26729 1323324 1145009 1110429 1177962 1237850 1323071 1253744 1055638 986137 965170 1013783 1104028
26718 1104028 1116103 984818 927253 988408 906927 1041811 1068293 1024553 906171 796856
26708 796856 793471 917322 934349 835816 1042159 1161158 1120015 1222622 1322549 1161502 1124641
26697 1124641 1185432 1242676 1272358 1269530 1208582 1275920 1179632 1035956 1016076 961241 1141192
26686 1141192 1311770 1174727 1214727 1312829 1247570 1141517 1034863 937800 944483 1084123
26676 1084123 1302971 1457093 1450445 1605117 1538028 1291247 1202693 1177254 1129543 1158695 1357939
26665 1357939 1389362 1321567 1329891 1296094 1203095 1322808 1306587 1294808 1190667 1023446 1058057
26654 1058057 1081784 927111 888221 989509 1080871 1160557 1215595 983321 835916 792095
26644 792095 906428 1022978 912887 890521 891112 1104924 1211927 1266835 1134762 944754
26634 944754 933198 805358 647594 695401 950242 1088521 957156 805596 843066 761361
26624 761361 762105 1014839 1063736 1079820 1011263 1087811 1086088 1026578 1101439 1134259 1024456 1005149
26612 1005149 969617 1052836 991420 855064 861277 833599 886162 1128638 1088532 926445 1060088
26601 1060088 1240841 1083316 1132961 1129712 1176075 1181391 1130036 931835 952951 1117529 993886
26590 993886 885859 908930 1099994 1028319 871081 782947 728850 896454 954979 988254 923848
26579 923848 819279 792568 821659 795305 818097 788470 784771 911642 1107036 1146174 869166
26568 869166 888471 981506 766106 715806 931176 952579 868582 917638 829825 664004 565969
26557 565969 700795 744701 783400 733677 879158 846295 781588 788226 891917 830696 878929
26546 878929 987757 1146284 1215417 1221311 1264747 1275545 1223207 1135033 1014758 1002375 1186267
26535 1186267 1197752 1089419 933632 934002 811581 663661 696103 549112 561521 619607 790805
26524 790805 825831 804192 656217 512110 505228 524250 464783 420829 459247 563904 700646
26513 700646 876425 807502 701121 738536 778856 817586 782983 884297 1076241 939626
26503 939626 678941 589923 813250 941666 973240 922983 868808 833343 989709 978613 730795
26492 730795 565015 606508 629643 626704 720454 782779 807422 961978 1014371 1015418 1078469
26481 1078469 924750 926941 850878 807168 648104 572069 633149 630915 514059 445223 400377
26470 400377 610226 739701 746923 711886 793332 916878 917524 839662 797825 838393 877450
26459 877450 891621 812360 795189 1042300 875329 641876 645264 654168 632404 715790 882642
26448 882642 940690 827173 803820 807844 621163 685829 766421 819642 928409 877965 868263
26437 868263 693894 591383 482701 386283 313895 311063 430003 584206 632305 769939
26427 769939 820770 760280 571782 627330 842315 856154 721077 614299 388212 451954
26417 451954 648588 737445 695641 780727 796212 767526 834100 902378 734640 694555 756466
26406 756466 727014 649472 619704 787513 914281 681920 717986 917809 854282 791545 914141
26395 914141 879880 694164 543417 640117 727921 797374 922050 925717 835810 773911 586967
26384 586967 532048 523141 659795 691142 851146 886035 862226 797644 583127 517710 498344
26373 498344 452268 524619 747623 904794 820922 804385 798227 728305 555377 708870 632248
26362 632248 536562 566030 641255 538374 668424 925069 786649 802320 860075 932050 779761
26351 779761 709425 785030 858471 869246 921015 826620 926347 989424 845921 660466 730432
26340 730432 824743 1040399 1080014 922603 698684 526064 381766 448429 504330 419251
26330 419251 419341 465513 460456 501915 615818 678263 580102 580454 757316 932666 984502 840505
26318 840505 595210 697407 789984 606813 681568 812071 747505 825998 818768 732055 755098
26307 755098 579986 656487 517807 593843 756565 924823 942229 837225 633299 435691
26297 435691 341526 545916 748547 720877 696731 724385 637226 548619 527410 682751 746014
26286 746014 612136 666997 752413 802760 668657 575148 517088 483701 477104 469296 394159
26275 394159 394421 565421 479478 557985 518082 512335 587748 463139 512327 849408 923435
26264 923435 812614 675893 452717 389725 493688 616431 632763 585848 604700 600118 524240
26253 524240 588181 553945 624662 857577 999501 957895 848952 848643 814469 794222 725162
26242 725162 698847 715414 656615 447338 345647 369237 422684 535474 701246 856304
26232 856304 803481 685998 575280 572365 638207 430281 393354 483365 342799 254863 354591
26221 354591 339603 375630 352032 420685 515068 551265 362675 401284 492128 535390 532708
26210 532708 508783 481225 409520 492616 516211 497409 513662 423500 292040 236373 330924
26199 330924 426531 433420 237971 192824 305576 449253 515274 400310 468920 566271 530782
26188 530782 399328 330251 463012 376494 180774 174018 326749 315936 372933 509152 436649
26177 436649 303341 338793 454127 496358 398708 472190 654522 668134 724627 617124 485044
26166 485044 474940 464918 435404 599185 508592 414362 405198 409888 443658 569460 552852
26155 552852 504911 426567 342809 287854 369346 555214 518916 336983 134956 45683 -72471
26144 -72471 -55566 26950 169391 357089 290795 236087 377158 488649 632072 565096 534364
26133 534364 605711 623045 418758 259671 318201 340722 290603 147208 115203 112758 122784
26122 122784 225298 257681 399298 479721 510880 338884 287511 304857 383615 379121 319849
26111 319849 463724 556960 580625 369766 398803 304049 45884 43608 304093 379626 560578
26100 560578 527475 413543 440643 479219 428110 374215 309498 299408 327048 442312 433086
26089 433086 301323 184841 314584 373110 450422 461110 476496 364184 318063 241724 137643
26078 137643 156200 322098 331060 215115 311298 352548 314556 209556 181319 408736 437876
26067 437876 450282 505975 399957 335729 261377 342409 359422 298041 258224 288487 214028
26056 214028 196541 131592 270431 520928 495513 335538 206867 207582 53967 23576 3290
26045 3290 40075 128483 151346 220032 231843 240234 220143 321428 171980 20102 155403
26034 155403 440718 542620 464956 371686 422670 439032 229955 64810 -58352 31143
26024 31143 -44288 60769 134581 41495 157933 163481 227035 215448 109251 21616 -112743
26013 -112743 69214 129647 263371 311385 361234 212724 69529 -4739 -140906 -28160
26003 -28160 225737 440782 489128 435517 258838 148429 279248 267736 385472 407866
25993 407866 376121 486300 440985 309209 382751 333260 273157 427849 520829 417040 362908
25982 362908 259903 135135 220178 180133 257927 302800 388750 344646 426054 266926 86771
25971 86771 253140 333799 371352 304063 411002 469612 397442 259076 67753 76438 205492
25960 205492 276491 310468 335752 340921 342734 373602 418654 304290 314174 300156 414629 567651
25948 567651 554416 526285 505613 381608 338578 293104 261996 224807 100541 199623 270871
25937 270871 209018 -4463 8170 84907 205747 325828 401969 308563 190634 265981 292323
25926 292323 234098 178902 127948 260113 546372 483989 415030 468831 381052 333958 260240
25915 260240 94110 152746 120037 98809 128894 213772 160830 211404 293603 342504 217518
25904 217518 209042 352340 659471 845801 690718 364554 288278 363298 430017 356113 262874
25893 262874 301027 360598 247674 177076 321714 297491 225893 395904 434804 406995 366088
25882 366088 234260 164807 111472 129277 337184 355113 340161 354922 461098 433245 401030
25871 401030 219165 137750 249804 228458 136201 235083 268096 48113 -77387 -7873 152156
25860 152156 345061 447508 401188 177542 38084 -23183 -135286 -173011 2036 109913
25850 109913 142247 90976 -19379 -145955 -100652 37939 89884 328830 452742 255920
25840 255920 -10286 -5999 25948 132111 267050 330584 128664 -110856 -63216 -74910 14250
25829 14250 60120 81877 -75094 -91695 74355 189548 224727 103564 154301 204253 213482
25818 213482 146955 115779 64969 84383 4803 72688 113823 71035 59281 24516 47783
25807 47783 -84712 63229 168561 10148 70842 10555 23004 130177 66467 -2912 109952
25796 109952 334366 225734 56903 37625 -12826 -95696 -231616 -150205 -241301 13275
25786 13275 205362 150374 181042 236022 312510 159698 44371 121768 162458 290056 407238
25775 407238 554291 546451 409946 409215 142624 22036 -26012 -82906 -3539 31790 91191
25764 91191 -61014 -65148 118453 167550 180764 -34526 -25065 164126 209480 167314 80592
25753 80592 -7900 57980 66510 119830 147261 97123 61052 140726 218892 170062 232663 367943
25741 367943 334897 97954 63260 117239 196531 38312 2618 208277 324971 282141 173708
25730 173708 160773 94845 -10610 62976 194698 325557 337691 348709 245029 193164 212558
25719 212558 151101 124500 -109344 -95752 6718 -122981 -94367 82393 197508 203050 263603
25708 263603 266032 287254 346241 360363 399203 304562 276517 227562 236101 311546 403529 279890
25696 279890 100950 94839 263300 266104 220189 172627 164143 196244 140139 8100 -110740
25685 -110740 -9596 33355 24043 -115908 -5982 147983 54892 187641 235092 183242 55844
25674 55844 57265 225080 85797 6760 243835 270929 109015 -1524 -24210 220048 370101
25663 370101 381490 304260 135789 31079 100166 173509 825 -261646 -126669 92235
25653 92235 178419 49703 134887 99219 100005 198122 137629 65922 75749 -58275 -192374 -22196
25641 -22196 72644 -100488 -275093 -145486 -33505 -34850 92189 118955 113261 199523 241140
25630 241140 90347 -2156 202277 347750 333577 370009 423131 401560 487252 641609 677259
25619 677259 481145 251180 58065 77632 180599 203007 109701 -48883 -74195 -3938
25609 -3938 59485 117364 295974 218535 146554 109607 82538 172169 171591 148224 5526 130330
25597 130330 31611 62746 7533 104079 160871 8284 108447 40637 999 -36538 36136
25586 36136 174821 219780 249553 278245 288523 351888 217955 337945 387048 369214 279810
25575 279810 175536 55354 26798 -105654 26599 85642 113967 -13181 157429 368677
25565 368677 164271 -78178 -138457 -242063 -266188 -191895 -20598 179422 180467 203203 266463
25554 266463 227770 280112 154793 22937 139454 153915 235646 169661 147913 220907 304472
25543 304472 429228 402764 445296 417944 280884 203384 107974 349238 359975 101048 2894
25532 2894 82847 60638 91614 85454 24522 92376 278500 269031 288454 162753 112094 5320
25520 5320 41829 198253 259694 292069 196312 116867 107362 142614 124896 15689 91842 252312
25508 252312 50515 -144329 -87703 61202 272904 283388 258048 242664 -10677 -162893
25498 -162893 -44842 -43022 -56345 -115908 -105145 -237929 -112458 -39577 19650 82706 189825
25487 189825 250613 45657 144326 137937 221881 289184 393260 247186 6766 20450 86329
25476 86329 195379 263230 199255 7015 -52665 -36412 -3380 -4189 -61332 -36794 13541 -65233
25464 -65233 -176473 -62929 157636 168149 188962 147095 -92203 -101571 -26809 -37296 -6145
25453 -6145 -125523 -68077 -35589 103442 213185 147139 39464 67599 130202 194927 162066
25442 162066 128930 -103261 -169660 -144379 -174802 -78773 1686 71599 110255 20718 -27683
25431 -27683 45261 64837 92688 100044 15731 52939 -86577 -192262 -228274 -121678 15842
25420 15842 -40293 38103 128887 93836 25218 -147391 -71269 -27673 -71729 -39212 87079
25409 87079 120079 91706 83295 -29403 -135453 -99640 37922 77008 67379 148384 403887
25398 403887 439912 271751 279222 195449 210018 79801 139494 32999 163791 186492 188581
25387 188581 120101 213977 91051 -24300 -35713 -20570 105293 156290 70056 227237 399926
25376 399926 339360 262623 354586 267533 -13609 -48018 67438 139368 86650 62040 -44681
25365 -44681 -127826 -80012 -128470 -187437 -203661 -10783 156144 407473 385486 319757 218602
25354 218602 128544 128685 7369 -97989 -51260 -67717 -161669 23930 189563 105427 7187
25343 7187 31744 53164 228233 275192 304353 245724 168526 113401 169435 169847 160154 217641
25331 217641 271875 355771 138970 -3701 125528 254482 269473 302614 208940 129723 69078
25320 69078 -161915 -150350 -95551 -14787 76372 43427 -64015 -198237 -97491 2837 203725
25309 203725 192564 138575 204930 113952 132975 119678 -56431 85108 244377 112954 104884
25298 104884 174820 67278 -177607 -128229 -31561 -80136 -184863 -121672 -69213 9071 122276
25287 122276 248410 135363 -20782 -121668 -70066 85002 251512 173759 189361 243056
25277 243056 78655 194068 204237 30215 64243 86188 173647 76592 75032 -4638 -64849
25266 -64849 -15445 -66933 19745 98872 79323 -74435 -82544 -78309 30779 346436 378721
25255 378721 241390 125451 130350 218397 151764 122209 21849 -62729 -11461 -59318 54102
25244 54102 11697 -108152 -157798 -47778 38050 71542 132606 64976 -1528 -86156 -33750
25233 -33750 154061 192602 307487 335736 354028 268848 145276 78717 56518 65171 156709
25222 156709 220313 154769 136193 213842 216559 176425 124545 -5090 -107673 -103012 -7515
25211 -7515 30193 7994 -6486 -91851 -62676 -115587 -108889 -67808 -99027 -80988 -145351 -110786
25199 -110786 88385 130823 -33873 -5315 111656 154850 218689 168249 202126 260129 181807
25188 181807 60792 -24866 -88314 -90901 -3251 -6523 82469 18911 60075 85093 -5630 -42896
25176 -42896 60952 76653 150966 -14812 60894 19456 -50556 -35284 -139013 -140816 -28270
25165 -28270 82487 212947 330566 313269 86096 183223 322045 290769 296624 155451 196271
25154 196271 299962 271817 178744 221163 253503 123303 81258 130902 -90204 -77686 117575
25143 117575 264527 404589 273572 13565 -91819 -134569 -111339 -87904 -94393 20188
25133 20188 -54369 29371 -3440 116223 217906 154263 30604 14778 87814 278334 126470
25122 126470 44912 -86125 -99941 -56896 11435 125775 232293 333028 315551 235935 114758
25111 114758 260670 237992 120275 60961 149344 134516 99951 105311 20112 78395 27968
25100 27968 30182 35126 -99248 -287600 -312089 -164433 -102327 -46400 -36099 -53845 -78367
25089 -78367 -62247 -134729 -227708 -240886 -257974 -367387 -185919 -75087 -9523 28636 136431
25078 136431 258819 257664 121121 79061 202721 287668 251613 206170 52042 112298 150679
25067 150679 334958 450898 194325 50491 70765 2826 -28795 -135654 -216017 -92549
25057 -92549 -24841 28879 106028 193269 -32488 -84048 46101 153792 306061 437387 348266
25046 348266 114659 99650 47930 5918 9842 -47924 -47198 -34379 -14229 -187086 -223226 -53406
25034 -53406 -64188 -50645 27302 56435 -94022 4019 1270 -120190 -155513 -156789 -232904 -99353
25022 -99353 36402 153214 366295 290631 164158 -61420 -194749 -39708 72004 126707
25012 126707 78090 104231 238930 237591 46057 -93104 -15157 -7183 23888 108854 41185
25001 41185 162928 83162 -26906 -219917 -244245 -26872 136012 159485 169184 226044 271903
24990 271903 249835 351022 460254 447745 230745 225843 127056 134926 41830 -9714 -69746
24979 -69746 -60851 6506 -97052 -70970 17976 -48144 -160823 -254788 -191856 -163093 -208694
24968 -208694 -136249 29761 61524 126449 -4683 -38613 54304 193954 321062 345775 129885
24957 129885 -55525 -89145 76767 23472 -36663 -16431 -22666 -75428 -12631 17002 9177
24946 9177 3190 -149303 -156636 -179914 -78537 32719 201117 208184 98490 40649 120811
24935 120811 19473 110497 49967 -95439 -252362 -171751 -129789 -93963 36687 60564 -17376
24924 -17376 -37271 -31514 -258071 -385782 -341370 -236514 18355 57808 145186 205505 124646
24913 124646 -45925 2625 -126404 -143738 -139606 -38977 -69182 -150329 -178079 -126877 -228073
24902 -228073 -238704 -98131 -153437 -217066 -222733 -115027 -162598 -218977 -40497 63630 29762
24891 29762 -81023 -61301 41319 -11850 -160519 -262121 -311657 -323051 -368572 -277134 -56565
24880 -56565 72055 -34950 23313 89829 211980 93549 5105 11710 211204 188472 4693
24869 4693 -147490 -116361 116592 310603 245861 255818 397549 209336 147444 253716 237399
24858 237399 152776 182403 21705 -70370 -51997 88392 -11165 -66757 -152125 -237175 -22756
24847 -22756 18137 -70541 -78032 22216 163729 264822 121702 65873 129440 256083 159151
24836 159151 -107796 -145230 -72023 -41369 -45901 128343 111814 -51835 -191748 -156591 -162846
24825 -162846 -97434 -191051 -284882 -262350 -211282 -183061 -140394 109431 147627 40959 13368
24814 13368 -56592 41848 -75606 -203007 -112746 -95916 -26485 -13093 -209111 -163159 -96845
24803 -96845 39296 129945 219110 200748 282389 190937 -11497 117585 85712 28785 34943
24792 34943 840 214239 303943 149134 36552 14983 -26331 61203 161836 349872 286154
24781 286154 208147 117873 52872 -161987 -270499 -277938 -324387 -211829 -112411 68719 422
24770 422 -122206 -110490 -215115 -389028 -174150 26078 203057 112746 2413 106313
24760 106313 165688 317196 381108 346129 371855 257318 -68956 -74292 -43492 -161469 -207333
24749 -207333 -19514 205987 245387 116064 123519 143597 125641 25944 217500 469553 170676
24738 170676 -53902 -50896 -14885 -59971 -218443 -254067 -224483 -207112 -23152 29808 -8630
24727 -8630 7546 1733 -98342 -127405 -47348 21766 107233 24424 -58520 4996 -37409 -28623
24715 -28623 -103088 -61860 -43529 599 -39447 -68278 105749 269155 312566 277217 98245
24704 98245 -118041 -141870 -50369 75297 249058 129164 -188397 -210786 -175904 -195985 -133207
24693 -133207 49960 229709 148868 50951 35522 -56004 -100104 135834 351535 378410 460137
24682 460137 461092 519609 458519 357195 231926 -36266 -37977 47746 47754 62436 -43637 -56374
24670 -56374 13864 76404 47584 81974 11869 -177758 -163610 -60874 -165525 -65440 -87499
24659 -87499 -5243 228714 373515 55296 -153671 -272954 -90406 81294 2318 -30215
24649 -30215 10087 60185 77049 147618 156338 197118 201884 216703 438489 471131 339815 279093
24637 279093 254748 66625 122983 76037 -163803 -274649 -121524 -58176 -61507 73341 97917
24626 97917 222311 324709 264304 179856 238957 197419 121997 88899 -63379 60511 201677
24615 201677 184705 -2578 -214987 -225458 -15922 211936 206957 100251 120250 -17213
24605 -17213 -10772 -60083 -65133 -66792 -106385 -74902 -146851 -233287 -215280 -48363 40420 -77656
24593 -77656 -42976 -14455 -58014 -90915 -151178 -137147 -84994 -211007 -139774 49399 125309
24582 125309 56146 -123107 10643 -42353 -54505 2970 36284 114145 267704 309554 252289
24571 252289 239753 60318 -18455 80078 78307 -110692 -154181 25047 79583 -33899 -33995
24560 -33995 -98451 12096 -73113 -69303 79595 149663 1797 -196859 -168415 -105036 -109560
24549 -109560 -253798 -342019 -356311 -188316 -136463 -10831 125519 126858 77595 31431 76124
24538 76124 -12684 -77388 -131445 -169852 -193713 -222225 -194741 -83523 72449 68441 57929
24527 57929 -35495 -173872 -53453 -88458 -229893 -106878 -30297 -80209 -163139 -128804 -237216
24516 -237216 -322465 -227039 -117788 90820 102915 -20271 -49381 571 58481 -121216 -179286
24505 -179286 -218615 -290132 -96434 -46529 -30386 -47495 -82389 -24368 6377 -131746 -116589
24494 -116589 -155637 40986 -25295 -161718 -40204 -71271 -131200 27403 87834 -14457
24484 -14457 -16907 5501 131471 4226 -59118 -147942 -304259 -323891 -271627 -236409 -201167
24473 -201167 -155703 -50586 -71754 -206881 -81659 -2051 -4693 77161 101013 64029 -66658
24462 -66658 -56331 -42714 -3092 -55231 16485 -5624 -41961 142211 54048 6603 10968 57938
24450 57938 87965 144340 168197 15150 -92163 -258121 -305705 -291111 -356960 -443347 -312354
24439 -312354 -179851 -179084 34497 151495 162464 34368 -208839 -219157 -46363 20040 210280
24428 210280 309969 310505 325247 446874 382166 91982 2690 1508 -115236 -22863 44080
24417 44080 -33608 -86743 -86824 -100400 -119287 -107669 13537 115664 45806 86046 -11612 -135486
24405 -135486 -106611 72728 161962 140631 111043 143625 151674 -27382 -81201 -92019 -169651
24394 -169651 -263554 -310144 -185638 -56622 100369 42999 -57510 57825 -7519 -129804
24384 -129804 -142610 -158995 -114799 -138732 -282923 -193296 -111832 -100938 -76724 -89502 -196783
24373 -196783 -268344 -277498 -173545 -264263 -222167 -91504 -70863 55828 232117 206347 171244
24362 171244 116071 27712 -34221 -20316 63779 44163 -246000 -235315 -105168 -61966 66324
24351 66324 116957 -133504 -118257 -3136 44520 6973 36012 45663 265418 199127 -5902
24340 -5902 -169814 -171407 7001 -27782 -134959 -206959 -200761 -115710 -109544 -93519 -17586 16524
24328 16524 -1896 49 -57927 -157734 -189552 -163807 -278626 -132164 16650 -75452 -239073
24317 -239073 -170945 12702 42624 -72268 -214892 -236754 -236947 -270420 -404887 -334130 -195211
24306 -195211 -148312 -25503 23219 -43809 -126275 -109615 69204 140072 10884 -68750 -149811
24295 -149811 -424230 -527142 -307483 -152097 -26447 83753 121391 76523 -7144 27162
24285 27162 40484 -67541 -158509 37410 50586 64921 53122 25024 94965 -7793 -128045
24274 -128045 -301462 -226932 -54066 -90870 -83541 -61109 -48653 -72341 10283 167440 56603
24263 56603 -55382 -55842 -110615 -165764 -189677 -52243 -16677 -105902 -203111 27241 41789
24252 41789 -71098 -47947 -13112 99454 205973 117052 51805 105700 96240 -44402 -63433
24241 -63433 67674 39867 -135433 -52119 221438 238321 202645 54812 81379 -76119 -271076
24230 -271076 -166470 -283720 -243320 -70861 12650 -63048 106015 192038 -90139 18562
24220 18562 93978 36235 115004 141976 60334 14405 -15962 93219 69274 111310 354900
24209 354900 341196 248405 160535 57945 74532 135235 88595 -157226 -278873 -188513 -148658
24198 -148658 -174089 -155888 -30019 73064 195739 193998 123760 255268 351937 170169 112805
24187 112805 35153 2495 182463 186878 16642 -153327 -364669 -315372 -208738 -187698 -221129
24176 -221129 -246475 -82783 -226460 -167129 -37701 -71761 -137252 -29194 -53146 -273638
24166 -273638 -364344 -173149 -85940 40326 -59211 -122966 -221317 -54713 106560 259272
24156 259272 216535 86738 98683 152211 161414 69312 -44557 -211029 -172231 -192093 -109904
24145 -109904 52003 139603 81947 -43045 -105530 -228516 -342458 -264798 -226159 -161714 -174761
24134 -174761 -110370 -161588 -312541 -426088 -184633 37622 62942 -81032 4127 141539
24124 141539 199213 163947 81751 71727 5103 30786 -6521 5791 -16680 -109993 -132851
24113 -132851 -75556 -50987 -26174 54200 -2690 -41079 -110971 -210543 -444018 -484526 -221310
24102 -221310 -57271 -97428 -83634 -115749 -244820 -33763 30861 -3976 82608 121645 74309
24091 74309 -170366 -253549 -256583 -346848 -237045 -85266 -142450 -220380 -158820 -21892 -39673
24080 -39673 -90869 -30414 -92944 -227024 -236127 -158848 -211240 -199211 -147126 -154687 -162172 -214287
24068 -214287 -224769 -281550 -238931 -311495 -284770 -326526 -134007 -214171 -347180 -238253 -198747
24057 -198747 -117967 48666 -80383 -151132 -155598 -90924 -149907 -231080 -11012 61199 -200248
24046 -200248 -411264 -405470 -302352 -123997 -89062 -99990 -163072 -236932 -231734 -201904 -136862
24035 -136862 -56180 -38827 64430 61572 -51941 -48387 -213232 -361489 -306816 -197942 32209
24024 32209 79211 -32715 -230339 -312128 -246549 -105450 -46847 -6334 -26370 -13193 -59484
24013 -59484 -16466 -231642 -484974 -403605 -128201 96234 183358 308173 149351 218603
24003 218603 282428 194249 172385 51160 -88724 52653 110943 108913 120226 84207 -130078
23992 -130078 -200534 -206724 -172454 -136143 33523 67715 33106 108845 124750 -2382 -86973
23981 -86973 -332233 -420175 -238005 -137760 -68414 -31733 -3503 1438 146483 168375 137471
23970 137471 -29992 -115961 21138 19343 -45740 14427 106358 130427 110231 11657 -104839
23959 -104839 -43587 -19911 -76387 -186212 -257944 -139087 -102891 -213455 -194756 -47304 -96310
23948 -96310 -52527 -97025 -146392 -137373 -132322 -124973 -38168 78230 -75319 -116576 -171063 -251378
23936 -251378 -288885 -442491 -385249 -231099 -228707 -127714 -49913 40779 32863 45035 73584
23925 73584 189681 192149 209365 127907 114092 126380 120125 42688 -97328 -71269 -52656 -150349
23913 -150349 -123691 10389 51165 -23435 85181 257240 210296 9721 -206242 -166061
23903 -166061 -62400 139423 17494 -95517 10398 77196 -26608 1190 92548 196318
23893 196318 198475 205197 70077 116449 171166 102781 223229 308259 236824 83710 36249
23882 36249 -3876 -72133 -7919 -72057 -107856 -15998 -26106 -130749 -147456 -116026 -83867
23871 -83867 -2155 146054 155948 149486 105337 60200 65613 -4150 -198477 -226445 -99150 40676
23859 40676 95424 112860 -39054 -260963 -428734 -443062 -323590 -115492 -101345 -38322 64911
23848 64911 -87989 -225640 -212259 -123956 -80491 -178432 -114574 108107 114412 33768 -177443
23837 -177443 -148060 -51315 -94083 -244031 -296435 -131158 -58562 -81086 -31256 -13334 -104963
23826 -104963 -147637 -330854 -308929 -384306 -367973 -265909 -408499 -340233 -239314 -228218 -164937
23815 -164937 18258 -20088 -301577 -351721 -291153 -362695 -234447 -210589 -132247 -59395 179567
23804 179567 108327 30637 223252 213917 78859 169372 259094 313265 109180 -26492 31142
23793 31142 35842 126018 156747 -20845 -90874 -113021 -102833 49060 126073 28268 35892 28534
23781 28534 -80510 -37691 -76437 -162714 -288139 -268502 -168507 52807 56980 14516 4081
23770 4081 -21094 60271 130494 124049 176680 167599 169102 181572 192906 55682 -35804 -111693
23758 -111693 -240120 -188328 -809 40501 -43750 -14894 203263 116364 173714 210910 78966
23747 78966 -146722 -79161 42903 157664 118051 -39996 -272797 -365932 -224911 -209440
23737 -209440 -215154 107581 199191 80432 -46394 -170139 -274867 -249857 -71046 44403
23727 44403 42649 -28144 71619 242297 238103 230100 340866 318840 213466 83885 -44907
23716 -44907 -113939 -28798 -66467 -67937 -179952 -300730 -267291 -284867 -124523 -131456 -181869
23705 -181869 -390388 -511943 -528020 -328195 -217789 -299601 -277690 -265993 -305013 -368062 -374707
23694 -374707 -428247 -378114 -133243 90040 174374 168695 35484 -34719 -100245 -183217 -30054
23683 -30054 -24957 156281 124267 -3015 -84186 155 -48876 -181891 -119730 -101553 -125653
23672 -125653 43141 35964 -42036 -140498 -221798 -180860 -135832 -171621 -214466 -125740 -36194
23661 -36194 -82544 -113368 111731 326683 134496 17691 10325 -36521 -38195 -83373 -60369
23650 -60369 -482 71465 52650 106574 63830 -13734 5341 -89882 -155333 -137754 -187351 -81620
23638 -81620 39040 209168 242001 207154 22354 -209386 -253872 -218787 -207902 -93218 -118592
23627 -118592 -93215 -17134 2158 33827 115754 139848 86559 33506 -6070 -48887 41568
23616 41568 107318 -24232 -49846 29699 87351 16570 140259 373238 151737 51879 219247
23605 219247 241002 236945 276429 263395 331206 302725 405009 398951 199245 -48680 -278275
23594 -278275 -322974 -270936 -211462 -113859 -7163 -78187 -242186 -253641 -209810 -72014 -88471
23583 -88471 -138270 -182540 -130533 -80348 -234205 -214524 -187403 -153727 -59466 -124402 -190040
23572 -190040 -177291 -19342 -35877 -173960 -301720 -69789 -11741 97979 140519 -257403
23562 -257403 -392123 -365819 -303837 -430077 -402163 -399122 -295652 -138368 -106489 -5406 -68136
23551 -68136 -183569 -273234 -291151 -218894 -208312 -231935 -33649 152184 192761 67142 32288
23540 32288 14957 5429 45852 25037 69784 31159 30376 63212 116875 -32518 -117373 -91924
23528 -91924 79595 171725 101432 123167 116259 45768 1875 -109868 -69734 -140204 -63963
23517 -63963 -175890 -98930 -168413 -196866 22181 -61959 -262920 -173462 -24679 84891 137198
23506 137198 -82567 -80585 118889 71596 37907 70098 11414 -180952 -115178 -69346 -90243
23495 -90243 -263412 -406531 -361301 -148173 -67177 -229298 -326000 -242298 -190660 -193359 -200552
23484 -200552 -213907 -190098 -4827 76391 -110882 -160534 -153173 -84597 73870 44781 -30052
23473 -30052 -11567 -113562 -53418 -123379 -67989 17717 -57626 -82235 -32617 -117276 -242048
23462 -242048 -361245 -428418 -188892 -224854 -285661 -264039 -198195 -238885 -351964 -438110 -270091
23451 -270091 -72115 -109597 -159968 -136690 -73007 55423 231625 365199 348679 260146 102011
23440 102011 12984 -41008 -78214 -93860 -67681 -112650 -90243 -16276 4531 26866 8723
23429 8723 -96459 -161152 -198640 -196140 -159658 -245022 -245133 -102435 66407 183265 226165 252657
23417 252657 -24624 -82522 -111797 -152955 -48132 88565 237122 278167 138418 -57920
23407 -57920 -65908 -668 130734 222497 139602 118286 81158 62367 207220 141503 -6813
23396 -6813 -160344 -161513 -83557 -169054 -324698 -283051 -124262 -189870 -319894 -241457 -150851
23385 -150851 47579 189682 107796 82371 93292 -28593 -14854 -82957 -124779 -44579 -38478
23374 -38478 -168452 -160645 -996 69315 21659 76283 -4453 -102374 33213 228050 210702
23363 210702 -7386 -120334 -189669 -206556 -232665 -149273 -60569 149452 260922 98868
23353 98868 -175664 -231054 -277699 -313356 -84485 58769 61495 14709 -173166 -93643 51323
23342 51323 97970 -98254 -92840 88205 134418 72027 74987 263612 361066 366673 269787 15789
23330 15789 -110166 -181284 -222264 -267843 -149279 105123 44049 -228201 -236639 -121394 -44812
23319 -44812 -169417 -172107 -215538 -300528 -207175 -146093 -39099 -159320 -224385 -40407 4712
23308 4712 -66107 -143335 -151282 -28917 111937 30756 13877 -33155 194269 177913 80481
23297 80481 124508 114687 120935 11595 -122245 -177373 -262861 -22653 -42523 -269577 -310863
23286 -310863 -263392 -134724 -98737 -35960 -135314 4378 111264 176224 259381 195451 239915
23275 239915 240150 396706 334249 200188 110312 110111 167470 102906 -36497 10216 -10272 -21671
23263 -21671 -74141 60469 86248 -15363 2360 113641 142728 172303 46010 136036 221474
23252 221474 37120 208292 197320 57365 -154459 -319695 -172793 -157920 -272220 -314890
23242 -314890 -262910 -286995 -185305 -79566 -16536 -41737 -138656 -128015 -21576 -7894 -62448
23231 -62448 132119 143989 41032 -39377 -57196 21479 57391 -100842 -197961 -179037 -90103
23220 -90103 -115783 -176965 -214230 -238181 -351896 -375295 -271956 -119943 -201265 -134460 -12994
23209 -12994 -248269 -395405 -394347 -305319 -167094 -6517 -24246 -69445 89674 89462 6008
23198 6008 -50857 4992 94810 114541 31700 62230 167795 98563 -29879 -250950 -197521
23187 -197521 -139533 -61762 -29151 -22748 -44506 889 -29507 -116640 -306093 -321666 -56206
23176 -56206 -12973 29035 150724 129469 74306 -73750 -186183 -133570 -11169 55759 77810
23165 77810 46624 79104 36544 -92845 -215434 -29425 70090 -139908 -61626 -20215 3292
23154 3292 -89929 -92878 -62262 109805 227947 2950 -25261 26916 -114846 -142897 -160664
23143 -160664 -162235 -256831 -76861 79967 128584 -55336 -229358 -202930 -326027 -327516 -282934
23132 -282934 -264192 -166252 -76035 -47698 -190100 -241983 17171 -75130 -116307 -5783 13733
23121 13733 -160639 -238672 -32130 -59749 -884 63987 -66005 -63002 47791 -1610 31529
23110 31529 -150771 -246506 -290637 -123200 -79350 88733 87598 -3019 -8686 100005 181531
23099 181531 222462 167897 94152 29391 -278576 -380716 -290003 -159877 -86710 -13846 20912
23088 20912 -49231 -129388 -186768 -186354 -77295 -80460 -58374 -128334 -60975 19970 157237 157572
23076 157572 126665 168209 77132 -126192 -15665 161202 55369 -24551 -155582 -214727
23066 -214727 -210801 -63336 -8306 -8870 -13724 -184326 -321734 -381596 -354893 -208864 -164625
23055 -164625 -270287 -239084 -183353 -75617 35537 30268 66349 233939 104169 -72886
23045 -72886 -63568 -98923 -36081 -97023 -48592 99293 -4761 -80348 -251246 -139893 -1812
23034 -1812 -64732 -164133 -153537 -106281 -51961 -6776 -153623 -122242 -33818 -174468 -143206
23023 -143206 -184616 -40341 71070 -92394 -200054 -172610 -79698 88153 48174 12584
23013 12584 38427 -49818 -39131 -67220 -156480 -181986 70074 111102 1524 982 164036
23002 164036 150089 76509 31807 -148727 -95406 -55547 34314 44615 -71351 -10623 69714
22991 69714 76236 -143537 -267899 -269346 -188432 -135899 -223064 -157304 -114727 56855 -83700
22980 -83700 -217670 -128501 -19862 -40193 -130118 -62300 -66845 -159301 -24416 106901 181231
22969 181231 198906 47611 -80530 -98684 -32586 26934 57828 11521 -55978 -13431 -112762
22958 -112762 -238994 -84750 287750 215408 -98024 -179646 -196101 -213816 -178870 -55182
22948 -55182 66927 52640 -83977 -175676 -301408 -120981 -134684 -176943 -24080 -24649 -139388
22937 -139388 -175160 -185795 -102124 -39780 59444 117726 72232 -30502 -47041 -39676 17634
22926 17634 2606 -268404 -385999 -269485 -162546 -170822 -127111 -261523 -138929 -108833 -235052
22915 -235052 -314353 -202768 53745 103206 125940 235016 382637 214425 -71019 -193005
22905 -193005 -82885 -112342 -215490 -83634 -84821 -25158 8074 -102719 -67100 -71320 116866
22894 116866 215476 130541 165469 74905 -20 -66321 -33360 6974 -74943 -98916 -97875 45225
22882 45225 172540 163856 8690 -34286 -16260 86240 30229 -53289 146409 156188 56790
22871 56790 87406 -53772 -190569 -173486 -207485 -49070 93035 244514 97276 -21338
22861 -21338 80107 68271 -29108 -57686 73190 153388 119735 -24823 -1500 -161046 -91115
22850 -91115 53345 30721 -74167 -102478 147913 112153 69369 14091 -50111 56052 184914
22839 184914 -49 12713 167329 257917 107951 224 -60784 -62513 -152788 -272287 -511675
22828 -511675 -673957 -407338 -141615 -170781 -178391 -246706 -267024 -113552 -69093 -271311 -212840
22817 -212840 -196963 -171509 -91361 -97223 -10452 -2519 10639 81601 -42696 -131160 -159406 -63805
22805 -63805 84107 165668 171345 182464 107893 25311 -84161 -230610 -202301 -233222 -192358
22794 -192358 -77022 -72396 -233772 -99551 36560 120084 117765 -65785 -183757 -177042 -84265
22783 -84265 -74280 -165094 -239623 -314443 -246815 -58235 27838 -76365 80640 118586 -48357
22772 -48357 -4254 69168 24111 21732 133141 68085 43088 -107191 -142793 -75079 -36509
22761 -36509 -11210 -75309 -227517 -183445 -103166 -15739 -157616 -282338 -233924 -31635 85431
22750 85431 -128732 -222605 -186562 -192826 -119242 -120086 -121438 -228652 -190492 -208521 -149680 -2810
22738 -2810 342232 335980 149444 30588 72751 -108190 -90222 -12876 229154 313539 250730
22727 250730 25501 -251747 -296728 -248386 -116294 -64312 64462 -52183 -58207 -141329 -259447
22716 -259447 -321143 -290731 -177002 -249050 -387195 -436217 -314010 -66566 -38834 17532 53621
22705 53621 -47332 -174118 -69218 40515 14231 -36224 17732 -61734 -95247 -124559 -69868
22694 -69868 122462 65008 -723 2906 60954 123084 -34742 7051 50018 35218 182114
22683 182114 150369 62113 -64044 -160251 -130013 58578 584 -53805 -59622 -44330 16182
22672 16182 128929 258029 223745 141486 -56078 -306594 -238601 -268970 -211624 -62248 -221963
22661 -221963 -333589 -225815 -99936 9699 -6146 -188455 -176707 -186435 -130942 -202185 -75178
22650 -75178 -2561 -91952 -137401 -108120 -122274 -309734 -411481 -510850 -378440 -163414 -63557
22639 -63557 74369 -9988 88431 143831 155220 104220 63262 137677 92586 81735 -24629
22628 -24629 29419 220061 172486 -40800 -178759 -168564 -195289 -287851 -276037 -353868 -238956
22617 -238956 -280873 -183183 -37525 24761 -141894 -366686 -326101 -195490 -122473 -25708 -78372
22606 -78372 -114617 -33671 -213999 -271561 29770 148697 -102326 -408843 -253181 -110403
22596 -110403 -124343 -187324 -320337 -238722 -156998 -392094 -439932 -256073 -65007 4689 -45709
22585 -45709 -58299 -102465 -205059 -53739 42255 -159080 -398326 -307195 -191813 -194125 -204328
22574 -204328 -94148 -142552 36992 14652 22120 -25586 43136 110541 37117 -30279 59972
22563 59972 -31882 -124429 -288585 -298220 -132135 -88803 -95812 -159200 -203313 -165386 -259221 -224906
22551 -224906 -217478 -71925 -71318 64953 149237 142331 123987 55052 81110 98640 148795 50177
22539 50177 -55525 -243679 -375011 -319761 -147579 -120789 -3161 -9932 -34385 -25620 116844
22528 116844 27063 -144587 -190292 -182425 -297699 -156002 -62855 58839 91752 105019 65605
22517 65605 35880 90976 123845 69616 76962 3078 -253757 -292452 -308413 -344490 -209684
22506 -209684 21781 28895 -218887 -354299 -244761 -272404 -299316 -135762 154688 81247
22496 81247 57487 -62894 3575 -76759 -207163 -371664 -392453 -457317 -528597 -317085 -154661
22485 -154661 -163933 -163113 -168288 -97263 -49537 -112054 -137815 -54646 97341 71388 -9160 -85773
22473 -85773 13938 33865 -42024 -127328 -113994 -122504 -109264 -17 -172203 -303750 -123219
22462 -123219 -75364 -77995 -55900 -9272 -46775 30848 -10618 -112105 -116421 -107012 -134465 -89923
22450 -89923 -288494 -386186 -286619 -190927 712 44720 -177810 -288983 -274923 -102512 39702
22439 39702 82953 31799 87080 -178481 -248584 -129808 10940 53453 61539 -22080 -48392
22428 -48392 96251 122208 190002 140513 70496 211 -123501 -94130 74504 173671 220785
22417 220785 88220 -162514 -282056 -99782 -39318 77177 177049 121348 -200607 -403081
22407 -403081 -425534 -305867 -198151 -109815 -87284 -117046 -163297 -198304 -234551 -369846 -282385
22396 -282385 -20009 -102108 -106605 -152525 -101366 -22625 85925 240924 185831 168103 83334
22385 83334 -67995 -124689 -35443 113425 65877 156506 218977 106918 24402 160739 137867
22374 137867 138140 21497 -1211 -124881 -204073 -72005 28755 -65411 4589 -31442 -118668
22363 -118668 -167001 -78879 -153796 -291161 -183942 -25442 107478 73739 -143424 -268018
22353 -268018 -138046 -107726 -126200 -79917 -159774 -232686 -123927 -44423 48389 144056 -32159
22342 -32159 -140663 -79073 -219737 -310119 -370721 -292271 -227743 -274054 -161015 -120920 -30353
22331 -30353 84567 -159240 -225417 -236014 -101271 -125235 -91687 82161 13279 -169632 -112777
22320 -112777 -90392 -270888 -324726 -171834 -166155 -186371 -82574 -90590 -115372 -213277 -254875
22309 -254875 -189719 -59392 -84563 -10364 105607 46106 203115 117817 23754 -2797 51467
22298 51467 146633 156556 -44898 -273664 -435901 -464978 -454781 -395149 -426131 -420511 -320785
22287 -320785 -344763 -246950 -133044 -185957 -52258 59493 -99760 -77773 -74353 -23262 -43211
22276 -43211 -16217 -164505 -188964 -159609 -172790 -127551 138540 43858 -87757 -64727 -40496
22265 -40496 -135183 -161222 -5757 83674 -33132 -643 65087 200169 173219 178162 245890
22254 245890 194180 27272 -150578 -144567 -108787 -185393 -245063 -161233 -143860 -88919 -89341 -138186
22242 -138186 -145361 41942 143823 59190 83341 94671 -1378 19130 36343 -109307 -138929
22231 -138929 -11361 102099 90525 -3992 -1045 -22541 59606 158734 199460 133493 77961
22220 77961 144636 127209 -47268 -173566 -136190 -122748 -210101 -242448 -164051 166591 328127
22209 328127 316609 164107 25458 53629 81290 -111836 -97994 -91231 -185102 -129431 -135107
22198 -135107 -65755 47782 52876 -51716 -135046 -225628 -154005 -81066 -144202 -202966 -171019
22187 -171019 -15922 -17552 -55293 -86587 -69147 -11409 238767 300126 251930 85144 -27921
22176 -27921 -140463 -218568 -148761 -69883 -14823 76959 52036 -28210 -43576 18636 60790
22165 60790 128533 -1602 44324 -95657 -176153 -79242 -15871 -47175 -150153 -151141 -96137
22154 -96137 -23389 -113869 -28140 -15242 61794 14947 -124841 -210182 -210380 -206247 -261471 -158151
22142 -158151 -49185 6891 -82305 -183226 -155458 -215432 -185184 -96861 141529 178905 222591
22131 222591 173051 136810 87773 63979 94087 160065 238557 163990 122629 -86792 -319231
22120 -319231 -241652 -187970 -10741 109070 175509 118738 -143181 -216914 -67105 91452
22110 91452 -51408 -78066 -55260 -22115 -62277 -213104 -375017 -424658 -325036 -339105 -460200
22099 -460200 -419113 -186517 90437 89792 -25250 -14907 -41460 14837 -78556 -203550 -198801
22088 -198801 -330050 -373308 -358962 -323651 -257255 -229399 -360702 -406044 -248655 -257993 -301490
22077 -301490 -254853 -209006 -247816 -54052 -23753 -130033 -144142 23134 219214 157226 -63125
22066 -63125 -7226 54401 -86218 -229091 -227031 -196798 -198207 -67915 -91473 -165093 -118857
22055 -118857 -82283 -239337 -282625 -308851 -313806 -233152 -225173 -313178 -417304 -382559 -317086
22044 -317086 -368350 -199845 -28142 3735 -12765 -161398 -290354 -142274 -43709 10777
22034 10777 31289 -20213 -156655 -242925 -205432 -97527 -92013 -38758 74233 27591 45942
22023 45942 -73877 -91040 -118445 -142702 -255246 -343959 -273169 -292835 -189608 -110422 -106664
22012 -106664 -125687 -181351 -31806 -90958 -307367 -384349 -308864 -339411 -435810 -318871 -240363
22001 -240363 -51719 128376 140511 -66437 -244617 -252238 -95041 -119295 -56764 80826
21991 80826 97368 -149051 -398546 -270215 -134161 -214168 -99301 -11877 47477 -17123 -34178
21980 -34178 32542 48120 49980 96027 128491 122246 42469 -107959 -319388 -346420 -121928
21969 -121928 119374 222195 217074 148668 -85555 -181380 -27852 85688 81670 17369 -70800
21958 -70800 -133412 -45717 -173009 -210228 -43919 3220 78516 35181 -40027 -33206 -139977
21947 -139977 -125399 -136337 -108597 -105569 -31916 -30765 14058 -50106 6455 58014 147339 105138
21935 105138 -106157 -161713 -116110 -44600 -62309 -141736 -144570 -124405 1572 42232 16341
21924 16341 79653 137807 -131555 -331586 -254870 -109929 -171239 -287043 -311552 -201039 -78448
21913 -78448 -135708 -335399 -455685 -309362 -91505 -206959 -215129 -203232 -301518 -107705 -100305
21902 -100305 -229517 -215266 -178519 -302726 -501987 -447506 -466053 -346981 -187032 -169368
21892 -169368 -133976 -89305 -155918 -39377 -126342 -228966 -308937 -379621 -348578 -213341 -208918
21881 -208918 -293972 -251789 -250077 -166014 -279480 -286860 -163369 -28047 57634 77437 10388
21870 10388 5252 -252723 -81003 -70411 -127105 -37537 -206166 -269622 -149443 -208756 -11478
21859 -11478 -167007 -144557 -66219 -23864 36945 1018 -140380 -309523 -255997 -238908 -155880
21848 -155880 -86483 27226 232672 171686 -43361 45236 25771 7187 -47232 -205698 -225667
21837 -225667 -297545 -89085 -67659 -65680 -15176 -77091 -66200 -30103 -22139 -96086 -122829 -54629
21825 -54629 -34555 -73095 -29512 86141 115123 -66051 -131245 -124020 -224830 -194515 -151797
21814 -151797 -198679 -137891 -60829 90852 148625 42619 -81884 14989 95337 -16046 19744
21803 19744 111942 249280 333136 301294 169934 226648 285524 114441 26228 61731 40229
21792 40229 -55049 -137969 -216842 -44518 67724 37982 -8137 -76795 -218421 -172749 -24065
21781 -24065 156273 235679 316191 254331 88353 48534 155671 141362 12474 -143823 81670
21770 81670 131570 39332 -115190 -149665 19339 118831 112102 132305 68667 118209 95051
21759 95051 104222 195250 -9385 30 183972 226884 116546 66096 119496 25194 -134160
21748 -134160 -100006 -57016 185624 298853 211666 -55364 23110 -126606 -104907 -68468 -164195
21737 -164195 -83966 81045 70013 34510 -51464 98992 189532 148644 106547 85194 151342
21726 151342 147879 42787 -34791 84830 205774 262325 57986 32182 137737 218801 161411
21715 161411 39821 105002 -4652 -69865 -188860 -50966 23093 190093 243472 221124
21705 221124 191668 120971 141830 157227 192459 52524 -69614 -17242 93350 142207 147699
21694 147699 111394 70684 96964 -36050 -127863 -15132 -71002 -242084 -156890 -94742 19200
21683 19200 -37818 -118717 -6374 24465 -74780 -200259 -93782 -112998 -114877 8209 78608
21672 78608 164223 17607 -51380 -95523 -28926 9614 -45598 -60956 -67751 -281917 -380253
21661 -380253 -394227 -256658 -132282 46798 57720 -49676 -66408 19308 -32514 121490
21651 121490 122445 132940 219624 257226 164252 -102812 -375287 -483286 -402939 -371911 -406170
21640 -406170 -440036 -144567 -249606 -361386 -196492 -306437 -297799 -156168 49169 104775
21630 104775 -27626 -201821 -190570 -58723 35747 42084 40938 -88505 -240343 -374968 -243128
21619 -243128 -23661 -75550 -143898 -45049 71133 48245 69308 278064 180485 68813 17332
21608 17332 -100492 -194418 -247017 -206708 -226858 -291703 -226411 -2027 93469 63337 -32874
21597 -32874 -168739 -93636 -58092 -167604 -259489 -230941 32180 159040 267404 246885 215724
21586 215724 207945 184881 106899 19643 6458 -71415 -103638 -150384 -377310 -347684 -362973
21575 -362973 -324901 -351321 -263386 -212987 -350322 -282624 -238379 -295715 -160987 -74610 -92985
21564 -92985 -179475 -334954 -252721 -214275 -226374 -75095 -2240 -129452 -163084 -265263 27475
21553 27475 256407 178655 81269 -148953 -280651 -352366 -208448 -118390 55015 117712 66534
21542 66534 -157953 -328025 -254578 -204912 -242145 -233677 -20658 -57833 -44365 -63707 -103771
21531 -103771 6198 -40051 -111075 -183257 50546 77022 55136 -1569 29117 -121671 -209968
21520 -209968 67509 166499 92066 125468 145541 -9352 82511 67303 46320 8687 -32402
21509 -32402 22118 172898 -112621 -106336 104267 85217 -33301 170 29673 -106646 -166852
21498 -166852 -134685 -113805 102797 92172 -136710 -101641 43131 -52631 -204439 -344593
21488 -344593 -277001 -144211 82177 -58541 -105013 -87186 -11818 84943 -66892 -149536 -144829
21477 -144829 -49029 -42423 -221603 -187669 -35455 137743 75798 -128451 -282858 -382024 -302614
21466 -302614 -73237 -11205 17399 -101228 -76582 -21616 -144328 -303213 -211343 -223223 -165254
21455 -165254 -222667 -312258 -205633 -156358 -215625 -232256 -154758 -86807 -149575 -133155 477
21444 477 -91466 -114970 89761 297801 224964 303345 272943 157945 121179 62744 -43566
21433 -43566 -226395 -458779 -361146 -299784 -143102 -56842 -167675 -180941 -180612 -246262 -207178
21422 -207178 -67037 18742 -14743 -123280 -192097 -163473 -39211 -2093 -49284 -211905 -170056
21411 -170056 -118912 25406 -106309 -122935 -122051 -38155 -152101 14231 133616 73500 22262
21400 22262 -76292 -106708 -4984 182956 99580 144122 175712 83542 -89405 -327335 -335144
21389 -335144 -382326 -323336 -358472 -131381 56088 86204 -112891 -211967 -203006 -370062 -464564
21378 -464564 -312299 -280948 -208313 -142859 -141177 -168102 -114521 -95404 -278143 -361528 -138361
21367 -138361 32306 -24387 -141881 -91070 -46238 -23971 -93475 -248661 -154454 -5583 43136
21356 43136 177482 370025 464947 473001 296912 101947 -11997 -58892 -29010 -141705 -131536
21345 -131536 3453 -127095 -167793 -21880 45767 138340 146850 147033 82798 6062 -1624 -89779
21333 -89779 -184795 -189255 -250924 -315363 -438979 -436326 -309941 -152966 -13983 53852 77730
21322 77730 108146 100285 72697 89246 -8680 -89088 -145990 -33306 14085 76158 83246 96792
21310 96792 89407 121534 101586 126984 50268 -62428 -79454 -81690 -26764 71529 -32070 -260994
21298 -260994 -257036 -89610 -244782 -278864 -110874 -24382 -56421 -201910 -291076 -227983 -198521
21287 -198521 -290963 -190292 -205133 -112162 -32620 -64135 -170919 -107913 77314 18029 -24286
21276 -24286 -22694 -1708 12041 85654 -59773 -72610 -82634 -82365 -47465 -116156 -94993 -26722
21264 -26722 25662 -44639 99912 409142 417869 348499 272233 237625 239671 120210 221921
21253 221921 287311 25149 -138653 -18942 3963 -17305 41224 136961 229738 220206 -42876
21242 -42876 -262750 -270099 -253415 -359915 -277090 -225435 -302021 -350351 -237626 -3178 76794
21231 76794 68731 36958 20642 104843 170948 113370 36734 39145 111077 157729 5712 -128259
21219 -128259 -262830 -247167 -122138 25248 6483 93317 96788 -9205 -76108 -231158 -245800
21208 -245800 -173513 -214275 -269401 -242581 -4997 -25668 -127076 -93607 -164253 -62936 47789
21197 47789 -152285 -199877 -93418 -84075 -120411 -182782 -281176 -227776 -168640 -157127 -184343
21186 -184343 -122835 -82174 -44081 28064 36306 -46355 196730 337213 146606 -64459 -129776
21175 -129776 -108393 -121241 -175945 -219498 -86252 -107718 -87680 -109974 -116756 -21616 -130750
21164 -130750 -248526 -320297 -167477 -154825 -85322 -95042 -233891 -251333 -125771 -289427 -286307
21153 -286307 -124663 -90856 -124433 -63191 -30942 9431 -84444 -147933 -149054 -357140 -347646
21142 -347646 -260224 -296329 -268371 -283947 -211319 -67783 -10767 184970 211114 -9349 -8488
21131 -8488 -12724 5593 44134 -71343 -314611 -304475 -60663 -63861 -55585 -96291 -154898 -69574
21119 -69574 -260728 -371595 -406916 -330014 -208898 -12384 24308 36942 77936 -37073 -74618
21108 -74618 -24547 -28827 40678 -61736 -267936 -335893 -178304 -156060 -243793 -263594 -260219
21097 -260219 -269844 -133638 17243 -142059 -189044 -104279 50872 8496 -59237 40242 109726
21086 109726 94250 -94431 -27751 104418 267214 339933 441914 463184 336049 204412
21076 204412 216533 189008 113278 -61189 -123723 -126288 -184536 -101972 14995 -7071 -166292
21065 -166292 -37611 -46916 -1806 88857 191410 67046 168203 108878 -74962 -64731 1287
21054 1287 94076 20824 -49029 106575 270708 294450 286726 168828 91615 -28446 -89875
21043 -89875 -15588 -57724 -45374 -13082 -6292 -20050 7805 70594 77241 2387 -212946 -296015
21031 -296015 -143704 -64096 -91482 -248653 -178974 -109114 -241641 -177591 -199895 -52983 -86191
21020 -86191 -143183 -8665 47023 185647 435958 245476 5139 -165484 -262431 -238943
21010 -238943 -217467 -75470 -12266 97520 117790 -62407 -200164 -44171 -44332 -108582 -118526
20999 -118526 -172112 -39780 -184321 -340195 -310607 -365464 -425025 -622318 -686195 -453579
20989 -453579 -307745 -256800 -117473 8588 77623 110420 74977 107584 102533 53957 64101
20978 64101 -7508 -31989 15641 -32146 -224242 -263359 -398944 -387556 -219865 -115252 -76864
20967 -76864 -184129 -141141 43695 -69507 -162882 -6286 -55690 11436 89643 73150 211484
20956 211484 205811 192626 374568 406211 269688 140911 -37128 -105589 -46366 1122 -36835
20945 -36835 108733 180777 84424 143354 208513 177759 223805 238677 -22385 -291025 -437924
20934 -437924 -308742 -248274 -179240 -160080 -246608 -212096 -102721 -161959 -70142 9222 94998
20923 94998 62745 -28653 -54072 -19743 -62525 -80226 -172824 -130146 -133291 -183461 -74720 88610
20911 88610 74805 58754 -74462 -230163 -169875 -67396 -90830 -215066 -285290 -337577 -201112
20900 -201112 -113851 27563 190381 114899 31880 39545 -154500 -288414 -323681 -279469 -92844
20889 -92844 -141004 -236275 -194430 3461 -18483 -43152 -116947 -167850 -157935 -170437 -268580 -269445
20877 -269445 -454515 -380393 -303714 -273934 -126833 -100121 -95274 -80183 20673 33617 -87503
20866 -87503 -163946 -81977 -50518 -43621 21635 161404 40244 108814 36279 -188651 -327947
20855 -327947 -280058 -103523 -34471 -160447 -272898 -269463 -7446 11089 -104785 -304173
20845 -304173 -321285 -296354 -102157 -6955 5732 -117245 -229317 -262825 -317797 -419746 -343794
20834 -343794 -342522 -339695 -258372 -225922 44395 101109 31811 94509 89494 160431 -23899 -89139
20822 -89139 -136398 -115975 -28130 41994 6493 -111809 -229073 -327155 -325293 -226780 -191494
20811 -191494 -252998 -348162 -229169 -202692 38401 227102 31047 -99882 -138318 -18174
20801 -18174 27730 121730 77644 7293 122431 216346 50912 -107076 -151138 -173433 -125555
20790 -125555 -53806 -247970 -424591 -469616 -414947 -354747 -285707 -202874 -305127 -336011 -138237
20779 -138237 -145224 -182799 -119469 -143555 -256430 -180788 -20767 25108 -52922 -53680 205006
20768 205006 203939 77100 -3378 -266907 -128528 -70907 -77083 -100989 -3428 73205 8334
20757 8334 -211165 -431966 -447908 -191366 37108 236061 251228 146358 84594 125871 19766
20746 19766 -19040 -133387 -1897 126145 -2516 -30889 -52130 -213270 -165812 -32735
20736 -32735 -83482 -100984 -70634 -83818 -94613 112723 186895 127435 -11686 -148690 -278458
20725 -278458 -266136 -294107 -213902 -161404 -43976 35955 31205 -36058 1344 -5819 -72038 -17052
20713 -17052 -130558 -240716 -172190 -120634 -42957 -63214 -82693 -21263 76968 77223 -21734 -53285
20701 -53285 -39220 28606 -81941 -140518 -430624 -476545 -163941 -95699 -65679 -236839 -362537
20690 -362537 -285060 -259858 -184821 -22954 98096 3628 -191495 -208834 -311925 -334908 -201224
20679 -201224 -38393 -92115 -10535 224137 244996 144935 76358 -6585 -31286 178398 174393
20668 174393 26466 -55732 -10353 10745 33268 -7436 -57602 -20480 -65383 -171782 -301056
20657 -301056 -417822 -343067 -168806 -115561 -145570 -210677 -174103 -149339 -16939 -98117 -134392
20646 -134392 12719 91508 3110 -51133 -113447 -106665 -264247 -207142 -242976 -295945 -247535
20635 -247535 -148730 -89105 -37528 -91370 28408 7444 9836 -113919 -203915 -172072 -112651
20624 -112651 -23210 -84629 -179094 -243381 -203408 -75451 -45641 -12347 -85421 -10420 -47135
20613 -47135 -125649 -158118 -165627 -103532 -258611 -298549 -183520 -23429 -127446 -254805 -216935
20602 -216935 -228108 -181206 -171679 -96547 45867 -61584 -70367 3553 67641 -29271 -36604 -107437
20590 -107437 -41148 44921 -127091 -335491 -296928 -164099 -14361 -25959 -143937 -216189
20580 -216189 80190 232171 -40542 -67295 -35445 -76193 -93046 64896 75222 154561 238774
20569 238774 38121 -126933 -173950 -57336 -64472 -298838 -200940 -134714 33893 -21278 -148552
20558 -148552 -136112 -82344 -85592 -132952 -132662 -204552 -263424 -116013 -61165 -114620 -206659 -271732
20546 -271732 -247393 -138789 -161182 -142542 -187385 -81322 -130994 -214909 -69042 211543 339722
20535 339722 145945 6275 -12526 15042 34602 138826 95372 73297 -203786 -391104
20525 -391104 -289194 -176155 -38194 -49520 77172 37119 -4481 -8661 -60029 178 -4964
20514 -4964 -109881 -256748 -206696 -122276 -72069 72742 319913 157455 -100809 -194759 -247405
20503 -247405 -110698 -128489 -177859 -133099 -4766 -20290 -80085 -262967 -339916 -267500 -247593
20492 -247593 -99722 -15896 -86672 -250248 -355823 -262952 -85815 -73366 -140797 -143485 -166927
20481 -166927 -349396 -331603 -159121 -88463 -4930 -208846 -203720 -209536 -127033 -149887 -306432
20470 -306432 -321368 -151286 -126138 -137626 52138 43629 -15432 107151 150891 141392 116984
20459 116984 51563 -79990 -137598 -63585 -105782 -103058 6881 -103887 -100074 -108419 -192942
20448 -192942 -100092 -134526 -194453 -396353 -400579 -380485 -166239 54185 90073 83774 -93578
20437 -93578 -274097 -292189 -194756 154631 238494 232912 253273 209281 202407 208717 3505 39676
20425 39676 132635 85724 117375 123630 -33944 2414 84445 -89560 -332161 -444043 -202606
20414 -202606 -75841 -144076 -286291 -432391 -311441 -100942 -158868 -75606 -30536 -36277 92017
20403 92017 146435 138649 -38059 102404 244906 301151 57277 -82746 -160474 -223056 -116508
20392 -116508 5571 69238 18578 -89391 -38451 -88324 6493 37529 -16785 -40608 -104544
20381 -104544 -223910 -216593 -184263 -105889 -107529 -216662 -248668 -166978 -41324 99150 50220
20370 50220 -25977 37442 13459 -49780 -85424 -191100 -244383 -80455 73468 109096 71887
20359 71887 11909 19998 66547 57103 144438 112054 16553 62461 115690 146425 40871 -163341
20347 -163341 -295619 -294364 -287351 -334699 -323864 -94694 77772 12875 -45817 -64598 -143303
20336 -143303 -19342 203116 134350 46628 -53724 -131423 -213344 -136479 -19317 26403 -156229
20325 -156229 -309413 -257570 -94296 2306 -137673 -221972 -110292 -86708 -204874 -266060
20315 -266060 -190577 -105157 -244416 -404246 -181708 -33560 -79513 -113866 -79475 -4981 22861
20304 22861 -66394 -111407 -186140 -220918 -72552 -68988 -166486 -107893 -3463 81567 236216
20293 236216 276906 237536 190040 165555 112041 -33237 71317 146314 146772 109138 54909
20282 54909 -9143 14712 79039 263504 345960 128825 -15596 159369 303771 172125
20272 172125 32674 31533 -83073 -341093 -388330 -388198 -395264 -166063 12626 65098 -41654
20261 -41654 196252 246260 68657 -124340 -183864 101774 195181 -27864 -115431 -207706 -346696
20250 -346696 -447491 -321915 -94670 -107712 -128030 -158622 -171733 -123533 -256399 -218327 -234342
20239 -234342 -293201 -81801 -25516 -13206 57059 -39725 -84637 -56786 -214663 -338630 -183289
20228 -183289 -8420 -18973 95704 99545 60369 -13675 -33243 58073 -45844 -167153 -160628
20217 -160628 -191315 -113950 -200389 -181648 -42761 -154449 -87364 -39398 -86551 -103150 -82832
20206 -82832 -99999 15835 11559 26009 209237 87151 -79044 -178456 -189899 -146560 -88693
20195 -88693 186109 206876 28211 -104917 -207076 -181814 21038 32514 -99611 -50377
20185 -50377 -15324 -1249 47356 208255 259007 43101 47196 121389 58900 230610 196817
20174 196817 -11495 91800 210043 165532 249147 199430 36441 -131684 -191528 -278923
20164 -278923 -197451 -149531 -198104 -198458 -37002 90911 50762 -60782 -75385 -79967 -87247 -106411
20152 -106411 105959 192549 355518 98427 -185760 -199818 -289820 -219741 -93064 -81936
20142 -81936 66810 102211 41649 -85434 -131468 -123588 -127125 -77404 -81607 -65177 30861 56198
20130 56198 -102298 -245431 -253917 -97834 62189 75274 31561 143719 164661 167333 153966
20119 153966 222091 215972 156108 39051 -39597 54022 159671 260418 268853 92543 61267
20108 61267 -32142 -67732 -83545 -163951 -226560 -318121 -320725 -236473 -216504 -291073 -221207 3739
20096 3739 142310 -79155 -72704 -2542 93693 105446 163388 24731 -316625 -318109 -147792
20085 -147792 -174595 -199763 -125658 -96903 -80401 -128820 -103722 -4579 133073 164056 59339
20074 59339 111705 294313 375325 255397 62524 74265 127442 52834 146407 84575 20875
20063 20875 53192 77015 -143648 -152594 90382 152254 94612 39212 93443 106115 42115
20052 42115 4018 -32992 73972 -62243 -225975 -235925 -192265 -157729 -43723 -43922 -54454
20041 -54454 -227328 -179152 -164756 10696 60397 143538 204581 115296 171837 172052 76626 -25220
20029 -25220 -25984 62357 31611 -20993 -12326 171503 187599 -90375 -128324 -114615 27096 -23217
20017 -23217 -185719 -175647 -310468 -318351 -244734 -258700 -454061 -527797 -220662 -111860 -128153
20006 -128153 -50672 -161209 -132326 -27156 115975 256529 237813 163712 57608 264464
19996 264464 345897 132754 -21318 17169 141747 76633 74342 62527 101859 77818 169076
19985 169076 248332 325414 459958 653605 756786 1019170 1113999 1094426 915044 790359
19975 790359 767623 601685 532275 341396 299130 184391 47217 262347 317502 216528
19965 216528 209228 485710 631470 613638 682410 485616 376648 383928 543259 701915 685607
19954 685607 648711 662225 775073 802991 728973 816086 905143 927632 1007662 1095610 1140727
19943 1140727 1249397 1490216 1540395 1392875 999668 847504 561875 427302 463469 474849
19933 474849 456364 419705 471497 642364 843304 926489 974023 826226 913458 919872 1081157
19922 1081157 1447516 1527141 1315802 959021 808623 768016 661063 506904 365436 294246
19912 294246 186118 113851 115137 46069 196018 389826 372043 239297 306839 315273 384266
19901 384266 298036 300819 322093 395882 237945 278057 245644 180181 191937 359804 349575
19890 349575 392640 517219 312250 131376 30002 9980 -7753 -43452 -117176 -108869 78877
19879 78877 175938 342708 276123 244731 179656 10941 -127401 -134372 -127640 -154101 9571
19868 9571 58526 102872 44895 121866 117895 -167396 -415206 -492572 -317777 -199850 -371647
19857 -371647 -390205 -128121 -13770 -18714 -38358 95713 188105 132993 -12231 -152502 -86187
19846 -86187 -146729 -71443 -17495 89450 283065 330421 149229 3860 26951 60414 12667
19835 12667 -8562 3020 -43060 21306 106342 180375 194692 59498 -79357 -132196 15796
19824 15796 208469 133512 -101327 -161942 -121403 -148462 -85631 -5866 -218037 -332820 -160666
19813 -160666 33513 -96021 -83115 -13006 -51618 -209247 -333958 -236096 -97389 -225679
19803 -225679 -509785 -578764 -492333 -354231 -311322 -244271 -39691 -20496 -64605 -138275 -141486
19792 -141486 -43693 24668 -70156 -195961 -172482 -18764 28518 80445 179316 194108 94860
19781 94860 26755 -107235 -41368 -172675 -138684 -14891 -169401 -241154 -214888 -220053 -125648
19770 -125648 -52909 -34029 -161624 -402847 -460664 -339552 -249979 -61732 41095 36524 -18958
19759 -18958 16748 74449 117059 61672 4866 49263 50103 133443 216937 105084 35626 189402
19747 189402 182263 125630 36945 124374 141995 116025 200878 269954 213911 131380 163094 179814
19735 179814 295942 367599 308489 313288 217802 118618 9923 125440 84948 -13150 -27931
19724 -27931 -52863 54291 8215 29450 -13013 -117230 -104913 -112273 -275775 -254540 -57149
19713 -57149 89517 107697 241180 132038 155545 145902 6038 81351 94967 -5719 -68152
19702 -68152 -103250 -69939 -70506 -62316 -186164 -235727 -250053 -68861 52046 216687 221244 238694
19690 238694 192587 140907 187773 116134 70913 31910 101587 160310 169813 76115 25711 52115
19678 52115 13910 -32228 -140446 -53510 -106191 -164073 10274 32475 -66665 -20603 62432
19667 62432 147411 238070 286770 102759 146274 265189 308354 140413 110994 9141 -94085
19656 -94085 -307132 -298520 -247695 -207096 -96386 90929 -63110 2338 98962 -45236 -109529
19645 -109529 -102194 3522 -33624 -125977 22019 -76735 -287617 -269797 -168881 -97739 -137997
19634 -137997 -138450 -154574 -202908 -184466 22620 144258 184345 11503 -166000 -129756 -150144
19623 -150144 -272779 -309228 -209338 -263218 -252250 -291178 -236823 -157963 -181815 -198352 3500
19612 3500 125651 41010 -188786 -314053 -197698 -148668 -75761 50422 -15546 -51443 -148531
19601 -148531 -274954 -363758 -365031 -169304 -268226 -322092 -468598 -381626 -416237 -458641 -440499
19590 -440499 -358553 -306365 -219856 -110949 -134738 -147503 -184109 -142349 -48625 8941 -135335
19579 -135335 -219343 -410608 -401216 -211837 -111529 -116857 9238 87157 119931 16545 60737
19568 60737 210294 146401 20164 101074 109164 63085 14900 -5167 28275 -73676 -212162
19557 -212162 -126792 -145019 -222585 -424402 -295640 -122370 -21108 177868 259251 181030
19547 181030 158398 254730 297011 196751 67973 -37716 57778 237561 144311 3195
19537 3195 -41423 20961 -77995 -183046 -213252 -182347 -33635 176826 138315 104557 53105
19526 53105 58609 -101927 -269677 -224948 -77744 -38465 -141585 -2777 166297 189707 63583
19515 63583 -69939 34183 -208491 -398788 -275041 -141109 32230 55047 19311 -182800
19505 -182800 -177043 -52157 -57767 -9066 151549 206235 59291 -38209 -184269 -119080 -52559
19494 -52559 -127399 -122904 -50004 -135931 -194683 -188426 -123303 -305407 -430661 -189227 10905
19483 10905 148975 2331 -48153 -39184 -79606 -129007 -194279 -308530 -296808 -265576 -247846
19472 -247846 -70862 -4977 9353 17377 -205102 -203118 -15366 100274 -30850 -22078 9019
19461 9019 -109292 -88379 55257 178047 164551 48621 1103 20408 84475 120688 167232
19450 167232 112089 188650 265956 187221 -187179 -239728 -335323 -459855 -406920 -239578 52887
19439 52887 91357 -51242 -177929 -327792 -275506 -238027 -332898 -348934 -276552 -74735 -75378
19428 -75378 -15607 -132846 -192337 -210943 -237331 -267151 -300826 -296253 -224764 -272808 -454375
19417 -454375 -336837 -251612 -263968 -140110 -74156 -173385 -266533 -350418 -142787 66136 82700
19406 82700 70046 67195 -210074 -383306 -300355 -186271 -184767 -268924 -126909 7540 -49784
19395 -49784 -237890 -48383 162836 131202 128431 19897 -235107 -342953 -445827 -465311
19385 -465311 -300506 -213714 -101968 -100955 -112034 -93284 -126948 -16814 -154182 -178892 5296
19374 5296 14755 -2001 -101879 104115 102424 132365 68561 103360 207392 21452 -129156
19363 -129156 -60618 175808 44782 -67920 -88138 65332 116105 -17239 -43562 -13647
19353 -13647 -83514 -104571 17725 75426 120371 146154 143087 156738 63185 -37850 -227320
19342 -227320 -313675 -1319 256217 189007 144345 232389 55626 -164870 -170902 -76069 -13143
19331 -13143 -101177 -293927 -234848 -241966 -222514 -95521 -152326 -49767 163036 158908 101977
19320 101977 -2728 -85823 -71963 -83331 -108609 -117792 -107583 11490 -128272 -73286 86693
19309 86693 -71683 -235888 -54806 84146 1376 -90015 -78869 57475 190295 179389
19299 179389 73822 70057 190499 286298 109506 18024 -91394 -183724 -99282 24114 113989
19288 113989 207508 256901 169787 274225 357579 222805 94894 -85737 4918 191650
19278 191650 252212 154066 18405 69925 82905 42329 157531 -42612 -174269 -122589 14714
19267 14714 39621 26095 -25112 47393 62402 366591 343993 164776 -62172 -47839 126736
19256 126736 72387 -67346 -169160 -122336 37027 -1051 177368 188746 -101471 -109918 -134684
19245 -134684 -22776 163087 196083 298939 294792 272002 210847 76085 232273 77217
19235 77217 94913 125254 178220 125867 107211 65650 168936 301396 229441 48798 -195384
19224 -195384 -242706 -292973 -250706 -19223 -2426 44693 118120 143722 172132 70870 96439
19213 96439 168437 157808 244405 101493 36681 -47005 -83872 67185 -13161 -29362 -14047
19202 -14047 110608 73961 -29517 -105922 -159666 -161514 -183801 -256363 -151746 27985 214218
19191 214218 314476 257607 199014 270684 317547 151601 121438 238576 191621 186917 131345
19180 131345 139835 232850 255676 254141 281621 288601 143600 202719 264040 117957 51526 41949
19168 41949 88854 99655 77027 26928 60362 44836 127793 31746 -19358 16748 133184
19157 133184 153541 7497 51672 33757 13321 16523 61212 -68790 -35175 202152 140983
19146 140983 60475 52144 24247 94785 210171 185910 142930 12549 -77542 35613 2422
19135 2422 -42894 112322 -15615 -88121 -8495 135086 190460 128656 85263 101848 149952
19124 149952 191558 117131 7016 -47091 -122060 -150347 -85575 -101799 -40750 -85645 -247483
19113 -247483 -259503 -85430 153105 270796 380330 249430 236450 376996 234428 262168
19103 262168 212403 246904 301360 342059 329723 256441 119306 203301 431356 513796 405239
19092 405239 261569 222740 192582 220955 305873 114987 37170 210173 315516 350819 234119
19081 234119 332780 391360 414876 543965 494058 495127 391549 330426 392103 268478 187283
19070 187283 371960 635646 818845 919161 1206143 1352838 1338265 1208474 1101036 1108681
19060 1108681 1302002 1283191 1261389 1227270 1025940 948730 936300 961736 912457 1047927 957835
19049 957835 937568 955575 976816 863897 716865 776387 861331 923443 975420 747469 667190
19038 667190 729968 919772 1035820 1224766 1282956 1359154 1551441 1771831 1874054 1863952
19028 1863952 1546507 1292195 1062528 1146469 1078863 1103633 1221650 1246153 1097373 1232008
19018 1232008 1187171 1129938 1052730 990036 775535 814937 964831 1088681 1167223 1114820 1084591
19007 1084591 1468047 1626058 1631529 1550259 1585857 1644706 1558045 1253941 952165 818774
18997 818774 763012 698945 519621 412954 436391 551224 619443 609833 598041 671750 643502
18986 643502 695110 708918 782638 883148 959816 712623 628135 522818 401770 306277 245532
18975 245532 150643 193993 240828 279274 263433 161609 182838 166403 212509 220991 146375
18964 146375 24718 -19499 65435 67487 -25029 -96486 -23751 122544 191016 -20403 -231579
18953 -231579 -244927 -115848 54983 91419 80328 124757 49021 96936 193024 151845 108322
18942 108322 -34970 102549 149872 204322 128796 10123 178238 258740 24799 -125028
18932 -125028 -114826 6498 188083 324731 306939 230444 41909 73242 -54935 -46898 77588
18921 77588 180981 395905 642842 553290 323919 360981 455174 413056 338998 352566 230202
18910 230202 224996 218318 199473 332371 371279 400516 152722 115951 78499 105644 53428
18899 53428 132616 214308 226138 50807 73190 131842 208049 257367 221241 273451 140196
18888 140196 37440 124471 238932 155742 95086 104205 246926 379450 406903 471806 330760
18877 330760 257092 203882 191033 120791 79405 69937 65834 20930 46044 -109617 -76396 -5751
18865 -5751 1109 119066 267014 438400 524993 453455 334895 186857 3184 -29203 186033
18854 186033 333750 398379 272099 216700 285480 365221 400236 377142 366889 233639 142229
18843 142229 158141 152748 239476 380021 354805 315787 270901 414199 494377 531953 545649
18832 545649 366087 412268 256906 237517 227377 259037 212370 330631 306532 265857 303965
18821 303965 218896 292512 349755 458207 702974 717542 480528 380837 484553 444797 368197
18810 368197 326985 459117 442376 461931 466620 539818 465061 187492 5959 203249 480067
18799 480067 622030 502184 542679 520259 557261 582305 347717 296374 302953 314349 376244
18788 376244 474554 430866 300511 215475 419192 550724 628679 626859 588143 575192 611936
18777 611936 476065 457679 583380 653399 645273 831573 806585 568246 454114 534269 579433
18766 579433 655737 777283 776030 818030 725322 662965 708308 860624 920546 985007 899989
18755 899989 829168 750827 767673 841300 679717 547743 621489 506919 465141 515423 649327
18744 649327 889792 848638 788078 867541 1101557 1366491 1708892 2003032 2429682 2718357
18734 2718357 2892627 2834555 2890542 2909412 2683702 2399477 2068167 1672059 1533899 1515749
18724 1515749 1374634 1403227 1393715 1543497 1809594 1907206 2049697 2199943 2408851 2634919
18714 2634919 2903152 2927867 3047355 3062768 3046143 2617794 2263715 2276265 2251808 2207959
18704 2207959 2191959 2170566 2105405 2224532 2374703 2462426 2665650 2906579 3019424 3068150
18694 3068150 3150746 3199330 2880462 2546480 2431637 2428913 2319592 2263991 2149419 2173424
18684 2173424 2208916 2363351 2668460 2898958 3143110 3547865 3946786 4197381 4463489 4451565
18674 4451565 4657421 4764978 4561572 4245768 3735083 3257934 2959812 2928887 3042511 3051365
18664 3051365 3098908 2985725 2765838 2787865 2940016 2961022 2976217 2964092 3168968 3401063
18654 3401063 3406602 3435583 3470351 3346304 3335616 3464652 3498839 3515886 3416014 3407536 3511260
18643 3511260 3523671 3348383 3328496 3397309 3443139 3471298 3569256 3567482 3610644 3576820 3387722
18632 3387722 3338482 3381267 3433737 3629401 3801891 3925772 4000637 4263981 4418661 4559413
18622 4559413 4534837 4555502 4675875 4594580 4626538 4652051 4623685 4771835 4869307 4690004 4644276
18611 4644276 4571690 4417847 4417226 4451855 4404191 4620097 4764116 4711798 4704366 5053565 5094187
18600 5094187 5015747 4935752 4970435 5289287 5768432 6077652 6285053 6655387 7299483 7790097
18590 7790097 8381195 9312302 10688466 12408053 14647297 16974058 18831779 20650214
18582 20650214 22502049 23743835 24247963 24419639 25324396 27457160 30256919 32599030
18574 32599030 34658407 36915617 38273155 37105601 33986252 31008329 28789999 27623195
18566 27623195 27470394 28238290 29973743 32656231 36469282 42153683 50707887 63392484
18558 63392484 82517796 111181708 149605333 190598946 223048485 245600332 265720861
18551 265720861 280085234 269466708 228162350 179374980 141790877 117216588 101907798
18544 101907798 92366721 86804515 84011469 83993365 87267930 94485915 107156796 127401504
18536 127401504 156709196 191943973 224478309 248005112 265289340 279735128 281228531
18529 281228531 256899719 215314473 176898299 150339306 134091336 125155528 121906126
18522 121906126 123897008 131624464 146888082 170686388 200123698 229140702 255103586
18515 255103586 278328702 294959492 295240250 276836231 247763812 212862626 178372836
18508 178372836 150987492 132140819 120049888 112953629 109855833 110299386 114557433 123786801
18500 123786801 140101682 166929065 206840498 256158988 302298785 334708744 357844262
18493 357844262 378097574 380769158 344598740 280185985 218767407 174358205 144679478
18486 144679478 124560435 110161216 99571771 91702759 85652317 80926017 77347982
18479 77347982 74997242 73646035 73691354 75150462 77962473 80941827 82739067 83861644
18471 83861644 85497877 86436569 84081493 79036677 74667273 71530156 69044246 67331177
18463 67331177 65442929 62293810 57369918 52004386 47520589 44160744 41493695 39266764
18455 39266764 37571192 36054944 34765242 33571529 32449012 31513277 30655493 29678903
18447 29678903 28795761 28109033 27407190 26600375 25956426 25319967 24725773 24310424 23927842
18438 23927842 23437170 22898655 22485117 22174472 21780845 21453802 20922105 20376064 20064524
18429 20064524 19745640 19358804 18928937 18557346 18138600 17801679 17447439 17034923 16581072
18420 16581072 16433951 16146108 15883805 15724885 15416236 15082945 14866879 14698698 14527385
18411 14527385 14293443 13959153 13695512 13638669 13449372 13308221 13034069 12753634 12506058
18402 12506058 12236369 12209016 12282062 12018324 11773455 11684957 11572902 11441712 11279418 11126309
18392 11126309 10826789 10581112 10295694 10114979 10175411 10076682 9824105 9676356 9512891 9337214
18382 9337214 9280968 9258782 9220870 9218837 9142679 9044261 8860048 8747782 8544861 8464084 8522445
18371 8522445 8491212 8301026 8069481 8182036 8063353 7787698 7687495 7429098 7350856 7305535
18361 7305535 7222014 6993437 6876039 6925561 6926088 6655804 6431013 6409522 6386247 6112206 5854825
18350 5854825 5707063 5542672 5570288 5531397 5416719 5217571 4986841 4966760 5001481 4983207
18340 4983207 4762378 4614301 4769411 4795472 4790498 4695997 4481513 4372244 4388659 4473016
18330 4473016 4318107 4067524 3906469 3874845 3749844 3739922 3574896 3393407 3321608 3337560
18320 3337560 3478865 3535512 3621353 3625990 3506143 3429112 3319086 3236108 3250696 3283046 3122810
18309 3122810 3035096 3025837 3098906 2975023 2903068 2810733 2786642 2720811 2625654 2721052 2785686
18298 2785686 2796352 2638078 2480929 2560045 2506672 2470029 2508266 2505167 2408753 2332716 2236999
18287 2236999 2278387 2342347 2250738 2129757 2171197 2265602 2315401 2342502 2311988 2258813 2223717
18276 2223717 2223025 2079694 2005393 2061757 2166170 1939579 1814132 1743033 1670110 1576581 1554343
18265 1554343 1575541 1630894 1750884 1810729 2026006 2090358 1981320 1908489 1824466 1740166 1672946
18254 1672946 1656270 1654223 1534395 1608809 1669682 1682512 1611785 1519903 1580840 1726587 1685160
18243 1685160 1735249 1858102 1788634 1678968 1755384 1777546 1700185 1642027 1637339 1698367 1747401
18232 1747401 1704427 1716475 1599282 1677257 1679933 1742335 1768862 1760590 1877501 1977952 1940760
18221 1940760 2034952 2267444 2448146 2394846 2592658 2602734 2397201 2281345 2367925 2399351
18211 2399351 2355769 2476501 2601543 2604381 2516928 2534538 2456963 2400476 2417199 2457211 2624019
18200 2624019 2611778 2545887 2535744 2531316 2683051 2868961 2663837 2525960 2559563 2645276 2819269
18189 2819269 3150965 3295285 3324192 3243403 3101452 2960927 2899980 3012929 3007957 3064686
18179 3064686 3051579 3129670 3081368 2886381 2946952 2963202 3041089 3134151 3276002 3318004 3218472
18168 3218472 3058015 3070003 3254753 3143815 3245100 3459792 3665530 3758803 3665969 3755613
18158 3755613 3975524 4099648 4018997 4161009 4462208 4670038 4645906 4635188 4648552 4483611
18148 4483611 4523574 4413759 4389766 4398347 4416833 4577876 4710733 4742578 4721473 4683522 4871387
18137 4871387 5126850 5040716 4843593 4778654 4857023 5097668 5497562 5789146 6027791 6441205
18127 6441205 7076379 8010202 9117219 10454702 12221233 15172999 19021655 23559448
18119 23559448 28635028 33820442 39297950 44760394 49387074 52142856 53233773 52720827
18111 52720827 51171177 49117786 46133711 42047134 37653736 33977949 31445599 30197491
18103 30197491 29733482 30117658 31488483 33669268 36843737 41361997 47691068 56910646
18095 56910646 71649774 96837802 139030288 201086779 269096043 317368421 346711180
18088 346711180 382347022 416007997 390927203 301942384 214328930 158932002 127507961
18081 127507961 109414851 99129154 93600871 90932619 90947274 94476499 102979038 118742262
18073 118742262 144784560 182741917 227656544 266798132 293688125 315763934 334309555
18066 334309555 328193235 282554089 220972036 171894556 140415629 121802117 111575000
18059 111575000 106982029 107009132 112111641 124613147 148954550 188464091 236526266 273965186
18051 273965186 294672731 316504061 343288454 338243049 279119984 211937420 166677406
18044 166677406 139364395 122603113 111773311 104403216 99623156 97279109 97742549 102417505
18036 102417505 113273291 134534501 171913738 223822535 271718113 298240357 318056457
18029 318056457 348973415 363495317 314347797 233538030 173606980 138717161 118075630
18022 118075630 104707591 95535267 88715280 82997016 78222024 74263726 70993452 68611504
18014 68611504 66963279 66245368 66318575 66941141 67986395 69189623 70267976 70871571 70514312
18005 70514312 69126183 67091473 64765379 62689041 60393895 57850986 55064046 51729100
17997 51729100 48160724 44812555 41842564 39563758 37953663 36665345 35552186 34617738
17989 34617738 33960146 33027601 31845800 30834871 30180014 29467452 28372931 27411864 26604003
17980 26604003 26025072 25493598 25269362 25190990 24909575 24343063 23900911 23305272 22797815
17971 22797815 22118104 21444224 21051843 20517169 19898746 19648899 19628905 19393791 19178505
17962 19178505 18762663 18244485 17809240 17650413 17527081 17241499 17139174 16978131 16821674
17953 16821674 16601552 16252321 15783841 15361160 15128599 14847826 14547613 14327376 14131480
17944 14131480 14004045 13788707 13505784 13186830 13075610 12942242 12666888 12349636 12121043
17935 12121043 12009293 12052198 11799349 11422530 11103477 10872737 10783500 10736200 10750371 10628882
17925 10628882 10402353 10362181 10277923 10099451 9928789 9607014 9429811 9342957 9403053 9359679
17915 9359679 9291041 9059482 8870638 8682914 8577454 8498586 8303380 8081028 8069118 8092439
17905 8092439 8099236 7782837 7370055 7159357 7048621 6943431 6871331 6696483 6568674 6419799
17895 6419799 6122027 6076325 5979530 5902154 5864274 5809089 5793772 5649101 5477750 5367087
17885 5367087 5227632 5301522 5296208 5069929 5044395 4808641 4615423 4539540 4401832 4369362
17875 4369362 4465919 4521813 4347491 4240165 4087374 4054621 3876504 3782098 3755055 3710126
17865 3710126 3681947 3611817 3479716 3329193 3326022 3190589 3343898 3200833 2858379 2768759
17855 2768759 2709155 2756773 2807608 2626078 2542023 2620862 2703488 2596528 2535482 2492069 2518510
17844 2518510 2621198 2701223 2688425 2576629 2610891 2550323 2468621 2442685 2352454 2243236 2226683
17833 2226683 2305442 2478547 2385208 2153089 2164182 2116137 2179744 2225113 1965809 1859477
17823 1859477 1839664 1722605 1572287 1651049 1497696 1578886 1694274 1708387 1797921 1899151
17813 1899151 1897617 1611813 1444577 1367338 1364544 1332940 1403680 1344020 1503966 1622577 1566860
17802 1566860 1530388 1587074 1534332 1607248 1687686 1461214 1393140 1384774 1285176 1298092 1357921
17791 1357921 1421677 1306267 1392326 1340676 1229120 1194914 1150570 1217953 1146001 1045389 1041312
17780 1041312 1161119 1397233 1350940 1249501 1066813 886942 887576 898677 807718 813835 899355
17769 899355 768904 756709 838484 761350 744754 904412 809139 682962 595837 561410 626503
17758 626503 639557 708525 549042 598494 711745 725756 581051 413687 353660 365568 497617
17747 497617 555567 507020 589052 695402 710694 634010 637203 637669 730936 899656 997859 942926
17735 942926 905967 844973 715309 731646 738927 776216 719881 540765 552624 689002 551735
17724 551735 496299 599215 511739 338502 332590 499967 552339 517229 530680 353330 298855
17713 298855 252715 228105 151618 201166 332943 381770 307629 246924 274942 193551 103008
17702 103008 262985 352875 342051 450672 525457 503745 341345 179170 230936 449850
17692 449850 583105 580782 365274 -9017 -181647 8116 250436 338576 361017 187800
17682 187800 157933 299938 409383 232394 160927 282529 179074 212159 345013 340949
17672 340949 338375 440199 328842 212588 169278 180385 258580 191524 164843 195711 197003
17661 197003 188348 205099 232968 270277 365706 529469 445195 235167 446106 575669 428589
17650 428589 206982 30878 106204 112891 146114 157820 169505 175688 233829 303580 225620
17639 225620 159885 96694 162808 132140 60433 195394 291071 211899 135555 161744 229604
17628 229604 342304 478406 451109 344566 134831 19476 66302 3491 -72362 -64287 23911
17617 23911 49276 55098 122184 354744 354899 185330 260474 599342 611191 798253 875311
17606 875311 1112030 1201069 1209341 1355334 1305096 1365851 1330527 1231832 1294017 1407928 1397312
17595 1397312 1317362 1306212 1204125 817712 646763 478577 350126 444966 493390 344535
17585 344535 299657 74152 128866 164551 132071 30284 -116817 -158896 77951 307771
17575 307771 401818 359132 263721 240418 394202 467429 377526 342364 318327 264672 314275
17564 314275 396398 482788 638869 638024 552431 773036 820451 926577 1275309 1718450 1960912
17553 1960912 1994011 1959174 1929343 1871310 1993579 2010548 1963188 1901451 1718825 1655383 1585513
17542 1585513 1557322 1289114 930953 650965 305707 213156 361508 519415 509006 786575
17532 786575 825412 779392 613352 372875 128817 130513 179551 190131 164577 76458 -70530
17521 -70530 -60213 183435 57888 -21484 120971 199589 164143 161835 146968 131490 182501
17510 182501 461078 447152 562617 645314 735451 856886 938034 1062472 1108958 1177303 1213311
17499 1213311 1239223 1211355 1117400 976623 901982 861934 752571 640783 335988 423906
17489 423906 595927 468702 275219 122825 56628 155664 290868 257237 181737 136872
17479 136872 220394 184384 221153 230105 196034 266010 229625 160864 194921 178290 97271 79267
17467 79267 27666 -33355 17272 36296 23265 162740 51116 30525 79014 148837 276459
17456 276459 276122 162460 143805 165856 137673 133167 -45799 -158748 -35993 215629 232809
17445 232809 149678 130653 263382 317184 394960 263641 208783 160817 177118 205315 272965
17434 272965 144246 132883 170879 134167 102857 403 -3626 -144170 -205235 -136451 -125185
17423 -125185 -234493 -307319 -354889 -348243 -289203 -304728 -88336 -14833 45112 57656 -131680
17412 -131680 -133491 -177394 -101030 25031 23396 152529 46546 -8838 -115963 -48770 69409
17401 69409 33270 16782 -74488 -224420 -206252 -143277 -135121 -62965 -68051 -139442 -232114 -107745
17389 -107745 -1265 -17963 2349 154723 107348 53955 220293 328715 151872 52961
17379 52961 -139206 -104148 -179467 -136848 53170 226909 278838 153906 271386 269811 289581
17368 289581 344905 263860 113765 -4508 -201940 -285626 -251437 -195321 -51214 -20178 70550
17357 70550 -825 -83495 -1444 80603 12216 -22166 216337 195620 183032 165060 189921
17346 189921 187072 -16150 7138 209546 80464 40069 131917 157600 133302 33583 -48787
17335 -48787 35517 89401 95775 125618 164614 97827 3197 -7608 -49197 118 1500 71794
17323 71794 209813 237916 148575 -11211 -65040 -167658 -158325 -102235 -122399 -188666 -180198
17312 -180198 -81559 -78113 -43770 -44618 -205726 -153208 -100884 -77380 -17013 -19944 -24799 -8293
17300 -8293 -27514 90556 -43400 -120981 -108165 -51827 12484 58148 120701 202884 369805
17289 369805 256958 113230 56909 86377 -20255 -41257 -130149 -295924 -458640 -330417
17279 -330417 -187568 -222239 -337299 -307819 -238229 -164627 -182220 -298558 -285079 -297872 -344455
17268 -344455 -377435 -377146 -288884 -106357 -133767 -177782 -184742 -136139 -98064 90101 195377
17257 195377 59216 -142709 -250550 -190437 -217681 -11042 188235 102567 125236 234845
17247 234845 93765 -40748 -40347 -44226 -51122 -58495 -19892 63423 131389 -105630 -29526 -40916
17235 -40916 69640 -46212 -8863 360930 357513 246205 85190 -94989 -181906 -220892 -151102
17224 -151102 -105401 -49901 -122765 -181176 -129104 -151451 -175081 -218777 -376713 -391280 -340815
17213 -340815 -89712 35371 -69849 -97922 -85291 -81290 -26940 -124971 -375817 -231988 47276
17202 47276 7594 -119995 -133969 -169480 47808 94170 -85449 -160027 -137389 23517 41
17191 41 -146870 -160139 -91929 -15687 113612 101292 8053 45121 40479 -111797 -96770 -22677
17179 -22677 -78805 -190679 -134336 -27883 -172237 -250339 -113872 -135224 -163777 47550 191697
17168 191697 12309 -68607 -72147 -128681 -60098 -2545 -82744 -193448 -189883 -114256 16193
17157 16193 101412 174947 164137 169490 -24072 38330 256600 369059 265971 84019 119260
17146 119260 156529 -763 -128795 50676 65249 -59569 -64282 -45216 41214 30472 -192449
17135 -192449 -323077 -132030 -156152 6178 71480 -11911 34230 60090 50630 170014 191961
17124 191961 68499 15811 -152926 -211300 -47541 62765 61030 -82158 -88336 -123159 -93694
17113 -93694 13239 154568 222726 87681 -87674 -164271 -23936 126403 99814 76301
17103 76301 32255 -53498 -102022 -110488 -102277 -117414 -96942 -110426 -189316 -217841 -227361 -33346
17091 -33346 55161 -82611 -241132 -247424 -202051 -125041 12022 112007 -37810 -241356 -120749
17080 -120749 -120414 -159545 -14824 96999 38777 17109 97666 48737 -6983 -233897 -262895
17069 -262895 -212608 -235323 -185353 -94373 63769 53997 -50916 -154104 -155298 42046 145419
17058 145419 9645 -88457 -34182 45563 94827 171647 246376 342732 187089 -217311 -333669
17047 -333669 -217673 -181389 -72842 39827 138577 148463 18288 17525 -82930 -173151 -207148
17036 -207148 -182854 -50911 -35321 -40742 -64308 -71528 -317731 -187970 175081 383572 456474
17025 456474 291829 93776 -14518 59260 2364 58342 68871 50133 5088 136939 168603
17014 168603 38538 13121 61093 57463 71129 34944 -119825 -92335 135919 169700 86805
17003 86805 -114865 -143392 -286350 -297757 -220249 -252075 -332358 -239747 -11247 -79212 -98615
16992 -98615 -57038 101185 184038 274608 344689 220585 301307 338840 152895 55189 74701
16981 74701 -67164 -153579 -118418 -60104 35811 -88745 -153930 -149105 -16515 27640 -11375
16970 -11375 -59702 -66026 -112196 -161229 -78361 -93609 -190861 -64019 -50055 -68168 200931
16959 200931 473646 326408 364458 224392 156071 191814 95440 13856 -85894 -187187 -133415
16948 -133415 48629 20305 -68356 -64408 34028 -117492 -111134 -141578 82749 30057 -164853
16937 -164853 -283360 -87616 -83016 -339049 -405551 -388195 -233757 -140822 -121533 -151058 -98800
16926 -98800 -33037 -98242 -222825 -177430 -226926 -319116 -320629 -102915 -29496 -138550 -166509
16915 -166509 -217123 -162732 -136379 -11893 -119836 -47508 -42751 -264451 -548516 -587433 -549445
16904 -549445 -339746 -108607 87411 146031 83856 13973 42226 171271 218225 260337 185343
16893 185343 211614 133799 -15138 -213659 -211768 -90775 -150977 -282363 -216322 -123097 -144937
16882 -144937 -205875 -348521 -452358 -440253 -388763 -384491 -470083 -383855 -223467 -91368 -77408
16871 -77408 -254976 -342428 -176613 -92540 -44761 66284 178691 409395 546673 424938
16861 424938 263810 81240 -165015 -273778 -218719 -229980 -284469 -263505 -193824 -262676 -310032
16850 -310032 -313213 -377545 -312109 -246735 -183259 -177354 -200882 -76403 50717 21248 -55879
16839 -55879 -106102 -116982 -209934 -162314 -57739 -103984 -160966 -130318 -136782 -111915 -50684 6438
16827 6438 -140478 -231440 -279119 -245035 -213374 -126700 -94462 -114422 -72184 -107721 -24116 -223589
16815 -223589 -201400 -101401 -43175 -75037 -114891 -96303 -157282 -181640 -27786 73938 63241
16804 63241 -51883 -48782 -188753 -62825 -51078 -15457 -109573 -190802 -194293 29047 55005
16793 55005 -3729 249030 214165 -94072 -191396 -239534 -160590 -137627 -283877 -281943 -111041
16782 -111041 -102557 -144923 -69638 74067 125211 174133 96875 96733 112645 -169750 -178146 86756
16770 86756 181366 153409 -98872 -111063 90462 32997 58065 -5606 72897 97809 108884
16759 108884 129361 283935 195439 43658 148835 261808 163999 212024 173158 59278
16749 59278 -270113 -456367 -421771 -376095 -444871 -427595 -292582 -72151 -115767 -45862 40514
16738 40514 63417 168849 16619 -103941 -189842 -216492 -234602 -296661 -113103 -102866 -55196
16727 -55196 -82949 -244245 -446576 -421227 -256326 -209956 -239770 -238541 -233206 -156131 2375
16716 2375 -18255 -73020 -184858 -266883 -168413 -137078 -157003 -108302 -101823 1029 -90040 -87614
16704 -87614 129996 205753 198635 87713 -47670 -105938 -58107 -70268 49599 89603 127849
16693 127849 140371 47902 50765 239902 145783 -6406 17178 19090 -810 -51960 80896
16682 80896 123775 83505 -74791 -111228 61616 164043 161854 182654 139201 79434 129506
16671 129506 98465 13389 12406 161074 277324 292154 190791 106877 154225 132182 119605
16660 119605 -41539 -237767 -191893 -64604 14477 47020 -91308 -39987 143886 72991
16650 72991 -21377 -148130 -202665 -173830 -226113 -247543 -243184 -245533 -178511 -25616 95604
16639 95604 34429 6054 64372 138600 175923 170670 143790 160021 74263 -172686 -301712
16628 -301712 -246911 -412870 -360857 -302432 -72155 -3538 -56525 -127830 -106881 203047 240859
16617 240859 104117 -52412 22946 54247 -36139 -119700 -27028 -13115 98524 148897 146279
16606 146279 19671 22926 124727 41223 -28380 126206 207227 5343 -68889 82355 256765
16595 256765 133179 114701 -4888 -21179 161117 288962 119626 -101409 -216951 -189259
16585 -189259 -276670 -298533 -84734 176279 231296 232520 200579 25141 3691 224558 186953
16574 186953 98031 14680 40989 -27771 -64375 88266 17336 -48617 58589 145206 16333
16563 16333 -31740 -68405 -28054 43814 -10689 -65570 -14258 -98383 -227737 -207307 -137275
16552 -137275 -99628 -241355 -112216 41842 20511 -51465 -43154 -196492 -99645 -81051 -106772
16541 -106772 -6374 33975 68045 30453 13454 -65831 -168467 -128056 14571 142547 69390
16530 69390 21749 92499 166922 49652 51253 -28667 30983 10036 -7561 -127025 -223924
16519 -223924 -118102 -56741 -13951 -11861 61297 130718 59448 -10552 -85060 -113963 -94790
16508 -94790 -60456 -123483 41166 50775 173306 16470 -91608 617 73741 28542 27096
16497 27096 125536 93395 -3620 -124157 -134923 -10153 -45387 -88159 49883 -114829 -68393
16486 -68393 -76275 -149861 -13343 140661 161869 2573 -188246 -357129 -465720 -379598 -204238
16475 -204238 -115187 40240 7300 -45557 11773 -119882 -218729 -138383 -51494 -203362 -170152
16464 -170152 47613 48441 -19203 -18491 107609 281982 296845 99399 20916 -64672 54180
16453 54180 58677 12036 -94556 90586 265926 154754 -101509 -163399 -285213 -342197 -283697
16442 -283697 -134367 -34329 -54128 -132712 -70521 21783 -109596 -28091 104745 244417
16432 244417 99407 10144 11090 -183538 -224801 -245994 -136204 -111374 -157921 -13164 213921
16421 213921 151143 17977 -196666 -226763 -104145 -206317 -224352 -214439 -224174 -231634 -186393
16410 -186393 26752 173679 149368 37333 93578 17402 -56188 -106493 -66997 91843 -137512
16399 -137512 -206275 -74676 -183197 -286044 -150765 -171613 -317073 -462120 -586997 -448842
16389 -448842 -293217 -310761 -201609 -168874 -84803 176308 351892 315822 99482 -17741
16379 -17741 144583 70544 92101 190212 284125 264578 337280 321744 165193 49976 123008
16368 123008 143078 76624 -154429 -327945 -143203 -84211 -175893 -92531 -26566 -39371 -50460
16357 -50460 -182724 -174643 -172564 -188337 -188800 -137823 -150039 -178489 -95594 5169 103470 144150
16345 144150 49954 -56933 13048 123434 245983 310377 179632 158418 68081 -135385
16335 -135385 -87693 -71405 -63769 -36786 30779 109175 229687 293245 97849 8099 -72232
16324 -72232 -164981 -104841 202350 260873 109748 106756 224378 143662 -85305 -133349 -129976
16313 -129976 -255734 -286343 -325463 -338458 -272326 -201530 -92751 -236953 -287853 -227180 -96451
16302 -96451 182213 170581 144131 117352 -92020 -211895 -104628 -216598 -237265 -124499
16292 -124499 -230511 -325167 -176519 -59208 -181887 -305402 -207212 -122669 -64821 -12554
16282 -12554 194384 206939 32164 22490 -117210 -318206 -214498 -77421 -89389 -155671 -130356
16271 -130356 -77576 -55725 -110020 -134639 -89086 -65681 -257315 -259421 -122653 -203201 -244365
16260 -244365 -127004 -163471 -163422 -248386 -121173 -66796 10945 -111280 -112386 -243330 -240405 -106157
16248 -106157 -84556 -110866 -124414 -19285 144014 159927 215387 256067 185796 244988 121490
16237 121490 40367 38567 236197 261759 136778 75975 117721 37140 -60121 -122970 21928
16226 21928 114952 38168 -24175 10567 -37004 -31601 -29178 -40202 -27279 -3845 12347 167718
16214 167718 252490 98800 5150 85661 123807 111810 86824 35900 122668 234129 40004
16203 40004 168883 111792 -117882 -119023 -94899 -112825 -80039 1303 66692 64848 137988 125762
16191 125762 176612 193845 66881 186720 320919 198207 13935 -143984 -105328 13479
16181 13479 99002 44680 -52974 -65034 -145459 -151557 122865 127637 -97738 -110703 67003
16170 67003 38755 17670 -28881 -183399 -199021 81066 95603 160617 83037 -13132 -63520
16159 -63520 10784 -32353 -39951 70788 70049 -223652 -349692 -210139 -82457 -155873 -262111
16148 -262111 -317843 -209232 -146515 -184703 -183465 -312662 -214695 -154731 -152535 -197840 -177718
16137 -177718 -56471 -113338 -77086 -44460 -140103 -185620 -8400 98110 -15351 201147
16127 201147 263828 241101 245171 340389 362399 388462 404355 359888 244258 283243 237075
16116 237075 136467 177171 -428 -100379 -83734 -138293 -128635 -158075 -177443 -159993 -225200
16105 -225200 -358146 -390229 -496201 -315332 -147644 -116345 -20636 -92947 -97124 -139304 -106077
16094 -106077 -154575 -186162 -330099 -219878 100437 196784 162342 117471 152194 200164 229326
16083 229326 126525 -47138 -161377 -107153 -5366 22268 -44040 155260 166225 86183
16073 86183 78713 49808 99198 119140 146067 25453 -31527 -3422 -127963 -178643 -270651
16062 -270651 -160885 -34358 21123 112051 127933 17041 -59176 77811 173645 243676 221232
16051 221232 190195 156108 225512 140936 95061 -917 2656 -23951 -32838 -139246 -335212
16040 -335212 -191114 -100481 -46221 -61740 -10586 -55445 74918 190677 72742 -76417
16030 -76417 -88058 -195050 -240315 -154770 -64162 -77241 -168809 -274562 -253894 -206514 -146337
16019 -146337 -71278 -80053 15151 45046 108205 131887 75395 125625 223782 139697 38499
16008 38499 26972 88119 243550 77154 -40379 62317 -2731 -136109 -12492 30254
15998 30254 112842 57580 -5319 -212153 -305229 -265064 -114026 -137680 -137133 -21538 -2660
15987 -2660 8741 -302227 -338116 -101802 81892 39340 -32117 -66329 -12685 -24478 -124320
15976 -124320 -174294 -81774 44310 77138 -60000 -94343 -178306 -164796 -232782 -19385 150788
15965 150788 35314 -17593 103473 128278 -41297 -207689 -16012 183331 134411 102076
15955 102076 180202 311240 194319 -107766 -107262 -93015 -161048 -249920 -148695 26102 142752
15944 142752 40138 -96211 -156889 45859 91832 108748 -49457 -191212 -141298 -77586
15934 -77586 -67932 28338 169565 -14912 -3311 138266 -56840 -235271 -207309 -84276 22576
15923 22576 -28870 -68111 -111295 -29323 -80832 32447 33884 -20144 -26490 10453 128910 -38370
15911 -38370 -285891 -392776 -371843 -264466 -248030 -136234 -120860 -88084 -89229 -160463 -48163
15900 -48163 -47964 -59276 -124829 -136380 -260355 -265714 -305650 -272970 -312036 -244210 -116529 -83976
15888 -83976 12951 -19608 -81852 13568 -49096 -50310 -66168 -46296 5346 -108912 -128030 -52031
15876 -52031 -172042 -27287 94428 85003 84064 -26677 -127137 -58366 -87675 17916 -97219
15865 -97219 12288 -67087 -233217 -227449 -210794 -93584 -23786 35163 -138655 -267335 -234372
15854 -234372 -141620 7336 -41324 -44316 -44577 -33075 -184886 -250892 -205224 -182760 -162168 -158815
15842 -158815 -198152 -342438 -361468 -192179 -77547 -78078 -166960 -304086 -459017 -447432 -333291
15831 -333291 -172302 60093 95905 -88530 -116532 27704 -6294 125725 141367 222746
15821 222746 232965 184577 -100504 -43186 193700 275908 239674 111321 1832 15199 27878
15810 27878 -31304 -98323 -99750 -125051 -283122 -197388 -62049 132322 61429 -64908 -142332
15799 -142332 -132805 -31911 -44322 -160685 -174102 -111992 -207059 -81207 190264 245873 181013
15788 181013 143021 85724 34991 -165573 -237337 -464512 -451876 -339907 -317615 -204101 -118240
15777 -118240 -68127 -1203 154210 85110 95203 60032 41625 -22527 31670 145752 142090
15766 142090 199108 200890 281572 258251 149751 -55315 -102284 -102581 28046 59512 51761 142105
15754 142105 184864 4404 -36258 90297 121048 -6449 -145538 -119064 -303782 -332661
15744 -332661 -193824 -196301 -228873 -246727 -172578 -196322 -51693 46722 87307 171630 284734
15733 284734 295537 220997 194677 271093 301981 160796 -102311 -65090 73568 134979 -23016
15722 -23016 -49179 -86706 -56131 -8873 -5799 -93430 -71325 3743 230422 287626 136991
15711 136991 -22010 95738 169221 245633 189812 128582 156500 233048 297953 170846 -23578
15700 -23578 -258501 -246228 -410110 -272487 -209207 -286457 -245467 -253258 -289744 -269196 -168606
15689 -168606 22026 80417 -12535 24942 185453 23900 85236 220873 188901 101270 102724
15678 102724 269653 304775 226348 189679 68310 -74585 -99731 26196 62687 -103408
15668 -103408 -95438 34811 157322 176071 96435 -71126 -39786 240583 221003 137105 23168
15657 23168 -55726 -110596 -123069 -29674 117875 191574 -41067 -200536 -273635 -103420 -27142
15646 -27142 -21330 3977 83266 48266 -71844 -119266 108739 246743 315407 402470 367037
15635 367037 438318 446375 255979 -33692 -113835 -33863 24994 59685 115017 184899 166726
15624 166726 123083 43015 38343 -91664 -5670 -35471 -206718 -231158 -139118 -189632 -180933
15613 -180933 -173415 -72252 -5032 -28312 -71939 161887 206085 180317 88392 -207229 -149222
15602 -149222 -164780 -74698 88715 61625 -2954 24458 122144 153313 -93056 -262876 -90008
15591 -90008 -1811 196924 236931 57475 -37042 -151701 -395576 -275511 -66434 90992
15581 90992 121056 52988 -196575 -196097 139914 275931 290628 369344 129057 -79878 -4912
15570 -4912 -1038 60758 211011 95012 107383 183 -49061 -59125 -83378 1904 -83822
15559 -83822 -92539 -165666 -280377 -49071 105818 83726 220 -73090 -221849 -228676 -53476
15548 -53476 132605 213004 90313 -9736 -16414 -10539 -50512 -9645 -14447 -309933 -368190
15537 -368190 -309619 -234084 -179674 -116918 4666 -111273 -181406 -89457 4318 104872 162614
15526 162614 61780 5461 -76126 -274898 -249492 -96463 -33811 -24702 -40529 -35352 -199484
15515 -199484 -271641 -137448 -184457 -91963 -117874 -67526 -60274 -227032 -158287 12669 -6343
15504 -6343 43218 62828 32813 -179847 -168240 -229666 -272151 -241866 -104501 63566 222842
15493 222842 220661 160113 20485 -27487 -78378 -50639 -35021 -60747 58928 -11420 -226410
15482 -226410 -309599 -249555 -60186 96185 155626 137841 111094 47577 -70008 -59992 -99641
15471 -99641 -18363 -135851 -414670 -326894 -252754 -253833 -211369 -36674 1904 -60204 47313
15460 47313 129261 121602 73913 55683 189184 242291 170094 84950 -54522 -37530 128422
15449 128422 223294 149409 160905 39074 -137708 -212360 -165672 -92155 67690 20054 -68910
15438 -68910 -27271 -9813 39137 173829 324940 220474 107759 -61772 -108008 -38804 -38548
15427 -38548 -3086 131278 181717 143739 21463 -101753 -12233 -151234 -112023 -49490 -7443
15416 -7443 96460 161768 351814 283612 188600 85423 -4067 -111399 -176256 -92230 -54117
15405 -54117 96952 173593 245668 151667 -27578 -9467 46454 70704 128090 84807 30897
15394 30897 -123213 -222222 -221100 -233806 -215180 -156717 -142305 -140977 -149415 -46819 -51941 15680
15382 15680 -119301 -188459 -216942 -268719 -110015 -36985 -6188 26034 -117509 -88000 -11241
15371 -11241 -183500 -313474 -100510 -5799 20112 -18746 -142111 -86811 -97447 -170747 -27272
15360 -27272 38091 64627 45042 155556 149551 -94073 -168685 -166685 -118524 -65730 43956
15349 43956 -9660 -71885 -144313 -166203 -220999 -151662 -20137 -61000 -62653 -33188 6412 197406
15337 197406 201427 118441 111195 98474 90322 141926 118294 58681 90904 94541 -47599 -138299
15325 -138299 -72279 -100032 81319 25001 -154900 -175156 -8975 96934 7677 -20441 -107910
15314 -107910 -70273 59325 122412 4045 143489 236060 68232 -134071 -269805 -339354
15304 -339354 -217056 -197362 -61240 -131727 -98886 -15036 -20845 -9435 151432 307947 191709
15293 191709 39140 -21637 36353 150346 108764 -56039 12497 -25889 -108595 -76952 -63033
15282 -63033 -128034 -198708 -102970 -27095 127659 211802 261624 86350 -22099 -23337 -25513
15271 -25513 1709 -138627 -73129 8603 21402 101276 15125 -39833 -114193 -201765 -15416
15260 -15416 27753 14538 75458 -90205 -187763 86051 128159 -2365 -126585 -65866 -111182
15249 -111182 -138436 -186223 -26901 -8730 -36135 -105321 -124123 105114 225870 284045 404347
15238 404347 146399 42540 99164 138481 74937 222372 286292 168456 172289 169935 68914
15227 68914 14401 -167258 -203794 -135364 -12041 -57219 2631 38385 -5860 41091 58794
15216 58794 -8482 126240 217520 174641 192354 336577 203538 22345 -157717 -304282
15206 -304282 -210995 42995 365015 359670 122177 -79897 -103900 -304919 -232724 -174277 -119713
15195 -119713 -10238 75253 -2893 -20972 52 -102537 -58589 -82583 -186079 -152966 -199792
15184 -199792 -312723 -226792 -162400 -254236 -290240 -185831 42701 97927 452 -33288 -118910
15173 -118910 -157392 -234146 -356828 -441455 -438540 -260852 -156761 -143976 -66425 -31488 19278
15162 19278 -120931 -186561 -171184 -94104 -129485 -41601 -52525 16685 -24220 78127 -12116
15151 -12116 -141175 -7081 194774 193190 112194 -70639 -89656 -105047 -273309 -315492 -255226
15140 -255226 -187907 -126103 -168138 -91420 -70593 -95172 -17216 79076 -24325 -204845 -321480
15129 -321480 -72 140783 166381 142337 129772 8035 -14285 78466 50330 173488 180665
15118 180665 249662 141971 -5075 -175411 -21598 40972 -34013 -48309 -21763 -57494 -122163
15107 -122163 -135932 -224400 -151835 -127011 -265554 -111141 24892 -54540 -70434 -303816 -360251
15096 -360251 -205344 6792 32521 42101 -77319 -190937 -159076 8475 50391 -3699 62192
15085 62192 91049 142806 207733 152913 103371 49861 63905 -48670 -121770 -221478 -335288
15074 -335288 -224390 17413 39269 -47509 1785 -71391 -122827 -108074 21864 -32918 -174928
15063 -174928 -150129 -141433 15060 -11467 10875 18954 249011 339760 234788 -93888 -131712
15052 -131712 -34337 -98623 -155174 -173113 -110834 7086 15536 63536 1621 11181 24552 -94896
15040 -94896 -155234 -219427 -197973 50589 167239 207354 179429 95346 -22100 -16756 -53697
15029 -53697 -122460 -306564 -111069 25582 34174 14736 24371 11329 85322 134878 -133049
15018 -133049 -291888 -115183 54167 107469 -105951 -390834 -594516 -512573 -122897 46195
15008 46195 61805 -147381 -272200 -95316 -956 -77232 -117487 -283547 -246307 -227259 -79194
14997 -79194 3057 116372 145115 -142699 -210534 -250169 -176584 135104 223991 77177 -115935
14986 -115935 -212735 -297819 -247722 -171691 -116110 -100220 60734 173639 160689 -78426 -83999
14975 -83999 -6421 107163 167023 138024 89386 -90662 -232993 -241280 -138316 -127168 -130713
14964 -130713 -136634 -142009 45585 58056 -160829 -149613 26553 92702 -125394 -45885 5714
14953 5714 64385 145737 130026 105663 117595 146044 207213 204582 7284 -210977 -238052 -160806
14941 -160806 -178215 -185061 -236676 -250060 -43888 18517 13916 -82344 13643 223316 199071
14930 199071 -19786 -96796 -194586 -194638 25764 193694 224947 167902 2679 -241098 -225601
14919 -225601 -187035 -12228 26135 -21096 -208180 -517168 -500206 -388878 -204643 -238198
14909 -238198 -229912 -78722 -3040 -112285 -137879 -239858 -156581 -81667 -43284 556 -86156
14898 -86156 -285026 -285501 -98092 22054 182517 284101 305983 74072 -5239 -22193 -99498
14887 -99498 -243904 -223686 -187365 -66330 -202554 -168741 -198578 -372967 -325207 -325738 -267282
14876 -267282 -241524 -262731 -261383 -255050 -32290 48350 -14187 -79514 -57116 -84013 -70381 -74655
14864 -74655 -83593 24038 212363 190935 -96428 -137754 4211 296512 380416 319299 347313
14853 347313 289643 241443 183887 -59165 -58755 -17097 -24977 6690 44863 -25801 -4682 -75588
14841 -75588 -48675 43713 69563 64609 24750 -96784 -170835 -206533 -264411 -44973 152181
14830 152181 249377 132515 -64338 -67165 24621 -26634 -73840 -160182 -211184 -274674 -75977
14819 -75977 -89051 -202573 -284225 -280139 -343663 -319176 -328118 -143681 94223 182982 57662
14808 57662 -50401 -99553 -202505 -96649 -191687 -198435 -36076 39493 -55368 -46696 43615
14797 43615 339572 309287 138631 122747 64009 88601 219064 216480 156098 63017 -33929
14786 -33929 -92458 -121164 -224106 -165524 -130834 -154479 -96102 -44706 -184425 -164251 -29040
14775 -29040 173186 288756 258514 188739 84925 112764 120114 92331 75466 -57208 -99924
14764 -99924 -23454 -51248 -141733 -27409 -47861 -215620 -953 78656 24713 75807 15335
14753 15335 -34526 -103997 -172759 -254933 -216012 -242708 -339012 -249241 -112356 96393 169062
14742 169062 69820 94971 177626 60493 52102 76655 -47356 73730 92776 63531 97410
14731 97410 23939 -167642 -207130 -132384 104570 215271 28537 -3214 -36911 -22208 -152949
14720 -152949 -87165 27375 76332 200904 283515 214993 143643 162843 208391 215540 193818
14709 193818 155452 107922 107067 215611 162399 124262 157448 28419 -33550 -3357 17116
14698 17116 61965 -123432 -151566 -119394 -119052 5287 77640 -74532 -251579 -207075 -115040
14687 -115040 12059 -37941 -100274 3129 78156 164157 188959 333802 151430 -8779
14677 -8779 -48269 27196 215693 336530 366901 161907 58064 -191163 -207768 -307142 -201156
14666 -201156 43421 227369 142072 38350 -35649 89895 -2959 -95771 -156969 -161543 -24958
14655 -24958 125092 275135 274409 201784 88218 22167 -77928 1077 -45609 -41362 -157856
14644 -157856 -105025 -115063 -108776 -132644 -229479 -276407 -183765 47394 -94272 -22922 97137
14633 97137 120678 141715 195400 229430 258155 195822 -15756 -116176 -39878 10710 -206636
14622 -206636 -188240 136829 151832 -26080 54705 30936 136665 65103 -94152 -288079
14612 -288079 -51627 69318 -15008 -45271 -35580 47250 40308 204831 284566 270617 262660
14601 262660 142190 66596 23762 -54193 -49377 136014 230582 179241 65506 22889 87160
14590 87160 224989 192198 104705 144977 -1624 -113531 -92227 -113740 -62934 -195130 -267525
14579 -267525 -214942 -352133 -178119 -137278 -109386 17472 27092 61555 85925 73605 -53001
14568 -53001 8636 88627 228383 227815 160353 89041 -12 19549 89965 118894 117337 128608
14556 128608 -44814 -174191 -254565 -254947 -164981 100618 105871 220542 322871 338974 301740
14545 301740 214436 103096 133385 44776 -101082 10460 -48491 -159171 -156380 -221716 -168217
14534 -168217 32677 68822 109113 162350 202663 248378 203301 271872 300373 349143 73312
14523 73312 -52111 115751 255780 294424 314958 393838 348863 179671 200874 80504 36436
14512 36436 116143 145663 275800 395560 379738 310784 267271 192384 13660 -105602 -151727
14501 -151727 -158946 -38913 11854 43885 39762 170824 242602 262088 26672 -74015 47998
14490 47998 171554 233601 180012 119409 208612 218434 227205 268434 254598 329467 307953 377352
14478 377352 400528 478621 352921 231284 162712 -39935 -49134 -33100 -127080 -110363 19693
14467 19693 123470 15856 -7386 -36374 90012 -14541 -102334 -68746 -182464 -127846 -124428
14456 -124428 -27424 97163 8120 -36187 -61771 -96804 10889 40194 -138313 -128303 -93914
14445 -93914 -81110 -12653 88243 -51215 -190116 -116995 -25976 106804 277592 282907 282996
14434 282996 209665 42591 -91661 38148 57372 139623 37524 30254 90737 129377 37239
14423 37239 12813 58470 57217 67342 152547 63157 -43267 56716 124722 318613 309896 214400
14411 214400 29943 6947 -25175 -64596 -48026 265144 279400 222258 217831 146176 261152
14400 261152 342274 532208 530060 353003 198987 250120 155475 122766 143637 -80679 -238903
14389 -238903 -272187 -172214 -59928 -32539 22687 141245 182873 214822 209853 67100 -297552
14378 -297552 -246643 -99594 -43183 70705 25487 -1847 -28314 -109187 -21661 -18076 -184322
14367 -184322 -30479 128582 146346 129230 -30480 -178004 -276847 -274618 -52267 5694 -193252
14356 -193252 -151175 -19850 31591 -32185 -56387 -103306 75030 217041 271564 121221 186909
14345 186909 166522 155289 -34170 -155554 -46192 44813 -97538 -270773 -314328 -154763
14335 -154763 -192555 -272370 -274660 -220903 -86907 -50143 -23117 30513 -153784 -134153 -108534
14324 -108534 -265516 -335846 -380985 -246823 -206041 51304 183482 176543 216694 122584 -47225
14313 -47225 -43059 41795 107526 75385 172275 166650 176932 191826 45301 -36542 -48913 42998
14301 42998 11530 87603 99311 140219 4772 -136899 -91389 -102698 -61770 -95349 -75993
14290 -75993 -162388 -120544 -43950 -202421 -226810 -58156 74585 10594 -180554 -93691 -38744
14279 -38744 -138732 -19063 319983 327708 261732 121452 108740 112365 183248 84262 -69639
14268 -69639 -8048 73214 220917 169810 108491 161089 303606 357508 272401 143652 38055
14257 38055 -19196 85790 163358 81444 -28047 -112186 -27393 14518 -85072 -201496 -190795
14246 -190795 -44360 17656 123969 301123 265227 136281 181965 106943 85383 -34034
14236 -34034 -208240 -179800 -93577 -61154 -15813 -212854 -163237 44660 196115 181663 235398
14225 235398 528838 480553 180885 85468 23335 -25664 19256 134352 213378 222883 356229
14214 356229 197956 -37306 -83993 121821 204699 108693 -16530 26103 41977 187648
14204 187648 390802 243979 105505 74650 81001 79301 133901 300999 342092 192282 88528
14193 88528 63311 128429 334376 424427 329654 272053 199142 174518 193315 149758 134403
14182 134403 100407 29725 57921 10037 173381 231324 43722 -39857 57706 29201 -149635
14171 -149635 -53412 -24263 85005 77901 66551 210421 156246 87434 41489 -94607 -230666
14160 -230666 -154109 -52903 -27223 171790 288705 175488 105621 206228 127214 23316
14150 23316 -20929 132321 69151 102172 163256 145362 104644 134181 111595 -194873 -182536
14139 -182536 -14728 157410 261513 145540 191475 252358 145432 12643 -169364 -123710
14129 -123710 30242 -17687 -117903 -156972 -58826 -24245 129366 328542 374520 240691
14119 240691 100614 38976 63963 -2446 -45057 -151885 -138127 -131983 -58243 42324 185289
14108 185289 256266 390244 409415 266209 56050 90570 151880 216924 118220 139463 139774
14097 139774 152813 -72286 -73622 64759 141937 144258 78033 101134 146058 275864 201183
14086 201183 224876 234263 214504 66954 78985 267534 245684 84037 6029 142533 212575
14075 212575 226126 228072 54686 -3810 168475 366227 290526 300297 360432 341926 235733
14064 235733 237053 386900 325556 236619 310995 345361 277516 277739 140929 -45559 -134264
14053 -134264 -27876 17355 -12854 55882 29362 -81457 -339571 -311236 -254842 -251196 -109120
14042 -109120 -93615 4438 14819 -50749 13806 68184 131840 154746 161354 84815 20583 -95407
14030 -95407 -23306 -6134 -33424 -145490 -202089 34549 197872 143044 46072 105898 199328
14019 199328 -3887 -36924 111712 106382 77154 -62777 15678 860 -119709 -2974 87914
14008 87914 211175 201323 141921 113196 1686 -82306 47122 -18527 -249912 -244953 78037
13997 78037 290446 149693 70467 147891 228188 391590 424436 280449 138733 90684 169516
13986 169516 300173 154831 -68262 -82327 9445 70439 160324 94174 5444 35845 -79234
13975 -79234 -44166 7567 84035 168416 121418 69591 -5498 60376 166463 156822 90853 207869
13963 207869 243643 244011 137850 167733 137659 -44339 -59096 64221 219353 213448 107734
13952 107734 121272 23802 -112697 -35745 187467 400948 428772 280681 93945 113377
13942 113377 134011 146969 306706 312013 129049 82577 99407 27511 -3218 148206 214357
13931 214357 114092 105331 262978 267224 312110 271558 211560 182960 197790 320680 265543
13920 265543 155379 -110267 -282300 -103451 243450 456374 326370 35949 -5581 -6541
13910 -6541 25875 119190 196373 175405 211856 164341 67959 39409 106031 45540 -11414 -48627
13898 -48627 45327 65044 4139 29507 42163 198885 79514 13904 -15272 -48833 -78151
13887 -78151 -38974 109202 83673 217212 261107 239652 269014 346087 431210 398941 242809
13876 242809 173893 141181 134006 289926 241908 219843 283708 254344 316563 313262 155916
13865 155916 75587 43454 65877 72761 201335 204070 196459 305508 343513 159227 187977
13854 187977 159387 131864 182222 110963 16360 13745 -3648 -83380 -59782 181637 168134
13843 168134 77147 24303 -45480 100582 136360 228302 197560 149832 22771 -4506 -58014
13832 -58014 95020 258320 188114 71032 24536 19691 -4747 -207684 -97355 56349 172325
13821 172325 148300 200331 276715 389188 294943 189909 44240 -73613 -113514 -113488 33168
13810 33168 164210 165757 86969 118434 220885 179194 197855 282546 136714 78889 -27280
13799 -27280 20309 99887 112840 198665 242744 141660 -46163 -62583 177886 301808 306912
13788 306912 242285 19758 23527 186070 230467 158613 -89913 -155068 9919 -133997 -162292
13777 -162292 -38560 -68402 -85633 15377 -11223 -54401 7742 152397 303486 397193 279209
13766 279209 141873 204866 209829 121518 196123 187844 268674 135450 -159197 -231935 -126466
13755 -126466 -40265 102030 262491 336081 321896 428587 429121 253064 363184 301069 328043
13744 328043 250111 263567 230758 42213 -96852 97652 314775 335157 375678 341542 235991
13733 235991 297465 295837 353217 352990 245018 245219 162569 58594 130518 64858 67214 121980
13721 121980 11371 25839 175130 314113 343103 203980 -17317 161875 282470 357189
13711 357189 375282 265796 55675 19162 52220 217506 275789 370935 260885 314500 306856
13700 306856 258094 125466 -10338 21417 138525 312180 348656 224632 125117 306325
13690 306325 284503 164392 24363 141774 238649 116944 85881 138485 29996 146170
13680 146170 338975 181363 76862 20621 -79810 -128416 -28939 35613 110798 307836
13670 307836 410287 327632 292088 384230 299141 263721 349184 398142 409802 296431 169622
13659 169622 123730 125468 65588 -54032 6359 -25436 -38090 -3049 220933 252637 316069
13648 316069 232807 81686 96989 -45424 -41613 18965 120559 279313 357493 264711 137011
13637 137011 111622 101112 105723 282620 137923 64534 -39147 -25198 25660 -41602 -28498
13626 -28498 50459 104898 120339 94271 144966 113502 111186 -46986 -136819 -64420 132593
13615 132593 228897 243985 233782 152044 124361 136940 120875 204784 209055 284308 252015 181859
13603 181859 85286 14903 -102157 -155804 18894 191703 202491 226582 191532 208124 246095
13592 246095 429593 382353 346233 161342 101300 -29950 89270 108631 109046 133779 213271
13581 213271 301427 298412 336150 446801 326342 264327 259028 131739 -8609 117546 217995
13570 217995 177860 129152 117097 23654 70498 117395 62187 43363 71775 95587 116549
13559 116549 226292 226653 167288 87371 103989 57360 85869 332013 318775 396171 491810
13548 491810 466885 425180 308769 203116 225843 163039 205553 365966 405599 368232 180622
13537 180622 23990 171144 252624 339678 355970 174162 -48766 1865 177553 296508
13527 296508 376627 428506 483239 517517 419387 269636 373304 447584 515014 410542 332425
13516 332425 263568 140999 104128 106048 160316 185247 162557 180875 156912 56898 143388
13505 143388 202758 166018 104599 295137 359521 436708 478701 299851 302749 341369 274772
13494 274772 215535 179259 90817 74548 35262 70751 315246 390969 375780 294971 148405
13483 148405 212676 169129 182357 222254 192890 227020 352518 251684 78688 97647 -81316
13472 -81316 -161952 -121896 58315 182777 281705 304796 115752 76947 100338 54739 -24699
13461 -24699 103904 270529 378926 335602 285934 108487 -69287 -34589 -1510 -9815 27416
13450 27416 152998 237335 159236 -9770 7866 103340 180574 186058 156985 -16630 71735
13439 71735 204737 180092 248572 384917 373062 216488 58396 -86747 -29375 104454
13429 104454 310222 445554 471874 321522 282738 245032 240949 324310 246804 211464 225819
13418 225819 215006 171260 159081 283584 240192 204190 351769 420050 450599 385917 397888
13407 397888 442890 383022 463199 490393 390938 97036 31369 74834 101353 354776 551991
13396 551991 331917 207886 341804 356357 298665 346843 150896 4456 62115 276056
13386 276056 343905 349321 396741 397579 422374 396901 378299 373144 355692 296799 295117 153814
13374 153814 105028 297493 352740 182582 137043 166637 229377 186251 17963 -77090 180287
13363 180287 431121 273638 90982 9761 51398 -23085 58581 -40135 -58393 66297 61455
13352 61455 88940 36176 79238 230052 256944 326918 395838 514218 522525 421160 316482
13341 316482 338629 305574 307873 233762 8298 50454 155799 179497 149411 -2386 83933
13330 83933 161190 309928 561386 654064 476792 511004 433626 376242 463881 382749 362165
13319 362165 473962 389229 282661 139807 257118 269397 265379 239032 308284 301540 330814
13308 330814 323614 180611 224075 348545 255368 184026 94104 56327 212822 286230 119022
13297 119022 25220 246924 331404 353775 251888 214866 193366 105580 -70692 -26999 198243
13286 198243 137076 -6389 -184912 -63581 165757 353594 427390 391456 317670 309419 238585
13275 238585 96205 194424 223654 91443 110529 107590 214224 262974 162519 75571 59645
13264 59645 83702 181260 266477 352511 448116 445733 387652 323085 330291 236648 344977 445985
13252 445985 413947 305191 229462 311414 433987 333574 235118 275646 293399 255853 462726
13241 462726 620232 552040 505864 439202 485490 413163 260532 340793 401798 383653 256857
13230 256857 354772 314993 220480 198177 47094 -5147 15831 190611 395881 379543 398115
13219 398115 520123 560697 603198 555069 511860 387086 460196 493079 482883 448473 533255
13208 533255 629705 570261 525933 339666 266922 341790 164832 164841 307409 261464 214889 181055
13196 181055 149751 312631 423387 232762 111231 43860 -15411 313868 412217 316421
13186 316421 369922 324435 281173 292579 223348 86689 238779 339626 326614 517011 477226
13175 477226 424486 355607 305734 278343 178084 138654 194095 275598 379258 476028 423776
13164 423776 375777 322843 508670 448758 338828 374356 235581 306957 386883 424617 389710
13153 389710 163952 24947 58935 176556 150819 233349 254297 245045 325223 238446 233382
13142 233382 170382 401764 610618 532558 324464 318000 418293 522347 480857 330575
13132 330575 273020 359895 228744 104472 112648 312017 278401 161952 195373 194949 310858
13121 310858 432889 656138 755072 703583 614839 530133 380658 216504 358893 484753
13111 484753 484473 501341 500891 413647 523675 631465 727852 710273 662306 655417 695741 679476
13099 679476 521276 576012 597632 674107 729346 578211 472243 517182 422106 321989 300139
13088 300139 271673 326603 290048 -8710 -15250 102646 276009 459819 428654 295888 188923
13077 188923 115524 70399 265256 337364 415536 431721 460257 456787 568861 493010 385633
13066 385633 315851 437133 537177 431624 559684 519248 447826 276954 292556 378551
13056 378551 234029 164968 147780 286585 331770 159799 257977 346899 343651 409732 554732
13045 554732 547958 463956 404884 458505 489843 551228 603136 731868 732061 544887 634584 634262
13033 634262 476071 525794 692107 735069 824291 842675 915821 1017147 1033136 845839 692507
13022 692507 593726 547773 556570 414656 441144 497716 444078 504367 574954 546222 441827
13011 441827 471230 456556 441184 520827 437846 361833 439213 533478 533549 549246 566631 521949
12999 521949 516225 436471 435236 362967 412069 512979 631046 571275 607894 564826 633659
12988 633659 603767 622871 640918 575295 548247 407664 455325 644314 615056 515851 550504
12977 550504 508115 562827 619583 626362 531167 539202 496574 661831 818942 707135 546937
12966 546937 484960 479641 580824 633283 568645 695339 622102 606754 642788 500318 383055
12955 383055 458867 503462 500110 587618 717215 701260 598973 405932 292115 420918 356767
12944 356767 257318 191442 325757 590932 806094 701327 437508 428567 423445 544216 744055
12933 744055 781428 617348 791213 884497 941297 751803 651235 685522 704643 791340 780577
12922 780577 688673 644258 653528 622557 723557 724627 650894 623132 682489 685902 684364 764086
12910 764086 889263 949752 864303 731491 611994 691829 735022 709166 620248 553570 589277
12899 589277 680568 794304 807304 852705 870806 928115 920302 1004711 950572 971306 887553
12888 887553 935134 841913 686464 677443 693229 798374 721660 781181 689405 671062 635358
12877 635358 545412 501427 363401 411751 510271 465314 382322 283982 362463 498898 692933
12866 692933 628791 632486 725214 677421 728529 828464 801208 742950 701084 732011 705980 717115
12854 717115 770038 721605 744510 891825 844771 797478 548892 454067 444574 477791 568708
12843 568708 791925 723770 549583 573891 802579 900595 1002938 909149 872734 899428 819856
12832 819856 740318 654394 509988 483905 620746 744061 811475 759624 617698 506639
12822 506639 560300 609079 743828 746718 821689 965315 800885 582696 567263 785229 818199
12811 818199 779719 625116 640516 804449 711176 682759 756781 670390 767999 830615 760772
12800 760772 708804 533268 546924 654808 686986 738181 1006257 985057 927170 961655 889480
12789 889480 804478 665030 621763 673137 735558 645464 673020 799063 793435 668586 679314
12778 679314 841860 843993 688757 649531 692699 824312 889563 784259 699476 655148 520508
12767 520508 476492 413681 596978 555705 568453 562367 620067 668607 714784 514392 310032
12756 310032 332566 306652 425194 646156 681490 765201 706392 486723 542222 712500 907599
12745 907599 850271 772024 907817 993355 929760 828493 860760 1050061 1183862 1021826
12735 1021826 845603 689266 846343 1015178 964215 939566 831311 985782 1004278 866955
12725 866955 646565 727524 763834 876583 846452 779625 937466 864103 875156 792391 721916
12714 721916 784311 753911 568746 573979 681002 835168 694930 574332 805019 1074160
12704 1074160 994795 888444 724454 711267 721899 826052 885139 798181 879064 883781 684548
12693 684548 610817 805639 1080496 1168073 1079071 908344 860510 842702 756436 752638 854755
12682 854755 960202 868798 962403 969848 846378 719015 731988 855131 941960 989491 960985
12671 960985 1096602 1143219 1077206 989179 1012793 895675 882918 889792 1017339 927121 775970
12660 775970 869044 952079 950856 984601 947434 990782 1036403 1105178 1084471 1048021 1146946 1149758
12648 1149758 1180406 1076927 984622 977077 944170 743706 722092 843891 999420 1036816 1013088
12637 1013088 913870 863031 816581 817525 954958 920392 877411 930557 844661 1009647 1172973
12626 1172973 1172762 1096281 1139375 1094355 1025850 946777 927119 975117 987804 919180 961243 1092904
12614 1092904 1016862 774998 713708 858526 1040320 1039799 1086105 1003091 921769 948236 1013303
12603 1013303 1154119 1307110 1288782 1189086 941097 864910 926837 822783 812387 1109223
12593 1109223 1028709 957271 927824 971793 1081289 1031647 922568 1012369 1209206 1230462 1182617
12582 1182617 1229267 1367362 1357996 1425807 1436018 1311716 1201065 1045329 869141 809242
12572 809242 927936 909495 1130612 1346003 1334329 1445705 1676437 1558603 1319969 1216448
12562 1216448 1184587 1183873 1112538 1349066 1465075 1359842 1179680 1138574 1037947 1095027 1196105
12551 1196105 1366682 1186048 1070042 1120173 1156439 1166906 1235275 1194112 1105269 1168326 1169778
12540 1169778 1268085 1069462 1052968 1225159 1352028 1314227 1142476 1021036 1128636 1148232
12530 1148232 1290555 1281068 1284632 1314085 1379848 1471475 1457807 1288026 1261664 1339299 1434042
12519 1434042 1432489 1450467 1632500 1614529 1397262 1246338 1218454 1196715 1086002 915375
12509 915375 933300 1125358 1132638 1019223 1115917 1234577 1389505 1378280 1288689 1383175 1439644
12498 1439644 1316052 1272033 1245305 1180554 1294310 1461728 1419293 1183044 1104604 1403223
12488 1403223 1665088 1729261 1741464 1770748 1699172 1680470 1647681 1555342 1466257 1562128 1826244
12477 1826244 1979386 1984803 1963354 1765994 1766817 1799038 1920040 1873622 1640152 1552057 1595775
12466 1595775 1508544 1294010 1400165 1535030 1619702 1727361 1773165 1641145 1443454 1331495
12456 1331495 1338405 1465213 1515236 1534478 1574724 1556938 1484158 1455106 1530632 1573227 1700835
12445 1700835 1732522 1657971 1435339 1366813 1242998 1201949 1455177 1608462 1598851 1561203 1501015
12434 1501015 1571918 1746679 1722460 1618090 1492917 1320171 1477859 1577950 1529764 1568597
12424 1568597 1714130 1809267 1935088 2037222 2054964 1853612 1789828 1888783 1843172 1822937
12414 1822937 1649599 1563175 1571419 1629342 1484558 1538418 1565013 1500706 1670081 1863282 1721159
12403 1721159 1536109 1570696 1704496 1791923 1870867 1839230 1697790 1673074 1699649 1678141 1725418
12392 1725418 1773299 1897015 1903257 1863592 1981444 1918026 1808569 1619325 1542576 1740905
12382 1740905 1931859 1879398 1752842 1858592 1972628 1892064 1738650 1632199 1834956 1987197
12372 1987197 1927391 1851920 1733939 1868176 2042229 1920428 1799138 1818869 1903390 1970399
12362 1970399 1890774 1750532 1671463 1928909 1953774 2022154 2148417 1966288 1792481 1716970
12352 1716970 1867878 1845513 1756291 1546597 1591621 1858456 1797963 1874834 1948844 1843841
12342 1843841 1964064 1998051 1935428 1827949 1687480 1666220 1780869 1897643 1992242 1966109
12332 1966109 1853892 1836745 1931846 2049873 2172344 2269723 2203913 2039725 2075452 2176557
12322 2176557 2075077 2120968 2366494 2190073 1855899 1727926 1770844 1903439 2090317 2257401
12312 2257401 2454060 2360124 2154180 2244775 2237897 2200252 2231451 2159498 2116627 2101147 2113608
12301 2113608 2083715 2102231 2232352 2228550 2020103 1723321 1822805 1848040 1733276 1838244
12291 1838244 2136631 2293381 2171642 2114558 2222847 2288763 2325047 2025526 1890119 1965177
12281 1965177 2000042 1829794 2019671 2318790 2264893 2113249 2175662 2340088 2291128 2303660
12271 2303660 2285508 2191120 2074213 1985075 1779541 1843582 2041473 2190248 2148970 2133324
12261 2133324 2034018 2233362 2302940 2289107 2179455 2254340 2368182 2307638 2259012 2341251 2294252
12250 2294252 2262773 2221778 2144055 2297420 2509495 2622848 2577722 2435400 2127906 2232074
12240 2232074 2359544 2389793 2476967 2440469 2349119 2298286 2345390 2369146 2371162 2247992 2139906
12229 2139906 2192461 2383664 2380238 2334253 2378736 2424143 2441098 2360659 2368083 2416031 2589505
12218 2589505 2764195 2706101 2571596 2428001 2428593 2479160 2548131 2714828 2625910 2612945 2393476
12207 2393476 2403016 2453869 2548636 2635340 2579722 2555845 2554622 2501181 2564735 2486589 2566381 2825451
12195 2825451 2845519 2740127 2593707 2607574 2669779 2746509 2800017 2811305 2868458 3001517 2908711
12184 2908711 2912991 2940083 2762896 2748066 2658481 2469705 2501794 2777507 2817650 2962282 2930133
12173 2930133 2916526 2921149 2836143 2690349 2653784 2739109 2917888 3013317 2832536 2810654 2727957
12162 2727957 2792825 2853836 2832921 2661740 2644025 2552630 2643275 2722578 2921020 3227240 3301332
12151 3301332 3172750 2993386 2954572 2960088 2820626 2829701 3017017 3240311 3386039 3393327 3316385
12140 3316385 3385394 3359854 3112610 2919982 2853982 2882237 2997486 3024959 2956233 2910404 2901399
12129 2901399 3007487 2987966 2863409 2936212 3039987 2960316 2887680 2831894 2775774 2680771 2729121
12118 2729121 2718608 2622719 2866096 3016971 3069515 3079123 2999241 2957804 2894531 3064851 2939348
12107 2939348 2767379 2836882 3060443 3247599 3388520 3712995 4008994 4060275 4109901 4334057
12097 4334057 4469946 4251430 4114936 3721805 3521680 3484847 3484456 3310384 3203098 3061994
12087 3061994 3105407 3162752 3229841 3063668 3094058 3301642 3219233 3043639 3069170 3017096 2987094
12076 2987094 3052560 3069418 3178227 3239517 3250022 3238132 3324405 3308723 3231158 3144507 3439511
12065 3439511 3399278 3367816 3332184 3270814 3446370 3584726 3645843 3818930 4237012 4376823
12055 4376823 4470516 4615348 4907702 4769988 4195579 3883189 3777853 3715888 3545939 3288323
12045 3288323 3361154 3390278 3632129 3620061 3522522 3424623 3321058 3268394 3308940 3433330 3309543
12034 3309543 3228854 3226853 3232929 3239001 3383918 3537737 3614946 3686499 3700068 3681505 3718430
12023 3718430 3732838 3536643 3460745 3423134 3587526 3573737 3429044 3595455 3746389 3752781
12013 3752781 3699437 3490840 3665601 3760843 3608853 3427349 3346998 3259158 3357674 3489552
12003 3489552 3415239 3219250 3068726 3230837 3525845 3680159 3602212 3523948 3466299 3401502
11993 3401502 3346815 3368116 3344834 3378258 3525497 3658248 3324762 3153755 3224773 3427584
11983 3427584 3564076 3515396 3424584 3336287 3432019 3524908 3449193 3366268 3344001 3353777 3381224
11972 3381224 3314003 3106596 2952423 3049721 3009408 3062968 3325278 3325474 3071011 2982164 3103516
11961 3103516 3285116 3269114 3301381 3398229 3408938 3442792 3375773 3238602 3270682 3288090 3357729
11950 3357729 3284362 3240879 3192799 3234591 3184442 3265212 3651292 3723763 3588915 3465203 3186687
11939 3186687 2936462 3125297 3390182 3533087 3483594 3334270 3367036 3417888 3343085 3350147
11929 3350147 3359950 3240206 3123431 3170260 3109080 3107632 3098685 2985215 2992954 3067341 3239178
11918 3239178 3355786 3455784 3288228 3333788 3391633 3462139 3395929 3462853 3532407 3451079 3424407
11907 3424407 3414434 3178960 3005579 3036731 3122518 3213198 3225988 3306655 3438576 3437798 3471264
11896 3471264 3391497 3487623 3572277 3434387 3406045 3283080 3228655 3174689 3115516 3171542 3210687
11885 3210687 3194789 3147603 3112444 3176086 3211374 3135726 2989288 3008860 3133991 3143060 3232803
11874 3232803 3349016 3397129 3301406 3239175 3120253 3043087 3121377 3170058 3114400 3135677 3086481
11863 3086481 3042315 2967642 2975569 2875425 2874917 2951878 3038780 2941688 2788478 2940134 2901003
11852 2901003 2843759 3122703 3118430 3177678 3168196 3185106 3170774 3199848 3237201 3243836 3209490 3133634
11840 3133634 3041416 3002357 2971179 2887555 2876591 2827212 2908703 3101661 3168019 3053305 2973567
11829 2973567 2924019 3006671 3077009 3081945 3228841 3309602 3124712 3069414 3042519 2929278 2760460
11818 2760460 2794408 2990804 3066057 3181524 3019598 2929791 3093213 3043983 3087630 3018664
11808 3018664 2875397 2922046 3029710 2999771 3008377 3026356 3103425 3180916 3321040 3505971 3375425
11797 3375425 3152879 3124058 3267274 3264916 3130418 2847513 2918793 2919766 2857985 2859263 2854128
11786 2854128 2746988 2653431 2765429 2781135 2755990 2681372 2494401 2488506 2436328 2560491 2819816
11775 2819816 3037100 2925805 2782864 2796858 2713357 2643893 2592294 2548659 2589580 2697767
11765 2697767 2797758 2657981 2764150 2960410 3094759 3078213 3021723 3086601 3043732 2838881
11755 2838881 2589367 2623789 2741024 2713277 2718032 2916352 3101104 2939073 2660169 2385907
11745 2385907 2392001 2510282 2567313 2536069 2612632 2642297 2680585 2707325 2511229 2648049 2770413
11734 2770413 2699097 2768512 2771638 2685662 2582815 2668678 2612320 2495354 2479350 2521830 2543952
11723 2543952 2738964 2791186 2717473 2434599 2370910 2408820 2557087 2697244 2567400 2575378
11713 2575378 2778026 2869696 2788850 2707745 2741830 2755509 2681122 2524885 2436344 2407282 2477349
11702 2477349 2487554 2600959 2581933 2583029 2644507 2855997 2923532 2876753 2655619 2627947 2698521
11691 2698521 2683191 2490301 2477712 2577445 2572642 2233817 2143318 2153206 2198580 2178267 2288011
11680 2288011 2384858 2435421 2392572 2337715 2358734 2497431 2696806 2590546 2407190 2527537
11670 2527537 2598419 2733147 2737272 2312305 2297836 2426211 2489765 2315540 2187909 2264864
11660 2264864 2404888 2247773 2157941 2189860 2414656 2463089 2378809 2393228 2464565 2509947 2546424
11649 2546424 2493186 2450432 2362905 2273112 2223352 2231519 2287792 2249160 2236186 2365361 2329960
11638 2329960 2107356 1895819 1891914 2036351 2065942 2016196 1914298 1954086 2199295 2412112
11628 2412112 2387986 2261382 2125003 2164967 2214061 2142880 2198195 2144527 2036435 2046034 2167343
11617 2167343 2087760 2052731 2062478 2044171 1973514 2056671 2203389 2312319 2417529 2319868 2210794
11606 2210794 2247044 1954965 1805191 1906278 1944625 1945373 1933387 1978355 1977090 1992255 2018512
11595 2018512 2090303 1987350 1912619 1967139 1906554 1846275 1941665 1909569 1830094 1833355 1941138
11584 1941138 1984800 1967187 2002397 2108846 2122408 2076025 2143934 2136804 2213969 2283790 2323238
11573 2323238 2218742 1965804 1818685 1846194 1791665 1811024 1909872 1876636 1723967 1765485
11563 1765485 1846079 1879177 1899047 1867932 1780185 1942734 2115154 1913913 1936415 1879763 1856727
11552 1856727 1736404 1694095 1804370 1783671 1671146 1803544 1922474 1853434 1827722 1799645
11542 1799645 1763729 1899312 1892641 1751977 1550007 1562847 1558823 1541044 1526007 1533032 1451040
11531 1451040 1501343 1442784 1410641 1548155 1569909 1611713 1600456 1591199 1528903 1597673 1801331
11520 1801331 1902738 1805804 1732577 1670419 1636760 1649549 1719136 1769690 1726350 1710903 1643003
11509 1643003 1568977 1563518 1531313 1679744 1751742 1767250 1769023 1750542 1422678 1398813 1584017
11498 1584017 1783128 1823440 1834491 1933065 1889823 1748203 1660018 1613369 1539218 1654473 1760933
11487 1760933 1686594 1520563 1474775 1353035 1305717 1272774 1263242 1584954 1579038 1558058 1567960
11476 1567960 1487837 1593862 1696685 1451687 1330501 1346380 1552258 1644963 1615169 1440833
11466 1440833 1340516 1379694 1481825 1711942 1734469 1613444 1330459 1276335 1491574 1426439
11456 1426439 1294317 1233660 1324330 1373187 1282794 1167978 1161045 1302551 1360812 1238291 1101815
11445 1101815 1282960 1341590 1192370 1199234 1199717 1207397 1304225 1313551 1328975 1313686 1318528 1411843
11433 1411843 1338886 1336819 1533036 1448530 1564258 1707536 1645886 1617409 1552747 1468656 1524622
11422 1524622 1624734 1529370 1307330 1120094 1231941 1339346 1469839 1453183 1416333 1523999
11412 1523999 1458281 1320071 1274564 1235571 1090497 1034446 949668 870755 905407 1126360 1232006
11401 1232006 1284451 1240944 1154190 1285149 1245427 1314840 1228607 1058509 1048821 945056 983651
11390 983651 1080149 1231717 1214637 1146113 1158895 1174654 1365404 1461463 1407397 1325718 1227155
11379 1227155 1126961 1111839 1137293 993374 1064144 1189200 1280985 1293167 1303022 1339589 1269017
11368 1269017 1273399 1330632 1487649 1340258 1166538 1128699 1183401 1259434 1175744 1229511 1126391
11357 1126391 1075704 1146613 997979 968775 973077 1094758 1285095 1370176 1242686 1152271 1160989
11346 1160989 1028093 959025 1003245 977203 943198 870800 923756 837229 799740 866059 923910
11335 923910 820776 756097 780810 842911 827995 836021 887332 895369 943126 964199 1003473 879883
11323 879883 838903 878761 1012000 1146260 1181133 1213711 1268461 1158896 1198139 1268460 1293265
11312 1293265 1117853 1188059 1101188 1094190 1057582 1062294 1073650 942349 1018451 1178242 1118221
11301 1118221 1211450 1185038 967730 1047877 1200658 1130778 1127243 999574 924385 945305 948586
11290 948586 968924 951714 1044096 1045604 1052337 918674 809425 777708 848042 848001 654569 797769
11278 797769 881423 907294 928203 882446 800845 846166 750648 806573 856963 885184 858318
11267 858318 922714 1028255 884751 759004 875678 798506 757061 773318 900596 879279
11257 879279 871100 812684 865397 633732 595077 621116 571663 618157 560844 663884 748298
11246 748298 670351 658821 702035 781488 621519 430300 407399 643882 866106 1011933
11236 1011933 1092190 1043020 971160 783805 839537 887494 799538 730797 766005 700178 626887
11225 626887 815011 979869 997092 809359 918344 1106832 1042354 839093 769772 652526
11215 652526 735732 807764 752632 894754 829063 789752 871003 1040705 855782 667815 587826
11204 587826 561940 543594 573060 494738 655317 813104 797191 654951 529332 495185 463629
11193 463629 508455 693988 956687 1017538 748113 538660 589584 643514 661701 792692
11183 792692 742598 750308 583819 675897 721381 606940 531428 634668 838923 788084 764612
11172 764612 574491 572082 657466 584401 485996 423536 320272 324347 399210 341810 482624
11161 482624 631981 601598 478272 245769 265766 528632 629883 648568 722681 662569
11151 662569 612194 878299 866414 648951 563761 521060 503885 470995 478873 495057 487298
11140 487298 453240 684778 745816 610304 656509 684136 650726 381982 310221 466480 585908
11129 585908 586059 541844 289297 280327 518661 482920 452647 632005 674329 846808 806113
11118 806113 728635 844048 665102 442716 367421 386781 429629 576137 510112 356230
11108 356230 132712 231921 285503 407605 599492 637362 738087 720356 826866 932909
11098 932909 789248 714285 594765 511365 550551 609013 622495 693905 719891 633756 604397
11087 604397 639309 637325 712761 627498 573072 615103 699575 793609 775992 693324 437165
11076 437165 356604 243326 282002 386492 531784 646957 767601 653274 529732 424676
11066 424676 300316 232747 277302 348440 460888 517969 555590 528352 476426 156029 252815
11055 252815 622481 612551 383215 513821 617976 671340 650443 562558 840691 994084
11045 994084 937719 813598 699868 694082 720543 730612 904952 1098206 1145453 1328952 1242517
11034 1242517 1158982 1117864 1268165 1377441 1387495 1405531 1491237 1484747 1458969 1528752 1670683
11023 1670683 1762350 1796545 1746956 1687458 1498779 1353925 1326093 1267356 1278862 1261290 1153394
11012 1153394 1273809 1561166 1706326 1731912 1764398 1651225 1528904 1435576 1228379 1049134
11002 1049134 1048323 1089814 1066299 995902 1012686 1024377 1003271 946194 1144282 1188444 1048762
10991 1048762 764398 539637 732033 733924 617346 572454 519217 605777 557870 556848 601757
10980 601757 475965 380071 579570 569029 362299 356772 415832 409187 267096 90986 54321
10969 54321 243994 297029 319442 358739 355495 405231 286462 282516 428927 470475 340108
10958 340108 265235 254337 373310 247689 243543 194260 128449 170719 136155 109042 243382
10947 243382 204956 195362 215184 362119 399767 394672 439920 375645 253982 260181 189392 44202
10935 44202 103671 426062 348638 124409 136322 99075 78925 168369 200937 130405 -43756
10924 -43756 23972 114280 189523 172979 80929 79233 -4239 5436 -42898 162550 285906 63462
10912 63462 94955 85986 48400 76211 139727 136130 128135 39917 81051 187212 178361 221746
10900 221746 68690 110614 219265 16214 -43505 117706 235539 275077 346158 263187
10890 263187 157088 97353 39890 115370 255015 247327 66108 -28130 59920 160119 151798
10879 151798 170246 183477 162412 95916 206317 239411 204701 183530 -82884 100771 241195
10868 241195 138009 71106 13488 153025 200171 267467 279865 67528 138047 266252 325668
10857 325668 348135 471229 416550 335655 322753 398975 388591 328861 246587 300188 315572
10846 315572 395124 348296 363091 404355 455483 324013 300520 432974 535457 432955 408042
10835 408042 344486 373834 324841 275549 307624 198955 289791 279537 223062 112790 102894
10824 102894 169037 141982 113452 191967 136251 159585 76139 46461 75677 -510 24476
10813 24476 76585 -77778 -155717 -46858 -10826 -160003 -299510 -175869 -14498 76902
10803 76902 85087 59651 67476 76045 287081 275845 280284 334856 225376 -104834 -146341 -4111
10791 -4111 -26635 -123477 -199703 -60279 106854 191946 282427 362403 204812 148677 236118
10780 236118 98995 -5781 -15256 -113337 61006 59238 -76964 -8124 56183 -40391 -190273
10769 -190273 -297653 -320363 -240390 -197280 -322615 -338326 -136138 -202178 -184239 -111579 -106374
10758 -106374 -114098 -47993 111849 -14769 -88236 111710 206035 321510 262861 185029 206601
10747 206601 233736 -25987 -48168 186366 166524 181729 76593 -18190 47636 258168 382437
10736 382437 521868 786212 738199 698174 924146 924728 881080 741552 731757 808088 1058381
10725 1058381 1244766 1289319 1362458 1526724 1523919 1517298 1548414 1577402 1469507 1469549 1553842 1683771
10713 1683771 1735056 1830036 1890390 1892199 1961082 1957316 1668266 1435004 1331938 1383529 1542643
10702 1542643 1707007 1686529 1789230 1838759 1777133 1660064 1526083 1452301 1291629 1135548
10692 1135548 1147739 1112076 1149746 1024421 937383 1166604 1225375 1159990 1007114 847681
10682 847681 714653 609467 606137 662383 623200 695760 817879 704474 633086 833190 927119
10671 927119 928097 823662 758607 756705 826676 863133 796087 687842 838686 778732 617500
10660 617500 678790 920185 1044681 973345 1030947 1031103 1157111 1445424 1844465 2251438 2479433
10649 2479433 2426139 2261928 2200124 2123937 2005041 1901948 2057819 1991506 1913291 2056027
10639 2056027 2321319 2625074 3149012 3872057 4620081 5560303 6358318 6955864 7635915
10630 7635915 8312222 8822012 9115009 9708070 10722981 12267873 14728856 18111090 22690504
10621 22690504 28520419 36223953 46150109 57106079 67825849 77510705 86537714 94268788
10613 94268788 98985482 99982999 99260989 99892390 104416702 114929615 131126682 150822426
10605 150822426 170251696 187241263 202071487 213560421 216841359 209746686 197616293
10598 197616293 188783929 188762813 198937686 217795106 241480320 264251272 282810627
10591 282810627 297136380 304923391 299546880 278218490 249885865 226218000 212242518
10584 212242518 208594030 213301998 222153863 230918744 237095900 240495452 238876802 228031574
10576 228031574 207295214 183163236 163114649 149667113 142424670 139772046 139577027
10569 139577027 139509183 138253787 135655939 130800267 122052996 109811758 96468632 84440167
10561 84440167 74711260 67258514 61791040 57265608 53531850 50558146 47948210 45530126
10553 45530126 43487808 41997023 40677563 39300403 37898398 36453345 35242971 34092775
10545 34092775 33097663 32198744 31462577 30672780 29860050 29024106 28137373 27185373 26422087
10536 26422087 25810767 25338980 24681160 24150124 23831634 23238306 22471879 21905424 21498516
10527 21498516 21000386 20676004 20391288 19856236 19434844 19054111 18682435 18401257 18031626
10518 18031626 17676153 17362466 17139904 16835227 16355377 15832250 15492451 15291697 14826168
10509 14826168 14582194 14384995 14145846 14029134 13715322 13360915 13003785 12637469 12445721
10500 12445721 12375068 12357869 12254810 12040776 11893375 11827189 11694456 11417452 11215487 11101241
10490 11101241 11086817 10870926 10668659 10461416 10299130 10296147 10157005 9893106 9634541 9564395
10480 9564395 9561564 9698543 9776194 9719343 9687227 9463164 9314454 9422876 9514474 9422810 9578848
10469 9578848 9679052 9575149 9258726 9042244 9176559 9154427 8907834 8679512 8454641 8328495
10459 8328495 8258325 8203871 8181965 8194642 8106561 7952722 7704460 7538362 7379181 7268582
10449 7268582 7319142 7185038 7172445 6929981 6841515 6893813 6791961 6696373 6488384 6191260
10439 6191260 6128597 5956148 5926390 5910083 5721361 5482030 5363277 5401845 5455123 5362207
10429 5362207 5137597 4907175 4745771 4794338 4785159 4655487 4532206 4494396 4387187 4297116
10419 4297116 4321847 4437039 4333314 4084383 3865108 3772566 3806001 3811644 3787959 3675358
10409 3675358 3492107 3329752 3463361 3479102 3651033 3725470 3577140 3490057 3422735 3371195
10399 3371195 3298282 3214438 3109007 3086988 3113608 3000079 3109427 3170758 3136787 2985201
10389 2985201 2872977 2739013 2664347 2749197 2846886 2938308 2893473 2712050 2573778 2712032
10379 2712032 2586501 2489833 2521105 2365821 2111841 2175588 2358511 2506839 2510168 2387932
10369 2387932 2362579 2420062 2245323 2212828 2129010 2045561 2042322 1995609 1989049 1991059 2049950 1822777
10357 1822777 1693503 1719145 1784522 1529533 1563249 1640818 1758621 1733196 1823569 1841605 1963779
10346 1963779 1879744 1642840 1742698 1935424 1859086 1674004 1607831 1572426 1624323 1537631 1470476
10335 1470476 1572311 1546455 1532665 1639703 1547247 1482472 1502465 1441056 1498005 1602384 1463872
10324 1463872 1369514 1180147 1208843 1165538 1051373 1082047 1131545 1204106 1287815 1377410 1323091
10313 1323091 1231709 1155590 1205978 1227075 1377458 1369895 1193644 1143222 1089536 1180274 1310710
10302 1310710 1292088 1275922 1199913 1004503 903638 1123751 1349572 1311080 1252968 1198671
10292 1198671 1251910 1224931 1101699 1021989 932006 919230 1087922 977480 898318 1087801
10282 1087801 1314141 1243016 959311 899039 1007558 1117507 1051684 987367 964343 914486
10272 914486 908005 1047611 969963 830559 968370 1143341 1077388 930252 876555 901119 864305
10261 864305 900672 791290 742217 829662 877936 766510 735665 778563 1104018 1203331 973114
10250 973114 670799 528916 448926 418340 534438 536829 520951 449763 490504 537661 627599
10239 627599 704841 777931 744816 771032 706444 471648 304585 270237 340684 546226 605507
10228 605507 488377 440849 451244 653038 693231 730703 750993 690098 664639 452943 372937
10217 372937 500680 585127 753607 926543 892064 707255 547200 588008 675195 568465
10207 568465 411471 319898 304180 341203 367501 440029 451893 478904 518349 521149 390688
10196 390688 343488 400575 509627 600202 708904 750057 729768 651352 734550 882132 982758
10185 982758 941956 815679 790810 833244 722394 754950 887945 1035129 992737 960720 943238
10174 943238 1022403 1183581 1246167 1177654 1287011 1290435 1378729 1445428 1569794 1667505 1565264
10163 1565264 1356493 1286997 1244981 1155912 1301956 1675136 1787372 1902238 1948794 1984480
10153 1984480 2079310 2203509 2069362 1859981 1560013 1478899 1552687 1616596 1622136 1824969
10143 1824969 1942298 1924135 1897141 1845362 1756140 1495331 1343817 1160390 1062652 1051698
10133 1051698 1199060 1171616 1252898 1173933 1013051 1096993 1187719 1159261 1056387 1278980
10123 1278980 1113878 920806 660197 729717 723628 630924 523163 504553 489437 372450
10113 372450 419243 407307 238895 250284 350216 401278 455312 519275 508036 426667 308920
10102 308920 346883 399309 382969 402467 404096 479091 431577 358189 275902 257853 304483 463533
10090 463533 528807 587425 548801 519907 385118 576369 543255 584261 541173 517858 500365
10079 500365 437965 395711 336131 378741 422061 543888 428217 286222 256199 216865 336015
10068 336015 519806 506930 320759 229912 262102 257920 178401 212109 212802 164577 330143
10057 330143 304797 284637 222876 200921 354808 671060 515825 247442 242572 354388 299103
10046 299103 330578 364621 246357 193750 257086 381156 312111 272658 289546 265370 259787
10035 259787 310186 486711 325482 218274 351741 314577 227401 284667 361615 359219 394510
10024 394510 358751 418985 491131 498886 453944 330398 190877 277105 411942 438853 505177
10013 505177 509182 425242 498929 306595 104156 265245 405423 396382 360562 351137 246284
10002 246284 202083 64749 45619 1814 -59483 280591 345415 381349 436104 354544 306901
9991 306901 390056 333176 173463 165234 271398 307909 296906 186316 137810 173987 193781
9980 193781 446994 491655 550385 517920 341957 262062 357945 342210 284867 99800 192083
9969 192083 215208 381517 399345 385269 257662 190704 186457 174334 316815 492729 418115
9958 418115 565395 556128 471197 399426 367582 485521 493285 244049 47794 115822 196630
9947 196630 35874 62455 133690 -17561 -34570 169730 283955 283082 312744 356810 213664
9936 213664 103180 117642 118831 142504 167156 201538 296461 305380 74377 65092 26812 -420
9924 -420 186174 288392 55424 85897 183787 196187 304748 275017 195059 189247 217446 168479
9912 168479 75140 70370 218931 275613 300101 121247 175406 248949 155777 39596 121722
9901 121722 180275 314567 378171 477691 485939 418179 363309 306318 291342 257801 251099 247292
9889 247292 419865 418758 458289 593664 480021 460720 405987 202830 85154 87752 319819
9878 319819 593353 468583 272530 189663 156580 101771 24627 114499 246755 353151 360798
9867 360798 305886 254577 247528 307174 391955 410378 391394 402031 347230 414783 421547 424617
9855 424617 395344 599153 366135 60314 -172323 -153025 143975 272395 258732 189238
9845 189238 317412 275742 432222 420922 345597 166043 89576 -118029 -239302 -84263
9835 -84263 34348 59275 263051 509413 572638 421900 246435 357221 355205 296963 202152
9824 202152 62894 37764 271812 334738 465155 514373 507543 607387 477945 296128 356564
9813 356564 457217 410890 414207 364850 379875 262189 210377 178016 301484 189941 -3025
9802 -3025 122474 79927 16794 -56921 -48479 -13197 84548 138221 49079 162795 254654 164085
9790 164085 190287 262324 111353 60540 135842 292176 210820 163818 229050 108029 -15604
9779 -15604 38613 -46070 -177796 -6646 9844 -13528 236768 272073 229580 101724 67431
9768 67431 156983 271805 367269 448416 516490 383682 557888 593294 513479 450287 359771
9757 359771 130190 162925 236242 195105 125913 129800 73447 99340 143604 180123 265051 111117
9745 111117 184420 135198 85364 -47034 -142864 -65038 122550 92225 3066 22105 184832
9734 184832 236426 206591 25121 -74074 -144826 -94599 -63635 43405 116464 227087 330923
9723 330923 341424 468272 308479 272468 358330 282306 119779 87924 -53290 13789 219181
9712 219181 361290 332741 253600 230589 303775 200048 290917 288063 240711 250855 319971
9701 319971 382543 284595 154474 121464 224671 349262 436398 398329 415066 175447 109763
9690 109763 205205 181515 143157 91492 7891 237968 413994 286696 234204 269655 51176
9679 51176 -38693 -26645 -126737 -256963 -107335 23901 149353 298208 280047 152525
9669 152525 203604 194588 135080 96577 -59778 -52455 87145 207972 351586 469125 585538
9658 585538 567017 715397 699155 777578 863182 905083 710791 839626 886063 715618 515657
9647 515657 436227 288892 119300 146873 218841 273559 364914 225803 279483 358685 362537
9636 362537 369848 306481 136956 195799 186528 -148 -34051 105505 227499 127802 152689
9625 152689 136484 86695 -33212 50110 196233 111349 17085 -15754 65645 136058 -2749
9614 -2749 90245 106030 185034 164814 20858 -224283 -279087 -191522 -91349 -32662 -93916
9603 -93916 -123277 -85022 69359 98462 -74847 3593 -65710 -48677 124245 -36142 131898
9592 131898 257734 116198 29385 -54611 -899 177573 207070 183424 154260 32873 -81578
9581 -81578 -98571 -77315 -9446 -91054 -18737 168408 216577 172658 30510 -105758 -67559
9570 -67559 183095 177455 89762 12069 200266 168998 96761 179156 256865 124530 84950
9559 84950 80569 33263 50559 14387 40889 55267 30947 107247 245163 280861 280995 235081
9547 235081 193874 166083 31208 30789 -15459 -57278 -18270 232992 274152 178194 134949 132682
9535 132682 190071 180059 282680 345482 200724 192383 375874 351900 255486 221353 172753
9524 172753 169745 209670 242637 157957 76384 13216 52530 134438 23583 57066 66336 226404
$$ [...]
##END NTUPLES=NMR SPECTRUM
##END=
