##TITLE=Analysis number 315527
Compound Code ac 29314
Project Code adrs
Chemist Name acros
##JCAMPDX= 6.0         $$ Bruker NMR JCAMP-DX V2.0
##DATA TYPE= NMR SPECTRUM
##DATA CLASS= NTUPLES
##ORIGIN= Bruker BioSpin GmbH
##OWNER= NMR
$$ XWIN-NMR		Version 3.5
$$ Tue Nov 22 12:33:29 2005 GMT Standard Time (UT+0h)  MAYBRIDGE\NMR@NMR_250MHZ
##.OBSERVE FREQUENCY= 250.131544655141
##.OBSERVE NUCLEUS= ^1H
##.ACQUISITION MODE= SIMULTANEOUS (DQD)
##.ACQUISITION SCHEME= undefined
##.AVERAGES= 16
##.DIGITISER RES= 18
##SPECTROMETER/DATA SYSTEM= dpx250
##.PULSE SEQUENCE= zg30
##.SOLVENT NAME= DMSO
##.SHIFT REFERENCE= (INTERNAL, DMSO, 0, 16.522)
##AUDIT TRAIL= $$ (NUMBER, WHEN, WHO, WHERE, WHAT)
$$ ##TITLE= Audit trail, XWIN-NMR		Version 3.5
$$ ##JCAMPDX= 5.01
$$ ##ORIGIN= Bruker BioSpin GmbH
$$ ##OWNER= NMR
$$ C:\u/data/dgb/nmr/ADRS/12840/pdata/1/auditp.txt
$$ ##AUDIT TRAIL=  $$ (NUMBER, WHEN, WHO, WHERE, WHAT)
(   1,<2005-11-22 12:33:06.90 +000>,<MAYBRIDGE\NMR>,<NMR_250MHZ>,
      <created by zg, POWCHK disabled, PULCHK disabled
       configuration hash MD5:
       62 19 C7 07 E1 42 D1 B7 37 6C 3D D0 77 39 F9 E6
       data hash MD5: 64K
       41 5D A8 CF D1 DD 5E E3 A0 70 BE F5 65 A8 1C FF>)
(   2,<2005-11-22 12:33:20.21 +000>,<MAYBRIDGE\NMR>,<NMR_250MHZ>,
      <Start of raw data processing
       ef LB = 0.3 FT_mod = 6 PKNL = 1 SI = 32K 
       data hash MD5: 32K
       D8 8A 18 F4 95 A8 5A A6 F8 23 8A A1 F7 E8 70 07>)
(   3,<2005-11-22 12:33:22.00 +000>,<MAYBRIDGE\NMR>,<NMR_250MHZ>,
      <apk 
       data hash MD5: 32K
       A5 95 43 15 E3 1B 66 96 B8 0C 1D 58 BA 28 91 E5>)
(   4,<2005-11-22 12:33:22.78 +000>,<MAYBRIDGE\NMR>,<NMR_250MHZ>,
      <abs ABSG = 5 
       data hash MD5: 32K
       CE FE 64 45 8C B5 CF 92 60 6E EA 3E F9 23 32 B1>)
$$ ##END=
$$ 
$$ hash MD5
$$ 36 15 AF 3A D5 78 96 02 0C 28 84 10 38 C5 73 23
##$RELAX= 
##$RELAX= 
##$RELAX= 
##$RELAX= 
##$RELAX= 
##$RELAX= 
##$RELAX= 
$$ Bruker specific parameters
$$ --------------------------
##$DU= <C:\u>
##$EXPNO= 12840
##$NAME= <ADRS>
##$PROCNO= 1
##$TYPE= <nmr>
##$USER= <dgb>
##$AMP= (0..31)
100 100 100 100 100 100 100 100 100 100 100 100 100 100 100 100 100 100 
100 100 100 100 100 100 100 100 100 100 100 100 100 100 
##$AQSEQ= 0
##$AQ_mod= 3
##$AUNM= <au_zg>
##$AUTOPOS= <24 >
##$BF1= 250.13
##$BF2= 250.13
##$BF3= 250.13
##$BF4= 250.13
##$BF5= 500.13
##$BF6= 500.13
##$BF7= 500.13
##$BF8= 500.13
##$BYTORDA= 1
##$CFDGTYP= 0
##$CFRGTYP= 5
##$CHEMSTR= <none>
##$CNST= (0..31)
1 1 145 1 1 1 1 1 1 1 1 1 1 1 1 1 1 1 1 1 1 1 1 1 1 1 1 1 1 1 1 1 
##$CPDPRG= <>
##$CPDPRG1= <>
##$CPDPRG2= <>
##$CPDPRG3= <>
##$CPDPRG4= <mlev>
##$CPDPRG5= <mlev>
##$CPDPRG6= <mlev>
##$CPDPRG7= <mlev>
##$CPDPRG8= <mlev>
##$CPDPRGB= <>
##$CPDPRGT= <>
##$D= (0..31)
0 1 0 0 0 0 0 0 0 0.06 0 0 0 0 0 0 0.0002 0 0 0 0 0 0 0 0 0 0 0 0 0 0 
0 
##$DATE= 1132662785
##$DBL= (0..7)
120 120 120 120 120 120 120 120 
##$DBP= (0..7)
150 150 150 150 150 150 150 150 
##$DBP07= 0
##$DBPNAM0= <>
##$DBPNAM1= <>
##$DBPNAM2= <>
$$ [...]
##$SUBNAM7= <"">
##$SUBNAM8= <"">
##$SUBNAM9= <"">
##$SW= 20.6930455092707
##$SWIBOX= (0..15)
0 0 3 0 0 0 0 0 0 0 0 0 0 0 0 0 
##$SW_h= 5175.983436853
##$TD= 65536
##$TD0= 1
##$TE= 294.16
##$TE2= 300
##$TE3= 300
##$TEG= 300
##$TL= (0..7)
0 120 120 120 120 120 120 120 
##$TP= (0..7)
150 150 150 150 150 150 150 150 
##$TP07= 0
##$TPNAME0= <>
##$TPNAME1= <>
##$TPNAME2= <>
##$TPNAME3= <>
##$TPNAME4= <>
##$TPNAME5= <>
##$TPNAME6= <>
##$TPNAME7= <>
##$TPOAL= (0..7)
0.5 0.5 0.5 0.5 0.5 0.5 0.5 0.5 
##$TPOFFS= (0..7)
0 0 0 0 0 0 0 0 
##$TUNHIN= 0
##$TUNHOUT= 0
##$TUNXOUT= 0
##$USERA1= <user>
##$USERA2= <user>
##$USERA3= <user>
##$USERA4= <user>
##$USERA5= <user>
##$V9= 5
##$VALIST= <valist>
##$VCLIST= <CCCCCCCCCCCCCCC>
##$VD= 0
##$VDLIST= <DDDDDDDDDDDDDDD>
##$VPLIST= <PPPPPPPPPPPPPPP>
##$VTLIST= <TTTTTTTTTTTTTTT>
##$WBST= 1024
##$WBSW= 4
##$XGAIN= (0..3)
0 0 0 0 
##$XL= 0
##$YL= 0
##$YMAX_a= 417540
##$YMIN_a= -349406
##$ZGOPTNS= <>
##$ZL1= 120
##$ZL2= 120
##$ZL3= 120
##$ZL4= 120
##$ABSF1= 16.522
##$ABSF2= -4.171173
##$ABSG= 5
##$ABSL= 3
##$ALPHA= 0
##$AQORDER= 0
##$ASSFAC= 0
##$ASSFACI= 0
##$ASSFACX= 0
##$ASSWID= 0
##$AUNMP= <proc_1d>
##$AZFE= 0.1
##$AZFW= 0.1
##$BCFW= 0
##$BC_mod= 0
##$BYTORDP= 0
##$COROFFS= 0
##$CY= 12.5
##$DATMOD= 1
##$DC= 0
##$DFILT= <>
##$DTYPP= 0
##$F1P= 14.0000005364418
##$F2P= -0.99999901652339
##$FCOR= 0.5
##$FTSIZE= 32768
##$FT_mod= 6
##$GAMMA= 0
##$GB= 0
##$INTBC= 1
##$INTSCL= 1
##$ISEN= 128
##$LB= 0.3
##$LEV0= 0
##$LPBIN= 0
##$MAXI= 10000
##$MC2= 0
##$MEAN= 0
##$ME_mod= 0
##$MI= 0
##$NCOEF= 0
##$NC_proc= -3
##$NLEV= 6
##$NOISF1= 0
##$NOISF2= 0
##$NSP= 0
##$NTH_PI= 0
##$NZP= 0
##$OFFSET= 16.522
##$PC= 1
##$PHC0= 75.53535
##$PHC1= 8.974487
##$PH_mod= 1
##$PKNL= yes
##$PPARMOD= 0
##$PSCAL= 4
##$PSIGN= 0
##$REVERSE= no
##$SF= 250.13
##$SI= 32768
##$SIGF1= 0
##$SIGF2= 0
##$SINO= 400
##$SIOLD= 32768
##$SREGLST= <1H.DMSO>
##$SSB= 0
##$STSI= 32768
##$STSR= 0
##$SW_p= 5175.98343685301
##$SYMM= 0
##$S_DEV= 0
##$TDeff= 65536
##$TDoff= 0
##$TI= <Analysis number 999999
Compound Code 99
Book Reference 9
Project Code 9>
##$TILT= no
##$TM1= 0
##$TM2= 0
##$TOPLEV= 0
##$USERP1= <user>
##$USERP2= <user>
##$USERP3= <user>
##$USERP4= <user>
##$USERP5= <user>
##$WDW= 1
##$XDIM= 32768
##$YMAX_p= 421817977
##$YMIN_p= -170939
$$ End of Bruker specific parameters
$$ ---------------------------------
##NTUPLES= NMR SPECTRUM
##VAR_NAME=  FREQUENCY,     SPECTRUM/REAL,   SPECTRUM/IMAG
##SYMBOL=    X,             R,               I
##VAR_TYPE=  INDEPENDENT,   DEPENDENT,       DEPENDENT
##VAR_FORM=  AFFN,          ASDF,            ASDF
##VAR_DIM=   32768,         32768,           32768
##UNITS=     HZ,            ARBITRARY UNITS, ARBITRARY UNITS
##FACTOR=    0.157963299565203, 1,           1
##FIRST=     4132.6476996994, 0,             0
##LAST=      -1043.33573715361, 0,           0
##MIN=       -1043.33573715361, -170939,     0
##MAX=       4132.6476996994, 421817977,     0
$$ Real data points
##PAGE= N=1
##DATA TABLE= (X++(R..R)), XYDATA
$$ [...]
$$ plain form
16411 18282 -15733 -17241 -4999 -23870 -4002 -5182 2851 -18483 -57667 -46880 10843 54034
16399 54034 58713 92702 64361 48542 59106 66744 27059 -68397 -99247 -61749 -24381 -2702
16387 -2702 13763 8476 39077 54466 48986 44918 69546 42127 32934 67181 69026 26195 14254
16374 14254 23030 -33583 -52023 -58271 -39084 17296 29771 -13267 -31329 -36335 -11397 -2433
16362 -2433 -38835 -79760 -76337 -78402 -51994 -10439 -12891 -29895 -40012 -7566 3525 10496 37720
16349 37720 45110 23108 41973 43405 70462 64067 33562 22255 -21448 -56755 -64899 -52754
16337 -52754 -46955 -26508 -40395 -4902 47702 31727 -2637 380 43278 -372 18129 22467
16325 22467 3076 18642 32283 5121 -56735 -88054 -45993 6160 8458 5309 -4840 -38874
$$ packed form
16411A8282l4015j508J2242j8871J9868j180Q033k1334l9184J0787N7723M3191
16399E4034M679L3989k8341j5819J0564P638l9685r5456l0850L7498L7368K1679
16387b702J6465n287L0601J5389n480m068K4628k7419r193L4247J845m2831j1941
16374A4254Q776n6613j8440o248J9187N6380J2475m3038j8062n006K4938Q964
16362b433l6402m0925L423k065K6408M1555k452j7004j0117L2446J1091O971K7224
16349C7720P390k2002J8865J432K7057o395l0505j1307m3703l5307q144J2145
16337e2754N799K0447j3887L5493N2604j5975l4364L017M2898m3650J8501M338
16325B2467j9391J5566J3641k7162o1856l1319M2061N2153K298l149j0149l4034
$$ plain form
16313 -38874 10509 -1589 -14212 5195 12281 -645 15076 -5224 -39287 -36275 -30050 -12150
16301 -12150 23546 8276 -1538 25477 -912 -21649 3756 10349 11251 -3587 -12236 -41858 -52539
16288 -52539 -47791 -52511 -57148 -74081 -32113 9888 -1119 378 28407 55402 38037 22119
16276 22119 38016 65304 74169 71725 34805 -18389 19078 26470 -12790 25822 56537 9871
16264 9871 -32861 -16228 -39207 -31330 -36891 1409 39338 39927 10741 -20269 -7934 8027 1753
16251 1753 5183 3524 -41468 -63736 -63615 -61483 24055 91294 66998 45803 27620 27412 14527
16238 14527 -27958 -1274 21515 -1281 13408 28658 21478 -5177 6811 3337 -23370 -60734
16226 -60734 -67212 -46645 -14046 -3025 -5362 -22533 -18478 7755 1567 7036 2710 22280 26779
$$ packed form
16313c8874M9383j2098j2623J9407P086j2926J5721k0300l4063L012O225J7900
16301a2150L5696j5270r814K7015k6389k0737K5405O593R02j4838q649k9622j0681
16288e2539M748m720m637j6933M1968M2001j1007J497K8029K6995j7365j5918
16276B2119J5897K7288Q865k444l6920n3194L7467P392l9260L8612L0715m6666
16264I871m2732J6633k2979P877n561L8300L7929N89k9186l1010J2335J5961o274
16251A753L430j659m4992k2268J21K132Q5538O7239k4296k1195j8183k08j2885
16238A4527m2485K6684K2789k2796J4689J5250p180k6655J1988l474k6707l7364
16226f0734o478K0567L2599J1021k337j7171M055K6233o188N469m326J9570M499
$$ plain form
16213 26779 22999 -10816 -9414 -24043 -57132 -38256 1800 -3752 -19746 -1860 -20124 -17943
16201 -17943 -76 31129 48313 -1516 -8592 4670 29249 52808 34771 28742 29494 -14327
16189 -14327 -40324 -36526 -47060 -23126 13579 8786 -39754 -70869 -82989 -45391 -27712 -12356
16177 -12356 5287 16787 14361 -32332 -44549 -53228 -47130 -38923 -79174 -117149 -91300 -112396
16165 -112396 -85722 -64475 -48179 -54048 -65392 -63381 -44152 -27397 6226 42754 813 -20073
16153 -20073 -29089 -11973 -4993 -15194 16007 5538 -18943 -41054 -7011 -7868 16734 25875 4599
16140 4599 -51666 -46093 -41118 -17056 18737 -14901 1419 35666 38243 8051 4771 -30378 -44564
16127 -44564 -41302 -18670 -8572 -21972 -30309 -44810 -14582 12632 1051 -47751 -19656 -6605
$$ packed form
16213B6779l780l3815J402j4629l3089J8876M0056n552j5994J7886j8264K181
16201a7943J7867L1205J7184m9829p076J3262K4579K3559j8037o029P52m3821
16189a4327k5997L798j0534K3934L6705m793m8540l1115j2120L7598J7679J5356
16177a2356J7643J1500k426m6693j2217q679O098Q207m0251l7975K5849k1096
16165a12396K6674K1247J6296n869j1344K011J9229J6755L3623L6528m1941k0886
16153b0073r016J7116O980j0201L1201j0469k4481k2111L4043q57K4602R141k1276
16140D599n6265N573M975K4062L5793l3638J6320L4247K577l0192l280l5149j4186
16127d4564L262K2632J0098j3400q337j4501L0228K7214j1581m8802K8095J3051
$$ plain form
16115 -6605 -33092 10908 23602 -2778 9129 48153 74434 80037 49723 -24221 -63473 -71097
16103 -71097 -43245 -20270 -1101 -452 52727 59037 23162 -12676 -19652 -33194 -57256 -31089
16091 -31089 28961 17501 9547 -10274 -28749 -36889 -26317 -3257 -8891 21753 36687 22690
16079 22690 -10788 -17207 -23801 13647 -2610 -29567 -9502 35622 17334 910 -9567 -15151
16067 -15151 -15644 -25888 -21891 -21909 -58762 -60958 -28889 -2015 6908 -9617 21236 12673 -10602
16054 -10602 -1602 7547 -10385 -58315 -57041 -66118 -38540 -42798 -53271 -46227 4667 16057 -19973
16041 -19973 -968 10208 30335 36875 53143 23713 -15458 -65701 -113421 -78857 -48762 -50101
16029 -50101 -26148 -9453 -55511 -82716 -108597 -99406 -42086 22529 -10739 -37862 -63070 -72466
$$ packed form
16115f605k6487M4000J2694k6380J1907L9024K6281N603l0314p3944l9252p624
16103g1097K7852K2975J9169O49N3179O310l5875l5838o976j3542k4062K6167
16091c1089O0050j1460p954j9821j8475q140J0572K3060n634L0644J4934j3997
16079B2690l3478o419o594L7448j6257k6957K0065M5124j8288j6424j0477n584
16067a5151m93j0244L997j8l6853k196L2069K6874Q923j6525L0853q563k3275
16054a0602R000R149j7932m7930J274r077K7578m258j0473P044N0894J1390l6030
16041a9973J9005J1176K0127O540J6268k9430l9171n0243m7720L4564L0095j339
16029e0101K3953J6695m6058k7205k5881R191N7320O4615l3268k7123k5208r396
$$ plain form
16017 -72466 -79097 -69871 -12135 4947 -17072 -36707 -60461 -56017 -70421 -68191 -41393 -28099
16005 -28099 -28277 -10321 -12613 -33650 -67168 -36487 3114 5454 18917 -4847 -13481 -7630 -18106
15992 -18106 -36871 -50683 -4518 10003 31707 54908 2654 -28821 -50833 -37446 -37203 15825
15980 15825 25161 -17670 -40400 -6534 -7861 -42637 -40193 -10686 5642 19695 19724 33725 20312
15967 20312 19943 25311 23496 -2047 -31396 -15212 -4037 33023 34274 52413 37967 41336 55402
15954 55402 43370 5992 26619 31061 484 13966 44878 62693 83641 77665 35557 3246
15942 3246 2892 -13870 -62176 -35768 -11362 -17706 -7344 -22395 -37118 991 31618 -6996
15930 -6996 6854 29748 41308 58294 24507 1818 -2331 -42885 -78467 -73022 -47303 -6111
$$ packed form
16017g2466o631R226N7736J7082k2019j9635k3754M444j4404K230K6798J3294
16005b8099j78J7956k292k1037l3518L0681L9601K340J3463k3764q634N851j0476
15992a8106j8765j3812M6165J4521K1704K3201n2254l1475k2012J3387K43N3028
15980A5825R336m2831k2730L3866j327l4776K444K9507J6328J4053K9J4001j3413
15967B0312l69N368j815k5543k9349J6184J1175L7060J251J8139j4446L369J4066
15954E5402j2032l7378K0627M442l0577J3482L0912J7815K0948n976m2108l2311
15942C246l54j6762m8306K6408K4406o344J0362j5051j4723L8109L0627l8614
15930f996J3850K2894J1560J6986l3787k2689m149m0554l5582N445K5719M1192
$$ plain form
15918 -6111 27398 33978 20604 -7666 -24384 -1715 34871 18038 -19116 -34496 -19985 -21276
15906 -21276 -30892 -53280 -60964 -56969 -30425 -13664 -18000 -30475 -39812 -61766 -60253 -35074 -21834
15893 -21834 -50837 -28788 46519 18485 -32805 -68712 -47153 -45680 -28208 -21085 -30492 11302
15881 11302 36723 58592 42942 -1693 22116 -4467 -37226 -60296 -66215 -30447 30615 82623
15869 82623 45304 30302 46359 60759 28783 -20020 -42683 -60478 -30842 2851 3745 3145
15857 3145 -16364 9737 66456 54166 15459 -1059 -3189 7706 29168 39606 73068 69601
15845 69601 12323 -45667 -47974 -6940 -24692 -29436 -30914 -57726 -39910 -42758 -29710 -48252
15833 -48252 -54695 -8026 3074 2688 9712 30167 3106 8370 -16535 -45232 -28819 -57661 -58242
$$ packed form
15918f111L3509O580j3374k8270j6718K2669L6586j6833l7154j5380J4511j291
15906b1276r616k2388p684L995K6544J6761m336j2475r337k1954J513K5179J3240
15893b1834k9003K2049P5307k8034n1290l5907K1559J473J7472P123r407M1794
15881A1302K5421K1869j5650m4635K3809k6583l2759k3070n919L5768O1062N2008
15869H2623l7319j5002J6057J4400l1976m8803k2663j7795K9636L3693Q94o00
15857C145j9509K6101N6719j2290l8707j6518k130J0895K1462J0438L3462l467
15845F9601n7278n7990k307M1034j7752m744j478k6812J7816k848J3048j8542
15833d8252o443M6669J1100l86P024K0455k7061N264k4905k8697J6413k8842n81
$$ plain form
15820 -58242 -79950 -71078 -41321 -34298 -17887 -37562 -39178 -50776 -67494 -63742 -37557 -24623
15808 -24623 -68186 -74828 -61155 -60295 -60678 -44244 -54823 -65032 -50844 -69782 -64174 -25610 9916
15795 9916 -6854 -29046 -4662 -43004 -47263 -10596 -4451 -5619 401 -28134 -56974 -85724 -97753
15782 -97753 -71616 -70284 -60347 -37136 -4565 24308 28172 40518 31298 -21821 -21370 19224 54883
15769 54883 45438 -114 -29583 -25455 52795 78311 49608 4597 -50433 -52600 -36327 -67799
15757 -67799 -66299 -19134 -9966 -34833 -12895 10780 31811 30826 42528 24995 -24418 -76024
15745 -76024 -92387 -80642 -55267 -14256 -11799 -19110 -23789 -16545 -16717 2407 -817 -19104 -24742
15732 -24742 -29387 -58960 -58566 -52657 -29715 -28415 -44348 -39783 -13141 -28756 -26454 -31874 -57600
$$ packed form
15820e8242k1708Q872K9757P023J6411j9675j616j1598j6718L752K6185J2934
15808b4623m3563o642J3673Q60l83J6434j0579j0209J4188j8938N608L8564L5526
15795I916j6770k2192K4384l8342m259L6667O145j168O020k8535k8840k8750j2029
15782i7753K6137J332R937K3211L2571K8873L864J2346r220n3119M51M0594L5659
15769E4883r445m5552k9469M128P8250K5516k8703m5011n5030k167J6273l1472
15757f7799J500M7165R168k4867K1938K3675K1031r85J1702j7533m9413n1606
15745g6024j6363J1745K5375M1011K457p311m679P244j72J9124l224j8287n638
15732b4742m645k9573L94N909K2942J300j5933M565K6642j5615K302n420k5726
$$ plain form
15719 -57600 -37917 -53845 -57306 -55030 -38873 -71082 -30456 -1768 12707 31151 64766 55130
15707 55130 -8489 7442 12099 351 -17588 -42298 -60376 -72555 -76770 -61473 -47965 -78358
15695 -78358 -77310 -45976 -28987 -49368 -67167 -71728 -70103 -82924 -85027 -58461 -48704 -40140 -51315
15682 -51315 -44585 -183 11132 -22320 -5619 9144 3262 44645 66172 41197 14759 -15139
15670 -15139 11795 10504 -45084 -73895 -80603 -74512 -40360 -44761 -32782 -7096 14361 20316 -10069
15657 -10069 -15384 7537 28646 17727 -25350 -18370 5128 -994 -11459 -5455 -22582 -46581
15645 -46581 -49172 -27740 -24451 -1495 -23427 -58794 -48330 -25300 -11796 -25895 -33007 -14793
15633 -14793 -8357 -19957 -8205 12028 -1788 -26895 -53609 -88737 -47057 -12679 -18111 -8306
$$ packed form
15719e7600J9683j5928l461K276J6157l2209M0626K8688J4475J8444L3615r636
15707E5130o3619J5931M657j1748j7939k4710j8078j2179m215J5297J3508l0393
15695g8358J048L1334J6989k0381j7799m561J625j2821k103K6566R757Q564j1175
15682e1315O730M4402J1315l3452J6701J4763n882M1383K1527k4975k6438k9898
15670a5139K6934j291n5588k8811o708O091L4152m401J1979K5686K1457N955l0385
15657a0069n315K2921K1109j0919m3077O980K3498o122j0465O004j7127k3999
15645d6581k591K1432L289K2956k1932l5367J0464K3030J3504j4099p112J8214
15633a4793O436j1600J1752K0233j3816k5107k6714l5128M1680L4378n432R805
$$ plain form
15621 -8306 739 41090 56784 23810 -22042 -43196 -43072 -51414 -20720 -42537 -26397 -707 -19737
15608 -19737 -25193 -9636 -4585 2940 11999 -37364 -58365 -31364 -16662 16818 38897 2946
15596 2946 1599 -10931 -2277 -23159 -73485 -55354 15429 68707 63334 44295 47930 25752 2656
15583 2656 5219 15950 14606 18033 60107 15094 2578 1061 -36937 -7395 14731 28428 33144
15570 33144 402 -28364 -29016 -25469 -53039 -26054 2219 -5751 -25942 18957 3660 -24314
15558 -24314 -231 8771 47968 61983 25405 -1206 -36762 -34576 -32180 -28440 -23810 -30216 -21287
15545 -21287 5278 18976 9804 -9157 -13871 26042 54410 23761 19209 7412 -23319 -50540
15533 -50540 -40947 11855 7395 26203 28252 21015 -39076 -27639 -1726 -33315 -44683 4781
$$ packed form
15621h306R045M0351J5694l2974m5852k1154J24q342L0694k1817J6140K5690j9030
15608a9737n456J5557N051P525R059m9363k1001K7001J4702L3480K2079l5951
15596B946j347j2530Q654k0882n0326J8131P0783N3278n373j9039L635k2178k3096
15583B656K563J0731j344L427M2074m5013j2516j517l7998K9542K2126J3697M716
15570C3144l2742k8766o52L547k7570K6985K8273p970k0191M4899j5297k7974
15558b4314K4083R002L9197J4015l6578k6611l5556K186K396L740M630o406Q929
15545b1287K6565J3698r172j8961m714L9913K8368l0649m552j1797l0731k7221
15533e0540R593N2802m460J8808K049p237o0091J1437K5913l1589j1368M9464
$$ plain form
15521 4781 19733 -6210 -24464 -8081 -1167 -2224 -18776 -15989 -31395 -47880 -17821 -25004 -43792
15508 -43792 -51827 -32877 -6958 59678 90577 59610 49124 23304 -9077 8390 34210 48696
15496 48696 64667 63887 19766 17521 8010 1037 -19864 3223 24240 221 -8449 -22753 -50170
15483 -50170 -28079 -14829 1576 18491 41858 41486 -4120 -26699 -17915 -12053 -20561 -25983 -27907
15470 -27907 -32845 -2000 19947 -23575 -58056 -106084 -110480 -85862 -86180 -65145 -36282 -15564
15458 -15564 -23004 -28133 -27625 -47915 -41759 -8193 25262 18580 15563 19020 698 -22588 910
15445 910 1552 17116 -35257 -89256 -101204 -89830 -73233 -35714 -1516 -34683 -66585 -73183 -57086
15432 -57086 -61329 -67679 -72764 -54387 -34791 -38481 -29097 -22138 -21628 -30977 -30974 25940 69941 22750
$$ packed form
15521D781J4952k5943j8254J6383O914j057j6552K787j5406j6485L0059p183j8788
15508d3792q035J8950K5919O6636L0899l0967j0486k5820l2381J7467K5820J4486
15496D8696J5971p80m4121k245r511o973k0901K3087K1017k4019q670j4304k7417
15483e0170K2091J3250J6405J6915K3367l72m5606k2579Q784N862q508n422j924
15470b7907m938L0845K1947m3522l4481m8028m396K4618l18K1035K8863K0718
15458a5564p440n129N08k0290O156L3566L3455o682l017L457j8322k3286K3498
15445I10O42J5564n2373n3999j1948J1374J6597L7519L4198l3167l1902o598J6097
15432e7086m243o350n085J8377J9596l690R384O959N10r349LN6914M4001m7191
$$ plain form
15418 22750 1158 -4619 -21798 -33851 -57037 -44426 -31469 -45529 -46721 -12730 -19366 -40237
15406 -40237 -52821 -35239 -8518 11894 9218 -34310 -40757 -13938 -8214 -27809 -24404 -1238
15394 -1238 -3274 4183 -6300 1826 -6214 -53836 -56847 -57929 -39537 -17715 15921 36783 512
15381 512 -11262 21638 15755 -30854 -51343 -6373 1802 -26965 4504 40502 6189 5334 18762
15368 18762 4591 -38142 -35666 -2997 35770 8532 37519 66677 31475 -18464 -43082 -11814
15356 -11814 49262 53903 41439 37777 35057 29629 -39525 -33790 -51204 -45986 10150 22324 -12406
15343 -12406 -20482 -20894 -52166 -29802 -21281 6635 39113 52317 37363 29608 36533 17176 14436
15330 14436 14165 -4673 -12065 -51303 -84257 -27824 -22876 -64093 -37363 -28880 11133 6001 -6487
$$ packed form
15418B2750k1592n777j7179j2053k3186J2611J2957j4060j192L3991o636k0871
15406d0237j2584J7582K6721K0412k676m3528o447K6819N724j9595L405K3166
15394a238k036P457j0483Q126q040m7622l011j082J8392K1822L3636K0862l6271
15381E12j1774L2900n883m6609k0489M4970Q175k8767L1469L5998l4313q55J3428
15368A8762j4171m2733K476L2669L8767k7238K8987K9158l5202m9939k4618L1268
15356a1814O1076M641j2464l662k720n428o9154N735j7414N218N6136J2174l4730
15343a2406q076m12l1272K2364Q521K7916L2478J3204j4954p755O925j9357k740
15330A4436k71j8838p392l9238l2954N6433M948m1217K6730Q483M0013n132j2488
$$ plain form
15317 -6487 -51411 -26030 19982 -1987 -58807 -59211 -13314 34007 47850 78511 32902 12001
15305 12001 11439 24007 21306 13375 17009 4826 1472 -32549 -59721 -51292 1923 -38993 -79896
15292 -79896 -77982 -64261 -47403 -23784 -34623 -43402 -68025 -35711 -21519 -28269 -39821 -10677
15280 -10677 -8752 -4421 44441 23138 25214 28533 24658 15723 -9028 10348 19184 -18157 -38817
15267 -38817 -50942 -45154 -57514 -46925 -41736 -50151 -64440 -68999 -38734 21923 47968 74689
15255 74689 78894 56990 11156 -29160 -49719 -43783 -87740 -136899 -82449 -37361 -38914 -38484 -35134
15242 -35134 5199 23660 19591 -12641 -28326 -21350 -10054 -27246 -29913 -53427 -40419 -39306
15230 -39306 14983 -6919 -33749 -88070 -91985 -79648 -72081 -56049 -63623 -65602 -27496 -16645
$$ packed form
15317f487m4924K5381M6012k1969n6820m04M5897M7321J3843L0661m5609k0901
15305A2001n62J2568k701p931L634j2183l354l4021k7172Q429N3215m0916m0903
15292g9896J914J3721J6858K3619j0839q779k4623L2314J4192o750j1552K9144
15280a0677J925M331M8862k1303K076L319l875q935k4751J9376Q836l7341k0660
15267c8817j2125N788j2360J0589N189q415j4289m559L0265O0657K6045K6721
15255G4689M205k1904m5834m0316k0559N936m3957m9159N4450M5088j553M30L350
15242c5134M0333J8461m069l2232j5685O976J1296j7192k667k3514J3008J113
15230c9306N4289k1902k6830n4321l915J2337P567J6032p574j979L8106J0851
$$ plain form
15218 -16645 -12494 -20261 -13761 50340 68927 75507 46824 1296 13738 -12863 -15956 -28012 -49811
15205 -49811 -26909 -31705 -15491 -38507 -75890 -58788 -35884 -21933 -13064 -29836 -35687 -62443
15193 -62443 -62621 -18269 23135 2638 -36104 -42656 -64079 -63623 -94474 -82121 -9300 -5771 28228
15180 28228 12315 14739 25270 29645 23496 12827 14712 12129 14746 7312 7013 17051 -25508
15167 -25508 -37484 -55537 -57589 -37325 21718 19990 17789 -5370 18783 71960 76524 81888 64044
15154 64044 48939 8772 -16465 -17737 -38585 -22653 -32529 -23454 -32364 -30255 -23156 27299 70211
15141 70211 51319 -8584 1094 44669 68266 50102 24209 13322 9059 -25943 -37625 -27410
15129 -27410 -58756 -36402 -48609 -42828 -77381 -94321 -70322 -62074 -57544 -33646 -7622 22586
$$ packed form
15218a6645M151p767O500O4101J8587O580k8683m5528J2442k6601l093j2056k1799
15205d9811K2902m796J6214k3016l7383J7102K2904J3951Q869j6772n851k6756
15193f2443j78M4352M1404k0497l8742o552k1423M56l0851J2353P2821L529L3999
15180B8228j5913K424J0531M375o149j0669J885k583K617p434k99J0038m2559
15167b5508j1976j8053k052K0264N9043j728k201k3159K4153N3177M564N364j7844
15154F4044j5105m0167k5237j272k0848J5932r876R075q910K109P099N0455M2912
15141G0211j8892n9903R678M3575K3597j8164k5893j0887m263l5002j1682J0215
15129b7410l1346K2354j2207N781l4553j6940K3999Q248M530K3898K6024L0208
$$ plain form
15117 22586 10093 7765 -15975 -55893 -75899 -110712 -49814 -41372 -15937 -1470 -16166 -30925
15105 -30925 -28545 -32931 -23745 -11665 -12020 -6517 17053 19307 26125 6827 14558 14140 -26597 -79333
15091 -79333 -65652 -53895 -56903 -60955 -24754 -17344 -49379 -38699 -44974 -2425 43076 27471
15079 27471 -3188 -20822 -39479 4071 -8569 -46357 -35274 -23972 -38024 -39561 -39383 -16410
15067 -16410 -9743 20922 29040 26087 -17951 -52462 -20933 16397 -2571 -51652 -53695 -31230
15055 -31230 -11376 -8004 7601 6400 3523 -8850 -1286 25242 24627 -7658 -41052 -62009 -90014
15042 -90014 -85495 -22440 -37137 -66052 -43238 -34366 -32119 -10602 -28183 -48768 -94046 -76508
15030 -76508 -85932 -55934 -13147 5395 48237 49789 26605 30115 19221 40271 51896 34392
$$ packed form
15117B2586j2493k328k3740l9918k0006l4813O0898Q442K5435J4467j4696j4759
15105c0925K380m386R186J2080l55N503K3570K254O818j9298P731m18m0737n2736
15091g9333J3681J1757l008m052L6201P410l2035J0680o275M2549M5501j5605
15079B7471l0659j7634j8657M3550j2640l7788J1083J1302j4052j537J78K2973
15067a6410O667L0665Q118k953m4038l4511L1529L7330j8968m9081k043K2465
15055c1230J9854L372J5605j201k877j2373P564K6528o15l2285l3394k0957k8005
15042i0014M519O3055j4697k8915K2814Q872K247K1517j7581k0585m5278J7538
15030g6508r424K9998M2787J8542M2842J552k3184L510j0894K1050J1625j7504
$$ plain form
15018 34392 26677 27570 39420 35323 8401 1010 -24752 7102 30043 71502 80490 72412 94032
15005 94032 41302 3621 20681 5671 -12779 -46627 -41449 23253 54411 17207 -12450 -32460
14993 -32460 -92052 -72440 14092 9424 -19582 -5783 19120 35960 19050 17264 9997 33008
14981 33008 29554 -7764 4313 24814 43553 29663 8285 -20878 -32434 -65066 -56062 -64561
14969 -64561 -85089 -65881 -19943 36238 7796 -37466 -37034 10420 38580 21375 -1403 12966
14957 12966 40740 36932 -31587 -41559 -11745 24130 21526 -7044 -23439 -28138 -8599 -3578 -28469
14944 -28469 -34395 10585 29712 30327 45522 33508 11085 -1693 26315 36920 13483 16024
14932 16024 45041 4496 -27520 -35153 -51341 -32142 27641 31896 22189 -6020 -17580 -41143
$$ packed form
15018C4392p715Q93J1850m097k6922p391k5762L1854K2941M1459Q988q078K1620
15005I4032n2730l7681J7060j5010j8450l3848N178O4702L1158l7204k9657k0010
14993c2460n9592J9612Q6532m668k9006J3799K4903J6840j6910j786p267K3011
14981C3008l454l7318J2077K0501J8739j3890k1378k9163j1556l2632R004q499
14969f4561k0528J9208M5938N6181k8442m5262M32M7454K8160j7205k2778J4369
14957A2966K7774l808o8519r972K9814L5875k604k8570j6395m699J9539N021k4891
14944b8469n926M4980J9127O15J5195j2014k2423j2778K8008J0605k3437K541
14932A6024K9017m0545l2016p633j6188J9199N9783M255r707k8209j1560k3563
$$ plain form
14920 -41143 -51553 -9673 -38793 -37684 -43217 -71487 -72132 -48142 -45142 -42550 -31671 -67346 -60807
14907 -60807 -47835 -37847 -77245 -99683 -88517 -99522 -95459 -74269 -13005 12602 -20844 -22481
14895 -22481 -43089 -85481 -93685 -76468 -71811 -78445 -42627 -42609 -40365 -39441 -51032 -36443 -38412 -29778
14881 -29778 4392 -562 30964 24609 11524 896 9275 9921 14653 -16873 -31441 -61037 -41248
14868 -41248 34604 57505 44640 -4382 -71104 -109807 -115479 -88277 -68226 -51252 -30238 53296
14856 53296 51897 65310 55082 20210 -28227 -26795 7259 35040 5752 -11323 -16326 -16663 -28593
14843 -28593 -22023 -21021 -29283 -11918 -8183 9593 5764 -34092 -33289 864 19387 10332 18148
14830 18148 26020 -38168 -31420 -17396 -15299 -18795 -42810 -42564 20725 29111 30813 54876 54403 4150
$$ packed form
14920d1143j0410M1880k9120J109n533k8270o45K3990L000K592J0879l5675O539
14907f0807J2972R988l9398k2438J1166j1005M063K1190O1264K5607l3446j637
14895b2481k0608m2392q204J7217M657o634L5818J8K244R24j1591J4589j969Q634
14881b9778L4170m954L1526o355j3085j0628Q379O46M732l1526j4568k9596J9789
14868d1248P5852K2901j2865m9022o6722l8703n672K7202K0051J6974K1014Q3534
14856E3296j399J3413j0228l4872m8437J432L4054K7781k9288j7075n003l37j1930
14843b8593O570J002q262J7365L735J7776l829l9856Q03L4153J8523r055P816
14830A8148P872o4188O748J4024K097l496k4015K46O3289Q386J702K4063m73n0253
$$ plain form
14816 4150 -74327 -47828 -4804 17038 -4033 -30256 -34457 -29817 -7331 -5423 -9478 6168 32630
14803 32630 1523 -1342 -6738 -11694 -8263 -20387 -4473 15085 -17301 -37488 -45314 -36734 -37532
14790 -37532 -20279 20874 21118 10199 15171 -7848 -12385 848 18187 -9144 -15357 10422 34663
14777 34663 60453 95366 74601 25040 3169 7012 13658 -3790 29132 34273 -5474 -8244
14765 -8244 -23263 -68129 -44485 -30327 -31252 -8651 39925 73307 77359 47200 -2524 -21458
14753 -21458 -5091 9407 30303 32410 31335 64134 73823 78443 61533 52722 37622 12556 -33734
14740 -33734 -28264 -49114 -56086 -28415 10637 62792 77951 29523 -7783 -26320 -61722 -102405
14728 -102405 -66976 -50147 -42351 -46311 -43709 -41021 -31522 -30939 -60508 -66915 -42661 -66207 -78751
$$ packed form
14816D150p8477K6499M3024K1842k1071k6223m201M640K2486J908m055J5646K6462
14803C2630l1107k865n396m956L431j2124J5914J9558l2386k0187p826Q580p98
14790c7532J7253M1153K44j0919M972k3019m537J3233J7339k7331o213K5779K4241
14777C4663K5790L4913k0765m9561k1871L843O646j7448L2922N141l9747k770
14765h244j5019m4866K3644J4158r25K2601M8576L3382M052l0159m9724j8934
14753b1458J6367J4498K0896K107j075L2799R689M620j6910q811j5100k5066m6290
14740c3734N470k0850o972K7671L9052N2155J5159m8428l7306j8537l5402m0683
14728a02405L5429J6829P796l960K602K688R499N83k9569o407K4254k3546j2544
$$ plain form
14715 -78751 -95435 -49206 -11377 -30595 -899 21873 -13508 -15929 -15719 -20206 -27377 -36065 -25249
14702 -25249 -14718 -45086 -18922 -20815 -33366 -35184 -81912 -101906 -81436 -61010 -63834 -54904
14690 -54904 -16763 5705 9572 7233 -8334 12545 27749 56932 57629 44522 51091 57535 12547
14677 12547 -12217 -9558 21264 66585 52680 9558 -6341 12063 -13331 -34109 -43575 -34587
14665 -34587 26870 39859 23367 -2708 -48619 -49513 -60143 -94062 -86123 -36746 -30819 -27744 -4959
14652 -4959 -14023 5076 -13971 -30317 -46368 -72904 -130681 -105660 -51068 -34674 -31417 -31602 -42390
14639 -42390 -27460 -26582 -28260 -13654 -17145 -7996 23939 28476 31882 -37799 -82740 -51398 -14505
14626 -14505 15307 39391 47105 49868 31327 42127 32162 27483 30782 20506 -8245 -14302 7218
$$ packed form
14715g8751j6684M6229L7829j9218K9696K2772l5381k421K10m487p171q688J0816
14702b5249J0531l0368K6164j893j2551j818m6728j9994K0470K0426k824Q930
14690e4904L8141K2468L867k339j5567K0879J5204K9183O97j3107O569O444m4988
14677A2547k4764K659L0822M5321j3905m3122j5899J8404k5394k0778r466Q988
14665c4587O1457J2989j6492k6075m5911q94j0630l3919P939M9377N927L075K2785
14652d959r064J9099j9047j6346j6051k6536n7777K5021N4592J6394L257j85j0788
14639d2390J4930Q78j678J4606l491R149L1935M537L406o9681m4941L1342L6893
14626a4505K9812K4084P714K763j8541J0800r965m679L299j0276k8751o057K1520
$$ plain form
14613 7218 5123 33703 28582 -11397 -44998 -39135 -9061 -26383 -58791 -53230 -30003 24290 31816
14600 31816 52854 47868 42339 -336 7360 -2396 37861 47190 52396 28974 -1762 -68865 -70671
14587 -70671 -78834 -56395 -8497 4413 35323 46604 46466 48187 42149 7579 14333 -27749 -98097
14574 -98097 -88095 -62748 -25884 -32389 -21111 -51113 -88979 -68620 -25398 -15773 -1104 21752
14562 21752 24651 19424 -1648 9671 32167 30039 33627 49797 38596 -3492 3909 9043 11527
14549 11527 -47771 -55126 -30184 -41106 -72442 -40439 466 -19257 -38033 23866 74656 57326
14537 57326 33831 18784 60171 58947 2601 -516 9738 49229 55397 39697 53670 70014
14525 70014 57450 106071 85423 41702 -9013 -46361 -50254 -29659 -15458 1607 13430 -4562
$$ packed form
14613G218k095K8580n121l9979l3601N863L0074j7322l2408N561K3227N4293P526
14600C1816K1038m986n529m2675P696r756M0257R329N206k3422l0736o7103j806
14587g0671q163K2439M7898J2910L0910J1281j38J721o038l4570O754m2082p0348
14574i8097J0002K5347L6864o505J1278l0002l7866K0359M3222R625J4669K2856
14562B1752K899n227k1072J1319K2496k128L588J6170j1201m2088P401N134K484
14549A1527n9298p355K4942j0922l1336L2003M0905j9723j8776O1899N0790j7330
14537E7326k3495j5047M1387j224n6346l117J0254L9491O168j5700J3973J6344
14525G0014j2564M8621k0648m3721n0715l7348l893K0595J4201J7065J1823j7992
$$ plain form
14513 -4562 -12433 20213 14984 25724 17272 7794 -36574 -78100 -42295 -39576 -23412 15792 26121
14500 26121 36875 13011 14924 24325 23808 6496 -43821 -60791 -53860 -55551 -20017 -23969 7665
14487 7665 7985 12856 21572 27174 -2957 -41241 -44868 -66039 -67031 -37608 -35561 -47255 -16431 38762
14473 38762 -44374 -71774 -27787 -25014 -41241 -54009 -46706 -36079 -36635 6478 70077 77680 55139
14460 55139 38128 60783 89815 110249 83274 24254 10761 24992 37827 -2467 -13242 -36143
14448 -36143 -48188 -6530 32807 8814 -61582 -70745 -43414 -47466 -36946 -23677 -18009 -36320
14436 -36320 -36874 -9740 -26091 -18408 -21534 -17727 11097 -3193 -11833 -15473 -11681 -53747 -26319
14423 -26319 31694 34354 -4573 -35825 -46625 -21669 -20456 -18072 -43464 -74247 -107118 -86310
$$ packed form
14513d562p871L2646n229J0740q452r478m4368m1526L5805K719J6164L9204J0329
14500B6121J0754k3864J913R401n17j7312n0317j6970O931j691L5534l952L1634
14487G665L20M871Q716N602l0131l8284l627k1171r92K9423K047j1694L0824N5193
14473C8762q3136k7400M3987K773j6227j2768P303J0627n56M3113O3599P603k2541
14460E5139j7011K2655K9032K0434k6975n9020j3493J4231J2835m0294j0775k2901
14448c6143j2045M1658L9337k3993p0396r163K7331m052J0520J3269N668j8311
14436c6320n54K7134j6351P683l126L807K8824j4290q640l640L792m2066K7428
14423b6319N8013K660l8927l1252j0800K4956J213K384k5392l0783l2871K0808
$$ plain form
14411 -86310 -12274 7414 31510 17431 -26581 -51217 -24956 -53102 -40581 -48573 -49205 -13337
14399 -13337 24812 -1892 -18464 5894 26892 38364 9017 -23838 -26277 25484 52282 -2294
14387 -2294 -48779 -82344 -57759 2071 -4433 -35709 -24449 -12658 -9270 17649 -7299 4688
14375 4688 11482 26260 43648 42986 -77436 -134468 -104779 -54664 -10939 15069 40222 29341
14363 29341 30766 -35440 -47999 -29704 -22200 -33268 3676 739 -21258 -68434 -42479 26093
14351 26093 62783 805 2275 12781 -7214 -39055 -55985 -21576 11959 4036 -44146 -84389
14339 -84389 -92550 -106382 -117131 -109798 -50642 1873 54613 52270 18590 -26194 -58064 -76257
14327 -76257 -96043 -100258 -58362 -9431 23048 29619 29773 7914 -5255 7121 -8846 -6442 -758
$$ packed form
14411h6310P4036J9688K4096j4079m4012k4636K6261k8146J2521p992o32L5868
14399a3337L8149k6704j6572K4358K0998J1472k9347l2855k439N1761K6798n4576
14387b294m6485l3565K4585N9830o504l1276J1260J1791L388K6919k4948J1987
14375D688O794J4778J7388o62j20422n7032K9689N0115M3725K6008K5153j0881
14363B9341J425o6206j2559J8295P504j1068L6944k937k1997m7176K5955O8572
14351B6093L6690o1978J470J0506j9995l1841j6930L4409L3535p923m8182m0243
14339h4389q161j3832j0749P333N9156N2515N2740k343l3680m4784l1870j8193
14327g6257j9786m215M1896M8931L2479O571J54k1859j3169J2376j5967K404N684
$$ plain form
14314 -758 -14390 -6906 -19156 -65510 -93117 -73566 -50226 -73054 -66834 -46069 -6738 3507
14302 3507 25520 854 3365 25055 -6414 -37075 -32572 -8231 -25312 -44609 -68193 -93052
14290 -93052 -106256 -99014 -69050 -36310 -22323 -31648 -15731 -47253 -68595 -60556 -42698 -64810
14278 -64810 -109505 -93428 -102488 -79892 -56979 -59490 -55905 -30774 -14053 2162 37493 -2586
14266 -2586 -34921 -54681 -57617 -28532 -2369 -29343 -77551 -43540 27616 42448 45065 32700
14254 32700 8849 -20857 -34121 -29144 -51846 -25029 -53101 -60355 -73618 -80277 -54342 -42899
14242 -42899 -14199 -13778 -11765 10777 26998 8469 -48224 -69345 -42337 -30840 -17906 -36278
14230 -36278 -66765 -80780 -88309 -20357 -13315 -10870 -27003 -2370 13847 18202 3202 13826
$$ packed form
14314g58j3632P484j2250m6354k7607J9551K3340k2828O220K0765L9331J0245
14302C507K2013k4666K511K1690l1469l0661M503K4341j7081j9297k3584k4859
14290i3052j3204P242K9964L2740J3987r325J5917l1522k1342Q039J7858k2112
14278f4810m4695J6077r060K2596K2913k511L585K5131J6721J6215L5331m0079
14266b586l2335j9760k936K9085K6163k6974m8208L4011P1156J4832K617j2365
14254C2700k3851k9706j3264M977k2702K6817k8072p254j3263o659K5935J1443
14242d2899K8700M21K013K2542J6221j8529n6693k1121K7008J1497J2934j8372
14230c6278l0487j4015p529O7952P042K445j6133K4633J6217M355j5000J0624
$$ plain form
14218 13826 33856 43050 -1895 -36306 -23571 3744 24320 39293 21755 -15933 -33832 5019
14206 5019 28704 62786 46955 10082 -32639 -78022 -92285 -64967 -72235 -84436 -66044 -46751
14194 -46751 -39128 -59036 -75819 -61474 5761 761 -42519 -16778 17672 30295 44221 23582
14182 23582 35159 29760 41303 17348 70580 33202 28335 -25130 -44728 -20996 -18915 -22592
14170 -22592 -19618 6607 53758 48008 12715 9880 25513 23152 6730 -29586 -38371 -57548 -43316
14157 -43316 -26629 -28254 -6073 -42 -2097 7578 52307 99925 92902 20702 -26417 15049 10135
14144 10135 -13315 -51457 -12753 25911 -22178 -18527 -10233 -24415 -15774 14867 4254 413
14132 413 -28842 -49441 -50965 -24520 -6743 -24062 -31646 -38838 -21226 -42210 -36906 -12306 7345
$$ packed form
14218A3826K0030R194m4945l4411J2735K7315K0576J4973j7538l7688j7899L8851
14206E019K3685L4082j5831l6873m2721m5383j4263K7318p268j2201J8392J9293
14194d6751P623j9908j6783J4345O7235n000m3280K5741L4450J2623J3926k0639
14182B3582J1577n399J1543k3955N3232l7378m867n3465j9598K3732K081l677
14170b2592K974K6225M7151n750l5293k835J5633k361j6422l6316q785j9177J4232
14157d3316J6687j625K2181O031k055R675M4729M7618p023p2200m7119M1466m914
14144A0135k3450l8142L8704L8664m8089L651Q294j4182Q641L0641j0613l841
14132D13k9255k0599j524K6445J7777j7319p584p192J7612k0984N304K4600J9651
$$ plain form
14119 7345 -3403 -30150 -25961 572 8806 21084 -21437 -64312 -38950 -46588 -52312 -30397 -1967
14106 -1967 -4409 -19911 -65918 -88057 -30911 -22269 -26784 -23733 -31050 -28041 -53144 -55404 -30535
14093 -30535 1257 1241 -3419 -4119 18967 6827 3688 -29026 -35796 -24209 -20328 -29742 -70082 -54996
14079 -54996 -25645 -38756 -28106 -27145 -28656 -23709 -18774 9029 26919 34018 23019 17770 15944
14066 15944 -33009 -41817 -14589 -8111 20196 16461 -11744 -22615 -33313 -8034 -16282 -55503
14054 -55503 -46991 -53981 -4465 37930 -187 -13551 18455 -4833 -6843 -7190 -23875 -26920 -32196
14041 -32196 -20818 -14532 -28078 30824 37724 17345 6992 -20810 -37145 -6522 52510 77134
14029 77134 22506 -12666 -57824 -99821 -109262 -58043 -4137 37342 14225 -5071 -16219 -43008
$$ packed form
14119G345j0748k6747M189K6533Q234J2278m2521m2875K5362p638n724K1915K8430
14106a967k442j5502m6007k2139N7146Q642m515L051p317L009k5103k260K4869
14093c0535L1792j6m660p00K3086j2140l139l2714o770J1587L881r414m0340J5086
14079e4996K9351j3111J0650R61j511M947M935K7803J7890P099j0999n249j826
14066A5944m8953q808K7228O478K8307l735k8205j0871j0698K5279q248l9221
14054e5503Q512o990M9516M2395l8117j3364L2006k3288k010l47j6685l045n276
14041c2196J1378O286j3546N8902O900k0379j0353k7802j6335L0623N9032K4624
14029G7134n4628l5172m5158m1997r441N1219N3906M1479k3117j9296j1148k6789
$$ plain form
14017 -43008 -98649 -94099 -105836 -86081 -6410 44327 41449 10812 12891 -11666 -74591 -59296
14005 -59296 -76182 -51096 -9063 23865 24209 18740 -14394 -24785 -5772 20991 -16131 5812
13993 5812 1808 -33761 -17324 -34878 -72399 -97229 -60419 -30504 -11444 -3649 -13609 -31308
13981 -31308 -42616 -60703 -79746 -78529 -61863 -75636 -34563 2261 12566 36124 49887 1173
13969 1173 -3682 16868 13237 5604 12978 1067 -4065 20200 27616 -6796 -14195 -33222 -34450
13956 -34450 -53530 -79189 -109097 -97909 -108615 -110915 -59818 -37639 3098 8932 28614 14915
13944 14915 -16549 -47919 -45905 -71196 -72721 -41040 -7341 -4169 -27806 -28658 -15152 -51293 -60638
13931 -60638 -41237 -50081 -28713 -9771 -50618 -56161 25646 38553 18397 -2967 -10413 -17896
$$ packed form
14017d3008n5641M550j1737J9755P9671N0737k878l0637K079k4557o2925J5295
14005e9296j6886K5086M2033L2928L44n469l3134j0391J9013K6763l7122K1943
13993E812m004l5569J6437j7554l7521k4830L6810K9915J9060P795r960j7699
13981c1308j1308j8087j9043J217J6666j3773M1073L6824J0305K3558J3763m8714
13969A173m855K0550l631p633P374j1911n132K4265P416l4412p399j9027j228
13956c4450j9080k5659k9908J1188j0706k300N1097K2179M0737N834J9682j3699
13944A4915l1464l1370K014k5291j525L1681L3699L172k3637q52J3506l6141r345
13931f0638J9401q844K1368J8942m0847n543Q1807J2907k0156k1364p446p483
$$ plain form
13919 -17896 -48047 -7707 -29242 -23796 -10055 -44616 -52171 -62336 -45075 -18277 36594 -11996
13907 -11996 -36467 -20896 69 -46075 -36240 -10083 -12891 3851 16928 42650 17579 -9840
13895 -9840 -27720 -28258 4340 -4323 -42233 -21333 22592 22437 9259 -1457 21346 2987 -13754
13882 -13754 59525 85169 25995 -30541 14845 19846 -20738 -68718 -64974 -34607 807 24745
13870 24745 16858 -7913 24614 42406 46377 18955 10310 14200 53215 103393 74177 44174
13858 44174 28957 -8437 -33205 -16530 -18202 -57043 -46912 -42481 -59522 -42285 -11792 15651
13846 15651 9196 -7778 -24978 -26637 -26484 -49407 -52659 -56822 -37552 -66618 -98514 -55358 -17977
13833 -17977 -22154 -29446 -32536 -60570 -49023 -7968 -8297 39616 75576 80035 77919 44831 43315
$$ packed form
13919a7896l0151M0340k1535N446J3741l4561p555j0165J7261K6798N4871m8590
13907a1996k4471J5571K0965m6144R835K6157k808J6742J3077K5722k5071k7419
13895i840j7880n38L2598q663l7910K0900M3925j55j3178j0716K2803j8359j6741
13882a3754P3279K5644n9174n6536M5386N001m0584m7980L744L0367L5414K3938
13870B4745p887k4771L2527J7792L971k7422q645L890L9015N0178k9216l0003
13858D4174j5217l7394k4768J6675j672l8841J0131M431j7041J7237L0493K7443
13846A5651o455j6974j7200j659J53k2923l252m163J9270k9066l1896M3156L7381
13833a7977m177p292l090k8034J1547M1055l29M7913L5960M459k116l3088j516
$$ plain form
13820 43315 59938 21856 12486 20839 -14335 -31736 -57147 -23759 -31777 -10654 -28465 -2969
13808 -2969 -6949 -18164 -9546 -13848 16662 34286 69315 39537 16871 -18580 -4224 -8963 -8959
13795 -8959 -26123 -34497 -10427 29629 54855 71321 48508 27269 11589 3615 17836 34250
13783 34250 26486 6724 9233 -26633 -34807 -35499 800 -11024 -22766 3427 -8744 -53978 -43542
13770 -43542 -22928 -5651 -25335 -41258 -49543 -34442 -58927 -71994 -40665 -30142 -54235 -27960
13758 -27960 -4240 3501 6162 20981 27803 21110 56643 29692 21218 -41806 -50440 -71767 -29170
13745 -29170 -16581 -38212 -20061 -2989 -1837 721 -6398 -30738 -27033 -47627 -45642 -84401 -86052
13732 -86052 -17255 20029 15203 11543 -19436 -60508 -26648 -23789 -31359 -44831 -63954 -58601 -25999
$$ packed form
13820D3315J6623l8082r370Q353l5174j7401k5411L3388q018K1123j7811K5496
13808b969l980j1215Q618m302L0510J7624L5029k9778k2666l5451J4356m739M
13795h959j7164q374K4070M0056K5226J6466k2813k1239j5680p974J4221J6414
13783C4250p764j9762K509l5866q174o92L6299j1824j1742K6193j2171m5234J0436
13770d3542K0614J7277j9684j5923q285J5101k4485j3067L1329J0523k4093K6275
13758b7960K3720P741K661J4819O822o693L5533k6951q474o3024q634k1327M2597
13745b9170J2589k1631J8151J7072J152K558p119k4340L705k0594J985l8759j651
13732h6052O8797L7284m826l660l0979m1072L3860K859p570j3472j9123N353L2602
$$ plain form
13719 -25999 6537 28047 40694 35726 24739 -5948 -17573 -18982 -1351 1725 18011 24027
13707 24027 154 -5464 32664 6525 10954 18288 -15475 -31777 -23074 -43724 -29104 -3864
13695 -3864 18015 2523 -4918 20630 27955 30234 -21520 -48955 -25920 -21844 -53460 -95642 -66949
13682 -66949 -46478 -13129 -15882 -25276 -20687 -31979 -44238 -42083 -47826 -70470 -52045 -54 10956
13669 10956 31991 48991 40591 67122 57568 63382 38298 -12723 -6650 33160 20193 7437
13657 7437 8946 -19268 -30165 -5 21594 19863 3477 -1648 1573 -2965 1178 20379 50936
13644 50936 61489 30932 42339 65836 50010 34157 27015 52265 57664 52547 57897 67012 16819
13631 16819 -9411 -20477 -39697 -18854 -26197 -21418 -52918 -61399 -36446 -36688 -64749 -129794 -103705
$$ packed form
13719b5999L2536K1510J2647m968j0987l0687j1625j409J7631L076J6286O016
13707B4027k3873n618L8128k6139M429P334l3763j6302Q703k0650J4620K5240
13695c864K1879j5492p441K5548P325K279n1754k7435K3035M076l1616m2182K8693
13682f6949K0471L3349k753r394M589j1292j2259K155n743k2644J8425N1991J1010
13669A0956K1035J7000q400K6531r554N814k5084n1021O073L9810j2967j2756
13657G437J509k8214j0897L0160K1599j731j6386n125L221m538M143J9201L0557
13644E0936J0553l0557J1407K3497j5826j5853p142K5250N399n117N350R115n0193
13631A6819k6230j1066j9220K0843p343M779l1500q481K4953k42k8061o5045K6089
$$ plain form
13618 -103705 -42824 -8456 31097 29865 25705 13837 38875 32707 19583 -2260 -35237 -30954
13606 -30954 -10367 27472 86288 106409 81596 52313 44723 26341 -6524 1497 10532 7401
13594 7401 -3050 12145 20165 -5503 -35366 6804 -952 -18275 -30904 13536 1277 6093
13582 6093 49784 71400 75955 25936 -12158 -8021 -41991 -59958 -43501 -31216 11010 -3565
13570 -3565 -6208 -2367 4094 207 -46579 -33515 26205 14898 -3929 17486 38170 32300 16584
13557 16584 25172 17881 7819 -668 -3853 -6740 -7143 -33466 -39063 -25773 -835 9871 -50547
13544 -50547 -66364 -48182 -49086 -42712 -36266 -27053 -17121 44080 28212 -12728 -28307 -27377 -16561
13531 -16561 2640 -2507 -39323 -65882 -67860 -66888 -62239 -10744 46500 49762 33016 -12555 -32316
$$ packed form
13618a03705O0881L4368L9553j232m160j1868K5038o168j3124k1843l2977M283
13606c0954K0587L7839N8816K0121k4813k9283p590j8382l2865Q021R035l131
13594G401j0451J5195Q020k5668k9863M2170p756j7323j2629M4440j2259M816
13582F093M3691K1616M555n0019l8094M137l3970j7967J6457J2285M2226j4575
13570c565k643L841O461l887m6786J3064N9720j1307j8827K1415K0684n870j5716
13557A6584Q588p291j0062q487l185k887m03k6323n597J3290K4938J0706o0418
13544e0547j5817J8182r04O374O446R213R932O1201j5868m0940j5579R30J0816
13531a6561J9201n147l6816k6559j978R72M649N1495N7244L262j6746m5571j9761
$$ plain form
13518 -32316 -50906 -56067 -31289 -4475 13273 11259 -7377 -14990 -9185 32701 39636 5671 -19678
13505 -19678 -59023 -36874 19326 34481 13590 5632 -21019 -47767 -20947 38521 9383 -16220
13493 -16220 -17072 -7066 -26983 -16784 -4244 -7297 -50572 -98533 -135519 -67794 -3825 29073
13481 29073 4055 -22374 -26421 -26517 -31988 -44852 -35681 -50078 -38666 -13816 -6050 -20739 -12741
13468 -12741 2862 28802 33713 34604 30100 30710 33692 -26450 -66392 -34935 -1769 14374 -32497
13455 -32497 -47956 -41358 -9250 17389 30604 -5090 -6763 21643 -11712 -15936 -7005 -1216 -15620
13442 -15620 -6414 22419 33392 20494 21376 12622 703 -8695 6163 21535 2298 -7514 13113
13429 13113 22983 29359 20258 -44052 -58002 -32386 -18845 -24405 -39136 -22042 14210 47124
$$ packed form
13518c2316j8590n161K4778K6814J7748k014j8636p613N805M1886O935l3965k5349
13505a9678l9345K2149N6200J5155k0891p958k6651k6748K6820N9468k9138k5603
13493a6220q52J0006j9917J0199J2540l053m3275m7961l6986O7725O3969L2898
13481B9073k5018k6429m047r6n471j2864R171j4397J1412K4850P766j4689P998
13468a2741J5603K5940M911Q91m504O10K982o0142l9942L1457L3166J6143m6871
13455c2497j5459O598L2108K6639J3215l5694j673K8406l3355m224Q931N789j4404
13442a5620R206K8833J0973j2898Q82q754j1919r398J4858J5372j9237r812K0627
13429A3113R870O376r101o4310j3950K5616J3541n560j4731J7094L6252L2914
$$ plain form
13417 47124 53328 76297 30841 4845 25039 35588 39111 35019 88239 63556 13914 2896
13405 2896 -1074 7127 8394 22489 27854 -6913 -11130 8135 13776 12716 -25599 -43301 -4161
13392 -4161 438 -2617 -5328 25603 26804 26798 -2548 -5767 13707 -30226 -43943 -39787 -31968 -3508
13378 -3508 25134 5215 -26786 -5456 -9392 -1270 63290 62363 61119 39504 27714 63642 59277
13365 59277 35246 21461 13091 -6524 -10555 -2374 -27592 -28011 -1247 42900 8763 -15487 -23769
13352 -23769 -41182 -39290 -17790 6306 -1926 -15018 4461 6241 40366 43631 17392 8146 16421
13339 16421 30488 55104 15067 -19083 -33572 -34696 -36593 36561 49296 20977 20400 52280
13327 52280 82310 120073 117376 77357 39345 15801 31275 41697 43376 29491 30425 39052 -3644
$$ packed form
13417D7124O204K2969m5456k5996K0194J0549L523m092N3220k4683m9642j1018
13405B896l970Q201J267J4095N365l4767m217J9265N641j060l8315j7702L9140
13392d161M599l055k711L0931J201ok9346l219J9474m3933j3717M156P819K8460
13378c508K8642j9919l2001K1330l936Q122O4560r27j244k1615j1790L5928m365
13365E9277k4031j3785q370j9615m031Q181k5218m19K6764M4147l4137k4250q282
13352b3769j7413J892K1500K4096q232j3092J9479J780L4125L265k6239r246Q275
13339A6421J4067K4616m0037l4150j4489j124j897P3154J2735k8319n77L1880
13327E2280L0030L7763k697m0019l8012k3544J5474J0422J679j3885R34Q627m2696
$$ plain form
13314 -3644 -37582 -59260 -37898 -28301 -37716 17182 64814 45225 21071 9394 51687 87472
13302 87472 65416 53305 -5284 -12699 8256 -31087 -70616 -60743 -49233 -43431 -30677 12428
13290 12428 42679 39007 35176 32196 -1160 -16867 -9773 14381 34125 33849 38567 54428 30940
13277 30940 37227 33723 28145 14185 20471 37603 40311 31787 17680 17709 -25618 -4656 30245
13264 30245 12116 27793 9505 -3191 12768 14468 57952 42126 11611 43321 53364 54773
13252 54773 54008 63880 52957 62186 67229 41057 26389 25160 -7816 11386 20020 717 21332
13239 21332 31989 48369 49837 4337 14123 40172 66805 79226 58272 7788 -59430 -43136
13227 -43136 -21890 6983 3077 -23458 -35530 -23853 -43339 -38781 -34735 -28785 10094 24939
$$ packed form
13314c644l3938k1678K1362R597r415N4898M7632j9589k4154j1677M2293L5785
13302H7472k2056j2111n8589p415K0955l9343l9529R873J1510N802J2754M3105
13290A2428L0251l672l831k980l3356j5707P094K4154J9744k76M718J5861k3488
13277C0940O287l504n578j3960O286J7132K708q524j4107K9m3327K0962L4901
13264C0245j8129J5677j8288j2696J5959J700M3484j5826l0515L1710J0043J409
13252E4773p65R872j0923R229N043k6172j4668j229l2976J9202Q634j9303K0615
13239B1332J0657J6380J468m5500R786K6049K6633J2421k0954n0484o7218J6294
13227d3136K1246K8873l906k6535j2072J1677j9486M558M046N950L8879J4845
$$ plain form
13215 24939 35492 29986 14196 42754 32032 37781 53164 41836 35572 45886 31078 5089
13203 5089 -15858 -8746 16587 16489 28361 55077 42074 24494 37418 6669 -3107 35376 61205
13190 61205 33745 1622 -14938 -5850 -15382 5102 -3025 -14161 -707 -20078 -37887 -35839
13178 -35839 -13925 6929 26638 40888 5085 15509 8971 454 -1253 -11222 -25273 -36586
13166 -36586 -4244 44177 67440 84914 39541 25895 25727 -3696 -10230 -31206 -10852 -12673
13154 -12673 -859 23705 -26015 -37349 -35515 -13330 8635 36077 42596 88606 113015 104600
13142 104600 90337 23470 -37132 -54262 -27809 1990 8646 2309 12237 25853 59917 103364
13130 103364 85253 70039 64129 25312 54535 36486 8739 -11700 -36039 -14751 26546 14732
$$ packed form
13215B4939J0553n506j5790K8558j0722N749J5383j1328o264J0314j4808k5989
13203E089k0947P112K5333r8J1872K6716j3003j7580J2924l0749r776L8483K5829
13190F1205k7460l2123j6560R088r532K0484q127j1136J3454j9371j7809K048
13178c5839K1914K0854J9709J4250l5803J0424o538q517j707r969j4051j1313
13166c6586L2342M8421K3263J7474m5373j3646j68k9423o534k0976K0354j821
13154a2673J1814K4564m9720j1334J834K2185K1965K7442O519M6010K4409q415
13142A04600j4263o6867o0602j7130K6453K9799O656o337R928J3616L4064M3447
13130A03364j8111j5214n910l8817K9223j8049k7747k0439k4339K1288M1297j1814
$$ plain form
13118 14732 38025 69036 87142 80934 74178 105829 92291 67902 37855 21879 -6802 1655
13106 1655 25063 28066 24885 22832 58851 64281 62514 96792 113292 88395 66273 41689 20117
13093 20117 -16499 -14012 23175 52932 54500 33260 39829 47325 18490 11918 29099 17007 25336
13080 25336 49317 45818 24207 26687 52347 73889 38672 4367 -10620 21654 32456 52464
13068 52464 105643 115911 76235 49470 19353 2444 -13377 23512 58113 45007 2182 26199
13056 26199 46376 33041 35832 29824 36776 53816 65628 84030 50035 18493 7586 25166
13044 25166 48388 13469 31769 25440 -310 -39911 -31668 -19127 -51020 -37270 14812 16758
13032 16758 26095 1594 -2087 31309 25782 57049 76827 40086 54210 35563 -17718 -10455
$$ packed form
13118A4732K3293L1011J8106o208o756L1651j3538k4389l0047j5976k8681Q457
13106A655K3408L003l181k053L6019N430j767L4278J6500k4897k2122k4584k1572
13093B0117l6616K487L7187K9757J568k1240O569P496k8835o572J7181j2092Q329
13080B5336K3981l499k1611K480K5660K1542l5217l4305j4987L2274J0802K0008
13068E2464N3179J0268l9676k6765l0117j6909j5821L6889L4601j3106m2825K4017
13056B6199K0177j3335K791o008O952J7040J1812J8402l3995l1542j0907J7580
13044B5166K3222l4919J8300o329k5750l9601Q243J2541l1893J3750N2082J946
13032A6758R337k4501l681L3396n527L1267J9778l6741J4124j8647n3281P263
$$ plain form
13020 -10455 6417 -20602 -29419 -35639 -13929 5950 -8240 -13708 -58302 -73056 -41245 -1217
13008 -1217 -971 -13156 -4234 -29008 5459 21424 11471 1151 -37992 -56049 -19129 10773 5840
12995 5840 -9298 -35980 -31643 11721 80990 65836 58016 48650 24796 2856 17520 42961
12983 42961 59517 36509 -6924 -24713 -38427 10058 44475 49159 28668 24201 131 9423
12971 9423 13271 40115 34414 53401 49484 47782 59225 41173 27738 31077 28331 39127 75762
12958 75762 18981 -10399 -11631 2868 1727 13412 8651 1210 7289 31041 25715 -7157 -71712
12945 -71712 -61282 -32537 -49619 -74941 -42191 -27237 -21101 -28326 -35996 -11593 -1840 -9229 -15543
12932 -15543 -13184 -17634 8369 39096 30563 5248 30654 39484 -11382 12083 71207 113168
$$ packed form
13020a0455J6872k7019q817o220K1710J9879j4190n468m4594j4754L1811M0028
13008a217K46j2185Q922k4774L4467J5965r953j0320l9143j8057L6920K9902m933
12995E840j5138k6682M337M3364O9269j5154p820r366k3854k1940J4664K5441
12983D2961J6556k3008m3433j7789j3714M8485L4417M684k0491m467k4070R292
12971I423L848K6844n701J8987l917j702J1443j8052j3435L339k746J0796L6635
12958G5762n6781k9380j232J4499j141J1685m761p441O079K3752n326l2872o4555
12945g1712J0430K8745j7082k5322L2750J4954O136p225p670K4403R753p389o314
12932a5543K359m450K6003L0727q533k5315K5406Q830n0866K3465N9124M1961
$$ plain form
12920 113168 70440 34012 30752 12730 -34741 -85109 -73148 -35109 -46263 -41708 -64938 -32262
12908 -32262 -285 10896 62997 96022 92728 65591 50585 72279 78755 80656 74689 61949
12896 61949 53966 29902 13545 33573 27981 39443 37350 30275 31054 44948 30652 8700 12949
12883 12949 34895 81406 92278 58699 39990 52893 54051 49692 87120 95480 64446 40232
12871 40232 14635 -1845 17511 11652 -24455 -4166 4500 25283 51717 41353 48045 12537
12859 12537 20773 -3631 4750 19456 -33812 -49473 -8786 10453 28805 12169 41952 69514
12847 69514 106795 130775 95080 37108 9800 13850 12658 -10854 3425 59283 87461 39886
12835 39886 2270 23703 51528 21380 34845 -959 -38446 -30185 9258 33639 11427 2723
$$ packed form
12920A13168m2728l6428l260j8022m7471n0368J1961L8039j1154M555k3230L2676
12908c2262L1977J1181N2101L3025l294k7137j5006K1694O476J901n967j2740
12896F1949p983k4064j6357K0028n592J1462k093p075P79J3894j4296k1952M249
12883A2949K1946M6511J0872l3579j8709J2903J158m359L7428Q360l1034k4214
12871D0232k5597j6480J9356n859l6107K0289Q666K0783K6434j0364O692l5508
12859A2537Q236k4404Q381J4706n3268j5661M0687J9239J8352j6636K9783K7562
12847F9514L7281K3980l5695n7972k7308M050j192k3512J4279N5858K8178m7575
12835C9886l7616K1433K7825l0148J3465l5804l7487Q261L9443K4381k2212q704
$$ plain form
12823 2723 21193 39322 59793 42523 20036 21379 18408 15984 71236 96421 61435 29710
12811 29710 72350 56148 50683 39185 48104 85609 100931 80495 85693 55455 79609 93183
12799 93183 35318 42085 85578 110106 135221 126827 86495 76216 69727 70438 22630 5513 22666
12786 22666 29991 43792 85767 70899 27385 9585 50103 65319 69822 61240 19260 3615
12774 3615 12632 40960 24250 -3049 -22677 -6085 -12588 -21414 -19963 6080 9622 46176 63430
12761 63430 85110 119095 129321 107447 76952 64083 39245 57556 58498 22046 9541 33762
12749 33762 22171 15604 55637 88855 107516 69065 62444 53009 43103 24753 16184 35122 55866
12736 55866 93403 107251 101691 70628 45123 2721 -13162 -5712 -41081 3368 48462 67735
$$ packed form
12823B723J8470J8129K0471j7270k2487J343k971k424N5252K5185l4986l1725
12811B9710M2640j6202n465j1498Q919L7505J5322k0436N198l0238K4154J3574
12799I3183n7865O767M3493K4528K5115q394m0332j0279o489P11m7808j7117J7153
12786B2666P325J3801M1975j4868m3514j7800M0518J5216M503q582m1980j5645
12774C615R017K8328j6710k7299j9628J6592o503q826J451K6043L542L6554J7254
12761F3430K1680L3985J0226k1874l0495j2869k4838J8311R42l6452j2505K4221
12749C3762j1591o567M0033L3218J8661l8451o621r435r906j8350q569J8938K0744
12736E5866L7537J3848n560l1063k5505m2402j5883P450l5369M4449M5094J9273
$$ plain form
12724 67735 107188 123410 93516 46382 46698 68645 83126 87812 86997 74365 75106 86221 97285
12711 97285 81381 71931 78049 77395 93974 81046 61396 35015 85635 150609 141891 93180 64573
12698 64573 92769 103685 104401 75819 51239 29446 26068 -5339 9414 52218 35125 67300
12686 67300 80692 95370 117266 129642 94420 49564 55908 52563 100588 91659 112385 103863
12674 103863 87161 80983 98267 125959 102786 104708 97583 89007 79759 44290 49958 99454 77155
12661 77155 39730 46503 62526 88640 102011 115237 106657 118863 124468 108735 116543 99132
12649 99132 74116 61677 49332 18074 -4684 4154 48531 54713 65536 101048 100820 94830 82287
12636 82287 57639 13376 -5429 18093 42981 9279 11475 57720 52486 34470 80502 156213
$$ packed form
12724F7735L9453J6222k9894m7134L16K1947J4481M686q15j2632P41J1115J1064
12711I7285j5904r450O118o54J6579j2928j9650k6381N0620O4974q718m8711k8607
12698F4573K8196J0916P16k8582k4580k1793l378l1407J4753M2804j7093L2175
12686F7300J3392J4678K1896J2376l5222m4856O344l345M8025q929K0726q522
12674A03863j6702o178J7284K7692k3173J922p125q576r248l5469N668M9496k2299
12661G7155l7425O773J6023K6114J3371J3226q580J2206N605j5733P808j7411
12649I9132k5016j2439j2345l1258k2758Q838M4377O182J0823L5512k28n990j2543
12636H2287k4648m4263j8805K3522K4888l3702K196M6245n234j8016M6032P5711
$$ plain form
12624 156213 166759 146426 142522 108270 99067 109835 101245 100492 113618 121740 138040 131879 125275
12611 125275 98323 113066 81718 74467 93257 90954 127174 164757 155424 148550 141934 114382
12599 114382 119716 118944 130804 138226 123512 120563 124181 136260 147139 115065 100373 118323 153776
12586 153776 216831 188925 143541 133715 120112 107296 131026 159224 162866 181319 200547 197776
12574 197776 150006 146979 178971 163521 145922 104812 81109 86073 125243 117745 116168 144615
12562 144615 131631 168660 158884 144396 150699 137051 124868 101806 91676 76150 101681 140982
12550 140982 214667 230683 188184 151524 109133 82323 109905 133137 99888 117146 150176
12539 150176 169977 181240 157280 139006 118263 79567 89322 123844 138454 148608 193559 195050
$$ packed form
12624A56213J0546k0333l904l4252r203J0768q590p53J3126Q122J6300o161o604
12611A25275k6952J4743l1348p251J8790k303L6220L7583r333o874o616k7552
12599A14382N334p72J1860P422j4714k949L618J2079J0879l2074j4692J7950L5453
12586A53776O3055k7906m5384r826j3603j2816K3730K8198L642J8453J9228k771
12574A97776m7770l027L1992j5450j7599m1110k3703M964L9170p498j577K8447
12562A44615j2984L7029r776j4488O303j3648j2183k3062j0130j5526K5531L9301
12550A40982P3685J6016m2499l6660m2391k6810K7582K3232l3249J7258L3030
12539A50176J9801J1263k3960j8274k0743l8696R755L4522J4610J0154M4951J491
$$ plain form
12527 195050 160450 143864 169178 194149 180002 193225 248684 238198 225025 201539 184351
12516 184351 167425 169527 159468 155632 152498 141064 132627 126483 116492 116321 124597 136339 155554
12503 155554 186966 224342 201988 171964 133815 85473 92312 127251 142856 178780 201037 202119
12491 202119 166580 180382 150421 133329 159716 169774 136937 163967 167551 159908 167349 133288
12479 133288 105462 110870 169497 202537 203256 182361 186023 207296 177678 178799 189907 168755
12467 168755 139031 120920 109980 93675 133754 190218 224218 210685 177105 166040 158291 169240
12455 169240 142938 111354 106147 116964 137558 170601 166809 131154 119567 183655 201017 178666
12443 178666 158580 170457 209539 230471 198913 197175 189161 182508 182251 219973 280177 271697 239341
$$ packed form
12527A95050l4600j6586K5314K4971j4147J3223N5459j0486j3173k3486j7188
12516A84351j6926K102j0059l836l134j1434q437o144r991j71Q276J1742J9215
12503A55554L1412L7376k2354l0024l8149m8342O839L4939J5605L5924K2257J082
12491B02119l5539J3802k9961j7092K6387J0058l2837K7030L584p643P441l4061
12479A33288k7826N408N8627L3040P19k0895L662K1273k9618J121J1108k1152
12467A68755k9724j8111j0940j6305M0079N6464L4000j3533l3580j1065p749J0949
12455A69240k6302l1584n207J0817K0594L3043l792l5655j1587O4088J7362k2351
12443A78666k0086J1877L9082K0932l1558j738q014o653k57L7722O0204q480l2356
$$ plain form
12430 239341 243365 225422 220292 227591 225170 240819 204554 206910 252929 280739 295087 290307 258060
12417 258060 225158 233054 255863 274760 253374 243391 231989 231949 236721 209696 211652 210584 239743
12404 239743 257138 237483 236711 261670 289117 292288 279567 320996 343384 308711 283761 275375
12392 275375 303813 281757 230824 194205 214345 244891 265128 239843 235017 227188 222990 204441
12380 204441 249453 269982 313464 334025 373082 383470 337267 298109 300374 280142 294033 294782
12368 294782 313763 291628 266206 279483 326362 318759 275447 258263 220314 207246 256126 273171
12356 273171 280370 270601 296884 306456 300034 307465 333749 392521 393779 355715 333181 309963 297767
12343 297767 270178 250678 263369 317935 307445 306197 305291 313333 341659 407042 411035 381724
$$ packed form
12430B39341M024j7943n130P299k421J5649l6265K356M6019K7810J4348m780l2247
12417B58060l2902P896K2809J8897k1386r983j1402m0M772k7025J956j068K9159
12404B39743J7395j9655p72K4959K7447L171j2721M1429K2388l4673k4950q386
12392B75375K8438k2056n0933l6619K0140L0546K0237k5285m826p829m198j8549
12380B04441M5012K0529M3482K0561L9057J0388m6203l9158K265k0232J3891P49
12368B94782J8981k2135k5422J3277M6879p603m3312j7184l7949j3068M8880J7045
12356B73171P199r769K6283R572o422P431K6284N8772J258l8064k2534k3218j2196
12343B97767k7589j9500J2691N4566j0490j248r06Q042K8326O5383L993k9311
$$ plain form
12331 381724 383022 380362 356615 342206 370760 373901 353446 358284 368676 363402 341481 360417
12319 360417 392539 415451 411382 403032 419215 458054 452127 416049 406738 402588 369462 375157 357529
12306 357529 345764 419327 489224 500888 474841 432888 418891 416760 404987 403692 450712 486838
12294 486838 462143 421233 432172 488419 520825 498867 483073 452705 444222 457344 446844 431872
12282 431872 419470 452803 477668 464206 493143 519022 487193 445552 431862 431028 414828 459930
12270 459930 462538 439127 412378 420689 473343 509490 486315 476278 511197 511544 547273 600211
12258 600211 593212 562408 554546 530251 593898 640075 636130 606692 631620 649365 643008 649419
12246 649419 629217 609094 581978 589551 605299 611525 627207 654793 640559 658956 679888 685286
$$ packed form
12331C81724J298k660k3747j4409K8554L141k0455M838J0392n274k1921J8936
12319C60417L2122K2912m069q350J6183L8839n927l6078r311m150l3126N695j7628
12306C57529j1765P3563O9897J1664k6047m1953j3997k131j1773j295M7020L6126
12294D86838k4695m0910J0939N6247L2406k1958j5794l0368q483J3122j0500j4972
12282D31872j2402L3333K4865j3462K8937K5879l1829m1641j3690q34j6200M5102
12270D59930K608k3411k6749Q311N2654L6147k3175j0037L4919L47L5729N2938
12258F00211o999l0804p862k4295O3647M6177l945k9438K4928J7745o357O411
12246F49419k0202k0123k7116P573J5748O226J5682K7586j4234J8397K0932N398
$$ plain form
12234 685286 674851 672050 701251 744053 767109 746421 719104 718455 740711 745879 769157 735046
12222 735046 732160 727150 692889 743321 742364 704949 707513 762258 744429 745739 772910 809249 813648
12209 813648 825164 852688 861574 862138 834503 885723 863277 855406 835800 870478 869212 847450
12197 847450 877358 904695 904654 921957 907902 883616 880617 908814 946993 989405 1018687 1005644
12185 1005644 1028357 1026970 1015115 996684 983604 956962 1035591 1049488 1051743 1077875 1094499 1083047
12173 1083047 1080696 1103127 1117516 1102363 1103407 1134242 1169534 1204909 1214521 1248921 1248810 1179975
12161 1179975 1153342 1184843 1222093 1238665 1271502 1303903 1343346 1385791 1398085 1379949 1369067
12150 1369067 1301757 1267207 1293825 1275182 1271363 1340284 1413837 1447967 1449772 1423404 1432099 1441628
$$ packed form
12234F85286j0435k801K9201M2802K3056k0688k7317o49K2256N168K3278l4111
12222G35046k886n010l4261N0432r57l7415K564N4745j7829J310K7171L6339M399
12209H13648J1516K7524Q886N64k7635N1220k2446p871j9606L4678j266k1762
12197H47450K9908K7337m1J7303j4055k4286k999K8197L8179M2412K9282j3043
12185A005644K2713j387j1855j8431j3080k6642P8629J3897K255K6132J6624j1452
12173A083047k351K2431J4389j5153J044L0835L5292L5375R612L4400j11o8835
12161A179975k6633L1501L7250J6572L2837L2401L9443M2445J2294j8136j0882
12150A369067o7310l4550K6618j8643l819O8921P3553L4130J805k6368Q695R529
$$ plain form
12138 1441628 1477744 1503629 1529282 1568885 1611661 1612703 1618414 1635537 1631439 1623338 1605340 1661883
12126 1661883 1705629 1749822 1785197 1790160 1763766 1744232 1766666 1784115 1838711 1884369 1900074
12115 1900074 1906375 1925869 1951394 1964937 1992079 2023434 2051335 2113125 2129801 2131844 2176358 2227632
12103 2227632 2235178 2225016 2238112 2216099 2273802 2340272 2408620 2468548 2524448 2545869 2560350
12092 2560350 2584554 2611316 2642822 2668411 2684110 2731235 2775762 2810759 2806544 2804807 2860426 2917230
12080 2917230 2948649 2970994 3031641 3090184 3181175 3261272 3285961 3322641 3337980 3372520 3410480
12069 3410480 3423281 3470825 3555356 3604588 3643728 3695925 3708421 3787854 3884045 3945343 4010527
12058 4010527 4045849 4095133 4186360 4279348 4337550 4380792 4463895 4541266 4579463 4654692 4747685
$$ packed form
12138A441628L6116K5885K5653L9603M2776J042N711J7123m098q101j7998N6543
12126A661883M3746M4193L5375M963k6394j9534K2434J7449N4596M5658J5705
12115A900074O301J9494K5525J3543K7142L1355K7901O1790J6676K043M4514N1274
12103B227632P546j0162J3096k2013N7703O6470O8348N9928N5900K1421J4481
12092B560350K4204K6762L1506K5589J5699M7125M4527L4997m215j737N5619N6804
12080B917230L1419K2345O0647N8543R0991Q0097K4689L6680J5339L4540L7960
12069C410480J2801M7544Q4531M9232L9140N2197J2496P9433R6191O1298O5184
12058D010527L5322M9284R1227R2988N8202M3242Q3103P7371L8197P5229R2993
$$ plain form
12047 4747685 4849948 4937795 5020795 5115666 5176695 5247498 5328575 5443452 5556204 5651262 5726512
12036 5726512 5817416 5938723 6065145 6183593 6298649 6410455 6496130 6598018 6707367 6826486
12026 6826486 6932053 7098333 7273425 7416308 7524276 7649848 7820597 7956351 8117035
12017 8117035 8281508 8402003 8568576 8716137 8882936 9063482 9244311 9433670 9625595
12008 9625595 9812335 9985291 10175806 10389330 10629861 10840514 11000326 11202926 11425216
11999 11425216 11655707 11881000 12094226 12322233 12603080 12883730 13129549 13416129 13713775
11990 13713775 13932621 14162636 14435748 14740086 15053364 15297226 15594549 15911680 16249391
11981 16249391 16545022 16804255 17103789 17406653 17698432 17984120 18268746 18549865 18835023
$$ packed form
12047D747685J02263Q7847Q3000R4871O1029P0803Q1077J14877J12752R5058P5250
12036E726512R0904J21307J26422J18448J15056J11806Q5675J01888J09349J19119
12026F826486J05567J66280J75092J42883J07968J25572J70749J35754J60684
12017H117035J64473J20495J66573J47561J66799J80546J80829J89359J91925
12008I625595J86740J72956J90515K13524K40531K10653J59812K02600K22290
11999A1425216K30491K25293K13226K28007K80847K80650K45819K86580K97646
11990A3713775K18846K30015K73112L04338L13278K43862K97323L17131L37711
11981A6249391K95631K59233K99534L02864K91779K85688K84626K81119K85158
$$ plain form
11972 18835023 19111201 19393806 19694562 19989630 20239526 20504568 20784092 21007188 21260689
11963 21260689 21557430 21771001 21976703 22175338 22357494 22552783 22705095 22832791 22946467
11954 22946467 23069493 23153483 23220457 23288683 23372371 23395950 23435240 23437205 23410429 23344992 23261173
11943 23261173 23149314 23047230 22988451 22923734 22806116 22608257 22418740 22231152 22015597 21809804
11933 21809804 21627273 21402471 21185467 20936252 20651994 20389552 20141772 19893746 19581734
11924 19581734 19305953 19048311 18783788 18501294 18211906 17927384 17600477 17311259 17027680
11915 17027680 16726393 16466073 16214525 15964173 15653518 15336857 15000073 14728204 14473164
11906 14473164 14195457 13916918 13650201 13375861 13122765 12870172 12638284 12411045 12172487
$$ packed form
11972A8835023K76178K82605L00756K95068K49896K65042K79524K23096K53501
11963B1260689K96741K13571K05702J98635J82156J95289J52312J27696J13676
11954B2946467J23026Q3990O6974O8226Q3688K3579L9290J965k6776o5437q3819
11943B3261173j11859j02084n8779o4717j17618j97859j89517j87588k15555k05793
11933B1809804j82531k24802k17004k49215k84258k62442k47780k48026l12012
11924A9581734k75781k57642k64523k82494k89388k84522l26907k89218k83579
11915A7027680l01287k60320k51548k50352l10655l16661l36784k71869k55040
11906A4473164k77707k78539k66717k74340k53096k52593k31888k27239k38558
$$ plain form
11897 12172487 11969995 11741660 11562365 11357905 11129621 10890434 10688155 10463293 10242584
11888 10242584 10048015 9894787 9723869 9497147 9291595 9115046 8935985 8763951 8611455
11879 8611455 8480203 8369564 8209588 8063645 7921540 7762079 7628076 7495882 7376669
11870 7376669 7252624 7113845 7022200 6911441 6805642 6667826 6513253 6388049 6281354 6202167
11860 6202167 6105665 5991784 5880933 5822837 5706512 5610135 5505764 5419714 5387185 5290309
11850 5290309 5177445 5059378 4964635 4913001 4862472 4756535 4676585 4591808 4545824 4494059 4380027
11839 4380027 4339494 4331717 4272426 4187730 4095371 4026459 4016787 3978388 3934715 3841774 3741420
11828 3741420 3713050 3680727 3647331 3610975 3537886 3494961 3425436 3385658 3364847 3329281 3244702
$$ packed form
11897A2172487k02492k28335j79295k04460k28284k39187k02279k24862k20709
11888A0242584j94569j53228j70918k26722k05552j76549j79061j72034j52496
11879H611455j31252j10639j59976j45943j42105j59461j34003j32194j19213
11870G376669j24045j38779r1645j10759j05799j37816j54573j25204j06695p9187
11860F202167r6502j13881j10851n8096j16325r6377j04371q6050l2529r6876
11850E290309j12864j18067r4743n1634n0529j05937p9950q4777m5984n1765j14032
11839D380027m0533p777n9291q4696r2359o8912r672l8399m3673r2941j00354
11828C741420k8370l2323l3396l6356p3089m2925o9525l9778k0811l5566q4579
$$ plain form
11817 3244702 3176640 3142603 3094667 3033812 2999035 2964836 2920686 2905308 2890954 2910225 2898053
11806 2898053 2869570 2776221 2719859 2700416 2716324 2671648 2590883 2541211 2535250 2564344 2532472
11795 2532472 2459636 2408983 2381347 2392629 2370227 2301769 2247518 2213370 2194509 2150285 2153741
11784 2153741 2173047 2124167 2107243 2062420 2031329 2065947 2045771 2038807 2048284 2031695 1984175 1925005
11772 1925005 1852915 1825191 1843262 1847825 1858119 1836176 1813263 1795509 1786204 1734967 1686979 1656856
11760 1656856 1666724 1673926 1663463 1622622 1603604 1606515 1582132 1560185 1527728 1502255 1517627 1523466
11748 1523466 1506474 1481803 1430692 1437559 1430683 1424455 1408376 1372183 1365986 1324766 1320681 1322136
11736 1322136 1285133 1273446 1256026 1309113 1315793 1295083 1276705 1253588 1253230 1237707 1220749 1206845
$$ packed form
11817C244702o8062l4037m7936o0855l4777l4199m4150j5378j4354J9271j2172
11806B898053k8483r3349n6362j9443J5908m4676q0765m9672n961K9094l1872
11795B532472p2836n0653k7636J1282k2402o8458n4251l4148j8861m4224L456
11784B153741J9306m8880j6924m4823l1091L4618k0176o964R477j6589m7520n9170
11772A925005p2090k7724J8071M563J0294k1943k2913j7754r305n1237m7988l0123
11760A656856R868P202j0463m0841j9018K911k4383k1947l2457k5473J5372N839
11748A523466j6992k4671n1111O867o876o228j6079l6193o197m1220m085J455
11736A322136l7003j1687j7420N3087O680k0710j8378k3117l58j5523j6958j3904
$$ plain form
11724 1206845 1203296 1228470 1235001 1152974 1117703 1142282 1169217 1154528 1134067 1108387 1062150 1033887
11712 1033887 1044267 1075513 1105907 1119140 1082729 1049869 1048015 1058321 1069738 1085423 1050267
11701 1050267 1011218 1056880 1054384 1038742 1039736 995459 933879 920160 919721 953290 979879 954165
11689 954165 929464 933515 956214 1002545 1016227 944313 932781 929967 926684 911006 863451 845338
11677 845338 833904 809146 792426 813519 869686 865378 830325 762299 713697 733986 761177 726007
11665 726007 707068 695317 736072 733778 719740 697436 702523 692493 689252 695169 697301 681483
11653 681483 680921 683217 692635 651655 638487 630148 629343 674861 705103 696868 686107 690681 680574
11640 680574 660749 652103 619129 610598 592429 574128 602608 657794 682374 666683 640285 626796
$$ packed form
11724A206845l549K5174O531q2027l5271K4579K6935j4689k0461k5680m6237k8263
11712A033887J0380L1246L0394J3233l6411l2860j854J0306J1417J5685l5156
11701A050267l9049M5662k496j5642R94m4277o1580j3719m39L3569K6589k5714
11689I54165k4701M051K2699M6331J3682p1914j1532k814l283j5678m7555j8113
11677H45338j1434k4758j6720K1093N6167m308l5053o8026m8602K0289K7191l5170
11665G26007j8939j1751M0755k294j4038k2304N087j0030l241N917K132j5818
11653F81483n62K296R418m0980j3168q339q05M5518L0242q235j0761M574j0107
11640F80574j9825q646l2974q531j8169j8301K8480N5186K4580j5691k6398j3489
$$ plain form
11628 626796 593944 596235 589892 625881 637161 599574 570331 592696 625102 636961 607148 584444
11616 584444 577711 593397 594606 591279 574986 544811 515706 520301 566075 566710 550929 534821 554547
11603 554547 511523 518330 527849 523502 556996 531008 516607 518713 496932 463203 449011 468320
11591 468320 498571 487856 441223 404891 411244 438667 456819 466387 464818 450670 406706 404765
11579 404765 438697 454849 483548 499597 486171 468447 443775 449739 434415 421482 423853 422917
11567 422917 418279 440957 445798 405528 383386 371614 391951 434745 438756 401436 419500 411585
11555 411585 426252 412532 393835 370623 413627 470183 439437 403085 355505 375124 363484
11544 363484 364149 365782 356635 382348 403869 366138 384245 377589 351548 350600 325273 347474 371055
$$ packed form
11628F26796l2852K291o343L5989J1280l7587k9243K2365L2406J1859k9813k2704
11616E84444o733J5686J209l327j6293l0175k9105M595M5774O35j5781j6108J9726
11603E54547m3024O807R519m347L3494k5988j4401K106k1781l3729j4192J9309
11591D68320L0251j0715m6633l6332O353K7423J8152R568j569j4148m3964j941
11579D04765L3932J6152K8699J6049j3426j7724k4672N964j5324j2933K371r36
11567D22917m638K2678M841m0270k2142j1772K0337M2794M011l7320J8064p915
11555D11585J4667j3720j8697k3212M3004N6556l0746l6352m7580J9619j1640
11544C63484O65J633r147K5713K1521l7731J8107o656k6041r48k5327K2201K3581
$$ plain form
11531 371055 381237 333345 284115 305344 317451 350109 333249 287100 299775 313443 344971
11520 344971 332180 285584 266268 234416 201619 232046 284262 339960 362601 337498 320186
11509 320186 350911 348469 336131 347013 304596 284359 294746 284029 289108 270306 256103 283016
11497 283016 335662 362869 361015 369561 356973 339143 316167 334936 327389 292185 288863 288205 285555
11484 285555 238368 269815 290667 255050 250266 254777 241661 263990 236167 233283 250832 272166
11472 272166 295969 315627 316937 290505 307466 301970 293423 303743 292311 299669 294608 267288
11460 267288 259999 264785 255862 217082 248313 233681 239589 238006 237599 243738 238434 215434 218169
11447 218169 205539 179892 158191 153569 164308 185105 184222 186990 193057 223395 217979 237818 224539
$$ packed form
11531C71055J0182m7892m9230K1229J2107L2658j6860m6149J2675J3668L1528
11520C44971j2791m6596j9316l1852l2797L0427N2216N5698K2641k5103j7312
11509C20186L0725k442j2338J0882m2417k0237J0387j0717N079j8802j4203K6913
11497B83016N2646K7207j854Q546j2588j7830k2976J8769p547l5204l322o58k650
11484B85555m7187L1447K0852l5617m784M511j3116K2329k7823k884J7549K1334
11472B72166K3803J9658J310k6432J6961n496q547J0320j1432P358n061k7320
11460B67288p289M786q923l8780L1231j4632N908j583m07O139n304k3000K735
11447B18169j2630k5647k1701m622J0739K0797q83K768O067L0338n416J9839j3279
$$ plain form
11434 224539 224281 219300 192841 264921 303932 269355 240218 224181 203037 193020 200598 208473
11422 208473 199595 191888 196594 216615 225187 244781 193817 196254 188012 194401 224749 225636 219113
11409 219113 213217 178389 191304 227041 230920 238733 195817 148250 149240 199921 178218 159988
11397 159988 154702 141245 179868 183719 190093 216425 230248 225119 201548 153543 134722 103632
11385 103632 119768 140956 155098 153409 164648 166192 137437 140428 159454 195403 219733 194046
11373 194046 174974 192901 211055 241990 234412 188081 166867 191242 200785 158205 122252 140064
11361 140064 138709 151126 148359 154507 105654 88811 100764 176473 189492 179704 223539 216209
11349 216209 166721 111151 63304 49321 85615 47886 37529 53929 89628 132764 106197
$$ packed form
11434B24539k58m981k6459P2080L9011l4577k9137j6037k1144j0017P578P875
11422B08473q878p707M706K0021Q572J9594n0964K437q242O389L0348Q87o523
11409B19113n896l4828J2915L5737L879P813m2916m7567R90N0681k1703j8230
11397A59988n286j3457L8623L851O374K6332J3823n129k3571m8005j8821l1090
11385A03632J6136K1188J4142j689J1239J544k8755K991J9026L5949K4330k5687
11373A94046j9072J7927J8154L0935p578m6331k1214K4375R543m2580l5953J7812
11361A40064j355J2417k767O148m8853j6843J1953P5709J3019r788M3835p330
11349B16209m9488n5570m7847j3983L6294l7729j0357J6400L5699M3136k6567
$$ plain form
11338 106197 104033 102486 129165 167240 142890 113112 112175 111224 105301 102835 175766 135603 102621
11325 102621 147608 143374 119812 147535 178856 172477 145756 98136 58972 50598 96185 121688
11313 121688 94144 85196 119574 160078 147787 127566 157836 153647 173123 184559 163953 138676
11301 138676 97628 98980 119015 91860 106508 86532 108165 118217 140304 169490 182123 120710
11289 120710 115324 79126 96879 103305 88397 42699 75181 68575 61473 88467 126343 130935
11277 130935 65623 102089 111525 118337 118170 102999 92810 76544 122949 118201 65138 91368
11265 91368 120730 109559 79973 65856 69508 72790 102378 130429 152176 140137 108444 101344
11253 101344 65512 68676 47914 56077 86706 105469 105527 76160 49376 19138 58523 39235
$$ packed form
11338A06197k164j547K6679L8075k4350k9778r37r51n923k466P2931m0163l2982
11325A02621M4987m234k3562K7723L1321o379k6721m7620l9164q374M5587K5503
11313A21688k7544q948L4378M0504j2291k0221L0270m189J9476J1436k0606k5277
11301A38676m1048J352K0035k7155J4648j9976K1633J0052K2087K9186J2633o1413
11289A20710n386l6198J7753O426j4908m5698L2482o606p102K6994L7876M592
11277A30935o5312L6466R436O812j67j5171j0189j6266M6405m748n3063K6230
11265I1368K9362j1171k9586j4117L652L282K9588K8051K1747j2039l1693p100
11253A01344l5832L164k0762Q163L0629J8763N8k9367k6784l0238L9385j9288
$$ plain form
11241 39235 35937 49199 62940 77499 84866 59303 52486 76939 53828 61054 74715 82972 82524
11228 82524 92394 92294 69601 88721 86289 79506 51382 31275 34392 52322 69416 53814 55298
11215 55298 97857 129328 112042 83667 90339 85578 73332 72381 90819 55997 43936 21487
11203 21487 34056 96548 100255 88786 111358 151536 117256 65614 39751 43533 43598 49616 82630
11190 82630 95747 101113 102237 84982 56100 72898 52684 63028 50727 71442 79560 76888
11178 76888 65224 10091 14810 35834 46919 59410 31119 15323 41304 27621 27187 29181
11166 29181 33198 32100 -16711 -20734 27544 19351 26594 44557 19477 49509 53946 49735 77658
11153 77658 115371 135550 100913 66490 36588 54518 101586 66489 50169 71093 108765 137404
$$ packed form
11241C9235l298J3262J3741J4559P367k5563o817K4453k3111P226J3661Q257m48
11228H2524R870j00k2693J9120k432o783k8124k0107L117J7930J7094j5602J484
11215E5298M2559L1471j7286k8375O672m761j2246r51J8438l4822j2061k2449
11203B1487J2569O2492L707j1469K2572M0178l4280n1642k5863L782O5O018L3014
11190H2630J3117N366J124j7255k8882J6798k0214J0344j2301K0715Q118k672
11178G6888j1664n5133M719K1024J1085J2491k8291j5796K5981j3683m34J994
11166B9181M017j098m8811m023M8278q193P243J7963k5080L0032M437m211K7923
11153G7658L7713K0179l4637l4423k9902J7930M7068l5097j6320K0924L7672K8639
$$ plain form
11141 137404 183823 182702 117443 101165 90266 69033 93256 102950 100893 76163 93052 85405
11129 85405 49543 9563 38548 89831 82670 87912 75401 50512 46246 69650 66211 95931
11117 95931 118241 87264 33258 24146 -6217 9052 27191 36380 34203 -7282 -21466 -18519
11105 -18519 -33470 28501 74694 79834 64165 28040 51533 79528 52254 59457 53370 76695
11093 76695 66165 66905 57985 63727 93921 92358 66779 72347 98876 86150 86746 101146 98143
11080 98143 55196 25189 43935 32855 9357 40433 85405 54246 49358 16125 15734 3918
11068 3918 24520 19623 25965 52288 26678 32097 16947 34211 24325 9843 11048 -5668 -863
11055 -863 -7140 17729 28528 28625 60259 76802 63937 94484 90200 83707 43118 42620 72293 46376
$$ packed form
11141A37404M6419j121o5259j6278j0899k1233K4223R694k057k4730J6889p647
11129H5405l5862l9980K8985N1283p161N242j2511k4889m266K3404l439K9720
11117I5931K2310l0977n4006r112l0363J5269J8139R189k177m1485j4184K947
11105a8519j4951O1971M6193N140j5669l6125K3493K7995k7274P203o087K3325
11093G6695j0530P40q920N742L0194j563k5579N568K6529j2726N96J4400l003
11080I8143m2947l0007J8746j1080k3498L1076M4972l1159m888l3233l91j1816
11068C918K0602m897O342K6323k5610N419j5150J7264r886j4482J205j6716M805
11055h63o277K4869J0799R7L1634J6543j2865L0547m284o493m0589m98K9673k5917
$$ plain form
11041 46376 46131 75212 99390 84569 162154 232262 225840 196714 142457 150825 201031 255253
11029 255253 259877 244663 280684 358195 414020 429120 405288 428502 452619 471562 493767 570633
11017 570633 698799 877945 1085060 1306034 1532262 1748291 1970069 2186212 2147409 1871477
11007 1871477 1544244 1241953 1067000 916657 836932 785830 717752 619381 542996 443268
10997 443268 369413 347660 317235 261755 273936 326587 328066 314994 257796 166881 133658 128402
10985 128402 111677 114972 117755 127121 123376 125210 163793 134140 75387 7659 -21700 21970
10973 21970 49999 46368 31008 43858 59249 60068 45394 51270 44855 33681 31412 20358 26771
10960 26771 45550 75666 71666 55551 24383 17471 -470 -19328 -31235 -18713 -19674 -19425 4596
$$ packed form
11041D6376k45K9081K4178j4821P7585P0108o422k9126n4257Q368N0206N4222
11029B55253M624j5214L6021P7511N5825J5100k3832K3214K4117J8943K2205P6866
11017E70633J28166J79146K07115K20974K26228K16029K21778K16143l8803k75932
11007A871477l27233l02291j74953j50343p9725n1102o8078r8371p6385r9728
10997D43268p3855k1753l0425n5480J2181N2651J479j3072n7198r0915l3223n256
10985A28402j6725L295K783R366l745J834L8583k9653n8753o7728k9359M3670
10973B1970K8029l631j5360J2850J5391Q19j4674N876o415j1174k269j1054O413
10960B6771J8779L0116m000j6115l1168o912j7941j8858j1907J2522r61K49K4021
$$ plain form
10947 4596 48188 51445 -3624 -40453 -24588 11108 9669 -19931 -29099 -35435 -50981 -34299 -19468
10934 -19468 -10727 -11305 -13660 -29734 -83933 -105178 -66852 -58059 -52936 -72495 -92283 -102930 -92485
10921 -92485 -120163 -100822 -85027 -38987 -16133 -1837 -3018 -239 32861 58845 67008 49532
10909 49532 74254 85593 49094 20539 13217 29270 61214 67006 47266 52307 59394 9064
10897 9064 -7615 -20003 -51938 -49051 -8346 4679 7731 29136 75327 94148 56508 41219
10885 41219 35648 31721 39388 39443 27737 37786 41461 40181 28265 12170 -12664 -11494 5515
10872 5515 10173 20700 48240 40839 54989 65700 43301 75489 130071 132610 133977 162274 199031
10859 199031 188828 136593 105496 125482 74187 47149 64686 89232 69038 81034 63081
$$ packed form
10947D596M3592L257n5069l6829J5865L5696j439k9600r168o336j5546J6682J4831
10934a9468Q741n78k355j6074n4199k1245L8326Q793N123j9559j9788j0647J0445
10921i2485k7678J9341J5795M6040K2854J4296j181K779L3100K5984Q163j7476
10909D9532K4722J1339l6499k8555p322J6053L1944N792j9740N041P087n0330
10897I064j6679j2388l1935K887M0705J3025L052K1405M6191J8821l7640j5289
10885D1219n571l927P667N5j1706J0049L675j280j1916j6095k4834J170J7009
10872E515M658J0527K7540p401J4150J0711k2399L2188N4582K539J367K8297L6757
10859A99031j0203n2235l1097J9986n1295k7038J7537K4546k0194J1996j7953
$$ plain form
10848 63081 35190 62539 40258 34267 34198 21366 25942 -13471 -46686 -14141 6423 20810 36003
10835 36003 9272 13676 36736 45339 88469 83232 111313 128558 111272 85450 71073 45377
10823 45377 33556 22324 54771 50246 56003 61298 50516 49556 48454 27917 30938 27769 17212
10810 17212 21593 34437 27935 30220 -4309 11106 9170 14629 12470 36417 112383 116784 96582
10797 96582 99961 47539 4505 1093 38984 41798 68153 55854 59968 73579 75808 46826 91196
10784 91196 110885 120273 98894 68739 77014 58725 39350 36454 12142 11837 -17307 -38443 -42971
10771 -42971 -47178 -85647 -85372 -70116 -47766 -40061 -31652 -51211 -99842 -128851 -125641 -106544 -60137
10758 -60137 -245 -13355 -25956 -27409 -19566 -21347 -41674 -26910 -1469 -19950 -37761 -10622
$$ packed form
10848F3081k7891K7349k2281n991o9j2832M576l9413l3215L2545K0564J4387J5193
10835C6003k6731M404K3060Q603M3130n237K8081J7245j7286k5822j4377k5696
10823D5377j1821j1232L2447m525N757N295j0782r60j102k0537L021l169j0557
10810A7212M381J2844o502K285l4529J5415j936N459k159K3947P5966M401k0202
10797I6582L379n2422m3034l412L7891K814K6355j2299M114J3611K229k8982M4370
10784I1196J9689R388k1379l0155Q275j8289j9375k896k4312l05k9144k1136m528
10771d2971m207l8469K75J5256K2350P705Q409j9559m8631k9009L210J9097M6407
10758f0137N9892j3110j2601j453P843j781k0327J4764K5441j8481j7811K7139
$$ plain form
10746 -10622 32459 56985 58736 30552 35157 109070 121763 96085 73970 106299 166512 216235
10734 216235 258944 298638 310301 308422 300305 272403 268179 272030 249372 228704 209445 184917
10722 184917 163312 155783 182435 206510 200894 192881 196148 225661 221650 221508 228947 218789 294049
10709 294049 340087 316497 307494 319256 311080 292486 275509 279377 300131 358298 332681 330382
10697 330382 342879 390494 451950 442469 508364 529508 462152 450225 467522 458480 447468 454213
10685 454213 494791 525016 536791 546753 582478 604304 562677 555866 618394 637433 616258 631169
10673 631169 653818 711656 750282 774809 788587 811587 813293 835134 869564 876927 942626 1058882
10661 1058882 1105418 1164461 1259464 1360159 1463101 1510400 1546710 1583859 1583257 1649678 1701982
$$ packed form
10746a0622M3081K4526J751k8184M605P3913J2693k5678k2115L2329O0213M9723
10734B16235M2709L9694J1663j879q117k7902m224L851k2658k0668j9259k4528
10722A84917k1605p529K6652K4075n616q013L267K9513m011j42P439j0158P5260
10709B94049M6038k3590r003J1762q176j8594j6977L868K0754N8167k5617k299
10697C30382J2497M7615O1456r481O5895K1144o7356j1927J7297r042j1012O745
10685D54213M0578L0225J1775R962L5725K1826m1627o811O2528J9039k1175J4911
10673F31169K2649N7838L8626K4527J3778K3000J706K1841L4430P363O5699J16256
10661A058882M6536N9043R5003J00695J02942M7299L6310L7149o02O6421N2304
$$ plain form
10650 1701982 1822362 1914926 2044673 2196001 2354555 2513149 2717130 2846534 3001168 3204687
10640 3204687 3413843 3648195 3937447 4307757 4677764 5050147 5487586 6052228 6731455
10631 6731455 7526852 8424633 9413130 10494341 11495695 12305730 13029119 14024297 15321593
10622 15321593 16989614 19079670 21690488 24951600 29030448 34213048 40783105 49369056
10614 49369056 60685776 75826300 96325787 124166477 161895928 211812706 273642243
10607 273642243 341411893 400645117 421817977 377778560 302017226 236492903 188713880
10600 188713880 155153675 132153604 116958651 107507677 101980036 97929912 92670452
10593 92670452 84845815 75829195 67780312 61830701 58240854 57043631 58281147 61907718
$$ packed form
10650A701982J20380R2564J29747J51328J58554J58594K03981J29404J54634K03519
10640C204687K09156K34352K89252L70310L70007L72383M37439N64642O79227
10631F731455P95397Q97781R88497J081211J001354Q10035P23389R95178J297296
10622A5321593J668021K090056K610818L261112M078848N182600O570057Q585951
10614D9369056J1316720J5140524K0499487K7840690L7729451M9916778O1829537
10607B73642243O7769650N9233224K1172860m4039417p5761334o5524323m7779023
10600A88713880l3560205k3000071j5194953r450974n527641m050124n259460
10593I2670452p824637r016620q048883n949611l589847j197223J237516L626571
$$ plain form
10585 61907718 67544384 73926945 78561147 78377958 72289058 63196515 54755997 48418277
10577 48418277 44379915 42594673 42765922 44694352 47876995 51276786 53124261 51472335
10569 51472335 46169710 39417933 33448054 29015833 26271031 24742175 24206147 24434121
10561 24434121 25140533 25755115 25555424 23935299 21057742 17790588 14785411 12351286
10553 12351286 10476474 9083638 8024811 7169561 6476297 5920839 5427830 4995086 4647332
10544 4647332 4361063 4080922 3856231 3679710 3458177 3266795 3070484 2915623 2775470
10535 2775470 2673274 2533883 2445770 2398211 2305985 2252167 2185522 2122832 1987632 1892134 1831334
10524 1831334 1785632 1746682 1696536 1713650 1688053 1631012 1596931 1526837 1458074 1389052 1340944
$$ packed form
10585F1907718N636666O382561M634202j83189o088900r092543q440518o337720
10577D8418277m038362j785242J71249J928430L182643L399791J847475j651926
10569E1472335n302625o751777n969879m432221k744802j528856n36028K27974
10561B4434121P06412O14582j99691j620125k877557l267154l005177k434125
10553A2351286j874812j392836j058827q55250o93264n55458m93009m32744l47754
10544D647332k86269k80141k24691j76521k21533j91382j96311j54861j40153
10535B775470j02196j39391q8113m7559r2226n3818o6645o2690j35200r5498o0800
10524A831334m5702l8950n0146J7114k5597n7041l4081p0094o8763o9022m8108
$$ plain form
10513 1340944 1270728 1194714 1182018 1223304 1242526 1193706 1206775 1192475 1187954 1187091 1145502 1100855
10501 1100855 1076979 1060419 1014056 978652 976415 924870 908199 885886 882967 900160 887812 894917
10489 894917 942642 909709 867013 809140 769544 764575 784830 827405 863026 890733 915663 903662
10477 903662 893404 859649 852983 864470 861309 833073 828910 824084 811103 836998 819241 771283
10465 771283 764309 789018 731710 740326 759401 768282 781285 758206 740659 736350 735009 745585
10453 745585 757183 747726 771076 798422 782515 749786 726546 745904 722967 687396 661567 654167
10441 654167 648069 652868 647481 667111 671522 665740 627176 607080 619750 648985 622582 559677
10429 559677 488266 480938 454931 488690 503884 511428 533854 513497 502853 493104 502317 476109
$$ packed form
10513A340944p0216p6014j2696M1286J9222m8820J3069j4300m521q63m1589m4647
10501A100855k3876j6560m6363l5404k237n1545j6671k2313k919J7193j2348P105
10489H94917M7725l2933m2696n7873l9596m969K0255M2575L5621K7707K4930j2001
10477I03662j0258l3755o666J1487l161k8236m163m826j2981K5895j7757m7958
10465G71283o974K4709n7308Q616J9075Q881J3003k3079j7547m309j341J0576
10453G45585J1598r457K3350K7346j5907l2729k3240J9358k2937l5571k5829p400
10441F54167o098M799n387J9630M411n782l8564k0096J2670K9235k6403o2905
10429E59677p1411p328k6007L3759J5194P544K2426k0357j0644r749R213k6208
$$ plain form
10417 476109 490447 486362 441567 410943 421564 421555 454300 475454 474062 496537 486961 491299 481757
10404 481757 448507 440150 440163 405568 391587 411807 415505 389468 356250 331077 302825 313774
10392 313774 329189 390035 387625 376946 372039 374836 385160 414353 432178 435097 415557 380416
10380 380416 378264 393090 409056 400302 386086 382784 361270 331696 393292 395642 364275 351816
10368 351816 330959 346061 340417 351670 360356 394143 394317 352400 306434 333157 381707 380744 409306
10355 409306 415326 413422 415826 375117 352036 343470 328390 326356 317763 304214 305918 301020 304978
10342 304978 312286 300035 300635 291275 313497 291980 310208 331146 344950 352943 341023 317964
10330 317964 297400 283475 270104 246742 257410 302499 320495 288437 234050 205064 237520
$$ packed form
10417D76109J4338m085m4795l0624J0621rL2745K1154j392K2475r576M338r542
10404D81757l3250q357J3l4595j3981K0220L698k6037l3218k5173k8252J0949
10392C13774J5415O0846k410j0679m907K797J0324K9193J7825K919j9540l5141
10380C80416k152J4826J5966q754j4216l302k1514k9574O1596K350l1367j2459
10368C51816k0857J5102n644J1253Q686L3787J74m1917m5966K6723M8550r63K8562
10355D09306O020j904K404m0709k3081q566j5080k034q593j3549J704m898L958
10342C04978P308j2251O00r360K2222k1517J8228K0938J3804P993j1920k3059
10330C17964k0564j3925j3371k3362J0668M5089J7996l2058n4387k8986L2456
$$ plain form
10319 237520 208788 196791 245679 305294 293951 273006 261847 236487 187617 199917 205882 200931
10307 200931 194557 136861 191368 216253 213572 186259 206037 176001 148893 133326 176610 176952
10295 176952 164975 165623 205384 269290 318734 306425 262983 237676 214449 182454 188382 229057
10283 229057 268622 311969 274398 233436 220282 210119 200926 166686 127512 118650 147338 183125
10271 183125 152487 166277 174794 199192 220710 211737 178924 157867 140273 174754 185078 175466
10259 175466 195662 196147 224396 197143 158136 170728 178768 201542 213073 204232 212910 220484 207813
10246 207813 153012 208041 216059 219317 229695 259240 242701 232664 213201 183013 182829 186159
10234 186159 175840 151082 156559 129999 137878 157236 140188 140450 157459 174542 189202 195920
$$ packed form
10319B37520k8732j1997M8888N9615j1343k0945j1159k5360m8870J2300N965m951
10307B00931o374n7696N4507K4885k681k7313J9778l0036k7108j5567M3284L42
10295A76952j1977O48L9761O3906M9444j2309m3442k5307k3227l1995N928M0675
10283B29057L9565M3347l7571m0962j3154j0163r193l4240l9174q862K8688L5787
10271A83125l0638J3790Q517K4398K1518q973l2813k1057j7594L4481J0324r612
10259A75466K0196M85K8249k7253l9007J2592Q040K2774J1531q841Q678P574j2671
10246B07813n4801N5029Q018L258J0378K9545j6539j0037j9463l0188j84L330
10234A86159j0319k4758N477k6560P879J9358j7048K62J7009J7083J4660O718
$$ plain form
10222 195920 232177 240283 249644 282024 325426 341840 321093 285915 284184 254095 227962 248684
10210 248684 255591 287343 329016 389897 499967 561002 582410 602098 678917 810848 1012629
10199 1012629 1237044 1493994 1781316 1995675 2065726 1916008 1621137 1352932 1096053 878593
10189 878593 742457 666027 629369 575927 510429 467154 383670 324686 275425 272822 273598 295794
10177 295794 282538 295761 310209 304542 306286 319617 385882 385000 313094 253943 236418 255911
10165 255911 296410 315646 330571 337187 378796 382770 388916 434569 408059 408484 344915 338871 374167
10152 374167 360290 404970 436924 480172 496272 524743 550552 516827 464298 426384 371406
10141 371406 317787 311476 322092 318017 321977 324306 356948 374056 364853 300402 258915 241924
$$ packed form
10222A95920L6257Q106R361L2380M3402J6414k0747l5178j731l0089k6133K0722
10210B48684O907L1752M1673O0881J10070O1035K1408J9688P6819J31931K01781
10199A012629K24415K56950K87322K14359P0051j49718k94871k68205k56879k17460
10189H78593j36136p6430l6658n3442o5498m3275q3484n8984m9261k603P76K2196
10177B95794j3256J3223J4448n667J744J3331O6265q82p1906n9151j7525J9493
10165B55911M0499J9236J4925O616M1609L974O146M5653k6510M25o3569o044L5296
10152C74167j3877M4680L1954M3248J6100K8471K5809l3725n2529l7914n4978
10141C71406n3619o311J0616m075L960K329L2642J7108r203o4451m1487j6991
$$ plain form
10129 241924 187403 179237 178351 202289 257315 286718 274606 242793 231121 218405 196254 197079
10117 197079 182309 186393 150845 117887 109070 119129 112718 102594 100512 97230 101022 139915 154837
10104 154837 151123 123475 132746 149923 191304 207328 218608 184087 180935 169257 131775 108117
10092 108117 167085 170554 152161 158252 143092 135085 139490 109118 70685 70360 130463 172593 154134
10079 154134 75614 89437 101058 110644 97673 86103 91053 108135 153170 157484 154214 177527
10067 177527 148274 167835 141256 95883 89463 88545 126203 107431 89879 91750 85524 110071
10055 110071 103255 70893 65808 79813 100321 154382 165285 146766 109893 105760 151110 158480
10043 158480 142603 138121 136833 140742 185602 190458 122216 99478 120232 128808 112865 112261 105075
$$ packed form
10129B41924n4521q166q86K3938N5026K9403j2112l1813j1672j2716k2151Q25
10117A97079j4770M084l5548l2958q817J0059o411j0124k082l282L792L8893J4922
10104A54837l714k7648R271J7177M1381J6024J1280l4521l152j1678l7482k3658
10092A08117N8968L469j8393O091j5160q007M405l0372l8433l25O0103M2130j8459
10079A54134p8520J3823J1621R586j2971j1570M950J7082M5035M314l270K3313
10067A77527k9253J9561k6579m5373o420r18L7658j8772j7552J871o226K4547
10055A10071o816l2362n085J4005K0508N4061J0903j8519l6873m133M5350P370
10043A58480j5877m482j288L909M4860M856o8242k2738K0754Q576j5943o04p186
$$ plain form
10030 105075 69973 51039 35790 32137 -12560 7726 34234 88399 113105 112315 89218 75489
10018 75489 103627 106014 117987 97102 81393 98205 134885 141863 108197 87376 101048 100449
10006 100449 91142 91558 86261 134609 159000 128200 169869 180991 107032 71588 57785 59214
9994 59214 84122 96846 120417 164279 155571 120662 84035 87245 71153 59724 51460 51104 48888
9981 48888 45306 36805 66949 84644 136283 120312 109162 100191 126695 113549 150209 148494 122950
9968 122950 139493 190500 193578 152254 68146 45330 40602 33222 73208 100261 98663 99928 92843
9955 92843 80048 62315 48116 31730 10267 47001 120260 141668 104692 66228 55698 64875
9943 64875 76073 77550 74878 39266 23887 55421 107257 113165 122070 94161 106815 130244 128831
$$ packed form
10030A05075l5102j8934j5249l653m4697K0286K6508N4165K4706p90k3097j3729
10018G5489K8138K387J1973k0885j5709J6812L6680O978l3666k0821J3672n99
10006A00449r307M16n297M8348K4391l0800M1669J1122p3959l5444j3803J429
9994E9214K4908J2724K3571M3862q708l4909l6627L210j6092j1429q264l56k216
9981D8888l582q501L0144J7695N1639j5971j1150q971K6504j3146L6660j715k5544
9968A22950J6543N1007L078m1324q4108k2816m728p380L9986K7053j598J265p085
9955I2843j2795j7733j4199j6386k1463L6734P3259K1408l6976l8464j0530R177
9943F4875J1198J477k672l5612j5379L1534N1836N908Q905k7909J2654K3429j413
$$ plain form
9930 128831 128463 105001 99385 108054 141303 179890 145952 110415 98437 118333 129053 175064
9918 175064 186508 196125 161342 133321 92812 51427 78144 64841 30758 51738 59381 36175
9906 36175 43724 48311 81345 50563 50444 64604 85906 97601 110685 110943 116338 98229 121971
9893 121971 98919 91270 53012 73198 59139 60928 101610 84619 42163 39407 60847 69540
9881 69540 65805 78405 68337 63169 51974 42296 63529 94459 58921 16159 62995 87422
9869 87422 58043 50103 41178 65806 71363 38646 -22307 -21083 61082 57066 18010 25065 32037
9856 32037 12463 -20893 -34654 -46178 -23357 5743 -19510 -27233 27282 55820 92560 30739
9844 30739 -6431 -15383 25704 52745 21042 2879 17814 36828 49748 88278 131028 99832
$$ packed form
9930A28831l68k3462n616Q669L3249L8587l3938l5537j1978J9896J0720M6011
9918A75064J1444R617l4783k8021m0509m1385K6717j3303l4083K0980P643k3206
9906C6175P549M587L3034l0782j19J4160K1302J1695J3084K58N395j8109K3742
9893A21971k3052p649l8258K0186j4059J789M0682j6991m2456k756K1440Q693
9881F9540l735J2600j0068n168j1195r678K1233L0930l5538m2762M6836K4427
9869H7422k9379p940q925K4628N557l2717o0953J224Q2165m016l9056P055O972
9856C2037j9574l3356j3761j1524K2821K9100k5253p723N4515K8538L6740o1821
9844C0739l7170q952M1087K7041l1703j8163J4935J9014J2920L8530M2750l1196
$$ plain form
9832 99832 106510 139308 132163 146357 144342 84696 73257 62530 51491 24582 63028 113011
9820 113011 76860 81654 89745 67706 31369 48015 75611 61899 57922 76482 107629 111734
9808 111734 120901 96697 69975 41304 38890 78202 70878 29869 31033 48657 23169 43067
9796 43067 67289 60964 49098 47629 79331 104215 105014 68736 76333 98899 77999 82803 50286
9783 50286 26516 45422 93837 103495 95918 84574 70021 87971 81439 48537 69260 112898
9771 112898 101400 78169 68427 52359 28244 -213 -7444 -11350 13263 2072 -11591 -13889
9759 -13889 -13407 10970 26714 23994 -2771 7910 43173 59940 92999 72931 27116 53783
9747 53783 57912 50287 11622 8020 34679 80056 129707 112171 100694 92297 70635 53307 58773
$$ packed form
9832I9832O678L2798p145J4194k015n9646j1439j0727j1039k6909L8446M9983
9820A13011l6151M794Q091k2039l6337J6646K7596j3712l977J8560L1147M105
9808A11734R167k4204k6722k8671k414L9312p324m1009J164J7624k5488J9898
9796D3067K4222o325j1866j469L1702K4884P99l6278P597K2566k0900M804l2517
9783E0286k3770J8906M8415R658p577j1344j4553J7950o532l2902K0723M3638
9771A12898j1498k3231r742j6068k4115k8457p231l906K4613j1191j3663k298
9759a3889M82K4377J5744k720k6765J0681L5263J6767L3059k0068m5815K6667
9747E3783M129p625l8665l602K6659M5377M9651j7536j1477q397k1662j7328N466
$$ plain form
9734 58773 46387 34024 50060 64849 61579 81465 101875 122150 144337 136541 97763 57335
9722 57335 42781 32984 32185 50843 53529 52101 69938 88393 43441 10869 59516 63652 60255
9709 60255 67745 98220 65909 48626 50342 36114 23235 28436 51016 42461 7161 281 -19451
9696 -19451 7370 50569 73392 92634 90877 81151 91234 112045 108163 81299 89906 116443 69159
9683 69159 31803 34766 64615 61154 72767 35030 44208 91015 102048 51669 14305 -7437
9671 -7437 934 15110 -2922 -23204 -38828 -20424 33470 66510 99997 85041 64005 54450
9659 54450 80056 99040 65338 15137 -20868 36794 103767 116899 95870 88827 116914 156298
9647 156298 202017 331717 487799 617508 549663 374042 255455 201573 135003 108693 100032
$$ packed form
9734E8773j2386j2363J6036J4789l270J9886K0410K0275K2187p796l8778m0428
9722E7335j4554r797p99J8658K686j428J7837J8455m4952l2572M8647M136l397
9709F0255P490L0475l2311j7283J716j4228j2879N201K2580q555l5300o880j9732
9696a9451K6821M3199K2823J9242j757r726J0083K0811l882k6864Q607K6537m7284
9683F9159l7356K963K9849l461J1613l7737R178M6807J1033n0379l7364k1742
9671g437Q371J4176j8032k0282j5624J8404N3894L3040L3487j4956k1036r555
9659E4450K5606J8984l3702n0201l6005N7662O6973J3132k1029p043K8087L9384
9647A56298M5719J29700J56082J29709o7845j75621j18587n3882o6570k6310q661
$$ plain form
9636 100032 72461 44649 65579 118853 132565 125003 136273 116093 94494 101478 78639 95572
9624 95572 101159 56406 41606 57847 70085 83566 78180 94970 98395 92357 90572 72323 32782
9611 32782 20191 59973 77215 22322 -3596 11698 36769 50480 43051 38534 64043 60241
9599 60241 40510 43564 32276 52683 21246 -9621 -57963 -55856 -26169 5768 7008 7774 -8137
9586 -8137 -15561 1750 42020 36053 46963 30560 46705 19499 14259 63718 85581 90936 51566
9573 51566 24690 -3777 -24907 33843 70771 108141 121259 96537 75021 21983 67238 66647
9561 66647 88476 122369 122174 121440 160115 169858 139472 139749 127179 77813 90882 76900 83823
9548 83823 63218 54187 109009 131738 75114 45579 54108 82654 82536 76368 64173 70111 17048
$$ packed form
9636A00032k7571k7812K0930N3274J3712p562J1270k0180k1599O984k2839J6933
9624I5572N587m4753j4800J6241J2238J3481n386J6790L425o038j785j8249l9541
9611C2782j2591L9782J7242n4893k5918J5294K5071J3711p429m517K5509l802
9599F0241j9731L054j1288K0407l1437l0867m8342K107K9687L1937J240P66j5911
9586h137p424J7311M0270n967J0910j6403J6145k7206n240M9459K1863N355l9370
9573E1566k6876k8467k1130N8750L6928L7370J3118k4722k1516n3038M5255n91
9561F6647K1829L3893j95p34L8675R743l0386K77j2570m9366J3069j3982O923
9548H3823k0605r031N4822K2729n6624k9535Q529K8546j18o168j2195N938n3063
$$ plain form
9535 17048 15112 14688 -33277 -18044 -25423 -29207 15583 53524 52913 38513 5148 28788 62117
9522 62117 48095 13373 -16838 -30711 -40733 -38088 528 -25401 -20158 -11551 36552 75358
9510 75358 76628 76488 62360 37325 -22186 -42488 -226 35611 20610 51527 73533 70990 15377
9497 15377 -9495 15398 33014 36758 85538 111377 128108 103402 69720 68331 31702 9656
9485 9656 21396 1519 33329 1644 30 53846 61228 32587 907 -12629 -3855 11747 55398
9472 55398 71671 88249 80381 50034 38057 27796 11111 -30426 -25521 24183 53695 46766
9460 46766 27991 23939 3333 13212 29418 -12207 -21828 -1860 50160 70808 25661 30879 35312
9447 35312 34214 19072 2338 23230 78299 63670 20081 46649 38239 41170 44716 47947 43824
$$ packed form
9535A7048j936m24m7965J5233p379l784M4790L7941o11j4400l3365K3640L3329
9522F2117j4022l4722l0211j3873j0022K645L8616k5929N243Q607M8103L8806
9510G5358J270j40j4128k5035n9511k0302M2262L5837j5001L0917K2006k543n5613
9497A5377k4872K4893J7616L744M8780K5839J6731k4706l3682j389l6629k2046
9485I656J1740j9877L1810l1685j614N3816P382k8641l1680j3536Q774J5602M3651
9472E5398J6273J6578p868l0347j1977j0261j6685m1537M905M9704K9512o929
9460D6766j8775m052k0606R879J6206m1625r621J9968N2020K0648m5147N218M433
9447C5312j098j5142j6734K0892N5069j4629m3589K6568q410K931L546L231m123
$$ plain form
9434 43824 12799 -8825 -21061 13234 19799 33999 36337 55832 72691 107136 107881 44406 -6008
9421 -6008 20086 14909 -7800 44677 83780 62245 85770 84305 91929 94993 41190 -13075 -54681
9408 -54681 -44637 4882 13732 47354 38210 26286 35345 29361 25945 7042 32120 46931 35855
9395 35855 55483 32438 52614 58882 57748 27774 13233 21311 25690 94650 114598 75641 40810
9382 40810 55695 92390 61531 24851 18444 8719 28410 36805 27416 19373 -46159 -102822 -86993
9369 -86993 -51790 1141 9666 26128 54542 86891 60618 36874 26598 18442 1191 -877
9357 -877 13043 10757 23911 20665 3463 26409 21087 -4952 8942 56557 84992 64477 53408
9344 53408 37276 22532 -12412 -25811 4660 23747 35866 39988 -1003 -36853 -68253 -17722
$$ packed form
9434D3824l1025k1624j2236L4295O565J4200K338J9495J6859L4445P45o3475n0414
9421f008K6094n177k2709N2477L9103k1535K3525j465P624L064n3803n4265m1606
9408e4681J0044M9519Q850L3622r144j1924R059n984l416j8903K5078J4811j1076
9395C5855J9628k3045K0176O268j134k9974j4541Q078M379O8960J9948l8957l4831
9382D0810J4885L6695l0859l6680o407r725J9691Q395r389q043o5532n6663J5829
9369h6993L5203N2931Q525J6462K8414L2349k6273k3744j0276q156j7251k068
9357h77J3920k286J3154l246j7202K2946n322k6039J3894M7615K8435k0515j1069
9344E3408j6132j4744l4944j3399L0471J9087J2119M122m0991l5850l1400N0531
$$ plain form
9332 -17722 31298 25391 31377 60088 73168 66156 35163 -12844 13269 15845 -9433 -7201 49801
9319 49801 94244 87026 83893 71886 31325 1120 -16952 -18789 12791 74501 104365 99857 76436
9306 76436 46639 25206 -8112 -7378 -23284 -31190 -20210 -28818 -45917 -25941 5561 9134 14931
9293 14931 47446 36436 23928 23440 17335 14523 5891 14121 40338 67472 58987 41325 20236
9280 20236 -1626 8001 48432 70890 79624 64643 13069 -16807 -36931 -39310 -79866 -78800 -54347
9267 -54347 -16385 8954 55505 71347 25064 25540 26774 24966 38191 32048 32936 44997 75128
9254 75128 104975 77287 59717 38629 58890 44730 13375 -6160 -6286 44781 65586 53025
9242 53025 51942 25752 -37665 -54412 -25264 32516 53175 40134 24113 9593 20390 47484
$$ packed form
9332a7722M9020n907N986K8711J3080p012l0993m8007K6113K576k5278K232N7002
9319D9801M4443p218l133j2007m0561l0205j8072j837L1580O1710K9864m508k3421
9306G6436k9797k1433l3318P34j5906p906J0980q608j7099J9976L1502L573N797
9293A4931L2515j1010j2508m88o105k812q632Q230K6217K7134q485j7662k1089
9280B0236k1862R627M0431K2458Q734j4981n1574k9876k0124k379m0556J066K4453
9267e4347L7962K5339M6551J5842m6283M76J234j808J3225o143Q88J2061L0131
9254G5128K9847k7688j7570k1088K0261j4160l1355j9535j26N1067K0805j2561
9242E3025j083k6190o3417j6747K9148N7780K0659j3041j6021j4520J0797K7094
$$ plain form
9230 47484 32664 32875 29344 62810 75124 57083 32039 41954 41601 45676 42093 42014 27890 -19219
9216 -19219 -17405 19290 17020 26498 1347 -36163 -29822 152 2414 29048 83884 107688 115539
9203 115539 53545 -10228 -3285 10635 19134 48641 71559 74789 35435 2041 -15817 -21917
9191 -21917 -13296 5345 8839 24321 9417 -3258 6573 49165 48026 26155 14631 22247 -21796
9178 -21796 9998 107576 102138 31050 27677 33886 36567 29578 15244 14149 63 32562 44005
9165 44005 65915 72166 85690 92038 56485 22080 33040 23223 9162 6333 11969 48600 76069
9152 76069 16091 7512 -7025 26527 90234 132154 141749 122212 101991 87143 78641 72092 59258
9139 59258 57491 63633 40645 20085 50551 74451 81324 94897 117870 98821 119677 156021
$$ packed form
9230D7484j4820K11l531L3466J2314j8041k5044R915l53M075l583p9j4124m7109
9216a9219J814L6695k270R478k5151l7510O341K9974K262K6634N4836K3804P851
9203A15539o1994o3773O943J3920Q499K9507K2918L230l9354l3394j7858o100
9191b1917Q621J8641L494J5482j4904j2675R831M2592j139k1871j1524P616m4043
9178b1796L1794R7578n438p1088l373O209K681o989j4334j095j4086L2499J1443
9165D4005K1910O251J3524O348l5553l4405J0960r817j4061k829N636L6631K7469
9152G6069n9978q579j4537L3552O3707M1920R595j9537k0221j4848q502o549j2834
9139E9258j767O142k2988k0560L0466K3900O873J3573K2973j9049K0856L6344
$$ plain form
9127 156021 122959 77996 19677 46136 36326 14572 19389 44065 36769 35000 33791 50622 27656
9114 27656 44354 87783 96748 33995 -7725 8356 10956 9757 -25120 -68462 -74138 -28420 2702
9101 2702 -19907 -25668 12219 6524 -21774 -69719 -39594 -49222 -30609 8938 27498 35432 43051
9088 43051 47409 66850 100819 63161 73666 43411 2174 -22929 -48976 -31458 -38843 -19033
9076 -19033 34106 32871 43702 59194 50427 12865 24146 51750 50473 89038 122780 86096
9064 86096 61635 56400 92954 76292 50724 68383 54728 23514 4926 -10696 -26498 8714
9052 8714 40697 13703 -4666 29529 27424 6630 20708 45218 66299 17806 6027 18361
9040 18361 38247 15303 -5318 -20890 -27897 -30905 -23679 25911 13976 30994 85781 66796
$$ packed form
9127A56021l3062m4963n8319K6459r810k1754M817K4676p296j769j209J6831k2966
9114B7656J6698M3429Q965o2753m1720J6081K600j199l4877m3342n676M5718L1122
9101B702k2609n761L7887n695k8298m7945L0125r628J8613L9547J8560P934P619
9088D3051M358J9441L3969l7658J0505l0255m1237k5103k6047J7518p385J9810
9076a9033N3139j235J0831J5492q767l7562J1281K7604j277L8565L3742l6684
9064H6096k4461n235L6554j6662k5568J7659j3655l1214j8588j5622j5802L5212
9052H714L1983k6994j8369L4195k105k0794J4078K4510K1081m8493j1779J2334
9040A8361J9886k2944k0621j5572p007l008P226M9590j1935J7018N4787j8985
$$ plain form
9028 66796 22661 -39210 -44568 -31840 -44310 -48172 -49985 -9102 -7644 -27602 -46707 -47431 -23641
9015 -23641 22099 68903 63514 -4754 -78965 -81428 -41377 -21621 -31783 -13309 -7579 31999
9003 31999 27513 15151 11125 24723 25518 40822 20510 -8965 -18133 9066 26964 41548 25120
8990 25120 17508 17511 14462 -32252 -38655 -3047 1568 -10743 35984 56125 13884 18404 44809 65206
8976 65206 108004 52925 -13286 -3257 24159 30371 21605 7473 3295 -37335 -33700 -17925 7846
8963 7846 43407 45627 17142 9643 -4507 14143 -1167 19657 55564 64839 70155 53767 86740
8950 86740 104930 40278 8200 39285 76339 87828 58311 23864 22801 22729 21651 60354 40501
8937 40501 17208 56245 69051 78064 76501 64895 84934 89285 39972 -1578 -7593 12508 47886
$$ packed form
9028F6796m4135o1871n358J2728j2470l862j813M0883J458j9958j9105p24K3790
9015b3641M5740M6804n389o8268p4211k463M0051J9756j0162J8474N730L9578
9003C1999m486j2362m026J3598P95J5304k0312k9475r168K7199J7898J4584j6428
8990B5120p612Ll049m6714o403L5608M615j2311M6727K0141m2241M520K6405K0397
8976F5206M2798n5079o6211J0029K7416O212q766j4132m178m0630L635J5775K5771
8963G846L5561K220k8485p499j4150J8650j5310K0824L5907R275N316j6388L2973
8950H6740J8190o4652l2078L1085L7054J1489k9517l4447j063p2j078L8703j9853
8937D0501k3293L9037J2806R013j563j1606K0039M351m9313m1550o015K0101L5378
$$ plain form
8924 47886 60553 38901 43712 14420 -51374 -19481 -9626 -43944 -37767 33983 81586 79044 63267
8911 63267 41824 43287 65176 91384 68354 46223 60164 82568 100562 92601 64817 42457
8899 42457 22190 11477 19480 8547 32740 63242 57124 36392 -11221 3323 9035 -222 -4690
8886 -4690 -5455 2606 28392 44506 35727 17336 -2901 11435 863 -7653 4229 36098 55357
8873 55357 57540 42083 10884 6021 29280 16458 -10530 -9675 -41580 -4196 18053 5285 -31691
8860 -31691 -9619 62784 89165 103009 151898 153977 130590 106615 75537 74418 95537 78228
8848 78228 76584 67753 91796 57854 -19225 -20106 636 44731 33941 30421 82617 48072 40402
8835 40402 50930 7074 -40081 -42453 -26234 -11664 -23710 -36176 -31985 -57087 -76063 -46478
$$ packed form
8924D7886J2667k1652M811k9292o5794L1893R855l4318O177P1750M7603k542j5777
8911F3267k1443J463K1889K6208k3030k2131J3941K2404J7994p961k7784k2360
8899D2457k0267j0713Q003j0933K4193L0502o118k0732m7613J4544N712r257m468
8886d690p65Q061K5786J6114q779j8391k0237J4336j0572q516J1882L1869J9259
8873E5357K183j5457l1199m863K3259j2822k6988Q55l1905L7384K2249j2768l6976
8860c1691K2072P2403K6381J3844M8889K079k3387k3975l1078j119K1119j7309
8848G8228j644q831K4043l3942p7079q81K0742M4095j0790l520N2196l4545p670
8835D0402J0528m3856m7155k372J6219J4570j2046j2466M191k5102j8976K9585
$$ plain form
8823 -46478 -41676 -26503 10868 33511 10020 -11281 -23910 -18841 1278 -2135 -38045 -45774 -10416
8810 -10416 -7684 7703 -34562 -57222 -57759 -52194 -24670 -9367 8880 18836 -9548 8644 2370
8797 2370 -19237 -36367 -31879 -31407 -29224 -29557 -7868 6402 39234 30167 -116 -16939 1308
8784 1308 15993 24350 688 -6370 -7836 -25516 -34823 -34370 -13985 3805 22369 25349 22752 36413
8770 36413 4526 -5042 10638 52775 36132 -30744 -48371 -49855 -73094 -76982 -72366 -70801 -47081
8757 -47081 -54080 -31336 -5672 14268 -8316 -36109 -10550 19194 -9680 -12420 -5295 -15091 -27833
8744 -27833 4607 18684 26639 67190 40240 44536 55842 23792 26137 50450 64501 79500
8732 79500 116360 91725 52857 56344 36787 18944 42274 18088 -13990 447 59573 101274
$$ packed form
8823d6478M802J5173L7371K2643k3491k1301j2629N069K0119l413l5910p729L5358
8810a0416K732J5387m2265k2660n37N565K7524J5303J8247R956k8384J8192o274
8797B370k1607j7130M488M72K183l33K1689J4270L2832r067l0283j6823J8247
8784A308J4685Q357k3662p058j466j7680r307M53K0385J7790J8564K980k597J3661
8770C6413l1887r568J5680M2137j6643o6876j7627j484k3239l888M616J565K3720
8757d7081o999K2744K5664J9940k2584k7793K5559K9744k8874k740P125r796j2742
8744b7833L2440J4077P955M0551k6950M296J1306l2050K345K4313J4051J4999
8732G9500L6860k4635l8868L487j9557j7843K3330k4186l2078J4437N9126M1701
$$ plain form
8720 101274 100429 55800 66403 56495 58753 74753 74684 43955 34509 46513 24608 3306 -24818
8707 -24818 24522 75976 112414 123052 124869 69849 18243 -3341 -32072 -34181 -11601 -7447
8695 -7447 -7166 -1796 14967 16288 18582 32988 79591 52645 24794 55831 57168 32602 49690
8682 49690 24213 1501 -16496 -12697 -14874 11577 39195 45918 51331 77982 55652 -4195 -41421
8669 -41421 -11248 9184 7287 48625 73804 25459 -22771 -5421 -27856 -26934 -11349 -4757 2312
8656 2312 -4209 12284 28533 24854 51806 34937 4796 60196 78906 33589 2612 6280 48388
8643 48388 69179 51898 62809 76256 33743 37497 44436 24972 -5177 -8312 21004 15786 53467
8630 53467 50817 26068 64175 34940 9919 42638 55682 63754 65533 33756 29227 37240 70569
$$ packed form
8720A01274q45m4629J0603r908K258J6000o9l0729r446J2004k1905k1302k8124
8707b4818M9340N1454L6438J0638J817n5020n1606k1584k8731k109K2580M154
8695g447K81N370J6763J321K294J4406M6603k6946k7851L1037J337k4566J7088
8682D9690k5477k2712j7997L799k177K6451K7618O723N413K6651k2330n9847l7226
8669d1421L0173K0432j897M1338K5179m8345m8230J7350k2435R22J5585O592P069
8656B312o521J6493J6249l679K6952j6869l0141N5400J8710m5317l0977L668M2108
8643D8388K0791j7281J0911J3447m2513L754O939j9464l0149l135K9316n218L7681
8630E3467k650k4749L8107k9235k5021L2719J3044Q072J779l1777m529Q013L3329
$$ plain form
8617 70569 79644 32799 28460 30824 73396 97790 58135 39271 44339 16817 32892 -18260 -37055
8604 -37055 -1396 31647 59291 82723 75184 76158 92533 111562 108291 91003 73722 49284 40912
8591 40912 48720 63273 73179 47286 -3071 -2959 8562 40757 98114 103299 72688 78460 69725
8578 69725 53942 40767 67099 50828 7495 36439 57376 40519 22602 35393 78685 59790
8566 59790 30172 804 6112 -1760 13868 44053 49398 33229 89193 103416 95283 101191 127964
8553 127964 136697 136336 122130 111666 82473 62474 53716 9923 33307 22888 14342 23538 39313
8540 39313 80519 68703 33395 -41657 -57694 -39327 -34788 -8141 -10485 -41195 -43074 -13499
8528 -13499 215 6127 3454 -15673 -10887 4862 -12687 -16856 -23691 -18124 -12643 11982 19397
$$ packed form
8617G0569R075m6845m339K364M2572K4394l9655j8864N068k7522J6075n1152j8795
8604c7055L5659L3043K7644K3432p539R74J6375J9029l271j7288j7281k4438q372
8591D0912P808J4553R906k5893n0357J12J1521L2195N7357N185l0611N772q735
8578F9725j5783j3175K6332j6271m3333K8944K0937j6857j7917J2791M3292j8895
8566E9790k9618k9368N308p872J5628L0185N345j6169N5964J4223q133N908K6773
8553A27964Q733l61j4206j0464k9193j9999q758m3793K3384j0419q546R196J5775
8540C9313M1206j1816l5308p5052j6037J8367M539K6647k344l0710j879K9575
8528a3499J3714N912k673j9127M786J5749j7549m169o835N567N481K4625P415
$$ plain form
8515 19397 39527 9572 -33052 -40634 -71282 -54543 -48141 -28429 2059 41042 49797 40243 23014
8502 23014 24614 54148 50161 38002 32880 2950 6192 23588 25577 7329 5552 -2854 -28252
8489 -28252 -4121 6384 -34663 -57646 -49375 -80608 -91232 -64338 -20515 -15501 -35087 -36877
8477 -36877 -21934 -31356 -24381 -13804 41551 40426 40093 13700 52275 30082 -10388 -15866 -20407
8464 -20407 -17893 17662 25362 20986 6597 31780 12996 28862 46028 28691 13026 -2297
8452 -2297 6459 13949 57289 32161 26642 52037 33246 7200 35959 34224 67258 96827 71668
8439 71668 67476 84399 105334 89370 48515 46848 16413 5392 -10053 13530 57886 94905
8427 94905 34164 5649 24091 38435 39057 63907 53687 9683 28597 41023 21928 -336
$$ packed form
8515A9397K0130k9955m2624p582l0648J6739O402J9712L0488L8983Q755r554j7229
8502B3014J600K9534l987j2159n122k9930L242J7396J989j8248j777q406k5398
8489b8252K4131J0505m1047k2983Q271l1233j0624K6894M3823N014j9586j790
8477c6877J4943r422O975J0577N5355j125l33k6393L8575k2193m0470n478m541
8464b0407K514L5555P700m376j4389K5183j8784J5866J7166j7337j5665j5323
8452b297Q756P490M3340k5128n519K5395j8791k6046K8759j735L3034K9569k5159
8439G1668m192J6923K0935j5964m0855j667l0435j1021j5445K3583M4356L7019
8427I4905o0741k8515J8442J4344O22K4850j0220m4004J8914J2426j9095k2264
$$ plain form
8415 -336 -3959 5837 -4712 7818 10354 37632 73229 96694 64477 33024 20675 -7442 3669
8402 3669 -8916 -198 41811 72863 87385 80489 61910 38723 12075 -22775 -8135 45714
8390 45714 47939 61035 25229 -979 -28152 -3137 3291 27845 35616 32958 3300 -18419 -6925
8377 -6925 -44743 -71598 -51493 -8612 6645 -14807 -49671 -73500 -56097 -55019 -90774 -79330
8365 -79330 -47413 -24402 -32158 -13284 38349 28495 -20514 -43637 -11846 43620 64685 37497
8353 37497 21893 27930 32371 55908 75189 59692 79872 89538 108928 81662 9757 12978 10789
8340 10789 -11917 -16089 -40459 -42109 -10306 621 1926 -7073 9850 -17004 -54224 -39414 -16151
8327 -16151 -40344 -64501 -64807 -50539 -66682 -58436 -32288 -34738 -40444 -48703 -46326 -6483 22256
$$ packed form
8415c36l623R796j0549J2530K536K7278L5597K3465l2217l1453j2349k8117J1111
8402C669j2585Q718M2009L1052J4522o896j8579k3187k6648l4850J4640N3849
8390D5714K225J3096l5806k6208k7173K5015O428K4554P771k658k9658k1719J1494
8377f925l7818k6855K0105M2881J5257k1452l4864k3829J7403J078l5755J1444
8365g9330L1917K3011p756J8874N1633r854m9009k3123L1791N5466K1065k7188
8353C7497j5604O037M441K3537J9281j5497K0180R666J9390k7266p1905L221k189
8340A0789k2706m172k4370j650L1803J0927J305q999J6923k6854l7220J4810K3263
8327a6151k4193k4157l06J4268j6143Q246K6148k450n706q259K377L9843K8739
$$ plain form
8314 22256 20097 32291 26295 24994 35704 27665 12516 -32577 -103621 -71585 -61557 -53520 -35679
8301 -35679 -1834 3099 -24368 -45250 -44910 -45645 -48198 -26456 -6479 -22348 -40694 -30544 -13370
8288 -13370 -11755 -26352 25779 70119 55994 42222 -1116 741 27278 55431 55696 57242 59505
8275 59505 81295 61962 43719 70937 53819 5945 -6841 42225 31716 21394 -6830 -37768
8263 -37768 -34856 5148 38124 55417 40276 6016 -34452 -63709 -76661 -51631 -98631 -107064
8251 -107064 -92899 -81966 -39844 -4274 15453 65641 81311 66360 55939 44333 -7172 -61087
8239 -61087 -79147 -80882 -16060 10733 6172 9574 -12080 -18450 -75871 -86984 -53760 -60030 -4945
8226 -4945 3721 19230 18558 -19728 -37406 -43586 13781 36497 43876 47211 51113 42251 31751 12526
$$ packed form
8314B2256k159J2194n996j301J0710q039j5149m5093p1044L2036J0028Q037J7841
8301c5679L3845M933k7467k0882L40p35k553K1742J9977j5869j8346J0150J7174
8288a3370J615j4597N2131M4340j4125j3772m3338J857K6537K8153K65J546K263
8275E9505K1790j9333j8243K7218j7118m7874j2786M9066j0509j0322k8224l0938
8263c7768K912M0004L2976J7293j5141l4260m0468k9257j2952K5030m7000q433
8251a07064J4165J0933M2122L5570J9727N0188J5670j4951j0421j1606n1505n3915
8239f1087j8060j735O4822K6793m561L402k1654o370n7421j1113L3224o270N5085
8226d945Q666J5509o72l8286j7678o180N7367K2716P379L335L902q862j0500j9225
$$ plain form
8212 12526 15369 -5471 -31000 -14020 -4463 204 22971 1933 -2693 -5296 -25684 -71850 -92046
8199 -92046 -43484 -1212 33182 18484 -30998 -67771 -50513 -25562 -2817 -7811 -24653 -13163
8187 -13163 -19375 -15745 -13237 12071 18891 10711 -15330 4849 35788 53675 1274 4449 5622
8174 5622 4773 39368 51133 42150 52032 97033 88622 58797 54186 68977 79003 11822 -19804
8161 -19804 -31971 -12346 21774 35084 18389 -10621 24460 58233 54861 16542 2172 -3523
8149 -3523 23158 25151 60055 31216 9887 46134 89382 54411 43432 28885 28157 31830 23674
8136 23674 7034 -21006 568 -1266 -21748 -1102 44915 33000 10139 46777 45181 61551
8124 61551 52831 45749 37240 16754 -1829 -30913 -50926 -61570 -34825 -9152 7347 23720
$$ packed form
8212A2526K843k0840k5529J6980R557M667K2767k1038m626k603k0388m6166k0196
8199i2046M8562M2272L4394j4698m9482l6773J7258K4951K2745m994j6842J1490
8187a3163o212L630K508K5308O820q180k6041K0179L0939J7887n2401L175J173
8174E622q49L4595J1765q983R882M5001q411k9825m611J4791J0026o7181l1626
8161a9804j2167J9625L4120J3310j6695k9010L5081L3773l372l8319j4370n695
8149c523K6681J993L4904k8839k1329L6247M3248l4971j0979j4547p28L673q156
8136B3674j6640k8040K1574j834k0482K0646M6017j1915k2861L6638j596J6370
8124F1551q720p082q509k0486j8583k9084k0013j0644K6745K5673J6499J6373
$$ plain form
8112 23720 25331 26586 1917 580 17329 12634 29925 58692 70811 12411 -2611 5176 14218
8099 14218 17043 17573 20601 74691 63224 18364 -39840 -58562 -63695 -3488 50356 71591 75835
8086 75835 49861 26377 8350 1067 -3311 26914 4698 24306 41148 -20355 -30173 29116
8074 29116 65816 36457 46363 26541 -23471 -50299 -47388 -34172 -5944 -12565 -5467 41471 40895
8061 40895 47522 32005 19356 65701 62514 45701 39951 7401 -41688 -5615 -3286 10283 68720
8048 68720 71398 43377 51980 94776 65467 34160 37862 11785 6195 14856 20820 46603 40947
8035 40947 7326 20585 7564 18692 1127 -15859 -9781 -5660 14765 -5126 -9758 -10852 12368
8022 12368 44535 68295 47747 32498 -11568 -39511 -42452 -20419 -11530 -1125 -7819 -2842 41114
$$ packed form
8112B3720J611J255k4669j337J6749m695J7291K8767J2119n8400j5022P787R042
8099A4218K825N30L028N4090j1467m4860n8204j8722n133O0207N3844K1235M244
8086G5835k5974k3484j8027p283m378L0225k2216J9608J6842o1503r818N9289
8074B9116L6700k9359R906j9822n0012k6828K911J3216K8228o621P098M6938n76
8061D0895O627j5517j2649M6345l187j6813n750l2550m9089L6073K329J3569N8437
8048F8720K678k8021Q603M2796k9309l1307L702k6077n590Q661N964K5783n656
8035D0947l3621J3259j3021J1128j7565j6986O078M121K0425j9891m632j094K3220
8022A2368L2167K3760k0548j5249m4066k7943k941K2033Q889J0405o694M977M3956
$$ plain form
8009 41114 61634 35735 2944 -18690 -48682 -28447 -16699 -1922 1523 -8733 -12997 5171
7997 5171 -20563 -28049 -9893 31246 41055 29568 67251 43362 -11968 -58801 -18963 10258
7985 10258 34345 21805 -6435 5772 29350 9437 -17305 5461 26370 38909 12955 20719
7973 20719 -3564 -15277 -13103 7736 58063 54166 55677 42492 20872 49829 52148 50853 65134
7960 65134 2938 -66703 -101553 -69909 -42204 -38842 -21628 -53695 -63908 1822 14907 -16182
7948 -16182 -29143 4795 -1111 -21077 -13079 -9901 10028 69935 101746 102954 80852 45367 25803
7935 25803 13296 -3303 3367 -28178 -61817 -66099 -68337 -58493 -46416 -58346 -62641 -63123 -46165
7922 -46165 -58753 -23793 -33430 -30228 5565 61967 60519 34454 30897 40652 77839 59990 53938
$$ packed form
8009D1114K0520k5899l2791k1634k9992K0235J1748J4777L445j0256m264J8168
7997E171k5734p486J8156M1139R809j1487L7683k3889n5330m6833L9838K9221
7985A0258K4087j2540k8240J2207K3578j9913k6742K2766K0909J2539k5954P764
7973B0719k4283j1713K174K0839N0327l897J511j3185k1620K8957K319j295J4281
7960F5134o2196o9641l4850L1644K7705L362J7214l2067j0213O5730J3085l1089
7948a6182j2961L3938n906j9966P998L178J9929N9907L1811J208k2102l5485j9564
7935B5803j2507j6599O670l1545l3639m282k238R844J2077j1930m295m82J6958
7922d6165j2588L4960r637L202L5793N6402j448k6065l557R755L7187j7849o052
$$ plain form
7909 53938 47843 2515 -19720 -31912 -22226 -49670 -89463 -60825 -49687 -26361 -61751 -34347
7897 -34347 23130 50233 46169 76598 73744 71862 48525 -4663 -25217 16409 30670 7469
7885 7469 -10828 -54727 -77358 -32622 31717 22059 -14487 -98013 -104730 -64138 -63382 -48647 -35127
7872 -35127 -46588 -3731 8739 16093 39791 17743 1717 -12639 -4860 -31022 -9359 -4685
7860 -4685 -41817 -17461 40136 35702 1792 15416 35834 11715 22158 23778 -176 24762
7848 24762 25392 23247 16047 999 1005 14236 45811 48011 52302 64560 50580 49497 19873 36029
7834 36029 44609 31131 17453 -22045 -15505 42886 71121 31492 23639 35560 10428 45862
7822 45862 66147 43498 52232 61505 73288 22080 721 25937 19151 12735 10990 611 -19765
$$ packed form
7909E3938o095m5328k2235j2192R686k7444l9793K8638J1138K3326l5390K7404
7897c4347N7477K7103m064L0429k854j882k3337n3188k0554M1626J4261k3201
7885G469j8297m3899k2631M4736O4339r658l6546q3526o717M0592P56J4735J3520
7872c5127j1461M2857J2470P354K3698k2048j6026j4356P779k6162K1663M674
7860d685l7132K4356N7597m434l3910J3624K0418k4119J0443J620k3954K4938
7848B4762O30k145p200j5048OJ3231L1575K200M291J2258j3980j083k9624J6156
7834C6029Q580j3478j3678l9498O540N8391K8235l9629p853J1921k5132L5434
7822D5862K0285k2649Q734R273J1783n1208k1359K5216o786o416j745j0379k0376
$$ plain form
7809 -19765 -22155 -5244 37169 43415 33588 26469 29214 -6038 -21995 -7440 9495 -24402 -23427
7796 -23427 -55315 -49995 -48836 -18504 -17205 5291 65167 61317 48169 35788 49198 32603 30840
7783 30840 64035 59856 23598 3840 -16494 -4502 18750 40949 43478 13830 -33314 500
7771 500 28545 11137 -12109 -36803 -42761 -31746 -21204 14313 29125 25147 23250 4555 244
7758 244 9848 -10106 10821 19892 8044 -8880 -67281 -90559 -103933 -82079 -9504 642 -34268
7745 -34268 -50046 -33553 13552 56690 14209 12178 53927 46003 44897 86264 101116 66105
7733 66105 69591 82954 49870 40729 6664 -26946 -40987 -32946 -3655 12439 -2351 17 -15876
7720 -15876 -45691 -30784 8782 34383 2902 -28025 -8545 -5022 3759 575 -15682 -14336 -24559
$$ packed form
7809a9765k390J6911M2413O246r827p119K745l5252j5957J4555J6935l3897R75
7796b3427l1888N320J159L0332J299K2496N9876l850j3148j2381J3410j6595j763
7783C0840L3195m179l6258j9758k0334J1992K3252K2199K529k9648m7144L3814
7771E00K8045j7408k3246k4694n958J1015J0542L5517J4812l978j897j8695m311
7758B44R604j9954K0927R071j1848j6924n8401k3278j3374K1854P2575J0146l4910
7745c4268j5778J6493M7105M3138m2481k031M1749p924j106M1367J4852l5011
7733F6105L486J3363l3084r141l4065l3610j4041Q041K9291J6094j4790K368j5893
7720a5876k9815J4907L9566K5601l1481l0927J9480L523Q781l184j6257J346j0223
$$ plain form
7707 -24559 -20231 11582 9402 35416 48875 50079 26667 15351 38926 7200 5668 40751 30517
7694 30517 -13811 -45248 -5166 31297 29592 12526 28669 32365 37822 12498 -21113 243
7682 243 -20950 -36368 6017 55749 57695 84652 97769 103238 80308 39388 17599 20232 590
7669 590 -2374 -4127 -29615 -26678 -5283 44521 45254 11880 400 -9757 -1579 -9891 25794 45891
7655 45891 -2496 -41726 -52226 -22947 33707 32078 38429 34372 -3110 -35629 -34752 -35097 -8490
7642 -8490 -57839 -54898 -19000 -19672 -14847 -30631 -9203 7116 -17329 -10486 8074 -19096 -77780
7629 -77780 -77472 -60518 -73703 -44779 -56793 -74783 -36414 5636 -12170 -34230 -32809 -33399 -33924
7616 -33924 -30458 -35430 -70819 -70363 -52244 -50440 -13391 34726 36428 21094 11992 -16405 8335
$$ packed form
7707b4559M328L1813k180K6014J3459J204k3412j1316K3575l1726j532L5083j0234
7694C0517m4328l1437M0082L6463j705j7066J6143L696N457k5324l3611K1356
7682B43k1193j5418M2385M9732J946K6957J3117N469k2930m0920k1789K633j9642
7669E90k964j753k5488K937K1395M9804P33l3374j1480j0157Q178q312L5685K0097
7655D5891m8387l9230j0500K9279N6654j629O351m057l7482l2519Q77l45K6607
7642h490m9349K941L5898o72M825j5784K1428J6319k4445O843J8560k7170n8684
7629g7780L08J6954j3185K8924j2014j7990L8369M2050j7806k2060J421n90n25
7616c3924L466m972l5389M56J8119J804L7049M8117J702j5334r102k8397K4740
$$ plain form
7603 8335 -23965 -31655 -42380 -56594 -22451 -6534 -16017 29745 10862 -52117 -45929 -41171 -1210
7590 -1210 10989 33470 46813 62028 62052 67063 72767 41802 19804 33285 27212 26534 40318 45529
7576 45529 24660 50922 32477 40837 19107 6868 -22598 -11636 -17236 -31175 -30682 -22944 -5752
7563 -5752 -13465 -25973 -33833 -30001 -69378 -62975 -42565 -64277 -29219 62803 75460 33090 -1282
7550 -1282 -29826 -88782 -100641 -99147 -86318 -66879 -80721 -39467 -21179 7701 41380 34079
7538 34079 -14536 -31783 -15889 -27477 -45574 -64367 -89759 -105045 -119745 -84359 -51671 -53516
7526 -53516 5658 72571 17951 -14806 3624 -10081 -34491 -54952 -60476 -45511 -26984 -3585
7514 -3585 -22312 -23980 -45365 -74047 -74055 -61061 -23303 1845 -5835 -33436 -29401 -1331 -3429 -5104
$$ packed form
7603H335l2300p690j0725j4214L4143J5917r483M5762j8883o2979O188M758L9961
7590a210J2199K2481J3343J5215K4N011N704l0965k1998J3481o073o78J3784N211
7576D5529k0869K6262j8445Q360k1730j2239k9466J0962n600j3939M93P738J7192
7563e752p713j2508p860L832l9377O403K0410k1712L5058R2022J2657m2370l4372
7550a282k8544n8956j1859J494J2829J9439j3842M1254J8288K8880L3679p301
7538C4079m8615j7247J5894j1588j8097j8793k5392j5286j4700L5386L2688j845
7526e3516N9174O6913n4620l2757J8430j3705k4410k0461n524J4965J8527K3399
7514c585j8727j668k1385k8682qJ2994L7758K5148p680k7601M035K8070k098j675
$$ plain form
7500 -5104 -15533 18674 22433 -7653 22717 44163 3020 -49488 -42863 -49193 -29619 -25053 -6797
7487 -6797 5522 4555 -541 11060 1253 -35626 -46351 -27754 -64095 -51720 -2174 26564 20753
7474 20753 36528 34453 -21405 -19301 8788 41436 3198 1454 -9104 -11790 -23903 -39384 -15915
7461 -15915 -721 2230 9084 -19728 10450 12962 10923 -13938 -14148 -884 19731 -28568 -24808
7448 -24808 8818 38981 22683 -4480 -5245 -8766 -20946 -30673 -16306 34148 77004 90976 58847
7435 58847 7183 -25983 -74256 -108241 -75172 -51125 -51741 -28594 -15860 -29119 -48023 -28910
7423 -28910 -15717 9934 49772 39477 25698 33612 -15316 -20884 -5844 -30144 12132 20335
7411 20335 15279 3018 -30739 -41369 15611 32942 29230 327 -47810 -4351 11935 -28806
$$ packed form
7500e104j0429L4207L759l0086L0370K1446m1143n2508O625o330J9574M566J8256
7487f797J2319r67n096J1601r807l6879j0725J8597l6341J2375M9546K8738n811
7474B0753J5775k075n5858K104K8089L2648l8238j744j0558k686j2113j5481K3469
7461a5915J5194K951O854k8812L0178K512k039k4861k10J3264K0615m8299L760
7448b4808L3626L0163j6298k7163p65l521j2180r727J4367N0454M2856J3972l2129
7435E8847n1664l3166m8273l3985L3069K4047o16K3147J2734j3259j8904J9113
7423b8910J3193K5651L9838j0295j3779P914m8928n568J5040k4300M2276Q203
7411B0335n056j2261l3757j0630N6980J7331l712k8903m8137M3459J6286m0741
$$ plain form
7399 -28806 4471 51922 24061 11017 -23528 -38822 -25415 -13966 -16929 -12701 -57096 -78093
7387 -78093 -47047 -91773 -83446 -29517 -8890 -12835 -7011 -13272 -42844 -64918 -80108 -77978 -62773
7374 -62773 -46098 4652 18425 36184 -9509 -61641 -55025 -61169 -78924 -54240 -51662 -66643
7362 -66643 -73908 -29003 -7929 5194 -7957 -16328 -1327 22862 17571 2533 7885 5044 10045
7349 10045 -793 -19696 21747 54258 47443 78269 87800 73806 36772 -4205 -10836 -46068
7337 -46068 -27000 -34165 -87812 -62007 -24363 -43742 7332 102267 92487 40619 -23362 -551
7325 -551 18193 35015 43733 29084 6906 50269 10418 12087 11856 -7904 -2310 -19565 -32109
7312 -32109 -21357 4914 11286 4449 -1242 -32337 -9860 -1893 10511 29259 55147 54953 17500
$$ packed form
7399b8806L3277M7451k7861j3044l4545j5294J3407J1449k963M228m4395k0997
7387g8093L1046m4726Q327N3929K0627l945N824o261k9572k2074j5190K130J5205
7374f2773J6675N0750J3773J7759m5693n2132O616o144j7755K4684K578j4981
7362f6643p265M4905K1074J3123j3151q371J5001K4189n291j5038N352k841N001
7349A0045j0838j8903M1443L2511o815L0826R531j3994l7034m0977o631l5232
7337d6068J9068p165n3647K5805L7644j9379N1074R4935r780n1868o3981K2811
7325e51J8744J6822Q718j4649k2178M3363l9851J669k31j9760N594j7255j2544
7312c2109J0752K6271O372o837n691l1095K2477P967J2404J8748K5888j94l7453
$$ plain form
7299 17500 47 -909 35202 54219 35729 72847 102864 27436 -35419 -21085 24883 2964
7287 2964 -35756 -43864 -48204 -61432 -8575 27570 48397 41614 26058 64850 99230 90626 83070
7274 83070 40768 -2315 -42499 -54245 -30357 -13635 -7350 -27336 -24117 -294 19946 -20155
7262 -20155 2672 -12761 -8992 -34052 -60308 -39224 -14332 -23597 -4282 539 -25009 3621
7250 3621 30900 15038 9377 7669 -13021 5563 64080 72374 40117 3221 -8807 -40014 -10541
7237 -10541 19739 43565 30716 -5983 -36123 -46742 -34036 -6660 -4367 -35994 -14637 3170
7225 3170 -16022 -19654 -66367 -75347 -42469 -44391 -57689 -69860 -43403 -35711 -33430 -61541 -27893
7212 -27893 -26169 -19029 13577 4143 -29225 -45441 -21857 8818 24717 19486 25591 61706 66665
$$ packed form
7299A7500j7453r56L6111J9017j8490L7118L0017p5428o2855J4334M5968k1919
7287B964l8720q108m340j3228N2857L6145K0827o783j5556L8792L4380q604p556
7274H3070m2302m3083m0184j1746K3888J6722O285j9986L219K3823K0240m0101
7262b0155K2827j5433L769k5060k6256K1084K4892r265J9315M821k5548K8630
7250C621K7279j5862n661j708k0690J8584N8517Q294l2257l6896j2028l1207K9473
7237a0541L0280K3826j2849l6699l0140j0619J2706K7376K293l1627K1357J7807
7225C170j9192l632m6713q980L2878j922j3298j2171K6457P692K281k8111L3648
7212b7893J724P140L2606r434l3368j6216K3584L0675J5899n231O105L6115M959
$$ plain form
7199 66665 58977 59140 -4199 -26497 -19248 -3194 16894 -15275 -44805 -25698 20875 28354 -8810
7186 -8810 -38573 -67698 -65525 -52028 -31431 -55578 -52793 -46310 -47767 -44191 -11357 -689 -43393
7173 -43393 -42513 11213 13071 -22969 18561 4071 -25696 -25367 -17726 -29655 6188 6235 -20289 -36871
7159 -36871 -48502 -58150 -79973 -93854 -67656 -7961 73055 57828 -7523 -23364 -37494 -12373
7147 -12373 -15651 -35436 -32286 -31673 -7264 13300 5515 -10540 -4401 -28846 -80309 -115973 -104515
7134 -104515 -64641 -39754 -61451 -30755 -3549 -29330 -27799 -33567 -34444 -15563 -30672 -26042 7264
7121 7264 36718 15260 -27405 -52676 -14990 6058 20740 18069 22294 -20579 -24982 -31066 -62717
7108 -62717 -32254 11802 -41537 -75488 -38333 -11916 2971 1968 -28331 -53401 -18218 -13369
$$ packed form
7199F6665p688J63o3339k2298P249J6054K0088l2169k9530J9107M6573P479l7164
7186h810k9763k9125K173J3497K0597k4147K785O483j457L576L2834J0668m2704
7173d3393Q80N3726J858l6040M1530j4490k9767L29P641j1929L5843M7k6524j6582
7159c6871j1631r648k1823j3881K6198N9695Q1016j5227o5351j5841j4130K5121
7147a2373l278j9785L150O13K4409K0564p785j6055O139k4445n1463l5664J1458
7134a04515L9874K4887k1697L0696K7206k5781J531n768q77J8881j5109M630L3306
7121G264K9454k1458m2665k5271L7686K1048J4682k671M225m2873m403o084l1651
7108f2717L0463M4056n3339l3951L7155K6417J4887j003l0299k5070L5183M849
$$ plain form
7096 -13369 -6160 -3357 -38124 -40575 20901 45943 6836 -8595 12523 6441 -14766 -29092 -6094
7083 -6094 16667 22890 14551 -36192 -74212 -58790 -20516 -27890 -44515 -16089 -11847 -27493 -36592
7070 -36592 -26137 -48603 -11217 -35070 -37641 -19086 -15057 -39267 -10475 18119 9697 -12362
7058 -12362 5340 49227 35651 2989 -21169 -91525 -82655 -33845 -40687 -35891 -4620 9943
7046 9943 4853 -2860 18095 13838 -5793 -6169 3134 -35604 -19600 -31172 -50082 -51832 -43413 -44285
7032 -44285 -14338 23130 63861 55278 33177 -2164 -14719 -29275 -16886 8535 -14470 -29584
7020 -29584 -24051 -5309 -2163 14719 23732 57028 38381 32568 39848 4498 5082 23870 3499
7007 3499 -41862 -70582 -40356 -18549 -35034 -47873 -54818 -19684 -5820 -44903 -62697 -31209
$$ packed form
7096a3369P209K803l4767k451O1476K5042l9107j5431K1118o082k1207j4326K2998
7083f094K2761O223q339n0743l8020J5422L8274p374j6625K8426M242j5646r099
7070c6592J0455k2466L7386k3853k571J8555M029k4210K8792K8594q422k2059
7058a2362J7702M3887j3576l2662k4158p0356Q870M8810o842M796L1271J4563
7046I943n090p713K0955m257j9631l76R303l8738J6004j1572j8910j750Q419q72
7032d4285K9947L7468M0731q583k2101l5341j2555j4556J2389K5421k3005j5114
7020b9584N533J8742L146J6882R013L3296j8647n813P280l5350N84J8788k0371
7007C499m5361k8720L0226K1807j6485j2839o945L5134J3864l9083j7794L1488
$$ plain form
6995 -31209 -36361 -397 46902 40350 5879 24141 1518 -10630 -1163 5607 26969 38373 70307
6982 70307 35128 37922 31471 13610 26947 13802 11884 17871 6922 20438 21666 -19664 -10713
6969 -10713 27172 47401 69609 50958 33468 35147 45824 36795 -33104 -53839 -39181 7034
6957 7034 33877 59561 12689 2129 24392 26799 25893 11599 -9060 -65776 -79604 -58253 -32143
6944 -32143 -67639 -78983 -65838 -73201 -60757 -53731 -44866 -12636 -97804 -93833 -49123 5802 27863
6931 27863 8550 -31601 -46643 -17182 -45823 -91985 -93696 -49322 -10190 -18517 -51813 -81822
6919 -81822 -78922 -66374 -53428 -26220 -16237 -20471 -12747 -27110 4747 14581 17651 9104 28366
6906 28366 16302 -25229 -41711 -49382 -57112 -11354 55147 54247 28835 24205 20894 -5284 27114
$$ packed form
6995c1209n152L5964M7299o552l4471J8262k2623j2148R467O770K1362J1404L1934
6982G0307l5179K794o451j7861J3337j3145j918N987j0949J3516J228m1330Q951
6969a0713L7885K0229K2208j8651j7490J679J0677r029o9899k0735J4658M6215
6957G034K6843K5684m6872j0560K2263K407r06j4294k0659n6716j3828K1351K6110
6944c2143l5496j1344J3145p363J2444P026Q865L2230q5168L971M4710N4925K2061
6931B7863j9313m0151j5042K9461k8641m6162j711M4374L9132q327l3296l0009
6919h1822K900J2548J2946K7208R983m234P724j4363L1857R834L070q547J9262
6906B8366j2064m1531j6482p671p730M5758O6501r00k5412m630l311k6178L2398
$$ plain form
6893 27114 74074 84354 34042 -34843 -8152 30252 38095 30531 27847 46311 41193 46610 28099
6880 28099 -9669 12899 28887 31759 16690 -5602 -48748 -8980 -4213 -35196 -59616 -49361
6868 -49361 -67835 -10524 21063 44136 46151 64817 58253 36021 23182 38485 52961 30484
6856 30484 32533 4600 -3075 4798 5760 30222 24415 33543 57353 25209 -61532 -62712 -51999
6843 -51999 14040 16832 -23581 -30627 -6198 8710 49097 51573 78872 59668 -2531 -3747 24835
6830 24835 7103 -10454 -16105 5771 2758 -14402 -71074 -79999 -39626 -15650 -24217 -18126 -17086
6817 -17086 -11298 7656 24243 11513 -25569 -45203 -33748 -2208 21589 16770 -18144 -17450 11729
6804 11729 37962 53304 47541 599 -1855 -9102 -16918 -55450 -64899 -30863 -22836 -31274 -35752
$$ packed form
6893B7114M6960J0280n0312o8885K6691L8404P843p564k684J8464n118N417j8511
6880B8099l7768K2568J5988K872j5069k2292m3146L9768M767l0983k4420J0255
6868d9361j8474N7311L1587K3073K015J8666o564k2232j2839J5303J4476k2477
6856C0484K049k7933p675P873R62K4462n807R128K3810l2144q6741j180J0713
6843e1999O6039K792m0413p046K4429J4908M0387K476K7299j9204o2199j216K8582
6830B4835j7732j7557n651K1876l013j7160n6672q925M0373K3976q567O091J040
6817a7086N788J8954J6587j2730l7082j9634J1455L1540K3797m819l4914O94K9179
6804A1729K6233J5342n763m6942k454p247p816l8532r449L4036Q027q438m478
$$ plain form
6791 -35752 -28493 -57245 -103020 -77666 -50512 -45838 -22525 -66356 -53395 -16704 18236 -14330
6779 -14330 -8594 -6632 19196 44226 64531 87461 95483 74659 54041 57989 43480 -10522 -8983
6766 -8983 5981 -31872 -28130 3738 16115 19960 12133 -13179 -72555 -74662 -38690 4869 14573
6753 14573 18227 -6370 20542 21882 -8996 -53660 -71102 -16646 5395 -27292 -34282 -1169
6741 -1169 -18843 -67562 -57316 10570 15956 -24342 -39631 -22266 -47619 -85469 -72761 28062
6729 28062 36092 -4522 1878 26295 44556 6479 -12968 -20320 -49107 -41481 -35865 -62245 -58743
6716 -58743 -44597 -37885 -33587 25231 81057 35816 6858 -17286 -19172 -23612 -31690 -6079 2598
6703 2598 -17141 -18773 -27686 -61240 -53060 -36300 13847 11175 -23526 -15813 10424 51468 57404
$$ packed form
6791c5752P259k8752m5775K5354K7154M674K3313m3831J2961L6691L4940l2566
6779a4330N736J962K5828K5030K0305K2930Q022k0824k0618L948j4509n4002J539
6766h983J4964l7853L742L1868J2377L845p827k5312n9376k107L5972M3559R704
6753A4573L654k4597K6912J340l0878m4664j7442N4456K2041l2687o990L3113
6741a169j7674m8719J0246O7886N386m0298j5289J7365k5353l7850J2708J00823
6729B8062Q030m0614O400K4417J8261l8077j9447p352k8787P626N616k6380L502
6716e8743J4146O712M298N8818N5826m5241k8958k4144j886m440q078K5611Q677
6703B598j9739j632q913l3554Q180J6760N0147k672l4701P713K6237M1044N936
$$ plain form
6690 57404 48967 55274 35568 4060 -14627 -30529 -23336 6736 -14205 -225 -19137 -18337 -14868
6677 -14868 -3586 -34748 -34170 -25971 -34570 -17904 -20494 -33944 -11754 38221 13667 -36343 -48186
6664 -48186 -44006 -1115 49050 30895 -31937 -69641 -43306 -26462 -60271 -68955 -41464 -41127 -72189
6651 -72189 -60679 -42790 -34798 -43968 -55882 -99303 -53873 -28481 -4949 -26880 -60709 -83073
6639 -83073 -56337 -33466 -6849 3081 -3173 5077 -24443 -6620 -5047 17251 10870 -33734 -66158
6626 -66158 -48525 6924 484 -41639 -49429 -35474 -41415 -47102 -18826 -15521 4896 -3681 -14511
6613 -14511 10086 -17413 -76642 -45769 -9965 11739 52175 19370 -35813 -50786 -12451 36128
6601 36128 50127 34681 2339 26849 30339 4925 8790 -7294 -28357 -19369 -4353 -17494
$$ packed form
6690E7404q437O307j9706l1508j8687j5902P193L0072k0941J3980j8912Q00L469
6677a4868J1282l1162N78Q199q599J6666k590j3450K2190M9975k4554n0010j1843
6664d8186M180M2891N0165j8155o2832l7704K6335J6844l3809q684K7491L37l1062
6651g2189J1510J7889P992r170j1914m3421M5430K5392K3532k1931l3829k2364
6639h3073K6736K2871K6617R930o254Q250k9520J7823J573K2298o381m4604l2424
6626f6158J7633N5449o440m2123p790J3955n941n687K8276L305K0417q577j0830
6613a4511K4597k7499n9229L0873L5804K1704M0436l2805n5183j4973L8335M8579
6601C6128J3999j5446l2342K4510L490k5414L865j6084k1063Q988J5016j3141
$$ plain form
6589 -17494 -11928 23001 554 -5886 -7648 -25975 -50950 -64960 -63712 -43907 -35503 -226 564
6576 564 -32579 -17967 -11627 -18472 -30102 -43227 -59010 -76038 -101437 -73107 -47289 -51981 -30562
6563 -30562 -36575 -58944 -43234 -29591 -16699 4078 -13301 -68142 -72135 -23382 -18122 28559
6551 28559 57182 62178 35620 5202 3332 29287 -25612 -58322 -33624 -25956 -26278 -29895 -2712
6538 -2712 1085 -7273 -24761 -20784 -9618 -25945 -46144 -30868 -12749 10833 8424 -19652 -14283
6525 -14283 -13789 26959 9161 -10821 -26374 -43827 -32297 -31020 16175 18373 12751 14653 16409
6512 16409 23735 25267 39666 -546 -34384 -54504 -42534 -10752 -15554 11663 15327 6758 19491
6499 19491 -40402 -68153 -34832 641 13683 7117 13869 16707 -44254 -57151 -50189 -79149 -32826
$$ packed form
6589a7494N566L4929k2447o440j762j8327k4975j4010J248J9805Q404L5277P90
6576E64l3143J4612O340o845j1630j3125j5783j7028k5399K8330K5818m692K1419
6563c0562o013k2369J5710J3643J2892K0777j7379n4841l993M8753N260M6681
6551B8559K8623M996k6558l0418j870K5955n4899l2710K4698P668l22l617K7183
6538b712L797q358j7488L977J1166j6327k0199J5276J8119K3582k409k8076N369
6525a4283M94M0748j7798j9982j5553j7453J1530J277M7195K198n622J902J756
6512A6409P326J532J4399m0212l3838k0120J1970L1782m802K7217L664q569J2733
6499A9491n9893k7751L3321L5473J3042o566O752K838o0961j2897O962k8960M6323
$$ plain form
6486 -32826 -8528 -2414 -13337 -27636 -5681 4103 -9637 -45198 -70843 -75035 -57724 -56740 -44231
6473 -44231 -21520 -71148 -103343 -116317 -48932 -32386 -27015 -25564 -2701 709 -31653 -65733
6461 -65733 -53979 -30715 -56121 -67636 -79550 -58636 -31649 -2579 4749 33599 12983 -22456
6449 -22456 -38361 -25309 -11511 -27563 -23560 -46935 -27272 -8961 10768 34739 30600 19917
6437 19917 42113 -1469 -25930 -78420 -96337 -52931 21521 69167 71764 57362 46228 -28029
6425 -28029 -71589 -55384 -28815 -1548 -14403 -50911 -25458 -27157 28793 49936 21862 7476
6413 7476 -3407 -1228 31272 83625 28989 18273 -15190 -19628 11321 10705 16975 11642 27150
6400 27150 445 -55075 -46471 -21803 -28643 -17669 -30512 -66097 -56389 -16246 -8763 -16782 28570
$$ packed form
6486c2826K4298O114j0923j4299K1955R784j3740l5561k5645m192J7311R84J2509
6473d4231K2711m9628l2195j2974O7385J6546N371J451K2863L410l2362l4080
6461f5733J1754K3264k5406j1515j1914K0914K6987K9070P328K8850k0616l5439
6449b2456j5905J3052J3798j6052M003k3375J9663J8311J9729K3971m139j0683
6437A9917K2196m3582k4461n2490j7917M3406P4452M7646K597j4402j1134p4257
6425b8029m3560J6205K6569K7267j2855l6508K5453j699N5950K1143k8074j4386
6413G476j0883K179L2500N2353n4636j0716l3463m438L0949o16O270n333J5508
6400B7150k6705n5520Q604K4668o840J0974j2843l5585R708M0143P483q019M5352
$$ plain form
6387 28570 58361 26245 36512 14263 -45649 -71893 -70231 -45816 -11501 27399 67590 74955
6375 74955 41111 40946 3493 -33151 -17697 -26415 -32956 -9375 32009 52077 7720 -28713 -68403
6362 -68403 -35041 -11417 12575 -6752 -20833 -21777 18896 33095 14387 7879 -5216 11857
6350 11857 5960 -32217 -55000 -41168 -44018 -16579 27524 37059 9727 24532 24678 8378 -13067
6337 -13067 -50041 -56332 -15553 -10905 -5672 8249 16940 22338 27451 3533 5216 -35823 -37711
6324 -37711 14784 14895 1969 -12653 10243 40049 56721 78930 60264 6843 -17274 17191
6312 17191 27980 -1806 6917 -24055 -60277 -64527 -28982 14699 37426 35729 -22153 -34480
6300 -34480 -28740 -46757 -12305 48166 63840 66910 38840 10584 -23367 -19662 -5174 15781
$$ packed form
6387B8570K9791l2116J0267k2249n9912k6244J662K4415L4315L8900M0191P365
6375G4955l3844j65l7453l6644J5454q718o541K3581M1384K0068m4357l6433l9690
6362f8403L3362K3624K3992j9327j4081r44M0673J4199j8708o508j3095J7073
6350A1857n897l8177k2783J3832k850K7439M4103R535k7332J4805J46j6300k1445
6337a3067l6974o291M0779M648N233J3921Q691N398N113k3918J683m1039j888
6324c7711N2495J11j2926j4622K2896K9806J6672K2209j8666n3421k4117L4465
6312A7191J0789k9786Q723l0972l6222m250L5545M3681K2727j697n7882j2327
6300c4480N740j8017L4452O0471J5674L070k8070k8256l3951L705J4488K0955
$$ plain form
6288 15781 3572 -21364 -7119 -40346 -80850 -68393 -40464 -7536 30186 -2423 -12578 -38214
6276 -38214 -26190 -13970 -18670 -1517 72098 63482 14509 -9241 -28917 -57746 -59229 -61623 -73487
6263 -73487 -49376 -25925 -36850 -72690 -60877 -44073 -12931 11563 -2349 -67 -24899 2337
6251 2337 -29649 -61883 -68034 -46566 -29131 -25241 -117 34200 23346 26288 24321 29481 14614
6238 14614 -1719 -16428 -58069 -50186 -42806 -67888 -94367 -92670 -88142 -53438 -51086 -7417 9940
6225 9940 40872 56570 54192 13043 -60675 -89695 -98901 -122087 -100373 -111177 -98118 -45117
6213 -45117 -22 -11540 -60864 -62721 -49324 -42384 -71098 -48603 -28228 -12308 -41515 -68967
6201 -68967 -17391 56825 45508 54808 86515 84072 68589 43312 1714 2326 17110 18954 18028
$$ packed form
6288A5781j2209k4936J4245l3227m0504J2457K7929L2928L7722l2609j0155k5636
6276c8214J2024J2220m700J7153P3615q616m8973k3750j9676k8829j483k394j1864
6263g3487K4111K3451j0925l5840J1813J6804L1142K4494j3912K282k4832K7236
6251B337l1986l2234o151K1468J7435L890K5124L4317j0854K942j967N160j4867
6238A4614j6333j4709m1641P883P380k5082k6479J697M528L4704K352M3669J7357
6225I940L0932J5698k378m1149p3718k9020r206k3186K1714j0804J3059N3001
6213d5117M5095j1518m9324j857J3397O940k8714K2495K0375J5920k9207k7452
6201f8967N1576P4216j1317R300L1707k443j5483k5277m1598O12J4784J844r26
$$ plain form
6188 18028 -13034 -37054 -33077 -20493 5604 33174 46074 48062 22014 27246 12170 -37680
6176 -37680 -55740 -50193 -77791 -49708 -46137 -46355 -27799 -23974 -20067 21936 16970 45373 23142
6163 23142 394 17616 -28369 -69995 -71695 -66696 -46832 -46871 -76886 -47317 -49803 -44809 -13296
6150 -13296 16668 1829 -21574 -4200 4381 24853 1231 -7418 -6477 -23038 -22931 -2095 4190
6137 4190 17961 55035 55861 43656 42173 64702 61177 -15359 -35869 -48278 -57861 -65179 -42261
6124 -42261 -27478 -29161 -17943 -50297 -50622 -23888 -16593 -58627 -59196 -39890 -25884 -24950 -70466
6111 -70466 -50604 -33887 -13300 -40941 -17128 45896 38946 -18580 -6143 -26393 -22874 -9272
6099 -9272 31643 31292 -23129 -2829 40707 9879 -20016 -17890 9099 15315 -56774 -52872 -74318
$$ packed form
6188A8028l1062k4020L977J2584K6097K7570J2900J988k6048N232j5076m9850
6176c7680j8060N547k7598K8083L571k18J8556L825L907M2003m966K8403k2231
6163B3142k2748J7222m5985m1626j700M999J9864l9l0015K9569k486M994L1513
6150a3296K9964j4839k3403J7374Q581K0472k3622q649R41j6561J07K0836O285
6137D190J3771L7074Q26j2205j483K2529l525p6536k0510j2409r583p318K2918
6124d2261J4783j683J1218l2354l25K6734P295m2034n69J9306J4006R34m5516
6111g0466J9862J6717K0587k7641K3813O3024o950n7526J2437k0250L519J3602
6099i272M0915l51n4421K0300M3536l0828k9895K126K6989O216p2089L902k1446
$$ plain form
6086 -74318 -91319 -42257 25309 33118 8158 -18623 -14004 -36053 -24112 -22743 6164 66564
6074 66564 67800 7894 4346 5638 -2096 43876 62590 63297 23312 10730 26058 39284 9490
6061 9490 -11704 17150 -3258 -17313 -66702 -84803 -60459 -28607 -33525 -40370 -22744 -67826
6049 -67826 -72282 -34597 6981 -5082 -9049 -32759 -31191 -17745 9021 33268 36244 -32644 -37260
6036 -37260 -12337 15065 14789 1660 -39306 -66314 -22927 -8605 16469 38952 10019 -57583
6024 -57583 -79029 -58556 -78506 -77681 -97052 -74708 -52895 -46123 -18648 9333 -15628 -60298
6012 -60298 -68432 -60579 -46720 -1151 12431 -8934 -42287 -74021 -64258 -7795 -13649 -2417 -7159
5999 -7159 -2625 36299 30740 13874 8237 2748 -9189 -10115 -5440 -36897 -22167 -4705 21197
$$ packed form
6086g4318j7001M9062O7566P809k4960k6781M619k2049J1941J369K8907O0400
6074F6564J236n9906l548J292p734M5972J8714P07l9985j2582J5328J3226k9794
6061I490k1194K8854k0408j4055m9389j8101K4344L1852m918o845J7626m5082
6049f7826m456L7685M1578j2063l967k3710J568J3446K6766K4247K976o8888m616
6036c7260K4923K7402k76j3129m0966k7008M3387J4322K5074K2483k8933o7602
6024e7583k1446K0473j9950Q25j9371K2344K1813O772K7475K7981k4961m4670
6012f0298q134P853J3859M5569J3582k1365l3353l1734R763N6463n854J1232m742
5999g159M534L8924n559j6866n637n489j1937r26M675l1457J4730J7462K5902
$$ plain form
5986 21197 22481 15478 37217 19242 -11691 -1728 -18431 -12223 -11331 5103 2361 -360 22454
5973 22454 18633 35575 21913 -8002 -61130 -31797 -31192 -22283 -5262 6074 6321 8259 1136
5960 1136 3054 -727 -43280 -38143 -23209 -27631 17131 32745 -5864 -63607 -91611 -76157 -65195
5947 -65195 -61631 -55240 -76868 -64669 -17427 -40526 -11596 -38998 -53450 -65556 -63825 -32638
5935 -32638 -22670 -23063 -15110 -3192 -41981 -69188 -70666 -64628 -43883 -27760 -31160 -19122 -47977
5922 -47977 -63615 -66860 -57788 -41865 -55737 -37373 -1870 14493 -5642 -34785 -45114 -42267
5910 -42267 -70336 -63438 -60113 -48689 709 30712 43710 54728 42441 23652 7254 1602
5898 1602 9493 -27425 -47651 -60827 -73166 -70599 -61421 -44198 -26411 -18660 -36314 -67732 -45881
$$ packed form
5986B1197J284p003K1739j7975l0933R963j6703O208Q92J6434k742k721K2814
5973B2454l821J6942j3662k9915n3128K9333O05Q909J7021J1336K47J938p123
5960A136J918l781m2553N137J4934m422M4762J5614l8609n7743k8004J5454J0962
5947f5195L564O391k1628J2199M7242k3099K8930k7402j4452j2106J731L1187
5935c2638R968l93P953J1918l8789k7207j478O038K0745J6123l400J2038k8855
5922d7977j5638l245R072J5923j3872J8364L5503J6363k0135k9143j0329K847
5910d2267k8069O898L325J1424M9398L0003J2998J1018j2287j8789j6398n652
5898A602P891l6918k0226j3176j2339K567R178J7223J7787P751j7654l1418K1851
$$ plain form
5885 -45881 -36132 -79703 -73512 -38910 -16413 -44534 -37951 -22367 -21641 -17022 -15586 10122 28113
5872 28113 29250 -1984 -26667 -7774 15704 56366 39888 12751 -9046 -19282 -55933 -36671
5860 -36671 -28921 7984 -23399 -4123 39764 2498 -1054 8189 -9907 -81906 -78302 -93589 -134899
5847 -134899 -121113 -74603 -90441 -104999 -80856 -47833 -60330 -51675 -49739 -80765 -98683 -59880
5835 -59880 -50095 -42304 1340 -28631 -52024 -65161 -19161 18958 6720 -8939 42691 19634
5823 19634 -31924 -33727 -41000 -37623 7391 9448 30733 29150 25232 5919 -31292 -45588 -29850
5810 -29850 -12974 18099 40753 14351 4158 22377 26032 33521 50604 79506 61750 -26819
5798 -26819 -62602 -48038 4532 23160 23121 33003 6226 1704 683 -18928 -19201 -8768 -9031 -12916
$$ packed form
5885d5881R749m3571O191L4602K2497k8121O583J5584P26M619J436K5708J7991
5872B8113J137l1234k4683J8893K3478M0662j6478k7137k1797j0236l6651J9262
5860c6671P750L6905l1383J9276M3887l7266l552R243j8096p1999L604j5287m1310
5847a34899J3786M6510j5838j4558K4143L3023j2497Q655J936l1026j7918L8803
5835e9880R785P791M3644k9971k3393j3137M6000L8119j2238j5659N1630k3057
5823A9634n1558j803p273L377M5014K057K1285j583l918j9313l7211j4296J5738
5810b9850J6876L1073K2654k6402j0193J8219L655P489J7083K8902j7756q8569
5798b6819l5783J4564N2570J8628l9R882k6777m522j021j9611k73J0433k63l885
$$ plain form
5784 -12916 -5024 -679 -49356 -75385 -75403 -64655 -61040 -31295 145 -22689 -20292 38469 45160
5771 45160 70243 97491 108734 68333 59999 71028 49397 46558 39929 9044 8314 11091 23439
5758 23439 47143 36654 26893 53316 63406 49181 2624 -4587 13418 44232 35763 8536
5746 8536 7320 12174 19919 28607 14545 -16316 -28187 -47028 -30506 -4648 -8664 -26223 -59693
5733 -59693 -51862 -53653 -42119 -49988 -61418 -47393 -12516 -36092 -30808 -30460 2394 -14058 -41168
5720 -41168 -5429 27536 -1942 -13805 -12017 -32281 -76598 -55629 -75275 -93612 -90129 -39048
5708 -39048 1694 6353 -1047 -6632 -21597 -64883 -71493 -39147 -38569 -67125 -32706 -7492 -1663
5695 -1663 -24774 -74403 -91723 -83087 -65451 -75765 -87936 -53538 -2678 25086 36950 18861
$$ packed form
5784a2916P892M345m8677k6029j8J0748L615K9745L1440k2834K397N8761O691
5771D5160K5083K7248J1243m0401q334J1029k1631k839o629l0885p30K777J2348
5758B3439K3704j0489r761K6423J0090j4225m6557p211J8005L0814q469k7227
5746H536j216M854P745Q688j4062l0861j1871j8841J6522K5858m016j7559l3470
5733e9693P831j791J1534p869j1430J4025L4877k3576N284L48L2854j6452k7110
5720d1168L5739L2965k9478j1863J788k0264m4317K0969j9646j8337L483N1081
5708c9048M0742M659p400n585j4965m3286o610L2346N78k8556L4419K5214N829
5695a663k3111m9629j7320Q636J7636j0314j2171L4398N0860K7764J1864j8089
$$ plain form
5683 18861 -15397 -39099 -9877 -32027 -52098 -47099 -43319 -40034 7869 19902 14222 16626 3266
5670 3266 -26571 -23653 1980 -2110 11058 13584 27062 32861 7130 -57531 -77901 -29171 -17693
5657 -17693 -50402 -36045 8600 -10659 -42245 -61819 -40696 24603 40339 958 -27891 -22787
5645 -22787 -35926 -20317 -33659 -52813 -59633 -50948 -60924 -64963 -90887 -76612 -22225 -28992 -21940
5632 -21940 16452 30914 16529 -33894 -37960 -38269 -17174 -7044 -29254 -19369 -1753 -27495 8773
5619 8773 40733 54201 65889 62951 82379 97833 83416 61289 -5497 -51111 -27570 -25601
5607 -25601 -69528 -59798 -42103 -54930 -89764 -78048 -61640 -66909 -42123 -33242 -42622 -43917 -58046
5594 -58046 -42793 -39625 -8892 8964 33269 61981 41985 12841 25796 42153 40026 7256
$$ packed form
5683A8861l4258k3702K9222k2150k0071M999L780L285M7903J2033n680K404j3360
5670C266k9837K918K5633m090J3168K526J3478N799k5731o4661k0370M8730J1478
5657a7693l2709J4357M4645j9259l1586j9574K1123O5299J5736l9381k8849N104
5645b2787j3139J5609j3342j9154o820Q685r976m039k5924J4275N4387o767P052
5632b1940L8392J4462j4385n0423m066l09K1095J0130k2210R885J7616k5742L6268
5619H773L1960J3468J1688k938J9428J5454j4417k2127o6786m5614K3541J969
5607b5601m3927R730J7695j2827l4834J1716J6408n269K4786Q881r380j295j4129
5594e8046J5253L168L0733J7856K4305K8712j9996k9144J2955J6357k127l2770
$$ plain form
5582 7256 -16195 -4212 -12477 -1489 10584 -23929 -9677 -19741 -14206 -7741 8752 40886 -1223
5569 -1223 5814 -2204 -32249 -34281 -38084 -23881 -4074 -33749 -29424 19471 32667 -13796 -8438
5556 -8438 1152 -10802 -24424 -8350 -25134 -12483 -30191 -50138 -17056 -55833 -51458 -4096
5544 -4096 40725 46813 33679 10855 -26263 -34607 17292 45099 19992 19667 5220 18802 2792
5531 2792 -10133 -27078 11208 12723 3024 920 35492 22747 7403 -31612 -31403 -17048 -40280
5518 -40280 -37860 -43171 -47494 -64384 -92383 -32738 7091 -17298 -26113 -41712 -34318 14507 60074
5505 60074 63800 35438 33567 13969 -12538 -14700 17948 37151 22553 10574 -21022 -41698
5493 -41698 -55055 -38765 -44961 -53026 -70540 -31731 5212 2942 5876 -41120 -61914 -49231 -49499
$$ packed form
5582G256k3451J1983q265J0988J2073l4513J4252j0064N535O465J6493L2134m2109
5569a223P037q018l0045k032l803J4203J9807k9675M325M8895J3196m6463N358
5556h438R590j1954j3622J6074j6784J2651j7708j9947L3082l8777M375M7362
5544d096M4821O088j3134k2824l7118q344N1899K7807k5107l25j4447J3582j6010
5531B792j2925j6945L8286J515r699k104L4572j2745j5344l9015K09J4355k3232
5518d0280K420n311m323j6890k7999N9645L9829k4389q815j5599P394M8825M5567
5505F0074L726k8362j871j9598k6507k162L2648J9203j4598j1979l1596k0676
5493d1698j3357J6290o196q065j7514L8809L6943k270K934m6996k0794J2683k68
$$ plain form
5480 -49499 -25697 19026 23581 -16918 -5899 -6059 1397 9505 -3369 -1755 -12134 -7995 12528
5467 12528 5939 3603 -11518 -16507 -33999 21318 15062 -19269 -38070 -45039 -86904 -65804 -57295
5454 -57295 -31461 21103 51529 28830 4945 28985 39686 13095 34576 31575 33528 27965
5442 27965 2454 -10083 -43271 -60443 -23300 3793 14364 3738 -1146 -16967 -25614 -30415
5430 -30415 -35621 -32142 -20727 -13479 -9381 23228 24904 32103 66865 73170 17522 -14564 -3612
5417 -3612 13602 25381 47426 76603 46700 -9180 -46250 -49173 -48707 -47656 -52006 -27411 -53648
5404 -53648 -21108 -26537 -10402 -9369 32229 56585 41543 11173 1657 -4083 -21345 -14428 -10856
5391 -10856 -27773 -22260 -7600 -6357 -343 -9286 -7745 4697 -39739 -37779 -8100 -2510 -11339
$$ packed form
5480d9499K3802M4723M555m0499J1019j60P456Q108j2874J614j0379M139K0523
5467A2528o589k336j5121m989j7492N5317o256l4331j8801o969m1865K1100Q509
5454e7295K5834N2564L0426k2699k3885K4040J0701k6591K1481l001J953n563
5442B7965k5511j2537l3188j7172L7143K7093J0571j0626m884j5821q647m801
5430c0415n206L479J1415P248M098L2609J676P199L4762O305n5648l2086J0952
5417c612J7214J1779K2045K9177k9903n5880l7070k923M66J051m350K4595k6237
5404e3648L2540n429J6135J033M1598K4356j5042l0370r516n740j7262O917L572
5391a0856j6917N513J4660J243O014q943J541J2442m4436J960K9679N590q829
$$ plain form
5378 -11339 -1203 -8317 -1730 8653 15209 23392 -16462 -21468 2122 -4717 -27541 -41693 -62452
5365 -62452 -29664 -9395 24875 30196 39310 13295 -4948 41164 65941 27453 -14775 -29638
5353 -29638 -8216 -20080 -75913 -117826 -77677 -67664 -71268 -28104 5254 -34931 -51048 -28764
5341 -28764 -14578 -6061 20197 -1691 -46849 -65384 -63761 -32166 16451 61379 66303 7872
5329 7872 -10901 8002 -27270 -43710 -81879 -99501 -63353 -47005 -67752 -42940 -52205 -34481
5317 -34481 -24749 -38773 -66118 -57276 -42581 -3050 428 -4194 50421 69168 34717 -14590 -40675
5304 -40675 -48408 -64474 -16482 -491 12814 4302 -15843 -30185 9704 -10173 -15226 15923
5292 15923 27412 27436 27311 39909 78663 37503 -30426 -8680 -3455 -30960 -52044 -53494 -39859
$$ packed form
5378a1339J0136p114O587J0383O556Q183l9854n006K3590o839k2824j4152k0759
5365f2452L2788K0269L4270N321R114k6015j8243M6112K4777l8488m2228j4863
5353b9638K1422j1864n5833m1913M0149J0013l604M3164L3358m0185j6117K2284
5341b8764J4186Q517K6258k1888m5158j8535J623L1595M8617M4928M924n8431
5329G872j8773J8903l5272j6440l8169j7622L6148J6348k0747K4812r265J7724
5317c4481R732j4024k7345Q842J4695L9531L478m622N4615J8747l4451m9307k6085
5304d0675p733j6066M7992J5991J3305q512k0145j4342L9889j9877n053L1149
5292A5923J1489K4j25J2598L8754m1160o7929K1746N225k7505k1084j450J3635
$$ plain form
5279 -39859 -26012 -57868 -75215 -76924 -96136 -74087 -53955 -37436 -56405 -74323 -32099 -5335
5267 -5335 -7222 -3188 6690 7990 -16810 2146 9633 28094 1768 -2752 4987 7456 4594 14197
5253 14197 5679 23583 21105 -6598 -64621 -57719 -12199 -11360 -12984 -3365 -26482 -62426 -47599
5240 -47599 -30142 8369 3132 -18123 -42099 -53071 -23646 17367 5628 30971 36321 35561 58720
5227 58720 43309 -4753 -41202 -58941 9433 56808 45115 55366 38178 -7707 -65314 -59830
5215 -59830 -28385 -27155 -60196 -84165 -104896 -101161 -40180 -12943 -30005 1482 29173 22589
5203 22589 3993 -26277 -13157 6267 2795 1214 -5787 -45602 -67605 -79512 -64129 -22294
5191 -22294 -45140 -62794 -104351 -66812 -10085 -3930 -43231 -37054 -18686 18679 14479 1383
$$ packed form
5279c9859J3847l1856j7347j709j9212K2049K0132J6519j8969j7918M2224K6764
5267e335j887M034R878J300k4800J8956P487J8461k6326m520P739K469k862R603
5253A4197q518J7904k478k7703n8023O902M5520Q39j624R619k3117l5944J4827
5240d7599J7457L8511n237k1255k3976j0972K9425M1013j1739K5343N350p60K3159
5227E8720j5411m8062l6449j7739O8374M7375j1693J0251j7188m5885n7607N484
5215e9830L1445J230l3041k3969k0731L735O0981K7237j7062L1487K7691o584
5203B2589j8596l0270J3120J9424l472j581p001l9815k2003j1907J5383M1835
5191b2294k2846j7654m1557L7539N6727O155l9301O177J8368L7365m200j3096
$$ plain form
5179 1383 -13489 12197 3105 -27373 -25586 -29092 -43322 -38789 -69754 -68914 -19839 6773 -62110
5166 -62110 -70453 -50349 -59806 -52002 -8786 -52173 -75601 -70599 -63825 -55579 -55521 -55674 -64179 -117503
5152 -117503 -106110 -69494 -64359 -28311 15214 24735 6323 -39978 -70169 -80702 -64240 16196
5140 16196 25052 863 -15174 -9099 -18555 -241 -10804 -54899 -79206 -90486 -98003 -81925 -73262
5127 -73262 -73141 -83776 -61220 -42232 -18077 20895 7843 -6003 16882 16439 4984 23021 15678
5114 15678 -13915 -26447 423 3532 -54814 -99187 -96497 -82950 -40849 17388 56120 49545
5102 49545 11341 17030 -7920 5760 -12667 11918 55823 41804 22504 -7323 -18658 -33469
5090 -33469 -41679 -4345 11000 -2762 -12609 -8697 -18283 -20356 13438 37219 -16126 -44366 -43773
$$ packed form
5179A383j4872K5686r092l0478J787l506j4230M533l0965Q40M9075K6612o8883
5166f2110q343K0104r457P804M3216m3387k3428N002O774Q246N8j53q505n3324
5152a17503J1393L6616N135L6048M3525R521j8412m6301l0191j0533J6462Q0436
5140A6196Q856k4189j6037O075r456J8314j0563m4095k4307j1280p517J6078Q663
5127g3262J21j0635K2556J8988K4155L8972j3052j3846K2885m43j1455J8037p343
5114A5678k9593j2532K6870L109n8346m4373K690J3547M2101N8237L8732o575
5102D9545l8204N689k4950J3680j8427K4585M3905j4019j9300k9827j1335j4811
5090c3469q210L7334J5345j3762r847L912r586k073L3794K3781n3345k8240N93
$$ plain form
5077 -43773 -58433 -41993 -42185 -39477 -80135 -101352 -88222 -64768 -38795 -4002 -3206 -2342 -11545
5064 -11545 -32658 -32131 -23128 -42859 -36540 -7582 -30441 -83713 -22792 10999 -33207 -28713 550
5051 550 -16914 -31561 -19466 -20634 804 29442 42814 48261 11224 -1362 -1141 -29926 -42944
5038 -42944 -47289 -15399 -18959 -70554 -68334 -62312 -72442 -96488 -123534 -104492 -76841 -29091 22777
5025 22777 18968 15603 27487 36374 39712 27642 23446 1763 -3694 40143 10986 -17475 -4324
5012 -4324 -15219 -47724 -35219 -21947 581 -12688 -80522 -60991 -30416 -29125 -38551 -7579
5000 -7579 16310 28393 65393 51419 27077 -5079 -47298 -21968 -29294 -6364 10589 17475
4988 17475 41572 30689 -11768 -44826 -44067 -30914 -22999 25794 25057 2887 -12376 2797 25063
$$ packed form
5077d3773j4660J6440j92K708m0658k1217J3130K3454K5973L4793P96Q64r203
5064a1545k1113N27R003j9731O319K8958k2859n3272O0921L3791m4206M494K9263
5051E50j7464j4647J2095j168K1438K8638J3372N447l7037j2586K21k8785j3018
5038d2944m345L1890l560n1595K220O022j0130k4046k7046J9042K7651M7750N1868
5025B2777l809l365J1884Q887L338j2070m196k1683n457M3837k9157k8461J3151
5012d324j0895l2505J2505J3272K2528j3269o7834J9531L0575J291r426L0972
5000g579K3889J2083L7000j3974k4342l2156m2219K5330p326K2930J6953O886
4988A7475K4097j0883m2457l3058P59J3153P915M8793p37k2170j5263J5173K2266
$$ plain form
4975 25063 52737 28748 14968 -19340 -46092 -64978 -47713 -26645 -2369 21071 -1041 2111
4963 2111 33951 -5414 -29975 -10771 18632 63539 42531 24881 43561 23590 -4387 4135
4951 4135 8555 -10228 32326 53571 60804 38957 16567 32655 53948 65049 43182 4679
4939 4679 -55331 -65376 -26437 -27565 -48940 -50978 -33360 -28035 -47952 -37384 -7103 28602 16940
4926 16940 -15291 2465 -15966 -56586 -29066 40210 35574 3132 26428 71216 33423 5550
4914 5550 770 -10247 -28765 -13058 -36138 -40898 -32913 -27979 33871 31054 11291 46301 41219
4901 41219 -7061 -22349 6913 13986 -4280 -18502 -61153 -91956 -70808 -66017 -43982 -43172 -59381
4888 -59381 -27108 -44336 -72596 -76714 -79638 -56055 -18491 -3351 -28838 -38993 -59079 -36759
$$ packed form
4975B5063K7674k3989j3780l4308k6752j8886J7265K1068K4276K3440k2112L152
4963B111L1840l9365k4561J9204K9403M4907k1008j7650J8680j9971k7977Q522
4951D135M420j8783M2554K1245P233k1847k2390J6088K1293J1101k1867l8503
4939D679o0010j0045L8939j128k1375k038J7618N325j9917J0568L0281L5705j1662
4926A6940l2231J7756j8431m0620K7520O9276m636l2442K3296M4788l7793k7873
4914E550m780j1017j8518J5707k3080m760P985M934O1850k817j9763L5010n082
4901D1219m8280j5288K9262P073j8266j4222m2651l0803K1148M791K2035Q10j6209
4888e9381L2273j7228k8260m118k924K3583L7564J5140k5487j0155k0086K2320
$$ plain form
4876 -36759 -23773 -13095 -6732 13751 28133 10520 39676 20609 -32688 -13473 -10270 -18800
4864 -18800 14326 15153 -7429 8419 37435 11202 -12814 -23342 24730 55393 70671 64418
4852 64418 22645 26486 57305 29191 -10011 -1954 25086 14298 25281 19435 -3463 -18355
4840 -18355 14084 26380 42991 53739 59613 64802 68029 50232 29675 11256 4241 -3882 -47328
4827 -47328 -50610 -68119 -48048 -45473 -3996 11718 34809 51861 54882 32156 33312 42117 50969
4814 50969 56435 55849 81292 53309 12565 -20080 -5438 16012 25182 -29701 -33652 5557 31434
4801 31434 11462 -26416 -37269 -45979 -84906 -90585 -76881 -63067 -43396 -11486 17926 -43689
4789 -43689 -66787 -64601 -65795 -71671 -60762 -55744 -71587 -60148 -25063 -26804 -79334 -103108 -79133
$$ packed form
4876c6759J2986J0678O363K0483J4382j7613K9156j9067n3297J9215L203q530
4864a8800L3126Q27k2582J5848K9016k6233k4016j0528M8072L0663J5278o253
4852F4418m1773L841L0819k8114l9202Q057K7040j0788J0983n846k2898j4892
4840a8355L2439J2296J6611J0748N874N189L227j7797k0557j8419p015q123m3446
4827d7328l282j7509K0071K575M1477J5714K3091J7052L021k2726J156Q805Q852
4814E0969N466n86K5443k7983m0744l2645J4642K1450R170n4883l951L9209K5877
4801C1434j9972l7878j0853q710l8927n679J3704J3814J9671L1910K9412o1615
4789d3689k3098K186j194n876J0909N018j5843J1439L5085j741n2530k3774K3975
$$ plain form
4776 -79133 -53349 -45005 -44725 -52870 -41984 -38404 -28200 16246 50008 49630 28045 26685 63635
4763 63635 39740 57424 35273 -30884 -33923 -48688 -45716 -23483 -14209 -16181 -30745 -10661 -11600
4750 -11600 -35795 -12691 -5629 18580 18487 -20825 -65655 -69470 -90044 -99106 -47902 -1164 2069
4737 2069 -16439 -27243 -6133 10847 19056 25656 36845 68658 67148 35547 -2187 -13569 -28122
4724 -28122 -30201 -72065 -83610 -61159 -42555 -39435 -69140 -50086 -37114 -24791 275 41950
4712 41950 27583 -23442 -38453 -33381 -66631 -20259 -10397 -43302 -33220 -43245 -70869 -62576
4700 -62576 -31953 40035 -6044 -45318 -40205 -31864 -20821 15956 37418 31734 822 517 16886
4687 16886 13551 -8713 -23076 -9865 10567 31749 -29097 -30457 316 1922 18507 16544 10248
$$ packed form
4776g9133K5784Q344K80q145J0886L580J0204M4446L3762l78k1585j360L6950
4763F3635k3895J7684k2151o6157l039j4765K972K2233R274j972j4564K0084r39
4750a1600k4195K3104P062K4209r3l9312m4830l815k0574r062N1204M6738L233
4737B069j8508j0804K1110J6980Q209O600J1189L1813j510l1601l7734j1382j4553
4724b8122k079m1864j1545K2451J8604L120k9705J9054J2972J2323K5066M1675
4712D1950j4367n1025j5011N072l3250M6372R862l2905J0082j0025k7624Q293
4700f2576L0623P1988m6079l9274N113Q341J1043L6777K1462n684l0912l05J6369
4687A6886l335k2264j4363J3211K0432K1182o0846j360L0773J606J6585j963o296
$$ plain form
4674 10248 39989 68877 35684 8935 -11995 6049 -4752 -28807 -12570 -15779 -2958 -8124
4662 -8124 8598 -7016 5850 36374 38694 30527 41092 28488 54613 69540 48592 4424
4650 4424 -37440 -18367 -27117 -18321 -23974 6534 1082 -28792 -46080 -29796 -34657 -42480 -18442
$$ packed form
4674A0248K9741K8888l3193k6749k0930J8044j0801k4055J6237l209J2821n166
4662h124J6722j5614J2866L0524K320q167J0565j2604K6125J4927k0948m4168
4650D424m1864J9073q750Q796n653L0508n452k9874j7288J6284m861p823K4038
$$ [...]
##END NTUPLES=NMR SPECTRUM
##END=
