##TITLE=Analysis number 313809
Compound Code ac 29603
Project Code adrs
Chemist Name flurochem
##JCAMPDX= 6.0         $$ Bruker NMR JCAMP-DX V2.0
##DATA TYPE= NMR SPECTRUM
##DATA CLASS= NTUPLES
##ORIGIN= Bruker BioSpin GmbH
##OWNER= NMR
$$ XWIN-NMR		Version 3.5
$$ Thu Sep 22 10:30:12 2005 GMT Daylight Time (UT+1h)  MAYBRIDGE\NMR@NMR_250MHZ
##.OBSERVE FREQUENCY= 250.131544655141
##.OBSERVE NUCLEUS= ^1H
##.ACQUISITION MODE= SIMULTANEOUS (DQD)
##.ACQUISITION SCHEME= undefined
##.AVERAGES= 16
##.DIGITISER RES= 18
##SPECTROMETER/DATA SYSTEM= dpx250
##.PULSE SEQUENCE= zg30
##.SOLVENT NAME= CDCl3
##.SHIFT REFERENCE= (INTERNAL, CDCl3, 0, 16.522)
##AUDIT TRAIL= $$ (NUMBER, WHEN, WHO, WHERE, WHAT)
$$ ##TITLE= Audit trail, XWIN-NMR		Version 3.5
$$ ##JCAMPDX= 5.01
$$ ##ORIGIN= Bruker BioSpin GmbH
$$ ##OWNER= NMR
$$ C:\u/data/dgb/nmr/ADRS/9800/pdata/1/auditp.txt
$$ ##AUDIT TRAIL=  $$ (NUMBER, WHEN, WHO, WHERE, WHAT)
(   1,<2005-09-22 10:29:54.14 +100>,<MAYBRIDGE\NMR>,<NMR_250MHZ>,
      <created by zg, POWCHK disabled, PULCHK disabled
       configuration hash MD5:
       62 19 C7 07 E1 42 D1 B7 37 6C 3D D0 77 39 F9 E6
       data hash MD5: 64K
       6F 5E CB E3 AF AA 1C 84 A6 28 48 D1 8B 85 FD E5>)
(   2,<2005-09-22 10:30:05.08 +100>,<MAYBRIDGE\NMR>,<NMR_250MHZ>,
      <Start of raw data processing
       ef LB = 0.3 FT_mod = 6 PKNL = 1 SI = 32K 
       data hash MD5: 32K
       B3 27 91 C3 BE 6D 52 05 C5 B9 A0 3D D6 2A C3 64>)
(   3,<2005-09-22 10:30:07.44 +100>,<MAYBRIDGE\NMR>,<NMR_250MHZ>,
      <apk 
       data hash MD5: 32K
       4E 8C 6A 85 CB ED F6 1A D9 B0 C2 53 2C AD A8 1B>)
(   4,<2005-09-22 10:30:08.17 +100>,<MAYBRIDGE\NMR>,<NMR_250MHZ>,
      <abs ABSG = 5 
       data hash MD5: 32K
       B2 E3 CA 84 08 3C D3 1E 46 16 98 81 61 72 31 3F>)
$$ ##END=
$$ 
$$ hash MD5
$$ D0 72 B6 0E 69 CC DA 05 98 D0 F2 DE 49 F8 84 23
##$RELAX= 
##$RELAX= 
##$RELAX= 
##$RELAX= 
##$RELAX= 
##$RELAX= 
##$RELAX= 
$$ Bruker specific parameters
$$ --------------------------
##$DU= <C:\u>
##$EXPNO= 9800
##$NAME= <ADRS>
##$PROCNO= 1
##$TYPE= <nmr>
##$USER= <dgb>
##$AMP= (0..31)
100 100 100 100 100 100 100 100 100 100 100 100 100 100 100 100 100 100 
100 100 100 100 100 100 100 100 100 100 100 100 100 100 
##$AQSEQ= 0
##$AQ_mod= 3
##$AUNM= <au_zg>
##$AUTOPOS= <8 >
##$BF1= 250.13
##$BF2= 250.13
##$BF3= 250.13
##$BF4= 250.13
##$BF5= 500.13
##$BF6= 500.13
##$BF7= 500.13
##$BF8= 500.13
##$BYTORDA= 1
##$CFDGTYP= 0
##$CFRGTYP= 5
##$CHEMSTR= <none>
##$CNST= (0..31)
1 1 145 1 1 1 1 1 1 1 1 1 1 1 1 1 1 1 1 1 1 1 1 1 1 1 1 1 1 1 1 1 
##$CPDPRG= <>
##$CPDPRG1= <>
##$CPDPRG2= <>
##$CPDPRG3= <>
##$CPDPRG4= <mlev>
##$CPDPRG5= <mlev>
##$CPDPRG6= <mlev>
##$CPDPRG7= <mlev>
##$CPDPRG8= <mlev>
##$CPDPRGB= <>
##$CPDPRGT= <>
##$D= (0..31)
0 1 0 0 0 0 0 0 0 0.06 0 0 0 0 0 0 0.0002 0 0 0 0 0 0 0 0 0 0 0 0 0 0 
0 
##$DATE= 1127381393
##$DBL= (0..7)
120 120 120 120 120 120 120 120 
##$DBP= (0..7)
150 150 150 150 150 150 150 150 
##$DBP07= 0
##$DBPNAM0= <>
##$DBPNAM1= <>
##$DBPNAM2= <>
$$ [...]
##$SUBNAM7= <"">
##$SUBNAM8= <"">
##$SUBNAM9= <"">
##$SW= 20.6930455092707
##$SWIBOX= (0..15)
0 0 3 0 0 0 0 0 0 0 0 0 0 0 0 0 
##$SW_h= 5175.983436853
##$TD= 65536
##$TD0= 1
##$TE= 294.16
##$TE2= 300
##$TE3= 300
##$TEG= 300
##$TL= (0..7)
0 120 120 120 120 120 120 120 
##$TP= (0..7)
150 150 150 150 150 150 150 150 
##$TP07= 0
##$TPNAME0= <>
##$TPNAME1= <>
##$TPNAME2= <>
##$TPNAME3= <>
##$TPNAME4= <>
##$TPNAME5= <>
##$TPNAME6= <>
##$TPNAME7= <>
##$TPOAL= (0..7)
0.5 0.5 0.5 0.5 0.5 0.5 0.5 0.5 
##$TPOFFS= (0..7)
0 0 0 0 0 0 0 0 
##$TUNHIN= 0
##$TUNHOUT= 0
##$TUNXOUT= 0
##$USERA1= <user>
##$USERA2= <user>
##$USERA3= <user>
##$USERA4= <user>
##$USERA5= <user>
##$V9= 5
##$VALIST= <valist>
##$VCLIST= <CCCCCCCCCCCCCCC>
##$VD= 0
##$VDLIST= <DDDDDDDDDDDDDDD>
##$VPLIST= <PPPPPPPPPPPPPPP>
##$VTLIST= <TTTTTTTTTTTTTTT>
##$WBST= 1024
##$WBSW= 4
##$XGAIN= (0..3)
0 0 0 0 
##$XL= 0
##$YL= 0
##$YMAX_a= 521842
##$YMIN_a= -355281
##$ZGOPTNS= <>
##$ZL1= 120
##$ZL2= 120
##$ZL3= 120
##$ZL4= 120
##$ABSF1= 16.522
##$ABSF2= -4.171173
##$ABSG= 5
##$ABSL= 3
##$ALPHA= 0
##$AQORDER= 0
##$ASSFAC= 0
##$ASSFACI= 0
##$ASSFACX= 0
##$ASSWID= 0
##$AUNMP= <proc_1d>
##$AZFE= 0.1
##$AZFW= 0.1
##$BCFW= 0
##$BC_mod= 0
##$BYTORDP= 0
##$COROFFS= 0
##$CY= 12.5
##$DATMOD= 1
##$DC= 0
##$DFILT= <>
##$DTYPP= 0
##$F1P= 14.0000005364418
##$F2P= -0.99999901652339
##$FCOR= 0.5
##$FTSIZE= 32768
##$FT_mod= 6
##$GAMMA= 0
##$GB= 0
##$INTBC= 1
##$INTSCL= 1
##$ISEN= 128
##$LB= 0.3
##$LEV0= 0
##$LPBIN= 0
##$MAXI= 10000
##$MC2= 0
##$MEAN= 0
##$ME_mod= 0
##$MI= 0
##$NCOEF= 0
##$NC_proc= -5
##$NLEV= 6
##$NOISF1= 0
##$NOISF2= 0
##$NSP= 0
##$NTH_PI= 0
##$NZP= 0
##$OFFSET= 16.522
##$PC= 1
##$PHC0= -76.05649
##$PHC1= 2.798888
##$PH_mod= 1
##$PKNL= yes
##$PPARMOD= 0
##$PSCAL= 4
##$PSIGN= 0
##$REVERSE= no
##$SF= 250.13
##$SI= 32768
##$SIGF1= 0
##$SIGF2= 0
##$SINO= 400
##$SIOLD= 32768
##$SREGLST= <1H.CDCl3>
##$SSB= 0
##$STSI= 32768
##$STSR= 0
##$SW_p= 5175.98343685301
##$SYMM= 0
##$S_DEV= 0
##$TDeff= 65536
##$TDoff= 0
##$TI= <Analysis number 999999
Compound Code 99
Book Reference 9
Project Code 9>
##$TILT= no
##$TM1= 0
##$TM2= 0
##$TOPLEV= 0
##$USERP1= <user>
##$USERP2= <user>
##$USERP3= <user>
##$USERP4= <user>
##$USERP5= <user>
##$WDW= 1
##$XDIM= 32768
##$YMAX_p= 485170880
##$YMIN_p= -736338
$$ End of Bruker specific parameters
$$ ---------------------------------
##NTUPLES= NMR SPECTRUM
##VAR_NAME=  FREQUENCY,     SPECTRUM/REAL,   SPECTRUM/IMAG
##SYMBOL=    X,             R,               I
##VAR_TYPE=  INDEPENDENT,   DEPENDENT,       DEPENDENT
##VAR_FORM=  AFFN,          ASDF,            ASDF
##VAR_DIM=   32768,         32768,           32768
##UNITS=     HZ,            ARBITRARY UNITS, ARBITRARY UNITS
##FACTOR=    0.157963299565203, 1,           1
##FIRST=     4132.6476996994, 0,             0
##LAST=      -1043.33573715361, 0,           0
##MIN=       -1043.33573715361, -736338,     0
##MAX=       4132.6476996994, 485170880,     0
$$ Real data points
##PAGE= N=1
##DATA TABLE= (X++(R..R)), XYDATA
$$ [...]
22276a16430N6776j4302j774l6850j03294M8702J02219R7537n7131k0416Q240
22265c6723R3064N0363o3817r9736K0520j3504m9478P6502Q5843k2128j08515
22254f7609k8748n8843j2653N7461K1868Q4170m2694o2205M4304J5565k0154l0543
22242a00081o596J2688L7970n279L5897K3145M1544K9569o5849l2726p0376r4844
22230a94938Q956p897J3593Q399O409P4257R6858o362j08407r680J19263J31801
22218A32252L2669k26979r48Q4399M8874K8944N8486r847l1992m1194n3518r8261
22206g7115L4083M1040P6934P9150j11609n3548m3760k2764O7776J15644n2080
22195E3751q4656M9290O5575Q2845J5602q5909j7226K9665J167j03558l2701k8548
$$ y = [-116430, -59654, -73956, -75730, -112580, -215874, -167172, -64953, 32584, -24547, -44963, -36723, 56341, 106704, 42887, -56849, -36329, -49833, -99311, -22809, 63034, 40906, -67609, -96357, -155200, -167853, -110392, -88524, -4354, -47048, -109253, -64949, -49384, -69538, -100081, -106677, -93989, -56019, -61298, -25401, -2256, 39288, 68857, 3008, -29718, -100094, -194938, -185982, -193879, -180286, -171887, -165478, -91221, 5637, -725, -109132, -118812, 451, 132252, 164921, -62058, -63006, 21393, 70267, 99211, 157697, 147850, 115858, 74664, 21146, -77115, -43032, -1992, 74942, 154092, 42483, -11065, -54825, -77589, -9813, 105831, 53751, -30905, 18385, 83960, 166805, 182407, 96498, 79272, 108937, 110104, 6546, -26155, -54703]
22183e4703n8788K0281p820J1193m6828L5377L3147L9204M8910k1560o3316l8991
22171a03894r662N3792K1626J2155N6952Q1117J5040m3467o1338p6463m4044l5860
22159a34046L4944Q3177L148m2266r368M9813L2542K2654k6060j17110m144K6129
22147h0587L2790N3628m2639R148m5130j8248q16k0366k5509r2J12197J0667L4065
22134A9108J3517K0746l5737l7739N1066L3365J3511J8872m1644m223P156J6484
22122G4482p0381p6074L5880m6051m6724O233N0121j7646K5883p5993J6753Q2599
22110d0918M4541M8571K5707r0523n8745P0495J10103P555o4671o8023N5898L2696
22098G2686k9216o1443j816N44J5721j0774n2136k1535m6595l0140N9795Q1982
$$ y = [-54703, -113491, -93210, -101030, -89837, -136665, -101288, -68141, -28937, 19973, -1587, -64903, -103894, -113556, -59764, -38138, -25983, 30969, 112086, 127126, 83659, 22321, -54142, -98186, -134046, -99102, -15925, -12777, -55043, -64411, -14598, 17944, 40598, 14538, -102572, -106716, -80587, -47797, 5831, -36808, -27660, -72790, -91038, -91854, -112220, -137729, -137821, -25624, -14957, 19108, 32625, 53371, 17634, -20105, 30961, 64326, 77837, 96709, 55065, 50842, 57998, 74482, 4101, -71973, -36093, -82144, -128868, -122635, -72514, -90160, -64277, -140270, -123517, -40918, 3623, 52194, 77901, -12622, -71367, -872, 109231, 116786, 52115, -15908, 39990, 72686, 43470, -17973, -19789, -19245, -3524, -14298, -66434, -87969, -134564, -164704, -104909, -22927]
22086b2927L5995M1747P7613P2609m2262j05817l4298k528K5497N3831q0909M7066
22074F5617M852J6312p3814k3111M2564j3112L213k9613j5708l8945J2500O7585
22062A8340j10501o6458N8325M3092P5499k7037p7515j0568m1217N016O3582N8780
22050a0662J2980O269r3726k7735k8596J5567J13110Q9845r033n0228k1282n8003
22038f1494r6541P1671N6345O6361j5568R4343K9626j47129o3639o8824K6553
22027a08296n9053k138K8266J4573O1377K6268r935j0317l1255j06114J51625
22016d4999N9247j3510L4133L5140P1015m0914j06951j7133O969j21130j19874
22005b58007J17416j6042P890P5321L1330N736n4256p9114L6052L2430k7131M5973
$$ y = [-22927, 13068, 54815, 132428, 205037, 162775, 56958, 22660, 20132, 45629, 99460, 18551, 65617, 70469, 86781, 12967, -10144, 32420, 19308, 22521, -7092, -22800, -61745, -49245, 18340, -92161, -158619, -100294, -57202, 18297, -8740, -86255, -96823, -138040, -133024, -69442, -10662, 2318, 8587, -85139, -112874, -141470, -125903, -12793, 77052, 68019, 17791, -3491, -61494, -158035, -86364, -30019, 36342, 20774, 115117, 144743, -2386, -66025, -134849, -108296, -167349, -169487, -141221, -126648, -65271, -39003, -48938, -59255, -90510, -196624, -44999, 14248, 738, 34871, 70011, 141026, 100112, -6839, -23972, -17003, -138133, -258007, -140591, -156633, -148743, -73422, -42092, -36356, -90612, -169726, -133674, -101244, -128375, -82402]
21993h2402R5325J26853k0068q0578O0353L7195l440J6540j84715j26255P7527
21982h3665J13921j8471k1504o8989n9643L8771Q9092j0221O166Q48j0705L3176
21970H776o1119J9865L3423L6803K7114M7423k1595n301K4639M117m3700n3615
21958A6830r575n6884j0569J2694q4832J2586Q2757m5996K2824j5895J122M9892
21946b5046N7543O3613l8396m3496l2950n5400n2710p4732L0327L6698Q021N7058
21934f9470l263k188O6937m7172l9876Q2646J756l3301m360P2822k2744K377l5598
21921c1434j6973p8983J7809P8401N0432M306J2864O0132o901p0243j24140k2454
21909a27184M2941R243J0052m0583R533m3209J5726J2396N7062M8653j1220J33751
$$ y = [-82402, 12923, 139776, 119708, 39130, 99483, 136678, 133238, 149778, -34937, -161192, -83665, 30256, 11785, -9719, -78708, -138351, -99580, -10488, -20709, -14543, -13695, -24400, 8776, -52343, -32478, 945, 37748, 64862, 112285, 90690, 85389, 110028, 114145, 70445, 16830, 7255, -49629, -60198, -47504, -132336, -119750, -36993, -82989, -60165, -76060, -74938, -25046, 32497, 96110, 57714, 14218, -18732, -74132, -126842, -201574, -171247, -134549, -126528, -69470, -72733, -74921, -7984, -55156, -95032, -12386, -10630, -43931, -48291, 24531, 1787, 4164, -31434, -48407, -127390, -109581, -31180, 19252, 23558, 36422, 96554, 89653, 19410, -104730, -127184, -84243, -75000, -64948, -105531, -95998, -139207, -123481, -111085, -54023, -5370, -16590, 117161]
21897A17161l4935j52471n8409J9395M8136Q3813K5258l6182K1509L6936r9636
21886b9425j4369l9883M7174J1749l5029q2999O4682O9687r5074j5794L5333R1182
21874G234J8429l2854n3882P4626o755K7283l2300o9002k3297J5097K7248N7419
21862I246J6139k249N1497n6147l2173M1017k003j3182r5397O5174J48882p6346
21850E4458n3010q1407j4510N2259J07072j0283p0204j9591o6282J79L996N6709
21838d0614J18889p5764j16166M3447M8491o5384N6074Q235k0958m5890m5034
21827a34674O8929P451o9500K6634P901J00940R3822p1174l8674j6748K3309N698
21815C914R789J6997M3944J40215m5570o4329o2508m7514l1389m0567o0330O5444
$$ y = [117161, 82226, -70245, -128654, -109259, -61123, 22690, 47948, 11766, 33275, 70211, -29425, -43794, -83677, -36503, -24754, -59783, -142782, -78100, -8413, -103487, -119281, -83948, 7234, 25663, -7191, -61073, 13553, 6798, 34081, 1781, -67221, -90518, -75421, -48173, 9246, 25385, 23136, 74633, 18486, -13687, 27330, 25327, 12145, -83252, -18078, 130804, 54458, 1448, -79959, -94469, -42210, 64862, 54579, -15625, -35216, -101498, -101319, -97323, -40614, 78275, 2511, -113655, -70208, -21717, -87101, -31027, -22792, -43750, -89640, -134674, -65745, -58294, -127794, -101160, -93259, 7681, 101503, 30329, -8345, -25093, -1784, 3914, 13703, 30700, 74644, 214859, 169289, 104960, 42452, -5062, -36451, -77018, -137348, -71904]
21803g1904O8352J1104o4973n0155J0838J40848N6401J0248p735k6316N5374n0269
21791H1813m2718J6699M5924m7216r8031J9246O5593j6530j39368q0595K4631
21780a70552l8268K3315J14029P6036M1977k8382p4692j596L6365P3698o0515
21769h585k8959l5995l5938M0894J3274J19379R763l7958p08m7716j658l919o1255
21756g9381j2716N2846J53937J41033l1158j09252q8226n6968L8459O5810O2710
21745A37094l4026j57400j09395O1195O85J8527j7164p9683j964O391Q4006J38597
21733D6863k8183n3817Q5420l3692k8332k7925O3649m3244j10358l150J24324
21722h445O0964k9696M5398J8344o1076l5382m2988K0770n1438N9994J29289J7893
$$ y = [-71904, -3552, 7552, -57421, -107576, -96738, 44110, 100511, 110759, 103024, 76708, 132082, 81813, 39095, 55794, 101718, 54502, -43529, -24283, 41310, 24780, -114588, -195183, -170552, -208820, -185505, -71476, 4560, 46537, 18155, -56537, -58133, -21768, 51930, -8585, -37544, -73539, -109477, -68583, -55309, 64070, 73833, 35875, 35167, -12549, -14207, -18126, -79381, -92097, -39251, 114686, 255719, 224561, 115309, 27083, -29885, 8574, 74384, 137094, 103068, -54332, -163727, -102532, -101847, -83320, -100484, -180167, -182131, -175740, -91734, 46863, 18680, -35137, 50283, 16591, -11741, -39666, 23983, -19261, -129619, -132769, -8445, 52519, 22823, 68221, 86565, 25489, -9893, -52881, -32111, -83549, -23555, 105734, 123627]
21710A23627l7985j06266J24580M1615m4766j02718l8004k7491N9207J9748m6898
21699c5351n1371k8872J638L8110J4655L6350K0K8083K1481n5209j02298p1619
21687b04383k1230O7045M8804k2221J09721N5650N8929k8757n9312n7172O414
21676d6512p4719P922J17049M0963l565j1540l394j5887j9186l4604n594n9884
21664a08951o1945P8978O8955m6835M6174O3836o210K5835P6469L0826n2717q1005
21652C3410j61166p2969m6050N8251Q6051J6337M0897Q2968l4395o6340L631m338
21640f3713l4895l0263L0812N2653O8651p979o1236M0208M1263M3592J1119j6026
21628G4186L8038r3755k06891q131j4475J73623P0890n2393N4395K7924k4911
$$ y = [123627, 85642, -20624, 103956, 145571, 100805, -1913, -39917, -67408, -8201, 11547, -35351, -86722, -115594, -113956, -75846, -61191, -24841, -24821, 3262, 24743, -30466, -132764, -204383, -225613, -158568, -109764, -131985, -22264, 33386, 92315, 63558, 4246, -52926, -46512, -121231, -113309, 3740, 44703, 41138, 29598, 26204, 10317, -8869, -43473, -49067, -108951, -170896, -91918, -22963, -69798, -23624, 40212, 34002, 59837, 136306, 167132, 114415, 33410, -127756, -200725, -246775, -188524, -102473, -86136, -45239, 37729, 3334, -63006, -59375, -63713, -98608, -128871, -98059, -45406, 23245, 15266, -45970, -5762, 35501, 79093, 90212, 74186, 112224, 18469, -188422, -196553, -211028, -37405, 33485, -18908, 35487, 63411, 38500]
21617C8500k4164k7482M8100M1085J06430r1719j86513M0257J35382k1509k1573
21606C6794j9589J1754J8460N7395J20556J1352p2614m3567n6181p369K5067r130
21594G2928k1728K596J8280p2318q4553j0984O907r389M3586K073K0204l0541
21582f2939J6675M0509R3003N7037o4543j00380p0605n2701J27310L6328j05014
21571h5320q0048N1996j6516O2935Q6543N2207k6303m4403r25J60658o3437j71580
21559g4193o7751N1836o92N4400L789K084N9848L4920l1589J3791R306J1580O0441
21546A27770q4586o4842j33245o6120R3769O2409m2288L1108N5652m3381r4455
21535a58209L7025M4054K4011k8975k1578P7419N6256M7347J4963J5325k3550
$$ y = [38500, 14336, -13146, 34954, 76039, 182469, 90750, -95763, -55506, 79876, 58367, 36794, 17205, 28959, 47419, 104814, 225370, 236722, 164108, 120541, 64360, 56991, 82058, 72928, 51200, 53796, 72076, -242, -84795, -95779, -88872, -98261, -54675, -52602, -32398, -62939, -46264, -5755, 87248, 144285, 79742, -20638, -91243, -143944, -16634, 19694, -85320, -165368, -113372, -129888, -66953, 19590, 71797, 45494, 1091, 166, 160824, 97387, -74193, -141944, -90108, -90800, -36400, -32611, -30527, 29321, 64241, 32652, 46443, 55749, 67329, 127770, 43184, -21658, -154903, -221023, -127254, -64845, -107133, -76025, -20373, -63754, -158209, -121184, -77130, -53119, -82094, -103672, -26253, 30003, 77350, 92313, 107638, 84088]
21524H4088n3828k8188k2402j0737J7658p0726j723p1527p2403R5094P0714m4657
21512a08637K3294N2220M521O9935Q901L7066L5920j3584M1545J9972j81509j17983
21500a28339M004K7518J48944Q2078L1759j00453j29093n0942k6038K6919k1026
21489a34669o647M3519N7569J7022l9774k9821N0208N1694q616L8183j6866l4929
21477a3127L9449j1839l068R095J426m9030j8823k1252l056q5049j6654l6755
21465b08683N5692Q0759K5210O4553P1922m0126n2119n07R5171J8529m4118n523
21453F0760l5270J1962m5209k4152L0646N4849o470L4789k4495o4526o984l2846
21441d6946j10395O2114Q3056J5701M5194m741r5277p0970J0814L0363J3987O7417
$$ y = [84088, 30260, 2072, -20330, -31067, -13409, -84135, -85858, -157385, -229788, -134694, -63980, -108637, -85343, -33123, -28602, 41333, 50234, 87300, 123220, 109636, 151181, 171153, -10356, -128339, -124335, -96817, 52127, 134205, 165964, 65511, -63582, -114524, -140562, -113643, -134669, -141316, -97797, -40228, -23206, -62980, -92801, -42593, 9101, 485, 38668, 21802, -13127, 26322, 14483, 11415, 20510, 21936, -27094, -45917, -67169, -70225, -155274, -171928, -208683, -152991, -72232, -47022, 17531, 89453, 49327, -2792, -3299, 91872, 110401, 66283, 60760, 25490, 37452, -7757, -31909, -1263, 53586, 47116, 81905, 57410, -7116, -14100, -46946, -157341, -95227, -12171, 3530, 48724, 43983, -51294, -122264, -111450, -81087, -67100, 317]
21429C17k3702J1709n128n1510l775L9416L2011m5635J3555K1539q118M9362j00254
21416g0213m079n4942r039j5405m3687J10833J04451k2295K428k5210n4011k2739
21404a03908m4186K1010k0847j04134L2659J29689M8403O6464m8152p6260o4419
21393a63681m9740l7912m8742O2382J1072j414J12932Q0048Q5860m93m1761k3926
21381a5375l666n6905j2421L9081l8237K7861Q0557J6762j4381n2852R973Q969
21369a0634p703O8254K9776L4463K0464K3180k3825o6950m3076o1658k5743k0463
21357h3915m5945J07584M9497o7848j12970m6467N4112Q8621P6748L3388p5860
21346b3055J122l493K8479m3735n6805M9648J17339R2966j983o8916p6529o9995
$$ y = [317, -23385, -11676, -16804, -68314, -72089, -32673, -662, -46297, -32742, -11203, -19321, 30041, -70213, -74292, -129234, -138273, -153678, -197365, -86532, 17919, -4376, -1948, -27158, -81169, -103908, -148094, -127084, -147931, -252065, -219406, -89717, -41314, 25150, -23002, -99262, -163681, -213421, -251333, -300075, -237693, -226621, -228035, -115103, -35055, 50805, 50312, 8551, -15375, -19041, -75946, -88367, -49286, -87523, -59662, 20895, 37657, 23276, -29576, -19603, -10634, -18337, 49917, 79693, 114156, 134620, 157800, 133975, 67025, 23949, -37709, -63452, -83915, -129860, -22276, 27221, -40627, -153597, -200064, -145952, -57331, 19417, 52805, -23055, -21933, -25426, 3053, -40682, -97487, -47839, 69500, 162466, 160483, 91567, 15038, -54957]
21334e4957L047K7015R5788k2105n181p0306O544J17904K9608j12654j68368m1339
21322a95004l4916K3503P7576J03182R8057m688p7223N1677J13860m1014j43114
21311b8104O2445N5213L0923l3647m2092L4338L1444q2568o489k0798j01328j8656
21299a19319l8000O0192L0413q220L1772N7028Q1119n225p7841l83N76L85p1r08
21285A1518J00054K8373k0180k5329J3473L5895L63m6716j87313o8567J29958
21274b8471Q7109K1895o707p0730o1042N7087K0915l8563o5778J972O0887J4127
21262g299M513J7195L5813L5474m5916k9260M514n0348p1476q4438J09216L8309
21250d3703P5550K5154l8148o1229l2479o347o1126P637m443L478P0487M8102
$$ y = [-54957, -51910, -24895, 70893, 48788, 43607, -26699, -20155, 97749, 127357, 14703, -153665, -195004, -229920, -206417, -128841, -25659, 72398, 67710, -9513, 42164, 156024, 115010, -28104, 34341, 89554, 120477, 86830, 44738, 79076, 110520, 27952, 21463, 665, -100663, -119319, -157319, -97127, -66714, -74934, -43162, 13866, 94985, 89760, 11919, 11536, 12112, 12497, 12426, 11518, 111572, 139945, 119765, 94436, 107909, 143804, 144167, 97451, -89862, -158429, -28471, 58638, 80533, 73826, 3096, -57946, -859, 20056, -18507, -84285, -82313, -21426, -7299, -2786, 14409, 50222, 85696, 39780, 10520, 15034, -35314, -106790, -191228, -82012, -43703, 31847, 57001, 18853, -42376, -74855, -81202, -142328, -134691, -139134, -135656, -65169, -17067]
21238a7067m575J06010n9031q3778M0401p031m2365N7146L5977n8746r0998k0008
21226a44065M161L2691m0658m2418L6982M8170Q0023M1581K0030r5256N393j9169
21214g2535J9193J12864P8440q7219q1644n4625p202K9585O2154N1400M7021J25
21202I7557l7285n5612O639R955k0749m4990K8281k4634L2644j7150P0695J9579
21190F4930O555q7829L504K2282j9411k987M3472j05277N7067R8147K2984q283
21178I5154l0510o9347K2204K3154j15908o6855p1518J93475P7170p5564K1500
21167B955K5109q7799j01221k7193J17778Q7701k2623o1162j39336j5796J09088
21156a12499Q2769M459O7454J3484q6517j37389p0370L8400Q7623Q6109J39008
$$ y = [-17067, -21642, 84368, 25337, -58441, -18040, -25071, -67436, -10290, 25687, -33059, -124057, -144065, -139904, -107213, -147871, -190289, -153307, -105137, -25114, 16467, 36497, -58759, -53366, -72535, -53342, 59522, 137962, 50743, -30901, -85526, -92728, -63143, -989, 50411, 97432, 97557, 60272, 4660, 11299, 21254, 505, -44485, -16204, -40838, -8194, -25344, 45351, 64930, 71485, -16344, -12840, 9442, -9969, -12956, 30516, -74761, -17694, 80453, 103437, 95154, 64644, -4703, 17501, 40655, -75253, -142108, -213626, -20151, 57019, -18545, 2955, 28064, -59735, -160956, -188149, -70371, 17330, -5293, -66455, -205791, -221587, -112499, -29730, -25271, 42183, 55667, -30850, -168239, -238609, -200209, -112586, -26477, 112531]
21145A12531J9715j14224o1879J09010K3659r7764j9404l3989n5949n5882L9547
21134a34629J36243Q3175R367P018l6181o6454j6168M6261J13272K4980J4212
21123A81096j00792k0656J4193l3629j01824k4992M6067K3347J9008O6030n7523
21112A0325n8975O9554K5806K2848p0799L1598j4226O4020j18796p7532O8786
21101d7391P3532J0657m9437m958o763n1163M9632K1635q2162k9677O7867L8894
21089i334j1569j4118j1097o811j0671J6159J21222K6815m900p065o418Q1442
21077A63655j5018l2565m9008m5306l3651L3487K4896P3676p420k7750m218k3256
21065E7522n0400n2940O2007M2712j09760J2450K6142k7833j305k944j1024l4587
$$ y = [112531, 132246, 18022, -43857, 65153, 88812, -8952, -28356, -62345, -118294, -174176, -134629, 1614, 84789, 94156, 101174, 64993, -1461, -17629, 28632, 141904, 166884, 181096, 80304, 59648, 73841, 40212, -61612, -86604, -40537, -17190, 1818, 67848, 10325, -48650, 20904, 46710, 69558, -1241, 30357, 16131, 80151, -38645, -116177, -47391, 26141, 36798, -12639, -17597, -24360, -75523, -25891, -4256, -86418, -116095, -48228, -9334, -20903, -35021, -46118, -52929, -63600, -47441, 73781, 100596, 95696, 88631, 82213, 163655, 148637, 116072, 67064, 21758, -11893, 21594, 46490, 120166, 112746, 84996, 80778, 57522, 7122, -45818, 16189, 58901, -50859, -38409, -12267, -40100, -41405, -44349, -55373, -89960]
21053h9960O6611K565l9563L0902J8418n7287J436p6628r1927R8060k89J5176
21041a22486N0558L7964j5032M9171M1866m4564K9884K8261K2583k0461n5706
21030B038j9454n5162K6072Q5330J00495M220j9327m6926m0464k3869o815K3658
21018B9796N4074N166j24499r6091O5655Q9074Q1824J6277K5725J9682r9386j1262
21006E6035J2180K4163L2156J8485Q97O3067N9615k1512r4463p2577L9126p8353
20994C8819n2827n891j67N2919K9546L0527j5236n171l9798J8870M0851J13410
20982B05852M5447q6814j59293j5239q6533m4419O1309n5542J8327P0296L3240
20971a3369P4493l2243k9825q6231N8468J2985J30438J17693m590o4839r5238
$$ y = [-89960, -23349, -20784, -60347, -29445, -11027, -68314, -66878, -143506, -235433, -137373, -137662, -122486, -71928, -33964, -48996, 175, 42041, -2523, 27361, 55622, 78205, 57744, 2038, -17416, -72578, -46506, 38824, 139319, 143539, 124212, 77286, 36822, 12953, 6138, 29796, 83870, 89036, -35463, -131554, -65899, 23175, 104999, 121276, 147001, 166683, 67297, 56035, 68215, 92378, 124534, 143019, 143916, 206983, 266598, 245086, 150623, 78046, 117172, 38819, -14008, -19899, -20066, 32853, 62399, 92926, 77690, 72519, 32721, 51591, 92442, 205852, 251299, 164485, 5192, -10047, -96580, -140999, -79690, -135232, -116905, -46609, -13369, 61124, 28881, -944, -87175, -28707, -15722, 114716, 232409, 227819, 162980, 67742]
20960F7742j01138j07394M9745Q0369k6410p5443P195O4679o73P8918J05471L0410
20948A73471j9060p8523m2302m4611L8588K4864n4064j3096L7593N5783l0957
20937D7686q6626M243L8159M1528o901o3781M168J03051R982m6662l1496l8849
20925b5498L7103P7878l9406l4423j461P4024l2296k9079P1304p1272n9044N1422
20913A9252J9555l3511k2556m3207j2145k8234J1581P1896m3382l7624K7056M1890
20901b9429j6662P3492J09488p776q9989n2747J3292Q3105N4290o3780p1896J5720
20889A7108k5974J9705J9820o2920r0559O2429R5243p1349J5901O8126P270m0652
20877A4148P0511r6264j1869l645j431P803O8435k4949j5459M7589n6384n193
$$ y = [67742, -33396, -140790, -91045, -10676, -37086, -112529, -105334, -40655, -41328, 37590, 143061, 173471, 154411, 75888, 33586, -11025, 27563, 52427, -1637, -14733, 22860, 78643, 47686, -38940, -34697, 3462, 44990, 38089, -25692, -21524, 81527, 91509, 44847, 13351, -25498, 11605, 89483, 50077, 15654, 14193, 88217, 55921, 26842, 98146, 26874, -32170, 19252, 38807, 5296, -17260, -60467, -72612, -100846, -89265, -17369, -60751, -98375, -71319, -29429, -46091, 27401, 136889, 129113, 39124, -13623, -331, 82774, 137064, 73284, 1388, 17108, -8866, 10839, 30659, -32261, -122820, -60391, 34852, -36497, -20596, 47530, 54800, 14148, 84659, -11605, -23474, -27119, -28550, -20747, 47688, 22739, 7280, 54869, -1515, -6708]
20865f708o4290r704P1953L4578J9544j3371N8030p1443j06722l7086N6901P9719
20853A1401R3084L2712p3968m0325r195r88J05427K1683j2019l5582k0908N884
20841G7206L1787l2206m7867m6028K3857p557j5543J6717K0080n3963L5153M3674
20829D5310l629j2370j03367r250P1991N313n3525J3014J3930j19N637k2561O7679
20816A8053r6770j23804j04400L3380Q9639J18020P7722k5309J9133j8352J7389
20805D701l8769L4553J2514J8107n56j8135L4901K3990j3683N795m2751j6546
20793D121J640L6519R3535m7319j16036m366J2488R6270J20215k8175m1110P3161
20781B00943p2759q4057K2431O935N622M3002K5580m1233n835J2812j4003J8107
$$ y = [-6708, -70998, -80702, -8749, 25829, 45373, 32002, 90032, 18589, -88133, -125219, -68318, 11401, 104485, 137197, 63229, 22904, 13709, 12721, 118148, 139831, 127812, 92230, 71322, 77206, 108993, 76787, 28920, -17108, 6749, -808, -16351, 366, 20446, -33517, 1636, 45310, 41681, 29311, -74056, -83306, -11315, -6002, -59527, -46513, -32583, -32702, -27065, -49626, 18053, -78717, -202521, -306921, -273541, -183902, -65882, 11840, -13469, 5664, -12688, 4701, -34068, 485, 12999, 31106, 30550, 12415, 47316, 71306, 57623, 63418, 20667, 4121, 5761, 42280, 135815, 88496, -27540, -31906, -19418, 76852, 197067, 168892, 127782, 200943, 128184, 44127, 66558, 73493, 79115, 122117, 147697, 106464, 100629, 113441, 99438, 117545]
20769A17545k6530o692J4920M9579o9231j22895M2335Q2840K5598K5873o9556
20758F3786j30360m3577R113O6675N1443N8684P993P0378J05380J41l0138K7842
20746B57360q7723k3321R5226o2644o8956J3206o6097o094l59K0965J09710L6468
20734B17741o7814r6760o8858J7838N6109l7706m1319l1460l4253m0618L8206
20723h8894J25445P3770m2884l8790l58L5752p4000N2M443q65N893R632k6322
20710a7126M7867k3123R314N2401P6466K8090k4735r933p3868o4462n6279j8563
20698g3951J024N3419R3887k6772k884k625Q3812L3750n4399o4783l3074p4208
20686f6804n9064Q4415J583j0223M1706M3719K5362l6006q7827M8042k1892Q204
$$ y = [117545, 91015, 84323, 99243, 148822, 79591, -43304, -969, 81871, 107469, 133342, 63786, -66574, -110151, -101038, -34363, 17080, 75764, 83757, 154135, 259515, 259656, 229518, 257360, 169637, 146316, 241542, 178898, 109942, 123148, 57051, 50957, 50598, 71563, 181273, 217741, 149927, 53167, -15691, 2147, 58256, 20550, -20769, -52229, -86482, -127100, -88894, 36551, 110321, 67437, 28647, 28289, 64041, -9959, -9907, -5464, -6329, -436, 9196, -17126, 30741, 7618, 16932, 69333, 145799, 173889, 149154, 139221, 65353, 891, -55388, -73951, -72927, -19508, 74379, 47607, 44723, 42098, 125910, 159660, 105261, 40478, 7404, -66804, -125868, -41453, -39870, -50093, -8387, 35332, 60694, 24688, -63139, -15097, -36989, -28785]
20674b8785M2779K4980m4382R788K0590k6454m6454L037L9454j5247l0108j10191
20662a60993J08430J21658p9622l0285k608P0744N4476n4319M6432P3635l9204
20651A08344m2186M556P9610o2553l1489l6104p6572j7836J04407P0888M627J8630
20639A24322M2934k1883m9556j40344j8875j9361J2307M2182m3167N6390J0520
20628d531Q61K3076n3080l8254J8823J09639P8522o3609m8574R470K0482O5778
20616A18603j6543j2019j13204L6031J7827K5332o1993q7426K210Q0901J8415
20605H134j0158J0206K8321N674R160k702o9149M3036J6850N3788L5073M9052
20593A77285r9540r1605m5393M8846l1117q892J31884N4291Q752m3457o0358j7462
$$ y = [-28785, 13994, 38974, -5408, 4380, 24970, -1484, -47938, -44901, -5447, -20694, -50802, -160993, -52563, 69095, -10527, -40812, -43420, 27324, 81800, 27481, 73913, 147548, 108344, 66158, 70714, 150324, 87771, 56282, 20178, -56394, -74230, 30177, 101065, 105692, 124322, 167256, 145373, 95817, -44527, -63402, -82763, -70456, -28274, -71441, -15051, -4531, -3670, 19406, -33674, -71928, -53105, 56534, 135056, 71447, 22873, 32343, 52825, 118603, 102060, 90041, -23163, 12868, 30695, 56027, -5966, -93392, -91182, -10281, 8134, -2024, 8182, 36503, 42177, 51337, 48635, -20514, 22522, 39372, 93160, 128233, 177285, 77745, -13860, -59253, -10407, -41524, -50416, 81468, 135759, 144511, 101054, 40696, 23234]
20581B3234m4762k7048J08183L0932r5595l9486K8307J32799j881o8800l6562
20570I321j7991J889N627J15170O3789o5379j87541R997M3706P4477Q7748Q066
20558A48879j9676r3395p8500M7898J3647Q2509J9208p4464o8686l6962k6243
20547h5785n0502J623M2063P9174O5245J9030q9911n3544p549k1853J08690L2884
20535C9565J5753M3582m4553o093M7230J6086n3977Q3689l4395q8266M0273j8228
20523D0666o6081L7008L3N4540P0088j10899j19346O5317j2205l2910o4475l6119
20511a74383J14306J4709k3316M7906R3558J61052M4767r0143j27835m4517N1249
20500F7353o4826n8740o3980k5637J13376j8052M8093K3907K0782L763J4296j4074
$$ y = [23234, -21528, -48576, 59607, 90539, -5056, -44542, -16235, 116564, 114683, 45883, 9321, -8670, -6781, -1154, 114016, 177805, 112426, -75115, -65118, -21412, 53065, 140813, 148879, 129203, 35808, -42692, 5206, 18853, 101362, 120570, 46106, -22580, -59542, -85785, -136287, -134664, -92601, -13427, 51818, 70848, -19063, -72607, -80156, -102009, 6681, 39565, 55318, 98900, 54347, 48254, 95484, 111570, 57593, 141282, 106887, 18621, 58894, 40666, -25415, 11593, 11626, 66166, 136254, 25355, -93991, -28674, -40879, -73789, -138264, -174383, -60077, -45368, -68684, -20778, 72780, 233832, 278599, 188456, 60621, 16104, 67353, 2527, -56213, -120193, -145830, -32454, -50506, -2413, 21494, 42276, 46039, 60335, 46261]
20488D6261p3457P7807L299j0019j5234o8483J9540K6862p1649P9784K9991J7990
20476F2692Q3214Q3750k3812j20273M934K6403p5837n9614L2445k3415o5699n4257
20464a29469k7994J6333J5295j5712N597O1294L1803k7506L3375m148L1244J3076
20452C188p7043M6812N6285R3469p891p9294q6825J1869K3321m4769l6227P6246
20440b0859O2564L7215j8769l8118n9925n5807P327M4463O3539N0617p38K0422
20428I1931K8430k2488P1424l2110q3518j434j4675L0213l295J16607p7148q6490
20416A7447K9160O8534O3119K170q2256j503j3416L3727M0650n2865r9433k4148
20404a8814l0804N3m4108o2074K7219M4836J2608M8732Q225n6099n7998L0034
$$ y = [46261, -27196, 50611, 53910, 43891, 28657, -39826, -20286, 6576, -65073, 14711, 44702, 62692, 145906, 229656, 205844, 85571, 90505, 116908, 41071, -18543, 13902, -9513, -75212, -129469, -157463, -141130, -125835, -141547, -135950, -74656, -42853, -70359, -36984, -41132, -9888, 3188, -73855, -27043, 29242, 122711, 114820, 35526, -51299, -39430, -16109, -60878, -97105, -20859, 41705, 78920, 60151, 22033, -37892, -93699, -86372, -41909, 21630, 72247, 71509, 91931, 120361, 97873, 169297, 137187, 53669, 52235, 37560, 67773, 64478, 181085, 103937, 17447, 46607, 115141, 178260, 180430, 98174, 96671, 83255, 116982, 157632, 104767, 5334, -18814, -49618, -49565, -93673, -155747, -128528, -83692, -71084, -22352, -14127, -70226, -128224, -98190]
20392i8190O196N874J10402M584J0921j9016q174q6910L2950J11757O9864l4648
20380A05610o4132K4158m628M3685L2729k6899Q0362l6724K3446Q0376m6621j44966
20368F6396k9682J2444Q1308P9064J1688j06772o6916K416p582p7811J7112l0098
20356d8433l1390J19403J00833k0237o8958n006l6629o437J46955L9885j20048
20345F9938j27459O1133N6850n6285p7433n9468k978M4740M6083Q2731K8033O8634
20333A34519n8145r7727O269n4814L6118j6438Q6993J03485M5439j28823j54976
20322i8100p8278J01717J29495P654K7921k6453K5775N386O186M688l6422j2300
20310E7269k456m2152O7489N3071p707q6511k2884l2087k4194P9074j1600k8888
$$ y = [-98190, -91994, -86120, 24282, 28866, 39787, 20771, 12597, -74313, -41363, 70394, 140258, 105610, 41478, 65636, 61008, 104693, 137422, 110523, 190885, 154161, 177607, 257983, 211362, 66396, 36714, 49158, 130466, 209530, 221218, 114446, 47530, 49946, 42364, -35447, -18335, -48433, -79823, 39580, 140413, 120176, 51218, 46212, 9583, 3146, 150101, 189986, 69938, -57521, 3612, 60462, 4177, -73256, -132724, -135702, -90962, -44879, 37852, 65885, 134519, 76374, -21353, -15084, -69898, -33780, -50218, 36775, 140260, 185699, 56876, -98100, -176378, -74661, 54834, 62488, 90409, 63956, 89731, 95117, 101303, 105991, 69569, 57269, 54813, 12661, 80150, 133221, 125514, 39003, 16119, -15968, -40162, 38912, 27312, -1576]
20298a576q0550p8665L5982M0811J7161P1714J0891N0307m7063j21063K9714J2957
20286e9380O4365J25091j4240r1014q406q1561k6229Q3763J9105K8782M5318P971
20274I3565K3650om0613m9224k915R3339K1541L7991j7124m9502o5174m4248N2818
20261E4098k9530j8878J04598L2018j2452q1590m5943n8123N7197J7885R137N244
20249C3661O1440N7203m2929J3543r2927j3853K5887L1428M3605K4897p314m0672
20237I3969m3950r3042m3770P7785J19396N2841p9345q8105O1098J9614o5582
20226A0909l3178N4107O7680K6546n1088j08665m7309J28339P6391K903k9549
20215I7086J0744J06741q5404n7609N1609J4625m3840J3472o189n7827j7121O0357
$$ y = [-1576, -82126, -160791, -124809, -83998, -66837, 4877, 15768, 66075, 19012, -102051, -72337, -59380, 4985, 130076, 115836, 24822, 16416, -65145, -91374, -7611, 11494, 40276, 85594, 93565, 117215, 117209, 76596, 27372, 24457, 117796, 139337, 177328, 160204, 110702, 45528, 1280, 54098, 24568, 5690, 110288, 142306, 129854, 48264, 2321, -55802, 1395, 19280, 28417, 33661, 95101, 152304, 109375, 122918, 29991, 16138, 42025, 73453, 117058, 141955, 134641, 93969, 50019, -43023, -86793, -9008, 110388, 163229, 83884, -4221, 56877, 76491, 10909, -22269, 31838, 99518, 126064, 74976, -33689, -80998, 47341, 123732, 126635, 97086, 107830, 214571, 129167, 71558, 123167, 137792, 93952, 107424, 101235, 43408, 26287, 86644]
20203H6644Q9272L461l5687j06855r8517j6463J48356J20358n5086j2126M1855
20192A65212P152J382p2991p3351L9488k3131K9661M1565L264j07969m0320O9683
20180C9645R9683P8981j05626j47846R0720L1991N7354k3573p220K5796q9375
20169E0530q1210J59376L9209l4947j4022K2362O1043M5447l4861o6907k3276
20158A22744P6700p726j20600j6863j8418j1426M0484N9858m181L1475q808l73
20146A42866l22q223n1961r397K1150m5055J6013M2410K1535Q4824k6717p7130
20134A09993j13787L1500n6007l5461L5185K5693K933Q050K722M5308N7877k1850
20122I2156R2466P8178q1190K779J4226J60356K2872q9374o2111m2952r8593j08859
$$ y = [86644, 175916, 179377, 143690, 36835, -61682, -78145, 70211, 190569, 135483, 123357, 165212, 172364, 173746, 100755, 27404, 66892, 43761, 73422, 114987, 118251, 10282, -30038, 39645, 139328, 218309, 112683, -35163, 55557, 87548, 144902, 121329, 114109, 139905, 50530, -30680, 128696, 167905, 132958, 118936, 141298, 202341, 247788, 212927, 146020, 122744, 199444, 191718, 71118, 54255, 35837, 24411, 64895, 124753, 120572, 152047, 143239, 142866, 142544, 134321, 82360, 72963, 94113, 49058, 65071, 107481, 129016, 213840, 187123, 109993, -3794, 27706, -28301, -63762, -28577, -2884, 49, 8099, 10821, 56129, 114006, 92156, 184622, 262800, 181610, 184389, 198615, 358971, 381843, 292469, 230358, 187406, 88813, -20046]
20110b0046l4599J1827Q4634Q2019l6320o8908P1613R0934M34q9475j6616O9806
20098A45303q2387L2894K9973N7898N9483q9440l8962M9113L1623j9141n5404
20087A20953n3499m0884N178k5185j4787k8753J1687K4982n7438O4368O8666L8258
20075A13546M749L8743K8460L5005J9006k041L870p7163k782N4598O7421Q2736
20063C66148k8550M0402j29395r4150n4945l3655L0749m7197L5371Q9029k5153
20052A48654K8226J1586k9112p5370j7886N7373p6150L6792K5592Q659k408j01950
20040A4006j3254l9202k7253M7724O0665K9223j7242o0893M1272n6659L0550K3000
20028C1937O2292k072L4045Q7447J1993l0545N4293r3644P0500J21700j0353n9838
$$ y = [-20046, -54645, -42818, 41816, 123835, 87515, 18607, 90220, 181154, 181588, 92113, 75497, 145303, 62916, 95810, 125783, 183681, 243164, 153724, 114762, 163875, 195498, 176357, 120953, 67454, 26570, 31748, 6563, -8224, -36977, -25290, -308, -57746, 6622, 75288, 113546, 118295, 157038, 185498, 220503, 239509, 237468, 241338, 164175, 161393, 215991, 283412, 366148, 337598, 378000, 248605, 154455, 99510, 65855, 96604, 49407, 84778, 173807, 148654, 176880, 188466, 159354, 83984, 66098, 123471, 47321, 84113, 109705, 118364, 115956, 14006, 752, -38450, -65703, -17979, 42686, 71909, 54667, -6226, 35046, -21613, 8937, 31937, 94229, 92157, 126202, 213649, 225642, 195097, 249390, 155746, 226246, 347946, 337593, 277755]
20016B77755l2135k6503J3218j7960O2629n7617o9029P068j17174N7683J0028
20005A07963k5298m4990K5661J35807r810j35814r3946k20m5855k0966K07026
19994I9558J28525N1894M2869M7166r7643q6071K0628j2544j07361r0864n9400
19983f3243P1543J25360O9968n3327m3123m792k3849M013K0656N6488M1629q953
19971A92370o5429P852L1620o6221m3105M6338j7764M307O6131L2651J123o2528
19959A27345n4757J944r402K0924k9375K717P1551P101l7728n7951M5270R0046
19947A77685K3579m4202q453j5948K7828R6418l8509l1108J242j07508n9295o764
19935A4965J12864P3966N712n2961O474Q0483R3852j68706j54528J8006O1851
$$ y = [277755, 245620, 219117, 232335, 214375, 277004, 219387, 150358, 157426, 40252, 97935, 107963, 82665, 37675, 63336, 199143, 189333, 53519, -40427, -40647, -86502, -107468, 99558, 228083, 279977, 322846, 370012, 272369, 186298, 206926, 194382, 87021, -3843, -63243, 8300, 133660, 203628, 150301, 107178, 102386, 78537, 82550, 103206, 159694, 201323, 192370, 126941, 134793, 166413, 100192, 57087, 103425, 85661, 89968, 156099, 188750, 189873, 127345, 72588, 74532, 65130, 86054, 56679, 59396, 130947, 138048, 100320, 42369, 87639, 177685, 201264, 157062, 148609, 132661, 160489, 256907, 218398, 187290, 188532, 81024, 21729, 14965, 127829, 201795, 207507, 154546, 161020, 241503, 335355, 166649, 12121, 30127, 91978]
19924I1978L6530Q0402P8876m6620o5225k4817n4504K1893N0566J6766J784K2489
19912B10118q7780j07893J6122N1790M6607J20136J8641q1424j38045n4302P7207
19901G1177O967k4019O7412L2532n8598r045M9618N6266L259M2797n1581p2141
19889A14644q143o6418j15742r775Q0629J59012Q4768k0794k6858o3484n0468
19878G7371J5406M070o3119J6978m0000k5932P8818O4117Q6462p2061M270J2707
19866A59087K7820l5874p83M4209n5772k9364N7829p6088n2986o6219o737L1330
19854c548M2114p1466m7082Q6828Q0462P7196J0523l9712n5821l141K8899O7335
19842A72587p1905o0326O1403J01314Q8819L6073L0235n6624j13475q0789q740
$$ y = [91978, 128508, 208910, 287786, 241166, 175941, 151124, 96620, 118513, 169079, 185845, 187629, 210118, 122338, 14445, 30567, 82357, 128964, 249100, 267741, 186317, 48272, -6030, 71177, 78144, 54125, 121537, 154069, 95471, 86426, 136044, 192310, 195569, 238366, 186785, 114644, 106501, 40083, -75659, -85434, -4805, 154207, 238975, 218181, 191323, 127839, 77371, 92777, 96847, 33728, 50706, 10706, -15226, 63592, 127709, 214171, 142110, 146380, 159087, 186907, 151033, 150250, 194459, 138687, 109323, 167152, 91064, 38078, -28141, -34878, -3548, 38566, -32900, -79982, 6846, 87308, 164504, 175027, 135315, 79494, 76353, 105252, 172587, 100682, 40356, 101759, 203073, 291892, 327965, 358200, 301576, 188101, 107312, 98572]
19831I8572m642N5917J274K8340m5387Q5177J21051Q0273n2449m7502p498j37595
19819A75531o9127R895Q8274j1452O741J8994p8499N942R2928J13642L8351j0217
19807C81003n6727L293q2070k9086n8425L7070n89K1697m5968R041L4035J08084
19795C21358k8233k6194q2771N4076P6643p9222l8122n1544q6177l980J32080
19784A87914n811P6590r1594O1595J14832K2458o3123j30062L8575l7595j622
19773A72157p9580J8941q365j1760J0161N7278K5171N0223L6884P013o3091M006
19761B19038j4353J4134L9319m6552o1878k6893N8663P0082Q8470j4785o6780
19750B58465j25993j9713P0195P1253O2723K993j25655k7527O0786M4563K241
$$ y = [98572, 93930, 149847, 151121, 179461, 134074, 219251, 340302, 420575, 368126, 320624, 313126, 175531, 106404, 116299, 204573, 193121, 199862, 218856, 140357, 146299, 239227, 352869, 391220, 381003, 324276, 327569, 245499, 216413, 157988, 195058, 194469, 216166, 170198, 179239, 213274, 321358, 293125, 266931, 184160, 238236, 314879, 235657, 197535, 145991, 59814, 55834, 187914, 182103, 258693, 167099, 228694, 343526, 365984, 302861, 172799, 211374, 173779, 172157, 92577, 111518, 103153, 91393, 101554, 158832, 184003, 234226, 271110, 278123, 215032, 219038, 204685, 218819, 258138, 211586, 149708, 122815, 181478, 251560, 340030, 325245, 258465, 132472, 112759, 182954, 254207, 316930, 319923, 194268, 166741, 227527, 272090, 274331]
19739B74331J28789M9107j45464j74389j146k3470m3997K8317O3952K3233L8874
19728B18137M2257K1933j275j13613Q4724k3553m2008N4729P840j29437O017P5334
19716B01085P2463L7146j3312L8905M6840n9222q2905J41293Q2210K12J6568j26971
19704C54312j57339j3421K0278J8512J04183J5719p1181k233N1494M5244r755
19693C55813J0492p1212j09630Q333k0523p3851J14782K1098j1677O391Q428r8136
19681A40308l3545L6194L7766M9091m9965m8920N4711L5767J6621J0702O4031
19670C12761K468J5564K5056l1536K2146n2057r4646j1353J11864p6K3119Q1447
19658D04757o3465o7260j03072m8352O3889J5132M8265P5921k9529m420L0374
$$ y = [274331, 403120, 452227, 306763, 132374, 131228, 107758, 63761, 92078, 156030, 179263, 218137, 260394, 282327, 281052, 167439, 252163, 228610, 186602, 241331, 249171, 119734, 125751, 201085, 273548, 310694, 297382, 336287, 383127, 323905, 241000, 382293, 464503, 464715, 481283, 354312, 196973, 183552, 203830, 222342, 326525, 342244, 271063, 268830, 320324, 365568, 355813, 366305, 295093, 185463, 193796, 173273, 99422, 214204, 235302, 223625, 230016, 238444, 140308, 106763, 142957, 180723, 229814, 179849, 130929, 185640, 221407, 238028, 248730, 312761, 315229, 330793, 355849, 324313, 346459, 294402, 199756, 188403, 300267, 300191, 323310, 404757, 341292, 274032, 170960, 122608, 186497, 201629, 249894, 325815, 296286, 291866, 322240]
19647C22240k5567J8341L616J7195k2228n6403o212P91L2493q364J2973k3376
19635B65499k5576P9707m9076m8242m6630J4533n5917K5162R6919k9184j4129
19624B13066M743J29186j9091j10597M9460L9178R0547L2658r8584L041J7599
19613C51206M8746k9637r2215M1126K2256J9427K4810r565q8134K4761N5708n2349
19601C16140l9753m5451k4586j4819P156M3012J32401L3730r371j4922M0961p7012
19589C47486o9447m75J5845N8757K5250P734l7265m9892l3609O4932R7557L6302
19577D63175n4851j32316K0382L7482o044O0796k3140o632m7752k7389P2013R4672
19565D50396K4714o1582n4666o1845R6129j6021q305J5422J10583N4628l3628
$$ y = [322240, 296673, 315014, 318630, 335825, 313597, 257194, 250982, 251773, 284266, 275902, 288875, 265499, 239923, 319630, 270554, 222312, 175682, 190215, 134298, 159460, 256379, 227195, 213066, 217809, 346995, 327904, 217307, 266767, 305945, 396492, 429150, 330566, 333607, 351206, 399952, 370315, 278100, 319226, 341482, 360909, 385719, 376154, 288020, 312781, 368489, 316140, 276387, 230936, 206350, 191531, 198687, 241699, 374100, 407830, 398459, 383537, 424498, 347486, 278039, 277564, 293409, 352166, 377416, 385150, 347885, 297993, 264384, 329316, 426873, 463175, 408324, 276008, 296390, 333872, 327828, 388624, 365484, 358852, 311100, 283711, 355724, 450396, 475110, 413528, 358862, 297017, 393146, 377125, 368820, 384242, 494825, 549453, 515825]
19554E15825l7644n512j57751l9195O9246J9305O2207j2890o8132k138M3473j2724
19542C74070l5653k3310M9186J4662L5350M5595j25318n0673j3342L6996k4287
19531B83276L3388j8371K5936J14869l0965J2949q1168N1108n582M7407l2351
19520D00496q7368l7992J55M441L1396J30939K8711k2761J7268n8175l0190Q8829
19508D65749j589j9805K5383M4110k3285n8380K6205K6645k0197j09911J5511
19497C70436L7608o8907R523O4734p2079l1781R4556k2163P2321R5444L1566l8767
19485E42491J8144m3030o5357j8669p720M074L4013j01493K1366L0040l8586k2881
19473C52392P3704M7823J5380P5730P8917O6562L4339j34629j02981l1128O0244
$$ y = [515825, 478181, 472669, 314918, 275723, 344969, 364274, 426481, 413591, 345459, 343321, 386794, 374070, 338417, 315107, 364293, 378955, 414305, 459900, 334582, 283909, 270567, 307563, 283276, 316664, 298293, 324229, 439098, 408133, 421082, 339914, 391022, 385440, 432847, 400496, 313128, 275136, 275291, 279732, 311128, 442067, 470778, 448017, 465285, 407110, 376920, 465749, 464160, 444355, 469738, 513848, 490563, 432183, 458388, 485033, 464836, 354925, 370436, 408044, 339137, 348660, 413394, 341315, 309534, 404090, 381927, 454248, 549692, 581258, 542491, 560635, 517605, 452248, 433579, 425859, 429933, 463946, 362453, 383819, 413859, 375273, 352392, 426096, 473919, 489299, 565029, 643946, 710508, 744847, 610218, 507237, 476109, 536353]
19462E36353J90799K9659j417O203p6674J45498J57926j364k0624Q2787J50549
19451A199695M0738N0752P2912N9224n28K2045K0666q1314P5081P9689P2763K3988
19439A635711r2092l8916m8301J4988l7137j4244J5654l5789l6108n8330M4020
19428A349456k2679o4322L8877L7181j8868r7477o6191l3609o4044j4895j9065
19417A024364k2955k1521R1930O819L2019p383j3829M2418L4283J06134J01842
19406A374121O7795M562M6899M9798K0974P960R487m6716r6046N1745j7030K6112
19394A499661Q2238N5509m9114m2016L455Q099J1271o0989j9582n8052p6994j4100
19382A339386o7187q2377R767j10773k4949M0383P989m7532p2515p7941P368j8931
$$ y = [536353, 727152, 756811, 755394, 761597, 684923, 830421, 988347, 986983, 966359, 1049146, 1199695, 1240433, 1291185, 1364097, 1423321, 1422793, 1444838, 1465504, 1384190, 1459271, 1538960, 1611723, 1635711, 1543619, 1504703, 1456402, 1471390, 1434253, 1420009, 1435663, 1399874, 1363766, 1305436, 1349456, 1326777, 1262455, 1301332, 1338513, 1319645, 1222168, 1155977, 1122368, 1058324, 1043429, 1024364, 1001409, 979888, 1071818, 1078637, 1110656, 1103273, 1089444, 1131862, 1166145, 1272279, 1374121, 1441916, 1446478, 1493377, 1543175, 1564149, 1572109, 1581596, 1534880, 1438834, 1490579, 1473549, 1499661, 1581899, 1637408, 1588294, 1546278, 1549733, 1557832, 1569103, 1508114, 1488532, 1430480, 1353486, 1339386, 1272199, 1189822, 1199589, 1088816, 1063867, 1104250, 1112239, 1064707, 992192, 914251, 921619, 902688]
19370I02688n7132j6386J3208M2998J3287r6653M492l6940p8025r966J9487k3509
19358F77549J8658O7998o9588p0623l0563J0495K9674Q424J1024n83k0758q8796
19346E42911o5146n2351Q2019N1384N8042N4331P6412r5551k2575Q4150l7126
19335F76500j5749P8259k369m2401k5757j80k4349k3589M7468j0500o0577j0490
19323E86266L254n7424K9114N5749R0300M1904n5689j30292m4082L0018N2473
19312F01591l0268N0978m268k6124P3762J61799M4515j77348j42353K4318Q3971
19301F60573l2852n7993r758Q2107P4789l7067m4887M6444J374K9966j1520m4649
19289F56527L0241N9828n5420K249Q8564J23013j26071j11235m8510K9733J2743
$$ y = [902688, 845556, 829170, 842378, 885376, 898663, 802010, 806502, 769562, 691537, 681571, 701058, 677549, 696207, 764205, 694617, 623994, 593431, 603926, 633600, 642024, 653048, 652465, 631707, 542911, 477765, 425414, 507433, 558817, 616859, 671190, 747602, 652051, 629476, 713626, 676500, 660751, 739010, 736641, 694240, 668483, 668303, 643954, 620365, 667833, 657333, 596756, 586266, 589520, 532096, 561210, 616959, 707259, 749163, 693474, 563182, 519100, 549118, 601591, 571323, 622301, 618033, 591909, 665671, 827470, 871985, 694637, 552284, 576602, 660573, 627721, 569728, 559970, 642077, 716866, 679799, 634912, 681356, 682730, 712696, 701176, 656527, 686768, 746596, 691176, 693425, 781989, 905002, 778931, 667696, 619186, 648919, 661662]
19278F61662O3593Q6186j0366J06425O6166m8986r9267L8584N1871L1931m1628
19267I06171K7471K8210P7465J7648R6877J00667O7105J31695K22489K59055L33814
19256B268667K80123K00934J35453K3563k25954l19234k05780j46872r7034l0480
19246A883386n0136R6945J39100J74956K87194L48995J02127q7788k31595l89153
19236B274031l17799j53807j75233j85728j74944q2145j1746k0437n3903l1325
19226A066964j8156M7335N608L4268P5711l6383n0647q6279n6723N5498K3422
19215A060618o5382O8031J14843L6962k76O0433p8186m9956N7376O7084j8798
19204A252749o418L3648n3211r9589j5905J0941O2420m5479N2229Q0466m9604
$$ y = [661662, 725255, 811441, 801075, 907500, 973666, 924680, 825413, 863997, 915868, 947799, 906171, 933642, 961852, 1039317, 1056965, 1153842, 1254509, 1321614, 1453309, 1675798, 1934853, 2268667, 2548790, 2749724, 2885177, 2908740, 2682786, 2363552, 2157772, 2010900, 1913866, 1883386, 1833250, 1930195, 2069295, 2244251, 2531445, 2880440, 2982567, 2894779, 2663184, 2274031, 1956232, 1802425, 1627192, 1441464, 1266520, 1184375, 1172629, 1152192, 1098289, 1066964, 1048808, 1096143, 1101751, 1136019, 1211730, 1175347, 1124700, 1038421, 981698, 1037196, 1060618, 995236, 1063267, 1178110, 1215072, 1214796, 1275229, 1197043, 1147087, 1204463, 1271547, 1252749, 1246331, 1279979, 1226768, 1127179, 1111274, 1122215, 1184635, 1139156, 1191385, 1271851, 1222247]
19193A222247o5428M826K6917k0338J1835K8253J5151L7549N116N2989P2085k2713
19181A368489r9465M2579M8960Q1752j04450l042k4830j1194k8704k0103l6168
19170A213824O1723P5938K4674R149J2795j1719R1840R1570k521j2970K038m0006
19158A516335K177K4139j7178q765N3717J49025N1921r975M6083M8134P5238J8334
19146A949185K947Q1941L7881q4502r4866j58006r1758N8086L0471L3693j742
19135A763330l8630p2137M5548L8335k6701o2889j09643J7383N0960l734K9199
19124A631021O3274K9583r4444o9578l6381M8414L4123N7360L0393K9368M2405
19113A765538L2261J18450j8455J2025P6711K95o3978P5536J7767k8496o4501
$$ y = [1222247, 1156819, 1161645, 1188562, 1168224, 1180059, 1208312, 1223463, 1261012, 1266128, 1319117, 1391202, 1368489, 1269024, 1311603, 1360563, 1442315, 1337865, 1334823, 1309993, 1298799, 1270095, 1249992, 1213824, 1275547, 1351485, 1376159, 1385308, 1398103, 1386384, 1478224, 1569794, 1567273, 1554303, 1556341, 1516335, 1518512, 1542651, 1525473, 1516708, 1570425, 1719450, 1771371, 1761396, 1807479, 1855613, 1930851, 1949185, 1952132, 2034073, 2071954, 1987452, 1892586, 1734580, 1642822, 1700908, 1731379, 1765072, 1763330, 1724700, 1652563, 1698111, 1736446, 1709745, 1646856, 1537213, 1554596, 1605556, 1601822, 1631021, 1694295, 1723878, 1629434, 1559856, 1523475, 1571889, 1606012, 1663372, 1693765, 1723133, 1765538, 1797799, 1916249, 1897794, 1909819, 1986530, 1986825, 1922847, 1998383, 2016150, 1987654, 1923153]
19102A923153l2282l3884K840J25298J40964j6419J6964Q3874K312k2621N96L095
19090B193890j1641K3369J1188P3808l635M9582P0478m2713j23753O1718R8589
19079B400880n7999k6944L4901L0876o983J1327N4686R4820O3149j790k5490k7445
19067B543988M3520j7470N8918N982M9267L8411Q3923R4452Q8537L0142R8289
19056C117959L4954Q636L074R1596P1500M2166P2596M9757L1522N169Q6303L1777
19044C647009O7519Q1946J00838J36925N9781M4888M3484J13043R4247J42129
19034D531809L7577R3772J19296O6608O5028R7296Q2939J40119j1628L3713R9893
19023E356422J25986R2095J07743K87447L23605M1732K5396J14649R087J44942
$$ y = [1923153, 1890871, 1856987, 1859827, 1985125, 2126089, 2109670, 2126634, 2210508, 2212820, 2190199, 2190795, 2193890, 2182249, 2205618, 2216806, 2290614, 2286979, 2336561, 2407039, 2364326, 2240573, 2302291, 2400880, 2342881, 2315937, 2350838, 2381714, 2374731, 2386058, 2440744, 2535564, 2598713, 2596923, 2571433, 2543988, 2587508, 2570038, 2628956, 2634938, 2684205, 2722616, 2806539, 2900991, 2989528, 3019670, 3117959, 3152913, 3161549, 3164623, 3256219, 3327719, 3369885, 3442481, 3492238, 3523760, 3528929, 3615232, 3647009, 3714528, 3796474, 3897312, 4034237, 4094018, 4138906, 4182390, 4295433, 4389680, 4531809, 4569386, 4663158, 4782454, 4849062, 4914090, 5011386, 5094325, 5234444, 5222816, 5256529, 5356422, 5482408, 5574503, 5682246, 5969693, 6293298, 6335030, 6360426, 6475075, 6484162, 6629104]
19013F629104J61519J96097J94329J42908K06277K21406K59743J57181K37006
19004H405570K41270K31907J39516K91861L15645K56032L28342L12550J94405
18995A0717098L75900M74124K90735M04553N34845M91490O17713O36500P03693
18986A5246651O82874P30828O98351P65190Q70543R44714R43468J171910J258662
18977B3313191J264813J400788J532002J646833J789259K058490K265949K382787
18969C7654112K430830K713992L160369L548224L859615M174682M642315N238007
18961F7422146N898137O629844P415139Q161741Q998461R813322J0597257J0959302
18953A35895349J1094282J0951491J0342696R311354P947175O512747N197443
$$ y = [6629104, 6790623, 6986720, 7181049, 7323957, 7530234, 7751640, 8011383, 8168564, 8405570, 8646840, 8878747, 9018263, 9310124, 9625769, 9881801, 10210143, 10522693, 10717098, 11092998, 11567122, 11857857, 12262410, 12797255, 13288745, 13906458, 14542958, 15246651, 15929525, 16660353, 17358704, 18123894, 18994437, 19939151, 20882619, 22054529, 23313191, 24578004, 25978792, 27510794, 29157627, 30946886, 33005376, 35271325, 37654112, 40084942, 42798934, 45959303, 49507527, 53367142, 57541824, 62184139, 67422146, 73320283, 79950127, 87365266, 95527007, 104525468, 114338790, 124936047, 135895349, 146989631, 157941122, 168283818, 177595172, 185542347, 192055094, 197252537]
18946A97252537M227376L723252L485125L611028L646495K966184J825498J56219
18938B20893714j770441m166238o297486p983640r116941r537638r524440q957463
18930A63539427p976088p059182o139124n369379m712778m173994l849383l506613
18922A20752886l139652k731567j938099j235325m09905O65251J685967K839416
18914A16488972M087117N114009O144507P180464Q138050Q746601R015470R041515
18906A73956705Q973101Q724805Q602524Q477227Q590472Q732765Q687488Q351359
18898B43096446P615142O363755M515671K144111q7556k059269l540753m975156
18890B53072391o379800p650334r199521j0862524j2525712j3856136j4510138
$$ y = [197252537, 201479913, 205203165, 208688290, 212299318, 215945813, 218911997, 220737495, 220893714, 219123273, 214957035, 208659549, 200675909, 191558968, 182021330, 172496890, 163539427, 155563339, 148504157, 142365033, 136995654, 132282876, 128108882, 124259499, 120752886, 117613234, 114881667, 112943568, 111708243, 111298338, 111963589, 113649556, 116488972, 120576089, 125690098, 131834605, 139015069, 147153119, 155899720, 164915190, 173956705, 182929806, 191654611, 200257135, 208734362, 217324834, 226057599, 234745087, 243096446, 250711588, 257075343, 261591014, 263735125, 263647569, 261588300, 258047547, 253072391, 246692591, 239042257, 229842736, 218980212, 206454500, 192598364, 178088226]
18883A78088226j4531421j4123564j3242551j2148495j0966583r599016q235825
18876I5240771p203325o235949n505371n059178m766084m454555m208793l992756
18868E3814760l714301l515669l184244k968499k663717k405704k270327k128260
18860C0964039k086424j863295j688104j498688j238838j042648j010556q50583
18852A9684903o24595n11721m12603k86070l90879n57658q29946r39452q20520
18843A4311459o54125n04941m61249l20285k51495k59789l52952m29359k91748
18834A0785516k61278k57319k74182k06135j18384k65080l94494m26789l05244
18825H276611j89321k47948k82637j64727j73692j98753p347j52698k61511j64182
$$ y = [178088226, 163556805, 149433241, 136190690, 124042195, 113075612, 103476596, 95240771, 88037446, 81801497, 76296126, 71236948, 66470864, 62016309, 57807516, 53814760, 50100459, 46584790, 43400546, 40432047, 37768330, 35362626, 33092299, 30964039, 28877615, 27014320, 25326216, 23827528, 22588690, 21546042, 20535486, 19684903, 19060308, 18548587, 18135984, 17849914, 17459035, 16901377, 16071431, 15131979, 14311459, 13657334, 13152393, 12691144, 12370859, 12119364, 11859575, 11506623, 11077264, 10785516, 10524238, 10266919, 9992737, 9786602, 9668218, 9403138, 9008644, 8581855, 8276611, 8087290, 7839342, 7556705, 7391978, 7218286, 7019533, 7012186, 6859488, 6597977, 6433795]
18815F433795j77254j50410r7277j0188J6359j23825j37985l090O016k2587M2047
18804E775601r0696j87002k2638J6194M1025J2093k1183K2233k5080l372J17191
18793E634366N1261n0630p3636j71262j30913m8816R9853L6285l8004j72686j13835
18782E021983n8985j05880j26471j34268j33103p7686j53698j17201K5543O6722
18772D206956o9167j1921J091R752N4753N4158K98618J47729k18448k52946k16753
18761D003822j71543j55895k8291k8541l6694k1081k2854J08165J41742M1216
18751C830046J11771N7063m4976m5482l8800L4020J41244J53907J51526P2068
18741D422387P1999O274N1337M8014n1978p1502j22843r3588q556l5534N6134
$$ y = [6433795, 6256541, 6106131, 6008854, 5998666, 6015025, 5891200, 5753215, 5750125, 5756141, 5733554, 5775601, 5684905, 5497903, 5475265, 5491459, 5532484, 5544577, 5523394, 5545627, 5520547, 5517175, 5634366, 5685627, 5634997, 5561361, 5390099, 5259186, 5210370, 5310223, 5346508, 5308504, 5135818, 5021983, 4962998, 4857118, 4730647, 4596379, 4463276, 4385590, 4231892, 4114691, 4140234, 4206956, 4137789, 4125868, 4126959, 4136711, 4191464, 4245622, 4544240, 4691969, 4473521, 4220575, 4003822, 3832279, 3676384, 3648093, 3619552, 3582858, 3561777, 3538923, 3647088, 3788830, 3830046, 3941817, 3998880, 3953904, 3908422, 3869622, 3903642, 4044886, 4198793, 4350319, 4422387, 4494386, 4500660, 4551997, 4600011, 4548033, 4476531, 4353688, 4260100, 4251544, 4216010, 4272144]
18730D272144N1158N1429J1194Q4300L7114r217j8273K3585O5399J10622P0950
18719D750405N7717J09275J30200J62288J05243J46905J76016J71168K15793J85373
18709F210383K56353L54904L60520L81569L59648L38421N30974O52118P68012
18700A0212902Q27082R28796R52076Q94707P86131R53378J177774J365112J659078
18691A9757036J667320J465577J364881J620692J934049K423437K816961L284699
18683C6334652L843584M368912N226565O674199Q293008J0729970J3774958J7680368
18675A06926216K3518254L2226959M4925232O0619356P2245408O2380314J9384232
18668D22225971l3122187o2288343o3261232m8893688l1370034j6273703m044149
$$ y = [4272144, 4323302, 4374731, 4385925, 4470225, 4507339, 4498122, 4479849, 4503434, 4568833, 4679455, 4750405, 4808122, 4917397, 5047597, 5209885, 5315128, 5462033, 5638049, 5809217, 6025010, 6210383, 6466736, 6821640, 7182160, 7563729, 7923377, 8261798, 8792772, 9444890, 10212902, 11039984, 11968780, 12920856, 13815563, 14601694, 15555072, 16732846, 18097958, 19757036, 21424356, 22889933, 24254814, 25875506, 27809555, 30232992, 33049953, 36334652, 40178236, 44547148, 49773713, 56447912, 64740920, 75470890, 89245848, 106926216, 130444470, 162671429, 207596661, 268216017, 340461425, 402841739, 422225971, 389103784, 326815441, 263554209, 214660521, 183290487, 167016784, 162972635]
18661A62972635P099006J8767229L2629169M9078488O2987999N9300574K3260019
18654D16095119k9902114o5781354p2790239o1405030m5282169l1806823k2342795
18647H6784595j6182022j2147732r300581p049811n533869m450688l577467k842527
18639B5699898k379294k165950j837467j394724j024107r46460j029569j063080
18631A3859247j068817q58408n60875n10971m65847m70390m34045n19240n95788
18622H374866o34866n37305m50986n15681l72455l25493l13008j09995j63427
18613D951650j61098k3193j82306j57054j15574j48225j00868q3485j67412q4396
18603C728039j45815k07283j29267q1106k9465j00009j14624n7305J9456o9676
$$ y = [162972635, 170071641, 188838870, 221468039, 270546527, 333534526, 392835100, 416095119, 386193005, 320411651, 247621412, 186216382, 140934213, 109127390, 86784595, 70602573, 58454841, 49154260, 42104449, 36570580, 32119892, 28542425, 25699898, 23320604, 21154654, 19317187, 17922463, 16898356, 15951896, 14922327, 13859247, 12790430, 11932022, 11371147, 10860176, 10394329, 9923939, 9489894, 8970654, 8374866, 7740000, 7202695, 6751709, 6236028, 5863573, 5538080, 5225072, 5115077, 4951650, 4790552, 4767359, 4585053, 4427999, 4312425, 4164200, 4063332, 3979847, 3812435, 3728039, 3582224, 3374941, 3245674, 3164568, 3135103, 3035094, 2920470, 2863165, 2882621, 2812945]
18593B812945O2258N0101k0608k12873k18890O674N4983O8466M2224j04339j57875
18582B383066j88480q6545l6652n2915o0107J6791q7124j731J15643J00951m590
18571B098307j07778o6302q600O7295o0676m9843k1412o7564l2005p2443K5284
18560A704263K6425L5067n5279p3768R1237J47400J12989N5047R234l9896j8941
18549A993778j28939k0111J13487J54573P4612M6419n3110j48461o0636n759l4807
18538A931046o9567j33223j31326q7425o0824k6680J1417P2325J48229K1578J0768
18527A686318k1405M6733K916m5250J3027J3301j26122m5115O4261p422J8550
18516A599792R0863Q3503Q0058o445j00483k03037n0354l1668J08748J1713O0067
$$ y = [2812945, 2875203, 2925304, 2904696, 2691823, 2472933, 2479607, 2534590, 2603056, 2645280, 2540941, 2383066, 2194586, 2108041, 2071389, 2018474, 1958367, 1975158, 1888034, 1886303, 2001946, 2102897, 2098307, 1990529, 1924227, 1915627, 1982922, 1922246, 1872403, 1850991, 1783427, 1751422, 1678979, 1704263, 1730688, 1765755, 1710476, 1636708, 1727945, 1875345, 1988334, 2043381, 2052615, 2012719, 1993778, 1864839, 1844728, 1958215, 2112788, 2187400, 2233819, 2180709, 2032248, 1971612, 1965853, 1931046, 1861479, 1728256, 1596930, 1509505, 1448681, 1422001, 1433418, 1505743, 1653972, 1675550, 1686318, 1664913, 1711646, 1714562, 1669312, 1682339, 1695640, 1569518, 1524403, 1588664, 1581242, 1599792, 1690655, 1774158, 1854216, 1847771, 1747288, 1544251, 1493897, 1462229, 1570977, 1582690, 1642757]
18505A642757J08555O4484Q0157L88o7191K21O6381M11q066R2618m5705n8621
18493A876389j288P5323J895r1044o7249m4238J02772N9082j6187m7907o719O9200
18481A910029L6632n6261l1451j2188m153m5827R6182K24098K46748J77716P8205
18470B619730k7093p7101j25375j04649j50303k14558k01364p69J30055K08520
18460B057093J00064R358M6608j1288q439P0979O9006J01483J25062J61696k922
18449B718700l7124P1767P3304N1346Q1548M3993J56059J53948J07692N4539o3520
18438C412252J51481J71256J92411K67803K12121K13102J44063K43187L70260
18429E377936L25214M20746N06311L98756M46366M09166L45210M55222N71660
$$ y = [1642757, 1751312, 1815796, 1895953, 1896341, 1829150, 1829371, 1895752, 1896163, 1888097, 1980715, 1935010, 1876389, 1875101, 1950424, 1952319, 1861275, 1794026, 1749788, 1852560, 1911642, 1895455, 1847548, 1840829, 1910029, 1946661, 1890400, 1858949, 1846761, 1842608, 1796781, 1892963, 2117061, 2363809, 2541525, 2619730, 2592637, 2515536, 2390161, 2285512, 2135209, 1920651, 1719287, 1718518, 1848573, 2057093, 2157157, 2166515, 2213123, 2201835, 2193396, 2264375, 2333381, 2434864, 2559926, 2721622, 2718700, 2681576, 2753343, 2826647, 2877993, 2959541, 3003534, 3159593, 3313541, 3421233, 3475772, 3412252, 3563733, 3734989, 3927400, 4195203, 4407324, 4620426, 4764489, 5007676, 5377936, 5703150, 6123896, 6630207, 7028963, 7475329, 7884495, 8229705, 8684927, 9256587]
18420I256587Q47658J039674R92965J088316J081559R08822R83234J434495J940821
18411A9574131K494107L507013M779582O520876R186765J3031418J7310710J9618173
18403I6022775J7096788P650109o504557j4776348j4150262q362857j195886N949601
18395H1729363J3531026K1059318K3529310J7338583Q619655L1243j3360628k4335660
18387A28142210k5572892k0277363j3135425o811212j611726K917139O820507
18380G0471238P696854K815358n348344r965111j0063225p732542m727697k272065
18372D0874466n03216P10468J428321K088980L208782M897112P202225J0150601
18364G0057739J2448189J1626016P797620N085709M667416M765633O245842J1252549
$$ y = [9256587, 10104245, 11143919, 12136884, 13225200, 14306759, 15215581, 16198815, 17633310, 19574131, 22068238, 25575251, 30354833, 36875709, 46062474, 59093892, 76404602, 96022775, 113119563, 120769672, 114265115, 99488767, 85338505, 76975648, 75779762, 81729363, 95260389, 116319707, 139849017, 157187600, 165807255, 165838498, 152477870, 128142210, 102569318, 82291955, 69156530, 62345318, 60733592, 63650731, 70471238, 78168092, 80983450, 75635106, 65669995, 55606770, 47874228, 43146531, 40874466, 40371250, 41081718, 42510039, 44599019, 47807801, 52704913, 59907138, 70057739, 82505928, 94131944, 101929564, 107015273, 111682689, 116448322, 122694164, 133946713]
18356A33946713K0471322L3997281M8910204N5977942M2374038K0852667J7815850
18349C74346017L3706689M4291974J8260289l6389597p3916582p6136148n6978083
18342B27184559l3131298j2983778K072346J0025667P376943j600077n946476
18335A92997886o017351j2304919k3642258k8587473k5384105j8973772j3062486
18328F5025522q797818n772422l703986k366473j499686p54273L5348P83166J555281
18319D4504659K501064L574005N000119P065929R692512J3355187J8381556K4485446
18311A28560477K7570146K0516830N120787n787036n254723M428804J9703116
18304A94858401L7614163N1521830M8109512K5312995l230226k2113974k2827324
$$ y = [133946713, 154418035, 188415316, 237325520, 293303462, 335677500, 356530167, 374346017, 408052706, 452344680, 470604969, 434215372, 360298790, 284162642, 227184559, 194053261, 181069483, 183141829, 193167496, 200544439, 198944362, 192997886, 186980535, 174675616, 151033358, 122445885, 97061780, 78088008, 65025522, 56227704, 50455282, 46751296, 44384823, 42885137, 42130864, 42166212, 42949378, 44504659, 47005723, 50579728, 55579847, 62645776, 72338288, 85693475, 104075031, 128560477, 156130623, 176647453, 181768240, 175981204, 170726481, 175155285, 194858401, 232472564, 283994394, 332103906, 357416901, 354186675, 332072701, 309245377]
18297C09245377j8319200k6866848m2004987m6677968l9645131k8202921j7877390
18290H9650932j0353014n113981j194776J940587L645804K249248r90371k104690
18282G7729739M46416N829817J3387503K1799448K5761354J4517950o344176j7600596
18274A35527455j6158870p621879L018987J4301927K8028980M3706909N0751779
18267B51555288K6346745k0197353m7790401m7880326l3750399j7638722m179705
18260A06465127P968696J7698426J7160079j161569k1802995k8749580k4772077
18253G2806107j7532722j1320202o872191m025648k330709r01476L33037J427052
18245C1583248K517391M267160O938528J0787699J4122720J0988193r16873j0478616
$$ y = [309245377, 290926177, 264059329, 222054342, 175376374, 135731243, 107528322, 89650932, 79297918, 74183937, 72989161, 74929748, 78575552, 80824800, 79834429, 77729739, 78176155, 84005972, 97393475, 119192923, 144954277, 159472227, 153128051, 135527455, 119368585, 111746706, 114765693, 129067620, 157096600, 200803509, 251555288, 277902033, 257704680, 209914279, 162033953, 128283554, 110644832, 106465127, 114433823, 132132249, 149292328, 148130759, 126327764, 97578184, 72806107, 55273385, 43953183, 37080992, 33055344, 30724635, 29823159, 30156196, 31583248, 34100639, 38367799, 45306327, 56094026, 70216746, 81204939, 80288066, 69809450]
18237F9809450j2235613r191985n059422j608585R83468L260883N627704Q670810
18229F0256710J3397437J9935014K7031246L0047921K8907900K6192398J5573961
18222B21342587l999243k5148838l5373371l1651256k3386686j8606939j6748669
18215F6427585j4341176j1174972p935292n246155l638511k568037j507355q54181
18207A9161906K5525J017022K059619L686826N398748N597736J736468l690971
18199C4992879o306816n757200m221857k750376j621804r08680k24217M10109
18191A3612038J007127J758918K904508M478506O585735O996764K788113k711633
18183C7420076m680883l530692q57573K348588O098896R890075J0318593K689015
$$ y = [69809450, 57573837, 48381852, 43322430, 41713845, 42697313, 45958196, 51585900, 60256710, 73654147, 93589161, 120620407, 150668328, 179576228, 205768626, 221342587, 217343344, 192194506, 156821135, 125169879, 101783193, 83176254, 66427585, 52086409, 40911437, 32976145, 27729990, 24091479, 21523442, 20016087, 19161906, 19187431, 20204453, 22264072, 25950898, 31349646, 36947382, 38683850, 34992879, 28686063, 22928863, 18707006, 15956630, 14334826, 13426146, 13201929, 13612038, 14619165, 16378083, 19282591, 23761097, 30346832, 37343596, 40131709, 37420076, 32739193, 29208501, 28350928, 30699516, 36798412, 46688487, 57007080, 59696095]
18175E9696095p147125j0996117r506557o068051k542844M04852K711041K544840
18167B9096134j081791m662913n658246m779434l254231k097334j501805j023851
18159E036529o19299n01300n12617l62289k70693k08737j47956p5659J6332j21284
18149B233027k36587j47965p5867K5982K4249j29213n8841k6357O4421K2860l1685
18138A664024J46688J40756N2010L4879J23933J56994K93766J86834K05530K14769
18128C220183K17329K23087L39789M53914N58280O63637O11318N94302O76520
18119G558359Q30768J094964J619127J879185K614808L751489N337438P623290
18111C2309428J1721745J9855675L4060014M9760616L2970952j9509176m5606553
$$ y = [59696095, 52548970, 41552853, 32046296, 25978245, 23435401, 23840253, 26551294, 29096134, 28014343, 23351430, 17693184, 12913750, 9659519, 7562185, 6060380, 5036529, 4417230, 3915930, 3403313, 3041024, 2770331, 2561594, 2413638, 2337979, 2354311, 2233027, 1996440, 1848475, 1772608, 1798590, 1822839, 1693626, 1634785, 1608428, 1672849, 1695709, 1664024, 1810712, 1951468, 2003478, 2038357, 2162290, 2319284, 2613050, 2799884, 3005414, 3220183, 3437512, 3660599, 4000388, 4454302, 5012582, 5676219, 6287537, 6881839, 7558359, 8389127, 9484091, 11103218, 12982403, 15597211, 19348700, 24686138, 32309428, 44031173, 63886848, 97946862, 147707478, 180678430, 161169254, 115562701]
18104A15562701m1981906k7958226j5823924q960428n621471l667200k440821
18097I108725j698069j173411q83652p07312p95668n40839k77864l38606l08692
18088B384612j36839j61385j74812p1038l0758j9146K7830L5177J08772K24049
18078B186462K20202M0462j70962k77833k80186j97949j1575O6949m8069q1164
18068A446337l8679Q0420J27940J75196K85120K16996L8555j08681l13600l21255
18058A588349k39742k46445o0421n0990j86717j67682j95444j71000r3134K6550
18048B03324O9973j5912n9496J09120J13977L8823K7311j24072o4174P4045J3372
18037C86291M399q2271j99756j40184o1990k7666p0125n2756L1743N390P8100
$$ y = [115562701, 73580795, 45622569, 29798645, 20838217, 15216746, 11549546, 9108725, 7410656, 6237245, 5353593, 4646281, 3850613, 3309774, 3031910, 2693304, 2384612, 2247773, 2086388, 1911576, 1840538, 1809780, 1790634, 1818464, 1853641, 1962413, 2186462, 2406664, 2447126, 2276164, 1998331, 1718145, 1520196, 1508621, 1575570, 1527501, 1446337, 1407658, 1488078, 1616018, 1791214, 2076334, 2293330, 2331885, 2223204, 1909604, 1588349, 1348607, 1102162, 1041741, 990751, 804034, 636352, 440908, 269908, 176774, 203324, 273297, 257385, 197889, 307009, 420986, 459809, 487120, 363048, 298874, 372919, 386291, 390690, 308419, 108663, -31521, -93511, -121177, -191302, -244058, -212315, -206925, -128825]
18026a28825J16355k688k3792k9153N5651l8367n9599J06217N9912n1432j2968
18015h689j1324n9095k6725J6592j2414o3245j2193O5088Q2590R6796N6848P3147
18003A97376k9187j10985o7453N6025k337m9150K5072n5096L7248o0777k9724
17992h8988P3951K9340q5047k2510o3457n3439l8870l2391K7207R8642J63728
17981H166J9802M8492k7822o8901N9495K9890l9958k9161L9401r6706j28852o5195
17969b51349O264L3324R473M1866O7029q223K3597N3759M5378l8729q6996L7416
17957f7191J01120n6574j2740p1558n7251j24762j3251Q9473M6773K9334j2141
17946a48768j8428K8788j1677M2137J4197M4049J5943r3001q1193J8097O7895
$$ y = [-128825, -12470, -15158, -38950, -68103, -12452, -50819, -110418, -4201, 55711, 4279, -8689, -20013, -79108, -105833, -89241, -101655, -164900, -177093, -112005, -29415, 67381, 124229, 197376, 168189, 57204, -10249, 45776, 43439, -5711, 19361, -35735, 1513, -59264, -88988, -15037, 14303, -70744, -93254, -156711, -210150, -249020, -281411, -254204, -155562, 8166, 27968, 76460, 48638, -20263, 39232, 69122, 29164, 3, 39404, -57302, -186154, -251349, -245085, -211761, -202288, -160422, -93393, -101616, -78019, -24260, 21118, -17611, -104607, -67191, 33929, -22645, -35385, -106943, -164194, -288956, -302207, -212734, -165961, -136627, -148768, -167196, -138408, -150085, -107948, -93751, -49702, -33759, -126760, -207953, -189856, -121961]
17935a21961O6462O1207N6312q293j9720o3655K8461O0975O2872j110Q025o1785
17923F7790N641N5256n3729k3296J00221j05978j67387m9231J1494j10916Q8884
17912a81251J7896K8094K2645L3309q749K7709o607k456r7736n870o3390k06N4211
17899a82401J40620N5838j5693K0692J19384L4057K8014J1877O4927J43390K29031
17888F49736J79684J19244m4483j73191M4308O8777R3403J23258j7290J7556J57543
17877A218545N7317n7429k00603j95504j88091j08858j25207n3609r2308j73460
17867H0793K158K1325M4501J21008K3398m6874n6762o288k1791L1449l436l2066
17855A57415l3230k8706K3081O2560R6375j2957Q372R8235J08613Q8261J20540
$$ y = [-121961, -55499, 5708, 62020, 53727, 34007, -29648, -1187, 59788, 122660, 121550, 129575, 67790, 73431, 128687, 74958, 51662, 151883, 45905, -121482, -170713, -159219, -270135, -181251, -163355, -135261, -112616, -79307, -88056, -60347, -66954, -69410, -167146, -173016, -236406, -236612, -182401, -41781, 14057, -1636, 19056, 138440, 172497, 200511, 212388, 277315, 420705, 649736, 829420, 948664, 904181, 730990, 775298, 844075, 937478, 1060736, 1043446, 1061002, 1218545, 1275862, 1218433, 1017830, 822326, 634235, 525377, 400170, 346561, 254253, 80793, 82951, 104276, 148777, 269785, 293183, 246309, 189547, 183259, 161468, 192917, 189481, 157415, 124185, 95479, 118560, 181120, 277495, 264538, 272910, 371145, 479758, 568019, 688559]
17844F88559J75467J23312K90224K66235R8138K1212p0374P9122R8392N6690M5387
17833A872364p0700n3174j36755j73285j74949k17926O49R9371M9216O3840l6725
17822A221926k5829j58556j53180k03439j88067q9416l2745k6780r3098r5148
17812A55668k9678l196L6396J6357Q445o255P746j5410k622k9429M19j0153O2997
17799A91285R1179N2586J06270R7132J43332M3976o7173K6381P3583J8567p9188
17788F97930l6948p6475k8223p4533n0994N250O1677J01086J56846J38381K67757
17777A161754L5947j13576p2143q7401k04888r5950J3194M9810m7716P8384M5954
17766G63369m5870j03074O336p3771j84745o411P6868k712n7974j05519j27839
$$ y = [688559, 864026, 987338, 1277562, 1543797, 1641935, 1663147, 1592773, 1671895, 1770287, 1826977, 1872364, 1801664, 1748490, 1611735, 1438450, 1263501, 1045575, 1046224, 1145595, 1194811, 1258651, 1221926, 1196097, 1037541, 884361, 680922, 492855, 403439, 370694, 343914, 250816, 155668, 125990, 122794, 159190, 175547, 183992, 177737, 185483, 170073, 167451, 138022, 138441, 128288, 191285, 282464, 335050, 441320, 538452, 681784, 725760, 658587, 684968, 758551, 777118, 697930, 660982, 584507, 556284, 481751, 430757, 436007, 497684, 598770, 755616, 893997, 1161754, 1197701, 1084125, 1011982, 924581, 719693, 623743, 636937, 686747, 639031, 717415, 763369, 717499, 614425, 620761, 546990, 362245, 355834, 432702, 429990, 372016, 266497, 138658]
17755A38658o6518m144n9516m5254R2940m6685J1188O9371r448o6890r2982O0472
17743a8808P0770k3612m1470n3807R1174N3J04251O1731m8272N8130O4059j5800
17731B48399J23286J28115R1252m8088O0978J53687J1178p4450O6017J21272K29519
17720A111165J41007l7897j49001k10643j23818j00679l6003l8878J1024J9043
17710E85320j22735P376Q384k11447o1665J195l0407j42164n1475r4941R0887
17699b1672M7529J7532Q8j206M8379L6769m2673Q021O9538m2279r609m2467m555
17686F3395m6590Q601L1310J5874J23316J56715L4669k0899N1756N1897L5100
17675E05144J5472Q5041Q5825P1314p0398q1683j70144j10110l5840J89712J60860
$$ y = [138658, 72140, 67996, 8480, -36774, 56166, 9481, 20669, 90040, 80592, 13702, -79280, -18808, 51962, 28350, -13120, -66927, 24247, 24300, 128551, 190282, 142010, 200140, 264199, 248399, 371685, 499800, 591052, 542964, 603942, 757629, 768807, 694357, 760374, 881646, 1111165, 1252172, 1214275, 1065274, 854631, 730813, 630134, 594131, 555253, 566277, 585320, 462585, 469961, 478345, 266898, 205233, 206428, 176021, 33857, -17618, -112559, -21672, 25857, 43389, 43477, 42271, 90650, 127419, 84746, 92767, 162305, 120026, 110417, 67950, 63395, 16805, 25406, 56716, 72590, 195906, 352621, 387290, 366391, 418147, 470044, 505144, 520616, 605657, 691482, 762796, 692398, 610715, 440571, 330461, 294621, 484333, 645193]
17664F45193l6615l9962N0040J7440o7273N7594O5090J79888K33996L26000M39847
17653A871238K85224K0602k87992k88100k85471j98406j63735j63534o1432K02454
17643I30848J63589J52602L14143L92539L80603o0447k88607m42755l68576l00187
17633H73752j48938j06212j51281j58699j04100n6376L2263r827K8516o0014j9848
17622A19236j3597o483m5099m6933K7413K7623j41066K3714J67768J7376r4257
17611C5695r0302k9879K8988n7564m671M7387J5970O143M4157n2543N2795L6633
17599C2809m6335l0131L1350m2364J8863j00138P307J8510J6038j3091M7975O7847
17587H640L9911J9838r385p0081j25583O8213J14716J11018l5830n8810n2529
$$ y = [645193, 608578, 568616, 618656, 636096, 568823, 626417, 691507, 871395, 1105391, 1431391, 1871238, 2156462, 2177064, 1889072, 1600972, 1315501, 1117095, 953360, 789826, 728394, 930848, 1094437, 1247039, 1561182, 1953721, 2334324, 2273877, 1985270, 1542515, 1173939, 873752, 724814, 618602, 467321, 308622, 204522, 148146, 180409, 170582, 199098, 139084, 119236, 105639, 99156, 54057, 7124, 34537, 62160, -78906, -55192, 112576, 129952, 35695, -54607, -84486, -55498, -113062, -117733, -70346, -54376, -48233, -4076, -56619, -3824, 32809, -13526, -43657, -12307, -54671, -35808, -135946, -128639, -110129, -94091, -107182, -59207, 8640, 48551, 68389, 59004, -11077, -136660, -68447, 46269, 157287, 121457, 62647, 10118]
17576A0118m8813j17479p0795l733M2461R6867M9199K5388j1607k4288n3136J05045
17564g73M8781P8343J5047j01824q4800o4093j8622K2422J9516r822L6944P7594
17552A8713l0525p602L40K5464Q4052l4072r9116k3547k4193J8158L785n7657
17540a26200L0770P4843K2214J186m1724l8537L050M2356p5324O4486R1699o401
17528D2418o0552j09502k2463L2200j02719K5699J60417L9474P3657m9311K676
17517C1994M1897k3686P616J03423J4291q3382p5114m1949R1622L1885l8997J994
17505F1594L7779q7135k0033N7124J69182l3503j14876J4217j2437K554J3214
17494H7680m2032p7381k5441J7761n1896K7743P2783q6673k4289R8343k0J2700
$$ y = [10118, -38695, -156174, -226969, -230702, -188241, -91374, -42175, -16787, -28394, -52682, -105818, -773, 48008, 126351, 141398, 39574, -45226, -109319, -127941, -105519, -86003, -95825, -58881, 18713, -11812, -19414, -19074, 6390, 90442, 56370, -42746, -66293, -90486, -72328, -68543, -126200, -95430, -20587, 1627, 2813, -38911, -77448, -74398, -32042, -107366, -42880, 48819, 42418, -18134, -127636, -150099, -117899, -220618, -194919, -34502, 4972, 78629, 29318, 31994, 73891, 50205, 57821, 161244, 175535, 92153, 17039, -24910, 66712, 98597, 59600, 61594, 99373, 12238, -7795, 49329, 218511, 185008, 70132, 84349, 71912, 74466, 87680, 45648, -31733, -57174, -39413, -91309, -63566, 9217, -77456, -101745, -3402, -3422, 9278]
17482I278j5588m8937J12538M7908O4196m6673q9811O001K5558K1583Q5971j9636
17470A52388l1911j3770N6877m4903n4328o9155k4327N9772L2411P167k6906K3607
17458F6922k6971k3461J10745N9624K7353j7160r6370j34339k5632O0736n0250
17447d8803K9163J39481R3872J12830J49319K27100J61563L6947k34538l13198
17437C53736j86379K663o4498j06597L408M2183K0448n162Q9957J0131J6474L1423
17425B07787j7892n7335n9900l1543l6418j4924j9257K9679P6597k0280k5142
17414C1372Q9019L05r445j0379L9178O1247l135q035n7866o6755j4474J6706N3521
17401A21259J4829j0325j10549k1950m6052P9759P8412j06632K9928M9057N2231
$$ y = [9278, -6310, -55247, 57291, 105199, 169395, 122722, 32911, 38912, 64470, 86053, 172024, 152388, 120477, 106707, 163584, 118681, 64353, -4802, -29129, 30643, 63054, 70221, 43315, 66922, 39951, 16490, 127235, 186859, 214212, 197052, 100682, -33657, -59289, 1447, -48803, -19640, 119841, 213713, 326543, 475862, 702962, 864525, 901472, 666934, 353736, 167357, 170020, 105522, -1075, 2333, 44516, 64964, 59802, 149759, 159890, 176364, 207787, 189895, 132560, 72660, 41117, 4699, -10225, -29482, 197, 76794, 56514, 31372, 120391, 120696, 111251, 100872, 140050, 201297, 198162, 190127, 132261, 65506, 51032, 67738, 121259, 136088, 125763, 15214, -6736, -52788, 26971, 105383, -1249, 28679, 77736, 129967]
17390A29967m048q2273j38613j7225J23776L2773J5465M2524Q530J7019j60r5950
17378C1785o1703J1990N9771K8316j8390Q396M36J04250R472j8233j34121J1048
17366C3017L6289p4843J9670N1375L9613Q672M9187J03221M7366R5790R4227j10618
17354C92966q2766k3541M4158k5266m838L4133O1491j6993k5461n2080o134m7736
17342B47933R870O4017Q735n1082j2610J07245N64j30917l4686M3881l9941N9810
17330B72819m2611j7433j7450m9234J0819K6042N4610N5347L0271J6159r4398
17319B44941P2103J38930n2184m733M6255p0519l7683N430q5077K1970M4580p395
17307C16618Q3904N9235O583m9151k5354O2776R3536k5535j26502L465J30629
$$ y = [129967, 125919, 43646, -94967, -112192, 11584, 44357, 59822, 102346, 110876, 127895, 127735, 31785, -29918, -17928, 41843, 70159, 51769, 60165, 60601, 164851, 174323, 156090, 21969, 33017, 69306, -5537, 14133, 65508, 105121, 113793, 162980, 266201, 313567, 409357, 503584, 392966, 310200, 286659, 330817, 305551, 300713, 334846, 396337, 379344, 353883, 301803, 295669, 247933, 257803, 321820, 330555, 279473, 266863, 374108, 374672, 243755, 209069, 252950, 213009, 272819, 230208, 212775, 195325, 146091, 156910, 182952, 237562, 292909, 323180, 339339, 244941, 317044, 455974, 403790, 399057, 445312, 374793, 337110, 342540, 257463, 279433, 324013, 316618, 400522, 459757, 466340, 417189, 391835, 454611, 548147, 522612, 396110, 399575, 530204]
17296E30204N1194M792J1557N9173l8319o1414k31068j63237j44332j69875k4079
17285a75404N5774Q1208J10994J20404M2275J26268J35061N878j37523j66871
17275A98064j55090j09477r4152m4006N4724O5609P359J4942K4635J28610J2683
17264A03901l7669L7043l8390k676N1482k3443m7473l5602j31J27965J39294N3783
17252C28084o9159o3449O4149k4681O061n2100p9817r0881O2821O3522J7264Q6155
17240B47969O5438M7826R5393n1254J3690j11244k7396O2813O2286j23457j1051
17229B71013m6698J39805J16967m4074l8626j3049L5529N5306N3742j1640k9857
17218D88418O4042J54086P8439j01512k0266P1484l434m2116m4210j45594p0834
$$ y = [530204, 581398, 586190, 597747, 656920, 618601, 557187, 326119, 162882, 18550, -151325, -175404, -119630, -38422, 72572, 192976, 235251, 361519, 496580, 502458, 364935, 198064, 42974, -66503, -160655, -204661, -149937, -84328, -76969, -62027, -37392, 91218, 103901, 66232, 103275, 64885, 62209, 113691, 90248, 42775, 7173, 7042, 135007, 274301, 328084, 258925, 195476, 259625, 234944, 241005, 188905, 109088, 18207, 81028, 144550, 161814, 247969, 313407, 361233, 456626, 405372, 419062, 307818, 280422, 343235, 405521, 282064, 271013, 224315, 364120, 481087, 437013, 398387, 385338, 420867, 476173, 529915, 518275, 488418, 552460, 706546, 784985, 683473, 663207, 734691, 731257, 689141, 644931, 499337, 428503]
17207D28503N0263M4851J45736N8106r5256p938M203J27726O4933O1332l1379
17196H51080m424N1083l6281j01331j605P9666R1172J4911m7923R001N9673j2843
17184I52179M1778l6117J8034P1326J07875O3899N0320K8173l5613m510N4496
17173A311840J46362m2944l5889j7837Q4504J5253j3361N8990P9030n617R40J03212
17161A684483R1155J09466J093J17421J23884J55421J21521M7001J9901Q2715
17151B554061J01804K8494J22216J27939J3372R7568J85851J79339J24832L03149
17141C838625K10415K34075K80408K43476K05745K60609K90873L03741M35252
17132F303219M50061N46902O02085O32632O57247R02814R84866J159842J529647
$$ y = [428503, 478766, 523617, 669353, 727459, 632203, 624265, 628468, 756194, 821127, 882459, 851080, 846656, 897739, 861458, 760127, 758522, 838188, 929360, 944271, 896348, 905349, 965022, 952179, 993957, 957840, 975874, 1047200, 1155075, 1218974, 1269294, 1297467, 1261854, 1257344, 1311840, 1458202, 1415258, 1379369, 1361532, 1446036, 1461289, 1447928, 1506918, 1585948, 1580331, 1581271, 1684483, 1775638, 1885104, 1886197, 2003618, 2127502, 2282923, 2404444, 2451445, 2471346, 2554061, 2655865, 2684359, 2806575, 2934514, 2947886, 3045454, 3231305, 3410644, 3535476, 3838625, 4049040, 4283115, 4563523, 4806999, 5012744, 5273353, 5564226, 5867967, 6303219, 6753280, 7300182, 7902267, 8534899, 9192146, 10094960, 11079826, 12239668, 13769315]
17123A3769315J558407J515325J418640J682340K123444K449240K223037K127875
17115B8867623K310669K750034L352226M448554N729988P113443R179759J1748070
17107G5500366J5172228K0522325K8768318M1150383O0074241Q4196385R7068346
17100D22452592O2718288j6674969p7175660q9613433p1801632m6440834k5551482
17093A57912870j0380654J645650J3150696K7114052M6555622P1641805R0572047
17086C98212088O9709799n246251p5320623r7242048q3572760n9004721l8717998
17079A08817486k5502211j7630584j2525098r181185o636573n052001m178597
17072B8111237l693537l215212k612612k085202j430741r24053p29543o78536
$$ y = [13769315, 15327722, 16843047, 18261687, 19944027, 22067471, 24516711, 26739748, 28867623, 31178292, 33928326, 37280552, 41729106, 47459094, 54572537, 63752296, 75500366, 90672594, 111194919, 139963237, 181113620, 241187861, 325384246, 422452592, 485170880, 468495911, 391320251, 301706818, 229905186, 183464352, 157912870, 147532216, 149177866, 162328562, 189442614, 235998236, 307640041, 398212088, 467921887, 462675636, 387355013, 290112965, 206540205, 147535484, 108817486, 83315275, 65684691, 53159593, 43978408, 37341835, 32289834, 28111237, 24417700, 21202488, 18589876, 16504674, 15073933, 14149880, 13420337, 12741801]
17064A2741801q77461q81011q55700o17124n43251o60059q24868o91761o28938
17055F161628n96194n14149l45273k78914l60002l09441k57799j81945j88048
17046C129863j18751q1726j26049j97768j92475q3291o6425j11769j64510j35949
17036A851150j50519j6428r8737j08347j5106j20836q6771j11328j8323k3034
17026A101721k1037o3460o0939O1517j7697j9306K6897k0503L4454m2300o5588
17015I13759j27366j10673J6876q2977l6511j4200K998J1634K9728m3885j4262
17004E45121l6180k47l9394l4849K3170j0830m7787Q1943L4164m1560m6471J797
16992D28877j8262p1763K679J23116L3446K310q9513m8227J6830q4390q9925n7732
$$ y = [12741801, 11864340, 10983329, 10127629, 9510505, 8967254, 8307195, 7482327, 6790566, 6161628, 5565434, 5051285, 4706012, 4427098, 4067096, 3757655, 3499856, 3317911, 3129863, 3011112, 2929386, 2803337, 2605569, 2413094, 2329803, 2263378, 2151609, 1987099, 1851150, 1700631, 1684203, 1585466, 1477119, 1462013, 1341177, 1254406, 1143078, 1124755, 1101721, 1080684, 1017224, 956285, 1017802, 1000105, 980799, 1007696, 987193, 1021647, 979347, 913759, 786393, 675720, 692596, 609619, 573108, 558908, 561906, 573540, 603268, 559383, 545121, 508941, 508694, 469300, 434451, 457621, 446791, 399004, 480947, 515111, 473551, 427080, 428877, 410615, 338852, 341531, 464647, 498093, 500403, 410890, 362663, 379493, 295103, 205178, 147446]
16980A47446J2748L5319J0073L7721j5854m3438P3299P4679m9251n2274P3738
16969C04206R1615J6768k1075L5275r6259q1759k9071O5108R0203k8356L212K0403
16957C70270o288j84604r3149j4854R8582R7215K9852j11104l5488j8054R7023
16946B29401J15269J2286n022m2890p4970k6359K382K4285N1049r5643o3754M3771
16934A69805N1342O6208k6251q5243l13M2080J8826k4833p0621l552L2764o8241
16922A01971l1088M4241O8434J7846M3175O7751N8107O1584L6226k61017j96766
16911A0464q470k0103k47685k41560r00J44485J57899M9952L2080J956R8731M1249
16899A8098l3461k8158j37076j85979r6095j06460j62402m805R5901J39840K7497
$$ y = [147446, 160194, 195513, 205586, 243307, 227453, 184015, 257314, 331993, 282742, 230468, 304206, 395821, 412589, 391514, 426789, 330530, 248771, 219700, 284808, 375011, 346655, 349867, 370270, 363982, 179378, 86229, 71375, 169957, 267172, 297024, 185920, 150432, 132378, 229401, 344670, 356956, 351934, 309044, 234074, 207715, 210097, 234382, 285431, 189788, 126034, 169805, 221147, 287355, 261104, 175861, 175548, 217628, 236454, 211621, 141000, 137448, 170212, 101971, 70883, 115124, 183558, 201404, 244579, 312330, 370437, 432021, 468247, 207230, 10464, 1994, -18109, -265794, -507354, -508254, -363769, -205870, -155918, -123838, -121882, -23151, 18098, -15363, -43521, -180597, -366576, -462671, -569131, -731533, -736338, -640437, -500597, -473100]
16888d73100L1402J11550K7714N717l0266p5018J3191L3672L0719L5428j45532
16877d34523k076J59163J43503p7079k9567J7311n4527M8302O7139K956l8136
16866a97534j0140o1945l5018m6524N0745J00114J13657Q3528k6510n2936o9146
16855a51709K6279K7751o2464n2332j0619l5610P14O1747O4357J8251O4606J6230
16843c2799l0270k2864l7905L0008k7035p3303l9053K6367O4343o4527l6940j4994
16831b58972M694L0483P4438O2442K8536j12374p4010Q0504P8155M594l4571K6584
16819h9497J3809J5307q5594J2882M9425q951j9067j5871j0643O1394K5532j4186
16807f5460L0512j6411k3260n971J36644L1686l6262N9538R7042p0504j17547
$$ y = [-473100, -441698, -330148, -302434, -296717, -326983, -402001, -388810, -355138, -324419, -288991, -434523, -436599, -277436, -133933, -211012, -240579, -223268, -277795, -229493, -162354, -159398, -197534, -207674, -269619, -304637, -351161, -300416, -200302, -86645, -3117, -29627, -82563, -151709, -125430, -97679, -160143, -212475, -223094, -258704, -257990, -196243, -131886, -113635, -49029, -32799, -63069, -85933, -123838, -93830, -120865, -194168, -233221, -206854, -142511, -207038, -243978, -258972, -254278, -223795, -149357, -86915, -58379, -170753, -244763, -164259, -86104, -81510, -116081, -89497, -75688, -60381, -145975, -133093, -83668, -92619, -111686, -127557, -138200, -76806, -51274, -65460, -34948, -51359, -74619, -80590, 56054, 87740, 51478, 111016, 208058, 137554, 20007]
16796B0007o9395L7667n9021m2013r6979p457N8940k0509k3362J3840P2302o370
16784a22350M1564R8032j6987j8971J7382j29254j16203l592O9107J464k6657
16773b06465N796M1480o8394J0714K1238q93M2243o6326O2286O6593m2025O3705
16761g0048L0862r2011j84M6589p2080l2892O8102L2889N3502k8941m2470p209
16749a13891L4472M5256l8968j19888m2379J10641J0444J7253k1113M9500O0210
16738h463j2231r367l5652J5337J5788j3580k3530J26587N689n0252m4791p997
16726d2462l6615j7520J7037q5080o7818o4621j7396J12453J26492K2757J733
16715e1040Q4649o9759l2309K9884o2139J6761L8176l1918K230K5954o9793N368
$$ y = [20007, -49388, -11721, -70742, -112755, -209734, -217191, -158251, -178760, -202122, -188282, -115980, -122350, -80786, 17246, 259, -18712, -1330, -130584, -246787, -250379, -181272, -179808, -206465, -200669, -159189, -227583, -216869, -195631, -196524, -154281, -220607, -158321, -91728, -133753, -70048, -39186, -131197, -131381, -84792, -156872, -189764, -121662, -88773, -35271, -64212, -106682, -113891, -79419, -34163, -73131, -193019, -235398, -124757, -114313, -97060, -118173, -68673, -8463, -20694, -30061, -65713, -50376, -34588, -48168, -71698, 54889, 60578, 10326, -34465, -42462, -79077, -96597, -79560, -164640, -232458, -297079, -314475, -202022, -75530, -52773, -51040, 33609, -36150, -68459, -38575, -100714, -83953, -45777, -77695, -75465, -49511, -119304, -113936]
16703a13936L4637L5480p2047L2135L9015j15526o7345M3951Q5672N3174K4666
16692b0124j00291o4289L5705L6402K4302j4906j4460m200M639O0617Q724r5118
16680a42999l8262J47554P5003M7056j07179j09260L8675J983J17125J4596j02955
16669e8663J9857J8055j08076l3616L3951P980M991j7673J12935M033l3020O1529
16657A2283M8747p9370n6785m5230K7088k2438o2683L6118K5545N5007J2879q1986
16645a30825o8813p3038M5718J28439K7194j7887k449j6762Q2879L3495l8208
16634c0257m6495M550n7422J7957j7122K7322K6883l6158j2983L8203n4513m5311
16622a85346R4100J32017k7636n5903k5241j40638j8373O9530J22051M6934q8161
$$ y = [-113936, -79299, -43819, -115866, -83731, -44716, -160242, -227587, -183636, -97964, -44790, -20124, -120415, -184704, -148999, -112597, -88295, -103201, -117661, -121861, -117222, -56605, -47881, -142999, -181261, -33707, 41296, 88352, -18827, -128087, -89412, -87429, 29696, 44292, -58663, -38806, -20751, -128827, -162443, -128492, -120512, -115521, -133194, -20259, -16226, -49246, 12283, 61030, -18340, -75125, -120355, -93267, -115705, -178388, -142270, -116725, -61718, -48839, -130825, -199638, -272676, -226958, -98519, -71325, -89212, -91661, -108423, -25544, 7951, -30257, -76752, -72202, -129624, -111667, -128789, -101467, -74584, -110742, -123725, -85522, -140035, -185346, -91246, 40771, 13135, -42768, -68009, -208647, -227020, -157490, -35439, 11495, -76666]
16611g6666K081o4777r8449M3209K4796l1858J4556L2290Q814m6683M9857q676
16599a51506n188k6429o3729Q7327k0179n6199K3762L7264N5340k1803o8228j09618
16587c19186m5312L8691J22974J11765K2080L4707k3153o3741j2062K0840L8702
16576g3695m8605J2670L4561K216j3762J2823m6126n9067P1322m6218o989k7665
16564a88535j1419n11j1871J39043P499Q8862J877Q436R1579K7834m9197N9117
16552A62714L3203k4752J7570R3052R5618Q1325J68161K52183M05443M16923L55353
16541B056793K88647q52l33157l56501l56458k77284j23122j13710j04472P393
16531F87277P4479J75966M09729L93349K80889R7788k71680l83292m49579l71647
$$ y = [-76666, -74585, -139362, -237811, -194602, -169806, -201664, -187108, -154818, -146004, -192687, -142830, -151506, -156694, -183123, -246852, -159525, -179704, -235903, -212141, -174877, -119537, -141340, -209568, -319186, -364498, -325807, -202833, -91068, -68988, -34281, -57434, -121175, -133237, -112397, -73695, -122300, -109630, -75069, -72853, -86615, -73792, -119918, -178985, -107663, -153881, -160870, -188535, -199954, -200465, -212336, -73293, -65794, 23068, 24945, 33381, 124960, 152794, 103597, 162714, 195917, 171165, 188735, 281787, 377405, 458730, 626891, 879074, 1284517, 1701440, 2056793, 2345440, 2344588, 2011431, 1654930, 1298472, 1021188, 898066, 784356, 679884, 687277, 761756, 937722, 1347451, 1740800, 2021689, 2119477, 1847797, 1464505, 1014926, 643279]
16521F43279j92264k04752p8999p3001K4365k4208o258j4156j370j7832q9994
16510c5190j8630N7041k9237Q3821N5775o2861j47709m8366K0030j0989j7399
16499a53714M3649L0705L238l9809j0676k0997j36700L9469Q6050J007J2846K5597
16487a19335J2017L4183k8262L3348L4112n7338j05454K2914N9586J4117n0994
16476a51106O3226O7465L2951j18937j51978l2408J7668J10082J06024J9277n4460
16465i2196P2347O3505l9852m5933q199J0507Q3616P731k9300K0192K3698l9037
16453B7079j1479m5556k7300L7937o9758J950j4561L9564j1681r2273k6411q290
16441b00779K3481L3770L2499j1132j1898q0992p2028K6115R4840O7702K745p5650
$$ y = [643279, 451015, 246263, 167264, 94263, 118628, 94420, 88162, 74006, 72636, 54804, -35190, -53820, 3221, -26016, 57805, 113580, 50719, -96990, -145356, -125326, -136315, -153714, -110065, -79360, -76122, -115931, -126607, -147604, -284304, -244835, -158785, -157778, -144932, -119335, -107318, -73135, -101397, -68049, -33937, -91275, -196729, -173815, -114229, -100112, -151106, -87880, -20415, 12536, -106401, -258379, -290787, -273119, -163037, -57013, -37736, -92196, -19849, 43656, 3804, -42129, -50328, -39821, 43795, 51526, 22226, 42418, 66116, 27079, 15600, -29956, -57256, -19319, -89077, -87127, -101688, -62124, -73805, -166078, -192489, -200779, -177298, -143528, -111029, -122161, -134059, -215051, -287079, -260964, -166124, -98422, -95677, -171327]
16429a71327l2503Q2193L9020m841n7425K7004n479L1083O8517O1332m7968n1178
16417f1572L050m7926j9059J7961P7125O8871o1361k8505r6922k6702L9679J9243
16405a16118r1076j2608M6259k601m8865k184J06516P298J33258L3937j06242
16394e2426n1501r3889L0040J1015J0013K341o085N7553J12357L5873j149m9744
16382D398l4601j02929l1972L3135K3859j389K4016o0429m0403M9161J27073k5165
16370c5246l6485K7O2135k4882p7702p7667K5896O7563N7601q0373l1752O8079
16358h2806O8159L2211n0991l3803k2677k8666k5826l4735O7664j222o51l2737
16346a46080k4592O4483j8600k498k358Q939O2319M8597n8660p0155k3518j2115
$$ y = [-171327, -203830, -121637, -82617, -87458, -144883, -117879, -123358, -92275, -23758, 37574, -10394, -61572, -58522, -106448, -125507, -107546, -30421, 38450, -22911, -51416, -148338, -175040, -135361, -116118, -207194, -219802, -173543, -176144, -225009, -227193, -120677, -113379, 19879, 53816, -52426, -103927, -197816, -167776, -156761, -146748, -144407, -150492, -92939, 19418, 55291, 54142, 4398, -30203, -133132, -165104, -131969, -108110, -109499, -85483, -145912, -186315, -137154, -10081, -35246, -71731, -71704, -9569, -34451, -112153, -189820, -163924, -96361, -38760, -119133, -150885, -82806, -14647, 17564, -33427, -67230, -89907, -118573, -144399, -179134, -111470, -112692, -113343, -146080, -170672, -106189, -124789, -127287, -129645, -120706, -58387, -9790, -68450, -138605, -162123, -174238]
16334a74238m3611J4808J9082m6644Q9414P8092L8469L69k4519Q068l5334M2747
16322c3297O7251p8123j21607j01643j9594M7248N7247p236r264l1073J3055n419
16310b22455P1976P728j7617R1244K2580l7650p4768K6692K5270K2267J8357k5251
16298i1627o3064J33122L3879j8259K2538j0138l459n4832m2538l2608r537J01541
16286c4982K9135q3673K2877J416K920M9102o580o986P4874N3836k2855j23054
16274d3970j13420l4444l3985J9717P9514k7927q3087l3387P2386K0489J9309
16263a58805o2053p2224N2943O2871K1845J15425P6981k3689p2570O751n5128
16252a07653p8963P8301J56691K5824m4747o4269m6624k7648K1648k9087k0300
$$ y = [-174238, -217849, -203041, -183959, -230603, -141189, -63097, -24628, -24259, -48778, -40710, -76044, -33297, 33954, -44169, -165776, -267419, -287013, -239765, -182518, -189754, -199018, -230091, -217036, -222455, -150479, -142751, -160368, -69124, -46544, -84194, -158962, -132270, -107000, -84733, -66376, -91627, -154691, -21569, 12310, -5949, 16589, 6451, 2992, -51840, -94378, -126986, -136523, -34982, -5847, -89520, -66643, -65227, -62307, -13205, -19785, -26771, 48103, 101939, 79084, -43970, -157390, -191834, -225819, -206102, -126588, -154515, -237602, -270989, -198603, -178114, -158805, -220858, -293082, -240139, -177268, -155423, -39998, 36983, 13294, -59276, -52525, -107653, -186616, -108315, 48376, 74200, 29453, -34816, -81440, -109088, -87440, -116527, -136827]
16241a36827k0205J11121L6503j21676l0991Q4440Q1848M6205K4986r4162k4886
16230d3644q6865j07450j1287L3571l9063N8154Q700j807J36160j6646M0838M9955
16218B0616Q8267n0952j59337J2131L1065Q1096L9929K8601J3991M182j5845j05681
16206a1937r9666k2153L2915K0322J01496j7997k4896k9772j5584Q3878l4460
16195a7854p0391m0834N2322R0508q9525o0927K2007o522J14297j35152j01826
16184b43897M8893k2860j00326k224q316N37R0753N4216L0118K691J08238J2017
16172c0160m4026j7151p8466N3765J7595m0655p0430k757R0459N1635k1145m7401
16160a38737n731L2679k4258k0320J7586m824M4404J2697K467n5167N474J6841
$$ y = [-136827, -157032, -45911, -9408, -131084, -162075, -77635, 4213, 50418, 75404, -18758, -43644, -130509, -237959, -249246, -215675, -254738, -196584, -187884, -189691, -53531, -70177, -29339, 20616, 108883, 57931, -101406, -89275, -58210, 22886, 62815, 91416, 105407, 109589, 93744, -11937, -111603, -133756, -100841, -80519, 20977, 2980, -21916, -51688, -67272, 16606, -17854, -88245, -129079, -76757, 13751, -75774, -136701, -114694, -121216, -6919, -142071, -243897, -195004, -217864, -318190, -320414, -328730, -328193, -237440, -183224, -153106, -150415, -42177, -30160, -74186, -91337, -169803, -116038, -98443, -139098, -209528, -212285, -121826, -70191, -91336, -138737, -144468, -111789, -136047, -156367, -138781, -143605, -99201, -86504, -84037, -139204, -133730, -116889]
16148a16889j2469N213Q4041L3513o6996j5942N4262n7758r532l1291o3144l0259
16136b27251l4377Q6366J29220R40m02m0187n6396K6026M3312n9698L0899R888
16124i1660m2418p237k6874L1630j4123o9231N5922R4782O1686L5385j982M954
16112C0834N3095q2835j08098R403l2837k4899p9058j4573J45432J20712l1595
16101a4419j53222p7220K7349M6319M2855l1192J9093K4559m5505K6957M3572
16090i0854j64796r5385Q6325J37101j9559o9171J7992K3888M4219n634P020O8623
16078f0231n393n3272Q7561n2038j08106m9588R5311R1303J05436r8711o486M4276
16066i938J4277K4667K4449j03232j07467L718P8738o714J4219J6432k5888l7362
$$ y = [-116889, -129358, -124145, -40104, -6591, -73587, -89529, -35267, -93025, -102557, -133848, -196992, -227251, -261628, -175262, -46042, -45102, -45504, -85691, -142087, -116061, -72749, -132447, -101548, -91660, -134078, -141315, -168189, -136559, -150682, -219913, -163991, -69209, -7523, 27862, 25880, 30834, 83929, 1094, -107004, -97601, -130438, -155337, -234395, -248968, -103536, 17176, -14419, -167641, -244861, -217512, -171193, -128338, -159530, -140437, -115878, -161383, -134426, -90854, -255650, -351035, -264710, -127609, -147168, -216339, -198347, -174459, -130240, -135874, -128854, -60231, -65624, -118896, -31335, -83373, -191479, -241067, -145756, -54453, 50983, -47728, -54214, -9938, 4339, 29006, 53455, -49777, -157244, -153526, -74788, -81502, -67283, -50851, -76739, -114101]
16054a14101O0203L6124N282j47710m3849J06166m0284j13004K1807M3572o6995
16043b52789M8960p0015m267K2044L8593P0640K0682L1010j955O2411O6957k3843
16031H428q4668Q024P1945N3411j0102n8870O5005q218p7335j6125k2319k8791
16019i9615R30k3588q1908l3940K1719Q2616o679k0802m7439l7196l3587j3045
16007b92534N4000J4380R8945n5527J0796j1831k3630R4225j758L748J6859j0416
15995a02743Q977P3198P7158l0137m2271J0074j7198r5672N1147P937j538M3038
15983a8030n7158l90R3812m1687r634n4131j1362J224n8857p3723P2990O1552
15971i5394n3051m7107N1890J123K8773J8141J6467O2713l1746n6753K5711M3886
$$ y = [-114101, -53898, -17774, -12492, -160202, -204051, -97885, -138169, -251173, -229366, -185794, -252789, -203829, -273844, -278111, -256067, -217474, -146834, -126152, -95142, -97097, -34686, 32271, 8428, -76240, -68216, 3729, 57140, 47038, -11832, 53173, 44955, -32380, -48505, -70824, -99615, -98685, -122273, -204181, -238121, -216402, -133786, -140465, -161267, -208706, -245902, -279489, -292534, -238534, -224154, -125209, -180736, -169940, -181771, -205401, -111176, -112934, -109186, -92327, -102743, -93766, -20568, 56590, 26453, -15818, -5744, -22942, -118614, -67467, -59530, -61068, -18030, -75188, -75578, 18234, -23453, -33087, -87218, -98580, -97356, -156213, -229936, -156946, -95394, -148445, -195552, -143662, -142539, -113766, -95625, -79158, -16445, -48191, -104944, -79233, -35347]
15959c5347J3354q924l3559K2592J298P4345k5900m1330J05604k1870j23811j0450
15947h3998J8384K378l8257P4943m0644j10437j06030J17083P9142J1986k4872
15936a00322m737N2997N711k5386m1922o2274J0848P844L0300o1081p2737J20560
15924a40199J32579O6160M245k9083O188q9450j10046p4460J8923L7433K0183
15913a57527l648O5598j0548P4770J6337o4925j10249j33405P2338k1937O2439
15902b10757P3426P1981n0214l9830o5780J2551K4529L6935K0822l1814L1496
15891a26655J6016k5030L0241K6347K1729Q5090P5932j4667k3866L1956q1962
15880A5131r1681Q5240m2379m0518K010o793l8630K1346r2827M1290R1164J6709
$$ y = [-35347, -21993, -30917, -64476, -41884, -40586, 33759, 7859, -33471, 72133, 50263, -73548, -83998, -65614, -63236, -101493, -26550, -67194, -177631, -283661, -166578, -87436, -75450, -100322, -105059, -52062, -46351, -71737, -113659, -175933, -165085, -157241, -126941, -188022, -260759, -140199, -7620, 58540, 62785, 33702, 39890, -49560, -159606, -234066, -215143, -177710, -157527, -161175, -95577, -106125, -31355, -15018, -79943, -190192, -323597, -251259, -273196, -210757, -137331, -65350, -115564, -155394, -221174, -208623, -184094, -147159, -126337, -158151, -126655, -110639, -135669, -105428, -79081, -57352, 27738, 103670, 89003, 65137, 97093, 15131, -76550, 8690, -33689, -74207, -72197, -78990, -117620, -96274, -189101, -147811, -56647, -39938]
15868c9938L488k2325r8564m9710O8333P9824J3086L7936k6869l5511n6217m0667
15856a67134r3778m839R4693K4169R3850L5653m3361N460p3708m5941l8289J0067
15844b03158O8111k3374k7128J37365M4849m2440N7396K7855J1385Pp9870n7352
15832h6354p55l5208N7718N7298J1775N032j0793m9069j00581K6927N2114Q347
15820f3549m3913j28624J5512P1581P8921O8422K8925j7146J9591M8514k6935
15809E1299p2047m159k1557M4169k3344O5387K6870n7219o0102K7178O4402m2819
15797a942l0031k4532N0361M0107l1919l8587l4901l8971J2038n4927L9785J9340
15785i4179k4004r0845k6138M2198Q0352O9555j6086J1671p2894J2217N0734J7583
$$ y = [-39938, -36450, -58775, -157339, -207049, -138716, -58892, -45806, -7870, -34739, -70250, -126467, -167134, -260912, -265751, -171058, -146889, -53039, -17386, -60747, -55287, -128995, -174936, -213225, -203158, -135047, -158421, -185549, -48184, -3335, -45775, 11621, 39476, 50861, 50868, -29002, -86354, -87109, -122317, -64599, -7301, 4474, 9506, -1287, -50356, -150937, -124010, -71896, -63549, -107462, -236086, -220574, -148993, -70072, -1650, 27275, 10129, 29720, 78234, 51299, -20748, -24907, -46464, -2295, -25639, 39748, 66618, 9399, -50703, -23525, 40877, -1942, -31973, -56505, -6144, 33963, 2044, -36543, -71444, -110415, -98377, -153304, -113519, -94179, -118183, -209028, -235166, -192968, -112616, -43061, -59147, -47476, -120370, -108153, -57419, -39836]
15773c9836r5643J5Q4576r4904M2770K1778P2939M6634J478K5045m9084j11058
15761i5290j26622k397Q1370O1584J3008M8429L4980O6483J08280N3336r7379
15750A45782n4115j09843k4116M4930o9121j5639N202r3234o2781K5155M5695
15739a62085K6834K3403J24m7563l4591k1784O959J04685L9728j15169l3667N7164
15727a55962O9368J07336R491N1397O4147q7339k5241k9245n7401k5479j1960
15716i0888M6522j9374J4630O7165M598l3524M06k7822p5126k999K3279K5903
15704f7230m5049L1121J5328M7906j8585j3375J0367n7595J0456M2435n4054o6672
15692a64947j29848j4620L8623Q0833J75564R2728J0387q0038j00800j4714o0590
$$ y = [-39836, -135479, -135464, -50888, -145792, -103022, -81244, -8305, 38329, 39807, 64852, 15768, -95290, -221912, -224309, -142939, -81355, -68347, -19918, 15062, 81545, 189825, 243161, 145782, 91667, -18176, -42292, 2638, -66483, -82122, -76920, -170154, -232935, -207780, -162085, -135251, -111848, -111724, -159287, -193878, -215662, -208703, -104018, -64290, -179459, -213126, -155962, -86594, 20742, 30233, 81630, 145777, 58438, 33197, 3952, -53449, -78928, -90888, -44366, -63740, -49110, 18055, 22653, -10871, -10465, -38287, -113413, -116412, -93133, -67230, -112279, -81158, -65830, -17924, -36509, -49884, -39517, -97112, -86656, -44221, -98275, -164947, -294795, -309415, -270792, -189959, -14395, 78333, 88720, 8682, -92118, -106832, -167422]
15681a67422p3913L9900Q2577m2427l6730J6084N5855N7286j1113j2563R1664
15670h02J8138K8520k9972j61866o7691j5696J12859P9198J9514K3982l8120L069
15658b8867P4106m2742j40192o1945J19699Q4740J0918n2347p1321j6303L6233
15647h8021O3228k2156j07426L0707k2558J1508k2133L0639j4593P946L66N4221
15635g8272m2416p5661q0815M3950L9785M7597j01127Q7071M8881j2013J2380
15624a10640M4496Q7275L0506k9125p6240l3220l1018l8956K6920L340R3507M8621
15612A5466M2816n803m8692j9857l5984l051J04428L332p2890j49716q5146P5976
15600a79121R7500O2322k7017p6502K8737N0997Q6359m9776p6118o3312o0295
$$ y = [-167422, -241335, -201435, -118858, -161285, -198015, -181931, -126076, -68790, -79903, -92466, -802, 17336, 45856, 15884, -145982, -213673, -229369, -116510, -37312, -17798, 6184, -31936, -28867, 45239, 2497, -137695, -199640, -79941, 4799, 15717, -36630, -107951, -124254, -88021, -24793, -46949, -154375, -123668, -146226, -134718, -156851, -126212, -140805, -132859, -132493, -78272, -120688, -196349, -277164, -233214, -193429, -145832, -246959, -159888, -111007, -123020, -110640, -66144, 21131, 51637, 22512, -53728, -86948, -117966, -156922, -130002, -126662, -33155, 15466, 58282, 52479, 3787, -16070, -52054, -55105, 49323, 52655, -20235, -169951, -255097, -179121, -81621, -19299, -46316, -122818, -94081, -43084, 43275, -6501, -82619, -145931, -206226]
15589b06226M1166N3637L0979J4720Q762J09154K2333n0625j40245n2066J7742
15578a50669l4297P2915J8025M8914R617o3507j1219q0848l4341Q8591N1499K9270
15566e6050P1773m2297q0300k1337J5472m8956q53O2185N6027N8154o6319p9107
15554a31608P6952O8602n2399P4934L3165n18K340p7410j7786Q232J6942n2278
15542e0832o7336J7952q124K8492p4834N1653m122k8962M9100O1832J9471n269
15530a0979O5513l496p1445l3771n5739k1087m076j0214k7825k3601L3988P6993
15518h5739J27010q2381j20461K2404N6554P8535L0827p703o3147J2554Q1641
15507E0094m0729K73N2126k7606j7867k0189o6697K3712K7116J5467k567j8410
$$ y = [-206226, -165060, -111423, -80444, -65724, -56962, 52192, 74525, 23900, -116345, -168411, -150669, -184966, -112051, -94026, -45112, -35495, -99002, -110221, -191069, -225410, -136819, -85320, -56050, 15723, -26574, -106874, -128211, -112739, -161695, -162548, -100363, -44336, 13818, -52501, -131608, -54656, 13946, -38453, 36481, 69646, 69128, 71468, -5942, -23728, -15496, 1446, -50832, -118168, -100216, -108340, -79848, -154682, -103029, -107151, -136113, -87013, -25181, -5710, -10979, 54534, 51038, -20407, -54178, -109917, -131004, -135080, -145294, -173119, -196720, -162732, -85739, 41271, -41110, -161571, -139167, -82613, -4078, 26749, 19046, -44101, -31547, 50094, 9365, 9638, 61764, 34158, 16291, -3898, -70595, -46883, -19767, -4300, -6867, -25277]
15495b5277r7962n9777M2374L3654k5658M8110p634K678R263J7566l6755j0508
15483a09926M2255P2100L0508j08435j2992J1816l7752r270O3425N5078q870o324
15471a8387o047m8514L9857Q0343k5581o3681j5719o066q2235j27872l1706l4862
15459c40470J45060J27777J8551N6580J4642j12634n4846L0349K1197J1445K0768
15448f1581M2488k3150J7824M3610N3274l1681k3005m9938L7791J7307j1558k6537
15436a5156m3437j1072O6112N4226p8411n9566j4558k5744L9537N6430o7133l0197
15424a28969J7389M9704J4607Q0968q9878q9059M6714K1378m9555j3376k1094
15413a61171j2443R7195R0071k3510m672M5752m5242l1315k1663J0423j17482
$$ y = [-25277, -123239, -183016, -140642, -106988, -132646, -84536, -92170, -89492, -80229, -62663, -99418, -109926, -67671, 4429, 34937, -73498, -86490, -74674, -112426, -121696, -58271, -3193, -12063, -18387, -24434, -72948, -33091, 47252, 21671, -42010, -57729, -63795, -146030, -273902, -305608, -340470, -195410, -67633, -49082, 7498, 22140, -90494, -145340, -114991, -93794, -82349, -61581, -19093, -42243, -24419, 19191, 72465, 40784, 17779, -32159, 5632, 22939, 11381, -15156, -58593, -69665, -3553, 50673, -27738, -87304, -101862, -127606, -88069, -31639, -98772, -128969, -111580, -61876, -47269, 33699, -56179, -145238, -98524, -77146, -126701, -140077, -161171, -173614, -76419, 13652, -9858, -14530, 31222, -14020, -45335, -66998, -56575, -174057]
15402a74057o8512N7120N7357l755N5491R7000n4318p0272N6615n0283k5285P5067
15390d7832R019j2769m0236O5941R2524j1086o3547n7249k6121N034j4533r8164
15378a99019N5199J10064Q7261r4370o5181J9941M6960R1560n487j16890j13895
15367a83857m2733p3128R0362J16071q493P2279K1507o836r1848m7970Q4573L3266
15355c6807M423m6119N747o0623R362P1290J18156M8934m1320p4527m2664j3286
15343e7434J0463q755q0589M3034J17898m6305N1742K2077j6859j172o4685j9778
15331e0363n8237l060j7163m8460J946L9876N4543M7277J00639J03287j0545j60187
15319d47p2557j0400L2166j5753n6746L7535K0217m6459P5787N8071m3918N7207
$$ y = [-174057, -242569, -185449, -128092, -131847, -76356, 20644, -33674, -103946, -47331, -97614, -122899, -47832, -38813, -51582, -91818, -25877, 66647, 55561, -7986, -65235, -91356, -86322, -100855, -199019, -143820, -33756, 53505, -40865, -106046, -86105, -39145, 52415, 46928, -69962, -183857, -226590, -299718, -209356, -93285, -101778, -29499, -7992, -14828, -106676, -154646, -70073, -36807, -32384, -78503, -72756, -133379, -124017, -52727, 65429, 114363, 73043, -1484, -44148, -57434, -46971, -55726, -136315, -93281, 24617, -21688, 30054, 52131, 35272, 34100, -30585, -50363, -108600, -111660, -128823, -177283, -175337, -135461, -80918, -33641, 66998, 170285, 159740, -447, -73004, -83404, -51238, -66991, -123737, -86202, -65985, -112444, -36657, 21414, -22504, 34703]
15307C4703J04131r0918q3510l9729j5194M6182O644l0491K819n3912l9205J36324
15295b2156K2305q0762l8397Q2068J4934r0564L5001O4342j9874j5872n070K6964
15283b7081N0150K7702L6332K0068j32702j10403O4041K1615N1982Q1154Q5210
15272A68068m094o8395n7668j08879j5616N5341K0636l407P2979J4882R70O5255
15260A40072n1787j28137o1190k1828J12651o8785o3516n2213l2471R2387L9682
15249i5135l817N0780M5648N6060k4314l6798Q3699O8622l0510l4801o59l9896
15237C8879n2603j9721j7843L1541M2102l4394K0410k8596m28J7442l2912L0424
15225e699l3939p2432n2625M4343J38910Q7692K5466j5941l0913k075r0254r7576
$$ y = [34703, 138834, 47916, -35594, -75323, -90517, -44335, -37691, -68182, -65363, -119275, -158480, -22156, 149, -80613, -119010, -36942, -22008, -112572, -77571, -13229, -33103, -48975, -54045, -27081, 23069, 50771, 87103, 107171, -25531, -135934, -71893, -50278, 1704, 82858, 168068, 163974, 95579, 37911, -70968, -86584, -31243, -10607, -14014, 58965, 73847, 74817, 140072, 88285, -39852, -101042, -122870, -10219, -79004, -142520, -194733, -227204, -134817, -95135, -98952, -48172, -2524, 53536, 29222, -7576, 76123, 144745, 114235, 79434, 78775, 38879, -13724, -33445, -51288, -19747, 22355, -12039, 8371, -20225, -20653, -3211, -36123, -5699, -39638, -112070, -164695, -120352, 18558, 106250, 131716, 115775, 84862, 82787, -7467, -105043]
15213a05043L0799P8687j9342n4892J4488N3863o0560j72575m6367o0265O651
15202c34556J00200K0841M9907j5344N2161N6012J3384P2996L5692R5853j44553
15191B593j25074O5158Q105l3670Q1712o8301j06240r680m303Q8900Q1114Q8797
15179F9111o9136J4523Q3103j1929j07321k6835K0911k6673N9189m2669p0818
15168a08544P6311J00259n8814m9725J38988N1930p6448l3928n3299q7580J1357
15157h9493n3897k9335J27551j3066j1514K0489o2892o0178j891j6776J013Q282
15145a81707K7230N2929J6105k235n9855J8398K4251P4547j9693J802J9248n8900
15133h7880N5334J34312l7992j02836o3877O7927M0405M8818Q011j22743r40m8293
$$ y = [-105043, -74244, 4443, -14899, -69791, -55303, -1440, -62000, -234575, -280942, -341207, -334556, -234356, -213515, -163608, -178952, -126791, -70779, -57395, 15601, 51293, 147146, 2593, -122481, -57323, -49218, -82888, -1176, -69477, -175717, -185397, -189700, -100800, -19686, 69111, -25, 14498, 97601, 85672, -21649, -48484, -27573, -54246, 4943, -37726, -108544, -32233, 68026, 9212, -40513, 98475, 150405, 73957, 40029, -13270, -100850, -89493, -143390, -172725, -45174, -58240, -69754, -49265, -112157, -172335, -174226, -191002, -189989, -181707, -154477, -101548, -85443, -87678, -147533, -129135, -104884, -30337, -50030, -48228, -28980, -87880, -32546, 101766, 63774, -39062, -102939, -35012, 5393, 54211, 62222, -60521, -61461, -109754]
15121a09754J1589J32942J0924J5072J5121m5767l9071O6274J8463N5257o3934
15110F7116n4861j7490n198o3153l9430J34752Q260k5492k9473N0270P7964l278
15098I9987o2996r9150j1874P0089N9465k2558r7489p3714k156N7738O0991l4240
15086e5907k4108K338r1395j025R6609K9180n0092p507q1868R056J51648k0860
15074d3931J3150J07689Q41l8529R292P858l9890m1591q0201j7573j2887j0628
15062a46400O727L5680L7420J6240M3500J051K9145R693L4643l9963j16517K2622
15050f6159l3383K0761N1096j0454l2302l6778n1912M9158N5978n0780j388L0649
15038g5514M9590r298m2024M0848K6129k753J7105J3092L9343n7807j8516O6818
$$ y = [-109754, -98165, 34777, 45701, 60773, 75894, 30127, -8944, 57330, 75793, 131050, 67116, 12255, -5235, -10433, -73586, -113016, 21736, 29996, 4504, -24969, 25301, 103265, 99987, 36991, -62159, -74033, -3944, 55521, 32963, -64526, -138240, -140396, -82658, -21667, -55907, -80015, -77677, -169072, -170097, -73488, -44308, -94400, -101907, -183775, -174719, -23071, -43931, -30781, 76908, 77749, 39220, 48512, 56370, 16480, -25111, -105312, -122885, -135772, -146400, -139673, -103993, -66573, -50333, -6833, -5782, 23363, 33056, 67699, 27736, -88781, -66159, -99542, -78781, -27685, -38139, -70441, -107219, -159131, -109973, -53995, -104775, -106163, -75514, -25924, -35222, -77246, -36398, -10269, -13022, 4083, 17175, 56518, -1289, -19805, 47013]
15026D7013n4616m7750L8165N599m936o7354r9579M3347K3189N4901N1073l0989
15014d1937k8703j5242o1001k4300K3987R8472j9053K1083k2214o9368L6251M3323
15002e8702Q5548P5916N7954N47q5326j57122O393J04320R4984K8101J5055j37635
14990C0033j44000J4010M6188N9214p8882o1248L6874J00992P895p5847l6976
14979a01747N6812o764J566k1521p67l0477L2588O5381R49O0546o3203l4165o5718
14966a06520L440R1514j2415N6752P0478Q410P1202P2699r0237j11648q600m1537
14954C538k3075j3708o2079k5516l551N1220k5515o0745J05963O1157J524o8725
14942e9512K9640L6665l6964k6879J1047L6581l8444P8369P7606k624M32q1797
$$ y = [47013, -7603, -55353, -17188, -11589, -16525, -83879, -183458, -140111, -116922, -62021, -10948, -41937, -70640, -85882, -146883, -171183, -147196, -48724, -67777, -46694, -68908, -138276, -102025, -58702, 26846, 102762, 160716, 161263, 75937, -81185, -74792, 29528, 124512, 152613, 167668, 30033, -113967, -99957, -53769, 5445, -73437, -134685, -97811, 3181, 11076, -64771, -101747, -44935, -51699, -50133, -71654, -72421, -102898, -70310, -4929, -3980, 56566, -6637, -40802, -106520, -103080, -11566, -23981, 32771, 103249, 111659, 182861, 255560, 165323, 53675, 45075, 3538, -19537, -33245, -95324, -120840, -124391, -73171, -98686, -159431, -53468, 7689, 9213, -59512, -29872, 6793, -30171, -57050, -46003, -9422, -47866, 30503, 108109, 105485, 105917, 24120]
14930B4120q5783l2663N422n9543M5090N0804l3521j941K2161R4220J6251m7970
14918c353o0873q4163j9357K8585J09174J9973l5458r4312O0686L580j3052O5010
14906b3560k7783n0381L6931J13586p8j40360j1735L688k6791N4451q1960l9898
14894a93890J9195P2319K3244N5860N240K3767M1432j0704N5693P3156n0609k2745
14882I1958Q2769O3195j10231l6793p7960l8753R6040n38m6593R403q3397m1432
14870i2332N4387M692o5208r0035r5099L9239J08044J2155R278O3300j076Q3381
14858C0726q560q5756p1536m1742j6822L5243K4878J4697L38q487P8358L4977
14846a3686M2340L5702k3153L7717Q5451l5824K5024L0612q0448j1894p1987l5310
$$ y = [24120, -61663, -94326, -88904, -148447, -103357, -52553, -86074, -88015, -65854, 28366, 44617, -3353, -64226, -148389, -167746, -139161, -29987, -10014, -45472, -139784, -79098, -75518, -88570, -23560, -51343, -101724, -64793, 48793, 48715, -91645, -103380, -99692, -126483, -72032, -153992, -193890, -174695, -102376, -79132, -23272, -18032, 5735, 47167, 36463, 92156, 165312, 114703, 91958, 174727, 237922, 127691, 90898, 12938, -25815, 70225, 69687, 23094, 32497, -50900, -92332, -37945, -33253, -98461, -188496, -283595, -244356, -136312, -124157, -114879, -51579, -52655, 30726, 22166, -63590, -135126, -176868, -193690, -158447, -133569, -118872, -118534, -127021, -48663, -13686, 28654, 64356, 41203, 78920, 164371, 128547, 153571, 184183, 103735, 91841, 19854, -15456]
14834a5456m4266j2415K7478Q10O2652j2036q3232m9366N4709L1820R0578L1248
14822H2524k4439j4821j6474m856r1218n1493Q0254Q5161M2611j52567K2878P774
14810c4666n9407m1449p7173m3488K2778k9435Q6042J19419J6122L814r725N0514
14798C346l6849l4371Q430J8647O069j02292L5167R4380P0672N103m7980J8954
14786C9276m38K7619m8202k9652P9552J2924n8148k5982N8368k8337j4415R8376
14774A10941Q239r9117k1041O1286J0815L708K5728L9332K2403J5549L564p6264
14762A05143o6897n7001L7123L8917l1306q1669J9688M7181P4837j3948r5241
14751b3173n7892O0651k0079p2048O6901L6301j9885P552j21074o1154J9943K7366
$$ y = [-15456, -59722, -72137, -44659, -43849, 18803, 6767, -76465, -125831, -71122, -39302, 51276, 82524, 58085, 43264, 26790, 21934, -69284, -120777, -40523, 44638, 87249, -65318, -42440, -34666, -94073, -135522, -212695, -256183, -233405, -262840, -176798, -57379, -41257, -37443, -47168, 3346, -33503, -67874, -59444, -40797, -34728, -137020, -101853, -7473, 63199, 68302, 20322, 39276, 38838, 66457, 18255, -11397, 68155, 81079, 22931, -3051, 55317, 26980, 12565, 110941, 119180, 20063, -978, 60308, 71123, 74831, 100559, 139891, 162294, 177843, 181407, 105143, 38246, -18755, 18368, 57285, 25979, -55690, -36002, 11179, 86016, 72068, -23173, -81065, -20414, -40493, -112541, -45640, -9339, -29224, -21672, -142746, -203900, -183957, -156591]
14739a56591L5251J3749K0298Q3613O2021o1304j7k1064L8319n237k2881m9847
14727f3690m2736l7116R728J8443J12263J24651p3125k61K2238M039K8007m9571
14715E2870p5070p3282k1510N0016J11804j9496n2526k9129m585P59l0046L8138
14703e2057l7461o897k4732k1823P1492J41800J0224L0714m9304j11354o6211
14692a15609O4989j9516M7281j5950p3469N236Q7128N3640n9576p3904p2892j7640
14680a90282R986N0748l2431M8838M7014L4171M7169M2144J7891o3081O9513n5736
14668B5944j395J7780p1121p1737R2958J1583k7549k6393J3232j2093N5754j5752
14656h789q9179M006K5823O0745P6214M9333N2638n6034O7576Q7411p4495j46895
$$ y = [-156591, -121340, -107591, -87293, -3680, 58341, -2963, -2980, -24044, 14275, 9038, -13843, -63690, -106426, -143542, -133814, -115371, -3108, 121543, 48418, 48157, 70395, 74434, 102441, 52870, -22200, -95482, -116992, -66976, 44828, 25332, -27194, -56323, -60908, -60149, -90195, -52057, -89518, -96415, -121147, -142970, -71478, 70322, 80546, 111260, 61956, -49398, -115609, -50620, -70136, -22855, -38805, -112274, -107038, -19910, 33730, -25846, -99750, -172642, -190282, -180296, -129548, -161979, -113141, -66127, -31956, 15213, 57357, 75248, 12167, 81680, 25944, 24549, 42329, -28792, -100529, -7571, 4012, -23537, -49930, -36698, -48791, 6963, -8789, -97968, -93962, -68139, -7394, 68820, 118153, 170791, 114757, 182333, 269744, 195249, 48354]
14644D8354o3505L825l2026K5897M2805K1731J0213Q6440r112j52095m2374N5689
14632d158J6954k9418p383r579L715j9147k1485l7159q4950o079Q7732N8493J0870
14619d1594L0738j4745J00904m5979j20428k2488M9110J09601L1057K3952p8770
14608B1358n3611N3940R0454l6901o7455k0054j3732k3052N3126J20174K8520
14597A52767q2586j28071o9612R3962J75977L553j62029k0878N8562n1570J0789
14586a9136k1906n2902l8885M1475J39198P7001L3362j15747q4625r537L8669
14575a3033J1647o0453M3334R1690o0034k7241N2227j2592L4356m9040q0153k1846
14563i1138Q3212M6432j30049j0433K3247k6517q411L6008O64N113K249L7588
$$ y = [48354, -15151, -11326, -43352, -17455, 25350, 47081, 57294, 143734, 134622, -17473, -59847, -4158, 12796, -16622, -24005, -33584, -29869, -49016, -70501, -107660, -192610, -198689, -110957, -52464, -41594, -10856, -25601, 75303, 29324, -91104, -113592, -64482, 45119, 76176, 100128, 21358, -32253, 21687, 112141, 75240, 7785, -12269, -26001, -49053, 4073, 124247, 152767, 70181, -57890, -127502, -33540, 142437, 145990, -16039, -36917, 21645, -29925, -19136, -41042, -93944, -132829, -91354, 47844, 124845, 158207, 42460, -42165, -51702, -13033, -1386, -61839, -18505, 73185, 13151, -14090, 38137, 25545, 59901, 10861, -69292, -91138, -7926, 38506, -91543, -101976, -78729, -105246, -113657, -77649, -76985, -71872, -69623, -32035]
14551c2035L0323L1970J0919j0844l4681L439j1888p6733n522K498N0501J00056
14539E8003P2652L2268J00219n4250n0244j1247p6406m7136k0992n8025n0082
14528a05240j6741O0132K0135k46k7620j9107M7040M9069O165p6168r9606j6175
14516a78362Q5473L3508N7415j5519J736J3825j5580L1871n8494q5727P7718J052
14504e1084j7336l1577M1132J9132N9733K486j4110n0216K1213Q007M3647m4600
14492a3573n885l3150J5388Q5629P9364M9333N4186n6487q1180k2709m4129M8361
14480G5148N908j06487r6693J18001J37705m406p9111n4608L4951n9115k7735
14469e6442j3236l8546m0189j01n0139K3414L1882J1325L8477j396n5303k4922
$$ y = [-32035, -1712, 30258, 41177, 30333, -4348, -909, -12797, -89530, -95052, -92554, -42053, 58003, 130655, 162923, 263142, 208892, 158648, 147401, 70995, 23859, 2867, -55158, -105240, -121981, -61849, -41714, -41960, -69580, -88687, -41647, 7422, 13587, -62581, -162187, -178362, -92889, -59381, -1966, -17485, -15749, -1924, -17504, 14367, -44127, -129854, -52136, -51084, -68420, -99997, -58865, -39733, 20000, 22486, 8376, -41840, -20627, -12620, 31027, -13573, -19458, -52608, -37220, 48409, 127773, 177106, 231292, 174805, 93625, 70916, 26787, 75148, 81056, -25431, -122124, -4123, 133582, 129176, 50065, -4543, 30408, -28707, -56442, -69678, -108224, -148413, -148514, -198653, -175239, -143357, -132032, -93555, -94951, -150254, -175176]
14457a75176M5303J04499J4335o3559k9375Q0929l2337l3965N643K6570j683K4461
14445c4355K5386m1041M440M8044j1111j9316m6763K8365N138M195N3566p196
14433I352j33623k3236l7871J27032J97400N5993q5179q2250k367j1444K0613
14422C4420J0107l6771o5392j5021R0062r936n482j05744m4034O0657M6678J18698
14410G8242J11538p4055p1996n7959l0919N36j41331k7641K7633N5719R1290L120
14398c5823J0531p8162M522K114K3740R3566J6566J9247j2889j4478l1629M448
14386A753N8725J9612j11628j9523o3638k6961l3712J8211P8121P8409k6623j5430
14374d2684k9321l6291m0116k2173Q6032M747n4919P685J03786J12118M0114j09801
$$ y = [-175176, -129873, -25374, -11039, -74598, -103973, -23044, -55381, -89346, -83703, -57133, -58816, -34355, -8969, -50010, -45570, 2474, -8637, -27953, -74716, -46351, -41213, -37018, 16548, 9352, -124271, -147507, -185378, -58346, 139054, 195047, 109868, 27618, 25251, 13807, 34420, 44527, 7756, -57636, -72657, 17405, 7469, 1987, -103757, -147791, -87134, -40456, 78242, 189780, 115725, 43729, -14230, -45149, -44613, -185944, -213585, -185952, -130233, -38943, -35823, -25292, -103454, -98932, -96818, -73078, 20488, 37054, 56301, 43412, 28934, -2695, 1753, 60478, 80090, -31538, -51061, -114699, -141660, -175372, -157161, -79040, -631, -27254, -42684, -72005, -108296, -148412, -170585, -84553, -79806, -134725, -127040, -23254, 88864, 128978, 19177]
14362A9177M708r7751J6850P1398n9698o9128M9883N9762o6596o2696L8336Q7348
14350h407q488M3678P079j66617l5135J4947O2596j5416L6409J35578n2278o8170
14338e4224l3787N7101j3636M811l4087o4520J3274o8184K4598R605J08514K716
14326d7819j6831j4911J3104M6252l4093k7040l2297J4314M1001K6288J23250
14315I1218l9116j26712L8442Q0084o5109q8904l714M2441k36O2848Q0706n6446
14303A5502q1348l7870O4715M3941R3317L9440o9606r8766Q981m504n4544M9817
14291c0925r3079n8807P0965J16753R0769j5389j228N5872K0358j0519j6921r9197
14279B8652o5417m157o8674j7988Q7510m056Q603J0446P869J796j0569P6985L0298
$$ y = [19177, 23885, -73866, -57016, 14382, -45316, -114444, -64561, -4799, -71395, -134091, -95755, -8407, -16895, 26783, 33862, -132755, -167890, -152943, -90347, -105763, -69354, 66224, 13946, -54224, -88011, -30910, -44546, -39735, -73822, -138342, -125068, -193252, -168654, -159049, -50535, -47819, -64650, -79561, -66457, -20205, -54298, -81338, -113635, -99321, -58320, -32032, 91218, 52102, -74610, -36168, 43916, -21193, -110097, -113811, -71370, -71606, -8758, 71948, 15502, -65846, -103716, -39001, 4940, 98257, 137697, 68091, -30675, -21694, -26198, -80742, -30925, -124004, -182811, -111846, 4907, 95676, 80287, 79059, 134931, 155289, 144770, 127849, 28652, -36765, -40922, -109596, -127584, -40074, -44130, -35527, -25081, -17212, -15416, -25985, 51000, 81298]
14266H1298k6746m420l4634n3468k1945L8601K5717o5207r241J2255J733k2390
14254g8447r6000L1570O7273k2960l1579L3735k013M6099J15954Q171l6005N0180
14242H5978J12782l8058j58036o9208r6857m1479L5593O665M8980K2309p202j69226
14230b67759m2040P2184Q2398Q4973j8655p5775J6886K1264J1072J3314l9905
14219a42043Q454J0902N933j3351j2795N2250L1563K8560l2367J3803L5172O8617
14207E4698p4189q7183J3082O3162K6319K8984N77M279K0726j10655n5292P7234
14195c8258M1082m6744N7751j790n0058l810O4504p6897n0747l8087K2220N6017
14183f4817M4911K8558j30447l3353N0365K2825j7884J6201P6140P3991N7036
$$ y = [81298, 54552, 50132, 15498, -37970, -59915, -21314, 4403, -60804, -70045, -57790, -56057, -78447, -174447, -142877, -75604, -98564, -130143, -96408, -98421, -52322, 63632, 71803, 35798, 85978, 198760, 160702, 2666, -66542, -163399, -204878, -169285, -162620, -113640, -91331, -98533, -267759, -309799, -237615, -155217, -70244, -88899, -164674, -147788, -126524, -115452, -102138, -142043, -133589, -122687, -116754, -130105, -142900, -90650, -59087, -30527, -62894, -49091, -13919, 54698, -19491, -106674, -93592, -30430, -4111, 24873, 25450, 29729, 50455, -60200, -115492, -38258, 2824, -43920, 13831, 12041, -38017, -41827, 22677, -54220, -104967, -143054, -120834, -64817, -19906, 8652, -121795, -155148, -104783, -81958, -99842, -83641, -7501, 66490, 123526]
14172A23526L6596j21275j30793J3533M51n7107Q1698Q4455j7820l7119l7049
14161f0904j6057n7866j0359J0404k5540j21731J20368J47364K509j9537J7380
14150a3969p190p091k8060J244m6524n6612j8166J6432L6111R2655n9210O0925
14138b9455r785J2979J4998k981Q3683L1258p8170N0913n8731o7736O2433L3872
14126D3278j9679j3140j3474M5393J08232q256n6885l3240j03396l5647J16238
14115B9424J8829k8904p7596K5087K5327l134l0089J06149P5377N925J4006p8052
14103H2349j68032o1394Q4489P7568l2383j60561k8644R4446P7617R0018J4444
14092F9917l3138p8061n7240M4033J07138O3731m2311p0882k0741O2470J9634
$$ y = [123526, 160122, 38847, -91946, -78413, -77962, -135069, -53371, 31084, 13264, -23855, -60904, -76961, -134827, -145186, -134782, -160322, -282053, -161685, -14321, -11812, -31349, -13969, -21159, -28250, -56310, -55066, -101590, -158202, -176368, -159936, -123825, -31170, -90380, -29455, -39240, -26261, -11263, -14244, 69439, 100697, 22527, 73440, 14709, -53027, 9406, 43278, 23599, 10459, -3015, 42378, 150610, 142354, 85469, 52229, -51167, -86814, 29424, 48253, 19349, -58247, -33160, -7833, -10967, -41056, 65093, 140470, 146395, 160401, 82349, -85683, -147077, -62588, 14980, -17403, -177964, -206608, -112162, -34545, 55473, 69917, 36779, -41282, -98522, -54489, 52649, 116380, 74069, 3187, -17554, 44916, 64550]
14081F4550q8631J4140l7219J7679K4433k1802n8805m882J53283J29424k0017
14070A72153j21347j16131q2519o791J5957j6357j1533J45759Q8675n7017n9915
14059d9066j1835l9939l7270M8073N5683J6997j8718J2183q167P1909O691P3242
14047A19783j3976r4843L0711L8800J7901j084l7562j4102l9579o2517m3044m6249
14035a45761J9125j410P7862j1789k3087j5638N78N0971K5139k6966k2349M5241
14023b8084K7751n7794O2154l0450j21544J0065M474J7574Q3476n0642k4960P3838
14011c4142K0124k5023R809L9038k0356o4956Q8691K1453r016L6533m4635j2044
13999E476O9731N1454q5272m161k2310m2465K6548K3460l108j213k0358n64P5481
$$ y = [64550, -24081, -9941, -47160, -29481, -5048, -26850, -85655, -90537, 62746, 192170, 172153, 50806, -65325, -147844, -154635, -138678, -155035, -166568, -20809, 67866, 10849, -49066, -60901, -100840, -138110, -90037, -34354, -17357, -36075, -23892, -32059, 39850, 46541, 119783, 105807, 10964, 41675, 80475, 98376, 97292, 59730, 45628, 6049, -56468, -99512, -145761, -126636, -128046, -50184, -61973, -85060, -100698, -100120, -49149, -24010, -50976, -73325, -28084, -333, -58127, 4027, -26423, -147967, -137902, -133428, -115854, -32378, -83020, -107980, -34142, -14018, -39041, -29232, 9806, -10550, -75506, 13185, 34638, 25622, 62155, 17520, 5476, 75207, 126661, 41389, 37228, 14918, -27547, -999, 22461, 19353, 18140, -2218, -2782, 72699]
13986G2699L3261j39634k1800N6671J5183J0405n8070k9586J34815Q4106m7311
13975A10739L163J5432m5096r7857J1360L5387j9630j7286R9698J9323k5114l0876
13963E9243l1808Q9908o3460l8603l2653j9858J2299L1140K428k277M6059p9728
13951b7310q9842j027Q7300J35211p8099j24957l5396J7797o8631r988J27472
13940f7470J62867Q907l9562Q9397n8073m9948p3021l7691k9206R2499M2351j17829
13928g6779j17886J6897L5457Q2432K6906J9206l9220k5570p3852q1287j1762
13917b45458R6103J24106N9451P7051k0196m8233r555l6994M2582O3746j0586
13906I2017q7400O7088m791o5560K9964O6752k3701m7357j10775r0674N9284p406
$$ y = [72699, 105960, -33674, -55474, 1197, 16380, 26785, -31285, -60871, 73944, 158050, 110739, 113902, 129334, 84238, -13619, -2259, 33128, 13498, -3788, 95910, 115233, 90119, 59243, 27435, 117343, 53883, 15280, -17373, -37231, -24932, 6208, 8636, 6359, 52418, -27310, -117152, -118179, -30879, 104332, 26233, -98724, -134120, -116323, -184954, -194942, -67470, 95397, 104304, 64742, 154139, 96066, 46118, -26903, -64594, -93800, -1301, 41050, -76779, -194665, -177768, -142311, -59879, -32973, -13767, -52987, -78557, -152409, -233696, -245458, -149355, -25249, 34202, 111253, 91057, 42824, 33269, -3725, 38857, 102603, 92017, 4617, 71705, 66914, 1354, 31318, 98070, 74369, 27012, -83763, -174437, -115153, -122559]
13894a22559M6053n2926r0023r0881K1362J26572K8329m1637l6435K9650k2156
13883b04651K0149J1838p6407O639J05319J17837N3380J2643k5406j16704m0022
13872a35385O4855P3299j5225j35231J0856P9553L8332L5583M6444j4948L8784
13861H6917P3411j0035k6681l7835K9822o875r3946m6484O1356k9759K231j0816
13849h694j20608J7453J18599m5277N8976J5597o1788k6075m0028Q169O4125L9814
13837B0263Q7562N5085j45153m2532L0687j1687m2148M8099l4605K2701n3062
13826f4790l9746J9899k5291R2118P4217j8768l7923L3802N0455l700J043k562
13814G8754p1179m0694P3r078j6052L5581L353k3873m9986K6983O8737p3721p4788
$$ y = [-122559, -76506, -129432, -219455, -310336, -288974, -162402, -134073, -175710, -212145, -182495, -204651, -184502, -172664, -249071, -242432, -137113, -19276, 34104, 46747, 21341, -95363, -135385, -70530, 2769, -12456, -147687, -136831, -57278, -18946, 16637, 63081, 48133, 86917, 160328, 150293, 123612, 85777, 115599, 108724, 14778, -31706, 29650, -109, 2122, -8694, -129302, -111849, 6750, -38527, 20449, 36046, -25742, -51817, -91845, -83676, -19551, 20263, 107825, 162910, 17757, -24775, 5912, -5775, -47923, 176, -34429, -11728, -64790, -104536, -84637, -109928, -17810, 56407, 37639, -284, 33518, 83973, 80273, 81316, 78754, 7575, -33119, -33046, -42124, -58176, -22595, -19242, -43115, -93101, -66118, 2619, -71102, -145890]
13801a45890n1607r567J2101J37355k4375k9052j9193K22r2979R2534O3438N8258
13789h755m8281m0209p307l3354K5356J2441K233M2384l5064J13105J32660K0102
13777A75311N5854k7958j08809n6389j35699o3910m5871J5642M9384M4702j1621
13766a09364P745k3696N0926r3411m559M2057o3898m8133N1548N8554O8967O699
13754e6565j24627j1200M4363o6898j7321R1407L3250K3177J3882m7985J304K5973
13742i1240O0151O6230l4244j42480j8005J67484K7293j45539n1951M0607J01675
13731b0019J611J9378K3294l262O0497K9005q23m3742K2214m0587p7503L2212
13719B275J09205n6316q7706K430l4618N125M8446N4104k9057L6906P4716O97
$$ y = [-145890, -197497, -207064, -194963, -57608, -81983, -111035, -130228, -130006, -222985, -130451, -67013, -8755, -57036, -97245, -104552, -137906, -112550, -100109, -97876, -55492, -90556, 22549, 155209, 175311, 231165, 203207, 94398, 38009, -97690, -161600, -207471, -191829, -142445, -97743, -109364, -101619, -125315, -74389, -167800, -172359, -130302, -194200, -242333, -190785, -132231, -63264, -56565, -181192, -192392, -148029, -214927, -232248, -140841, -107591, -84414, -70532, -118517, -117213, -91240, -31089, 35141, 897, -141583, -159588, 7896, 35189, -110350, -162301, -121694, -20019, -18408, 970, 24264, 21002, 81499, 110504, 109681, 65939, 88153, 47566, -29937, 2275, 111480, 55164, -32542, -30112, -64730, -59605, -11159, 42945, 13888, 50794, 125510, 126207]
13707A26207q1096j27675k1935L9686O7871j1299J3794N9784J4351j28648k4425
13696g3385O7687j8226M1384J7803j1481P6141j3164m9405M6344n1560o4667L4166
13684A637R5865l9722L7916M2514Q693l3173k9937j9812q925l8841N5384K2242
13672I3841m3157J8056M5446p3318p0666o4963R7559J70686N9894r2239j939N5514
13660A94714l7562k9157N0007j7993q2635l314m7771k6932J4671J3378m4917n7915
13648g5426m1622l5639Q521L2865R0116Q995O3200o519m7779p3117K4175J19823
13636F7593M5561o2312p2164j4795Q1016j1507o8673q5700m0679J7163N0809q5580
13624a79268p2179l361M4637J13267O7496J7640Q254R557k3574j1901j239K1923
$$ y = [126207, 45111, -82564, -104499, -64813, 3058, -8241, 5553, 65337, 79688, -48960, -73385, -5698, -23924, 17460, 35263, 23782, 99923, 86759, 37354, 83698, 32138, -32529, 1637, 97502, 57780, 95696, 138210, 146903, 113730, 83793, 63981, 55056, 16215, 71599, 93841, 50684, 68740, 114186, 40868, -29798, -94761, 2798, 173484, 233378, 141139, 139200, 194714, 157152, 127995, 178002, 160009, 77374, 74060, 26289, -643, 14028, 27406, -17511, -75426, -117048, -152687, -144166, -111301, -21185, -12190, 51010, 44491, -3288, -76405, -52230, 67593, 113154, 50842, -21322, -36117, 44899, 33392, -35281, -120981, -161660, -144497, -93688, -179268, -251447, -254808, -210171, -96904, -29408, -11768, -3514, 6043, -17531, -29432, -30671, -8748]
13612h748P7512K9783n3226j29580J9614K8208j40494K5296P7853O3380P5009
13601F4607K609q4696q397Q2819O551j31809J852K7734j2792K4289P6254n6808
13589g787o5004L5663L3036J7619K2478k209o0136P1184P742M2629l2767L0949
13577I3397m9499n9181M8686j4965j2153J6249n1900M166J0666k4367J3137o8139
13565i3903j96J22329L1566l8495M519K6575p577K8586j5608P7258k8411l6651
13553F9992o9523k142k1785k3575k1508M3157J68400J7929j25246r0628M986J70910
13541A20967J9590l6227l2001O1876n0590j965Q8202p143N7998n4193q8854r0403
13529a2743n4921r173J22365L330k287m1147R1555j3718n5515N2666L8797l141
$$ y = [-8748, 68764, 98547, 45321, -84259, -64645, -36437, -176931, -151635, -73782, -10402, 64607, 67216, -17480, -25877, 56942, 63493, -68316, -66464, -38730, -51522, -27233, 49021, -7787, -72791, -37128, -4092, 13527, 36005, 33796, -26340, 44844, 52586, 95215, 62448, 93397, 43898, -15283, 33403, 18438, 6285, 22534, -29366, -25200, -14534, -38901, -25764, -93903, -94099, 28230, 59796, 21301, 25820, 52395, 44818, 73404, 57796, 135054, 106643, 69992, 469, -1673, -23458, -47033, -68541, -25384, 143016, 160945, 35699, -54929, -49943, 120967, 140557, 104330, 72329, 134205, 83615, 81650, 169852, 162709, 220707, 166514, 77660, -12743, -67664, -76837, 45528, 48858, 46571, 5424, 96979, 83261, 27746, 80412, 119209, 116068]
13517A16068p4743l4684m8669o570m3590k7450l821J90J7169J13333k1186k4788
13505c8741P0515n9326j601k4293L9317P2571o442K2047P3388q8954q3866J2146
13493a3239N6949n7031l0586j9130j04879q456J36043O3436j1334k8768p18M5110
13481B7397q2942j9260L9734J957j6364O5203j7938k1707N6605J6161j6875J5720
13469D7691P686J4466j05502n6877L8011K2526P3777m630n846n0659j3568K9319
13457c606k4849m9864J7152J10952j3696p3642N1491k5147r0341j4798J17154
13446H06P5883k8299R74k4000p1127l422m7366L6271N2601O5132m770K075o270
13433D8488Q986n6973n132O2822p9454o6064p3573j3642m879J0372P7483M1915
$$ y = [116068, 41325, 6641, -42028, -48598, -92188, -119638, -123459, -123269, -106100, 7233, -13953, -38741, 31774, -27552, -29153, -53446, -14129, 58442, 52000, 74047, 147435, 58481, -25385, -13239, 43710, -13321, -43907, -63037, -167916, -176372, -40329, 23107, 11773, -16995, -17713, 27397, -55545, -74805, -35071, -33114, -49478, 15725, -2213, -23920, 32685, 48846, 31971, 47691, 55377, 69843, -35659, -92536, -54525, -31999, 41778, 37148, 31302, -19357, -32925, -3606, -28455, -78319, -61167, 49785, 36089, -37553, 13938, -11209, -101550, -116348, 806, 76689, 48390, 49364, 25364, -45763, -49185, -96551, -60280, -7679, 57453, 52683, 54758, 48488, 57474, 501, -4631, 58191, -21263, -87327, -160900, -174542, -179421, -169049, -91566, -49651]
13421d9651P4223K4383l1308M0173N9841l689m2487l5419n2288l4500K2503O211
13409b2008l1918K9195M2398o49N9240k051o2804l2374m597K0395P0889l3551
13397C2165j5076n9637m9796p1445L6613m5832O8395P2692O4547M3364j6905K0185
13385G9270m8523P4471j4603o9629q600M4683l2555k4819j00734L8844R4781j10633
13373g8047k0864k45O0036k2682N0741q1273O9793M5211L161m6045q9206M7105
13361f2315J04165l6635n046j9785k7687o778L5689J04236L1892J5085k2357K9648
13349A40112p2345j25303j0809K4670n80P5324Q998J7461n1732O1138L6844k862
13337A00916J7228l0658j9381k1049J17321Q699n098m55m2695m5714n8757o6603
$$ y = [-49651, 24572, 48955, 17647, 57820, 117661, 113972, 71485, 36066, -16222, -50722, -28219, -22008, -53926, -24731, 17667, 17018, 76258, 74207, 11403, -20971, -25568, -5173, 65716, 32165, 17089, -42548, -92344, -163789, -127176, -173008, -104613, -31921, 32626, 75990, 59085, 79270, 30747, 105218, 90615, 20986, 12386, 57069, 24514, -305, -101039, -62195, 32586, -78047, -98911, -99156, -39120, -61802, -11061, -92334, -22541, 22670, 25831, -20214, -109420, -62315, 41850, 5215, 169, -19616, -47303, -54081, -18392, 85844, 117736, 132821, 110464, 140112, 67767, -57536, -68345, -43675, -44255, 31069, 40067, 57528, 5796, 66934, 103778, 100916, 118144, 87486, 68105, 47056, 164377, 173076, 167978, 167523, 124828, 79114, 20357, -46246]
13325d6246l7208K243N2969L7701N8905k0030o415m9899o6875l8779N5375m7778
13313a06037J7255K6866N6068N3729K3598q1000M104P6890L26k8708k0054K1938
13301D4975k2519q1104J4684J2422n0725k3254J4681L8685m1099p4721O2924N3343
13289e1708q6280r9957J79805P1814q4644p9035P6590K2840N3285n5072l15Q2330
13277B9653K8926K9087o7616j08065j9721m8166L92j5621P9877J08257l247k4727
13265a0971j8032l7924Q543O9126J14414k741J9508Q137o7627n1519p0876J0041
13253b9921J9646k3541M4021Q3777p508r4227m2618J5361M1338J5069k961l9775
13241b1339k7799K348Q0853Q3835j29681p5235K1563O7642Q477R1505O4682M9732
$$ y = [-46246, -83454, -81211, -28242, 9459, 68364, 48334, 41919, -7980, -74855, -113634, -58259, -106037, -88782, -61916, -5848, 47881, 71479, -9521, -5417, 71473, 71799, 43091, 23037, 44975, 22456, -58648, -43964, -31542, -82267, -105521, -90840, -52155, -93254, -167975, -105051, -51708, -137988, -237945, -58140, 13674, -70970, -150005, -73415, -50575, 2710, -52362, -52677, 29653, 58579, 87666, 20050, -88015, -107736, -155902, -155510, -171131, -91254, 17003, 13756, -10971, -29003, -66927, -58384, 10742, 125156, 122415, 141923, 150060, 82433, 30914, -39962, -29921, -10275, -33816, 10205, 93982, 86474, -7753, -50371, -35010, 6328, 21397, 18436, -21339, -49138, -46790, 34063, 117898, -11783, -87018, -65455, 2187, 10664, 102169, 166851, 216583]
13229B16583R8698p162L1410J93881J14785Q4129o2607j14206j33150r0367j64796
13218A67198j38614J9335K9287Q747p0735K2038o1378L8807L2851n6546k0721
13207b9731o325R6934K0266L9472j6163n9584q4804N6067O8390k5981M4244l189
13195I9596J1696r0295j689l2352N6674j7250O9418O915R6818K42008J26532J1671
13183E79742K43571L01107L26982L61425M03456j1777l83535m48537n19661l80534
13173D72239r7100m5627j03045r5533n3172n3515J1407l205k1361m945o1877P9065
13161B3331L8702r6918p1317L0174R2547K69K3428K5443O4465K4184J9310N640
13149A79258j7330l0076m8431M0155L729M4647L7197k7337P5510K24215J90411
$$ y = [216583, 315281, 308119, 339529, 533410, 648195, 732324, 669717, 555511, 422361, 331994, 167198, 28584, 47919, 77206, 85953, 15218, 37256, -24122, 14685, 47536, -9010, -29731, -36056, 60878, 81144, 120616, 104453, 44869, -39935, 16132, 84522, 58541, 102785, 99596, 111292, 20997, 19308, -13044, 43630, 26380, 95798, 102713, 199531, 441539, 568071, 579742, 823313, 1124420, 1451402, 1812827, 2216283, 2204506, 1820971, 1372434, 852773, 472239, 375139, 329512, 226467, 130934, 77762, 24247, 35654, 32449, 11088, 6143, -55734, 23331, 62033, -34885, -106202, -76028, 16519, 16788, 40216, 65659, 130124, 154308, 173618, 179258, 161928, 131852, 83421, 123576, 127305, 171952, 209149, 181812, 257322, 481537, 671948]
13138F71948J25269K67291L43051M37799M02745J74220k23185n25484n27854l23806
13128H21994k91722l20940j44003R0326O4687j15274m4340k3028r6415Q0792P513
13117B9590n9461j43664L5884M5825R5894L8701O7470k6801r4433k5728J01244
13106F4521J1713q3580m729K3212j2669p7602P6654J19103j30616k25796J6278
13095b23511J96284J53636P9308O1229J06384J24550J50268k869p1079j17273
13085D56927j42142m2804o6389o3703j21331n0301K422N322j7231M2321N2448
13074E5539j4686k789K8332N955o3769M6784o8817M921L8439p0126n5352o1325
13062a56894M1659k128m4489N044q2615l6393R3729J30817M5863j02780p3711
$$ y = [671948, 797217, 1064508, 1407559, 1845358, 2248103, 2422323, 2199138, 1673654, 1145800, 821994, 530272, 209332, 65329, 155655, 220342, 105068, 60728, 37700, -58715, 22077, 29590, -29871, -173535, -137651, -91826, 4068, 42769, 110239, 83438, -10995, -36723, 64521, 76234, -7346, -12075, 11137, -1532, -79134, -2480, 116623, -13993, -239789, -223511, -27227, 126409, 205717, 266946, 373330, 497880, 648148, 645279, 574200, 456927, 314785, 271981, 205592, 141889, 20558, -29743, -27321, -21999, -39230, 3091, 55539, 40853, 38064, 66396, 72351, 8582, 55366, -13451, -8530, 29909, -40217, -95569, -156894, -115235, -117363, -161852, -156808, -239423, -275816, -182087, -51270, -5407, -108187, -181898]
13051a81898r926l6069R8924J01394k7591n2039J6514M3809J6306k8830P909j1315
13039f2812R217K0049n027J31282N5733o7616l2657j11127l3822N7138p1944P0550
13027d1036n1702l2477J36920R2462k6295j22988o6012J40720Q7876k4860r071
13016H3537m8005r6991p2287k0843J9267J28413L3647k43K5191K4381q595j6594
13004E0878K1044j6182j3208L2539k6440m9234o8812k2614N9957k0947N853j0720
12992e7886R6358J21715J0162p2480p9204K173j5615q8353q872l8631p8580L4
12980b09179K5211k7156K0889N4825J31790O5248O3102r1199j82779K4808k4490
12969a48930R8993J8270j22571K3910L6392R8058n6964l3268r8338n5547O3347
$$ y = [-181898, -191824, -227893, -128969, -27575, -55166, -107205, -90691, -46882, -30576, -59406, -51497, -62812, -53595, -33546, -38573, 92709, 148442, 80826, 48169, -62958, -96780, -39642, -111586, -41036, -92738, -125215, 11705, 104167, 77872, -45116, -111128, 29592, 117468, 92608, 83537, 35532, -61459, -133746, -154589, -135322, -6909, 26738, 26495, 51686, 76067, 67472, 50878, 71922, 55740, 42532, 75071, 48631, -603, -69415, -92029, -32072, -53019, -47166, -57886, 38472, 160187, 170349, 97869, 18665, 20838, 5223, -83130, -92002, -130633, -209213, -209179, -183968, -211124, -190235, -135410, -3620, 61628, 124730, 33531, -149248, -124440, -148930, -49937, -31667, -154238, -130328, -93936, 4122, -52842, -86110, -184448, -239995, -176648]
12958a76648N9823L8058m3621K087k91L2006K599M5136p065Q810M7757R0419P1948
12945A71018J8602J065Pj5547q0319j00887j03569K2403Q3766q2274m147K2006
12933f7876n5158L4102O3865J22896L8723j2758m5785k0610q678J7423l078q49
12921F2217J0120m6902L8538L0616j13301N050k8800l2721O7378M307k8143k8742
12909f0383J53192m18j27120K3457N6710l117j24443L5906K0611j33662j6739
12898a76006Q4021J23140J1099j8519k0558N9541j50486j29613n473J94081Q3639
12887E4866R94K6389m0345q2775j0980L5731l0184n382L5022K5025n2125O059
12875c7705n403n9380Q995J1351M2828K0219o9393p4025j0360R6900N2938O302
$$ y = [-176648, -116825, -78767, -122388, -120301, -120592, -88586, -85987, -40851, -47916, -39106, 8651, 99070, 171018, 189620, 190685, 190692, 175145, 94826, -6061, -109630, -87227, -3461, -85735, -89882, -67876, -123034, -88932, -25067, 97829, 136552, 123794, 78009, 57399, 48721, 66144, 63066, 62217, 72337, 25435, 63973, 94589, -18712, -13662, -42462, -75183, -7805, -3498, -31641, -60383, 92809, 92391, -34729, -11272, 45438, 42321, -82122, -46216, -25605, -159267, -176006, -91985, 31155, 42254, 23735, 3177, 62718, -87768, -217381, -222854, -28773, 54866, 55860, 82249, 41904, -40871, -51851, -16120, -46304, -51686, -16664, 8361, -43764, -37705, -43108, -102488, -93493, -82142, -39314, -19095, -88488, -162513, -172873, -75973, -23035, -16733]
12863a6733k097M5113M7603L786j23012j05368L9066R0527M9855P4942M0511j8
12851A44175r9253p0484L3525J3280k2029l0522j579n103p7144N2227R0981n9275
12839c1201l5370l5368Q7950M118l8137M613L34n624O651m4044p48n380L068K5853
12825f3285r799p971l7832L7403J8520o3039k7198M5791N0201M0965l7592o4399
12813a18235N0449J0766o3676R568N3524o3377J09609R3364M3251l8144m5627
12802D1472j24038l1047J11646P9722o9052j10425Q2994J3658K5829J4400q7415
12791e2256j35497K7437O4214l0617P1111P6976j37072M829P0952N1407k8485
12780a7001r553P4543M4865n6671p911L8931M7325m8753n2517O972K2829P8957
$$ y = [-16733, -18830, 26283, 73886, 77672, -45340, -150708, -111642, -21115, 28740, 103682, 144193, 144175, 44922, -25562, 7963, 21243, -786, -31308, -32887, -37990, -115134, -62907, 28074, -31201, -66571, -101939, -13989, -9871, -48008, -43395, -43061, -48685, -42034, -86078, -86826, -92206, -89138, -63285, -73084, -81055, -118887, -81484, -62964, -126003, -153201, -107410, -57209, -16244, -53836, -118235, -67786, -57020, -120696, -111128, -57604, -120981, -11372, 81992, 125243, 87099, 41472, -82566, -113613, -1967, 77755, 8703, -101722, -18728, -5070, 20759, 35159, -52256, -187753, -160316, -96102, -126719, -55608, 21368, -115704, -110875, -39923, 11484, -17001, -26554, 47989, 92854, 36183, 28272, 67203, 114528, 65775, 13258, 20230, 43059, 122016]
12768A22016K6495K5990J0603j13938j12754O7574L0312J3215o9089n4129q8492
12757a42197J7944P7566m3436Q772J8983K5084o4199O5089N524k5852J11702O4520
12745A19500n9805o4182O4106p8112O584K6717j3422J6530M0607P1130L7540j60608
12733F585j11697M5152K8486L103P5244J0556l4686K6235l7136j22282L8466J9205
12721e2769m8391O5554j0961K1824j4957o6500K2477m8372Q025j8661l6787P6398
12709a03120N5004J6450J7971J4007l8653j34632J4260P2044J05347M3438l1144
12698C0972k1723L5561n9006J5759m7350q9119L9381K6662o253L7400J05430p621
12686F0093n2024Q998L4164J01741l8845l1366M3875p51n8675o0732J86Q4588
$$ y = [122016, 148511, 174501, 185104, 71166, -41588, 25986, 56298, 69513, 424, -53705, -142197, -124253, -46687, -90123, -81351, -62368, -37284, -101483, -36394, -30870, -56722, 54980, 119500, 59695, -4487, 59619, -18493, -11909, 14808, 1386, 17916, 58523, 129653, 167193, 6585, -105112, -59960, -31474, -28371, 46873, 57429, 22743, 48978, 11842, -110440, -71974, -52769, -101160, -35606, -46567, -24743, -39700, -106200, -83723, -132095, -124070, -142731, -179518, -103120, -48116, -31666, -13695, 312, -38341, -172973, -158713, -86669, 18678, 62116, 30972, 9249, 44810, -14196, 1563, -45787, -134906, -95525, -68863, -75116, -37716, 67714, 60093, 8069, 17067, 51231, 152972, 114127, 82761, 126636, 125885, 67210, 6478, 6664, 91252]
12674I1252O817K0142o4671j3647k471l3579m2086q745k6800M1677L2013N3498
12662E3400r0680n9286J2488M5637J19305P1790o7136n1989M3183n8568o5603
12651d7459l789N9866J07149J2669q7206j01272j6378O0016O3625R733q553K5852
12639G4253l6254p4193m3636K5404P6857k6132n1595M687q9981L216Q1698R5769
12627D0093M3093j0404J9363n5279m6755m1805M819l5864j5140M8719l1723N8510
12615b2373J28622M2111q0329l3028N3038k3189l1688l2139n4094L446J18243
12604F8620O1153J6522N6520K546n4875p850J1705o165o1840n1374j2948n0709
12592b8695o3954m322K8867K955n4983J3938R2353P8763K8758K2069k0683m4976
$$ y = [91252, 98069, 118211, 53540, 39893, 37422, 3843, -38243, -46988, -73788, -32111, -98, 53400, -37280, -96566, -84078, -38441, 80864, 152654, 85518, 33529, 76712, 18144, -47459, -51248, 8618, 115767, 128436, 41230, -60042, -76420, -16404, 47221, 56954, 48401, 74253, 37999, -36194, -79830, -54426, 22431, -3701, -55296, -50609, -140590, -137374, -55676, 40093, 83186, 72782, 92145, 36866, -9889, -51694, -46875, -82739, -97879, -49160, -80883, -22373, 106249, 148360, 68031, 35003, 88041, 64852, 33164, 1025, -53069, -49623, 68620, 129773, 146295, 202815, 205361, 150486, 142636, 154341, 148176, 86336, 34962, 22014, -28695, -92649, -96971, -68104, -65149, -120132, -106194, -13841, 64922, 93680, 115749, 95066, 50090]
12580E0090k1151l9395j07315o5981m7546J28458M8617k2521Q1247O9248q0803
12569g052k5944P0264M5592K452m726o7227j10507r787Q0685O5727J9746j04127
12557d4904Q131L4917q1970j2695N9186M0897L6937p6281j530o460j1651K2540
12545c2883J5497J08262K7776l1977j21844n9796M118M2516N6926m7632O91k0312
12533e8658L4154j3539l9324L5266n228o18L6665N0211j0838r9912M745Q2046
12521A4970K5029m7408m1344k1383m002K4911l1479L7176k3786k1340j3234l7346
12509a39236J968O926P1149J06899k9545j770M0678o0188N4900M8464p858m4756
12497D7631o117P52p5256R6177N5485P132m3926n9343M5336k1150M6543p283J2664
$$ y = [50090, 28939, -10456, -117771, -183752, -231298, -102840, -54223, -76744, 4503, 73751, -7052, -32996, 37268, 82860, 85312, 80586, 13359, -97148, -106935, -26250, 39477, 59223, -44904, -36773, -1856, -83826, -96521, -37335, 3562, 40499, -35782, -37312, -43772, -55423, -32883, -17386, 90876, 118652, 86675, -35169, -94965, -90847, -48331, 8595, -39037, -38346, -58658, -24504, -38043, -77367, -42101, -47329, -47947, -11282, 38929, 28091, -71821, -67076, 14970, 39999, -7409, -48753, -70136, -74138, -49227, -80706, -43530, -67316, -88656, -101890, -139236, -137268, -130342, -59193, 47706, 18161, 16391, 57069, -3119, 51781, 100245, 92387, 47631, 41514, 42266, -32990, 63187, 118672, 125804, 81878, 22535, 67871, 46721, 93264, 85981, 98645]
12484I8645l8437k1028n7066m0463j2932n3792j1532R7901K3973m0561j9436N4118
12472b0610p620k6278K4604J4930q4211p5832m982n4121N4842J28412K8449K6598
12460D181J00395n8093M122K6866l6748j25593m93N8002n9750j06056N0151r124
12448a52140n3804P2825R9807J32772Q8716l3088j41701p3935K3594N284p4276
12437a05946m2677j6930O8430J4816J3031O5148R9640j43271q2060M4445N185
12426h0189K9866J05792L3240R957o5651j01706L2025J9427m2859N6717m5994
12415d9375q8328k5927k0406M6157J13490O263j0839J1756J23392j35j17342m0917
12403e2211k0840j01842N453J00283j698p9178q2223j6842O787J12273N7470J7719
$$ y = [98645, 60208, 39180, -17886, -58349, -71281, -125073, -136605, -38704, -14731, -55292, -74728, -20610, -28230, -54508, -29904, -14974, -99185, -175017, -179999, -234120, -179278, -50866, -22417, 4181, 104576, 46483, 50605, 77471, 40723, -84870, -85363, -27361, -87111, -193167, -143016, -152140, -205944, -133119, -33312, 99460, 188176, 155088, 13387, -60548, -36954, -31670, -105946, -148623, -165553, -97123, -82307, -69276, -4128, 95512, -47759, -129819, -85374, -80189, -50323, 55469, 88709, 98666, 33015, -68691, -36666, -17239, -60098, -3381, -49375, -137703, -163630, -184036, -137879, -24389, -18126, -28965, -17209, 106183, 106048, -11294, -52211, -73051, -174893, -169440, -69157, -70855, -150033, -232256, -249098, -242311, -130038, -72568, -54849]
12391e4849Q53P6530J04682K5291L5343N0452j32556l2507m669Q5833k1344q7043
12379D6016n7255J4159m3754L1460k4110P4723O2796j2698M0129m4473l9095J01679
12367A49577P0911o0770k3847l8179J9837m4389p7541Q8121o9488p6185L6582
12356b5371P5599K1957K9813M1851L5250L2066P955l2411j04982p4408M575J2853
12344B4747K8382l4475j30296p0077J50861Q6361L9417m9090j11609J6082M8788
12333i09k3093M0226J21713l2573j03822j19338N1574N2791o7748J3864J588m3507
12321a09234Q6671J21989j9044q3679M9719L8594J2563n0617m7573N2684n2253
12310a80n8410J2834J06064L8256J6771n4161n3974J63J2254m3617q8174K602
$$ y = [-54849, -53996, 22534, 127216, 152507, 187850, 238302, 105746, 73239, 68570, 154403, 133059, 46016, -11239, 2920, -40834, -9374, -33484, 41239, 104035, 91337, 131466, 86993, 47898, 149577, 220488, 159718, 135871, 97692, 117529, 73140, -4401, 83720, 14232, -61953, -25371, 50228, 72185, 101998, 143849, 179099, 211165, 219120, 186709, 81727, 7319, 11894, 24747, 53129, 18654, -111642, -181719, -30858, 55503, 94920, 45830, -65779, -49697, -909, -24002, 16224, 137937, 105364, 1542, -117796, -66222, -13431, -81179, -67315, -65727, -109234, -22563, 99426, 80382, -3297, 46422, 85016, 97579, 46962, -611, 52073, -180, -58590, -45756, 60308, 98564, 115335, 61174, 7200, 7363, 19617, -24000, -112174, -109572]
12298a09572m5161N3554J49906P9236O871j36279q8639m4096Q4599K4316o6968
12287i2233k4301N4202Q6467P506k1685k5568l865k7461O7582L994P0102Q2095
12275A76835P594N4731L1823j50501l0958Nn8079K1811R333k7226j09344j11430
12263a85406m8718Q2297N8385Q3817M5275L7622j9478q6225j03529K9553R7151
12252i256P7003P0163M4056m851j16731j13652p4169O7892Q6423k376K4973L5095
12240H4570m2593K8221L861k1134q0331J7208O5685P872L0333M6453l7139r4182
12228H824k9529n621K4965r318k7128R038L2974K5207m2265j79j3855L2776Q1538
12215H7427m7225j8333j44700k5612L1793P1633P4347O1881L2210N3317j260r6855
$$ y = [-109572, -154733, -101179, 48727, 127963, 134834, -1445, -90084, -134180, -49581, -25265, -92233, -116534, -62332, 24135, 31641, 9956, -15612, -19477, -46938, 20644, 24638, 94740, 176835, 184429, 239160, 270983, 120482, 89524, 89529, 31450, 53261, 62594, 35368, -73976, -185406, -234124, -151827, -93442, -9625, 35650, 73272, 53794, -32431, -135960, -106407, -9256, 67747, 137910, 181966, 177115, 60384, -53268, -127437, -59545, 26878, 24502, 49475, 84570, 41977, 70198, 74059, 52925, -27406, -10198, 55487, 63359, 93692, 140145, 103006, 8824, -20705, -26326, -1361, -10679, -37807, -28769, 4205, 29412, -12853, -13032, -26887, 5889, 87427, 40202, 21869, -122831, -148443, -116650, -45017, 29330, 91211, 123421, 176738, 175478, 78623]
12203G8623l5114R370k8383p9878K3071Q3108K3701l0207q9636k0463J06564n0650
12191i894p9205L3669M4831k3091O4389J52234P0613l0188K3290j4077p0939o2929
12179I8703k3792n2271k2766k8874J9529K7277J02073r734p2684q0302j2715L4527
12167b1029k0318M8789N3504j0403j233K7653m8129K3732O5060Q363j21190n3089
12155d8290P8867J9913k339K4442J06449J6163j03507q6441L8154L1138p2809
12144A740l2046N925N8388k989J488Q6210L2696M4875j5621k11091K9163K9833
12132B8571m3203K3764J8135n2094l8601K8104J06300N4917j00343M2638J12783
12121A80971N1401q7315q4514r1324n8620N4630j6468j3797K7219N1191j36648
$$ y = [78623, 43509, 52879, 24496, -55382, -32311, 50797, 74498, 44291, -45345, -65808, 40756, -9894, -89099, -55430, -10599, -33690, 30699, 182933, 253546, 223358, 246648, 232571, 161632, 98703, 74911, 22640, -126, -29000, -9471, 17806, 119879, 110145, 37461, -42841, -55556, -21029, -41347, 7442, 60946, 50543, 49310, 76963, 28834, 52566, 117626, 125989, 4799, -48290, 30577, 50490, 48151, 72593, 179042, 195205, 91698, 5257, 43411, 74549, 1740, -30306, -24381, 34007, 31018, 32506, 118716, 151412, 196287, 180666, -30425, -1262, 28571, -14632, 9132, 27267, -24827, -63428, -35324, 70976, 125893, 25550, 68188, 180971, 232372, 145057, 60543, -30781, -89401, -34771, -51239, -65036, -37817, 13374, -123274]
12110a23274m4240J03582k9393m3994K18180O8304Q017L2126k8071r3680m3135
12099B4422L8678j2716m6311M0584J1166L4261l179r0466J7387l8171M1591M2879
12087F0125J9350J3962p8658P786L7333j32871j8935N9502O28M1298m2269n9768
12075i2517J15907J30521N2275j09648j06138n2178N4739j2511J0983m9485n867
12064f3919l8840n9413L1244J19647R2051O7068l9501j08963M7855N8144j6086
12053H9287r9560m9630r854k5378K0373l0594j07847K0981J23665J06310J7069
12042E4822P277j5513l689o2308J9266L448L6638R320p5593J5014K5599R6159
12030A10440k5101l9080K8672J3543K367l4991k6682M4179P833O0685l3360K4273
$$ y = [-123274, -167514, -63932, -93325, -137319, 80861, 149165, 157182, 189308, 161237, 67557, 24422, 63100, 50384, 4073, 44657, 55823, 90084, 86905, -3561, 13826, -24345, 17246, 60125, 79475, 93437, 14779, 22565, 59898, -72973, -91908, -32406, -31778, 9520, -32749, -92517, 23390, 153911, 206186, 96538, -9600, -61778, -7039, -19550, -8567, -58052, -63919, -102759, -162172, -130928, -11281, 80770, 147838, 108337, -626, 47229, 105373, 89287, -10273, -59903, -69757, -95135, -74762, -105356, -213203, -192222, -68557, 37753, 54822, 62099, 46586, 42897, -19411, -145, 3303, 39941, 49261, -26332, -11318, 14281, 110440, 85339, 46259, 74931, 88474, 90841, 55850, 29168, 73347, 81180, 141865, 108505, 132778]
12018A32778K7333j08371J957K0148l3100R3985r3633o086J68O8671L3243j19600
12006A7493m0158K7088p5722m1350L8186J02812P8408M3380K1636k7283r2154
11995E2336j29825l3057Q192N9047J14265J5163J3090l5651J8442J4927r0944
11984E985O4384N6020r0502o9062L8738Q606P529M0277l5918L0876J9638N3542
11972A30113q4155j19444K4334J04451n5612o844O2409Q6717l2953o6831J2092
11961E4277K2975l1930l6991j2807j2407M6481N1547j20065o1624L1549M3675
11950b5320N4889Q195l7204M2196K0127M5827Q683n1500l2288k4688m8892l7677
11938g7652J62766M3014q7425p0667n905j8152J099K1503o4637m4716J6822O7618
$$ y = [132778, 160111, 51740, 53697, 73845, 40745, 134730, 41097, 35011, 35179, 103850, 137093, 17493, -22665, 4423, -71299, -112649, -74463, 28349, 106757, 150137, 171773, 144490, 52336, -77489, -110546, -102354, -43307, 70958, 86121, 99211, 63560, 82002, 96929, 5985, 70369, 126389, 35887, -33175, 5563, 14169, 21698, 61975, 26057, 56933, 76571, 130113, 45958, -73486, -49152, 55299, -313, -7157, 55252, 141969, 109016, 42185, 54277, 77252, 45322, 8331, -4476, -16883, 29598, 81145, -38920, -100544, -68995, -25320, 29569, 37764, 560, 42756, 62883, 108710, 117393, 65893, 33605, 8917, -39975, -77652, 85114, 128128, 40703, -29964, -35869, -54021, -52922, -31419, -96056, -140772, -123950, -56332]
11926e6332J30671J44209R941m9508l0489j02897k5390K7568j4380r3520j4075
11915g4202L4293N9312J628k1095j7537k1472N0791P1021j0436p5255K1670N4601
11903G3319o6630J2690M6100q8612m9605j0376j0653K7889L3650k562o2927Q886
11891h8831L3139O0652J61538j4114o2207J500j7814P116m8860l0819j06188l1556
11879a36444K7018R9573J92430l1497j958O8967k2929o4482m2802p6664M0024
11868E1236J19689l364j9483J4891p0033o3452k5341P6443J13878R4927m1037
11857B48354j48479r6878l1024J13862J38377n7713o1097J6963J06748n3869q6910
11846H8334Q4345P049K533m3378N6786j9783l6195j18998q0712L153J23396L1458
$$ y = [-56332, 74339, 218548, 228489, 178981, 148492, 45595, 20205, 47773, 33393, -60127, -74202, -39909, 19403, 21031, -64, -17601, -39073, 11718, 82739, 72303, -2952, 18718, 73319, 6689, 19379, 65479, -23133, -72738, -83114, -93767, -65878, -32228, -34790, -97717, -88831, -55692, 4960, 166498, 152384, 90177, 91677, 73863, 80979, 32119, 1300, -104888, -136444, -109426, -9853, 182577, 151080, 149122, 218089, 195160, 130678, 87876, 11212, 51236, 170925, 167561, 148078, 162969, 92936, 29484, 4143, 80586, 194464, 289391, 248354, 99875, 2997, -28027, 85835, 224212, 166499, 105402, 122365, 229113, 175244, 88334, 172679, 179728, 182261, 138883, 195669, 175886, 139691, 20693, -60019, -56866, 66530, 97988]
11834I7988k6633o128L4350N2869K3438J180l4554M5903l2482n1767K0367j5656
11822A08875l4755L2549O3091j07249k0491n8381q358J32099j2191j1232P4773
11811A58730J3427j5094o3645l1106p0736p1062o1485J514J34740L9932K6835
11800F2050P1979r370L9653r789j04876o0502P9071P495O9171J78102R646j66069
11788A66561m7520N3139p3345K7176O9203m7041J8574l0073p9565l2137k6025
11777a053M4744l4593M0996R990l1517l4575j2990m9154N8955J07591L8386j8795
11765A17985J4449N0852O2640M4556k4737j38278q6509K5272P6632J5401R7244
11754B55507Q8350l7854o0559k0217J2868j24112p7898k7581m4719J13223k4030
$$ y = [97988, 71355, 65227, 99577, 152446, 175884, 177064, 142510, 188413, 155931, 104164, 124531, 108875, 74120, 106669, 169760, 62511, 42020, -16361, -24719, 107380, 95189, 83957, 158730, 172157, 157063, 93418, 62312, -8424, -79486, -140971, -139457, -4717, 35215, 62050, 134029, 124659, 164312, 154523, 49647, -10855, 68216, 75711, 144882, 322984, 332630, 166561, 119041, 172180, 98835, 126011, 195214, 148173, 166747, 136674, 57109, 24972, -1053, 43691, 9098, 50094, 60084, 28567, -6008, -18998, -68152, -9197, 98394, 136780, 117985, 132434, 183286, 245926, 290482, 265745, 127467, 40958, 66230, 142862, 158263, 255507, 343857, 306003, 245444, 225227, 238095, 113983, 36085, 8504, -36215, 77008, 52978]
11743E2978p4019J112J67047O4908j02588m0599l8498J6201R8649J00924n4928
11732A91187j0853L0918m0858o9306r9055K2515j2435K3754j6020M7359N6820
11721A24026r7450j3190j7351j29543K1400O0287j7179L4524M6957q412n4567
11710e0498L9221m2057k6242Q9972k0239p3329l2246L5265J12249M7377n1654
11699B7819j9179M0130j263Q5126J6872L7594P809m4176J1803l9581M4779j9346
11687A48387K1527P347o1342o2869k621o6142j17974J682O0085J29903N6155r28
11675A13210n2761O650l4968l1456M9945L1025j43179n7061J06913L9296j3807
11664A3807n3327l1158L7242M0669O2486P0281n5761n529n9600n8065N6881P3522
$$ y = [52978, -21041, -19929, 147118, 212026, 109438, 68839, 30341, 46542, 145191, 246115, 191187, 180334, 211252, 170394, 101088, 2033, 24548, 12113, 35867, 19847, 67206, 124026, 26576, 13386, -3965, -133508, -112108, -51821, -69000, -34476, 12481, 4069, -50498, -11277, -53334, -79576, 10396, -9843, -83172, -115418, -80153, 32096, 79473, 27819, 8640, 48770, 47507, 132633, 149505, 187099, 194908, 150732, 162535, 122954, 167733, 148387, 169914, 177261, 115919, 53050, 50429, -15713, -133687, -132005, -71920, 57983, 114138, 113210, 60449, 67099, 32131, 675, 50620, 81645, -61534, -118595, -11682, 27614, 13807, -39520, -70678, -33436, 7233, 69719, 140000, 84239, 78710, 19110, -38955, 17926, 91448]
11652I1448k3480L2864m6350j19474L9766M7718J7755M5357L2589n7007K2218
11641H3404l4960l7240N4186L0421j3658M3710n324m7526l5279L4500L0541O3169
11629A65944L098o1749M2263K4610K6677n6459J09078O3793r9848j34133n6222
11618B7052L7091n8336L1360l0021j0706m1736m8634l2694k4250J37188J13662
11607I9976j9743k7714l6669J2171O2114K3414M3820m8611L4250n7359q1862R0570
11595I4357O0560p9128n0609N7948M4828O6449j223n890O001o6504R686N1752
11583A88227q505j0956J4616p8459n9556n7913p8548M0706N5257L5646j67j6377
11571B3971l6861K9080L8011K9189Q3954n753j08606n9453n8379j12372L2834
$$ y = [91448, 67968, 100832, 54482, -64992, -25226, 22492, 40247, 85604, 118193, 61186, 83404, 48444, 11204, 65390, 95811, 82153, 125863, 120539, 73013, 37734, 72234, 102775, 165944, 169042, 107293, 149556, 174166, 200843, 144384, 253462, 317255, 217407, 83274, 27052, 64143, 5807, 37167, 7146, -3560, -45296, -93930, -126624, -150874, -13686, 99976, 80233, 52519, 15850, 28021, 90135, 113549, 157369, 108758, 143008, 85649, 3787, 94357, 154917, 75789, 25180, 83128, 127956, 194405, 193182, 187292, 193293, 126789, 136475, 188227, 179722, 168766, 183382, 104923, 45367, -12546, -91094, -50388, 4869, 40515, 40348, 23971, -12890, 16190, 54201, 83390, 167344, 161591, 52985, -6468, -64847, -177219, -144385]
$$ [...]
##END NTUPLES=NMR SPECTRUM
##END=
