##TITLE=Analysis number 318603
Compound Code ac 29726
Project Code adrs
Chemist Name acros
##JCAMPDX= 6.0         $$ Bruker NMR JCAMP-DX V2.0
##DATA TYPE= NMR SPECTRUM
##DATA CLASS= NTUPLES
##ORIGIN= Bruker BioSpin GmbH
##OWNER= nmr
$$ XWIN-NMR		Version 3.5
$$ Wed Apr  5 15:13:10 2006 GMT Daylight Time (UT+1h)  MAYBRIDGE\nmr@NMR_250MHZ
##.OBSERVE FREQUENCY= 250.131544655141
##.OBSERVE NUCLEUS= ^1H
##.ACQUISITION MODE= SIMULTANEOUS (DQD)
##.ACQUISITION SCHEME= undefined
##.AVERAGES= 16
##.DIGITISER RES= 18
##SPECTROMETER/DATA SYSTEM= dpx250
##.PULSE SEQUENCE= zg30
##.SOLVENT NAME= DMSO
##.SHIFT REFERENCE= (INTERNAL, DMSO, 0, 16.522)
##AUDIT TRAIL= $$ (NUMBER, WHEN, WHO, WHERE, WHAT)
$$ ##TITLE= Audit trail, XWIN-NMR		Version 3.5
$$ ##JCAMPDX= 5.01
$$ ##ORIGIN= Bruker BioSpin GmbH
$$ ##OWNER= nmr
$$ C:\u/data/dgb/nmr/ADRS/2130/pdata/1/auditp.txt
$$ ##AUDIT TRAIL=  $$ (NUMBER, WHEN, WHO, WHERE, WHAT)
(   1,<2006-04-05 15:12:47.40 +100>,<MAYBRIDGE\nmr>,<NMR_250MHZ>,
      <created by zg, POWCHK disabled, PULCHK disabled
       configuration hash MD5:
       84 BC 41 DB A1 6E 1D 46 DA 25 12 A5 C1 ED C5 3A
       data hash MD5: 64K
       91 90 51 D9 7C 6D B2 BF 9F 35 B9 C1 25 78 EF 94>)
(   2,<2006-04-05 15:13:00.71 +100>,<MAYBRIDGE\nmr>,<NMR_250MHZ>,
      <Start of raw data processing
       ef LB = 0.3 FT_mod = 6 PKNL = 1 SI = 32K 
       data hash MD5: 32K
       43 85 BD EA E9 8D 84 17 A6 17 82 9D 02 9F 2F 4C>)
(   3,<2006-04-05 15:13:02.40 +100>,<MAYBRIDGE\nmr>,<NMR_250MHZ>,
      <apk 
       data hash MD5: 32K
       73 D0 D4 C9 4A 22 8F 07 5C 69 85 E3 05 42 FB D2>)
(   4,<2006-04-05 15:13:03.20 +100>,<MAYBRIDGE\nmr>,<NMR_250MHZ>,
      <abs ABSG = 5 
       data hash MD5: 32K
       6A F9 A9 90 D3 A0 94 39 7A B5 DD 7A 43 CB 83 57>)
$$ ##END=
$$ 
$$ hash MD5
$$ 9A 12 A0 D2 AA 01 84 F6 8D 43 EF A7 72 3C 64 E2
##$RELAX= 
##$RELAX= 
##$RELAX= 
##$RELAX= 
##$RELAX= 
##$RELAX= 
##$RELAX= 
$$ Bruker specific parameters
$$ --------------------------
##$DU= <C:\u>
##$EXPNO= 2130
##$NAME= <ADRS>
##$PROCNO= 1
##$TYPE= <nmr>
##$USER= <dgb>
##$AMP= (0..31)
100 100 100 100 100 100 100 100 100 100 100 100 100 100 100 100 100 100 
100 100 100 100 100 100 100 100 100 100 100 100 100 100 
##$AQSEQ= 0
##$AQ_mod= 3
##$AUNM= <au_zg>
##$AUTOPOS= <48 >
##$BF1= 250.13
##$BF2= 250.13
##$BF3= 250.13
##$BF4= 250.13
##$BF5= 500.13
##$BF6= 500.13
##$BF7= 500.13
##$BF8= 500.13
##$BYTORDA= 1
##$CFDGTYP= 0
##$CFRGTYP= 5
##$CHEMSTR= <none>
##$CNST= (0..31)
1 1 145 1 1 1 1 1 1 1 1 1 1 1 1 1 1 1 1 1 1 1 1 1 1 1 1 1 1 1 1 1 
##$CPDPRG= <>
##$CPDPRG1= <>
##$CPDPRG2= <>
##$CPDPRG3= <>
##$CPDPRG4= <mlev>
##$CPDPRG5= <mlev>
##$CPDPRG6= <mlev>
##$CPDPRG7= <mlev>
##$CPDPRG8= <mlev>
##$CPDPRGB= <>
##$CPDPRGT= <>
##$D= (0..31)
0 1 0 0 0 0 0 0 0 0.06 0 0 0 0 0 0 0.0002 0 0 0 0 0 0 0 0 0 0 0 0 0 0 
0 
##$DATE= 1144246365
##$DBL= (0..7)
120 120 120 120 120 120 120 120 
##$DBP= (0..7)
150 150 150 150 150 150 150 150 
##$DBP07= 0
##$DBPNAM0= <>
##$DBPNAM1= <>
##$DBPNAM2= <>
##$DBPNAM3= <>
$$ [...]
##$SUBNAM7= <"">
##$SUBNAM8= <"">
##$SUBNAM9= <"">
##$SW= 20.6930455092707
##$SWIBOX= (0..15)
0 0 3 0 0 0 0 0 0 0 0 0 0 0 0 0 
##$SW_h= 5175.983436853
##$TD= 65536
##$TD0= 1
##$TE= 295.16
##$TE2= 300
##$TE3= 300
##$TEG= 300
##$TL= (0..7)
0 120 120 120 120 120 120 120 
##$TP= (0..7)
150 150 150 150 150 150 150 150 
##$TP07= 0
##$TPNAME0= <>
##$TPNAME1= <>
##$TPNAME2= <>
##$TPNAME3= <>
##$TPNAME4= <>
##$TPNAME5= <>
##$TPNAME6= <>
##$TPNAME7= <>
##$TPOAL= (0..7)
0.5 0.5 0.5 0.5 0.5 0.5 0.5 0.5 
##$TPOFFS= (0..7)
0 0 0 0 0 0 0 0 
##$TUNHIN= 0
##$TUNHOUT= 0
##$TUNXOUT= 0
##$USERA1= <user>
##$USERA2= <user>
##$USERA3= <user>
##$USERA4= <user>
##$USERA5= <user>
##$V9= 5
##$VALIST= <valist>
##$VCLIST= <CCCCCCCCCCCCCCC>
##$VD= 0
##$VDLIST= <DDDDDDDDDDDDDDD>
##$VPLIST= <PPPPPPPPPPPPPPP>
##$VTLIST= <TTTTTTTTTTTTTTT>
##$WBST= 1024
##$WBSW= 4
##$XGAIN= (0..3)
0 0 0 0 
##$XL= 0
##$YL= 0
##$YMAX_a= 412406
##$YMIN_a= -445987
##$ZGOPTNS= <>
##$ZL1= 120
##$ZL2= 120
##$ZL3= 120
##$ZL4= 120
##$ABSF1= 16.522
##$ABSF2= -4.171173
##$ABSG= 5
##$ABSL= 3
##$ALPHA= 0
##$AQORDER= 0
##$ASSFAC= 0
##$ASSFACI= 0
##$ASSFACX= 0
##$ASSWID= 0
##$AUNMP= <proc_1d>
##$AZFE= 0.1
##$AZFW= 0.1
##$BCFW= 0
##$BC_mod= 0
##$BYTORDP= 0
##$COROFFS= 0
##$CY= 12.5
##$DATMOD= 1
##$DC= 0
##$DFILT= <>
##$DTYPP= 0
##$F1P= 14.0000005364418
##$F2P= -0.99999901652339
##$FCOR= 0.5
##$FTSIZE= 32768
##$FT_mod= 6
##$GAMMA= 0
##$GB= 0
##$INTBC= 1
##$INTSCL= 1
##$ISEN= 128
##$LB= 0.3
##$LEV0= 0
##$LPBIN= 0
##$MAXI= 10000
##$MC2= 0
##$MEAN= 0
##$ME_mod= 0
##$MI= 0
##$NCOEF= 0
##$NC_proc= -4
##$NLEV= 6
##$NOISF1= 0
##$NOISF2= 0
##$NSP= 0
##$NTH_PI= 0
##$NZP= 0
##$OFFSET= 16.522
##$PC= 1
##$PHC0= 163.9074
##$PHC1= 9.306046
##$PH_mod= 1
##$PKNL= yes
##$PPARMOD= 0
##$PSCAL= 4
##$PSIGN= 0
##$REVERSE= no
##$SF= 250.13
##$SI= 32768
##$SIGF1= 0
##$SIGF2= 0
##$SINO= 400
##$SIOLD= 32768
##$SREGLST= <1H.DMSO>
##$SSB= 0
##$STSI= 32768
##$STSR= 0
##$SW_p= 5175.98343685301
##$SYMM= 0
##$S_DEV= 0
##$TDeff= 65536
##$TDoff= 0
##$TI= <Analysis number 999999
Compound Code 99
Book Reference 9
Project Code 9>
##$TILT= no
##$TM1= 0
##$TM2= 0
##$TOPLEV= 0
##$USERP1= <user>
##$USERP2= <user>
##$USERP3= <user>
##$USERP4= <user>
##$USERP5= <user>
##$WDW= 1
##$XDIM= 32768
##$YMAX_p= 280263022
##$YMIN_p= -426101
$$ End of Bruker specific parameters
$$ ---------------------------------
##NTUPLES= NMR SPECTRUM
##VAR_NAME=  FREQUENCY,     SPECTRUM/REAL,   SPECTRUM/IMAG
##SYMBOL=    X,             R,               I
##VAR_TYPE=  INDEPENDENT,   DEPENDENT,       DEPENDENT
##VAR_FORM=  AFFN,          ASDF,            ASDF
##VAR_DIM=   32768,         32768,           32768
##UNITS=     HZ,            ARBITRARY UNITS, ARBITRARY UNITS
##FACTOR=    0.157963299565203, 1,           1
##FIRST=     4132.6476996994, 0,             0
##LAST=      -1043.33573715361, 0,           0
##MIN=       -1043.33573715361, -426101,     0
##MAX=       4132.6476996994, 280263022,     0
$$ Real data points
##PAGE= N=1
##DATA TABLE= (X++(R..R)), XYDATA
$$ [...]
23277H7876m8312o0219j2179O8780K1968M4254K2385p0526P3223k4334j16766
$$ 87876 39564 -20655 -32834 35946 57914 102168 124553 54027 127250 102916 -13850
23266a3850N5932N1335n0731M1148P2200m1734p3330r398L8259m0265j114m776
$$ -13850 42082 93417 42686 83834 156034 114300 40970 31572 69831 29566 28452 23676
23254B3676P43Q0951p9566k4672J0842o89m4050q01j79207q6504P4519M1054R3572
$$ 23676 24419 105370 25804 1132 11974 11285 -32765 -33566 -212773 -299277 -224758 -183704 -90132
23241i0132L4403m8007K8282j2471o2033o598Q9809K11782p7184r5708p5937j7228
$$ -90132 -55729 -103736 -75454 -87925 -149958 -156556 -66747 145035 67851 -27857 -103794 -121022
23229a21022R6042O4848Q5288J6634l7756j4225o4622p9303l4633o1P8064P841
$$ -121022 -24980 39868 125156 141790 104034 89809 25187 -54116 -88749 -88810 -10746 -2905
23217b905m8997K3884J1741M8403M7560k0690J0778n9100j0725j5798L9130M8679
$$ -2905 -51902 -28018 -16277 32126 79686 58996 69774 10674 -51 -15849 23281 71960
23205G1960K0171r6012q8661O8961M6276j2184N9769l1986K3450j5531l2763p0282
$$ 71960 92131 -3881 -92542 -23581 22695 10511 70280 38294 61744 46213 13450 -56832
23193e6832q1376L0031m7978J7664J9499J1764O9030R2901J673j42444J0710O5070
$$ -56832 -138208 -108177 -156155 -138491 -118992 -107228 -38198 54703 56376 -86068 -75358 -10288
23181a0288k1N1223K1434K676m5963o311k2236k4777R533J0152K8321o1464J18519
$$ -10288 -10309 40914 62348 65024 19061 12750 -9486 -34263 -24730 -14578 13743 -47721 70798
23168G0798R6603m9148L271K714p6340j7567l5707P28j27931k3264J39634O7053
$$ 70798 167401 118253 121524 124238 47898 30331 -5376 -4648 -132579 -155843 -16209 50844
23156E0844O3920k4877R3859N2775m7431j38517o2100O233n764L90m0712L0041
$$ 50844 114764 89887 183746 236521 189090 50573 -11527 -5294 -11058 -10668 -51380 -21339
23144b1339Q5067N6236q9015n2527j35454L9101J7770L4337N2566J9473J02113
$$ -21339 63728 119964 30949 -21578 -157032 -117931 -100161 -65824 -13258 6215 108328
23133A08328n5424j02895o1268k9833p2422k4074m6721j5145J21052J27535J9595
$$ 108328 52904 -49991 -111259 -141092 -213514 -237588 -284309 -299454 -178402 -50867 -31272
23122c1272O9479q539m6242m9875j07L1405j12019P0830N4035n7294j03789k4984
$$ -31272 38207 29668 -16574 -66449 -66556 -35151 -147170 -76340 -22305 -79599 -183388 -208372
23110b08372J37406K9219l0408m239R0624J4598P842j04674k6541j09580j38741
$$ -208372 -70966 -41747 -72155 -76394 14230 28828 36670 -68004 -94545 -204125 -342866
23099c42866J09431J70517M1161l2491k1877M5924O7021j7098o7554M8881l2986
$$ -342866 -233435 -62918 -21757 -54248 -76125 -30201 36820 19722 -47832 1049 -31937
23088c1937m5410K8146M6282J3334o9722K172P3187J2468J04107Q0937j05575
$$ -31937 -77347 -49201 -2919 10415 -59307 -57135 16052 28520 132627 213564 107989
23077A07989j47513L6090Q5999O3228n8507l8660N5183k1503n0548J04331k565
$$ 107989 -39524 -3434 82565 145793 87286 48626 103809 82306 31758 136089 133524
23066A33524r8202p3008n5586j9717O00J24959Q2927o725p481l7323k1286j6717
$$ 133524 35322 -37686 -93272 -112989 -112389 12570 95497 88772 81291 43968 22682 5965
23054E965J25450R760j06925p1390q0480K0029O9687P916j8193P9988P5425l5014
$$ 5965 131415 141175 34250 -37140 -117620 -97591 -27904 -19988 -38181 41807 117232 82218
23042H2218j14497J2187O376m3817M2482K9671o3465p422j192J2706K9292j35886
$$ 82218 -32279 -20092 -13716 -57533 -15051 14620 -48845 -56267 -57459 -44753 -15461 -151347
23030a51347M2048O2272M7149J07501m124O635k525k2339m9368M4323n642l6576
$$ -151347 -109299 -47027 122 107623 103499 110134 107609 85270 35902 80225 74583 38007
23018C8007j6694j61766J5849R1412Q55o986l4510k3726k9413J62226J9187N6073
$$ 38007 21313 -140453 -124604 -33192 -32337 -39323 -73833 -97559 -126972 35254 54441 110514
23006A10514k1987l3181m6582p3353M6762M0280O2231j2337j87993n4523J30868
$$ 110514 88527 55346 8764 -64589 -17827 22453 84684 72347 -115646 -170169 -39301
22995c9301k7714P7891N0844R3496J0470r851j09295n9962m3111P506O5898m7088
$$ -39301 -67015 10876 61720 155216 165686 155835 46540 -13422 -56533 -49027 16871 -30217
22983c0217n7482k0796P4800J11291q336m9064M6861k4O0105N1771q8990l2037
$$ -30217 -87699 -108495 -33695 77596 69260 20196 67057 67033 127138 178909 89919 57882
22971E7882o0310n2180r2116P8295J10870L7481j4692k2831j1209j72170j33322
$$ 57882 -2428 -54608 -146724 -68429 42441 79922 65230 42399 31190 -140980 -274302
22960b74302J42835k4183j7497J19708l888p7631N9455M8953N8778m9806L6510
$$ -274302 -131467 -155650 -173147 -53439 -57327 -134958 -75503 -26550 32228 -17578 18932
22949A8932J56875N385j21941l7866N688N3907L9411J5534K0395O099k4099M5936
$$ 18932 175807 181192 59251 21385 27073 80980 120391 135925 156320 162419 138320 184256
22937A84256r5502m9464j679o8028J3004R819m0653m3343n0445l6562j0942K5437
$$ 184256 88754 39290 37611 -30417 -17413 -7594 -48247 -91590 -142035 -178597 -189539 -164102
22925a64102n5917R2015M2436K1005P744m24k7107R6409K5587K1778M1579m4981
$$ -164102 -220019 -128004 -85568 -64563 -56819 -57243 -84350 12059 37646 59424 101003 56022
22913E6022K3601j8214p5393o3106m7510J01071R1921r310l3183j44107l0570
$$ 56022 79623 61409 -13984 -77090 -124600 -23529 68392 59082 25899 -118208 -148778
22902a48778J6460O3409M7230Q9954n7234l7475j0631l8346j6155N6814N716R788
$$ -148778 -132318 -68909 -21679 68275 11041 -26434 -37065 -75411 -91566 -34752 -29036 -19248
22890a9248K7977m4337j5905J0504k9530M1335o395q6267K3692R0955P2899K934
$$ -19248 8729 -35608 -51513 -41009 -70539 -29204 -35599 -121866 -98174 -7219 65680 68614
22878F8614L0064m638k3571n5060n1781J2283l8038j282N5704L0817R8869J5027
$$ 68614 98678 94040 70469 15409 -36372 -24089 -62127 -63409 -7705 23112 121981 137008
22866A37008n3654k0352N7122j06390j701k338o4494N500P4547j626j0824L519
$$ 137008 83354 63002 120124 13734 12033 9695 -54799 -49299 25248 23622 12798 16317
22854A6317k8811O0745q6335J4146O6614O3953P3025r0296l4077O9473r1920n9930
$$ 16317 -12494 48251 -38084 -23938 42676 106629 179654 89358 55281 124754 32834 -27096
22842b7096j4581J02817N6182k1294j3741K481l6552J835L0862j36483N715J22110
$$ -27096 -41677 61140 117322 96028 82287 84768 48216 50051 80913 -55570 -49855 72255
22830G2255O4219J5394l8403j73525k8968R875M7692K6864n4208j00568q3592
$$ 72255 136474 151868 113465 -60060 -89028 -79153 -31461 -4597 -58805 -159373 -242965
22819b42965o9369j4717R5039J62017J6061m4571p5477J791J04354P5584N1145
$$ -242965 -312334 -327051 -232012 -69995 -53934 -98505 -173982 -172191 -67837 7747 58892
22808E8892N8099m2963k4424M5131r1155j10647n7817L9320J2996o344J2699P547
$$ 58892 116991 74028 49604 94735 3580 -107067 -164884 -125564 -112568 -118912 -106213 -98666
22796i8666J05216n7609k5351P173L4994l156M3883n7036L7515j13209m2251J24646
$$ -98666 6550 -51059 -76410 -69237 -34243 -37399 6484 -50552 -13037 -126246 -168497 -43851
22784d3851o716k6241q0975p6616O3300O5875O7060k1717J2060K7972J8629L2447
$$ -43851 -50567 -76808 -157783 -234399 -171099 -105224 -38164 -59881 -47821 -19849 -1220 31227
22772C1227Q2237q0006l9457m1675J901M9009j708m6963K3069K5011n4551n8055
$$ 31227 113464 33458 -5999 -47674 -45773 3236 1528 -45435 -22366 2645 -51906 -109961
22760a09961n7132P8039o9548K0738P8413j4210p27o5400k4100M7568O0513J28415
$$ -109961 -167093 -89054 -158602 -137864 -59451 -73661 -74388 -139788 -163888 -116320 -55807 72608
22748G2608J43876q181j03653o4547J5522M5969r4460n6799O1171l0709m3358
$$ 72608 216484 208303 104650 40103 55625 101594 7134 -49665 11506 -19203 -62561
22737f2561l2781N520J1982p851j03078m9689J09439R8158L0242m7182r4836l5820
$$ -62561 -95342 -89822 -77840 -85691 -188769 -238458 -129019 -30861 -619 -47801 -142637 -178457
22725a78457K5281J0956n0327R7368N3156j302J033n8874J00897O8361j16316
$$ -178457 -153176 -142220 -192547 -95179 -42023 -43325 -42292 -101166 -269 68092 -48224
22714d8224p0536M6910O8539k6780o9202M6279K2957o1465L1531L6943j4484n143
$$ -48224 -118760 -71850 -3311 -30091 -99293 -53014 -30057 -91522 -59991 -23048 -37532 -42675
22702d2675K4145K4554M4553j1810l7416M2182m5213j8985M3419J0229n6195j9547
$$ -42675 -18530 6024 50577 38767 1351 43533 -1680 -20665 22754 32983 -23212 -42759
22690d2759R1888L2301m1975P3369Q0549l5695n2951j0263Q9854L7274j5049p9188
$$ -42759 49129 81430 39455 112824 193373 157678 104727 94464 184318 221592 206543 127355
22678A27355j01821m7340M9479l541j48147m2455J30015J00704k287j2901j07104
$$ 127355 25534 -21806 27673 24132 -124015 -166470 -36455 64249 61962 49061 -58043
22667e8043k7627r869R047l8361J20305q143q0411l7163N1071J09947J42285m4286
$$ -58043 -85670 -95539 -86492 -124853 -4548 -12691 -93102 -130265 -79194 30753 173038 128752
22655A28752o0067l16p8034n5510P8945l4395p4053r0828K2524M1234L8458Q7198
$$ 128752 68685 68369 -9665 -65175 13770 -20625 -94678 -185506 -162982 -121748 -83290 3908
22643C908r2808L5084P1245n2201K0478l6415j8173K5488K4927M5196o991n4727
$$ 3908 -88900 -53816 17429 -34772 -14294 -50709 -68882 -43394 -18467 26729 19738 -34989
22631c4989q1706K7909j0761L809P784K2069L5008O9287p249o6527J0480P991
$$ -34989 -116695 -88786 -99547 -95738 -87954 -65885 -30877 38410 31161 -35366 -24886 -16895
22619a6895K8821L1981q4637l0339K4284r0357k9432L7725R9822J2382p848R0420
$$ -16895 11926 43907 -40730 -71069 -46785 -137142 -166574 -128849 -29027 -16645 -24493 65927
22607F5927K0726l2451m0475o197k0523J5364J4885O4621O912m8930p6978j6224
$$ 65927 86653 54202 13727 7530 -12993 2371 17256 81877 88789 39859 -37119 -53343
22595e3343P9251L5139p8883p0649R6778l8320q6478k6086N0010k4897L3182P494
$$ -53343 25908 61047 -17836 -88485 8293 -30027 -116505 -142591 -92581 -117478 -84296 -76802
22583g6802l3525K169j1624Q8065Q3638o8563j12426j04257M4847N8396N7479
$$ -76802 -110327 -108158 -119782 -31717 51921 -16642 -129068 -233325 -188478 -130082 -72603
22572g2603k211r5659K7734L2491O7460n4896j13031L0042P2764N1951q9477M7707
$$ -72603 -74814 -170473 -142739 -110248 -42788 -97684 -210715 -180673 -107909 -55958 -145435 -97728
22560i7728O7230L5761R5969K0361o7488M6252l7547q7221j5766M3951J0504q0764
$$ -97728 -30498 5263 101232 121593 54105 100357 62810 -24411 -40177 3774 14278 -66486
22548f6486j0166R7976k6170j04099j12967l7436K8395J43651j9953k7707l3048
$$ -66486 -76652 21324 -4846 -108945 -221912 -259348 -230953 -87302 -107255 -134962 -168010
22537a68010k0603J00063P9820m696m6962J7301O4346m1060o8914n630J56136
$$ -168010 -188613 -88550 -8730 -13426 -60388 -43087 21259 -19801 -88715 -94345 61791
22526F1791M7966o5035k4959k5481j06494m41n2843k7624K9353Q2561R5139o893
$$ 61791 109757 44722 19763 -5718 -112212 -112653 -165496 -193120 -163767 -81206 13933 7040
22514G040n6087l0610P6269j3779o7147j9600J04401L1021m7707j41713q8031
$$ 7040 -49047 -79657 -3388 -17167 -84314 -103914 487 31508 -16199 -157912 -245943
22503b45943J0023n9298n728J65601O6560k5486L9102o633J7371L4126m316m0481
$$ -245943 -235920 -295218 -300946 -135345 -68785 -94271 -55169 -61802 -44431 -10305 -14621 -55102
22491e5102k9014m0851o4608k7832J16004J3722j3416j7832R812j5551K4129N175
$$ -55102 -84116 -124967 -189575 -217407 -101403 -87681 -101097 -118929 -109117 -124668 -100539 -95364
22479i5364j22059n4569Q2322J09728O1577K7964p3675L1519P0495k4138K2538
$$ -95364 -217423 -271992 -189670 -79942 -18365 9599 -64076 -32557 37938 13800 36338
22468C6338J1900L1532o4222l2482L9703M4840K3203o0301n9322j7175k4896K7395
$$ 36338 48238 79770 15548 -16934 22769 67609 90812 30511 -28811 -45986 -70882 -43487
22456d3487K9128m3072O7096J2218J931n6635o0526J2842j69K2228m1207M0532
$$ -43487 -14359 -57431 9665 21883 23814 -32821 -93347 -80505 -80674 -58446 -99653 -59121
22444e9121R2584o4550L623j7058N2766P3621p8464J0551j8510j3533O1274o239
$$ -59121 33463 -31087 -27464 -44522 8244 81865 3401 13952 -4558 -18091 43183 36944
22432C6944m6746r7713k1604J16088R0950Q3824l0151j28094o0662L8325l5155
$$ 36944 -9802 -107515 -129119 -13031 77919 161743 131592 3498 -57164 -18839 -53994
22421e3994r2408M4067O18K1561J11790j2547N6361k9789n5589J05848K9273j21527
$$ -53994 -146402 -102335 -101717 -80156 31634 19087 75448 45659 -9930 95918 125191 3664
22409C664l7472j7584q5391L4234N8275J6619K3778m1709M5551J05460l9235p9678
$$ 3664 -33808 -51392 -136783 -102549 -44274 -27655 -3877 -45586 -35 105425 66190 -13488
22397a3488R5315P7133l9078r1391q1501J0973J04731J1556N1104K8674m7080
$$ -13488 81827 158960 119882 28491 -53010 -42037 62694 74250 125354 154028 106948
22386A06948j11422j50919J8082J43271Q5885J3874o6949j8818N9553Q0797n8870
$$ 106948 -4474 -155393 -137311 5960 91845 105719 38770 19952 79505 160302 101432
22375A01432r7803p7658J8647J539q8851k5182l218l391Q0085J03206o777j1654
$$ 101432 3629 -74029 -55382 -53843 -142694 -167876 -171094 -174485 -94400 8806 2029 -9625
22363i625n5082P637R9594j2366r6608K819J8539k9682J6195M3614j011k3631
$$ -9625 -64707 -57070 42524 30158 -66450 -63631 -45092 -74774 -58579 -14965 -15976 -39607
22351c9607k685L1742o281M3217k5001j7665L1231P2734m558r5891o6468K3734
$$ -39607 -42292 -10550 -16831 26386 1385 -16280 14951 87685 83127 -12764 -79232 -55498
22339e5498J24637O7569k91j01253N8866j0822j1077P230Q1442l5642j6105J4580
$$ -55498 69139 136708 136417 35164 94030 83208 72131 79361 160803 125161 109056 123636
22327A23636m009j01322j09370N3680n4862p0404O8842O6439l0415N2870J09589
$$ 123636 119627 18305 -91065 -37385 -92247 -162651 -93809 -27370 -57785 -4915 104674
22316A04674k0067j5872k1698p0457K4967n8253m2566J00821j2486j3034r6696
$$ 104674 84607 68735 47037 -23420 1547 -56706 -99272 1549 -10937 -23971 -120667
22305a20667k0789M4427o8697k2767L0167P706j29790M0678M2659L1131N9833
$$ -120667 -141456 -97029 -165726 -188493 -158326 -150620 -280410 -239732 -197073 -165942 -106109
22294a06109J74647k8521o38m5550J7517j8243K9868k9914o2369j2003l534l5263
$$ -106109 68538 40017 39379 -6171 11346 -6897 22971 -6943 -69312 -81315 -84849 -120112
22282a20112k8786M5183l1782n3502p980o144J49729Q4111n2784k7639r642q136
$$ -120112 -148898 -103715 -135497 -188999 -196979 -203123 -53394 30717 -22067 -49706 -59348 -67484
22270f7484m0886J06148j7487O8488O582r6093r560j8086m087J08967N8779J8982
$$ -67484 -108370 -2222 -19709 48779 55361 -40732 -50292 -68378 -72465 36502 95281 114263
22258A14263L0487q6662k8382k7289L2850P3332m1578m4522o2120K0567r872M0164
$$ 114263 144750 58088 29706 2417 35267 108599 67021 22499 -39621 -19054 -28926 11238
22246A1238o9189q3940K9986N7897J963l9846p5196L5259Q1363j1292n8163N3506
$$ 11238 -57951 -141891 -111905 -54008 -52045 -91891 -167087 -131828 -50465 -61757 -119920 -66414
22234f6414J00583L424k5729M99l7304l874M5538M4733k0369j16628q3130K4909
$$ -66414 34169 37593 11864 12363 -24941 -28815 16723 61456 41087 -75541 -158671 -133762
22222a33762L2586l233J1634m2965M0828J624L6957j0222K5151J4029n537k6427
$$ -133762 -101176 -104409 -92775 -135740 -94912 -93288 -56331 -66553 -41402 -27373 -32910 -59337
22210e9337m6825j88P0850N3261j426p1714K7392L4861r3757p7250n2099p048
$$ -59337 -106162 -106350 -35500 17761 16335 -55379 -27987 6874 -86883 -164133 -216232 -223280
22198b23280Q494Q1271N5236L3590j4520n8978o5155P6139O3314m2199J8847K1184
$$ -223280 -214786 -133515 -78279 -44689 -59209 -118187 -183342 -107203 -43889 -86088 -67241 -46057
22186d6057q0548j14063P6339L6850j6561m307J27633J29225M9379L1403n6989
$$ -46057 -126605 -240668 -164329 -127479 -144040 -148347 -20714 108511 157890 189293 132304
22175A32304j09765p9004M4007K6778K6885K0695o356j31158j02580O8170M7101
$$ 132304 22539 -56465 -12458 14320 41205 61900 55544 -75614 -178194 -110024 -62923
22164f2923L8483m1446j697k9970N1842n1881j26322M1555R4862k973o3217L0187
$$ -62923 -24440 -65886 -67583 -97553 -45711 -97592 -223914 -182359 -87497 -90470 -153687 -123500
22152a23500k2091j40219N7864Q0710l4012j6559M5472Q6285L541m1552J35491
$$ -123500 -145591 -285810 -227946 -147236 -181248 -197807 -152335 -66050 -62509 -104061 31430
22141C1430M1096j08970j33838n2598L6018Q5119J82263n7554J2659N2092r346
$$ 31430 72526 -36444 -170282 -222880 -186862 -101743 80520 22966 35625 87717 78371
22130G8371p533p9747l281R210O5050M8911j15480n0100N223k322r9327n6083
$$ 78371 70838 -8909 -12190 -2980 62070 110981 -4499 -54599 -49376 -51698 -151025 -207108
22118b07108O2883l531p7635k1307L6328Q5258J04138j5109M613L4509l4796j49319
$$ -207108 -144225 -147756 -225391 -246698 -210370 -125112 -20974 -36083 -31470 3039 -31757 -181076
22106a81076o6701K4245J22497M4617J58063M1553j24903m2723k1967j8498J8276
$$ -181076 -247777 -223532 -101035 -56418 101645 143198 18295 -24428 -46395 -64893 -46617
22095d6617J03338j1257l4608o2916j01323N3420J03012R8829l8898r9816k2473
$$ -46617 56721 45464 10856 -52060 -153383 -99963 3049 101878 62980 -36836 -59309
22084e9309L0321j4196j8717l3610Q3214K6883j3870L256N5080p7272J4907j9662
$$ -59309 -28988 -43184 -61901 -95511 -12297 14586 716 3972 59052 -18220 -3313 -22975
22072b2975m2218J36048p540O7304k8008q7712j7104J1538l8222n1811r1994P7733
$$ -22975 -65193 70855 63315 130619 102611 14899 -2205 9333 -28889 -80700 -172694 -94961
22060i4961J63775k0578L5410j8027q436o842K6490k2605l3617J4631j57940J5436
$$ -94961 68814 48236 83646 65619 57183 50341 76831 54226 20609 35240 -122700 -107264
22048a07264J15416Q4398k2048o0267N2847L37r0566r4880J6002K6025M3034M7559
$$ -107264 8152 92550 70502 10235 63082 63419 -27147 -122027 -106025 -80000 -36966 10593
22036A0593K6950M350J01823R5752n7653K1499N498j1575j0582k6747j33148o5609
$$ 10593 37543 41893 143716 239468 181815 203314 208812 197237 186655 159908 26760 -38849
22024c8849L4229n3238k272m7249R3229J3379N4169k2128K4531N2393J0287n5389
$$ -38849 -4620 -57858 -60130 -107379 -14150 -771 53398 31270 55801 108194 118481 63092
22012F3092n5290o1979k7312J00167L1058l2397k8565M7559J06037m4895j21028
$$ 63092 7802 -54177 -81489 18678 49736 17339 -11226 36333 142370 97475 -23553
22001b3553j35056j25479J35516R4704P790k330q5066j26325K2245j2204O4631
$$ -23553 -158609 -284088 -148572 -53868 -46078 -48408 -133474 -259799 -237554 -249758 -185127
21990a85127q7735N4818N4549R8156O6848J08747K8374n4328J08938O0363l8454
$$ -185127 -272862 -218044 -163495 -65339 1509 110256 138630 84302 193240 253603 215149
21979B15149p3935n7952j9865k1132l1241P386N0798p5225l2529N0619K0929K1724
$$ 215149 141214 83262 63397 42265 11024 18410 69208 -6017 -38546 12073 33002 54726
21967E4726N4665j4959p8979j7495p7832m6314P6067K5978j7929P8786k5750q3305
$$ 54726 109391 94432 15453 -2042 -79874 -126188 -50121 -24143 -42072 36714 10964 -72341
21955g2341L2043O580K4680k1533J2754N2983J48869k8661j15952q5343j3090
$$ -72341 -40298 -33718 -9038 -30571 -17817 35166 184035 155374 39422 -45921 -59011
21944e9011r25o5318M4493j8995k2723n2251Q810K0192p323L538o9681q7525K7269
$$ -59011 -59936 -125254 -80761 -99756 -122479 -174730 -165920 -145728 -153051 -149513 -219194 -306719 -279450
21931b79450O4222M6063j320M840l7475m9223J10538J76935J4679r8119r0224
$$ -279450 -215228 -169165 -170485 -165645 -203120 -252343 -141805 35130 49809 -48310 -138534
21920a38534l7133J41853L0815J4808l865K5723r6997l8923m4242J6485j9336
$$ -138534 -175667 -33814 -2999 11809 7944 33667 -63330 -102253 -146495 -130010 -149346
21909a49346J16746J47975k7417q5088l0477M0607K8800Q431k9087L6556q7695
$$ -149346 -32600 115375 87958 2870 -27607 13000 41800 50231 21144 57700 -29995
21898b9995j35315o4271O8529n6682j37488Q887J84693L7002J19435R6506L7713
$$ -29995 -165310 -229581 -161052 -217734 -355222 -346335 -161642 -124640 -5205 91301 129014
21887A29014n4924j35545o4531M3024J20735O221l2919k8694q5596J3956R6083
$$ 129014 74090 -61455 -125986 -82962 37773 43994 11075 -17619 -103215 -89259 6824
21876F824J0878j8593K8310L1109m0659q023L4515L0159m2648j17645k9373k1841
$$ 6824 17702 -891 27419 58528 17869 9846 44361 74520 31872 -85773 -115146 -136987
21864a36987m0609O5786l0952k1797O7165M7851K6080r037m6722J8304l6377R060
$$ -136987 -177596 -111810 -142762 -164559 -97394 -49543 -23463 -32500 -79222 -60918 -97295 -88235
21852h8235j5306j6726R931P156m1239R585l4866Q8898R3402p874N7764M6476
$$ -88235 -103541 -120267 -110336 -103180 -144419 -134834 -169700 -80802 12600 4726 62490 108966
21840A08966m8178q2684r8813J2968O7004L7189K5879p0015k0869Q7461Q9252
$$ 108966 60788 -21896 -120709 -107741 -40737 -3548 22331 -47684 -68553 18908 108160
21829A08160p7746n9591o3587m5430L7913J2026K5023L0479N8355N0277k6502
$$ 108160 30414 -29177 -92764 -138194 -100281 -88255 -63232 -32753 25602 75879 49377
21818D9377k8368l1810j839N8260k3300n6804J15114J01394J0743j18918n3037
$$ 49377 21009 -10801 -12640 45620 22320 -34484 80630 182024 192767 73849 20812
21807B0812L5138L1654O67j7767n2527j43420r501N7343q6636K5656P9302P4567
$$ 20812 55950 87604 88271 70504 17977 -125443 -134944 -77601 -164237 -138581 -59279 15288
21795A5288M7188j9476J5613l8241j46956m3812N2146K4307R5460J32927j5699
$$ 15288 62476 43000 58613 20372 -126584 -170396 -118250 -93943 1517 134444 118745
21784A18745J2237J36552r8740j46324j0888q4486n539M1621r8162q3762N9266
$$ 118745 130982 267534 168794 22470 11582 -72904 -78443 -36822 -134984 -218746 -159480
21773a59480R1068L5654o4378j2610O4100R52j2690m3710j15795k1783Q2803N784
$$ -159480 -68412 -32758 -97136 -109746 -45646 -44694 -57384 -101094 -216889 -238672 -155869 -150085
21761a50085M1300K8643J4620O3575P2687O8436n8688m6328j01158L0446k7550
$$ -150085 -108785 -80142 -65522 -1947 70740 139176 80488 34160 -66998 -36552 -64102
21750f4102J7035O7511n0498J4084n7136l5413O5734r117o4036J6844K1643j21207
$$ -64102 -47067 20444 -30054 -15970 -73106 -108519 -42785 -51902 -115938 -99094 -77451 -198658
21738a98658q3462J0743N1771P4618R9471M9305j02208L4537K6661K0342J846
$$ -198658 -282120 -271377 -219606 -144988 -45517 3788 -98420 -63883 -37222 -16880 -15034
21727a5034o343K5261j03130q4805P5004J02369J13640o8700o0507N93o446k5727
$$ -15034 -21377 3884 -99246 -184051 -109047 -6678 106962 38262 -22245 -21652 -28098 -53825
21715e3825q2759O3721M3837Q2233J7219K6491n0169j02322o3161o2563J15867
$$ -53825 -136584 -72863 -29026 53207 70426 96917 46748 -55574 -118735 -181298 -65431
21704f5431R6011p053o0774m5370L8033L8865P6466R6507r2630j27369j71563
$$ -65431 30580 23527 -37247 -82617 -44584 -5719 70747 167254 74624 -52745 -224308
21693b24308Q2167N7525K333O8162L7619j06330M9640J56517L5837j13679r0187
$$ -224308 -142141 -84616 -82283 -14121 23498 -82832 -33192 123325 159162 45483 -44704
21682d4704l7598p2803Q282J75395J41035o8098K089r8431q1410O2425K407N3269
$$ -44704 -82302 -155105 -146823 28572 169607 101509 103598 5167 -76243 -13818 -11411 41858
21670D1858j5211l0399j8409O000N2587m4594N6514M1469j72437o9144r2191p5778
$$ 41858 26647 -3752 -22161 -16161 36426 -8168 48346 89815 -82622 -151766 -243957 -319735
21658c19735J3402Q6458K14576J09328q7478j02121p672k4113J16780p411K3919
$$ -319735 -306333 -219875 -5299 104029 16551 -85570 -93242 -117355 -575 -7986 15933
21647A5933n8438k856p2787J06986J32128J7764r5086Q716l060J5242L1681M200
$$ 15933 -42505 -45361 -118148 -11162 120966 138730 43644 52360 49300 64542 96223 100423
21635A00423j45883l5393Q6068k5r254p5246p5497J07505J07400m869l9095n5762
$$ 100423 -45460 -80853 5215 5190 -4064 -79310 -154807 -47302 60098 55229 16134 -39628
21623c9628p0469R241N9734K2625k5317k5365n6565L5424J68437Q2224r995q4090
$$ -39628 -110097 -100856 -41122 -18497 -43814 -69179 -125744 -90320 78117 160341 150346 66256
21611F6256j36042K7331N3281j13396j1795L6348J7688J1667K5052K1337m3664
$$ 66256 -69786 -42455 10826 -102570 -114365 -78017 -60329 -48662 -23610 -2273 -45937
21600d5937J11092J809n8783q07P4113k0270j6359P6449N1046J101l1092j69955
$$ -45937 65155 66964 8181 7374 81487 61217 44858 121307 172353 173454 142362 -27593
21588b7593k8694r530m3602M8006l0506l5886J31239O2435k1530K487j5140M8677
$$ -27593 -56287 -65817 -109419 -61413 -91919 -127805 3434 65869 44339 46826 31686 80363
21576H0363k4024L633K1003j11438m8881J616o951n2352P4386L8206J3848o8631
$$ 80363 56339 59972 80975 -30463 -79344 -77728 -84679 -137031 -62645 -24439 -10591 -79222
21564g9222l9227L2173P5011l8753l5090L1919m1367L0958P8629j5877o6894q2359
$$ -79222 -118449 -86276 -11265 -50018 -85108 -53189 -94556 -63598 15031 -846 -67740 -150099
21552a50099o2737J16281Q1423n2188m5345N0902N8575k8288r4210O7341J00593
$$ -150099 -212836 -96555 -15132 -67320 -112665 -61763 -3188 -31476 -125686 -58345 42248
21541D2248n2002J08159P0458r7625q0129k3231N665J7045r4935O125L8584k8627
$$ 42248 -9754 98405 168863 71238 -8891 -32122 -26457 -9412 -104347 -98222 -59638 -88265
21529h8265N7594L1842m8004j9609L1779j833K6206n3587J0478L7387L2007N9217
$$ -88265 -30671 1171 -46833 -66442 -34663 -36496 -10290 -63877 -53399 -16012 15995 75212
21517G5212k3008j8713j07052k7010l8861K8345L4751M8633n6512m736q9118P0935
$$ 75212 52204 33491 -73561 -100571 -139432 -111087 -76336 -27703 -84215 -88951 -178069 -107134
21505a07134M0471j16435n2758P817O5725J46754O8016N2527M1254l3875j00429
$$ -107134 -66663 -183098 -235856 -228039 -162314 -15560 52456 104983 146237 112362 11933
21494A1933j56679K801N6838L1291n7828N4405J31311l5512j00866O1790m5752
$$ 11933 -144746 -141945 -85107 -53816 -111644 -57239 74072 38560 -62306 -516 -46268
21483d6268J8571j0065q0680K9441J09279R0474j23966m1408K2590K0709l8508
$$ -46268 -27697 -37762 -118442 -89001 20278 110752 -13214 -54622 -32032 -11323 -49831
21472d9831p152j0039Q8350q1483K179O035J0673j7171L5975p5510j14472l6208
$$ -49831 -56983 -67022 21328 -60155 -57976 -51941 -41268 -58439 -22464 -97974 -212446 -248654
21460b48654N3024k8103J31865N0162k1172n5849J35457O2477Q551O764j15756
$$ -248654 -195630 -223733 -91868 -41706 -62878 -118727 16730 79207 87758 94522 -21234
21449b1234r2426k1546k9948L0239J4964N6699m0151m7771Q8540l5802j7957Q0752
$$ -21234 -113660 -135206 -165154 -134915 -119951 -63252 -103403 -151174 -62634 -98436 -116393 -35641
21437c5641j6227p05L2338J33212Q3644N684j66125o5756K715j5943j20174q697
$$ -35641 -51868 -52573 -20235 112977 196621 202305 36180 -29576 -26861 -42804 -162978 -171675
21425a71675J25160k0502n3893N1845J64362M4168j9422m1664j45912j00521j0881
$$ -171675 -46515 -67017 -120910 -69065 95297 139465 120043 78379 -67533 -168054 -178935
21414a78935L5873p92J2173o484m1973J28079J2293J0819N5425R3274r7152n3321
$$ -178935 -143062 -143854 -131681 -138165 -180138 -52059 -39766 -28947 26478 119752 22600 -30721
21402c0721J356L7241l1030j25641j4888M9533M3238K4356m5889j03339l9055
$$ -30721 -29365 7876 -23154 -148795 -163683 -114150 -70912 -46556 -92445 -195784 -234839
21391b34839J23298Q6836K0847n4265l9188K6092N5796J6880L6988K3103J9474
$$ -234839 -111541 -24705 -3858 -58123 -97311 -71219 -15423 1457 38445 61548 81022
21380H1022m078q8823j09711J19594J01396m0499j5382k011J1571k6114j6704
$$ 81022 76944 -11879 -121590 -1996 99400 58901 43519 41508 53079 26965 10261
21369A0261M8217K8099l0249j01204j1633n836Q3814k8468p211R8114l4575j7158
$$ 10261 58478 86577 56328 -44876 -56509 -62345 21469 -6999 -14210 83904 49329 32171
21357C2171L0570l812p1187l9823l3980Q916q2336M8681P5719k8149q4974N262
$$ 32171 62741 58929 -12258 -52081 -86061 -77145 -159481 -110800 -35081 -63230 -148204 -142942
21345a42942J30385k3040N512q630J1467P2482L8241p4209q7394m085q598O1071
$$ -142942 -12557 -35597 -30085 -38715 -27248 45234 83475 9266 -78128 -82213 -90811 -29740
21333b9740P6993k9659j00658R240Q242k5674o5767O549M1814o0822K7450m6540
$$ -29740 47253 17594 -83064 -73824 -65582 -91256 -157023 -150474 -108660 -169482 -142032 -188572
21321a88572k0538l3229N3410P4447M8384m0710J56166J0031K9735O5330q1306
$$ -188572 -209110 -242339 -188929 -114482 -66098 -106808 49358 59389 89124 154454 73148
21310G3148K3638J7799l9610m275n7562o6857n9756n0808L2321Q1082O4212j9154
$$ 73148 96786 114585 74975 70700 13138 -53719 -113475 -164283 -131962 -50880 13332 -5822
21298e822n3756k553o5101P5345m8829j19466p6894O6257J36095J30270J3473
$$ -5822 -59578 -62131 -127232 -51887 -100716 -220182 -297076 -230819 -94724 35546 49019
21287D9019m2733j13255L8809P0647j2245l1906R0616Q349J1718l1332r096L6204
$$ 49019 6286 -106969 -68160 2487 -9758 -41664 48952 57301 69019 37687 28591 64795
21275F4795K3829k94q1332o2893O3505K8102q7408m5262o447M1007O7910J04715
$$ 64795 88624 88330 6998 -55895 7610 35712 -51696 -96958 -103405 -62398 5512 110227
21263A10227K2313o2853j49628m3550M6484n7595Q1590K3072n914p398m4957O6540
$$ 110227 132540 69687 -79941 -123491 -77007 -134602 -53012 -29940 -35854 -43252 -88209 -21669
21251b1669P6379j7793m4963K4883M2639l8713n0738m7857l6101m477R9006P1445
$$ -21669 54710 36917 -8046 16837 59476 20763 -29975 -77832 -113933 -118410 -19404 52041
21239E2041J3184o5127L1406M1821j46719R1433Q5749r6666m652K0181j7263K8919
$$ 52041 65225 98 31504 73325 -73394 18039 103788 7122 2470 22651 5388 34307
21227C4307N7068p0558L0189J36422l7725l7001j1933o259q5789L9472N7246j62942
$$ 34307 91375 20817 51006 187428 149703 112702 100769 94510 8721 48193 105439 -57503
21215e7503p8539m8332J11460l5673M0299O679q9871M2315Q9334O9112j4708q717
$$ -57503 -136042 -184374 -72914 -108587 -68288 -61609 -151480 -109165 -19831 49281 34573 25856
21203B5856O3762K2008m4725k8456l1103l4962l0015K2914n3084j42772o4361
$$ 25856 89618 111626 66901 38445 7342 -27620 -57635 -34721 -87805 -230577 -294938
21192b94938R7513P3166R9227l0930j16121N439j7662O9868P3668M6965o7087
$$ -294938 -197425 -124259 -25032 -55962 -172083 -166644 -184306 -114438 -40770 6195 -60892
21181f0892r5373j2746J09214K5431p4955k4440O8076R7626L3882n3806J896n8301
$$ -60892 -156265 -169011 -59797 -34366 -109321 -133761 -65685 31941 65823 12017 13913 -44388
21169d4388J1290J8490N116l5650r372Q2586M5776p0239p7018j8538m023K9432
$$ -44388 -33098 -14608 -9492 -45142 -54514 28072 73848 3609 -73409 -91947 -95970 -66538
21157f6538K0614j55571n4960J18275J319j14300j4146K1834o9149O2902J54585
$$ -66538 -45924 -201495 -256455 -138180 -136861 -251161 -265307 -243473 -312622 -249720 -95135
21146i5135O8733j420J11003P2776k2736l2056p3745L2162o0641m1294l085j7466
$$ -95135 -26402 -27822 83181 155957 133221 101165 27420 59582 -1059 -42353 -45438 -62904
21134f2904o3044j9184N28o8044m3162n9108M765L9989J29765J16211M3830k418
$$ -62904 -125948 -145132 -144604 -212648 -255810 -314918 -310153 -270164 -140399 -24188 19642 17224
21122A7224j1763r6796L6297P3113P4377K8741j10257m6698k2423o2529r377o0606
$$ 17224 5461 -91335 -55038 18075 92452 121193 10936 -35762 -58185 -120714 -130091 -190697
21110a90697j8042J29736m8834L6774L9857N9334M091p8352j6812l2500J383J4459
$$ -190697 -208739 -79003 -127837 -91063 -51206 8128 12219 -66133 -82945 -115445 -114062 -99603
21098i9603O237N9579J27457r804m9967j9493N2055n7756r6223q2758o8610o840
$$ -99603 -93366 -33787 93670 83866 33899 14406 66461 8705 -87518 -170276 -238886 -245726
21086b45726n855K069J86092J19220j04882k8082K3941R359J5177J7905o1522
$$ -245726 -251581 -249512 -63420 55800 -49082 -77164 -53223 -43864 -28687 -10782 -72304
21075g2304j15987n7970j7664j62176L5935O2488j6592J00346O4297J10487j5434
$$ -72304 -188291 -246261 -263925 -426101 -390166 -327678 -344270 -243924 -179627 -69140 -84574
21064h4574K7285M8500k3701P7478R1304k7349j21133r685j7887k0984M3327J38109
$$ -84574 -57289 -8789 -32490 44988 136292 108943 -12190 -21875 -39762 -60746 -17419 120690
21052A20690n128m7707j43623k6533M5962J29619O6574o9712q3396q9794k5319
$$ 120690 115562 67855 -75768 -102301 -56339 73280 139854 70142 -13254 -103048 -128367
21041a28367Q5296Q7804J2332m1339J9933M4246N9763j21197j58687k0151M3007
$$ -128367 -43071 44733 57065 15726 35659 79905 139668 18471 -140216 -160367 -117360
21030a17360l8973M2941R2046m5187o5010k8489O3714O3992L9408Q3628J18537
$$ -117360 -156333 -113392 -21346 -66533 -131543 -160032 -96318 -32326 7082 90710 209247
21019B09247n4638j00246j70227P5686J38205K1108k5288j11635q6212j67899
$$ 209247 154609 54363 -115864 -40178 98027 119135 93847 -17788 -104000 -271899
21009b71899L7155N3472J01377J16574o1911J6413j7858j70094q7661N8279J03503
$$ -271899 -234744 -181272 -79895 36679 -25232 -8819 -26677 -196771 -284432 -226153 -122650
20998a22650r746l0530l7487J50567J48920q929o2822k6587O2483l6891j1093
$$ -122650 -132396 -162926 -200413 -49846 99074 90145 27323 736 63219 26328 15235
20987A5235K6872l1358M3484P1594M4348l6280L6301j1576n4479m4186L1851n5613
$$ 15235 42107 10749 54233 125827 170175 133895 170196 158620 104141 59955 91806 36193
20975C6193j6278n3389n925n103l6489K9361l2952n5473m2794P1070Q8783M1458
$$ 36193 19915 -33474 -39399 -44502 -80991 -51630 -84582 -140055 -182849 -111779 -22996 18462
20963A8462R424m2191l9473j9931m4700K5133J13356R2606O2557q0107p7146J1945
$$ 18462 27886 -14305 -53778 -73709 -118409 -93276 20080 112686 175243 95136 17990 29935
20951B9935m3047j03252m5655l755K7585J9839k3009o1383O8325J7298q324J1580
$$ 29935 -13112 -116364 -162019 -165774 -138189 -118350 -141359 -202742 -134417 -117119 -125443 -113863
20939a13863O725q8530M1210J35539n6429o5487j1952J79234k7545j06575R2875
$$ -113863 -107138 -195668 -154458 -18919 -75348 -140835 -152787 26447 -1098 -107673 -14798
20928a4798J19794J01372j3095j09970p8013o2631j5332K0320J128K6744j551
$$ -14798 104996 206368 193273 83303 5290 -57341 -72673 -52353 -51225 -24481 -26032
20917b6032j9230J24730J81306K1383k3575n8490j67129j65156o990k1798n8575
$$ -26032 -45262 79468 260774 282157 258582 200092 32963 -132193 -139183 -160981 -219556
20906b19556j042N2185P8940N3789n9659J8982R2572R2263O0030p3052n9070o0992
$$ -219556 -220598 -168413 -89473 -35684 -95343 -76361 16211 108474 168504 95452 36382 -24610
20894b4610q513o6334n9573j5416L7056R0660O0380k5474M7073J7526r4391p4297
$$ -24610 -33123 -99457 -159030 -174446 -137390 -46730 13650 -11824 35249 52775 -41616 -115913
20882a15913m3522L3274J9749M4990l8841J76475O4500m4897m0008J5984n0399
$$ -115913 -159435 -126161 -106412 -61422 -100263 76212 140712 95815 55807 71791 21392
20871B1392q4820r1685n9284l3271R7260J03826N6199q019m212J6547p8261P7001
$$ 21392 -63428 -155113 -214397 -247668 -150408 -46582 9617 1598 -2614 13933 -64328 12673
20859A2673L7931l3625r9560r4702N6595R6366j640j58247M6136J39445K519r956
$$ 12673 50604 16979 -82581 -177283 -120688 -24322 -25962 -184209 -138073 1372 3891 -6065
20847f065L4798J1021j15719m210K5766L6961k8925l1818N5732k5448L6118M3030
$$ -6065 28733 39754 -75965 -80175 -54409 -17448 -46373 -78191 -22459 -47907 -11789 31241
20835C1241m1117l9734J8876J31555k2013j4546M0390n7633j9100m2330J4625
$$ 31241 -9876 -49610 -30734 100821 78808 64262 104652 47019 27919 -14411 214
20824B14P1785J34530j04750m8125k181K032p0576k9722k068K9032o548k2364
$$ 214 71999 206529 101779 53654 51473 53505 -17071 -46793 -48861 -19829 -26377 -48741
20812d8741P2871M0300k4497m1929m0527l7174m9502J3132P4318J48647L5856
$$ -48741 24130 64430 39933 -1996 -42523 -79697 -129199 -116067 -41749 106898 142754
20801A42754j53621j67628n4653Q5053R1528l5334j5965k8855L9017R5042L1179
$$ 142754 -10867 -178495 -233148 -148095 -56567 -91901 -107866 -136721 -97704 -2662 28517
20790B8517O6121k2957J7395Q058o7518r3686P202l5544n2096J24435j6010j5087
$$ 28517 94638 71681 89076 97134 29616 -64070 -56868 -92412 -144508 -20073 -36083 -51170
20778e1170j3458k4520n8489r1320K8001Q6798L0288N996l711L1904K0796J3007
$$ -51170 -64628 -89148 -147637 -238957 -210956 -124158 -93870 -87874 -91585 -59681 -38885 -25878
20766b5878M4709k557l5806l0694j15948p6763j3644J03118J9078N8379p1194
$$ -25878 18831 16274 -19532 -50226 -166174 -242937 -256581 -153463 -134385 -76006 -147200
20755a47200O9641L1425l19l9563L6864J8783Q8097Q563K497O9325k3317q8912
$$ -147200 -77559 -46134 -46453 -86016 -49152 -30369 57728 66291 68788 138113 114796 25884
20743B5884L3183o3636N8597p7332l7674l7148j1971l0664O0235K5536J9182j5264
$$ 25884 59067 -4569 54028 -23304 -60978 -98126 -110097 -140761 -80526 -54990 -35808 -51072
20731e1072Q2859M1625l364K4592n06n0786k1955O437K8314m9814j22554n6063
$$ -51072 31787 73412 70048 94640 94134 43348 21393 27830 56144 6330 -116224 -172287
20719a72287j7160l0733P8017K6716m9043k1114L4728K538Q7529J5546j4113L6801
$$ -172287 -189447 -220180 -142163 -115447 -164490 -185604 -150876 -148338 -60809 -45263 -59376 -22575
20707b2575n0222o320o3131o8881K4977Q4306J37914j5104j00291m1116P4602
$$ -22575 -72797 -79117 -142248 -211129 -186152 -101846 36068 20964 -79327 -120443 -45841
20696d5841k1913m6340N6270k2960q6129j23424P0479J85198j35798k532K7893
$$ -45841 -67754 -114094 -57824 -80784 -166913 -290337 -219858 -34660 -170458 -172990 -145097
20685a45097O590J0762n2167R8401J33272Q3831J6328j2634q4419j10728l4514
$$ -145097 -138507 -127745 -179912 -81511 51761 135592 151920 139286 54867 -55861 -90375
20674i0375l17K0997n6374m3762N2725J65226O5965r0337m4967N3473J31123q3414
$$ -90375 -90692 -69695 -126069 -169831 -117106 48120 114085 23748 -21219 32254 163377 79963
20662G9963m4374n8549q9207j22736K6207J06287K897n033r358J57448P3971k5911
$$ 79963 35589 -22960 -112167 -234903 -208696 -102409 -99512 -104545 -113903 43545 117516 91605
20650I1605r3415n4325o9633K9798R6434M9000j1825L8679l4252j45399j28354
$$ 91605 -1810 -56135 -125768 -95970 464 49464 37639 76318 42066 -103333 -231687
20639b31687J10695O2559O8680J6847m81n067N4392J8205k9897j28495k36015
$$ -231687 -120992 -58433 10247 27094 26613 21546 75938 94143 64246 -64249 -300264
20628c00264r294J56255Q4371N6841M2658K6903O5104K3585p8095k54R647o291
$$ -300264 -309558 -153303 -68932 -12091 30567 57470 122574 146159 68064 67810 77457 71166
20616G1166l9600n4038J2955O27m0874K3285N7084P9521O751m0502k7467k1390
$$ 71166 31566 -22472 -9517 -8890 -49764 -26479 30605 110126 116877 76375 48908 27518
20604B7518l7101q036j3179K8580L0494M0299L9620J4246k0553p1006j5504j4159
$$ 27518 -9583 -17619 -30798 -2218 28276 68575 108195 122441 101888 30882 15378 1219
20592A219j23189j00637j66771J01827J61515n1196o7414J9664P4923N1585J3496
$$ 1219 -121970 -222607 -389378 -287551 -126036 -177232 -244646 -224982 -150059 -98474 -84978
20581h4978k7336L4907O046k0615j1978q2407J1969P5634k7122k7845Q4485o0434
$$ -84978 -112314 -77407 -71361 -91976 -103954 -186361 -174392 -98758 -125880 -153725 -69240 -129674
20569a29674L954L4223m9707K1725n3503r346R2888N536j2870j869p6775L8888
$$ -129674 -125720 -91497 -141204 -119479 -172982 -182328 -89440 -83904 -96774 -98643 -175418 -136530
20557a36530O0295P5429j1102O2558K8230P8600m8934m7472l2690j28233l6956
$$ -136530 -76235 -806 -11908 50650 78880 157480 108546 61074 28384 -99849 -136805
20546a36805L5815J3166l6590n37j5806K7421L6220O9214J27279M0963l5418m7881
$$ -136805 -100990 -87824 -124414 -124951 -140757 -113336 -77116 -7902 119377 160340 124922 77041
20534G7041l7171j1446m6779n2920q2769n9106L6766M3914p8735K7620J49266
$$ 77041 39870 28424 -18355 -71275 -154044 -213150 -176384 -132470 -211205 -183585 -34319
20523c4319k7470n5141q6556m8847L7707J11679l3105k6580M6345m985Q824J47482
$$ -34319 -61789 -116930 -203486 -252333 -214626 -102947 -136052 -162632 -116287 -121272 -112448 35034
20511C5034L3795R5357J0574M3681o7497q2789j5719l0412K3599q0095j12646
$$ 35034 68829 164186 174760 218441 150944 68155 52436 22024 45623 -34472 -147118
20500a47118r040J08711J31626o6976k1411O1430k3374m9229J0699j04614O1562
$$ -147118 -156158 -47447 84179 17203 -4208 57222 33848 -15381 -4682 -109296 -47734
20489d7734J43591K0557L3753O4369p4027j22149j02943j7723K0778J12910K1406
$$ -47734 95857 116414 150167 214536 140509 18360 -84583 -102306 -81528 31382 52788
20478E2788K9813O831K8130p272J844m228m6379l6110O7071k2160o4585O2472
$$ 52788 82601 89432 117562 110290 112134 107906 61527 25417 92488 70328 5743 68215
20466F8215p4937k7148Q3817R7762P0465r2631k2222o5305K4425Q0370P689L241
$$ 68215 -6722 -33870 49947 147709 218174 125543 103321 38016 62441 142811 150500 153741
20454A53741P5231p770k03408p8955o7092J7825J43580k3707q2591J0127J24782
$$ 153741 228972 221202 17794 -61161 -128253 -110428 33152 9445 -73146 -63019 61763
20443F1763j55087k80299J6415J23564O1433L2553P2463P6290j4202n6594o0550
$$ 61763 -93324 -373623 -357208 -233644 -172211 -139658 -67195 9095 -5107 -61701 -122251
20432a22251o2234R3159M6179J1569P902o2818O9840P9860K9545k1032j07067
$$ -122251 -184485 -91326 -45147 -33578 -25676 -88494 -18654 61206 90751 69719 -37348
20421c7348j4023P3691j6762k8711r0630J025J70531n1192q3053Q5947K967J5433
$$ -37348 -51371 22320 5558 -23153 -113783 -112758 57773 6581 -76472 9475 12442 27875
20409B7875m9043j8303k2655J32620J457m2797R0518l254n3840p0483o932R9659
$$ 27875 -21168 -39471 -62126 70494 71951 29154 119672 116418 62578 -7905 -14837 84822
20397H4822J06507m2643q9247m8426K6060k2604q9468j4757L0018J3909P2915
$$ 84822 191329 148686 59439 11013 37073 14469 -74999 -89756 -59738 -45829 27086
20386B7086P975j3785L1819p1568l7030M0955O368K912K1904R78L6184J4611O8987
$$ 27086 35061 21276 53095 -18473 -55503 -14548 -8180 -5268 16636 17614 53798 68409 137396
20373A37396n817j18359j3383m5749l8438R084O4386L8992p051o5632J04843j7693
$$ 137396 131579 13220 -163 -45912 -84350 -75266 -10880 28112 21061 -44571 60272 42579
20361D2579O380n378m7702m8423P2732N0259J00486N2088l1531j45261q6239N700
$$ 42579 48959 43581 -4121 -52544 20188 70447 170933 223021 191490 46229 -40010 -34310
20349c4310M3626l3351J1022N2900n0915J3235l651o5038j9955M1712l3413l8041
$$ -34310 9316 -24035 -13013 39887 -11028 2207 -1444 -66482 -86437 -44725 -78138 -116179
20337a16179q2808L0936J2484q6473J0408L7684Q1377L3685R1408O0076n0205
$$ -116179 -198987 -168051 -155567 -242040 -231632 -193948 -112571 -78886 12522 72598 22393
20326B2393q3526j10148j12583K4530J46232Q9588K6005R6413O505m8156k9166
$$ 22393 -61133 -171281 -283864 -259334 -113102 -23514 2491 98904 105409 57253 28087
20315B8087m7077p2090l9060J07287J822k0134J7703J47275J4034j11293n8363
$$ 28087 -18990 -91080 -130140 -22853 -21031 -41165 -23462 123813 137847 26554 -31809
20304c1809R727L2878k530o2730K878O1374J4076o7888L18r965L5451K1448j39008
$$ -31809 -22082 10796 8266 -54464 -51586 9788 23864 -44024 -43706 -53671 -18220 3228 -135780
20291a35780o5795l5285L2095J92742J6104M95O0458J9113L3127n5146o3981l6262
$$ -135780 -201575 -236860 -204765 -12023 4081 4576 65034 84147 117274 62128 -1853 -38115
20279c8115m084O6440m6090j64495r765k398J08611J3257J5974K4156P6679M9240
$$ -38115 -42199 24241 -21849 -186344 -196109 -198507 -89896 -76639 -60665 -36509 40170 89410
20267H9410M9711j6075K8265Q0486q501j17405o8522K291k9605j44282j27330
$$ 89410 139121 123046 151311 231797 223296 105891 37369 39660 10055 -134227 -261557
20256b61557N7347J45542O0839N7493m4441q4324N3794J13418K4897m2889J8219
$$ -261557 -204210 -58668 2171 59664 15223 -69101 -15307 98111 123008 80119 98338
20245I8338L4266M3695k2608q5777p706o1247p5750l3484q151p7279K271J0161
$$ 98338 132604 176299 153691 67914 60208 -1039 -76789 -110273 -118424 -195703 -193432 -183271
20233a83271M2448K7054K9913L0324O871J2461L0524m0870R7285J2883j5116L6922
$$ -183271 -140823 -113769 -83856 -53532 -46661 -34200 -3676 -44546 52739 65622 50506 87428
20221H7428R077J1695j30380j665N4797N2780O5578l2710j16283o1161K8702O7949
$$ 87428 96505 108200 -22180 -23845 30952 83732 149310 116600 317 -60844 -32142 35807
20209C5807J1458n2960l3931k6230J8350J3837M3745l0394l1561j42234P4800
$$ 35807 47265 -5695 -39626 -65856 -47506 -33669 10076 -20318 -51879 -194113 -119313
20198a19313R5910K811J2411j7148r627N4212j9276l859o0814N4994l8885p6885
$$ -119313 -23403 -20592 -8181 -25329 -34956 19256 -20 -3879 -64693 -9699 -48584 -125469
20186a25469j12813k360J5250Q2709J23486j10337o5167J13406P4640l1542o7951
$$ -125469 -238282 -240642 -225392 -142683 -19197 -129534 -194701 -81295 -6655 -38197 -106148
20175a06148j5598K5945l3720J5469j2058j05285j0228J13969O816J8551P3955
$$ -106148 -121746 -95801 -129521 -114052 -126110 -231395 -241623 -127654 -120838 -102287 -28332
20164b8332j08980j111K1595M8538k3378q0310n745N6483N5221K0316m8167K4013
$$ -28332 -137312 -138423 -116828 -68290 -91668 -171978 -177723 -121240 -66019 -45703 -93870 -69857
20152f9857J40545j2280j12754j7221M9247L1250r1993M6874o942o7418k6168
$$ -69857 70688 58408 -54346 -71567 -22320 8930 -83063 -36189 -43131 -110549 -136717
20141a36717Q2050J36956k3697p1749n8205J3150k4773M7873L9255r1584m5701
$$ -136717 -54667 82289 58592 -13157 -71362 -58212 -82985 -35112 4143 -87441 -133142
20130a33142O3955M0951O9553R1060l4088p5430J8631j6779p3357K6142m4724
$$ -133142 -69187 -28236 41317 132377 98289 22859 41490 24711 -48646 -22504 -67228
20119f7228p3530k7162N5093Q2251L8377K3399O3247M5770r1864n3685j05266
$$ -67228 -140758 -167920 -112827 -30576 7801 31200 94447 140217 48353 -5332 -110598
20108a10598o6733J53807J33653o1938j37113m3198J9902P0585J43250k7543j45224
$$ -110598 -177331 -23524 110129 48191 -88922 -132120 -112218 -41633 101617 74074 -71150
20097g1150k8239j13L3913R0033N3823P4916j0302o8906N891K9885j33163l4989
$$ -71150 -99389 -99502 -65589 24444 78267 153183 142881 73975 79866 109751 -23412 -58401
20085e8401L6646l871M9948m268q4774J1518J07559M4853N534m8747n6441K7222
$$ -58401 -21755 -25626 24322 20054 -64720 -53202 54357 99210 104744 55997 -444 26778
20073B6778j7134l8267P3075n2970j37641Q4679J6738K8422M018r044l2967K6984
$$ 26778 9644 -28623 44452 -8518 -146159 -61480 -44742 -16320 -12302 -21346 -54313 -27329
20061b7329r758L4057J6708j13343l3855J10310P7157r4457q8171r540R1928Q9847
$$ -27329 -37087 -3030 13678 -99665 -133520 -23210 53947 -40510 -128681 -138221 -46293 43554
20049D3554j15908q7441o4357N3303J73361r548r759J5236M0023j05953r459N7813
$$ 43554 -72354 -159795 -224152 -170849 2512 -7036 -16795 -1559 38464 -67489 -76948 -19135
20037a9135n0952j6644q1165o9776o684M8910R4707Q2376o519j16998j37043O488
$$ -19135 -70087 -86731 -167896 -237672 -244356 -195446 -100739 -18363 -24882 -141880 -278923 -272435
20025b72435J61072m463j1213l6096Q5658N0777k8232J6203M9908n680k4801L7997
$$ -272435 -111363 -115826 -127039 -163135 -77477 -26700 -54932 -38729 11179 5499 -19302 18695
20013A8695J614K5204k2404m2080m5306N060n3827k9568j999P2046l6742j50059
$$ 18695 20309 45513 23109 -18971 -64277 -59217 -113044 -142612 -144611 -72565 -109307 -259366
20001b59366Q1510J03538m3299J0930J1740M2082R1670j2964k3205l8688m9018
$$ -259366 -177856 -74318 -117617 -106687 -94947 -52865 38805 25841 2636 -36052 -85070
19990h5070m6072N0120P9789j3595j6269j2235l728k6796m6676r133J37800o7378
$$ -85070 -131142 -81022 -1233 -14828 -31097 -43332 -47060 -73856 -120532 -129665 8135 -59243
19978e9243m6803q142N4087J02088n737m0250n0594k1328r7776N7054l3413j03829
$$ -59243 -106046 -114188 -60101 41987 36250 -4000 -54594 -75922 -173698 -116644 -150057 -253886
19966b53886O1672J55245M2449l516j32180j06785L3026N3509K5615L3541j00914
$$ -253886 -192214 -36969 5480 1964 -130216 -237001 -203975 -150466 -124851 -91310 -192224
19955a92224P6200P1476J12677M8003j04999j31546J375J405M2242m7887L2940
$$ -192224 -116024 -44548 68129 116132 11133 -120413 -119038 -117633 -75391 -123278 -90338
19944i0338P3562O1637j7834k4006m9262K1469j9182m4000K8098K8333j23864
$$ -90338 -16776 44861 27027 3021 -46241 -24772 -43954 -87954 -59856 -31523 -155387
19933a55387J873M3279M7862M7402K75k8337L5914o6746k7533K4838j31118L1709
$$ -155387 -153514 -110235 -62373 -14971 -14696 -43033 -7119 -73865 -101398 -76560 -207678 -175969
19921a75969J84580l4258k3908J105m3989P361P7313p6829q1114P9497P3990N8384
$$ -175969 8611 -25647 -49555 -48450 -92439 -85078 -7765 -84594 -165708 -86211 -12221 46163
19909D6163k4420K1890r6331j926J09470J9612P2759R0925J9057j16706j26174
$$ 46163 21743 43633 -52698 -54624 54846 74458 147217 238142 257199 140493 14319
19898A4319P556P8285O9263l1959j67710j32668J21834Q3575o0499j05459n6035
$$ 14319 21875 100160 169423 137464 -30246 -162914 -41080 42495 -18004 -123463 -179498
19887a79498R643L2854J10529j1973n2306J7813j4315m3178N0533J25096q959
$$ -179498 -169855 -137001 -26472 -38445 -90751 -72938 -87253 -130431 -79898 45198 36239
19876C6239j16802j9555K9852l422P7454r08J10892k3268P7189n7027j52293j991
$$ 36239 -80563 -100118 -70266 -73688 3766 2858 113750 90482 167671 110644 -41649 -43640
19864d3640N5616K7760o5125k7786q594o065n7036q784n7093M8024O2918J01175
$$ -43640 11976 39736 -25389 -53175 -61769 -67834 -124870 -133654 -190747 -142723 -79805 21370
19852B1370j9227K3726J7148j7610k0082R690m8781m2916P073L645l5870j15875
$$ 21370 2143 25869 43017 25407 5325 15015 -33766 -76682 -69609 -65964 -101834 -217709
19840b17709Q2201O0834p0753l537R714k453R124M5014L6948m1714k5962L0452
$$ -217709 -135508 -74674 -145427 -148964 -139250 -141703 -132579 -87565 -50617 -92331 -118293 -87841
19828h7841Q2118l9302k5733o6015N8078J1141P9418j758p0360K3479L1054L0081
$$ -87841 -5723 -45025 -70758 -136773 -78695 -67554 11864 10106 -60254 -36775 -5721 24360
19816B4360l0131q2185O7549O2316n4331j9111L255K3012P3941L4417m4214k9616
$$ 24360 -5771 -87956 -20407 41909 -12422 -31533 -28278 -5266 68675 103092 58878 29262
19804B9262l6960J25860j2814o7740J1418L7399M113j15352j39450J02907O8695
$$ 29262 -7698 118162 105348 37608 49026 86425 90538 -24814 -164264 -61357 7338
19793G338N6477J00131p0303q4290p0590q9876J8248j636L9404Q1632N3872J18318
$$ 7338 63815 163946 93643 9353 -61237 -151113 -132865 -134501 -95097 -13465 40407 158725
19781A58725r91n4145p5043m621J03716r7763j13913o3126J6092Q820Q073O157
$$ 158725 157734 103589 28546 23925 127641 29878 -84035 -147161 -131069 -122249 -114176 -108019
19769a08019R1032N7570r0288J1672R2020O6117L986q3902r6647n1750L4925Q3947
$$ -108019 -16987 40583 -49705 -38033 53987 120104 124090 40188 -56459 -108209 -73284 10663
19757A0663J01946M6192j42674j1453j5779p7659n6853p5635Q4976J22114j7407
$$ 10663 112609 158801 16127 4674 -11105 -88764 -145617 -221252 -136276 -14162 -31569
19746c1569Q1471J06408o7768o7840l7222k9595Q236j2347J564Q3873o4219K1482
$$ -31569 49902 156310 88542 20702 -16520 -46115 -37879 -50226 -48662 35211 -29008 -7526
19734g526N6120n1705J1550L688L8809O9064J111p9053m0074m7582q626J7426
$$ -7526 48594 -3111 8439 12127 50936 120000 121111 42058 1984 -45598 -54224 -36798
19722c6798L1590o4442Q4842O0711r6810r0404Q7311K3541m3609J72572M1216
$$ -36798 -5208 -69650 15192 75903 -20907 -111311 -24000 -459 -44068 128504 169720
19711A69720q2319l1905n2745j8361o2984J0140l4514k9265L6925J973L5890P4796
$$ 169720 87401 55496 2751 -15610 -78594 -68454 -102968 -132233 -95308 -93335 -57445 17351
19699A7351l6070n1639J13847O7659R4416L5106l674r508q0307o453j09014o7578
$$ 17351 -18719 -70358 43489 111148 205564 240670 236996 227488 147181 140728 31714 -35864
19687c5864M340j0508k7468J1921R6000J13806k3020j59387k3596K3422k2675
$$ -35864 -31524 -42032 -69500 -57579 38421 152227 129207 -30180 -53776 -30354 -53029
19676e3029p0665Q0384M5169j6486n5678n1033L2366J7391o637J02854n7436j1891
$$ -53029 -123694 -43310 1859 -14627 -70305 -121338 -88972 -71581 -78218 24636 -32800 -44691
19664d4691j21204K3731l342k7994P0668n871r939L1294l7645K6420N8726O6132
$$ -44691 -165895 -142164 -145506 -173500 -102832 -108703 -118642 -87348 -124993 -98573 -39847 26285
19652B6285q613N1941l2424o2679j28404K3779M4185k6183K003N7049L3712j056
$$ 26285 17672 69613 37189 -25490 -153894 -130115 -85930 -112113 -110110 -53061 -19349 -20405
19640b0405N1977m0561J1779j0671l1019j7929O3726j7608J9837k9508J1472k8928
$$ -20405 31572 -8989 2790 -7881 -38900 -56829 6897 -10711 9126 -20382 -8910 -37838
19628c7838j06413L2026J122n6167o1687m8596l301J5313K2987J33223o1648L4688
$$ -37838 -144251 -112225 -111103 -167270 -228957 -277553 -280854 -265541 -242554 -109331 -170979 -136291
19616a36291N6745r4235p3640k4944K6720k6515o9345K1060J36232J26763j535
$$ -136291 -79546 -173781 -247421 -272365 -245645 -272160 -341505 -320445 -184213 -57450 -58985
19605e8985M9321K6253k289p4118M3865j2764P407L1027J7879q9316j05567K7148
$$ -58985 -9664 16589 14300 -59818 -15953 -28717 -21310 9717 27596 -61720 -167287 -140139
19593a40139P0774K6326P9174p523n0160l7357L0208J210L1532N0213j1944p9324
$$ -140139 -69365 -43039 36135 28612 -21548 -58905 -28697 -27487 4045 54258 42314 -37010
19581c7010P0676j5003j34664L5629J2620L9048K2511p235p8435J00371M6458
$$ -37010 33666 18663 -116001 -80372 -67752 -28704 -6193 -13428 -91863 8508 54966
19570E4966n9458j830j4155r0413J06452J66245L9655j16834j44869L7340R8185
$$ 54966 -4492 -6322 -20477 -110890 -4438 161807 201462 84628 -60241 -22901 75284
19559G5284N9005j287p9394j10544p043l4229K9032L4915l316M6804O3350M4004
$$ 75284 134289 133002 53608 -56936 -63979 -98208 -69176 -34261 -37577 9227 72577 116581
19547A16581K3734J0512J2849l150n1658j61702J171j9372l2505K7831M8217m733
$$ 116581 140315 150827 163676 160526 108868 -52834 -51663 -71035 -103540 -75709 -27492 -32225
19535c2225K712L8930N751J3986L6144R4294j6085n2559m6580j29200r4402P2089
$$ -32225 -29513 9417 15168 29154 65298 159592 143507 90948 44368 -84832 -179234 -107145
19523a07145O6919K8860L4651l1337J3260L9317j1321p6217n6689o4059K5210
$$ -107145 -40226 -11366 23285 -8052 5208 44525 33204 -43013 -99702 -163761 -138551
19512a38551m5584O8443O2386j8421J33909O435r1130q7020R6773M0525n0447
$$ -138551 -184135 -115692 -53306 -71727 62182 68617 -22513 -109533 -12760 27765 -22682
19501b2682L7016K0379J0997o4533l5074m651J04597j1505Q341K2520M6166o6823
$$ -22682 14334 34713 45710 -18823 -53897 -58548 46049 34544 42885 65405 111571 44748
19489D4748q1695J6280J4179l5491M1979J0410p0349M9903j9208k9719k299J9767
$$ 44748 -36947 -20667 -6488 -41979 0 10410 -59939 -10036 -29244 -58963 -61262 -41495
19477d1495O8099j26223k4385l3526P5281j1002K7847J54974j4133q0725l1815
$$ -41495 26604 -99619 -124004 -157530 -82249 -93251 -65404 89570 75437 -5288 -37103
19466c7103m769O5030k9264M435Q4588n867o3912L011k184J429O0808j3757K1609
$$ -37103 -41872 23158 -6106 -1671 82917 77050 13138 16149 13965 15394 76202 62445 84054
19453H4054j3726r6804n690L5649O7290L9161k458j8988j2390o2735j7104k9499
$$ 84054 70328 -26476 -32166 3483 70773 109934 107476 88488 76098 13363 -3741 -33240
19441c3240n3228m2666j14761O184O8028M3424O7118M7344n0444J8111q2864k5035
$$ -33240 -86468 -129134 -243895 -237711 -169683 -126259 -59141 -11797 -62241 -44130 -126994 -152029
19429a52029M9945n6656K5891O4927O4735L9658l878J2312o663m6452Q8418l7168
$$ -152029 -102084 -158740 -132849 -67922 -3187 36471 32593 44905 38242 -8210 80208 43040
19417D3040r9423M0272j7811L3870k000R429J4463K7560m8381p8987P6087K143
$$ 43040 -56383 -16111 -33922 -52 -2052 7377 21840 49400 1019 -77968 -1881 262
19405B62P2727P2259P649o2992p5625O3041M4610R215K782O5791o7599j22159
$$ 262 72989 145248 152897 89905 14280 77321 121931 131146 133928 199719 132120 9961
19393I961j33666N791O79l5186l1776j78m1946M9077M7127o511R7224J9231q7707
$$ 9961 -123705 -117914 -117235 -152421 -184197 -184375 -226321 -177244 -130117 -136628 -39404 -20173 -107880
19380a07880r658P59K3836n408l4980J7792m0460j04695M3381N7989J08880J03421
$$ -107880 -117538 -116779 -92943 -98351 -133331 -115539 -155999 -260694 -217313 -159324 -50444 52977
19368E2977k5419o7643m4401k3456J00736n0490k5090J8037Q6955K0583N196Q7838
$$ 52977 27558 -40085 -84486 -107942 -7206 -57696 -82786 -64749 22206 42789 47985 135823
19356A35823J18925k0501m7242j34823j89869j8805M7558j9614O8210J06441J1685
$$ 135823 254748 234247 187005 52182 -137687 -156492 -108934 -128548 -60338 46103 57788
19345E7788J599L6077K9026r7936q5002L0481M1168p8264P0424R9993n0782m0702
$$ 57788 59387 95464 124490 26554 -58448 -27967 13201 -65063 5361 105354 54572 13870
19333A3870l0858L3117P7281P8287j06313j14430k2811o7843M8963K6644o05L9231
$$ 13870 -16988 16129 93410 171697 65384 -49046 -71857 -139700 -90737 -64093 -64698 -25467
19321b5467J08967m1199q9060j61738J39749L0091k970M7212Q4804Q0436J0002
$$ -25467 83500 42301 -46759 -208497 -68748 -38657 -41627 5585 90389 170825 180827
19310A80827r8267o6323n5215L5909O6878o6325k2942K1276o53l9637J3464N3969
$$ 180827 82560 16237 -38978 -3069 63809 -2516 -25458 -4182 -4835 -44472 -31008 22961
19298B2961j9828N41m3203P054k4116k7537n114j55268N3489p997q9230j1808
$$ 22961 3133 3674 -39529 -32475 -56591 -84128 -89242 -244510 -191021 -199018 -288248 -300056
19286c00056J9471P0515J01646L7579o2690o598M7296m0415N5434k2710Q0419
$$ -300056 -280585 -210070 -108424 -70845 -133535 -140133 -92837 -133252 -77818 -100528 -20109
19275b0109P1448M4980p1253m6099N137M9714k6318L2510J21235j64754n2120
$$ -20109 51339 96319 25066 -21033 -15896 33818 7500 40010 161245 -3509 -55629
19264e5629J7465j2105L1287N2430r647J9914R7252J05481p568p1018j12785m948
$$ -55629 -38164 -50269 -18982 33448 23801 43715 140967 246448 238880 167862 55077 50129
19252E0129n0704k7100J6342K1826k0246o8888O1841q7681J4750K4843q37m4545
$$ 50129 -575 -27675 -11333 10493 -9753 -78641 -16800 -104481 -89731 -64888 -65725 -110270
19240a10270N8734M0351J8816L9595J03331m2506k0264J3836k6483r4673m8842
$$ -110270 -51536 -11185 7631 47226 150557 108051 87787 101623 75140 -19533 -68375
19229f8375R2142m8803j04751K1331L0531k3619J4322m1317P4545q559r4991o521
$$ -68375 23767 -25036 -129787 -108456 -77925 -101544 -87222 -128539 -53994 -62553 -157544 -164065
19217a64065O8246j2941J8323O5082o1322q7484J8869J17956q46j9997Q3407J63230
$$ -164065 -95819 -108760 -90437 -25355 -86677 -174161 -155292 -37336 -38182 -58179 25228 188458
19205A88458l535q6944L9027M6667q1385q3535j4654j8417n9376k3686j3233J04742
$$ 188458 184923 97979 137006 183673 102288 18753 4099 -14318 -73694 -97380 -110613 -5871
19193e871j4977M2101n2107r4290M1878l4409O788m5550J32568m6115m7784J23356
$$ -5871 -20848 21253 -30854 -125144 -83266 -117675 -110887 -156437 -23869 -69984 -117768 5588
19181E588J71978q5663K4830o1436m3778J4796J5340n8640m1534l3402j1379J6293
$$ 5588 177566 91903 116733 55297 11519 26315 41655 -16985 -58519 -91921 -103300 -87007
19169h7007j4639l4835j73811J4556J54571M4801L8134N7644j7735Q6167K4267
$$ -87007 -101646 -136481 -310292 -295736 -141165 -96364 -58230 -586 -18321 67846 92113
19158I2113k1616o7707j5832j38352n4409J90830J31733j03278j27326J8696n52
$$ 92113 70497 2790 -13042 -151394 -205803 -14973 116760 13482 -113844 -95148 -95700
19147i5700J64313R2444J0196n855J03723m5314L0889J6772l3105p7645N8542
$$ -95700 68613 161057 171253 165398 269121 223807 254696 271468 238363 160718 219260
19136B19260o688J4754j02014j72087K2099R2679J8763q0084O194O1296p3559
$$ 219260 212572 227326 125312 -46775 -24676 68003 86766 6682 12876 74172 613
19125F13o2948k8190K4659o2230j3269J06642N5007K0592p4642o8216Q6975M2310
$$ 613 -62335 -90525 -65866 -128096 -141365 -34723 20284 40876 -33766 -101982 -15007 27303
19113B7303M224J33131Q4483K3949j32180n8374j22035p7157P0173j8917k8883
$$ 27303 31527 164658 249141 273090 140910 82536 -39499 -116656 -46483 -65400 -94283
19102i4283M7738n1087O009L0494J04239L7862j5352p5733p0584J094M5537P770
$$ -94283 -46545 -97632 -91623 -61129 43110 80972 65620 -10113 -80697 -79603 -34066 -26296
19090b6296m5347K8857k5084l9916K6344J07418J08395j17213q6063p6140Q6397
$$ -26296 -71643 -42786 -67870 -107786 -81442 25976 134371 17158 -68905 -145045 -58648
19079e8648J91324O4799j4969l8911j6301l1139k906r396n0618J5158l9802n5042
$$ -58648 132676 197475 182506 143595 127294 96155 93249 83853 33235 48393 8591 -46451
19067d6451N76O2733L3949k9322l6175J04017Q6525j56623o121k7332J0419O7789
$$ -46451 -45875 16858 50807 21485 -14690 89327 175852 19229 13108 -14224 -3805 63984
19055F3984K8031j31439n3544O8488M5520l27o7231P5559M3243r612k0733j09405
$$ 63984 92015 -39424 -92968 -24480 21040 20713 -46518 29041 72284 62672 41939 -67466
19043f7466m5660Q7410L2910k6218L0189j1742l1652M7765J30770L4617m2766
$$ -67466 -113126 -25716 7194 -19024 11165 -577 -32229 15536 146306 180923 138157
19032A38157n3965k0961l30J7445N1436k6192J2419N2806J8003j257m684R7258
$$ 138157 84192 63231 62901 80346 131782 105590 118009 170815 188818 187561 182877 280135
19020B80135K48969K04758K90673J41615r175p212p3404k10392j14783j04584
$$ 280135 529104 733862 1024535 1166150 1156975 1149763 1076359 865967 751184 646600
19010F46600P2569J00487r4120R4189J79253J40357J92127J0486q4554j20609
$$ 646600 719169 819656 725536 819725 998978 1139335 1331462 1341948 1257394 1136785
19000A136785p3500j48315k17226m1666n8657j60654j27731k0812N6359n0936
$$ 1136785 1063285 914970 697744 656078 597421 436767 309036 288224 344583 293647
18990B93647j9196r5323q765o5175P0436N538p1660j3668q4588J9103r612O4183
$$ 293647 274451 179128 170363 105188 175624 181162 109502 95834 11246 30349 20737 84920
18978H4920R3911J49738N0795n8303l8662o6915K7821k7195j03950j27560j8539
$$ 84920 178831 328569 379364 321061 282399 215484 243305 216110 112160 -15400 -33939
18967c3939M3859Q201l3276j9847M3786m0219M9172J17190M7967j02931o4808
$$ -33939 9920 18121 -15155 -35002 8784 -31435 17737 134927 182894 79963 15155
18956A5155N0871K1058k9517m0737M553L4706N6986J16684O269l0909K1735l6808
$$ 15155 66026 87084 57567 16830 21383 56089 113075 229759 236028 205119 226854 190046
18944A90046j00026j2355J8361N1058r1149p137N1594q0984p4536j5170m2042
$$ 190046 90020 77665 96026 147084 55935 48798 100392 19408 -55128 -70298 -112340
18933a12340r311R7845O0177J26761L7067k3089r2855o8505L6303j226N658O8510
$$ -112340 -121651 -23806 36371 163132 200199 177110 84255 15750 52053 50827 56485 124995
18921A24995m3711p3114j09731M0582J05027m5168k7198K4117O0949k7948r064
$$ 124995 81284 8170 -101561 -60979 44048 -1120 -28318 -4201 56748 28800 19736
18910A9736r256M5182j5266n3760M5904L4993Q1375j1265o3536L4280l5649k2752
$$ 19736 10480 55662 40396 -13364 32540 67533 148908 137643 74107 108387 72738 49986
18898D9986J6321o6975N63k4591L8937M1274J01805j39513q5737K7624k9317n3953
$$ 49986 66307 -668 -105 -24696 14241 55515 157320 17807 -67930 -40306 -69623 -123576
18886a23576O9510M7157R950o5476k3635J01829O4771p3967r6560j7866L1148
$$ -123576 -54066 -6909 3041 -62435 -86070 15759 80530 6563 -89997 -107863 -76715
18875g6715N6400r612j19116l938K5982m9865j7971Q2071J17020J02135r275J442
$$ -76715 -20315 -29927 -149043 -152981 -126999 -176864 -194835 -112764 4256 106391 97116 98558
18863I8558l727j32753j02282Q2173j1142j3465P7313N4950n185q685m776p0065
$$ 98558 94831 -37922 -140204 -58031 -69173 -82638 -5325 49625 44440 35755 30979 -39086
18851c9086p3364P6333K5167Q6436M6751p6286j7181M5210n4530j60071j7922
$$ -39086 -112450 -36117 -10950 75486 122237 45951 28770 73980 19450 -140621 -158543
18840a58543R8315J13789n1616j19222K9891N7355j5706K0149J05030L4445q5505
$$ -158543 -60228 53561 1945 -117277 -87386 -30031 -45737 -25588 79442 113887 28382
18829B8382q6225n8219P0403Q0159J6404L1539m6022n4626L7865R6579P6838N5751
$$ 28382 -57843 -116062 -45659 34500 50904 82443 36421 -18205 19660 116239 193077 248828
18817B48828L6833M3599P8661P7066K7581K4171K6181j14724k07019j00448l7239
$$ 248828 285661 329260 407921 484987 512568 536739 562920 448196 241177 140729 103490
18806A03490K3368O2037P9844N626r3542l7916J11426m29j23836q9453L9318Q3032
$$ 103490 126858 188895 268739 274365 180823 142907 254333 253904 130068 40615 79933 162965
18794A62965l8576L2197N2899j687p4472q6292p9381J4279J57193O4924M1185
$$ 162965 124389 156586 209485 207798 133326 47034 -32347 -18068 139125 204049 245234
18783B45234n6798k1592P4149n5456j60377K5310M0570O0684r2667q6428L3582
$$ 245234 188436 166844 240993 185537 25160 50470 91040 151724 59057 -27371 6211
18772F211O1652K0047Q7793J3574j09642l5880K6749j1494L1332p7645j9721J9110
$$ 6211 67863 87910 175703 189277 79635 43755 70504 59010 90342 12697 -7024 12086
18760A2086J7182J01687M5903L4413r3110n4316n8198m8689o291K1342K17l8068
$$ 12086 29268 130955 176858 211271 118161 63845 5647 -43042 -49333 -27991 -27774 -65842
18748f5842O6886Q4098M1844l6543N8760N755q9861N8064J42499j1315K0527R201
$$ -65842 1044 85142 126986 90443 149203 154958 65097 123161 265660 254345 274872 284073
18736B84073j33578j6515O7128r8715j04917N8291R0101k5950o2429j1937P6202
$$ 284073 150495 133980 201108 102393 -2524 55767 145868 119918 57489 45552 121754
18725A21754O0884P1909r9906m3190L9762M6970k5304P2906J6329r8493M7378
$$ 121754 182638 254547 154641 111451 151213 198183 172879 245785 262114 163621 210999
18714B10999L4730K788l1429o1832M7189o3869p6172K0864r663o4486j4869K9612
$$ 210999 245729 248517 217088 155256 202445 138576 62404 83268 73605 9119 -5750 23862
18702B3862j8958N5539J2379r4788k5404N7676J2497p3764N5799R6938n9955j73851
$$ 23862 4904 60443 72822 -21966 -47370 10306 22803 -50961 4838 101776 41821 -132030
18690a32030N5756N7167O6465J66906l1276j26274k2922O9499o2250M7692K8799
$$ -132030 -76274 -19107 47358 214264 182988 56714 33792 103291 41041 88733 117532
18679A17532M457J6445o5377m5808l0249l362J8232K8572k580J627p5895J8571
$$ 117532 121989 138434 73057 27249 -3000 -6362 11870 40442 37862 39489 -36406 -17835
18667a7835p168J7018M9576l2779R752n6958K5004p48M721j8976K2862J73000
$$ -17835 -25003 -7985 41591 8812 18564 -38394 -13390 -14138 -9417 -28393 -5531 167469
18655A67469N8020p9512q3470o9753l7260n2765j0278L2853K2630M8714J3973
$$ 167469 225489 145977 62507 -7246 -44506 -97271 -107549 -74696 -52066 -3352 10621
18644A0621R1893R9954r5249j41365p48J00412j3389L8082O7043Q559N0082J8153
$$ 10621 102514 202468 107219 -34146 -34894 65518 52129 90211 157254 165813 215895 234048
18632B34048K6890k0524Q685P1979p6988M8912L6902j07679p7165j6034m9362
$$ 234048 260938 240414 249099 321078 244090 293002 329904 222225 145060 129026 79664
18621G9664m7382O7081M6888p3106o5759j21444L9737J90712J08196j75392q5265
$$ 79664 32282 99363 146251 73145 7386 -114058 -74321 116391 224587 49195 -36070
18610c6070j573O6754N5401R8342P5740K4316J49785K71018J16888Q3247J89615
$$ -36070 -37643 29111 84512 182854 258594 282910 432695 703713 820601 903848 1093463
18599A093463J29346q7491l5516P9251M1010n9922j42196R0216J32405J05244
$$ 1093463 1222809 1135318 1099802 1179053 1220063 1160141 1017945 1108161 1240566 1345810
18589A345810K4102K3301K07382Q4898k8741j12225p7409K2501j38950j04787
$$ 1345810 1369912 1393213 1600595 1685493 1656752 1544527 1467118 1489619 1350669 1245882
18579A245882o2025O7357J20427J5846J74527Q4902l7823o4035j66217j26216
$$ 1245882 1183857 1251214 1371641 1387487 1562014 1646916 1609093 1545058 1378841 1252625
18569A252625j39326l8718L289O4371J80669J16323j7522N4582M688j18726p3858
$$ 1252625 1113299 1074581 1077870 1142241 1322910 1439233 1421711 1476293 1480981 1362255 1288397
18558A288397j01294o0708K9850l899N5497M887M7724o383o2802r8868m4379L8560
$$ 1288397 1187103 1126395 1156245 1152346 1207843 1212730 1260454 1254071 1191269 1092401 1048022 1086582
18546A086582o682r21j6458l5872o9123Q004J05335P5541j6712k4539r2024Q1074
$$ 1086582 1079900 1078979 1062521 1026649 957526 965530 1070865 1146406 1129694 1105155 1013131 1094205
18534A094205M6561O8781J3854N5708N5966k8195J9652N4137J2797J15693N0954
$$ 1094205 1140766 1209547 1223401 1279109 1335075 1306880 1326532 1380669 1393466 1509159 1560113
18523A560113j7905j80982R5060J00561K8787m7724P4064O1198J39486K08652
$$ 1560113 1542208 1361226 1456286 1556847 1585634 1537910 1611974 1673172 1812658 2021310
18513B021310M5589J87018K37180J93281Q1784n5663j0321p983r16K996L4762
$$ 2021310 2066899 2253917 2491097 2684378 2766162 2710499 2700178 2692195 2691279 2694275 2729037
18502B729037J10633K31300K23671L02463M31206L94272N96158N90254P39787
$$ 2729037 2839670 3070970 3294641 3597104 4028310 4422582 5018740 5608994 6348781
18493F348781Q43786P72511P87769R46925R84392J047040J289899J529911K168772
$$ 6348781 7192567 7965078 8752847 9699772 10684164 11731204 13021103 14551014 16719786
18484A6719786L201883N241754Q866691J5218425K4127981L0382226K8581636
$$ 16719786 19921669 25163423 34030114 49248539 73376520 103758746 132340382
18477A32340382K7764653K9491520J5298833q025867j2851087j6767392k9360940
$$ 132340382 160105035 189596555 204895388 196869521 184018434 167251042 137890102
18470A37890102k5261809j1333290M694027J9961382K6126824K2649517K5120290
$$ 137890102 112628293 101295003 105989030 125950412 152077236 174726753 199847043
18463A99847043K5826179M234388j8659640j8872820k6669238l6884297l0525843
$$ 199847043 225673222 229907610 211247970 192375150 165705912 128821615 98295772
18456I8295772k1343575j4174337r163184o043540m242474l007424k230482j795377
$$ 98295772 76952197 62777860 53614676 47571136 43328662 40321238 38090756 36295379
18448C6295379j558217j394603j558598j580261j390959j442234j511653j267500
$$ 36295379 34737162 33342559 31783961 30203700 28812741 27370507 25858854 24591354
18440B4591354j175223r84446q44982p21474p88808q49579q07442n72372n26761
$$ 24591354 23416131 22431685 21586703 20865229 20076421 19226842 18419400 17847028 17320267
18431A7320267o10533n19526m26576l92660l44397k73706l94725l74258k77197
$$ 17320267 16709734 16190208 15763632 15370972 15026575 14752869 14358144 13983886 13706689
18422A3706689l47974l43266k66020k90887j87340k16493k47008l06164q8151
$$ 13706689 13358715 13015449 12749429 12458542 12271202 12054709 11807701 11501537 11413386
18413A1413386K438q6489r3037k20373k89845l78129l65327l16449l37407k52481
$$ 11413386 11415824 11329335 11236298 11015925 10726080 10347951 9982624 9666175 9328768 9076287
18403I076287j93586k39944j72554j68448k85113j41949r1478j67932j32741j71342
$$ 9076287 8882701 8642757 8470203 8301755 8016642 7874693 7783215 7615283 7482542 7311200
18393G311200j82344j54815k21905q5602j29981q0553r7828n7062j54517j20663
$$ 7311200 7128856 6974041 6752136 6666534 6536553 6456000 6358172 6301110 6146593 6025930
18383F025930k2735j22370j57966j57243j96662k1482j08447p1385o0487k2912
$$ 6025930 6003195 5880825 5722859 5565616 5368954 5347472 5239025 5167640 5107153 5084241
18373E084241j31046k7066K2923j8991m5470o3513q415n5760l1061J9019L3387
$$ 5084241 4953195 4926129 4949052 4930061 4884591 4821078 4812663 4756903 4725842 4744861 4778248
18362D778248J62033Q4293P9418L7284j04487p5645j07921j77241j78644r3604
$$ 4778248 4940281 5024574 5103992 5141276 5036789 4961144 4853223 4675982 4497338 4403734
18352D403734m4627J26779J18499N4504q5017l5887r9460j90142j90314j29221
$$ 4403734 4359107 4485886 4604385 4658889 4573872 4537985 4438525 4248383 4058069 3928848
18342C928848j74795k9544J33490Q7630J90337M0513l4732J94171R390j71091
$$ 3928848 3754053 3724509 3857999 3945629 4135966 4176479 4141747 4335918 4345308 4174217
18332D174217j25375j94626j85771k40161j65293j27082q7761p3552r6178r5757
$$ 4174217 4048842 3854216 3668445 3428284 3262991 3135909 3048148 2974596 2878418 2782661
18322B782661q118R3785o0666j71075p8880m178M8643M185j27616p3303j2091
$$ 2782661 2774543 2868328 2807662 2636587 2557707 2553529 2602172 2606357 2478741 2405438 2393347
18311B393347J790o3919k7176J8276k0533j28990j7910K2247J11317J0371j5608
$$ 2393347 2395137 2331218 2304042 2322318 2301785 2172795 2154885 2177132 2288449 2298820 2283212
18300B283212j27397n8955J0770q4432n1795K2663m9319j38925j4898N0254o8353
$$ 2283212 2155815 2096860 2107630 2023198 1971403 1994066 1944747 1805822 1790924 1841178 1772825
18289A772825l7787m2245J5637L708j16287j10207R0151O4664L7629j9187j02489
$$ 1772825 1735038 1692793 1708430 1712138 1595851 1485644 1575795 1640459 1678088 1658901 1556412
18278A556412M638q0408l1313o1351q3525Q714J19351N844O36o6399p4587q1264
$$ 1556412 1561050 1480642 1449329 1387978 1304453 1313167 1432518 1438362 1438998 1372599 1298012 1216748
18266A216748O9504O2166k7738J7134M8875K7600Q4781J38710q2470p020N4344
$$ 1216748 1286252 1348418 1320680 1337814 1386689 1414289 1499070 1637780 1555310 1548290 1602634
18255A602634p6676l0040n9682l1818j17759j56244p1595M8700K0615N1958Q8497
$$ 1602634 1525958 1495918 1436236 1404418 1286659 1130415 1058820 1107520 1128135 1180093 1268590
18244A268590r9510p4137k6236p9433j6732j6457N0391p8482J9321n6820M6347
$$ 1268590 1169080 1094943 1068707 989274 972542 956085 1006476 927994 947315 890495 936842
18233I36842P3739N5449p4483o6638l8225j2581p3794M8647M6328M1964j13172
$$ 936842 1010581 1066030 991547 924909 886684 874103 800309 848956 895284 937248 824076
18222H24076r1527o7455K4532M2282p6396K0619o8313l2798n4949N9245r5420
$$ 824076 732549 665094 689626 731908 655512 676131 607818 575020 520071 579316 483896
18211D83896J33457J16974j4N4144J9723m3242k3788L2675p4138k5697n0412j34989
$$ 483896 617353 734327 734313 788457 808180 764938 741150 773825 699687 673990 623578 488589
18199D88589m4436R8952j7096k8640k0756o8781K8071J7591K9526l9876M7678
$$ 488589 444153 543105 526009 497369 476613 407832 435903 453494 483020 443144 490822
18188D90822k1838r7206q836J99729J82531j7575N5093J26264J97323J56092L1874
$$ 490822 468984 371778 362942 562671 745202 727627 782720 908984 1106307 1262399 1294273
18177A294273m5389R0312J33229J4587k5517m9304j2535K19340K87938K24806
$$ 1294273 1248884 1339196 1472425 1487012 1461495 1412191 1399656 1618996 1906934 2131740
18167B131740K67787J66606j6617j30568j07932p0609j60629j23882o6891j29822
$$ 2131740 2399527 2566133 2549516 2418948 2311016 2240407 2079778 1955896 1889005 1759183
18157A759183j3179l5732r8117j49481j84161j64411q192j7817q9640n63L5826
$$ 1759183 1746004 1710272 1612155 1462674 1278513 1114102 1105910 1088093 998453 997890 1033716
18146A033716l0249o246L7882L8865m0563J3238L7932R0019N7024O2162P7925
$$ 1033716 1003467 997221 1035103 1073968 1033405 1046643 1084575 1174594 1231618 1293780 1371705
18135A371705M1211M5729n0361n2118N5619J7784P6283K73629M39849L76332K06390
$$ 1371705 1412916 1458645 1408284 1356166 1411785 1429569 1505852 1779481 2219330 2595662 2802052
18124B802052J89826K52147M2358j55362M3396J34200Q1367J28618J11534P1158
$$ 2802052 2991878 3244025 3286383 3131021 3174417 3308617 3389984 3518602 3630136 3701294
18114C701294P6423j57166l06951l05114k38518j80941l5625n1473j30694k49243
$$ 3701294 3777717 3620551 3313600 3008486 2769968 2589027 2553402 2501929 2371235 2121992
18104B121992j82486R010m2258L3699O9978o3378r3844j6370M2888p6293o9334
$$ 2121992 1939506 1948516 1906258 1939957 2009935 1946557 1852713 1836343 1879231 1802938 1733604
18093A733604l2408k4424L8346N5520K6573r6904L3747l5168M256J87398R7739
$$ 1733604 1701196 1676772 1715118 1770638 1797211 1700307 1734054 1698886 1703142 1890540 1988279
18082A988279J15327M8590N3758N7550J42197N5302r004r234O8321J09783K31208
$$ 1988279 2103606 2152196 2205954 2263504 2405701 2461003 2451999 2442765 2511086 2620869 2852077
18071B852077L25838K28271J51901J71930J67984J90150J98432J78022K82036
$$ 2852077 3177915 3406186 3558087 3730017 3898001 4088151 4286583 4464605 4746641
18062D746641M37566P35141R62986J230896J822284K803026M495378P621772J2839620
$$ 4746641 5184207 5919348 6882334 8113230 9935514 12738540 17233918 24855690 37695310
18053C7695310J7438004J4768672O401961N035516O479444m323885j7075336j5441689
$$ 37695310 55133314 69901986 76303947 81339463 87818907 83495022 66419686 50977997
18045E0977997j0194906m937405P7796N074256J0874429J4104563R310052L190808
$$ 50977997 40783091 35845686 35923482 40997738 51872167 65976730 75286782 78477590
18037G8477590M169735K685974r879494j7149180j3974676r668897o030950l761803
$$ 78477590 82647325 85333299 75453805 58304625 44329949 34661052 28630102 24868299
18029B4868299k539035j924490j550285j208803j077218q60584o19996m17992
$$ 24868299 22329264 20404774 18854489 17645686 16568468 15707884 15087888 14669896
18021A4669896k89697k13663p0610J02384K2273l3312K1919Q0289j10817P9077
$$ 14669896 14380199 14166536 14095926 14198310 14220583 14187271 14209190 14289479 14178662 14257739
18011A4257739L87687O94343P55874J210205J700765K563985L897790N877081
$$ 14257739 14645426 15339769 16095643 17305848 19006613 21570598 25468388 31345469
18003C1345469R592486J6937585K6663023L1510657K1847710R305459J0646030
$$ 31345469 40937955 57875540 84538563 116049220 137896930 147202389 157848419
17996A57848419P459001j7019490l1649053k5187971j5427186n998588L404855
$$ 157848419 165307420 148287930 116638877 91450906 76023720 70025132 73429987
17989G3429987J3888496K4213177K6171196J3749994N610932Q900632j030206
$$ 73429987 87318483 111531660 137702856 151452850 157063782 165964414 164934208
17982A64934208k7024466l3119770k5281684j7006583j0875574p106586m860582
$$ 164934208 137909742 104789972 79508288 62501705 51626131 44519545 39658963
17975C9658963l480664k493604k073888j830607j571945j358777j141766j057080
$$ 39658963 36178299 33684695 31610807 29780200 28208255 26849478 25707712 24650632
17967B4650632r30533q60922q40563r58939r71024p51195n94606l92171m80904
$$ 24650632 23720099 22859177 22018614 21059675 20088651 19337456 18742850 18350679 17869775
17958A7869775m34867l63058m57383m15091m02946l32062k90309m57557l46732
$$ 17869775 17434908 17071850 16614467 16199376 15796430 15464368 15174059 14716502 14369770
17949A4369770l14181k71282k42201k63089k83129k57907k54028k48195j72471
$$ 14369770 14055589 13784307 13542106 13279017 12995888 12737981 12483953 12235758 12063287
17940A2063287j24689o0196N524L2108L7815L4669O1533K11489P8777k9214k90797
$$ 12063287 11938598 11878402 11883926 11916034 11953849 11988518 12050051 12261540 12340317 12311103 12020306
17929A2020306m06484m34474l30395l23740l32932k56675k81997j06439o1556
$$ 12020306 11613822 11179348 10848953 10525213 10192281 9935606 9653609 9547170 9485614
17920I485614m5753n4504l718o3790j20648k3596K32602J91841J12458J34210
$$ 9485614 9439861 9385357 9381639 9317849 9197201 9173605 9406207 9598048 9710506 9844716
17910I844716J33400R5976J61378K15880J70371L8176J37650L28520M54166K89021
$$ 9844716 9978116 10074092 10235470 10451350 10621721 10659897 10797547 11126067 11580233 11869254
17900A1869254J07170J01170O7709j30856l46925k42219R4388L78155O55626Q25650
$$ 11869254 11976424 12077594 12145303 12014447 11667522 11425303 11519691 11897846 12553472 13379122
17890A3379122Q29036J014962J335746J433207J662241K614282M253053O602188
$$ 13379122 14208158 15223120 16558866 17992073 19654314 22268596 26521649 33123837
17882C3123837J0619218J7910188K9038862M0199640M1376500L6348491L9307890
$$ 33123837 43743055 61653243 90692105 130891745 172268245 208616736 247924626
17875B47924626L2315194K3202k1972562k2076716l5883011m6365287l7124111
$$ 247924626 280239820 280263022 258290460 236213744 200330733 153965446 116841335
17868A16841335k5490356j6418862j0869516p952850o266284m645139l217401
$$ 116841335 91350979 74932117 64062601 56109751 49843467 45198328 41980927
17861D1980927k403665k329445k025254j581472j406239j254733j105350j058773
$$ 41980927 39577262 37247817 35222563 33641091 32234852 30980119 29874769 28815996
17853B8815996j147338j053166p66028o79063p19052n82259n72938p67962o29165
$$ 28815996 27668658 26615492 25849464 25170401 24451349 23869090 23296152 22528190 21899025
17844B1899025l62596m42577m14828k68750j44040k80560k64836j43630k9684
$$ 21899025 21536429 21093852 20679024 20410274 20266234 19985674 19720838 19577208 19547524
17835A9547524K91004P44577J102177J687945K498987L998004O660443J0947743
$$ 19547524 19838528 20583105 21685282 23373227 25872214 29870218 36530661 47478404
17827D7478404J7657002K2754776K1085956J9041099K1391213J3041162o713851
$$ 47478404 65135406 87890182 108976138 128017237 149408450 162449612 155735761
17820A55735761j3550770j3951768k3587340k5018530j8398938j2285359p744043
$$ 155735761 142184991 128233223 104645883 79627353 61228415 48943056 41199013
17813D1199013n105929l565442k564270j837525j505095j529328j316235j083238
$$ 41199013 36093084 32527642 29963372 28125847 26620752 25091424 23775189 22691951
17805B2691951j135727j151690j053244q49414p59441o35170l10366k56065l88751
$$ 22691951 21556224 20404534 19351290 18501876 17742435 17107265 16796899 16540834 16152083
17796A6152083l91938l09580l80043m14714l69013l88830n02733k39363j34640
$$ 16152083 15760145 15450565 15070522 14655808 14286795 13897965 13395232 13155869 13021229
17787A3021229l67138m36866k81623k90450l00229k38080l03845l10918k68412
$$ 13021229 12654091 12217225 11935602 11645152 11344923 11106843 10802998 10492080 10223668
17778A0223668k45449j86485j43654k72677k02945j81183k03874j49656j68907
$$ 10223668 9978219 9791734 9648080 9375403 9172458 8991275 8787401 8637745 8468838
17769H468838j60571J0823m0779q7995o2525r9009l21320k38440k54290k13403
$$ 8468838 8308267 8319090 8278311 8190316 8127791 8028782 7707462 7469022 7214732 7001329
17759G001329k39582j89608j20667j39789j16415m2275J5393O732J43865K23386
$$ 7001329 6761747 6572139 6451472 6311683 6195268 6152993 6168386 6175118 6318983 6542369
17749F542369J37804R3103N0556j67514j84563k27960j81893k37895k09752j97774
$$ 6542369 6680173 6773276 6823832 6656318 6471755 6243795 6061902 5824007 5614255 5416481
17739E416481j61769j97943k23329m5332j5600j82582j57953n4435j5647L0014
$$ 5416481 5254712 5056769 4833440 4788108 4772508 4589926 4431973 4377538 4361891 4391905
17729D391905k4278r4520j34928j00199p2981j8299o4363o8290j23285J8961M0404
$$ 4391905 4367627 4273107 4138179 4037980 3964999 3946700 3882337 3814047 3690762 3709723 3750127
17718C750127j00390j42983j3994n8591p4419j13082k9146j34503j57088j2910
$$ 3750127 3649737 3506754 3492760 3434169 3359750 3246668 3217522 3083019 2925931 2913021
17708B913021P8768M2680n9467o6897n1733j02308l658P54K1749J11353K69905
$$ 2913021 2991789 3034469 2975002 2908105 2856372 2754064 2750406 2751160 2772909 2884262 3154167
17697C154167K25098J2469r2518n5188j40190k41674j6350Q5866l4060j19283
$$ 3154167 3379265 3391734 3299216 3244028 3103838 2862164 2845814 2931680 2897620 2778337
17687B778337j14212q5785l1978q1083o4135q7289p9696q2646k1217N6399J9213
$$ 2778337 2664125 2578340 2546362 2465279 2401144 2313855 2234159 2151513 2130296 2186695 2205908
17676B205908r2615j13048N3232o1987p9761k3156r5543j04727m7440j2573P3039
$$ 2205908 2113293 2000245 2053477 1991490 1911729 1888573 1793030 1688303 1640863 1628290 1701329
17665A701329J6780q4653j28919n8708n7531M890j06010j54771k7532J68010J18900
$$ 1701329 1718109 1633456 1504537 1445829 1388298 1393188 1287178 1132407 1104875 1272885 1391785
17654A391785K5757l5472l1656m9081L5622N6609K2397M654r491k3914p2651r0292
$$ 1391785 1417542 1382070 1350414 1301333 1336955 1393564 1415961 1420615 1411124 1387210 1314559 1224267
17642A224267m3746k725L0667R5661k6540M15l7236o4139q3884j12292l5985J72063
$$ 1224267 1180521 1177796 1208463 1304124 1277584 1277999 1240763 1176624 1092740 980448 944463 1116526
17630A116526J5600p2347j7454m6852k8135l5644L8860M8639n4664m8385o2232
$$ 1116526 1132126 1059779 1042325 995473 967338 931694 970554 1019193 964529 916144 853912
17619H53912k6497L3593M4588m5767o7170n4174k6204o5326M6033Q8478L8351
$$ 853912 827415 861008 905596 859829 792659 738485 712281 646955 692988 781466 819817
17608H19817n4277m4498j17517n7324L9431j20173k2855L9746N1235K3244p0247
$$ 819817 765540 721042 603525 546201 585632 465459 442604 482350 533585 556829 486582
17597D86582K2120Q7502j6516j255l0683K640O082r377k2923J4309J1608J4609
$$ 486582 508702 596204 579688 578433 547750 550390 556472 547095 524172 538481 550089 564698
17585E64698n2028m1700j13061R7991R7602r42j06733q508q1086L3118M7226J26142
$$ 564698 512670 470970 357909 455900 553502 552560 445827 437319 356233 389351 436577 562719
17573E62719O9035k4030j4795m008j75155j51636j5409O329L9133K5833N9964
$$ 562719 631754 607724 592929 588921 413766 262130 246721 253050 292183 318016 377980
17562C77980L6239l8973J3784M9142k1702l6335j12642p3639k2168J13893L7704
$$ 377980 414219 375246 389030 438172 416470 380135 267493 193854 171686 285579 323283
17551C23283M365J0607n8982Q8358J8940p5719o2503k234O7595J32962j5377r1531
$$ 323283 327648 338255 279273 367631 386571 310852 248349 246115 313710 446672 431295 339764
17539C39764o6127o7691J6954J4738J33467K003l7692r8142N7944k6475q953m4205
$$ 339764 273637 205946 222900 237638 371105 373108 335416 237274 295218 268743 259790 215585
17527B15585J5814J4666M4718p470j09938m1647J0834K4907R2499P5302L7461
$$ 215585 231399 246065 290783 283313 173375 131728 142562 167469 259968 335270 372731
17516C72731L5554Q8502J89540J14498Q6596P7880n9485j25611j24497j20323
$$ 372731 408285 496787 686327 800825 887421 965301 905816 780205 655708 535385
17506E35385J6187n5513j1362K0220r963N9194m5841K5264K44791J30707r7044
$$ 535385 551572 496059 484697 504917 494954 554148 508307 533571 778362 909069 812025
17495H12025l0121j23754m4450q2560j41700M5882j8012p4378J4655l8620q5262
$$ 812025 781904 658150 613700 531140 389440 435322 417310 342932 357587 318967 233705
17484B33705k0574L3800m8988k3135o8818N2808M1250o5772p5122m1329k795P2626
$$ 233705 213131 246931 197943 174808 105990 158798 200048 134276 59154 17825 15030 87656
17472H7656k9994J7558l6073n7377o2966N9722M6670J33959J07130N6934J16150
$$ 87656 57662 75220 39147 -18230 -81196 -21474 25196 159155 266285 323219 439369
17461D39369J36271J04048j3522L1176J03684p9981k15701q2468M5462N5842m2423
$$ 439369 575640 679688 666166 697342 801026 721045 505344 422876 468338 524180 481757
17450D81757o6464J12351J57871L1260J0275j9270l9504p0836n2560n3358N517
$$ 481757 415293 527644 685515 716775 727050 707780 668276 597440 544880 491522 497039
17439D97039r6448j0981l8640j10746j36809j15925N595O6600R3931Q1464o763
$$ 497039 400591 389610 350970 240224 103415 -12510 -6915 59685 153616 235080 228317
17428B28317l9674k8334m8906l2265l7852j9674M2941O285l1846k7744M6422Q9746
$$ 228317 188643 160309 111403 79138 41286 21612 64553 70838 38992 11248 57670 147416
17416A47416P1664j4158M8907m7764r3289m6431q8833N6845O2298j0028k0075
$$ 147416 219080 204922 253829 206065 112776 66345 -22488 34357 96655 86627 66552
17405F6552n7940L4389J28607m726J5654o214N0847P6580m801q6234m8517j1595
$$ 66552 8612 43001 171608 166882 182536 176322 227169 303749 298948 212714 164197 152602
17393A52602n1341j70208n1120K3295J13007P9171k4426J1157j1763o0547o0477
$$ 152602 101261 -68947 -120067 -96772 16235 95406 70980 82137 70374 9827 -50650
17382e0650K6469l0179m6766J25097O6599o253p5596J8679N0298o6964k492l2207
$$ -50650 -24181 -54360 -101126 23971 90570 84317 8721 27400 77698 10734 8242 -23965
17370b3965P7982J34219l0507m3675k8450n3780Q7297N0573p6088k798J22453
$$ -23965 54017 188236 157729 114054 85604 31824 119121 169694 93606 90808 213261
17359B13261J6868j05168j08930l6671J8619J04581N4858P0630J04951J729m488
$$ 213261 230129 124961 16031 -20640 -2021 102560 157418 228048 332999 334728 330240
17348C30240Q1182P8272J94858J53220N9481J7019J5551J98023k218j65231j16746
$$ 330240 411422 489694 684552 837772 897253 914272 929823 1127846 1125628 960397 843651
17337H43651r1214j81649j62450k4698j4686J0754q5540q7401q8576J2725J3479
$$ 843651 752437 570788 408338 383640 368954 379708 294168 206767 118191 130916 144395
17326A44395P32j624J24698L3044n9215n5100r7231j16915n10Q7671m5380R509
$$ 144395 145127 143503 268201 301245 242030 186930 89699 -27216 -27726 59945 14565 24074
17314B4074O30J16436q2858r2454L9306J30118R1050p985j12084o2896L9110P4918
$$ 24074 24704 141140 58282 -34172 5134 135252 226302 218317 106233 43337 82447 157365
17302A57365l5957p3137k2476O8193K2976L7620J05690L4137J98899J83482R1879
$$ 157365 121408 48271 25795 93988 116964 154584 260274 294411 493310 676792 768671
17291G68671J22501P6548J2363j45694j05357j55357j07179n4404p0231o9822
$$ 768671 891172 967720 980083 834389 729032 573675 466496 412092 341861 272039
17281B72039l1737M3880J224r2314j68625r5602O5664k1256k7659Q2993M9300
$$ 272039 240302 284182 285406 193092 24467 -71135 -5471 -26727 -54386 28607 77907
17270G7907P0369K2208P3412l9140o3411L2987j0322l2830j03521j771P1303M1148
$$ 77907 148276 170484 243896 204756 141345 174332 164010 131180 27659 25888 97191 138339
17258A38339m8973j9407L8569n8913N3623K6734k3953J5949m921o5997k9340r3850
$$ 138339 89366 69959 108528 49615 103238 129972 106019 121968 117047 51050 21710 -72140
17246g2140L268J3582K0937N1225j565N8252j0241m1290K5925j4556o2223L2458
$$ -72140 -68872 -55290 -34353 16872 15307 73559 63318 22028 47953 33397 -28826 3632
17234C632R3972N9907l4989k5697L6014k7094j0650J3576o9720j36397L881R8359
$$ 3632 97604 157511 122522 96825 132839 105745 95095 108671 38951 -97446 -93565 4794
17222D794M2933n1685j36884R789M6459J27196N2479r8068K369j7656n4803L7187
$$ 4794 47727 -3958 -140842 -131053 -84594 42602 95081 -2987 -618 -18274 -73077 -35890
17210c5890j2319J18805J28901q8742j46087K888Q2506K6302j4167J6585L162
$$ -35890 -48209 70596 199497 110755 -35332 -32444 50062 76364 62197 78782 81944
17199H1944j20277L6793M0700j9094J36843P926l1084j16055m6275J53950Q3069
$$ 81944 -38333 -1540 39160 20066 156909 164835 133751 17696 -28579 125371 208440
17188B08440n367j29204N138K8910n2541j6399o8249K0090N4183P3639J7981p0325
$$ 208440 203073 73869 79007 107917 55376 38977 -29272 -9182 45001 118640 136621 66296
17176F6296o9639j31420m7004P2269M3451M575M8605n2288k375J36033K8674r5970
$$ 66296 -3343 -134763 -181767 -109498 -66047 -61472 -12867 -65155 -67530 68503 97177 1207
17164A207l2151K2572L113l9941q1328L5115J62727J20530o7478L1083N9335j511
$$ 1207 -30944 -8372 -5259 -45200 -126528 -91413 71314 191844 124366 155449 214784 213273
17152B13273j10931j03432j9627L5335L3624l2851K5960r0866J4101N1012n7403
$$ 213273 102342 -1090 -20717 14618 48242 15391 41351 -49515 -35414 15598 -41805
17141d1805j3720J62979j6633j58614O0165J68116P8972j9264q5117k4397l232
$$ -41805 -55525 107454 90821 -67793 -7628 160488 239460 220196 135079 110682 107450
17130A07450k1333j06979m0162N9149O2939K7161m6748J31252k8466j18473L523
$$ 107450 86117 -20862 -61024 -1875 61064 88225 41477 172729 144263 25790 29313
17119B9313p2434l7298M5549p113k5149k2497O146L9330J22o0444j0460K7016
$$ 29313 -43121 -80419 -34870 -41983 -67132 -89629 -83483 -44153 -44031 -104475 -114935 -87919
17107h7919j4357J3634M9918R1213R6368K1066j23215k9186j6673n1612O83Q8667
$$ -87919 -102276 -88642 -38724 52489 148857 169923 46708 17522 849 -50763 -50080 38587
17095C8587J0199K7803p3884l8947N9964L3801n3095o6548Q3232R6826Q61r0448
$$ 38587 48786 76589 2705 -36242 23722 57523 4428 -62120 21112 117938 118799 28351
17083B8351l0893P663m2251O6163J2668j3148k5084J6223m6575j53550n3706k6671
$$ 28351 -2542 5121 -37130 29033 41701 28553 3469 19692 -26883 -180433 -234139 -260810
17071b60810M8662P507L0548P9266M139n3195j6856L8492M7667J0735n6355r1293
$$ -260810 -212148 -204641 -174093 -94827 -90688 -143883 -160739 -122247 -74580 -63845 -120200 -211493
17059b11493p3743m0300J31279O8067l5841k8722Q2767J1994o8462m9037L9000
$$ -211493 -285236 -325536 -194257 -126190 -162031 -190753 -107986 -95992 -164454 -213491 -174491
17048a74491J04487R071j7598m5187l4997J09256m369K9044r2634L067k4433O785
$$ -174491 -70004 -60933 -78531 -123718 -158715 -49459 -53828 -24784 -117418 -114351 -138784 -131999
17036a31999l2547l833J26604r6534k6665J48023n1942o7639J67M4003Q0160L9148
$$ -131999 -164546 -168379 -41775 -138309 -164974 -16951 -68893 -136532 -136365 -92362 -12202 26946
17024B6946L2839n507j3134k1050K8763N9841o5170m5185r4680P771R7862P8703
$$ 26946 59785 54278 41144 20094 48857 108698 43528 -1657 -96337 -88566 9296 87999
17012H7999o0254j55516m0795J41587J41489p029j51048p060J4473K0213J11615
$$ 87999 27745 -127771 -168566 -26979 114510 107481 -43567 -50627 -36154 -15941 95674
17001I5674J1j5016M705N756M6439l1129p1792J0012j4728j08767o4657k8862
$$ 95674 95685 80669 85374 91130 137569 106440 34648 44660 29932 -78835 -143492 -172354
16989a72354L8900J57606m7951j10623m5786n3348L8558J66344J89013p17r3546
$$ -172354 -133454 24152 -23799 -134422 -180208 -233556 -194998 -28654 160359 159642 66096
16978F6096j40042Q162O6179k5780J06252r049l9459l9447L4463n5364O0000J56659
$$ 66096 -73946 -65784 395 -25385 80867 71818 32359 -7088 27375 -27989 32011 188670
16966A88670L8805j01562q1060q3937J03584m5495K3619p2584r788L4028j6986
$$ 188670 227475 125913 44853 -39084 64500 19005 42624 -29960 -39748 -5720 -22706
16955b2706M1536n5044M0678J04342m6413n6857L6287o1274r0827j4236J4826
$$ -22706 18830 -36214 4464 108806 62393 5536 41823 -19451 -110278 -124514 -109688
16944a09688o2067l8753K3489J24619m2310n1899Q2659O8397j5850K1488K4623
$$ -109688 -171755 -210508 -187019 -62400 -104710 -156609 -73950 -5553 -21403 85 24708
16933B4708O6586M4915p6179r8941k8977M1947J12649J76979l3054j37991p4929
$$ 24708 91294 136209 60030 -38911 -67888 -25941 86708 263687 230633 92642 17713
16922A7713l8723q3883n953N1071m9179m8680N5958N2584M7931l0157m8564m4797
$$ 17713 -21010 -104893 -110846 -59775 -108954 -157634 -101676 -49092 -1161 -31318 -79882 -124679
16910a24679J00716K5454P4250j0724r2674k0376k4873K9666l120j7782n7652
$$ -124679 -23963 1491 75741 65017 -27657 -48033 -72906 -43240 -46360 -64142 -121794
16899a21794l9440K3809J65261o3174j1113n132P4849k1228l9414o7493n0662
$$ -121794 -161234 -137425 27836 -35338 -46451 -51583 23266 2038 -37376 -104869 -155531
16888a55531n4323L7205Q9254o704m8347r692J29853K0905P6509P7941m9313j92946
$$ -155531 -209854 -172649 -83395 -90099 -138446 -148138 -18285 2620 79129 157070 107757 -85189
16876h5189j11505K7994m127R5934J09966K8487L8473Q561J26545P8722r4399
$$ -85189 -196694 -168700 -172827 -76893 33073 61560 100033 108594 235139 313861 219462
16865B19462p6182j80859o6181R7550O8225L8304Q8753l1568j47226n4545m7775
$$ 219462 143280 -37579 -103760 -6210 62015 100319 189072 157504 10278 -44267 -92042
16854i2042O1068M2172o6251j16379l4273J2577p4790J1989J05061N3981Q3869
$$ -92042 -30974 11198 -55053 -171432 -205705 -193128 -267918 -255929 -150868 -96887 -13018
16843a3018J30215p7588p0919l8478M87n4912j05596O0618P3639k3208q7095N1160
$$ -13018 117197 39609 -31310 -69788 -69301 -124213 -229809 -169191 -95552 -118760 -205855 -154695
16831a54695K4089j3075L6781P0996P2369K7158j45650j19882m1476O7384M369
$$ -154695 -130606 -143681 -106900 -35904 36465 63623 -82027 -201909 -243385 -176001 -171632
16820a71632j8820O2186p1576K8196N9680J17616k0665j1843N5287k4887m5820
$$ -171632 -190452 -128266 -199842 -171646 -111966 5650 -15015 -26858 28429 3542 -42278
16809d2278R7478O4055L492n9655J0896L3015m6381l164j09190M6523N148O8753
$$ -42278 55200 119255 122747 63092 73988 107003 60622 57458 -51732 -5209 -61 68692
16797F8692L1941j3051o5537n5790L2631N7421O1049l6211m0429l8691L8003l1672
$$ 68692 100633 87582 22045 -33745 -1114 56307 117356 81145 40716 2025 40028 8356
16785H356p4877O8947J3326q8919j5422l6865M853N9993q300K2701p6133k4881
$$ 8356 -66521 2426 15752 -73167 -88589 -125454 -120601 -60608 -68908 -46207 -122340 -147221
16773a47221n8558o6803l1464Q406P8995J52042R1437k0331o5645l200M6682o0711
$$ -147221 -205779 -272582 -304046 -295640 -216645 -64603 26834 6503 -59142 -62342 -15660 -76371
16761g6371l5717j5872l6476m4327J00513K0775O3772Q9015J7491j04354n9969
$$ -76371 -112088 -127960 -164436 -208763 -108250 -87475 -23703 65312 82803 -21551 -81520
16750h1520m5347L6404k979p626l476n1284n4952p8068r0414J13659j9356l968
$$ -81520 -126867 -90463 -93442 -101068 -104544 -155828 -210780 -288848 -379262 -265603 -284959 -288927
16738b88927J47757J09455N9876L9164K27o9802l5080k8504L6J22878j4499j47364
$$ -288927 -141170 -31715 28161 67325 67552 -2250 -37330 -65834 -65798 57080 42581 -104783
16726a04783k5535J04336R135m1757J26647q4231j51013O972P5701J7164j2554
$$ -104783 -130318 -25982 -16847 -58604 68043 -16188 -167201 -160229 -84528 -67364 -79918
16715g9918p2861q337J2269K7673J12824j3193k7486N7427j14236r8977P6465
$$ -79918 -152779 -161116 -148847 -121174 -8350 -21543 -49029 8398 -105838 -204815 -128350
16704a28350j0860J15214m1120n9066L8830j8291m3037J02344M9718L0088o303
$$ -128350 -139210 -23996 -65116 -124182 -85352 -103643 -146680 -44336 5382 35470 29167
16693B9167q890l1263N6707k5884j0079n419l9222n8479q8220p994J3295N5825
$$ 29167 20277 -10986 45721 19837 9758 4339 -34883 -93362 -181582 -189576 -176281 -120456
16681a20456Q3305M0694M567k6644m8518K5586k2678l1309k3120N8853l5520k4897
$$ -120456 -37151 3543 8110 -18534 -67052 -41466 -64144 -95453 -118573 -59720 -95240 -120137
16669a20137M5148k648n4292j06291K605J14188m4761r4860P2733J87329P725
$$ -120137 -74989 -77637 -131929 -238220 -235615 -121427 -166188 -261048 -188315 -986 6739
16658F739j00533l2972M8768J0006m1342M173J5712m5450q8495O4496P0234m5089
$$ 6739 -93794 -126766 -77998 -67992 -109334 -105161 -89449 -134899 -223394 -158898 -88664 -133753
16646a33753P4709k530M2582k6713j5464n7695q7164L8373R4428O4536P5615J2863
$$ -133753 -59044 -61574 -18992 -45705 -61169 -118864 -206028 -167655 -73227 -8691 66924 79787
16634G9787O4876M0406m8828k428N1794q555n3214p8058O818N7678l6479l5569
$$ 79787 144663 185069 136241 133813 185607 177052 123838 45780 52598 110276 73797 38228
16622C8228j42822j9837l4968R7657R6149N0003k2677j00573o2659M6194l1932
$$ 38228 -104594 -124431 -159399 -61742 34407 84410 61733 -38840 -101499 -55305 -87237
16611h7237J5460K4331K9779p2170l6260J21588K5381J8713J710o1545J8771j1081
$$ -87237 -71777 -47446 -17667 -89837 -126097 -4509 20872 39585 41295 -20250 -1479 -12560
16599a2560j5931j3958l3448J00684J44557j52768j33976K4346k6927O4427P8398
$$ -12560 -28491 -42449 -75897 24787 169344 16576 -117400 -93054 -119981 -55554 22844
16588B2844j8059l2532r5748j6838J9232J7715J2165J2971J6795M1283q9240j0851
$$ 22844 4785 -27747 -123495 -140333 -121101 -103386 -91221 -78250 -61455 -20172 -109412 -120263
16576a20263Q9051O2908m8138k5067j07803K884O2013J26533N4154k7670j8805
$$ -120263 -31212 31696 -16442 -41509 -149312 -146428 -84415 42118 96272 68602 49797
16565D9797m2695p8445l7575J0503Q8359m8389Q437K596n49J9765q5562M7513
$$ 49797 7102 -71343 -108918 -98415 -10056 -58445 -50008 -47412 -47961 -28196 -113758 -66245
16553f6245J95l6052K6911Q6943O1542l19o238M9555j0540M7986m661j35455q2266
$$ -66245 -66050 -102102 -75191 11752 73294 72975 66737 116292 105752 153738 149077 13622 -68644
16540f8644L4895J02569P5467j39539p9780j7709O330m25j6331R447J0140L2800
$$ -68644 -33749 68820 144287 4748 -75032 -92741 -86411 -86836 -103167 -93720 -83580 -50780
16528e0780N0641J509Q8871J5476o5506o0977N1354n29q06o0258N6450M4777o9733
$$ -50780 -139 1370 90241 105717 40211 -20766 30588 30059 29253 -31005 25445 70222 489
16515D89p4282q6600K8377R5273M292M2063M5633J07205N8452k6960j54240j27599
$$ 489 -73793 -160393 -132016 -36743 -32451 9612 55245 162450 220902 193942 39702 -87897
16503h7897j3434J9036j02445J0347N8534Q3681l5941p7841p2011j1828o8572
$$ -87897 -101331 -82295 -184740 -174393 -115859 -32178 -68119 -145960 -217971 -229799 -298371
16492b98371M0713K01643N1247p076l7712q1292L601N3073K2452J3101O5546j7649
$$ -298371 -257658 -56015 -4768 -11844 -49556 -130848 -127247 -74174 -51722 -38621 26925 9276
16480I276J7708j12640j8174J35108p1539r3744J7503J72716O6632J1699o606
$$ 9276 26984 -85656 -103830 31278 -40261 -134005 -116502 56214 122846 134545 127939
16469A27939p815k7706l1654J1823O0613k881k2600j9695m4537K9274K4756L7107
$$ 127939 120124 92418 60764 72587 133200 130319 107719 88024 43487 72761 97517 134624
16457A34624n9596N270l8707q0278Q1424J25361k1307j0197J50070L394j75848
$$ 134624 75028 80298 41591 -38687 42737 168098 146791 136594 286664 290058 114210
16446A14210j00570n9223k3931M3833N6240O7867k4147q035m1811j30881j38164
$$ 114210 13640 -45583 -69514 -25681 30559 98426 74279 66244 24433 -106448 -244612
16435b44612l455j8761o917N7583Q5606N6713P5293m4014K6071L6813j8892p1487
$$ -244612 -248067 -266828 -273745 -216162 -130556 -73843 1450 -42564 -16493 20320 1428 -70059
16423g0059j47620m3739J17236J18955N3318J1952m4385j08179J01726J53754
$$ -70059 -217679 -261418 -144182 -25227 28091 40043 -4342 -112521 -10795 142959
16413A42959l8L7658j4474p333L7237j01524j14240J1040k6599j32458n7014L3427
$$ 142959 142921 180579 166105 158772 196009 94485 -19755 -8715 -35314 -167772 -224786 -191359
16401a91359O9375J16202O8792m1558l5293M6612L64o4171n2655L6396M2718r861
$$ -191359 -121984 -5782 63010 21452 -13841 32771 33135 -31036 -83691 -47295 -4577 -14438
16389a4438o6910n4851o6077K014j5395q22n4754P490J66843M2777l5634J4559
$$ -14438 -81348 -136199 -202276 -200262 -215657 -216479 -271233 -263743 -96900 -54123 -89757 -75198
16377g5198K0552R0922k1942r0022p6304P4973N8882O8418M1169P740n539l0175
$$ -75198 -54646 36276 14334 -75688 -151992 -77019 -18137 50281 91450 99190 93651 63476
16365F3476j20412p4068M3929J78087j165m1742q3455k4491L6826N9005o573j3954
$$ 63476 -56936 -131004 -87075 91012 89847 48105 -35350 -59841 -23015 35990 29417 15463
16353A5463k2712o4892L2399J6190L2117N7364k1011o0871K8191n030n1744O2958
$$ 15463 -7249 -72141 -39742 -23552 8565 65929 44918 -15953 12238 7208 -44536 18422
16341A8422M9959m067n7301l0497O5596J4776O241L9606j38299m3296O5875k2361
$$ 18422 68381 64314 7013 -23484 42112 56888 63129 102735 -35564 -78860 -12985 -35346
16329c5346p9981k6584R654L1680l2193L4254J17129n6737m5514N8654k538R2112
$$ -35346 -115327 -141911 -132257 -100577 -132770 -98516 18613 -38124 -83638 -24984 -27522 64590
16317F4590R9441l9101j07392M4345J48680k8282n2150q6450r0238j37485M9739
$$ 64590 164031 124930 17538 61883 210563 182281 130131 43681 -46557 -184042 -134303
16306a34303R2364L3054q7530n4469J8353m2589k7172L1875j5518O2830j0160
$$ -134303 -41939 -8885 -96415 -150884 -132531 -175120 -202292 -170417 -185935 -123105 -133265
16295a33265R1090j2925k7888P625R169q0443m1993J17311P2681M9508r2388p4468
$$ -133265 -42175 -55100 -82988 -75363 -66194 -146637 -188630 -71319 1362 50870 -41518 -115986
16283a15986o1978j03401J4758R0645K2572Q76R3820M1419M1076m2731L5905O663
$$ -115986 -177964 -281365 -266607 -175962 -153390 -152514 -58694 -17275 23801 -18930 16975 23638
16271B3638M6601p306m5549K2803L9693J3536o8800L5486n2738l5356K125k4422
$$ 23638 70239 62933 17384 40187 79880 93416 24616 60102 7364 -27992 -25867 -50289
16259e0289L5337Q5548O3067l351j23493j7060m0508l8336L7318q14k0322N9029
$$ -50289 -14952 70596 133663 130312 6819 -10241 -50749 -89085 -51767 -52581 -72903 -13874
16247a3874Q1669N2688j13109r7835k8752P4227j04979n2412j0358L0921J53601
$$ -13874 67795 120483 7374 -90461 -119213 -44986 -149965 -202377 -212735 -181814 -28213
16236b8213J37398j12462j11708j1365L170m921o8762o718N7313M0359j33040
$$ -28213 109185 -3277 -114985 -126350 -123180 -128101 -196863 -203581 -146268 -105909 -238949
16225b38949J606J23723J41059J06584k0135m6215o0567L3597n967N5361j1230
$$ -238949 -237343 -113620 27439 134023 113888 67673 7106 40703 34736 90097 78867
16214G8867K5732l2570q5930n4877p1853M8222O3998J8542o6735O7175N8313J23269
$$ 78867 104599 72029 -13901 -68778 -140631 -92409 -28411 -9869 -76604 -9429 48884 172153
16202A72153k9596j19254n9287j756Q7071N6945l9050M9308j0948n361K7666j34231
$$ 172153 142557 23303 -35984 -37740 49331 106276 67226 116534 105586 100225 127891 -6340
16190f340l5294J03496Q9817N831q9588K882M3269j55227K5069J01252N2988R616
$$ -6340 -41634 61862 151679 157510 67922 70804 114073 -41154 -16085 85167 138155 147771
16178A47771m6861n4905o2793M9215P0794L2085L4330r8743n8247k5119n142j992
$$ 147771 100910 46005 -16788 32427 103221 135306 169636 70893 12646 -12473 -17615 -19607
16166a9607J12844O6733j02416L747M36k6438m3339K7748p4264o541M5331M382
$$ -19607 93237 159970 57554 61301 61737 35299 -8040 19708 -54556 -61097 -15766 -11384
16154a1384o4546L7292r2066J8146R1349M5393l5736O2701L2118q4538k8459N4860
$$ -11384 -75930 -38638 -130704 -112558 -21209 24184 -11552 51149 83267 -1271 -29730 25130
16142B5130j5479m4302j24352L441J0599Q375k4774j0206J6412k6769k3262k4689
$$ 25130 9651 -34651 -159003 -155562 -144963 -136588 -161362 -171568 -155156 -181925 -205187 -229876
16130b29876K9945J51668J00188M0457l9940o4355N89K0989j211O0108P5293m9987
$$ -229876 -199931 -48263 51925 92382 52442 -11913 -11324 9665 8454 68562 143855 93868
16118I3868l3394j5689O1266P708N2376M3555j9185J4534J1943o6428j33385k2093
$$ 93868 60474 44785 106051 113759 166135 209690 190505 205039 216982 150554 17169 -4924
16106d924L8434o6033o1497N0025Q1804N8957p3743P049K5702K1966p2477o4417
$$ -4924 33510 -32523 -94020 -43995 37809 96766 23023 30072 55774 77740 5263 -59154
16094e9154p5994j02845n5968m5574M6262Q9699N4042j4167l7007K1446p216O5909
$$ -59154 -135148 -237993 -293961 -339535 -293273 -203574 -149532 -163699 -200706 -179260 -186476 -120567
16082a20567O7064J1516o642J3372L6342R1203o8528n1535k9358J3707o2307L9131
$$ -120567 -53503 -41987 -48629 -35257 1085 92288 23760 -27775 -57133 -43426 -105733 -66602
16070f6602l0701M94N43N4415J05095J1860m7605m0293m817J7121j58374k8750
$$ -66602 -97303 -96809 -96266 -41851 63244 75104 27499 -12794 -17611 -490 -158864 -187614
16058a87614R1152N6077K3459o984M130K5867j06365M4387M8292p9450M8833j7269
$$ -187614 -96462 -40385 -16926 -23910 -19780 6087 -100278 -55891 -7599 -87049 -38216 -55485
16046e5485q4242N3385Q8386M6150p3023O5349K5998r1358r6645J2178n1946K6732
$$ -55485 -139727 -86342 2044 48194 -24829 40520 66518 -24840 -121485 -109307 -161253 -134521
16034a34521j4251j9252Q9281J12980L3905k5382q289J9185L6242k9782k0726
$$ -134521 -148772 -168024 -78743 34237 68142 42760 34471 53656 89898 60116 39390
16023C9390m2098R7269R2236M3754j01984j31485q391J28271Q9250r5833J4647
$$ 39390 -2708 94561 186797 230551 128567 -2918 -11309 116962 206212 110379 125026
16012A25026L2652j24709l4920K5479m5765n8477N1215L9900q8793Q0150J8298
$$ 125026 157678 32969 -1951 23528 -22237 -80714 -29499 10401 -78392 1758 20056
16001B0056m2638j8676N9220N1383Q334l3433k3009J39224j3954j16828j1056
$$ 20056 -22582 -41258 17962 69345 77679 44246 21237 160461 146507 29679 18623
15990A8623K8373M152l0970o9026k1154N6736O0756q8804p1433q0826m5136R6188
$$ 18623 46996 51148 20178 -48848 -70002 -13266 47490 -41314 -112747 -193573 -238709 -142521
15978a42521o9548K9910Q3599k3992N8844r117j5697n6936o3868Q8318O0446J38769
$$ -142521 -212069 -182159 -98560 -122552 -63708 -72825 -88522 -145458 -209326 -121008 -60562 78207
15966G8207J5379k6331P8702q4873j45152M1424L3585P4173p1493n3049O9809
$$ 78207 93586 67255 145957 61084 -84068 -42644 -9059 65114 -6379 -59428 10381
15955A0381O224J2824n1808K9638Q8436m3756r6813l5967l6379j13396J6320L6987
$$ 10381 16605 29429 -22379 7259 95695 51939 -44874 -80841 -117220 -230616 -214296 -177309
15943a77309N9869P0361K1760J0990M959l7890m2155R231l4315N5143k5209l7075
$$ -177309 -117440 -47079 -25319 -14329 -9370 -47260 -89415 -80184 -114499 -59356 -84565 -121640
15931a21640m0957J00607k7144l5108l5043p7886N295m43N8588J19669Q9038l1551
$$ -121640 -162597 -61990 -89134 -124242 -159285 -237171 -231876 -232319 -173731 -54062 34976 3425
15919C425j7492o9363M3870J4896K8295L8389K9319Q205q6113p5917J4138O3422
$$ 3425 -14067 -83430 -39560 -24664 3631 42020 71339 79544 -6569 -82486 -68348 -4926
15907d926m1500N2413O5177J13437r9131j79477q1317J03127J05844R844N4673
$$ -4926 -46426 5987 71164 184601 85470 -94007 -175324 -72197 33647 43491 98164
15896I8164N001P362l6192p0032Q996l0443Q5552K6366J4102m0738K17J79j8895
$$ 98164 103165 110527 74335 4303 13299 -17144 68408 94774 108876 68138 68355 68534 49639
15883D9639K2925L3263M780j19168N29m123m1126O2558N5354o8324j6538K0195
$$ 49639 72564 105827 110607 -8561 -8032 -12155 -53281 9277 64631 -3693 -20231 -36
15871c6J00116J944l0722L9500q796m8843R8203m8062L6980k1773k209j4052j42295
$$ -36 100080 102024 71302 110802 102006 53163 151366 103304 140284 118511 116302 102250 -40045
15858d0045n5951L1467j7633n4868M2956j6598o669K2956M1294J04407O8905l0156
$$ -40045 -95996 -64529 -82162 -137030 -94074 -110672 -117341 -94385 -53091 51316 120221 90065
15846I0065m0495p3189k3207K6980q3181m8982N2129O4756j15643o8388J1688
$$ 90065 49570 -23619 -46826 -19846 -103027 -152009 -99880 -35124 -150767 -219155 -207467
15835b07467O4120N0480O4976R8287M0055k3849J8777k4835n295j06517m6767
$$ -207467 -143347 -92867 -27891 70396 110451 86602 105379 80544 75249 -31268 -78035
15824g8035M0098P6739J20426l6545k5863m547J08156o4103l7362j06670n2767
$$ -78035 -37937 38802 159228 122683 96820 92273 200429 136326 98964 -7706 -60473
15813f0473Q2976N9167P1689m3037m5768r9200N3769L532J8796J0077N6775j37445
$$ -60473 22503 81670 153359 110322 64554 -34646 19123 22655 41451 51528 108303 -29142
15801b9142q4426J07761O5218K0882o0701j5191O3786j5746J3962p5434M4903
$$ -29142 -113568 -5807 59411 80293 19592 4401 68187 52441 66403 -9031 35872
15790C5872M3862J01724p1170r4161J28808N4810j16043r9768J33533K156l8275
$$ 35872 79734 181458 110288 16127 144935 199745 83702 -16066 117467 119623 81348
15779H1348O3742J9301m7109j30223n3163J10039O0748o228p2394j42815r2134
$$ 81348 145090 164391 117282 -12941 -66104 43935 104683 98455 26061 -116754 -208888
15768b08888L7516J07850J7128O0883P7808P1028N4573m5316q7111l6011m1181
$$ -208888 -171372 -63522 -46394 14489 92297 163325 217898 172582 85471 49460 8279
15757H279R0385l657j04660L13j54074O5176O8012j2640j3550P8413Q958n8456
$$ 8279 98664 95007 -9653 -9340 -163414 -98238 -30226 -42866 -56416 21997 30955 -27501
15745b7501l3372M0913j4134j0331J1894k4412n439j13243M469J20446m7877K3919
$$ -27501 -60873 -19960 -34094 -44425 -32531 -56943 -62382 -175625 -171156 -50710 -98587 -74668
15733g4668O6481J10037M0862n4781r4462p7091J1679R165O1569k2899o1477J8596
$$ -74668 -8187 101850 142712 87931 -6531 -83622 -71943 -62778 -1209 -24108 -85585 -66989
15721f6989L3740K8536N8257o6367n8560m9281Q7L0369m2414n8301J15614P7292
$$ -66989 -33249 -4713 53544 -12823 -71383 -120664 -120577 -90208 -132622 -190923 -75309 1983
15709A983O6464m9053J3556p3113n2549l0182P1519J19064L1742r7591m7779n2537
$$ 1983 68447 19394 32950 -40163 -92712 -122894 -51375 67689 99431 1840 -45939 -98476
15697i8476m8182J00048K3178m4539J16505K4671l7163r6269P9021J7151n5092
$$ -98476 -146658 -46610 -23432 -67971 48534 73205 36042 -60227 18794 35945 -19147
15686a9147N4365R365o2028L8757P2619o5584q4365K7707K2133O2228m7894l0881
$$ -19147 35218 44583 -17445 21312 93931 28347 -56018 -28311 -6178 56050 8156 -22725
15674b2725j0057n7125k7156j412N813M2908Q6014O4475J38q2630j10243P000
$$ -22725 -32782 -89907 -117063 -118475 -112662 -69754 16260 80735 80873 -1757 -112000 -105000
15662a05000K7647N7350p3671K4602Q2961o324j036L1937K3025l04j34040m6571
$$ -105000 -77353 -20003 -93674 -69072 13889 7565 6529 38466 61491 61187 -72853 -119424
15650a19424N4923n5236R8844J57181o9956q1786m0485J49845L4423j5931j3977
$$ -119424 -64501 -119737 -20893 136288 66332 -15454 -55939 93906 128329 112398 98421
15639I8421k7635J5866L1224O7429l5705K0940M891r6114p1033j02033p5614N519
$$ 98421 70786 86652 117876 185305 149600 170540 175431 79317 8284 -93749 -169363 -163844
15627a63844j0452l6894P5875K6539l3124M3041l9542n8061M3342O1229O1725
$$ -163844 -174296 -211190 -135315 -108776 -141900 -98859 -138401 -196462 -153120 -91891 -30166
15616c0166p5309j28125O014k4145Q8379J41974M1828J8022k3713J2481k4609
$$ -30166 -105475 -233600 -227586 -251731 -163352 -21378 20450 38472 14759 27240 2631
15605B631O0235n8960l7464j2606k5543J9344J7524j5972q7108l8855j7975k1074
$$ 2631 62866 3906 -33558 -46164 -71707 -52363 -34839 -50811 -137919 -176774 -194749 -215823
15593b15823Q332K7147L0779L1654Q8025J7871M4644j4782Q491o4383k6265Q9049
$$ -215823 -207491 -180344 -149565 -117911 -29886 -12015 32629 17847 26338 -38045 -64310 24739
15581B4739L4531l3856q8419J04691J02705j31234m1013q329j5612l2947j7351
$$ 24739 59270 25414 -63005 41686 144391 13157 -27856 -36185 -51797 -84744 -102095
15570a02095N9642L0064O496l2207J8840K4327k8309n6265M73L5632j05898P4883
$$ -102095 -42453 -12389 -5893 -38100 -19260 5067 -23242 -79507 -79034 -43402 -149300 -74417
15558g4417L6839P2244N6142l4056o1060l0153q9539j4296L2026M4378O8778n6387
$$ -74417 -37578 34666 90808 56752 -4308 -34461 -124000 -138296 -106270 -61892 6886 -49501
15546d9501Q3345J3928J7861M1521p3086p5565n4047P8556j4303J30141K2719
$$ -49501 33844 47772 65633 107154 34068 -41497 -95544 -16988 -31291 98850 121569
15535A21569K2510r3250j04562r2718J08681M9763q1172m5313P1421O6983q7491
$$ 121569 144079 50829 -53733 -146451 -37770 11993 -69179 -114492 -43071 23912 -63579
15524f3579J576R7920j4183k8027n412l4653m7277J01628O3425k6318M6845l1743
$$ -63579 -62003 35917 21734 -6293 -11705 -46358 -93635 7993 71418 45100 91945 60202
15512F0202J3614o3247m5527r7967M0068J11929K0594J3582J255q880O0665n5692
$$ 60202 73816 10569 -34958 -132925 -92857 19072 39666 53248 54503 45623 106288 50596
15500E0596M1505q427r4339N8528q8975O3353J14172K4675L961Q4853o7201j06697
$$ 50596 92101 83674 -10665 47863 -41112 22241 136413 161088 165049 249902 182701 76004
15488G6004j71781j0081J9211J6097O5583J16841l8132r3168N4875R567K3606
$$ 76004 -95777 -105858 -86647 -70550 -4967 111874 73742 -19426 35449 45016 68622
15477F8622n5636J0031J1930q3502J37370K0169q5425m0564N7650L8533p1689
$$ 68622 12986 23017 34947 -48555 88815 108984 23559 -17005 40645 79178 7489
15466G489N7897K7612o9094M3574j1430k3407k5487L126m4774K4371K8934M979
$$ 7489 65386 92998 23904 67478 56048 32641 7154 10280 -34494 -10123 18811 23790
15454B3790J2368n0700q183L0249m757n0850p6728n7984j2239P6511R848m390
$$ 23790 36158 -14542 -22725 7524 2767 -48083 -124811 -182795 -195034 -118523 -108675 -113065
15442a13065J20267J3097n7056j043N7223L7228J2758o8378q9285Q0259M416n83
$$ -113065 7202 20299 -36757 -37800 19423 56651 69409 1031 -88254 -7995 -3579 -4162
15430d162N0187J67413q5072q2356K5959k8868n6662m7039K8105Q2365r621m9202
$$ -4162 46025 213438 128366 46010 71969 43101 -13561 -60600 -32495 49870 40249 -8953
15418h953K7299J9839J7154l2694o4319r5161O8384J30392Q7756n5898o0560p3193
$$ -8953 18346 38185 55339 22645 -41674 -136835 -68451 61941 149697 93799 33239 -39954
15406c9954k0918q2242M076J1586Q1034n619p255J2601N5960M240j8726q6631
$$ -39954 -60872 -143114 -139038 -127452 -46418 -52037 -59292 -46691 9269 13509 -5217 -91848
15394i1848J9626j7854K0291O6234q1235O5824K7976k4785K5675m541L7711k1099
$$ -91848 -72222 -90076 -69785 -3551 -84786 -18962 9014 -15771 9904 5363 43074 21975
15382B1975L4300L7863m5522j47729M0017N185j1723O7997l6031L9275k3331r2289
$$ 21975 56275 94138 48616 -99113 -59096 -53911 -65634 2363 -33668 5607 -17724 -110013
15370a10013m1580K5191Q572r038L2658k5123L7346N4754P8872j03143m3182P3877
$$ -110013 -151593 -126402 -117830 -126868 -94210 -119333 -81987 -27233 51639 -51504 -94686 -20809
15358b0809n4097N7775J1259N5329q2458r8723K6715J9144N4132M1411r9901q7932
$$ -20809 -74906 -17131 -5872 49457 -33001 -131724 -105009 -85865 -31733 9678 -90223 -178155
15346a78155o9401M3509N9543M1865L8709l834M9196l1761L243P4874k0141n3337
$$ -178155 -247556 -204047 -144504 -102639 -63930 -67764 -18568 -50329 -47086 27788 7647 -45690
15334d5690N8972J41352L7394q4187k15209q8069Q3849M2036R4073p8031j07071
$$ -45690 13282 154634 192028 107841 -107368 -195437 -111588 -69552 24521 -53510 -160581
15323a60581L9743p542j7175J6333M0339m4287L0967K2752P3561K1177N7786n2803
$$ -160581 -120838 -128380 -145555 -129222 -88883 -133170 -102203 -79451 -5890 15287 73073 20270
15311B0270j47516K6900P581k9312L214N2372L1486j8581o0144Q938l5980M8012
$$ 20270 -127246 -100346 -92765 -122077 -118863 -66491 -35005 -53586 -113730 -104792 -140772 -92760
15299i2760m5722J7038j131P554K3621Q7192R2608j91423j3550N3288J7535Q6272
$$ -92760 -138482 -121444 -122575 -115021 -91400 -4208 88400 -103023 -116573 -63285 -45750 40522
15287D0522o7985L25N8159p3502k6508k6273Q3487P8106l144o476J8265j9436
$$ 40522 -27463 -27138 31021 -42481 -68989 -95262 -11775 66331 63187 56711 74976 55540
15275E5540m1112J3263P1528o3810k6872k4704L0158L1935m0522r7233j1538P7818
$$ 55540 14428 27691 99219 35409 8537 -16167 13991 45926 5404 -91829 -103367 -25549
15263b5549q6688m5703l4102O7333J13310K4333J04834j2250r6913K5272k4778
$$ -25549 -112237 -157940 -192042 -124709 -11399 12934 117768 105518 8605 33877 9099
15252I099p3526K7962N8306Q1822N8581j08195j25920m1572K7398k5284K5549
$$ 9099 -64427 -36465 21841 103663 162244 54049 -71871 -113443 -86045 -111329 -85780
15241h5780K0048n5498K2511l8663K272o1532P0131L1150L2271L5829J176n7198
$$ -85780 -65732 -121230 -98719 -137382 -135110 -196642 -126511 -95361 -63090 -27261 -26085 -83283
15229h3283o7405Q3071L2774J49890j6812o7173K3494N7799o8391n27Q3489j7139
$$ -83283 -150688 -67617 -34843 115047 98235 31062 54556 112355 43964 43437 126926 109787
15217A09787j17858J715M7310Q218M5358J9658o3312j39540O4931J54540o646
$$ 109787 -8071 -6356 40954 49172 94530 114188 50876 -88664 -23733 130807 124161
15206A24161j45948p2657L126L3690R1020j17564k9496N1723K5845M5691K3860
$$ 124161 -21787 -94444 -91318 -57628 33392 -84172 -113668 -61945 -36100 9591 33451
15195C3451Q1478J0667n7770k090J3267n6021M978O7021L8398j11998M1041J20182
$$ 33451 114929 125596 67826 65736 79003 22982 27960 94981 133379 21381 62422 182604
15183A82604p4320l58l3841M9348K3440k2822n3558r7626K1367M5726n8044m6287
$$ 182604 108284 107926 74085 123433 146873 124051 70493 -27133 -5766 39960 -18084 -64371
15171f4371r746m4864j845N9805J8674l3530L1839R2477n884J2774P9607l1666
$$ -64371 -74117 -118981 -120826 -61021 -42347 -75877 -44038 48439 42555 55329 134936 103270
15159A03270o1322R651p7104n4875J036N7755j5116N3113l6703L5707R6475m4666
$$ 103270 41948 51599 -25505 -80380 -79344 -21589 -36705 16408 -20295 15412 111887 67221
15147F7221r9159m0984J9955N8304m5629N3694J01931J32719n3851j81016m9864
$$ 67221 -31938 -72922 -52967 5337 -40292 13402 115333 248052 194201 13185 -36679
15136c6679J15683J08540j38477k2329Q175n916M2615k9559l4811j8167p4274
$$ -36679 79004 187544 49067 26738 34913 28997 71612 42053 7242 -10925 -85199
15125h5199K8200R9926P2683J0629o8174j1722L9125j9185K3723l2952r0731N4524
$$ -85199 -56999 42927 115610 126239 58065 46343 85468 66283 90006 57054 -33677 20847
15113B0847j6531K2952l1112k3305o1838N5600M4625J7752m2760m5542m4637R1331
$$ 20847 4316 27268 -3844 -27149 -88987 -33387 11238 28990 -13770 -59312 -103949 -12618
15101a2618O7621J6015j52790j30168J11715K00499P3889p2904q7728K3669j187
$$ -12618 55003 71018 -81772 -211940 -100225 100274 174163 101259 13531 37200 36013
15090C6013Q0171K398L6092J5636o1836j19840j27276m5822N2780J38599L4802
$$ 36013 116184 118582 154674 170310 108474 -11366 -138642 -184464 -131684 6915 41717
15079D1717n2377l7945o3071o2301o27R8529O3745j05401m7231o3870K2989J56441
$$ 41717 -10660 -48605 -111676 -173977 -174604 -76075 -12330 -117731 -164962 -228832 -205843 -49402
15067d9402J19882j24290J4036J68324J14188M3559l3928r5338j68621p5055k6192
$$ -49402 70480 -53810 -39774 128550 242738 286297 252369 157031 -11590 -86645 -112837
15056a12837P4845r826K7469J8005m2339N5495J9651M2995k736j1660m1986J686
$$ -112837 -37992 -47818 -20349 -2344 -44683 10812 30463 73458 70722 59062 17076 18762
15044A8762k125J9629O3947M3962q5022p6576O49p7331m271N7368j6953N1163
$$ 18762 16637 36266 100213 144175 59153 -17423 -16774 -94105 -98376 -41008 -57961 -6798
15032f798R3146L6866n0300p447P4706n5015K31O3234R788r7501m9471k0749l7855
$$ -6798 86348 123214 72914 65467 140173 85158 85389 148623 158411 60910 11439 -9310 -47165
15019d7165j353n0754N8899N1594R5726J6408r9966m8718P0199L833o3793J7067
$$ -47165 -48518 -99272 -40373 11221 106947 123355 23389 -25329 44870 48703 -15090 1977
15007A977k2562q719O9879N3846L7062J1059m464p3687m2646p4481n1150J4361
$$ 1977 -20585 -29304 40575 94421 131483 142542 138078 64391 21745 -52736 -103886 -89525
14995h9525M4071k531J4780o9318j05817P988J03486J28528N0529K5527k1790
$$ -89525 -45454 -47985 -33205 -102523 -208340 -200352 -96866 31662 82191 107718 85928
14984H5928n9590P785k4027l9661n4390J11416K9274j23175N6993N8186J7944
$$ 85928 26338 34123 10096 -29565 -83955 27461 56735 -66440 -9447 48739 66683
14973F6683k2213J0679o6217K998L0827M5833K2416j1943r1188M5709L2290l566
$$ 66683 44470 55149 -11068 -8070 22757 68590 91006 79063 -12125 33584 65874 62308
14961F2308k2757j33373k1673P2868Q4857J9947Q630l1434J7087J8047p7441j10466
$$ 62308 39551 -93822 -115495 -42627 42230 62177 70807 39373 56460 74507 -2934 -113400
14949a13400p0090Q0083J6939l3613O6855K0271m3738J5480N7543l4813p258P69
$$ -113400 -183490 -103407 -86468 -120081 -53226 -32955 -76693 -61213 -3670 -38483 -45741 -44972
14937d4972N353P1199P9501J8921Q059m0485j0820J6925j6068o2863p4256M6722
$$ -44972 -39619 31580 111081 130002 138061 97576 86756 103681 87613 24750 -49506 -2784
14925b784J12998M0970j37648r2091M3286J77603J8318j16501n2297j56990k470
$$ -2784 110214 151184 13536 -78555 -35269 142334 160652 44151 -8146 -165136 -167606
14914a67606R8143J9498J05877Q670l3612k2913M6545p3446m6072O5056j023J7564
$$ -167606 -69463 -49965 55912 64582 30970 8057 54602 -18844 -64916 140 -883 16681
14902A6681K862L0967k834k7094j9058k4237p529k3021L7281m0521o3821R985
$$ 16681 19543 50510 47676 20582 1524 -22713 -30242 -53263 -15982 -56503 -120324 -110339
14890a10339O3168Q7671l6485J3618N9307j424n0938l9095J07424M9220p7316
$$ -110339 -47171 40500 4015 17633 76940 75516 24578 -14517 92907 142127 64811
14879F4811q8956m7113N8991P0824m3393N0906l6939p7884j37343k8897J01981
$$ 64811 -24145 -71258 -12267 58557 15164 66070 29131 -48753 -186096 -214993 -113012
14868a13012n88O475R938J17943O7872q8451p6709J08693O7159k0028q4856p1706
$$ -113012 -113600 -107125 -97187 20756 88628 177 -76532 32161 99320 79292 -5564 -77270
14856g7270N050R9273J0353o4403m5711n2084r1113K6329L8556J12414J01038
$$ -77270 -72220 27053 37406 -26997 -72708 -124792 -215905 -189576 -151020 -38606 62432
14845F2432R0302j5734j7345J09957m0553l6440q6060k12774j20750k6135o0992
$$ 62432 152734 137000 119655 229612 189059 152619 66559 -146215 -266965 -293100 -354092
14834c54092J02642J33113R6310o466R447J02741o0885n9561j2056J28593N8682
$$ -354092 -251450 -118337 -22027 -28493 -19046 83695 22810 -36751 -48807 79786 138468
14823A38468j05379K0998j9991J0859k9294q0409m6804n7637Q5649k406K9368
$$ 138468 33089 54087 34096 44955 15661 -64748 -111552 -169189 -83540 -85946 -56578
14812e6578k8658J1486l4923o3472L009J39614M2061k5177j93421K4967J13146
$$ -56578 -85236 -73750 -108673 -172145 -169136 -29522 12539 -12638 -206059 -181092 -67946
14801f7946J43534l9924j48490j05807N8555J54235J13995J40785o7290j26212
$$ -67946 75588 35664 -112826 -218633 -160078 -5843 108152 248937 181647 55435
14791E5435q0337o0698J4421J4875o976q2312l598J03925n9439l2618j52347N72
$$ 55435 -24902 -85600 -71179 -56304 -63280 -145592 -149190 -45265 -104704 -137322 -289669 -289097
14779b89097k9680P3497J0755J21517M8212J23265N4208k5983q2048L1601j39
$$ -289097 -318777 -245280 -234525 -113008 -64796 58469 112677 86694 4646 36247 36108
14768C6108m1284L5276K1110R0095p0671j65012o4985K5596N9876m9410N5802
$$ 36108 -5176 30100 51210 141305 70634 -94378 -159363 -133767 -73891 -123301 -67499
14757f7499O8983J2406L4338j5203m9332m5603R691K7397j19241M7389J25595
$$ -67499 1484 13890 48228 33025 -16307 -61910 -52219 -24822 -144063 -96674 28921
14746B8921J3968j25068p0931M8791J6930r5583k2800N1461N8948j5364M0110
$$ 28921 42889 -82179 -153110 -104319 -87389 -182972 -205772 -154311 -95363 -110727 -70617
14735g0617J4587L9864J00239m8190j01511K2205l0811P7575j8342j0713j38024
$$ -70617 -56030 -16166 84073 35883 -65628 -43423 -74234 3341 -15001 -25714 -163738
14724a63738L5728N5827K9274K6354Q0023K2719l9058n677m7289o9428j1979K2062
$$ -163738 -128010 -72183 -42909 -16555 63468 86187 47129 41452 -5837 -75265 -87244 -65182
14712f5182P8237k020M2158l8377q8986j1322J2225M4369Q3841K6919K6164r1369
$$ -65182 13055 11035 53193 14816 -74170 -85492 -73267 -28898 54943 81862 108026 16657
14700A6657r0078O3601P9965n2705k3729K860q6744M1556N6803J2657m6608m2608
$$ 16657 -73421 -9820 70145 17440 -6289 -3429 -90173 -48617 8186 20843 -25765 -68373
14688f8373l3697j0731R6235N8197l6197n5225j21625L7477J12623N4477L6102
$$ -68373 -102070 -112801 -16566 41631 5434 -49791 -171416 -133939 -21316 33161 69263
14677F9263n1145j7423J2033p4290l5039M8807L27j2649r8348j11821P1725J07315
$$ 69263 18118 695 12728 -61562 -96601 -47794 -47467 -60116 -158464 -270285 -198560 -91245
14665i1245L1181K4014N83K7463J0257n8788M592N019J16264O5246m595o1033
$$ -91245 -60064 -36050 -35467 -8004 2253 -56535 -51943 -46924 69340 134586 129991 68958
14653F8958O1701m0576N85L632o198n774J3529l308q1779o3938k5296Q4171L9474
$$ 68958 130659 90083 90668 94300 88102 82328 95857 92549 10770 -53168 -78464 5707 45181
14640D5181M778R9234n2095j68910j09410P716O7448j245L1497q9393J8831N4845
$$ 45181 49959 149193 97098 -71812 -181222 -173506 -106058 -107303 -75806 -165199 -146368 -91523
14628i1523j5124q045Q8453N9136K9153j25354j2716O9376m5749k6879P8376k1938
$$ -91523 -106647 -114692 -26239 32897 62050 -63304 -76020 -6644 -52393 -79272 -896 -22834
14616b2834L3569O2313p2519o8177J0344K9767P4200j4184Q9612q202J2020q6731
$$ -22834 10735 73048 529 -67648 -57304 -27537 46663 32479 122091 113889 125909 39178
14604C9178j18534j21888P9107O6318R5800M95j48628k753P8985q447M9730L6552
$$ 39178 -79356 -201244 -122137 -55819 39981 40476 -108152 -110905 -31920 -40367 9363 45915
14592D5915l6399n3248m3971j9793o6276k9863o3682R145J31762J11880K7504
$$ 45915 9516 -43732 -87703 -107496 -173772 -203635 -267317 -258172 -126410 -14530 12974
14581A2974O5500r8603n8147J6647l3946P6342M9768J325K4766L1228n721r0330
$$ 12974 78474 -20129 -78276 -61629 -95575 -19233 30535 31860 56626 87854 82133 -8197
14569h197o8330j7352P8754M4391j11458j47562j3236J67556o5032l5003J32607
$$ -8197 -76527 -93879 -15125 29266 -82192 -229754 -242990 -75434 -140466 -175469 -42862
14558d2862M8607p6851J8450O5769j0675n0185L1143j46J70M7541m2356L3522
$$ -42862 5745 -71106 -52656 13113 2438 -47747 -16604 -16750 -16580 30961 -11395 22127
14546B2127j2158P4981k0313Q8649K1448p5730o6909J8709R9565o2837K2155K0546
$$ 22127 9969 84950 64637 153286 174734 99004 32095 50804 150369 87532 109687 130233
14534A30233j47409n6082J7680M7193J12296Q3187L689j17882l6846N3060r2113
$$ 130233 -17176 -73258 -55578 -8385 103911 187098 190787 72905 36059 89119 -2994
14523b994j5804m6026k9221N1470l2598l9090J48032O5175k5310P3878J13712
$$ -2994 -18798 -64824 -94045 -42575 -75173 -114263 33769 98944 73634 147512 261224
14512B61224L9097n0535l0139L775j25013j34828r748o664j7196j36917k4631
$$ 261224 300321 249786 219647 223422 98409 -36419 -46167 -52831 -70027 -206944 -231575
14501b31575Q1064P6321j338J12192J11267r1113j29526N9029J2931k1426K7799
$$ -231575 -150511 -74190 -75528 36664 147931 56818 -72708 -13679 -748 -22174 5625
14490E625J22360j2265K0183o1327q4644l3372O791J05853k5129P787J3679K0876
$$ 5625 127985 115720 135903 74576 -10068 -43440 -36649 69204 44075 51862 65541 86417
14478H6417P7692n6114r8804q3379m605k2570O5098n6134Q7375J10981L819q5481
$$ 86417 164109 107995 9191 -74188 -78793 -101363 -36265 -92399 -5024 105957 109776 24295
14466B4295J265Q3031q3027j42277n0449J5283j8151j0425R7585N4444j52J5259
$$ 24295 25560 108591 25564 -116713 -167162 -151879 -170030 -180455 -82870 -28426 -28578 -13319
14454a3319Q3022m7783k4234n7725L2711k1499n2034M5315L7511M2886n8940Q5345
$$ -13319 69703 21920 -2314 -60039 -27328 -48827 -100861 -55546 -18035 24851 -34089 51256
14442E1256R8318P9638K9254o5457j87568l0164P554K4027m7507J7666J41285
$$ 51256 149574 229212 258466 193009 5441 -24723 -17169 6858 -40649 -22983 118302
14431A18302O7622R036j53597o5648n9528k1555J35492J2116k7302j5384m059
$$ 118302 185924 194960 41363 -24285 -83813 -105368 30124 42240 14938 -446 -4505
14420d505N3029J43222o6149p8462n9297L754n1561q4604J9482M7914O8112j4466
$$ -4505 48524 191746 125597 47135 -12162 -8408 -59969 -144573 -125091 -77177 -9065 -23531
14408b3531N3265R133o755p2855O2239J338K3758n2391k0642j4766R0291R4031
$$ -23531 29734 38867 32112 -40743 21496 22834 46592 -5799 -26441 -41207 49084 143115
14396A43115k2789o1068n3835k6909l0000R1115j1177p6198L5583Q3935K4275
$$ 143115 120326 59258 5423 -21486 -51486 39629 28452 -47746 -12163 71772 96047
14385I6047n9500r0038p1522J0310P7388J3686r2472l740n1681J15519N5799q205
$$ 96047 36547 -53491 -125013 -114703 -37315 -23629 -116101 -119841 -171522 -56003 -204 -8409
14373h409q0099l3954K6032J6082j2493R8608J32955o3582o537l4805l6536L1215
$$ -8409 -88508 -122462 -96430 -80348 -92841 5767 138722 75140 68603 33798 -2738 28477
14361B8477R2782L570j32925J5927R6743p4130n9652o1590p6436M4020J9258O9184
$$ 28477 121259 124829 -8096 7831 104574 30444 -29208 -90798 -167234 -123214 -103956 -34772
14349c4772K1950K5810M0868Q9704J28621o6327o3998m1913m9869M953p3906j21047
$$ -34772 -12822 12988 53856 143560 272181 205854 141856 99943 50074 55027 -18879 -139926
14337a39926L4547O8530L3796o2857j2697n0669q3148J32733J23330n3524l757
$$ -139926 -105379 -36849 -3053 -65910 -78607 -129276 -212424 -79691 43639 -9885 -13642
14326a3642M2979Q598M8582O3593o7587r4049m709P7191M5569m1009l0679j05891
$$ -13642 29337 37935 86517 150110 82523 -11526 -16235 60956 106525 65516 34837 -71054
14314g1054m2756l9354N7478J86633N1933m3953q4091J7627K6133q432K4923M3598
$$ -71054 -113810 -153164 -95686 90947 142880 98927 14836 32463 58596 50164 75087 118685
14302A18685r4089j79381N390J05163R5912l3661q1511L124J9992O4620l1720
$$ 118685 24596 -154785 -149395 -44232 51680 18019 -63492 -60368 -40376 24244 -7476
14291g476J3656J4568k05695P4805J45858O2393P4479L6825O1290p5499j52331
$$ -7476 6180 20748 -184947 -110142 35716 98109 172588 209413 270703 195204 42873
14280D2873j5946q991q009m8137q0546j4733J26636K5935M0803q908j2776o345
$$ 42873 26927 17936 9927 -38210 -118756 -133489 -6853 19082 59885 50977 38201 31856
14268C1856O251k9494r4211o9096l5493J11102R8181k080k55L4337j7054n4637
$$ 31856 38107 8613 -85598 -154694 -190187 -79085 19096 17016 16761 51098 34044 -20593
14256b0593N7851O8738j4845m1988P3003m4291j37207n3410K5164M7379j5837
$$ -20593 37258 105996 91151 49163 122166 77875 -59332 -112742 -87578 -40199 -56036
14245e6036l9780K7610r646O2944R7488Q3062n0413m1058l6554m747O4452m9459
$$ -56036 -95816 -68206 -77852 -14908 82580 165642 115229 74171 37617 32870 97322 47863
14233D7863k3130J15669J7051o3205k0333n0469j39194J2499N6897j7521n9558
$$ 47863 24733 140402 157453 94248 73915 23446 -115748 -103249 -46352 -63873 -123431
14222a23431K9328O5567n0991N1405L4070O0347J17515J3751j03500q7564m8718
$$ -123431 -94103 -28536 -79527 -28122 5948 66295 183810 197561 94061 6497 -42221
14211d2221j00948n4231R8634J34785j13375p9734P1249J5880J8290m6665K3380
$$ -42221 -143169 -197400 -98766 36019 -77356 -157090 -85841 -69961 -51671 -98336 -74956
14200g4956l7145o8704l1015M6875Q6934J15321M0327n4362l927L7228J2983o9161
$$ -74956 -112101 -180805 -211820 -164945 -78011 37310 77637 23275 19348 56576 69559 398
14188C98q5166o8618n3983O5095J16473K3444n0936r1246l2954P3707J17941N9798
$$ 398 -84768 -153386 -207369 -142274 -25801 -2357 -53293 -144539 -177493 -103786 14155 73953
14176G3953q8399l3160P4698j02728j26105N5483N2432j29629o0480Q338Q3528
$$ 73953 -14446 -47606 27092 -75636 -201741 -146258 -93826 -223455 -283935 -275597 -192069
14165a92069J41627j030l032j7749k5129J0034k1107N2029L8608l7376R9549M0501
$$ -192069 -50442 -51472 -54504 -72253 -97382 -87348 -108455 -56426 -17818 -55194 44355 84856
14153H4856n2194j11995J8788O3629K994M7183K2661Q598n4890q5357J4468N8719
$$ 84856 32662 -79333 -60545 3084 6078 53261 75922 84520 29630 -55727 -41259 17460
14141A7460o6734P8846Q1468j42952Q8244J91126K3780j33327n3579j3600l8464
$$ 17460 -49274 29572 111040 -31912 56332 247458 271238 137911 84332 70732 32268
14130C2268K3129L9778J2782k4963O3764K5389m2714j20057P2470J47480p1927
$$ 32268 55397 95175 107957 82994 146758 172147 129433 9376 81846 229326 157399
14119A57399j48942J4153J4912n0411n7801n9312n8764P6290J00123R8337M1408
$$ 157399 8457 22610 37522 -12889 -70690 -130002 -188766 -112476 -12353 85984 127392
14108A27392j51872j00176j0519l5764O017o376J5614P3976O860R7844O849q1086
$$ 127392 -24480 -124656 -135175 -170939 -164922 -171298 -155684 -81708 -74848 22996 29845 -51241
14096e1241J25489N6855j35824k4588O243K8221j0415o376l2263k8411O172J355
$$ -51241 74248 131103 -4721 -29309 -23066 5155 -5260 -11636 -43899 -72310 -66138 -64783
14084f4783K4780J0005L3290J604N375q743L4232n8667O0826L598j12391R377
$$ -64783 -40003 -29998 3292 4896 10271 1528 35760 -22907 37919 41517 -70874 -61497
14072f1497L9486k6760n64M99O1427l8869q5649N5382Q7496P5511l833j10536
$$ -61497 -22011 -48771 -49335 -48836 12591 -26278 -111927 -56545 30951 106462 102629 -7907
14060g907l6022p4792j7951J35242r265p8599n3490J31093m583j18567p7015R9669
$$ -7907 -43929 -118721 -136672 -1430 -10695 -89294 -142784 -11691 -16274 -134841 -211856 -112187
14048a12187J05952j1757j09500K7210K3380J5540M5399J6546M4377L0643J48113
$$ -112187 -6235 -17992 -127492 -100282 -76902 -61362 -15963 583 44960 75603 223716
14037B23716Q9546r9228p9040m9826p746l2115m1309k3761n2587K296n4641j4983
$$ 223716 313262 214034 134994 85168 77422 45307 3998 -19763 -72350 -70054 -124695 -139678
14025a39678J20305M6591P392l7871k6348j4831K9627M2005m440m9159o8039j04984
$$ -139678 -19373 27218 34610 -3261 -29609 -44440 -14813 27192 22752 -26407 -94446 -199430
14013a99430o514M2800J05802l0705o9106J58136L3764o1179j5289L2058k6464
$$ -199430 -205944 -163144 -57342 -88047 -157153 983 34747 -26432 -41721 -9663 -36127
14002c6127K9069L863Q3513K8586q998p7730q7980m9406k1709p341Q6567j3276
$$ -36127 -7058 -3195 80318 108904 99906 22176 -65804 -115210 -136919 -144260 -57693 -70969
13990g0969m2041p391J6488N2530j3913K1604N32j29752m1884J11494P6637O3744
$$ -70969 -113010 -120401 -103913 -51383 -65296 -43692 -43160 -172912 -214796 -103302 -26665 37079
13978C7079J7162P8062m736k9186K844k8978Q1847J0485j26228L3833n1163j58854
$$ 37079 54241 132303 127567 98381 101225 72247 154094 164579 38351 72184 21021 -137833
13966a37833O5029K27970J08529j9508l4330p8619p58P278K1548l1298j31459
$$ -137833 -72804 155166 263695 244187 209857 131238 130480 137758 159306 128008 -3451
13955c451J5230M5007k2740o7367k3072j1755o9018J29032P3304l6792N496R3356
$$ -3451 11779 56786 34046 -33321 -56393 -68148 -137166 -8134 65170 28378 33874 127230
13943A27230o1714q9817j56237L440K8922J6163j8294J42211N5634n1136o2695
$$ 127230 65516 -24301 -180538 -177098 -148176 -132013 -150307 -8096 47538 -3598 -66293
13932f6293K7444J18809L3713J8680Q1383j5063j15880j48449r884L8344J37005
$$ -66293 -38849 79960 113673 132353 213736 198673 82793 -65656 -75540 -37196 99809
13921I9809K8339J9452j10513j04854L1180R1614O0507k2130n1469k6708L3582
$$ 99809 128148 147600 37087 -67767 -36587 55027 115534 93404 41935 15227 48809
13910D8809n8205k1857N8467M0747j4799n2046n6578M1950J8219J49560k1707
$$ 48809 -9396 -31253 27214 67961 53162 1116 -55462 -13512 4707 154267 132560
13899A32560j19164r104j7028n6740q1670M9447J55549R0014l5790p3334M317
$$ 132560 13396 4292 -12736 -69476 -151146 -101699 53850 143864 108074 34740 39057
13888C9057O3565o718L0662j5588K5669R817o5342P6287N9336p3198n7099J2324
$$ 39057 102622 95904 126566 110978 136647 146464 81122 157409 216745 143547 86448 98772
13876I8772j2234L6235J0326K5954J4208o2189j92252m2429J01438p809M5019
$$ 98772 86538 122773 133099 159053 173261 111072 -81180 -123609 -22171 -29980 15039
13865A5039P0160p7122k8228P8557m0277q9028q4703K1518N422q5332n0094k3245
$$ 15039 85199 8077 -20151 58406 18129 -70899 -155602 -134084 -128662 -213994 -264088 -287333
13853b87333R3929Q0028K1872Q4401M2046m2897j2017O7635n01l0581K605j6676
$$ -287333 -193404 -113376 -91504 -7103 34943 -7954 -19971 47664 47163 16582 19187 2511
13841B511n0491Q8866K2954Q201k8657n8903O101N2206M7750o380k5642M573m7984
$$ 2511 -47980 40886 63840 72041 43384 -15519 -9418 42788 90538 84158 58516 63089 15105
13828A5105q045k9423m011K8033j1406l9418q7384m9356R452K2601Q1103N7821
$$ 15105 7060 -22363 -26374 1659 -9747 -49165 -136549 -185905 -176453 -153852 -72749 -14928
13816a4928l7547k2117k8706J6200l0187N4159K5032m7836J0533J2653m667n0013
$$ -14928 -52475 -74592 -103298 -87098 -117285 -63126 -38094 -85930 -75397 -62744 -67411 -117424
13804a17424L8050P5784m4679q3739Q2428J0431l2322r3594n5615O6109m116J582
$$ -117424 -79374 -3590 -48269 -132008 -49580 -39149 -71471 -165065 -220680 -154571 -158687 -157105
13792a57105R2618P3592l8534l7149Q0285k5150k8474n4961L8742L372O217m9365
$$ -157105 -64487 9105 -29429 -66578 13707 -11443 -39917 -94878 -56136 -52764 -46547 -95912
13780i5912m470P1678L1276n7276o7206p4847L0688J4687k7480R8644q927n8882
$$ -95912 -100382 -28704 2572 -54704 -121910 -196757 -166069 -151382 -178862 -80218 -89145 -148027
13768a48027J22786J13736j4673n5185J8575J28161p318j05795J722J3371l0553
$$ -148027 -25241 88495 73822 18637 37212 165373 158055 52260 53982 67353 36800
13757C6800q3639o05l0344M9290N1828J9456K6826N0406o9448m2950J47039j068
$$ 36800 -46839 -47444 -77788 -28498 23330 42786 69612 120018 50570 7620 154659 153591
13745A53591j02814j31366j967R5320P8046o4678j12332O209r0216Q8907N3824
$$ 153591 50777 -80589 -82556 12764 90810 26132 -86200 -79991 -170207 -81300 -27476
13734b7476Q7388n3072k0931K2793K2336M3935J2435P4034n1650K434L1718j16709
$$ -27476 59912 6840 -14091 8702 31038 74973 87408 161442 109792 112226 143944 27235
13722B7235j3813P0600J6867K4387j0738K1150K1988o5912o2306k4906J0957P0287
$$ 27235 13422 84022 100889 125276 114538 135688 157676 91764 29458 4552 15509 85796
13710H5796J1240L5044k596l4205m7255j43342Q8107J68962o4643p1276M2305
$$ 85796 97036 132080 129484 95279 48024 -95318 -7211 161751 97108 25832 68137
13699F8137O8014l7974p9198N889J05306k6672j31630n0447L0267J3687N7522
$$ 68137 136151 98177 18979 24868 130174 103502 -28128 -78575 -48308 -34621 22901
13688B2901L8820l0673K843r924K7391J6378j1773m1924K5807l9537O69M5690
$$ 22901 61721 31048 33891 23967 51358 67736 55963 14039 39846 309 978 46668
13676D6668Q1039j15504m7317l3115P7377J21082J0194q0043J8694K8259J9685
$$ 46668 127707 12203 -35114 -68229 9148 130230 140424 60381 79075 107334 127019
13665A27019n4124q0933n1775K8011k8041P9713M6819j20824l4302Q7529R6931
$$ 127019 72895 -8038 -59813 -31802 -59843 19870 66689 -54135 -88437 -908 96023
13654I6023O2570K8377M205l238o4973j24554l4194j2558J32170L0009K9594m859
$$ 96023 158593 186970 191175 187937 122964 -1590 -35784 -48342 83828 113837 143431 138572
13642A38572J2396m5186l3026p2605k2217O8254J5549K1044J1018k4939p9769
$$ 138572 150968 105782 72756 151 -22066 46188 61737 82781 93799 68860 -10909
13631a0909l3R7634J9810K8716j06911j75423Q2265L9679j9190J01900P4706K1890
$$ -10909 -10942 86692 106502 135218 28307 -147116 -64851 -25172 -44362 57538 132244 154134
13619A54134M2686M8066o2440l4648J3264k9740m2015K519p9654m4500q441J32989
$$ 154134 196820 244886 182446 147798 161062 131322 89307 91826 12172 -32328 -40769 92220
13607I2220j5074n9059j10175r1156J64249R197r6947P9720J41449p8559m6001
$$ 92220 77146 18087 -92088 -183244 -18995 -9798 -106745 -27025 114424 35865 -10136
13596a0136M8631L5420r5703L8682L5407L0355l6510j1000J5275k3930K4398J852
$$ -10136 38495 73915 -21788 16894 52301 82656 46146 35146 50421 26491 50889 52741
13584E2741j6975K8611J33673N192j78215r854P9768L8483n434j23357n8838J03754
$$ 52741 35766 64377 198050 203242 25027 15173 94941 133424 127990 4633 -54205 49549
13572D9549K8077j2383m6195J2032L0703l299O134N823p5192k2830K4304j1853
$$ 49549 77626 65243 19048 31080 61783 58484 64618 70441 -4751 -27581 -3277 -15130
13560a5130M9654k4398j49492P0391J38185Q6762q1979j2811L4537p351K3739
$$ -15130 34524 10126 -139366 -68975 69210 155972 73993 61182 95719 88368 112107
13549A12107J3422N3143J07654K825j28370j34872q573m334r0737K4553Q2543
$$ 112107 125529 178672 286326 289151 160781 25909 17336 13002 -77735 -53182 29361
13538B9361K9858r9922p7418O4585L8694L6267P1316J0478k1018J1069j16739
$$ 29361 59219 -40703 -118121 -53536 -14842 21425 92741 103219 82201 93270 -23469
13527b3469n7943O5912J4681O8226j5704j25413O498J17521l9401j4795n2915
$$ -23469 -81412 -15500 -819 67407 51703 -73710 -67212 50309 10908 -3887 -56802
13516e6802k2335m376P9174m8102m3488J01996q521l6012j9915R2954K8912o7755
$$ -56802 -79137 -83513 -4339 -52441 -95929 6067 -2454 -38466 -58381 34573 63485 -4270
13504d270l4638K0513m8159k2350l5169m7637P0893J36458L8733q3451q6822k383
$$ -4270 -38908 -18395 -66554 -88904 -124073 -171710 -100817 35641 74374 -9077 -95899 -98282
13492i8282o6776L2447J7317l5352k4763J2656M0144K2093R8676Q9326k6609j52817
$$ -98282 -165058 -132611 -115294 -150646 -175409 -162753 -122609 -100516 -1840 87486 60877 -91940
13480i1940l7702R0871J06395Q076J2495n6699p946K0112M4459O6003R81n1144
$$ -91940 -129642 -38771 67624 75700 88195 31496 23550 43662 88121 154124 155105 103961
13468A03961q5734L3748J16210Q8425q4631j20713m0750m7297Q8802J06968P9254
$$ 103961 18227 51975 168185 256610 171979 51266 10516 -36781 52021 158989 238243
13457B38243j5666p6980n0759M2973J01806P8255m9919r0161r5613m9336m7194
$$ 238243 222577 145597 94838 137811 239617 317872 267953 177792 82179 32843 -14351
13446a4351p5132K2924J02910l2735k5810L9989j9173l1103K4653R6434k3877
$$ -14351 -89483 -66559 36351 3616 -22194 17795 -1378 -32481 -7828 88606 64729
13435F4729k3720k2082J1448N182J309P1873r0567p6646M2382P8781L4319K7977
$$ 64729 41009 18927 30375 35557 36866 108739 18172 -58474 -16092 62689 97008 124985
13423A24985o705J5698r9779r9554J8097J09829N111r2654j7756P3383L7078p1907
$$ 124985 118280 133978 34199 -65355 -47258 62571 67682 -24972 -42728 30655 67733 -4174
13411d174J4442l5300l4312J830p923l272R15L7718k4459q8044j8977Q4609J37874
$$ -4174 10268 -25032 -59344 -57514 -65437 -68709 -67794 -30076 -54535 -142579 -161556 -76947 60927
13398F0927O842m2037p5730M2375L5004L5949N878r7839m5364J8701J20899j9363
$$ 60927 67769 25732 -49998 -7623 27381 63330 69208 -28631 -73995 -55294 65605 46242
13386D6242Q6267J6679j04229J0312j7955J9355p4222L7669Q5086L4572j1647
$$ 46242 132509 149188 44959 55271 37316 56671 -17551 20118 105204 139776 128129
13375A28129j01484M368L3489k5997k7555N7297J18219L2920j41998p7338l6954
$$ 128129 26645 31013 64502 38505 10950 68247 186466 219386 77388 50 -36904
13364c6904l3223n8663r37K0928J6530N5974J1358j2860m5177Q8526O0849N2431
$$ -36904 -70127 -128790 -129727 -108799 -92269 -36295 -24937 -37797 -82974 5552 66401 118832
13352A18832J29890n7428j2425j05388m0404m9467J7162M3973j7787Q5279j3359
$$ 118832 248722 191294 178869 73481 33077 -16390 772 44745 26958 112237 98878
13341I8878P172p4964j58704n730O9301N0583N570m0505q1708J3302o2039J3026
$$ 98878 106050 31086 -127618 -133348 -64047 -13464 -7894 -48399 -130107 -116805 -178844 -165818
13329a65818J27440J27668L3625N0108l1145j05404r8857n8367M7729P8605j7901
$$ -165818 -38378 89290 122915 173023 141878 36474 -62383 -120750 -73021 5584 -12317
13318a2317j6870J7135O1443n514o2379m821j38740l1622K4612J24584K17645
$$ -12317 -29187 -12052 49391 43877 -18502 -23323 -162063 -193685 -169073 -44489 173156
13307A73156K7937J2598N2215m0874q6294j01650q5212J0495J16309n0517j2076
$$ 173156 201093 213691 265906 225032 138738 37088 -48124 -37629 78680 28163 16087
13296A6087L8604J1683J2913L9306n5991M1279O3913j16405m3122n6190K6581
$$ 16087 54691 66374 79287 118593 62602 103881 167794 51389 8267 -47923 -21342
13285b1342M2011m5357K5174L7648P7537J8082q6966o2639J4315M2199j4870N9031
$$ -21342 20669 -24688 486 38134 115671 133753 46787 -15852 -1537 40662 25792 84823
13273H4823N1233m5358r2632o0879j28165m4606J14736J04616M0456P8964K69
$$ 84823 136056 90698 -1934 -62813 -190978 -235584 -120848 -16232 24224 103188 103457
13262A03457K9483K2002l2711j9263o8348j4418j04234k6871L2040J00247M5646
$$ 103457 132940 154942 122231 102968 34620 20202 -84032 -110903 -78863 21384 67030
13251F7030q1462J00334P4290n0316j2260Q2972K3640j4842o3339O2458M1522
$$ 67030 -14432 85902 160192 109876 97616 180588 204228 189386 126047 188505 230027
13240B30027k2326n3293K2166o9066Q063Q937j18776p6401j291L3818J03179j13779
$$ 230027 207701 154408 176574 107508 115571 124508 5732 -70669 -71960 -38142 65037 -48742
13228d8742j58316K9706J01232P7998J02202j10955o4987N2479l4487P647k943
$$ -48742 -207058 -177352 -76120 1878 104080 -6875 -71862 -19383 -53870 -46223 -49166
13217d9166L1878o9764l7013J00377N4217k751j6871L9024n4606m5164L1260k3009
$$ -49166 -17288 -87052 -124065 -23688 30529 27778 10907 49931 -4675 -49839 -18579 -41588
13205d1588p375N9500L1105J15370l0j3892r687K9291J32092K6402o210q4742
$$ -41588 -48963 10537 41642 157012 156982 143090 133403 162694 294786 321188 314978 230236
13193B30236j07443l8464o6591j766j2311R4602l9028j13683L5711P4050J5283
$$ 230236 122793 84329 17738 15972 3661 98263 59235 -54448 -18737 55313 70596
13182G0596p7848L2283P4695n9968m7152M8438K8790p6227p08J14427Q99m0431
$$ 70596 -7252 25031 99726 39758 -7394 41044 69834 -6393 -7101 107326 108225 67794
13170F7794m8173K6303N2395J1223K4657L1467M1698j8237O218n7763o8156p8602
$$ 67794 19621 45924 98319 109542 134199 165666 207364 189127 195345 137582 69426 -9176
13158i176l6299L6678M6610J1569n0754N5882M4843k9366J7378m705j02770p4359
$$ -9176 -45475 -8797 37813 49382 -1372 54510 99353 69987 87365 82660 -20110 -94469
13146i4469J04739l6518q1238Q208L8340L5390J5017o8170J4421k4255J13690
$$ -94469 10270 -26248 -107486 -99278 -60938 -25548 -10531 -78701 -64280 -88535 25155
13135B5155P2387n5654k6058k836l5093J751J08841K4351q5373k7550j8401j508
$$ 25155 97542 41888 15830 12994 -22099 -20348 88493 112844 27471 -79 -18480 -19988
13123a9988n6475K5571J00477K4494N9358J5756j749M5688o8291q4276k8457J1791
$$ -19988 -76463 -50892 49585 74079 133437 149193 147444 193132 124841 40565 12108 23899
13111B3899k382J864J6446r0913n7053L6521q9172p1008N4410J53070N5719o2178
$$ 23899 21517 23381 39827 -51086 -108139 -71618 -160790 -231798 -177388 -24318 31401 -30777
13099c0777o9127k0537n9357O0598O4470j8746J7503K31281K01326j45086n1483
$$ -30777 -99904 -120441 -179798 -119200 -54730 -73476 -55973 175308 376634 231548 180065
13088A80065M5766j45906j05367J186K9375j07412L652N4364K3647L4001M359
$$ 180065 225831 79925 -25442 -24256 5119 -102293 -98641 -44277 -20630 13371 17730
13077A7730M3252J06519r5902j71769q4925J09679P2925J2413j86946o697P4674
$$ 17730 60982 167501 71599 -100170 -185095 -75416 -2491 9922 -177024 -183721 -109047
13066a09047R8697J91637k7339j13489M5908n9556k9384k9497J3712j5274j4220
$$ -109047 -10350 181287 153948 40459 86367 26811 -2573 -32070 -18358 -33632 -47852
13055d7852N0189K8583O5449K6280q4385J1026J68543M688j03968j34032N5237
$$ -47852 2337 30920 96369 122649 38264 49290 217833 222521 118553 -15479 39758
13044C9758J8905l1885j31596k444m5936J5635R9472j0871L1228q4822l7906O1944
$$ 39758 58663 26778 -104818 -107262 -153198 -137563 -38091 -48962 -17734 -102556 -140462 -78518
13032g8518J9457M3042J14707k2456j31277j06568R4863Q7471N2600n0835K1211
$$ -78518 -59061 -16019 98688 76232 -55045 -161613 -66750 20721 73321 22486 43697
13021D3697Q1200Q7488j0766k7127R0993J8587j12891j08562j35583N4221L6846
$$ 43697 124897 212385 201619 174492 265485 284072 171181 62619 -72964 -18743 18103
13010A8103n085j9239O7550K9807j05227l5687R5715J39312Q8826p607n0107k0197
$$ 18103 13018 -6221 61329 91136 -14091 -49778 45937 185249 274075 266468 216361 196164
12998A96164r2131n9432L7886M698n3880p8995M2787P0790n738o5499j7996n303
$$ 196164 104033 44601 82487 87185 33305 -45690 -2903 67887 62149 -3350 -21346 -26649
12986b6649O6160J3243J701j086o913k8761N277K8423o6814j6192N017M7346M9129
$$ -26649 39511 52754 54455 53369 46456 17695 22972 51395 -15419 -31611 -26594 20752 69881
12973F9881R987j0134R3797l546n1525o6841l1433K6316P532O154J04381J8094
$$ 69881 79868 69734 163531 159985 108460 41619 10186 36502 44034 50188 154569 172663
12961A72663J10102j5444j53020n7261k7836M0366L2312j1579Q703K989L8276
$$ 172663 282765 267321 114301 57040 29204 69570 101882 90303 99006 101995 140271
12950A40271j03480l2936K5604n918m3245P1442M4368j8440j35582K1253l040
$$ 140271 36791 3855 29459 23541 -19704 51738 96106 77666 -57916 -36663 -39703
12939c9703l0385J07581K7124q818P16M1580J63068J3287o7335o7671n6023L0785
$$ -39703 -70088 37493 64617 55799 56515 98095 261163 274450 207115 139444 83421 114206
12927A14206P987m357j1310k2366n9416j1550L1849n023j4313J6277M3670R3413
$$ 114206 122193 117836 106526 84160 24744 13194 45043 40020 25707 41984 85654 179067
12915A79067l0010m7610j5332L8249P934m1046o5494J3755L0962p2245p1473L4296
$$ 179067 149057 101447 86115 124364 132298 91252 25758 39513 70475 -1770 -73243 -38947
12903c8947R7021L2494l6171m5085J123P1277J15292Q9887j26880q3729m5182
$$ -38947 58074 90568 54397 9312 10435 81712 197004 286891 160011 76282 31100
12892C1100m9007N6641O2206l8282k1392p938n2231P8309J09314o9947J0944K5670
$$ 31100 -17907 38734 100940 62658 41266 33328 -18903 59406 168720 98773 109717 135387
12880A35387N8989q841L7634m7143k3140J8246O8393j6404j23157J3809N828k6895
$$ 135387 194376 185535 223169 176026 152886 171132 239525 223121 99964 113773 119601 92706
12868I2706p9637l6607j3845N1651M1355Q8590l419k2568l6554K1730O6389N4209
$$ 92706 13069 -23538 -37383 14268 55623 144213 140794 118226 81672 103402 169791 224000
12856B24000K5411J7138l5234q5909j50559p3626Q0539J02578m9755l2083J00416
$$ 224000 249411 266549 231315 145406 -5153 -78779 1760 104338 54583 22500 122916
12845A22916K4603l5815p6021p9341p858Q3222L5290L0757L6812j02605o4724
$$ 122916 147519 111704 35683 -43658 -51516 31706 66996 97753 134565 31960 -32764
12834c2764M5801J3515m0934n6664l0649O7263N4308n228K1996N9536L078Q201
$$ -32764 13037 26552 -14382 -71046 -101695 -34432 19876 14648 36644 96180 99258 107459
12822A07459r0362n5979q302M0786Q8301L3972o4421m7255j01245J0590K1971
$$ 107459 17097 -38882 -47184 -6398 81903 115875 51454 4199 -97046 -86456 -64485
12811f4485R8411J4774r6466k2869M4113m2228M2209n8830j03700Q770K9535P9851
$$ -64485 33926 48700 -47766 -70635 -26522 -68750 -26541 -85371 -189071 -180301 -150766 -70915
12799g0915P0365L2954L9182n9411l6166p7130k4255J07079J40507Q3029k877
$$ -70915 -550 32404 71586 12175 -23991 -101121 -125376 -18297 122210 205239 202362
12788B02362r7430k0042o9968o6974R8607R0520N570k7557O9050n4086j2130l5330
$$ 202362 104932 84890 14922 -52052 46555 137075 142645 115088 184138 130052 117922 82592
12776H2592l738N7248n0665k4032o8507L5984M6235p9400o2328L225M9366l4663
$$ 82592 78854 136102 85437 61405 -7102 28882 75117 -4283 -66611 -63386 -14020 -48683
12764d8683P3636J01099k4348M1103n5550n8042J237K8233Q2464N8235K1050q7494
$$ -48683 24953 126052 101704 142807 87257 29215 30452 58685 141149 199384 220434 132940
12752A32940p1046m9908N9930K6584l5524M9106J2953O465M924r8235o9381N2873
$$ 132940 61894 11986 71916 98500 62976 112082 125035 131500 136424 38189 -31192 21681
12740B1681m3487L87m8217M8337m1101M2498J48857J6521J3830o6829m9397K877
$$ 21681 -21806 -21419 -69636 -21299 -62400 -19902 128955 145476 159306 92477 43080 45957
12728D5957k572l2753p2018J04338J27104M2010m4591l5521J8503o5818K990Q485
$$ 45957 43385 10632 -61386 42952 170056 212066 167475 131954 150457 84639 87629 96114
12716I6114k0623J2307O0539k6493j1312j77368q0155J43635J22768N111o6193
$$ 96114 75491 87798 148337 121844 110532 -66836 -146991 -3356 119412 124523 58330
12705E8330k4533R5480N7278N151l4488p7496j5754N0589O141J740Q9718m1848
$$ 58330 33797 129277 186555 191706 157218 79722 63968 114557 120698 122438 212156 170308
12693A70308o4263n6172k9351o080O8649R4871j9896n4590K3835P5721n8751m8486
$$ 170308 106045 49873 20522 14442 83091 177962 158066 103476 127311 203032 144281 95795
12681I5795J0812n3263l0926M558p080Q8153q127N0266K4579p9362k1708J0043
$$ 95795 106607 53344 22418 26976 19896 108049 99922 150188 174767 95405 73697 83740
12669H3740j4485J2409J6789J05567n8583o5279L3131j2371J2261N124o0942K1348
$$ 83740 69255 81664 98453 204020 145437 80158 113289 100918 113179 118303 57361 78709
12657G8709J13746M9764r1124j40224k3323K6610M1997L765L2072k9943k9545
$$ 78709 192455 242219 151095 10871 -12452 14158 56155 59920 91992 62049 32504
12646C2504Q3828Q9933j18948l5672K6186J4203M7132P0451J0167L6005J6715
$$ 32504 116332 206265 87317 51645 77831 92034 139166 209617 219784 255789 272504
12635B72504m0247p9655j3353O762o120m0015p5268K8546N3835O9985L1141m044
$$ 272504 232257 152602 139249 146011 139891 99876 24608 53154 106989 176974 208115 204071
12623B04071j7843j39095p894K6795O4337M4480l2025k7760J7859J3077J7193
$$ 204071 186228 47133 39239 66034 130371 174851 142826 115066 132925 146002 163195
12612A63195J7962m5942k6442L0991M132J10463k425r6821J7772L3124q2658q950
$$ 163195 181157 135215 108773 139764 143896 254359 251934 155113 172885 206009 123351 114401
12600A14401l2381l0036M8424p7348O9449M5997P0374J7928o1656Q7587p6816
$$ 114401 82020 51984 100408 23060 92509 138506 208880 226808 165152 252739 175923
12589A75923m5201J40824N9975j13913j22219n3242J00855M1514n8611m590j7681
$$ 175923 130722 271546 331521 217608 95389 42147 143002 184516 125905 121315 103634
12578A03634L8722k7690j13605P428K0341M8441O4018Q4477o1020l2852R5082
$$ 103634 142356 114666 1061 8489 28830 77271 141289 225766 164746 131894 226976
12567B26976j9042L1020L9304o4895j2340o4149J6819O3739K6769K7301L7018
$$ 226976 207934 238954 278258 213363 201023 136874 153693 217432 244201 271502 308520
12556C08520K3270k4276k6377l5182l9621k7134p99l2031K4758N2961k8418K8094
$$ 308520 331790 307514 281137 245955 206334 179200 178401 146370 171128 224089 195671 223765
12544B23765P3782j35344l634J7844J506J748m120k3803n1724m7705R138j34440
$$ 223765 297547 162203 158569 176413 177919 179667 175547 151744 100020 52315 61453 -72987
12532g2987J8439J63348N9512P2126O1135j67705k0804P3230l5325M1970m2659
$$ -72987 -54548 108800 168312 240438 301573 133868 113064 186294 150969 192939 150280
12521A50280p928O3355o6119M8707J47761l0935m7826q931K037k9496j18420M3112
$$ 150280 142352 205707 139588 188295 336056 305121 257295 248364 250401 220905 102485 145597
12509A45597K2273J6417k8562m5736j6929M5342K7519l3924R4364O10p7499j6520
$$ 145597 167870 184287 155725 109989 93060 138402 165921 131997 226361 226971 149472 132952
12497A32952J27795J81843p3357n4264q8154j34606l5548L9437J08005L5228k5173
$$ 132952 260747 442590 369233 314969 226815 92209 56661 96098 204103 239331 214158
12486B14158J03145J1608O5970N0220p3312j13293M9205K5823m3080l498n0627
$$ 214158 317303 328911 394881 445101 371789 258496 307701 333524 290444 286946 236319
12475B36319L6323k6193k1474J12351m9569l8029j8707M582m9845K0549J58811
$$ 236319 272642 246449 224975 337326 287757 249728 231021 235603 185758 206307 365118
12464C65118L9952p5609q9623j9104k5821M798N7405J7524n4686O4047J7741l3815
$$ 365118 405070 329461 239838 220734 194913 199711 257116 274640 219954 284001 301742 267927
12452B67927k9158q5279P3630L3079n8681o1002J1684Q9815Q8682O67O0200n7419
$$ 267927 238769 153490 227120 260199 201518 140516 152200 242015 330697 331364 391564 334145
12440C34145o6720O2182o845Q554L0131q9692J441P4375N5266M3302l2638k8409
$$ 334145 267425 329607 322762 331316 361447 271755 273196 347571 402837 446139 413501 385092
12428C85092j12658n1766J6755P2388J1142L1820L9612k6485K0599l863O430j12617
$$ 385092 272434 220668 237423 309811 320953 352773 392385 365900 386499 382636 389066 276449
12416B76449n9764m7881R1361K6390M2745P663j13779p9037J2552J3676J89618
$$ 276449 216685 168804 260165 286555 329300 336963 223184 144147 156699 170375 359993
12405C59993R3649r2919k754J32995M9867o609k6792o6765n0773J66371j4367
$$ 359993 453642 360723 357969 490964 540831 534222 507430 440665 389892 556263 541896
12394E41896K2046r3619j12975j6427j4367n7755J6923J22626M5861j768N150
$$ 541896 563942 470323 357348 340921 326554 268799 285722 408348 454209 452441 457591
$$ [...]
##END NTUPLES=NMR SPECTRUM
##END=
