##TITLE=Analysis number 315618
Compound Code ac 30194
Project Code adrs
Chemist Name acros
##JCAMPDX= 6.0         $$ Bruker NMR JCAMP-DX V2.0
##DATA TYPE= NMR SPECTRUM
##DATA CLASS= NTUPLES
##ORIGIN= Bruker BioSpin GmbH
##OWNER= NMR
$$ XWIN-NMR		Version 3.5
$$ Fri Nov 25 07:56:11 2005 GMT Standard Time (UT+0h)  MAYBRIDGE\NMR@NMR_250MHZ
##.OBSERVE FREQUENCY= 250.131544655141
##.OBSERVE NUCLEUS= ^1H
##.ACQUISITION MODE= SIMULTANEOUS (DQD)
##.ACQUISITION SCHEME= undefined
##.AVERAGES= 16
##.DIGITISER RES= 18
##SPECTROMETER/DATA SYSTEM= dpx250
##.PULSE SEQUENCE= zg30
##.SOLVENT NAME= TFA
##.SHIFT REFERENCE= (INTERNAL, TFA, 0, 15.1284)
##AUDIT TRAIL= $$ (NUMBER, WHEN, WHO, WHERE, WHAT)
$$ ##TITLE= Audit trail, XWIN-NMR		Version 3.5
$$ ##JCAMPDX= 5.01
$$ ##ORIGIN= Bruker BioSpin GmbH
$$ ##OWNER= NMR
$$ C:\u/data/dgb/nmr/ADRS/13001/pdata/1/auditp.txt
$$ ##AUDIT TRAIL=  $$ (NUMBER, WHEN, WHO, WHERE, WHAT)
(   1,<2005-11-25 07:55:34.38 +000>,<MAYBRIDGE\NMR>,<NMR_250MHZ>,
      <created by zg, POWCHK disabled, PULCHK disabled
       configuration hash MD5:
       62 19 C7 07 E1 42 D1 B7 37 6C 3D D0 77 39 F9 E6
       data hash MD5: 64K
       FE AB 27 E9 E2 E4 A1 B0 03 2D C4 AA 77 EC EE 29>)
(   2,<2005-11-25 07:55:50.56 +000>,<MAYBRIDGE\NMR>,<NMR_250MHZ>,
      <Start of raw data processing
       ef LB = 0.3 FT_mod = 6 PKNL = 1 SI = 32K 
       data hash MD5: 32K
       5F 67 AC CB DF 8B FE E2 4E C1 2F 34 FC 21 A2 9F>)
(   3,<2005-11-25 07:55:54.23 +000>,<MAYBRIDGE\NMR>,<NMR_250MHZ>,
      <apk 
       data hash MD5: 32K
       B0 01 64 6D 88 C4 BB 99 9D 71 C9 47 97 9C 49 3B>)
(   4,<2005-11-25 07:55:55.48 +000>,<MAYBRIDGE\NMR>,<NMR_250MHZ>,
      <abs ABSG = 5 
       data hash MD5: 32K
       50 F2 24 B8 AE 5B DA 8E 34 36 E7 BB 80 AD C6 A4>)
$$ ##END=
$$ 
$$ hash MD5
$$ 8D 02 44 66 44 D2 ED A4 01 39 8A BB D7 BD D3 39
##$RELAX= 
##$RELAX= 
##$RELAX= 
##$RELAX= 
##$RELAX= 
##$RELAX= 
##$RELAX= 
$$ Bruker specific parameters
$$ --------------------------
##$DU= <C:\u>
##$EXPNO= 13001
##$NAME= <ADRS>
##$PROCNO= 1
##$TYPE= <nmr>
##$USER= <dgb>
##$AMP= (0..31)
100 100 100 100 100 100 100 100 100 100 100 100 100 100 100 100 100 100 
100 100 100 100 100 100 100 100 100 100 100 100 100 100 
##$AQSEQ= 0
##$AQ_mod= 3
##$AUNM= <au_zg>
##$AUTOPOS= <46 >
##$BF1= 250.13
##$BF2= 250.13
##$BF3= 250.13
##$BF4= 250.13
##$BF5= 500.13
##$BF6= 500.13
##$BF7= 500.13
##$BF8= 500.13
##$BYTORDA= 1
##$CFDGTYP= 0
##$CFRGTYP= 5
##$CHEMSTR= <none>
##$CNST= (0..31)
1 1 145 1 1 1 1 1 1 1 1 1 1 1 1 1 1 1 1 1 1 1 1 1 1 1 1 1 1 1 1 1 
##$CPDPRG= <>
##$CPDPRG1= <>
##$CPDPRG2= <>
##$CPDPRG3= <>
##$CPDPRG4= <mlev>
##$CPDPRG5= <mlev>
##$CPDPRG6= <mlev>
##$CPDPRG7= <mlev>
##$CPDPRG8= <mlev>
##$CPDPRGB= <>
##$CPDPRGT= <>
##$D= (0..31)
0 1 0 0 0 0 0 0 0 0.06 0 0 0 0 0 0 0.0002 0 0 0 0 0 0 0 0 0 0 0 0 0 0 
0 
##$DATE= 1132905331
##$DBL= (0..7)
120 120 120 120 120 120 120 120 
##$DBP= (0..7)
150 150 150 150 150 150 150 150 
##$DBP07= 0
##$DBPNAM0= <>
##$DBPNAM1= <>
##$DBPNAM2= <>
##$DBPNAM3= <>
$$ [...]
##$SUBNAM7= <"">
##$SUBNAM8= <"">
##$SUBNAM9= <"">
##$SW= 20.6930455092707
##$SWIBOX= (0..15)
0 0 3 0 0 0 0 0 0 0 0 0 0 0 0 0 
##$SW_h= 5175.983436853
##$TD= 65536
##$TD0= 1
##$TE= 294.16
##$TE2= 300
##$TE3= 300
##$TEG= 300
##$TL= (0..7)
0 120 120 120 120 120 120 120 
##$TP= (0..7)
150 150 150 150 150 150 150 150 
##$TP07= 0
##$TPNAME0= <>
##$TPNAME1= <>
##$TPNAME2= <>
##$TPNAME3= <>
##$TPNAME4= <>
##$TPNAME5= <>
##$TPNAME6= <>
##$TPNAME7= <>
##$TPOAL= (0..7)
0.5 0.5 0.5 0.5 0.5 0.5 0.5 0.5 
##$TPOFFS= (0..7)
0 0 0 0 0 0 0 0 
##$TUNHIN= 0
##$TUNHOUT= 0
##$TUNXOUT= 0
##$USERA1= <user>
##$USERA2= <user>
##$USERA3= <user>
##$USERA4= <user>
##$USERA5= <user>
##$V9= 5
##$VALIST= <valist>
##$VCLIST= <CCCCCCCCCCCCCCC>
##$VD= 0
##$VDLIST= <DDDDDDDDDDDDDDD>
##$VPLIST= <PPPPPPPPPPPPPPP>
##$VTLIST= <TTTTTTTTTTTTTTT>
##$WBST= 1024
##$WBSW= 4
##$XGAIN= (0..3)
0 0 0 0 
##$XL= 0
##$YL= 0
##$YMAX_a= 578101
##$YMIN_a= -482445
##$ZGOPTNS= <>
##$ZL1= 120
##$ZL2= 120
##$ZL3= 120
##$ZL4= 120
##$ABSF1= 15.12838
##$ABSF2= -5.564764
##$ABSG= 5
##$ABSL= 3
##$ALPHA= 0
##$AQORDER= 0
##$ASSFAC= 0
##$ASSFACI= 0
##$ASSFACX= 0
##$ASSWID= 0
##$AUNMP= <proc_1d>
##$AZFE= 0.1
##$AZFW= 0.1
##$BCFW= 0
##$BC_mod= 0
##$BYTORDP= 0
##$COROFFS= 0
##$CY= 12.5
##$DATMOD= 1
##$DC= 0
##$DFILT= <>
##$DTYPP= 0
##$F1P= 14.0000005364418
##$F2P= -0.99999901652339
##$FCOR= 0.5
##$FTSIZE= 32768
##$FT_mod= 6
##$GAMMA= 0
##$GB= 0
##$INTBC= 1
##$INTSCL= 1
##$ISEN= 128
##$LB= 0.3
##$LEV0= 0
##$LPBIN= 0
##$MAXI= 10000
##$MC2= 0
##$MEAN= 0
##$ME_mod= 0
##$MI= 0
##$NCOEF= 0
##$NC_proc= -4
##$NLEV= 6
##$NOISF1= 0
##$NOISF2= 0
##$NSP= 0
##$NTH_PI= 0
##$NZP= 0
##$OFFSET= 15.12838
##$PC= 1
##$PHC0= 78.59004
##$PHC1= 6.333152
##$PH_mod= 1
##$PKNL= yes
##$PPARMOD= 0
##$PSCAL= 4
##$PSIGN= 0
##$REVERSE= no
##$SF= 250.130348579637
##$SI= 32768
##$SIGF1= 0
##$SIGF2= 0
##$SINO= 400
##$SIOLD= 32768
##$SREGLST= <1H.TFA>
##$SSB= 0
##$STSI= 32768
##$STSR= 0
##$SW_p= 5175.98343685301
##$SYMM= 0
##$S_DEV= 0
##$TDeff= 65536
##$TDoff= 0
##$TI= <Analysis number 999999
Compound Code 99
Book Reference 9
Project Code 9>
##$TILT= no
##$TM1= 0
##$TM2= 0
##$TOPLEV= 0
##$USERP1= <user>
##$USERP2= <user>
##$USERP3= <user>
##$USERP4= <user>
##$USERP5= <user>
##$WDW= 1
##$XDIM= 32768
##$YMAX_p= 473597786
##$YMIN_p= -4487894
$$ End of Bruker specific parameters
$$ ---------------------------------
##NTUPLES= NMR SPECTRUM
##VAR_NAME=  FREQUENCY,     SPECTRUM/REAL,   SPECTRUM/IMAG
##SYMBOL=    X,             R,               I
##VAR_TYPE=  INDEPENDENT,   DEPENDENT,       DEPENDENT
##VAR_FORM=  AFFN,          ASDF,            ASDF
##VAR_DIM=   32768,         32768,           32768
##UNITS=     HZ,            ARBITRARY UNITS, ARBITRARY UNITS
##FACTOR=    0.157963299565203, 1,           1
##FIRST=     3784.06691826631, 0,            0
##LAST=      -1391.9165185867, 0,            0
##MIN=       -1391.9165185867, -4487894,     0
##MAX=       3784.06691826631, 473597786,    0
$$ Real data points
##PAGE= N=1
##DATA TABLE= (X++(R..R)), XYDATA
$$ [...]
30734i6785J8192K1337P881N2126L2919L879K5884l3265N274J9816k3344p1206
30722c7292K7786M6021Q339n2948J995J7869N9683L0671k1844j9732k0570j5623
30710B4355J0997N207O700M8258m586k9281j2356k1892M0693J7874j1845j4067
30698F0057j980p399k8348k3023Q3396L5451m0229n5109n5558J9238K5156L8008
30686D9660M3702k0363j8090N2283n9339m6191j362n8692k811M335J4888j4399
30674e6379L2433J7806j1460K2387q20m386J1944j7687L4740J4170o508n2085
30662a5845k4353K2823k4672M8356J0686l4454L5743J7386j9315q634k9642J3770
30650h151K6148K5293M8762j005p3774l7005l1503m4694n071K8115M9241K2232
$$ plain form
30734 -96785 -78593 -57256 -49375 2751 35670 39549 65433 32168 37442 57258 33914 -37292
30722 -37292 -9506 36515 44854 -8094 -6099 11770 71453 102124 80280 60548 39978 24355
30710 24355 35352 40559 47259 95517 90931 61650 49294 27402 68095 85969 74124 60057
30698 60057 58077 50678 22330 -693 82703 118154 77925 22816 -32742 -13504 11652 49660
30686 49660 93362 72999 54909 107192 47853 1662 300 -58392 -61203 -56868 -41980 -56379
30674 -56379 -23946 -6140 -17600 4787 3967 -419 11525 -6162 28578 42748 36240 -15845
30662 -15845 -40198 -17375 -42047 6309 16995 -17459 18284 35670 16355 7721 -21921 -8151
30650 -8151 17997 43290 92052 91047 17273 -19732 -51235 -95929 -101000 -72885 -23644 -1412
30638a412J9339l9727l6656O520M0571r461J0094J9400j6260k4286j9193K2455
30626b8616J7338P492o0242k6365O4590K561m815L6940J17000N3390j20007k7155
30614C2111k65K5750J471m9474j0074L205P182K9400J584K9047O052l6229M0911
30601H0671O2532j1344m2109J0620K9225n6679m2335k4690Q601O119L99L9245
30589F0255J9872P179k7077n5633k0413P540n6558n1707n3045J6036L9503O1082
30577e2966N1409m5488m0757K7171m0078k76L0352N4538N6342r087r5400l457
30565f7697K9163L3379l2720J1033l197n8588p152M5963O0925k1273M2094N4808
30553H6738k0882k5302k5687M651L3591j6879l3363m4163k7736N6220L381j6935
$$ plain form
30638 -1412 17927 -21800 -58456 -51936 -11365 -20826 -10732 8668 -7592 -31878 -51071 -28616
30626 -28616 -11278 -3786 -64028 -90393 -25803 -23242 -28057 8883 125883 179273 59266 32111
30614 32111 31846 57596 59067 9593 -481 2724 9906 39306 40890 69937 75989 39760 80671
30601 80671 143203 131859 89750 100370 129595 72916 30581 5891 14492 20611 21010 60255
30589 60255 80127 87306 60229 4596 -15817 -8277 -64835 -116542 -169587 -153551 -114048 -52966
30577 -52966 -1557 -47045 -87802 -60631 -100709 -100985 -70633 -16095 40247 31160 -64240 -67697
30565 -67697 -38534 -5155 -37875 -26842 -30039 -88627 -95779 -49816 11109 -10164 31930 86738
30553 86738 65856 40554 14867 19518 53109 36230 2867 -41296 -69032 -12812 -9431 -26366
30541b6366p27J0793n067m2097q855N7737L2696l539m9740P887j5402L274Q000
30528c1406K1017O4015l2036j5654J5663L2283L0203m0465j16776j8344Q2045
30517i455K4721J4174m19k2620j4262j6101M8746N3135N515m4981k1014K4498
30505D1937L2422k1541l5215m5557l1651N125L2580M242k5989n2950K7509O2376
30493f712L948l1806n645M881K0989K6767J8022j2834L386Q581p4694n2485O8576
30480b9026J1095o385L1467l9458r486O9981j5884n9955l6213l0422N8797K9920
30468b5569j3720j438K0921K0403j5580M9255M5336K4097l8644L9584j3888k9934
30456F0823N099N493m5803l2707l4349K4634L1207J4483k2917K7243N5152K2172
$$ plain form
30541 -26366 -27093 -16300 -21367 -63464 -72319 -14582 18114 14575 -35165 -27278 -42680 -39406 -31406
30528 -31406 -10389 53626 21590 5936 21599 53882 84085 43620 -73156 -91500 -9455
30517 -9455 15266 29440 29021 6401 -7861 -23962 24784 77919 83434 38453 17439 41937
30505 41937 74359 52818 17603 -27954 -59605 -54480 -21900 -17658 -43647 -96597 -69088 -6712
30493 -6712 -2764 -34570 -40215 -35334 -14345 12422 30444 17610 20996 29577 -45117 -97602 -29026
30480 -29026 -17931 -24316 7151 -32307 -41793 28188 12304 -47651 -83864 -114286 -55489 -25569
30468 -25569 -39289 -40727 -19806 597 -14983 34272 79608 103705 65061 104645 90757 60823
30456 60823 65922 71415 25612 -7095 -41444 -16810 14397 28880 5963 33206 88358 110530
30444A10530M882K588k351j7822m6398m6278j421J9624K9714l894j00131n8106
30432a09063L5958k0327k4594K3670M8360N4511N735M1705L2383K2779j5494k5359
30420G0264J7789m536J2766j5670n4937L7235l790l79M331l6398l3530k0306j0658
30407c7819M8018m5684q451K0067Q969o600J2092J25N359l462O3318M9180l7767
30394F7345j8869M3148K4730o7370L3496J10246m1175o9078o8157J295M6545k7280
30382C4876l8790l1664K3591L9941K3294K6944N4695n8593m2929J7929M459l7296
30370A6457o4781J0303j6609L2255P9085M9208J5087m8453K643l482m3146M47
30358B9014J2155m156n1557k3709k0301l142K5429J1360j8670q2633l1751J7305
$$ plain form
30444 110530 115412 118000 115649 97827 51429 5151 3730 23354 53068 49174 -50957 -109063
30432 -109063 -73105 -93432 -118026 -94356 -45996 8515 14250 55955 88338 111117 95623 70264
30420 70264 88053 83517 96283 80613 25676 62911 59121 58742 63073 26675 -6855 -27161 -37819
30407 -37819 10199 -35485 -43936 -23869 -14900 -21500 -9408 -9283 -3924 -7386 55932 105112 67345
30394 67345 48476 91624 116354 48984 82480 192726 151551 82473 14316 15611 62156 34876
30382 34876 -3914 -35578 -11987 27954 51248 78192 132887 74294 31365 49294 53753 16457
30370 16457 -48324 -38021 -54630 -22375 56710 105918 121005 72552 75195 71713 28567 29014
30358 29014 41169 37013 -14544 -38253 -58554 -61696 -36267 -24907 -43577 -126210 -157961 -140656
30346a40656n672R9647K3601J6865K1788l0924n7842K479M3021L6541k2138J2592
30334f98j1955K6372K901J6342K2177k9842q5497K3906J6710p135K8878k244J7168
30321A7083j7956k442O4742K2388j3814K4560L8417Q076n6740q5312J1093k5387
30309a5292M395M8227K4869J5894R90j7896J885m854j1909L744J9935l3871m8203
30296a2086K3048o987n79m108J3414l1950j946M6631M8458n6758k9579K3026N6683
30283F7267q817N086l3255m5169j3120L0575L4289j3441m893K8497J4121j7166
30271D3974q6632m306L3243J2738m3231k626P1454J7793m9714m8261M6402J3102
30259C936O233j543j6878j2546j307j4049q501M1163K7765N3403j6087K8649O9670
$$ plain form
30346 -140656 -146328 -46681 -23080 -6215 15573 -15351 -73193 -70714 -27693 8848 -13290 -698
30334 -698 -12653 13719 16620 32962 55139 25297 -60200 -36294 -19584 -26719 2159 -85 17083
30321 17083 -873 -3315 61427 83815 70001 94561 132978 141054 84314 -998 10095 -15292
30309 -15292 -10897 37330 62199 78093 79083 61187 63072 58218 46309 50053 69988 36117 -12086
30296 -12086 10962 3975 3396 -712 12702 -19248 -21194 25437 73895 17137 -12442 10584 67267
30283 67267 58450 63536 30281 -14888 -28008 2567 36856 23415 18522 47019 61140 43974
30271 43974 -42658 -46964 -13721 -983 -44214 -46840 24614 42407 -7307 -55568 -9166 3936
30259 3936 10169 8626 -8252 -20798 -22105 -36154 -44655 -3492 24273 77676 61589 90238 159908
30246A59908P992l1839n7430K1626q917n0214j0189r540L0629j2580K882m6670
30234d342k7369j6463J8116n0459M2691P1165l6041k0658l3058l5936Q191M0526
30222d3637P1819J7536Q720J690m9927j2724J0136L794j8072K2628M0561L8531
30210I1055L3260L5631n4997m9824m2781k1243J1020J8392N346N280J801l5249
30198b309K4869M1257r967m3509j8575p056m6893l0969N8419L1252Q012n4569
30186e0038l6975J452J6973J3165K7925N3981K3109J1065J7539m4302m9900J74
30174a5832L072J965K0921J7874p355n636L499J0651n3177l9146L1526J7747l1102
30161d4993J6978Q015M1494L878J9153N064j8228P196p02p634k6328k8959k2603
$$ plain form
30246 159908 167900 136061 78631 100257 91340 41126 30937 21397 52026 39446 42328 -4342
30234 -4342 -31711 -48174 -30058 -80517 -37826 33339 -2702 -23360 -56418 -92354 -84163 -43637
30222 -43637 28182 45718 54438 56128 6201 -6523 3613 7407 -10665 11963 52524 91055
30210 91055 124315 159946 104949 55125 12344 -8899 2121 20513 25859 31139 32940 -2309
30198 -2309 22560 63817 53850 10341 -8234 -15290 -62183 -93152 -34733 -3481 4531 -50038
30186 -50038 -87013 -85561 -68588 -55423 -27498 26483 49592 60657 78196 33894 -16006 -15832
30174 -15832 -12760 -10795 10126 28000 20645 15009 18508 29159 -24018 -63164 -31638 -13891 -44993
30161 -44993 -28015 -20000 21494 25372 44525 49589 31361 38557 37855 30221 3893 -25066 -47669
30148d7669K6382K3266j3545j4517l2733M7292N237l9194n091j1763L0361L3682
30136A708O851K5539r485o3536j5516O1099K7024J9640j167k65k6273k8602l5289
30123c8272j8230J0331M6153k2744q726K5244M0039J4696L717J0356J8930J1937
30111I3431L3442k040j07092q5270M2261N3037q38k6168L850n250N75J1527j2912
30098a447l772l4434J4767J9359M7927M542j7320L2372n1271l7277R030j9666
30086c7190j7633L5035K1313l9370J9574J3025K8691j4704M0487O988l8916p598
30074I702l8694j3540l970R313J2936K6129O767k1843m3585j2927M0016L7075
30062G379l8180o892J2750l433O2006L1111K3444q3n3451L4713M4992k7935l2528
$$ plain form
30148 -47669 -21287 1979 -11566 -26083 -58816 -11524 -6287 -45481 -50572 -62335 -31974 1708
30136 1708 8559 34098 24613 -38923 -54439 6660 33684 53324 52157 51892 25619 -2983 -38272
30123 -38272 -56502 -46171 -18 -22762 -31488 -6244 33795 48491 52208 62564 81494 93431
30111 93431 126873 124833 17741 -67529 -25268 27769 26931 763 4613 -637 -62 11465 -1447
30098 -1447 -5219 -39653 -24886 -5527 42400 46942 29622 61994 10723 -26554 -17524 -37190
30086 -37190 -54823 -19788 1525 -37845 -18271 -5246 23445 8741 49228 56216 17300 9702
30074 9702 -28992 -42532 -46502 -37189 -24253 1876 8643 -13200 -56785 -69712 -29696 7379
30062 7379 -30801 -37693 -24943 -28376 33630 64741 88185 88102 34651 69364 114356 86421 53893
30049E3893K3077l1380o6377n9485m4040k3024O0240N996K716O6517j465j6028
30037b9360k6356k4552j4586N0985L2800L0802J592l4613k3907L1796K5587M7332
30025F7520J7037j8535k2022k7528M504K6336J2060K8924L2961n2878q6421l1475
30013d9517m083j3844K7641L9305P235N3715J8803m3207o9123k1618M5174j2901
30001b2420m5016J2830L2022P5835K9078K5947l931k890k7782l0858o694m0756
29989d635o8490L7983P8116n2310n2943j6811P0863P6369P126M1232l5719k7398
29977E3383k11N066m6418k2708m2216m359L3356K0605J5827J1070n3908k7237
29965e7750L8902L5701k7260o1733q511J2233J479O0515L1622K9886J4248p696
$$ plain form
30049 53893 76970 45590 -20787 -80272 -124312 -147336 -87096 -81100 -78384 -11867 -13332 -29360
30037 -29360 -55716 -80268 -94854 -43869 -11069 19733 21325 -13288 -37195 -5399 20188 67520
30025 67520 84557 66022 44000 16472 20976 47312 59372 88296 121257 68379 -18042 -49517
30013 -49517 -53600 -67444 -39803 -498 6737 60452 79255 36048 -33075 -54693 -9519 -22420
30001 -22420 -67436 -54606 -22584 53251 82329 108276 104345 101455 73673 42815 36121 -4635
29989 -4635 -73125 -35142 42974 -9336 -62279 -79090 -8227 68142 75268 116500 80781 53383
29977 53383 53172 58238 11820 -10888 -53104 -57463 -24107 -3502 12325 23395 -30513 -57750
29965 -57750 -18848 16853 -10407 -72140 -80651 -68418 -66939 -6424 25198 55084 69332 61636
29953F1636K189k2768n971k0116k3153j9027o75m165M1430R9455J2332p1950n7826
29940h609J1836J926M7734M3713k7261k9441l4798n3991k2664M4418N6495l2682
29928c324j6847K0909L3450K2821n0718l1628L8080K9022O291r780k7157m9970
29916c8851Q145Q883N8561o9531m2652N760O4994P3608L5320k6881m0934n290
29904C1132j6667n363N427J2756J1740r436n0613k0525j4795K715K1387L8602
29892F360L7648m9041l4660L999J9559J4402J1651r198L1282l1249j4233m6648
29880f0128K2288j3389L9301K9833P702k545J5151l5358j3247L0889M9241m786
29868F4952l1339p0550K7947K7960M194J5280k2108n5215l1519K5245K3931J3338
$$ plain form
29953 61636 63825 41057 35086 14970 -8183 -27210 -27885 -32050 9380 108835 121167 49217 -8609
29940 -8609 3227 5153 52887 96600 69339 39898 5100 -48891 -71555 -27137 29358 -3324
29928 -3324 -20171 738 34188 57009 6291 -25337 12743 41765 48056 38276 11119 -38851
29916 -38851 -30706 -21823 36738 -32793 -75445 -69685 -4691 68917 104237 77356 36422 31132
29904 31132 14465 9102 14529 27285 39025 29589 -21024 -41549 -56344 -53629 -32242 6360
29892 6360 44008 -5033 -39693 -35694 -16135 -1733 9918 720 32002 753 -13480 -60128
29880 -60128 -37840 -51229 -11928 17905 25607 23062 38213 2855 -10392 20497 69738 64952
29868 64952 33613 -36937 -8990 18970 23164 38444 16336 -38879 -70398 -45153 -21222 -7884
29856g884L99j4833J354k0830r063j6722m510J9296k5898j2009O9862K9539K6864
29843C5565K6061J4979K9026j4170n7648l0887k0414k2406N693L2534K9777L458
29831C1568k8636o224r326N6460J2431m0056J4696k0699K0304J852N509M6470
29819H4349K6519P124J4813j13155r5201P473K8922O6748Q344J380n8076n5994
29807g6754M4198m457q0992k9563L1204j9768K2999K4417K1662J0593L4889k2131
29795d3703k0423L7586Q9893P955o0619J7649n9250n8416K326K1446J4311L4397
29783a6848o138R13K0751N6061p448m3998L6020M5769Q194n014q6961k2391m488
29770b5578j593L6380O7793j1557j4408j8841Q559K2529J6015l4466m6149K5173
$$ plain form
29856 -7884 -7485 -22318 -20964 -41794 -50857 -67579 -72089 -52793 -78691 -90700 -20838 8701 35565
29843 35565 61626 76605 105631 91461 33813 2926 -17488 -39894 -34201 -1667 28110 31568
29831 31568 2932 -3292 -12618 43842 56273 16217 30913 10214 30518 32370 37879 84349
29819 84349 110868 117992 132805 19650 -75551 -68078 -39156 27592 35936 37316 -20760 -76754
29807 -76754 -32556 -37013 -118005 -147568 -116364 -136132 -113133 -88716 -67054 -56461 -21572 -43703
29795 -43703 -64126 -26540 63353 71308 10689 28338 -30912 -89328 -87002 -65556 -51245 -16848
29783 -16848 -22986 -22073 -1322 54739 47291 3293 39313 85082 93276 88262 1301 -21090 -25578
29770 -25578 -27171 9209 77002 65445 51037 32196 40755 63284 79299 44833 -1316 23857
29758B3857L261L6525L6636k2497o8826K2153j266j1269K1974o1321j7600k2995
29746f1368j4426K4740K4386K4120P707L0883Q45n452m8069m5229K4161L3705
29734c997m0748l2811J4998q165K3283M9157j9982j8355M4388P240p7307o1262
29722a23561n34J4427O1076K7679O1350M8500K5500j3717N789L8155k7327k6398
29710I0939l3410m0822p626K8418K7462J5359m8161N563K956l5822M7716J0886
29698F3458N527L1886k4179j8704k1182p7415J4752L2420P0881Q675m1350j2159
29686C2610L1365j5464k6067L5613J7236j6880o9552m4327J2319M3909L7331M1561
29674G9654k8484n0893P734K2563J533p3835n2075N1768M0358l8874K1648O1184
$$ plain form
29758 23857 27118 63643 100279 77782 8956 31109 29843 18574 40548 -20773 -38373 -61368
29746 -61368 -75794 -51054 -26668 -2548 5159 36042 36887 31435 -16634 -61863 -37702 -3997
29734 -3997 -44745 -77556 -62558 -70723 -47440 1717 -18265 -36620 7768 15008 -62299 -123561
29722 -123561 -124095 -109668 -48592 -20913 40437 88937 114437 100720 106509 144664 117337 90939
29710 90939 57529 16707 9081 37499 64961 80320 32159 37722 40678 4856 52572 63458
29698 63458 68985 100871 76692 57988 36806 -40609 -25857 6563 77444 86119 44769 32610
29686 32610 63975 48511 22444 58057 75293 58413 -11139 -55466 -43147 762 38093 79654
29674 79654 51170 277 8011 30574 32107 -41728 -93803 -42035 -1677 -40551 -18903 42281
29662D2281M0636o0974n0814k4736M9512J7699l2515P752M7158N0626K2158r907
29650I8876N7485k3083k7119J8904k4286m1236l2940n250K6307l8362j3178M6346
29638D2464M752r305o3134P073K6092n361n0908l3666L0265M7365q234K878L8058
29625B8339J1122J881Q060j3245K1005j1750l3564k167k5432J8871J3352M0509
29613E6981j1021n6533M7165k884l5511M6568K458J1365m272l8393n1561O2911
29601B7273K9668n6598l3831k4947K2963K1340K471o656L0790N015l1136P562
29589f086l0962j1344J7376K3332K0033L2429J2117m3165J4138J8213K4137k4419
29577D5799l5843k9331r098j650k0134k5611P4530M9242l4651j1724J8043L9059
$$ plain form
29662 42281 82917 21943 -28871 -53607 -4095 13604 -18911 -11159 35999 86625 108783 98876
29650 98876 156361 133278 106159 125063 100777 59541 26601 21351 47658 9296 -3882 42464
29638 42464 47216 37911 -25223 -18150 7942 2581 -48327 -81993 -51728 -4363 -12597 -9719 28339
29625 28339 39461 41342 49402 36157 57162 45412 11848 9681 -15751 3120 16472 56981
29613 56981 45960 -10573 36592 33708 -1803 44765 47223 58588 54316 15923 -35638 27273
29601 27273 56941 343 -33488 -58435 -35472 -14132 -11661 -18317 12473 17488 -13648 -6086
29589 -6086 -37048 -48392 -31016 -7684 12349 44778 56895 13730 27868 46081 70218 45799
29577 45799 9956 -19375 -28473 -30123 -50257 -75868 -1338 47904 13253 1529 19572 58631
29565E8631k5655j9508J1060L1499J9375o0728l5627M3324M3852J7482l7899o5133
29553a9327k5483L6261K0447n15n0184r85J9297M7192M2144j1513J8835M3513
29541A19682j8733o2904l6636M2974N3887l3678o2932j8691m23M4462R598l3438
29529C168M423o931q389K3405J7378J9267J622L0083j6299l0516l8305n531j7502
29516b4127j4469m498k3962M1028J07766L3437o9024n1639p452K3708J1534K1747
29504D4049L757m2347j9406n281j9642M6441O122r5094O025L0429R1341O822k1155
29491C2061q896k6304K5224M5821j2629J2055m4121k0749J6141J1691m709q9638
29479f4053l6823N0385J4474M4078P348j3286k3411M2336P784M3099K1885j9502
$$ plain form
29565 58631 32976 13468 24528 56027 75402 14674 -20953 22371 66223 83705 45806 -19327
29553 -19327 -44810 -8549 11898 11383 -38801 -39786 -20489 26703 68847 57334 76169 119682
29541 119682 100949 38045 1409 44383 98270 64592 1660 -17031 -17454 27008 36606 3168
29529 3168 7591 660 -7729 15676 33054 52321 53943 84026 67727 37211 -1094 -6625 -24127
29516 -24127 -38596 -43094 -67056 -26028 81738 115175 46151 -5488 -12940 10768 22302 44049
29504 44049 47806 5459 -13947 -19228 -38870 7571 13693 -81401 -75376 -44947 46394 53216 32061
29491 32061 23165 -3139 22085 67906 55277 67332 23211 2462 18603 30294 25585 -64053
29479 -64053 -100876 -50491 -36017 8061 15409 2123 -21288 21048 28832 71931 93816 74314
29467G4314n0262k4959k0130O0806j6957k2287k8788M5922j750l4479M619l3641
29455d7592M2371J4283k3597n0250j9992k064M2693N1948L8551m4256k9126K012
29443b5019m9986J8900L1265J030j8144N9435L4524k0980K989k0164R277M4421
29431F7548k0663l0904L468J3527J8925M956J2508M441o118K0763J0085k058o0225
29418C6253o3301l0965J2019O8837K6217l3515j678k5180k6503J9563M4638r843
29406A6542m6524m2268n2749K4652K5349J2756J1431k9982m419L8179K9348J8872
29394A187N3081R5548o1611m2167K7368M553m3341n5768k152k3953K0851J8960
29382g444O0672l7040n0135J7553L3476J937k2388j3986j8471K3418K312j5704
$$ plain form
29467 74314 24052 -907 -21037 39769 22812 525 -28263 17659 15909 -18570 -13951 -47592
29455 -47592 -5221 9062 -14535 -64785 -84777 -86841 -44148 7800 46351 2095 -27031 -25019
29443 -25019 -75005 -56105 -24840 -23810 -41954 17481 52005 31025 34014 13850 23127 67548
29431 67548 46885 15981 19449 32976 51901 56857 69365 73806 67688 88451 98536 96478 36253
29418 36253 -27048 -58013 -45994 22843 49060 15545 13867 -11313 -37816 -18253 26385 16542
29406 16542 -29982 -72250 -124999 -100347 -74998 -62242 -50811 -80793 -85212 -47033 -17685 1187
29394 1187 54268 149816 88205 46038 73406 77959 34618 -21150 -23302 -47255 -26404 -7444
29382 -7444 53228 16188 -33947 -16394 17082 19019 -3369 -17355 -35826 -12408 -10096 -25800
29370b5800L709M4330N2012m249q0867k7910M2571K0764J6952K46k6805r2354
29358g7401k6519M7406K6031M2313N8382j3062o840L1777l272m3491J1472L835
29346E0631k339m1740r290O0604L2660q514p113l8738p5332K1645K2897j074J2472
29333A6769L4094N0932J4693j1366j2023n443k9552n3889M4109K0239J7007K2424
29321A07994J4598o5791p2018k5346O1612K8348o72K792n571J5526J1114l9434
29309C3152K8287j210N480m3559J4405n007j1000J1596j467m430k5567j4443r041
29296b2804n947J47N4491P2126j7379j0465p546l0123o9422n4427J6889L8495
29284c5965M3839j2505K2723N4255l7454l8581r572m9611J5976L6807n377l1456
$$ plain form
29370 -25800 -22091 22239 74251 70002 -10865 -38775 3796 24560 41512 41758 14953 -77401
29358 -77401 -103920 -56514 -30483 11830 70212 57150 50310 82087 78815 35324 46796 50631
29346 50631 48292 6552 -2738 57866 90526 82012 74899 36161 -39171 -17526 5371 4297 16769
29333 16769 50863 101795 116488 105122 93099 87656 58104 4215 48324 68563 85570 107994
29321 107994 122592 56801 -15217 -40563 21049 49397 48725 51517 45946 61472 72586 33152
29309 33152 61439 60229 65709 22150 36555 31548 20548 32144 30677 26247 680 -13763 -22804
29296 -22804 -28751 -28604 25887 98013 80634 70169 62623 32500 -36922 -91349 -74460 -35965
29284 -35965 7874 -4631 18092 72347 34893 -3688 -13260 -62871 -46895 -10088 -15465 -46921
29272d6921j3085M9684N447L7634M3589j8567j3488k9514l8765r266K9517J0286
29260F551l968k170J9949J2876j6J4592k8020k238l3107J9638k4174l0915l797
29247e4799J2356K4737j4186K8674L3538K4204J3201L497l5464J8968p907O874
29235E3693k178j9266m5106m9052M1261O211R649K0381O6523K7080j1357l1532
29223F6307j8419l9211J695L8501n4347k6988L7573J3226k7903l4638O7046M3722
29211F6564k8689O685k1836l5446o293L6503m136K4609k7260j2334r985M3561
29199C1943P7145L5855l7227l3961K774k5627r043N968j8245J0476k2466m4995
29187b7403q138k050Q9654K5355M847k8237q767m6927l1013k4110J7437J6441
$$ plain form
29272 -46921 -60006 -10322 -4875 32759 76348 57781 44293 14779 -23986 -33252 -3735 6551
29260 6551 2583 413 20362 33238 33222 47814 19794 17556 -15551 4087 -20087 -51002 -54799
29247 -54799 -42443 -17706 -31892 -3218 30320 54524 67725 71222 35758 54726 46819 53693
29235 53693 51515 32249 -12857 -61909 -20648 -14437 -4788 15593 82116 109196 97839 66307
29223 66307 47888 8677 10372 48873 -5474 -32462 5111 18337 -9566 -44204 22842 66564
29211 66564 37875 44560 22724 -12722 -19015 17488 13352 37961 10701 -1633 -11618 31943
29199 31943 109088 144943 107716 73755 76529 50902 41859 47827 29582 40058 17592 -27403
29187 -27403 -35541 -37591 52063 77418 82265 54028 45261 -1666 -32679 -56789 -39352 -22911
29175b2911l0658N9003L0264k5546l6073j9877J5986L2028P0440K0924k4470p3532
29163d422o0964L5660M8313L4658J8323L7620k7748p8281l0446q345R88m121j2423
29150e1188k8399k8009M3809q98o2957K7570L0934O103l572J1341N9286O7934
29138G1954l3474n0381j4908M0561K0809L0487R224l2826o2745n1476M1993L1947
29126A165k0794L243J849K076k879K0635j0015k2544L23M2368M9616K9678J2933
29113A07654j8284l8085l4277K8693P3190J4737n0895m6922k012j1477o4959k9162
29101g1799J9376K3227N6471n4382R75R71P2637K5614j8777J2548l1929m517J9174
29088D9589k505k6342J3501j1447L3485l3736n8241J7266J8958n872L9762N2202
$$ plain form
29175 -22911 -53569 5434 35698 10152 -25921 -45798 -29812 2216 72656 93580 69110 -4422
29163 -4422 -65386 -29726 18587 53245 71568 109188 81440 3159 -27287 -35632 -34644 -38765 -51188
29150 -51188 -79587 -107596 -63787 -64685 -127642 -100072 -69138 -63035 -66607 -55266 4020 71954
29138 71954 38480 -11901 -26809 13752 34561 65048 74272 41446 -21299 -72775 -30782 1165
29126 1165 -19629 -16386 -14537 -12461 -15340 5295 -4720 -27264 -26941 15427 65043 94721 107654
29113 107654 89370 51285 17008 45701 118891 133628 82733 35811 33799 22322 -42637 -71799
29101 -71799 -52423 -29196 27275 -27107 -26132 -25161 47476 73090 54313 66861 34932 30415 49589
29088 49589 47084 20742 34243 22796 56281 22545 -35696 -18430 528 -5344 34418 86620
29076H6620o5163k5817o232M2280K1694j4581j3513n876l6944l6408L2771p53
29064b1922K2655j4117Q942K9954L9876l5520o8648o732L3935N1441M372N264
29052D9500J5328o459k7804m9397N6203P0017l9381n5236o03k906J0784P3159
29040I3205k6152o8602l4861k1782n2420J530L1515M9383L7618K9475j6717n6690
29028c4498Q587n56N5615L0983n4987l9087P987l37k7362l9869J9012J09662J8716
29015E3866k4187O945j5106m0647K8520M8327l9539n1640j3044L8702l117K6688
29003A5768j477k1433J934r179K6744n1545j2453p193K2611M481o915J9183N1383
28990C1909j2106l5844J804k2644m166M7583N3018l566k2733k0490O904q30J1947
$$ plain form
29076 86620 21457 -4360 -10592 31688 53382 38801 25288 19412 -17532 -53940 -21169 -21922
29064 -21922 733 -13384 -4442 25512 65388 29868 -38780 -45512 -11577 39864 44236 49500
29052 49500 64828 58369 30565 -18832 37371 107388 68007 12771 12168 9262 20046 93205
29040 93205 67053 -1549 -36410 -58192 -110612 -109082 -77567 -28184 9434 38909 22192 -34498
29028 -34498 -25911 -26467 29148 60131 5144 -33943 -25956 -26293 -53655 -93524 -74512 35150 53866
29015 53866 29679 36624 21518 -19129 9391 57718 18179 -33461 -46505 -7803 -10920 15768
29003 15768 14291 -7142 -5208 -14387 12357 -39188 -51641 -58834 -36223 -31742 -38657 -19474 31909
28990 31909 19803 -16041 -14237 -36881 -41047 6536 59554 55988 33255 12765 19669 18839 30786
28977C0786l2093K0821J5280m8361m1841J6405K4682J1295K428j9123j3579j7208
28965e0508k7878n150M4092K3789L4282q539o4461L7290J7362O425j9595m518
28953a7409l2819k9672q081N0130L5164O770j6735k4771K3780O4396L7596l9163
28941D9186o7623l2970J9933j2681M0971M2973j8497K4980K2180n3866n5674K7344
28929a3744L7241J3344M6785l3422l8451R126k416r809j1400r87o3617l3236K8914
28916g1672M2241J7312m1267k375m047R47j7720L0267J548q513P2173O0350m4217
28903C5027o0586o199j9427p6931K0859j5637N672L7807K5092L0423K0346l160
28891f714L257L9826P2806j1077k690l3273m2029l921j0528N280J6211j2889j101
$$ plain form
28977 30786 -1307 19514 34794 -13567 -55408 -39003 -14321 -3026 -598 -19721 -33300 -50508
28965 -50508 -78386 -83536 -39444 -15655 18627 10088 -54373 -17083 279 6704 -12891 -17409
28953 -17409 -50228 -79900 -87981 -37851 -2687 4083 -12652 -37423 -13643 50753 88349 49186
28941 49186 -18437 -51407 -31474 -44155 -3184 39789 21292 46272 68452 14586 -41088 -13744
28929 -13744 23497 36841 83626 50204 11753 20879 18463 8654 -2746 -3733 -67350 -100586 -71672
28916 -71672 -29431 -12119 -53386 -55761 -59808 -58861 -76581 -46314 -44766 -53279 18894 79244 35027
28903 35027 -25559 -31758 -51185 -128116 -107257 -122894 -117222 -79415 -54323 -23900 -3554 -6714
28891 -6714 -3457 36369 109175 98098 95408 62135 20106 16185 5657 10937 27148 14259 13158
28878A3158j229N3739j9373n9119o6355j1590l1742r986R0347N5508K7812l4175
28866F995O272L1522J1502n686m4517k7475j8012L2002P3851K5873l824l0829
28854E7674k8206M755p065k5120m7039J3383K2023k4470l1541R638K0805q774
28842d3937k6060K3455J4686j2497l6334L5279L1744K0460J7112K7175k4514l7262
28830a0693K7510J6223K8981k0080J0677n2331j3252O949k727J6521o219j322
28818B37M6476j3224m3353K3832m0432J4696M2993o2167J3968P993p2948j8019
28806i9948J3540j658k0798P5220J5114j0001j8955L3131j9633J451p217L7488
28794b266L758l882j3071J3415J2382q8505l0883O685j4387r230O2163N0157M5702
$$ plain form
28878 13158 11929 65668 46295 -12824 -79179 -90769 -122511 -132497 -42150 13358 41170 6995
28866 6995 13267 44789 56291 50605 6088 -21387 -39399 -7397 66454 92327 88503 57674
28854 57674 29468 34223 27158 2038 -45001 -31618 -9595 -34065 -65606 -55968 -35163 -43937
28842 -43937 -69997 -46542 -31856 -44353 -80687 -45408 -13664 6796 23908 51083 26569 -10693
28830 -10693 16817 33040 62021 41941 52618 287 -12965 -6016 -8743 7778 1559 237
28818 237 46713 33489 -9864 13968 -26464 -11768 31225 -30942 -16974 -8981 -81929 -99948
28806 -99948 -86408 -88066 -108864 -33644 -18530 -28531 -47486 -14355 -33988 -32537 -39754 -2266
28794 -2266 1492 -2390 -15461 -2046 10336 -78169 -109052 -102367 -116754 -125984 -63821 -13664 32038
28781C2038P337L4971k3277k0493j7309l311O703p7409m798K4075n780M1987J5079
28768I813l00j5307K2082K1370P723m7440o940j682N6375j863L2603K537k443
28755G6528O9455n4193k4012M595O086l2678j3603k6254n9122k331K9185j1154
28743c7498q465K5814L0429L3191p142o6855j8143P698K87k2567m8546J0720J6408
28730h4669L6588J9774r434j9062K5544M00N542N1013J1833j1046k438n573J2074
28717C0546j4270k3765k0796M0889l9437J6770j6162J4218J3796k6186L190P247
28705a3960K178j7096k0118J3850L5950M7163J5884r45n3461n3242m6353j14241
28693b04391j0596L8617M0277K7206N4298J5712O832N3536j4595P442m7755J28
$$ plain form
28781 32038 39375 74346 51069 30576 13267 9956 16659 -60750 -65548 -41473 -47253 -5266 9813
28768 9813 9513 -5794 16288 37658 45381 -2059 -8999 -10681 45694 43831 76434 78971 76528
28755 76528 145983 91790 67778 72373 78459 45781 32178 5924 -53198 -55529 -26344 -37498
28743 -37498 -45963 -20149 10280 43471 36329 -30526 -48669 -40971 -40684 -63251 -111797 -101077 -84669
28730 -84669 -48081 -28307 -37741 -56803 -31259 -30859 -25317 25696 37529 26483 24045 18472 30546
28717 30546 16276 -7489 -28285 12604 -26833 -10063 -26225 -12007 1789 -24397 -21207 -13960
28705 -13960 -11782 -28878 -48996 -35146 804 47967 63851 62906 9445 -43797 -90150 -204391
28693 -204391 -214987 -176370 -136093 -108887 -54589 -38877 -32045 21491 6896 14338 -33417 -33289
28681c3289l783k6941o36K5601k921o814L8259j1254j0214M5417K4520o6876M4512
28668A5581M2107J1834k6832j9067M976L1326L1848m558l3563K2739M6364p155
28656A15600n3613J7853n699K5146O66m2380l5959M8107P154n0402M215j5132
28644A5556O461N5693n6697q0874Q409N1963M5264L9372k0301l6017O317j1171
28632B3975o654k4699K4794K1975j0138L043J0788n6430o2420k083L4112L6939
28620f798l2963j9003l1449K5463J8135J6798m2923J336J3383Q328k0285K2527
28608d7451J2787r278q185k8406k9517K525M1723Q642J6235K9300J2593M941k3395
28595a7486q057J6017j1979N8049L3176o5900o2514j2541M8290K108k4359L7861
$$ plain form
28681 -33289 -37072 -64013 -64649 -39048 -41969 -48783 -10524 -21778 -31992 13425 37945 -28931 15581
28668 15581 57688 69522 42690 23623 28599 59925 91773 87215 53652 76391 122755 115600
28656 115600 61987 79840 74141 99287 99953 57573 21614 69721 76875 26473 30688 15556
28644 15556 22017 77710 21013 -59861 -51452 511 45775 85147 64846 28829 35146 23975
28632 23975 17321 -7378 17416 39391 29253 32296 43084 -13346 -75766 -77849 -43737 -6798
28620 -6798 -39761 -58764 -90213 -64750 -46615 -29817 -72740 -71404 -58021 -49693 -69978 -47451
28608 -47451 -34664 -43942 -52127 -80533 -110050 -107525 -65802 -57160 -40925 -11625 968 5909 -17486
28595 -17486 -25543 -9526 -21505 36544 69720 3820 -58694 -71235 -22945 -20837 -45196 -7335
28583g335k4485m9132N5122K9420j2240n796M1909J1209J5867K1906j659l5315
28571C9471l7021m1346J2454R6077N3450m0353k1408N6970m03j5978P938n2508
28559E7343j5935o922j0281j4086k2882J7106J034j8800j6214O0431N1144k3721
28547E8217j1801j8954j9251n0403M8056L2536k1903r0059K7290N7171J6960k4497
28535C362k9407n3079K0991J1219K9677K0589O336R080J9300J0860k8321j3408
28523G199N8152o518o1517j7702k130J7499M4229L2509L593n920K2442M420j1889
28510H4367l6748J5639K7244P735j1511o399J8378k1378j6586L2306q599j2253
28498G2195l4628K1797K3445p4849j4182J12624L6739n6062l2928K2825J361m3206
$$ plain form
28583 -7335 -31820 -80952 -25830 3590 -8650 -14446 27463 38672 54539 76445 74786 39471
28571 39471 2450 -38896 -26442 69635 123085 82732 61324 118294 117891 101913 109851 57343
28559 57343 41408 34486 24205 10119 -12763 4343 5377 -13423 -29637 30794 81938 58217
28547 58217 46416 27462 8211 -42192 5864 38400 16497 -73562 -46272 10899 27859 3362
28535 3362 -26045 -79124 -58133 -46914 -17237 3352 9688 18768 38068 48928 20607 7199
28523 7199 65351 58833 -2684 -20386 -22516 -5017 39212 71721 75314 69394 91836 96256 84367
28510 84367 47619 63258 90502 98237 86726 80327 98705 77327 60741 93047 84448 72195
28498 72195 37567 59364 82809 7960 -6222 106402 143141 87079 54151 76976 78337 35131
28486C5131j764N4102m4165r1728n8726j3402L6560O1595R610K233Q851O6117
28474F4414J5769k5360k243j5316l3513k8405k2268L1061o974Q495k2281j7798
28462e4419M0474K9682K5593k1849r924J9280k1079l4012k6638L4686m702R876
28450a3032k7766O349R219l0104J0736J5176j785M378k1084R853q263M579Q555
28437c3189M7764N3685j3437J705N7639L1212j757j3228q0535p6582j1004M4615
28425F888K4331K200m9800N066O1006J3139j6224j5300K2079j4542m2863n6203
28413f0223J5491L1184N0559N448k9053M8499K5760o4340r156M8155L0671K3288
28401A16283k1721j1886m952J2501k5270j6966K4229j9307j4569k2806m0451L7821
$$ plain form
28486 35131 33367 87469 43304 -48424 -107150 -120552 -83992 -22397 -12787 -10554 -1703 64414
28474 64414 80183 54823 52580 37264 3751 -24654 -46922 -15861 -22835 -14340 -36621 -54419
28462 -54419 -13945 15737 41330 19481 9557 28837 7758 -26254 -52892 -18206 -22908 -13032
28450 -13032 -40798 -34449 -25230 -55334 -44598 -29422 -31207 -26829 -47913 -38060 -46323 -41744 -33189
28437 -33189 14575 68260 54823 56528 114167 145379 143622 130394 49859 -26723 -37727 6888
28425 6888 31219 33419 -16381 -11315 49691 62830 46606 31306 53385 38843 -4020 -60223
28413 -60223 -44732 -13548 37011 42459 13406 61905 87665 23325 14169 62324 92995 116283
28401 116283 94562 82676 77724 90225 64955 47989 72218 52911 38342 15536 -24915 12906
28389A2906j6809j5629K4669K0995K6081k5887q3208l1747l4518M8498K6417L0
28377d8202L3464k9864n4770o200L7794Q136o807q823K0024J475r688j758N1019
28364a4200L9053M4414M920j1895l3855m6827p4521K7625M2579j1145M3015j1706
28352b543n3087J1285K6149j157l9586n0062R225L4161L4505R940m8228M949k1250
28339h5699k0682J6059N3866R996K3597L4300M0573K5407j4656N6069l4154q4618
28327B0058k1785L5880J428K828p441m5249m0393k1214M5035K9410O609k5570
28315b0404K500o3376q850L5621k6871j9926R2385K8270k7963J366m319k3793
28303c5360l9j128j8917M1553N5676l50j6341J8086p213M2988K7768j8506J7497
$$ plain form
28389 12906 -3903 -19532 5137 26132 52213 26326 -56882 -88629 -123147 -74649 -48232 -48202
28377 -48202 -14738 -44602 -99372 -105572 -67778 -59642 -66449 -75272 -55248 -53773 -63461 -65219 -14200
28364 -14200 24853 69267 74187 62292 28437 -18390 -92911 -65286 -22707 -33852 9163 -2543
28352 -2543 -55630 -44345 -18196 -19353 -58939 -109001 -99776 -65615 -31110 -21170 -69398 -64449 -85699
28339 -85699 -106381 -90322 -36456 -26460 -2863 31437 72010 97417 82761 138830 104676 20058
28327 20058 -1727 34153 35581 38409 30968 -14281 -54674 -75888 -30853 -1443 5166 -20404
28315 -20404 -17904 -81280 -90130 -54509 -81380 -101306 -8921 19349 -8614 -7248 -11567 -35360
28303 -35360 -35399 -36527 -55444 -13891 41785 41435 25094 43180 35967 78955 106723 88217 105714
28290A05714n7350n4748k1840n005J3995k713l5510K988K6107M1781q06m5333
28278c2720k1874K2755m160K5743p514k1855j7568k0792J7788q587k8368J5595
28266h1557J7551p948P8847K9561K476o0833l4661N9009M926j0417O4538n5244
28254F248l7673J9000O5233K9256j4448j5799k3455J5276n4980L416j2263k3301
28242d3490M3589M1349l6359m1977K13j17N5954P1709k3799k4473K7307L0360
28230A00266q367R531k0549m6570j7818j4388Q909J7301K3607K2748n2554m2612
28218b0496N16K0047L1710l638k4305o640j4288n995Q140K6762j2123j7165K6124
28205H649J9262L2258n1193l0675k7313k7033k928K4555j6275K3624k665Q238
$$ plain form
28290 105714 48364 -6384 -28224 -33229 -19234 -21947 -57457 -54469 -28362 13419 12613 -32720
28278 -32720 -54594 -31839 -35999 -10256 -17770 -39625 -57193 -77985 -60197 -68784 -97152 -81557
28266 -81557 -64006 -71954 6893 36454 38930 -21903 -56564 2445 7371 -3046 61492 6248
28254 6248 -31425 -12425 52808 82064 67616 51817 28362 43638 -11342 -7926 -20189 -43490
28242 -43490 99 41448 5089 -36888 -36675 -36792 19162 90871 67072 42599 69906 100266
28230 100266 91899 101430 80881 34311 16493 2105 11014 28315 51922 74670 22116 -20496
28218 -20496 -19980 67 31777 28139 3834 -2806 -17094 -23089 -14949 11813 -310 -17475 8649
28205 8649 27911 60169 8976 -21699 -49012 -76045 -78973 -54418 -70693 -47069 -49734 -41496
28193d1496N2404j0034q353O2095J5130J6956M9486p5705n3097k0830K7541K1038
28181C5135o74k3957r79L3065m0977l1041K6456l0025k5732Q902K8972k3421k2248
28168f6524J1148Q121j8959K5409J6959M0356K6920j5998L244k371P735m7342
28156a1302J3394O8586k0359n4068K4877J1410q608k6016m6961m6522J6192j4242
28144i3619l318Q5406j6623Q830L9789O3277L3515K1006k6335r8553k4908j2823
28132b4356J605L1614K0746N552o3429n7144k7312n664m0987L7330L4836J9747
28120f7462K3013j81J9859k3426O1827N4530J4438l4034j7620j4830m6528r842
28108d0256k736L6627J6417k3183o6979n1444M926N0041O9132K9805k4752n5651
$$ plain form
28193 -41496 10908 874 -7479 54616 69746 86702 136188 60483 7386 -13444 14097 35135
28181 35135 34461 10504 9525 42590 1613 -29428 -2972 -32997 -58729 -49827 -20855 -44276 -66524
28168 -66524 -55376 -47255 -66214 -40805 -23846 16510 43430 27432 30676 28305 36040 -11302
28156 -11302 2092 70678 50319 -3749 21128 32538 23930 -2086 -49047 -95569 -79377 -93619
28144 -93619 -96937 -11531 -28154 -19324 20465 83742 117257 138263 111928 13375 -11533 -24356
28132 -24356 -22751 8863 29609 35161 -28268 -85412 -112724 -118388 -159375 -122045 -87209 -67462
28120 -67462 -44449 -44630 -24771 -48197 13630 68160 82598 48564 30944 16114 -30414 -40256
28108 -40256 -42992 -6365 10052 -13131 -80110 -131554 -126628 -76587 -7455 22350 -2402 -58053
28096e8053j4638O1399K2492l0659M0856M1130q93o801k1493k6633j3847k625
28084i765q145m7835n9853N0808K9616J8288O0558Q766j0815O952K9707J5698
28072H3980P17q6033k6525k40o5517k8842O6395O7152N0823m2349m8438P134L1078
28059I335J1104m173j5441n308j3757L6608K7796q525n2445k6906M8863k7645
28047b0494o676M3116N2523j5866k3128k2818j2567k0027l1478L0372L0703K1653
28035B5313M13k4566m3953L100p185k3460k5060q00M9951J9080K1052J7520p185
28022D220K802L4825K9117k4222p6039j4351J0949m2721K2113j6060k1378Q4786
28010e959K0983J7963k9565m3001O9072J8744l3392k3581k6837M2327K5672o5704
$$ plain form
28096 -58053 -72691 -11292 11200 -19459 21397 62527 61634 54833 33340 6707 -7140 -9765
28084 -9765 -17910 -65745 -125598 -74790 -45174 -26886 33672 42438 31623 38575 68282 83980
28072 83980 84697 -1336 -27861 -28101 -93618 -122460 -56065 11087 61910 19561 -28877 -21743 9335
28059 9335 20439 16266 825 -4483 -18240 18368 46164 37639 -14806 -41712 7151 -20494
28047 -20494 -27170 15946 68469 52603 29475 6657 -5910 -25937 -57415 -27043 3660 25313
28035 25313 25726 1160 -42793 -39693 -46878 -70338 -95398 -96198 -46247 -27167 -6115 11405 4220
28022 4220 7022 41847 70964 46742 -29297 -43648 -32699 -75420 -53307 -69367 -90745 -5959
28010 -5959 15024 32987 3422 -39579 29493 48237 14845 -8736 -35573 6754 32426 -33278
27998c3278K4434K3478n1528j2012k0695L2559M2250j1958j5894J7240J2441P8040
27986H5077j4302n2368j13734k8375M8824O9801K5391M517L5641L7736M542n1317
27974E1433k1825K3679O714r01L732K9065m8036j429M179k2526k2811j061k020
27961a807M4249L1231Q286l7884j7429k854k231M1598J8025k3710k2889p2404
27949c7819l074M2001J8923j3053J2444O260J14J7137k3393N584N1468M5365O0286
27936A82243o9143p1802O198j4450p3875o1719M4259Q1302N6646n1363k8884j7801
27924a8389j290j9875j9388J294l2341k708q802J4713J0178J4564k2894r467j2219
27911a06624L2515N8630K4058Q004N091k0125K4223k7257j3264J6233M9706R446
$$ plain form
27998 -33278 -8844 14634 -36894 -48906 -69601 -37042 5208 -6750 -22644 -5404 7037 85077
27986 85077 70775 18407 -95327 -123702 -74878 -5077 20314 24831 60472 98208 102750 51433
27974 51433 29608 53287 60001 59100 62832 91897 43861 42432 46611 24085 1274 213 -1807
27961 -1807 42442 73673 81959 44075 26646 23792 21561 63159 81184 57474 34585 -37819
27949 -37819 -40893 1108 20031 6978 19422 25682 25796 42933 19540 25124 76592 121957 182243
27936 182243 113100 41298 47496 33046 -40829 -102548 -58289 23013 79659 28296 -588 -18389
27924 -18389 -19679 -39554 -58942 -57648 -89989 -92697 -101499 -86786 -76608 -62044 -84938 -94405 -106624
27911 -106624 -74109 -15479 8579 16583 21674 1549 25772 -1485 -14749 1484 51190 60636
27899F0636o0111j2553j3200j0681L7947M0527k438k6707K1991r612n8977j2561
27887d5739m276j2064M612L3108L2732n721L7964K6493k9062k8827k095k3788
27875a6663J3104k0248M176j2725N1402Q1706J1852k6990k9251m4738l237k4493
27863a6105m9599j3803L4692J7678o480Q023L0361N318k6621L372J8759n318l5269
27850c4992J2566j1320L947N445O923L3208m7865m6365L9485J5591l1838m197
27838e9412j3627k1172K7149O9982M8001L7121l1691l6824K279j4124l800J9006
27826B2888j233j4976M1372K2667m1098k5723p445K0323N7919K2215p011k5740
27814F4158n5795p148k8673p0521k4000O0604L9388l2793J1514N2832k79n7308
$$ plain form
27899 60636 525 -12028 -25228 -35909 2038 42565 40127 13420 35411 25799 -33178 -45739
27887 -45739 -50015 -62079 -57467 -24359 8373 2652 40616 67109 38047 9220 7125 -16663
27875 -16663 -3559 -23807 -19631 -32356 19046 100752 112604 85614 56363 11625 8388 -16105
27863 -16105 -65704 -79507 -44815 -27137 -33617 -25594 4767 10085 -16536 -13164 5595 277 -34992
27850 -34992 -22426 -33746 -29799 -24354 -17431 15777 -32088 -78453 -38968 -23377 -55215 -59412
27838 -59412 -73039 -94211 -67062 2920 50921 88042 56351 19527 21806 7682 3882 22888
27826 22888 21655 6679 48051 70718 29620 3897 -3548 16775 74694 96909 89898 64158
27814 64158 8363 1215 -27458 -97979 -121979 -61375 -21987 -54780 -43266 9566 9287 -48021
27802d8021M178o197J480N0909J4545l659k171J957l8925M644L8482l4715k2848
27789d0341j133L0169K5552M740L008n2609l3534J8373k0573l1389M7116L8238
27777a2383J1719j3049J7342O5477K9338m3933l9565j0939k352j3277R396l6059
27765c8285o6511K195J3860O2353O9928j699m5179k205k859k298R253J7939j5132
27752A360J0153k2045K8018n671j216K9384k0050L2084j385J6024k4470n1339
27740i153P371L5329n4981o4034K3419l126J1849N38j1318J7552K6327K372L9472
27727B1617N706M844J1648n466j711L3002o1516o7385L2293P5050M1561o4281
27715B5362o5790k1117J8033J290o38K2536Q584J3119L216j6728j9798M2538k88
$$ plain form
27802 -48021 -43843 -50040 -48560 2349 16894 13235 11064 13021 -25904 -21260 17222 -17493 -40341
27789 -40341 -41474 -11305 14247 18987 21995 -30614 -64148 -45775 -66348 -97737 -50621 -12383
27777 -12383 -664 -13713 3629 69106 98444 54511 14946 4007 1655 -11622 -2226 -38285
27765 -38285 -104796 -102601 -88741 -26388 43540 41841 -3338 -5543 -8402 -10700 -1447 16492 1360
27752 1360 11513 -10532 17486 11815 10599 39983 19933 52017 50632 66656 42186 -9153
27740 -9153 -1782 33547 -21434 -85468 -62049 -65175 -53326 -52788 -64106 -46554 -20227 -17855 21617
27727 21617 27323 32167 43815 38349 36638 69640 8124 -59261 -26968 48082 89643 25362
27715 25362 -40428 -61545 -43512 -42222 -42860 -20324 -11740 1379 4595 -12133 -31931 10607 10319
27702A0319j9518l0701J4670M3316L4719J551j9098o677J5087k7115M482k2127
27690a092K3235K7444k5406J3315m0477L443P23J6193L9547N567k3158j7005p639
27677A4690j4910M5145j6382k1158q63L3728O2168k0353n5401k5537l4644l2989
27665f6506K2920J7192L3535L3530n2492J485N4406J2338J7246R652k1855n3509
27653G942k7258O3751o399k9807j0928J9196M6505P937K8269L824J1816l5832
27641G9016j6101l368K1658J4557p2409q907m1963n9905k1784J3467L4940O761
27629e4038L4425J1871L1595n1493j9870n473o3369M3621M8389m6772j4140J9002
27617f6252n208j0680K6059L2230P2544k1200o1482R875J8323K7127m4858o7797
$$ plain form
27702 10319 -9199 -39900 -25230 18086 52805 54356 35258 28581 43668 16553 21035 -1092
27690 -1092 22143 49587 24181 37496 -2981 462 1185 17378 56925 62492 39334 22329 14690
27677 14690 -220 44925 28543 7385 6522 40250 102418 82065 26664 1127 -33517 -66506
27665 -66506 -43586 -26394 7141 40671 -11821 -10336 44070 56408 73654 83306 61451 7942
27653 7942 -19316 44435 38036 8229 -2699 16497 63002 70939 99208 103032 114848 79016
27641 79016 62915 59547 81205 95762 23353 14446 -27517 -87422 -109206 -95739 -60799 -54038
27629 -54038 -19613 -7742 23853 -27640 -47510 -52983 -116352 -72731 -24342 -71114 -85254 -66252
27617 -66252 -71460 -82140 -56081 -23851 48693 27493 -33989 -24114 -5791 21336 -23522 -91319
27605i1319n405M5251j4777L6817J5860p1659N326O3635K4477j4545J1386L8018
27593D3065L1461m9445n8417J6279n930J0143O585j3884m1116M0163J6341J7909
27581A3154P887k1678r71J6979J1205J3479m241K8498K7234k3717M1181n2856
27569E6154k3553Q901L3124N929J7732m9260l4730j0973n056m1484P219R314O573
27556b0110L739r878q929j188j5352j1953j3764Q1346L0757n0473m2803N878K4347
27543b8383o0157K3622K2074L2504K9855r490n4566m7480K2276L0952J4578M384
27531a9831P076q630L6702M0904N2428j30o0925J9440l6344r721o7986k0598J4307
27518e3308M0359P326M4606p3627o1140Q1598O5790J7586J1534m376L04l2946
$$ plain form
27605 -91319 -96724 -51473 -66250 -29433 -13573 -85232 -79906 -16271 8206 -6339 5047 43065
27593 43065 74526 25081 -33336 -17057 -22987 -12844 -6259 -20143 -61259 -21096 -4755 13154
27581 13154 21041 -637 -1608 15371 26576 40055 35814 64312 91546 67829 109010 56154
27569 56154 32601 41502 74626 80555 98287 49027 14297 3324 -1732 -43216 -35997 -26683 -20110
27556 -20110 -16371 -26249 -35178 -36366 -51718 -63671 -77435 3911 34668 -15805 -58608 -52730 -28383
27543 -28383 -88540 -64918 -42844 -10340 19515 10025 -44541 -92021 -69745 -38793 -24215 -19831
27531 -19831 -12755 -21385 15317 56221 108649 108519 47594 67034 30690 20969 -47017 -67615 -53308
27518 -53308 -12949 -5623 38983 -34644 -95784 -14186 51604 69190 80724 76348 76652 43706
27506D3706q7943J3820J4911M8442m2770p8227k925J5913J1731J9784J7993Q497
27494a7068k3730j1737m764M1182N4200J349r464L3527k6651k1699M884j9877
27482A52k3379J0554L1961n3080j8597K143R580O5888J2220l4669j3761K7572
27470A6584J6420j0683l8529P726M3239P47m245q825K4539L7059l6016j9176K5745
27457E4585L4741Q110j12986l6120Q1174O816l1748o544k7379j4991j4394J8029
27445d0707m246k6998M9927M3311J8765m7496l4355L9429O8709n5525m3627M2022
27433I209J9325J4128m5872m6627Q207O8184m240q233r731n5046l4112k3599n8
27420a08465L4205J068K6789L5497o5302l4083K0697J503K4552L1348j347m1811
$$ plain form
27506 43706 -44237 -30417 -15506 32936 -9834 -88061 -90986 -75073 -63342 -43558 -25565 -17068
27494 -17068 -40798 -52535 -57299 -16117 38083 39432 29968 63495 36844 15145 20029 152
27482 152 -23227 -12673 19288 -33792 -52389 -50246 -40666 25222 37442 2773 -10988 16584
27470 16584 33004 22321 -16208 -8482 34757 35504 31259 22434 46973 84032 48016 28840 54585
27457 54585 89326 97436 -15550 -51670 29504 36320 4572 -1972 -29351 -44342 -58736 -40707
27445 -40707 -44953 -71951 -22024 21287 40052 -7444 -41799 -2370 66339 10814 -32813 9209
27433 9209 28534 42662 -3210 -49837 -41630 26554 22314 14081 4350 -50696 -84808 -108407 -108465
27420 -108465 -74260 -73192 -46403 -10906 -76208 -110291 -89594 -88091 -63539 -32191 -33538 -75349
27408g5349o179r982L1801J128J1130l1585n718N0165p638m2453J2559L6348k6232
27395f2005l969K6319j9055j628J5109k8544l701N5142M8049L8389n207m4562
27383A4337l3973j716k0485J1224K6184j3863j5042M7317J4625k7534m4059J4474
27371b8511k8436l822Q2401L0127N7684L6740j4155P016l7763l8387l3606N253
27359C4541P607l5487l5237R573K2093m0954j486J310J245k9360J7755M3535k2197
27346b7062j1962O6187L3680R181j906l1340k0306p0156j2400L9289N714l1695
27334e2776O8707K5748r6408k7642j4890J4322N1402L7754n297l0574k767L2911
27322D90K4728K0458M4699m2927o1935l108l8670K3452r469j4051J5536L2193
$$ plain form
27408 -75349 -81528 -91510 -59709 -58581 -47451 -79036 -84754 -34589 -42227 -84680 -72121 -35773 -62005
27395 -62005 -65974 -39655 -58710 -60338 -45229 -73773 -77474 -22332 25717 64106 58899 14337
27383 14337 -19636 -21352 -41837 -30613 -4429 -18292 -33334 13983 28608 1074 -42985 -28511
27371 -28511 -56947 -60769 21632 51759 109443 146183 132028 139044 101281 62894 29288 34541
27359 34541 42148 6661 -28576 -19003 3090 -37864 -39350 -38040 -36795 -66155 -48400 -4865 -27062
27346 -27062 -39024 27163 60843 70024 68118 36778 16472 -53684 -66084 -26795 -21081 -52776
27334 -52776 15931 41679 -54729 -82371 -97261 -82939 -31537 6217 920 -29654 -32421 490
27322 490 25218 45676 90375 47448 -14487 -17595 -56265 -32813 -42282 -56333 -40797 -8604
27310h604J6253M470K3115j7506m4255P500K6592j2566k8118L7002K886K192l4550
27297b5589j9452N857L9744L2017k3945j7270J4059j8984l4014j7759o056L8501
27285c2891l0748l066M3056M2022K0259J2317L6265J3794l4432k6913M50P069
27273D7182K5966l0865m7921o2356k0711k1421k5658L0358P1540L1015J7675l8272
27261b3468k5641K0304L0185n639m919J3018K9531J7926l9841m1239O6496M3019
27249G9732j0200j573k6095n9687J3054m5905P667L7853K5705n0758l8962P8202
27237I033L767j2331j5131k3807l3644L0318L0807k8881m5314K4676O7328L6491
27225D3312M8670l61K124Q980j6696j2973P874j2486k9Q337j9893L6844k3340
$$ plain form
27310 -8604 7649 12119 35234 17728 -26527 -19027 7565 -5001 -33119 3883 6769 8961 -25589
27297 -25589 -45041 -39184 560 32577 8632 -8638 5421 -13563 -47577 -65336 -71392 -32891
27285 -32891 -63639 -66705 -23649 18373 38632 50949 87214 101008 66576 39663 40113 47182
27273 47182 73148 42283 -5638 -67994 -88705 -110126 -135784 -105426 -33886 -2871 14804 -23468
27261 -23468 -49109 -28805 1380 -4259 -9178 3840 33371 51297 11456 -29783 36713 79732
27249 79732 69532 67959 41864 -17823 -4769 -50674 -43007 -5154 20551 -30207 -69169 9033
27237 9033 12800 469 -14662 -38469 -72113 -41795 -10988 -39869 -85183 -60507 6821 43312
27225 43312 91982 91621 93745 102725 86029 73056 80930 68444 68415 76752 56859 93703 70363
27212G0363q3190m4423M2491O808j8544l0607r544p892K4600N1542j0911j2303
27200b1610M5921k3001p533K0573M1481k8542k4531l4223R140k3525L2301Q6903
27188G3354L5943n7241N575k3928k4658Q443n233l1846N853j3813K9817j0566
27176h300j6258M0863m3251q2187O2453N3375L6824M337l0447n2961m4612K9620
27164e0544L762L9755j0581Q368M1225N7870q852j09691n8011P991J26798J2875
27152F0965l6231k3913j2796K2808q506l092L2644l713J3844l909K6071k2065
27140D2107m6943J2239M570o667L6853O882k7493o0626P2537L8079m2582n9940
27128c0984L707k4573q74J224k3239K7070K0792L4301l7599o3517K351J476j3569
$$ plain form
27212 70363 -12827 -57250 -14759 -7951 -26495 -57102 -66646 -74538 -49938 1604 -9307 -21610
27200 -21610 24311 1310 -6223 14350 55831 27289 2758 -31465 -22325 -45850 -13549 73354
27188 73354 109297 52056 57631 33703 9045 17488 12255 -19591 -13738 -27551 2266 -8300
27176 -8300 -24558 16305 -26946 -109133 -46680 6695 43519 47856 17409 -35552 -80164 -50544
27164 -50544 -46782 -7027 -17608 -9240 31985 89855 81003 -28688 -86699 -78708 48090 60965
27152 60965 24734 821 -11975 10833 2327 -765 31879 28166 42010 38101 64172 42107
27140 42107 -4836 7403 11973 5306 42159 49041 21548 -39078 33459 71538 28956 -30984
27128 -30984 -27277 -51850 -52724 -51500 -74739 -47669 -26877 7424 -30175 -93692 -91341 -89865 -103434
27115a03434K0086O914O1283J3183q107l1353m6181J0468N053J0141J9377L692
27103c8878P7929j1164p22j1320r274j3444j4092n4611K4011J0596N2533K1434
27091C2998k81m9929m4469J5504j2547J499M540K9211J0582j9024j7137K7489
27079b1564N8668J9683o9417m9888k7033K212P557j7048p638L4080J0881K3010
27067c6497n852Q805j1638J2890N1572J3388j0479o730mk5453j8565K7984K6270
27054B5691M5106L7714r5870j00765R281L8392K4467l3082L0996L4135p322j828
27042F915J5435j1131J1413J5532k5199m8203K9493J6662j8498j4521J8215J2990
27030I103o753k321L5020j3550m3761p1765j6134O210J8248N5856O8559l5293
$$ plain form
27115 -103434 -83348 -76434 -15151 -1968 -10075 -41428 -87609 -77141 -72088 -61947 -42570 -38878
27103 -38878 39051 27887 27165 15845 6571 -6873 -20965 -75576 -51565 -40969 11564 32998
27091 32998 32717 -17212 -61681 -46177 -58724 -57225 -52685 -23474 -12892 -31916 -49053 -21564
27079 -21564 37104 56787 -12630 -62518 -89551 -87339 -79782 -96830 -104468 -70388 -59507 -36497
27067 -36497 -42349 -33544 -45182 -32292 19280 32668 22189 15459 15455 -9998 -28563 -579 25691
27054 25691 70797 108511 12641 -88124 -78843 -40451 -15984 -49066 -18070 16065 8743 6915
27042 6915 22350 11219 22632 38164 12965 -35238 -5745 10917 -7581 -22102 -3887 9103
27030 9103 2350 29 35049 21499 -22262 -94027 -110161 -103951 -85703 -29847 38712 3419
27018C419Q361K6960j6100j8182l7815m4412K0963J6735q434L0902j2046M163
27006b5486L4155K6288P8456j1109n9874l1645J0454J3160L2511l34l8476J2365
26994D0465j3098j8422K2125k1606o2576K1027L0812k0796o801k1815K582J8080
26982c0023Q5K5450l9965n1406J2773M3913J271m6877J8014K6185O0950K0059
26970D0429m6105O804l0286k0127K8126J6624M2944J3149J5384l7534N49k0625
26958I332j3860o2312J703O7469k785j5220m164Q943p900l9551j6634m4064j5853
26945a34896L9274K7192N4437L4436l5499j8824o342J768L5665N9174J4630J657
26933G2672k6049k2413K1871k2839n94r13P7L3233K5798m667j2428J8186n024
$$ plain form
27018 3419 11780 38740 22640 4458 -33357 -77769 -56806 -40071 -48505 -17603 -29649 -25486
27006 -25486 8669 34957 113413 102304 42430 10785 21239 34399 66910 66576 28100 40465
26994 40465 27367 8945 31070 9464 -53112 -32085 -1273 -22069 -28870 -50685 -48103 -30023
26982 -30023 -29938 -4488 -44453 -95859 -83086 -39173 -37902 -84779 -66765 -40580 20370 40429
26970 40429 -5676 1128 -29158 -49285 -21159 -4535 38409 51558 66942 29408 29957 9332
26958 9332 -4528 -66840 -65137 2332 -453 -15673 -19837 -10894 -18794 -58345 -74979 -119043 -134896
26945 -134896 -95622 -68430 -13993 20443 -15056 -33880 -40222 -38454 -2789 56385 71015 72672
26933 72672 46623 24210 46081 23242 22648 21735 21812 55045 80843 76176 63748 81934 76910
26920G6910K2012l6577o945P5930L6419o6005n3599r49p49N5188M0781l3003n2880
26907E6533J3557P0131m253m1387m9681n1108Q786M2029M445l4758K091j8682
26895b297l7594R075M5470J8605P395o5633j5000M1755J8171q762j863K9795J1010
26882E0127L366N014m4123m7905l953j0203k8569J687J6898q164L0326j0023l0889
26869g6411K2766O995L4522j1952j5321l576m651k8608K3551K1065K5507j5889
26857b2002n823k7726K4655K3599k0948p163p36M7217p158M0510M9705k2880j9577
26844E1673r104j6578l4159m5956j2693O4922j719k7869K6896J0541L2394J3382
26832E1730l5282o228j8661R717O371j2540N1850K722k9842k0581r195k928K9271
$$ plain form
26920 76910 98922 62345 55400 131330 167749 101744 48145 47196 46447 101635 142416 109413 56533
26907 56533 70090 140221 135968 94581 44900 -6208 2578 44607 49052 14294 16385 -2297
26895 -2297 -39891 -30816 14654 33259 40654 -24979 -39979 1776 19947 11185 9322 39117 50127
26882 50127 53493 58507 14384 -33521 -37474 -47677 -76246 -74559 -57661 -65825 -35499 -45522 -76411
26869 -76411 -53645 -46650 -12128 -24080 -39401 -42977 -47628 -76236 -52685 -31620 -6113 -22002
26857 -22002 -27825 -55551 -30896 -7297 -28245 -35408 -36144 11073 3915 44425 94130 71250 51673
26844 51673 42569 25991 -8168 -54124 -66817 -1895 -3614 -31483 -4587 5954 38348 51730
26832 51730 16448 10220 -8441 1276 7647 -4893 46957 49679 19837 -744 -9939 -12867 16404
26819A6404N5870j753j8845L9335o4364l5354r757J5756J2786l1537o6227j990
26807h9676L5996M2392L4755k9405o6040l1755L4016J7530m4856J5226K0142J7543
26795d4132k6065j4676M2947K3479n7509N2829k7051m7949N849K3505N1961O6981
26783E0169k0028k0476j5606k0906N4942q177k3068l8716M3952M7720R862n6420
26771C248o7187l0448J9022M5553o67m226k1263k9688J8350k7069K2752P1300
26759c23K3066j99p790K3645K942K941K0661k0917l6453j1603m2121j910K4816
26746b3245J6391n5837o0023j9046N2027O1686K9853J3973j3333q0288R567J7991
26734e0284O8690J5837m0449j6676m6044O873q070M8134M0717k3689p6829Q850
$$ plain form
26819 16404 72274 70521 51676 91011 26647 -8707 -18464 -2708 10078 -21459 -87686 -89676
26807 -89676 -53680 -11288 23467 -5938 -71978 -103733 -69717 -52187 -97043 -81817 -61675 -44132
26795 -44132 -70197 -84873 -41926 -18447 -75956 -23127 -50178 -98127 -92278 -68773 -16812 50169
26783 50169 30141 9665 -5941 -26847 28095 19918 -3150 -41866 2086 49806 59668 3248
26771 3248 -63939 -94387 -75365 -29812 -30479 -34705 -55968 -85656 -67306 -94375 -71623 -323
26759 -323 22743 22544 14754 38399 41341 44282 64943 44026 7573 -4030 -46151 -48061 -23245
26746 -23245 -6854 -62691 -122714 -141760 -89733 -28047 1806 15779 2446 -77842 -68275 -50284
26734 -50284 18406 34243 -6206 -22882 -68926 -62053 -70123 -21989 18728 -4961 -81790 -72940
26722g2940M572J0847M5116J6219m2236L163K1285k5342K323L7158K3315O6848
26710I0328K6365l4311n860J5999j6044k8422J1081M4461k2651m2809M6952j9562
26698F5527o8103k5041n7587l5970N1470m489K0631L2987M8553M95j406m7934
26686b0867n9605l2183K4483P7189j4825j1572M1840M868l2520m1016J8136L9375
26674f697K7664j0358m2617K2616P780n2813O869L0629O789l4323J3383o492l115
26661d0685l922K6899L819J7890J5526q869J1318P884L67m986j1942M664k5807
26648g844k5974n6695k4818L3518L6604K6503j9341R104K630M2375L8932l6318
26636A8676o1000j1015q399P2829N942k2291Q871n891p3771j7097O0218J1974
$$ plain form
26722 -72940 -68368 -57521 -12405 3814 -38422 -35259 -13974 -39316 -36993 165 23480 90328
26710 90328 116693 82382 76522 92521 76477 48055 59136 103597 80946 38137 85089 65527
26698 65527 -2576 -27617 -85204 -121174 -69704 -74193 -53562 -20575 27978 28473 27067 -20867
26686 -20867 -80472 -112655 -88172 -10983 -25808 -37380 4460 9328 -23192 -64208 -46072 -6697
26674 -6697 20967 10609 -32008 -9392 -1612 -54425 -47556 -16927 -10138 -44461 -31078 -37570 -40685
26661 -40685 -44607 -17708 -13889 4001 19527 10658 21976 29860 30227 25241 13299 17963 -7844
26648 -7844 -33818 -90513 -115331 -81813 -45209 -18706 -38047 -28943 -26313 16062 54994 18676
26636 18676 -42324 -53339 -61738 11091 17033 -5258 3613 -2278 -76049 -93146 -32928 -20954
26624b0954n3323K4849N5529K7901l1030L9257N3976J1722j3417n7761L999Q706
26612D9454k6353P12J2904l982j6690l1128j5562O6861L4357m4925n4808n7904
26600h7064j5829M5492L7206j33J806Q219N503K3044L6027p4224k3918K4560N6544
26587C7233M6209K2295k0638l8138l2176k8945J2442j2019Q31k2767j7183J1110
26575d1746L5869J3286l6936k5154P006k1040m170K4820N9124K0281p6059m8409
26563i3128M3295M5355K9536k9736o930j523j6319L2684L0189K0093k4694k2690
26551F132r343N472j0600j1052K1820J7707l0631q543M3300J4197k2042R398r142
26538A6673j5349m7109k3424K2006n7397J7834R2379O8414J7598j0967n1523m9248
$$ plain form
26624 -20954 -74277 -49428 6101 34002 2972 42229 96205 107927 94510 36749 40748 49454
26612 49454 23101 23813 36717 32735 16045 -15083 -30645 36216 70573 25648 -29160 -87064
26600 -87064 -102893 -57401 -20195 -20328 -18522 -10303 -4800 18244 54271 -19953 -43871 -19311 37233
26587 37233 83442 105737 85099 46961 14785 -14160 -1718 -13737 -12906 -35673 -52856 -41746
26575 -41746 -5877 7409 -29527 -54681 -47675 -68715 -72885 -48065 11059 31340 -44719 -93128
26563 -93128 -49833 -4478 25058 -4678 -11608 -13131 -29450 3234 33423 53516 28822 6132
26551 6132 -3211 2261 -8339 -19391 2429 20136 -10495 -19038 24262 38459 16417 25815 16673
26538 16673 1324 -45785 -69209 -47203 -104600 -86766 5613 74027 91625 80658 29135 -20113
26526b0113J490j9563O661L4601j3609o0534k4114N3775N577K6151J3968k348
26514A942j9542j5535P592j5550O8543N3278l5613k4853J7285l7443o752R774
26502C126j4546j9926j3972J5290J520K468J0540j9658M6085j0910R673K6527
26490C6217j4020j3486J6091k7455k5219k0097q023K9341k2261K2922J2852p648
26478b0786k6845K3185m188j6880j3469j9328N7348L8154n1003m871J3611l1640
26466e6712O1488J7220l5765K7496K613N0662L201l9101j6469L872J3508l00j9409
26453A2304k0390j0963P122M3407M2879m756m0864l460J6655J2156L5977N5665
26441A45732l8755l5583k9361k9308J4656l1739L095l7668N67j2446k3778J8362
$$ plain form
26526 -20113 -18623 -38186 -31525 3076 -10533 -71067 -95181 -41406 -35829 -9678 4290 1942
26514 1942 -17600 -33135 -25543 -41093 27450 80728 45115 20262 37547 104 -6648 3126
26502 3126 -11420 -31346 -45318 -30028 -28508 -26040 -15500 -35158 10927 17 9690 36217
26490 36217 22197 8711 24802 -2653 -27872 -47969 -55992 -26651 -48912 -25990 -13138 -20786
26478 -20786 -47631 -24446 -28634 -45514 -58983 -78311 -20963 17191 -33812 -38683 -25072 -56712
26466 -56712 4776 21996 -13769 13727 16340 67002 70203 31102 14633 18505 32013 31713 12304
26453 12304 -8086 -19049 -11927 31480 74359 69603 28739 25279 41934 54090 90067 145732
26441 145732 106977 71394 42033 12725 27381 -4358 -1263 -38931 -38364 -50810 -74588 -56226
26429e6226J6536M147j5617K2178J9653m0830o6013k604N2140J7340j4388p782
26417g1466j6963j6423p06L6808Q809p46J2258J0706K6835L1933N0285K4991J3547
26404A09868n2973m2840l755n960N8938L804K8676K8056L782o5191j4429j1606
26392C6370j1584J5979k290J4026n8373j6059K4810L1754k0841m7577l1452j5005
26380h0242j6590N0695K0290j5644M5785k3483m1749M997K632J0348l6247J3497
26368f5711L3094j0017l1639R826k9607j1405Q6740O9429O112O8473j0577q0099
26356C4619k4116l522L5255J3242J7225j0018M7845o1371k793K0613k3536n0671
26344g228j6905J8758N7397J9069o1511j6062r405k3221L0175j0689l7794k512
$$ plain form
26429 -56226 -39690 -35543 -51160 -28982 -9329 -50159 -116172 -118776 -66636 -49296 -63684 -71466
26417 -71466 -88429 -104852 -105558 -68750 -59941 -60687 -48429 -37723 -10888 21045 71330 96321 109868
26404 109868 56895 14055 10300 4340 63278 67082 95758 123814 127596 62405 47976 36370
26392 36370 24786 40765 38475 52501 -5872 -21931 2879 34633 13792 -33785 -65237 -80242
26380 -80242 -96832 -46137 -25847 -41491 4294 -19189 -60938 -55941 -53309 -42961 -79208 -65711
26368 -65711 -32617 -42634 -74273 -64447 -94054 -105459 -18719 50710 56822 125295 114718 34619
26356 34619 10503 6981 42236 55478 72703 62685 110530 49159 46366 66979 43443 -7228
26344 -7228 -24133 -5375 52022 71091 9580 -6482 -15887 -39108 -8933 -19622 -57416 -59928
26332e9928l464K9335L9788m3490j4843N7752L5258k0776j8778r984k6590o87
26320c6407k6122J6493j4015K8071L6535j4110m4421l7742N2989R380M7275k4902
26308f976j5589O587j5472m1918R544L7660K2080J1693L1448K7009n7153l9316
26296c0403K8932K527l8387K0482l0882n9381j5565l4148K3539M3253Q020N705
26284g6308J5156L6994j379K8015N683K9076J2548j5640k3813l276J4011N21K2911
26271D4499k6336O5835K159p4943j212L7109l4872l4681m929q320j574J9545l1205
26258d8925j623Q911K5311J4244j0986M6772K7454l2259j4455M2661L2989j5982
26246G4112q5671R0N318K8918o213l6754J1715o145J3178l687K378j152n386k0377
$$ plain form
26332 -59928 -63392 -34057 5731 -37759 -52602 5150 40408 19632 854 -9130 -35720 -36407
26320 -36407 -62529 -46036 -60051 -31980 4555 -9555 -53976 -91718 -38729 -29349 17926 -6976
26308 -6976 -22565 -15978 -31450 -73368 -63824 -26164 -4084 7609 39057 66066 8913 -30403
26296 -30403 -1471 1056 -37331 -16849 -47731 -107112 -122677 -156825 -133286 -90033 -82013 -76308
26284 -76308 -61152 -24158 -25537 2478 8161 37237 49785 34145 10332 7056 21067 21588 44499
26271 44499 18163 83998 86157 11214 10002 47111 12239 -22442 -27371 -35691 -37265 -17720 -48925
26258 -48925 -50548 -41637 -16326 -2082 -13068 33704 61158 28899 14444 57105 90094 74112
26246 74112 -11559 -11469 -6151 22767 16554 -20200 -8485 -14630 -1452 -5139 -2761 -3913 -9299 -29676
26232b9676r048k9052L5211J9026J3882l608l5646J0025J7137m9221o7845K890
26220a25925l333J8540J547J9881N9442J0842k6830j0162j4856n936j4920k332
26208i4042L4743j8905l5689l583l8325J0168L2259L98j090l262L2493K0610q737
26195g2962J1233l5985k1566N8111N7762q1474k5108L2412N176N0547L0315k6355
26183a7894j6466j4654O4K072L2826L0910L256k0967K6968l5374K5550M3964L1922
26170I2177K7125l421l5776l017l8798j5601k6692j4660j7388l8872j9703N907
26158h8719K1869J0628k4286K294M1037k2255q827M91j878k6239J5268n898k0152
26145a06667Q7519K8316j7804K2844J7271l8649k5677p627k251J1954p912n652
$$ plain form
26232 -29676 -38724 -67776 -32565 -13539 343 -3265 -38911 -28886 -11749 -60970 -128815 -125925
26220 -125925 -129258 -110718 -109171 -89290 -29848 -19006 -45836 -55998 -70854 -76790 -91710 -94042
26208 -94042 -59299 -78204 -113893 -117476 -155801 -145633 -113374 -112976 -114066 -117328 -84835 -64225 -72962
26195 -72962 -61729 -97714 -119280 -61169 -3407 -84881 -109989 -77577 -72401 -21854 8461 -17894
26183 -17894 -34360 -49014 -48950 -46878 -14052 16858 20114 -853 26115 -9259 16291 60255 92177
26170 92177 119302 115881 80105 77088 38290 22689 -4003 -18663 -36051 -74923 -94626 -88719
26158 -88719 -66850 -56222 -80508 -78214 -37177 -59432 -68259 -67768 -69646 -95885 -80617 -86515 -106667
26145 -106667 -19148 9168 -8636 14208 31479 -7170 -32847 -40474 -42725 -30771 -38683 -44335
26133d4335K1012K5205K2209j7366m438O163M5927K0430K1619J7203Q759l4081
26121H8307n240j5973J1157M72j8709N1818o511j03089j3016K9141M2189O7041
26109A27587M5355J4594n758K1377K3206o765n772j7120M822p0223p1888m3659
26097A5756m243j9214j8142K9840L1196L1041P741M7102M0716j3873l5354m2625
26085F9941L0365j7794q7386k2429O3783L1213Q790p2416k1950N314m8422L2008
26073b8983N4464p5739L511M6951k4319n8815M0819M5407J6434j4478m8517k9583
26061g2848l3596p574O5793N634J7296K784j6921J1416l1360J9091J1176J5182
26049a3927K91m0007J2513L4984M9291n069l022l7378P249L6331j1063R530J8348
$$ plain form
26133 -44335 -23323 1882 24091 6725 2287 8450 54377 74807 96426 113629 122388 88307
26121 88307 83067 67094 78251 78723 60014 111832 105321 2232 -10784 18357 60546 127587
26109 127587 172942 187536 181778 203155 226361 219596 213824 196704 201526 131303 59415 15756
26097 15756 11513 -7701 -25843 3997 35193 66234 73975 121077 161793 147920 112566 69941
26085 69941 100306 82512 -4874 -27303 36480 67693 76483 4067 -17883 -12569 -60991 -28983
26073 -28983 25481 -50258 -46747 204 -24115 -82930 -42111 3296 19730 5252 -43265 -72848
26061 -72848 -106444 -114018 -48225 -42591 -25295 -22511 -39432 -28016 -59376 -40285 -29109 -13927
26049 -13927 -13636 -53643 -41130 -6146 43145 38076 35054 -2324 4925 41256 30193 39723 58071
26036E8071J1703m5465J6813p653n3590k2855M1951N1568K5563q1227l9235M9927
26024E571K9754J8004J0629l8117l320o362n9387R326O1217K6155J5211m454j7347
26011D6880k1324m1120l7920L2073l3095m4709P004K5390O6017M1903p7153j5112
25999e1166R650K9503N9007k5343k7090k556j5889j8868J6142N1702L5866l3902
25987B7056o970j9096K5933j7855o1789J8367J1963j3064M4283M0178j2997m6156
25975a0147P785K577P451j7171K1985r788l4352j4173k5904r295K9460K4523r855
25962c6904K7863J394m4351L8650J18999K4244n2554q1149o2710P9983j2390n0890
25950d9815M3590O9842M1653o7519j7646N527o096o1604k8918M0388J7075j7585
$$ plain form
26036 58071 69774 24309 41122 33469 -20121 -42976 -1025 50543 76106 -5121 -44356 5571
26024 5571 35325 53329 63958 25841 22521 16159 -43228 -33902 27315 53470 68681 64227 46880
26011 46880 25556 -15564 -53484 -21411 -54506 -99215 -92211 -66821 -804 41099 -36054 -51166
25999 -51166 -41516 -12013 46994 21651 -5439 -7995 -23884 -42752 -26610 25092 60958 27056
25987 27056 20086 990 26923 9068 -52721 -34354 -22391 -35455 8828 49006 36009 -10147
25975 -10147 -2362 215 7666 -9505 12480 2692 -31660 -45833 -71737 -81032 -51572 -27049 -36904
25962 -36904 -9041 -7647 -51998 -13348 105651 129895 77341 -3808 -66518 13465 1075 -49815
25950 -49815 -6225 63617 105270 37751 20105 25632 19536 -42068 -70986 -30598 -13523 -31108
25938c1108l588m4158J9878P3227M5784m0607j02705n0615j5635N595L0459O6969
25926d6504P7214M166j6998j4977m4991n7226K4621J5107m350l362K2577O5320
25914B0597L8157l999r18l6293l2326k1507K8600p193J8673L7139M0339M5756
25902A27025K0220J435p7777q0006j1739M2841l5624K6876N5842Q133J0088N1991
25890A39305m86p0297o1571j8604L7566J7877L0512L6571k1934j6178m4893l023
25878B4845k359r367M1204q741L1847j3342j3161K938K6082l3534l9403m9779
25866d2770k8964P633P5735K8346q789k8364L1650M7285J4039K9483K116r2553
25854C4847k3921k4321O4342M5677n5722k9075J2795M4973j3423r72l0352l2831
$$ plain form
25938 -31108 -34696 -78854 -58976 14251 60035 19428 -83277 -133892 -149527 -143932 -113473 -46504
25926 -46504 30710 34876 17878 2901 -42090 -99316 -74695 -59588 -63938 -67300 -44723 20597
25914 20597 58754 54755 53837 17544 -14782 -36289 -7689 -14882 3791 40930 81269 127025
25902 127025 147245 148680 70903 -9103 -20842 21999 -13625 13251 69093 77226 87314 139305
25890 139305 138819 68522 6951 -11653 25913 43790 74302 110873 88939 72761 27868 24845
25878 24845 22486 13119 54323 45582 77429 64087 50926 53864 79946 46412 7009 -42770
25866 -42770 -71734 -64101 11634 39980 31191 2827 34477 81762 95801 125284 127400 34847
25854 34847 10926 -13395 50947 96624 40902 11827 24622 69595 56172 55200 24848 -7983
25842g983K8040k1448m3666M3201J5961K6979O2680k4404n390K9742k1766K949
25830H4895R319l7389j1326J5907j4359o790K7080m6912j932L2142j9724P0614
25818A01525N8205k0957J2552p467l7094J4431k4474q2542K4702J6862j7065M3794
25806H2472L9121j6199m512m3616n1025J1538N3991K1204k0275n3363o7777j2965
25794f1406L7634m5531l530j4460n248M1083Q4993J7101m592n551n3796j5074
25782b8377L6929J5489K1254k5583j418J6796n916j8914L5574l7534L4854N3404
25770I6558J2271k3690n0182J2762N1556j8031p2039L7277O7568J9662j3196k7109
25758I3407k2966k1335n522L9818l0298M2351M5593J9483m374p7109n1547L0161
$$ plain form
25842 -7983 20057 -1391 -45057 -1856 14105 41084 103764 79360 73970 103712 81946 84895
25830 84895 94214 56825 45499 61406 47047 40257 67337 20425 18493 50635 30911 101525
25818 101525 159730 138773 151325 143858 106764 121195 96721 14179 38881 55743 38678 82472
25806 82472 121593 105394 100882 57266 6241 17779 71770 92974 72699 19336 -48441 -61406
25794 -61406 -23772 -69303 -72833 -87293 -92541 -51458 33535 50636 46044 40493 -13303 -28377
25782 -28377 8552 24041 45295 19712 18294 35090 29174 10260 45834 8300 43154 96558
25770 96558 108829 85139 34957 47719 99275 81244 9205 46482 114050 133712 120516 93407
25758 93407 70441 49106 43584 83402 53104 95455 141048 160531 156157 79048 27501 57662
25746E7662K6714O5691j8924n8211l367j5821L959J6321L7246j2474J911l2352
25734F8355l2554k6842M9339M1254o029M0761L3445J653l148L9544k6253j1685
25722A67840l0154j7705l0754m2099m8607j6560r542p985K007J5597L5338l5588
25710a8212L9421o027K3162n631K5717l926r85o2477m9564l71k04Q213p065m1629
25696i9578r406K6805o235k8597J6056L1268q739K655r975j430J4619K5689j6017
25683f2885l6015P1813k4046n7295J7899l627P3007O8279K6605K7517m1002o8327
25671h077k1059M6185k1672k5879p913M0270R396k7108n0585p542L5459M5253
25659F728K5821m417n3598p673M8209n7543j11362N5302Q8187L4521M3692L8675
$$ plain form
25746 57662 84376 150067 131143 72932 69565 53744 57703 74024 111270 98796 100707 68355
25734 68355 35801 8959 58298 99552 93523 134284 167729 169382 166234 205778 179525 167840
25722 167840 137686 119981 89227 47128 -1479 -18039 -27581 -35566 -33559 -17962 17376 -18212
25710 -18212 21209 15182 38344 32713 58430 54504 53519 -8958 -58522 -58893 -59097 -50884 -57949 -99578
25696 -99578 -108984 -82179 -88414 -117011 -100955 -69687 -78426 -75771 -85746 -87176 -72557 -46868 -62885
25683 -62885 -98900 -27087 -51133 -108428 -90529 -94156 -21149 47130 73735 101252 60250 -8077
25671 -8077 -29136 17049 -4623 -30502 -38415 1855 11251 -15857 -66442 -73984 -38525 6728
25659 6728 32549 28132 -25466 -33139 15070 -42473 -153835 -98533 -10346 24175 67867 106542
25647A06542N1307L5111j9238m8381m565j922L5111k3991K4001o8359k8727o057
25635E0832n0127m3780K0559M9101K9583j5326M0488k147l7310m0985J453n912
25623c571J3185J0436L9940p025k6237o4388n463M840k3212J0002J7794K6428
25611g271q622m1259m107k1818l994l9814l0537K8814r747p449O8916P5993N3914
25598E3019R724N2253K8211k2701K817m9946Q565M0927P8466N3671k8551m3862
25586A82593l4307M1379O6792m921q88Q735M9513L9957O0680j1622m724N6624
25574D49811k7797r322k549L3105R503m2931k5655n508o3245m4364N346l5228
25562B41166r9871k7942J0841n470k5558J016r694j7122l1907l9610j2409k1554
$$ plain form
25647 106542 157849 192960 173722 125341 120776 118854 153965 129974 153975 85616 56889 50832
25635 50832 705 -43075 -22516 26585 56168 40842 81330 79183 41873 888 2341 -3571
25623 -3571 9614 20050 59990 52965 26728 -37660 -43123 -38283 -61495 -51493 -33699 -7271
25611 -7271 -15893 -57152 -61259 -83077 -87071 -126885 -157422 -128608 -138355 -145804 -76888 -895 53019
25598 53019 62743 114996 143207 120506 123323 73377 81942 122869 201335 255006 226455 182593
25586 182593 148286 189665 256457 251536 250648 259383 308896 348853 409533 397911 393187 449811
25574 449811 422014 412692 410143 443248 452751 409820 384165 378657 315412 271048 276394 241166
25562 241166 141295 113353 124194 118724 93166 94182 84488 67366 35459 -4151 -16560 -38114
25550c8114m2712L648K0297k1334J2261J6886L3156J8400J6728k9425n7610J510
25538f6309j2923l6563k2609n4378m4339L2299Q4822O4690J3344R912N7269J5335
25526D0550J9251P727m3151L619J9810J9524k8718k0362L1947p402n804n3908
25514a6917k2255N3359L5584j2146k3103L0171k9746k5291J8403Q604l3538p240
25502b4115N3787p489l6316n3846l4537l2345r576J8430O295j4238o800J1563
25490a29187J6765J134K7661Q4945M0197O3432R6551P5344L5100O2086k1111K7570
25478C80487N4425l1519m266M214J4023K2858M3482L4543J0484N3880M0502l6088
25466E87025m2042K0488p066Q085M065l305l2509j067k8542n9410j5434k6817
$$ plain form
25550 -38114 -80826 -77178 -56881 -78215 -65954 -49068 -15912 2488 19216 -10209 -67819 -66309
25538 -66309 -79232 -115795 -138404 -192782 -237121 -204822 -120000 -55310 -41966 -32054 25215 40550
25526 40550 59801 67528 24377 27996 47806 67330 38612 18250 50197 42795 36991 -16917
25514 -16917 -39172 14187 49771 37625 14522 44693 14947 -10344 8059 16663 -16875 -24115
25502 -24115 29672 22183 -14133 -67979 -102516 -134861 -144437 -126007 -119712 -133950 -140750 -129187
25490 -129187 -112422 -111288 -83627 1318 41515 104947 201498 276842 311942 374028 352917 380487
25478 380487 434912 403393 399127 403341 417364 440222 483704 518247 528731 582611 623113 587025
25466 587025 544983 565471 558405 566490 570555 567250 534741 533674 505132 445722 430288 403471
25454D03471p6598n345r1864o4556j0688K1745j2353L2102L5787n320o7600q457
25442A50324M0312k6907L267O228M9555Q470L5894L5442q763o7343q1938R40M0645
25429A86126j0614L0401M1040q984k3689J3783k5737k4451j4690P4259M5893M5479
25417C28816l4602j7442k8662m5168p924J2408L1521P327j8096m880n480m8696
25405A69122p257k0441m7220K8258N0139J0773R5669J50417J7463k6249l2918
25394C87756J323J9300J686p8121o1559n4825n2640o396L2645J06671R0473K1588
25382D07901m4335m763O1487L5943o6842j02658m8743m9661n3598n9526o0856
25371A4349p2358l3707O920N675N959J4187q6283p5836l7024j5945n266j2128
$$ plain form
25454 403471 326873 321528 229664 165108 154420 176165 163812 195914 231701 226381 158781 150324
25442 150324 190636 163729 166996 173224 222779 231249 267143 302585 293822 226479 144541 145481 186126
25429 186126 175512 205913 246953 237969 214280 228063 202326 177875 163185 237444 283337 328816
25417 328816 294214 276772 248110 202942 195018 207426 238947 246274 228178 223298 217818 169122
25405 169122 161865 141424 94204 122462 172601 183374 279043 429460 446923 420674 387756
25394 387756 389079 408379 410065 331944 270385 215560 162920 156524 189169 295840 386313 407901
25382 407901 363566 358803 420290 456233 389391 286733 237990 188329 134731 75205 14349
25371 14349 -58009 -91716 -84796 -79121 -73162 -58975 -145258 -221094 -258118 -274063 -279329 -291457
25359b91457n5373q4446l9715O347K4484k5885O092j8567j4308j0182K8576J07780
25347c66654K5739L490k2345k3210L794M672N1601l3722n7324M3031J8241j2451
25335c65138K9057N3285K7331M0637j9486J8611K4768o384K3994l427K4935k67
25323a52084P5797R4957J0427k0200k3161N4359N4045L1573L0475O3012Q3317
25312C02517M6058O2879P6724O8132M4831Q5417M4906n985k0659N0066K8915L8515
25300H22316P1839N6245O5708N09l4744o8553j4135k0556J720J1566n967k7671
25288H58277o6780m0473n2485o3579m2873p0446j07947j09306j45998q6455o4176
25277G759r6367n4384n1732l4711k1213m8108q6451k2279k0997n405N3727k8858
$$ plain form
25359 -291457 -346830 -431276 -470991 -464644 -440160 -466045 -459953 -478520 -492828 -503010 -474434 -366654
25347 -366654 -340915 -337425 -359770 -382980 -379186 -374514 -322913 -356635 -413959 -370928 -352687 -365138
25335 -365138 -336081 -282796 -255465 -214828 -234314 -215703 -190935 -197319 -173325 -176752 -151817 -152084
25323 -152084 -76287 18670 29097 8897 -14264 40095 94140 125713 156188 219200 302517
25312 302517 348575 411454 488178 556310 601141 686558 731464 725479 704820 754886 783801 822316
25300 822316 894155 950400 1016108 1016617 981873 913320 899185 878629 880349 891915 885948 858277
25288 858277 791497 751024 698539 634960 592087 521641 413694 304388 158390 71935 7759
25277 7759 -88608 -142992 -194724 -229435 -250648 -298756 -385207 -407486 -428483 -433888 -380161 -409019
25265d09019j0606N9334K0865l0236m7659o3429j4953M888L3398R6924L1351O6693
25253b62449M7509l586j4578L7484l3832K8728J39923J25585J60086O0563N35
25242B85968J9198M709o212K6384L8950J08297J10226J9701L240j3256J282k9156
25230E69331l9955L6524K9899J1750O0587P6585R1963J56474J61441P4260L2882
25219A261741K0675K5959m8884o3317n0056o2246J5870m5180j19845o5208j5651
25208H53858Q289n1488n3813M0350J07104N5299J14137N8077J6235P021K810O07
25196A158486Q0400R206l4581R893m2955j00293r2382K472N0902M5826m0058p9393
25184I67523r7552o2029l3032p2410j24752j01351n740J2051M7878L4832J50210
$$ plain form
25265 -409019 -419625 -360291 -339426 -369662 -417321 -480750 -495703 -490815 -457417 -360493 -329142 -262449
25253 -262449 -214940 -218526 -233104 -195620 -229452 -200724 -60801 64784 224870 285433 285968
25242 285968 305166 309875 303663 330047 368997 477294 587520 607221 610461 597205 598487 569331
25230 569331 529376 565900 595799 607549 668136 744721 836684 993158 1154599 1228859 1261741
25219 1261741 1282416 1308375 1259491 1196174 1146118 1083872 1099742 1054562 934717 869509 853858
25208 853858 862147 810659 756846 797196 904300 959599 1073736 1131813 1148048 1155069 1157879 1158486
25196 1158486 1238886 1248092 1213511 1223404 1180449 1080156 987774 990246 1041148 1086974 1046916 967523
25184 967523 869971 807942 774910 702500 577748 476397 470657 482708 530586 565418 715628
25173G15628J88839J47571M2948n0420j6258L0550N0752J58464J58666J06572
25163A533312L3124k0729j8854j18388m1567l6063l857O2218J15344J66566J22012
25152A793118M2622p184j020P0902P4698P2890O1350L2682j5330j03298l3008
25141A988422Q8166J09701K6189N739j26012j71629j49739j24929j8653j4431
25131A612824n7613L5252K563J8153L1485j9222N153N0777l9307q1485n2136j53138
25119A353306j58889j20571r4849Q299O3805K5636q1125m7942L9574R8317J38124
25108A223685R2709J00516Q6676K8874N5650J03966K59833K89163K74543L57996
25098B873611L41250J73167L3603r708j6565L8223J02886J29898J50839R9195
$$ plain form
25173 715628 904467 1052038 1094986 1044566 1028308 1058858 1109610 1268074 1426740 1533312
25163 1533312 1566436 1545707 1526853 1408465 1366898 1330835 1326978 1389196 1504540 1671106 1793118
25152 1793118 1835740 1828556 1827536 1898438 1973136 2046026 2107376 2140058 2124728 2021430 1988422
25141 1988422 2076588 2186289 2212478 2218217 2092205 1920576 1770837 1645908 1627255 1612824
25131 1612824 1555211 1590463 1593026 1611179 1642664 1623442 1628595 1679372 1640065 1558580 1506444 1353306
25119 1353306 1194417 1073846 978997 987296 1051101 1076737 995612 947670 987244 1085561 1223685
25108 1223685 1316394 1416910 1503586 1532460 1588110 1692076 1951909 2241072 2515615 2873611
25098 2873611 3214861 3388028 3421631 3411923 3395358 3433581 3536467 3666365 3817204 3916399
25088C916399P3585j4070r7853j28540r380r4160r3983j05360m3406J03013J49172
25077C655417J26307K30377J71137J64358Q0862j37333k90624l16975k97018k47663
25067C138845j14983o2464k48837m43159n25167m86829l73537l23051k30469j63358
25057A66991j02770j20246k39230m76724n15311l51726j14313L2399o8714j69355
25047a958999l43396m51505m32110m46678l94261j97374r9620q0993q2958M5749
25037d442145R961J18601K33057L78799M88161N00803M50460M42219M53300N74669
25027g92115O29670N76297M86496N44502O15645O83231P01705P55456Q76328J011143
25017F088358J055690J019023Q73978O52999M53056M06679K86952K35070K53453
$$ plain form
25088 3916399 3989984 3975914 3878061 3749521 3740141 3645981 3551998 3446638 3403232 3506245 3655417
25077 3655417 3781724 4012101 4183238 4347596 4428458 4291125 4000501 3683526 3386508 3138845
25067 3138845 3023862 2961398 2712561 2269402 1744235 1257406 883869 560818 330349 166991
25057 166991 64221 -56025 -295255 -771979 -1287290 -1639016 -1753329 -1720930 -1789644 -1958999
25047 -1958999 -2302395 -2753900 -3186010 -3632688 -4026949 -4224323 -4323943 -4404936 -4487894 -4442145
25037 -4442145 -4432184 -4313583 -4080526 -3701727 -3213566 -2712763 -2262303 -1820084 -1366784 -792115
25027 -792115 -162445 413852 900348 1444850 2060495 2743726 3445431 4200887 5077215 6088358
25017 6088358 7144048 8163071 9037049 9690048 10143104 10549783 10836735 11071805 11325258
25008A1325258M83151O47660N92144N44272N79908P04801P68113R65335J226781
24999A7837423J714656K162325K378750K356553K285281K208768K309774K813294
24991C6066824L656139M565481N174922N945299P143150Q112515R294128J2236179
24983I2194637J7424691K3698883K9033241L2099434L3066724L1442056K5561163
24976B84520829J8585921J4126332J0876175J0602868J4085591J8873195K2614669
24969C94285580K3763765K1262078J4625494O232391Q32417r4602K062502M661384
24961D67631009M476531J490246l471449q798778j2783475j2995440p447441M38310
24953D28539513M255307N258948M321788n467234k3201662l8225726m6185425
$$ plain form
25008 11325258 11808409 12456069 13048213 13592485 14172393 14877194 15645307 16610642 17837423
24999 17837423 19552079 21714404 24093154 26449707 28734988 30943756 33253530 36066824
24991 36066824 39722963 44288444 49463366 55408665 62551815 70664330 79958458 92194637
24983 92194637 109619328 133318211 162351452 194450886 227517610 258959666 284520829
24976 284520829 303106750 317233082 328109257 338712125 352797716 371670911 394285580
24969 394285580 418049345 439311423 453936917 460169308 461001725 460907123 462969625 467631009
24961 467631009 472107540 473597786 470126337 461327559 448544084 435548644 428101203 428539513
24953 428539513 432794820 438053768 442375556 436908322 413706660 375480934 329295509
24946C29295509m8688000m4646465l4968094k5100785j8828515j5241320j3668591
24939A28153739j4359886j5457794j5441553j4320643j2514433j0234771p788415
24932C8036244n481143l129590j267144o83650j015544j447668j775884k077592
24924B1158029k218189j804648j362723j105771j010279j073999j257995j405878
24916I918547j374588j186693r34204p95089p82934p82049l90134k9588J73542
24907C816810L65836P14917J179135J314794J058323Q99255O10012M3208l26148
24898I676142l81841k84431q1845R1396N2941K1060m8934L5114K31140K77706
24888I588448K35209J35356j2681k56664n34179o67800n96225m02194k23577j42077
$$ plain form
24946 329295509 280607509 235961044 200992950 175892165 157063650 141822330 128153739
24939 128153739 113793853 98336059 82894506 68573863 56059430 45824659 38036244
24932 38036244 32555101 29425511 28158367 27474717 26459173 25011505 23235621 21158029
24924 21158029 18939840 17135192 15772469 14666698 13656419 12582420 11324425 9918547
24916 9918547 8543959 7357266 6423062 5627973 4845039 4062990 3672856 3643268 3816810
24907 3816810 4182646 4897563 6076698 7391492 8449815 9349070 9959082 10002290 9676142
24898 9676142 9294301 9009870 8928025 9019421 9072362 9093422 9044488 9079602 9310742 9588448
24888 9588448 9823657 9959013 9946332 9689668 9155489 8487689 7891464 7489270 7265693 7123616
24878G123616n3508l6473j740J6469j26677j49927j12721o5257q1870r0672j45731
24867F275509k61023l52225m03125l52102k70191k12611j43655j27345j3598N9904
24857D199538o2919k07657k83255k91368k45093k68162k23222l05435l95818m45463
24847A471146m36979m21491k37258j78208J0005J81075K05964M8141j35208k20526
24837B86661k16190j65451j37155n7430J8079k1552n4382j15879k61538j94541
24827i19378j11710O5834K25605K06711R2431K8087k517n8780j542M3656j0042
24816d41645o1533r5406q8389k5258l5300p3212m5264j6240J11502O1795j6366
24805g25316k2565m7934J241L3552L0434J09678J11010N7170Q4502J28316J08428
$$ plain form
24878 7123616 7070108 7033635 7031895 7048364 6921687 6771760 6659039 6593782 6511912 6421240 6275509
24867 6275509 6014486 5662261 5259136 4907034 4636843 4424232 4280577 4153232 4139634 4199538
24857 4199538 4136619 3928962 3645707 3354339 3109246 2841084 2617862 2312427 1916609 1471146
24847 1471146 1034167 612676 375418 197210 207215 388290 594254 642395 507187 286661
24837 286661 70471 -94980 -232135 -289565 -271486 -293038 -347420 -463299 -724837 -919378
24827 -919378 -1031088 -965254 -739649 -532938 -440507 -412420 -414937 -473717 -475259 -431603 -441645
24816 -441645 -503178 -598584 -686973 -712231 -747531 -820743 -866007 -882247 -770745 -708950 -725316
24805 -725316 -747881 -795815 -794574 -761022 -730588 -620910 -509900 -452730 -368228 -239912 -131484
24794a31484J32617R3490N7267P9052P0490q9730j68952k41520j04596R6325J36012
24783g1029K4020j6187N8483J43225M6980l1843K0132q1667p4829k3446k1407
24772b7568Q200J9109k6425k4217M3743K2108m6829j12442j15480j03204q0003
24761d43008q2538q3833j680Q0404J7745L8236P5602J0338j4146m9447p8616p4297
24749f05240j24311j36236o0437m0829N4695J23536J46466O6457k0153l6888j26464
24738g59404m5268R5570J16217J26697K16377J02408K2686q349k9367M0113M8457
24727g3863J14261K11460J93362N979r7866j74533k02530j04993n9416k5568k2197
24716b35904j2659l8044J6742J09265J42566J27609J18102J5024p5178l5058j10876
$$ plain form
24794 -131484 1133 94623 151890 230942 301432 211702 42750 -198770 -303366 -207041 -71029
24783 -71029 -47009 -63196 -4713 138512 185492 153649 173781 92114 17285 -6161 -27568
24772 -27568 -19368 -259 -26684 -50901 -7158 14950 -31879 -144321 -259801 -363005 -443008
24761 -443008 -525546 -609379 -611059 -530655 -512910 -474674 -399072 -388734 -402880 -452327 -530943 -605240
24749 -605240 -729551 -865787 -926224 -967053 -912358 -788822 -642356 -575899 -596052 -632940 -759404
24738 -759404 -804672 -709102 -592885 -466188 -249811 -147403 -124717 -133066 -162433 -122320 -73863
24727 -73863 40398 251858 445220 451199 353333 178800 -23730 -128723 -188139 -213707 -235904
24716 -235904 -248563 -286607 -269865 -160600 -18034 109575 227677 242701 167523 132465 21589
24705B1589j06877J9093O2770L9547L5980J9324J916L9606M1613N384O196R3445
24693B79586J11347N5168J715l7998p7175p0856j15675o9898L4509J30384J70118
24682D11225J01424L1719O6078O7236K7271L2597L2455J5943k3550n3619K3086
24671G31865j2440n843j9976P5296K0553R801J177L7378J02111M9814J3380q9203
24659I13913j49663k18304j55728l7811l3050M7650M2994O006J5721o0901j05415
24648B65412p6922j17763j30215K778k6532o7331l7678R63n6179q7409j7734n6924
24636d05534m4050J8158j1109k7849M174K5673K6603o980n77J7388l1357K9092
24624d06368J3126L1976k3774J246Q4308R3905O0528K4732N8277M3390J4368Q4824
$$ plain form
24705 21589 -85288 -66195 -3425 36122 72102 91426 93342 132948 174561 179945 186141 279586
24693 279586 390933 446101 447816 409818 332643 261787 146112 76214 110723 241107 411225
24682 411225 512649 544368 610446 677682 704953 737550 770005 785948 762398 708779 731865
24671 731865 719425 713582 693606 768902 789455 799256 800433 837811 939922 989736 1003116 913913
24659 913913 764250 545946 390218 352407 319357 367007 410001 416007 431728 370827 265412
24648 265412 188490 70727 -59488 -56710 -83242 -150573 -188251 -187288 -243467 -330876 -348610 -405534
24636 -405534 -449584 -431426 -442535 -470384 -466210 -440537 -413934 -420914 -421491 -404103 -435460 -406368
24624 -406368 -393242 -361266 -385040 -383794 -299486 -205581 -145053 -120321 -62044 -18654 -4286 80538
24612H0538O5125j0618m617K9751k3873k8859j8589K2671O4636P5195Q2232n3696
24600B79896j10969j3800L0400N2040R5120L4634K0506k9930j537k9410k8203
24589B98747J9835O4790R0224R0764N2606L7051L0652K7595l9468m751r884m5253
24577F12908j0772Q6178O4813K0901k3456k0688q616k5894J3566p7462l92J00358
24565G31444K5872o367l5416J2530o0987l5053n3366m0321j3639n3879j0950P9
24553D59947p3859j16345p7412m5843L5982J4256k9989k8396k5329K368m1739
24542G3641r8806r160J7689L6922O154k2806o6749p7373m0346m7968j4696j3428
24530b56926K9550m260l9202J3753M5637m01K0822J1582J7033m3616l9103R5702
$$ plain form
24612 80538 145663 135045 130428 160179 136306 107447 88858 111529 176165 251360 333592 279896
24600 279896 168927 155127 185527 237567 332687 367321 387827 357897 356360 326950 298747
24589 298747 318582 383372 473596 564360 616966 654017 684669 712264 672796 668045 658161 612908
24577 612908 602136 688314 753127 774028 750572 729884 721268 695374 708940 631478 631086 731444
24565 731444 757316 750949 715533 728063 667076 632023 578657 538336 524697 470818 459868 459947
24553 459947 386088 269743 192331 146488 182470 196726 166737 138341 113012 115380 73641
24542 73641 -25165 -34325 -16636 20286 26440 3634 -63115 -140488 -180834 -228802 -243498 -256926
24530 -256926 -227376 -231636 -270838 -257085 -211448 -211849 -191027 -179445 -162412 -206028 -245131 -149429
24518a49429N6510l019j6118j4003M7087M9952N3763N3927K1719J4960K4260n0592
24506H9017p3480n8172k2056k8666K0177O2259M138r057J5812j1167o4647J9744
24494e6098L4987L5452k5814J8299K9045L9701k1992q8883j6424j6406K6235K3294
24482a8604J6385l8883n1654L1458M8652m4018q8060J0537L4857l7608m6739n20
24470a84197j1434m3937K440P135q00k8301q4766R837P3494K4920Q866l0943l937
24457b61623K5766J6707L0731k0877J5977L9389M5927l5169j1151M2324N1666
24446f0333N8798L2133j3425N8396J0178m7978L1571j2816l0569K7330k5161L8151
24434F6275N2687K7104M5804n786k7529l8674r173l2713O779L7682R392p191k0655
$$ plain form
24518 -149429 -92919 -95938 -112056 -126059 -78972 -29020 24743 78670 100389 115349 139609 89017
24506 89017 15537 -42635 -64691 -93357 -73180 -10921 -6783 -15840 -28 -11195 -75842 -56098
24494 -56098 -21111 14341 -11473 6826 35871 75572 53580 -35303 -51727 -68133 -41898 -18604
24482 -18604 -2219 -41102 -92756 -61298 -12646 -56664 -144724 -134187 -99330 -136938 -183677 -184197
24470 -184197 -195631 -239568 -237128 -229993 -230793 -259094 -343860 -334023 -260529 -235609 -226743 -257686 -261623
24457 -261623 -235857 -219150 -188419 -209296 -193319 -153930 -108003 -143172 -154323 -111999 -60333
24446 -60333 -1535 30598 17173 75569 85747 37769 69340 56524 25955 53285 28124 66275
24434 66275 118962 146066 191870 186084 158555 119881 110708 77995 84774 122456 131848 124657 104002
24421A04002m0676k4503m3736O7031M2288M7888R8613J10449J4825r2265q6251
24410A97665p9570n4802k3448j7267k055N2668K7421M6394l3122k7880j5647j2173
24398E8184J3437j8788q139n2046p587J9115k2501k0199M6230M3229m597M522
24386E0860N473N8302K4147k6261p2711k3762P061L5751j4339k1473M3208R508
24374G5764l8642j969J3945K3617k4624l852N2662J9460p061n0258p3997l2532
24362d7487M5670k2283P093O6922l823K2307k2173N050K5134M4410l4682o9544
24350A6594k2722o95j2446n5564J8162J5600L3565l9326l5894K7982n336j370
24338f1450J4344J5640K4597J9552k0856q4538K933K3172N9987k2399K1262K5779
$$ plain form
24421 104002 63326 38823 -4913 62118 104406 152294 250907 361356 376181 283916 197665
24410 197665 118095 63293 39845 22578 20523 73191 100612 147006 113884 86004 70357 58184
24398 58184 71621 52833 44694 -7352 -14939 4176 -18325 -38524 7706 50935 46338 50860
24386 50860 56333 114635 138782 112521 39810 16048 23109 58860 44521 23048 66256 75764
24374 75764 37122 35153 49098 72715 48091 44239 96901 116361 109300 59042 -14955 -47487
24362 -47487 -1817 -24100 -17007 49915 46092 68399 46226 51276 76410 120820 86138 16594
24350 16594 -6128 -6823 -19269 -74833 -56671 -41071 -7506 -46832 -82726 -54744 -60080 -61450
24338 -61450 -47106 -31466 -6869 12683 -8173 -92711 -89778 -66606 -6619 -29018 -7756 18023
24326A8023k775K82M5630K5577o8350k8960J0392j1378l7753J8144J1252p343
24314b7259j2481P113N1097N2840J6033K1590L098q149j7342n9431J2669k3932
24302A5846n4361M2838K929P585j8775p778J3771J0675O9k3343L2710k1348J0794
24289A1612L8686J4508k3984L232J6138j3646L2428k9733m1960q099K5207J5544
24277C9933M450J1735L3655K0547K3108J3694N984K2958K6624j2055K452R656
24265B02741p4414m276K7348k7385j6206O5746k030n9517J5830m1030k3238k143
24253F1426O400L92J9622J8440K068K2510L757m7313l3380J4737M128M3293L3051
24240A49131L5298j5340j260J0242K6865m7689J420j2350N8928J9628q2543j3975
$$ plain form
24326 18023 15248 15530 61160 86737 18387 -10573 -181 -11559 -49312 -31168 -19916 -27259
24314 -27259 -39740 -32627 18470 71310 87343 108933 112031 103882 86540 27109 39778 15846
24302 15846 -38515 4323 7252 14837 -3938 -11716 2055 12730 12799 -10544 22166 818 11612
24289 11612 50298 64806 40822 44054 60192 46546 78974 49241 7281 -818 24389 39933
24277 39933 44383 56118 89773 110320 133428 147122 153106 176064 202688 190633 193085 202741
24265 202741 128327 124051 151399 124014 107808 173554 171524 112007 127837 86807 63569 61426
24253 61426 67826 68218 87840 106280 108348 130858 134615 87302 53922 68659 72787 116080 149131
24240 149131 184429 169089 167829 178071 204936 157247 158667 146317 205245 224873 142330 128355
24228A28355Q378K4163L574J5347r399l210k7453l052L3343j8005l1484K28k7924
24215I2861k2513k5896l7933k2637m141k7852l7738j6890j5708J4644P2210N258
24203b6335o7391l7426J41J6312L3105K4504R656O3308j9389k7662l9211q573
24191g8961J4611k0939K1538j3414N1732J5893K4754M1487P72L0260k4843p2610
24179i720L27K464L458J5924l1779m1805O241R3898j8414m3993L3872R617M5021
24166F5111M059r388J1187L5309Q7680m4726p2237O690j1791j6318J654L822K6132
24153H7184O4282K3646P997j4048o5345L919M2325j9071J634l0038N508K9795
24141A37788J424O737J3058j5984k134j4677l1472j4690K895J0134K7432K1893
$$ plain form
24228 128355 136733 160896 164470 179817 170418 167208 139755 136703 170046 152041 120557 120785 92861
24215 92861 70348 44452 6519 -16118 -20259 -48111 -85849 -102739 -118447 -103803 -31593 -26335
24203 -26335 -93726 -131152 -131011 -114699 -81594 -57090 -47434 15874 -3515 -31177 -70388 -78961
24191 -78961 -64350 -85289 -63751 -77165 -25433 -9540 15214 56701 57473 87733 62890 -9720
24179 -9720 -9393 -6929 -3471 12453 -19326 -61131 -54890 39008 20594 -23399 10473 20090 65111
24166 65111 69170 59782 70969 106278 193958 149232 76995 83685 71894 55576 57230 61052 87184
24153 87184 151466 175112 183109 169061 103716 107635 149960 130889 132523 102485 107993 137788
24141 137788 139212 145949 159007 143023 140889 126212 94740 80050 82945 93079 120511 142404
24129A42404q475K2558j5032j13992p1421K3278L6471j4278l5492K4560M8460
24118C9041j3367q6860k8294N9608m107J0939k5167m9884M5528M4033k7157K4467
24106a1220K1098k6202K722M1523K5620L994j0425J063k7916o662l053K7526P13
24093C8781j2399J3506N3061M1492L1419N4953m7771o6319P846N4035l3678J3173
24081A48099L8154p242l1058k8467m8724L6203K9825j4112m8295m5337j1564O439
24069B3921O1576O3102M8165l5509o8805p953K330l8813k3062l9431N283j0657
24057a9853L9673N1071l8318j8738r157j9510k0096K9163K5841N344k439r806
24045A3175j2425k4023n4766q730N9824M1932L989l3947o4962k2775J8048k5727
$$ plain form
24129 142404 133929 156487 141455 27463 -43958 -20680 15791 1513 -33979 -9419 39041
24118 39041 25674 -61186 -89480 -29872 -33979 -23040 -48207 -98091 -52563 -8530 -35687 -11220
24106 -11220 9878 -16324 -13602 27921 53541 57535 47110 48173 20257 13595 10542 38068 38781
24093 38781 26382 39888 92949 134441 165860 220813 173042 106723 114569 168604 134926 148099
24081 148099 186253 179011 147953 119486 70762 106965 136790 122678 74383 29046 17482 23921
24069 23921 85497 148599 196764 161255 92450 84497 86827 48014 24952 -14479 -9196 -19853
24057 -19853 19820 70891 32573 13835 4678 -14832 -34928 -5765 20076 25420 22981 13175
24045 13175 750 -23273 -78039 -86769 -26945 14987 18976 -14971 -79933 -102708 -84660 -110387
24033a10387m1218l0618K782K0902O2898N1520J5630l3532Q1196j0151o1968l5721
24021h8667J5577j3305m6463J3986L5453j1940N2348O8486o7651o3209L0483M3737
24009c1165L8352j537K7314j1897m746M511p7045K4445K1817j0254J6213J2343
23997H351l6737J7816O3479R20N6614K5120l5088j9292M852k7421M7475j3777
23985I2312l5375J7730K9809O2813M835q6051j01471n08J01686M4443j9121l5688
23973G5414m1779j6228j0634N2441N535j2859m4917J7239j424J9223L9001n3873
23961B7139l3350L3031R526L8131k3257k9536m3218R7669R4918l6788l1277q7264
23949A5724o5581K9026K0146l408K6887N9298J9615l5729R061n1523p7829j7651
$$ plain form
24033 -110387 -151605 -182223 -179441 -158539 -95641 -44121 -28491 -62023 19173 9022 -52946 -88667
24021 -88667 -73090 -86395 -132858 -118872 -83419 -95359 -43011 25475 -42176 -105385 -74902 -31165
24009 -31165 7187 5650 32964 21067 16321 20832 -56213 -31768 -9951 -20205 -3992 8351
23997 8351 -28386 -10570 52909 53829 110443 135563 100475 81183 86035 58614 106089 92312
23985 92312 56937 74667 104476 167289 172124 86073 -15398 -15906 85780 130223 111102 75414
23973 75414 33635 17407 6773 59214 64749 51890 6973 24212 22788 42011 81012 27139
23961 27139 -6211 26820 36346 74477 51220 21684 -21534 76135 171053 134265 102988 15724
23949 15724 -49857 -20831 -685 -4093 22794 82092 101707 65978 75039 23516 -54313 -71964
23937g1964O8605N7456O199k7883n1889Q341M8003Q907m4349q565n6148L198O3188
23924C099N5098O795q180j5631k4086n9816O666P2230K7440J7531r522j4589P252
23911F4287M2156J3061m655l7396k3911k6889J4656L8670q104j2844n5354p6980
23899g3303j7939L462O0677K4492J7516l2216K4767K6424m2035l6211m881k965
23887e2212k2686n380P1699N1656l0721j6702L1195J6346m5621L2938O2741j6498
23875G6755j8999k1227m5213K634q00j291n7976R964N1979K4270k597K985N0066
23862G0550K908J9621J0916l8627k2018J2662N0594R635n7784k1449K815r50L1168
23849G0041L517K4234o2148m1397L5080R6952m513p0553n4902k5163O4687K35
$$ plain form
23937 -71964 -3359 54097 60296 32413 -19476 -11135 36868 45775 1426 -7139 -63287 -60089 3099
23924 3099 58197 64992 56812 41181 17095 -42721 -36055 36175 63615 81146 71624 57035 64287
23911 64287 106443 119504 114849 77453 53542 26653 41309 79979 71875 59031 3677 -73303
23899 -73303 -91242 -87780 -27103 -2611 14905 -17311 7456 33880 -8155 -44366 -49247 -52212
23887 -52212 -74898 -80278 -8579 43077 12356 -4346 26849 43195 -2426 30512 93253 76755
23875 76755 57756 36529 -8684 -6050 -6850 -8141 -66117 -56153 -4174 20096 17499 20484 70550
23862 70550 73458 93079 103995 65368 43350 56012 106606 116241 58457 37008 39823 38873 70041
23849 70041 73558 97792 35644 -5753 29327 126279 121766 51213 -3689 -28852 35835 36070
23837C6070k3453o4756K6754N6843J6081J6949j0370n5284n2713J5176L5402N3577
23825E0276o362l8047o0342n1942N1463k6897K6595k9651n0907L9702N2471J5902
23813b7739m2484l5898J1254J7646J4980N372J50N8005K7967m8293o0316K9178
23801e0178M2839k146N5620k3510l4623l8818j5744O643J418L2929J884l5973
23789e9659K0278L6227J6750p741k7846k4023k46J7686J7445N5011M0765j5561
23777F9086l3092k1785m1008L0439J6712L1877L3502j6424K6133j3973o1135j9657
23765F75J906K3360l2160K7796J0475R174l408J5819K884P172p9579j8531m471
23752c8888N5703M9471j9293N765M0279l7670n0462n430O1607J0840l8747n4477
$$ plain form
23837 36070 12617 -52139 -25385 31458 47539 64488 54118 -1166 -53879 -38703 -3301 50276
23825 50276 43914 5867 -54475 -106417 -54954 -81851 -55256 -84907 -135814 -96112 -43641 -27739
23813 -27739 -70223 -106121 -94867 -77221 -62241 -56869 -56719 1286 29253 -19040 -79356 -50178
23801 -50178 -7339 -9485 46135 22625 -11998 -50816 -66560 -59917 -58499 -25570 -23686 -59659
23789 -59659 -39381 -3154 13596 5855 -21991 -46014 -46260 -28574 -11129 43882 84647 69086
23777 69086 35994 14209 -26799 3640 20352 52229 85731 69307 95440 81467 20332 675
23765 675 2581 25941 -6219 21577 32052 41226 37818 53637 56521 63693 -15886 -34417 -38888
23752 -38888 16815 66286 46993 52758 93037 55367 4905 -525 61082 71922 33175 -21302
23740b1302j405P899R876R16J6041J0367K743L490r223M7349M8742L0862j680
23727A44675j718N607o3175k4356J2426n5943J1990K8896K3859j2035K8995m7847
23715E1374J4258L4470O02K914l0868k1653K865r611k3396k8992K5564L5990L8449
23702I1966l0001k9124Q466K5834N2398L2466k9942n2734o5047m039L6026R995
23690D6264j8033M552J7783M2337J1099l4182o419j4594L883l448j346j7865K4827
23677E4858n764l6667j3670J957l1900j8530M3226J1791n5397J1501O954j7481
23665d9122J5683P4837P3490j9999o2772k4530K7712L6939o950J4100J3550J2762
23653A05700k0748l4219j2451O812o448k1345m5307o5715p1p271M5574O1036k0069
$$ plain form
23740 -21302 -22707 -14808 -4932 -4016 12025 22392 25135 28625 19402 66751 115493 146355 144675
23727 144675 142957 148564 85389 61033 73459 17516 29506 58402 82261 70226 99221 51374
23715 51374 65632 100102 100704 103618 72750 51097 53962 44351 20955 -8037 17527 53517 91966
23702 91966 61965 32841 41307 67141 119539 152005 122063 69329 4282 243 36269 46264
23690 46264 28231 32783 50566 92903 104002 69820 63401 48807 52690 49242 47896 30031 54858
23677 54858 49094 12427 -1243 714 -31186 -49716 -6490 5301 -50096 -38595 -31641 -49122
23665 -49122 -33439 41398 114888 94889 32117 7587 35299 72238 65288 79388 92938 105700
23653 105700 84952 50733 38282 45094 38646 17301 -28006 -93721 -93792 -101063 -55489 5547 -14522
23640a4522P734L5535K2259M085o620m862L2244J4732n0421M1328k0218k8890
23628C2384l5763k5280J1323k6039j8172P2193N0379j9954k7173k9789k6634J4055
23616b8470K6844K7674M790l5611q124R385P713K5453m1274j1837K7364n33m048
23603f74m618r741J9730L3681j1535j5773l7100k6478J5708k1731o525J5634M2509
23590f913N4654J2398k0032m2300K2035L779m9263m5015O4955P9469J7855l3131
23578E8491q6298N938K1818J3632l4786J4560N4390J7387K459k8833m9199L5959
23566B5518J3437k956N399n1327l0984J1140r113P061N1244k0606j9067k0475
23554d0729k7740N0853K8583k4094j8251N5493K5790l1250L326N3107k3073p3331
$$ plain form
23640 -14522 -6788 28747 51006 55091 48471 43609 75853 90585 40164 81492 61274 32384
23628 32384 -3379 -28659 -17336 -43375 -61547 10646 61025 41071 13898 -15891 -42525 -28470
23616 -28470 -1626 26048 30838 -4773 -12897 -3512 4201 29654 -11620 -23457 3907 3374 -674
23603 -674 -5292 -15033 4697 38378 26843 11070 -26030 -52508 -36800 -58531 -65056 -49422 -6913
23590 -6913 47741 60139 40107 -2193 19842 23621 -25642 -70657 -5702 73767 91622 58491
23578 58491 -27807 -21869 -51 13581 -21205 -6645 47745 65132 67591 38758 -10441 25518
23566 25518 38955 35999 41398 -9929 -40913 -29773 -38886 -31825 19419 -1187 -20254 -40729
23554 -40729 -68469 -17616 10967 -13127 -31378 24115 49905 18655 21981 75088 52015 -21316
23542b1316p0498J6127J9446L5190J09J3869K6567M192m2201p423N6439M388n2000
23529a7111k3284l4769J1066M6843N1125J6625j0696j6234j2566J7708j4243N170
23517A9634o617r4556L277M8277L4364K0099M6967n488m0108N728r569j0269K2272
23504C4011L086k349l9227p3636k5201R216M07L8209Q232K5784m401P745j2337
23491c0461n754J8641k3249k0295K0889M249R22o775M9660M1799j85j1828N205
23478D2818l4521j0919P04K4880L407m7930j7624K6892M4937J0263l2809O474
23466A6572n8785J3343P6880J3964m1684n293m1892L2008M6518k7207J6923k8872
23454A2475J331J5229j452j3926Pl491K5663K896n1075M064K0759J4152j6773
$$ plain form
23542 -21316 -91814 -75687 -56241 -21051 -20942 -7073 19494 23686 -18515 -25938 30501 34889 -17111
23529 -17111 -40395 -75164 -64098 -17255 33870 50495 39799 23565 10999 28707 14464 19634
23517 19634 13017 -81539 -78262 -29985 4379 24478 71445 65957 25849 31577 22008 11739 34011
23504 34011 37097 34748 -4479 -78115 -103316 -94100 -93693 -55484 -47252 -21468 -25869 -18124 -30461
23491 -30461 -36215 -17574 -40823 -61118 -40229 -35980 -35058 -41833 7827 49626 49441 37613 42818
23478 42818 8297 -2622 -1918 22962 26369 -21561 -39185 -12293 32644 42907 10098 16572
23466 16572 -42213 -28870 48010 61974 20290 14997 -26895 5113 51631 24424 41347 12475
23454 12475 13806 29035 27583 13657 13664 10173 35836 38732 -12343 -8279 12480 26632 9859
23441I859j5934j635o78L1617M3948L9091K2646l0034J08l0231J1883j8370l8940
23428B3330l0625K6405m7047N7284K2843j6114p682L2863n195j475k216J3451
23416F5822l1582o4749L4556M2993j4238k577L075l7025o0432j8653O9161J5436
23404A787L7419L2312j6205j6647L4158j87n3658m383J0538R092M1167K7238j602
23391A01029j0964L7463n8750q3957K3529J8710l0372j6336J2050J8152K1649
23380C2203M2558L8506n5770m3883O990O756Q175k7633j7165r265j8132n622J1416
23367c0866M0753m3545k4829l7827L9252J0802j8119p580M1102R976N567J3777
23355a537O759m6660j2733L5599R705j111m735l4753k3338L2969j4668j0913K4045
$$ plain form
23441 9859 -6075 -7710 -8388 23229 67177 106268 128914 98880 98988 68757 80640 62270 23330
23428 23330 -7295 19110 -27937 29347 52190 36076 28394 61257 56062 54587 52371 65822
23416 65822 34240 -30509 4047 47040 32802 30225 33300 -3725 -64157 -82810 -13649 1787
23404 1787 39206 71518 55313 38666 72824 72637 18979 14596 25134 34226 75393 102631 101029
23391 101029 90065 127528 68778 -15179 8350 27060 -3312 -19648 -7598 10554 32203
23380 32203 74761 113267 57497 13614 20604 27360 35535 7902 -9263 -18528 -36660 -42282 -30866
23367 -30866 9887 -33658 -58487 -96314 -57062 -46260 -64379 -71959 -30857 -20881 -15314 -1537
23355 -1537 5222 -41438 -54171 -18572 -8867 -9978 -14713 -49466 -72804 -39835 -54503 -65416 -41371
23342d1371K8445M0173j2957J591K6271j4110o582K649L7963J027L0268J9927
23330A13294j9534n4172m4031l6361K0530L9442J9973n710O1305j8783p1380k0584
23318a6011k772K9391K142j817j7632O2512K1558l3099l3298n5256k4127J6026
23306e2383r215K0087M1755N4954k6250k7749j5480o1644J5810L1208K5119j7433
23294b1221k3805K7388L0044P353N439L4728P798m3650o7499k631J2445N7385
23282B3774J3677k2966M5360L4078k8701m9335J9383k8236m8021L9480M5504K7078
23270G1075j7914q732k2782l510L2861J4840l8560K1686k720p6286L9783P5180
23258H4921j7661l1141k1098k9728k6723J0026N0069k6744o9334q087j0067L7106
$$ plain form
23342 -41371 -12926 27247 14290 15881 42152 28042 21460 24109 62072 63099 93367 113294
23330 113294 93760 39588 -4443 -40804 -20274 19168 39141 33431 94736 75953 4573 -16011
23318 -16011 -18783 10608 12750 10933 -6699 55813 77371 44272 10974 -44282 -68409 -52383
23306 -52383 -61598 -41511 244 55198 28948 1199 -14281 -75925 -60115 -28907 -3788 -21221
23294 -21221 -45026 -17638 12406 19759 25198 59926 67724 24074 -43425 -46056 -33611 23774
23282 23774 37451 14485 59845 93923 65222 15887 35270 7034 -40987 -1507 43997 71075
23270 71075 53161 44429 21647 18137 50998 65838 27278 48964 46244 -30042 9741 84921
23258 84921 67260 36119 15021 -14707 -41430 -31404 18665 -8079 -77413 -85500 -95567 -58461
23246e8461l7907L0257k6328M174R8230L9304k7455o6867k887K5283q882J1797
23234a9742M096m0761j3532J8839k451k6587N1896R1817j9460m9812j6268J9064
23222b901K8883K4921K4983m6216n2549n1633J9023k0649P2730N2127P112L3243
23210H9074J8216n9562n3348m3897J0869j9041p741L2392K9691q101j9015q09
23198c1272j8819n383J6338j0202K4306M6420R807p286k8314L3160j6741J323
23186A3337q986O1600k2197l1223m0578m5852K3128k3293l9310N5073J4378O8204
23174B4281N0081m1863l6190n3847m1939R407L4054M3228K3502K8016K1494m1228
23162A8996k1647J8030L1794j139p60J3485L2115l4457j494J4093K1698L2690
$$ plain form
23246 -58461 -96368 -66111 -92439 -88265 9965 49269 21814 -45053 -47940 -22657 -31539 -19742
23234 -19742 -15646 -56407 -69939 -51100 -53551 -80138 -28242 63575 44115 -5697 -21965 -2901
23222 -2901 25982 50903 75886 29670 -22879 -74512 -55489 -76138 -3408 48719 55831 89074
23210 89074 107290 47728 -5620 -49517 -38648 -57689 -65430 -33038 -3347 -11448 -30463 -31272
23198 -31272 -50091 -55474 -39136 -49338 -25032 21388 31195 23909 -4405 28755 12014 13337
23186 13337 4351 65951 43754 12531 -28047 -73899 -50771 -74064 -113374 -58301 -43923 24281
23174 24281 74362 32499 -3691 -57538 -99477 -90070 -56016 -12788 10714 38730 60224 18996
23162 18996 -2651 15379 47173 46034 45274 58759 90874 56417 54923 69016 90714 123404
23150A23404J0227o9341k7868O489j5103m9290r001j4803O4435J0363K3063J2571
23138F5146n5757p312M2517N6738m9835o8245k2524J0896L6018N5968l7849o3571
23126c7810L4599L1046O407k5071r101J5421N1656J068o6936m5007k0422K3058
23114d1092L243L2954J6038J4363P764k7077O757q211n5540J3717L6589m571K0263
23101A5197K0544L7402M739m254k6647l8245n8802j5058N0530k89n23K3382j3228
23088e252L685J2651J3368k3889k3541Q9957O9747r914l0268O977r715q9778k5475
23075b1447J4976p706j7216L7829K9299r840K246Q683j8235m342k1922o553J7054
23062B826k4768k4293m1493k500L2046J4148k1273k8734K5267J1457k9657m7119
$$ plain form
23150 123404 133631 64290 36422 42911 27808 -21482 -30483 -45286 19149 29512 52575 65146
23138 65146 9389 2077 44594 101332 51497 -16748 -39272 -28376 7642 63610 25761 -37810
23126 -37810 -3211 27835 34242 9171 70 15491 67147 68215 1279 -43728 -64150 -41092
23114 -41092 -37849 -4895 11143 25506 33270 6193 12950 4739 -50801 -37084 -495 -5066 15197
23101 15197 35741 73143 77882 73628 46981 8736 -50066 -65124 -14594 -14883 -15406 7976 -5252
23088 -5252 -1567 11084 24452 563 -22978 66979 136726 126812 96544 103521 93806 4028 -21447
23075 -21447 -6471 -14177 -31393 6436 35735 25895 28141 36824 18589 14247 -7675 -14228 2826
23062 2826 -21942 -46235 -87728 -90228 -58182 -44034 -65307 -94041 -68774 -57317 -86974 -134093
23050a34093J5050J03200J9583l8529j9186K2617Q3139j2479j8484k6653j347
23039g182K9139j1459J5286k3966l363j7099l4864P4032Q2716m3690n134k3005
23027C1411k2275k2896J7690l0122j4235J7716N59J8619J6940J8782K7008L0135
23015H9332j6379l1129k3545n4132J9526L8145P415k5284j7418m1325K4759M2022
23003A1987k4064l4783o933M1059M3192l8855l0661K7222l438m7354l253K8060
22991c7821M4994K0018o480J6995m2711l7976l3767j284O9526O7465m8275L0406
22979D1090M1460k9583m7605M4797J7666l8587m4204m4209L8309M5992j4495j5052
22967d421l0561J6018k4382L2870M4114Q305R181k7558k8941J9034k2494l4813
$$ plain form
23050 -134093 -119043 -15843 3740 -34789 -53975 -31358 51781 39302 20818 -5835 -7182
23039 -7182 21957 10498 25784 1818 -1545 -18644 -53508 20524 103240 59550 54416 31411
23027 31411 9136 -13760 3930 -26192 -40427 -22711 -22152 -3533 13407 32189 59197 89332
23015 89332 72953 41824 18279 -35853 -16327 21818 29233 3949 -13469 -54794 -30035 11987
23003 11987 -12077 -46860 -53793 -12734 30458 -8397 -39058 -11836 -15274 -62628 -65881 -37821
22991 -37821 7173 27191 20711 37706 -5005 -42981 -76748 -78032 -8506 58959 10684 41090
22979 41090 82550 52967 5362 50159 67825 29238 -14966 -59175 -20866 25126 10631 -4421
22967 -4421 -34982 -18964 -43346 -10476 33638 41943 51124 23566 -5375 13659 -8835 -43648
22955d3648k943N2977P4773k7290n6427r655O123J8366N9779k6972n5485Q126
22943b276k0989K7372L3693j2331m456l8899Q426j0778L0330J9126o8678k3574
22931f3034N2113K2490k5615k1740K8924M0985N632l5489k1971J0655K3616J1576
22919B8142p3997K289o979L1450M2124o446n3658j1763o145J7443K1105R656k511
22906i290L7028l7250l2840J4785r325J5958J8655K745R982N1913n697n0819N6703
22893F2548m4802o2784K5253L2894J2131j4681J3055J1275J7782J1115j4979p1785
22881b2978J8930J5652K4156J3072J2904j9797p709P342k8662N913N4343K6541
22869I9707m6265l5445n4289l1276j372K5275K0861j9793j2087k1067K1163j6565
$$ plain form
22955 -43648 -46591 6386 81159 53869 -2558 -12213 -6090 12276 72055 45083 -10402 -2276
22943 -2276 -23265 4107 37800 25469 21013 -17886 -9460 -20238 10092 29218 -39460 -63034
22931 -63034 -10921 11569 -14046 -35786 -6862 34123 39755 4266 -17705 -7050 16566 28142
22919 28142 -45855 -43566 -50545 -19095 23029 16583 -37075 -48838 -54983 -37540 -16435 -6779 -9290
22906 -9290 27738 -9512 -42352 -27567 -36892 -20934 -2279 466 10448 62361 56664 5845 62548
22893 62548 17746 -45038 -19785 13109 25240 10559 23614 34889 52671 63786 48807 -22978
22881 -22978 -4048 11604 35760 48832 61736 41939 34230 41572 12910 18823 73166 99707
22869 99707 53442 17997 -36292 -67568 -68940 -43665 -22804 -42597 -54684 -75751 -54588 -71153
22857g1153j6345r640M7118Q0856J4338j5334k5493j2169R101L6529n9949n741
22845b7882M9177O8596J829m1119p3005K7827M4125q709J4765j2718n5448n6713
22833f9275M757j4507N1716K9258J0123K2394j5147o9916p4393J7817N8266j5396
22821f4303J7492M8073j0648k6937J6646N8642J0340k8560p1338m9799K2129N779
22809g2484o175K4097J4440l6774o550q009M9958N0750q067r1389o479j3103j9017
22796a28802N3721M0577l1628l4449J3976L5258J0788M755M3966l63l9290l6323
22784f7814l1802m886J7818n86J5078K7628J5174k953J0613K4033j6874k7531
22772d2102J6774L8330K7028M605n1235N367Q287j3061k0071L4576p104K4643
$$ plain form
22857 -71153 -87498 -97138 -50020 30836 45174 29840 4347 -7822 1279 37808 -22141 -27882
22845 -27882 21295 89891 91720 50601 -22404 5423 49548 40839 55604 42886 -12562 -69275
22833 -69275 -64518 -79025 -27309 1949 12072 34466 19319 -50597 -124990 -107173 -48907 -64303
22821 -64303 -46811 1262 -9386 -36323 -19677 38965 49305 20745 -50593 -100392 -78263 -72484
22809 -72484 -78659 -54562 -40122 -76896 -83446 -91455 -41497 9253 1186 -90203 -96682 -109785 -128802
22796 -128802 -75081 -34504 -66132 -100581 -86605 -51347 -40559 -35804 8162 7799 -31491 -67814
22784 -67814 -99616 -104502 -86684 -87270 -72192 -44564 -29390 -32343 -21730 2303 -14571 -42102
22772 -42102 -25328 13002 40030 44635 -6600 -1233 7054 -6007 -26078 8498 1394 26037
22760B6037O411j9242R71J1568L280m163M5042l7230j0247J2180P102J2295k7301
22747B6703k9695J2450K7646p525m028k8344J0576j7891N4417j2644l7741L5198
22735B9122K2903k1063j1377L4929k6256k230O8020K9786n7496r0556k1305K1687
22723b3836l3851j3917K7159j740k2867J9757p488o3593J0032N6486L7729L0659
22711A4530K3184J1771M874n22k6720J835M251j0836j9695k0441k4167J5084M147
22698b2705n144j662k428J6818O8387j5950l3249l2656K4865L1999R591l7156
22686G10M2922M2727r942k9876j3442p6300k708M6249R292k4173k6291K2750M2806
22673B4724M174n8473k6552O143J4423L7221j0003m7416j0278M825l6798K565
$$ plain form
22760 26037 32448 13206 14177 25745 29025 24862 69904 32674 22427 34607 41709 54004 26703
22747 26703 -2992 9458 37104 29579 25551 -2793 7783 -10108 44309 31665 -6076 29122
22735 29122 52025 30962 19585 54514 28258 26028 94048 123834 66338 -24218 -45523 -23836
22723 -23836 -57687 -71604 -44445 -46185 -69052 -49295 -56783 -120376 -110344 -53858 -16129 14530
22711 14530 37714 49485 54359 53837 27117 28952 33203 22367 2672 -17769 -41936 -26852 -22705
22698 -22705 -27849 -29511 -31939 -15121 53266 37316 4067 -28589 -3724 28275 37866 710
22686 710 43632 86359 76417 46541 33099 -43201 -45909 340 9632 -14541 -40832 -18082 24724
22673 24724 28898 -29575 -56127 -49984 -35561 1660 -8343 -55759 -66037 -61212 -98010 -95445
22661i5445N6302J7945k294J3981L5932K8766l6205k8198m1216l9859p516J0894
22649h6913r533L8484J01384O0636j3378l2609J4127k7817p4054k2919m4135N134
22637i1593j9350O361N3202P3239O825k6164k5898j8301k0174K6117M1402o2M4340
22624D9944P496o3846k1433k2451J0217L1868K05l9334l0329j4539N6245L482
22612c2475L9273P7522J3028o5814p7334j2036L8073L3153N838J9798k1144k2281
22600d399L4769J8924k1946j0944J7198j0048K67j8695j5417L6221M5132L456
22588G4518j6479r982n8615R929m215L5575m891R114k451p253J1319o3990k5112
22575e2533L9198P767N09O2690P184L2498K4951l0769n769j3189m9958q6541J6775
$$ plain form
22661 -95445 -39143 -21198 -23492 -9511 26421 55187 18982 -9216 -50432 -90291 -97807 -86913
22649 -86913 -96446 -57962 43422 104058 90680 58071 72198 44381 -29673 -52592 -96727 -91593
22637 -91593 -110943 -104582 -51380 21859 28684 2520 -23378 -41679 -61853 -35736 5666 5604 49944
22624 49944 57440 -6406 -27839 -50290 -40073 -8205 -8000 -47334 -77663 -92202 -35957 -32475
22612 -32475 6798 84320 97348 31534 -45800 -57836 -19763 13390 19228 39026 17882 -4399
22600 -4399 30370 49294 27348 16404 33602 23554 23821 5126 -10291 25930 71062 74518
22588 74518 58039 48057 -10558 -629 -4844 30731 25840 34954 32503 25250 36569 -27421 -52533
22575 -52533 -13335 -5568 -5059 57631 64815 97313 122264 91495 85726 72537 22579 -63962 -47187
22562d7187l6647J9485N2319J2032K9876R686M6408m966n1573k1806k0999K4175
22550A0803K9654k8093k5577R390R511J4090q605k8246K7811K3331O8671o3760
22538C8980n5129j9717M4035O1935J7936l7154j3837K4132J1945j2804k7365l461
22526B9496l8847J9962L1417K3011l2957m4307j1743M129l106j048l5408N423
22514e3978O5670M570j7357j5120J7617k0309k940M363J0996k7549k2498N4086
22502b449M1755L314m2584k3354J9582l111J698K5765O4517m7381r6996l0621
22490h9865N2529P920K940M0867K9596l7297n2458K4163K2246J0436L5565r364
22478C7278l2481j5957p38o3349m3088m239M7972M9532J04781M8492k4557m8169
$$ plain form
22562 -47187 -83834 -64349 -12030 2 29878 39564 85972 81006 29433 7627 -13372 10803
22550 10803 40457 12364 -13213 -3823 5688 19778 11173 -17073 10738 34069 102740 38980
22538 38980 -16149 -35866 8169 70104 88040 50886 37049 61181 73126 60322 32957 29496
22526 29496 -9351 10611 42028 65039 32082 -12225 -23968 -19839 -22945 -23993 -59401 -53978
22514 -53978 11692 16262 -1095 -16215 1402 -18907 -21847 -17484 -6488 -34037 -56535 -2449
22502 -2449 39306 42620 36 -23318 -3736 -6847 -5149 20616 85133 37752 -59244 -89865
22490 -89865 -37336 -29416 -26476 14391 43987 6690 -45768 -21605 641 11077 46642 37278
22478 37278 4797 -11160 -11898 -75247 -118335 -122574 -74602 -25070 79711 128203 103646 55477
22466E5477n0482l860o532J1493J107K817N399j9357J6169R188l5475l9360J5248
22453c8168L2225l8827p2170j1697P2591M5145j8652M425j5250n9904J0782P4619
22441a4881K0672L5680l0864m8454K274K2446l0934L4744L3927m0667j6412K2181
22429a0288K7176L0616k156m058L8936o5882o5616o935o477L4604N08M7990k3281
22416d863o2601m7090K0097K905L287N9908j8887K0029L4918k5301j8892J0333
22404b6157r271M4518l3705n7860J6897K1483O304l6469J5709r06l299j8958K9337
22391e2377O8956J9541j4911J7761L0139j5053J2864k9955k9054l3379k9598J1729
22379d3337K3017q290l7870N4619K8844j2220M8240N4968J0308m1938p8936l2555
$$ plain form
22466 55477 4995 1135 -5397 6096 7203 10020 15419 -3938 12231 21419 -14056 -53416 -38168
22453 -38168 -5943 -44770 -116940 -128637 -56046 -10901 -29553 -25128 -40378 -100282 -89500 -14881
22441 -14881 5791 41471 10607 -37847 -35573 -13127 -44061 -9317 24610 -16057 -32469 -10288
22429 -10288 16888 47504 45348 41290 80226 14344 -51272 -58207 -64684 -30080 -29572 18418 -4863
22416 -4863 -67464 -114554 -94457 -91552 -88265 -28357 -47244 -27215 7703 -17598 -36490 -26157
22404 -26157 -35428 9090 -24615 -82475 -65578 -44095 -37791 -74260 -58551 -59457 -62756 -81714 -52377
22391 -52377 16579 36120 21209 38970 69109 54056 66920 36965 7911 -25468 -55066 -43337
22379 -43337 -20320 -28610 -66480 -11861 16983 4763 53003 107971 118279 76341 -2595 -35150
22367c5150J7183J5616J6520j0352P638K5158J9561J1694m2680m4526j0765j3781
22355d3884p83o0898N31N0476O4770J3184j5945J3941M949k0911k3901K1437M6895
22342D9861p509l8921m821j6568o127M8018M1539J8986p2331o0607J7541l5586
22330f6525l5333j1877K5069N8603J0846j4431J2358J6612K2329j3451o4915q2869
22318a43584O082N1738N5014p781o3224J8097L8275M5549O0052l1326k9753l8362
22306c9223j761J4495n503k7057k8769K7859M6610L7035k0023l707l6867l0828
22294f7739j546j1091j1638K6196K2777k1398J5884q842l9738K1055J410J8473
22282e6197K8895m759o812J0333k4046n2820l798K4282P036l1257L393M9473J9771
$$ plain form
22367 -35150 -17967 -2351 14169 3817 11455 36613 56174 67868 25188 -19338 -30103 -43884
22355 -43884 -44667 -105565 -105034 -54558 10212 23396 7451 21392 26341 5430 -18471 2966 49861
22342 49861 42352 3431 -1390 -17958 -24085 23933 65472 84458 12127 -48480 -30939 -66525
22330 -66525 -101858 -113735 -88666 -30063 -19217 -33648 -21290 -4678 17651 4200 -60715 -143584
22318 -143584 -137502 -85764 -30750 -38531 -101755 -83658 -45383 166 60218 28892 -861 -39223
22306 -39223 -40984 -26489 -31992 -59049 -87818 -59959 -13349 23686 3663 -44 -36911 -67739
22294 -67739 -69285 -80376 -92014 -65818 -43041 -64439 -48555 -57397 -97135 -76080 -74670 -56197
22282 -56197 -27302 -32061 -38873 -28540 -52586 -105406 -109204 -84922 -77886 -109143 -105750 -56277 -36506
22269c6506J3945K2944K8608r645j8964k7561k8649k0598j501O6197K2024j3879
22257c585k112k940J7612O8770J8188L810j9071n7950o3344l6163L6225l5849
22245g6409m2165M0103J4283J5204L8239k8004k7361q76J5030L1297K3872M4177
22233D7390r145l933l2139N9490M9041l470Q10l4998J5854J1870q3399k3804K7655
22220B1222k7503m5778L086K5570M1068N0568k5113r994k4836J7725k4653q0825
22208g9463n9894M402N6664j5561L824L7657m380J9291j7850m7837Q4888N7188
22196C8929N1371J6228n5002m9329r7603J946M2421M6264j3485m0883J4477L7443
22184g223n156J7641J1529n4868k0176k8384O4825J4904j5094j5771m3130K4799
$$ plain form
22269 -36506 -22561 383 28991 19346 382 -27179 -55828 -76426 -77927 -11730 10294 -3585
22257 -3585 -5697 -8637 8975 77745 95933 99743 80672 22722 -40622 -76785 -40560 -76409
22245 -76409 -118574 -78471 -64188 -48984 -10745 -38749 -66110 -66986 -51956 -20659 3213 47390
22233 47390 38245 34312 2173 61663 110704 107234 108044 73046 88900 100770 17371 -6433 21222
22220 21222 -6281 -52059 -48973 -23403 17665 68233 43120 33126 8290 26015 1362 -79463
22208 -79463 -139357 -134955 -78291 -93852 -90028 -52371 -56751 -37460 -55310 -103147 -18259 38929
22196 38929 90300 106528 51526 2197 -95406 -93460 -51039 -4775 -18260 -59143 -44666 -7223
22184 -7223 -12379 5262 16791 -38077 -58253 -86637 -21812 -6908 -22002 -37773 -80903 -56104
22172e6104L901K3414J6805J6269l508J0375k5997J559N762Q01J644L1850L3229
22159F0000j621J3334N4879K348k7800n5171j1432m199R132j4029j5217L2160
22147D2384j2424L9991j1747O866J9276j4272j1365N921j4422L0711l5153m2137
22135C629n0566K1043N2261L0156K7062p749K9156p587o2258J2870L6058J0977
22123I5052n0959o5695J4259K3185K3542J779o0402l8855j8905K6107M069L4744
22111a2079N0389L2956k2033o4737j8074k7048J0734K6447J2226L5998P036O705
22099C8520K7760j3408q590j6188K115m6262o0176O597P7562J3335l2651j1119
22087b2505N326M1901L2300n016m2707k5529l8603K1454K3807K1056K5474j5211
$$ plain form
22172 -56104 -52203 -28789 -11984 4285 777 11152 -14845 -13286 -7524 -6723 -5079 26771 60000
22159 60000 58379 71713 126592 128940 101140 45969 34537 30338 39470 25441 10224 42384
22147 42384 29960 69951 58204 65070 84346 70074 58709 64630 50208 80919 45766 3629
22135 3629 -46937 -25894 26367 56523 83585 75836 104992 97405 35147 48017 84075 95052
22123 95052 44093 -21602 -7343 15842 39384 41163 -19239 -58094 -76999 -50892 -46823 -12079
22111 -12079 38310 71266 49233 -15504 -33578 -60626 -49892 -23445 -11219 24779 31815 38520
22099 38520 66280 52872 44282 28094 30209 -16053 -76229 -69632 7930 21265 -11386 -22505
22087 -22505 -17179 24722 57022 52006 9299 -16230 -54833 -33379 -9572 11484 36958 21747
22075B1747k6968L9268J6600p1492k5345Q566L9295K6365M6840k3450l0248k7757
22063f579o859O860n0454l1141j6131N8041M6747j6490n9259J0848L0841L6043
22051B467l4284j3062L4220K6709M0900N882q1997o0903N7988J7557j9118m2880
22039f6521j607J0645p441J621N43j8855r220N4309l090k7464L3653J0088J1710
22026a1629j2730j7759M8680K5390J3500J8747j7619l6905l5246J5058N6253L5761
22014H1501O615l6127J8555K9792k787m7103k3292P5324J1923o996o9483n7970
22002b0048r098J124l3244m849O6391m412l0370J7042K5693L9513l3217m3328
21990b8803K4586n929N2861K9562j9634j186k7651l8760Q034k3223j1924K9295
$$ plain form
22075 21747 -5221 34047 50647 -20845 -46190 -37624 1671 28036 74876 51426 21178 -6579
22063 -6579 -13438 -6578 -57032 -88173 -104304 -46263 484 -16006 -75265 -64417 -33576 2467
22051 2467 -31817 -44879 -10659 16050 56950 62832 -19165 -80068 -22080 -4523 -23641 -66521
22039 -66521 -68128 -57483 -64924 -63303 -62760 -81615 -90835 -36526 -39616 -67080 -33427 -23339 -11629
22026 -11629 -24359 -42118 6562 31952 45452 64199 46580 9675 -25571 -10513 45740 81501
22014 81501 88116 51989 70544 100336 97549 50446 27154 102478 114401 107405 37922 -20048
22002 -20048 -29146 -28022 -61266 -66115 276 -4136 -34506 -17464 8229 47742 14525 -28803
21990 -28803 -4217 -10146 42715 72277 52643 51457 23806 -14954 -6920 -30143 -42067 -12772
21978a2772M5823K081n0990L240O1521K5436N565m4992k3988k2158r120J8755
21966a599J0256p3402J4146k9645m215P1558L3683K229O346m0261l5464l2357
21954g8725k8972L8701M2071K5660J3450J4516J3655L8699k8098l0063P88K6393
21942D8075j9368n6230l9268p2623J146J02915K9383j6657J9519M8639K3347k8909
21930C9969p3205J5473J0536j3885n5K9536K7769k159O620J3611j9702j6501J9048
21917C7055k5808k3772P534K3084L698M701j7796l5490k7470l3772L4878M2268
21905a0890J5642r134K1688n9029j502L0661l5015k0149L5097p733M5171L3028
21893C7835o3009m2138l8626j8587j327M169N0855l334o2108J4927J16072M3498
$$ plain form
21978 -12772 33051 35132 -15858 -12618 48903 74339 79904 34912 10924 -11234 -20354 -1599
21966 -1599 8657 -64745 -50599 -80244 -84459 -12901 20782 23011 29357 -10904 -46368 -78725
21954 -78725 -107697 -68996 -26925 -1265 12185 26701 40356 79055 50957 20894 21682 48075
21942 48075 28707 -27523 -66791 -139414 -138268 -35353 -5970 -22627 -3108 45531 68878 39969
21930 39969 -33236 -17763 -7227 -21112 -21167 8369 36138 33979 40599 54210 34508 18007 37055
21917 37055 11247 -12525 -4991 18093 21791 26492 8696 -26794 -54264 -88036 -53158 -10890
21905 -10890 4752 -4382 17306 -41723 -43225 -12564 -47579 -67728 -32631 -40364 4807 37835
21893 37835 -25174 -67312 -105938 -124525 -125852 -121683 -70828 -74162 -136270 -121343 -5271 38227
21881C8227k3387l7309j8467L0029j0260j2571m9274k8687O3487O9060j6759j3664
21869i575j920L6264l2979j6752j4931p962K5398J7599k7111l1263o645q431l6885
21856a15193J900M1627k0798M1320N1025Q018j4939J7295n8632o6288L3626M9610
21844c1429L1897l5974p1865M114k76l4401M0982N9038j3935N3482K8276J282
21832C1191p85m9244P335j2493K6987K4712r201l734l6106n2213m7950k1518N675
21819a37344M4440M0094J9852J376J5777O57l54l3135n661K700R977J00446M9644
21806A08469k3406m2651n8974q471K2896p850l110l3956j1199J6959O2711M498
21794B5916L375l3830n0243l9511j3452l0798l1808K9719L0476L1076M5666N1551
$$ plain form
21881 38227 14840 -22469 -40936 -10907 -21167 -33738 -83012 -111699 -48212 20848 4089 -9575
21869 -9575 -11495 24769 -8210 -24962 -39893 -47855 -22457 -4858 -31969 -63232 -69877 -78308 -115193
21856 -115193 -113293 -71666 -92464 -51144 -119 7899 -7040 10255 -48377 -114665 -81039 -31429
21844 -31429 468 -35506 -107371 -103257 -103533 -137934 -96952 -37914 -51849 1633 29909 31191
21832 31191 30406 -18838 -11503 -23996 2991 27703 18502 14768 -21338 -73551 -121501 -143019 -137344
21819 -137344 -92904 -52810 -32958 -31582 -15805 -15148 -15502 -48637 -54298 -51598 -41621 58825 108469
21806 108469 85063 42412 -16562 -25033 -2137 -9987 -13097 -47053 -58252 -41293 21418 25916
21794 25916 29291 -4539 -54782 -94293 -107745 -138543 -170351 -140632 -110156 -79080 -33414 18137
21782A8137k6428m1765k5864O8645N2241K312j9499m8179n6599l2192M178j2202
21770a17215Q151N4727M26k7530R295N9388K4363j0142j4410J4255K7543J8561
21758D7412j0191l6309o3090l2304J7559K7535N7212p355l5958L118K595l3064
21746f2840M6517L5640l3253l2105j8425m52l772J7969j4338p305Q1692r94l7370
21733b9036L1089K4019j2678o0853o58O4541M3148q3894n7870L2835K9112J4146
21721f099o71k7443P617j4066l076k068K7764L7040R976m9239j6093P918l450
21708c1890J265m9714R374L9442J0967k84K8362m5699n020M2946N3962o5359l2936
21695d4584J2601O3927K7186k9594j9215k3350L0822Q713j6173k8320J7542k14
$$ plain form
21782 18137 -8291 -50056 -75920 -7275 44966 47278 27779 -20400 -76999 -109191 -105013 -117215
21770 -117215 -109064 -54337 -53911 -81441 -72146 -12758 11605 1463 -12947 1308 28851 47412
21758 47412 37221 912 -62178 -94482 -76923 -49388 7824 469 -35489 -32371 -29776 -62840
21746 -62840 -16323 19317 -13936 -46041 -64466 -64918 -68690 -50721 -65059 -72364 9328 8334 -29036
21733 -29036 2053 26072 13394 -47459 -48117 16424 59572 -24322 -82192 -49357 -20245 -6099
21721 -6099 -6770 -34213 -26596 -40662 -43738 -45806 -18042 18998 28974 -20265 -36358 -28440 -31890
21708 -31890 -30625 -80339 -70965 -31523 -20556 -20840 7522 -38177 -43197 -251 53711 -11648 -44584
21695 -44584 -31983 31944 59130 29536 10321 -13029 17793 26506 10333 -17987 -445 -659
21683f59P084k4474n2740k2126J6281O2225j534l819K9229Q556K2879k2057n6785
21670c7940K296K6472n806k4573m8248k937O2521L4859l6077k8540k6879N8947
21658b5905R233J2451p292m6582m9788j4831n527N2546J6538P739N2261K558l2618
21645b9217P429J4088M4731J7891o5398J2966j2728Q112M4664N6240J8899n9503
21633E8174n0218M355n4852k3852m3241j2349L9330M5838k1183j3266N9613J5295
21621C644k3340N510K4392k1175L3325K9945k4978n5170n2183j7625J4950L7983
21609d4722K2004k3725M919r035k2951M7909M641K2663q492n6791l4924N9085
21597c9419N8272L193l7696k1618p383n3688L5925r71J7488L8598m6684j3262
$$ plain form
21683 -659 6425 -18049 -70789 -92915 -76634 -14409 -15943 -19762 9467 18023 40902 18845 -37940
21670 -37940 -35644 -9172 -14978 -39551 -87799 -90736 -28215 6644 -29433 -57973 -84852 -25905
21658 -25905 -16672 -4221 -11513 -58095 -107883 -122714 -128241 -75695 -59157 -51418 843 3401 -29217
21645 -29217 -21788 -7700 37031 54922 -10476 2490 -10238 -2126 42538 98778 117677 58174
21633 58174 7956 12311 -42541 -66393 -109634 -121983 -82653 -36815 -57998 -71264 -11651 3644
21621 3644 -19696 -14186 10206 -10969 22356 52301 27323 -27847 -80030 -97655 -82705 -44722
21609 -44722 -22718 -46443 -41524 -50559 -73510 -25601 -20960 1703 -6789 -63580 -98504 -39419
21597 -39419 18853 22046 -15650 -37268 -44651 -98339 -62414 -63385 -45897 -7299 -53983 -67245
21585f7245j6546p412n364O074L6654L8726J3097J9463k1715j7560P4586M0193
21573I2951k6633l7537K5216J3758m9054J2658L6297k0233J8738J2570o3518q371
21561F842J1782j8289r124r737m756L9395K651k6537q5485M0292O6233O608j1672
21548H203j3262k3246l9689M7815N7929l867m6405l926l9408k2767N6328l754
21536b6049m2320p453J2265J6468J0297k8649l3027k553M9855L3070M4519L83
21524B6806n6363Q985L6446p280k5849m8897M0253K6974M2483j713j7583J8761
21512D3023J2394N070l1419j1644j9012n7373m8535l130P5002L7688O1265N097
21500F8426m6126J2389o551j3002Q529j4394j136R38K8475j1654m7608J8907N2651
$$ plain form
21585 -67245 -83791 -91203 -96567 -90493 -53839 -15113 -2016 17447 -4268 -21828 52758 92951
21573 92951 66318 28781 53997 67755 18701 31359 67656 47423 66161 78731 15213 6842
21561 6842 18624 335 -8789 -18526 -23282 16113 18764 -7773 -93258 -52966 13267 19875 8203
21548 8203 -5059 -28305 -67994 -20179 37750 33883 -12522 -16448 -55856 -78623 -22295 -26049
21536 -26049 -68369 -75822 -63557 -47089 -36792 -65441 -98468 -101021 -51166 -18096 26423 26806
21524 26806 -29557 -20572 15874 8594 -17255 -66152 -25899 1075 43558 41845 24262 43023
21512 43023 55417 60487 29068 17424 -1588 -58961 -107496 -110626 -35624 2064 63329 68426
21500 68426 22300 34689 28138 15136 23665 9271 8135 9073 37548 25894 -21714 -2807 49844
21487D9844K0287j7661j9869K049m2687o2718m9767q12P5508K8877l1488l4298
21475h2735k150j7860L7742N0771l2477n9457K1806O0389O6323n741n6537n5327
21463g5253L972J6881l0847P496J1867p910L6064L393J9444k19n3355K1994N586
21450d0887J1015n1216L973L466l8058k5087K4001P1936L7608k2753j8119k3776
21438f7897l466m1245p182L3440K3892N9998L1595l8066l0073J4177K1499L7708
21426C4380j0868l3009Q209K620L87K240m5521P464K8163j2961q8071k4989K7652
21413a04304N2521j7211O89p557k5189l7738M1601K4062O8148J3912l4419j4749
21401d0234O0017K9469M835m741n5896j1290k8428m8375M0945N2833J1194q160
$$ plain form
21487 49844 70131 52470 32601 34650 -8037 -70755 -120522 -121334 -45826 -16949 -48437 -82735
21475 -82735 -84885 -102745 -65003 -14232 -46709 -106166 -84360 -23971 42352 36611 -19926 -75253
21463 -75253 -71281 -54400 -85247 -77751 -65884 -73794 -37730 -34337 -14893 -15112 -68467 -46473 -40887
21450 -40887 -29872 -81088 -77115 -73649 -111707 -136794 -112793 -40857 -3249 -26002 -44121 -67897
21438 -67897 -71363 -112608 -119790 -86350 -62458 -2460 29135 -8931 -39004 -24827 -3328 34380
21426 34380 23512 -9497 -1288 1332 1719 3959 -41562 -34098 -5935 -18896 -106967 -131956 -104304
21413 -104304 -51783 -68994 -68305 -75862 -101051 -138789 -97188 -73126 -4978 8934 -25485 -40234
21401 -40234 19783 49252 54087 49346 -6550 -17840 -46268 -94643 -53698 -865 10329 2169
21389B169l5189O8017k5133j6700N4350P0188l8943q7215J1328j7283o7981N5957
21377b6435K9778k1327K8914l4724j1454J2836N7177l0107n6875n3730K8189J8648
21365e9110N348L5670j1430m8038l5750L7635M4810L5323L518j1141j3666j8743
21353c5574l949j8538J2153R610n5523j1595L6963k6856M434K0628J4349j3743
21341f7641p108Q029K2121l4774K1521K9821L4167K0744M0350j8315k4699l3604
21329i388j729O9443j2322j0947J0261J4646N121j7695j7167j8338L8765N2966
21317A03616j254J7574j2888m6906m7058l212J6713M198M6759l6351l9622J2782
21305A4351n9233K3182Q7311q117o277k5590j903N404p965N2500p5815l6920N0438
$$ plain form
21389 2169 -33020 34997 9864 -6836 47514 117702 78759 -8456 2872 -14411 -82392 -26435
21377 -26435 3343 -17984 10930 -23794 -35248 -22412 34765 4658 -52217 -105947 -77758 -59110
21365 -59110 -53762 -18092 -29522 -77560 -113310 -75675 -30865 4458 7976 -3165 -16831 -35574
21353 -35574 -39523 -58061 -45908 -36298 -91821 -103416 -66453 -93309 -88875 -68247 -53898 -67641
21341 -67641 -74749 -66720 -44599 -79373 -57852 -28031 6136 26880 67230 48915 24216 -9388
21329 -9388 -11117 58326 46004 35057 45318 59964 65085 47390 30223 11885 50650 103616
21317 103616 102362 119936 107048 60142 13084 9872 26585 30783 77542 41191 1569 14351
21305 14351 -44882 -21700 65611 57494 51217 25627 23724 29128 21163 73663 -2152 -39072 11366
21292A1366J3412k333o7754k1841l4415M4472L8974l608l3222Q741K8449o273
21280b4032l6635j3343l9100Q149K4820N4573R888K2594l5408K1591R494n2513
21268d9922j211J4090K9795n2597m7423L8384M5479j536r500J1104l5835j5632
21256g4804K0993R831k8794O4746r55l0704K6887J9213J1771l0420k1413M3982
21244A0333L9321m7733O635r740k0053M1578K8167L7326k8092n3813r0617n1160
21232a37848j4383J7030J5894K2821j7488j1406J0122M93L9718P2274p035m8469
21220e8277j6473K0212O2698q906q6494j8266J5813M6009J0916p320L5099M5108
21208D0119j6323l5578Q33j2995q263k1970L0553N5782K3847l6872j6530N624
$$ plain form
21292 11366 24778 22445 -45309 -67150 -101565 -57093 -18119 -21727 -54949 -46208 -17759 -24032
21280 -24032 -60667 -74010 -113110 -104961 -80141 -25568 -15680 6914 -28494 -6903 2591 -49922
21268 -49922 -51133 -37043 -7248 -59845 -107268 -68884 -23405 -24941 -34441 -23337 -59172 -74804
21256 -74804 -53811 -43980 -72774 -8028 -8983 -39687 -12800 6413 18184 -12236 -33649 10333
21244 10333 49654 1921 8556 -1184 -21237 20341 48508 85834 57742 3929 -86688 -137848
21232 -137848 -152231 -135201 -119307 -96486 -113974 -125380 -115258 -114765 -75047 -2773 -9808 -58277
21220 -58277 -74750 -54538 8160 -746 -87240 -105506 -89693 -43684 -32768 -40088 -4989 40119
21208 40119 23796 -11782 -10949 -23944 -32207 -54177 -23624 32158 56005 19133 2603 8227
21196H227K007n5811o0085N0335J9673L6054J7530j6790m9333j1594j660L3911
21184b7536O9196l4362r5207p4034l3609N1832L4210N350J5276J01013j1606p738
21172g215k8887L6970M042j4808l1346q429K662k0874j4872N0234K2628m8065
21160e7960J2503j2625J1900J2134J4395J8848j323L27l6455L440j7310J2160
21148c9966K7358j3801K5732L050n6673J789L2375O9217m7081j3489J4551k7244
21136b4182j2471M8329M1523N3175q8673l7649L334n4279l7622K4255K7422P800
21124d9038k216j1294p36j1901l4181R016N4476N0496J8858j6456J0170l1953
21112a4759j7293N1959J4296l3998m3863J537K5718Q936r974K2819O960j7821
$$ plain form
21196 8227 10234 -45577 -105662 -55327 -35654 400 17930 1140 -48193 -59787 -61447 -27536
21184 -27536 41660 7298 -87909 -161943 -195552 -143720 -109510 -104160 -88884 12129 523 -7215
21172 -7215 -36102 868 4910 -9898 -41244 -49673 -47011 -67885 -82757 -32523 -9895 -57960
21160 -57960 -45457 -58082 -46182 -34048 -19653 -805 -2128 -1801 -38256 -34816 -52126 -39966
21148 -39966 -12608 -26409 -677 2373 -54300 -52511 -20136 49081 2000 -11489 3062 -24182
21136 -24182 -36653 11676 53199 106374 17701 -19948 -16614 -70893 -108515 -84260 -56838 -49038
21124 -49038 -51254 -62548 -63284 -75185 -109366 -100350 -45874 4622 23480 7024 17194 -14759
21112 -14759 -32052 19907 34203 205 -43658 -42121 -16403 -7467 -17441 5378 12338 -5483
21100e483n4627p754j1314l3168L0401L0613n953q411O2980N281K256k0233q2446
21087i7858j7669J6420K0549N957l5025j023O870P1588O6901M271p2514m3783
21075g5316l3948L5243P242k0512K5803O4624L6008k2135J7090M6983r599n5403
21063A6080l7653O542O332m7551M0918K4521R287l2731K6802N9695O505o0107
21051A8640l6445m4686k3876K745k6049L7057M293j48j377K0378k9643J4050K3833
21038d1228m560K1378k8235l2798J9546M552Q34K9107K2294j6505L5580K1180
21026C1145p0037M96J9063K7910K6672M7677l6997j0171J364K98o2387j9842M6278
21013A469n624l1207K8092P7511L003j7294o1028j2381P441M1117M8325j1358
$$ plain form
21100 -5483 -60110 -67864 -79178 -112346 -81945 -51332 -57285 -65696 -2716 2565 4821 -15412 -97858
21087 -97858 -115527 -99107 -78558 -72601 -107626 -108649 -101779 -30191 36710 40981 -31533 -75316
21075 -75316 -109264 -74021 -66779 -87291 -61488 3136 39144 17009 34099 81082 71483 16080
21063 16080 -21573 -15031 -8699 -56250 -15332 9189 18476 -14255 12547 72242 78747 18640
21051 18640 -17805 -62491 -86367 -83622 -109671 -72614 -68321 -68469 -69846 -49468 -79111 -65061 -41228
21038 -41228 -45788 -24410 -52645 -85443 -65897 -61345 -60511 -31404 -9110 -25615 9965 31145
21026 31145 -38892 -38396 -19333 8577 35249 82926 45929 35758 37122 37420 -24967 -44809 1469
21013 1469 -4155 -35362 -7270 70241 73244 55950 -5078 -17459 -10018 31099 79424 68066
21001F8066N406J9004l4000m4038l5007L6891L022q294R38k6758R189J7702L147
20988A5268O2079K449k1684n1116j5136j06962k9370M1581K6304J3548m4321J8375
20976h8985O2010M5418k0246J2438k455m2646K524L8185O9982j5638n5331J9877
20964B5133J0694m4150n7395k5381k2503l4264J9158P2685L1028r667Q472J2396
20952a3794k2847j121K1884L1773l1267k3612k063j8588k4906K7812N4787k8723
20940c0665J4567j9300n9484J8153N917j0753J1518L5538m4963j4023J0386l3898
20928a17007N7164R209q776k1364N1771n592j4061p392L6378N126n8547j1698
20916h4789J0340M103J9058o76k072l5879J301M1236L7353N332l9181j7799n815
$$ plain form
21001 68066 73472 92476 58476 14438 -20569 16322 19344 11050 11988 -14770 -5581 12121 15268
20988 15268 77347 79796 58112 6996 -8140 -115102 -144472 -102891 -76587 -63039 -107360 -88985
20976 -88985 -26975 18443 -1803 10635 8180 -34466 -31942 6243 76225 60587 5256 25133
20964 25133 35827 -8323 -65718 -91099 -113602 -147866 -128708 -56023 -24995 -34662 -26190 -13794
20952 -13794 -36641 -37762 -15878 15895 -15372 -38984 -41047 -59635 -84541 -56729 -1942 -30665
20940 -30665 -16098 -35398 -94882 -76729 -70812 -81565 -70047 -34509 -79472 -93495 -83109 -117007
20928 -117007 -59843 -50634 -59410 -80774 -29003 -34595 -48656 -56048 -19670 -14544 -73091 -84789
20916 -84789 -74449 -70346 -51288 -51964 -54036 -89915 -88614 -47378 -10025 -4693 -43874 -61673 -67488
20903f7488j8776M0906L8438L446j5640l6342r239J770k6907P327J4690k2586
20891i0401J5037O1185k3095l1788J8992j4296J6402K4051M6304j0001k7736q343
20879b3689j4037m4712J0268P857j4622m121J3483j8956j4938K7685L5631O641
20867c3510L4482L8029J8987n1736lp811m0535J5J0276k3925J3950K3395l5234
20854e3620M508L9349K9811O960j8821q556m474N6872L2698l4397o0671n1176
20842f1517m841K5901k2931r911K5742L9876K5580R653K766O049L5949j986k8135
20829D2195M6542k8212o3321l524L9961M9990M8373m4422j7683n7188l6099l2313
20817e5701L5757q252L392P330J0932J32470K5230l0908m9370p2416k520l686
$$ plain form
20903 -67488 -86264 -45358 -6920 -3474 -19114 -55456 -64695 -62925 -89832 -82505 -67815 -90401
20891 -90401 -75364 -14179 -37274 -69062 -50070 -64366 -47964 -23913 22391 12390 -15346 -23689
20879 -23689 -37726 -82438 -72170 -64313 -78935 -83056 -69573 -88529 -103467 -75782 -40151 -33510
20867 -33510 972 39001 57988 6252 6249 -1562 -42097 -42082 -31806 -55731 -41781 -18386 -53620
20854 -53620 -49112 -9763 20048 27008 8187 -369 -4843 52029 84727 50330 -10341 -61517
20842 -61517 -66358 -40457 -63388 -73299 -47557 -7681 17899 27552 30318 36367 72316 70330 42195
20829 42195 88737 60525 -2796 -6320 33641 83631 132004 87582 69899 12711 -23388 -55701
20817 -55701 -19944 -28196 -24804 -17474 -6542 125928 151158 120250 70880 -1536 -4056 -7742
20805g742J2436j4359m473j4718J8072J6262J7959L3460m4519j1325J177l2520
20793c0290l5756o794K3300k4810l3304k3847R0986M3806M614j77J2198j3959
20781E967l6501n3917J2668J1965r885K7264m867n4252M461R35q27O4972P5193
20768D3176P8564P754l4321q5229J1294K0651n0059o899j8223L8743J7965k3488
20756g2o7279O944J2251K5660N1731J0214J7331R418p3925p7258k3410o06Q4923
20743b4078K3249l6284k4569K8137k64l8594O4598L1022k3916r282o873k5443
20731d2297M1932o559l9493r669J3248O900K0167K4320k3485J9096l774J7704
20719A8090l2067j5070l0284K0556N8716k8096O587k2433m2220J3457o3219k8122
$$ plain form
20805 -7742 4694 -9665 -14138 -28856 -10784 5478 23437 56897 12378 1053 2230 -30290
20793 -30290 -66046 -72840 -49540 -74350 -107654 -131501 -40515 3291 7905 7728 19926 5967
20781 5967 -30534 -84451 -71783 -59818 -69703 -42439 -47306 -101558 -97097 -96162 -96989 -32017 43176
20768 43176 121740 129494 95173 9944 21238 41889 -8170 -15069 -33292 5451 23416 -72
20756 -72 -67351 -60407 -48156 -22496 29235 39449 56780 66198 -7727 -84985 -108395 -109001 -24078
20743 -24078 -829 -37113 -61682 -33545 -33809 -72403 -7805 23217 -699 -9981 -16854 -42297
20731 -42297 -365 -6924 -46417 -56086 -42838 -35938 -15771 8549 -14936 4160 386 18090
20719 18090 -13977 -29047 -59331 -38775 19941 -8155 -1568 -24001 -66221 -52764 -115983 -144105
20707a44105J9866K1543p916J2391L219R088L9921J3205k7035J1196P376l468
20695d4719k047J1839L0261L7126l3988k9794k2743j8976l206Q541M8861K4044
20683E199n2860m7641k1921J9509J574L5220k8825k906J2595M0666j8450k1713
20671g9553K7048J4761l074P344M430L827N911J3343K4878k7260o138p820P855
20658a4448J2315R004m8521k574J2250M5690M6431k0619k4626n3000k4911j8514
20646h1523K6109P82K4320L0471l1549j6658o1576M5305J0289P251L449L3074
20634a0256m9332k3897O649K2314Q147k0084M925M3747J3403m3193L062P0414
20622B5899J2019n5784n2567r807K5923M5084J7539L9221k2939l6683n7888J726
$$ plain form
20707 -144105 -124239 -102696 -110612 -98221 -95002 -85914 -45993 -32788 -59823 -48627 -41251 -44719
20695 -44719 -46766 -34927 -4666 32460 -1528 -31322 -54065 -73041 -76247 -67706 -18845 5199
20683 5199 -47661 -95302 -117223 -97714 -96140 -60920 -89745 -92651 -80056 -39390 -57840 -79553
20671 -79553 -52505 -37744 -40818 -33474 -29044 -25217 -19306 -5963 18915 -8345 -14483 -22303 -14448
20658 -14448 -2133 6871 -41650 -44224 -31974 13716 60147 39528 14902 -38098 -63009 -81523
20646 -81523 -55414 -54632 -30312 159 -31390 -48048 -109624 -64319 -54030 -46779 -43330 -10256
20634 -10256 -59588 -83485 -76836 -54522 -46375 -66459 -61534 -17787 -4384 -47577 -44515 25899
20622 25899 37918 -17866 -70433 -80240 -54317 -9233 8306 47527 24588 -12095 -69983 -68257
20610f8257j286l7581M1970p285l4464r90O894J1775M679J7280J2140K3412J6144
20597a5569m0934J8569K1870j5993J3076K8278O649M89l836k1327k8953K3633
20585a4048O1837R460m587n5902N9j5876n8936L9009O2993k2863l1853N352q217
20572c3572k0443j7972p259M1378k753m9334l3392M1532L7355K7518L1117m8800
20560c4625j1646K3986k853p697L2434P171o2648k1660j8925J1700m2199j1036
20548a37998J5267O4399P3230j0108l7282m4266k9787O2551J6827J0061k5879
20537d2985J4088L5728J4570j397m3350L0532L6671j7288Q331m693n9685j8996
20525d8474L2279K0732j4162k2789j3150L882J9557p963k0376j2381L0631j7260
$$ plain form
20610 -68257 -69543 -107124 -65154 -72439 -106903 -107893 -100999 -89224 -84545 -67265 -55125 -31713 -15569
20597 -15569 -56503 -37934 -16064 -32057 -18981 9297 15946 16435 12599 -8728 -37681 -14048
20585 -14048 47789 57249 52662 -3240 -3181 -19057 -77993 -38984 24009 1146 -30707 -25355 -33572
20572 -33572 -54015 -71987 -79246 -37868 -40621 -89955 -123347 -81815 -44460 -16942 14175 -34625
20560 -34625 -46271 -22285 -25138 -32835 -401 6770 -55878 -77538 -96463 -84763 -126962 -137998
20548 -137998 -122731 -58332 14898 4790 -32492 -76758 -106545 -43994 -27167 -17106 -42985
20537 -42985 -28897 6831 21401 20004 -23346 7186 43857 26569 34900 30207 -29478 -48474
20525 -48474 -16195 4537 -9625 -32414 -45564 -41682 -22125 -30088 -50464 -62845 -32214 -49474
20513d9474m831L330K6899J975O7514L1716K3341o5206L456K8908m8248J8629
20501C8009L9220J7203l6586l8038k5076k1667J8299O1268j9210k3094m4344M283
20489b9733Q0041l5583k4352M4684L0418j7997k0727j6593J4653n19j1858J563
20477A3997J8623l758p034n844l901J9840k3527M619O5191J4160k0951m2578n5188
20464b6351l0132M2570K9469j2172j4742k3441K0475o329K721k3496L7222M5433
20452D1227j4152J4711K62j6899m3126m0270J5396n820J2724L4434j8453j818
20440b1784M2181k4752o7098n367K0332O304j8724m0845m9498J2980Q8984L9772
20428a7515Q310k3945l6501m484n5814n8966J6651L2038K3456l8472Q553N0120
$$ plain form
20513 -49474 -54305 -50975 -24076 -22101 45413 77129 100470 35264 38720 67628 19380 38009
20501 38009 77229 94432 57846 19808 -5268 -26935 -8636 52632 33422 10328 -34016 -29733
20489 -29733 50308 14725 -9627 35057 65475 47478 26751 10158 24811 24292 12434 13997
20477 13997 32620 28862 21828 15984 12083 31923 8396 13015 78206 92366 71415 28837 -26351
20464 -26351 -56483 -13913 15556 3384 -11358 -34799 -14324 -20653 -17932 -41428 -4206 41227
20452 41227 27075 41786 42048 25149 -17977 -58247 -42851 -48671 -35947 -1513 -19966 -21784
20440 -21784 20397 -4355 -71453 -76820 -56488 -50184 -68908 -109753 -159251 -146271 -57287 -17515
20428 -17515 -9205 -33150 -69651 -74135 -129949 -188915 -172264 -140226 -116770 -155242 -146689 -96569
20416i6569K6663R300j4044J3722r312k9761K3210N0774M8934L9784K3714j472
20404H4943n0062o5937J8464J03268L459K869o9604m0145P060o3083K7998K5175
20392a5595n1918Q402M9788o894M673j1065j9378L5996k3235k7750m99N3020L1881
20379B7426m1759q7219K9444O2175m733L4168N2001J7342k1377k711l2218k4956
20367G583p9024j02400n8321M3310J11167M0249N3672J6642P317l5311n506O8473
20355F7851l5372j6311j0864k7309m0373R874N732J45k629K6004M3340k3302K963
20342b51j980K9310M1179L3021j9840n9894p048k3507j9477k0635j0017j4215
20330g3354j7810j5451K9457J2474J7274J1269L1J8443N0472P020k5745J1270
$$ plain form
20416 -96569 -69906 -60606 -74650 -60928 -70240 -100001 -76791 -26017 22917 62701 86415 84943
20404 84943 34881 -31056 -12592 90676 94135 97004 27400 -12745 -5685 -68768 -40770 -15595
20392 -15595 -67513 -59111 -9323 -16217 -11544 -22609 -41987 -5991 -29226 -56976 -57475 -4455 27426
20379 27426 -14333 -101552 -72108 -9933 -14666 19502 71503 88845 67468 64757 32539 7583
20367 7583 -71441 -173841 -232162 -188852 -77685 -37436 16236 32878 40195 4884 -622 67851
20355 67851 32479 16168 5304 -22005 -62378 -52504 -46772 -46627 -49256 -23252 20088 -3214 -251
20342 -251 -2231 27079 68258 101279 81439 21545 14497 -9010 -28487 -49122 -59139 -73354
20330 -73354 -91164 -106615 -77158 -64684 -47410 -36141 -36110 -17667 32805 39825 14080 25350
20318B5350n5526L9308J8828J8644L2597r584n0199l3566n7130J462j0316l4817
20306a14949M843j7225m4287L3734J6556J5107J0711O106Q1870m124o408l8642
20294e6708n7459m9681J9392Q3365j710K3945r393m1158l685J3448N5718j1316
20282c5242k9661M0806J0189n1627L2404M9872l1342J5069j1492J099L843K7545
20270B1463K1407j9744p5254j5138J8455J4472n5458n6304L4060O6228M4758j8361
20258a9416O97N296K2480P036K6188J1807q583m4474l4996O990m104K0139k9237
20245d0177j4093k8911l204M2519q329l1456J2191K4549N1054M9754j1602k1694
20233B0601N333p715m2304l0557M1855j0976M3561K2443p7540j4452O339K1164
$$ plain form
20318 25350 -30176 9132 27960 46604 79201 69617 19418 -14148 -71278 -69816 -80132 -114949
20306 -114949 -110106 -127331 -171618 -137884 -121328 -106221 -95510 -89404 -7534 -11658 -18066 -56708
20294 -56708 -114167 -163848 -144456 -61091 -62801 -38856 -48249 -89407 -93092 -79644 -23926 -35242
20282 -35242 -64903 -24097 -13908 -65535 -33131 16741 -14601 468 -11024 -9925 -6082 21463
20270 21463 42870 23126 -52128 -67266 -48811 -34339 -89797 -146101 -112041 -45813 -1055 -19416
20258 -19416 -18719 -13423 9057 16093 42281 54088 45505 1031 -33965 -26975 -31079 -10940 -40177
20245 -40177 -54270 -83181 -86385 -43866 -52195 -83651 -71460 -46911 4143 53897 42295 20601
20233 20601 25934 18219 -24085 -54642 -12787 -23763 19798 42241 -35299 -49751 -43412 -22248
20221b2248M8264L1628l0545j3965L423l7428J0396l269M7004J5275m5549l483
20209d97K3001p688j6528P0510R475k2545n3709l3586L8243M7186Q25m4593L1798
20196D1892r837p0206J7857k3778p163M0424Q134J2620O6304o0914o0279j7090
20184f2036K0017L7392L4504j9186J6596J7298K7140j2920R8J1315k5776j7579
20172B6863m3757k6452O2314J4533K3228R74k2363N195k9141j9445j5097L3153
20160A0005L3297J6201l8731k9765l6743l9631Q449K9945N5031j2528J0423K8013
20148C3966j2525l8448K5657N499m2964m130L2706M3475L6639l6242m8723j8036
20136b3126m085p11M4011k28k5815K4290J8208m339L7312r397m0111j5096O561
$$ plain form
20221 -22248 26016 57644 27099 13134 16557 -20871 -10475 -13744 33260 48535 2986 -497
20209 -497 22504 14816 -1712 68798 78273 55728 2019 -31567 6676 53862 54687 10094 41892
20196 41892 32055 -38151 -20294 -44072 -51235 -10811 -2677 9943 76247 15333 -44946 -62036
20184 -62036 -42019 -4627 29877 10691 27287 44585 71725 58805 58903 70218 44442 26863
20172 26863 -16894 -43346 18968 33501 56729 57703 35340 40535 11394 -8051 -23148 10005
20160 10005 43302 59503 20772 -8993 -45736 -85367 -76918 -46973 8058 -4470 5953 33966
20148 33966 21441 -17007 8650 14149 -28815 -32945 -239 43236 79875 43633 -5090 -23126
20136 -23126 -27211 -27922 16089 15861 -9954 14336 32544 28205 65517 56120 16009 913 7474
20123G474N1149J205l3956l1915n3555L8990M0832O038J3580n712L939q626r961
20110A9482J0017k5392l3110K9368j2691L2234j5420m1116J2190O4902L348J1433
20098E5245k9847o2452j6752M0780K2012N5886K8680J8173M6956O0133n3097j19898
20086D5819n0507l1262k8129J0721P0710O5745k9016l5140J013L1398K0742m8152
20074B3942k8220M1617J1409K2921J1909M314J021K42J8761j0498j323L584N823
20061A05502J4249j1115m1360N8009L3251n8855k5132k2338k8144P5948P6781
20050A76796k7496j8354p988N0064K3956m885j0525o1572j4501K5161N3859P1
20038A84586L2364L4558J2784K438p840M101j502p649J3524J3402o0676M68J0114
$$ plain form
20123 7474 58623 59828 25872 -6043 -59598 -20608 20224 26262 39842 34130 38069 29443 19482
20110 19482 29499 4107 -29003 365 -12326 19908 4488 -36628 -24438 40464 43812 55245
20098 55245 25398 -37054 -53806 -13026 8986 64872 93552 111725 158681 218814 165717 45819
20086 45819 -4688 -35950 -64079 -53358 17352 83097 54081 18941 19954 51352 72094 23942
20074 23942 -4278 37339 48748 71669 83578 87892 88913 89155 107916 97418 96095 99679 105502
20061 105502 119751 108636 67276 125285 158536 99681 74549 52211 24067 100015 176796
20050 176796 149300 130946 122958 173022 196978 192093 181568 119996 105495 130656 184515 184586
20038 184586 216950 251508 264292 266730 258890 262991 261489 253840 267364 280766 220090 220558 230672
20025B30672M9964M7696L306K09r080P7458r240q710O6495L6510l384k4536l5302
20012D22058q688J9852J9803M2582l1647q210K8372n015k1756L4502J1895r65
20000E02783L8546l886M1609Q023m6424m403O362L2538L9425K9059q4012J9461
19988E79081K5215l8044j8215N7013k5548o8776O801j8883R96J1525N0689p931
19976E53923L1739K0939m1715j0123K2466M0149j1938K6171P238l2010l0387k3820
19964E52632m4473K6252n3168j6090Q3379M359k1829K4930m796l5184l6004l7771
19952D42237k5416J567p171l392O253k751l1046K6623O863O787m2110n6830M5838
19939C67452p098J8536L4603N683j7194k4070O155q001M669J990L935R018o5968
$$ plain form
20025 230672 280636 328332 331638 331847 322767 400225 390985 382275 448770 485280 481896 457360 422058
20012 422058 413370 433222 453025 495607 463960 455750 484122 479107 457351 491853 503748 502783
20000 502783 541329 537443 579052 587075 540651 536248 542610 575148 614573 643632 559620 579081
19988 579081 604296 566252 548037 605050 579502 510726 517527 498644 499640 511165 561854 553923
19976 553923 585662 606601 564886 554763 577229 617378 605440 631611 638849 606839 576452 552632
19964 552632 508159 534411 481243 465153 548532 552891 531062 555992 551196 516012 480008 442237
19952 442237 416821 418388 411217 407825 414078 411327 380281 406904 413767 420554 378444 321614 367452
19939 367452 360354 378890 413493 419176 401982 377912 384067 376066 380735 382725 386660 395678 329710
19926C29710j3482J2495K0100k0430o261l2603n5109p963L7835j633K0531P2266
19914C55456p136m5537n6704l2102O581J0896k4642M5051M8259o5300l6131N2804
19902B51495K017l1947J5414j0292k6181m1724n5730L0483O8720p340j7605j7841
19890A59469o8376J036o739j8824Q465l5918K5633L2716k9523n391M638J3280
19878H0466L042K4385p552k1988J4905K3471m8884j3196J03366K4147j5207k8433
19866A38522j8158M0129L897o5987o553j1027j7630l394l5561m4367Q619M0459
19854B8949K1131L4220O396k4392k1875k4478O0979L3875l3053j6781P036M1707
19842A13714m9199j6571k2319L1155J8385q966J7784j0291R377L5844j1968l3153
$$ plain form
19926 329710 316228 328723 348823 328393 322132 289529 234420 226457 264292 262659 283190 355456
19914 355456 348320 302783 246079 213977 220558 231454 206812 251863 300122 234822 198691 251495
19902 251495 253512 221565 236979 226687 200506 158782 103052 133535 202255 194915 177310 159469
19890 159469 91093 92129 85390 66566 75031 39113 64746 97462 67939 62548 67186 80466
19878 80466 83508 107893 100341 78353 93258 116729 67845 54649 158015 182162 166955 138522
19866 138522 120364 160493 164390 98403 91850 80823 63193 59799 24238 -20129 -11510 28949
19854 28949 50080 84300 90696 66304 44429 19951 80930 114805 81752 64971 72007 113714
19842 113714 64515 47944 25625 56780 75165 66199 83983 73692 83069 118913 106945 73792
19830G3792k3895L847J1562j5944l7746l6865J5081O975K683p692J5838j1483
19818c847m3119l9530k592J0745k0045K0872O8969J8898l738j0609J2797K9338
19806C8139o2269l3040M9458L9721j9551J792J4220k3786Q156J4953J5806p447
19794C6152k1796K6019J3561q0430l3836L4407l976k2015J7889L7639j2439L3038
19782B4213N6679L5949m4352o5764R569L324J4159L1968M2007k450m8647j2330
19770D4325j4401k7393l4707j6931L7984M7989j8660m4116j1184k1969J0205j1805
19758f0663k9267N4834L0575K1655O441k9706M3484M1745j6710n1395l1671J909
19746a8769k8078o1523M1182R680m8358O583P8787N8405j2211n5860j04210K0854
$$ plain form
19830 73792 49897 53744 65306 49362 11616 -25249 -10168 -3193 -510 -8202 7636 -3847
19818 -3847 -46966 -86496 -89088 -78343 -98388 -77516 -8547 10351 6613 -3996 8801 38139
19806 38139 -24130 -57170 -7712 32009 12458 14250 28470 4684 12840 27793 43599 36152
19794 36152 14356 40375 53936 -26494 -60330 -25923 -29899 -51914 -34025 3614 -8825 24213
19782 24213 80892 116841 72489 6725 16294 19618 33777 65745 107752 105302 56655 44325
19770 44325 29924 2531 -32176 -49107 -11123 36866 18206 -25910 -37094 -59063 -48858 -60663
19758 -60663 -89930 -35096 -4521 17134 23575 -6131 37353 79098 62388 10993 -20678 -18769
19746 -18769 -46847 -108370 -67188 -57508 -105866 -99283 -20496 37909 25698 -30162 -134372 -113518
19734a13518N7641K7838m9475j2890j2179o579O1923j4167K5363j0359k3913K8795
19722d1520k734P311M36J0534L342k020k512K1548R750l1262L3630J1815k7424
19709i106L6944k0914J6663k7465M498J7741M829K1715l985j6650k7182j5057
19697a7969l1003K2280O1160L6293k552R17P71k000l048j2155k1783K0319m2428
19684H802k2667J7271l3328n335L1688j4254P359M64J6708j3919k8928j7784k0556
19671g4479J7098N5306p354K9024L9124m1867p085R762m9777K0542Q5082m2587
19659C2789n4135K4399L3741J4276l2406n895J5218k6348j6497j8992K3441J2433
19647B024N4580L8353m172l1839j8500N5711K9756N840l5671q7471r3413K0442
$$ plain form
19734 -113518 -55877 -28039 -77514 -90404 -102583 -109162 -47239 -61406 -36043 -46402 -70315 -41520
19722 -41520 -44254 -36943 -36507 -25973 -22631 -24651 -27163 -5615 4135 -27127 6503 18318 -9106
19709 -9106 27838 6924 23587 -3878 620 18361 23190 44905 40920 24270 -2912 -17969
19697 -17969 -48972 -26692 34468 70761 68209 69126 69897 67897 64849 52694 30911 51230 8802
19684 8802 -13865 3406 -29922 -35257 -3569 -17823 -10464 -10000 6708 -7211 -36139 -53923 -74479
19671 -74479 -57381 -2075 -9429 19595 58719 16852 9767 19529 -30248 -9706 75376 32789
19659 32789 -21346 3053 36794 51070 18664 12769 27987 1639 -14858 -33850 -10409 2024
19647 2024 56604 94957 90785 58946 40446 96157 125913 131753 96082 8611 -84802 -64360
19635f4360Q0502M0284k7983l9762j9992O346n3382m4957l2856J2284m8970n536
19623a98382Q7733M3551K0678Q009k5708Q459O7978J9392n4612l7917J025L9900
19611a9894o3023K896L9267j0870N284J2888J3141k2563p6787J3926N2752J0975
19599d2008K8569N709K0984n837K1550m2735r4832j614L1734P3664K2658K12l138
19586A4916m2539j9158k7542n484K156K0221J8612M1980L5k1402k6062j9195R616
19573e3846O3133j3050l1217J6942J9649k9115l7668k9017O7790N0462k6374L1016
19561B8705L3915J9405k2588l1303L161J3513K177J711K79j6460j1775j263J7418
19548C6895k677j8713Q695L4092l0088J8543M0824l034o4234k4490o945j0705
$$ plain form
19635 -64360 16142 56426 28443 -11319 -31311 -24965 -78347 -123304 -156160 -143876 -192846 -198382
19623 -198382 -110649 -67098 -46420 -38411 -64119 -55660 12318 31710 -22902 -60819 -59794 -19894
19611 -19894 -82917 -80021 -40754 -51624 -46340 -33452 -20311 -42874 -119661 -105735 -52983 -42008
19599 -42008 -13439 -7730 13254 7417 28967 -13768 -108600 -110214 -78480 -4816 17842 18054 14916
19586 14916 -27623 -46781 -74323 -79807 -77651 -57430 -38818 3162 3197 -18205 -44267 -63462 -53846
19573 -53846 9287 -3763 -34980 -18038 1611 -27504 -65172 -94189 -26399 24063 -2311 28705
19561 28705 62620 82025 59437 28134 31295 44808 46985 48696 48975 32515 20740 19477 36895
19548 36895 34218 15505 24200 58292 28204 46747 87571 84537 20303 -4187 -11132 -21837
19536b1837l4766k6500J4440J3823O6309j8326l3371N4110m4626J135O8277m5699
19524g031o4332m546K8972K040K7560L7040K7742m093n394M2393J7733L1095k9000
19511A00179J0369j2304o2009k893L3767L167k9327m4592p8359l4461K3746j2241
19499a04958K2473M321K1480J2555Q136N940K1123P226j3620K2780k6151K9288
19487A0593K5031L504K6171j4502l7300n7884j6869J230K8637K7692L2258L7838
19475F6399q3176o6323L2332L5966J2758K4116o7599k2091k403L595N171N9013
19463b242P0648L3265m6123q5522r432K6574J5654m8392J2373K2920J7631k3224
19451a5870k163J5106l5357l6366J6272N7079K4037L4575J4017k0955J1531l020
$$ plain form
19536 -21837 -56603 -83103 -68663 -54840 11469 -6857 -40228 13882 -30744 -29609 38668 -7031
19524 -7031 -71363 -75909 -46937 -44897 -17337 19703 47445 43352 37958 80351 98084 129179 100179
19511 100179 110548 98244 36235 33342 67109 70276 40949 -3643 -82002 -116463 -92717 -104958
19499 -104958 -82485 -78164 -56684 -44129 -35993 -30053 -8930 -1704 -15324 7456 -18695 10593
19487 10593 35624 39128 65299 50797 13497 -44387 -61256 -60026 -31389 -3697 28561 66399
19475 66399 -16777 -83100 -50768 -14802 -2044 22072 -45527 -67618 -70021 -66426 -61255 -2242
19463 -2242 68406 101671 55548 -29974 -39406 -12832 2822 -45570 -33197 -10277 7354 -15870
19451 -15870 -18033 -2927 -38284 -74650 -58378 -1299 22738 57313 71330 50375 61906 58886
19439E8886r178K6955L5108l3002l449j3327p8659J1268M4536j7949j4781N5462
19427F1870P0547J0633k7865l8904O919j3418j4369O947O1802M3140j5054k5413
19415A26835o3779j0102J8324N8748j565L471j4231J5540j57l988R251j2997k3089
19402A02261J0687O39K1121K6895r650Q280O4460l0142J0242Q139M4004p735k2162
19389B27039l5666j7452m8995m4653M4890M3650L2384j4275J3383M761j714r696
19377A93656K1588M0119L1423p46l4082l1444O850Q2941J8716M052J2054P4012
19365D19139K3307k0633K7587j7918n5758o9503n5099L0954P3521k3529k4311
19354C07757O520M6622L9071O4847J4932o2950k0190K0269J8620M1496J251o325
$$ plain form
19439 58886 49708 76663 111771 78769 75320 61993 -16666 -5398 39138 21189 6408 61870
19427 61870 132417 143050 115185 76281 83200 69782 55413 62360 124162 167302 152248 126835
19415 126835 63056 52954 71278 130026 128461 131932 117701 133241 133084 129096 138347 125350 102261
19402 102261 112948 113587 134708 161603 151953 160233 224693 194551 204793 212932 256936 249201 227039
19389 227039 191373 173921 124926 80273 125163 168813 201197 186922 200305 205066 203352 193656
19377 193656 215244 255363 286786 286040 251958 220514 227364 310305 329021 333073 345127 419139
19365 419139 442446 421813 449400 431482 375724 306221 251122 282076 355597 332068 307757
19354 307757 314277 360899 399970 464817 479749 416799 396609 416878 435498 476994 478245 471920
19342D71920k0080K2220O759m3224m006J8728j2767k5211k0548N995k5558l381
19330C70847N2466L1264L3045K5143Q152L758j4051j7981K3503l4009l3147l2517
19318D16473n49L7735Q60o3577J6098O879M0571M7346l6258l6323K0488N3295
19306E03038K8400J5762m3754m7522n9764q049L9340J8940n808J8485k3602l1927
19294D03539K593k8196K180P9586M8177n1820q1158k2318k890Q947L9986J4095
19282D12721j2944k6476J1792k650k8827J2600j2705J325M0067k4634k2949J9365
19270C66685k5551k1981n9418Q759L526k2376o418q196k0611O890J3147K0464
19258B54920m8187j0704P7801M7866O749k7032j7264k1640J5200J3170j9589l6318
$$ plain form
19342 471920 451840 474060 480819 437595 433589 452317 439550 414339 393791 399786 374228 370847
19330 370847 423313 454577 487622 512765 520917 524675 510624 492643 516146 482137 448990 416473
19318 416473 415924 453659 454519 390942 407040 413919 454490 501836 465578 429255 449743 503038
19306 503038 531438 547200 503446 455924 396160 388111 427451 446391 440583 459068 435466 403539
19294 403539 406132 377936 380116 459702 507879 456059 374901 352583 349693 358640 398626 412721
19282 412721 399777 373301 385093 382443 353616 366216 353511 354836 394903 370269 347320 366685
19270 366685 341134 319153 259735 268494 272020 249644 243226 235030 214419 221309 234456 254920
19258 254920 206733 196029 273830 321696 328445 301413 284149 262509 277709 290879 271290 234972
19246B34972O844K2217j2777k0583l4812m0019k9035L8296L0844J3444p375O463
19234B08479m5565K4027L94P261J8964m1623N756Q104j2704Q097J6860K5072l8959
19221A84163m8960m1513q5L2631M4304J8575q6224j024K2375j8575J1083N957
19209A22707M1662m772r52n4950o1278L7607M3632Q061l9506k5522K7851J4651
19197A09191m5087L001M757m961L0621l9093o990M6304K0485p6865m5001J0572
19185F934L4649l695P176N6518j0451m5171l8357J8020N2676M2024J3326m6112
$$ plain form
19246 234972 241816 264033 251256 230673 195861 155842 126807 165103 195947 209391 202016 208479
19234 208479 162914 186941 187335 194596 213560 171937 177693 185797 173093 181190 198050 223122 184163
19221 184163 135203 93690 93605 126236 170540 189115 102891 101867 124242 105667 116750 122707
19209 122707 164369 159597 158645 103695 42417 80024 123656 131717 92211 66689 94540 109191
19197 109191 64104 67105 71862 66901 97522 58429 51439 97743 118228 41363 -3638 6934
19185 6934 41583 37888 45064 101582 91131 45960 7603 25623 78299 120323 133649 87537
$$ [...]
##END NTUPLES=NMR SPECTRUM
##END=
