##TITLE=Analysis number 316344
Compound Code ac 30341
Project Code adrs
Chemist Name new century
##JCAMPDX= 6.0         $$ Bruker NMR JCAMP-DX V2.0
##DATA TYPE= NMR SPECTRUM
##DATA CLASS= NTUPLES
##ORIGIN= Bruker BioSpin GmbH
##OWNER= nmr
$$ XWIN-NMR		Version 3.5
$$ Wed Jan 11 14:58:57 2006 GMT Standard Time (UT+0h)  MAYBRIDGE\nmr@NMR_250MHZ
##.OBSERVE FREQUENCY= 250.131544655141
##.OBSERVE NUCLEUS= ^1H
##.ACQUISITION MODE= SIMULTANEOUS (DQD)
##.ACQUISITION SCHEME= undefined
##.AVERAGES= 16
##.DIGITISER RES= 18
##SPECTROMETER/DATA SYSTEM= dpx250
##.PULSE SEQUENCE= zg30
##.SOLVENT NAME= DMSO
##.SHIFT REFERENCE= (INTERNAL, DMSO, 0, 16.522)
##AUDIT TRAIL= $$ (NUMBER, WHEN, WHO, WHERE, WHAT)
$$ ##TITLE= Audit trail, XWIN-NMR		Version 3.5
$$ ##JCAMPDX= 5.01
$$ ##ORIGIN= Bruker BioSpin GmbH
$$ ##OWNER= nmr
$$ C:\u/data/dgb/nmr/ADRS/14480/pdata/1/auditp.txt
$$ ##AUDIT TRAIL=  $$ (NUMBER, WHEN, WHO, WHERE, WHAT)
(   1,<2006-01-11 14:58:33.73 +000>,<MAYBRIDGE\nmr>,<NMR_250MHZ>,
      <created by zg, POWCHK disabled, PULCHK disabled
       configuration hash MD5:
       62 19 C7 07 E1 42 D1 B7 37 6C 3D D0 77 39 F9 E6
       data hash MD5: 64K
       1C 43 80 99 C8 C6 4E 00 BD 07 4E C8 87 3D 04 1C>)
(   2,<2006-01-11 14:58:48.25 +000>,<MAYBRIDGE\nmr>,<NMR_250MHZ>,
      <Start of raw data processing
       ef LB = 0.3 FT_mod = 6 PKNL = 1 SI = 32K 
       data hash MD5: 32K
       63 EC 05 36 C0 2C E8 49 50 09 B6 FA EF AF 43 99>)
(   3,<2006-01-11 14:58:50.39 +000>,<MAYBRIDGE\nmr>,<NMR_250MHZ>,
      <apk 
       data hash MD5: 32K
       29 97 1D 27 10 FD B1 36 6A 56 43 C4 71 3E 61 4D>)
(   4,<2006-01-11 14:58:51.18 +000>,<MAYBRIDGE\nmr>,<NMR_250MHZ>,
      <abs ABSG = 5 
       data hash MD5: 32K
       65 AD D8 FE 43 57 75 E6 B2 45 48 1E A5 CB 9B 44>)
$$ ##END=
$$ 
$$ hash MD5
$$ 04 30 0B CB 27 AD A7 E3 C1 18 17 90 08 45 4D 17
##$RELAX= 
##$RELAX= 
##$RELAX= 
##$RELAX= 
##$RELAX= 
##$RELAX= 
##$RELAX= 
$$ Bruker specific parameters
$$ --------------------------
##$DU= <C:\u>
##$EXPNO= 14480
##$NAME= <ADRS>
##$PROCNO= 1
##$TYPE= <nmr>
##$USER= <dgb>
##$AMP= (0..31)
100 100 100 100 100 100 100 100 100 100 100 100 100 100 100 100 100 100 
100 100 100 100 100 100 100 100 100 100 100 100 100 100 
##$AQSEQ= 0
##$AQ_mod= 3
##$AUNM= <au_zg>
##$AUTOPOS= <41 >
##$BF1= 250.13
##$BF2= 250.13
##$BF3= 250.13
##$BF4= 250.13
##$BF5= 500.13
##$BF6= 500.13
##$BF7= 500.13
##$BF8= 500.13
##$BYTORDA= 1
##$CFDGTYP= 0
##$CFRGTYP= 5
##$CHEMSTR= <none>
##$CNST= (0..31)
1 1 145 1 1 1 1 1 1 1 1 1 1 1 1 1 1 1 1 1 1 1 1 1 1 1 1 1 1 1 1 1 
##$CPDPRG= <>
##$CPDPRG1= <>
##$CPDPRG2= <>
##$CPDPRG3= <>
##$CPDPRG4= <mlev>
##$CPDPRG5= <mlev>
##$CPDPRG6= <mlev>
##$CPDPRG7= <mlev>
##$CPDPRG8= <mlev>
##$CPDPRGB= <>
##$CPDPRGT= <>
##$D= (0..31)
0 1 0 0 0 0 0 0 0 0.06 0 0 0 0 0 0 0.0002 0 0 0 0 0 0 0 0 0 0 0 0 0 0 
0 
##$DATE= 1136991512
##$DBL= (0..7)
120 120 120 120 120 120 120 120 
##$DBP= (0..7)
150 150 150 150 150 150 150 150 
##$DBP07= 0
##$DBPNAM0= <>
##$DBPNAM1= <>
##$DBPNAM2= <>
$$ [...]
##$SUBNAM7= <"">
##$SUBNAM8= <"">
##$SUBNAM9= <"">
##$SW= 20.6930455092707
##$SWIBOX= (0..15)
0 0 3 0 0 0 0 0 0 0 0 0 0 0 0 0 
##$SW_h= 5175.983436853
##$TD= 65536
##$TD0= 1
##$TE= 294.16
##$TE2= 300
##$TE3= 300
##$TEG= 300
##$TL= (0..7)
0 120 120 120 120 120 120 120 
##$TP= (0..7)
150 150 150 150 150 150 150 150 
##$TP07= 0
##$TPNAME0= <>
##$TPNAME1= <>
##$TPNAME2= <>
##$TPNAME3= <>
##$TPNAME4= <>
##$TPNAME5= <>
##$TPNAME6= <>
##$TPNAME7= <>
##$TPOAL= (0..7)
0.5 0.5 0.5 0.5 0.5 0.5 0.5 0.5 
##$TPOFFS= (0..7)
0 0 0 0 0 0 0 0 
##$TUNHIN= 0
##$TUNHOUT= 0
##$TUNXOUT= 0
##$USERA1= <user>
##$USERA2= <user>
##$USERA3= <user>
##$USERA4= <user>
##$USERA5= <user>
##$V9= 5
##$VALIST= <valist>
##$VCLIST= <CCCCCCCCCCCCCCC>
##$VD= 0
##$VDLIST= <DDDDDDDDDDDDDDD>
##$VPLIST= <PPPPPPPPPPPPPPP>
##$VTLIST= <TTTTTTTTTTTTTTT>
##$WBST= 1024
##$WBSW= 4
##$XGAIN= (0..3)
0 0 0 0 
##$XL= 0
##$YL= 0
##$YMAX_a= 487343
##$YMIN_a= -501737
##$ZGOPTNS= <>
##$ZL1= 120
##$ZL2= 120
##$ZL3= 120
##$ZL4= 120
##$ABSF1= 16.522
##$ABSF2= -4.171173
##$ABSG= 5
##$ABSL= 3
##$ALPHA= 0
##$AQORDER= 0
##$ASSFAC= 0
##$ASSFACI= 0
##$ASSFACX= 0
##$ASSWID= 0
##$AUNMP= <proc_1d>
##$AZFE= 0.1
##$AZFW= 0.1
##$BCFW= 0
##$BC_mod= 0
##$BYTORDP= 0
##$COROFFS= 0
##$CY= 12.5
##$DATMOD= 1
##$DC= 0
##$DFILT= <>
##$DTYPP= 0
##$F1P= 14.0000005364418
##$F2P= -0.99999901652339
##$FCOR= 0.5
##$FTSIZE= 32768
##$FT_mod= 6
##$GAMMA= 0
##$GB= 0
##$INTBC= 1
##$INTSCL= 1
##$ISEN= 128
##$LB= 0.3
##$LEV0= 0
##$LPBIN= 0
##$MAXI= 10000
##$MC2= 0
##$MEAN= 0
##$ME_mod= 0
##$MI= 0
##$NCOEF= 0
##$NC_proc= -2
##$NLEV= 6
##$NOISF1= 0
##$NOISF2= 0
##$NSP= 0
##$NTH_PI= 0
##$NZP= 0
##$OFFSET= 16.522
##$PC= 1
##$PHC0= 75.42086
##$PHC1= 2.911416
##$PH_mod= 1
##$PKNL= yes
##$PPARMOD= 0
##$PSCAL= 4
##$PSIGN= 0
##$REVERSE= no
##$SF= 250.13
##$SI= 32768
##$SIGF1= 0
##$SIGF2= 0
##$SINO= 400
##$SIOLD= 32768
##$SREGLST= <1H.DMSO>
##$SSB= 0
##$STSI= 32768
##$STSR= 0
##$SW_p= 5175.98343685301
##$SYMM= 0
##$S_DEV= 0
##$TDeff= 65536
##$TDoff= 0
##$TI= <Analysis number 999999
Compound Code 99
Book Reference 9
Project Code 9>
##$TILT= no
##$TM1= 0
##$TM2= 0
##$TOPLEV= 0
##$USERP1= <user>
##$USERP2= <user>
##$USERP3= <user>
##$USERP4= <user>
##$USERP5= <user>
##$WDW= 1
##$XDIM= 32768
##$YMAX_p= 367347346
##$YMIN_p= -266066
$$ End of Bruker specific parameters
$$ ---------------------------------
##NTUPLES= NMR SPECTRUM
##VAR_NAME=  FREQUENCY,     SPECTRUM/REAL,   SPECTRUM/IMAG
##SYMBOL=    X,             R,               I
##VAR_TYPE=  INDEPENDENT,   DEPENDENT,       DEPENDENT
##VAR_FORM=  AFFN,          ASDF,            ASDF
##VAR_DIM=   32768,         32768,           32768
##UNITS=     HZ,            ARBITRARY UNITS, ARBITRARY UNITS
##FACTOR=    0.157963299565203, 1,           1
##FIRST=     4132.6476996994, 0,             0
##LAST=      -1043.33573715361, 0,           0
##MIN=       -1043.33573715361, -266066,     0
##MAX=       4132.6476996994, 367347346,     0
$$ Real data points
##PAGE= N=1
##DATA TABLE= (X++(R..R)), XYDATA
$$ [...]
17225C09509j7287l8832k7773l3646l2839k3482k8970j8518n338L286o578j2445
$$ 309509 292222 253390 225617 191971 159132 135650 106680 88162 82824 86110 79532 67087
17213F7087n880l638o998k396L653R327k438l479N434P874J8495K8738J9571K2453
$$ 67087 61207 57569 50571 48175 51828 61155 58717 55238 60672 68546 87041 115779 135350 157803
17199A57803L2669M2060N1097J9995N255K772j6574l3079l6967l4617k9767k1800
$$ 157803 190472 232532 283629 303624 308879 311651 295077 261998 225031 190414 160647 138847
17187A38847k3357j6691j6002o322j2735p829M277l385j9577j2453K686J488R31
$$ 138847 115490 98799 82797 76475 63740 55911 60188 56803 37226 24773 27459 28947 29878
17174B9878m476N846k285N08J0458M026n941j2129m529J1294O152l180J975P61
$$ 29878 25402 31248 28963 29471 39929 43955 38014 25885 21356 32650 38802 35622 37597 38358
17160C8358j41K227o64p985Q6L807q486k560n889J810L596o026M64Q043NP946
$$ 38358 38217 40444 39780 31795 31881 35688 27202 24642 18753 20563 24159 18133 18597 26640 26645 34591
17144C4591M807m150J370o698m325q079q347o402n318L263J3361n47j0503L745
$$ 34591 39398 35248 36618 29920 25595 17516 9169 2767 -2551 712 14073 13526 3023 6768
17130F768J200M142K384n74Q949O803m900p739l828N15O25L133R17J173l504J95
$$ 6768 7968 12110 14494 13920 22869 29672 24772 17033 13205 13720 14345 17478 18395 19568 16064 16259
17114A6259j348O35M916j617J676l717J43n906r788M376n0Q379O458o215j061
$$ 16259 14911 15546 20462 18845 20521 16804 16947 11041 1253 5629 5579 13958 20416 14201 13140
17099A3140K474j98k785q241qN857P287l063p171Q44O232q13J448j744n347j105
$$ 13140 15614 15416 12631 4390 4382 10239 17526 14463 7292 8136 14368 13555 15003 13259 7912 6807
17083F807N091R318M41L187M2j612k33j878l662J477o229p980J980J401j270k309
$$ 6807 11898 21216 21657 24844 24886 23274 23041 21163 17501 18978 12749 4769 6749 8150 6880 4571
17067D571J569R187J0585o5j2267r017J227J3545O072J876l386j252Q966K351
$$ 4571 6140 15327 25912 25847 13580 4563 5790 19335 25407 27283 23897 22645 31611 33962
17053C3962m030p258l072k798l340k635K125R01O497M512K397K401M704l928n590
$$ 33962 29932 22674 19602 16804 13464 10829 12954 13855 20352 24864 27261 29662 34366 30438 24848
17038B4848m717q255J436N959j953J345M844m101j2000m031m394n084M662J027
$$ 24848 20131 11876 13312 19271 17318 18663 23507 19406 7406 3375 -1019 -6103 -1441 -414
17024d14L500Q129J4319N132j7447p945L329p04q82n183O486k334j776J1948N894
$$ -414 3086 11215 25534 30666 13219 5274 8603 7899 7017 1834 8320 5986 4210 16158 22052
17009B2052k168o482J55m644k282L506J464o740l171J0413R200j862o534n717
$$ 22052 19884 13402 13557 8913 6631 10137 11601 4861 1690 12103 21303 19441 12907 7190
16995G190k874m776N349j598O783R558O012o929o453r600j359R017R614l960J152
$$ 7190 4316 -460 4889 3291 10074 19632 25644 18715 12262 2662 1303 10320 19934 15974 17126
16980A7126j372n654L886L469L12k20q0R67k459m631J250P461l336j3032j420
$$ 17126 15754 10100 13986 17455 17767 17547 17467 18434 15975 11344 12594 20055 16719 3687 2267
16965B267J4391J0135K808K700j1782l070P46N629m072o399O40M288m349K37m102
$$ 2267 16658 26793 29601 32301 20519 17449 18195 23824 19752 13353 13993 18281 13932 14169 10067
16950A0067L563N148k369p219j266o600p496J508J2293L673M456Q53J385l145
$$ 10067 13630 18778 16409 9190 7924 1324 -6172 -4664 7629 11302 15758 16611 17996 14851
16936A4851J641k861P506J595n212N523J0388M707n875q138K984K439r563j1221
$$ 14851 16492 13631 21137 22732 17520 23043 33431 38138 32263 24125 27109 29548 19985 8764
16922H764K521J92j0615m317O354q002k574p104N525P991J0688J189K898K341
$$ 8764 11285 11477 862 -3455 2899 -5103 -7677 -14781 -9256 -1265 9423 10612 13510 15851
16908A5851L557L952k307o846n290N843J557L116L34K698r271p412K259M238m833
$$ 15851 19408 23360 21053 14207 8917 14760 16317 19433 19767 22465 13194 5782 8041 12279 7446
16893G446q781O600J282M198K402L451p453n272m000m877m216M362J5687n714
$$ 7446 -1335 5265 6547 10745 13147 16598 9145 3873 -127 -5004 -9220 -4858 10829 5115
16879E115j0722J1442M68m074J202p758K23L941J2410O253m795r108q878q40R57
$$ 5115 -5607 5835 6303 2229 3431 -4327 -4104 -163 12247 18500 13705 4597 -4281 -5121 -4164
16864d164J61J0049o852p68Q341l499j0345K041Q725K778L048O218q702p238L551
$$ -4164 -4003 6046 -806 -1574 6767 3268 -7077 -5036 3689 6467 9515 15733 7031 -207 3344
16849C344m615p924L524J2566J505n347m385l669J675M163o46l251m134P788l383
$$ 3344 -1271 -9195 -5671 6895 8400 3053 -1332 -5001 -3326 837 191 -3060 -7194 594 -2789
16834b789J348j887p450Q221J5757O077L980j0376l053m569K297j263l586o10
$$ -2789 -1441 -3328 -10778 -2557 13200 19277 23257 12881 9828 5259 7556 6293 2707 2097
16820B097M977J777l215m74O507N9k935j248O287J90R527L326j2282q179j449
$$ 2097 7074 8851 5636 5162 11669 11728 8793 7545 13832 14022 23549 26875 14593 6414 4965
16805D965P849Q957p063k299L042p694j1800o825M764K543J973O971L497K171
$$ 4965 12814 21771 14708 12409 15451 7757 -4043 -10868 -6104 -3561 -1588 5383 8880 11051
16791A1051j701q51P662n213n834QP627O675o746J654M432r440j1906l658q20
$$ 11051 9350 8499 16161 10948 5114 5122 12749 19424 12678 14332 18764 9324 -2582 -6240 -7060
16776g060K502O610J1558O763l224o754M903R63k492l207q293o873M600m070k410
$$ -7060 -4558 2052 13610 20373 17149 10395 15298 16261 13769 10562 2269 -4604 -4 -4074 -6484
16761f484O685J1324m582M431J4708j78n279r681K180N409R709K447o431r165
$$ -6484 201 11525 6943 11374 26082 25904 20625 10944 13124 18533 28242 30689 24258 15093
16747A5093p104m671k079l230J050P892l913j227l128q652L619O297K223J661
$$ 15093 7989 3318 1239 -1991 -941 6951 3038 1811 -1317 -9969 -6350 -53 2170 3831
16733C831M064J938n744R22J671N05m441j606j257l631Q80j762p009k4M39R841
$$ 3831 7895 9833 4089 5011 6682 7187 2746 1140 -117 -3748 -2868 -4630 -11639 -11663 -11224 -1383
16717a383J217l44M131P189m171o0j283j737J1K785p705p39J972K573N745O259
$$ -1383 -166 -510 3621 10810 6639 6579 5296 3559 3570 6355 -1350 -2089 -117 2456 8201 14460
16701A4460l502l893Q32q688q996J2348R261j138R32p091J907M702J886j049k913
$$ 14460 10958 7065 7897 -791 -9787 2561 11822 10684 11616 4525 6432 11134 13020 11971 9058
16686I058O473n880r468j76J269J4386O89k312L457N183K748r58o912K82K632
$$ 9058 15531 9651 183 7 1276 15662 16351 14039 17496 22679 25427 24469 17557 17839 20471
16671B0471j107L486M200j9085j536j080j399R702M396J618O054j25q171r070
$$ 20471 19364 22850 27050 7965 6429 5349 3950 13652 18048 19666 25720 25595 17424 8354
16657H354O728J515J42k318n503K751m216N442L227q838m530m050j2650J519r41
$$ 8354 15082 16597 16739 14421 8918 11669 7453 12895 16122 7284 2754 -1296 -13946 -12427 -13368
16642a3368J954P137J0233M976n020K379J4821K23j0060j915P52M565k767q515
$$ -13368 -11414 -4277 5956 10932 5912 8291 23112 23335 13275 11360 12112 16677 13910 5395
16628E395l896L506J773J996K065l180K732r59K892l485l328j382M993k876l462
$$ 5395 1499 5005 6778 8774 10839 7659 10391 9432 12324 8839 5511 4129 9122 6246 2784
16613B784m02K319L244k272R00p892o24j287K350N817Q57K62K745P931m401o684
$$ 2784 2382 4701 7945 5673 6573 -1319 -1943 -3230 -880 4937 5794 6056 8801 16732 12331 5647
16597E647n54O865M623J768k366J65Q467m081j847q371J432L974j923j0181M051
$$ 5647 5093 11958 16581 18349 15983 16148 24615 20534 18687 10316 11748 15722 13799 3618 7669
16582G669k633j885O478J5260j299j5471l267O919o746p265k410Q680O092k341
$$ 7669 5036 3151 9629 24889 23590 8119 4852 11771 5025 -2240 -4650 4030 10122 7781
16568G781n236j905o338K396J6457Q34j0196K160j043K326M259j619n908o004
$$ 7781 2545 640 -5698 -3302 13155 13989 3793 5953 4910 7236 11495 9876 3968 -2036
16554b036m082N265Q533N306J122j0324R730R3m511p627m484m125k955R380Q092
$$ -2036 -6118 -853 7680 12986 14108 3784 13514 13607 9096 1469 -3015 -7140 -10095 -715 7377
16539G377m905q121j027k644M832Q124N317K029l552L050r480K181N684o388l955
$$ 7377 2472 -5649 -6676 -9320 -4488 3636 8953 10982 7430 10480 1000 3181 8865 2477 -1478
16524a478O59O46J0114P794p129l306q267j329J0972Q97k211J30Q99J307l991
$$ -1478 -819 -173 9941 17735 10606 7300 -967 -2296 8676 9573 7362 7492 8391 9698 5707
16509E707r48m39P984P357k737L893k91K987j972l222N394j411r630O7J05P26
$$ 5707 4759 4320 12304 19661 16924 20817 20526 23513 21541 18319 23713 22302 12672 12739 12844 13570
16493A3570l693m119k45r39P39K763k578R53L945Q329n671J436N541m373n724
$$ 13570 9877 5758 5513 4574 5313 8076 5498 6451 10396 18725 13054 14490 20031 15658 9934
16478I934j3096J01j0575n107K386J0015J1540K821n744L301n79j560N290k532
$$ 9934 -3162 -3061 -13636 -18743 -16357 -6342 5198 8019 2275 5576 4997 3437 8727 6195
16464F195Q96n136n590K166Q516k07M136L535r870j3034J497N873N725K715q82
$$ 6195 7091 1955 -3635 -1469 7047 6840 10976 14511 4641 -8393 -6896 -1023 4702 7417 6535
16449F535Q136m130O152r985L266O482L518p475K531l356O24k764J665j038j710
$$ 6535 14671 10541 16693 6708 9974 16456 19974 12499 15030 11674 12298 9534 11199 10161 8451
16434H451J48P44l849j610o431J281O573k271n471o062j0M455J1505K178j008
$$ 8451 8599 9343 5494 3884 -2547 -1266 5307 3036 -2435 -8497 -8507 -4052 7453 9631 8623
16419H623k061n946j870O916J981n454M431P256N226n471k800m119l717J510k27
$$ 8623 6562 616 -1254 5662 7643 2189 6620 13876 19102 13631 10831 6712 2995 4505 4278
16404D278m070p947K308J4093J8824M159r716m394M461o925m95m994Q37n444n304
$$ 4278 208 -7739 -5431 8662 27486 31645 21929 17535 21996 15071 14576 9582 10419 4975 -329
16389c29J0044p312q296o365q281J5852J2617r479o631J1037Q999K25m923l843
$$ -329 9715 2403 -5893 -12258 -20539 -4687 7930 -1549 -8180 2857 11856 12081 7158 3315
16375C315m46l873l148Q838l66L595O248n037R023P783p546n650l950L787K699
$$ 3315 2869 -1004 -4152 4686 4320 7915 14163 9126 18149 25932 18386 12736 8786 12573 15272
16360A5272N249l180n329n951N605N936l363K754O339q682q607q658p508L735
$$ 15272 20521 17341 12012 6061 11666 17602 14239 16993 23332 14650 6043 -2615 -10123 -6388
16346f388K378J342L807j014l855o347O312J0880R614J271j481n440j2370O058
$$ -6388 -4010 -2668 1139 125 -3730 -10077 -3765 7115 16729 18000 16519 11079 -1291 4767
16332D767m763K861J0970P427L565n493N631j0016r701J0128M060n132L196L356
$$ 4767 4 2865 13835 21262 24827 19334 24965 14949 5248 15376 19436 14304 17500 20856
16318B0856k905m552n647j382P001L656M159p51o133r111L127j620q041l712n466
$$ 20856 17951 13399 7752 6370 13371 17027 21186 20435 14302 5191 8318 6698 -1343 -5055 -10521
16303a0521p714K896J135O346P250n2O860M370Q278m617N634j467r788q791Q44
$$ -10521 -18235 -15339 -14204 -7858 -608 -660 6200 10570 18848 14231 19865 18398 8610 -181 663
16288F63Q42Q210L205q457j2088p441M854J389K04J267Q585Q112K796l862J862
$$ 663 1505 9715 12920 4463 -7625 -15066 -10212 -8823 -8619 -7352 1233 9345 12141 8279 10141
16273A0141l315q623j243j644K464O253k56j847p006L860o6K591M114k811L546
$$ 10141 6826 -1797 -3040 -4684 -2220 4033 3777 1930 -5076 -1216 -1282 1309 5423 2612 6158
16258F158K419M546J787j657n290j044M69k383n242r249J582Q224k555P115j62
$$ 6158 8577 13123 14910 13253 7963 6919 7388 5005 -237 -9486 -7904 320 -2235 4880 4718
16243D718m803Q38j74K388r6j866N373N737p587J516N683L934p078j2186N439
$$ 4718 -85 753 579 2967 2871 1005 6378 12115 4528 6044 11727 15661 8583 -3603 1836
16228A836N209j75k774J816O533K990p094j0563m778l74J3465N588k775l439k660
$$ 1836 7045 6870 4096 5912 12445 15435 8341 -2222 -7000 -7374 6091 11679 8904 5465 2805
16213B805N73l146l045L182N994Q156J1102n839K852k042j2376l310k929j552
$$ 2805 3378 232 -2813 369 6363 14519 25621 19782 22634 20592 8216 4906 1977 425
16199D25M923L751l164k355p571m261p396j032J6990J7717O620j2952r999J170
$$ 425 5348 9099 5935 3580 -3991 -8252 -15648 -16680 310 18027 24647 11695 1696 2866
16185B866O485l879l011O196k513M595J184n818N42j805J140j35n922M012q85
$$ 2866 9351 5472 2461 8657 6144 10739 11923 6105 6647 4842 5982 5847 -75 3937 3052
16170C052p316l27J2568L844j0560K246O590N344K369n364p083K625O270p35j989
$$ 3052 -4264 -4591 7977 11821 1261 3507 10097 15441 17810 12446 5363 7988 14258 13523 11534
16155A1534m965O600m510j2167r96L591K016j528O336n56j0005M894J1426o7K885
$$ 11534 6569 13169 8659 -3508 -4504 -913 1103 -425 5911 5355 -4650 244 11670 11603 14488
16140A4488K600J0556J1340j1484j2727k193R9o648M224r031j739O056M223o650
$$ 14488 17088 27644 38984 27500 14773 12580 12679 6031 10255 1224 -515 5541 9764 3114
16126C114j0826K255Q691N851O330K362p020j0574J781Q264K135k597j6117n029
$$ 3114 -7712 -5457 3234 9085 15415 17777 10757 183 1964 10228 12363 9766 -6351 -11380
16112a1380p0O295R229o290R81O796O632N074q878j424o611q524K008L139q92
$$ -11380 -11450 -5155 4074 -2216 -1235 5561 12193 17267 8389 6965 354 -8170 -6162 -3023 -3915
16097c915K766n098o067k198P41R492J0697K105J20n582j1095n626K912K310P74
$$ -3915 -1149 -6247 -12314 -14512 -13771 -4279 6418 8523 8643 3061 -8034 -13660 -10748 -8438 -7664
16082g664p44J394O165L745J737q814m279M741R058M769J112m837j569m689L068
$$ -7664 -8408 -7014 -849 2896 4633 -4181 -8460 -3719 5339 10108 11220 6383 4814 125 3193
16067C193M561n096K585R006Q839j1034q976k67q409P753L749n860j841l022l81
$$ 3193 7754 2658 5243 14249 23088 12054 3078 2811 -5598 2155 5904 44 -1797 -4819 -5200
16052e200L365O475M394P883J045j0201n298L689k275m153Q45N567Q91l187q352
$$ -5200 -1835 4640 9034 16917 17962 7761 2463 6152 3877 -276 569 6136 7027 3840 -4512
16037d512p576P32K834m990L729J3550K264q293l904K607Q061N368K178q767r464
$$ -4512 -12088 -11356 -8522 -13512 -9783 3767 6031 -2262 -6166 -3559 4502 9870 12048 3281 -6183
16022f183r360Q665P894P107n904n46n413K649L461n196m712m26J3683L115n191
$$ -6183 -15543 -6878 1016 8123 2219 1673 -3740 -1091 2370 -2826 -7538 -7964 5719 8834 3643
16007C643p664L345L407J245L376L469m151j351J050l070j455k164M06m187Q47
$$ 3643 -4021 -676 2731 3976 7352 10821 6670 5319 6369 3299 1844 -320 86 -4101 -3254
15992c254J32r47L245K007N674O126q150q411q63K44N020P482O159M361k415n228
$$ -3254 -3122 -4069 -824 1183 6857 12983 4833 -3578 -4441 -4197 823 8305 14464 18825 16410 11182
15976A1182j9989Q298Q168m504j167L073l659M769l709K806p631n35N285O066
$$ 11182 -8807 -509 7659 3155 1988 5061 1402 6171 2462 5268 -2363 -2898 2387 8453
15962H453p045n405L322J895M291Q322Q23k253l976k901q522j0320J044R716J7562
$$ 8453 1408 -3997 -675 1220 5511 13833 14656 12403 8427 5526 -2996 -13316 -12272 -2556 15006
15947A5006K565l817p366q474l221O868l496J558Q700J1457M721n304n393j0676
$$ 15006 17571 13754 6388 -2086 -5307 1561 -1935 -377 8323 19780 24501 19197 13804 3128
15933C128q836N304M425O780k099r692L216M796k606p998K224M492N914M710O00
$$ 3128 -5708 -404 4021 10801 8702 -990 2226 7022 4416 -3582 -1358 3134 9048 13758 14358
15918A4358Q25k792R24M407j311l809m909j1946L563o226m784P740O61M966J2
$$ 14358 15183 12391 13315 17722 16411 12602 7693 -4253 -690 -6916 -11700 -3960 -3299 1667 1679
15903A679k163N593j80O40p069m642J2378K754J384M682n412n713m674o895J926
$$ 1679 -484 5109 4929 5569 -1500 -6142 6236 8990 10374 15056 9644 3931 -743 -7638 -5712
15888e712J2305O143j2007j902O947J644j7473j756P060Q532Q659J931K037p967
$$ -5712 6593 12736 729 -1173 5774 7418 -10055 -11811 -4751 3781 12440 14371 16408 8441
15874H441j0478O999J0780j1489k671K580N242l095JQ536K95k526K08j4117n291
$$ 8441 -2037 4962 15742 4253 1582 4162 9404 6309 6310 14846 15141 12615 12823 -1294 -6585
15859f585J871M58J555o515J558j920L268o64O346L742m134p868k559J163K825
$$ -6585 -4714 -4256 -2701 -9216 -7658 -9578 -6310 -6974 -628 3114 -1020 -8888 -11447 -10284 -7459
15844g459o025n310N432k787P501J4905M159j0984J930R81r270n397L710M370
$$ -7459 -13484 -18794 -13362 -16149 -8648 6257 10416 -568 1362 2343 -6927 -12324 -8614 -4244
15830d244o40P42q564m639l180K535J3938Q402Q973P02q555k04k233n134O968
$$ -4244 -4884 -4142 -12706 -17345 -20525 -17990 -4052 4350 13323 14025 5470 5266 3033 -2101 4867
15815D867m656l076L134K276n940l336L166o279O560J3408j870M92k067l797L069
$$ 4867 211 -2865 269 2545 -3395 -6731 -3565 -9844 -3284 10124 8254 8746 6679 2882 5951
15800E951O012M810l931j3304m487m383K385K301M653J7618R260j0937k072J419
$$ 5951 11963 16773 12842 -462 -4949 -9332 -6947 -4646 7 17625 26885 15948 13876 15295
15786A5295j058k763Q28p640m538k114p650k662N002m047l082L747P072Q479j621
$$ 15295 14237 11474 12302 4662 124 -1990 -9640 -12302 -7300 -11347 -14429 -10682 -3610 4869 3248
15771C248j4132k750N130M320M078K936m823l780K233L392K465j866j646N235
$$ 3248 -10884 -13634 -8504 -4184 -106 2830 -1993 -5773 -3540 -148 2317 451 -1195 4040
15757D040N042K16k890p435O231N54l153n504m556Q84K874n688k067M966P939
$$ 4040 9082 9298 6408 -1027 5204 5758 2605 -2899 -7455 -6571 -3697 -9385 -11452 -6486 1453
15742A453M772M912j510L075j179j3949o936n860K914K626Q604J3339p660q152
$$ 1453 6225 11137 9627 12702 11523 -2426 -9362 -15222 -12308 -9682 -1078 12261 4601 -3551
15728c551L224o58L254J36k580m496K084J3j727j0424n173Q209m043R33P59J556
$$ -3551 -327 -985 2269 2405 -175 -4671 -2587 -2574 -4301 -14725 -19898 -11689 -15732 -14799 -14040 -12484
15712a2484o297P528O896j780N849P119k102n94m463o55O98k685J810j876k063
$$ -12484 -18781 -11253 -4357 -6137 -288 6831 4729 4135 -328 -983 -285 -2970 -1160 -3036 -5099
15697e099l400N387l820q89P810k677k206l741m054R120J146m939q076q35j444
$$ -5099 -8499 -3112 -6932 -7821 -11 -2688 -4894 -8635 -12689 -3569 -2423 -7362 -15438 -16273 -17717
15682a7717O488j709L334j268K012K673O44J5002J218k274m449m522Q69m598L133
$$ -17717 -11229 -12938 -9604 -10872 -8860 -6187 -5543 9459 10677 8403 3954 -568 301 -4297 -1164
15667a164k204k817J1716N31j1809J070p001j131K111J058n063P00r95K538Q162
$$ -1164 -3368 -6185 5531 6062 -5747 -4677 -11678 -12809 -10698 -9640 -14703 -14003 -14998 -12460 -4298
15652d298N164q140r221J983K307R920j319n199Q880R91M411O680L705k556j905
$$ -4298 866 -7274 -16495 -14512 -12205 -2285 -3604 -8803 77 1068 5479 12159 15864 13308 11403
15637A1403q80j0872m506L518J077k451n185n365P289R580m910o953k846m244
$$ 11403 10523 -349 -4855 -1337 -260 -2711 -7896 -13261 -5972 3608 -1302 -8255 -11101 -15345
15623a5345p400J0002J2174R055N76j3430n23P038j1176j155P035Q998l443j604
$$ -15345 -22745 -12743 -569 8486 9062 -4368 -4891 2147 -9029 -10184 -3149 5849 2406 802
15609H02O774m37j5820J002O351q998l005P918K742n503M5P13l138l159Q873J54
$$ 802 7576 7139 -8681 -7679 -1328 -10326 -13331 -5413 -2671 -8174 -8129 -7416 -10554 -13713 -4840 -4686
15593d686j919q56o788R730J9926K555j386l523m023K922j284k456m535o272m883
$$ -4686 -6605 -7461 -14249 -4519 15407 17962 16576 13053 9030 11952 10668 8212 3677 -2595 -7478
15578g478n56R207L937M410R381m398j961j1416l045L472M648j0408O337J2414
$$ -7478 -8034 1173 5110 9520 18901 14503 12542 1126 -1919 1553 6201 -4207 2130 14544
15564A4544n129m975K227q10J489O003M908j1465k765K429L10p941j3424k645
$$ 14544 9415 4440 6667 5857 7346 13349 18257 6792 4027 6456 6766 -1175 -14599 -17244
15550a7244L796n488M633L807K08J851P900Q804j901K073M596L988o144n910k477
$$ -17244 -13448 -18936 -14303 -10496 -10288 -8437 -537 8267 6366 8439 13035 17023 10879 4969 2492
15535B492J424J325j2286k323P750O56R5j746K257M920m874m90k656r75j700O650
$$ 2492 3916 5241 -7045 -9368 -1618 -962 -867 -2613 -356 4564 -310 -800 -3456 -4431 -6131 519
15519E19m15j0773n679L235J2973O502k068n502j034K488l80l655m453M18M312
$$ 519 104 -10669 -16348 -13113 -140 6362 4294 -1208 -2242 246 -134 -3789 -8242 -7824 -3512
15504c512Q07N364N815j102l294j6J693p698l996K212R428l533r997l569N332
$$ -3512 -2705 2659 8474 7372 4078 4062 5755 -1943 -5939 -3727 5701 2168 -7829 -11398 -6066
15489f066O654jn25m046L697L355N87L653j3510n213j864j49m997K088J2419k562
$$ -6066 588 587 62 -3984 -287 3068 3655 7308 -6202 -11415 -13279 -13428 -18425 -16337 -3918 -6480
15473f480J664l33O17J855k430k161M877J1757M724P192k809q168n216j097o493
$$ -6480 -4816 -5149 -4532 -2677 -5107 -7268 -2391 9366 14090 21282 18473 10305 5089 3992 -2501
15458b501l181n986p517N963M032L789J498L443J524O059n146q775k331J2097
$$ -2501 -5682 -11668 -19185 -13222 -9190 -5401 -3903 -460 1064 7123 1977 -6798 -9129 2968
15444B968k354l549n610k465N748p50J716P98J921L742K088q97n179q378M398
$$ 2968 614 -2935 -8545 -11010 -5262 -6012 -4296 -3498 -1577 2165 4253 3356 -1823 -10201 -5803
15429e803J865J1413K128k674r128l091L686n210j6268n770n233N769O075N735
$$ -5803 -3938 7475 9603 6929 -2199 -5290 -1604 -6814 -23082 -28852 -34085 -28316 -22241 -16506
15415a6506Q647J1677M989N992L08p687o985k582m284M628Q258l420P04o46K558
$$ -16506 -7859 3818 8807 14799 15107 7420 435 -2147 -6431 -1803 6455 3035 3739 3093 5651
15400E651R226j720m070j391l482l904L027l694M15R145M411K192j263L300o401
$$ 5651 14877 13157 9087 7696 4214 310 3337 -357 58 9203 13614 15806 14543 17843 11442
15385A1442l991p385j82P811j4871o638l51P331M427K008M814k531p392K622J380
$$ 11442 7451 66 -116 7695 -7176 -13814 -14165 -6834 -2407 -399 4415 1884 -5508 -2886 -1506
15370a506m197j107n60L933m635k269P355l56l189l945k380K434J604l008O67
$$ -1506 -5703 -6810 -7370 -3437 -8072 -10341 -2986 -3342 -6531 -10476 -12856 -10422 -8818 -11826 -11159
15355a1159P593R225n979K031O755L923n201o906O320p82m468k850K668m749l442
$$ -11159 -3566 5659 -320 1711 8466 12389 7188 282 6602 5820 1352 -1498 1170 -3579 -7021
15340g021J098r780l614N196J2066P809K002J40K355O929m009M343n731j5677
$$ -7021 -5923 -15703 -19317 -14121 -2055 5754 7756 7896 10251 17180 13171 17514 11783 -3894
15326c894o895p592P26R843O872n569m489l836J6248J336r02J240O345M299l345
$$ -3894 -10789 -18381 -17655 -7812 -940 -6509 -10998 -14834 1414 2750 1848 3088 9433 13732 10387
15311A0387l804n297j335p528q478Q257J5141L628L078j8j002n1k195j357l593
$$ 10387 6583 1286 -49 -7577 -16055 -7798 7343 10971 14049 14031 13029 12978 10783 9426 5833
15296E833M35m146o423n047J0782M987k115j941j629K185K419m865l478n571r06
$$ 5833 6268 2122 -4301 -9348 1434 6421 4306 2365 736 2921 5340 475 -3003 -8574 -9480
15281i480k539L262L122R60R290n335n453M791K323N311L224l67m641Q2p12j4972
$$ -9480 -12019 -8757 -5635 -4675 4615 -720 -6173 -1382 941 6252 9476 9109 4468 4550 3838 -11134
15265a1134p155p99N729K437P491J0766o590r256n65k211M75J628n445R241L331
$$ -11134 -18289 -19088 -13359 -10922 -3431 7335 745 -8511 -9076 -11287 -10812 -9184 -14629 -5388 -2057
15250b057l532k587L446N450N148K860p230q550n391N373J6482j69j1235q850
$$ -2057 -5589 -8176 -4730 720 5868 8728 1498 -7052 -12443 -7070 9412 9243 -1992 -10842
15236a0842O662r26m68J1974M40j377o459O621p51n71r16k366l121k621j952j907
$$ -10842 -4180 -5106 -5574 6400 6840 5463 -996 5625 4874 4303 3387 1021 -2100 -4721 -6673 -8580
15220h580J035m92J0114j98k901N372n607n46N739j947m660J826M73N789J80K26
$$ -8580 -7545 -8037 2077 1879 -1022 4350 -1257 -1803 3936 1989 -2671 -845 -372 5417 5597 5823
15204E823N56m743n981N071L457l174k743Q595j0690j804N512n957n498N151N849
$$ 5823 6379 1636 -4345 726 4183 1009 -1734 6861 -3829 -5633 -121 -6078 -11576 -6425 -576
15189e76Q10o376l332N281R237P095J1408k992j477p795n193l238J490L136l186
$$ -576 234 -6142 -9474 -4193 5044 12139 23547 20555 19078 11283 6090 2852 4342 7478 4292
15174D292M439o190n580n3J948M301J1155o927r647R67J2998j025l327p850k507
$$ 4292 8731 2541 -3039 -3092 -1144 3157 14312 7385 -2262 -1295 11703 10678 7351 -499 -3006
15159c006q746j544N272Q03k286R785P304J279O011M873j2940j4312N080k041
$$ -3006 -11752 -13296 -8024 -7221 -9507 278 7582 8861 14872 19745 6805 -7507 -2427 -4468
15145d468O06O39Q68n292L442j569k660j376l964P336m355o12O421Q023O001j662
$$ -4468 -3862 -3223 -2355 -7647 -4205 -5774 -8434 -9810 -13774 -6438 -10793 -11405 -4984 3039 9040 7378
15129G378m761n056o124n116K257p156O60j650k476J0710k40o885m694N946Q777
$$ 7378 2617 -2439 -8563 -13679 -11422 -18578 -17918 -19568 -22044 -11334 -11574 -18459 -23153 -17207 -8430
15114h430l706P874P3m220M701P025N841P698q431k992J1290J4195L004j2657
$$ -8430 -12136 -4262 -4189 -8409 -3708 3317 9158 16856 8425 5433 16723 30918 33922 21265
15100B1265j64k506j0489o683m412o893J3284J1341N3l811K560M22J615j144l649
$$ 21265 21101 18595 8106 1423 -2989 -9882 3402 14743 14796 10985 13545 13967 15582 14438 10789
15085A0789m446m302k323m568P217r44J511L000q601m950R941K19r874l199N978
$$ 10789 6343 2041 -282 -4850 2367 1423 2934 5934 -2667 -7617 2324 2543 -7331 -10530 -4552
15070d552J0515J463m415j0032q88J101r57P53j2053q625Q998O990K229l6O456
$$ -4552 5963 7426 3011 -7021 -7909 -6808 -7765 -7012 -19065 -27690 -18692 -11702 -9473 -9509 -3053
15055c053P938N274k680m099R322P837j8214j3247P335k320o176L79J241m036
$$ -3053 4885 10159 7479 3380 12702 20539 2325 -10922 -3587 -5907 -12083 -11704 -10463 -14499
15041a4499P228O421M439J079J031j1995o208j897K276R877j886l88O763J066
$$ -14499 -7271 -850 3589 4668 5699 -6296 -12504 -14401 -12125 -2248 -4134 -4522 2241 3307
15027C307m54q733m905k833L212N756n12k079L449j704k984l250L040L096N865
$$ 3307 2853 -5880 -10785 -13618 -10406 -4650 -5162 -7241 -3792 -5496 -8480 -11730 -8690 -5594 271
15012B71k855m403J566j445k823m417Q724J3975m054j1090l354k771k787Q044
$$ 271 -2584 -6987 -5421 -6866 -9689 -14106 -5382 8593 4539 -6551 -9905 -12676 -15463 -7419
14998g419N228q933n801J0414k272N317o591j879N360J7223L984l429j241L074
$$ -7419 -2191 -11124 -16925 -6511 -8783 -3466 -10057 -11936 -6576 10647 14631 11202 9961 13035
14984A3035m598r893J275K010p243k868J3007J0889O024m607j2471n865M99K146
$$ 13035 8437 -1456 -181 1829 -5414 -8282 4725 15614 21638 17031 4560 -1305 -806 1340
14970A340j370o110k08q7N618J611J312L339p20R63K174o90J995m494n780k586
$$ 1340 -30 -6140 -6348 -6435 -817 794 2106 5445 4725 5688 7862 7172 9167 4673 -1107 -3693
14954c693N516j243J202Q383J410j5812j5114m287J838M819M686l229K254Q177
$$ -3693 1823 580 1782 10165 11575 -4237 -19351 -23638 -21800 -16981 -12295 -15524 -13270 -5093
14940e093J987N76l424R898l631n396k287K456K048L161N452l649j2779j1031
$$ -5093 -3106 -2530 -5954 3944 313 -5083 -7370 -4914 -2866 295 5747 2098 -10681 -21712
14926b1712n731J0371n66L936O431n491R05K964R62n683J723P334O393R159L452
$$ -21712 -27443 -17072 -17638 -13702 -7271 -12762 -11857 -8893 -7931 -13614 -11891 -4557 1836 10995 14447
14911A4447j962n278j9023N313O289M112l617n855r756L280J5486N417p779l682
$$ 14447 12485 7207 -11816 -6503 -214 3898 281 -5574 -15330 -12050 3436 8853 1074 -2608
14897b608q058O467R167l005n087q577J786O397L458K253J493p001o716l077K991
$$ -2608 -10666 -4199 4968 1963 -3124 -11701 -9915 -3518 -60 2193 3686 -3315 -10031 -13108 -10117
14882a0117N957R886K302l886N345L200O66j1349p254J716k942N031K304n315
$$ -10117 -4160 5726 8028 4142 9487 12687 13353 2004 -5250 -3534 -6476 -1445 859 -4456
14868d456O81Q021M456n513l088m014k618q814K606J324p246P131J3368l491m797
$$ -4456 -3775 4246 8702 3189 101 -3913 -6531 -15345 -12739 -11415 -18661 -11530 1838 -1653 -6450
14853f450j994k906k418N992r24M357l761L672L401J282o627L683L838M324m342
$$ -6450 -8444 -11350 -13768 -7776 -8700 -4343 -8104 -4432 -1031 251 -6376 -2693 1145 5469 1127
14838A127o709Q288L280Q69j22j1220L116J850p6k607o079L85N623K58Q782Q149
$$ 1127 -5582 2706 5986 6855 6733 -4487 -1371 479 403 -2204 -8283 -7898 -2275 -2017 6765 14914
14822A4914k430q819k916m95J961j522k055j1404l809R116P040l235O57o605J1177
$$ 14914 12484 3665 749 254 2215 693 -1362 -12766 -16575 -7459 -419 -3654 -2997 -9602 1575
14807A575J987n905q971l495K056o33J872n946K438M554j050K059l550k121J4433
$$ 1575 3562 -2343 -11314 -14809 -12753 -13386 -11514 -17460 -15022 -10468 -11518 -9459 -13009 -15130 -697
14792f97M299N018j2275l493O315P31j997q94j826Q387L678q632j1834J0679O525
$$ -697 3602 8620 -3655 -7148 -833 -102 -2099 -2993 -4819 3568 7246 -1386 -13220 -2541 3984
14777C984m705j890m480J712J0007J0934l045k814k363M652q23p372o531L912
$$ 3984 -721 -2611 -7091 -5379 4628 15562 12517 9703 7340 11992 11169 3797 -2734 1178
14763A178k325j857q902p8L919p475L065N451J371l229K969j20L043Q874J685
$$ 1178 -1147 -3004 -11906 -11984 -8065 -15540 -12475 -7024 -5653 -8882 -5913 -6033 -2990 5884 7569
14748G569j2725k373k899k219Q184M512j1507N352K622o35M778K377K207P084
$$ 7569 -5156 -7529 -10428 -12647 -4463 49 -11458 -6106 -3484 -4119 659 3036 5243 12327
14734A2327o370m295k576j567L745O653l226k380M65R021J557K854Q37n560j265
$$ 12327 5957 1662 -914 -2481 1264 7917 4691 2311 2776 11797 13354 16208 17045 11485 10220
14719A0220P10P65r459j0531K619j175K109P397L184p936r630m400m048J0008
$$ 10220 10930 11695 2236 -8295 -5676 -6851 -4742 2655 5839 -2097 -11727 -16127 -20175 -10167
14705a0167K931J19l304k653L099N867P65R499O321j580p640p440O162J482K810
$$ -10167 -7236 -7117 -10421 -13074 -9975 -4108 -3343 6156 12477 10897 3257 -4183 1979 3461 6271
14690F271l58O634J552n709K611q339J849J952J071N75k211o221K392j914o144
$$ 6271 5913 12547 14099 8390 11001 2662 4511 6463 7534 8109 5898 -323 2069 155 -5989
14675e989O498R117O184l143m730k344l184o872m848J631p425P020J0458N28k852
$$ -5989 509 9626 15810 12667 7937 5593 2409 -4463 -9311 -7680 -15105 -8085 2373 2901 49
14660D9p424r421l216M445l43J329P159O94J0891M605K845j0527o758K349L446
$$ 49 -7375 -16796 -20012 -15567 -15910 -14581 -7422 -6728 4163 8768 11613 1086 -5672 -3323 123
14645A23J962P815J455k733N503m625l289j993r31P590j378j2252M065O368q981
$$ 123 2085 9900 11355 8622 14125 9500 6211 4218 3287 10877 9499 -2753 1312 7680 -1301
14630a301k802R747k865Q45N755j2592j4230M483P331o8M913J1653L437p777r512
$$ -1301 -4103 5644 2779 3624 9379 -3213 -17443 -12960 -5629 -5697 -784 10869 14306 6529 -2983
14615b983j1145R122R726J587n963n662l079l50N377J0411l290K352N298N34j2736
$$ -2983 -14128 -5006 4720 6307 344 -5318 -8397 -8747 -3370 7041 3751 6103 11401 11935 -801
14600h01p175o20K978J4118L501l091l551l536l319o133K82J418K514R512K933
$$ -801 -7976 -8596 -5618 8500 12001 8910 5359 1823 -1496 -7629 -7347 -5929 -3415 6097 9030
14585I030K85J379L57j0826Q821M985j1959l780O98O236o556m78N067m054l784
$$ 9030 9315 10694 11051 225 9046 14031 2072 -1708 -1010 5226 -1330 -1808 3259 -795 -4579
14570d579L828N403j252N651o224J433P500k099o077j0351o0k637J481Q330j810
$$ -4579 -751 4652 3400 9051 2827 4260 11760 9661 3584 -6767 -6827 -9464 -7983 347 -1463
14555a463p819o56l13R855N900j291N561j398j0168j100k99m909k177P05Q478
$$ -1463 -9282 -9938 -10251 -396 5504 4213 9774 8376 -1792 -2892 -3191 -8100 -10277 -9572 -1094
14540a094J08k641l531k98j623O907K045l971P330K995j611R03m392l177J0975
$$ -1094 -986 -3627 -7158 -7456 -9079 -2172 -127 -4098 3232 6227 4616 5519 1127 -2050 8925
14525H925K708r298R40l113q413q245L437J1010o574K056J1846k368j11m476q181
$$ 8925 11633 2335 3275 162 -8251 -16496 -13059 -2049 -8623 -6567 5279 2911 2800 -1676 -9857
14510i857m571k938L460L055L866K519J389o290L165N258M096q39L227J41j246
$$ -9857 -14428 -17366 -13906 -10851 -6985 -4466 -3077 -9367 -6202 -944 3152 2313 5540 5681 4435
14495D435k774K195j242K809O942m749m476k335k260J549M870O955j679m326l970
$$ 4435 1661 3856 2614 5423 12365 7616 3140 805 -1455 94 4964 11919 10240 5914 1944
14480A944o309N027O26o950N06M030l708p356k097M453K015J1628K794l151j0358
$$ 1944 -4365 662 1288 -5662 -5156 -1126 -4834 -12190 -14287 -9834 -7819 3809 6603 3452 -6906
14465f906M23K298j531L279J3554p452r994L112J5427m175j283m91p520j1263
$$ -6906 -6483 -4185 -5716 -2437 11117 3665 -6329 -3217 12210 8035 6752 6261 -1259 -12522
14451a2522k240O080K123P241K957K207j754n7L675l581J31K081J586j0031j1634
$$ -12522 -14762 -8682 -6559 682 3639 5846 4092 4035 7710 4129 4260 6341 7927 -2104 -13738
14436a3738R559K991M889l283j0816l677P213L238L391n819k850Q647J88L941
$$ -13738 -4179 -1188 3701 418 -10398 -14075 -6862 -3624 -233 -6052 -8902 -255 -67 3874
14422C874J212j3002l329P99n498K463J0775r8L61Q824L074o551n012k51j946
$$ 3874 5086 -7916 -11245 -10446 -15944 -13481 -2706 -2804 -2443 6381 9455 2904 -2108 -2359 -4305
14407d305O769p997q649n247J1118J9595J1962j230j8123q397m392O628L463k307
$$ -4305 2464 -5533 -14182 -19429 -8311 11284 23246 22016 3893 -4504 -8896 -2268 1195 -1112
14393a112o335q13l895K31M049L499m561q290K048L761M458O200J042j909m813
$$ -1112 -7447 -8260 -12155 -11924 -7875 -4376 -8937 -17227 -15179 -11418 -6960 -760 282 -1627 -6440
14378f440L988n642K79j072R760J596o542k513L788M378m843j068J82m462j290
$$ -6440 -2452 -8094 -7815 -8887 873 2469 -4073 -6586 -2798 1580 -3263 -4331 -4149 -8611 -9901
14363i901Q358N155M26j728r547k635l516p24l156L287O351K432k724K963N206
$$ -9901 -1543 3612 4038 2310 -7237 -9872 -13388 -14112 -17268 -13981 -7630 -5198 -7922 -4959 247
14348B47N089L360m427q609n513L429J490K856N442J1862L457l325q114J698K395
$$ 247 5336 8696 4269 -4340 -9853 -6424 -4934 -2078 3364 15226 18683 15358 7244 8942 11337
14333A1337o545l520j2546o756o090j83K944M504j349r833M274O345M867P961
$$ 11337 4792 1272 -11274 -18030 -24120 -24303 -21359 -16855 -18204 -28037 -23763 -17418 -12551 -4590
14319d590P709l032q566k115m20M967J601J385j42O359M28n484o345n843o074
$$ -4590 3119 87 -8479 -10594 -11014 -6047 -4446 -3061 -3203 3156 3584 -1900 -8245 -14088 -20162
14304b0162J0143J1224Q634L198q898k116j910p259k345k329J6m819j564o06L867
$$ -20162 -10019 1205 9839 13037 4139 2023 113 -7146 -9491 -11820 -11804 -16623 -18187 -18793 -14926
14289a4926R031j1365k921J2382M123p308N534j372j212r0L824O209l889J022
$$ -14926 -5895 -17260 -20181 -7799 -3676 -10984 -5450 -6822 -8034 -8124 -4300 1909 -1980 -958
14275i58j756M41K722j771p147m467m839K529P196k188k170K831P754N260O39
$$ -958 -2714 -2273 449 -1322 -8469 -12936 -17775 -15246 -8050 -10238 -12408 -9577 -1823 3437 4076
14260D076M380O87l818q379j931o011L368K332p439L221N247L884K180Q229K005
$$ 4076 8456 9143 5325 -3054 -4985 -10996 -7628 -5296 -12735 -9514 -4267 -383 1797 10026 12031
14245A2031j0143l790j459K881O274p040p668j1597O497J2842J1183L616k914
$$ 12031 1888 -1902 -3361 -480 5794 -1246 -8914 -20511 -14014 -1172 10011 13627 10713
14232A0713k495p517j135J203n146k705K814N717k24k188m463O030R69J031N301
$$ 10713 8218 701 -434 769 -4377 -7082 -4268 1449 1225 -963 -5426 604 1573 2604 7905
14217G905J543k767j1490k233Q645J0966l016j1703J819K105N97k125j0846n927
$$ 7905 9448 6681 -4809 -7042 1603 12569 9553 -2150 -331 1774 2371 246 -10600 -16527
14203a6527N315J3092L874p642j837K661q408Q51J137R424j320m573o461p7k603
$$ -16527 -11212 1880 5754 -1888 -3725 -1064 -9472 -8621 -7484 1940 620 -3953 -10414 -10491 -13094
14188a3094J195P601M371m820q666L527P493M4n765P012L350K622k37j075o113
$$ -13094 -11899 -4298 73 -4747 -13413 -9886 -2393 -2349 -8114 -1102 2248 4870 4633 3558 -2555
14173b555r559L758Q465P082k87j656p456L956K928M59N853j907r905o642J538
$$ -2555 -12114 -8356 109 7191 6904 5248 -2208 1748 4676 5135 10988 9081 -824 -7466 -5928
14158e928N339L813k779j969R696L75n98l145p474p057q247O354M90n098O663
$$ -5928 -589 3224 445 -1524 8172 8547 7949 4804 -2670 -9727 -17974 -11620 -11130 -16228 -9565
14143i565J295K287L200j266M53m502N905M854p942o352L352m94R558k185m888
$$ -9565 -8270 -5983 -2783 -4049 -3596 -8098 -2193 2661 -5281 -11633 -8281 -8775 783 -1402 -6290
14128f290j6218j616N816L328L061J555M390J137m113l400O77M679Q170q700q733
$$ -6290 -22508 -24124 -18308 -14980 -11919 -10364 -5974 -4837 -8950 -12350 -11673 -6994 1176 -7524 -16257
14113a6257M47K018j11l862N687J63O187m096K782K480l317J650m375K9l280m116
$$ -16257 -15810 -13792 -13903 -17765 -12078 -11915 -5728 -9824 -7042 -4562 -7879 -6229 -10604 -10575 -13855 -17971
14097a7971O521j920n514l333K103N145L951O384J63m538j287O746J0902K37j0936
$$ -17971 -11450 -13370 -18884 -22217 -20114 -14969 -11018 -4634 -4471 -9009 -10296 -3550 7352 7589 -3347
14082c347r706J0572l922M09J1844K122m63j1224p341k55N521l099n214R775Q036
$$ -3347 -13053 -2481 -6403 -5994 5850 7972 7509 -3715 -11056 -11311 -5790 -8889 -14103 -4328 3708
14067C708j70j0888M689L4K070K663P004R700j574j6818q890m47P223P077k934
$$ 3708 3538 -7350 -2661 -2627 -557 2106 9110 18810 17236 418 -8472 -8919 -1696 5381 2447
14052B447l03K484j1114j9638l676J2026P217Q58J1385R329j1413j6825l758m130
$$ 2447 2144 4628 -6486 -26124 -29800 -17774 -10557 -9699 1686 11015 -398 -17223 -20981 -25111
14038b5111J1286O475M192l54J744m577R34p788q113J1994L691J638p262o725
$$ -25111 -13825 -7350 -3158 -3512 -1768 -6345 -5411 -13199 -21312 -9318 -5627 -3989 -11251 -17976
14024a7976L892J2599N072m971o701R124M456O427j4505k379N999P166Jl590q127
$$ -17976 -14084 -1485 3587 -1384 -8085 1039 5495 11922 -2583 -4962 1037 8203 8204 4614 -3513
14009c513J3195K310o298j0593L58k592O79l420r838J1145O483q67k927K218O023
$$ -3513 9682 11992 5694 -4899 -4541 -7133 -6454 -9874 -19712 -8567 -2084 -2951 -5878 -3660 2363
13994B363k172n894Q14J4086N997J026L719r018j0233P12n041l695j054O531K121
$$ 2363 191 -5703 -4889 9197 15194 16220 19939 10921 688 1400 -3641 -7336 -8390 -1859 262
13979B62l082M086m589P59j992P95p674K389N408J0014p655j3149J064Q328r63
$$ 262 -2820 1266 -3323 -2564 -4556 -3761 -11435 -9046 -3638 6376 -1279 -14428 -13364 -5036 -5999
13964e999J0678j29l853l124r277q09P098P685o323L181R168K429l011q530K15
$$ -5999 4679 4550 697 -2427 -11704 -12513 -5415 2270 -4053 -872 8296 10725 7714 -816 -601
13949f01l213p397l894r28N980K897j076j2459j361k965O417J2474k781m009o592
$$ -601 -3814 -11211 -15105 -16033 -10053 -7156 -8232 -20691 -22052 -25017 -18600 -6126 -8907 -12916 -19508
13934a9508l423Q581J0260L488L79L898p21k794r363J0267J0063k156j1037j5855
$$ -19508 -22931 -14350 -4090 -602 -223 3675 2954 160 -9203 1064 11127 8971 -2066 -17921
13920a7921L053L956K648p038p53N202K251k515k694O837R031l101M86q626m016
$$ -17921 -14868 -10912 -8264 -15302 -16055 -10853 -8602 -11117 -13811 -6974 2057 -1044 -558 -9184 -13200
13905a3200M211O158K863k090Q87q918J454Q543p52p070r639n724j012N134J5823
$$ -13200 -8989 -2831 32 -2058 -1171 -10089 -8635 -92 -844 -7914 -17553 -23277 -24289 -19155 -3332
13890c332J0654o912m833L212k869n637k63N949L630J13O19L909R69J911r840
$$ -3332 7322 410 -4423 -1211 -4080 -9717 -9980 -4031 -401 -288 331 4240 5209 7120 -2720
13875b720o210J739j480M078M73k325Q062j300m474J713L890p758K98Q675K566
$$ -2720 -8930 -7191 -8671 -4593 -4120 -6445 1617 317 -4157 -2444 1446 -6312 -6014 2661 5227
13860E227k115o587n310q999K398M772L838K990l064O731K460m192m509O72J514
$$ 5227 3112 -3475 -8785 -17784 -15386 -10614 -6776 -3786 -6850 -119 2341 -1851 -6360 -5688 -4174
13845d174n375r627k167J2668m219q226O971R805P167o610K007J070l457k357
$$ -4174 -9549 -19176 -21343 -8675 -12894 -21120 -14149 -4344 2823 -3787 -1780 -710 -4167 -6524
13831f524N008N63j0k444N886P686j156o475p2k601K420M572j0846P76R569K232
$$ -6524 -1516 -953 -963 -3407 2479 10165 9009 2534 2462 -139 2281 6853 -3993 -3217 6352 8584
13815H584n509J431Q780J492r07M231r792j5756q48K267m20P947j198o897m120
$$ 8584 3075 4506 13286 14778 13871 18102 8310 -7446 -8294 -6027 -6447 1500 302 -6595 -10715
13800a0715k450L321O783J386J575l962k930O751K854N339K813l130j540k493
$$ -10715 -13165 -9844 -3061 -1675 -100 -4062 -6992 -241 2613 7952 10765 7635 6095 3602
13786C602j0524P012J80n364n800P04N965Q699M258p052L325J705j1352o77N600
$$ 3602 -6922 90 270 -5094 -10894 -10190 -4225 4474 8732 1680 5005 6710 -4642 -5319 281
13771B81M923j946J114n92P83N762J569n490n316l273p546K010J1342L177k168
$$ 281 5204 3258 4372 3780 4563 10325 11894 6404 1088 -2185 -9731 -7721 3621 6798 4630
13756D630j601k523j570K830M48q202O965P203n86j1212K74M609n268n871O267
$$ 4630 3029 506 -1064 1766 2214 -5988 977 8180 7594 -3618 -3344 1265 -4003 -9874 -3607
13741c607j959q418J3344Q963k262k651k114J1217P265j0449k636l809p315n034
$$ -3607 -5566 -13984 -640 8323 6061 3410 1296 12513 19778 9329 6693 2884 -4431 -9465
13727i465N050l224k168J450k51l35L911k52j414M168r203M958K592l100R23j31
$$ -9465 -4415 -7639 -9807 -8357 -8608 -8943 -5032 -5284 -6698 -2530 -11733 -6775 -4183 -7283 -6360 -6491
13711f491Q640Q459r575j0873n914M673M873j321M80N994m134L18O951J667k863
$$ -6491 2149 10608 1033 -9840 -15754 -11081 -6208 -7529 -7049 -1055 -5189 -4871 2080 3747 884
13696H84O149O65N647Q982q504j4319N691R455p710j1667k089k722J512n060k493
$$ 884 7033 7698 13345 22327 13823 -496 5195 14650 6940 -4727 -6816 -9538 -8026 -13086 -15579
13681a5579N415j736j639j0204K356L652l528p015J0904Q834Q924K175r853L447
$$ -15579 -10164 -11900 -13539 -23743 -21387 -17735 -21263 -28278 -17374 -8540 384 2559 -7294 -3847
13667c847k430m655n629n52J2816M668j35j767r998p22J040M711k68K334P775
$$ -3847 -6277 -10932 -16561 -17113 -4297 371 236 -1531 -11529 -12251 -11211 -6500 -6768 -4434 3341
13652C341j458o502p262j132Q294N6l377n470M045N598P889N65j744J33Q231J968
$$ 3341 1883 -4619 -11881 -13013 -4719 -4663 -8040 -13510 -9465 -3867 4022 4587 2843 2976 11207 13175
13636A3175J920o818N45O54j1848m374M474m887o787M414M627K010q436J2881
$$ 13175 15095 8277 8822 9476 -2372 -6746 -2272 -7159 -13946 -9532 -4905 -2895 -11331 1550
13622A550P084m667o058m51n743P78J145k962p359P640J4296L166o919o72N168
$$ 1550 8634 3967 -2091 -2542 -8285 -7507 -6362 -9324 -16683 -9043 5253 8419 1500 828 5996
13607E996o386o344K90j389P396M429K214p789q179N299J718r66K94N805o479
$$ 5996 -390 -6734 -6444 -7833 -437 3992 6206 -1583 -9762 -4463 -2745 -3711 -3417 2388 -4091
13592d091J745J667J558o60j037o728q374M868K101M56j263j982M296M780J106
$$ -4091 -2346 -679 879 219 -818 -7546 -15920 -11052 -8951 -8495 -9758 -11740 -7444 -2664 -1558
13577a558P69j555L06l796K402K010j719n042r485n678Q064J2875m050n073M276
$$ -1558 -789 -2344 -2038 -5834 -3432 -1422 -3141 -8183 -17668 -23346 -15282 -2407 -6457 -11530 -7254
13562g254O156l609n024L683O926P361k306j386o64r769l263m184r871l263M123
$$ -7254 -1098 -4707 -9731 -6048 878 8239 5933 4547 3883 -5886 -9149 -13333 -23204 -26467 -22344
13547b2344N229P86n910Q04K299K453J982p051K803N336J2726J5777l177n743
$$ -22344 -17115 -16329 -22239 -21435 -19136 -16683 -14701 -21752 -18949 -13613 -887 14890 11713 5970
13533E970r522l152o605K729O262O636k067j5246O289N742k898lL765L624J706
$$ 5970 -3552 -6704 -13309 -10580 -4318 2318 251 -14995 -8706 -2964 -5862 -5865 -2100 1524 3230
13518C230o245l705o556l715k41M110J2978k984j534l566n243m397j025L690K101
$$ 3230 -3015 -6720 -13276 -16991 -17232 -13122 -144 -3128 -4662 -8228 -13471 -17868 -18893 -15203 -13102
13503a3102J500N613K445m319j790o190N679K511K705l743M665l645o954m505
$$ -13102 -11602 -5989 -3544 -7863 -9653 -15843 -10164 -7653 -4948 -8691 -4026 -7671 -14625 -19130
13489a9130N247K568o14Q961J3688j479q314j671J960O0j0287Q3r862J086L167
$$ -19130 -13883 -11315 -11929 -2968 10720 9241 927 -744 1216 1276 -9011 -8928 -18790 -17704 -14537
13474a4537%J0948O136J63j0353L175j440N674K292o953p14j006k821o421J0327
$$ -14537 -14537 -3589 2547 2710 -7643 -4468 -5908 -234 2058 -4895 -5609 -6615 -9436 -15857 -5530
13459e530N514K101j152l068k0389l313O962L249n158J2490J282n846n402L569
$$ -5530 -16 2085 933 -2135 -22524 -25837 -18875 -15626 -20784 -8294 -7012 -12858 -18260 -14691
13445a4691o959L551J5855R394p375n138P758O541K817r973j0748k652J081Q71
$$ -14691 -21650 -18099 -2244 7150 -225 -5363 2395 8936 11753 1780 -8968 -11620 -10539 -9668
13431i668j996R367M346L066j748K251J197K473P80n46L004j3404o216k71L411
$$ -9668 -11664 -2297 2049 5115 3367 5618 6815 9288 10068 9522 12526 -878 -7094 -7365 -3954
13416c954J6745J0069n802q909L48L229j0155N265O28q278k555p972p340Q929
$$ -3954 12791 22860 17058 8149 8497 11726 1571 6836 7464 -814 -3369 -11341 -18681 -9752
13402i752J4528N400j0178o362j750P379J4440n14q804k499L320j194J137O39
$$ -9752 4776 10176 -2 -6364 -8114 -735 13705 13191 4387 1888 5208 4014 5151 5790
13388E790k916l590J301k176k126K883O242l082m890r64l752m610o200l421N796
$$ 5790 2874 -716 585 -1591 -3717 -834 5408 2326 -2564 -3528 -7280 -11890 -18090 -21511 -15715
13373a5715P69M025O433K200j585n902P716N180o872m959j612J15l335O037M595
$$ -15715 -14946 -10921 -4488 -2288 -3873 -9775 -2059 3121 -3751 -8710 -10322 -10207 -13542 -7505 -2910
13358b910M418k686q710K877J284l703J89J584n503J760l922k51l248m071Q705
$$ -2910 1508 -1178 -9888 -7011 -5727 -9430 -9241 -7657 -13160 -11400 -15322 -15573 -18821 -22892 -14187
13343a4187J104Q4M158J324j979L62q653o392o837K777J4480J4469L502m28k386
$$ -14187 -13083 -12999 -8841 -7517 -9496 -9134 -17787 -24179 -31016 -28239 -13759 710 4212 3784 1398
13328A398j429J16r979o157J555o02N830R721O700J261J993L577n937j0151J080
$$ 1398 -31 85 -9894 -16051 -14496 -15098 -9268 453 7153 8414 10407 13984 8047 -2104 -1024
13313a024O93o946Q62o56L529J834L923K064K923o608o300O040K005m599m417
$$ -1024 -331 -7277 -6415 -7071 -3542 -1708 2215 4279 7202 594 -5706 334 2339 -2260 -6677
13298f677o35L433p458p70N777K082L592K416N37j855L006k687q520Q151J824
$$ -6677 -7312 -3879 -11337 -12107 -6330 -4248 -656 1760 2297 442 3448 761 -7759 392 2216
13283B216L364R26n224n518j356n232L499P203N338m752n642n905M014r77r02
$$ 2216 5580 6506 1282 -4236 -5592 -10824 -7325 -122 5216 464 -5178 -11083 -7069 -8046 -8948
13268h948j875K168P437k54J582O032j664K965n515K409J060m66k548p070n737
$$ -8948 -10823 -8655 -1218 -1472 110 6142 4478 7443 1928 4337 5397 4931 2383 -4687 -10424
13253a0424m317m519M584m844M203M706n049M082J0658Q591r493l238l408o102
$$ -10424 -14741 -19260 -14676 -19520 -15317 -10611 -15660 -11578 -920 7671 -1822 -5060 -8468 -14570
13239a4570n467P845R496K623K6n732J312N073N916j825k027J755Q9J01j2240
$$ -14570 -20037 -12192 -2696 -73 -47 -5779 -4467 606 6522 4697 2670 4425 4514 4615 -7625
13224g625j694R997N712j0891L95J1161K663M011k252r74k939m426n475J667K909
$$ -7625 -9319 678 6390 -4501 -4106 7055 9718 13729 11477 10503 7564 3138 -2337 -670 2239
13209B239m768n35K690L364m148j1641k764P916Q581k76k533J101q480l246P138
$$ 2239 -2529 -3064 -374 2990 -1158 -12799 -15563 -7647 934 658 -1875 -774 -9254 -12500 -5362
13194e362P051q125k872M327J354Q571M647n770n818m676m201L032j839r55K792
$$ -5362 1689 -6436 -9308 -4981 -3627 4944 9591 3821 -1997 -6673 -10874 -7842 -9681 -10636 -7844
13179g844p762l7L471J2020Q442J018K443l661K576r2j324j944q672m261R906
$$ -7844 -15606 -15643 -12172 -152 8290 9308 11751 8090 10666 10574 9250 7306 -1366 -5627 4279
13164D279J914P17l264q139m887M145p17p931p362k470K889J6017K284J485K801
$$ 4279 6193 6910 3646 -4493 -9380 -5235 -5952 -13883 -21245 -23715 -20826 -4809 -2525 -1040 1761
13149A761r90N082J562m957K702m189M02J596o62p499n986p23J445P28R089J045
$$ 1761 771 5853 7415 2458 5160 971 1373 2969 2307 -5192 -11178 -11901 -10456 -9728 -639 406
13133D06K736K200o223R06R462r305L286q74n275q991n269L561P155K404n303
$$ 406 3142 5342 -881 25 9487 182 3468 2594 -2681 -11672 -16941 -13380 -6225 -3821 -9124
13118i124k513M473J2577L936L94l781l169j938n021m268r51k494N422J0286j899
$$ -9124 -11637 -7164 5413 9349 9743 5962 2793 855 -4166 -8434 -9385 -11879 -6457 3829 1930
13103A930m251m43j2378n196M725m396N459L650j236J102J491m641K412P690N286
$$ 1930 -2321 -2764 -15142 -20338 -15613 -20009 -14550 -10900 -12136 -11034 -9543 -14184 -11772 -4082 1204
13088A204n727j0478k656j177l669L380M729K389J2292L430K82k417K508K743
$$ 1204 -4523 -15001 -17657 -18834 -22503 -19123 -14394 -12005 287 3717 3999 1582 4090 6833
13074F833o518m447l830N333J0042l001j2706n223R933O091j576K853l374m787
$$ 6833 315 -4132 -7962 -2629 7413 4412 -8294 -13517 -3584 2507 931 3784 410 -4377
13060d377j6200p758J5178R249K392n699J718P927J557l677P78P72m720J681J0077
$$ -4377 -20577 -28335 -13157 -3908 -1516 -7215 -5497 2430 3987 310 1088 1860 -2860 -1179 8898
13045H898o98l3l111p463K646j616r958K338o33J77j824j611J0625Q674l834O84
$$ 8898 8200 8167 5056 -2407 239 -1377 -11335 -8997 -9630 -9453 -11277 -12888 -2263 6411 2577 3261
13029C261L083r219K276P738K253r773K932o387m299k284q659q3m012l366K811
$$ 3261 6344 -2875 -599 7139 9392 -381 2551 -3836 -8135 -10419 -19078 -19161 -23173 -26539 -23728
13014b3728Q296J2040K083o66O377O145K388k739m364M866n382j5915r021m341
$$ -23728 -15432 -3392 -1309 -1975 4402 10547 12935 10196 5832 10698 5316 -10599 -19620 -23961
13000b3961O660O065M48K944k185L243M688l782p026K979m473o377N593J2568
$$ -23961 -17301 -11236 -10788 -7844 -10029 -6786 -2098 -5880 -12906 -9927 -14400 -20777 -15184 -2616
12986b616m690n287r220m478P399K90k469J1650j317N511N091J853O635k00Q903
$$ -2616 -7306 -12593 -21813 -26291 -18892 -18602 -21071 -9421 -10738 -5227 -136 1717 8352 8152 17055
12971A7055L509q194o862M759l344r867p256L328R267K535p567j952m668M304
$$ 17055 20564 12370 5508 10267 6923 -2944 -10200 -6872 2395 4930 -2637 -4589 -9257 -4953
12957d953J4321N007j7673m664P569J527m064j868r175L254J3983P468p44n869
$$ -4953 9368 14375 -3298 -7962 -393 1134 -2930 -4798 -13973 -10719 3264 10732 9988 4119
12943D119o069rK39k313r17n912J640J2564k081j0019l522r14N692k162N535M156
$$ 4119 -1950 -1959 -1720 -4033 -4950 -10862 -9222 3342 1261 -8758 -12280 -13194 -7502 -9664 -4129 27
12927B7R211P968o997r575l576l931n84N379k100l630N017R22j789L200P870K957
$$ 27 9238 17206 10209 634 -2942 -6873 -7457 -2078 -4178 -7808 -2791 -1869 -3658 -458 7412 10369
12911A0369M559N266r407j4562M100M612n714L422L703m537k330p684j990L990
$$ 10369 14928 20194 10787 -3775 325 4937 -777 2645 6348 1811 -519 -8203 -10193 -6203
12897f203k982K503P09Q657K468n408J672n654O086M553M21J697l087o924l845
$$ -6203 -9185 -6682 -5973 2684 5152 -256 1416 -4238 1848 6401 6822 8519 5432 -1492 -5337
12882e337J554R047k259M773n972q619J1935L458r829r796M693O183J710m931
$$ -5337 -3783 5264 3005 7778 1806 -6813 5122 8580 -1249 -11045 -6352 -169 1541 -3390
12868c390l987O925K974j416l520J857Q369N217L525m853p210p451K176M755P549
$$ -3390 -7377 -452 2522 1106 -2414 -557 7812 13029 16554 11701 4491 -2960 -784 3971 11520
12853A1520m342m46O471k277q171j1072J2767J6837L376O763q220k0327r149Q38
$$ 11520 7178 6732 13203 10926 2755 -8317 4450 21287 24663 31426 23206 2879 -6270 -5432
12839e432J147R287Q045P484q856n415k760r093m486N100J487M241L358O99p84
$$ -5432 -4285 5002 13047 20531 11675 6260 3500 -5593 -10079 -4979 -3492 749 4107 4806 4022
12824D022p621k062P466K2L861K850r047M01j084O352j613m819k417j40k358Q44
$$ 4022 -3599 -5661 1805 1827 5688 8538 -509 -108 -1192 5160 3547 -1272 -3689 -3829 -6187 -5343
12808e343j275j20l306m437J754J640J6240N536o310n624J357J2876l041k229
$$ -5343 -6618 -6738 -10044 -14481 -12727 -11087 5153 10689 4379 -1245 112 12988 9947 7718
12794G718J313M282j159O296j576P79m023K73N167k608m420q810r441q716m28
$$ 7718 9031 13313 12154 18450 16874 17653 13630 13903 19070 16462 12042 3232 -6209 -14925 -15353
12779a5353K869P466J20l167M760N871J577k570j763p22l935M131M14L11O910
$$ -15353 -12484 -5018 -4898 -8065 -3305 2566 4143 1573 -190 -912 -4847 -716 -302 9 6919
12764F919P247m938J525L510p947q524n911n770L831L110J420L724Q663R95K634
$$ 6919 14166 9228 10753 14263 6316 -2208 -8119 -13889 -10058 -6948 -5528 -1804 6859 7854 10488
12749A0488M56l030l072o622k742K99m784L688J1564J2959j2569j4559k440j667
$$ 10488 10944 7914 4842 -1780 -4522 -4223 -9007 -5319 6245 19204 6635 -7924 -10364 -12031
12735a2031O126O295l97K16n908L849k550p609j921Q978K122L678O182K612N11
$$ -12031 -5905 390 -7 209 -5699 -1850 -4400 -12009 -13930 -4952 -2830 848 7030 9642 10153
12720A0153J210l357j290O472l484j0883n529P061L326j974K3n709m80J569O823
$$ 10153 11363 8006 6716 13188 9704 -1179 -6708 353 3679 1705 1728 -3981 -4461 -2892 3931
12705C931j0398p719P751J5441l574r319r50J600K458L809j132o84j522L988j778
$$ 3931 -6467 -14186 -6435 9006 5432 -3887 -4837 -3237 -779 3030 1898 1214 -308 3680 1902
12690A902J84J558r180k326N547M41m461o4J3223j18j0215N731n75J532j397m582
$$ 1902 2086 3644 -5536 -7862 -2315 -1874 -6335 -6399 6824 6706 -3509 2222 1647 3179 1782 -2800
12674b800p53n872L385k037R862O138J127K791J839L134N701k163r812j1538L58
$$ -2800 -3553 -9425 -6040 -8077 1785 7923 9050 11841 13680 16814 22515 20352 10540 -998 -640
12659f40J1664J51m702m945J5110O575m389o372M794j822l287q70N453j1476p292
$$ -640 11024 11175 6473 1528 16638 23213 18824 12452 17246 15424 12137 11267 16720 5244 -2048
12644b048m097N75r3R645M189M663j069k772j426l77l786L032R602M330L282L726
$$ -2048 -6145 -5570 -5663 3982 8171 12834 11765 8993 7567 7190 3404 6436 16038 20368 23650 27376
12628B7376o251j3279l507R33K085o218N977N939l765N95m09p682k760L527J137
$$ 27376 21125 7846 4339 5272 7357 1139 7116 13055 9290 9885 9476 1794 -966 2561 3698
12613C698n310m608N616P840p018k682j734L727n404J3l378L263Q001Q507j988
$$ 3698 -1612 -6220 -604 7236 218 -2464 -4198 -471 -5875 -5862 -9240 -5977 2024 10531 8543
12598H543L808O96l021l848j1454J537K697K126k288M901l318o877L854O593P752
$$ 8543 12351 13047 10026 6178 -5276 -3739 -1042 1084 -1204 3697 379 -6498 -2644 3949 11701
12583A1701n226l012L879k395J792N687N26q049l898o217J155K880J989L392n304
$$ 11701 6475 3463 7342 4947 6739 12426 12952 4903 1005 -5212 -4057 -1177 812 4204 -1100
12568a100J853M76n820J874J4106k556j0785L163P565K686k744Q018L650j46k921
$$ -1100 753 1229 -4591 -2717 11389 8833 -1952 1211 8776 11462 8718 16736 20386 20240 17319
12553A7319j5142q504J1385L82r764j3241J62K166R978J1410K462K31p80o366
$$ 17319 2177 -6327 5058 5440 -4324 -17565 -17403 -15237 -5259 6151 8613 8844 8064 1698
12539A698Q719k825M965n11k596N419M073j187j063K083K386j010q067l638l558
$$ 1698 10417 7592 12557 12046 9450 14869 18942 17755 16692 18775 21161 20151 12084 8446 4888
12524D888Q70r01n620j205N47P712J733L753J799J5293P97j4608q892k233O016
$$ 4888 5758 4857 -763 -1968 -1421 6291 8024 11777 13576 28869 29666 15058 6166 3933 9949
12509I949J2964L996o943j4717k987K269k014j521K049P929j805l740J522K765
$$ 9949 22913 26909 19966 5249 2262 4531 2517 996 3045 10974 9169 5429 6951 9716
12495I716Q117L346l256p440K664k731K110k347k47J3334O229n515r176m90N551
$$ 9716 17833 21179 17923 10483 13147 10416 12526 10179 9932 23266 29495 23980 14804 14314 19865
12480A9865P5j118K959r01K512k870l858l318Q823m205o992J836%N298k62K539
$$ 19865 19940 18822 21781 20880 23392 20522 16664 13346 22169 17964 10972 12808 12808 18106 17844 20383
12464B0383M55k487n62J611l155q175K652N958p535o577J4011M353l29K115L677
$$ 20383 20838 18351 17789 19400 16245 8070 10722 16680 9145 2568 16579 20932 20603 22718 26395
12449B6395p06k534K517M104l288j683l517q627P315M3k217p585o446n041M898
$$ 26395 25689 23155 25672 29776 26488 24805 21288 12661 19976 20019 17802 10217 3771 -1270 3628
12434C628J4554N521l31j071j1050M442J0779J59l081J952n80M520p244o125m811
$$ 3628 18182 23703 23372 22301 11251 15693 26472 26631 23550 25502 24922 29442 22198 16073 11262
12419A1262R095J2099P16J427Q180J984m008J613k231j458L166m086J134O042
$$ 11262 20357 32456 33172 34599 42779 44763 40755 42368 40137 38679 41845 37759 38893 44935
12405D4935Q850P01j0798n194Q309K453K842j3122j1975O340j240j471k878k707
$$ 44935 53785 54486 43688 38494 46803 49256 52098 38976 27001 33341 32101 30630 27752 25045
12391B5045k377m072r86M296K727L092k495L13J245k569r24m89N154Q956J381
$$ 25045 22668 18596 17610 21906 24633 27725 25230 25543 26788 24219 23295 22806 27960 36916 38297
12376C8297O979j766n471J288k844N134K516n646j995K207o687k197O614k85l063
$$ 38297 45276 43510 38039 39327 36483 41617 44133 38487 36492 38699 32012 29815 36429 36144 33081
12361C3081m823m976Q113N054K632J2692N50j3871r75K966l14j0343r398O62J067
$$ 33081 28258 23282 31395 36449 39081 51773 52323 38452 37477 40443 40129 29786 20388 21050 22117
12346B2117J695J3153R817M221L086m853L84M20n794L678L884J474J911l266j1673
$$ 22117 23812 36965 46782 51003 54089 49236 49620 50040 44246 47924 51808 53282 55193 51927 40254
12331D0254p876L193J0669j632o489k879M851p09N120p464o427M997M740M730
$$ 40254 32378 35571 46240 44608 38119 35240 40091 39382 44502 37038 30611 35608 40348 45078
12317D5078O785p824q15O679j873j5817r42R703K91Q205K321K425m24N222K528
$$ 45078 51863 44039 43224 49903 48030 32213 31271 40974 41265 49470 51791 54216 53792 59014 61542
12302F1542r76J496j049O49q688M63P251n505j1225N276K299l910L31N738N501
$$ 61542 60566 62062 61013 61662 52974 53437 60688 55183 43958 49234 51533 47623 47954 53692 59193
12287E9193K699L479l44j995j0636p159j946J2279O822o287p086Q811Q385r25
$$ 59193 61892 65371 65027 63032 52396 45237 43291 55570 62392 56105 49019 57830 66215 65290
12273F5290m529n791Q437Q900j757m17O049r332l902N432J576r873K070Q221J249
$$ 65290 60761 54970 63407 72307 70550 70133 76182 66850 62948 68380 69956 60083 62153 70374 71623
12258G1623k15m940n555K153j513m249O077J2346j0480J055Q544R773J0160n950
$$ 71623 71408 66468 60913 63066 61553 57304 63381 75727 65247 66302 74846 84619 94779 88829
12244H8829p973k611K81J303J182J0646k009p086J534j995m543k844J2669M223
$$ 88829 80856 78245 78526 79829 81011 91657 89648 82562 84096 82101 77558 74714 87383 91606
12230I1606l157m172j065J1017P029r74K656J0903m943r277m100N640K496r70
$$ 91606 88449 84277 83212 94229 101258 100284 102940 113843 108900 99623 95523 101163 103659 102689
12216A02689j570L877N394O241J564p102j0508l744l005Q719N279o913N719N788
$$ 102689 101119 104996 110390 116631 118195 111093 100585 96841 93836 102555 107834 100921 106640 112428
12202A12428K067J30k134R57R237l752L928R28r71R2l257j1454K554K738Q429
$$ 112428 114495 114625 112491 113448 122685 118933 122861 123789 122818 122910 119653 108199 110753 113491 121920
12187A21920O975L108J136k369q40M163N413k146p114K658O713L241M849m219
$$ 121920 128895 132003 133139 130770 129930 134093 139506 137360 130246 132904 139617 142858 147707 143488
12173A43488j374Q88m28L697J824P386L602L190P207J632m598j702k91j233K508
$$ 143488 142114 143002 142574 146271 148095 155481 159083 162273 169480 171112 166514 164812 164521 163288 165796
12158A65796N382P265M252o23k569k360o616M030J4020J0575j049M90M09j626
$$ 165796 171178 178443 182695 182072 179503 177143 170527 174557 188577 199152 198103 198593 199002 197376
12144A97376J171K602N588J3311r26l127l309j86n085R922L943k357O283Q773
$$ 197376 198547 201149 206737 220048 219122 215995 212686 212500 207415 217337 221280 218923 225206 233979
12130B33979N072O150o900j164J94k201J0790J1889M909n497Q48J0186j557m574
$$ 233979 239051 245201 238301 237137 237331 235130 245920 257809 262718 257221 258069 268255 266698 262124
12116B62124O564J4947l705l218o58J1514Q914J747J611m893k114P791K594M167
$$ 262124 268688 283635 279930 276712 276054 287568 296482 298229 299840 294947 292833 300624 303218 307385
12102C07385L370O470J4585P072L185M410p762j897K510J448J517J525J1931J7855
$$ 307385 310755 317225 331810 338882 342067 346477 338715 336818 339328 340776 342293 343818 355749 373604
12088C73604J5300M53m11J0480K710j466M136N993K127K631O013O85O899J036
$$ 373604 388904 389357 388946 399426 402136 400670 404806 410799 412926 415557 421570 422255 429154 430190
12074D30190M694P041J7700R259l302N057R085P874m53P966J7969O746P830M669
$$ 430190 434884 441925 459625 468884 465582 470639 479724 487598 487145 495111 513080 519826 527656 532325
12060E32325j91J2683M331M364N170O733J8320J7681J2167o77M968N080k82k78
$$ 532325 532134 544817 549148 553512 558682 565415 583735 601416 613583 612906 617874 622954 622672 622394
12046F22394J2283M962J2875J4942N839J0715L649O918K0804J6092L793n772J286
$$ 622394 634677 639639 652514 667456 673295 684010 687659 694577 715381 731473 735266 729494 730780
12033G30780J4876J6675J2920J1197J3747R544J1405R349J811J3344J4173Q148
$$ 730780 745656 762331 775251 786448 800195 809739 821144 830493 832304 845648 859821 867969
12021H67969Q550J0815Q735P52L753J0977K1755M705k92Q154J0285J7483P108
$$ 867969 876519 887334 896069 896821 900574 911551 933306 938011 937719 945873 956158 973641 980749
12008I80749L047l03J893R992K0653J9491J0450l270P154J0740P039k527M928
$$ 980749 983796 983493 985386 995378 1016031 1035522 1045972 1042702 1049856 1060596 1067635 1065108 1070036
11995A070036M436j813L355L222O025R506O500Q024M950o203j0967J904K529N494
$$ 1070036 1074472 1072659 1076014 1079236 1085261 1094767 1101267 1109291 1114241 1108038 1097071 1098975 1101504 1106998
11981A106998J1765n443k769o77j2060n938M366j861m738k626R84K57j191q121
$$ 1106998 1118763 1113320 1110551 1109874 1097814 1091876 1096242 1094381 1089643 1087017 1088001 1088258 1087067 1078946
11967A078946q979o764m601p03m102o794r297J510j303r354j0532r194j6390r995
$$ 1078946 1069967 1063203 1058602 1057899 1053797 1047003 1037706 1039216 1037913 1028559 1018027 1008833 992443 982448
11953I82448j1420l879q847j6304r888m177j1598J871k965j1553j7569j868j1351
$$ 982448 971028 967149 958302 941998 932110 927933 916335 918206 915241 903688 886119 884251 872900
11940H72900j4077j0393n314j267j4414j6162r495K945l229l355j7732k6891o970
$$ 872900 858823 848430 843116 841849 827435 811273 801778 804723 801494 798139 780407 753516 746546
11927G46546m332p611n516m07j3384j1891j1265q558j811q191j0149o334j4439
$$ 746546 742214 734603 729087 728680 715296 703405 692140 683582 681771 673580 663431 657097 642658
11914F42658j4952r647M331K114j3564j6615j4406j1480j1354j0261M308j59j3625
$$ 642658 627706 618059 622390 624504 610940 594325 579919 568439 557085 546824 551132 550973 537348
11901E37348q415P83k700m477n810j0792j4441n111M283j1137j3800j152p03j5545
$$ 537348 528933 529716 527016 522539 516729 505937 491496 486385 490668 479531 465731 464579 463876 448331
11887D48331p794p75N343o525n416k531j7601j1172n029l980J461j1317o193n520
$$ 448331 440537 439762 445105 438580 433164 430633 413032 401860 396831 392851 394312 382995 376802 371282
11873C71282q448j101k45q709n733k681o866k403Q290j838p027j4019m154Q517
$$ 371282 362834 361733 361488 352779 347046 344365 337499 335096 343386 341548 334521 320502 316348 324865
11859C24865l70o507m666j4126p696M090k099p692J373j555n625r886j4297j965
$$ 324865 324495 317988 313322 299196 291500 295590 293491 285799 287172 285617 279992 270106 255809 253844
11845B53844P585j937j8780j1566m083J064L083M290m202M166r109l87n585L918
$$ 253844 261429 259492 240712 229146 225063 226127 229210 233500 229298 233464 224355 223968 218383 222301
11831B22301O75o127P375N553m417o976n876M883m532r413k986j0244l337M764
$$ 222301 222976 216849 224224 229777 225360 218384 212508 217391 212859 203446 200460 190216 186879 191643
11817A91643o127R85n620l362J2480K609j550n587M617k21p912n337l662r75L175
$$ 191643 185516 186501 180881 177519 189999 192608 191058 185471 190088 189867 181955 176618 172956 171981 175156
11802A75156n787j102k130n221K926O6m25q557n154n383p044M38O75M034K018
$$ 175156 169369 168267 166137 160916 163842 163908 163483 154926 149772 144389 137345 137783 138458 142492 144510
11787A44510j18K999n114q584k297K276J2883R235Q02q882j4269R26L977o473
$$ 144510 144392 147391 142277 133693 131396 133672 146555 155790 156592 147710 133441 134367 138344 131871
11773A31871j909M996N581q406l836R77j2692l016L603l956Q894J906p464j1209
$$ 131871 129962 134958 140539 132133 128297 129274 116582 113566 117169 113213 122107 124013 116549 105340
11759A05340p249j98J9L924k95N333M233j126m260p974m651l146oN153l111M041
$$ 105340 98091 97893 97912 101836 101541 106874 111107 109981 105721 97747 93096 89950 89944 95097 91986 96027
11743I6027o966l312J308N783L945j058K589n971K035o026K358J030j3531n040
$$ 96027 89061 85749 87057 92840 96785 95727 98316 92345 94380 88354 90712 91742 78211 73171
11729G3171J990l969j180m469j663J0897J1176K749l906q397n293p91J460N650
$$ 73171 75161 71192 70012 65543 63880 74777 85953 88702 84796 76399 71106 70315 71775 77425
11715G7425N384p53k834k495J215M98O25r003r950L632N625K10j800p72M97r771
$$ 77425 82809 82056 79222 76727 77942 78440 79065 70062 60112 63744 69369 69579 67779 67007 67504 57733
11699E7733j2391J1210J2659J772R56k077P038J0423n026q43r527j2211L37p95
$$ 57733 45342 56552 69211 70983 71939 69862 76900 87323 82297 81454 71927 59716 60053 59258
11685E9258m675n475l4p090p304M028q58o74L759Q48j641L828M200R011R254j3863
$$ 59258 54583 49108 49074 41984 34680 38708 37850 37176 40935 41783 40142 43970 48170 57181 66435 52572
11669E2572j0570N835K700N046J707j689j187l687l279L947l455J733M35j959
$$ 52572 42002 47837 50537 55583 57290 55601 54414 50727 47448 51395 47940 49673 50108 48149
11655D8149j917j872K982k972j299j347l834k675N299n01j845N506k348p497P373
$$ 48149 46232 44360 47342 44370 43071 41724 37890 35215 40514 40013 38168 43674 41326 33829 41202
11640D1202J2072M600j1137m444q84j080K298J3624O947r998o568o55j1328j499
$$ 41202 53274 57874 46737 42293 41409 40329 42627 56251 63198 53200 46632 45977 34649 33150
11626C3150j569J272l297R603K3888J3479j3143j93j0587q165K296k510N185O103
$$ 33150 31581 32853 29556 39159 63047 76526 63383 63190 52603 44438 46734 44224 49409 55512
11612E5512j221n626K786K736j740m29n146m81J01M904o15J38j0323R401O060
$$ 55512 54291 48665 51451 54187 52447 52018 46872 46391 46492 51396 50781 50919 40596 49997 56057
11597E6057j4998N048L556m035j7017p858j196R573O85j3738O93M907Q639J39
$$ 56057 41059 46107 49663 45628 28611 20753 19557 29130 29815 16077 16770 21677 30316 30455
11583C0455n258M672J032j740P103R861m536l731L313j3943K2L540O871O447k30
$$ 30455 25197 29869 30901 29161 36264 46125 41589 37858 41171 27228 27250 30790 37661 44108 43878
11568D3878o264j2188p287L517N760j710Q697L538p188j0301m032M538n186n326
$$ 43878 37614 25426 18139 21656 27416 25706 34403 37941 30753 20452 16420 20958 15772 10446
11554A0446M063k762Q934K915o527M632j435K794O611o307n082n605n332n958
$$ 10446 14509 11747 20681 23596 17069 21701 20266 23060 29671 23364 18282 12677 7345 1387
11540A387J6214J2713j918m91Q624l394j5011L083O458k987P34o632R05m869k300
$$ 1387 17601 30314 28396 27905 36529 33135 18124 21207 27665 24678 25412 18780 19685 14816 12516
11525A2516Q46J177K347K357L960O842K826n141J197M824j437o947n358r322M311
$$ 12516 13362 14539 16886 19243 23203 30045 32871 27730 28927 33751 32314 25367 20009 10687 14998
11510A4998O426M668p316j6933M798J1360l0j000l469k342o971N022O583K305
$$ 14998 21424 26092 18776 1843 6641 18001 17971 16971 13502 11160 4189 9211 15794 18099
11496A8099p622o724J015j493o62L177L413Q706o03m734M27j2778M002R512J704
$$ 18099 10477 3753 4768 3275 2613 5790 9203 17909 17306 12572 12999 221 4223 13735 15439
11481A5439K299l780N294j301l341J23K145L689N261j557j3742m470N97K872R320
$$ 15439 17738 13958 19252 17951 14610 14733 16878 20567 25828 24271 10529 6059 6656 9528 18848
11466A8848L172l239L08J21n895l694k778m558O847O224R21j797m083l587J947
$$ 18848 22020 18781 19089 19210 13315 9621 6843 2285 9132 15356 16277 14480 10397 6810 8757
11451H757j478K30Q989m52k288M671l079p068m059J759j183J597P095l524K772
$$ 8757 7279 7509 16498 16046 13758 18429 15350 8282 4223 5982 4799 6396 13491 9967 12739
11436A2739J2270l342j930J652k350n579j0951l453J68N788L99p908J543J0781
$$ 12739 25009 21667 19737 21389 19039 13460 2509 -944 -776 5012 5411 -2497 -954 9827
11422I827P332j729L87k881m186M147R88j0978m040l004j767l470K478N596P13
$$ 9827 17159 15430 15817 12936 8750 12897 13885 2907 -1133 -4137 -5904 -9374 -6896 -1300 -587
11407e87K281o756K610J2424L199k469o278m92n570m68N594J687k13n542l312
$$ -587 1694 -5062 -2452 9972 13171 10702 4424 3932 -1638 -2106 3488 5175 4962 -580 -3892
11392c892L422M569J076L016R298p937q209j764Q85m354R88K479O574M105n42
$$ -3892 -470 4099 5175 8191 17489 9552 1343 -421 464 -3890 -2902 -423 6151 10256 9714
11377I714o32J845L330j430M4K720L962L497J877j9692j2371M162Q322N185o602
$$ 9714 9082 10927 14257 12827 12871 15591 19553 23050 24927 5235 -7136 -2974 5348 10533 3931
11362C931L943N473j765K777k843p379N390O485L029J2656k998J974O833j5007
$$ 3931 7874 13347 11582 14359 11516 4137 9527 16012 19041 31697 28699 30673 37506 22499
11348B2499k3820r645R33J0679R113J1893N843k1409p962j102M037P531p89k817
$$ 22499 -1321 -10966 -10033 646 9759 21652 27495 6086 -1876 -2978 1059 8590 7801 4984
11334D984n8m558l177L480l440k390R95n04M996J758q147O11N550k31Q947M120
$$ 4984 4926 368 -2809 671 -2769 -5159 -4164 -4668 328 2086 -6061 -5450 100 -131 8816 12936
11318A2936l89n268m516K821J2949N146L794K667j2306j7264k141r65k682k806
$$ 12936 12547 7279 2763 5584 18533 23679 27473 30140 17834 570 -1571 -2536 -5218 -8024
11304h024K595O734Q808L477j222p389o732M100O478n158l375n883M145M66r485
$$ -8024 -5429 1305 10113 13590 12368 4979 -1753 2347 8825 3667 292 -5591 -1446 -980 -10465
11289a0465J259O787m486M346j13P153J453l839J494J3358M536j0674j8740p792
$$ -10465 -9206 -2419 -6905 -2559 -2672 4481 5934 2095 3589 16947 21483 10809 -7931 -15723
11275a5723JK493R858K708J037L130K675P43J634L844k801r693R52j132J0687
$$ -15723 -15722 -13229 -3371 -663 374 3504 6179 6922 8556 12400 9599 -94 858 -274 10413
11260A0413J163m360l831p488J095L327k62P990J174p88p341o816K073l459j156
$$ 10413 11576 7216 3385 -4103 -3008 319 57 8047 9221 8433 1092 -5724 -3651 -7110 -8266
11245h266M525O863m062o101m051P540j66r104Q186J657k356k963L810M135l532
$$ -8266 -3741 3122 -940 -7041 -11092 -3552 -3718 -12822 -4636 -2979 -5335 -8298 -4488 -353 -3885
11230c885j622Q399J391j746O270m190P558n117j5111n0l718K595L446N352J792
$$ -3885 -5507 2892 4283 2537 8807 4617 12175 7058 -8053 -8103 -11821 -9226 -5780 -428 1364
11215A364K163n478L378l191Q335l995k138K745J015J825q363R10j918l929M839
$$ 1364 3527 -1951 1427 -1764 6571 2576 438 3183 4198 6023 -2340 -1430 -3348 -7277 -2438
11200b438n218N09J707K956M167Q87P077l990L854m817m640K327k894j2610j204
$$ -2438 -7656 -7147 -5440 -2484 1683 2570 9647 5657 9511 4694 54 2381 -513 -13123 -14327
11185a4327N107N379J2713L142k231p811P31p139J484J468k183M36L816p31J314
$$ -14327 -9220 -3841 8872 12014 9783 1972 2703 -4436 -2952 -1484 -3667 -3231 585 -146 1168
11170A168L88L811J3587l503k837Q187L030m462q573p625q043j9827J390K83J0910
$$ 1168 1556 5367 18954 15451 12614 20801 23831 19369 10796 3171 -4872 -24699 -23309 -23026 -12116
11155a2116P835L422j771q063q576N880N613L659j179k92m923p539m376J5622
$$ -12116 -4281 -859 -2630 -10693 -19269 -13389 -7776 -4117 -5296 -5588 -10511 -18050 -22426 -6804
11141f804l70J60j333j396M371k403K390j438L087M251O14K930j781m650l450
$$ -6804 -7174 -7014 -8347 -9743 -5372 -7775 -5385 -6823 -3736 515 1129 4059 2278 -2372 -5822
11126e822N053k77p008n046j507j69O308P91k593o37K61L837p163n626K325J2354
$$ -5822 -769 -1046 -8054 -13100 -14607 -14776 -8468 -7677 -10270 -10907 -10646 -6809 -13972 -19598 -17273 -4919
11110d919N197m482M74j452j708J196k15L349M821J0904k368o000J174J040j066
$$ -4919 278 -4204 -3730 -5182 -6890 -5694 -5909 -2560 2261 13165 10797 4797 5971 7011 5945
11095E945o771q204L403R264M834p77k413o264k887j297j346K082p30K078M076
$$ 5945 -826 -9030 -5627 3637 8471 7694 5281 -983 -3870 -5167 -6513 -4431 -5161 -3083 993
11080I93n6m994J618J2379N732j05j1529k99L95N70J1607K061m999m507j451P146
$$ 993 937 -4057 -2439 9940 15672 15567 4038 3739 4134 4704 16311 18372 13373 8866 7415 14561
11064A4561o880j1530l436J739k94J0598O846k773J311N11m004l81N229K118K128
$$ 14561 7681 -3849 -7285 -5546 -5840 4758 11604 8831 10142 10653 6649 6268 11497 13615 15743
11049A5743L413j915o098K490Q361N793p176J45K832N981M847J52Q000R513Q476
$$ 15743 19156 17241 11143 13633 21994 27787 20611 20756 23588 29569 34416 34568 42568 52081 60557
11034F0557J639R632k11p993j3887o232r068M47J3153J5858J902N340J0835m332
$$ 60557 62196 71828 71617 63624 49737 43505 34437 34884 48037 63895 65797 71137 81972 77640
11020G7640k058M734l019j2927p063Q214j380J244R856P259m113j2261o581j88
$$ 77640 75582 80316 77297 64370 57307 65521 64141 65385 75241 82500 78387 66126 59545 59357
11006E9357k763l411p230j0487O036P95L528O166o386j2225j2830l463j067k501
$$ 59357 56594 53183 45953 35466 41502 42297 45825 51991 45605 33380 20550 17087 16020 13519
10992A3519Q369J5694n811o584r911K603m32J528l955L930o729n820R13M803J517
$$ 13519 21888 37582 31771 25187 15276 17879 17447 18975 15020 18950 12221 6401 7314 12117 13634
10977A3634Q364J2698o522r025o571M79P030P820M242J535N40J1364J545K299
$$ 13634 21998 34696 28174 19149 12578 13057 20087 27907 32149 33684 34224 45588 47133 49432
10963D9432Q851q40o424P811R478n608N733n355j952n069J041O985K428K378J270
$$ 49432 58283 57443 51019 58830 68308 62700 68433 63078 61126 56057 57098 64083 66511 68889 70159
10948G0159J2558J9039J5902R969J545J1495J5857K7312K3484L5543N7468O3349
$$ 70159 82717 101756 117658 127627 129172 140667 156524 183836 207320 242863 300331 363680
10936C63680Q1490J21970J92489K75499L08578K63670K69586J19264j11272j62952
$$ 363680 445170 567140 759629 1035128 1343706 1607376 1876962 1996226 1884954 1722002
10926A722002k48186k80621k47771k01401j49154j17449r3112p0451n7081m0125
$$ 1722002 1473816 1193195 945424 744023 594869 477420 384308 313857 256776 216651
10916B16651j9172j4061k3490r971m938k2466k0984K837q591p041p799q707r126
$$ 216651 197479 183418 159928 149957 145019 122553 101569 104406 95815 88774 80975 72268 63142
10903F3142j2399p806J290N961n49Q197N456r324j1033K690J3124l932p454j588
$$ 63142 50743 42937 44227 50188 49639 57836 63292 53968 42935 45625 58749 54817 47363 45775
10889D5775l569j317q15p912l045J310P0N913l716L614j036M799N144l957M775
$$ 45775 42206 40889 40074 32162 29117 30427 30497 36410 32694 36308 35272 40071 45215 41258 46033
10874D6033N301K020l498m250O644L186Q622N099k355M060K413o484n497M338
$$ 46033 51334 53354 49856 45606 52250 55436 64058 69157 66802 70862 73275 66791 61294 65632
10860F5632N616J519p154L03L350j872l00j0393R25L905L555L882Q84m258P730
$$ 65632 71248 72767 65613 65916 69266 67394 67094 56701 57626 61531 65086 68968 69852 65594 73324
10845G3324J4529k682p019K705p127j9964k2608n593j5308k2552j4522j4229q214
$$ 73324 87853 85171 78152 80857 73730 53766 31158 25565 10257 -12295 -26817 -41046 -49260
10832d9260l732Q42R775Q367O866K7218R137R533M124J9J0523J955K576q175k040
$$ -49260 -52992 -52150 -42375 -34008 -27142 76 9213 18746 22870 22889 33412 35367 37943 29768 27728
10817B7728l304p365m527J1507n802m873M454m033K662P261K06l99N20N8j353
$$ 27728 24424 17059 12532 24039 18237 13364 17818 13785 16447 23708 23914 23515 24035 24093 22740
10802B2740J1932M386j0158j4082O856K0217N816J2478J4531P237O123J4370K358
$$ 22740 34672 39058 28900 14818 21674 41891 47707 60185 74716 81953 88076 102446 104804
10789A04804J3173K1176J5671J5712N278Q72o597j2297j630j273o367j0527m708
$$ 104804 117977 139153 154824 170536 175814 176686 170089 157792 156162 154889 148522 137995 133287
10776A33287m648r706j85J438j6241m623n395j2551j0254n258k788n612n78M132
$$ 133287 128639 118933 118748 120186 103945 99322 93927 81376 71122 65864 63076 57464 56886 61018
10762F1018L204O486o302j9411P248J4449L465J6181R938O349K459Q263k336o671
$$ 61018 64222 70708 64406 44995 52243 66692 70157 86338 96276 102625 105084 113347 111011 104340
10748A04340j23J017n780o736R491O083L80P031J2180J5158K625n896M486O470
$$ 104340 104217 105234 99454 92718 102209 108292 108672 115703 127883 143041 145666 139770 144256 150726
10734A50726J611k661m595p47P75j6454j1773q471K628N536n983j5170j0085n269
$$ 150726 152337 149676 145081 144334 145109 128655 116882 108411 111039 116575 110592 95422 85337 80068
10720H0068j1929Q9R614K4392K4930J33K058l694j1893r149q790P925J4636P763
$$ 80068 68139 68228 77842 102234 127164 127297 129355 125661 113768 104619 95829 103754 118390 126153
10706A26153Q073J2779O465Q197M171n338n094j0798q843m439M263k338q971r345
$$ 126153 134226 147005 153470 161667 165838 160500 155406 144608 135765 131326 135589 133251 124280 114935
10692A14935L760J3111J3429L441M709N746J02j9153m7827m9051m9977m6935j4515
$$ 114935 118695 131806 145235 148676 153385 159131 159233 140080 92253 43202 -6775 -53710 -68225
10679f8225K0781K2918M4650N3468M8327M4601M2391K9645L2371L7696L3878L4723
$$ -68225 -47444 -24526 20124 73592 121919 166520 208911 238556 270927 308623 342501 377224
10667C77224L7925M3206M0295N3066O0074L8135J2716J2557k6727n0671n6435
$$ 377224 415149 458355 498650 551716 611790 649925 662641 675198 648471 597800 541365
10656E41365m6372k8428k2104M364K3665j1639k2356n3239q1255j17256j26526
$$ 541365 494993 466565 444461 448825 472490 460851 438495 385256 304001 186745 60219
10645F0219j01946j22695p9479k2165N124M0941O6826Q9342J05101R4864R3747
$$ 60219 -41727 -164422 -243901 -266066 -260942 -220001 -153175 -63833 41268 136132 229879
10634B29879J02041R5615Q1292P2647O8812O0936O8741R5535J04153J31323J77473
$$ 229879 331920 427535 508827 581474 650286 711222 779963 875498 979651 1110974 1288447
10623A288447K11217K69294L49135M46159N71389P17562P86725O83769M00078
$$ 1288447 1499664 1768958 2118093 2564252 3135641 3853203 4639928 5323697 5723775
10614E723775J21356k2325k5723N8979J91591L84846O41553R96516J374941J535870
$$ 5723775 5845131 5822806 5797083 5856062 6047653 6432499 7074052 8070568 9445509 10981379
10604A0981379J192790L88346l30070n89215n54537l56536r8649K35595O72990
$$ 10981379 12174169 12562515 12232445 11643230 11088693 10732157 10633508 10869103 11542093
10595A1542093J192388J682220J795130J137227j22081j123922j428422j296880
$$ 11542093 12734481 14416701 16211831 17349058 17226977 16103055 14674633 13377753
10587A3377753j048651p64829m14388m087M18757P62250P87955K93673n37524
$$ 13377753 12329102 11564273 11149885 11145798 11564555 12326805 13114760 13408433 12870909
10578A2870909j129146j226123j087313q87253o62098m38910j95202J8935J65670
$$ 12870909 11741763 10515640 9428327 8541074 7878976 7440066 7244864 7263799 7429469
10569G429469J44194n8957l54885n58998n93157n22926m27551l31513k25870j19886
$$ 7429469 7573663 7514706 7159821 6600823 6007666 5484740 5057189 4725676 4499806 4379920
10559D379920m4108L8017J07413J64598K32490K81644L35213L94139M86752O07301
$$ 4379920 4335812 4373829 4481242 4645840 4878330 5159974 5495187 5889326 6376078 6983379
10549F983379P72729R19388J005690J163166J218770J261217J580364J819810
$$ 6983379 7756108 8675496 9681186 10844352 12063122 13324339 14904703 16724513
10541A6724513K008694K386463K776429L045352L724802M725211O062872Q089261
$$ 16724513 18733207 21119670 23896099 26941451 30666253 35391464 41454336 49543597
10533D9543597J0979444J5557028K3248134L6021227N3656267O0170833M7494881
$$ 49543597 60523041 76080069 99328203 135349430 189005697 249176530 296671411
10526B96671411M8268603K2407332k1241766k7334239m2346800n4164681m6044974
$$ 296671411 344940014 367347346 346105580 318771341 276424541 222259860 176214886
10519A76214886l6249645k8737819k2884291j7982694j3479476r782172p185405
$$ 176214886 139965241 111227422 88343131 70360437 56880961 47098789 39913384
10512C9913384n279068m104996l490779k891193k432102k100950j805340j500890
$$ 39913384 34634316 30529320 27038541 24147348 21715246 19614296 17808956 16308066
10504A6308066j282817j354974j295817j198991j155681j014742q43969p19030
$$ 16308066 15025249 13670275 12374458 11175467 10019786 9005044 8161075 7442045
10496G442045o16515n10596m10807l65378l27421k86650k64478k51749k32053
$$ 7442045 6825530 6314934 5904127 5538749 5211328 4924678 4660200 4408451 4176398
10487D176398k18393k16279j89953j78323j58260j40729j19933j09907r2758q9613
$$ 4176398 3958005 3741726 3551773 3373450 3215190 3074461 2954528 2844621 2751863 2662250
10477B662250o8932p8637r1864q0672q1382p7148p0789q0740p9717q6221q8505
$$ 2662250 2593318 2514681 2422817 2342145 2260763 2183615 2112826 2032086 1952369 1866148 1777643
10466A777643o5413n8298o0748o4287m9862n0541n7869n6162m0358l6755m0476
$$ 1777643 1712230 1653932 1593184 1528897 1479035 1428494 1370625 1314463 1274105 1237350 1196874
10455A196874k8231k9943l1803k1705l2252l6485k4420k091j1012k2115j8694
$$ 1196874 1168643 1138700 1106897 1085192 1052940 1016455 992035 989944 978932 956817 938123
10444I38123j5101k0188k0079k1111n586l043m737j6087q545r986q754j3305k7820
$$ 938123 923022 902834 882755 861644 856058 853015 848278 832191 823646 813660 804906 791601 763781
10431G63781j9497k4070k1283j5045m302k84n601j2466p653n735K085l344J038
$$ 763781 744284 720214 698931 683886 679584 679300 673699 661233 653580 647845 649930 646586 647624
10418F47624r99K502K902P904P207M4231N4500O2911P2699N7009M4538M4632K3174
$$ 647624 646625 649127 652029 659933 667140 711371 765871 828782 901481 958490 1003028 1047660 1070834
10405A070834j1730m2054o1050p1085r8190q6322p9072o8950l3781j9873k1701
$$ 1070834 1059104 1017050 956000 884915 786725 700403 621331 552381 518600 498727 477026
10394D77026m1411m4399n4506p7842n9130l7357m9633k7195Q263P105l895R168
$$ 477026 435615 391216 336710 258868 199738 162381 112748 85553 93816 100921 97026 106194
10382A06194J0266J9851K4974K1854J7474J7696L0284M6104N9611N2407L0162
$$ 106194 116460 136311 161285 183139 200613 218309 248593 294697 354308 406715 436877
10371D36877J6250o791k9876k9685l2847l6701j8221j7715k3759j9185j4481j1106
$$ 436877 453127 446336 416460 386775 353928 317227 299006 281291 257532 238347 223866 212760
10359B12760k408L15m264m884j0456o047j2087j2421q468j930m807L976j738k35
$$ 212760 210352 210667 206403 201519 191063 185016 172929 160508 152040 150110 145303 149279 147541 147306
10345A47306N337O955J494P397J1813n764j778k571o010j0276n454o266j898J3157
$$ 147306 152643 159598 161092 168489 180302 174538 172760 170189 164179 153903 148449 142183 140285 153442
10331A53442J3270R333J1774M650p130j0278n975R50l795j1882j2577k4926k2418
$$ 153442 166712 176045 187819 192469 185339 175061 169086 170036 166241 154359 141782 116856 94438
10318I4438j233r93j522R86L534J1470l724L14J8017J0043O316l196n241K910
$$ 94438 93205 92212 90690 91676 95210 106680 102956 103270 121287 131330 137646 134450 129209 132119
10304A32119M160M989j3798r944n180O883P344P186k156K807J758l533O01J1372
$$ 132119 136279 141268 127470 117526 112346 119229 126573 133759 131603 134410 136168 132635 133236 144608
10290A44608J1069N72N257l199j755k866k968m81m357o737k091l057l005j0379
$$ 144608 155677 156249 161506 158307 156552 153686 150718 150237 145880 139143 137052 133995 130990 120611
10276A20611K739l15r334j41K969N349L015N653M487k145J653o384o254q67l556
$$ 120611 123350 123035 113701 113560 116529 121878 124893 130546 135033 132888 134541 128157 121903 121036 117480
10261A17480K485n710n927M308n947j1222m620O989O490K743N561J1885Q644k844
$$ 117480 119965 114255 108328 112636 106689 95467 90847 97836 104326 107069 112630 124515 133159 130315
10247A30315o672l301o236O784j626K996K029J567N876j821j0066m916J4232M036
$$ 130315 123643 120342 114106 120890 119264 122260 124289 125856 131732 129911 119845 114929 129161 133197
10233A33197r76n519k910k492o031j3767p683Q901J7283J9152J2876K2295J6833
$$ 133197 132221 126702 123792 121300 115269 101502 93819 102720 120003 139155 152031 174326 191159
10220A91159J1472N852m572o766m816o17j1642j9934k0212k6447k2063k2848j9318
$$ 191159 202631 208483 203911 197145 192329 191712 180070 160136 139924 113477 91414 68566 49248
10207D9248l562L673m290M069J715r095M141Q957N887K68J382L029r484n577k285
$$ 49248 45686 49359 45069 49138 50853 41758 45899 54856 60743 61011 62393 65422 55938 50361 48076
10192D8076j915M107L570p732M474M639O231l518j245J466k500J1283J6538o99
$$ 48076 46161 50268 53838 46106 50580 55219 61450 57932 56687 58153 55653 66936 83474 82775
10178H2775L872n314o407K166K083K174J5945J0307K0702J0089J541J65k605m154
$$ 82775 86647 81333 74926 77092 79175 81349 97294 107601 128303 138392 139933 140098 137493 133339
10164A33339l712J264M947K166P113J2187K0907K1030K2937K7740K6496L7373
$$ 133339 129627 130891 135838 138004 145117 157304 178211 199241 222178 249918 276414 313787
10152C13787M2044L6457J7980K5124Q255m852N16K6765J5829q632k0056n2369
$$ 313787 355831 392288 410268 435392 443647 438795 439311 466076 481905 473273 453217 400848
10140D00848o1258m0863l4519k7678n658R02j0010n864m359N459J1358J5820J3740
$$ 400848 339590 298727 264208 236530 230872 231774 221764 215900 211541 217000 228358 244178 257918
10127B57918K0768L0066K5522M0303O6084R9325J43312K07860K91555L06991K54467
$$ 257918 278686 308752 334274 374577 440661 539986 683298 891158 1182713 1489704 1744171
10116A744171K36852M5885j35255j72147k64089k95501k22026j82924j57379j28084
$$ 1744171 1981023 2026908 1891653 1719506 1455417 1159916 937890 754966 597587 469503
10106D69503r5119o2405m0749k9487k8177k5044j6712j3154j3851j1515j8484
$$ 469503 374384 311979 271230 241743 213566 188522 171810 158656 144805 133290 114806
10095A14806j1786l713k511K558o867j0668j1337p94o589k561j491j033J1776
$$ 114806 103020 99307 96796 99354 92487 81819 70482 69688 63099 60538 59047 58014 69790
10082F9790J646o273K232q700l236l675K968P170Q046k498j164J3323K0635J5917
$$ 69790 71436 65163 67395 58695 55459 51784 54752 61922 69968 67470 66306 79629 100264 116181
10068A16181O354n238m956m961M329K365Q239j128j0060j404o895j5848n549k791
$$ 116181 122535 117297 112341 107380 111709 114074 122313 121185 111125 109721 102826 86978 81429 78638
10054G8638j5897m991o617k466O835l571o953L297o19K665J1047p179l204k359
$$ 78638 62741 57750 51133 48667 55502 51931 44978 48275 47656 50321 61368 54189 50985 48626
10040D8626o121L513N851L407p010j632l573O12K430m207l311N371J995M129R172
$$ 48626 42505 46018 51869 55276 48266 46634 43061 43673 46103 41896 38585 43956 45951 50080 59252
10025E9252K332m353j470k527j686k97j849o053o546J018J090o88P404J019l200
$$ 59252 61584 57231 55761 53234 51548 51251 49402 43349 36803 37821 38911 38223 45627 46646 43446
10010D3446O554n52o645J227M715r911k335j777q235m007P164O195J949L277J324
$$ 43446 50000 49448 42803 44030 48745 38834 36499 34722 26487 22480 29644 35839 37788 41065 42389
9995D2389J651L127Q05O906k357m039P604L279m814j0120j2113m00l16r839M07
$$ 42389 44040 47167 47972 54878 52521 48482 56086 59365 54551 44431 32318 31918 31602 21763 22170
9980B2170k508L169J4470J4720n844j3849K35J660L173q92M562P344K977o889
$$ 22170 19662 22831 37301 52021 46177 32328 32563 34223 37396 36504 41066 48410 51387 44498
9966D4498o83k058n435J168J146k38K186m852k755k812l239K193O117J037K037
$$ 44498 43815 41757 36322 37490 38636 38398 40584 35732 32977 30165 26926 29119 35236 36273 38310
9951C8310K824r174J943o37q265k531m472N694J3582k226l562r658o050J297J1916
$$ 38310 41134 31960 33903 33266 25001 22470 17998 23692 37274 35048 31486 21828 15778 17075 28991
9936B8991O282K071o041p487j036Q529M06k902j984o752k329L475R028M688P337
$$ 28991 35273 37344 31303 23816 22780 31309 31715 28813 26829 20077 17748 21223 30251 34939 42276
9921D2276P17j682L279M078j259j428j394L676L7j3009r184r45k659O881J768
$$ 42276 42993 41311 44590 48668 47409 45981 44587 48263 48300 35291 26107 25162 22503 29384 31152
9906C1152l435L50l17j2192N698M624L41n654r898l079L046J3278P600p960o583
$$ 31152 27717 28067 27750 15558 21256 25880 26221 20567 10669 7590 10636 23914 31514 23554 16971
9891A6971R776K116L217N214m717J91J928O39M2l244j1492j3741J140P387J0031
$$ 16971 26747 28863 32080 37294 32577 32768 34696 35335 35377 32133 20641 6900 8040 15427 25458
9876B5458q46R300J034j3076j526P931O989N191m633j1810o065l764j003m43J71
$$ 25458 24612 33912 34946 21870 20344 28275 35264 40455 35822 24012 17947 14183 13180 12737 12908
9861A2908q85M451O777J348m216j140l035n830J394N426L003J402j723j996N463
$$ 12908 12023 16474 23251 24599 20383 19243 16208 10378 11772 17198 20201 21603 19880 17884 23347
9846B3347J566o477m584Q043P678k761q582j023m543Q592k896j4262l834O912
$$ 23347 24913 18436 13852 21895 29573 26812 18230 17207 12664 21256 18360 4098 264 7176
9832G176M812L184L963K185K678J142q253l378M04o58N033J913o84n080J096O194
$$ 7176 11988 15172 19135 21320 23998 25140 16887 13509 13913 13255 18288 20201 19517 14437 15533 21727
9816B1727O911o509j0560P69J3222P56l73n411p295o640r35O45N605N289L157
$$ 21727 28638 22129 11569 12338 25560 26316 25943 20532 13237 6597 5662 6307 11912 17201 20358
9801B0358k909L522N444L057M520n395L939L779j092n150q767n344K593M064M112
$$ 20358 17449 20971 26415 29472 33992 28597 32536 36315 35223 30073 21306 15962 18555 22619 26731
9786B6731L718r400j9779p015M620K408M029J0053P221N527l353l925K163m7o78
$$ 26731 30449 21049 1270 -5745 -1125 1283 5312 15365 22586 28113 24760 20835 22998 22951 22273
9771B2273N0j681q70j686N934M032p695K426m143l859k210R52J0563j028r799
$$ 22273 22323 20642 19772 18086 24020 28052 20357 22783 18640 14781 12571 13523 24086 23058 13259
9756A3259M975P549J0416M69q477j353m820o757K752J3892M41j1121m434l317
$$ 13259 18234 25783 36199 36668 28191 26838 22018 15261 18013 31905 32346 21225 16791 13474
9742A3474M236J418K968k875o225K29L662J359L254l416j25l002m819J504N381
$$ 13474 17710 19128 22096 19221 12996 13225 16887 18246 21500 18084 17959 14957 10138 11642 17023
9727A7023j242o853r901j816J3616L886J004K186j0908K009Q243o70n186n078
$$ 17023 15781 8928 -973 -2789 10827 14713 15717 17903 6995 9004 17247 16577 11391 6313
9713F313m810N305O392L541M684M142M515j1414n813J184Q310m028l682j782k690
$$ 6313 1503 6808 13200 16741 21425 25567 30082 18668 12855 14039 22349 18321 14639 12857 10167
9698A0167N729n197J909k275n408P376p705r667P013M328o25Q176O07J946k282
$$ 10167 15896 10699 12608 10333 4925 12301 4596 -5071 1942 6270 5645 13821 14428 16374 14092
9683A4092N57j6140j2645M898J0133K74p485j997R858O170l557M776p01L612m955
$$ 14092 14649 -1491 -14136 -9238 895 1169 -6316 -8313 1545 7715 4158 8934 8233 11845 6890
9668F890j1934m15J6707P881q93k784o974j0129L402K113O029l424k587M164Q407
$$ 6890 -5044 -5459 11248 19129 18236 15452 8478 -1651 1751 3864 9893 6469 3882 8046 16453
9653A6453K915J2970R021m726m665o826L022O355l650j1619O124K957o296l048
$$ 16453 19368 32338 41359 36633 31968 25142 28164 34519 30869 19250 25374 28331 22035 18987
9639A8987k900k835O933R44k409j910k785Q424p019k277J350k430O536Q266M679
$$ 18987 16087 13252 20185 21129 18720 16810 14025 22449 15430 13153 14503 12073 18609 26875 31554
9624C1554q727p06r296N939Q320M591J653o184j3763O660L023M85j934n804M784
$$ 31554 22827 22121 12825 18764 27084 31675 33328 27144 13381 20041 23064 23549 21615 15811 20595
9609B0595Q99L693N86k406l688P656J195m461j1363N24L782p898K954j639j883
$$ 20595 21494 25187 25773 23367 19679 27335 28530 24069 12706 13230 17012 9114 12068 10429 8546
9594H546L423l656j640m987l038K28J5170k673m006N596Q340M37j162r987j0302
$$ 8546 11969 8313 6673 1686 -1352 -1124 14046 11373 7367 12963 21303 21740 20578 10591 289
9579B89L637j946j898R85q176J0244Q280M230k497q200J009M350m787l736M53
$$ 289 3926 1980 82 1067 -7109 3135 11415 15645 13148 4948 5957 10307 5520 1784 2237
9564B237Q824P561j959j454m644K196j522k584k936o385M736L402j968o939J829
$$ 2237 11061 18622 16663 15209 10565 12761 11239 8655 5719 -666 4070 7472 5504 -1435 394
9549C94L31N100j4114k158l024N373O596j133L173O575M367J56K263Q38m144K014
$$ 394 725 5825 -8289 -10447 -13471 -8098 -1502 -2635 538 7113 11480 11636 13899 14737 10593 12607
9533A2607Q808K447J124r519o698j3892K015O512R172J430j106K826P818k272
$$ 12607 21415 23862 24986 15467 8769 -5123 -3108 3404 12576 14006 12900 15726 23544 21272
9519B1272O28q79o168P374J716r038j400l079J418r317m913N739M665K756j913
$$ 21272 21900 21021 14853 22227 23943 14905 13505 10426 11844 2527 -2386 3353 8018 10774 8861
9504H861M143j26j195j095r819J806k578k877P679O922j03l456L288n754j0914
$$ 8861 13004 12878 11683 10588 769 2575 -3 -2880 4799 11721 11618 8162 11450 5696 -5218
9489e218o264m696P006O021q52M755P837k89k033K298p675j1553J2352M432o93
$$ -5218 -11482 -16178 -9172 -3151 -4003 752 8589 8300 6267 8565 890 -10663 1689 6121 5428
9474E428o36J035j019k621J2373J1563L180o117n100J457N499K218o582n502N34
$$ 5428 4792 5827 4808 2187 14560 26123 29303 23186 18086 19543 25042 27260 20678 15176 15710
9459A5710m327k842r591P178O134L450k150j719j912j605n420J183J566j0915
$$ 15710 11383 8541 -1050 6128 12262 15712 13562 11843 9931 8326 2906 4089 5655 -5260
9445e260m289N117L208R952K270j414O96L981p051N598l159n049K786O880k641
$$ -5260 -9549 -4432 -1224 8728 10998 9584 10280 14261 7210 12808 9649 4600 7386 14266 11625
9430A1625M093P83m24r994j1439j223K482o97l125l484L486P309l391j1113j060
$$ 11625 15718 16501 16077 6083 -5356 -6579 -4097 -4794 -7919 -11403 -7917 -608 -3999 -15112 -16172
9415a6172j71Q772R533m044N232J238N43L953J456j340K280L266K901k824N178
$$ -16172 -16343 -7571 1962 -2082 3150 4388 4931 8884 10340 9000 11280 14546 17447 14623 19801
9400A9801o274j4744m153p095N615J5725K487O149m736M94L004J394r212J052
$$ 19801 13527 -1217 -5370 -12465 -6850 8875 11362 17511 12775 13269 16273 17667 8455 9507
9386I507p093k025l79N972j341K61n812l37R656N937j611j961J01m387K532M404
$$ 9507 2414 389 10 5982 4641 4902 -910 -1247 8409 14346 12735 10774 10875 6488 9020 13424
9370A3424k06M639L127l043l439N08l298K551M043R14j515j969p512o161o474
$$ 13424 13218 17857 20984 17941 14502 15010 11712 14263 18306 19220 17705 15736 8224 2063 -4411
9355d411J334l463K484O906L769L307n079r034K397P676k377L678J774r341L220
$$ -4411 -3077 -6540 -4056 2850 6619 9926 4847 -4187 -1790 5886 3509 7187 8961 -380 2840
9340B840O630q633q942J364M256n652J194J472N675K072M918Q581O469l088l194
$$ 2840 9470 837 -8105 -6741 -2485 -8137 -6943 -5471 204 2276 7194 15775 22244 19156 15962
9325A5962k248p605m708J244l851L927N296J540o427j92K334o87l258K879J49
$$ 15962 13714 6109 1401 2645 -1206 2721 8017 9557 3130 2938 5272 4585 1327 4206 4355
9310D355Q060N29r626o226k464L012j599L531R470j99l343o462J131N473N5l313
$$ 4355 12415 12944 3318 -2908 -5372 -2360 -3959 -428 9042 8843 5500 -962 169 5642 5697 2384
9294B384l962l382J8832J0094j3199j972L245l556R954m237m247m889p39R564
$$ 2384 -1578 -4960 13872 23966 10767 8795 12040 8484 18438 14201 9954 5065 4326 13890
9280A3890M417p177p150L114Q710K73n418o614j729N272J2794j725j990m774n715
$$ 13890 18307 11130 3980 7094 15804 16077 10659 4045 2316 7588 20382 18657 16667 11893 6178
9265F178O585J3558J248j4090k726M690m096k535K38j110L968K286q065q21m754
$$ 6178 12763 26321 27569 13479 10753 15443 11347 8812 9050 7940 11908 14194 6129 5308 554
9250E54J261J215J112j3628l03L005R870r32n974N490K736k967o29M124N087P191
$$ 554 1815 3030 4142 -9486 -9789 -6784 3086 2154 -3820 1670 4406 1439 810 4934 10021 17212
9234A7212N17Q3J423j638l747n406L234N488k355N011Q270L672J513l649j1749
$$ 17212 17729 17812 19235 17597 13850 8444 11678 17166 14811 19822 28092 31764 33277 29628 17879
9219A7879p686o192n300P74m943L560K914l279j805L689M985M076J081K640l182
$$ 17879 10193 4001 -1299 -525 -5468 -1908 1006 -2273 -4078 -389 4596 8672 9753 12393 9211
9204I211j116M997N80M523N605l935k452l957K388k616n570j539P079P485p968
$$ 9211 8095 13092 13672 18195 23800 19865 17413 13456 15844 13228 7658 6119 13198 20683 12715
9189A2715j5655N752L945J730N085q566m88j232l828k778k804R939P775o546o280
$$ 12715 -2940 2812 6757 8487 13572 5006 4518 3286 -542 -3320 -6124 3815 11590 5044 -1236
9174a236J572j878o245O632r67J1k840m361O508J6271l888j045J0456p765j4134
$$ -1236 336 -1542 -7787 -1155 -2122 -2111 -4951 -9312 -2804 13467 9579 8534 18990 11225 -2909
9159b909m593M563l831P24Q945L2j1482P56J934N270K214o774j1624M697P444
$$ -2909 -7502 -2939 -6770 -6046 2899 2931 -8551 -7795 -5861 -591 1623 -5151 -16775 -12078 -4634
9144d634J740J4381L395K215l608p221j3007k736J1334L598j0143j2440L124Q329
$$ -4634 -2894 11487 14882 17097 13489 6268 -6739 -9475 1859 5457 -4686 -17126 -14002 -5673
9130e673N934L863k851k070J563K289n746m758L983O755L734M68p8J697l930o110
$$ -5673 261 4124 1273 -797 766 3055 -2691 -7449 -3466 3289 7023 7491 7413 9110 5180 -930
9114i30n944M294p06K49K397K924m394L799p79O19N057n12K34j0674k729M81k43
$$ -930 -6874 -2580 -3286 -3037 -640 2284 -2110 1689 910 1529 6586 6074 6308 -4366 -7095 -6614 -6857
9097f857j888J013Q864J172J81M022L974L839M530P554j4043j0883m70P541J440
$$ -6857 -8745 -7732 1132 2304 2485 6507 10481 14320 18850 26404 12361 1478 1008 8549 9989
9082I989K673K613M913n13m851r235O342J2515m375j8624o508n963L308L792L146
$$ 9989 12662 15275 20188 19675 14824 5589 11931 24446 20071 1447 -5061 -11024 -7716 -3924 -778
9067g78j06j905O195N978k250j957M616M503J447m583p550m500m996N631J7399
$$ -778 -884 -2789 3406 9384 7134 5177 9793 14296 15743 11160 3610 -890 -5886 -255 17144
9052A7144L530m455j834O804Q038l084q443l486K679M90n308K650k561n480j905
$$ 17144 20674 16219 14385 21189 29227 26143 17700 14214 16893 17383 12075 14725 12164 6684 4779
9037D779J319J939K817M677P916p541p429q053n768j1006K511J1267J21K679l222
$$ 4779 6098 8037 10854 15531 23447 15906 8477 424 -5344 -16350 -13839 -2572 -2451 228 -2994
9022b994J814K919J744M997O368J17l368L885o325M602N196m850o840r199n131
$$ -2994 -1180 1739 3483 8480 14848 14965 11597 15482 9157 13759 18955 14105 7265 -1934 -7065
9007g065M831n063Q27J6325J0038o053j0564j0409j339O504K226m836k417k454
$$ -7065 -2234 -7297 -6470 9855 19893 13840 3276 -7133 -8472 -1968 258 -4578 -6995 -9449
8993i449J82P724P909m251n810l276Q566l414K109j047m02M212l036l891n3K033
$$ -9449 -9267 -1543 6366 2115 -3695 -6971 1595 -1819 290 -757 -1159 3053 17 -3874 -3927 -1894
8977a894J0682n801q268J961K877r01m99R393o15J773l520q600m346L529P335
$$ -1894 8788 2987 -5281 -3320 -443 -1344 -1843 7550 6935 8708 5188 -3412 -7758 -4229 3106
8962C106J985J978L088m903o368L917k334R58j732k232q88M152p970K660J264
$$ 3106 5091 7069 10157 5254 -1114 2803 469 1427 -305 -2537 -3425 727 -7243 -4583 -3319
8947c319L51l709j0316N863R264j1K856j925J620M015m916o594N463l911m472
$$ -3319 -2968 -6677 -16993 -11130 -1866 -1877 979 -946 674 4689 -227 -6821 -1358 -5269 -9741
8932i741L37k680J159L811J013N311P948q714R13N130k634J835k666Q755l391
$$ -9741 -9404 -12084 -10925 -7114 -6101 -790 7158 -1556 -643 4487 1853 3688 1022 9777 6386
8917F386j4892L179M004l787M938L220k690m364m99J725m061k403N000L656n359
$$ 6386 -8506 -5327 -1323 -5110 -172 3048 358 -4006 -4505 -2780 -6841 -9244 -4244 -588 -5947
8902e947n067M674l97L632R226J931j0238o567l079Q251J5204k888n173m946r65
$$ -5947 -11014 -6340 -6737 -3105 6121 8052 -2186 -8753 -11832 -3581 11623 8735 3562 -1384 -2349
8887b349P040k511n214j2455o402P39Q972L117R97M651J0156Q181o738j218o73
$$ -2349 4691 2180 -3034 -15489 -21891 -21152 -12180 -9063 -8066 -3415 6741 14922 8184 6966 6293
8872F293j3818m542J2498K324l890N456R89L073K399J436m957o790P716K469m452
$$ 6293 -7525 -12067 431 2755 -1135 4321 5310 8383 10782 12218 7261 471 8187 10656 6204
8857F204m32Q41m605n529J923L39L485L399n010q238m192M985J3905P489p50J126
$$ 6204 5772 6613 2008 -3521 -1598 -1259 2226 5625 615 -7623 -11815 -6830 7075 14564 13814 14940
8841A4940o669j828l330l254K714O740N881O23r454o382m396N84R65k163k994
$$ 14940 8271 6443 3113 -141 2573 9313 15194 15817 6363 -19 -4415 -3831 -2866 -5029 -8023
8826h023M606j400P843l05q494n455l82N034O293o133o383n864O53P038L852k156
$$ -8023 -3417 -4817 3026 2721 -5773 -11228 -11610 -6576 -283 -6416 -12799 -18663 -18010 -10972 -7120 -9276
8810i276m572o352P183J3584N461k137o071P10L144K48j275r903M235K381J3525
$$ -9276 -13848 -20200 -13017 567 6028 3891 -2180 -1470 1674 1922 647 -9256 -5021 -2640 10885
8795A0885N840p699K544K482q809O906j066j2782k003O238L126n198m062Q022
$$ 10885 16725 9026 11570 14052 5243 12149 11083 -1699 -3702 2536 5662 464 -3598 4424
8781D424J2420q494N04j013m203L857J329o158j205K617k43m34k366O930J1455
$$ 4424 16844 8350 8854 7841 3638 7495 8824 2666 1461 4078 3835 3401 1035 7965 19420
8766A9420M508j190m034n877j4918J370J103j899k459Q279J3120M454j531m039
$$ 19420 23928 22738 18704 12827 -2091 -721 382 -1517 -3976 4303 17423 21877 20346 16307
8752A6307P605M434m277q507j9118j2645N33J61J5757K169l93N472P902j112j3218
$$ 16307 23912 28346 24069 15562 -3556 -16201 -15668 -15507 250 2419 2026 7498 15400 14288 1070
8737A070j8619k735J1816R036J695j660p182n083m748p13O158P165O416j163o675
$$ 1070 -17549 -20284 -8468 568 2263 603 -6579 -11662 -16410 -17123 -10965 -3800 2616 1453 -5222
8722e222l914K360M189M196m150j3305P026L455J591J42l499M094R60P465L122
$$ -5222 -9136 -6776 -2587 1609 -2541 -15846 -8820 -5365 -3774 -3632 -7131 -3037 -2077 5388 8510
8707H510m115k97n560P770L654m843n519N511N978l6J786j239n887n901L883P066
$$ 8510 4395 4098 -1462 6308 9962 5119 -400 5111 11089 11053 12839 11600 5713 -188 3695 10761
8691A0761n149j990j958o753l46n93M190k179M17M877o430r77Q805j013M649Q846
$$ 10761 5612 3622 1664 -5089 -5435 -6028 -1838 -4017 -3600 1277 -5153 -6130 2675 1662 6311 15157
8675A5157k40k382q772Q410L85n53j295k690l004N515l657l098O501N350Q201
$$ 15157 14917 12535 3763 12173 12558 12005 10710 8020 5016 10531 6874 3776 10277 15627 23828
8660B3828r724k1329r371J0381m34O904N185l104l881K678K921l913M127J3169
$$ 23828 14104 -7225 -16596 -6215 -6649 255 5440 2336 -1545 1133 4054 141 4268 17437
8646A7437R246j203l429q319o623o226l16l481N328o843p723k323P502M80o78
$$ 17437 26683 25480 22051 13732 7109 883 567 -2914 2414 -4429 -12152 -14475 -6973 -6493 -7171
8631g171N962L261L45N520L407J3644m52j0186j200l761K836J416J0930k555n915
$$ -7171 -1209 2052 2397 7917 11324 24968 24516 14330 13130 9369 12205 13621 24551 21996 16081
8616A6081L655L923J177j0127n503P00m004j200N566n058M341J0358n031j3962
$$ 16081 19736 23659 24836 14709 9206 9906 5902 4702 10268 5210 9551 19909 14878 916
8602I16Q24K733J229k066j22j080k194L244P974j934O339K716q56j791j2933j323
$$ 916 1740 4473 5702 3636 3514 2434 240 3484 11458 9524 15863 18579 17723 15932 2999 1676
8586A676K286l098l315j377J1871M160o394q409J3760P671k092l035l892o340
$$ 1676 3962 864 -2451 -3828 8043 12203 5809 -2600 11160 18831 16739 13704 9812 3472
8572C472n087K761P871J613P787j290j0880K420J1293L024L645P52q969o298N08
$$ 3472 -1615 1146 9017 10630 18417 17127 6247 8667 19960 22984 26629 27381 18412 12114 12622
8557A2622K398l070n947R725O350j2561K652K099j528n995l604R985J0083j1390
$$ 12622 15020 11950 6003 15728 22078 9517 12169 14268 12740 6745 3141 13126 23209 11819
8543A1819p218n074j789o040QP807P94L743K264L615l58n744o095q624l132J5873
$$ 11819 4601 -473 -2262 -8302 -8294 -487 307 4050 6314 9929 9571 3827 -2268 -10892 -14024 1849
8527A849N140K588j310N011j712K14P12P236J1057J2185n609j4645l318o18n980
$$ 1849 6989 9577 8267 13278 11566 11780 12492 19728 30785 42970 37361 22716 19398 18780 12800
8512A2800L483r098p347k754J351R180k260k80L980M79k673M934L281m58j926
$$ 12800 16283 7185 -162 -2916 -1565 7615 5355 5075 9055 9534 6861 11795 15076 14618 12692
8497A2692j4372k074J000O036k229N89P941J1744M618r143q895k190m923p703
$$ 12692 -1680 -3754 -2754 3282 1053 1642 9583 21327 25945 16802 7907 5717 794 -6909
8483f909O244M354m193N29K090o273O94J0423J456p783o790n998Q084J1807J2635
$$ -6909 -665 3689 -504 25 2115 -4158 -3464 6959 8415 632 -6158 -12156 -4072 7735 20370
8468B0370K02j0820j620N19j335K445J659o064j4525m454M661R751J92n220n501
$$ 20370 20572 9752 8132 8651 7316 9761 11420 5356 -9169 -13623 -8962 789 981 -4239 -9740
8453i740p736j118J1227K051j437N394k404j324K754J0111P603o94N18L258q33
$$ -9740 -17476 -18594 -7367 -5316 -6753 -1359 -3763 -5087 -2333 7778 15381 14687 15205 18463 17630
8438A7630j838J280j030j670k310r950l739M592R337j17J595K818L163o98j0969
$$ 17630 15792 17072 16042 14372 12062 2112 -1627 2965 12302 12185 13780 16598 19761 19063 8094
8423H094K82N536K620p138j719M622j1122m006N54N370N560m936o455l853l249
$$ 8094 8376 13912 16532 9394 7675 12297 1175 -2831 -2277 3093 8653 3717 -2738 -6591 -9840
8408i840k034L859l065l502J293J2072O713n321k218l218K846j171O244M404o675
$$ -9840 -11874 -8015 -11080 -14582 -13289 -1217 5496 175 -2043 -5261 -2415 -3586 2658 7062 387
8393C87k702J3873J0569r105l892r030n132Q867Q601n623p679j1960J089R37O462
$$ 387 -2315 11558 22127 13022 9130 100 -5032 3835 12436 6813 -866 -12826 -11737 -10800 -4338
8378d338J0315l499L284O120o481n049L79J932K469J995J297q37j1095j779K474
$$ -4338 5977 2478 5762 11882 5401 352 731 2663 5132 7127 8424 7587 -3508 -5287 -2813
8363b813J175J0412M471k908k65m668J754k684n625M570M540k39p906R888O683
$$ -2813 -1638 8774 13245 10337 10072 5404 7158 4474 -1151 3419 7959 7720 -186 9702 16385
8348A6385r066j6507M0O492L559r43l541M441o20O79M174J049j743p183K776l800
$$ 16385 7319 -9188 -9148 -2656 903 -40 -3581 860 240 919 5093 6142 4399 -2784 -8 -3808
8332c808K80Q527k875n62J389q141n535Q72K177l785J800k522J2112J998k074
$$ -3808 -3528 4999 2124 1562 2951 -5190 -10725 -9853 -7676 -11461 -9661 -12183 -71 1927 -147
8317a47j541M798n116k335n365o795K671N734P638M49K299O002o553q688l400
$$ -147 -1688 3110 -2006 -4341 -9706 -16501 -13830 -8096 -458 -9 2290 8292 1739 -6949 -10349
8302a0349O65j252k417o846j814J1250R832J2049k970o767K368o080P903J669
$$ -10349 -9684 -10936 -13353 -20199 -22013 -10763 -931 11118 8148 1381 3749 -2331 5572 7241
8288G241k925m831p282q4P167j539K725n831m490l982j088J860Q01N730Q053N323
$$ 7241 4316 -515 -7797 -7881 -714 -2253 472 -5359 -9849 -13831 -14919 -13059 -12258 -6528 1525 6848
8272F848j847p007J531L533k031l280j134Q437K639o776Q73J183J324J524p199
$$ 6848 5001 -2006 -475 3058 1027 -2253 -3387 5050 7689 913 1786 2969 4293 5817 -1382
8257a382o613m020M81L459m969j640O050J2484j104m123k06O79l719L147o14k581
$$ -1382 -7995 -12015 -11534 -8075 -13044 -14684 -8634 3850 2746 -1377 -1583 -904 -4623 -1476 -2090 -4671
8241d671n896Q950P014O504R688N171p784k367p099j3125l808M544P492k568q097
$$ -4671 -10567 -1617 5397 11901 21589 26760 18976 16609 9510 -3615 -7423 -2879 4613 2045 -6052
8226f052k738N668J617N467N867P813l166K336j658j5284n500j706K644L988j108
$$ -6052 -8790 -3122 -1505 3962 9829 17642 14476 16812 15154 -130 -5630 -7336 -4692 -704 -1812
8211a812l993p359O486K995n790m298M801L722L818jn172O068Q407l599J980j07
$$ -1812 -5805 -13164 -6678 -3683 -9473 -13771 -8970 -5248 -1430 -1431 -6603 -535 7872 4273 6253 6146
8195F146n423r117J905k28K59j89kO187j817l862k876P946K006o14l784l41R10
$$ 6146 723 -8394 -6489 -6717 -6458 -6647 -6649 -462 -2279 -6141 -9017 -1071 935 321 -3463 -3804 -2894
8178b894m518q25J918n16p361M125L151Q893P326o622m529O099K659q584q229
$$ -2894 -7412 -8237 -6319 -6835 -14196 -10071 -6920 1973 9299 2677 -1852 4247 6906 -1678 -9907
8163i907l907N142O710l555q774N066Q219M283p542J764M066J262p68m678j3140
$$ -9907 -13814 -8672 -1962 -5517 -14291 -9225 -1006 3277 -4265 -2501 1565 2827 2059 -2619 -15759
8148a5759L304J2982M963o368L07l063l374N542N301r418p856L180M362R916l35
$$ -15759 -12455 527 5490 -878 -571 -3634 -7008 -1466 3835 -5583 -13439 -10259 -5897 4019 3684
8133C684m744R96m972ql1j1398j294J465k088J2166N252l890R071K281k630q914
$$ 3684 -1060 -64 -5036 -5044 -5075 -16473 -17767 -16302 -18390 -6224 -972 -4862 4209 6490 3860 -5054
8117e054r408j0781K302P230P690M179N022O822m40K161J043Q777l039l54m843
$$ -5054 -14462 -25243 -22941 -15711 -8021 -3842 1180 8002 7562 9723 10766 19543 16504 16150 11307
8102A1307q320p496M533N328m932p184J929J3635K35K31K810q849m423K757J841
$$ 11307 2987 -4509 24 5352 420 -6764 -4835 8800 9035 9266 12076 3227 -1196 1561 3402
8087C402J8073K629q581j0250n508m442Q69l959kK639j0975P07j528n31L133m59
$$ 3402 21475 24104 15523 5273 -235 -4677 -3808 -7767 -7769 -5130 -16105 -15398 -16926 -17457 -14324 -14783
8071a4783k294P432M596Q920K977n91j996p105r49Q05l62J218L132M257m236l247
$$ -14783 -17077 -9645 -5049 3871 6848 6257 4261 -2844 -3793 -2988 -3350 -2132 1000 5257 1021 -2226
8055b226L214j398j890P741L788q286k153J676k01n735k98K588q426k056J0254
$$ -2226 988 -410 -2300 5441 9229 943 -1210 466 265 -5470 -5768 -3180 -11606 -13662 -3408
8040c408P252r995k422n509P980O838q584j1320J947J634K131L316p36N535l439
$$ -3408 3844 -6151 -8573 -14082 -6102 736 -7848 -19168 -17221 -15587 -13456 -10140 -10876 -5341 -8780
8025h780l472M427R551P335j151j622K166O395j6467j1149P080J640N004Q83o782
$$ -8780 -12252 -7825 1726 9061 7910 6288 8454 14849 -1618 -12767 -5687 -4047 957 1840 -4942
8010d942p06k188J42L066K585k561k440O013K78L950J513k956k861N147r01M845
$$ -4942 -5648 -7836 -7694 -4628 -2043 -4604 -7044 -1031 -753 3197 4710 1754 -1107 4040 3139 7984
7994G984K730o100N153k01l876q908o762L994m136K306P24L16O968j950l287P97
$$ 7984 10714 4614 9767 9566 5690 -3218 -9980 -5986 -10122 -7816 -7092 -6776 192 -1758 -5045 -4248
7978d248Q073J1373k791l408K38p67k157r100j1952P539R510K66j475n830l50
$$ -4248 3825 15198 12407 8999 9237 8470 6313 -2787 -14739 -7200 2310 2576 1101 -4729 -5079
7963e079J2097O561M334K456J242k290p351q331R022N510j574L437n599j0213
$$ -5079 7018 13579 17913 20369 21611 19321 11970 3639 12661 18171 16597 20034 14435 4222
7949D222m711q80l96j431J321K870j941J131K084n214J989L081l091j081J1164
$$ 4222 -489 -1369 -1765 -3196 -1875 995 -946 185 2269 -2945 -956 2125 -966 -2047 9117
7934I117M032o45m69m386k954R936l563p24O048q098r58j291l390m191l390O439
$$ 9117 13149 12504 12035 7649 4695 14631 11068 10344 16392 8294 7336 6045 2655 -1536 -4926 1513
7918A513J0582K392l080j297K892j648N4n380n154L450L265R48r259l541Q324
$$ 1513 12095 14487 11407 10110 13002 11354 11408 6028 874 4324 7589 8537 -722 -4263 4061
7903D061O933N014n59J739l834n557j990p904j1775R233J2938O334j854j2740
$$ 4061 10994 16008 15449 17188 13354 7797 5807 -2097 -13872 -4639 8299 14633 12779 39
7889C9q272R721N10N546J968O19l449p462o963m042J0204J3847J788K747j0506
$$ 39 -8233 1488 1998 7544 9512 10131 6682 -780 -7743 -11785 -1581 12266 14054 16801 6295
7874F295N483L018j5174k302J0j394L247J788O681o443q778K370k027K665R27
$$ 6295 11778 14796 -378 -2680 -2670 -4064 -817 971 7652 1209 -7569 -5199 -7226 -4561 -3634
7859c634J813j058P06J893J0130K638p847o869l613N268L341l413N815M448o497
$$ -3634 -1821 -2879 -2173 -280 9850 12488 4641 -2228 -5841 -573 2768 -645 5170 9618 3121
7844C121n03J849j127l000j482r194R965P35K544L365J209N644p777m662J4151
$$ 3121 2618 4467 3340 340 -1142 -10336 -371 364 2908 6273 7482 13126 5349 687 14838
7829A4838j786q591l936j572k290L768m286m549m372J1025Q280N646n25q621l515
$$ 14838 13052 4461 525 -1047 -3337 431 -3855 -8404 -12776 -1751 6529 12175 11650 3029 -486
7814d86m352p03j405j707q92o988r53q0q77l68J647k071N138N609Q280Q296k015
$$ -486 -4838 -5541 -6946 -8653 -9545 -16533 -17486 -17566 -18443 -18811 -17164 -19235 -14097 -8488 -208 8088 6073
7797F073j0656M464K624p685J836P899j348k070j045L212j1108k716j676N405
$$ 6073 -4583 -119 2505 -5180 -3344 4555 3207 1137 92 3304 -7804 -10520 -12196 -6791
7783f791O478J595O038K684m140j044K285l49l334K979J771m867J680k261j3060
$$ -6791 -313 1282 7320 10004 5864 4820 7105 6756 3422 6401 8172 3305 4985 2724 -10336
7768a0336m2Q991J935R639K808M008j059L3j398p748l324p202j947J44R07O606
$$ -10336 -10378 -1387 548 10187 12995 17003 15944 15977 14579 6831 3507 -3695 -5642 -5498 -4591 2015
7752B015L411N177n601n389K595J1200k742o073l558j163q735N709J455J810K301
$$ 2015 5426 10603 5002 -387 2208 13408 10666 4593 1035 -128 -8863 -3154 -1699 111 2412
7737B412j327J612N888o678P98m73K665o291K462Q550j04K483l59M044m584k034
$$ 2412 1085 2697 8585 1907 2705 2232 4897 -1394 1068 9618 9514 11997 11638 15682 11098 9064
7721I064j3446j978J595P70O79K755L347k971k221L340l243k384K354M620K917
$$ 9064 -4382 -6360 -4765 -3995 -3316 -561 2786 -185 -2406 934 -2309 -4693 -2339 2281 5198
7706E198J3567N187j2546j2692m346P48N16m491l994n66j745j382o017J472N966
$$ 5198 18765 23952 11406 -1286 -5632 -4884 -4368 -8859 -12853 -13419 -15164 -16546 -22563 -21091 -15125
7691a5125L758m468Q403Q112P223j795Q92M693o996o056j2374L09O170K808m085
$$ -15125 -11367 -15835 -7432 680 7903 6108 7000 11693 4697 -1359 -13733 -13424 -7254 -4446 -8531
7676h531J80J09Q067J571n970l842n713j665n339N960P964O850R09k831p684L085
$$ -8531 -8351 -8242 -175 1396 -4574 -8416 -14129 -15794 -21133 -15173 -7209 -359 550 -2281 -9965 -6880
7660f880O368k056J968J1397M42j2192j185p198K941M261q606l606Q463J0666
$$ -6880 -512 -2568 -600 10797 11239 -953 -2138 -9336 -6395 -2134 -10740 -14346 -5883 4783
7646D783j716k88j965P161j673q98N432R47l482p145j6837m887N849O756N967
$$ 4783 3067 2779 814 7975 6302 5404 10836 11783 8301 1156 -15681 -20568 -14719 -7963 -1996
7631a996J0429k072n226M07n013l16Q0L411M604n71J536J237m230O894Q819K775
$$ -1996 8433 6361 1135 1542 -3471 -3787 -3707 -296 4308 3737 5273 6510 2280 9174 17993 20768
7615B0768k72k688p749l429o624o281m40l16p319j0712J926J293j110M557J0958
$$ 20768 20496 17808 10059 6630 6 -6275 -6715 -7031 -14350 -25062 -23136 -21843 -22953 -18396 -7438
7600g438L78M345P016m949o126K813j826p277M02j610J640N378J3002K194m767
$$ -7438 -7060 -2715 4301 -648 -6774 -3961 -5787 -13064 -12662 -14272 -12632 -7254 5748 7942 3175
7585C175p948M778J350m738l739M325k671o096N071N559P339o888k577O099l867
$$ 3175 -4773 5 1355 -3383 -7122 -2797 -5468 -11564 -6493 -934 6405 -483 -3060 3039 -828
7570h28m907p361M127Q612p240j293n32P310R763r024p951k36Q035k809p218r05
$$ -828 -5735 -13096 -8969 -357 -7597 -8890 -9422 -2112 7651 -1373 -9324 -9560 -1525 -4334 -11552 -12457
7554a2457J2071J0175K548J010j96j0321l088N568n207m974j3240l67M54Q465
$$ -12457 -386 9789 12337 13347 13151 2830 -258 5310 103 -4871 -18111 -18478 -18024 -9559
7540i559J2363J0369j261o472o895r773J0293N71n563k973o187N212J1296L165
$$ -9559 2804 13173 11912 5440 -1455 -11228 -935 -364 -5927 -8900 -15087 -9875 1421 4586
7526D586J919j444O71j18J222P199q88l896k502P063n385n394n901J853m053j911
$$ 4586 6505 5061 5732 5614 6836 14035 13147 9251 6749 13812 8427 3033 -2868 -1015 -5068 -6979
7510f979m826L448J113M977L010P084n472o994J553k171O462Q35l6L245O519p7
$$ -6979 -11805 -8357 -7244 -2267 743 7827 2355 -4639 -3086 -5257 1205 2040 2004 5249 11768 11691
7494A1691q016p443p465L029N480K212j69j190J487J886k281o937O757K336P754
$$ 11691 3675 -3768 -11233 -8204 -2724 -512 -681 -1871 -384 1502 -779 -7716 -959 1377 9131
7479I131J803n621m504o317K23k148J56N652J5258N40j5157M279L876K9N293O646
$$ 9131 10934 5313 809 -5508 -5285 -7433 -7277 -1625 13633 14173 -984 3295 7171 7200 12493 19139
7463A9139o267n546j119o811n612l800K834P602L269n640m045J993k164K960k65
$$ 19139 12872 7326 6207 -604 -6216 -10016 -7182 420 3689 -1951 -5996 -4003 -6167 -3207 -3472
7448c472J807K335J0691n409o770N005J5651L812j1003L937M110o609r029J035
$$ -3472 -1665 670 11361 5952 -818 4187 19838 23650 12647 16584 20694 14085 5056 6091
7434F091o949n864P347J0719J077o513n048n94j2717K435k24L894J0162M095k630
$$ 6091 -858 -6722 625 11344 12421 5908 860 266 -12451 -10016 -10240 -6346 3816 7911 5281
7419E281J140o071o417J516J660O548j546J505J237k712k294M45j1159M73Q488
$$ 5281 6421 350 -6067 -4551 -2891 3657 2111 3616 4853 2141 -153 292 -10867 -10394 -1906
7404a906P007l271o446L379k661j002N78M380q04K232j945l842R87l890r341K539
$$ -1906 5101 1830 -4616 -1237 -3898 -4900 -4322 58 -746 1486 -459 -4301 -3314 -7204 -16545 -14006
7388a4006k20j450L491p75J2203J2395M417n898q694J913J829N502m804j031m485
$$ -14006 -14226 -15676 -12185 -12960 -757 11638 16055 10157 1463 3376 5205 10707 5903 4872 387
7373C87l887k995m18p440N405O903M485m292j0325K462M536L192o41K570m000
$$ 387 -3500 -6495 -6913 -14353 -8948 -2045 2440 -1852 -12177 -9715 -5179 -1987 -2628 -58 -4058
7358d058J798n875L151P965p118K898l849J14j027j1101j415N633P570M3n891
$$ -4058 -2260 -8135 -4984 2981 -4137 -1239 -5088 -4974 -6001 -17102 -18517 -12884 -5314 -5271 -11162
7343a1162k930O968J4573L128j4180n958O096M498q203p292K473Q536J699l678
$$ -11162 -14092 -7124 7449 10577 -3603 -9561 -3465 1033 -7170 -14462 -11989 -3453 -1754 -5432
7329e432o66Q999n345l837J398M126M286j190L842M728j0094p866J978n89J289
$$ -5432 -6098 2901 -2444 -6281 -4883 -757 3529 2339 6181 10909 815 -7051 -5073 -5662 -4373
7314d373n840l304L110L266J15P27j063m325p7M844M041j483n429K252N682j5007
$$ -4373 -10213 -13517 -10407 -7141 -7026 -6299 -7362 -11687 -11764 -6920 -2879 -4362 -9791 -7539 -1857 -16864
7298a6864j3485Q657Q393R603J803p59R072r08K9K178L52P375L606r262j4131
$$ -16864 -30349 -21692 -13299 -3696 -1893 -2652 6420 5512 5541 7719 8071 15446 19052 9790 -4341
7283d341n916j450j453K799O598L354M658m293q833Q31K595l661o958P814O94
$$ -4341 -10257 -11707 -13160 -10361 -3763 -409 4249 -44 -8877 -8046 -5451 -9112 -16070 -8256 -7562
7268g562N587M312K726p729k148j844M349M147K702q046q009k12R181K944J1345
$$ -7562 -1975 2337 5063 -2666 -4814 -6658 -2309 1838 4540 -3506 -11515 -11727 -2546 398 11743
7253A1743j354o843o778p4p207l703P59M593l936j1685j076J1066K050PN440M743
$$ 11743 10389 3546 -3232 -3306 -10513 -14216 -13457 -8864 -12800 -24485 -25561 -14495 -12445 -12438 -6998 -2255
7237b255M116K766L706Q110m430m250L394r966q372m598N762M688l62K320j893
$$ -2255 1861 4627 8333 16443 12013 7763 11157 1191 -7181 -11779 -6017 -1329 -1691 629 -1264
7222a264o170r009l623J5454N351k010M748ml291l918R199J354L310M559k906
$$ -1264 -7434 -16443 -20066 -4612 739 -1271 3477 3473 182 -3736 5463 6817 10127 14686 11780
7207A1780K529j401j672k032p466j0054l271k230P923N824M904j704P4l207k551
$$ 11780 14309 12908 11236 9204 1738 -8316 -11587 -13817 -5894 -70 4834 3130 3204 -3 -2554
7192b554k715o381O411m145j4975k521R856P30N132Q425J378k434p047M895r30
$$ -2554 -5269 -11650 -5239 -9384 -24359 -26880 -17024 -16294 -11162 -2737 -1359 -3793 -10840 -5945 -6875
7177f875lL869l765R291M282P348M450p662j6011J099L31K120K260J932R50l850
$$ -6875 -6878 -3009 -6774 2517 6799 14147 18597 10935 -5076 -3977 -3646 -1526 734 2666 3616 -234
7161b34m623P499o0m786m808n860j783J7185N020o761m453N113k78l920L494L19
$$ -234 -4857 2642 2582 -2204 -7012 -12872 -14655 2530 7550 789 -3664 1449 1171 -2749 745 1064
7145A064l957O049J0111q322q350J369n12O489n113J195Q036j731J224k298J7
$$ 1064 -2893 3156 13267 4945 -3405 -2036 -2548 3941 -1172 23 8059 6328 7552 5254 5271
7130E271p452n139L312N56L685M3K722L320j3098q441k340J1945J1644j312o196
$$ 5271 -2181 -7320 -4008 -3452 233 276 2998 6318 -6780 -15221 -17561 -5616 6028 4716 -1480
7115a480L14L397q4r43L083m051j188M539l835l180j22j1201N681l499k704N82
$$ -1480 -1166 2231 2147 1204 4287 236 -952 3587 -248 -3428 -3550 -14751 -9070 -12569 -15273 -14691
7099a4691Q727J0159l209m108J235n333k739M103O60M941K750p592l143Q829N374
$$ -14691 -5964 4195 986 -3122 -1887 -7220 -9959 -5856 -5196 -255 2495 -5097 -8240 589 5963
7084E963J744p117R49j2050q880Q838M166q45j562n208N058Q25j2833m119L724
$$ 5963 7707 590 1539 -10511 -19391 -10553 -6387 -7232 -8794 -14002 -8944 -8119 -20952 -25071 -21347
7069b1347J430R332L954J3062P17j287r65N879k187j1802k436J661j926o455O21
$$ -21347 -19917 -10585 -6631 6431 7148 5861 4896 10775 8588 -3214 -5650 -3989 -5915 -12370 -11749
7054a1749L164M088J1057O094k604n768L286l278r599J1917p13j0631M443l127
$$ -11749 -8585 -4497 6560 12654 10050 4282 7568 4290 -5309 6608 5895 -4736 -293 -3420
7040c420l590J245O130j117j3434l20M82k199m438Q488k395o542R106R314M434
$$ -3420 -7010 -5765 365 -752 -14186 -14506 -14024 -16223 -20661 -12173 -14568 -21110 -12004 -2690 1744
7025A744o138m79j369N71J625l692K709L867O107M310j288j0348j3249J5054O443
$$ 1744 -4394 -4873 -6242 -5671 -4046 -7738 -5029 -1162 4945 9255 7967 -2381 -15630 -576 5867
7010E867r447m206j116J2058l54L957K576r92K489L263J48O764l887j2087j4042
$$ 5867 -3580 -7786 -8902 3156 2802 6759 9335 8343 10832 14095 14243 21007 17120 5033 -9009
6995i009l828o83j383N879O919K331L487O90L544k176Q34M681l576r334q166M792
$$ -9009 -12837 -13520 -14903 -9024 -2105 226 3713 4403 7947 5771 6605 11286 7710 -1624 -9790 -4998
6979d998K194N002J110p6R46o351n603N695L677N826k162q911M151J711l254O558
$$ -4998 -2804 2198 3308 3232 4178 -2173 -7776 -2081 1596 7422 5260 -3651 500 2211 -1043 5515
6963E515J505k434K012K760k427r942p884K622O018K422K464k204L945o893j523
$$ 5515 7020 4586 6598 9358 6931 -3011 -10895 -8273 -2255 167 2631 427 4372 -2521 -4044
6948d044J607N959m147r256l88n16L082J557l078l387j309K88k212P628J217q086
$$ -4044 -2437 3522 -625 -9881 -10269 -10785 -7703 -6146 -9224 -12611 -13920 -13632 -15844 -8216 -6999 -15085
6932a5085m201P876N926N654P771J155p196r410L424K683K255n36k04l252J415
$$ -15085 -19286 -11410 -5484 170 7941 9096 1900 -7510 -4086 -1403 852 316 112 -3140 -1725
6917a725r365O006L417n205j407N328R410J1991J173q546j2129k223J704O689
$$ -1725 -11090 -5084 -1667 -6872 -8279 -2951 6459 18450 19623 11077 -1052 -3275 -1571 5118
6903E118Q166n607J215L756p217n098J812K993L523J715r165p307J0457O617l766
$$ 5118 13284 7677 8892 12648 5431 333 2145 5138 8661 10376 1211 -6096 4361 10978 7212
6888G212j606N745J421n217o940q422l99N164L206Q09r563O145q45m180N567P7
$$ 7212 5606 11351 12772 7555 615 -7807 -8206 -3042 164 973 -8590 -2445 -3290 -7470 -1903 -1826
6872a826o43p879J300J0689p93k29P332k929Q104J1399K1j3074p443P047j430
$$ -1826 -2469 -10348 -9048 1641 848 619 7951 5022 13126 24525 24546 11472 4029 11076 9646
6857I646L396j173m485N191N346m539j829J0391N820j4449j0020q786q387m266
$$ 9646 13042 11869 7384 12575 17921 13382 11553 21944 27764 13315 3295 -5491 -13878 -18144
6843a8144J18J196o580j767N325R616O56n756j335N223L983j326K568m193O087
$$ -18144 -18026 -16830 -23410 -25177 -19852 -10236 -9580 -15336 -16671 -11448 -7465 -8791 -6223 -10416 -4329
6828d329Q51p548K375p309q381K3Q847P659N813P314O248P056j578j3991J010
$$ -4329 -3478 -11026 -8651 -15960 -24341 -24318 -15471 -7812 -1999 5315 11563 18619 17041 3050 4060
6813D060K397P17n341j722M816K973P962m020K871q579q62j052N38o185L477P621
$$ 4060 6457 7174 1833 111 4927 7900 15862 11842 14713 6134 5272 4220 4758 -1427 2050 9671
6797I671k182p481l878p878K441N511N529j730l066k243k136l853o837M287Q794
$$ 9671 7489 8 -3870 -11748 -9307 -3796 1733 3 -3063 -5306 -7442 -11295 -18132 -13845 -5051
6782e051O207m72j99m595k057J1855R237Q327n114n451j2904J092O873J096j1238
$$ -5051 1156 684 485 -4110 -6167 5688 14925 23252 18138 12687 -217 875 7748 8844 -2394
6767b394o420j761L463K094K148N751p358p306M733J437R118K431n355q624m417
$$ -2394 -8814 -10575 -7112 -5018 -2870 2881 -4477 -11783 -7050 -5613 3505 5936 581 -8043 -12460
6752a2460M670j732l078L278q642K479J0901m264l133j049R211L407n692J126
$$ -12460 -7790 -9522 -12600 -9322 -17964 -15485 -4584 -8848 -11981 -13030 -3819 -412 -6104 -4978
6738d978J0127n819l430L779p745p522M960J2748l856k333m1l180l019r22O318
$$ -4978 5149 -670 -4100 -321 -8066 -15588 -10628 2120 -1736 -4069 -4110 -7290 -10309 -11231 -4913
6723d913j297M774l559r217k379K084J2836l308j0417O182M704K394P42L550j77
$$ -4913 -6210 -1436 -4995 -14212 -16591 -14507 -1671 -4979 -15396 -9214 -4510 -2116 -1374 2176 1999
6708A999k931J358p055j656R019l340j1195j528J521Q226R230J546j0703j077
$$ 1999 -932 426 -6629 -8285 734 -2606 -13801 -15329 -13808 -5582 3648 5194 -5509 -6586
6694f586K937m513L252o53j1950M680K836L073L503N624m573k172l41n172R898
$$ -6586 -3649 -8162 -4910 -5563 -17513 -12833 -9997 -6924 -3421 2203 -2370 -4542 -4883 -10055 -157
6679a57l424k113m385O013J5123l428j3346j0223r725M995J3749K717M319k293
$$ -157 -3581 -5694 -10079 -4066 11057 7629 -5717 -15940 -25665 -20670 -6921 -4204 115 -2178
6665b178N771Q909n97p438l513N05k455j0113J343P897N366r628p486o847l118
$$ -2178 3593 12502 11905 4467 954 1459 -996 -11109 -9766 -1869 3497 -6131 -13617 -20464 -23582
6650b3582M276k090O573O391O089R9Q76n764L466K59o564J598o41K444N098K911
$$ -23582 -19306 -21396 -14823 -8432 -2343 -2244 -1368 -7132 -3666 -3407 -9971 -8373 -9014 -6570 -1472 1439
6634A439N102N173j1413q183Q317J0227j1082n211J769q057o555o008J0175O651
$$ 1439 6541 11714 301 -7882 435 10662 -420 -5631 -3862 -11919 -18474 -24482 -14307 -7656
6620g656J100j842J169J815q8l435m92l759M934n67k309j183l200j55O70k077
$$ -7656 -6556 -8398 -7229 -5414 -5502 -8937 -9429 -13188 -8254 -8821 -11130 -12313 -15513 -15668 -14998 -17075
6604a7075J1819J414k454p98K635o819L4J2473M655n518k563m346J827K023q608
$$ -17075 -5256 -3842 -6296 -7094 -4459 -11278 -11244 1229 5884 366 -2197 -6543 -4716 -2693 -11301
6589a1301k474N451P44K554N862K466J013k493o034J178N130L13p044j3122o187
$$ -11301 -13775 -8324 -7580 -5026 836 3302 4315 1822 -4212 -3034 2096 2409 -4635 -17757 -23944
6574b3944K018J1981J2838r710o409j658l174j898L764n148R162M024J738K308
$$ -23944 -21926 -9945 2893 -6817 -13226 -14884 -18058 -19956 -16192 -21340 -12178 -8154 -6416 -4108
6560d108J60L741P226n467r688N462M063L406N68J868j0015k135L188m975n0n61
$$ -4108 -3948 -207 7019 1552 -8136 -2674 1389 4795 5363 7231 -2784 -4919 -1731 -6706 -6756 -7317
6544g317o967l244m215n30R723J1331J5309K110n83m906p244j112K554J3463L649
$$ -7317 -14284 -17528 -21743 -22273 -12550 -1219 14090 16200 15617 10711 3467 2355 4909 18372 22021
6529B2021K602j3941o19K356r304q670L953N117K670j536j621n195L198j078K017
$$ 22021 24623 10682 10063 12419 3115 -5555 -1602 3515 6185 4649 3028 -2167 1031 -47 1970
6514A970J076j152J2154M395K449j885j440n738j0429o996l332j842m634Q03J489
$$ 1970 3046 1894 14048 18443 20892 19007 17567 11829 1400 -5596 -8928 -10770 -15404 -14601 -13112
6499a3112J3314J396N004J05r490j1328L888L96P015Q029R972L034q5q821p252
$$ -13112 202 1598 6602 6707 -2783 -14111 -10223 -9827 -2812 5217 15189 18223 18138 9317 2065
6484B065n154o087j829m089J227Q177N308M449r321q069J813M728M937m594N028
$$ 2065 -3089 -9176 -11005 -15094 -13867 -5690 -382 4067 -5254 -13323 -11510 -6782 -1845 -6439 -1411
6469a411R449o435m580K595L497r43j4707L146P126k22P3J376Q673j86K777r243
$$ -1411 8038 1603 -2977 -382 3115 2172 -12535 -9389 -2263 -2485 -2412 -1036 7637 7451 10228 985
6453I85j6371m145p631N881J0674L857m946o284J67R431K870K531j055k385L136
$$ 985 -15386 -19531 -27162 -21281 -10607 -6750 -11696 -17980 -17813 -8382 -5512 -2981 -4036 -6421 -3285
6438c285m004J839L930P020L232o337N328n300m023R820L587r445J352n773q057
$$ -3285 -7289 -5450 -1520 5500 8732 2395 7723 2423 -1600 8220 11807 2362 3714 -2059 -10116
6423a0116O102Q416p69m640n162j016J0660J3023q10j2900o411K491q798n82l786
$$ -10116 -4014 4402 3633 -1007 -6169 -7185 3475 16498 15688 2788 -3623 -1132 -9930 -10512 -14298
6408a4298m650O499M128j469j702K427l782r8N16j211J860k442J350m33L126J2779
$$ -14298 -18948 -12449 -8321 -9790 -11492 -9065 -12847 -12945 -12429 -13640 -11780 -14222 -12872 -13305 -10179 2600
6392B600n94p383o445j042j529L754l084N377J3191m433K420M693o380L351j3400
$$ 2600 2006 -5377 -11822 -12864 -14393 -10639 -13723 -8346 4845 412 2832 7525 1145 4496 -8904
6377h904k943J487R282R36o078o703Q97R147p414k749l764K759L398l023N44J839
$$ -8904 -11847 -10360 -1078 -142 -6220 -12923 -12026 -2879 -10293 -13042 -16806 -14047 -10649 -13672 -13128 -11289
6361a1289j93p36L295k176K483L154J045Q146p122m808Q654l339o107O460J6837
$$ -11289 -11482 -12218 -8923 -11099 -8616 -5462 -4417 3729 -3393 -8201 453 -2886 -8993 -2533 14304
6346A4304O516p70l434k133j791p460j2519l182m750m609K691J0492Q555k810
$$ 14304 20820 20050 16616 14483 12692 5232 -7287 -10469 -15219 -19828 -17137 -6645 1910 -900
6332i00p947r98O230J456l181l179p009n506M398N637j259r90J574m315M388P390
$$ -900 -8847 -9845 -3615 -2159 -5340 -8519 -15528 -21034 -16636 -10999 -12258 -13248 -11674 -15989 -11601 -4211
6316d211O441K086j052N9K224l337j2341j333m815Q493J5711m108j929O925K766
$$ -4211 2230 4316 3264 3323 5547 2210 -10131 -11464 -16279 -7786 7925 3817 1888 8813 11579
6301A1579q419q732n604M743J184L099j204k517j777j352Q393M327m573k678K685
$$ 11579 3160 -5572 -11176 -6433 -5249 -2150 -3354 -5871 -7648 -9000 -607 3720 -853 -3531 -846
6286h46j562K232J345k984K105J0642l096o545L597l731K094K956r053j1507K466
$$ -846 -2408 -176 1169 -1815 290 10932 7836 1291 4888 1157 3251 6207 -2846 -14353 -11887
6271a1887O841L604K701N503k749p350k107o859q573J0104R075l738J185j96K382
$$ -11887 -5046 -1442 1259 6762 4013 -3337 -5444 -12303 -20876 -10772 -1697 -5435 -4250 -4446 -2064
6256b064j740l367K360N802n327K717Q175q655j3036k185L368O28K148l393N369
$$ -2064 -3804 -7171 -4811 991 -4336 -1619 6556 -2099 -15135 -17320 -13952 -13324 -11176 -14569 -9200
6241i200J0025k070J94M90l136l524J589J497O068N380l276p09n046o992o677
$$ -9200 825 -1245 -1051 -561 -3697 -7221 -5632 -4135 1933 7313 4037 3328 -1718 -8710 -15387
6226a5387j133M593J222q625o229N083N855Q261O962Q905l158o104j780P074j668
$$ -15387 -16520 -11927 -10705 -19330 -25559 -20476 -14621 -6360 602 9507 6349 245 -1535 5539 3871
6211C871j1535p018O716O071j125N770K195o031o361k799J0003J014l07p330K872
$$ 3871 -7664 -14682 -7966 -1895 -3020 2750 4945 -1086 -7447 -10246 -243 771 464 -6866 -3994
6196c994Q115o940q740P239R402l099o252k413N89J0061j544J411j1249m970J16
$$ -3994 4121 -2819 -11559 -4320 5082 1983 -4269 -6682 -6093 3968 2424 3835 -7414 -12384 -12268
6181a2268M475R684j403p964k082j407L107j418Q141K251k626L292M810j0384
$$ -12268 -7793 1891 488 -7476 -9558 -10965 -7858 -9276 -1135 1116 -1510 1782 6592 -3792
6167c792k464j446j525j529L999m379j839N860L203L532k477n967r7P213M659
$$ -3792 -6256 -7702 -9227 -10756 -6757 -11136 -12975 -7115 -3912 -380 -2857 -8824 -8921 -1708 2951
6152B951n78n472J97n543p430M24K931n121M980Q132J498O803n316n424M232l268
$$ 2951 2373 -3099 -2902 -8445 -15875 -15451 -12520 -17641 -12661 -4529 -3031 3772 -1544 -6968 -2736 -6004
6136f004N890K205m508r058P98P915o82J395L770J1549p679l267K70m891M917
$$ -6004 -114 2091 -2417 -11475 -10677 -2762 -3444 -2049 1721 13270 5591 2324 2594 -2297 2620
6121B620P480j503N249q768p073M593M885k296j0070r898O53l685Q837Q180J357
$$ 2620 10100 8597 13846 5078 -1995 2598 7483 5187 -4883 -14781 -14128 -17813 -8976 -796 561
6106E61j289q690k645N588L761L406q544l272O090P673P065N315r811n417N783
$$ 561 -728 -9418 -12063 -6475 -2714 692 -7852 -11124 -5034 2639 9704 15019 5208 -209 5574
6091E574k983r595J40J3563J0181m357l63l290n341k62j238j858j6582N98N183
$$ 5574 2591 -7004 -6864 6699 16880 12523 12160 8870 3529 3267 2029 171 -16411 -15813 -10630
6076a0630l67p895P697L881o652Q433Q76n631o764K245r335M695J3921N489M542
$$ -10630 -10997 -18892 -11195 -7314 -13966 -5533 -4657 -10288 -17052 -14807 -24142 -19447 -5526 -37 4505
6061D505O903P82j292j1897j4890r081P70J2393j614l396O350L927q908K77L114
$$ 4505 11408 12190 10898 -999 -15889 -24970 -24200 -11807 -13421 -16817 -10467 -6540 -15448 -15171 -12057
6046a2057Q653l767k688J1321l651J432j545l778P766K799o802o650p815RP028
$$ -12057 -3404 -7171 -9859 1462 -2189 -757 -2302 -6080 1686 4485 -2317 -8967 -16782 -16773 -9745
6031i745q37l86J4202R189k267j1813j0865L822j012O447M688O210l819j2850
$$ -9745 -10582 -10968 3234 12423 10156 -1657 -12522 -8700 -9712 -3265 1423 7633 3814 -9036
6017i036r727R41P023j285p92J2002j043q967m195O288j267K168L611k632n173
$$ -9036 -18763 -17822 -10799 -12084 -12876 -874 -1917 -10884 -15079 -8791 -10058 -7890 -4279 -6911 -12084
6002a2084M12q69J704K842n553N116K666o258N532L753J767L377J857N844l270
$$ -12084 -11672 -12541 -10837 -7995 -13548 -8432 -5766 -12024 -6492 -2739 -972 2405 4262 10106 6836
5987F836j0964J980K094l961k068n72J906l893m184J1409P708l820p519j1754
$$ 6836 -4128 -2148 -54 -4015 -6083 -6655 -4749 -8642 -12826 -1417 6291 2471 -5048 -16802
5973a6802K606M084j1966K584K418J825l164N136L369O219K119j078J617k346
$$ -16802 -14196 -10112 -22078 -19494 -17076 -15251 -18415 -13279 -9910 -3691 -1572 -2650 -1033 -3379
5959c379k821k515K540J619L377J889J0663K839p849k195l120k583j634%n856
$$ -3379 -6200 -8715 -6175 -4556 -1179 710 11373 14212 6363 4168 1048 -1535 -3169 -3169 -9025
5944i025m658N110J2262l091n398K545p68l160n19m656r95O22M459M394K802N0
$$ -9025 -13683 -8573 3689 598 -4800 -2255 -3023 -6183 -6702 -11358 -12353 -11731 -7272 -2878 -76 -26
5928b6m513q160p41O370L640q232o462K512K371J685O507J837l205J108M14P328
$$ -26 -4539 -12699 -13440 -7070 -3430 -11662 -18124 -15612 -13241 -11556 -5049 -3212 -6417 -5309 -4895 2433
5912B433O719q61k987m558k39l168p972R62j459P162p69j0295Q963k962N837K735
$$ 2433 9152 8291 5304 746 507 -2661 -10633 -9671 -11130 -3968 -4737 -15032 -6069 -9031 -3194 -459
5896d59o272j0518N485P281O174o11n239N566L669o392j748K049k096K95P118
$$ -459 -6731 -17249 -11764 -4483 1691 1080 -4159 1407 5076 -1316 -3064 -1015 -3111 -2816 4302
5881D302l86l044k391L172L159J659p754q340P67M594m406L126k473o72O574N107
$$ 4302 3916 872 -1519 1653 4812 6471 -1283 -9623 -8856 -4262 -8668 -5542 -8015 -8687 -2113 2994
5865B994l23J3557m260p212N581l266j0640Q99N005K2r023k63qn427j276o27K62
$$ 2994 2671 16228 11968 4756 10337 7071 -3569 -2670 2335 2357 -6666 -6929 -6937 -12364 -13640 -14267 -14005
5848a4005M611J1429K460j2512K415J330n921q01m439J0209k795P849P641J615
$$ -14005 -9394 2035 4495 -8017 -5602 -4272 -10193 -10994 -15433 -5224 -8019 -170 7471 9086
5834I086k395m960m006J400K174J743l124Q465J64k034j1213o770L420J494J332
$$ 9086 6691 1731 -2275 -875 1299 3042 -82 8383 8547 6513 -4700 -11470 -8050 -6556 -5224
5819e224N910O065k967k877k610N22K755k929Q675N686K07j0447n145Q915J044
$$ -5224 686 6751 3784 907 -1703 -1181 1574 -1355 7320 13006 13213 2766 -2379 6536 7580
5804G580m695j510K998L053O22p063o233L191M389N642k408l045l204q37m265
$$ 7580 2885 1375 4373 7426 8048 985 -5248 -2057 2332 7974 5566 2521 -683 -1520 -5785
5789e785k122K162l329J0205K947k286P102Q76j0803q191J396Q156M862j0134
$$ -5785 -7907 -5745 -9074 1131 4078 1792 8894 9770 -1033 -9224 -7828 328 5190 -4944
5775d944m351O76o389j433K672m332Q40M621K69n696m41J797M53M528R180O320
$$ -4944 -9295 -8619 -15008 -16441 -13769 -18101 -17261 -12640 -12371 -18067 -18508 -16711 -16258 -11730 -2550 3770
5759C770m182l997o676o772N727R045R020P034m600p169r971L718j866r536m047
$$ 3770 -412 -4409 -11085 -17857 -12130 -3085 5935 12969 8369 1200 -8771 -5053 -6919 -16455 -20502
5744b0502J849N402N383M814J774l334o107N165Q966R640L853j369p111p046k950
$$ -20502 -18653 -13251 -7868 -3054 -1280 -4614 -10721 -5556 3410 13050 16903 15534 8423 1377 -1573
5729a573j063M481P468j07r698K718P179J272J631l215m079L00n371j61J790p883
$$ -1573 -2636 1845 9313 9206 -492 2226 9405 10677 12308 9093 5014 5314 -57 -218 1572 -6311
5713f311r821K018Q843K490J14n818P11N119k127q835l957R587J5485m310j0814
$$ -6311 -16132 -14114 -5271 -2781 -2667 -8485 -7774 -2655 -4782 -13617 -17574 -7987 7498 3188 -7626
5698g626m432P844J596k249q215l159o335O10J578L023O278K821P455n64j731
$$ -7626 -12058 -4214 -2618 -4867 -13082 -16241 -22576 -21966 -20388 -17365 -11087 -8266 -811 -1375 -3106
5683c106J321j931j4910l174J2283l07M174O988o32J857l264l162j635p90k97
$$ -3106 -1785 -3716 -18626 -21800 -9517 -9824 -5650 1338 706 2563 -701 -3863 -5498 -6288 -6585
5668f585m587q760O306J1740P51p207j486L739k569O680J6128P841l135j1296
$$ -6585 -11172 -19932 -13626 -1886 -1135 -8342 -9828 -6089 -8658 -1978 14150 21991 18856 7560
5654G560o917j026l938n55M501L381j882n820j077K94o840q92m325N53J0618J1628
$$ 7560 643 -383 -4321 -4876 -375 3006 1124 -4696 -5773 -5479 -12319 -13211 -17536 -16983 -6365 5263
5638E263J577l311j892L86P724K908m360m263m290p786L833J102M784Q12q157
$$ 5263 6840 3529 1637 2023 9747 12655 8295 4032 -258 -8044 -4211 -3109 1675 2487 -5670
5623e670O201N165O315K939n662p391k542L61M671k484m923L224j488j000L215
$$ -5670 531 5696 12011 14950 9288 1897 -645 -284 4387 1903 -3020 204 -1284 -2284 931
5608I31m080M735P688l014m242p287m911O265M36n242Q409k170j542J2340L396
$$ 931 -3149 1586 9274 6260 2018 -5269 -10180 -3915 -3479 -8721 -312 -2482 -4024 8316 11712
5593A1712q551n835J567K229M183L174l278n214o973O850l089m987m019R524j912
$$ 11712 3161 -2674 -1107 1122 5305 8479 5201 -13 -6986 -136 -3225 -8212 -12231 -2707 -4619
5578d619J431O399k953j982O640N463k766o747N815N971q59k856o504j1993J053
$$ -4619 -3188 3211 258 -1724 4916 10379 7613 866 6681 12652 11793 8937 2433 -9560 -8507
5563h507m441m571K048k051l773L812K527N985J5091K844j024l426l220k401j774
$$ -8507 -12948 -17519 -15471 -17522 -21295 -17483 -14956 -8971 6120 8964 7940 4514 1294 -1107 -2881
5548b881q7m554M167M842J596j0144j194J2446l510q467P682L053J1334o978j4948
$$ -2881 -2968 -7522 -3355 1487 3083 -7061 -8255 4191 681 -7786 -104 2949 14283 7305 -7643
5533g643r616J459M480J0889j517Q571L01o456J599L497L026k950K131N110l43
$$ -7643 -17259 -15800 -11320 -431 -1948 6623 6924 468 2067 5564 8590 5640 7771 12881 12538
5518A2538J316m030k274m462j139k462l604J437N588P955j027k870l958o452m342
$$ 12538 13854 9824 7550 3088 1949 -513 -4117 -2680 2908 10863 9836 6966 3008 -3444 -7786
5503g786O158M829M458l389j0382k107J2758P26p199l943L761O454k471O8J4362
$$ -7786 -1628 3201 7659 4270 -6112 -8219 4539 5265 -1934 -5877 -2116 4338 1867 1935 16297
5488A6297R713j8926j1513n607q294R449P117l597p961J774k405N958Q957M885
$$ 16297 26010 7084 -4429 -10036 -18330 -8881 -1764 -5361 -13322 -11548 -13953 -7995 962 5847
5474E847m352J220j543M367q37n114o202l633J148m358Q20l831n945Q544M477
$$ 5847 1495 2715 1172 5539 4702 -412 -6614 -10247 -9099 -13457 -12637 -16468 -22413 -13869 -9392
5459i392M757Q496p358j378o057O204P764J5M022Q21p699L762L465Q92m251j7640
$$ -9392 -4635 3861 -3497 -4875 -10932 -4728 3036 3051 7073 7894 195 3957 7422 8314 4063 -13577
5443a3577m473J3080k309K998Q05K374J644n431P298M071k454k395n158k26L848
$$ -13577 -18050 -4970 -7279 -4281 -3476 -1102 542 -4889 2409 6480 4026 1631 -3527 -3753 95
5428I5P253R28Q2J139k898j1174m804P918M032p85M66m707J79k389o075K718O11
$$ 95 7348 8276 8358 9497 6599 -4575 -9379 -1461 2571 1786 2252 -2455 -2276 -4665 -10740 -8022 -7411
5411g411M07j874j0428q191m245P283M766o934j664O022J7751Q436j336K36P242
$$ -7411 -7004 -8878 -19306 -27497 -31742 -24459 -19693 -26627 -28291 -22269 -4518 3918 2582 2818 10060
5396A0060N337k748m381r750l128Q98J941j0749l24L080k364M423R97l999O49
$$ 10060 15397 12649 8268 -1482 -4610 -3712 -1771 -12520 -12844 -9764 -12128 -7705 -6708 -10707 -10058
5381a0058O137J0927r518r677Q048O367j366r483j1790k275J2165k360R0k395
$$ -10058 -3921 7006 -2512 -12189 -4141 2226 860 -8623 -20413 -22688 -10523 -12883 -12793 -15188
5367a5188P38m981N63P228Q763K371k135j750J915R986P158K291m501l193k28
$$ -15188 -14450 -19431 -18868 -11640 -2877 -506 -2641 -4391 -2476 7510 14668 16959 12458 9265 9037
5352I037K789k839j82p569j3969N049K640N762j939K163J361P628J219M025L204
$$ 9037 11826 8987 8805 1236 -12733 -7684 -5044 718 -1221 942 2303 9931 11150 15175 18379
5337A8379J149q789p330p792m592K578m1K01K463M387q197P523M074j290j592
$$ 18379 19528 10739 3409 -4383 -8975 -6397 -6438 -6237 -3774 613 -7584 -61 4013 2723 1131
5322A131k110q188n981Q179k93N41K769p039l913K970Q978M921R81L721n061k623
$$ 1131 -979 -9167 -15148 -6969 -7262 -6721 -3952 -10991 -14904 -11934 -2956 1965 2946 6667 1606 -1017
5306a017K815o572k507Q125J6823P225l087J570q236j5471o618M249m42K967P586
$$ -1017 1798 -4774 -7281 844 17667 24892 21805 23375 15139 -332 -6950 -2701 -3143 -176 7410
5291G410J451n608j0626R31j016m551j525K348R313O736k286j1653l820M91j173
$$ 7410 8861 3253 -7373 -6442 -7458 -12009 -13534 -11186 -1873 4863 2577 -9076 -12896 -12405 -13578
5276a3578L432M638Q879l386r611Q870K040q071L147J815j0357n629J1682P396
$$ -13578 -10146 -5508 3371 -15 -9626 -756 1284 -6787 -3640 -1825 -12182 -17811 -6129 1267
5262A267j940R26q375j769P885N30O564k55m532L420P652M410l825m87j0065L421
$$ 1267 -673 253 -8122 -9891 -2006 -1476 5088 4833 301 3721 11373 15783 11958 11471 1406 4827
5246D827n403k925M520k040M845o13k139O405Q30o717N565j16l304k798m492m161
$$ 4827 -576 -3501 1019 -1021 3824 3211 1072 7477 8307 1590 7155 7039 3735 937 -3555 -7716
5230g716L091R277J443o330m713M89k629P432M274N62l787M471O829q309p765
$$ -7716 -4625 4652 6095 -235 -4948 -4459 -7088 344 4618 5180 1393 5864 12693 4384 -3381
5215c381J412K297l02p629L828k673j789P275Q874m379N41n354j869m456r99J63
$$ -3381 -1969 328 26 -7603 -3775 -6448 -8237 -962 7912 3533 4074 -1280 -3149 -7605 -8604 -8441
5199h441j416l704P5P625J864l526k163K284j4j3656M026J1618l504J596J0353
$$ -8441 -9857 -13561 -13486 -5861 -3997 -7523 -9686 -7402 -7416 -21072 -17046 -5428 -8932 -7336 3017
5184C017K880l290O520K978k253o076P07m49o618l860P762J141K447j698l803
$$ 3017 5897 2607 9127 12105 9852 3776 4483 4034 -2584 -6444 1318 2459 4906 3208 -595
5169e95p927J469R64L364j801j0367q584Q886P249n44p09PK093M903m59n270k487
$$ -595 -8522 -7053 -6089 -2725 -4526 -14893 -23477 -14591 -7342 -7886 -8595 -8588 -6495 -1592 -2051 -7321 -9808
5152i808j3973m765M857P919O882N185m06Q115O460q351j918J0521J524m595n989
$$ -9808 -23781 -28546 -23689 -15770 -8888 -3703 -4109 4006 10466 2115 197 10718 12242 7647 1658
5137A658l655O24J853k944J582p49L132l42o616m967K308L785Q756L03n414n069
$$ 1658 -1997 -1373 480 -2464 -882 -1631 1501 1159 -5457 -10424 -8116 -4331 4425 4728 -686 -5755
5121e755J695M033j1703o939P218J1355O101n304L555k678r213l233N435J780
$$ -5755 -4060 -27 -11730 -18669 -11451 -96 6005 701 4256 1578 -7635 -10868 -5433 -3653
5107c653L951j160o02Q446J236L066O051o263K759l577j2500r242K94L44l866
$$ -3653 298 -862 -1464 6982 8218 11284 17335 11072 13831 10254 -2246 -11488 -11194 -10850 -14716
5092a4716L773O464L137O35m746r273P321M939m851r936j364M459K756K592K397
$$ -14716 -10943 -4479 -1342 -707 -5453 -14726 -7405 -2466 -7317 -17253 -18617 -14158 -11402 -8810 -6413
5077f413n618M865K454j0639P69M120L131Q32N144n553M644J283l376K74j371
$$ -6413 -12031 -7166 -4712 -15351 -14582 -10462 -7331 -6499 -1355 -6908 -2264 -981 -4357 -4083 -5454
5062e454q676o570L524L111P233p28o089K132L050k148k803l642l69L848Q567
$$ -5454 -14130 -20700 -17176 -14065 -6832 -7560 -13649 -11517 -8467 -10615 -13418 -17060 -17429 -13581 -5014
5047e014J719M792m47m930k692m281r948L498O225M340o998q233J3006M291k68
$$ -5014 -3295 1497 1050 -3880 -6572 -10853 -20801 -17303 -11078 -6738 -13736 -21969 -8963 -4672 -4940
5032d940J640j309J721j439k040M273j050r348J2677N445k773j554j2543k240
$$ -4940 -3300 -4609 -2888 -4327 -6367 -2094 -3144 -12492 185 5630 2857 1303 -11240 -13480
5018a3480N85j223n310K503K939M77J1084M298j544J310K082K413k028k779o017
$$ -13480 -12895 -14118 -19428 -16925 -13986 -13509 -2425 1873 329 1639 3721 6134 4106 1327 -4690
5003d690M871L118k848p02o490p684Q495R337O809l153r124Q88K925K376m949
$$ -4690 181 3299 451 -251 -6741 -14425 -5930 3407 10216 7063 -2061 -1173 1752 4128 -821
4988h21K828L224J07k14j961j3905j61R58N281J0787L011m228r279k0200n462
$$ -821 2007 5231 5338 5124 3163 -10742 -10903 -9945 -4664 6123 9134 4906 -4373 -24573 -30035
4973c0035J2534K754m851R39N594K469J1793j367o808J6527Q647j1665r488k819
$$ -30035 -17501 -14747 -19598 -18659 -13065 -10596 1197 -170 -6978 9549 18196 6531 -2957 -5776
4959e776n664N321L255R0o001K281q660n58N615R534M404j0834k5085kJ4887J1522
$$ -5776 -11440 -6119 -2864 -2774 -8775 -6494 -15154 -15712 -10097 -563 3841 -6993 -32078 -32080 -17193 -5671
4943e671J1520J096p536r922m056P099J2179L310j534j2938k796k481L152Q859
$$ -5671 5849 6945 -591 -10513 -14569 -7470 4709 8019 6485 -6453 -9249 -11730 -8578 281
4929B81N313k672J294O427k030j911o159o725j48N922K498k431N261j772R38m984
$$ 281 5594 2922 4216 10643 8613 6702 543 -6182 -6330 -408 2090 -341 4920 3148 4086 -898
4913h98l722J575j408O775L295Q799n397p121K450J9m847m113j072j63l008P17
$$ -898 -4620 -3045 -4453 2322 5617 14416 9019 1898 4348 4367 -480 -4593 -5665 -5828 -8836 -8119
4897h119P089M636q318p822q36J1760L980R43R59n970l196O253J289j684m803
$$ -8119 -1030 3606 -4712 -12534 -13370 -1610 2370 3313 4272 -1698 -4894 1359 2648 964 -3839
4882c839L611Q368n514J671P80P08M182j763m49p664p726r193J257J6034O872
$$ -3839 -228 8140 2626 4297 5077 5785 9967 8204 7755 91 -7635 -16828 -15571 463 7335
4867G335L813J87q573k684N740J69K452K191r777m396N249n114q506N03O727N477
$$ 7335 11148 11335 2762 78 5818 5987 8439 10630 853 -3543 1706 -3408 -11914 -11411 -4684 793
4851G93O330j759n045j1364R667J0965R87n582q570k831N950K910k292p125r716
$$ 793 7123 5364 319 -11045 -1378 9587 10574 4992 -3578 -6409 -459 2451 159 -6966 -16682
4836a6682M908J0991m202o044M038K006J943o72m523k470o741K505J1481J490
$$ -16682 -11774 -783 -4985 -11029 -6991 -4985 -3042 -3714 -8237 -10707 -17448 -14943 -3462 -1972
4822a972k187j937J0804M706m446J969J513q406M50N205N267j744j731l262l507
$$ -1972 -4159 -6096 4708 9414 4968 6937 8450 44 494 5699 10966 9222 7491 4229 722
4807G22r21j1439N662j178n932N945O275J436J206j040j000M694O172O097l881
$$ 722 -199 -11638 -5976 -7154 -13086 -7141 -866 570 1776 736 -264 4430 10602 16699 12818
4792A2818m769J264L036P72j0608o407p126J714k177L694L130Q645N017K585l976
$$ 12818 8049 9313 12349 13121 2513 -3894 -11020 -9306 -11483 -7789 -4659 3986 9003 11588 7612
4777G612r115j936K442j178m884M204j274J1687L255K192q04k322J25j416r40
$$ 7612 -1503 -3439 -997 -2175 -7059 -2855 -4129 7558 10813 13005 12201 9879 10004 8588 7648
4762G648j1542o062K30J01K094l843N962l17m102p321l988J833L499p141j457
$$ 7648 -3894 -9956 -9726 -9625 -7531 -11374 -5412 -5729 -9831 -17152 -21140 -19307 -15808 -22949 -24406
4747b4406Q791O609O007N749L612r364o355N88R26p693J266L604L065M839J798
$$ -24406 -15615 -9006 -2999 2750 6362 -3002 -9357 -8769 -7843 -15536 -14270 -10666 -7601 -2762 -964
4732i64m155j608L485M303l774l742J0621p958j2033J2068R409j735o75j343j884
$$ -964 -5119 -6727 -3242 1061 -2713 -6455 4166 -3792 -15825 -3757 5652 3917 3242 1899 15
4717A5m981J418Q209r05l111K586O19K410R18P60j930m629Q570k028r2m157j3335
$$ 15 -4966 -3548 4661 3756 645 3231 3850 6260 7178 7938 6008 1379 9949 7921 7829 3672 -9663
4700i663K713J4969M456M768q845n279n384j2113k075P289J2813l279K39P90q828
$$ -9663 -6950 8019 12475 17243 8398 3119 -2265 -14378 -16453 -9164 3649 370 609 1399 -7429
4685g429J562k364k427Q218N880j0148j9092J987J3013N778o422m904R624L383
$$ -7429 -5867 -8231 -10658 -2440 3440 -6708 -25800 -23813 -10800 -5022 -11444 -16348 -6724 -3341
4671c341n213P664J30k736q544k603Q396R228J139j0438p102J222K175j540j033
$$ -3341 -8554 -890 -760 -3496 -12040 -14643 -6247 2981 4120 -6318 -13420 -12198 -10023 -11563 -12596
4656a2596j364R206J0742O656j2261j2525J215J00q034P916J4436J728q424q305
$$ -12596 -13960 -4754 5988 12644 383 -12142 -10927 -10827 -18861 -10945 3491 5219 -3205 -11510
4642a1510l887P033O700J065p276m139P048N327R141j011k102q007j045J725k222
$$ -11510 -15397 -8364 -1664 -599 -7875 -12014 -4966 361 9502 8491 6389 -1618 -2663 -938 -3160
4627c160K262k996J606l569L198N211l855k802J997L02K409L508Q423K777q405
$$ -3160 -898 -3894 -2288 -5857 -2659 2552 -1303 -4105 -2108 -1806 603 4111 12534 15311 6906
4612F906j0687o250K581O019J2972R685K245o945j792Q18p97n869j1447j0227
$$ 6906 -3781 -10031 -7450 -1431 11541 21226 23471 16526 14734 15552 14755 8886 -2561 -12788
4598a2788l523R514K116O867O241l604o322K672P79l781k710J819K860J1204N52
$$ -12788 -16311 -6797 -4681 2186 8427 4823 -1499 1173 1952 -1829 -4539 -2720 140 11344 11896
4583A1896n263n343k275n779L8O394L969k818K23K763K764J688l399K731L981
$$ 11896 6633 1290 -985 -6764 -6726 -332 3637 819 1042 3805 6569 8257 4858 7589 11570
4568A1570j0277Q1r538l866K604L821o521k576O726J5772K09K099p199o1L176
$$ 11570 1293 1374 -8164 -12030 -9426 -5605 -12126 -14702 -7976 7796 8005 10104 2905 2844 6020
4553F020n7j937N913k545q877p162K540N4O748p499p312N410N953n219L236j0023
$$ 6020 5963 4026 9939 7394 -1483 -8645 -6105 -6051 697 -6802 -14114 -8704 -2751 -7970 -4734 -14757
4537a4757l81N366j343Q520Q677J1039m252j3501j3167k45j486R851k440m121
$$ -14757 -15138 -9772 -11115 -2595 6082 17121 12869 -632 -13799 -14044 -15530 -5679 -8119 -12240
4523a2240n845l8J1573K064r16j0695J427p34Q32k587p926N686L808L663k614
$$ -12240 -18085 -18123 -6550 -4486 -5402 -16097 -14670 -15404 -14572 -17159 -25085 -19399 -15591 -11928 -14542
4508a4542l491K202K420J773Q433N541O635N043n940M48k602L587l691m361J621
$$ -14542 -18033 -15831 -13411 -11638 -3205 2336 8971 14014 8074 8522 5920 9507 5816 1455 3076
4493C076k2r144p798m510J0747O205L288L604J913j1000j047J1673Q94m585P493
$$ 3076 3054 -6090 -13888 -18398 -7651 -1446 1842 5446 7359 -3641 -4688 6985 7879 3294 10787
4478A0787J246l360j075K873l45J381j630J858j907k257l169j503M974m798J629
$$ 10787 12033 8673 7598 10471 10126 11507 9877 11735 9828 7571 4402 2899 7873 3075 4704
4463D704K649l387m881K33K180Q176o861j4577m276j817M007O939R313J403K241
$$ 4704 7353 3966 -915 -682 1498 9674 2813 -11764 -16040 -17857 -13850 -6911 2402 3805 6046
4448F046p39k383o301L831k099o258K901L119M263n172K007P172o292q08l294
$$ 6046 5307 2924 -3377 454 -1645 -7903 -5002 -1883 2380 -2792 -785 6387 95 -713 -4007
4433d007k068l166J087j282m03N030J0826J94l626k802m235j2067n877O290k80
$$ -4007 -6075 -9241 -8154 -9436 -9839 -4809 6017 6211 2585 -217 -4452 -16519 -22396 -16106 -16386
4418a6386M33K959r77K948J911Q847O929m344n904l75k489L838M881o060r20M819
$$ -16386 -15953 -12994 -13971 -11023 -9112 -265 6664 2320 -3584 -3959 -6448 -2610 2271 -3789 -4709 110
4402A10k505J416o129R248M118L122q230j3133K942L726P249m66m934N328N3K285
$$ 110 -2395 -979 -7108 2140 6258 9380 1150 -11983 -9041 -5315 1934 1468 -3466 1862 1915 4200
4386D200O12R22l47o909j623J7544m542j4241k60k295P214J580k604J908j1720
$$ 4200 4812 5734 5387 -1522 -3145 14399 9857 -4384 -4644 -6939 275 1855 -749 1159 -10561
4371a0561L556P677q95j427p508n61P995j0376k417m142j4320L341J5438J066
$$ -10561 -7005 672 -223 -1650 -9158 -9719 -1724 -12100 -14517 -18659 -32979 -29638 -14200 -13134
4357a3134N412L859k276M302l55R70O626k581K018K875j495q434L40l930o658
$$ -13134 -7722 -3863 -6139 -1837 -2192 -1222 5404 2823 4841 7716 6221 -2213 -1873 -5803 -12461
4342a2461J1180Q75m075R707n79m875M842R04j7903q388K964J0735M050L478l315
$$ -12461 -1281 -406 -4481 5226 4647 -228 4614 5518 -12385 -20773 -17809 -7074 -3024 454 -2861
4327b861N996Q50m503j960p91N446j82l472O576j011l456M439P895J1596k424
$$ -2861 3135 3985 -518 -2478 -3269 2177 1995 -1477 5099 4088 632 5071 12966 24562 22138
4312B2138n732k883k273j9r00K409k790q02n436l090p09l10P813K851k326r659
$$ 22138 16406 13523 11250 11231 10331 12740 9950 9148 3712 622 -87 -397 7416 10267 7941 -1718
4296a718k878K426l534P226M323l067L831n671n79m86Q134n178j49M940n975j3710
$$ -1718 -4596 -2170 -5704 1522 5845 2778 6609 938 359 -127 8007 2829 2680 7620 1645 -12065
4280a2065l103j917P541O228l422O705m597j0069l04r620L332K0259J555m846
$$ -12065 -15168 -17085 -9544 -3316 -6738 -33 -4630 -14699 -15003 -24623 -21291 -1032 523 -4323
4266d323p683o945O540o347p812M954N868Q303p66Q413Q054l815L95K105l07R75
$$ -4323 -12006 -18951 -12411 -18758 -26570 -21616 -15748 -7445 -8211 202 8256 4441 4836 6941 6634 7609
4250G609j32k406n123j316L580r31k05k274J0990K410j684q765o452j0525j0476
$$ 7609 7477 5071 -52 -1368 2212 1281 1076 -1198 9792 12202 10518 1753 -4699 -15224 -25700
4235b5700o539L162J4240P133p990K482O085Q407Q048l785N3k560J259q75j619
$$ -25700 -32239 -29077 -14837 -7704 -15694 -13212 -7127 1280 9328 5543 5596 3036 4295 3420 1801
4220A801J2341O663p196K439k504o458m282M671M645Q040K10o945n863n956m041
$$ 1801 14142 20805 13609 16048 13544 7086 2804 7475 12120 20160 20370 13425 7562 1606 -2435
4205b435M671o614P67L988J615J200j483j1615k568K14o98K919M796O240o724
$$ -2435 2236 -4378 -3611 377 1992 3192 1709 -9906 -12474 -12260 -12958 -10039 -5243 997 -5727
4190e727N054M484K9R74J098l486m929q400Q85O342q63r2k511l633P47Q045J826
$$ -5727 -673 3811 3840 4814 5912 2426 -2503 -10903 -10018 -3676 -4539 -4631 -7142 -10775 -10028 -1983 -157
4173a57J309l837L145j018j1435p313o05p21O598J3796N989o792p076N993R501
$$ -157 1152 -2685 460 -558 -11993 -19306 -19911 -20632 -14034 -238 5751 -1041 -8117 -2124 7377
4158G377K442k24m100r47j893n448k320j719M635N608L493L379k267N87K444j6871
$$ 7377 9819 9595 5495 4548 2655 -2793 -5113 -6832 -2197 3411 6904 10283 8016 8603 11047 -5824
4142e824r11J843L003N362R48o564j1659L8k589j200K712M835R552m811q884k476
$$ -5824 -6735 -4892 -1889 3473 4421 -2143 -13802 -13764 -16353 -17553 -14841 -10006 -454 -5265 -14149 -16625
4126a6625O721L412l678P813M726n41O342j636L475K100j0602j1963K246q69j19
$$ -16625 -9904 -6492 -10170 -2357 2369 1828 8170 6534 10009 12109 1507 -10456 -8210 -9079 -9198
4111i198k271L157m771M620J1735K695J19k844o745J613P388L28l117J146m93
$$ -9198 -11469 -8312 -13083 -8463 3272 5967 6086 3242 -3503 -1890 5498 5826 2709 3855 3362
4096C362R38o283q871P531Q285N689q929m174L960l911j574m217J959J3281k280
$$ 3362 4300 -1983 -10854 -3323 4962 10651 1722 -2452 1508 -2403 -3977 -8194 -6235 7046 4766
4081D766J502k599p206l633K763J773l259J658M788Q935m410k573m817J832O253
$$ 4766 6268 3669 -3537 -7170 -4407 -2634 -5893 -4235 553 9488 5078 2505 -2312 -480 5773
4066E773p773m005k130j713J242j717m70J216M037k623q223n00M646M673L5O7
$$ 5773 -2000 -6005 -8135 -9848 -8606 -10323 -10793 -9577 -5540 -8163 -16386 -16886 -12240 -7567 -7532 -7465
4050g465k22R23l737l342K999O299K887k718N87m80q99R354J248n652j1127O925
$$ -7465 -7687 -6764 -10501 -13843 -10844 -4545 -1658 -4376 -3789 -4269 -5168 4186 5434 -218 -11345 -4420
4034d420P507j0780j597J921n952N457j050Q748P964q357j2856m354J635K722
$$ -4420 3087 -7693 -9290 -7369 -13321 -7864 -8914 -166 7798 -559 -13415 -17769 -16134 -13412
4020a3412K284o83O485r13O689R393l2o239l607j788j614p231K797R484k878r060
$$ -13412 -11128 -11811 -5326 -6239 450 9843 9811 3572 -35 -1823 -3437 -10668 -7871 1613 -1265 -10325
4004a0325K443L916Q43P23q256O444P836j1057k776K118O793N920J26m755N55
$$ -10325 -7882 -3966 -3123 -2400 -10656 -4212 3624 -7433 -10209 -8091 -1298 4622 4748 -7 548
3989E48Q603R02R225J1086J682o142M481l313j1423j389l217m90j285L57n281
$$ 548 9151 10053 19278 30364 32046 25904 30385 27072 15649 14260 11043 10553 9268 9625 4344
3974D344p979j168M522M92k414L665k634p370N555n925q527K888R096m681o91
$$ 4344 -3635 -4803 -281 211 -2203 1462 -1172 -8542 -2987 -8912 -17439 -14551 -5455 -10136 -10827
3959a0827J1388L111k512q69j49n495k259Q810R055K175o185j107j1030j630R636
$$ -10827 561 3672 1160 291 142 -5353 -7612 1198 10253 12428 6243 5136 -5894 -7524 2112
3944B112K619m309l727R725m894j2327K500Q709j819j811l185J629O581M26o268
$$ 2112 4731 422 -3305 6420 1526 -10801 -8301 408 -1411 -3222 -6407 -4778 1803 2229 -4039
3929d039p476K468J785L334R58m181K462k187N723M137O486q611j5495N613P709
$$ -4039 -11515 -9047 -7262 -3928 -2970 -7151 -4689 -6876 -1153 2984 9470 859 -14636 -9023 -1314
3914a314J158m632J118K543l620p53m3L817l528P345M018M413K897M92O237j347
$$ -1314 -156 -4788 -3670 -1127 -4747 -5500 -5543 -1726 -5254 2091 6109 10522 13419 13911 20148 18801
3898A8801r65o749l729L858M755m265l711k260N271r65j0759k571J594O46N230
$$ 18801 17836 11087 7358 11216 15971 11706 7995 5735 11006 10041 -718 -3289 -1695 -1049 4181
3883D181k809j634j6847o259q298K177J3970P603J1260j368l414j302K998J283
$$ 4181 1372 -262 -17109 -23368 -31666 -29489 -15519 -7916 3344 1976 -1438 -2740 258 1541
3869A541j0072m952n51J632n475L632n02r114J1079P276J966J2333R111n393r647
$$ 1541 -8531 -13483 -14034 -12402 -17877 -14245 -14747 -23861 -12782 -5506 -3540 8793 17904 12511 2864
3854B864j2032j902k011k940L009j150Q825K354r11k827o299q302O126J5501l258
$$ 2864 -9168 -11070 -13081 -16021 -13012 -14162 -5337 -2983 -3894 -6721 -13020 -21322 -15196 305 -2953
3839b953l710Q042j5508o061J1054o22o170J308l460M821O382O099L570j3582
$$ -2953 -6663 1379 -14129 -20190 -9136 -9758 -15928 -14620 -18080 -13259 -6877 -778 2792 -10790
3825a0790R1J3796r066n311M658P12j0411n66J319N61k852k181J021N424R589
$$ -10790 -10699 3097 -5969 -11280 -6622 -5910 -16321 -16887 -15568 -15007 -17859 -20040 -19019 -13595 -4006
3810d006L359o553j16Q302k980j598Q273O616m565o45k491Q22O652l13j1808k246
$$ -4006 -647 -7200 -7316 986 -1994 -3592 4681 11297 6732 6087 3596 4418 11070 10757 -1051 -3297
3794c297m156n162p680k621R714L759N942l079m098L600J699m076q872M547Q583
$$ -3297 -7453 -12615 -20295 -22916 -13202 -9443 -3501 -6580 -10678 -7078 -5379 -9455 -18327 -13780 -5197
3779e197R114Q770J324n266j257Q11n042l331j192Q185K000o46l158Q99l502K198
$$ -5197 3917 12687 14011 8745 7488 8299 3257 -74 -1266 6919 8919 8273 5115 6014 2512 4710
3763D710m427j515J969j2568r28K294J9690K587J803o255M043p061o426O317L783
$$ 4710 283 -1232 737 -11831 -12759 -10465 9225 11812 13615 7360 11403 4342 -2084 4233 8016
3748H016N053J711K352k431p036l970k077O122j647k864m195r44m473M382K333
$$ 8016 13069 14780 17132 14701 7665 3695 1618 7740 6093 3229 -966 -1910 -6383 -2001 332
3733C32l382K888M110q940L56N640M575j410n382m774K956J710K094n16N52J193
$$ 332 -3050 -162 3948 -4992 -4636 1004 5579 4169 -1213 -5987 -3031 -1321 773 257 809 2002
3717B002n625M341O699R70l289J665p107p634n035Q871M063O657M558N207K454
$$ 2002 -3623 718 7417 8387 5098 6763 -344 -7978 -13013 -4142 -79 6578 11136 16343 18797
3702A8797j6318q378L717K560l135M102P280R640Q097m104j5897r148M783q758
$$ 18797 2479 -5899 -2182 378 -2757 1345 8625 18265 26362 22258 6361 -2787 1996 -6762
3688f762q535R896J308J314M075J718j535p828k049l572m145O421N785P768M993
$$ -6762 -15297 -5401 -4093 -2779 1296 3014 1479 -6349 -8398 -11970 -16115 -9694 -3909 3859 8852
3673H852J735K779q11R90r85m93j782j088J067J516M809j172O14k1609N051J1140
$$ 8852 10587 13366 12555 13545 12560 12067 10285 9197 10264 11780 16589 15417 16031 -5578 -527 10613
3657A0613l549J229l340m814r414N222N939M13m147o127O29k611k13K517J0921
$$ 10613 7064 8293 4953 139 -9275 -4053 1886 2299 -1848 -7975 -7346 -9957 -10170 -7653 3268
$$ [...]
##END NTUPLES=NMR SPECTRUM
##END=
