##TITLE=Analysis number 317576
Compound Code ac 30913
Project Code adrs
Chemist Name acros
##JCAMPDX= 6.0         $$ Bruker NMR JCAMP-DX V2.0
##DATA TYPE= NMR SPECTRUM
##DATA CLASS= NTUPLES
##ORIGIN= Bruker BioSpin GmbH
##OWNER= nmr
$$ XWIN-NMR		Version 3.5
$$ Tue Feb 28 08:10:15 2006 GMT Standard Time (UT+0h)  MAYBRIDGE\nmr@NMR_250MHZ
##.OBSERVE FREQUENCY= 250.131544655141
##.OBSERVE NUCLEUS= ^1H
##.ACQUISITION MODE= SIMULTANEOUS (DQD)
##.ACQUISITION SCHEME= undefined
##.AVERAGES= 16
##.DIGITISER RES= 18
##SPECTROMETER/DATA SYSTEM= dpx250
##.PULSE SEQUENCE= zg30
##.SOLVENT NAME= CDCl3
##.SHIFT REFERENCE= (INTERNAL, CDCl3, 0, 16.522)
##AUDIT TRAIL= $$ (NUMBER, WHEN, WHO, WHERE, WHAT)
$$ ##TITLE= Audit trail, XWIN-NMR		Version 3.5
$$ ##JCAMPDX= 5.01
$$ ##ORIGIN= Bruker BioSpin GmbH
$$ ##OWNER= nmr
$$ C:\u/data/dgb/nmr/ADRS/16940/pdata/1/auditp.txt
$$ ##AUDIT TRAIL=  $$ (NUMBER, WHEN, WHO, WHERE, WHAT)
(   1,<2006-02-28 08:09:42.67 +000>,<MAYBRIDGE\nmr>,<NMR_250MHZ>,
      <created by zg, POWCHK disabled, PULCHK disabled
       configuration hash MD5:
       84 BC 41 DB A1 6E 1D 46 DA 25 12 A5 C1 ED C5 3A
       data hash MD5: 64K
       FA 56 CC E7 18 D9 2F 65 A8 C6 9C B8 57 81 30 E9>)
(   2,<2006-02-28 08:10:01.89 +000>,<MAYBRIDGE\nmr>,<NMR_250MHZ>,
      <Start of raw data processing
       ef LB = 0.3 FT_mod = 6 PKNL = 1 SI = 32K 
       data hash MD5: 32K
       28 A1 74 89 C3 F3 0F E9 6E 46 51 66 01 A9 C9 B7>)
(   3,<2006-02-28 08:10:04.00 +000>,<MAYBRIDGE\nmr>,<NMR_250MHZ>,
      <apk 
       data hash MD5: 32K
       9F 7F 58 47 8E 97 91 0C 44 87 1F 08 2D 4B 40 6B>)
(   4,<2006-02-28 08:10:04.92 +000>,<MAYBRIDGE\nmr>,<NMR_250MHZ>,
      <abs ABSG = 5 
       data hash MD5: 32K
       60 EF BB 44 CF 3F CC EF D7 83 2F 2E D9 E9 36 BA>)
$$ ##END=
$$ 
$$ hash MD5
$$ 9D 01 A8 E6 0B 1A E6 2B 25 D9 88 81 0A 91 9D 25
##$RELAX= 
##$RELAX= 
##$RELAX= 
##$RELAX= 
##$RELAX= 
##$RELAX= 
##$RELAX= 
$$ Bruker specific parameters
$$ --------------------------
##$DU= <C:\u>
##$EXPNO= 16940
##$NAME= <ADRS>
##$PROCNO= 1
##$TYPE= <nmr>
##$USER= <dgb>
##$AMP= (0..31)
100 100 100 100 100 100 100 100 100 100 100 100 100 100 100 100 100 100 
100 100 100 100 100 100 100 100 100 100 100 100 100 100 
##$AQSEQ= 0
##$AQ_mod= 3
##$AUNM= <au_zg>
##$AUTOPOS= <9 >
##$BF1= 250.13
##$BF2= 250.13
##$BF3= 250.13
##$BF4= 250.13
##$BF5= 500.13
##$BF6= 500.13
##$BF7= 500.13
##$BF8= 500.13
##$BYTORDA= 1
##$CFDGTYP= 0
##$CFRGTYP= 5
##$CHEMSTR= <none>
##$CNST= (0..31)
1 1 145 1 1 1 1 1 1 1 1 1 1 1 1 1 1 1 1 1 1 1 1 1 1 1 1 1 1 1 1 1 
##$CPDPRG= <>
##$CPDPRG1= <>
##$CPDPRG2= <>
##$CPDPRG3= <>
##$CPDPRG4= <mlev>
##$CPDPRG5= <mlev>
##$CPDPRG6= <mlev>
##$CPDPRG7= <mlev>
##$CPDPRG8= <mlev>
##$CPDPRGB= <>
##$CPDPRGT= <>
##$D= (0..31)
0 1 0 0 0 0 0 0 0 0.06 0 0 0 0 0 0 0.0002 0 0 0 0 0 0 0 0 0 0 0 0 0 0 
0 
##$DATE= 1141114181
##$DBL= (0..7)
120 120 120 120 120 120 120 120 
##$DBP= (0..7)
150 150 150 150 150 150 150 150 
##$DBP07= 0
##$DBPNAM0= <>
##$DBPNAM1= <>
##$DBPNAM2= <>
$$ [...]
##$SUBNAM7= <"">
##$SUBNAM8= <"">
##$SUBNAM9= <"">
##$SW= 20.6930455092707
##$SWIBOX= (0..15)
0 0 3 0 0 0 0 0 0 0 0 0 0 0 0 0 
##$SW_h= 5175.983436853
##$TD= 65536
##$TD0= 1
##$TE= 293.16
##$TE2= 300
##$TE3= 300
##$TEG= 300
##$TL= (0..7)
0 120 120 120 120 120 120 120 
##$TP= (0..7)
150 150 150 150 150 150 150 150 
##$TP07= 0
##$TPNAME0= <>
##$TPNAME1= <>
##$TPNAME2= <>
##$TPNAME3= <>
##$TPNAME4= <>
##$TPNAME5= <>
##$TPNAME6= <>
##$TPNAME7= <>
##$TPOAL= (0..7)
0.5 0.5 0.5 0.5 0.5 0.5 0.5 0.5 
##$TPOFFS= (0..7)
0 0 0 0 0 0 0 0 
##$TUNHIN= 0
##$TUNHOUT= 0
##$TUNXOUT= 0
##$USERA1= <user>
##$USERA2= <user>
##$USERA3= <user>
##$USERA4= <user>
##$USERA5= <user>
##$V9= 5
##$VALIST= <valist>
##$VCLIST= <CCCCCCCCCCCCCCC>
##$VD= 0
##$VDLIST= <DDDDDDDDDDDDDDD>
##$VPLIST= <PPPPPPPPPPPPPPP>
##$VTLIST= <TTTTTTTTTTTTTTT>
##$WBST= 1024
##$WBSW= 4
##$XGAIN= (0..3)
0 0 0 0 
##$XL= 0
##$YL= 0
##$YMAX_a= 280394
##$YMIN_a= -314994
##$ZGOPTNS= <>
##$ZL1= 120
##$ZL2= 120
##$ZL3= 120
##$ZL4= 120
##$ABSF1= 16.522
##$ABSF2= -4.171173
##$ABSG= 5
##$ABSL= 3
##$ALPHA= 0
##$AQORDER= 0
##$ASSFAC= 0
##$ASSFACI= 0
##$ASSFACX= 0
##$ASSWID= 0
##$AUNMP= <proc_1d>
##$AZFE= 0.1
##$AZFW= 0.1
##$BCFW= 0
##$BC_mod= 0
##$BYTORDP= 0
##$COROFFS= 0
##$CY= 12.5
##$DATMOD= 1
##$DC= 0
##$DFILT= <>
##$DTYPP= 0
##$F1P= 14.0000005364418
##$F2P= -0.99999901652339
##$FCOR= 0.5
##$FTSIZE= 32768
##$FT_mod= 6
##$GAMMA= 0
##$GB= 0
##$INTBC= 1
##$INTSCL= 1
##$ISEN= 128
##$LB= 0.3
##$LEV0= 0
##$LPBIN= 0
##$MAXI= 10000
##$MC2= 0
##$MEAN= 0
##$ME_mod= 0
##$MI= 0
##$NCOEF= 0
##$NC_proc= -4
##$NLEV= 6
##$NOISF1= 0
##$NOISF2= 0
##$NSP= 0
##$NTH_PI= 0
##$NZP= 0
##$OFFSET= 16.522
##$PC= 1
##$PHC0= -109.4058
##$PHC1= 5.424005
##$PH_mod= 1
##$PKNL= yes
##$PPARMOD= 0
##$PSCAL= 4
##$PSIGN= 0
##$REVERSE= no
##$SF= 250.13
##$SI= 32768
##$SIGF1= 0
##$SIGF2= 0
##$SINO= 400
##$SIOLD= 32768
##$SREGLST= <1H.CDCl3>
##$SSB= 0
##$STSI= 32768
##$STSR= 0
##$SW_p= 5175.98343685301
##$SYMM= 0
##$S_DEV= 0
##$TDeff= 65536
##$TDoff= 0
##$TI= <Analysis number 999999
Compound Code 99
Book Reference 9
Project Code 9>
##$TILT= no
##$TM1= 0
##$TM2= 0
##$TOPLEV= 0
##$USERP1= <user>
##$USERP2= <user>
##$USERP3= <user>
##$USERP4= <user>
##$USERP5= <user>
##$WDW= 1
##$XDIM= 32768
##$YMAX_p= 355638654
##$YMIN_p= -695280
$$ End of Bruker specific parameters
$$ ---------------------------------
##NTUPLES= NMR SPECTRUM
##VAR_NAME=  FREQUENCY,     SPECTRUM/REAL,   SPECTRUM/IMAG
##SYMBOL=    X,             R,               I
##VAR_TYPE=  INDEPENDENT,   DEPENDENT,       DEPENDENT
##VAR_FORM=  AFFN,          ASDF,            ASDF
##VAR_DIM=   32768,         32768,           32768
##UNITS=     HZ,            ARBITRARY UNITS, ARBITRARY UNITS
##FACTOR=    0.157963299565203, 1,           1
##FIRST=     4132.6476996994, 0,             0
##LAST=      -1043.33573715361, 0,           0
##MIN=       -1043.33573715361, -695280,     0
##MAX=       4132.6476996994, 355638654,     0
$$ Real data points
##PAGE= N=1
##DATA TABLE= (X++(R..R)), XYDATA
$$ [...]
23582A42189m0167j32518M6562O4522p8046o7196K36466O1734j5070k7061j15865
23571G5550p1179q4161j75599j57991J04023J56369Q779j31449K4032O2246j2753
23560b02133J71514J21613j21588l2484n1817J68337N7153k0156q9705P298O7027
23549G5059J06027J23146m0323j02932J42187J05295j49543P7387j05784k01174
23539B9345J0243j48977j8136P2369M1959K5878j0489J39679J1275p7543k710
23528G2893m9401j8164R4332J06857P1745p291Q116K0345j81317j06735r2493
23517h1113K6843O7538R3127k8913k50299j3183O9455j38760j17329m9391J70583
23506b51442P1375j7972J97261J10153J01889N5447J14663j56505r6740N9427
$$ plain form
23582 142189 102022 -30496 16066 80588 2542 -64654 171812 233546 218476 191415 75550
23571 75550 4371 -79790 -255389 -413380 -309357 -152988 -144209 -275658 -251626 -189380 -202133
23560 -202133 -30619 90994 -30594 -63078 -114895 53442 110595 90439 734 8032 75059
23549 75059 181086 304232 263909 160977 303164 408459 258916 336303 230519 29345
23539 29345 39588 -109389 -127525 -55156 -13197 12681 2192 141871 153146 75603 72893
23528 72893 23492 5328 99660 206517 278262 270971 279087 299432 118115 11380 -81113
23517 -81113 -54270 13268 106395 77482 -172817 -186000 -116545 -255305 -372634 -422025 -251442
23506 -251442 -180067 -198039 -778 109375 211264 266711 381374 224869 128129 187556
23496A87556j6486p7361k7023k0608K6179l107J7350k7284j47211j02868l7011
23485b27874P5973K3695k3120j67056K19424J49381l7347k93585J3607J26633
23475a40269o7416m5066j11728K3794J2243R9493R5179N1636N0096J8725J67168
23464A53855J37517j77103q9592J48948O2083o9738n1765k1335M0103k70356j53403
23453b90786L8677J0626R2424J02085P5222j11145N7323N4747l2696j62301j04925
23442b70749j7333m4976K3531j7537K50220O5306k7767n218p3719m6733p4070
23431b39045J65980J32069j96822K662J04130j31427K1697J12498Q9565P6845
23421A38152j14515p836J3862l0303M968j11232j14500q984l3057j1753j26444
$$ plain form
23496 187556 171070 93709 66686 46078 72257 69150 86500 59216 -87995 -190863 -227874
23485 -227874 -151901 -128206 -151326 -318382 -98958 50423 13076 -280509 -266902 -140269
23475 -140269 -207685 -252751 -364479 -340685 -328442 -228949 -133770 -82134 -32038 -13313 153855
23464 153855 291372 114269 24677 173625 235708 165970 114205 92870 132973 -137383 -290786
23453 -290786 -252109 -241483 -149059 -46974 28248 -82897 -25574 29173 -3523 -165824 -270749
23442 -270749 -288082 -333058 -309527 -327064 -76844 -11538 -39305 -44523 -118242 -164975 -239045
23431 -239045 -73065 59004 -137818 -135156 -31026 -162453 -140756 -28258 61307 138152
23421 138152 23637 15801 29663 -640 4328 -106904 -221404 -230388 -263445 -275198 -401642
23410d01642L21587P3828m8096j08673j10326k10875O3280J76786J70612O0461
23400a3058J35065J65039k5434j06190k6245k50339j1973N0576N613J8120J07373
23389D8547Q3559R8314N3493j42455k09199j76207j5763K1862P0686K5488L0196
23378a11479k0425l6894r0083K5593R2522j06839j02188q6888O2639O8940K1779
23367b83323J54711R4496J76621n4357j41875j9955m0995n2797J8364q5865O6274
23356a68701M4256K9610J61502k9241M8610J33924K04065R6115j76849r9028j04148
23345A40115j2132R458L647n9042q9978m124P2282N2000j3491k19687k21904o6928
23333d09784J5715K35031K05228J0498k9171O5058n0347j73015N134m6549M9800
$$ plain form
23410 -401642 -80055 -6227 -54323 -162996 -273322 -484197 -420917 -244131 -73519 -13058
23400 -13058 122007 287046 261612 155422 129177 -121162 -133135 -82559 -76946 -58826 48547
23389 48547 132106 230420 283913 141458 -67741 -243948 -259711 -237849 -167163 -141675 -111479
23378 -111479 -131904 -168798 -258881 -233288 -140766 -247605 -349793 -436681 -374042 -305102 -283323
23367 -283323 -128612 -34116 142505 88148 -53727 -73682 -114677 -167474 -149110 -234975 -168701
23356 -168701 -124445 -94835 66667 37426 86036 219960 424025 520140 343291 244263 140115
23345 140115 127983 137441 141088 82046 -7932 -12056 60226 112226 98735 -120952 -342856 -409784
23333 -409784 -394069 -159038 46190 56688 27517 92575 42228 -130787 -125653 -172202 -122402
23322a22402J44411m8731L2732k0762j94964j76784l0010N3644K47212L06332
23312A90678l5176l39824J951Q4696J12904k2740N2146k25604O43J60739N3051
23301C3464j70019j34420j64830k2509K24760J21034M9725l4997L9277q7066O107
23290a39474J03320j6202l3518P5890P8992m4748q7299l7536R1579N2080r7276
23279e4192K0288K40404P4818N5698k06252j5425j42577q9075J67595Q5131J1920
23268A48333n7440j08293Q667Q1226r465k81517Q761J46550N5877q7075J38167
23257D3791M5832J91117j8654k13507K1044M4943L5703L3913l817j60322l7769
23246a7726M9442J82980m6738j04378o5664J380K2226K7737m6952q8782p076R2219
$$ plain form
23322 -122402 22009 -26722 6010 -14752 -209716 -386500 -416510 -362866 -115654 190678
23312 190678 155502 -184322 -182371 -97675 15229 -7511 44635 -180969 -180326 -19587 33464
23301 33464 -136555 -270975 -435805 -458314 -233554 -112520 -62795 -97792 -58515 -145581 -139474
23290 -139474 -36154 -52356 -85874 -9984 69008 24260 -63039 -100575 -8996 43084 -54192
23279 -54192 -33904 206500 281318 337016 130764 115339 -27238 -116313 51282 136413 148333
23268 148333 90893 -17400 -8733 72493 63028 -218489 -209728 -63178 -7301 -94376 43791
23257 43791 89623 280740 262086 48579 69623 114566 150269 184182 180365 20043 -17726
23246 -17726 31716 214696 167958 63580 -2084 -704 21522 49259 2307 -86475 -93551 -1332
23234a332Q5873j54723J4473K015q4893M6404Q6641L8939l4049P4573L5034j8635
23222I0320r2588q1898r4252q9517n7885Q477J17737K37679R6590J6931n0159
23211A01435n7003m437O2452j41877n5212n9496N4273P1854k8008j47419l7991
23200b41429J42532k4053Q3634J67710J3537M0848R59N3436J16744l4782j74126
23189A45010m6944J11697m887k1683q6287o094l8872M8173J73934q1092o9089
23178A23866J09579n2154l7637O4594o5225l3211K6437n1303k0047J11625l536
23167A72988J36647q2915J9355k921j43926j20549j33198J33579Q0182j585L826
23156F1483K9416o0129k93944q1715K31360l3405o6742j88433L6656J85146j21527
$$ plain form
23234 -1332 84541 -70182 -55709 -53694 -138587 -92183 -5542 33397 -652 73921 108955 90320
23222 90320 -2268 -84166 -178418 -267935 -325820 -317343 -199606 38073 134663 151594 101435
23211 101435 44432 39995 102447 -39430 -94642 -154138 -99865 -28011 -56019 -203438 -241429
23200 -241429 -98897 -122950 -39316 128394 141931 182779 183738 237174 353918 319136 145010
23189 145010 98066 209763 204876 183193 96906 90812 51940 100113 274047 192955 123866
23178 123866 233445 181291 143654 208248 143023 109812 136249 84946 64899 176524 172988
23167 172988 309635 226720 246075 243154 99228 -21321 -154519 -20940 59242 57657 61483
23156 61483 90899 30770 -263174 -344889 -113529 -146934 -213676 -402109 -365453 -180307 -301834
23145c01834N1645K26067m7659r7743Q9284o0071q7329k7567l517J07290j15908
23134b67342j09731J56238J9520K9624J35655K43004j18026O295R4817O4009r3938
23123A60125j69390Q4150J27286K3887j40243j17472M406m0458j5916j90732J9922
23112b54435M4026J28619n4526J2079J4500Q7786p7709p9013J07820L7635R0291
23101E7073j16246J13250r4380j09080L0098O6398N1362l3680o39r5906n4404
23090a86154P967K05657M8302n361l3043P6164M1710n0557l2088j931k04639j63186
23078b97159L2702J87541N076n1951P018L5153J04978j47594n4568l4082K520
23067b10366j1308Q2336l557J25322J30240q1956j15932K8043K04021n9035q2809
$$ plain form
23145 -301834 -250189 -24122 -71781 -169524 -80240 -140311 -227640 -255207 -258724 -151434 -267342
23134 -267342 -377073 -220835 -201315 -171691 -36036 206968 88942 95237 190054 254063 160125
23123 160125 -9265 74885 202171 226058 85815 -31657 -27251 -67709 -83625 -274357 -254435
23112 -254435 -210409 -81790 -136316 -124237 -109737 -21951 -99660 -178673 -70853 -33218 57073
23101 57073 -59173 54077 -40303 -149383 -119285 -52887 -1525 -35205 -35844 -131750 -186154
23090 -186154 -178187 27470 75772 70411 37368 113532 155242 104685 72597 70666 -133973 -297159
23078 -297159 -264457 -76916 -71840 -123791 -116773 -81620 23358 -124236 -178804 -212886 -210366
23067 -210366 -221674 -139338 -142895 -17573 112667 30711 -85221 -57178 146843 87808 4999
23056D999q5530n5962N1935j74099o8718J27902J80498P2297L1135n2632L6279
23045F8104j20219P2884O4939j61235o6413O4919Q2226q3108O0654R4819p3436
23034D134p6386k1088K19543l9599k11535R8694N6643k9300j60633r8041M073
23023b53495N7667n3331m8882R4585J63394j52742p1260O499N747p489l3304J38551
23011a54060J64059o4938l6301N7181J28936J97064N443m9049j60886j4697O1962
23000A34714K6666n083m6633k553J4437L873J7335R351j44450J64312J22184o9271
22988B24882j49123N2572K98939Q9979j93261k62151j07620J8819O820J00850
22978H0706P5070J9537k02056J13483J88866j11900j62376N4462j72077o470K9262
$$ plain form
23056 4999 -80531 -136493 -84558 -258657 -327375 -199473 -18975 53322 84457 31825 68104
23045 68104 -52115 20769 85708 -75527 -141940 -77021 5205 -77903 -17249 77570 4134
23034 4134 -72252 -93340 126203 86604 -124931 -26237 30406 1106 -159527 -257568 -253495
23023 -253495 -195828 -249159 -298041 -203456 -40062 -192804 -264064 -257565 -251818 -259307 -292611 -154060
23011 -154060 9999 -54939 -91240 -34059 94877 291941 297384 248335 87449 72752 134714
23000 134714 161380 156297 109664 107111 121548 125421 142756 152107 7657 171969 294153 224882
22988 224882 75759 128331 427270 517249 323988 61837 -45783 -26964 -20144 80706
22978 80706 155776 175313 -26743 86740 275606 163706 1330 55792 -116285 -122755 -93493
22967i3493n6468P7795J07236J64113O8809r502p9811k29868j3449J0174p218
22956f1682K8285J13643k2084k90760K2020Q1129J09205K9745j89789l7965O4310
22945a53943m4530j17489O7646K20421P9387q1637O648K08677K0379m5111m585
22934A55863L5398q3103J5435J1183n9149Q4573O2044o3330j99777j12411J21809
22923c1465m9464J16774N5519J22002J61279P5185j17385r9312n2237j9071M1213
22912B03038M9671r4388j11829j7662L23161N5480j97607j54794p1699j7894j54480
22901a89003M8251J40568L7156j65541Q487O3400J62680j3207l1590j35807r5880
22890a70486j8777L5723k7406k4353J91144J17264p7818j0713K41868l0590j82251
$$ plain form
22967 -93493 -149961 -72166 35070 199183 267992 258490 178679 -51189 -64638 -54464 -61682
22956 -61682 -33397 80246 58162 -232598 -210578 -129449 -20244 9501 -180288 -218253 -153943
22945 -153943 -198473 -315962 -248316 -27895 51492 -30145 -23497 185180 205559 160448 155863
22934 155863 191261 108158 123593 134776 75627 160200 222244 158914 -40863 -153274 -31465
22923 -31465 -80929 35845 91364 213366 374645 449830 332445 233133 180896 161825 203038
22912 203038 252709 158321 46492 28830 351991 407471 209864 55070 -16629 -34523 -189003
22901 -189003 -140752 -184 36972 -128569 -120082 -56682 105998 92791 61201 -74606 -170486
22890 -170486 -189263 -153540 -180946 -205299 -14155 103109 25291 14578 256446 225856 43605
22879D3605j6078j6879j26057j49163J48877K1467Q339J56925J54043M3922J44701
22868D13702p1078l5132n6698r1290O5029q4018p3351j96849N4085J75115K2588
22857A22103K995n1682J95341K9015k45468j3883R0899k3885l4178J4201m608
22846H0850n483J00202M1741j7424j87232j22234r2118O2451J25292Q8484l9437
22835C5092N8869J6721O4949l0812j09637n0253J38597K4552j5729k6201J18507
22824B24655j343p6989j19655k18723R0298O6343J08379k89J71057L7614o0653
22813B20694k68592K2806N9599L5980j3737Q8747j8539q4794r0264J08031J20216
22802A80147p8571O3373q833j49295J6615m0228m1889n9117p7298q9843O6227
$$ plain form
22879 43605 27527 10648 -115409 -264572 -115695 -94228 -85889 71036 225079 269001 413702
22868 413702 342624 307492 250794 159504 224533 140515 67164 -129685 -75600 99515 122103
22857 122103 125098 73416 268757 297772 52304 38421 129320 105435 71257 85458 80850
22846 80850 75367 175569 217310 199886 12654 -109580 -201698 -139247 -13955 74529 35092
22835 35092 93961 110682 175631 144819 35182 -15071 123526 148078 132349 106148 224655
22824 224655 223312 146323 26668 -192055 -101757 -35414 72965 72676 243733 281347 220694
22813 220694 -47898 -25092 34507 70487 56750 145497 126958 42164 -48100 59931 180147
22802 180147 101576 164949 156116 6821 23436 -16792 -58681 -117798 -195096 -284939 -218712
22791b18712J03438J38271r0535J4441j91264r8147O8915J52943j62309j27612
22781d10571k1128K3216K42504j07887j1927J21657L0287L5106J33651K6741j3053
22770D8596q0331m1042L0173N0307L709n6573j37875r6731J1712j21116J13163
22759b76008K45350l1234j03960q5184O7387J13815K03415n7393j72426K7197
22749f9041J57356k1430j20606r3815K0829q3648J9584N1928J5351j13430N7257
22738a79665J17416M4346j31026j1729l4582j12421J86594k6396J15297J00089
22728F7923L1423N6228J8903K10779k5548j86642j57191M5570J23849o8443k70458
22717a53607o6436O0287J38596j08739k9757p4264J61293K23516K1327m1670R5487
$$ plain form
22791 -218712 -115274 22997 -67538 -53097 -244361 -342508 -273593 -120650 -282959 -410571
22781 -410571 -431699 -408483 -165979 -273866 -285793 -164136 -133849 -98743 34908 61649 48596
22770 48596 -31735 -72777 -42604 7703 11412 -45161 -183036 -279767 -268055 -389171 -276008
22759 -276008 -30658 -61892 -165852 -251036 -183649 -69834 133581 76188 -96238 -69041
22749 -69041 88315 66885 -53721 -147536 -126707 -210355 -190771 -138843 -123492 -236922 -179665
22738 -179665 -62249 -17903 -148929 -160658 -195240 -307661 -121067 -147463 -32166 67923
22728 67923 99346 155574 174477 385256 359708 173066 15875 61445 185294 116851 -153607
22717 -153607 -220043 -159756 -21160 -129899 -159656 -233920 -72627 150889 172216 130546 226033
22706B26033R2493N0369p9047q7858J03069J0364l04194k23893j9629j2264k2478
22695b67035K20069J000O4575o1059K0012n5530j01313n2849k3655j57418R9691
22684c13512K45683q2844j12245J4779p7490R5032Q9084R1911L4727M0055R6450
22673A21630K3689l0575k8784K7596k6057R572j10633j72103J6570R0450M2716
22662c5929n1538R6678J96959J6002j35711l8717m3519L3031m0243N0958J72886
22651B20857j01026l7288o2917r5226m6474j18606J25491j1765k13269j59254
22641d99477N5617J61428J52585j13656q5295J65796P4430L9682N4962m7106R5986
22630E4952M1500M9372j22106l26050O3428J88214J67985M4244l7672j96191j91042
$$ plain form
22706 226033 318526 368895 289848 201990 305059 315423 11229 -212664 -232293 -244557 -267035
22695 -267035 -46966 -45966 18609 -42450 -22438 -77968 -179281 -232130 -255785 -413203 -313512
22684 -313512 -67829 -150673 -262918 -248139 -325629 -230597 -141513 -49602 -14875 25180 121630
22673 121630 145319 114744 85960 113556 87499 97071 -13562 -185665 -169095 -78645 -35929
22662 -35929 -87467 9211 206170 222172 86461 47744 4225 37256 -2987 47971 220857
22651 220857 119831 82543 19626 -75600 -122074 -240680 -115189 -126954 -340223 -499477
22641 -499477 -443860 -282432 -129847 -243503 -328798 -163002 -88572 -48890 6072 -41034 54952
22630 54952 96452 145824 23718 -302332 -238904 -50690 117295 161539 123867 -72324 -263366
22619b63366j5197J77765J23336K2014K41168M0285j26912p9745j85050j37989
22609b03691R8698Q4830m4318R4319q7899q5558k6854M1165J29747n7924r0578
22598a48063p9667K54478L66095j07151j81842j99203L6871r9148r4892k6084
22588b78606P6746K1063l71358J66140M18753P6258O4110N0043j99902j25890
22578a02643L5737j75325k54935J43840K31913P2481k742n8465J02265P8530k3279
22567D7377j4873k77468n4160J75061j7673q842n0526j5708J08197L5961m8232
22556a20886l7203J45310J03653p1129l2178P8262o485r7220N6218L3728N787
22545E7857L7056J77741l2174p7029j46845p4102n0050p796J58377J40131j27786
$$ plain form
22619 -263366 -278563 -100798 22538 44552 285720 326005 199093 119348 -65702 -203691
22609 -203691 -104993 -20163 -64481 29838 -58061 -143619 -170473 -129308 439 -57485 -148063
22598 -148063 -227730 26748 392843 285692 103850 -95353 -58482 -157630 -252522 -278606
22588 -278606 -201860 -180797 -552155 -386015 32738 108996 173106 223149 23247 -102643
22578 -102643 -66906 -242231 -497166 -353326 -121413 -48932 -51674 -110139 -7874 70656 47377
22567 47377 32504 -244964 -299124 -124063 -141736 -150578 -201104 -216812 -108615 -72654 -120886
22556 -120886 -158089 -12779 90874 19745 -12433 65829 59344 -37876 18342 52070 57857
22545 57857 94913 272654 240480 163451 16606 -57496 -107546 -115342 43035 183166 55380
22534E5380q5217J16271R3943N4796k09385j28646Q2574o4150j43902O8217J56374
22523c745N0953j58250Q0662J20874k0968M7071O4493J66107j41219p5682Q9316
22512B19612p2318j33668j02296M1077N3428n1543p565P4413j39148k03253K2334
22501b98927J6863K7063P8501K12011j02993l32694O0949K60831r366j81398L1919
22490b37241K14716J28757o614j34328J1299R5116J616q1512j82677j76562R4986
22479b72444K31149J31471P3002M6188J45785o0443N349J5779k71038j74963Q0748
22468d9417l3154J0262k206M4344R2191n7889n297Q4160N12P7745m9667p2020
22456C9564J35406K7105l7548j70666j2986J79643l0378l7318Q2490N7597k9122
$$ plain form
22534 55380 -29837 86434 180377 235173 25788 -102858 -20284 -84434 -228336 -160119 -3745
22523 -3745 47208 -111042 -30380 90494 69526 116597 181090 347197 205978 130296 219612
22512 219612 147294 13626 -88670 -47593 5835 -45708 -53273 21140 -118008 -321261 -298927
22501 -298927 -282064 -255001 -176500 35511 -67482 -400176 -339227 -78396 -87762 -269160 -237241
22490 -237241 -22525 106232 99618 -34710 -23411 71705 73321 -8191 -190868 -367430 -272444
22479 -272444 -41295 90176 163178 209366 355151 294708 300057 315836 44798 -130165 -49417
22468 -49417 -82571 -72309 -74515 -30171 62020 4131 -1166 82994 83506 161251 111584 39564
22456 39564 174970 202075 164527 -6139 -19125 160518 130140 92822 175312 232909 203787
22445B03787j15366l1160l1326k5862J977R1295K20468R642l01836j45489N1739
22434g2131P6681o8656m5550Q4498k3882J00078J65822O1531n0775L6709j49615
22423A14710n3520K0368j50690K921R2154K53242J8952ON4463j14297j08290k8173
22411A01846R2147j42887j17118k33666J23801Q5008J35408O3721R923J68805
22401B86988o920j02263j06186j54874P5902j32427J7719m2576L6902J92929P8431
22390A43625J0331n216p1813m6042r3954J7563N7039n8307q3437O2919j36795
22379b04087j35762j9216N7150q2937K81587J13532j22330j27934j4469J02701
22369a51765K2845P4638J8290O7292m7041K100j31778Q7332n4230m2916R461l7761
$$ plain form
22445 203787 88421 57261 25935 73 2050 93345 313813 323455 21619 -123870 -72131
22434 -72131 4550 -64106 -109656 -25158 -49040 51038 216860 278391 227616 264325 114710
22423 114710 61190 81558 -69132 -66211 25943 279185 298137 298143 352606 238309 130019 101846
22411 101846 193993 51106 -66012 -299678 -175877 -90869 44539 108260 118183 286988
22401 286988 280068 177805 71619 -83255 -7353 -139780 -122061 -164637 -127735 65194 143625
22390 143625 153956 148740 76927 30885 -63069 -45506 11533 -46774 -130211 -67292 -204087
22379 -204087 -339849 -359065 -301915 -384852 -103265 10267 -112063 -239997 -254466 -151765
22369 -151765 -128920 -54282 -35992 31300 -15741 -13641 -145419 -58087 -112317 -155233 -145772 -183533
22357a83533n2314Q6657n8245J38524J37406K2199M0447J7067r5867l9609J02849
22346A15581n8301l68596l8545J25420Q0763j41644K7787M8359j04850o6090K00525
22335a79591M4101P3348J4358q7319p5457J36484N0025O421m8423p6010O3844
22324g8219L2104r5646o3467J35885J32612j8523j14219j05053q2706K7440J41648
22313h8144M5439n3298N7776K3471l6942j4336j86606j22185L6105J21770N1208
22302a65742o067k3975J7030j76520m635R4428Q9612J17556o049j2397Q2121p4984
22290f9622j9461m1954J27297q0285j04320K9548R7445j77949L6035K62678r976
22279D9436j29828P538j34153k236O8956L5084Q6789K273l4090l2302J6675j18378
$$ plain form
22357 -183533 -235847 -149190 -207435 -68911 68495 90694 131141 148208 52341 12732 115581
22346 115581 57280 -311316 -349861 -224441 -143678 -285322 -257535 -209176 -314026 -380116 -179591
22335 -179591 -135490 -62142 -47784 -135103 -210560 -74076 -24051 -17630 -66053 -142063 -78219
22324 -78219 -46115 -141761 -205228 -69343 63269 44746 -69473 -174526 -257232 -229792 -88144
22313 -88144 -42705 -96003 -38227 -14756 -51698 -66034 -252640 -374825 -338720 -216950 -165742
22302 -165742 -171809 -195784 -178754 -355274 -359909 -265481 -175869 -58313 -64362 -76759 5362 -69622
22290 -69622 -89083 -131037 -3740 -84025 -188345 -158797 -61352 -239301 -203266 59412 49436
22279 49436 -80392 -72854 -207007 -209243 -140287 -105203 -18414 -16141 -50231 -82533 -65858 -184236
22267a84236j6829R3833j41118j26879O5144J62897n8726q0135K8621K08038R2313
22256D2923q6609j25376q3154k3997R2074M7129Q4676n6612K5520k2280n1431
22245a57137Q4605j46456p5120N8015K23288o6638j21674J49858K00212O1189
22235B10142j4504K88p6789p0885k55614j93046J30623K58284M6581K6170J15668
22224A76918J64144r9564j94799M3272O2363n780Q9189l9460k7491j42197J07254
22213A33849P0696J10607m5396k85219M8849N3456M9784q1109N7805J04518n7654
22202A60186j01008r1971L4342J9314q9155n6122R3768P6132R7479q0137j29521
22191f6693J42748j10489j67552M9760Q2713n9142m7199k4645r1327M1673K20716
$$ plain form
22267 -184236 -201065 -107232 -248350 -375229 -310085 -147188 -205914 -286049 -257428 -49390 42923
22256 42923 -43686 -169062 -252216 -276213 -184139 -137010 -52334 -108946 -83426 -105706 -157137
22245 -157137 -72532 -218988 -294108 -236093 -12805 -79443 -201117 -51259 148953 210142
22235 210142 195638 195926 119137 48252 -207362 -400408 -269785 -11501 35080 61250 176918
22224 176918 341062 241498 46699 89971 152334 146554 235743 196283 168792 26595 133849
22213 133849 204545 315152 269756 -15463 33386 86842 136626 55517 113322 217840 160186
22202 160186 59178 -32793 1549 20863 -68292 -124414 -30646 45486 142965 62828 -66693
22191 -66693 76055 -34434 -201986 -152226 -69513 -128655 -175854 -200499 -291826 -250153 -29437
22180b9437M0327j06493q1777l4642J39543K39134p1784j85868j0262J33271N9938
22169I1950q8745l5396N5145q3338J23900N1950l46627L5413J26463J14299J3328
22158E8342m5928q788j3883J61315M4204r8137l4777K83751J00122j89889j84759
22147G1573L848J04796P4229j39674j11545M9657O2256q8703k3679J02888J58509
22136B64155J31527j11623J06391N8607j24088j61841J73599O2628k91991j95955
22126h8591r1977N7557J68106J1831j9417p0636k02948q415O2335m6182J94155
22115c4182R3358O4948J5812K9732j9133o3013o132L6506o421q1957j46510N9817
22103e7175J8046k3140j16556j56814R4428R4747J14053R5728r0516j00624j8791
$$ plain form
22180 -29437 10890 -95603 -177380 -212022 -72479 166655 94871 -90997 -101259 32012 91950
22169 91950 3205 -32191 22954 -60384 63516 115466 -231161 -195748 -69285 45014 58342
22158 58342 12414 3626 -10257 151058 195262 97125 62348 346099 446221 256332 71573
22147 71573 75421 180217 254446 114772 3227 52884 115140 26437 2758 105646 264155
22136 264155 395682 284059 390450 449057 324969 163128 336727 399355 107364 -88591
22126 -88591 -180568 -123011 45095 56926 37509 -33127 -236075 -244490 -182155 -228337 -34182
22115 -34182 59176 124124 139936 169668 150535 87522 81390 117896 111475 29518 -116992 -57175
22103 -57175 -39129 -62269 -178825 -335639 -241211 -146464 -32411 63317 -27199 -127823 -146614
22092a46614K7466K34002J75276o7570j18493n1731j20575O5315k7053k23337
22082b53314J07467J02839R842l0632J31395N7320m903j53770l3692J32081l4367
22071C0266r8566J42750j6847o0487j42741j3593J436l8053M7290K4115J04578
22060a9852J48280r7881j70331J79395J08739n7434l7141r220j08217j38625J31999
22049g0288R4635N4150j92915L0300M3052p2414k7577K41036j34476k43562K2858
22038b55201m688J41803N4874j23261q2764R0933J0544R8146J68948O9202j8454
22027A50082j21112l2998j10210M6232P1258r6235p4668L2380L1712r5184l3650
22016b32393l0301J84651P1581J17551r5300o8387o5812j50972J40362j43666
$$ plain form
22092 -146614 -119148 114854 290130 222560 104067 52336 -68239 -2924 -29977 -253314
22082 -253314 -145847 -43008 -33166 -63798 67597 124917 120014 -33756 -67448 64633 30266
22071 30266 -68300 74450 57603 -2884 -145625 -159218 -157782 -195835 -148545 -124430 -19852
22060 -19852 128428 30547 -139784 39611 148350 90916 53775 44555 -63662 -202287 -70288
22049 -70288 24347 78497 -114418 -84118 -41066 -113480 -141057 99979 -34497 -278059 -255201
22038 -255201 -259889 -118086 -63212 -186473 -269237 -178304 -167760 -69614 99334 168536 150082
22027 150082 28970 -4028 -114238 -68006 3252 -92983 -167651 -135271 -103559 -198743 -232393
22016 -232393 -262694 -78043 -6462 111089 15789 -52598 -118410 -269382 -129020 -272686
22006b72686m6343L18188R5553j23914l7611j83031k6616J37009J32855O8101
21996F1505K37764P1943L6831k51488l02221j59755K95502L24262P9037k14586
21986A78794j206J2754j52464o5213J38857L6464K5002J26681p7106j46723R5596
21975A71436j09315o1518k2288j68163r8601L8472l59L3622J36369J9803j8461
21964g9003P0806J24722J10371O9J7993K4712q036l1203o5059p3512o14o5461
21952B5785L3391n1504j3308P7384J9185j65239l8618q9425k9124J35757k3684
21941a19400l5454M6076P1690R2194n879K601n9077r0507R0289k11990J23829
21930i5628R4220j45653J38116J37986l0468m8353M6914j27963j52950J05990
$$ plain form
22006 -272686 -319029 -841 94712 -29202 -66813 -249844 -276460 -139451 -6596 61505
21996 61505 299269 371212 408043 156555 -145666 -305421 -9919 314343 393380 178794
21986 178794 177588 190342 37878 -27335 111522 147986 172988 299669 222563 75840 171436
21975 171436 62121 603 -21685 -189848 -288449 -249977 -250336 -216714 -80345 -60542 -79003
21964 -79003 -8197 116525 226896 226965 244958 269670 261634 230431 165372 91860 91246 25785
21952 25785 59176 7672 -5636 71748 90933 -74306 -112924 -202349 -231473 -95716 -119400
21941 -119400 -154854 -108778 -37088 55106 49227 51828 -7249 -97756 -7467 -219457 -95628
21930 -95628 -1408 -147061 -8945 129041 98573 50220 97134 -30829 -183779 -77789
21920g7789J30180P1472j45074Q8251L843j5025P0632K6712j0194L1332j12932
21909F1408k10516J21746J1124o9764N348j50678j74469K0564O7155R7419J41413
21898g9250Q7480l9273j36532n0613k3008j6948N7629N1531J05864j20933L5244
21887a28809j0408J43269P4054j8398k69181J01848J10730K3916k14073j5513
21877b02565J30963l730j04477j30950n2633J6248J14347p8004Q9027J11841J4227
21866i5706K0847m0819n2800k183J53336J44983l8825j23110N1931R1664j7274
21855I2044J65071k3943j79343l1609M2456Q462R8980q6882r0095n348k1794n1232
21843h3233r3955l2757K15734J01114O0715J52309j59022j55865J93970J10562
$$ plain form
21920 -77789 52391 123863 -21211 67040 70883 55858 126490 153202 143008 174340 61408
21909 61408 -149108 -27362 -16238 -86002 -80654 -231332 -405801 -385237 -318082 -220663 -79250
21898 -79250 8230 -31043 -167575 -218188 -241196 -258144 -200515 -148984 -43120 -164053 -128809
21887 -128809 -139217 4052 78106 59708 -209473 -107625 3105 27021 -187052 -202565
21877 -202565 -71602 -75332 -179809 -310759 -363392 -347144 -232797 -310801 -221774 -109933 -95706
21866 -95706 -74859 -115678 -168478 -170661 -17325 127658 88833 -34277 17654 109318 92044
21855 92044 257115 233172 53829 22220 64676 73138 172118 85236 -4859 -10207 -32001 -83233
21843 -83233 -177188 -209945 5789 106903 167618 319927 160905 5040 199010 309572
21833C09572j17563j42416J02433L4690k21013m8367K0771q0100P5040J46725
21823G9772P5594L2981j65104O4324j38429j07505N9277k03827J6947J00551j24056
21812c09475j50185Q7008N5364J50524n9447J20499J49078j02580K6624L4175
21802A585l9414J8018M0747o9627j78281q0740R4499J29512j690p5890O5039J47694
21790E1452j5460q1994j0972J7937L929l9269o0053R040n3730K3854J47499j5621
21778b3388J43677Q1135j23913k02577j16062J12697l000J7289K8964J04942o240
21767A3524k22672k65868j57776K36100K46382J19343k990l3952K50171J07175
21757B89437o6161n8286p6070k873Q3430J6363j48578j32821J5819O5765p3162
$$ plain form
21833 309572 192009 49593 152026 186716 -34297 -82664 -61893 -141993 -66953 79772
21823 79772 155366 188347 23243 87567 -50862 -158367 -99090 -302917 -285970 -185419 -309475
21812 -309475 -459660 -372652 -317288 -166764 -226211 -105712 43366 -59214 -32590 1585
21802 1585 -37829 -19811 20936 -48691 -226972 -307712 -213213 -83701 -85391 -161281 -96242 51452
21790 51452 35992 -46002 -56974 -39037 -35108 -74377 -134430 -125390 -179120 -155266 -7767 -23388
21778 -23388 120289 201424 77511 -125066 -241128 -128431 -131431 -114142 -85178 19764 13524
21767 13524 -209148 -475016 -632792 -396692 -150310 -30967 -33957 -67909 182262 289437
21757 289437 223276 164990 88920 86047 169477 185840 37262 -95559 -79740 -13975 -87137
21746h7137J8759L8625K0993n7090j89758j61432J06921R4083J85413l1846J04460
21735D1991L6372O0321j48292o234j5039J04739j0872J8289j12031j47321N5393
21724a22684J18625q9046P9942J25036j83466p8547k4092J04351j36228k4546
21714b30655l188J18131j1051o7681p950J42853K3323p6033n1293J55601M6269
21703C8326l5201M4073J58209n8834J3705J11677m0978q3828q8340Q4842L9668
21692A83319j05128L9788J3869N2502j47659j74777P2661J05318K8087P388j38615
21681f3247J9783Q1878P5257j87816o0489L2801p2374o8409K5024j80615q7131
21670d85338P6112R0564K26257J55087M825j58035j16374J13532J41937K36361
$$ plain form
21746 -87137 -68378 -29753 -8760 -65850 -255608 -417040 -310119 -216036 -30623 -62469 41991
21735 41991 78363 138684 -9608 -15842 -30881 73858 62986 81275 -30756 -178077 -122684
21724 -122684 -4059 -93105 -13163 111873 -71593 -150140 -174232 -69881 -206109 -230655
21714 -230655 -233843 -115712 -126763 -194444 -202394 -59541 -36218 -112251 -163544 -7943 38326
21703 38326 3125 47198 205407 146573 160278 271955 230977 147149 58809 143651 183319
21692 183319 78191 117979 131848 184350 36691 -138086 -65425 39893 67980 75368 -63247
21681 -63247 -43464 38414 113671 -74145 -134634 -101833 -174207 -242616 -217592 -398207 -485338
21670 -485338 -409226 -318662 -92405 62682 67507 -90528 -206902 -93370 48567 284928
21660B84928m7810j27367j46226K26498J7920j86962n2461n2391k4656j52112
21650b60639p7880R265J1676R4660J10699p983J16643M07947k3550k28845J6196
21639A68189j03881j09861M0136J33586j43782j44527j4148R7621M2739j03469
21629a37397p9839O0411K17088P610k766J9687J01920P5490j54112l6273l5272
21618C6547o5939j74019N2241M23231P6870j32225M6617L2410k4881j53669j21272
21607d089j908J8818O3793J21159j03199l7699q0914l0138j32651j47068o2860
21596c96756j7413O4330J25142R6732l7060R7376Q2718M0106m8955r9717N1231
21585d2266P8468l7190j18639K4365N6760n6686J95026K02679M4090k58169q6270
$$ plain form
21660 284928 237118 109751 -36475 190023 207943 20981 -31480 -83871 -108527 -260639
21650 -260639 -338519 -329254 -317578 -222918 -112219 -120202 -3559 404388 380838 151993 168189
21639 168189 64308 -45553 -5417 128169 -15613 -160140 -174288 -76667 -33928 -137397
21629 -137397 -217236 -156825 60263 67873 65107 84794 186714 262204 108092 71819 36547
21618 36547 -29392 -203411 -151170 272061 348931 216706 263323 295733 270852 117183 -4089
21607 -4089 -5997 12821 76614 197773 94574 56875 -24039 -54177 -186828 -333896 -396756
21596 -396756 -414169 -349839 -224697 -127965 -165025 -67649 15069 55175 6220 -93497 -42266
21585 -42266 36202 -988 -119627 -95262 -38502 -95188 99838 302517 346607 88438 2168
21574B168p8252Q8016K73023j68418k56623K4249O8631J31859m753p3662j71624
21563a65386n7079O0315l2566N0748l1959J07840l091K6732Q2824n282j07884
21552g4788p4718M5567N6221l0205j01525j06422j6019O9805J31826o373j12587
21541b19218l3038N1918J45864L2176M5874m9680L0329q0954j90603k2472K10719
21530g9085R2629N3561r2610m1207K8146O3353P995k74814j80451K48879J09314
21519f4290o478K66102R5337q625k91844N7340L0158j04855j88784m4213P3285
21508a86867M9242j3285m7378J01747j7793R1556j8559k4912L423j94237l018
21497b60081P3239J5190J85620Q2538q4061l7609p6888k1731j81875M6543N4192
$$ plain form
21574 2168 -76084 11932 284955 116537 -140086 -115837 -47206 84653 79900 6238 -165386
21563 -165386 -222465 -162150 -194716 -143968 -175927 -68087 -71178 -44446 38378 33096 -74788
21552 -74788 -149506 -103939 -47718 -77923 -179448 -285870 -301889 -232084 -100258 -106631 -219218
21541 -219218 -252256 -200338 -54474 -22298 23576 -26104 4225 -76729 -267332 -289804 -79085
21530 -79085 13544 67105 -25505 -66712 -38566 24787 32782 -242032 -422483 -173604 -64290
21519 -64290 -70768 195334 290671 282046 -9798 47542 77700 -27155 -215939 -260152 -186867
21508 -186867 -137625 -150910 -198288 -96541 -114334 -22778 -41337 -66249 -62826 -257063 -260081
21497 -260081 -186842 -171652 13968 96506 12445 -25164 -102052 -123783 -305658 -259115 -204923
21486b04923j04628m0018K14055O2338P998O4404j18997J54369K37136j54076
21476A17658q5878j87541J7575P5338N7780P4982P9021L963q5457n2202q8277
21465g3038R0642L8460p9926J20261n9650m0221N7984J11306j1469l3341l5690
21454H5318k0194o5879o385m7328l3334o2606O1811R7717O3912j5514o5269N5957
21442D8206K644Q6772q0101n9896j6534J52803J11128r6066j32602K8478j82666
21431a37834L0378L16103K87146j98099k21163k6401M1928O156j7714j03912n2105
21420g5517J00696K00666o5099p7038J3964Q311q18q914J475p3221l4972J2542
21408B075q3894p3420r100j63025j17J46314M9533n1804j04823r8151K82322K06860
$$ plain form
21486 -204923 -309551 -349569 -135514 -73176 -65178 -774 -119771 34598 271734 117658
21476 117658 31780 -155761 -138186 -62848 -5068 69914 148935 152898 67441 15239 -73038
21465 -73038 17604 56064 -23862 96399 36749 -3472 54512 165818 154349 121008 85318
21454 85318 65124 -755 -7140 -54468 -87802 -150408 -88597 9120 73032 57518 -7751 48206
21442 48206 50850 137622 57521 -2375 -18909 133894 245022 148956 16354 44832 -137834
21431 -137834 -107456 208647 495793 297694 76531 50130 92058 98214 80500 -23412 -75517
21420 -75517 25179 225845 160746 83708 97672 105983 105165 96251 97726 24505 -10467 2075
21408 2075 -81819 -155239 -164339 -327364 -327481 -181167 -131634 -183438 -288261 -386412 -104090 102770
21396A02770J06933j39875J86609J36322j66567j94137q9454N1634O7503M2503
21386A04241p0187j33045N9502J14767N3352n2690n7092J07145j41585q6153j33707
21375b35452J06069K6192R1461K159j24161o6J80930r1238o9623J60173P3558
21364A20002n4484J03237q8884l39227R0134J67581j7720l603j61586l7787o1291
21353b83628J75434M9922O7002J72978o7257n4121o1447k12794j21736J34985
21343b00662J53652J64439k9929j26829k1824Q143j67372m973O2279P6068K4378
21332f2630N9263N3200j13737L9867R6586J76173j22015j23378K1858j51674j25322
21321b51809R9200k2069M8620k6679J14276M4985k34276K1711J23413J65707m4206
$$ plain form
21396 102770 209703 69828 256437 392759 226192 32055 -57399 -5765 61738 104241
21386 104241 34054 -98991 -39489 75278 128630 75940 18848 125993 -15592 -101745 -235452
21375 -235452 -129383 -103191 -11730 -9571 -133732 -133798 47132 -44106 -113729 46444 120002
21364 120002 65518 168755 79871 -259356 -169222 -1641 -19361 -22964 -184550 -222337 -283628
21353 -283628 -108194 -58272 8730 181708 114451 60330 -1117 -213911 -335647 -200662
21343 -200662 -47010 117429 87500 -39329 -61153 -53010 -220382 -225355 -163076 -87008 -62630
21332 -62630 -3367 49833 -63904 -24037 72549 248722 126707 3329 25187 -126487 -251809
21321 -251809 -152609 -174678 -126058 -152737 -38461 6524 -227752 -206041 -82628 83079 38873
21310C8873j10388p9579j78116o5040J27842J58004J7894M9105k7809o7652j75263
21299c12129p5470J29833K61796r6685j72062O6778Q2032r9772l391K03773Q9590
21288G4293J2053r3024j94197j95371M4315k0018K6293L9306O8773K27703K76973
21277B67099j62297k8888J14434j00298J1141J77036J14366k17309j30708p9422
21267c4846o5050K9115L0789n0024R8323j23187R4191Q4573O3576p7170j06983
21256e6693K1839P4876J16052N8802K8353j1930j41093l5683p1083L5946j97175
21245a77789J22386J50569K11057Q0687j58754j36453j97522p6639J20608R9343
21235C7493J4623j17450L3222J72983q9972j37858J25663j18598K8069m90j6392
$$ plain form
21310 38873 -71515 -151094 -329210 -394250 -266408 -108404 -90510 -41405 -69214 -136866 -312129
21299 -312129 -387599 -257766 4030 -92655 -264717 -197939 -115907 -215679 -219070 -15297 74293
21288 74293 86346 -6678 -200875 -396246 -351931 -371949 -345656 -306350 -237577 -9874 267099
21277 267099 104802 75914 190348 90050 101191 278227 392593 175284 44576 -34846
21267 -34846 -99896 -70781 -39992 -90016 8307 -114880 -20689 63884 127460 50290 -56693
21256 -56693 -34854 40022 156074 214876 243229 231299 90206 54523 -16560 19386 -177789
21245 -177789 -55403 95166 306223 386910 228156 91703 -105819 -182458 -61850 37493
21235 37493 52116 -65334 -32112 140871 50899 -86959 38704 -79894 -51825 -52315 -68707
21224f8707r030k8990N6368j54759K7562Q5484J6431J48460P6820n2333p048K2081
21212A12339M6552m1848m4694Q6122o5301j53958n4502L41982O8922L407j95403
21201A03618k20502j13715L6046L5901j4728J607J34374l7134p247p4004m2302
21190a98086Q9011O5922j2624N1021L3928j40252J09332p6212n7806R2515K10113
21179A66862J83857m1902j00598p7670k85929j53817K27405J67213m7494q6424
21169d8497r1905K63579J10955N739O1538j14965j11854j8534k74975k03001k62
21158d22182J41108N3953n5839Q6366J09715R2329R2142q7932m2565j70657R6419
21147a07143K45773J3180q3429j15023M5253R0187m4677j981J30888R0048j76231
$$ plain form
21224 -68707 -77737 -106727 -50359 -205118 -177556 -92072 -75641 72819 149639 97306 90258 112339
21212 112339 158891 117043 72349 158471 93170 -60788 -115290 226692 295614 299021 103618
21201 103618 -116884 -230599 -194553 -158652 -173380 -171773 -37399 -74533 -81780 -155784 -198086
21190 -198086 -109075 -43153 -55777 -4756 29172 -111080 -1748 -77960 -135766 -43251 166862
21179 166862 350719 308817 208219 130549 -155380 -309197 -81792 85421 37927 -48497
21169 -48497 -140402 123177 234132 239871 301409 186444 74590 56056 -218919 -421920 -422182
21158 -422182 -281074 -227121 -282960 -196594 -86879 5450 97592 9660 -32905 -203562 -107143
21147 -107143 138630 151810 68381 -46642 -1389 88798 44121 42140 173028 263076 86845
21136H6845j26216n8265R998N2506P2083m5897J19006j12551l03625k7782J17261
21125b16637L3141O7123K1655j9922J73941o078j25195J44798j02301r2864p4357
21114a96696J20165O5221L1165Q1981J51217N1059q2766O0350K3842n5884k40703
21103H951j10175K68889J66647J4463m7685j13536J2799p5087o2484o8494l0613
21092c6325n434J2553j21325l5353n8675P3669M114L6648q7668J90841J32987
21081A06032q4384J07449q287j10300k9603O8888q8150k61923K4743J67113J1993
21070i6429k4895k3316Q0855J5048J80678J88189n945l4120j30218K0229j25923
21059D4153p7011m5323l5913k3349L8428J43533K5297O7708j57904P8944K7148
$$ plain form
21136 86845 -39371 -97636 -87638 -35132 36951 -8946 110060 -2491 -306116 -333898 -216637
21125 -216637 -183496 -116373 -94718 -114640 59301 53223 -71972 72826 -29475 -122339 -196696
21114 -196696 -76531 -11310 19855 101836 253053 304112 221346 281696 305538 249654 8951
21103 8951 -101224 167665 334312 348775 301090 187554 200353 125266 62782 -5712 -36325
21092 -36325 -41759 -29206 -150531 -185884 -244559 -170890 -166776 -130128 -217796 -26955 106032
21081 106032 21648 129097 120810 10510 -19093 49795 -38355 -300278 -275535 -108422 -96429
21070 -96429 -121324 -144640 -63785 -48737 131941 320130 314185 280065 149847 170076 44153
21059 44153 -32858 -78181 -114094 -137443 -99015 44518 69815 137523 -20381 58563 85711
21048H5711q8935J791O8547j5790k3758J03386j26724k38719j07788r7247J76156
21037b63370J10871j90795K418K34874O6929j02933j80888J56217P9819j8518
21027a05376m3890J22807m8355k7023m5199o8382r5377J07913J58606J10652p7905
21016a1529J51027M7976o2353j5489j01693J78961Q8359K7934K2507j24574l6507
21005A64619j2174j33170l0579Q2101N1785L6658j3230j18126k9711O6991P373
20994G2537N9969Q3569o5596m2498M5011K9193q473j04738l9613O6829K4609k73043
20982a52244K3888J29872R7689q7759r8686J52716J14050j4909L4116J06311k1528
20971B83516j8051M3281n7640j49358p8413l2674n9597m7539q5935M6286J01996
$$ plain form
21048 85711 -3224 -1433 67114 51324 27566 130952 4228 -234491 -342279 -439526 -263370
21037 -263370 -152499 -343294 -340876 -106002 -39073 -142006 -322894 -166677 -86858 -105376
21027 -105376 -149266 -26459 -74814 -101837 -147036 -215418 -310795 -202882 -44276 66376 -11529
21016 -11529 139498 187474 125121 109632 7939 186900 275259 303193 325700 201126 164619
21005 164619 152445 19275 -11304 70797 122582 159240 146010 27884 -1827 65164 72537
20994 72537 132506 216075 150479 107981 152992 182185 173712 68974 29361 96190 120799 -152244
20982 -152244 -128356 1516 99205 11446 -87240 65476 179526 164617 198733 305044 283516
20971 283516 265465 308746 251106 101748 23335 -9339 -68936 -116475 -202410 -156124 -54128
20960e4128J58266J8308j94184m6296j75846P3665J89030J42391m6214j06432
20950d1440j57463M5616R5613J82343j88463r4538j4714J2869K95098K03098k8511
20939C09508o1262j21456n5052M8660j06319p575r2048J13100J40548J16407N3444
20928C37955k35142j52999r7188j09737J58265k23390j0289O9264O91J74589N0046
20917c7935P8305j02811o2673p9062J54934p6723k06515q9042J70805J72784K8527
20906d9406L990m5895j13954k3101j515M2571J47092m4232L5115j56055j58408
20895c63798R6427J12007M4258n461o5512m778J08320j08394n0433K12438J32273
20884A07347N7002j89236p3090J56548K2691j80069o570P5943K1106o4685l4926
$$ plain form
20960 -54128 104138 122446 -71738 -118034 -293880 -220215 -31185 111206 64992 -41440
20950 -41440 -198903 -153287 -57674 124669 -63794 -158332 -173046 -160177 134921 338019 309508
20939 309508 248246 126790 71738 120398 14079 6504 -85544 27556 168104 284511 337955
20928 337955 102813 -50186 -147374 -257111 -98846 -322236 -332525 -263261 -262570 -87981 -37935
20917 -37935 40370 -62441 -125114 -204176 -49242 -125965 -332480 -421522 -250717 -77933 -49406
20906 -49406 -45416 -91311 -205265 -228366 -229881 -187310 -40218 -84450 -49335 -205390 -363798
20895 -363798 -267371 -155364 -111106 -116567 -182079 -186857 -78537 -186931 -237364 -24926 107347
20884 107347 164349 -24887 -97977 58571 81262 -98807 -105377 -29434 -8328 -73013 -107939
20873a07939j97136L2827K2496L8795P7988K71831J02693o5533P4918L2019N2238
20862C35197n3475j65977J6482J10893j6940q4495p4627o1073n4082j46488R0819
20851a03766K10176p8090P6240q6023m8484O3309Q6694n9911L5464P5792l7127
20840A34274j46337l0013p5019p042R8343J61937j2494m33229M676K72891M3664
20829A1651J64771R4006q5228k10023j0464P3356M9877N4885n775M0725K0914
20818A98695j9639k16857m2143O7553J1327M7649j9933M5555L7114O4549Q3628
20807B57498m2181j90525r5616M2362m959R8755m5536j27040j62105K7711J92680
20796d8956N1287o8908N9141K36000n0434j50699J72539n5274k49406k72849R3545
$$ plain form
20873 -107939 -305075 -272248 -249752 -210957 -132969 138862 241555 176022 250940 282959 335197
20862 335197 281722 115745 132227 243120 226180 141685 67058 5985 -48097 -194585 -103766
20851 -103766 106410 28320 104560 18537 -29947 33362 120056 60145 95609 171401 134274
20840 134274 -12063 -42076 -117095 -124137 -25794 136143 123649 -309580 -304904 -32013 11651
20829 11651 176422 270428 185200 -24823 -35287 38069 87946 142831 137056 177781 198695
20818 198695 179056 -37801 -79944 -12391 -1064 46585 26652 72207 109321 173870 257498
20807 257498 215317 24792 -70824 -28462 -33421 65334 19798 -107242 -269347 -241636 -48956
20796 -48956 2331 -66577 -7436 228564 178130 27431 199970 144696 -104710 -377559 -284014
20785b84014K08005K0943j41908J15892M7139p4654j41604L1688J49218l6547
20775a05842P1149Q4669J04064L7009l4498m3196j3117R3704o9675m0197k13699
20764a29629k8517J27920J77166O3370j91915j23053J20205J07868R5915m9870
20754A69460r3269J32716r8899j51107p6198K1991J41822J16249j00610R5451
20744A57606r434k8253m3912q9384p5585j38697O275q9961J37603P8375l7210
20733a32577j79671j23016J93437J35799r1599L6873O8385O8573P5023J66518
20723B17745j16042j02647O0277P9191j34633k30300l7118L419J97378K14365
20713A51635N5603k2478l75887N9651K82231Q3533m4629M3395j87069k42914j29851
$$ plain form
20785 -284014 -76009 -55066 -196974 -81082 -33943 -108597 -250201 -218513 -69295 -105842
20775 -105842 -34693 49976 154040 191049 156551 113355 100238 193942 124267 84070 -129629
20764 -129629 -158146 -30226 146940 210310 18395 -104658 15547 123415 219330 169460
20754 169460 76191 208907 110008 -41099 -117297 -95306 46516 162765 62155 157606
20744 157606 148172 119919 76007 -13377 -88962 -227659 -221384 -311345 -173742 -95367 -132577
20733 -132577 -312248 -435264 -241827 -106028 -197627 -160754 -92369 -23796 51227 217745
20723 217745 101703 -944 59333 138524 3891 -226409 -263527 -260108 -62730 151635
20713 151635 207238 184760 -191127 -131476 150755 234288 189659 233054 45985 -196929 -326780
20702c26780J43009J56857K89515k8979m3403n2545J59965P0943p6251r7718M3940
20691B38553o326j28175K0558p4134J2205q7209j19431K58949m068k01405j16984
20680b07467J09646l0289L7010J94128J92757o9412K3554J27132L4206j82179
20670B29086m6442j308J2818q2451r3314k2858J4406j2477Q9760k686p0309j0218
20658D007n0676k334n3499p0315J46676O5994n26M3762J08519J01126j34059J5228
20646A73903o4330j09706Q3077M814o7562O3130N7649M941n7726K258q5872l0141
20634b5565Q2032J1571r3512j11680j16094j16380L14111P9991M1379N050J8934
20623H9837l6662p9414n7450k19546J91186J88831k17284j09972K8340j02779
$$ plain form
20702 -326780 -183771 -26914 262601 233622 190219 137674 297639 368582 292331 194613 238553
20691 238553 232227 104052 124610 50476 62681 -24528 -143959 114990 110922 -90483 -207467
20680 -207467 -97821 -128110 -91100 103028 295785 226373 249927 377059 411265 229086
20670 229086 182644 181336 194154 111703 18389 -4469 9937 -2540 87220 84534 14225 4007
20658 4007 -46669 -49003 -102502 -172817 -26141 39853 39327 83089 191608 292734 158675 173903
20646 173903 109573 -133 82944 87758 20196 83326 140975 145916 88190 90448 4576 -25565
20634 -25565 56467 68038 -25474 -137154 -253248 -369628 -55517 24474 65853 70903 89837
20623 89837 53175 -26239 -83689 -303235 -112049 76782 -140502 -250474 -222134 -324913
20613c24913L683M7515L03353J23104n9829j55477r6238J55788J88990j32490
20603E3486p5223p7933k6944J5436M6689R2030N7432r0574k5964J50485q193j18406
20591g679r1614K4925L1508p801o3088k8327K5253J3875N1149O059K577N5797
20579A2634L5828n6668j26872j47079p8584J78001J4207m649K20744O1520K4639
20568A33721n8154j1308O8185J31574k0063k73628j65119P6208P9656M6826K5142
20557C3040R7066o029q9446J44404k0579j40029j41070N2473k1488J7901r1119
20546a64876j2022J49085O9076J32539M7149q0248O2200R7387l36380k20483P0844
20535a85729J99936n2008j35124q2473K70813Q5876m4580r864J6612R5484o2828
$$ plain form
20613 -324913 -321230 -273715 29638 152742 92913 -62564 -158802 -3014 185976 53486
20603 53486 -21737 -99670 -126614 -111178 -64489 27541 84973 -5601 -31565 118920 110727 -7679
20591 -7679 -99293 -74368 -42860 -50661 -113749 -142076 -116823 -102948 -51799 -45740 -43163 12634
20579 12634 48462 -8206 -135078 -282157 -360741 -182740 -168533 -173182 47562 109082 133721
20568 133721 75567 64259 132444 264018 243955 -29673 -194792 -118584 -38928 7898 33040
20557 33040 130106 124077 34631 179035 158456 18427 -122643 -70170 -91658 -73757 -164876
20546 -164876 -176898 -27813 41263 173802 220951 140703 202903 300290 -36090 -256573 -185729
20535 -185729 14207 -37801 -172925 -255398 15415 101291 56711 46847 63459 158943 96115
20524I6115j05987j65356J3908P5907p5318K0723l5148p402R5774K06050j1305
20513A07961j89761j31608J48482J32537Q0213m0226L8500J83711M7202r037j67411
20502B00563k56515J30668L1950r2646r1028J00518O6220j90634L0401P5794l1113
20491b5822J00367K05664O4792l8193m6278j06429k58762j52410P6880L3930J64601
20480A8340K10745q6787K7593J26521m9614j91811l1197q2152j51063J18400K53319
20469A62294j06240j28816J87136K3044J97729M2492k96576j49037K5326J10418
20459F7770R7097j9020K4441L2537J23775m9861j50436N2981m2720j99769j39277
20448b02482K14071P9968j34333l1980j6174j05979L9806O3671K0926J6427j9392
$$ plain form
20524 96115 -9872 -175228 -161320 -85413 -160731 -140008 -175156 -182558 -86784 119266 107961
20513 107961 -81800 -213408 -64926 67611 147824 107598 146098 329809 377011 367974 200563
20502 200563 -55952 74716 106666 14020 -77008 23510 89730 -100904 -70503 5291 -25822
20491 -25822 74545 280209 345001 306808 260530 154101 -104661 -257071 -180191 -146261 18340
20480 18340 229085 142298 169891 296412 246798 54987 23790 -58362 -209425 -91025 162294
20469 162294 56054 -72762 114374 137418 335147 377639 81063 -67974 -42648 67770
20459 67770 164867 145847 170288 202825 326600 276739 126303 179284 136564 -63205 -202482
20448 -202482 11589 91557 -42776 -74756 -90930 -196909 -157103 -93432 -72506 -56079 -75471
20437g5471j43690o3270n6279O9512o1407j1906J52057K22864j00446o0010J6384
20426a11662J34597j1027j70187m9217J40233O3095O2669N8562o7869n7900L1050
20415B2344r6930n6027j3755J31391j23650K7030J14891j09214j7856J21664J75374
20404A75262n3829j72448k36638k2928M8439M6614L7973K27999j2856j54309M3240
20393g3481K0010k9513J36503J55188m5648j68564M5712n3438q800o9804j58551
20382b50386Q1946J65506J60174r8346j04389j3935l1667m0491m8835J2266J66336
20371a821k3989l21987j09659J20700K58801Q5662N8003J7574R852o3860j75534
20360a46258r0071n3715J12450J06140R9546j46678O0601k6592k3818j32177N2999
$$ plain form
20437 -75471 -219161 -282431 -338710 -269198 -330605 -342511 -190454 32410 -68036 -128046 -111662
20426 -111662 22935 11908 -158279 -207496 -67263 -4168 58501 117063 49194 -8706 22344
20415 22344 -74586 -130613 -144368 -12977 -136627 -109597 5294 -103920 -121776 -112 175262
20404 175262 121433 -51015 -287653 -310581 -262142 -215528 -177555 50444 37588 -116721 -73481
20393 -73481 -53471 -82984 53519 208707 163059 -5505 40207 -13231 -22031 -91835 -250386
20382 -250386 -168440 -2934 157240 58894 -45495 -59430 -91097 -131588 -180423 -168157 -1821
20371 -1821 -25810 -347797 -457456 -336756 -77955 7707 65710 83284 93136 29276 -146258
20360 -146258 -236329 -290044 -177594 -71454 28092 -118586 -57985 -84577 -108395 -240572 -187573
20349a87573J15269j08852j74970J00040J35098J84356q3865j1872K3696m2016
20339e0689k2116K5122j09717L8584Q2549j85275q0899K33368K37024m0431j06446
20328B1074R4803l6196P7719k2770Q2865j29053n6896K804j4517j04826J13197
20317B8204P0116n8187k36662k37538j7816K82928J40186l2841k10565r1711o3943
20306d27829P6097n0429P1512K26409J37099q4817J29619K9303n8793o4416J12930
20295I6685P484q7542j06916n7694l9901l6038J55291O5361P1304q1073m9153
20284f2192J8414j33421l8979K92425J14635L0111j07137j15789j6313n6500J9535
20273e5211O0726n8724k78014q466l0283j9790M7025O4145P0409J30584J22358
$$ plain form
20349 -187573 -72304 -181156 -356126 -256086 -120988 63368 -20497 -32369 -8673 -50689
20339 -50689 -72805 -47683 -157400 -118816 -36267 -221542 -302441 -69073 167951 127520 21074
20328 21074 115877 79681 157400 134630 217495 88442 31546 34350 19833 -84993 28204
20317 28204 98320 40133 -196529 -434067 -451883 -168955 -28769 -61610 -272175 -363886 -427829
20306 -427829 -351732 -402161 -330649 -104240 32859 -51958 77661 106964 48171 -16245 96685
20295 96685 104169 16627 -90289 -147983 -187884 -223922 -68631 -3270 68034 -13039 -62192
20284 -62192 -43778 -177199 -216178 76247 190882 220993 113856 -1933 -18246 -74746 -55211
20273 -55211 5515 -53209 -331223 -339689 -369972 -389762 -342737 -278592 -208183 -77599 44759
20262D4759k780J57859j87706q1485J0067R5752R8602m1146k19527o725R1566
20251d0764N6684l1105R1956j1687O3279j25104j12023J03923r6481M9244k3386
20240g5464p9345Q6600J3142N5347r2850n3166K54100J3177O3308K3543m7490
20229A60902p1316l5670j33263o733l1080R7706N0583o3729L5880J02070k25j2993
20217I2132l1335k9032p8236j61803o1056j01487P2832K26883O1760J1213n1846
20206d9975R5821l1840J5977o4408j00482P561n0102n6422L5723M7470M6110k2879
20194a27446j40661J28662J60882j06018J7889J99155Q6683N6136m3454p1407
20184A60421o2372Q3305k6905P6788n4830j42534j0005N3698j53452J2965P1667
$$ plain form
20262 44759 41979 199838 12132 -69353 -59286 36466 135068 93922 -125605 -132330 -40764
20251 -40764 15920 -15185 76771 65084 128363 3259 -108764 -4841 -101322 -52078 -75464
20240 -75464 -154809 -68209 -55067 280 -92570 -145736 108364 121541 184849 208392 160902
20229 160902 89586 53916 -79347 -86080 -117160 -19454 31129 -32600 3280 105350 105125 92132
20217 92132 60797 31765 -46471 -208274 -269330 -370817 -297985 -71102 -9342 1871 -49975
20206 -49975 45846 14006 29983 -34425 -134907 -127346 -177448 -233870 -198147 -150677 -104567 -127446
20194 -127446 -268107 -139445 21437 -84581 -66692 132463 219146 275282 231828 160421
20184 160421 98049 181354 154449 231237 176407 33873 23868 77566 -75886 -62921 8746
20173H746j89101n8858k4707L7024q9367L8656P0184O6670J65104q6056L2123
20162b9582L121k5361K7670O7622L0480q2622k6178J5331J03803q2739l4283p4725
20150a07463R2646J24300l4540j95366n2592m0005j03686P5784J64137o3035m4511
20139a84331L4896P9071m9978q9283r165P4987j01643O6133J62908J01324R1101
20128A76020o8379j04102L2815r4766j9846P7413L0024p5557l5909Q8455N4708
20117F0876L2243j7743l8993j33474j39848J7061Q1811M2572J04480O7232J59506
20106B35723l9230j35160j66610N356K05840n3487k433J97804Q6835l2892q3845
20095B17901j60141j14477N5043j0954J12095j73218o9926K19692N5735j05733
$$ plain form
20173 8746 -180355 -239213 -263920 -226896 -316263 -277607 -207423 -140753 24351 -61705 -29582
20162 -29582 -26461 -51822 -24152 43470 73950 -8672 -34850 -19519 84284 1545 -32738 -107463
20150 -107463 -14817 109483 74943 -120423 -173015 -213020 -316706 -240922 -76785 -139820 -184331
20139 -184331 -149435 -70364 -120342 -209625 -218790 -143803 -245446 -179313 -16405 84919 176020
20128 176020 107641 3539 36354 -58412 -78258 -845 29179 -46378 -82287 6168 60876
20117 60876 93119 75376 36383 -97091 -236939 -219878 -138067 -95495 8985 76217 235723
20106 235723 196493 61333 -105277 -99921 105919 52432 49999 247803 334638 301746 217901
20095 217901 57760 -56717 -1674 -12628 99467 -73751 -143677 76015 131750 26017
20085B6017j88853K5260K02002J74918k1159q7882n5309j21609p5718p084O8612
20074f0805O7770J36784J01140k4560J07314n9262j15575j5058K976j8411k07276
20063h4963j42244J1591N1179l9379M5842J84444o9675M2960J19977L3220p1009
20052H1943j63955q0900l4606q0442o7879p3592l262J48045Q2721N2190P6159
20041f3578L7473J77076O5214j8108k2044j97461q2420J49305J0844p2182J48620
20030A32739R3650r023o1644j17907o5889R7237m6210k2233J69970N8918r6938
20019A32670r9884j9433N6602J31708P7524J071l248q5981j2760J43302j41715
20008A79856r3152O9325O0867N0681M3426j7267r1097k05502O1846J24760j73306
$$ plain form
20085 26017 -162836 -137576 64426 239344 218185 130303 74994 -46615 -122333 -129417 -60805
20074 -60805 6965 143749 244889 220329 327643 268381 152806 137748 140724 122313 -84963
20063 -84963 -227207 -215616 -164437 -203816 -157974 26470 -43205 -245 119732 152952 81943
20052 81943 -82012 -162912 -197518 -277960 -345839 -419431 -422693 -274648 -191927 -139737 -63578
20041 -63578 -26105 150971 216185 198077 176033 -21428 -103848 45457 56301 -15881 132739
20030 132739 226389 217366 155722 37815 -28074 69163 22953 720 170690 229608 132670
20019 132670 32786 13353 69955 201663 279187 280258 277010 191029 178269 321571 179856
20008 179856 86704 156029 216896 267577 311003 293736 202639 -2863 58983 183743 10437
19997A0437k28017p6528P1963J27196N3614K14777l8192o2300M945j03713j33400
19986a59218J36346M3809N8053j16851L923R0713P620o3960k6178K5257k0421
19975b0907O1225O9335j09396Q2068O5582K155q1241J470r122R1186Q3499R9723
19963C35577L1627o7601j38554k5256j25628m9173J40839J00763l9003L3432j15763
19952H1260m8336r3473r4399K6826J03273N595q7165n2314R6078J00902J90313
19941B28560m4083r9330Q364Q467J37211j22987r8276M4836M2069J09357j7467
19930A96721m37q7841k06672L3413K00376N6697k3441m5531o0280n5328N4627
19919F2304O1178j26223m5309N2989k7111j04100M5100J75492K14766m1954k25116
$$ plain form
19997 10437 -217580 -294108 -222145 -94949 -41335 173442 135250 72950 77895 -25818 -159218
19986 -159218 -22872 20937 78990 -37861 -33938 56775 64395 435 -25743 -486 -20907
19975 -20907 40318 109653 257 82325 147907 150062 68821 70291 61169 152355 235854 335577
19963 335577 367204 299603 161049 135793 10165 -39008 101831 202594 163591 197023 81260
19952 81260 32924 -60549 -154948 -128122 -24849 -19254 -106419 -158733 -62655 38247 228560
19941 228560 184477 85147 93511 101978 239189 116202 17926 62762 104831 214188 196721
19930 196721 196284 108443 -98229 -64816 135560 192257 168816 123285 63005 7677 62304
19919 62304 123482 -2741 -48050 4939 -22172 -126272 -81172 94320 309086 267132 42016
19908D2016J3200O0141O5237j72724Q9967j0651j44604l9022j05329n5664o6247
19897c23680K20889M6161L6480K5173j09629k4856P1049N246K7682L9256J07752
19886A21523m1202k39205J8678O3762j39442o4926m5797J83198M1489O4838J85332
19875A48248m2376k6464j97989j6185L4126j14456L7876L7722O4604J35675j76381
19864a15600k8005L31007P6940j59432j39599L8331J2485j8756m408O5792n6118
19853B637l6382j33596n3555N6038J27554j03514M8892M9818r4542j2327p5092
19842b24069l3608J06322Q7811J26065r8515k0321K88149J06435j63514j69390
19832E365q5006N272k2026j4038J02689l5424j43403M6073K5732J27412O002q0928
$$ plain form
19908 42016 55216 115357 180594 7870 97837 87186 -57418 -96440 -201769 -257433 -323680
19897 -323680 -102791 -56630 -20150 5023 -104606 -129462 -58413 -53167 -25485 13771 121523
19886 121523 80321 -158884 -140206 -76444 -215886 -280812 -326609 -143411 -101922 -37084 148248
19875 148248 105872 79408 -118581 -134766 -100640 -215096 -177220 -139498 -74894 60781 -115600
19864 -115600 -143605 187402 264342 104910 -34689 3642 16127 -2629 -7037 58755 2637
19853 2637 -33745 -167341 -220896 -164858 -37304 -140818 -91926 -42108 -136650 -148977 -224069
19842 -224069 -257677 -151355 -63544 62521 -35994 -56315 231834 338269 174755 5365
19832 5365 -79641 -74369 -96395 -110433 -7744 -43168 -186571 -140498 -114766 12646 18648 -62280
19820f2280J29455K41805Q3463O4457j44741o8239j76475o2533L4015n6935j03388
19809a21396N8571j13179r2515M9806O9607J4249m8137M8982p7476J23417O9346
19798a8725p6628q8589J9402k863K4367j72161K11986L4786j11388J18526n9185
19787a20472l3248J97008J7703r6958o5041p0816J76969M5128j24897m8733L5021
19776h8336k4728m6092J04381R5798K2019R6520J18132p6589l14241Q5020L62040
19765C33924J24922n2700j69806l36027j6557J12300o3487K9193O6077J29835
19755A57674j7987l4634j03542k4797K2545O289J02006n5932P210j11524j17614
19744a70306K6222O9452J06682k20713N8918M3657J5625j0372O0739K02304L5308
$$ plain form
19820 -62280 67175 308980 392443 456900 312159 243920 67445 4912 38927 -18008 -121396
19809 -121396 -62825 -176004 -268519 -218713 -149106 -134857 -182994 -134012 -211488 -88071 -18725
19798 -18725 -95353 -183942 -164540 -167403 -143036 -315197 -103211 -68425 -179813 -61287 -120472
19787 -120472 -153720 43288 60991 -35967 -101008 -171824 5145 50273 -74624 -123357 -88336
19776 -88336 -113064 -159156 -54775 41023 63042 159562 277694 201105 -113136 -28116 333924
19765 333924 458846 406146 236340 -99687 -116244 -3944 -67431 -38238 27839 157674
19755 157674 139687 105053 1511 -23286 -741 5548 107554 51622 58832 -52692 -170306
19744 -170306 -144084 -74632 32050 -188663 -129745 -86088 -70463 -80835 -20096 182208 217516
19733B17516L8446j24469m9646P4269K564m9742o8945k29543j23669K14692J35391
19722C6864n9785L9081j10105p0975O8719K3298m4655J56469P0910o1230m7853
19711G38P495K2548O4665p0910Q6580p9025j14086p630K0350K0449O48r9186P5946
19698g1418o1515O4951n176k4001J75259J08870p9610j30944k10542J34682Q2855
19687a6589j13565n4571R7141R9452j42311P461o5790K3439M7964j51564j4465
19676b83398P2574o865Q2262j9496R4856P1520J72711j7016j40573K1657K6526
19665G4758M8863p417j06322m3635Q697J8623R4306L230o8365O1741K8767O2888
19653A76134J91418J61865k06201l01363q8456n6513L0667J8994N2083Q7702J06992
$$ plain form
19733 217516 255962 131493 81847 156116 158680 108938 39993 -189550 -313219 -98527 36864
19722 36864 -22921 16160 -93945 -164920 -96201 -72903 -117558 38911 109821 48591 738
19711 738 8233 30781 95446 24536 111116 32091 -81995 -89625 -69275 -48826 -48178 -147364 -71418
19698 -71418 -132933 -67982 -73158 -97159 78100 186970 107360 -23584 -234126 -99444 -16589
19687 -16589 -130154 -184725 -87584 11868 -130443 -122982 -188772 -165333 -117369 -268933 -283398
19676 -283398 -210824 -217689 -135427 -154923 -60067 11453 184164 167148 26575 48232 74758
19665 74758 123621 116204 9882 -33753 -25056 -6433 87873 91103 22738 84479 113246 176134
19653 176134 367552 529417 323216 21853 -66603 -123116 -92449 -73455 -21372 66330 173322
19642A73322R1287j35468p34l4375p2056q7331q4748N4591N6778j07816Q5604
19631f0946k1395L2977K054P230j67308K9566K39747M9308r7787Q7910K18719
19620C20075j69368J8698q8977j6366n0900P9366L1790q2249j11615m5177r556
19609a24279q9923K754K02970K35848r6458j84122j06352Q6864N2011N5928j5440
19598A9801P0923L4014l8355j36616j92887O160J00683P5678O3943Q4344o8892
19587A8796r9794l8760O7680M8756j31499j41332o319J7917J14621M6748k7341
19576a30527r7612j29750J72774J82411L3086o4663K00391J29760n6109r8856
19566A40905q2148K1874R6860j32811j97785n1454R3318J3658k9357n2463p5692
$$ plain form
19642 173322 264609 129141 128407 94032 21976 -65355 -150103 -95512 -38734 -146550 -60946
19631 -60946 -82341 -49364 -47310 -40080 -207388 -177822 61925 111233 13446 101356 320075
19620 320075 150707 169405 80428 64062 13162 92528 124318 42069 -69546 -114723 -124279
19609 -124279 -214202 -211448 -8478 227370 130912 -53210 -159562 -72698 -20687 35241 19801
19598 19801 90724 124738 86383 -50233 -243120 -236960 -136277 -60599 3344 87688 18796
19587 18796 -80998 -119758 -52078 -3322 -134821 -276153 -282472 -264555 -149934 -103186 -130527
19576 -130527 -228139 -357889 -185115 -2704 30382 -34281 166110 295870 239761 140905
19566 140905 58757 80631 177491 44680 -153105 -204559 -111241 -97583 -126940 -179403 -255095
19555b55095k25502K1983K23686J96859m5083J16219K14246p4259l8746j84417
19545e0109L03475J98445p3361k88887j49583j10153j8929J72862K54002J41011
19535C78773j21581K0051k9805j26785j35504k8665N5025l1418m1691N7412o3711
19524f7899R1797R2443k86221j74885J50718Q5247P6058J22922J00939q2446k22999
19513a14326J27644L23476m4225p0135o7141l6480N0002j19230j89100p9165N2173
19502a66507J00219R3118N6073j16389r6840o719J71673O1800O666p2087m0356
19491i349N776n826k3534m0119J77979k5875k0274K6641J14438P4698j38590Q5429
19479B21394K25909j1662l13992j58837j66568k7934Q3058O5832R461Q4699o3453
$$ plain form
19555 -255095 -480597 -458614 -234928 -38069 -83152 33067 247313 173054 134308 -50109
19545 -50109 253366 451811 378450 89563 -60020 -170173 -189102 -16240 237762 378773
19535 378773 257192 277243 247438 120653 -14851 -43516 11509 -19909 -61600 -4188 -67899
19524 -67899 23898 116341 -169880 -344765 -194047 -108800 -32742 90180 191119 108673 -114326
19513 -114326 13318 336794 292569 222434 155293 118813 168815 49585 -139515 -218680 -166507
19502 -166507 -66288 26830 82903 -33486 -130326 -137045 34628 96428 103094 31007 -9349
19491 -9349 -3573 -9399 -32933 -73052 104927 79052 58778 85419 199857 274555 135965 221394
19479 221394 447303 435641 121649 -37188 -203756 -231690 -148632 -82800 -73339 11360 -52093
19468e2093l0395M5666J26342N1116P647Q6194n0478j95274L6313k1196O1843
19457F5685J78309j74541q6735J57947p446l9791j74315q6569j24295O6802K01983
19446b2966K05233J00172n1167j59303j86610L9693K254j272o318o2702Q1788
19435f1198n0675j95489r1208j0055J36002J50552L4326J02798J10652L0873r1236
19424F5342k52055p453J58852L1323N8448J15406L2291l452q2456K6423k85495
19413a42826J6789J58524j9002m2394J09409J38747m5370o4746j34411m0120o3262
19402a28662p9927L2567r3535J21902J38461J24095j86962M1564O0030R3602l2464
19391I0671J4498J4047J52824R852K9368l5975L9550M7729p8626j74975j62256
$$ plain form
19468 -52093 -82488 -36822 89520 140636 148283 234477 183999 -11275 25038 3842 65685
19457 65685 243994 69453 -17282 140665 133219 93428 -80887 -167456 -291751 -224949 -22966
19446 -22966 182267 282439 231272 71969 -114641 -74948 -72694 -73966 -80284 -142986 -61198
19435 -61198 -111873 -307362 -398570 -408625 -272623 -122071 -87745 15053 125705 156578 65342
19424 65342 -186713 -194166 -35314 -3991 54457 169863 202154 198702 116246 142669 -142826
19413 -142826 -126037 32487 13485 -28909 80500 219247 173877 109131 -25280 -65400 -128662
19402 -128662 -208589 -176022 -269557 -147655 -9194 114901 -72061 -30497 29533 123135 90671
19391 90671 105169 119216 272040 281892 311260 275285 314835 362564 283938 108963 -53293
19380e3293r9655L8889Q526K22524N8208N8428k23172j54237K04143J8976j87024
19369a07687j37469n8561p2566J52810J14031M3044J4281l6455m9096j1292l4354
19358a83314L8725J3848m000J71177M8963k03315K4360R4305N4545r996J03652
19347A48950K22811j94328j07422p1754p2196J19531J22967j12381R5172N2193
19337B03543P6009q6667j23979M9233o4839j66261l7999J24379L9973j1862p7632
19326g6102j2199J97548J41393j01996l22592j57241K38712K95757J00663p827
19316B96116k2313j36187n4302j0861M7489j0475K1801J58848J69854l2400Q7972
19305E15542j09722q4069j3686j95041k44929R5409P4415P1614j56306K6639J36747
$$ plain form
19380 -53293 -152948 -114059 -105533 116991 175199 233627 10455 -143782 60361 79337 -107687
19369 -107687 -245156 -303717 -376283 -223473 -109442 -66398 -52117 -88572 -137668 -148960 -183314
19358 -183314 -144589 -130741 -134741 36436 85399 -117916 -93556 749 55294 45298 148950
19347 148950 371761 177433 70011 -1743 -73939 45592 168559 56178 151350 203543
19337 203543 279552 192885 68906 118139 53300 -112961 -150960 -26581 13392 1530 -76102
19326 -76102 -88301 109247 250640 148644 -173948 -331189 -92477 203280 303943 296116
19316 296116 273803 137616 83314 72453 119942 109467 131268 290116 459970 427570 515542
19305 515542 405820 321751 308065 113024 -131905 -36496 37919 109533 -46773 -20134 116613
19294A16613K52414j32959j04954r2752o891J13434J03879p2432j95027J0980
19284g695L43046J15986l09858j37026P2561j6286q2826Q2667K34567K1008j39171
19273A76973L0858K9694j08297K786o862k2446L9934j86102m5311M3283Q8892
19262D3402L9692j21076j40778o6012L8301J17296o9349m4546K2913R6870k5823
19251a09110J61971Q1052L5153M1811o2223j47926q487P8572R8482Q6319p0311
19240A85303m7785n1886o1326O5774j30985l8883J20449m0522m2517q2506J48152
19229B3268R4201k7037o134o6693m8661Q6943Q4805j16677j26905j194L5208J55094
19217H6218P0400J04582J74160k42995j67034K0357j07718K72014R5747k98996
$$ plain form
19294 116613 369027 236068 131114 38362 31471 144905 248784 176352 -18675 -7695
19284 -7695 335351 451337 141479 4453 77014 60728 -22098 60569 295136 316144 176973
19273 176973 207831 237525 129228 132014 125152 102706 142640 -43462 -88773 -45490 43402
19262 43402 83094 -37982 -178760 -244772 -206471 -89175 -158524 -203070 -180157 -83287 -109110
19251 -109110 52861 133913 169066 210877 148654 728 -7759 70813 169295 255614 185303
19240 185303 137518 85632 24306 90080 -40905 -79788 40661 139 -42378 -124884 23268
19229 23268 117469 90432 84298 17605 -31056 55887 140692 24015 -102890 -104084 -68876 86218
19217 86218 156618 261200 435360 192365 25331 45688 -62030 209984 305731 6735
19207F735r5942K09647L3963J57608l6834m894r581k7300m7695J09973L57j12233
19195A83804R882L2922m5464q7606n6229K9013K25626l6480r3755N2018j94071
19184A9660r2748j55375N38l6659k08615k4227K46841K63735j9354j02711j8192
19173a27107j39227J52679R7315l4823m5403k2856J44571J46320N0162p5709P6236
19162B22158j62091N3430J12481R8307M0201p7769k55763j71745M6728J23681
19152B9618j80929n7601J25037O3999k5441j01374K1871j66969L7878J59565J82476
19141H8130O0842j2364n2780o988P3430j69219j51628J05889j5835j3554N8848
19130c5229R9392m8054M1207n1810r5466Q5585k7127J9013Q2762J05651L6813
$$ plain form
19207 6735 -89207 120440 154403 312011 275177 270283 260702 233402 185707 295680 296037 183804
19195 183804 193686 226608 181144 93538 37309 66322 291948 255468 161713 213731 19660
19184 19660 -73088 -228463 -227925 -264584 -473199 -497426 -250585 13150 -6204 -108915 -127107
19173 -127107 -266334 -113655 -16340 -51163 -96566 -119422 25149 171469 221631 145922 222158
19162 222158 60067 113497 225978 324285 364486 286717 30954 -140791 -94063 29618
19152 29618 -151311 -208912 -83875 -19876 -45317 -146691 -124820 -291789 -253911 -94346 88130
19141 88130 148972 136608 83828 76840 150270 -18949 -170577 -64688 -80523 -94077 -35229
19130 -35229 64163 16109 57316 5506 -89960 -4375 -31502 -12489 70273 175924 212737
19119B12737O797k02654m8347K03418M4475J67856J33650q5870j91719j12497
19109A27846o937N2721R9813j24421p0436J23502K6602k10316J59722O8331p9563
19098A66864m2331j4826m9047j84866J0245Q6881J91356q8083p0486j83889j52504
19087c30686K31569L67106L8136k36689l1948N1590R319N0043q5701q9322o0528
19076h7111j4849K05022K24076J251L2171j64163n2134k4918j08976j83681O2874
19065a10438J31348K40376R5298N6951j77124n0578l5669M2841R7186k37014j78892
19054a25715R2252o1839L6850k0364J2268N7050K5315j41263J08919J41617J02225
19043B27315q9698k07525J5220J93034Q6002O1310J14184j58082r0250J5580J60901
$$ plain form
19119 212737 219534 16880 -31467 171951 216426 384282 517932 432062 240343 127846
19109 127846 120909 173630 273443 149022 78586 202088 228690 18374 178096 246427 166864
19098 166864 124533 109707 60660 -124206 -113961 -27080 164276 76193 5707 -178182 -330686
19087 -330686 -99117 267989 306125 69436 37488 89078 98397 148440 62739 -26583 -87111
19076 -87111 -101960 103062 327138 328389 360560 196397 144263 119345 10369 -173312 -110438
19065 -110438 20910 261286 356584 413535 236411 185833 150164 193005 290191 53177 -125715
19054 -125715 -33463 -95302 -58452 -78816 -66548 -9498 15817 -125446 -16527 125090 227315
19043 227315 137617 -69908 -54688 138346 224348 285658 399842 241760 151510 167090 327991
19032C27991l581L7630k00535k19655M7019k4253J17279k2287J02720J65467R0569
19021D18364q1214j90282l9219j28386j9848j57716J15750J26332K0117J18288
19011A82186j42731j78470Q3979J97594Q7939j17248j0632J65230l8470Q342L4091
19000B71810j8340k1037Q7366K07258J69133k4681j32597m6701J20990J45231
18990G58432R5595O6387p3353r414M1462l5194l6005J9402k25480j38982k5404
18979D37446k59873j7217J04457L950j73902j96630j34639J04936K24949j66138
18969g2661j30882K56010P5237J3492J830J47324J09296L1712j03567J40635J40298
18958F08724j40456j0723k6184j6403j01078j24462J51227K08801l0052R4634
$$ plain form
19032 327991 324410 362040 161505 -58150 -11131 -35384 81895 59608 162328 327795 418364
19021 418364 337150 146868 107649 -20737 -40585 -198301 -82551 43781 63898 182186
19011 182186 39455 -139015 -55036 142558 230497 113249 102617 267847 229377 237719 271810
19000 271810 253470 232433 319799 527057 696190 671509 538912 492211 613201 758432
18990 758432 854027 920414 847061 837647 879109 843915 807910 827312 601832 462850 437446
18979 437446 177573 160356 264813 268763 94861 -101769 -236408 -131472 93477 -72661
18969 -72661 -203543 52467 127704 141196 143026 290350 399646 431358 327791 468426 608724
18958 608724 468268 457545 431361 414958 313880 189418 340645 549446 519394 614028
18948F14028p2310j68828m7155P1662J65248J70126J28854J68984J9379k7050
18938A022938j64233p1306J58035J50326N7618K11656R3662j19397j66446j29621
18928A043232N718k58254j46650j87919o0730j16305p986M3665M8002l0618j10611
18917B21544J8468o3520p2178J2550K2991J99943L6194p6400j23618q649q6113
18906H1212P3908J44404p0652m6207O8294p8159l5532k8751j55742r9555M0835
18895a05945J15474M4872p6246j067Q8956K78577J25815J56858L55241L03098
18885A285633L8772K3620K0650j23674j73852j26536o4063k72421n0980J75791
18875G32940n1007L3687K16729J52462K8148J49422K13048R0697M0589j19177
$$ plain form
18948 614028 541718 372890 325735 397397 562645 732771 861625 1030609 1049988 1022938
18938 1022938 858705 787399 945434 1095760 1153378 1365034 1458696 1339299 1172853 1043232
18928 1043232 1048950 790696 644046 456127 395397 279092 271106 314771 362773 332155 221544
18917 221544 240012 176492 104314 116864 139855 339798 375992 299592 175974 167325 81212
18906 81212 155120 299524 228872 182665 250959 172800 137268 108517 -47225 -146780 -105945
18895 -105945 9529 54401 -21845 -22912 66044 344621 470436 627294 982535 1285633
18885 1285633 1324405 1348025 1368675 1245001 1071149 944613 880550 608129 557149 732940
18875 732940 681933 715620 932349 1084811 1112959 1262381 1475429 1566126 1606715 1487538
18865A487538j10941l45795p0108O8687j57960k17075r1399M4861Q7885J69836
18855H65529K1174k4229l0428j75025J10252K8277j22096j84635o3012N9872K4889
18844E10568P517O3886Q8014P5118l5749m81K0613o1295J06745K33197J63027
18833A171160j48552j54815j33279k25707j56528J56728J2531j83645l05817j20214
18823h8138N2323R6487M7885N856p4229n4546L6068Q5069J12143L0643m20m1268
18811B07873o8320J43662l7672j52413r7095R6731K5824L3814Q331r0163k22946
18800a52374P3561J07990o1107J9163l5063m0582Q1011N9164P6242J44480n1251
18789B21234n1438R2829j9324j03457J24330o365Q8643n2701M5065o9413l9102
$$ plain form
18865 1487538 1376597 1030802 960694 1029381 871421 654346 562947 607808 695693 865529
18855 865529 886703 862474 832046 657021 767273 795550 673454 488819 425807 485679 510568
18844 510568 518085 581971 669985 745103 709354 708873 729486 668191 774936 1008133 1171160
18833 1171160 1022608 867793 734514 508807 352279 509007 521538 337893 32076 -88138
18823 -88138 -35815 60672 108557 114413 40184 -14362 21706 106775 218918 249561 249141 207873
18811 207873 139553 283215 245543 93130 -3965 92766 118590 152404 160735 70572 -152374
18800 -152374 -78813 29177 -31930 -12767 -47830 -88412 -7401 51763 128005 272485 221234
18789 221234 169796 262625 243301 139844 264174 257809 346452 293751 338816 269403 230301
18778B30301l7900j2308K05952Q5645l2997l8633K1323L2508K1076l4339m2496
18767C98132M2349K63580M96003O93517K02733k11240l59625n14966l79757k07681
18757D23045j43906J39565Q342o5577Q6171m2762q6835J7294p8069P7448O798
18746C41514j34773J8374k8570r3755n1747K58746K99825j30527J5696o4742k21754
18735B08287K5302R8936M7882p6603n5090l3146j32161j7252J4753q167P5836
18724A48577J28163l0950n6148J7269J74464l7707o2343R0338J80951l1307O292
18713E27599Q0836l2272J2067p3397r2199j881k83522j24487K29900J72514N5034
18702D70192k0063m6453j33383p4239j635O8498j69637N0088K18941q5151N8144
$$ plain form
18778 230301 192401 180093 386045 471690 438693 400060 421383 453891 474967 440628 398132
18767 398132 440481 704061 1200064 1893581 2096314 1885074 1525449 1010483 630726 423045
18757 423045 279139 418704 427046 361469 447640 404878 318043 335337 257268 334716 341514
18746 341514 206741 225115 196545 102790 51043 309789 609614 479087 494783 430041 208287
18735 208287 233589 332525 380407 303804 248714 215568 83407 66155 80908 72741 148577
18724 148577 276740 245790 189642 206911 381375 343668 281325 371663 552614 521307 527599
18713 527599 608435 576163 588230 514833 422634 420753 137231 12744 242644 415158 470192
18702 470192 450129 403676 270293 196054 194419 262917 93280 143368 362309 277158 335302
18691C35302o817R6652Q4385O51j10256q3745O4503j73473l4307j27917J62403
18680B07381N5644M5568J54597L46991R9354j30853k59504J5291L7805j16224
18670D56050j52979j06046j59194p3332J82801J58666k35499N6627J42385P8735
18660C48214N4474J21752J091p887m8550q2863R7839j1223p8491O9128Q6714m8209
18648E01989P9034r472k8723l0697j09669O4007J58792j74611j59686J0110J49117
18637D50191K71206P0131o2017K7365k80775k35595J5957N4421l2713Q6552L04077
18626F68800n1263l7262Q8762j24827p3764p829J00455K11466m4247j74698N6606
18615F12199n7689N8663k42836L652K23539J06259P9430R4678j27741j79777J13306
$$ plain form
18691 335302 328485 425137 509522 510173 399917 316172 380675 207202 172895 44978 207381
18680 207381 263025 308593 463190 810181 909535 778682 519178 534469 572274 456050
18670 456050 303071 197025 37831 -35501 147300 305966 70467 127094 269479 348214
18660 348214 402688 524440 525531 517644 469094 386231 484070 472847 394356 463484 550198 501989
18648 501989 581023 571551 542828 512131 402462 466469 625261 450650 290964 301074 450191
18637 450191 721397 791528 729511 756876 476101 240506 256463 310884 278171 364723 668800
18626 668800 617537 580275 669037 544210 470446 462617 563072 774538 730291 555593 612199
18615 612199 554510 613173 370337 373989 597528 703787 783217 877895 750154 570377 683683
18604F83683J02364j92350j08660R2869J6187j01703j9178O9230R6718n0910p7096
18593E11154p6075P6103J70420n3592j54358o5605K35513K32576L9147J76318
18583A091601n4542j4133o413K433j87970j09432j06527j15621O6479j46995Q5741
18572E04621J56978j2688J01978N5840r6377l5566K3619J09882L5938j48212j24440
18561E71573O8173j11O6071j44296j64226j16170K8382J09171Q2953Q0950j7525
18550E64945k0037J90216K17990j00353Q6737K596J6745P1482j59355q9503j71411
18539F10052k8345K63997K71910j0916R7472K22769O5310M8001j32394K9354K37324
18528A674534p7117j93708o7863O5286k6370j53741j7756p1525P8553K54071J73818
$$ plain form
18604 683683 786047 593697 485037 577906 594093 492390 473212 542442 639160 588250 511154
18593 511154 435079 511182 681602 628010 473652 408047 643560 876136 915283 1091601
18583 1091601 1037059 1022926 1016513 1018946 830976 721544 615017 499396 565875 418880 504621
18572 504621 661599 648911 750889 806729 710352 674786 698405 808287 844225 696013 571573
18561 571573 639746 639635 705706 561410 397184 281014 309396 418567 501520 582470 564945
18550 564945 544908 735124 953114 852761 939498 942094 958839 1030321 870966 781463 610052
18539 610052 581707 845704 1117614 1106698 1204170 1426939 1492249 1540250 1407856 1437210 1674534
18528 1674534 1597417 1403709 1335846 1401132 1374762 1221021 1203265 1131740 1210293 1464364 1638182
18517A638182J06548M6662J60967N0674M41k78424j58258L1632j64883M9058P47
18506A483346Q6559Q0290k26746p1681M0652K1670J57524K76467R0526R3508K5178
18495B057293j0370l083K0087J59186L1603J59718J78416J00745O375j29930K4741
18484B594781P3818P9161K7250L09667K86991K80441M51211L82450L55563N46877
18474E388210O71468O91297Q29703J092285K014980L019059M757104P627874J0183408
18465C6275388J0485901J2069253J5217113J8579031J7379845J2803636J2838670
18458A35648837P552412L846873j539861m515374p376008j5253926j6277431j5920549
18450H6164973j4097348j3332409j2623378j0052358p977480o029610m139693
$$ plain form
18517 1638182 1744730 1791392 1952359 2003033 2003474 1725050 1566792 1598424 1433541 1482599 1483346
18506 1483346 1569905 1650195 1423449 1351768 1392420 1414090 1571614 1848081 1938607 2032115 2057293
18495 2057293 2046923 2043840 2063927 2223113 2254716 2414434 2592850 2693595 2699970 2570040 2594781
18484 2594781 2668599 2747760 2775010 3084677 3371668 3652109 4103320 4485770 4841333 5388210
18474 5388210 6059678 6750975 7580678 8672963 10687943 13707002 18464106 26091980 36275388
18465 36275388 46761289 58830542 74047655 92626686 110006531 122810167 135648837
18458 135648837 143201249 147048122 145508261 140992887 133616879 118362953 102085522 86164973
18450 86164973 72067625 58735216 46111838 36059480 28082000 22052390 17912697
18443A7912697k688071j920758j396699j204712p66057n99567n83580j81219l04506
18434H267528j42355l85037l83246l72824j88151Q208J03689K10311J93952K13459
18424G525534K58065J53690L90947N76964O01064P00429J119111J578930K355246
18415A5259980L637896N898105R430113J2695857J3362389J5686716J9557083
18408I5528139K3650569K2322031J6987572J6889106R731253M746458j839947
18401A88015181n328029r564082j9849236k1506822k0655820j7909235j7153461
18394G6048496j6383154j3202006j0526080p687929n106224l520260k232272j682009
18386A5708562j376043q55320p91320p26166n99860k94351j12655j18673J51813
$$ plain form
18443 17912697 15224626 13303868 11907169 10702457 9936400 9336833 8753253 8572034 8267528
18434 8267528 8125173 7740136 7356890 6984066 6795915 6804123 6907812 7118123 7312075 7525534
18424 7525534 7783599 7937289 8328236 8905200 9506264 10206693 11325804 12904734 15259980
18415 15259980 18897876 24795981 34226094 46921951 60284340 75971056 95528139
18408 95528139 119178708 141500739 158488311 175377417 185108670 189855128 188015181
18401 188015181 182687152 173123070 153273834 131767012 111111192 93201957 76048496
18394 76048496 59665342 46463336 35937256 28249327 23143103 19622843 17390571 15708562
18386 15708562 14332519 13477199 12685879 11959713 11359853 11065502 10952847 10834174 10985987
18377A0985987K75768M91903P89708P71184Q18085J447718J644548J983816L158867
18368B2367584N002194Q238067J2193861J4749552J8893113K5306315K5445725
18361A32196411K0085747K1594987J6547791J681477m876786p875824j8233697
18354A61120106k2266866j9365002j6749197j1311569k468959M738075J0572535
18347A04269123J9948082K6018428K0944075J8800138J9319205O044037p069139
18340B08273949j0343146j8719577k7281188k6739779k4560764k2828476j8364532
18333E9436487j3745298r978115o800062m567930l358358k523831j968576j606178
18325A4888139j476857j328282j308483r65039q66741p89971o79770n13145n37012
$$ plain form
18377 10985987 11261755 11753658 12543366 13314550 14132635 15580353 17224901 19208717 22367584
18368 22367584 27369778 35607845 47801706 62551258 81444371 106750686 132196411
18361 132196411 152282158 173877145 190424936 192106413 187229627 179353803 161120106
18354 161120106 138853240 119488238 102739041 91427472 88958513 93696588 104269123
18347 104269123 124217205 150235633 171179708 189979846 209299051 215343088 208273949
18340 208273949 197930803 179211226 151930038 125190259 100629495 77801019 59436487
18333 59436487 45691189 35713074 28913012 24345082 20986724 18462893 16494317 14888139
18325 14888139 13411282 12083000 10774517 9809478 8942737 8152766 7472996 6959851 6422839
18316F422839m71547m54314k57693r4714j93294l38547l17873l78940m47164k80733
18306C188020j16090R851j13262n25394l82776J18083k1103n0433k42134j83544
18296A681218J18670J12695j90253j36151l9462J5267o7980j44500k71229p6379
18286A001896j26492j13475j70738P4938K61987l523k17196j57611N1696K6118
18276F27600o8269o6328J32716L1008q2091K7771k1119o0224m3858N2818m4591
18265D85433k55356q4370J65326L72848J38485j43944p7056J22526R9177j02317
18255G20752m1715n0549r4574j73498l13114J6096K96780J19619k35296j74997
18245F9504k2672P3798R7009J15278J49019j7023k6131K7489n1372J06325J55543
$$ plain form
18316 6422839 5951292 5496978 5239285 5144571 4951277 4612730 4294857 3915917 3468753 3188020
18306 3188020 3071930 3081781 2968519 2443125 2060349 2178432 2157329 2106896 1864762 1681218
18296 1681218 1799888 1912583 1722330 1586179 1546717 1561984 1494004 1349504 1078275 1001896
18286 1001896 875404 761929 591191 666129 928116 924593 707397 549786 601482 627600
18276 627600 559331 493003 625719 656727 574636 602407 581288 521064 477206 530024 485433
18265 485433 230077 145707 311033 683881 822366 678422 601366 723892 823069 720752
18255 720752 679037 628488 533914 360416 47302 63398 360178 479797 244501 69504
18245 69504 46832 120630 217639 332917 481936 464913 438782 466271 414899 521224 676767
18234F76767n4245p5499J9339K4040k8840j6972k5575j15170q8464j718J06329
18223D19992o3755j16428K64752k7548p5981M7000n7574j47457J12489Q2776r5619
18212C42647L858r4369n4662j9534j6995N6884k62310r9096J04839j8705k5285
18201h2728J92812K30379m1234j54872J37054K07064k7666J8060Q2135K8766n7541
18190E32229k04569j43092j7994J47238J30576m8932j44083R6883O4745j33148
18180B79853N3208J95737P9651j9015p0323N842R7439q0773J22576L9401j78201
18169E25395q1740Q0216P9570N7695l8739o9634k5897K31288N812M5779n427j63544
18157F40774n1866R8043j4643l07Q8950J44358j28111j34748Q387J12203m2362
$$ plain form
18234 676767 622522 547023 566362 590402 561562 544590 519015 403845 315381 313663 419992
18223 419992 356237 239809 504561 477013 401032 448032 390458 243001 355490 438266 342647
18212 342647 346505 252136 197474 177940 160945 217829 -44481 -143577 -38738 -57443 -82728
18201 -82728 110084 340463 299229 144357 281411 488475 460809 478869 561004 589770 532229
18190 532229 327660 184568 166574 313812 444388 395456 251373 348256 413001 279853
18180 279853 333061 528798 608449 589434 519111 524953 622392 541619 664195 703596 525395
18169 525395 443655 523871 603441 661136 622397 552763 526866 758154 763966 809745 804318 640774
18157 640774 588908 686951 672308 672001 760951 905309 777198 642450 650837 763040 720678
18146G20678J18553J32609l6451R4806m9532o2409P4278J83877J14754j31468
18136A159695N8803K64430L93176M7204J1767J75637Q6346M1202K87259J51538
18126B677057j102j23518M43573M90503K59170J86164L75828N42115J001699J111587
18116F963076J299312J500257K166952L245177M421608O689273J0864075K0231608
18108E7381338M2240323Q8581058J32503238L4932697n8711080o5971781p4698095
18101A56257698n9876686l4499961j8282242j1001141p226277m990839l506943
18094A6873609k484305j991059j059993o89621q39224j042038q15285o36597r34988
18085F380499o22914k78045l07796l60207l2951K19658j903j27609K41560L29882
$$ plain form
18146 720678 839231 971840 935389 1030195 980663 918254 992532 1176409 1291163 1159695
18136 1159695 1218498 1482928 1876104 1923308 1935075 2110712 2197058 2238260 2525519 2677057
18126 2677057 2675955 2552437 2996010 3486513 3745683 3931847 4307675 4849790 5851489 6963076
18116 6963076 8262388 9762645 11929597 15174774 19596382 26285655 37149730 57381338
18108 57381338 99621661 188202719 320705957 355638654 296927574 230955793 156257698
18101 156257698 96381012 61881051 43598809 32597668 25371391 20380552 16873609
18094 16873609 14389304 12398245 11338252 10648631 9809407 8767369 7952084 7315487 6380499
18085 6380499 5757585 5479540 5171744 4811537 4778586 4998244 4996341 4868732 5110292 5440174
18075E440174L19499J04520L291l8118J45883K76741N82835R99662J032730J600368
18065A0467585K405401L589526N902751R623097J1585543R974704J2518049J9058758
18057H5125414J7512314N373392L363196O527742J06532j1021864j2270896j1160980
18049H3554850j1841163j1005050p068963k001656L016647N009959O296876J2228583
18041G8190083J6128953Q175710J333964L535342K594525p769097j3134040j1756036
18033G7299404j2186233j3210370j1645433r400140p385342n088189l280710k132515
18025A2970472j395060q11490m96253n71863l02887l66799l76916l54376k10302
18016H084526K5577P8426j19365M96576R11006J706218K914839M730032P477662
$$ plain form
18075 5440174 5759673 5864193 5867484 5829366 5975249 6251990 6834825 7834487 8867217 10467585
18065 10467585 12872986 16462512 22365263 31988360 43573903 53548607 66066656 85125414
18057 85125414 102637728 108011120 111374316 117902058 118008590 106986726 94715830 83554850
18049 83554850 71713687 60708637 53639674 51638018 54654665 59664624 65961500 78190083
18041 78190083 94319036 102494746 103828710 107364052 109958577 102189480 89055440 77299404
18033 77299404 65113171 51902801 40257368 30857228 23471886 18383697 15102987 12970472
18025 12970472 11575412 10763922 10267669 9695806 9392919 9026120 8649204 8294828 8084526
18016 8084526 8110103 8188529 8069164 8565740 9476746 11182964 14097803 18827835 26305497
18007B6305497Q807912P578744R737709J4836413J3237861L905201K311496M804627
17999I1525460j04724q710988r526538q539426r139009q534383n389727j542371
17991D0038294K427518L723661M857273R581488J2376078O087637J011943K693190
17983H2797082J843478o059689j0079433r210519r291482j0138709r279851p360372
17975B3220505n707111l969537k590481j650964j284993j098018o75702n13772
17967E729927n18668m81362n29510l05302k09355l59379n50314l15396l65305
17958B095336n0707P7238k21257o4838j5728j01893j82033j55449j98074Q400
17948A190995M4936o6387L908n3031m7717k54645k4234P1502o5245K7572m7790
$$ plain form
18007 26305497 35113409 42692153 52429862 67266275 80504136 84409337 86720833 91525460
17999 91525460 91420736 82709748 73183210 64643784 55504775 46970392 41580665 40038294
17991 40038294 42465812 46189473 51046746 60628234 73004312 79091949 80103892 82797082
17983 82797082 84640560 78580871 68501438 59290919 49999437 39860728 30580877 23220505
17975 23220505 17513394 13543857 10953376 9302412 8017419 6919401 6243699 5729927
17967 5729927 5211259 4729897 4200387 3895085 3685730 3326351 2776037 2460641 2095336
17958 2095336 2044629 2121867 1900610 1835772 1820044 1718151 1536118 1380669 1182595 1190995
17948 1190995 1235931 1169544 1173452 1120421 1072704 818059 793825 865327 800082 827654 779864
17937G79864j70484k11544N8111p4827k89029n7972J19109N0500j20326j3750
17927F9652J72301J18550Q0842j35161o1762J69837J58398J89033K26797j594
17917I86893J55389J57894j3791M7562J53192o086p9720m3158k2805j58691l27013
17906H49666k66133j67709p1168r0031k0977n0875L7645j35008j48654j07122
17896a70366j37527J3607J90173J32245J10399N2025j53839j41614K0986K11542
17886A27631J32705p9256q1397J07947j35309J26692O5002m2224n8901n2990L093
17875A12993R62k0871k9331j6155M8662k5560M9085M1604k7094J64687J79279
17864D78261P4766O3560j59956l9411M1419J1547m7355P9076L6241p40q5571k42109
$$ plain form
17937 779864 609380 397836 455947 381120 92091 34119 153228 203728 83402 69652
17927 69652 241953 360503 441345 306184 244422 414259 572657 761690 988487 986893
17917 986893 1142282 1300176 1286385 1333947 1487139 1481053 1401333 1358175 1335370 1176679 849666
17906 849666 583533 415824 344656 254625 233648 182773 220418 85410 -63244 -170366
17896 -170366 -307893 -294286 -104113 28132 138531 190556 36717 -104897 -83911 127631
17886 127631 260336 181080 99683 207630 72321 199013 264015 221791 162890 109900 112993
17875 112993 113955 93084 63753 47598 96260 70700 119785 161389 134295 298982 478261
17864 478261 553027 616587 456631 417220 458639 470186 422831 501907 538148 537408 451837 209728
17852B09728O3848J09907n5047k60704p1851m1195j27546N913P2168l92J23157
17841B7986J13599P7466o0668j53089j37019J59624L05851j295L8225P6193L02782
17830G49655J89825M6138r0687K47739J47009P3198J54526q6051k29966o3942
17820A137444k38458l74199j62783O9677M1067K19800J13600m7417J06002P7018
17810I41751J38490J20258k68712k61423p8298q9795j18224j56743n992r3734
17800A27578n9804m0073o8370J26538q4467k07639K8000J95869M9049J17931L4135
17789B18747j07150o3632K8185M338j18135Q8547Q3227J00759j65221M6254m0491
17778G5428j51827n0444K9634Q0679K7679n0927j4917j61055J04598J50315Q6760
$$ plain form
17852 209728 273576 383483 328436 67732 -4119 -45314 -172860 -166947 -94779 -95171 27986
17841 27986 141585 219051 158383 5294 -131725 27899 333750 332455 370680 446873 749655
17830 749655 939480 985618 894931 1142670 1289679 1362877 1517403 1431352 1201386 1137444
17820 1137444 898986 524787 362004 431681 472748 692548 806148 758731 864733 941751
17810 941751 1080241 1200499 931787 670364 592066 502271 384047 227304 221312 127578
17800 127578 67774 27701 -40669 85869 1402 -206237 -178237 17632 66681 184612 218747
17789 218747 111597 47965 76150 80488 -37647 50900 134127 234886 69665 115919 75428
17778 75428 -76399 -126843 -97209 -16530 11149 -39778 -54695 -215750 -111152 39163 125923
17767A25923o6078o6417o7918L3471M3977p3631Q1431J488j93568O0536J05999
17756a4787K36309o0034k41748n7749R2226Q9589J61963j44068J24347J56734
17746C42782p4085k01836j37567r8222n8289N3708K5311R3442K00897J21651r3450
17735A74342j87447j01013J27117L8074j11184J65031N4944m1048r8012j5639
17725E165J57109J68418q5802k48059j29516L3632J40954O8844j99943O6876J04477
17714H2155j24904K30420P4718r9101q5111L1040j74543l4593N8138q9204m5732
17703a76717O4762J74425Q9634j53539J4507j49216q4806j02838Q2075Q4757n524
17692a62480N0369J57824J1719l4327N841j177M9781J17508m1869j92687j5373
$$ plain form
17767 125923 59845 -6572 -74490 -41019 2958 -70673 10758 12246 -181322 -120786 -14787
17756 -14787 221522 161488 -80260 -138009 -45783 43806 205769 61701 186048 342782
17746 342782 268697 66861 -70706 -168928 -227217 -173509 -148198 -54756 146141 267792 174342
17735 174342 -13105 -114118 12999 51073 -60111 104920 159864 118816 20804 5165
17725 5165 162274 330692 244890 -3169 -132685 -99053 41901 110745 -89198 -22322 82155
17714 82155 -42749 187671 262389 163288 78177 109217 -65326 -99919 -41781 -130985 -176717
17703 -176717 -111955 62470 152104 -1435 13072 -136144 -220950 -323788 -241713 -156956 -162480
17692 -162480 -112111 45713 57432 23105 28946 27769 77550 195058 153189 -39498 -54871
17681e4871R6682j6156j76658p2815o4710j19188J60992J93032N2773O5833J9016
17670H3930j61608j22923K5090R2291K6031q5140j32588r3602K3290m8554j13109
17659e06892J00006J47123j02480j23636j6950J49229K79018J05412m8750L6848
17649A8928P4974K1854j06188M1813J5388k6761j63739l5816p1524J32968J94332
17638I6229M8980j50864l174j59061m1161R1461J04985m7684n5117m9756M6696
17627a18466J39231q151J22119N3682j53218n8403p7067L2267J44160R6597j75903
17616c152j80532J52544K8447K8087n436o5344J02243L1020k8806Q291L8897J1716
17604A17975N8386L8184m2694q6836R873P1919O6725j07694K5433k6587p6028
$$ plain form
17681 -54871 41811 25655 -151003 -223818 -288528 -407716 -246724 -53692 -919 64914 83930
17670 83930 -77678 -200601 -175511 -83220 -57189 -142329 -274917 -368519 -345229 -393783 -506892
17659 -506892 -406886 -259763 -362243 -485879 -502829 -353600 -74582 30830 -17920 18928
17649 18928 93902 115756 9568 51381 66769 40008 -123731 -159547 -231071 -98103 96229
17638 96229 145209 -5655 -8829 -167890 -209051 -117590 -12605 -60289 -115406 -165162 -118466
17627 -118466 20765 12614 134733 188415 35197 -23206 -100273 -68006 76154 172751 -3152
17616 -3152 -183684 -31140 -2693 25394 19958 -45386 56857 87877 59071 67362 106259 117975
17604 117975 176361 214545 171851 85015 94888 166807 233532 125838 151271 124684 48656
17593D8656K4897m4750K5492j24969o6210J40560P7364K0199q8209J9866J9133
17582E2029j27279j47841P9413k90k0955R4443M3665L9653n8967k5174l5368m3695
17570a50366K22378K73882m4683j85383j04652O0655O4075P343j19247j11622
17560h7620k2320J5965j69706j96379J28275R2427o5015q6968K89509J36796k35620
17549b00656j41583K78707J98248r4111j95285q6769K8926R0701J73983R1136
17539A43297O5813M1027p2580P3847J65738q8542j44131K16712J74245L0639n6911
17528E49154L1658K8387k70578j67633j57712k1312M0265J14272J2106J00111
17518B58718L2603K48379J25121P3190l556R2061k02397o4947j8801p6562m0989
$$ plain form
17593 48656 73553 28803 54295 -70674 -136884 3676 81040 101239 13030 32896 52029
17582 52029 -75250 -223091 -143678 -143968 -164923 -70480 -26815 12838 -46129 -71303 -106671 -150366
17570 -150366 72012 345894 301211 115828 11176 71831 135906 143249 24002 -87620
17560 -87620 -109940 -93975 -263681 -460060 -331785 -239358 -304373 -391341 -101832 34964 -200656
17549 -200656 -342239 -63532 134716 40605 -154680 -241449 -212523 -121822 52161 143297
17539 143297 209110 250137 177557 251404 417142 328600 184469 401181 575426 606065 549154
17528 549154 580812 609199 338621 170988 13276 -8036 32229 146501 158607 258718
17518 258718 291321 539700 664821 738011 734455 826516 624119 559172 540371 463809 422820
17507D22820k9602q9449k20008l1589q4202J18543K12644j76216j80163l4608
17497i1830n5453J0295N9493K9101J22739l7800k41191l5789M4706J22128J24148
17486E0547j12986k11559l3729J92860J38277j9164J11463J40005p6802Q020J26573
17475C13505N0142J0149O3565l2103L2138P2603k01479l37197R8112J31299p772
17464A92962J1621L3888P4486k7648J06486P3452j49288J71729J75959j38247
17454E25400r9656R745j43525k09462n6719j25200o7989J19962P9705L1108P2594
17443A35963o208K89372N24978N87220K94097k63313l50437l11692k94185k62325
17433C43470j21293J28690j4823j13677j53917m1201J10768q960k62149j93676
$$ plain form
17507 422820 393218 303769 83761 52172 -32030 86513 299157 122941 -57222 -91830
17497 -91830 -147283 -136988 -77495 -48394 74345 36545 -204646 -240435 -195729 -73601 50547
17486 50547 -62439 -273998 -307727 -114867 23410 4246 115709 255714 178912 186932 313505
17475 313505 363647 373796 437361 405258 437396 509999 308520 -28677 69435 200734 192962
17464 192962 204583 238471 312957 285309 391795 465247 315959 487688 663647 525400
17454 525400 425744 435489 291964 82502 25783 -99417 -167406 -47444 32261 63369 135963
17443 135963 129755 419127 944105 1531325 1825422 1562109 1211672 899980 605795 343470
17433 343470 222177 350867 336044 222367 68450 27249 138017 129057 -133092 -326768
17423c26768J15930J83424o4209J09403m4250L8472L8588J475K3118J08473l2327
17412A51329O5491j68306P767o4277O113R2291J61596k60709l25144J61718K0132
17401a51999J6376J06242J87694o828j16529o1488J45847q002J3200R205o3802
17390F9916O8939p0529n9603J60288k1579j38585J08674J5716r505j01944j831
17379A9957J26394O0494j62549p5216o7312r0315n2524J36088k164q3563n912
17368a96622R579J35823K34890K01684j25253p9437j24126J10797J67593k40047
17358I4881l46914k2440J47675J67719R950P2261K04301o4960q6371m8531j60790
17347c3219l16450q2533K4370o4258K03894J12948L515m887J67665R9146R7763
$$ plain form
17423 -326768 -210838 -27414 -91623 17780 -26470 12002 50590 52065 75183 183656 151329
17412 151329 216820 48514 56281 -7996 -1883 90408 252004 -8705 -333849 -172131 -151999
17401 -151999 -135623 -29381 158313 151485 34956 -26532 119315 111313 124513 133718 69916
17390 69916 138855 68326 8723 169011 147432 8847 117521 133237 123732 21788 19957
17379 19957 146351 206845 44296 -30920 -98232 -188547 -241071 -104983 -107147 -190710 -196622
17368 -196622 -187043 -51220 183670 385354 260101 180664 56538 167335 334928 94881
17358 94881 -252033 -274473 -126798 40921 50871 123132 327433 262473 176102 127571 -33219
17347 -33219 -349669 -432202 -407832 -472090 -268196 -155248 -151733 -156620 11045 110191 207954
17336B07954L3025q1586o7014K9189K67337p7449j49549r2242K410J09814l7116
17325A44773j20179P6374o6979j06922j02183O9470O6900p801j00240O997M3113
17314i6677M6137n513J37620m3794m7790j21115j70651O166J25937J93744p3363
17303d9299L2520J07036j75230J14084J73507J1003j42274N103M6626n7796l1776
17292C3504k01873K3745J60383P3177r2474O0165k9516P7093k0915J1330q6647
17281G972L5791j63453l8525K31169m9542j29894q9176j00342N4601O6373j59644
17270c34670n6624J6532K0098Q3375K14424P5739r9729k379R0772j3638j10649
17259a16749j30239m7162j04305j1128J16088J32740Q4754N0034R5888j49889
$$ plain form
17336 207954 240979 159393 92379 121568 388905 311456 161907 69665 72075 181889 144773
17325 144773 24594 100968 33989 -72933 -175116 -105646 -38746 -46547 -146787 -139790 -96677
17314 -96677 -50540 -56053 81567 37773 -10017 -131132 -301783 -295617 -169680 24064 -49299
17303 -49299 -16779 90257 -84973 29111 202618 213621 71347 76450 123076 65280 33504
17292 33504 -168369 -144624 15759 88936 -3538 56627 27111 104204 83289 94619 7972
17281 7972 43763 -119690 -158215 72954 23412 -106482 -195658 -296000 -241399 -175026 -334670
17270 -334670 -391294 -374762 -354664 -271289 -56865 18874 -80855 -83234 7538 -6100 -116749
17259 -116749 -246988 -294150 -398455 -409583 -293495 -160755 -76001 -25967 69921 -79968
17249g9968k59904k27675K20616L88014O8065j36829k15378R8077J3454J20497
17239a1031M5049J04567p2076l1015j0285q9759m1099q2623o178O5751Q4349O3166
17227A8816J84432j06501j47192l4895R6934k2765r2718j9744L5003j81907R6415
17216a74122O6699p6104P4968K7165Q6070L1890J8509O1012K6107j40635j42993
17205a41434Q7181J73237O601p5468j46205j655P2542l2808q167M4415J35253
17194A13492m681r8992j57138o5458J31573r8415m202O1717L9827p5865Q7144
17183g0998J55510J02893k6609o8244j18167j33172J22892q2024j33670m0780
17173b92369m1229R3169J95406j3597q5807j63697n5903J0036n5164N9669J82163
$$ plain form
17249 -79968 -339872 -567547 -346931 41083 109148 -27681 -243059 -144982 -131528 -11031
17239 -11031 34018 138585 66509 35494 25209 -64550 -105649 -188272 -194450 -128699 -44350 18816
17227 18816 203248 96747 -50445 -85340 11594 -11171 -103889 -123633 -88630 -270537 -174122
17216 -174122 -107423 -183527 -108559 -81394 4676 36566 55075 116087 142194 1559 -141434
17205 -141434 -54253 118984 125585 50117 -96088 -97743 -25201 -58009 -66176 -21761 113492
17194 113492 108811 9819 -147319 -212777 -81204 -179619 -183821 -122104 -82277 -158142 -70998
17183 -70998 84512 187405 160796 92552 -25615 -158787 -35895 -117919 -251589 -292369
17173 -292369 -333598 -240429 -45023 -58620 -144427 -308124 -364027 -353991 -409155 -349486 -167323
17162a67323K3052j8442J90937O904j36916K0248O7270k5864n1424K4004m6618
17151a14172J9304k3137K2005L5113j96722l6720Q035K537r0283Q5312R3165J44964
17139e0599J48494M7389j85169j06778R8804J90320J13373N9126j09145j08427
17129I7388q3444j3686J36829j7153k37917k2232O7473m6112j31097M9404q9502
17118b90049l5352J67165R2742Q6613k5966j35870J3372j94596r0629N1928N9477
17107c01165J15127O4427l1605L7665R9828J09060n983M2634k4752j10423j23104
17096a28291L0184J8177k1895J05237J17260p7586o592j18710j04244K8459R2812
17085f5189M4602N5531J07584K7575j56949J6222m8950j1909q9706O652J02518
$$ plain form
17162 -167323 -144271 -162713 28224 35128 -101788 -81540 -14270 -40134 -91558 -67554 -114172
17151 -114172 -94868 -118005 -96000 -60887 -257609 -294329 -286294 -283757 -374040 -288728 -195563 -50599
17139 -50599 97895 145284 -39885 -146663 -47859 142461 255834 314960 205815 97388
17129 97388 13944 258 137087 119934 -117983 -140215 -72742 -118854 -249951 -200547 -290049
17118 -290049 -325401 -158236 -65494 21119 -4847 -140717 -127345 -321941 -412570 -360642 -301165
17107 -301165 -186038 -121611 -153216 -115551 -15723 93337 87354 129988 105236 -5187 -128291
17096 -128291 -98107 -79930 -101825 3412 120672 43086 36494 -82216 -186460 -158001 -65189
17085 -65189 -20587 34944 142528 170103 13154 29376 -19574 -31483 -121189 -114537 -12019
17074a2019J02570p7347k59700n1736J45506Q0480J36211j8405P9481q6867K4946
17063F3120l6248j8870j8040k8200J20586j07065J57708k7626j59004N9746o4740
17052e8633p2574l376R5710Q9237j24502J250n080n8477R1198l1148k7562j806
17040a05763l0527k7599J58768J13653M6275L2208K7830J71046N6681m7120q3349
17029C12103k04786m9583J22766O839K351p7262N8109m0599Q4720m5991L4414
17018B03081k7058r0099P0655n7387J30917m1390J176j05054j0672Q043o2430
17007A9782N3206k1615L8854Q2746Om5630J17021R2598r8461j54709j4484K5602
16995I4916J11387k29357r993J46937q5040k0230j7882R748j6510Q9399m6539
$$ plain form
17074 -12019 90551 13204 -246496 -298232 -152726 -72246 63965 45560 125041 38174 63120
17063 63120 26872 8002 -10038 -38238 82348 -24717 132991 105365 -53639 6107 -58633
17052 -58633 -131207 -134583 -38873 50364 -74138 -72888 -77968 -136445 -45247 -76395 -103957 -105763
17040 -105763 -136290 -163889 -5121 108532 154807 187015 214845 385891 442572 395452 312103
17029 312103 107317 57734 180500 187339 189690 112428 170537 129938 214658 168667 203081
17018 203081 176023 85924 156579 99192 230109 188719 189895 84841 74169 82212 19782
17007 19782 72988 51373 90227 172973 172979 127349 244370 336968 238507 83798 69314 94916
16995 94916 206303 -23054 -33047 113890 28850 8620 -9262 486 -16024 73375 26836
16984B6836J12297J24969J00489L0040r0610m9457J7305L5315l4301n6009n0286
16973A66588R648P4380j25351n5276o027J00857K4244M5459m3466n8296M5145
16962A77905m8993M5094k9210j96872j48137J96195J81093p265k33249J7225J05075
16951E8861O0990N2496r2223j96359p1175O9164R1654N0853O2096J21550q6555
16940A21352j95921j31164l4968k6599R8466K63811O974k95931J50041J27644
16930H3705k7546K4881K56234r5177j25805l5341r5001j3351J92761L0780m0845
16919A55295j44327N1485L1562K33937l6861j04644J79765j50672k04723k4096
16909a3279n3198j31843o3893j0556l3918R6612J50346P1466L1781o4765j11129
$$ plain form
16984 26836 139133 264102 364591 394631 304021 254564 271869 307184 272883 216874 166588
16973 166588 176236 250616 125265 69989 63962 164819 189063 234522 191056 132760 177905
16962 177905 128912 174006 144796 -52076 -200213 -4018 177075 169810 -63439 -46214 58861
16951 58861 119851 172347 80124 -116235 -187410 -118246 -26592 24261 86357 207907 121352
16940 121352 -74569 -205733 -240701 -267300 -168834 94977 101951 -193980 -43939 83705
16930 83705 56159 81040 337274 242097 116292 80951 -14050 -27401 165360 196140 155295
16919 155295 10968 62453 94015 327952 291091 186447 366212 215540 10817 -13279
16909 -13279 -66477 -198320 -262213 -272769 -306687 -210075 -59729 11737 43518 -21247 -132376
16898a32376L6266j21402K681R2389J5365m6579M9627P0457M7717N5530J0271
16887G9946L4674J06764O7843p9398j73352m4042O0738r3712N1672P696r410O3652
16875G3071q2251j19086l2903q396p9216j6069J56786L67742r3148q8077k17560
16864a39107r1117N1704N0297O2080j04854L4284O2750k106J97063Q9353k0191
16853A90156j81621j05140L1453K231K02220j0621n3067J54680n5096j27466p1899
16842b4170j42229j7092J11875m7842J06198j67642r195J63533J48568j05758
16832A6246r5579L4015J45400o5954J6996n1126N8312J7354J03178n3518o4334
16821F0990p18K8836p9235q3619k8788K3388K5913r0798O2195j41075j56991M0654
$$ plain form
16898 -132376 -96110 -217512 -214831 -122442 -107077 -153656 -104029 -33572 14145 69675 79946
16887 79946 114620 221384 289227 209829 36477 -7565 53173 -40539 11133 18829 9419 73071
16875 73071 -9180 -128266 -161169 -169565 -248781 -264850 -108064 259678 166530 78453 -139107
16864 -139107 -230224 -178520 -128223 -66143 -170997 -136713 -73963 -76069 120994 210347 190156
16853 190156 8535 -96605 -65152 -62921 139299 128678 75611 230291 175195 47729 -24170
16842 -24170 -166399 -183491 -71616 -119458 -13260 -180902 -190097 -26564 122004 16246
16832 16246 -79333 -45318 100082 34128 51124 -2 58310 75664 178842 125324 60990
16821 60990 60272 89108 9873 -73746 -102534 -79146 -53233 -144031 -81836 -222911 -379902 -339248
16809c39248L4830J60002J40325O6317l5398j13928J24906k9899o4756l7626J38035
16798D3560k05466l8382j1072O5384R127o4168j88474r0423K68446K88970n1607
16787B5895P2315M4690o721r4972L3888J1023j43412R720o5786m5760j4206p4552
16775b47878L7267L74883k7034j14188k525o0616j935j05975J21273J67556N4408
16764A95236q8360j06493L757N0096J29222j05857q2537j22085J4165o9533l9147
16753b21536K57057J55557n2206j68389j91782M9511k4947j8799K11433r0595
16743i4696m1317k71029N1786K53277J72468P5037j02047M8911j1130j49835K2412
16732d6163J04171j68465n7032R5048K8025n7407O8254o8047q0553k4232J46898
$$ plain form
16809 -339248 -304418 -144416 -4091 62226 26828 -87100 37806 7907 -56849 -94475 43560
16798 43560 -161906 -200288 -211360 -145976 -136849 -201017 -389491 -479914 -211468 77502 25895
16787 25895 98210 142900 136179 41207 75095 86118 -57294 -47574 -113360 -159120 -173326 -247878
16775 -247878 -210611 164272 137238 23050 20525 -40091 -42026 -148001 -26728 140828 195236
16764 195236 106876 383 4140 54236 183458 77601 -4936 -127021 -112856 -182389 -221536
16753 -221536 35521 191078 138872 -29517 -221299 -171788 -196735 -215534 -4101 -94696
16743 -94696 -136013 -407042 -355256 -101979 70489 145526 43479 92390 81260 -68575 -46163
16732 -46163 58008 -110457 -167489 -72441 -44416 -101823 -33569 -101616 -182169 -206401 -59503
16721e9503R7226Q8590n5471O3198O7965j36875l04356q4944J88479l2722r7987
16710b66400J91057N4181J06269J2339L2594M8023k6939K0434J7444j02134j98032
16699a11164n9702J66708K87164M8232j17468r7557j16884j68405k6911K23389
16689B7402K0244j11294j43458R9438K1161L5679q1699N3557O4187j45057n8463
16678b18303K9519M299J53294O4843j5027L5105J4113O6241K0959m8999j37752
16667c1708Q6867J92919P7840q9062j47272j8001O7853R4595r1684j30655n3846
16656d2154K6221J38770M9138J14932L8995j92009j30678L0382n7653p8046K11320
16645A09218J48229k04976r8606j30658j09217J10381J72799j28380j17262p8311
$$ plain form
16721 -59503 37723 126313 70842 134040 202005 65130 -239226 -324170 -135691 -168413 -266400
16710 -266400 -75343 -21162 85107 97446 130040 178063 151124 171558 189002 86868 -111164
16699 -111164 -170866 -4158 283006 331238 213770 116213 -671 -169076 -195987 27402
16689 27402 47646 -63648 -207106 -107668 -86507 -50828 -132527 -78970 -14783 -159840 -218303
16678 -218303 -188784 -184485 -31191 33652 18625 53730 67843 134084 155043 106044 -31708
16667 -31708 55159 248078 325918 236856 89584 71583 139436 234031 142347 11692 -42154
16656 -42154 -15933 122837 171975 286907 325902 133893 3215 33597 -24056 -102102 109218
16645 109218 257447 52471 -46135 -176793 -286010 -175629 -2830 -131210 -248472 -326783
16635c26783M8452J16460P3438J20863M107j12716o1939j54097M0076R9796J57326
16624D983K3018m904%j08680m1812M8704k5398p7653J01831P2303N7760p6056
16612b5904J86242J45270o7545o4911p7215k26923p5398K18882j9641j58722Q0189
16601h5676P9177k3467Q5522o429q4419J27247J54723j6993n0521k48365j11625
16590a80826K1718q5466N8751M5566j70013L130J58952P3300o3013j19522Q6178
16579a71245J62347j456o4164j06982O2175K81388R172k93787n0563J74882r8554
16568i6787j04713J20757J4940j04731L9434Q9859m7576o1059M2290o2191L6080
16557a33697J28529n8851k14634R0680L3608q2049J35075O0186m5474P3615K85705
$$ plain form
16635 -326783 -278331 -161871 -88433 32430 36537 -76179 -138118 -292215 -252139 -152343 4983
16624 4983 28001 23097 23097 -85583 -127395 -78691 -104089 -181742 -79911 -7608 50152 -25904
16612 -25904 160338 305608 238063 173152 95937 -130986 -206384 12498 -7143 -165865 -85676
16601 -85676 -6499 -29966 55556 49127 -35292 91955 246678 229685 179164 -69201 -180826
16590 -180826 -159108 -244574 -185823 -140257 -310270 -307140 -148188 -74888 -137901 -257423 -171245
16579 -171245 -8898 -10354 -74518 -181500 -119325 162063 171235 -122552 -173115 1767 -96787
16568 -96787 -201500 -80743 -65803 -170534 -131100 -41241 -88817 -149876 -107586 -169777 -133697
16557 -133697 -5168 -64019 -278653 -187973 -154365 -236414 -101339 -41153 -86627 -13012 272693
16546B72693K8791p2070k66023r8653k7447J96812K5913r7559j20075J0743q9823
16535b36698Q111J7869R7404J39564M6620j02088J3982M3347O875J10930Q5373
16524B31289j40694r9596j4912J43525J35871n598k25073j89016J14921O4500
16514A5217p4614j34027J26121L0390M1594J16784n2957q4430L563j3631o437
16503c2427N4089O8226J18155K2387q3441O8706J07888k24504R4495M3629O808
16492B44011J78414o8554k16893o3235l7018j04885O4772O9302q8490o9832N0982
16481d1426q113j817j71661K1527J55876K14294j33756m4768n8250J67331J81705
16470B80942j74116j25300j40233k9239M0763q3264m7766K49873J76704r8167
$$ plain form
16546 272693 301484 229414 -36609 -135262 -162709 34103 60016 -37543 -157618 -146875 -236698
16535 -236698 -228587 -210718 -113314 26250 72870 -29218 -15236 28111 34986 145916 231289
16524 231289 90595 -9001 -23913 119612 255483 249885 24812 -164204 -49283 15217
16514 15217 -59397 -193424 -67303 -36913 4681 121465 68508 -15922 -12359 -25990 -32427
16503 -32427 21662 89888 208043 230430 146989 215695 323583 99079 193574 237203 244011
16492 244011 422425 353871 136978 73743 36725 -68160 -3388 65914 -22576 -92408 -41426
16481 -41426 -49539 -51356 -223017 -201490 -45614 168680 34924 -9844 -68094 99237 280942
16470 280942 106826 -18474 -158707 -187946 -147183 -230447 -278213 -28340 148364 50197
16460E0197p4514J434J21923K3704l1766j80840Q1774j73235N5340K01756o6110
16449I663k07067K05592P4108j66327j00272K9981j50999j16973N5800M1342P5058
16438b50094J57199n084j53516q9046J80904J29774K3322M5197L0411o8373J30006
16427A30700o427n7054m8570q1551j29780R1929K02357K5374P1174j64324Q826
16416D2654Q6091L397n6215n2044j00786o7475l5450l3609J13057J10183J04994
16405A14797j6820o088K27168K2728j3988n6344j29501R0732n4915j16999J3267
16394G4037J01272k2835R354r3557J7592m5260r7382Q175M1122r9050M9643J05962
16382D9073O7835J23959r2104l12002J43421L11615m1278j65480l3959n3687M9857
$$ plain form
16460 50197 -24317 -22883 99040 122744 90978 -89862 -8088 -181323 -125983 75773 9663
16449 9663 -197404 8188 82296 -84031 -184303 -154322 -305321 -422294 -366494 -325152 -250094
16438 -250094 -92895 -97979 -251495 -340541 -159637 -29863 -6541 38656 69067 694 130700
16427 130700 124273 67219 18649 -62902 -192682 -100753 101604 126978 198152 33828 42654
16416 42654 128745 132142 75927 23883 -76903 -144378 -179828 -213437 -100380 9803 114797
16405 114797 97977 91889 319057 341785 327797 271453 141952 232684 177769 60770 74037
16394 74037 175309 152474 161828 68271 85863 40603 -56779 -48604 -7482 -106532 -56889 49073
16382 49073 116908 240867 148763 -163239 -19818 291797 250519 85039 51080 -2607 47250
16371D7250k0783p607J63516j21113m5206O209l6233j51642j80772m4307P4182
16360c16506J48699J89636J84212k6810L3518J255M8170p6547r6126J61043n2321
16349A98223r3425j79097k5613q6637o8818j80695P8965J58716O761Q3167J62589
16338E4136J86854K6587j4490j49132q2014R792n8128n1833l6619J27767p9161
16327f6241j72003J5765p914l3943r2035J52938P178J0482j17779J93677K36313
16316A26438J1706j64613p4806m0864P8998J32732J52888N1875r8250j61720j50099
16305a35715K5938K82384p2078j77346q5825p33K07418Q1089j44079q1541J41208
16294D0720J2404q2049k4555j16757j65858N5824N9194p613L4916P0774L4710
$$ plain form
16371 47250 26467 18860 182376 61263 16057 22266 -13967 -165609 -346381 -390688 -316506
16360 -316506 -167807 21829 206041 179231 212749 214004 262174 185627 89501 250544 198223
16349 198223 104798 -74299 -99912 -186549 -255367 -436062 -357097 -198381 -191620 -108453 54136
16338 54136 240990 267577 253087 103955 21941 31733 -26395 -78228 -114847 12920 -66241
16327 -66241 -238244 -222479 -230393 -264336 -356371 -203433 -196255 -185773 -303552 -109875 126438
16316 126438 138144 -26469 -101275 -142139 -63141 69591 222479 274354 176104 14384 -135715
16305 -135715 -109777 172607 100529 -76817 -162642 -163375 44043 125132 -18947 -100488 40720
16294 40720 53124 -28925 -53480 -170237 -336095 -280271 -221077 -228690 -193774 -123000 -88290
16283h8290J25347K8147n7101J6179n0181k32895j25564k3636j43401J49457k2514
16272d24452k2632J53622K98663j3768j91496j04416r7605L00511J04905L0762
16262C4094j33103N8974K8315R816J48343j39059o3591j1157j49622K6299p3377
16251b64068K0504R2058K26448l8078j28225n5159O3459J98102J42274N2633j59929
16240A50019p0036p6958Q8339O8189k84605j88793m2410O7046Q3212K04437N4811
16229E3251n9842m3017j72891K5967K06442P1371J02774n5631j98060j71774k3377
16218b64787J38103M7011n8472J66973J05578j05997J4268M6667L1049o7150r5660
16207d2417M8656k3341j36766k9109L4240J01204N3560j39377k35525J32984K33675
$$ plain form
16283 -88290 37057 65204 8103 24282 -25899 -258794 -384358 -407994 -551395 -401938 -424452
16272 -424452 -447084 -293462 5201 -8567 -200063 -304479 -402084 -101573 3332 34094
16262 34094 -99009 -40035 -11720 -1904 146439 7380 -56211 -67368 -216990 -190691 -264068
16251 -264068 -243564 -151506 74942 36864 -91361 -146520 -83061 115041 257315 309948 150019
16240 150019 79983 3025 91364 159553 -125052 -313845 -356255 -289209 -205997 -1560 53251
16229 53251 -6591 -49608 -222499 -196532 9910 81281 184055 128424 -69636 -241410 -264787
16218 -264787 -126684 -79673 -138145 28828 134406 28409 42677 89344 120393 53243 -42417
16207 -42417 6239 -17102 -153868 -182977 -148737 -47533 6027 -133350 -368875 -235891 -2216
16196b216p234J14814K6627j20691j07509J1508J78047K02374J855K3396J35503
16185D56474l4808k1748p6384j89608j49549j52254N3235K12109K2294j15235
16175D526j17204P5950J05367j65838j01227J4769j8207J21928M0753O3635l8914
16164a4462p8280P4338J80038O6239j10059p491Q1341o4186j29543M2331j85067
16153a44801j86664J16773k5174L7105J04109J72793J35376J9711j13660J07315
16143B22883N7039j02400p1819p8694L25809J00894j42368k26418q6875r0885
16133i2834k80946r8107k362n492J6132J03924Q5902K17698O0859j36030O5059
16122f6197L2004O1235Q8431j16851j55300p2224m7442k0663O7458M9297O24j01004
$$ plain form
16196 -2216 -9450 105364 131991 11300 -96209 -84701 93346 295720 297575 320971 456474
16185 456474 421666 399918 323534 133926 -15623 -167877 -114642 97467 119761 4526
16175 4526 -112678 -36728 68639 -97199 -198426 -183657 -201864 -79936 -39183 24452 -14462
16164 -14462 -92742 -18404 161634 227873 117814 110323 191664 127478 -2065 40266 -144801
16153 -144801 -331465 -214692 -239866 -202761 -98652 74141 209517 229228 115568 222883
16143 222883 279922 177522 105703 27009 352818 453712 311344 84926 -1949 -92834
16133 -92834 -373780 -471887 -474249 -479741 -463609 -359685 -273783 -56085 4774 -131256 -66197
16122 -66197 -34193 27042 115473 -1378 -156678 -228902 -276344 -297007 -229549 -180252 -179628 -280632
16110b80632j48608K2944K42749J44553j3088M6125k11133j38557J56218j1464
16100a90893J182O434J98453K1155J1701q9123P4784q7496K3856J10404k52698
16089a72241m1231L7582J06536k7927r4821Q6465J440q3183N5848L892l9267K04466
16077C7559K6071K4070J22038p5981o2639M9173l0888P1733J64550p9352j06733
16066A39601J8492J01290m5174l7722l463q1309m2257J10635j08162j70874m2469
16055a61412j2402O6723Q5370J12652j37900J160p0544J2290m270p6185l8816
16044b23334N7806K0056M2221j21291j73074K07259J83939J39541K7266k03113
16034d2724J27561N4236p7301o6726L2673J7684r3489j91555K8028K47621q105
$$ plain form
16110 -280632 -429240 -406296 -163547 -18994 -32082 14043 -197090 -335647 -179429 -190893
16100 -190893 -189711 -183277 15176 36331 48032 -41091 33693 -53803 -29947 80457 -172241
16089 -172241 -213472 -175890 -69354 -97281 -192102 -105637 -104197 -187380 -131532 -127640 -166907 37559
16077 37559 63630 87700 209738 133757 71118 120291 89403 161136 325686 246334 139601
16066 139601 158093 259383 214209 176487 173024 91715 49458 160093 51931 -118943 -161412
16055 -161412 -173814 -107091 -21721 90931 -46969 -45809 -116353 -104063 -108333 -184518 -223334
16044 -223334 -165528 -145472 -103251 -224542 -397616 -190357 -6418 133123 160389 -42724
16034 -42724 84837 139073 61772 -4954 27719 45403 -48086 -239641 -211613 36008 27903
16023B7903M0569N0430P5198j0846p9861N1326J20274J3858j51062j47282R163
16012c30O3164L2867j21719P4011J18959K0571J7665q7361j39696l0389k9468
16001h1726N636j16521J36701K01862K29224m2080k07374j43772l6000o8186J00231
15990b2005J34591J01713j27394k2399r8876r0738N8743J66850j60842n2581k3097
15979a36035R563r2953k3743L6302K4181J08119N4835m3506j1264L3860p8765
15968a19406K0602m6467P8653Q4311J46218r5067j99358p4692o4518l261J33497
15957a39488J65191O8171j33057j42815q1440j24098L03541J94198J37697p9047
15947A68853Q4390p2945o6439J8765p3592j1512q363R1304o0224M341m647j11682
$$ plain form
16023 27903 68472 118902 194100 183254 103393 154719 274993 288851 137789 -9493 -330
16012 -330 62834 95701 -26018 47993 166952 187523 205188 117827 -21869 -52258 -81726
16001 -81726 -76090 -192611 -55910 145952 375176 333096 125722 -18050 -54050 -122236 -22005
15990 -22005 112586 214299 86905 64506 -34370 -125108 -66365 100485 -60357 -112938 -136035
15979 -136035 -126472 -219425 -243168 -206866 -182685 -74566 -19731 -63237 -74501 -40641 -119406
15968 -119406 -98804 -145271 -66618 17693 163911 68844 -130514 -205206 -269724 -272985 -139488
15957 -139488 25703 93874 -39183 -181998 -263438 -387536 -83995 110203 247900 168853
15947 168853 253243 180298 113859 132624 59032 47520 39157 130461 70237 74578 69931 -41751
15935d1751k33973M7317Q0803R6361J14081K5999n9192j7818m039n2731m308J8484
15923c0767P4231M0344J44490J58188j9990r9373l2027R1279j6453j47215l1047
15912A31660k7342Q3879j46327k74431K1305J78633M1801l7946J7462r6531j29326
15901b37163M881j6667O5166J04104J24787q6388l1360J98132P9485m8880j01716
15890E4381j09015j9877j6204j1351J45574J17465J11685j56794m5186o4332n7870
15879e1524O4515M280J36885J25010j17163l9990j59814m7076K6687l1001J0407
15868g8784J17118J30126Q5527o8253q6329j10429O4042J36316k1414k5361J77184
15857C19743j00860k32545k668J27588q0843q2573p064j12466J35582J93147j08116
$$ plain form
15935 -41751 -275724 -228407 -147604 -51243 62838 88837 29645 11827 7788 -44943 -49251 -30767
15923 -30767 43464 83808 228298 386486 366496 267123 235096 326375 309922 162707 131660
15912 131660 104318 188197 41870 -232561 -211256 -32623 9178 -28768 -11306 -107837 -237163
15901 -237163 -232282 -248949 -183783 -79679 45108 -41280 -72640 125492 204977 156097 54381
15890 54381 -54634 -74511 -90715 -102066 43508 160973 272658 115864 70678 6346 -51524
15879 -51524 12991 17271 154156 279166 162003 122013 -37801 -84877 -58190 -89191 -78784
15868 -78784 38334 168460 253987 185734 99405 -11024 53018 189334 167920 142559 319743
15857 319743 218883 -13662 -16330 111258 30415 -52158 -59222 -171688 -36106 157041 48925
15846D8925j07431K8527k2151l7733R1556J78178j13324j56861J12195N7065N6975
15835A35921n5516K959O2910j38502m3253m4332J02937K58615l2163j89524K1300
15824H1352J97765Q9827j83238q4246n6848l4771k01698j31153M1900K44492K5341
15813a1277Q881j17756M0016J2532R1677j06284l75978K55869K73956n4641j8695
15802a700L3766K5073L6233l975j27960o524J5254N1988K3537j43351O1337J32997
15790I6675j95463j35996k2141n2623P9335P9310R8610j9375r2622K08338J30167
15779A74215M85j72136O947k26305j29072J72915K47459k8742j19157O9731j5463
15768a9123N130J2315k7703j46822L3297R8604k4048N9511N249J9577L8179j845
$$ plain form
15846 48925 -58506 -29979 -52130 -89863 1693 179871 66547 -90314 21881 78946 135921
15835 135921 80405 83364 146274 7772 -35481 -79813 23124 281739 249576 60052 81352
15824 81352 279117 368944 185706 101460 44612 9841 -191857 -323010 -281110 -36618 -11277
15813 -11277 -2396 -120152 -80136 -67604 24073 -82211 -458189 -202320 71636 16995 -1700
15802 -1700 32066 57139 93372 89397 -38563 -45087 -29833 22155 45692 -97659 -36322 96675
15790 96675 -98788 -234784 -256925 -309548 -230213 -150903 -52293 -71668 -164290 44048 174215
15779 174215 174700 2564 9511 -216794 -345866 -172951 74508 45766 -73391 -3660 -19123
15768 -19123 -13993 -1678 -29381 -176203 -142906 -44302 -68350 -8839 -3590 15987 54166 52321
15756E2321J59936L2235j12278k81284j69711l7596o3984M9064K65131Q6671q0502
15745i9997Q542m211J93886M9014o2569J5902j9057R1501q8999o2629J93577R4799
15733C09759j26871k70790j08106M8061J50554o5J00575m3830q7300O3834K2631
15722E8452j36762n9127Q451L8383j5066J26357M3657n551k6196K11072j9853
15711B23817m3854k3474r1327k1590m4597Q0608K2273j11285k07931o9488J4891
15700b71957Q6755J64457N7065N8245N436j02238j1633j07470o4212J62731j06840
15689a29661o6437k1023J01314K05445R1043k9900O0633J11072j18360k36723
15679c2597o8518M1137J07037q8064j01146n7487P5442J93457Q1956j17967l9793
$$ plain form
15756 52321 212257 244492 132214 -149070 -318781 -356377 -420361 -371297 -106166 -19495 -99997
15745 -99997 -91455 -95666 98220 147234 84665 100567 81510 173011 84012 21383 214960 309759
15733 309759 182888 -87902 -196008 -147947 2607 2542 103117 59287 -28013 35821 58452
15722 58452 -78310 -137437 -128986 -90603 -105669 20688 64345 58794 32598 243670 223817
15711 223817 179963 156489 65162 43572 -1025 79583 101856 -9429 -217360 -286848 -271957
15700 -271957 -185202 -20745 36320 94565 100001 -2237 -13870 -121340 -185552 -22821 -129661
15689 -129661 -196098 -217121 -115807 89638 180681 150781 211414 322486 204126 -32597
15679 -32597 -101115 -59978 47059 -41005 -142151 -199638 -124196 69261 151217 33250 -6543
15668f543n6244j1403j70423j04009M5358K02974J03583K0837q9224j01108N2387
15657a13815M162J6603P5182o2893Q8986J27628k40062k1554p3288l684N3166
15646a49569j97413O117P9936Q6422K4133J13355j40930j36401m267N4332J01170
15635a63115K85980J6727r5376N434J05073J51429J81562r447k62709r2967j79886
15624e7295k41175J49956Q2963J4762P6257m3718N88O634j079J5064p761l3449
15612c8253k0623O8847J67714J0070j79152N2161R435L0219j8122M5846j33963
15601e821j32146J8976M2227Q208o664q2800J52878p0705m3516M5740O4280Q4892
15589G5549r0801J52509O3514m3056m489K003L3383O0817l9194N9026j3542r3253
$$ plain form
15668 -6543 -62787 -74190 -244613 -348622 -303264 -100290 3293 24130 -65094 -166202 -113815
15657 -113815 -109653 -93050 -17868 -80761 8225 135853 -104209 -125763 -199051 -202735 -149569
15646 -149569 -346982 -340865 -260929 -174507 -150374 -37019 -177949 -314350 -318617 -264285 -163115
15635 -163115 122865 139592 44216 49650 154723 306152 487714 478267 215558 122591 -57295
15624 -57295 -298470 -148514 -65551 -50789 25468 -18250 -17662 -11028 -12107 2957 -4804 -38253
15612 -38253 -58876 9971 177685 187755 8603 60764 70199 100418 82296 128142 -5821
15601 -5821 -137967 -118991 -76764 -68556 -75220 -158020 -5142 -75847 -119363 -73623 -9343 75549
15589 75549 -15252 137257 200771 157715 153226 155229 188612 249429 210235 269261 255719 162466
15577A62466j49845Q881o5565R792Q0684R9572r4413j78733p0230P653K53476
15566F3738K91823R8169j34142n8359k07857j86149P604j0489J13306K7819l7056
15555c1593J482O6381o1733j4453j92658L5850K59444j51899L4652L2810J5422
15544f295o9472p7928K48813J5161o4272r1784m0375j31651K4628j0370K12090
15533H545N0604r6604L0812m608Q938R8621N8019O366N7673k2581k38465n8565
15521a01245Q1917K11972k9394k09583q6105P8322L1617M2573m1500j48806k9034
15510a99266K8745J27849Q3852j9300k6276k06466l2156P2691J38349L2694M987
15499E703j41059n9760j19393M3743J9629k9448j32016K26715J9289Q5315j5126
$$ plain form
15577 162466 12621 21502 -44063 -34271 46413 145985 51572 -127161 -197391 -189738 63738
15566 63738 355561 453730 319588 261229 53372 -132777 -125173 -135662 -22356 5463 -31593
15555 -31593 -30111 36270 -25463 -39916 -232574 -196724 62720 -89179 -54527 -21717 -6295
15544 -6295 -75767 -153695 95118 110279 46007 -45777 -86152 -217803 -193175 -203545 8545
15533 8545 59149 -37455 -6643 -11251 -2313 96308 154327 160693 218366 195785 -42680 -101245
15521 -101245 -19328 192644 163250 -46333 -132438 -54116 -22499 20074 -21426 -170232 -199266
15510 -199266 -170521 -42672 41180 21880 -4396 -210862 -243018 -170327 -31978 716 5703
15499 5703 -135356 -195116 -314509 -270766 -251137 -280585 -412601 -185886 -166597 -81282 -96408
15488i6408q022K8041j52199j67831p4539m5597j78725K26465K32426M9387k2768
15477b09770q215P4694J71706P266l6989q8802L4714J4208j33232j94826L9798
15466c29448N6726L7127J04080l5986m352J30944J77652J00367j21291k13207
15456i7388K4903J57676J07343j14191M0181r4245O1586J22290m7220J3220J25532
15445B99687M2784J303j34006o9157J5465r4878j87958L528R3547k6127k5688
15434h1500l5000J79160P3690l2463N8656P3115R5556J7973j38786k2271j94163
15423f033R0953n718J50069j1838j72806q3260r6424r2213J11857j1746j24100
15412b51259m3364L0123K55671j12694j09744j3662l7425J31967J62641L484k12155
$$ plain form
15488 -96408 -104430 -76389 -228588 -396419 -470958 -516555 -695280 -468815 -236389 -187002 -209770
15477 -209770 -217985 -143291 28415 35681 -1308 -90110 -55396 -41188 -174420 -369246 -329448
15466 -329448 -272722 -235595 -131515 -167501 -171853 -40909 136743 237110 115819 -97388
15456 -97388 -72485 85191 192534 78343 118524 24279 85865 208155 160935 174155 299687
15445 299687 342471 343774 209768 140611 156076 61198 -126760 -123232 -29685 -55812 -81500
15434 -81500 -116500 62660 136350 103887 162543 235658 331214 349187 210401 188130 -6033
15423 -6033 84920 79202 229271 217433 44627 -38633 -135057 -227270 -115413 -127159 -251259
15412 -251259 -294623 -264500 -8829 -121523 -231267 -244929 -282354 -150387 12254 15738 -196417
15401a96417r2834N9934J02530K0152J30878j70665r3547O0384n7042q0666J20747
15390a96546K23189Q8083n1938N147n4541R4251q8949o130n9222j90043p9803
15379c16502P5835p344J57976P1537p3133k2884r7962J21628Q4150R0656N1832
15368A35789p5042l5339Q9371K2661r4282j10517J38762K9816j71437q8292R7126
15357f1384R7455j36605j52582K31564J03012q8616j31969K07502O7619p8941
15347E7055p9337l2302o0882J25792O7149r288j0494o283J45782N3573j98562
15336E2203k1126j6308J73255J52223r9572p0871R9181q464p5920j22160m6166
15325A6275q2920J29545K03220J50908k8440j20264k13328j7334m32R1438J15311
$$ plain form
15401 -196417 -289251 -229317 -126787 -106635 24243 -146422 -239969 -179585 -236627 -317293 -196546
15390 -196546 26643 114726 62788 67935 13394 107645 18696 12566 -46656 -236699 -316502
15379 -316502 -240667 -248011 -90035 -18498 -91631 -114515 -212477 -90849 -6699 83957 135789
15368 135789 60747 25408 114779 137440 43158 -67359 71403 101219 -70218 -158510 -61384
15357 -61384 36071 -100534 -253116 -21552 81460 -7156 -139125 68377 135996 57055
15347 57055 -22282 -54584 -115466 10326 77475 68187 57693 51410 197192 250765 52203
15336 52203 31077 14769 188024 340247 240675 169804 268985 260521 184601 62441 16275
15325 16275 -66645 62900 266120 417028 388588 268324 54996 37662 37230 128668 243979
15314B43979j50168j43217N0143J09571M6299k7537m0298k2394m375J21169j46125
15303C7047J76857J5848j66445j12784J6533O4714m0746o0708N8266R1713k55432
15292a75137k39528J40028K79236J19378M5051J57002p2822j64933j26799r0905
15282a29429J00270n2024O6838o829j43247j77331O2871J90482J17506o6226k02391
15271b39510r7890l5546j4595O6721J71943K98856J41040m062O4n2608j9136m9848
15259A65429p8942m1500p1673J21120j2310J5554J38170r9972j52284j11011n1691
15248a79110K307N3078O8168J42739K44604k24633j37883k0321O7623R3525p7140
15237C2957j11432l395J66467L3843P7091j12502j05886k7513K42937J96999J2509
$$ plain form
15314 243979 93811 -49406 737 110308 156607 129070 88772 66378 62003 183172 37047
15303 37047 213904 229752 63307 -49477 -32944 31770 -8976 -69684 -11418 80295 -175137
15292 -175137 -414665 -274637 4599 123977 169028 326030 253208 88275 -38524 -129429
15282 -129429 -29159 -81183 -14345 -21174 -164421 -341752 -278881 -88399 29107 -37119 -239510
15271 -239510 -337400 -372946 -387541 -320820 -148877 149979 291019 286957 287021 234413 215277 165429
15259 165429 86487 44987 -26686 94434 82124 97678 235848 135876 -16408 -127419 -179110
15248 -179110 -176803 -123725 -55557 87182 331786 107153 -30730 -51051 16572 110097 32957
15237 32957 -78475 -81870 84597 118440 195531 83029 -22857 -50370 192567 389566 402075
15226D02075j28493j11963j53856o3661J05930J67560L7634Q4880J49479m1243
15216D48342n9367K937q0676p2897j28813j30481K851j29945J07989M9749j58802
15205a49113J80069J2515p7721p2142j59127J49060J82675K9841o3214k17056
15195a84213N2192J46838J60291m4188j30687O5520J26360M4556j49588j07592
15185b0511R7486J7497j7429o6825M7953r993J1675P9933p009M26q1886n9497
15173h180R3677K39424j26598j63214Q1667n8889j72036m3448O3124J11588K30812
15162B47927N3146m6568J57973J20582l16305l41259k24890J37779L5058k4416
15152b00973J72483j13682j84216Q6001J41347O8083j4537O0907m5084J04183
$$ plain form
15226 402075 273582 161619 7763 -55898 50032 217592 255226 340106 489585 448342
15216 448342 388975 391912 311236 238339 109526 -20955 -18104 -148049 -40060 9689 -149113
15205 -149113 30956 43471 -34250 -106392 -265519 -116459 66216 96057 32843 -184213
15195 -184213 -132021 14817 175108 130920 233 65753 192113 236669 87081 -20511
15185 -20511 76975 94472 77043 10218 58171 48178 59853 139786 132777 133203 51317 -8180
15173 -8180 85497 324921 198323 35109 116776 57887 -114149 -157597 -94473 17115 247927
15162 247927 301073 254505 412478 533060 216755 -124504 -349394 -211615 -176557 -200973
15152 -200973 -28490 -142172 -326388 -240387 -99040 -30957 -45494 15413 -29671 74512
15142G4512J1709q0257M8540N9271j40133J67166J10449J2975j07533k68722n4236
15131a66259O9260J94335k7271j88080k753k6838N6107J5582l9500P1378K33620
15120A89581p2514j94899P1953N6395j06623j29686m0974J4293j1547J12260J44545
15109C2784O4144m7404j7244j1202K1100J5213J12592k1926O8219j69885O3722
15098A10113J28322r9170j68816q0664r345J1872j77312j56772P099j33842K02249
15087c66266K00181K59618J13660j73044k41081j92262K223J29506O4447m6845
15077b49863J02328R9041J19588L2605N1237j27564j15556J29041o9869m0226
15067f9238N232q1945Q8910L165j93402N888J45469P4116L5889k51243R8058k5201
$$ plain form
15142 74512 86221 5964 54504 113775 -26358 140808 251257 264232 156699 -112023 -166259
15131 -166259 -96999 97336 70065 -118015 -120768 -147606 -91499 -75917 -115417 -44039 189581
15120 189581 117067 -77832 -5879 50516 -56107 -185793 -226767 -212474 -224021 -111761 32784
15109 32784 96928 49524 32280 21078 42178 57391 169983 148057 216276 46391 110113
15098 110113 238435 139265 -29551 -110215 -119560 -107688 -285000 -441772 -434673 -568515 -366266
15087 -366266 -166085 93533 207193 34149 -206932 -399194 -396971 -267465 -203018 -249863
15077 -249863 -147535 -48494 71094 103699 154936 27372 -88184 40857 -29012 -69238
15067 -69238 -64006 -145951 -57041 -53876 -247278 -241390 -95921 -21805 14084 -237159 -139101 -164302
15055a64302j4774J11832J50858q4919j26817R8770K27979J06240j69924J1896
15045A46839J5836n3868l0625K6410l4750j77974J73550R3841k06782J32426K76149
15034C61052p6945j7893Q829n8074j33627N8237j2229P1155K42278P7831l00646
15023B19968m9670p0370p1371q5902r5177p7484J55369M3194J47480J50270k15119
15012E1188j5925m846K288L3858P8130j5223j39235j05976P7892P0470P8210M0966
15000A51797j6166j37j67091j36088J91841J19585j70398o9362j81160O1490N6177
14989a59512K39691P3063j42365o2399m3610j48078O4508O4572K14557j11727
14979a1300r0647M4879J31183J85228m9210l3715M2977K06217r9628l5166N0539
$$ plain form
15055 -164302 -179076 -67244 83614 -1305 -128122 -29352 198627 304867 134943 146839
15045 146839 162675 108807 78182 104592 69842 -108132 65418 159259 -47523 84903 361052
15034 361052 284107 266214 275043 216969 83342 141579 129350 200505 442783 520614 219968
15023 219968 170298 99928 28557 -57345 -152522 -230006 -74637 -31443 116037 266307 51188
15012 51188 35263 30417 32705 66563 144693 129470 -9765 -115741 -37849 32621 110831 151797
15000 151797 135631 135494 -31597 -167685 24156 143741 -26657 -96019 -277179 -215689 -159512
14989 -159512 80179 153242 10877 -51522 -95132 -243210 -178702 -114130 100427 -11300
14979 -11300 -101947 -57068 74115 259343 210133 176418 219395 425612 325984 290818 341357
14968C41357k4813j84835j20368r5098K12114J4057j53460J13636l8243j36871
14958g2524j26154J20156L882p6757k0650J49854J56283J30773n0463j31743Q6959
14947A69616p5338j45676l0239J08215r9819j16658L3117K09914K3778j46477
14937f9567R9680l3122j12897K5623J65089J49867m0869j50817j17319m1276N345
14926a20263l5900O3394J46260J42076j41284j5172K1724o7974q4845j04217o274
14915b02475J29388N920N3645K8929N6817r4883k10747P6607J09678K55254Q5569
14904B93702k38076j27212J49360j39850l2230J69576l9585j50050O9333J18333
14894G3301J7153N4779J8805o97j63065j9363J8830l3031k2426J03451O5840j78497
$$ plain form
14968 341357 316544 131709 11341 -83757 128357 142414 -11046 102590 64347 -72524
14958 -72524 -198678 -78522 -74640 -151397 -172047 -22193 134090 264863 214400 82657 169616
14947 169616 94278 -51398 -81637 26578 -73241 -189899 -156782 53132 76910 -69567
14937 -69567 30113 -3009 -115906 -90283 74806 224673 183804 32987 -84332 -125608 -120263
14926 -120263 -156163 -92769 53491 195567 54283 39111 60835 -7139 -91984 -196201 -202475
14915 -202475 -73087 -67167 -13522 15407 72224 -22659 -233406 -156799 -47121 208133 293702
14904 293702 55626 -71586 77774 -62076 -94306 75270 35685 -114365 -45032 73301
14894 73301 90454 145233 164038 163341 276 -19087 -257 -33288 -55714 47737 113577 -64920
14882f4920k13315p9741J31083L2493l541J63705k9462K1572Q8516j47818j24040
14871b25468r2154p2966J86821l1108j9101J59005P6062J45170K3268j61380j09315
14860a21166R855K8532L6472J11530J78571L205j77231n244j65721k12485n3653
14849c67335J49510Q1278O3893j02186p4712J15285P8062M839M3282p6620L4399
14838e0305K1804P025l4231J69642l6323P3065k3541j35524P3766J53397j10012
14827A08763p9683n2099j61763q7983K39845O7958j7578k88571L8822K3017O9812
14816a39460J6961J37131j937N4478Q248q6374R7654P482p4201M4133n8223J52384
14804A58276L2125p2391k9684m7786L7936l9855j12975M8544R2541J71921J28957
$$ plain form
14882 -64920 -278235 -357976 -226893 -194400 -197941 -34236 -63698 -42126 46390 -101428 -225468
14871 -225468 -317622 -390588 -203767 -234875 -253976 -94971 -18909 126261 149529 -11851 -121166
14860 -121166 -111311 -82779 -46307 65223 243794 246999 69768 64524 -101197 -313682 -367335
14849 -367335 -217825 -136547 -72654 -174840 -249552 -134267 -56205 -51366 -8084 -84704 -50305
14838 -50305 -28501 -21476 -55707 113935 77612 150677 127136 -8388 65378 218775 108763
14827 108763 29080 -23019 -184782 -272765 -32920 35038 17460 -271111 -232289 -209272 -139460
14816 -139460 -122499 14632 12695 67173 75421 -10953 86701 94183 19982 64115 5892 158276
14804 158276 190401 118010 88326 40540 78476 38621 -74354 -25810 66731 238652 367609
14793C67609q3651k13378o6627O3614O7689j16427J10305q7522j40492J13712
14783A4832l3J79358j01906j25957l8245J96947J02360q1882j28966J4326j225
14772B9609l8428N750M7999j8701R9183O3461M0558R4211J24836j14337r5134
14761B39007j14305Q7449j01659j18310k40015J51974K04855j41495k43315K63889
14751a1925R2137o7468J7365j20905n097O6423J35320j342j40770J25351q248
14740H0841q6461q0355J3198J25683q587j1486P244J04217R9801o2529l5257l8427
14728A07882Q8780N0889R2838o7792J28212o7065l5449p9814k34556j01452J4731
14717a02796Q5686J02639j8029o9909o2590j08113j14220J318J28505N1339n5429
$$ plain form
14793 367609 283958 70580 3953 67567 135256 18829 129134 41612 -98880 14832
14783 14832 14799 194157 92251 -33706 -71951 124996 227356 145474 16508 30834 29609
14772 29609 -8819 -3069 44930 26229 125412 188873 229431 323642 448478 334141 239007
14761 239007 124702 212151 110492 -7818 -247833 -95859 108996 -32499 -275814 -11925
14751 -11925 80212 12744 30109 -90796 -95893 -29470 105850 104508 -36262 89089 80841
14740 80841 -5620 -85975 -72777 52906 44319 32833 40077 144294 244095 181566 146309 107882
14728 107882 196662 247551 340389 272597 400809 333744 298295 218481 -16075 -117527 -102796
14717 -102796 -17110 85529 67500 -2409 -64999 -173112 -287332 -286014 -157509 -106170 -161599
14706a61599j0348K59529K05634l2487j51956n5732L72710P5175j79887r1718
14696B29321q1291j26214j48078J31993R9340j3524O6986R587q0311K6608M2016
14685A56433l6129j50995j1156R4665J09456P2238k10118J26905J25228r4153
14675A82374p9157Q3972N5954k9517j96160L7508k1980M5367J61037j24225q3786
14664C1387r4598j28165O4755J31223L3423J05061L0159m72j16361p8092R973
14653a1707O4515K3096M4144J21843r0978J0188p0469n4568l4915J5993p9201
14642f2059j74542o9336O1178Q6505N7955L5629q2393K03096O0951l5185q9751
14631g952k1571o1577j34870j63605k8812P6526N9760O3878n7364j1848R8467
$$ plain form
14706 -161599 -171947 87582 293216 260729 108773 53041 425751 500926 321039 229321
14696 229321 148030 21816 -126262 5731 105071 91547 158533 168120 87809 114417 156433
14685 156433 120304 -30691 -41847 52818 162274 234512 24394 151299 276527 182374
14675 182374 103217 187189 243143 213626 17466 54974 32994 78361 239398 115173 31387
14664 31387 -63211 -191376 -126621 4602 38025 143086 173245 172773 56412 -21680 -11707
14653 -11707 52808 75904 120048 241891 150913 161101 90632 36064 1149 17142 -62059
14642 -62059 -236601 -305937 -244759 -158254 -100299 -64670 -147063 56033 116984 81799 -7952
14631 -7952 -29523 -91100 -225970 -389575 -418387 -341861 -282101 -218223 -275587 -287435 -188968
14620a88968L5926R944n3469L106J21304N117L0219J51020l4185j20636l3772
14609g4394O2718J66159Q9468O885j91769l2791M8203L1492l1678L9693q8931
14598B5055K1310m7296n9806Q2341R3235N8486j45225j55003o5071J16590O7509
14587g875k7949j27368J35225O7392j938L5177r5318N3819Q7106Q9643k75692
14576f7778k7385R0484K6988O1980j64348j32810j17481J08736R5888J7850N9674
14565d8202k24846N7640R8706J15708J15213m8861j11680j01079J1782j8840Q5776
14554f8683J51183N4098o1166l3920J77635L3242n747j27976j45305k8597M2347
14543a2889J6605O3708q809k12093m4034J78376P775j22969j2140J15510k3400
$$ plain form
14620 -188968 -153042 -143098 -196567 -193461 -72157 -67040 -36821 114199 80014 -40622 -74394
14609 -74394 -11676 154483 243951 250836 59067 26276 74479 105971 74293 113986 25055
14598 25055 46365 -931 -60737 21604 114839 173325 28100 -126903 -191974 -75384 -7875
14587 -7875 -35824 -163192 -27967 39425 37487 72664 -22654 31165 118271 207914 -67778
14576 -67778 -95163 -4679 22309 84289 -80059 -212869 -330350 -221614 -125726 -107876 -48202
14565 -48202 -273048 -215408 -116702 -994 114219 65358 -46322 -147401 -135619 -154459 -68683
14554 -68683 82500 136598 75432 41512 219147 252389 246642 118666 -26639 -55236 -12889
14543 -12889 3716 67424 58615 -153478 -197512 -19136 -11361 -134330 -146470 -30960 -54360
14532e4360m8756J3242P3522J27148J8002k4612o6499p1136k9043J18698m238
14521E1968k18313r0432Q3998J26010P2707k1023K989n7213j63677L8199J34817
14510c9970M672q6136q6405k008J33371k1100j29817Q5820J21184K7618l5863
14499b8634j15030L9258o8800N7701j73578j8706J56394J99589Q2448J66752m3769
14488B53625r6805j13774N4303J86955M6468k04845j40770J9310J3426J06050
14478A23943M6080p293J2049O4626k28887j15013o0386J03967Q1127k3390k37351
14467b40528j42593J38755O1331n3317Q635J4744J238J62928J16703J39839j2991
14456A94744r6763q6795N627Q6413M071R283Q1915j63549p4772o5474J45452J41477
$$ plain form
14532 -54360 -103116 -89874 -16352 110796 128798 104186 37687 -33449 -62492 56206 51968
14521 51968 -166345 -256777 -172779 -46769 25938 4915 7904 -49309 -212986 -174787 -39970
14510 -39970 -35298 -121434 -207839 -209847 -76476 -97576 -227393 -141573 -20389 7229 -28634
14499 -28634 -143664 -104406 -173206 -115505 -289083 -307789 -151395 48194 130642 297394 253625
14488 253625 156820 43046 97349 284304 330772 125927 -14843 4467 17893 123943
14478 123943 170023 162730 174779 239405 10518 -104495 -164881 -60914 20213 -3177 -240528
14467 -240528 -383121 -244366 -183035 -236352 -227717 -212973 -211735 -48807 67896 207735 194744
14456 194744 97981 11186 16813 103226 107297 116580 198495 34946 -39826 -105300 40152 181629
14444A81629j4097j18157k22336J39442R5080j850N1923n0170r2619r1546m8695
14433a71396P8206P5608r4549j05922P5621k531m6489R749M0394j15566J88962
14422f7913O8088l187O588n3840J33126J484R495j52041N0105J44104J7311J19004
14410B72324N1263j38940j65673P2422L1398o2799j23886j9924K0237J98237m7670
14399H6989j77627q4805j35868p0813Q2729J18387J26205M1171L4410J65688K6693
14388B13159j47089J56798J07745l4195k46907q5260L7579j37323m5027K38462
14378E7942P0262p857j67289K9417j33750q3782n0682J88758K92109J43313j81632
14367A56809k39126J6087j9352O5415J04836l5026R6625P8666j63698r9100Q7021
$$ plain form
14444 181629 167532 49375 -172961 -33519 61561 59711 111634 61464 -31155 -122701 -171396
14433 -171396 -93190 -17582 -112131 -218053 -142432 -144963 -191452 -181703 -141309 -256875 -67913
14422 -67913 175 -3012 3576 -50264 82862 84346 93841 -58200 -8095 136009 153320 272324
14410 272324 323587 184647 18974 91396 122794 59995 -63891 -83815 -63578 134659 86989
14399 86989 -90638 -175443 -311311 -382124 -299395 -181008 -54803 -13632 20778 186466 213159
14388 213159 66070 222868 330613 296418 49511 -35749 1830 -135493 -180520 57942
14378 57942 128204 120347 -46942 -17525 -151275 -235057 -285739 -96981 195128 338441 156809
14367 156809 -82317 -66230 -85582 -20167 84669 49643 146268 224934 61236 -37864 49157
14356D9157L2281j03270J3655m734k35241q4313J37005K08745R4808m5946k1654
14345D0493j23238j44336J09372K32031j1460k8369J10026N7005J8759j02140
14335A58143j248j41189M7473R3271r8159k8227J90022J2964j67172j93723n4171
14324a82016O5669J12637M324j16912j48560R3483J49981K04189J08149k5617
14314B65327j63838j26117P737J21426Q8477k1385l0257j15255j68875J40950
14304a810R8262l9590j89627P695m1558Q0844n56j59337j13628R1493J28833O1332
14292g7647L8824l6937n8738K7632K10473J34349R5051k7805j13983j07417j24147
14281d0345P3661J2608j24965O353J32140O1656q5491O9507J86778J62417j15711
$$ plain form
14356 49157 81438 -21832 -8177 -12911 -248152 -332465 -195460 13285 108093 62147 40493
14345 40493 -82745 -227081 -117709 114322 102862 74493 184519 241524 260283 158143
14335 158143 156895 15706 63179 156450 58291 30064 220086 233050 65878 -127845 -182016
14324 -182016 -116347 -3710 614 -116298 -264858 -171375 -21394 182795 290944 265327
14314 265327 101489 -24628 -16891 104535 193012 171627 141370 26115 -142760 -1810
14304 -1810 96452 56862 -132765 -125070 -166628 -85784 -86340 -245677 -359305 -267812 -138979 -77647
14292 -77647 -38823 -75760 -134498 -106866 103607 237956 333007 305202 191219 83802 -40345
14281 -40345 33316 45924 -79041 -72688 59452 121108 35617 105124 291902 454319 338608
14270C38608k96043K4866P3475K13721J74641k00662l96277j15730J34538k9602
14260g8465k9132R4086j05820Q658l6194o146L1644P6703J6947O8463j18561m2623
14248a20440K0785P2320k23996Q4364R5474Q097p2148M9942K3927p6212j71641
14237c09528J5822J16410o5757Q3163J52433p1027l1686k3518p1047o881m2407
14226b54023J29663J20727O3560j03719r6218j3066K4026q0625Q7644J91104Q0155
14215A49228n2890J00133o304j35317r8637L0885J06390o8129j8445m8934J9140
14204b2880k1865q2034J14920k1980P7253N9379o1365Q9805m1465r3330m8031
14193e1593P1126K4156J8618k23435j67854J16233J2798J69993J29971j16454
$$ plain form
14270 338608 42565 67431 140906 354627 529268 328606 -67671 -183401 -48863 -78465
14260 -78465 -107597 -13511 -119331 -110673 -146867 -153013 -121369 -44666 -27719 40744 -77817 -120440
14248 -120440 -99655 -27335 -251331 -166967 -71493 -63396 -135544 -85602 -61675 -137887 -309528
14237 -309528 -293706 -177296 -243053 -159890 -7457 -78484 -110170 -133688 -204735 -211616 -254023
14226 -254023 -124360 -3633 59927 -43792 -140010 -153076 -129050 -209675 -122031 69073 149228
14215 149228 96338 196471 190167 54850 -43787 -12902 93488 25359 6914 -42020 -22880
14204 -22880 -44745 -126779 -11859 -33839 43414 102793 41428 131233 89768 -3562 -51593
14193 -51593 19533 43689 62307 -161128 -328982 -212749 -199951 -29958 100013 -16441
14183a6441j58407J0478M0560o5485N0922L64625M7310L9650N6142O9155r3282
14172C45227m6677Q1014k5699k27144o0116M476l6457L5345j28386n0043J91198
14161H2738J24576j26532k08301Q1125J12788J8652J62319j22303j7183O4057
14151A71936o2262j83673j01167o3139K503P8260K07401j33945O618P5114j26453
14140a28807p8202m5078R154J92712J36780r1337k19410J4227p971R3143J28387
14129C598O5475m1173L8952j71861j39874J81820N5648P2039J26143K3087J04157
14118C18011K03441j86232m02178j2815J29018q5701q9483k7829J00553L6138
14108a7077J74882O133j38663p2599l1968k24730r9877K50773R5293N801m4606
$$ plain form
14183 -16441 -174848 -164370 -123810 -189295 -138373 226252 273562 313212 369354 438509 345227
14172 345227 298550 379564 353865 126721 66605 71081 34624 69969 -58417 -108460 82738
14161 82738 207314 80782 -127519 -46394 66394 85046 247365 125062 107879 171936
14151 171936 109674 -73999 -175166 -238305 -235802 -157542 49859 -84086 -77468 -2354 -128807
14140 -128807 -207009 -252087 -242933 -50221 86559 -4778 -224188 -209961 -217932 -124789 3598
14129 3598 69073 27900 66852 -105009 -244883 -63063 -7415 64624 190767 213854 318011
14118 318011 521452 335220 -66958 -79773 49245 -36456 -125939 -153768 -53215 -17077
14108 -17077 157805 163938 25275 -47324 -79292 -304022 -403899 -153126 -57833 -52032 -96638
14097i6638j52640k541J84839Q4953Q4078J06503O6195k2469k51115j37603M2430
14086i4008L1179J42119j58036p1064J8216J16489K390J83178O466r9745j11172
14075c3988j6980J75941J11553k7694l6483m4305j9118q9414j63043K27582K15857
14064B99908O690m6842j06199l7287q5986j11189J40543L2576O9737O7173J6307
14053B45431k21071N794K3533K3696o2670n7486o6325j20445K578K44494K82514
14042C00043m115K7808J6711j78637k96229J09797N2201j00304j032R1774K6878
14031D4895J3785O1203j66529j6401l5411p7306k8915Q6693J11033J12846O2248
14020A68141n5046L5419Q2697L032N7420k19504j54676O1542Q5630r0Q9483l1321
$$ plain form
14097 -96638 -249278 -251819 -66980 17973 102051 208554 274749 252280 1165 -136438 -94008
14086 -94008 -62829 79290 -78746 -149810 -131594 -15105 -12715 170463 176929 77184 -33988
14075 -33988 -50968 124973 236526 208832 172349 128044 108926 19512 -143531 84051 299908
14064 299908 306598 259756 153557 116270 30284 -80905 59638 92214 161951 229124 245431
14053 245431 24360 30154 53687 77383 14713 -42773 -109098 -229543 -226965 17529 300043
14042 300043 295928 323736 340447 161810 -134419 -24622 27579 -72725 -73757 18017 44895
14031 44895 58680 119883 -46646 -63047 -98458 -175764 -204679 -117986 -6953 105893 168141
14020 168141 113095 148514 231211 234243 291663 72159 -82517 -20975 64655 64565 154048 122727
14008A22727k51270j04936J06822K1410P517l2181r19N9638R8631l2313k6744
13997c1618n118m7495m5405R5095Q1828j47502k9744l5j2012J98462j00142K4034
13985a9652K8745j04669j36189J56826J52130K10737L1086K6283k0780j18927
13975B05590m2354K8167J5729n9009p4299j82844M5457k1948l2127r2027j40990
13964c50655J86336J84566n4343N1950J1249p7380o8398K5386J8533M9039K6093
13953B376l3835M5519j14335m821P2766n3709R5665l2585K4871J24103O4436n4602
13941A35849j20343n3423j04836p7374O9938Q2440O7437J17058j19484j71554
13931a74292K5091J38330q5037j59231q4920J19211J05039J88973j17448k0149
$$ plain form
14008 122727 -128543 -233479 -126657 -105247 -97730 -129911 -130830 -71192 27439 -4874 -31618
13997 -31618 -36736 -84231 -129636 -34541 47287 -100215 -129959 -129994 -142006 56456 -43686 -19652
13985 -19652 9093 -95576 -231765 -74939 77191 287928 319014 345297 324517 205590
13975 205590 163236 191403 207132 148123 73824 -109020 -63563 -85511 -117638 -209665 -350655
13964 -350655 -164319 20247 -34096 17854 29103 -48277 -116675 -91289 -72756 -23717 2376
13953 2376 -31459 14060 -100275 -105096 -32330 -86039 9626 -22959 1912 126015 190451 135849
13941 135849 15506 -37917 -142753 -220127 -150189 -67749 -312 116746 -2738 -174292
13931 -174292 -149201 -10871 -95908 -255139 -340059 -220848 -115809 73164 -44284 -64433
13921f4433J59382L4623j07821j21304m3383R3446J17432J2400M3682Q1190p4914
13910A30300l3395j38067r9045k8413L5068N8982K22896J95258j3703j95403p0066
13899F4412k7055Q0142J18707j05338l3764k05919l12151J13814K58297J10638
13889F1783k4395L992k749P4664N1466j12809n7355Q130m7488P1628J18299J0090
13877A55256K3913P0323n978M6924j20551K9656J16697J19341r1422j4904j39025
13866A90230Q172J35720o9393N5036j24983j16193p1956J56021q741j10268p720
13855C5925r5464K347n5768M8273Q2943J57051j76682j56956J98367L6847K6476
13844A03359o7290k4978J8061N9558q5447m7228m9920k2914P3074j1557M3614
$$ plain form
13921 -64433 94949 129572 21751 -99553 -142936 -49490 67942 80342 124024 205214 130300
13910 130300 96905 -41162 -140207 -168620 -133552 -74570 148326 343584 329881 134478 64412
13899 64412 37357 117499 236206 130868 97104 -108815 -420966 -307152 -48855 61783
13889 61783 37388 41380 38631 113295 164761 51952 -5403 2727 -44761 26867 145166 155256
13877 155256 179169 249492 243514 290438 169887 199543 316240 435581 344159 329255 190230
13866 190230 198402 334122 264729 319765 194782 78589 6633 162654 153913 43645 35925
13855 35925 -59539 -57192 -112960 -64687 18256 175307 -1375 -158331 40036 76883 103359
13844 103359 36069 11091 29152 88710 3263 -43965 -93885 -116799 -43725 -55282 -11668
13833a1668J10058J34610J37425j2469k85460q9926N1827j14754j03335O2673
13823a21019J96993P7384k66355l1824K28761J42046j9266k11015n4927P2017
13813A2795j63211M4811L6011p4963P7755O5682r9292N710p7869l1027Q6524l2581
13801a49655J4091J11034O3804K6579p5026l8607J6652J75208O6921k4832k5363
13790A60806K8942o6456n6376M6397j23400J2078K0053M4438J12411l189j63691
13779A2013q151N0916o8381j83929p1656K1444J00056p9601j9917K75596O5534
13768I3924j68653q2858P0195P9378n6138Q4217L045N338o638K14719L8774k32711
13756D2592N0515j99514j0296N9021r2276o913K26938J47157q8413o2550o8254
$$ plain form
13833 -11668 98390 233000 370425 357956 72496 -17430 34397 -80357 -183692 -121019
13823 -121019 75974 153358 -112997 -144821 83940 225986 206720 -4295 -59222 12795
13813 12795 -150416 -105605 -69594 -144557 -66802 -1120 -100412 -94702 -172571 -203598 -117074 -149655
13801 -149655 -135564 -24530 39274 65853 -9173 -47780 -31128 144080 211001 186169 160806
13790 160806 189748 123292 66916 113313 -10087 1991 22044 66482 178893 175704 12013
13779 12013 3862 54778 -13603 -197532 -269188 -247744 -147688 -227289 -247206 28390 93924
13768 93924 -74729 -157587 -87392 -8014 -64152 20065 23110 28448 21810 236529 275303 42592
13756 42592 93107 -106407 -116703 -57682 -149958 -156871 70067 217224 128811 66261 -1993
13745a993k300J7298L3077N234N3287j4209N5692K11450m7124j75111M7882J0328
13733A93511o148q0667n21p8281o2280j68051Q2556k5673j25896J57297K13485
13722I9332r4812M8209J7084j26116o1727K3621Q3039l849k0088K9745q042M9109
13710C5505P7279o2007r9744j33481l9173M9819M0398N3945l0448R2988J09691
13699I4772j65680L9235J59252O8238K8445P7705k3738m8354j08657j11078j40728
13688a30588J0278K59877K8168j06286q3441O9151j8503k1487j6790J8433J18184
13677A26996J89529j56216j07351J82571N7794j71068M3927R7036k9080j76833
13667E7305j50976K5574J19908J9149j16113J03688J60766J24651r3261O1164
$$ plain form
13745 -1993 -4293 13005 46082 51316 104603 90394 146086 357536 310412 135301 183183 193511
13733 193511 187363 106696 106175 27894 -34386 -202437 -119881 -145554 -271450 -114153 99332
13722 99332 4520 52729 69813 -56303 -118030 -94409 -11370 -15219 -35307 -5562 -13604 35505
13710 35505 112784 50777 -48967 -182448 -221621 -171802 -131404 -77459 -107907 -14919 94772
13699 94772 -70908 -31673 127579 195817 224262 301967 278229 229875 121218 10140 -130588
13688 -130588 -120310 139567 167735 61449 -21992 47159 28656 7169 -9621 8812 126996
13677 126996 316525 160309 52958 235529 293323 122255 166182 263218 234138 57305
13667 57305 -93671 -68097 51811 70960 -45153 58535 219301 343952 250691 311855
13657C11855q982q9386j14184q938k4176K1023p6806K879k7645p076L2870J37931
13645A49365k0553j2434R0618J31762J11441o8819j23186J05243j34510r7637
13635A31290r0565n6928j12114K50860q0033j09718o4622M9410J05467N1468O3480
13624A37995j58535m4135R0052J07588j84049k3652M4R1292j80135r5432J80987
13613g7980l0570k5923J99348j17233j23911K5094P4104k6330l6256m1709R6787
13602h4579J3254m9342O6863M071O1360N7970o1934J4636q2353j48263j19548
13591c27865j20021K14183L10835J31161K4810K7532j09734k25786j06365J40336
13581d0914p3419L5382J13014j615J38667n4001j12494k63074N0466Q8531J80131
$$ plain form
13657 311855 302873 213487 99303 90365 66189 87212 10406 13285 -14360 -21436 11434 149365
13645 149365 128812 116378 206996 338758 450199 381380 258194 363437 228927 131290
13635 131290 40725 -16203 -128317 122543 42510 -67208 -131830 -82420 23047 74515 137995
13624 137995 -20540 -64675 25377 132965 -51084 -74736 -74692 16600 -163535 -258967 -77980
13613 -77980 -108550 -134473 64875 -52358 -176269 -151175 -77071 -103401 -139657 -181366 -84579
13602 -84579 -71325 -120667 -53804 -49733 11627 69597 7663 22299 -60054 -208317 -327865
13591 -327865 -447886 -233703 77132 208293 233103 260635 150901 -74885 -181250 -40914
13581 -40914 -114333 -78951 34063 32448 171115 117114 4620 -258454 -207988 -119457 60674
13570F0674O7352o9224K3718N6076N5711o3191j49873K5408N6125N0376K50N3370
13558A66772Q9659l7876P0554k0457J8818j47893j58579j08054o00J04877L9115
13547A6336n1636j12442N1146n5584j32330n0404J2301J38191R5192K2886j79557
13536b45901J59329Q0831N5902O2660Q304N1606N8200j5317j74146O0228O903
13525A08599k53822K0845K32653J03607M4605j56109j56587O4817o0370R6494
13515D4732q841j56852q1262L04192K23524m0689k63011R025J39649j41948o1147
13504c2628J00935M7645q6605j11372j37708m4214m2953J18235J39226k0747o6246
13493a36432J74830J46605j61026j70158o820k04120Q1164J77980j90037j25963
$$ plain form
13570 60674 128026 58802 82520 138596 194307 131116 -18757 6651 62776 113152 113402 166772
13558 166772 256431 218555 289109 268652 287470 139577 -19002 -127056 -127656 -22779 16336
13547 16336 -35300 -147742 -96596 -152180 -284510 -334914 -322613 -184422 -89230 -66344 -245901
13536 -245901 -86572 -5741 50161 112821 121125 172731 230931 215614 41468 101696 108599
13525 108599 -145223 -124378 108275 211882 256487 100378 -56209 8608 -51762 44732
13515 44732 35891 -120961 -202223 101969 325493 284804 21793 30818 170467 28519 -32628
13504 -32628 68307 115952 29347 -82025 -219733 -263947 -306900 -188665 -49439 -70186 -136432
13493 -136432 38398 185003 23977 -146181 -153001 -357121 -275957 -97977 -288014 -413977
13483d13977O2658l1928J05753O6817n0312l8778J73985R3805J8774M4889l3043
13472a357p1437K5801P6235P5664j38761j37473j3295J43203L2089M3117O1947
13461I5733K98410q5285j18660p9811n2610n3646k8681N7694K04384l3863j15205
13450H8460p7256n0870O4040L2605J991p4302P3999N3151m3308j54984O0142J85474
13438A59142L1506j18727r2181n2174k3060R2020J80589M3299K0540j16247j06951
13427A7756j3886J497k7429J1999J13511j03246j12616J01020J77112L5694j77528
13416B3884j0284l274K1472P0565j03077j0967J746J06804J05501m333j14193
13405H3844P6954j19318J1401q9546J02200j10721J2168J82016j95771J24934
$$ plain form
13483 -413977 -351319 -383247 -277494 -210677 -260989 -299767 -125782 -31977 -13203 31686 -1357
13472 -1357 -72794 -46993 29242 104906 -33855 -171328 -184623 -41420 -9331 33786 95733
13461 95733 394143 308858 190198 110387 57777 4131 -24550 33144 237528 203665 88460
13450 88460 11204 -39666 24374 56979 58970 -15332 58667 111818 68510 -86474 -26332 159142
13438 159142 190648 71921 -20260 -72434 -95494 -3474 177115 220414 240954 124707 17756
13427 17756 3870 5367 -22062 -10063 103448 202 -112414 -11394 165718 201412 23884
13416 23884 13600 10326 31798 102363 -714 -11681 -9935 96869 202370 198037 83844
13405 83844 160798 41480 52881 -36665 65535 -45186 -33018 148998 -46773 78161
13395G8161J4394j20033j4332K5429K377K3208m6782P7800J93087o2882n2715
13384A17712q9982l9951J22229J05711r336l4226l6848j73879k60643k0781J01595
13373b18399r2511o5824K02233K3197k5041J00898R7769Q2295N8527j43835j05689
13362h6380J46529j284k69307k27406p3768K08393K12597l6488j43525k1239Q2088
13351b09790j76907M0966K26231J27335R1438K8152k35018K5089J51248k6725
13341D2019o3386j6792J85578k2132k59998k4405R3858J87857J41809O9851n0504
13330B83755m9619r7086k9925J1381N5863J37347j17225o8039j61030k67218J12160
13319a89636J52090Q8049j87063L4089K15570R5990m1434q8289K00178k3683k32484
$$ plain form
13395 78161 92555 -27478 -41810 -16381 -14004 9204 -37578 40222 233309 170427 117712
13384 117712 27730 -12221 110008 215719 206383 172157 135309 -38570 -299213 -319994 -218399
13373 -218399 -310910 -376734 -174501 -151304 -176345 -75447 22322 104617 163144 19309 -86380
13362 -86380 60149 58865 -210442 -437848 -511616 -303223 -90626 -127114 -270639 -291878 -209790
13351 -209790 -386697 -345731 -119500 7835 99273 127425 -107593 -82504 68744 42019
13341 42019 -21367 -38159 147419 125287 -134711 -159116 -65258 122599 264408 334259 283755
13330 283755 234136 137050 107125 118506 174369 311716 194491 126452 -34578 -301796 -189636
13319 -189636 -37546 50503 -136560 -102471 113099 209089 167655 79366 279544 255861 23377
13308B3377j85019j3711J0041M0121J16314N5593r124k11231Q7514R1056R9208
13297A04139j73532j47140K79881J81181L2566q5340m4322M2802k3820p6787j44707
13286e5079K9315k8709Q6817p0168j00458j07807j6653J86209J72571k0514q4242
13275h718L4963p1263l8417K1586L9663L8660j44109Q587M5869l8220n087j67915
13263b84401Q0268K12016J64782Q1605N1565K0318j64087j62112n3751q2970q358
13252a45125K0884P5872J54689J20532m8298l4689Q0719L3725k11205k4768J9148
13241D1484m0032K3653L6437j5824O3694m548Q9149J46101j56061j04177L6978
13230A16854r8396n0229J7120l8630J35507J01883k72886j28537J57035K5384
$$ plain form
13308 23377 -161642 -175353 -165312 -125191 -8877 46716 37592 -173639 -86125 4931 104139
13297 104139 -69393 -216533 63348 244529 277095 191755 147433 190235 166415 89628 -55079
13286 -55079 -25764 -54473 32344 -37824 -138282 -246089 -262742 -76533 96038 75524 -8718
13275 -8718 26245 -45018 -83435 -61849 -22186 16474 -127635 -119048 -73179 -111399 -116486 -284401
13263 -284401 -204133 7883 172665 254270 305835 326153 162066 -46 -53797 -136767 -145125
13252 -145125 -124241 -48369 106320 226852 178554 143865 224584 258309 47104 22336 41484
13241 41484 1452 25105 61542 45718 109412 104864 194013 340114 184053 79876 116854
13230 116854 18458 -31771 -14651 -53281 82226 184109 -88777 -217314 -60279 -34895
13220c4895J84348j696j25414n9705j02418k4586Q4428N3296J9985M2170l7189
13209a676j58608K42662j12770k77654M0366J16092R5881J12483p1451L5573L6539
13198E7437j06408j87509P5974O9789j37735Q7572J28320J1051J25402O7618j79022
13187A2489j55596j05230J75567O9616o7075j20334m3315J62256N9576P8498p4187
13176g735k4397j05278K84355M2632j67416n5315J5471O7737m8654j4518J15100
13165A01982J034p3787J12518J11901J68227j35473j91165j36466p4855R0357
13155b5727R050J72827k9109q9037K4798L0089O3077J591J2928j976L2745j20785
13143H0471J18666l9496j82571o3484J58876N6533k9411J22336J5147j45822l8367
$$ plain form
13220 -34895 149453 147757 22343 -37362 -139780 -164366 -79938 -26642 -6657 35513 -1676
13209 -1676 -160284 82378 -30392 -308046 -267680 -151588 -55707 56776 -14675 20898 57437
13198 57437 -48971 -236480 -160506 -90717 -228452 -140880 -12560 -1509 123893 191511 12489
13187 12489 -143107 -248337 -72770 -3154 -70229 -190563 -233878 -71622 -12046 66452 -7735
13176 -7735 -32132 -137410 146945 189577 22161 -33154 -17683 50054 1400 -13118 101982
13165 101982 103016 29229 141747 253648 421875 286402 95237 -41229 -116084 -25727
13155 -25727 -16677 156150 127041 38004 62802 92891 155968 157559 170487 168511 201256 80471
13143 80471 199137 159641 -22930 -86414 72462 128995 99584 221920 237067 91245 52878
13132E2878J06600l0113J506j25040j28150J57185K08180j00771j33067J27682
13122A36890R9444L1641j87897p6547J38761O7197j22877K9181j00081m2418m0153
13111f6859L8794j21378J22234j1358m2393J7200P8228m990k9895p1568q0108
$$ plain form
13132 52878 159478 129365 130871 5831 -122319 34866 243046 142275 9208 136890
13122 136890 236334 267975 80078 3531 142292 209489 86612 115793 15712 -26706 -66859
13111 -66859 -28065 -149443 -27209 -38567 -80960 -63760 14468 9478 -20417 -91985 -172093
$$ [...]
##END NTUPLES=NMR SPECTRUM
##END=
