##TITLE=Analysis number 314492
Compound Code ac 30948
Project Code adrs
Chemist Name cuschem
##JCAMPDX= 6.0         $$ Bruker NMR JCAMP-DX V2.0
##DATA TYPE= NMR SPECTRUM
##DATA CLASS= NTUPLES
##ORIGIN= Bruker BioSpin GmbH
##OWNER= NMR
$$ XWIN-NMR		Version 3.5
$$ Tue Oct 18 13:31:53 2005 GMT Daylight Time (UT+1h)  MAYBRIDGE\NMR@NMR_250MHZ
##.OBSERVE FREQUENCY= 250.131544655141
##.OBSERVE NUCLEUS= ^1H
##.ACQUISITION MODE= SIMULTANEOUS (DQD)
##.ACQUISITION SCHEME= undefined
##.AVERAGES= 16
##.DIGITISER RES= 18
##SPECTROMETER/DATA SYSTEM= dpx250
##.PULSE SEQUENCE= zg30
##.SOLVENT NAME= DMSO
##.SHIFT REFERENCE= (INTERNAL, DMSO, 0, 16.5155)
##AUDIT TRAIL= $$ (NUMBER, WHEN, WHO, WHERE, WHAT)
$$ ##TITLE= Audit trail, XWIN-NMR		Version 3.5
$$ ##JCAMPDX= 5.01
$$ ##ORIGIN= Bruker BioSpin GmbH
$$ ##OWNER= NMR
$$ C:\u/data/dgb/nmr/ADRS/10990/pdata/1/auditp.txt
$$ ##AUDIT TRAIL=  $$ (NUMBER, WHEN, WHO, WHERE, WHAT)
(   1,<2005-10-18 13:31:32.24 +100>,<MAYBRIDGE\NMR>,<NMR_250MHZ>,
      <created by zg, POWCHK disabled, PULCHK disabled
       configuration hash MD5:
       62 19 C7 07 E1 42 D1 B7 37 6C 3D D0 77 39 F9 E6
       data hash MD5: 64K
       A8 A4 D2 17 FF 89 36 1B 68 2E 41 56 38 35 1A A6>)
(   2,<2005-10-18 13:31:44.22 +100>,<MAYBRIDGE\NMR>,<NMR_250MHZ>,
      <Start of raw data processing
       ef LB = 0.3 FT_mod = 6 PKNL = 1 SI = 32K 
       data hash MD5: 32K
       25 96 FD 6E 55 65 A1 FE CF F1 81 5D 9B 56 F1 81>)
(   3,<2005-10-18 13:31:45.97 +100>,<MAYBRIDGE\NMR>,<NMR_250MHZ>,
      <apk 
       data hash MD5: 32K
       0F 8B D3 6E F9 1D BE BA 38 8A 21 0E 95 94 BC 54>)
(   4,<2005-10-18 13:31:46.64 +100>,<MAYBRIDGE\NMR>,<NMR_250MHZ>,
      <abs ABSG = 5 
       data hash MD5: 32K
       A7 19 78 2F 47 A8 6F AC 3E 31 93 BE 69 85 B1 7F>)
$$ ##END=
$$ 
$$ hash MD5
$$ ED 47 38 AA 78 C1 BA 6D 14 B7 FA 9D D6 9E 6F CB
##$RELAX= 
##$RELAX= 
##$RELAX= 
##$RELAX= 
##$RELAX= 
##$RELAX= 
##$RELAX= 
$$ Bruker specific parameters
$$ --------------------------
##$DU= <C:\u>
##$EXPNO= 10990
##$NAME= <ADRS>
##$PROCNO= 1
##$TYPE= <nmr>
##$USER= <dgb>
##$AMP= (0..31)
100 100 100 100 100 100 100 100 100 100 100 100 100 100 100 100 100 100 
100 100 100 100 100 100 100 100 100 100 100 100 100 100 
##$AQSEQ= 0
##$AQ_mod= 3
##$AUNM= <au_zg>
##$AUTOPOS= <29 >
##$BF1= 250.13
##$BF2= 250.13
##$BF3= 250.13
##$BF4= 250.13
##$BF5= 500.13
##$BF6= 500.13
##$BF7= 500.13
##$BF8= 500.13
##$BYTORDA= 1
##$CFDGTYP= 0
##$CFRGTYP= 5
##$CHEMSTR= <none>
##$CNST= (0..31)
1 1 145 1 1 1 1 1 1 1 1 1 1 1 1 1 1 1 1 1 1 1 1 1 1 1 1 1 1 1 1 1 
##$CPDPRG= <>
##$CPDPRG1= <>
##$CPDPRG2= <>
##$CPDPRG3= <>
##$CPDPRG4= <mlev>
##$CPDPRG5= <mlev>
##$CPDPRG6= <mlev>
##$CPDPRG7= <mlev>
##$CPDPRG8= <mlev>
##$CPDPRGB= <>
##$CPDPRGT= <>
##$D= (0..31)
0 1 0 0 0 0 0 0 0 0.06 0 0 0 0 0 0 0.0002 0 0 0 0 0 0 0 0 0 0 0 0 0 0 
0 
##$DATE= 1129638691
##$DBL= (0..7)
120 120 120 120 120 120 120 120 
##$DBP= (0..7)
150 150 150 150 150 150 150 150 
##$DBP07= 0
##$DBPNAM0= <>
##$DBPNAM1= <>
##$DBPNAM2= <>
$$ [...]
##$SUBNAM7= <"">
##$SUBNAM8= <"">
##$SUBNAM9= <"">
##$SW= 20.6930455092707
##$SWIBOX= (0..15)
0 0 3 0 0 0 0 0 0 0 0 0 0 0 0 0 
##$SW_h= 5175.983436853
##$TD= 65536
##$TD0= 1
##$TE= 294.16
##$TE2= 300
##$TE3= 300
##$TEG= 300
##$TL= (0..7)
0 120 120 120 120 120 120 120 
##$TP= (0..7)
150 150 150 150 150 150 150 150 
##$TP07= 0
##$TPNAME0= <>
##$TPNAME1= <>
##$TPNAME2= <>
##$TPNAME3= <>
##$TPNAME4= <>
##$TPNAME5= <>
##$TPNAME6= <>
##$TPNAME7= <>
##$TPOAL= (0..7)
0.5 0.5 0.5 0.5 0.5 0.5 0.5 0.5 
##$TPOFFS= (0..7)
0 0 0 0 0 0 0 0 
##$TUNHIN= 0
##$TUNHOUT= 0
##$TUNXOUT= 0
##$USERA1= <user>
##$USERA2= <user>
##$USERA3= <user>
##$USERA4= <user>
##$USERA5= <user>
##$V9= 5
##$VALIST= <valist>
##$VCLIST= <CCCCCCCCCCCCCCC>
##$VD= 0
##$VDLIST= <DDDDDDDDDDDDDDD>
##$VPLIST= <PPPPPPPPPPPPPPP>
##$VTLIST= <TTTTTTTTTTTTTTT>
##$WBST= 1024
##$WBSW= 4
##$XGAIN= (0..3)
0 0 0 0 
##$XL= 0
##$YL= 0
##$YMAX_a= 410458
##$YMIN_a= -427081
##$ZGOPTNS= <>
##$ZL1= 120
##$ZL2= 120
##$ZL3= 120
##$ZL4= 120
##$ABSF1= 16.51551
##$ABSF2= -4.177662
##$ABSG= 5
##$ABSL= 3
##$ALPHA= 0
##$AQORDER= 0
##$ASSFAC= 0
##$ASSFACI= 0
##$ASSFACX= 0
##$ASSWID= 0
##$AUNMP= <proc_1d>
##$AZFE= 0.1
##$AZFW= 0.1
##$BCFW= 0
##$BC_mod= 0
##$BYTORDP= 0
##$COROFFS= 0
##$CY= 12.5
##$DATMOD= 1
##$DC= 0
##$DFILT= <>
##$DTYPP= 0
##$F1P= 14.0000005364418
##$F2P= -0.99999901652339
##$FCOR= 0.5
##$FTSIZE= 32768
##$FT_mod= 6
##$GAMMA= 0
##$GB= 0
##$INTBC= 1
##$INTSCL= 1
##$ISEN= 128
##$LB= 0.3
##$LEV0= 0
##$LPBIN= 0
##$MAXI= 10000
##$MC2= 0
##$MEAN= 0
##$ME_mod= 0
##$MI= 0
##$NCOEF= 0
##$NC_proc= -3
##$NLEV= 6
##$NOISF1= 0
##$NOISF2= 0
##$NSP= 0
##$NTH_PI= 0
##$NZP= 0
##$OFFSET= 16.51551
##$PC= 1
##$PHC0= -80.21135
##$PHC1= 6.320688
##$PH_mod= 1
##$PKNL= yes
##$PPARMOD= 0
##$PSCAL= 4
##$PSIGN= 0
##$REVERSE= no
##$SF= 250.130001621275
##$SI= 32768
##$SIGF1= 0
##$SIGF2= 0
##$SINO= 400
##$SIOLD= 32768
##$SREGLST= <1H.DMSO>
##$SSB= 0
##$STSI= 32768
##$STSR= 0
##$SW_p= 5175.98343685301
##$SYMM= 0
##$S_DEV= 0
##$TDeff= 65536
##$TDoff= 0
##$TI= <Analysis number 999999
Compound Code 99
Book Reference 9
Project Code 9>
##$TILT= no
##$TM1= 0
##$TM2= 0
##$TOPLEV= 0
##$USERP1= <user>
##$USERP2= <user>
##$USERP3= <user>
##$USERP4= <user>
##$USERP5= <user>
##$WDW= 1
##$XDIM= 32768
##$YMAX_p= 401431141
##$YMIN_p= -162500
$$ End of Bruker specific parameters
$$ ---------------------------------
##NTUPLES= NMR SPECTRUM
##VAR_NAME=  FREQUENCY,     SPECTRUM/REAL,   SPECTRUM/IMAG
##SYMBOL=    X,             R,               I
##VAR_TYPE=  INDEPENDENT,   DEPENDENT,       DEPENDENT
##VAR_FORM=  AFFN,          ASDF,            ASDF
##VAR_DIM=   32768,         32768,           32768
##UNITS=     HZ,            ARBITRARY UNITS, ARBITRARY UNITS
##FACTOR=    0.157963299565203, 1,           1
##FIRST=     4131.02468291937, 0,            0
##LAST=      -1044.95875393364, 0,           0
##MIN=       -1044.95875393364, -162500,     0
##MAX=       4131.02468291937, 401431141,    0
$$ Real data points
##PAGE= N=1
##DATA TABLE= (X++(R..R)), XYDATA
$$ [...]
22564 -9240 -19585 -12161 9154 10214 -4639 -24827 -30652 -19018 -7087 3058 -6844 9180 1821
22551 1821 4387 13120 1922 5622 -4041 -3243 6927 5309 15100 19135 -1593 882 -4538 -15763
22537 -15763 -4099 -2534 618 -3860 -2877 22417 22393 12206 11453 -10130 -11448 -11584 -12335 11547 12512
22522 12512 -11540 -10328 -7755 -725 2466 9379 11677 4981 -2503 -16154 -27360 -17429 -20450 -15910
22508 -15910 -21346 -22264 -27261 -25011 -27499 -18823 -6668 1691 6290 7737 6435 6623 -7155 -6179 16336
22493 16336 40181 19797 -6438 -1422 -5245 1035 19618 18156 -4183 -15696 -18363 -19425 -8215
22480 -8215 3642 2456 -373 -8530 -17848 -719 -7153 -16358 -6748 -15621 -8643 20752 31163 25515
22466 25515 37470 39274 22742 7872 1536 -7626 -11781 -5866 -8710 5787 9363 14993 24174
22453 24174 29816 33428 24215 12418 4688 15379 12556 10739 4841 -2794 3371 7598 3848 6794
22439 6794 13068 19518 4724 -3154 -4779 -10830 -11250 6979 17113 9151 5047 9038 17807 -2145
22425 -2145 -19496 -21773 -28863 -11577 -6192 -3040 10557 -2270 -12997 -6909 -4457 -4792 -3944 -2099
22411 -2099 -21948 -22536 11942 28507 25529 20421 9729 17933 24683 21419 18467 -4886 -17635
22398 -17635 -14448 -11185 -14958 -13830 -13035 -8205 4594 8224 5569 3505 1771 5665 3675 -11378
22384 -11378 -19115 -6702 3328 -9153 1223 15986 25158 23907 18519 21608 8794 -1206 -10190
22371 -10190 -4661 8181 17242 9289 -1919 12368 17869 518 -30390 -38786 -20372 -1742 -4322
22358 -4322 -6716 -10262 1281 -6606 -23547 -28857 -12884 -6463 -21600 -37929 -13351 -4995 -7522
22345 -7522 -11754 -27289 -29592 -21820 -18176 -24149 -19688 -15482 -29504 -36958 -19747 -17111 -10426 -4767
22331 -4767 -24874 -18876 2024 11621 3607 -8142 -27285 -13206 -5637 -757 -2505 11883 36344
22318 36344 40404 43316 35017 19943 2778 10407 7222 13960 22940 33827 27109 20392 10474 15261
22304 15261 -4298 -2445 -11734 -1451 5826 3625 -11699 -8227 -704 -3377 -17055 -22519 363
22291 363 3327 5240 7071 894 2697 8392 14725 -4640 -11030 -980 7100 20844 12498 8758
22277 8758 -4238 -13518 -21817 -29171 -47872 -17595 8656 11177 30499 32154 -5046 -8917 10010
22264 10010 -500 -8274 -5809 -25008 -45350 -36842 9028 30191 25373 7790 -4147 -5426 -4546
22251 -4546 2202 13458 13711 10138 -5163 -25267 -19087 -25164 -43101 -51883 -37113 -31394 -29768 -34196
22237 -34196 -50380 -51508 -53563 -39867 -27340 -22014 -35391 -24409 -21339 -18313 4994 644 -10671
22224 -10671 -19618 -21555 -16050 -19828 -36743 -47417 -35708 -10495 -10622 -16293 -12920 -13133 -12793 -11877
22210 -11877 -13310 -1840 12202 4723 -11401 -18282 -28562 -30675 -43753 -40533 -29560 -15129 -21422
22197 -21422 -15731 -14005 -8498 -2142 -9478 4321 9900 13918 21485 22419 26943 12896 -13651 -30005
22183 -30005 -24249 -18017 -25028 -30643 -29260 -18107 -14924 5774 8564 -8228 -13313 -15222 -11947 -10048
22169 -10048 2184 11193 19963 27972 14271 4499 -14349 -5657 7471 -9339 152 -6752 -1525
22156 -1525 -7774 -9302 583 5372 -897 -11327 -9835 12241 35260 43102 23740 3486 -9418
22143 -9418 2211 14863 20715 25634 16618 12000 12757 24733 22719 16997 15845 19924 5180 -6064
22129 -6064 -8385 -3730 -6036 -8427 -17153 -17744 -36937 -10819 8544 6071 858 -12066 -31087 -18831
22115 -18831 -13968 -9947 7382 2682 -4370 7575 11381 18368 13236 -3004 -12528 -9473 9298
22102 9298 20438 19522 14815 3832 -10816 -20979 -20733 -16274 -15792 -22349 -21825 -5816 -15385 -4339
22088 -4339 3649 -12082 -12104 -11243 704 12969 -916 -5208 11140 3222 -5887 -18866 -18738 27455
22074 27455 33899 21317 13851 8082 19922 9803 -5573 -2516 13684 13331 -5202 286 8625
22061 8625 25501 18538 282 -10336 -9960 -4605 1818 1386 -9059 -13421 -15086 -22850 -11299 -10489
22047 -10489 -8248 -3936 6349 12786 27912 19246 3905 4572 4049 5382 24809 26334 12330 -8265
22033 -8265 -23009 -40317 -33022 -39371 -31153 -10353 12841 19426 8192 -8623 -20726 -14770 -12290
22020 -12290 -5974 2116 18448 15265 12371 18419 18726 909 -10676 -7117 8116 2742 -24881
22007 -24881 -24261 -13978 -9340 4680 9932 5604 -14379 -27479 -13445 22 9446 -8018 -19571
21994 -19571 -22405 -13610 -13070 1433 6649 11229 15800 3661 -9333 -5797 -30119 -35774 -22642
21981 -22642 -27377 -34719 -18696 -6965 -11547 -3648 -11203 -4117 4048 8515 -10031 -12844 4224
21968 4224 20379 15022 -385 -18878 -9600 936 -15869 -12758 14270 -2678 -4284 -7790 -14104
21955 -14104 -2225 3958 -18933 -15417 -11547 -24946 -5758 4348 -4784 -31874 -51559 -35359
21943 -35359 -8492 -16275 -16208 -15459 -15794 -6762 7471 11830 -880 -21460 -31326 -24707 -11095 -13071
21929 -13071 -30725 -29033 -24092 -23453 -16678 -2059 4387 10064 15779 14954 -4255 -1696 -2067 -1700 7635
21914 7635 25831 43347 29969 33295 49077 28761 3028 -7281 -18955 -19612 -1561 4658 17896
21901 17896 16599 11044 9536 -18487 -16616 -14831 -10021 7549 22888 20971 26093 11380 -18649
21888 -18649 -22697 -9060 -4816 -110 1706 -3667 9895 9259 -9762 -8852 -19907 -30148 -15989
21875 -15989 -10421 -3965 -112 -3916 -4376 9808 10807 7454 12350 8409 -16181 -28994 -15642 -27745
21861 -27745 -35646 -25485 -31224 -32566 -27461 -28262 -11315 -14365 -29016 -36752 -9208 18792 308
21848 308 -15243 -16597 -12161 5004 13567 9050 2389 -5331 2285 -5200 -20478 -10701 -4155 -13074
21834 -13074 16039 19444 15991 24486 -1158 -10130 2311 18665 16472 14912 13165 19239 22636
21821 22636 11765 25195 18278 -3674 451 26957 22137 16337 5433 12417 22985 16274 20780
21808 20780 21417 19115 26614 47157 51420 31532 6733 1072 240 -12023 -9464 -784 6576 4170
21794 4170 6027 -13737 -35524 -35353 -35549 -31080 -22074 -15415 -11291 8068 25101 18884 15327 9346
21780 9346 -5596 -12509 -9819 -14371 -14876 4810 20231 16181 20284 12958 3154 -8955 -14797 18562
21766 18562 20199 -2117 -16350 9737 15512 -16983 -28995 -36447 -23252 -8377 7021 4936
21754 4936 9057 3917 -10331 -31799 -26920 -17247 -22392 -23806 -17902 -17742 -22891 -6480 17170 23579
21740 23579 22693 14261 66 -15883 -19872 -7863 5667 -10525 -11784 -19843 -32897 -25819 -20205
21727 -20205 -39908 -27044 -21447 -30382 -39114 -37644 -28311 -7069 1227 577 15317 13558 -11302
21714 -11302 -9009 -11474 -8977 -8386 -5128 -5415 11375 544 3537 -2534 575 11087 10555 12388
21700 12388 6620 2011 2481 -2081 4997 7365 -11721 -12345 -1549 -10063 -16076 -12539 -38566 -41489
21686 -41489 -25263 -3599 -1045 -4778 -22474 -24828 -6678 -6763 -2462 -1163 19493 25242 24581 8639
21672 8639 4107 6939 5392 9067 8520 -2470 5514 15244 17809 29686 36148 13457 -8193 -21646
21658 -21646 -31063 -39379 -29063 -16884 -18854 -10043 -10639 1105 14992 4768 2721 8750 1118
21645 1118 -6468 -24038 -25239 -20483 -9305 -15492 -28168 -36272 -26148 -17237 -23178 -28332 -14877
21632 -14877 -5580 -13921 -18445 -19908 -15671 -2814 -239 -18581 -8789 11198 18461 11855 2700 15582
21618 15582 27592 18029 9222 -5585 2014 -8585 -13330 8571 32100 27108 17632 1318 -6281
21605 -6281 6481 6838 -8665 -22873 798 13370 -3791 -22362 -41544 -36138 -40109 -23818 -14090
21592 -14090 -21394 -13427 -7533 -10280 -23478 -41174 -27044 -28843 -30999 -22747 -11876 -14005 -19255
21579 -19255 -20396 -15359 -13392 12362 15973 15310 27011 41836 20732 18419 4472 -5307 3903
21566 3903 -1391 2309 -5418 -5188 8646 5514 4191 1308 -14418 -18379 -16089 -24338 -24220 -6160
21552 -6160 7090 16527 20052 32166 21659 11534 14168 24305 22051 18204 12386 22482 12063
21539 12063 -11875 -20950 -8130 -25127 -38911 -28541 -8119 -6639 -26848 -22349 -5123 1333
21527 1333 -6637 -13426 -19725 -29807 -50158 -40563 -15416 -1447 -7808 -3185 -17115 -13262 3324
21514 3324 -5937 -4204 -6605 -6227 4025 13495 18116 14772 -3408 -35771 -27345 847 10416 -1228
21500 -1228 -3490 356 177 -6822 -17605 -5304 6374 10619 24533 20900 9615 -5056 -10613
21487 -10613 -12379 -10514 -19637 -25664 -27038 -36775 -19908 -14819 3472 485 -9233 -9447 -15213 -30302
21473 -30302 -12407 -7569 -11539 -21555 -28180 -23582 -15664 -59 1182 19306 30281 24885 15132
21460 15132 2515 -19257 -22635 -22157 -6644 9801 7683 7761 -12091 -23597 -20213 1832 19366
21447 19366 13488 11414 14862 -10533 -20026 -29617 -27533 -9093 10516 5325 3337 9147 8571 18537
21433 18537 16435 4720 10934 -1645 -9841 12719 7200 12285 8121 -17901 -35286 -28654 -9933
21420 -9933 11248 5518 10475 18991 16469 15111 12619 6843 12360 16633 -30 -5207 -10577 -11934
21406 -11934 -25936 -24368 -7456 -5387 -17326 -11585 4367 14719 23727 -1825 -18277 -5649
21394 -5649 10577 1796 -11284 -12291 -13829 -21801 -30950 -26457 -12361 3616 12613 10554 7194 833
21380 833 3555 -18875 -30525 -34046 -42978 -29677 -1169 -7763 -10647 -6417 11569 30513 22352
21367 22352 791 -20820 -38569 -39079 -22829 -20630 -31310 -19373 -9829 -13377 -7189 8467 12550
21354 12550 6701 -23431 -34506 -3150 11823 19955 7021 -5550 -9964 -12378 -7160 -12692 -23674
21341 -23674 -12335 4427 9286 15131 24782 26769 4464 -16094 -22507 -43218 -44901 -40827 -36846
21328 -36846 -27924 -22538 -12521 -11888 -20283 -14883 10567 11273 4020 -7303 -12198 -15996 -12242 -302
21314 -302 -3692 -8338 -18421 4210 -3982 -1611 -11252 -15378 448 -10576 -7191 -12116 2095 16113
21300 16113 19829 26604 33455 24190 -3333 -10221 -22850 -26697 -17375 4269 14288 7698 2023
21287 2023 -5760 1083 14310 13703 18861 22783 11964 -7932 13036 13119 22583 29366 36997 27975
21273 27975 13971 11764 8835 -2186 -14450 519 467 -4211 -16948 -28662 -22298 -8425 8274
21260 8274 4803 5973 -16301 -30353 -22854 -13447 -22697 -6759 -4468 -16609 -31439 -20239 -13269
21247 -13269 -11832 -18127 -8265 -2399 3648 2516 -6567 -31206 -15252 3282 6155 15134 7379 -12994
21233 -12994 -12704 -4963 -1740 115 -336 10696 27270 15256 -7853 -15265 -16967 -464 -1721 -1078
21219 -1078 18288 -1472 6585 5925 5534 4000 5969 13304 14799 19438 24098 42909 50399 42285
21205 42285 16742 18742 31986 30623 23253 5570 -20203 -14484 13507 -7416 -12421 -2761 -3272
21192 -3272 -13628 -763 10229 11852 -7026 -10280 -22199 -22504 -11622 4758 18350 24432 23139
21179 23139 26931 33925 18838 4744 4695 11489 12133 5936 -1130 -13345 -21143 -11205 1397 -4547
21165 -4547 -16237 -12649 -16051 -7876 -1817 -9658 -9644 -18441 3648 9924 8146 2674 -18257 -9155
21151 -9155 11185 28335 21081 8618 -5949 -11218 -9583 -9324 -5227 -17123 -43212 -51519 -32009
21138 -32009 -21627 -17830 -28531 -38594 -27900 -22621 -21472 -14812 -5186 -7404 -15138 -13560 -6088
21125 -6088 -2475 20544 18826 -82 -453 -5176 -6956 -3881 -7783 -11386 -3564 5514 7688 24821
21111 24821 41089 29483 24413 23749 11744 8168 13918 -493 -13151 -17196 -5287 7346 37008
21098 37008 32232 15073 11731 -6207 -2603 1021 -16391 -14485 -14448 -22936 -5209 17283 27423
21085 27423 30611 33497 14656 -7438 606 2532 5681 6670 -5255 -10366 1048 7514 2052 3750
21071 3750 11088 3015 -8773 6336 13467 8859 -863 -21597 -26088 -27107 -21407 -5687 6845
21058 6845 7974 10257 14973 24652 27382 34756 22840 9125 7598 5661 15106 805 14532 12621
21044 12621 2147 -13339 -20830 -14418 5339 13423 12267 10232 -4037 -9619 -1083 967 -3083
21031 -3083 7733 21361 654 -5670 -11851 -17187 -19052 -12905 -4106 -1703 -12988 -13165 -35503 -24349
21017 -24349 -1665 13001 6568 17934 29872 11900 -10458 -9743 -5495 -775 14500 19250 17728
21004 17728 5320 -17046 -53227 -50796 -19831 -1947 -6041 -294 10563 26344 28837 22218 24584
20991 24584 29152 21588 6372 -2574 -20859 -23802 -14256 -20401 -23685 -18712 -22791 -18399 -7553 15114
20977 15114 41260 43724 28856 -1728 -9172 5222 -8621 -30671 -45047 -34346 -19158 -10847
20965 -10847 -4510 -17400 -27498 -28922 -40326 -44562 -41425 -22645 -12545 -19173 -23502 -10143 -8716
20952 -8716 -1896 5583 445 -2887 3952 17531 24724 15745 -2417 -21749 -16401 -5670 8175
20939 8175 16236 -3933 -4565 -1184 -9179 13530 27124 20753 5679 -12196 9502 32303 27166
20926 27166 5447 -19204 -8118 8961 16507 28454 19564 21193 30184 36985 43498 39035 34457
20913 34457 20769 37070 35815 30959 23965 8761 5174 -1070 -8469 -10947 -5057 -1577 4246 -7915
20899 -7915 -6077 -13291 -4559 -4738 -16130 -19509 -16452 6623 21089 24648 22362 14779 17200 25190
20885 25190 16894 7821 455 10101 -1888 -35306 -18945 23886 19825 8065 21045 4370 -10346
20872 -10346 -1023 21007 14932 11413 32638 24272 -4780 -11142 5637 3609 -4204 876 10611
20859 10611 27679 28388 49455 43950 20841 3573 -7045 -14644 -870 17122 13340 17571 21359
20846 21359 9103 4793 4214 479 4969 4951 -2793 4838 11139 1028 -3191 -2011 -13597 -16488
20832 -16488 1404 20364 23748 25406 7140 -21734 -24045 11151 8697 22684 31401 31733 27007
20819 27007 10658 19476 19603 8839 -6172 -8341 -10128 -4916 6504 5642 2208 -5900 -16456 -11747
20805 -11747 -14943 -14682 128 3461 10615 12490 5959 4530 5713 -9604 -16235 -28460 -22886 -16577
20791 -16577 -20008 -29425 -40278 -36986 -26167 -8835 10506 15046 12376 9596 -1272 1037 16564
20778 16564 17655 20139 27775 19157 9806 19136 44417 44019 10732 2152 23565 30814 32223 43856
20764 43856 34818 35261 41765 27843 27978 22134 5709 10856 5413 13877 24537 22859 15475 26068
20750 26068 26790 33236 32138 30243 31395 21464 10347 3450 8553 8972 -670 7815 20022 3705
20736 3705 3305 7180 27974 9523 -9991 -1025 -59 -5439 -1214 162 -12669 -20938 -9187 -722
20722 -722 6398 2128 -3591 -9574 7471 17423 34197 19707 -14858 -25033 -21893 -13597 -1623
20709 -1623 5643 11287 14830 10519 6730 1943 -3655 6045 15627 1874 1593 -4016 -32050 -37378
20695 -37378 -25667 -23529 -6707 8466 10271 -14923 -15752 -2931 7099 28748 22111 5102 -15587
20682 -15587 -15153 -11078 -5610 -1607 1772 13559 19302 6979 -2582 -7371 -8440 -11087 -7727 -10998
20668 -10998 -7136 -6158 -1216 -6115 10871 11142 628 4408 -12319 -39646 -31292 -25952 -8477 9041
20654 9041 11304 11805 2833 11490 14924 14377 15618 32252 28083 27257 31329 21216 21756 27473 11461
20639 11461 665 12657 27488 15378 3690 10301 16527 22069 18523 8246 -554 -15894 5554
20626 5554 424 -14554 -13455 -928 7556 3756 1427 -6937 1939 22407 26150 23953 2986 10860
20612 10860 36872 32461 32786 39463 44722 38861 30031 -4400 -13403 -7736 -12344 -6523 -7836 3003
20598 3003 -11484 -5313 6152 24073 29395 14418 3943 5250 9371 933 -2800 -11124 1746
20585 1746 17460 29591 29071 27133 20353 1040 -12955 1135 7786 -2887 10641 15723 19900
20572 19900 13287 23574 23598 3157 11412 11665 3006 -6921 -21929 -28633 -37634 -30588 8511 25661
20558 25661 14020 -3275 -21408 -26956 -23174 -18435 -9624 -6527 -11120 -6576 6736 9531 29458
20545 29458 33235 26809 15418 15551 24333 25050 20224 33230 23791 -2014 -1780 -9683 505 9519
20531 9519 1422 -3115 -11497 -30568 -27025 -2319 14545 4931 13344 9007 -10314 -10616 6388 10748
20517 10748 3035 -7074 -11938 -15516 -4905 -9000 -9042 1460 6087 18401 30920 5129 -13556
20504 -13556 -31814 -40343 -14779 13003 28129 15209 14734 11618 3371 -3684 665 5841 8945
20491 8945 25034 31046 15072 -8517 -2036 7768 -4246 -2289 -673 3922 13521 14369 24775 47615
20477 47615 39050 39821 50038 30725 22742 18240 8691 3498 12589 17900 4071 425 17497 -1477
20463 -1477 -4393 9710 26173 13760 17077 40558 51460 35022 35156 35110 21572 9925 13770
20450 13770 10934 19474 19501 19367 25200 22934 31718 37861 47351 68091 103614 142763 187034 244660
20436 244660 271969 261977 228260 187635 150890 119264 96490 67256 49933 41757 43445 38492
20424 38492 24834 30194 26219 15381 23823 16362 7477 -397 -703 15695 15674 10842 -3657 -3527
20410 -3527 -4528 -8024 -14349 -5817 -13558 4914 3715 -1508 -312 -1982 10155 13233 19491 16829
20396 16829 14983 11792 6086 -5198 9284 29123 17749 7308 6956 11210 10519 5359 21483
20383 21483 20749 23781 29279 38017 28688 -2680 -10754 -14663 -6824 2066 -10509 -21458 -10408 -11508
20369 -11508 -19823 -23840 2366 9126 -12768 -28770 -17355 -10235 -9907 3585 20771 12824 17180
20356 17180 21758 26704 43126 37383 4407 -1698 11555 26886 13873 14550 22546 17240 21065
20343 21065 39299 65522 49950 37995 31169 40024 32047 26771 26423 28450 29048 19132 6790 3863
20329 3863 16583 28508 26801 15857 7527 24701 51801 63355 53006 36025 28260 10309
20317 10309 -19552 -27265 -24589 -21266 -8823 1245 -8851 -18900 -36116 -15615 -899 -4845
20305 -4845 2195 12248 12486 145 -9434 -4863 9231 2706 1054 22222 15342 11056 10767 19297
20291 19297 11874 -10295 -18428 -23374 -25597 -40067 -42827 -39534 -22842 -7872 -6950 -3210 11416
20278 11416 -20819 -10879 10906 5176 -3366 10280 32808 45199 41809 32154 5927 1705 -5216
20265 -5216 21740 34385 29007 14810 4452 11177 3080 -7632 -13458 -18822 -11818 -13208 -14360
20252 -14360 -12010 -15629 -10151 -20218 -4394 -6708 5650 8201 20808 20885 13676 8926 -19843 -23744
20238 -23744 -6737 8227 19062 -139 -17436 14331 38225 29905 25675 24593 19401 1854
20226 1854 8543 15141 31702 38029 25494 14892 6509 -31099 -22737 10278 28777 34530 36275
20213 36275 37747 20409 24268 36535 13781 -3545 394 12121 28790 45372 50446 33074
20201 33074 30696 19876 11493 31413 33113 32574 30767 43436 46896 43600 25942 18833 9007 6881
20187 6881 20214 16411 1744 17373 38518 32220 13529 4531 6725 -8548 -12606 -10537 1713
20174 1713 9756 425 -2681 7310 -3124 -13719 -12374 7164 16939 8302 10895 18082 25780 24186
20160 24186 18553 14461 20531 40414 38764 33881 33025 6670 -3405 3387 6368 -3494 4856 19175
20146 19175 18809 3007 4062 -7939 -16134 -18203 -3809 2112 -2639 -4821 -4903 -12187 -1267 22861
20132 22861 34669 45832 53207 49875 44784 16562 -15720 -30604 -17437 -12137 827 -2179 18070
20119 18070 18254 16308 20012 11715 9405 5038 16598 10833 5014 8896 5701 13707 6829 -6486
20105 -6486 -1039 11844 5375 16409 23070 8804 -3490 4398 3412 -7716 1000 10205 26171
20092 26171 40259 49926 46982 36333 32286 33232 18675 -2281 2193 10665 5338 12201 16167 19751
20078 19751 7127 14565 29319 19462 20299 12283 -8140 -15783 7237 6514 9676 28118 25459 19532
20064 19532 15903 8779 -6152 -20554 -9211 14706 15671 -10513 -11 11538 1453 -6601 986
20051 986 15905 20764 10837 9222 13087 16204 14447 27428 28616 26375 30630 28954 41289 56682
20037 56682 59632 44577 34325 27336 32017 26353 13100 11228 12653 24254 588 -14723 -15190
20024 -15190 -19196 2427 19090 5512 7575 16316 11569 -4930 -7275 -15699 -26151 -12072 8040
20011 8040 17708 35116 47957 37040 22235 692 1283 -2696 1564 4512 13716 10327 12795 24853
19997 24853 29565 35670 44285 49251 61266 36430 25348 22547 34100 43244 30220 25040 16230
19984 16230 11272 16934 20551 26859 39542 22066 11149 31674 50385 45019 39676 33551 21417
19971 21417 21390 32111 37887 51467 45755 34477 15863 -263 -9556 -523 3832 11213 17566 21830
19957 21830 27595 16217 12022 12729 5384 -7118 -1744 -3111 2158 -219 3879 -1419 -17412 -8668
19943 -8668 8884 33801 39413 26783 19961 13678 8835 12544 28125 32173 15788 4225 1486
19930 1486 18168 40563 52970 48556 33201 21300 26364 27882 15308 -5286 -2163 3636 1101
19917 1101 -7351 -3088 7588 24216 27453 22087 10659 12810 6406 8364 6749 8787 -135 1088
19903 1088 12326 26328 15102 13389 8341 3591 9340 -6387 -10540 -12612 -11956 10257 37431
19890 37431 43789 38205 45882 40958 30600 21970 6216 10499 28499 18004 8340 21027 18384
19877 18384 17656 38126 50703 30906 21418 14605 15723 22200 26210 26820 29498 26298 13455 14288
19863 14288 46461 66493 65670 39916 34279 32083 22748 17344 35138 29006 37718 42322 39592 40803
19849 40803 38279 24603 13139 25593 35595 24614 28591 28850 2040 -8751 4345 14506
19837 14506 12424 18888 26481 50138 68422 65921 63345 61921 58046 54350 43958 41417 55411
19824 55411 50340 41599 35758 21507 6531 -269 -3467 -9344 -10618 -3958 16573 2872 3541 8440
19810 8440 3929 822 14437 27738 28315 9984 6345 10096 13402 18090 31605 33866 28787 21962
19796 21962 17910 12867 39393 52365 46685 41389 40054 32103 34229 33254 29913 27328 39915 47112
19782 47112 39800 40202 54924 50995 27474 4505 -13081 2300 2676 4033 13099 15552 5555 -9184
19768 -9184 -7800 16982 20375 20522 14385 19880 29995 46047 31887 21202 21297 29765 28291 16751
19754 16751 5429 29107 40023 36105 16934 17037 -1647 -3619 -2962 4984 9907 11202 13928 24442
19740 24442 32098 31865 35969 32952 36922 35821 32406 31254 13237 14205 20884 18586 30424 36351
19726 36351 21474 19207 15126 15485 16807 11513 -1067 -3748 19694 39960 19806 -4088 -2645
19713 -2645 4249 16463 22715 25582 37661 45712 42595 37120 23699 21350 8681 19908 27415
19700 27415 28387 22202 5939 -1221 19194 35333 41780 32303 43804 30977 31963 47270 45424
19687 45424 32029 9076 2556 -2322 -3568 3797 13248 6659 6876 37175 67513 102239 104062
19674 104062 89446 67956 43732 24969 16733 25441 37601 43731 64931 80178 63458 58073
19662 58073 40793 38345 65664 68716 57942 36340 15821 7100 16260 40804 43861 27995 24518
19649 24518 14677 33236 52406 61786 71521 63952 35219 45023 40538 34789 31505 25790 31678 50687
19635 50687 50966 39140 36189 32091 44102 45000 36758 26001 26964 31710 37306 42149 37042 30317
19621 30317 31661 34133 46755 53650 47536 33014 21204 3302 11277 41811 34904 24841 43869
19608 43869 38443 24908 18361 7368 5491 29464 46084 31953 32076 33806 29639 32915 37442
19595 37442 43333 34552 35048 32102 23657 18020 13565 16281 17225 16251 26309 18850 26277 25894 31817
19580 31817 55739 59054 51812 41436 50141 51632 39674 32952 40532 44155 36425 32678 41048 49467
19566 49467 53071 51058 56674 47295 45653 62583 60805 57069 52886 38931 46992 51287 48854 42869
19552 42869 39299 22741 19078 32667 45719 44160 37621 37356 26569 34631 42977 42088 41945 32571
19538 32571 25665 24071 24231 28159 23545 42406 60625 72571 84316 73156 49038 63908 63129
19525 63129 66975 66162 70314 68059 54454 56073 64970 66596 75144 70733 71453 77392 78892 96141
19511 96141 107643 100976 94455 75727 66670 63538 78417 65453 45832 21118 31383 43798
19499 43798 43013 53230 57872 60122 55664 45186 45296 57195 59527 53601 47560 31427 20895 12163
19485 12163 6617 43030 61433 44349 21773 2273 4804 13962 39772 70845 78593 52992
19473 52992 33725 26795 54311 89351 83492 77772 61285 49850 38904 36316 47483 35970
19461 35970 41597 47256 61392 66655 63979 77689 77411 79197 79104 86311 96318 93847 85520 96101
19447 96101 92702 77410 75282 90516 73398 79732 70422 45529 35715 38426 32946 37052 34920
19434 34920 44552 55470 67017 47719 38832 40504 41070 39151 44841 59214 70515 60627 50825
19421 50825 60323 73329 94570 96516 66891 63475 62915 66197 93597 116876 126170 128608 124382
19408 124382 116211 120799 135007 145571 167330 198930 218977 205830 192914 199703 209701 217399
19396 217399 227949 241460 232150 226918 245804 270799 291037 297082 299449 310090 301075 307784 316018
19383 316018 316096 292300 268932 251722 259047 270543 279398 280338 250921 228720 222321 211389 191480
19370 191480 169817 141113 144806 145070 157479 164900 162560 159483 145621 145390 146438 131154 124278
19357 124278 118479 117911 143017 178516 187140 186430 205269 203544 216761 226022 235515 261430 288466
19344 288466 305747 313416 318825 320835 323165 323937 318588 307204 307495 299088 316588 349628 357879 374281
19330 374281 377281 364714 330516 315992 289630 276279 261386 225483 203875 205515 205256 205686 202916
19317 202916 197691 168849 157337 141803 127160 126396 129444 126571 123230 142059 165287 152742 126066
19304 126066 140193 156607 166717 166481 163235 147391 133984 110282 89709 99885 103306 78461
19292 78461 94179 122686 133558 145576 152319 136539 124055 127476 119869 123486 139850 134360 132723
19279 132723 126622 139714 138944 125925 124551 135022 143934 150195 158546 156030 148537 145617 146375 153765
19265 153765 145465 148013 155385 144674 104090 107943 111274 85690 61267 74687 104219 148179
19253 148179 181908 195730 180195 176695 178631 175712 179143 177007 183390 188091 188898 189320 196445 202640
19239 202640 196262 187303 180096 178206 185278 195128 205515 210097 226609 228581 231602 257115 267271
19226 267271 262794 262698 265419 268671 247596 198265 123668 69746 49435 39676 61587 85560 94414
19213 94414 104064 116023 143777 184224 196507 200014 208677 211587 209330 205162 220817 237853 222048
19200 222048 180637 136124 83920 54081 80316 128813 190956 241194 262844 274901 222787
19189 222787 134609 82588 63301 69507 78571 81407 58626 81049 149956 241943 319908 334413
19177 334413 313530 300751 308450 317459 319661 314316 317003 329218 337957 332683 326163 339125 362481
19164 362481 375485 387020 374476 389830 402888 416950 439948 458589 445768 450038 439837 425923
19152 425923 410666 421329 443554 448562 437225 426913 420343 409938 410695 425127 427827 418763 412408
19139 412408 417201 421289 442163 463396 469257 477602 487753 501774 516821 533081 515967 521339
19127 521339 543008 539572 544985 560115 578762 617027 686062 733681 761164 805019 831928 837820
19115 837820 872979 910306 927245 920164 919482 922427 930066 935121 959701 1020427 1088408 1146361 1199980
19102 1199980 1257000 1321695 1364095 1425151 1512737 1589055 1675918 1764686 1856731 1979984 2112180
19091 2112180 2251015 2435707 2655585 2894296 3190543 3605693 4150875 4883972 5889140
19082 5889140 7065893 8249236 9151519 9714648 10164504 10951164 12259180 14087761 16461674
19073 16461674 19709996 24456501 31673224 43061710 61376720 90518663 133183011
19066 133183011 183602786 224102510 234902233 210521992 165522590 123457374 93638077
19059 93638077 73664124 60130118 50762656 44175126 39528465 36175898 33546774 31128380
19051 31128380 28515534 25664750 22865344 20310598 18023190 16025295 14283857 12792017
19043 12792017 11508405 10411378 9465486 8602877 7799409 7104731 6494547 5938154 5427882
19034 5427882 4975208 4563753 4201916 3910674 3614608 3309755 3044388 2814335 2632449
19025 2632449 2486876 2360749 2239155 2129294 1988983 1824972 1658276 1520157 1387699
19016 1387699 1283348 1190705 1107092 1042427 1006046 977751 945133 923763 878964 835162 817060
19005 817060 770964 741092 744685 740336 715052 699334 681436 659811 637574 608333 592241 579040
18993 579040 568881 555043 535156 543015 556552 543890 520365 492810 480379 480024 498971 491275
18981 491275 480558 474167 468524 451049 424713 403171 392120 381003 366700 380924 407989 415127
18969 415127 413407 426615 427943 414526 386569 377369 383402 379852 365780 375000 398492 417508 432472
18956 432472 458313 491353 518102 516369 488105 449310 401173 396243 440274 502662 586353 647752
18944 647752 692784 743331 814223 869533 890909 867074 837549 811806 830328 897589 971324
18933 971324 1063027 1189305 1299892 1368843 1424407 1497188 1573514 1651951 1727139 1791417 1849907
18922 1849907 1928356 2025255 2183416 2368486 2595251 2890141 3301016 3917713 4791272 5926105
18912 5926105 7168942 8225125 8784635 8762211 8430807 8164231 8242526 8701825 9592339
18903 9592339 11034806 13236205 16596649 21742266 29434727 40137267 52751236 63610364
18895 63610364 68459485 65791335 58380184 51174701 46017165 41972094 37978176 34036755
18887 34036755 31047099 29548078 29388283 29957424 30291657 29469467 27211826 23984170 20672347
18878 20672347 17796436 15523836 13738088 12361489 11315326 10492367 9827242 9260520
18870 9260520 8741906 8255090 7868588 7552241 7304665 7163130 7125841 7205837 7421388 7812312
18860 7812312 8430496 9440196 10992435 13198843 16075497 19376558 22334013 24161012
18852 24161012 24594629 24170420 23967813 24849626 27272869 31226137 36138817 41489417 47556539
18843 47556539 55415049 65425897 74543400 77770220 72488690 60734705 48194703 38352638
18835 38352638 31371401 26484605 23037405 20613617 18938281 17846874 17248900 17057357
18827 17057357 17055522 16882835 16194251 14861029 13072913 11261805 9728344 8511426 7556270
18818 7556270 6795012 6181058 5674115 5243138 4859098 4535603 4243545 3955572 3680120
18809 3680120 3391926 3092675 2814116 2572770 2349734 2148759 1971944 1811167 1677696
18800 1677696 1567377 1471203 1374846 1293604 1213394 1153064 1078664 983466 893066 843590 802735
18789 802735 778219 737967 720656 696309 669798 652844 633767 600987 588466 602541 608416 598021
18777 598021 574829 545218 509015 494226 474811 451301 442141 430985 413620 384175 358059 351592
18765 351592 359886 357371 358614 350954 330739 311306 290409 280716 264854 244046 223390 197097
18753 197097 178092 140576 128864 131663 144786 158159 156109 174902 191546 195812 184191 184788
18741 184788 181078 180380 161673 132206 106405 91157 98879 99416 108176 126812 118279 112703 108433
18728 108433 103637 91941 68017 65900 62288 85202 96032 78909 85100 93822 85441 113257 141781
18715 141781 164065 144401 104656 91996 86557 94483 104724 104194 115958 132351 132353 145963 118966
18702 118966 95814 107991 125912 123225 127244 140096 131254 103729 89966 94791 90405 93963 101779
18689 101779 111558 112284 107332 92096 75158 66539 32201 15764 18767 2925 9930 387 8494
18676 8494 13434 -704 4933 12930 18443 13700 10495 -18863 -18356 2217 -6874 4495 14872 20156
18662 20156 16109 31038 30552 20760 5772 8286 2462 3113 -20446 -32349 -4694 11408 38817
18649 38817 39264 30556 25881 13902 19357 18638 18078 14660 16665 32637 16019 7645 7680 6541 3979
18634 3979 5078 -5741 -11760 -5243 -13146 -16665 -17407 -19170 -5067 51 8708 13395 12313 26367
18620 26367 30252 24193 11213 -6902 -7184 -13093 -11152 -6274 18841 27034 4616 -3887 3356 -6750
18606 -6750 -26977 -26139 -31417 -39423 -19904 -6373 7952 6937 -3532 -5658 5289 27723 43185
18593 43185 35997 24309 28723 27519 24733 2830 -3558 -9909 -12551 -7771 -22411 -30198 -13247
18580 -13247 -15670 -18575 -20873 -6185 5189 17335 30006 16465 826 -26104 -22246 -15899 -25063
18567 -25063 -18278 -13972 -7694 -14427 -18487 -21214 -27733 -10393 9348 19802 17090 4313 11632
18554 11632 21951 21322 4168 10128 23611 20240 4849 -10079 -17982 -12712 -22364 -21242 -26634
18541 -26634 -24474 -31324 -30900 -8670 -21364 -31820 -24484 -19779 -14834 -270 -13112 -32688 -29965
18528 -29965 -29231 -36731 -40863 -42482 -35564 -28946 -30729 -13734 -2079 414 -442 -9917 -24095 -16246
18514 -16246 -26376 -8951 -3635 -13510 -21334 -23687 -40635 -32656 -25664 -20973 -9538 537 3679
18501 3679 19701 39272 26697 -2866 -7356 -7725 -12191 -10960 169 -1470 -9201 -5251 -15 -1536
18487 -1536 1952 14993 9277 -18640 -44598 -41351 -18449 -6002 11972 42879 37708 18500 -3929
18474 -3929 -7252 4779 2576 -75 -5248 -23176 -11209 6104 22906 24163 5580 -4974 -5517
18461 -5517 -13753 -10700 -13798 -20629 -4032 37112 66574 58968 40311 20255 14924 -5892 -12771
18448 -12771 -16727 -10261 1322 -12422 -24030 -26055 -29422 -26896 -5466 2004 -11210 -21559 -24163
18435 -24163 -22159 -24710 -11348 -14304 -10806 -18443 -16092 3580 13630 14646 14508 22815 8845 -1212
18421 -1212 -4647 -383 2964 7778 3020 -1707 14530 12873 -4551 -7211 16375 40975 37088 45464
18407 45464 54579 77337 70959 79893 109419 122341 119531 129927 138284 164751 164931 151474 148482
18394 148482 152581 168908 179997 184681 186592 190662 185737 188729 174143 163703 140963 102493 102181
18381 102181 109346 108128 96341 73651 65369 83273 99506 92757 91540 101529 105425 80171 57894
18368 57894 59420 56513 71003 65151 60786 80590 72167 67636 70870 69011 83718 118222 134252
18355 134252 134433 115921 122150 141567 137615 133364 164505 183319 175043 213664 252538 253033 259670
18342 259670 265756 240472 218802 208774 205103 199045 201197 199343 196792 198018 211201 187928 170713
18329 170713 164582 135789 127379 124500 116065 100540 84936 91399 104809 94800 81298 64462
18317 64462 68066 72565 54216 33923 46871 54417 42566 44623 45664 43372 31305 20156 26790
18304 26790 44072 34220 26346 16841 19428 23169 24697 19579 33478 31593 10655 12154 12693 15184
18290 15184 31759 25053 31782 49108 76531 82807 72451 43003 35877 48701 72595 89401
18278 89401 96294 91138 80007 84200 89823 77749 47264 32883 33208 51670 69554 73194 56575
18265 56575 40644 26676 33725 40444 52552 68288 66256 73050 76262 74280 69111 72547 78179
18252 78179 71524 50004 57834 66905 51367 47761 38375 43186 54121 61701 55316 35213 25283
18239 25283 50343 53395 37269 24953 9301 6190 17801 30668 20309 22034 32719 45524
18227 45524 73567 89867 101018 92608 74041 65226 50081 51529 43063 27826 16143 35316
18215 35316 32688 17487 1520 13596 15184 11830 3747 11849 4370 -1964 12066 19283 17326
18202 17326 2355 4026 13947 12920 26681 27472 9348 5241 15362 7821 -2336 -16989 -12461
18189 -12461 6540 30394 26760 -784 -17317 -17482 -6846 -4462 -9121 -2168 -3178 -7184 -2382
18176 -2382 -11807 -11808 -14751 -21719 -19878 -17704 -7042 -5800 -3867 -5822 2167 10098 11470 13042 28674
18161 28674 39397 24587 19677 22791 23449 13999 15363 16975 3557 -3140 10440 28795 14566
18148 14566 15748 17903 5747 12362 7624 12912 10100 9478 12355 139 -7720 -6971 1433 -1759
18134 -1759 4977 9335 -1892 -27162 -36487 -13846 -1638 -14102 -30177 -29154 -22148 -20412 5211
18121 5211 11104 14502 20624 18137 15276 1297 -6613 1145 3016 -8171 -32138 -15153 -9966 -5543
18107 -5543 6823 40433 46569 44967 29797 17911 11562 8832 24735 14592 12318 10417 14605
18094 14605 34677 35988 17394 8386 -7980 -19396 -11699 566 12588 19385 17316 17841 30178
18081 30178 28829 20217 30160 20464 14219 26113 16397 2983 8569 7909 3413 14762 46244 46232
18067 46232 61635 61677 54264 63681 74610 83134 108738 133839 163157 186012 199410 215168 204743
18054 204743 218611 201546 169772 162022 145138 139922 121523 119184 133223 163313 170738 182931
18042 182931 210591 231119 252028 253851 244222 247943 236188 227900 218172 194582 164059 133936
18030 133936 119083 118382 103286 84652 86903 82995 73062 75865 63677 48540 39095 53690 51703
18017 51703 45060 57363 62244 62902 75593 101373 96720 91843 95330 92632 100152 106653 125005 141259
18003 141259 171699 204244 221814 233524 209118 196055 185029 168149 152653 166126 177431
17992 177431 196389 223723 215181 213746 220706 211098 197288 185608 182100 163195 134718 129251 120907
17979 120907 97175 89809 98701 83401 71475 78939 83180 71569 73360 51944 23359 24461 36749
17966 36749 40178 35919 43480 64951 67474 73209 72789 51890 29609 25407 25663 36340 25349 22931
17952 22931 15486 5032 9317 4565 -3627 -18349 -21522 -3524 1422 1303 11001 12995 18385 30138
17938 30138 30099 8714 -831 25160 41704 31468 29515 24836 17789 14020 10289 19676 17627 15375
17924 15375 23373 25023 23891 21404 25713 36549 47065 24916 15525 29555 35289 31774 18134
17911 18134 -1085 27544 25770 27051 25095 25763 38655 30788 12016 6569 13748 20085 28368 41459
17897 41459 40420 4492 -7749 -616 -5136 2797 4913 2024 3667 3590 -9618 658 2624 12165
17883 12165 27623 19487 23091 36740 49384 42311 46284 34561 26312 29570 28260 38469 44978
17870 44978 44320 34879 41542 40344 38930 48842 58114 47214 44039 60643 48835 31125 20353
17857 20353 26615 30409 28572 9412 7049 42893 48032 25749 20703 20959 26144 13117 4027 6537
17843 6537 12592 500 -1731 23031 54695 59050 40087 30479 24931 33441 18572 -643 5904
17830 5904 18503 23821 28684 19916 13166 10351 20967 39819 56967 69712 58762 63056 67965
17817 67965 76365 80996 86574 81931 57236 62278 63604 67614 84621 98887 103920 86967 87118 92514
17803 92514 78687 85320 79800 75278 73979 60263 61869 49471 43496 34192 32130 46420 46046 19412
17789 19412 31787 43526 45397 67918 66188 61395 66373 38523 31876 50098 52988 62558 72710
17776 72710 64299 51279 43835 42842 58374 63432 69817 64922 57811 74017 94720 86682 73228
17763 73228 71618 62624 53758 48776 46948 48012 66295 63676 66558 75955 88317 90770 77187 69256
17749 69256 63408 61508 43613 41165 47474 31066 34363 53448 59709 69975 94929 108748 108510
17736 108510 103158 87542 93912 98722 98860 99129 85945 88582 103075 109272 104626 109922 99964 97742
17722 97742 86957 91103 100391 98728 83619 76467 88799 78349 81505 102914 118505 120435 137984
17709 137984 131073 128125 114839 114594 118442 93670 71790 71047 87347 89576 62295 56763 55007
17696 55007 59885 87366 93809 106219 110020 110075 102388 102186 104557 112406 116685 102336 113928 105950
17682 105950 88153 95975 92278 99602 124587 136762 162046 176614 144456 122111 140574 150119
17670 150119 156089 147839 155615 153167 170625 210393 264256 308763 312028 307120 293835 269309 276559
17657 276559 283299 286859 262283 263869 267749 270410 281165 274527 271405 259265 258158 240168 235099
17644 235099 243665 240089 221173 207594 219470 213861 225744 235409 239039 245151 233969 216025 228142
17631 228142 240968 242477 247466 231350 216817 200119 213521 234394 262000 286207 309412 318636
17619 318636 330919 357312 371475 372365 375688 395701 401483 430118 481330 510037 536468 571204
17607 571204 595614 581615 578132 580725 578712 591616 613412 634294 646921 641322 629578 630652
17595 630652 634419 629859 613622 617564 644409 671779 688190 737859 759239 778040 812326 816959
17583 816959 835198 872258 899831 973538 1048321 1110023 1194948 1309668 1448140 1616304 1836883
17572 1836883 2129895 2473834 2902498 3480700 4283864 5302988 6570167 7949420 9043939
17563 9043939 9557068 9448798 9060131 8790188 8881609 9433510 10517698 12244218 14896266
17554 14896266 18969119 25293258 34902676 48082824 62696180 73804529 76999627 71867363
17546 71867363 62826156 54734345 48771303 44006075 39668504 35845946 33147855 31873540
17538 31873540 31828961 32355547 32438141 31188397 28438580 24827132 21260563 18275283 15922590
17529 15922590 14080687 12607694 11407459 10413560 9603473 8927250 8344027 7845207 7441869
17520 7441869 7104052 6854050 6689441 6650988 6742394 6975210 7375408 8029208 9038278 10509905
17510 10509905 12621134 15435325 18639984 21538746 23370610 23931208 23729017 23758233 24798943
17501 24798943 27121761 30559037 34709981 39458080 45416335 53586773 63586665 71951622
17493 71951622 74008153 67781973 55976006 43960646 34706151 28243767 23815257 20756929
17485 20756929 18596639 17073860 16051114 15487010 15281654 15253859 15088335 14469777 13276470
17476 13276470 11701731 10115597 8765345 7633163 6693882 5946777 5301951 4737734 4292080
17467 4292080 3915061 3572567 3257170 2973261 2706318 2474963 2288164 2121672 1956869
17458 1956869 1784865 1627498 1500094 1378359 1278542 1200503 1125980 1043264 963167 898332
17448 898332 852758 801965 752551 707520 654848 619095 597461 579950 562609 530881 497171
17437 497171 453985 416539 396759 372706 342220 308241 302020 291857 290775 306050 304380 302874
17425 302874 305196 299405 286118 283200 259721 239510 221786 225277 240143 255925 268254 279068
17413 279068 265042 233366 224554 229318 216412 196774 183097 173825 172183 171485 169388 153770 162839
17400 162839 176636 203164 194788 186911 182146 183640 175788 147468 96217 72001 73822 89734 93123
17387 93123 90639 93961 84903 87596 88674 71041 61038 48757 42133 29163 21461 44657 58855
17374 58855 56670 68891 95625 104070 105906 110564 130560 132184 121597 118254 98629 103426 85886
17361 85886 85372 90859 97030 100203 107781 101739 107227 99472 102863 99488 99049 88468 69958 53156
17347 53156 50458 51635 55887 55603 60335 53595 62193 71620 55727 48232 20754 9991 2336 -5167
17333 -5167 -13740 -19938 9701 25541 20792 10396 -4400 1555 9108 -11592 -30973 -42160 -48936
17320 -48936 -28076 855 21594 16590 12645 5004 -5411 -3854 -12990 -27203 -50337 -36460 -14357
17307 -14357 6897 27080 24418 7036 9616 2079 -15295 -728 -132 -3053 -9188 -14868 2760
17294 2760 -13248 -25576 -24204 -23465 -41925 -34715 -19436 -14797 -29348 -31323 -18415 -15150 -34431
17281 -34431 -30819 -15044 -16807 -37827 -33620 -23076 -14147 -1641 -2176 -3808 -4317 -3507 -7844 -41663
17267 -41663 -44171 -16717 3578 19045 28303 34609 9855 -9591 -22021 -29538 -26535 -8533 1055
17254 1055 -705 -700 3587 10305 14003 -3375 5799 10401 3196 -2258 3550 -15799 -25026 -32816 -30186
17239 -30186 -17526 -9893 2320 5957 4525 -659 5770 8520 -1248 -17846 -20671 -24520 -42109
17226 -42109 -37593 -25903 -25866 -36808 -45864 -24177 -12889 3110 11379 6999 82 1584 -2322 -15532
17212 -15532 -18369 3501 16585 11197 23701 15745 -7271 -15696 -18644 -21464 -17643 -13315 -13119 -36748
17198 -36748 -30367 -10600 -17160 -34440 -35425 -38564 -45548 -44114 -25772 -8293 -27699 -40784 -56384
17185 -56384 -44111 -44887 -32805 -43455 -53419 -50904 -45641 -33351 -13910 19897 29268 27785 52139
17172 52139 56190 59164 53005 41273 26309 25121 22930 8904 10581 2966 -12019 -16095 -20163
17159 -20163 -1482 14887 24472 15694 2188 -800 -29472 -37689 -30651 -15407 -11401 -13516 -16216
17146 -16216 -8619 229 15358 17609 4219 -5761 -5413 -31758 -32944 -8421 -5509 -17898 -3082
17133 -3082 6513 -2804 10985 9399 17105 15735 14788 8194 24702 24089 24873 42652 57758 71131
17119 71131 82972 78068 63748 68484 79279 81576 73947 56853 30507 19653 21859 9531 3403
17106 3403 19805 13143 4282 -12339 -24929 -9642 -11307 -12587 -263 6373 -5103 408 12086
17093 12086 4385 3904 -7917 -4995 13058 2417 -24854 -27720 -10259 -7177 -5959 2278 4995
17080 4995 5557 5698 -3298 3884 2309 -17656 -34469 -21347 -3951 -329 2460 -100 24951 20841
17066 20841 20469 27694 21717 28191 33843 20708 31638 40768 45818 51024 82397 125968 154320
17053 154320 172765 173891 180023 200681 207683 194916 187325 183932 155699 125613 134427 125938 115456
17040 115456 128561 143417 173567 205466 221973 209024 206057 196875 177769 157984 128643 123890
17028 123890 116104 89992 79862 89290 88102 61798 45243 57096 68683 85004 81230 61833
17016 61833 39819 32533 27734 30494 45206 53371 48673 55293 90678 107490 107190 110705 137816
17003 137816 157371 170956 204718 224828 232797 243857 238189 215755 193338 174761 153112 127667
16991 127667 118631 115021 101835 98457 97588 112804 123879 146010 160782 184167 227540 241747
16979 241747 228128 221044 204856 154318 102381 78397 72449 64362 41396 38173 43018 42469 30921
16966 30921 45488 38752 18200 10238 -5730 -9263 -989 7401 7923 3011 -17487 -31699 -36492
16953 -36492 -24521 -15793 -5386 -21225 -32801 -39231 -29939 -27777 -17146 -11623 -28446 -59194 -34796
16940 -34796 1388 4611 11281 22674 5429 -13922 -24670 -40551 -34603 -37328 -26892 -23514 -35703
16927 -35703 -13964 15032 -4416 -22109 -12460 -10904 -19078 -18892 -23917 -24709 -31860 -33365 -32600 -32792
16913 -32792 -33815 -25310 3669 6365 -6420 -19045 -24622 -24933 -23915 -14084 -16254 -24312 -5487 -6360
16899 -6360 -7156 4233 34163 43305 34955 47819 41959 26316 14939 12104 118 -3661 4255
16886 4255 5844 -2174 -2215 20203 15156 9410 -3091 -11435 -23457 -27780 -16515 -22541 -38692 -32677
16872 -32677 -19795 -22523 -20002 -6335 15503 -18209 -32384 -33584 -39892 -25044 4826 4071 10705
16859 10705 3175 -3760 -3875 8047 4768 -8350 2053 1219 -9126 -8914 5739 -3546 -25353 -37410
16845 -37410 -20781 -12837 -18705 -12193 -21571 -22230 -1762 -3037 1927 1475 -12481 -5567 7831 -9140
16831 -9140 3967 1819 -11558 -13464 -25955 -48846 -50540 -42308 -28486 -17428 -18680 -18566 -6253
16818 -6253 5175 -17994 -24672 -17829 -7819 4663 6324 14144 10698 -12900 -33735 -25887 -19116
16805 -19116 -23864 -19682 -22002 -31963 -34506 -14721 1090 3347 -1425 -5695 -7528 8760 16669 6505
16791 6505 1766 1825 -11259 -21556 -14681 -2795 -1358 16798 12340 3987 -6556 -26900 -51175
16778 -51175 -41062 -42051 -36442 -52096 -54580 -52891 -55684 -51035 -58871 -52564 -37772 -17396 -10845 -19166
16764 -19166 -25042 -26182 -1667 -4066 -25997 -28360 -24468 -29525 -37797 -37088 -17385 -16732 -27244 -35688
16750 -35688 -27046 -29662 -20609 -1775 -4134 -26297 -21459 -22660 -12169 -14673 -36979 -35422 -22204
16737 -22204 -30273 -28295 -26155 -15900 -6920 -2770 -15933 -30530 -22757 -23604 -13590 -4762 -1241 -2002
16723 -2002 -10539 -25276 -26281 -27817 -19103 -14491 -18190 -17741 3207 3346 -9074 -6274 -7772 -18339
16709 -18339 -35602 -36625 -40066 -36860 -59452 -59425 -37173 -25363 -39097 -48062 -36873 -22074 -40903
16696 -40903 -60637 -61728 -43120 -30454 -20176 -23185 -34252 -34710 -22988 -15647 -23581 -27403 -44726
16683 -44726 -41444 -22276 6841 9504 6321 3910 9958 10209 -2905 -6589 7061 22677 29361
16670 29361 23488 14414 13177 37118 36965 7766 -13086 -14383 -30491 -26391 -15090 -16085 12334
16657 12334 10719 1571 10602 578 -1891 -10765 -33820 -43347 -52140 -47094 -34163 -26424 -29471 -19969
16643 -19969 -32078 -33475 -20756 -5275 4586 4159 -8355 -10274 6599 11684 4714 -3242 -24097
16630 -24097 -24513 -17869 -12264 -25742 -41975 -37318 -30479 -32407 -25443 -24817 -7541 -12187 -20166 -22285
16616 -22285 -18920 -17577 -8838 4354 4309 -842 -24680 -26676 -3738 -8224 -14337 -23091 -9772 -18306
16602 -18306 -24591 -7690 3071 -13427 -24551 -22545 -19691 -11248 1023 4720 4756 -23969 -28648
16589 -28648 -15307 -17384 -13352 4926 9702 9072 7301 -312 923 4781 7437 11219 10996 5083
16575 5083 2264 -11297 -26529 -25516 -24539 -25389 -31978 -30243 -21193 -29697 -39884 -41096 -42482 -52302
16561 -52302 -61218 -57723 -61332 -50470 -54579 -41609 -80 870 -14289 -3692 -4128 -5188 -10870 -13643
16547 -13643 -12865 -9673 -6453 -15306 -34049 -31509 -25834 -13926 -14077 -13607 491 7078 3169 -7442
16533 -7442 -22647 -26916 -16503 -6136 -15764 -6210 10179 4394 1326 -7104 -5893 2884 -4854 -32317
16519 -32317 -28139 -3863 22038 21623 26528 18395 4184 -3742 -12428 -3833 -12940 -7722 -30697 -35599
16505 -35599 -30791 -30251 -12452 -6719 -5538 -10021 -3923 -21050 -19670 -8314 2 -6813 15046 14314
16491 14314 10661 -1122 14456 13766 13094 23142 15733 14109 37698 24423 21197 7432 -1128
16478 -1128 -3369 -4570 11265 12711 -3494 1288 -291 -8456 -20098 -34762 -46488 -53669 -35869
16465 -35869 -44127 -38813 -30860 -28571 -29663 -30234 -36800 -30850 -28868 -31805 -35017 -39503 -30268 -31936 -40216
16450 -40216 -20030 -13225 -1869 1523 3265 16061 15975 26833 27078 19700 7378 -7241 -24170
16437 -24170 -31183 -39680 -49365 -62503 -55398 -37308 -45463 -44956 -34056 -26879 -25176 -18198 -11400 -14626
16423 -14626 9855 9924 -20018 -41652 -49427 -34135 -35388 -28460 -18024 -9284 -12387 -21599 -13368 7832
16409 7832 9016 -11043 -25541 -34121 -13812 -18368 -19067 -9846 -9386 -6945 -10130 1823 19754 26680
16395 26680 26883 6702 -6393 -10787 -20644 -22566 -22595 -5666 -6975 605 -13810 -12125 -27504 -9396
16381 -9396 -9890 -18955 -13422 -23413 -36557 -32927 -22101 -22961 -13199 -8668 1749 -8686 -13507 12810
16367 12810 18661 571 -7198 -19303 -48500 -48121 -29580 -13600 -849 4921 6156 -1641 -6974
16354 -6974 -23709 -12176 -8523 -6924 -12115 -26125 -44328 -51291 -50825 -40904 -32342 -13919 -7189 -7763
16340 -7763 4814 325 -22395 -22567 -7499 -1192 -32267 -48749 -34727 -18329 -17641 -30180 -36415
16327 -36415 -30886 -23907 -17864 -7780 1623 8264 -7254 -2181 9074 -3236 -13827 -6517 15767
16314 15767 29035 29607 29831 38119 30457 -11437 -37384 -37159 -17472 -8731 1508 -3402 -4340 -3184
16300 -3184 -9186 -239 11047 -1531 -2825 6406 12379 19234 17050 27584 19289 21018 12778 899
16286 899 -13465 -15284 -5912 3044 -7790 -16035 -5361 -2914 -19764 -23198 -23755 -25646 -39567 -54177
16272 -54177 -56200 -41767 -30176 -29999 -26012 -22885 -18685 -8860 6131 4543 -19252 -20905 -37856
16259 -37856 -20108 -3320 -26132 -34967 -39774 -15179 -5379 -7088 -19431 -28931 -24690 -17347 -18049
16246 -18049 -25521 -31578 -29158 -30159 -36705 -26379 -35276 -62250 -62660 -32537 -19382 -16067 -11543 -15517
16232 -15517 -24968 -19936 -12549 5837 763 -3539 -1105 17391 20481 19552 15803 -6735 -13057 -3845
16218 -3845 -5258 -2877 11336 14785 -7223 -10232 -10334 -27849 -28628 -6968 6847 26510 39645
16205 39645 28651 -869 -15455 -21358 -7905 -2204 -1577 1327 -17813 -31570 -21397 42 1285
16192 1285 4296 5289 5952 4758 579 8811 5021 12214 14959 326 -6566 -18588 -10395 -8449 -19388
16177 -19388 -37976 -19344 -6863 -8665 -5266 -15282 -14610 -19648 -15069 -9448 -13738 -17069 -7707 -1913
16163 -1913 -5687 -3713 3672 -3744 -18311 -24071 -32301 -15559 -21009 -33241 -18807 -2253 9804
16150 9804 20456 24640 7221 -3457 -1552 -3891 -21065 -13082 14275 18530 5720 1579 -5488
16137 -5488 -36394 -37543 -26287 -24937 -25482 3204 12232 -9262 -18023 884 2211 14366 24675
16124 24675 26822 32740 19587 4343 16673 21512 30239 29890 36832 24564 -3303 -4363 2705
16111 2705 11463 -3 17363 30197 32184 25516 19232 11664 14228 9840 -184 -1113 7974 -6234
16097 -6234 -2721 7067 1442 -12069 -11033 -7292 -13831 -1275 1764 3854 -3144 -4707 10911 15249
16083 15249 6099 -5621 -8974 6251 5767 -5797 -7630 -11493 -9728 -21568 -38529 -35562 -32386
16070 -32386 -21921 -3770 14418 15241 -6844 11818 16388 15745 13549 -559 -9786 4746 9687
16057 9687 8138 24268 2698 -21349 -12598 -15488 -15733 -5473 -39456 -35971 -23294 -4922 3861
16044 3861 6177 -895 1890 -20103 -32915 -26291 -237 18438 -11671 -12818 7515 6264 16025
16031 16025 14958 6211 14918 13439 12550 12657 -6339 -9858 -16073 -28074 -33877 -32957 -28769 -15597
16017 -15597 2701 9678 13320 27871 8049 -25134 -23421 -17738 -2171 24466 20883 5693 2973
16004 2973 6942 -8993 3045 -17243 -40981 -21716 -9084 -7357 -2521 -14807 -5890 -9424 -5542
15991 -5542 -7042 -13343 -14244 7580 4443 -213 9689 5904 17228 33844 31185 16460 -941 -6541
15977 -6541 -5561 -13155 -26401 -40069 -29208 -14278 -3958 -3239 -8468 -5666 -9501 -9981 -7064 -17201
15963 -17201 -13132 -27227 -23337 -3853 2795 -232 -11755 -26893 -21710 -4495 21622 32264 30791
15950 30791 20759 13655 13749 13168 11097 7578 8006 3522 1446 -3150 -4513 -16248 -47684 -42100 -31169
15935 -31169 -25919 -10050 4200 8811 25346 21103 11048 10347 10159 -6245 -13993 -2598 6693
15922 6693 20660 12534 9699 4740 624 8918 -17271 -40417 -43888 -43345 -44961 -45986 -47017 -34674
15908 -34674 -23201 -31358 -26289 -11074 -9125 -16514 -9740 -13886 -27849 -14208 -13067 -13864 -11695 -13608
15894 -13608 -12659 -6948 4520 1342 -12894 -19039 -17038 -26275 -28159 -26985 -32752 -29840 -39005 -31579
15880 -31579 -17215 8272 -374 -8180 -18731 -10529 -22542 -29095 -29523 -14372 -3232 -4453 2296
15867 2296 -13310 -18022 -13736 -28605 -46555 -57360 -45540 -26815 -19656 -7424 -7336 -675 -8399
15854 -8399 -15702 -11879 -10023 -3368 -7710 -10927 -16951 -9491 -8804 -28561 -32284 -39521 -44262 -37656 -27419
15839 -27419 -21246 -37385 -37432 -27864 -23480 -11997 -10934 -1515 -14342 -23098 -27831 -24107 -24454 -27744
15825 -27744 -30927 -13789 995 5494 -17177 -14127 -173 14639 8418 22342 25881 -6337 -33892
15812 -33892 -42993 -47545 -35911 -5386 -495 -1261 -138 -12871 -2318 -8652 -17726 -27915 -27212 -17523
15798 -17523 -26834 -34304 -28382 -13747 -7691 -7129 -19673 -14673 -16604 -31451 -21639 -6894 8868
15785 8868 8781 5602 -6566 1103 4057 -10591 -22502 -30261 -33099 -32809 -17090 250 13203 5824
15771 5824 13173 8054 -3011 -4173 -13195 -17353 -1978 -11974 -9266 1840 -898 -7129 -11918 -4930
15757 -4930 -4244 -14128 -10288 -12620 -45030 -61436 -55327 -27517 -9012 -3929 12981 26617 18753
15744 18753 -5038 -17397 -14786 7938 52374 114277 155066 162241 143800 95949 65163 56930
15732 56930 25242 -7616 -16289 -19806 -10318 -4942 -11449 -3508 -346 -4861 -16456 -35415 -22521
15719 -22521 -2578 -45 800 -6235 -1371 -5963 -20012 -11337 -14790 -26960 -43063 -26705 -9114
15706 -9114 -9820 -1546 14276 12170 19175 21065 4503 -9368 -10052 -2434 -3080 -13136 -6466 5059
15692 5059 9969 3459 -8103 -9894 6450 251 -21732 -34380 -29432 -5870 -4892 -12372 -21147 -27758
15678 -27758 -4718 17831 -1644 -2455 645 5418 19809 22660 13832 1195 -2869 -537 -22421
15665 -22421 -23099 -3078 11979 6023 10131 7754 11731 8139 -8129 -2627 -15513 -23413 -25239 -24431
15651 -24431 -24697 -35380 -28168 -7524 -15543 -14754 3297 10846 7688 -330 -5930 -6050 -23507 -28344
15637 -28344 -18524 -18446 -22624 -27013 -28369 -10992 10053 29393 28790 22132 12485 14171 17397 16049
15623 16049 35036 46040 26328 -3872 -19678 -8671 2155 -3668 -7762 10553 11470 -1209
15611 -1209 -16386 -6751 18022 11514 -12221 -21348 -20005 -15105 -29791 -16592 -687 -31921 -41929
15598 -41929 -34376 -22797 -23658 -27427 -30444 -16130 -4209 -6505 -13225 -10240 -25822 -36091 -17870
15585 -17870 7206 6690 3940 -6512 -13983 -5479 -8180 -20834 -567 -16576 -19589 -4194 13307
15572 13307 17243 22461 21767 26220 37932 24414 14991 -6227 -20255 -6885 3338 662 -6224
15559 -6224 -14626 -9943 -7841 -27106 -15514 -14514 -17765 -22587 -21844 -14383 2245 6897 15125 23040
15545 23040 18934 12538 -2658 -9996 7923 -9594 -15629 -11927 -16549 -9445 -430 7956 12556 1671
15531 1671 13593 32365 16937 23098 18432 6990 -2347 5297 -14555 -34626 -41469 -24152 -2301
15518 -2301 -5528 -14848 -20257 -32979 -18096 -14804 -9150 15404 17122 10449 13457 5994 3978 2356
15504 2356 -5270 13717 5597 174 -311 -17577 -15963 -13848 -6563 -8099 -23219 -23160 -6566 -1247
15490 -1247 -17849 -26864 2561 11668 -5989 -12975 -13602 -27487 -21790 -153 31595 37479 38523
15477 38523 34916 26583 26992 25424 15101 11713 -9149 -6730 8062 7234 -2561 -9629 1029 -4972
15463 -4972 -2577 8824 14690 -1518 -13897 -1626 1488 9592 15592 -5909 -5874 11225 -6232
15450 -6232 -13251 -26486 -13623 -5168 -21153 -18832 11129 22731 1151 -9565 -2805 -5918 -12650
15437 -12650 2811 12109 4550 -1630 -27594 -34129 -31721 -21719 -37722 -24734 -18740 -14159 11322
15424 11322 25288 29161 25608 10671 5642 6756 -18335 -18480 -14212 -8814 -17995 -17921 -9472 2675
15410 2675 -6909 -30836 -13974 -16796 -28667 -30420 -25715 -9966 -26149 -14730 -5504 4571 18263
15397 18263 13414 17702 10496 -3564 -16211 -13194 26075 16954 -6634 -5602 3328 8906 4791
15384 4791 -3234 16572 11040 758 16231 22275 14110 -16168 -16075 -6357 -6637 5228 10183 -2100
15370 -2100 -22390 -17142 4589 23044 23669 16467 14457 6496 4726 -1147 19358 20407 20442 758
15356 758 -17778 -34170 -37269 -28845 -26166 -12930 -7839 4721 -8327 -2299 10915 6103 -4195
15343 -4195 -13985 -27904 -28044 -12956 20313 20286 -2521 -20499 -19113 -8907 -18316 -41849 -36615 -70
15329 -70 13575 6348 20205 9070 12314 18917 -8100 -29701 -23230 -1517 6993 -1778 -20703
15316 -20703 -5039 -850 1129 -11642 -3781 8660 15734 1937 2297 13297 16137 -4256 -6391
15303 -6391 -10673 -20336 -21697 -8112 2704 -152 -9265 -2960 -3862 2001 12897 6101 756 -4990
15289 -4990 -8679 -1866 -1309 -12846 -18150 -17254 -7026 -5551 -4281 -13275 -1321 -12079 -15095 -27921
15275 -27921 -9072 10606 10411 24764 23286 1582 -1292 -3982 -15397 -18373 -17957 -6257 -5796 -12701
15261 -12701 -6468 4906 2923 -21262 -19423 -1231 -4955 -27124 -10562 -2197 -6010 -7736 49
15248 49 17205 11337 10771 17861 9047 -7706 -13450 -15956 -25215 -18779 -12502 -13618 -8936 -3033 -1848
15233 -1848 -6856 -15745 -20477 -27177 -31519 -966 11350 11033 28051 19364 9651 17379 20770 11144
15219 11144 6508 17722 9280 10122 17281 6771 5937 14842 23483 17705 26961 22051 4812 -1522
15205 -1522 -9196 -36478 -49132 -53465 -35308 -31465 -16418 6983 14200 9638 -1164 -5118 -11328
15192 -11328 11174 14527 22011 18390 -827 -5116 -13170 -17801 -9844 978 12010 1679 -3669
15179 -3669 -13448 -22606 -10305 -4913 -11910 -5454 916 -4889 7808 14711 -15146 -30407 -22582 -44111
15165 -44111 -40691 -5869 -6123 -24849 -20489 -1131 -812 7108 -10942 -19510 -994 5480 -6708
15152 -6708 -2245 -1842 12450 -2840 -9914 -9677 -3203 11266 19737 3007 -6615 -20098 -31528 -18017
15138 -18017 18739 29398 9339 13123 -9632 -7763 12486 32017 46384 32046 6563 -12187
15126 -12187 274 2021 8484 26596 31055 24348 9917 470 10098 14413 17605 10821 -1079
15113 -1079 4422 17385 11627 5833 -4813 -3340 -28547 -53391 -67562 -51307 -42605 -26523 -20234
15100 -20234 -23200 -15885 -5497 -11254 -7087 7604 4648 -7658 4158 211 -28888 -24060 -31501
15087 -31501 -29556 -12697 22946 24629 8529 -16675 -17558 8162 21926 19124 22204 -1804 -9044
15074 -9044 9297 12166 -7433 -787 18612 8563 -2808 2706 12212 14340 2677 -8396 -6155
15061 -6155 -12226 -4820 4514 3611 16307 21283 13283 5859 49 -8213 -13537 4588 24627 17941
15047 17941 -7340 -12612 1457 -11052 -27230 -24194 -19361 -3084 20768 16812 20320 3718 11467
15034 11467 19730 -158 -18389 -25878 -10858 -12413 -28215 -34890 -11221 -10842 -13518 -19236 -16822
15021 -16822 -28982 -21110 -12854 -9056 1297 -14525 -37038 -32556 -26650 -24871 -9666 -11160 -21555
15008 -21555 -11770 -14810 -30290 -25406 -10742 -19854 -17487 -19818 -32913 -28791 -44698 -29130 -8888
14995 -8888 -6672 -3362 -4958 -7314 -12242 -17093 -22516 -6656 7114 -395 -822 -18343 -23895 -18271
14981 -18271 -12537 -2645 942 -8983 -3912 7324 14831 20013 2872 -19454 -11781 -27547 -29671
14968 -29671 -27081 -5027 4446 9520 -7983 -18787 -16785 -8067 1896 7102 13972 4749 921 -4971
14954 -4971 -9823 10524 25498 19235 4671 -22950 -40438 -39507 -43173 -38594 -26577 -7648 -2185
14941 -2185 -10487 -7464 -3597 -10465 -23399 -30753 -27995 -5949 -1635 4426 -5053 -26640 -20471 -17040
14927 -17040 -10753 -6373 3598 17955 6262 5185 6547 9754 6281 9880 17614 10302 -1856 -7905
14913 -7905 -11267 -8521 3673 -11726 -19510 -34701 -36369 -34183 -19261 -13210 -2438 9914 17780
14900 17780 14131 7249 -14927 -14655 -12370 -14827 -14728 -17164 6392 -7441 -10723 9447 13618 13814
14886 13814 -6572 -11315 -13987 -16363 -13346 -24560 -38021 -31430 -36324 -29198 -15537 -29605 -38562
14873 -38562 -35283 -19078 -19871 -24125 -17074 -28299 -31420 -17283 -12959 3582 11751 17195 10914 32222
14859 32222 38816 10160 -7082 -5413 -13030 -10645 -3995 -22338 -18510 -4084 4936 1673 -14701
14846 -14701 -28872 -33378 -33379 -27954 -3119 14133 3471 -7112 -19625 -14573 902 5205 -1405
14833 -1405 -14030 -19812 -4468 -10546 -15906 2272 21294 9722 -956 -7493 2471 20165 11847
14820 11847 -11830 10832 16389 10795 17189 15904 11492 5323 2734 852 -1152 9702 30503
14807 30503 14045 4308 22208 45969 48012 32929 22287 21570 3515 10849 12278 5856 -937
14794 -937 7029 23624 16047 12651 18168 6907 2215 17759 16218 1971 -3878 7643 30253
14781 30253 50788 34154 19998 2679 -2486 -5764 -1475 1683 -5966 -4603 3441 15803 16338
14768 16338 28851 54543 53006 21388 20775 3734 -8556 1442 16401 6971 -13047 -17338 -24707
14755 -24707 -26760 -15705 -9111 -8899 -15910 -10537 -11955 -12075 -1312 10382 7858 -6626 -1839 6151
14741 6151 6340 -6581 13578 18812 12497 17552 22268 15954 17868 12561 1631 2978 24082 27730
14727 27730 35947 32553 15591 32789 30584 2229 -7284 -3748 7482 16620 1948 -25156 -19736
14714 -19736 270 2524 -6791 -15831 -13386 3585 -1555 -4043 3513 7742 7848 5043 3371 -2857
14700 -2857 -1521 5697 -7010 -6685 -1548 2387 3063 -13901 -8294 -15217 -24285 -26488 -13078 -9353
14686 -9353 -11992 -15149 2104 -2756 -9563 -12227 -14496 -16271 -15862 -11341 4383 14589 19441 32888
14672 32888 32810 16474 -1133 -3783 -12721 -1297 1567 -5791 16489 46806 38711 34308 5564
14659 5564 -16719 -5338 1892 -1497 3152 -6674 -3567 -8332 -15342 1295 16804 22141 27709 13371
14645 13371 -6885 -9332 -19782 -23024 1105 17801 28653 41900 45456 38156 30978 34259 35525
14632 35525 45664 45744 11351 -3660 -7878 -12484 6308 26925 8125 14945 14708 5742 -9838
14619 -9838 -13325 -24588 -26856 -24349 -13307 -10708 -15073 -13342 -9421 -8536 -14518 -8531 6517 10357
14605 10357 8728 -12093 -5097 -3897 -12775 -12969 7101 1245 -7833 3991 -11777 -17667 -7980 -4700
14591 -4700 -4494 -10134 1201 18875 30210 32735 22064 4039 -13887 -10790 -8670 -3671 -3034 -17321
14577 -17321 -24404 -24841 -23490 5598 22553 13140 -10306 -23272 -17211 -15516 -1562 793 13185
14564 13185 13166 1065 14251 15945 7443 11573 8981 17619 6803 -1615 -2357 -24974 -34494 -27499
14550 -27499 -14899 -4485 10066 8898 11549 14775 27850 44838 48261 56525 40915 26279 36846
14537 36846 35328 18423 12351 8368 253 4826 -10385 -11726 10455 26411 18972 25291 18849
14524 18849 18553 26674 22920 29287 18592 973 -499 -11406 -26892 -10853 4042 2363 -2565
14511 -2565 -3279 4430 6445 97 2338 12433 28960 35393 17224 14146 16733 -3953 -12247 -5065
14497 -5065 -872 -13605 -21479 -13385 4797 4126 -121 -8931 -18902 -15613 -14633 -16728 -20087 -21162 -12968
14482 -12968 -411 -870 -3438 12056 -1257 -9626 13109 15198 -2572 -24644 -14638 -19984 -23193
14469 -23193 -34805 -29729 -17639 103 12815 -10163 -10963 -2317 18534 11830 -7002 -12527 -19763
14456 -19763 -4589 -152 1768 13356 22057 21576 20851 16602 4167 -918 1238 1183 2079 -12143 -19297
14441 -19297 -27617 -30189 -41285 -50426 -54058 -51035 -36675 -30719 -12948 -12280 -9778 -24656 -7044
14428 -7044 36285 40846 16566 -18230 -23234 -23072 -19419 -35336 -31498 -14129 5181 -7234 -4527
14415 -4527 1142 -3658 -477 6393 11237 24043 24216 6013 -12201 -8843 -10938 3382 7423 70
14401 70 -1454 346 17240 13768 15273 -1577 3444 9096 -5902 -3725 -2094 16509 23896 11294
14387 11294 6863 10437 6508 7051 20184 20001 -722 -17675 -20443 4042 6140 -3368 6074 9464
14373 9464 -3764 4904 1209 -4649 9258 25563 17028 31981 20012 -5365 -14630 -8290 -6669
14360 -6669 4400 -8746 -6710 -10232 13265 32567 18542 -15222 -19153 -14547 -18617 -14684 -15087
14347 -15087 -12991 -16522 -17274 -11646 -10084 2446 13941 5636 -42 -6239 -8613 -9894 -3821 -4663
14333 -4663 4438 1719 -5364 6800 17478 26056 37755 15757 4709 -3992 -15167 -2152 7552
14320 7552 11709 12445 17036 15641 18760 39094 31694 16179 25955 18787 981 -11836 -5275 -880
14306 -880 -3503 -10283 -1496 20259 10360 -6927 -6223 -1789 3385 -5767 -9618 -2360 14033 3833
14292 3833 -17969 -15438 -7344 -61 475 -8902 1294 -8213 496 -509 3597 3547 10449 11949 5053
14277 5053 3360 -9074 -9439 5496 23925 34723 48770 51752 48581 46856 31214 16178 26032
14264 26032 19534 27632 13513 -449 1506 9514 11791 11004 2107 2982 -4975 5185 8794 3404
14250 3404 18524 31489 22877 16946 31315 38914 28039 27286 27910 31777 26434 1091 -874 5479
14236 5479 10759 -799 -6273 10598 23023 22152 6063 -15390 -20984 -13101 2895 5618 -9442
14223 -9442 3836 -5419 -14736 2939 14438 14743 13447 8738 17326 19931 21087 41391 31801 31773
14209 31773 18195 13846 21018 5074 1661 14561 24201 17667 22615 18087 18959 26507 28797 13266
14195 13266 8671 17254 9741 7307 -9562 7966 -6315 -20636 2716 324 2919 3211 3039 -5607
14181 -5607 3600 7291 15131 28471 20632 7049 2146 -1404 7892 7498 5355 15891 13419 2701
14167 2701 2343 -21881 -24143 -14709 -4708 9645 2784 18820 28618 37365 44814 26994 6888
14154 6888 -700 6749 9409 11806 33832 33387 13091 7073 -1843 10870 18963 18278 20218 20189 35929
14139 35929 31443 27793 14948 3614 -6282 -22876 -3105 8189 4622 10439 7732 7627 18203
14126 18203 17858 22988 13951 12236 27385 19706 35514 43987 34112 14168 6215 25644 21604 19847
14112 19847 14256 9138 17859 8292 20044 18714 9572 -6616 -17661 -30901 -23225 -9380 -19788
14099 -19788 -21158 -21743 -26268 -28607 -22466 -3796 -1980 -15563 -5730 158 -1759 3462 -7466 -20376
14085 -20376 -20400 -9434 -12161 -10883 -3629 1255 -1390 -12338 3115 32549 48978 59236 63531
14072 63531 46062 31057 21212 26704 59780 63171 37752 24712 32878 16188 4134 332 849
14059 849 7163 8751 9372 7727 -14631 -20189 -25095 -7201 -470 -6967 1942 3458 -17767 -28266
14045 -28266 -28292 -30444 -25849 -17684 -10866 -2211 7158 4932 -3542 5519 8550 3878 17324 22465 14616
14030 14616 3508 13892 6126 2620 17792 24004 37024 46528 22067 9833 18728 19759 35574
14017 35574 33679 21712 18038 12439 10459 7123 -1760 -6454 -12514 -27276 -25556 -24826 -14691 -18359
14003 -18359 -9473 -3339 10337 -4075 -6337 12185 11739 10239 1585 12425 3808 5456 23646
13990 23646 30969 874 -21785 8338 30620 27231 26037 20966 19854 8549 -10076 -24982 -40084
13977 -40084 -26659 11277 7606 -376 -5496 -4406 20888 31336 17892 23379 50142 63377 73579
13964 73579 70331 54200 62124 69240 54255 18192 -9705 1469 3691 14065 20608 13247 10960
13951 10960 18808 17689 14184 17733 -7542 -12634 2724 8417 14477 19262 13666 18008 24651 26160
13937 26160 16459 19287 25836 25367 27880 13224 8145 16720 26156 37416 46506 55237 40809 46595
13923 46595 53261 48394 27092 9884 961 -17320 -21523 -20185 -18729 -11735 -9371 4271 13004
13910 13004 10425 10316 8398 16858 6289 -1726 -6813 -8080 -9028 -11012 5083 10422 2889 -6571
13896 -6571 -1192 -8438 6153 10258 32869 29990 26939 27881 26698 19978 10125 729 14700 10053
13882 10053 371 -4277 1635 19912 28219 29307 23186 18372 10227 15161 17290 20748 31369 44897
13868 44897 39139 24649 35643 27000 19763 11257 2563 2496 8613 16774 15622 13913 22139 14985
13854 14985 21480 17786 11925 10898 14542 1339 -2972 4992 5746 3760 7358 24688 24449 -649
13840 -649 7532 7208 -2600 346 -3217 -469 10921 3211 -4869 734 -13160 -20755 -9532 1986
13826 1986 20191 11194 -4624 -18778 -27571 6541 24170 27242 23717 28773 27511 20507 -746
13813 -746 3830 29143 28675 35016 15117 3280 7723 14771 11384 9983 106 -2264 -15073 12332
13799 12332 34869 40131 36367 33915 22491 16395 19528 32996 22156 -13041 -11730 9205 16522
13786 16522 14034 18751 25379 22795 11073 3942 5103 13404 15586 23628 37377 33339 6422 12539
13772 12539 18768 19516 16746 9250 18609 14857 1052 6172 8814 6352 14754 30106 30031 15631
13758 15631 7587 1851 9466 18134 20593 25512 37817 35083 18637 12889 9879 2039 -4295 -214
13744 -214 -3160 10318 15282 19389 23722 30886 49263 53223 32704 14394 10732 16353 30394 23767
13730 23767 33098 27717 17146 14978 24731 32721 10004 7517 27098 31258 29649 24819 21042 -4010
13716 -4010 -8288 -5605 -3487 1913 25785 34931 29836 25360 -2023 -21027 -17721 -2802 24411
13703 24411 30765 30115 2891 16038 22285 -2774 -532 5572 13950 30687 41744 25956 18686
13690 18686 17554 3880 -3368 2663 12143 18974 28274 32007 24554 14039 9311 1635 5465 22422
13676 22422 46300 47601 29562 6134 10161 15993 4131 5697 3168 -6424 -6259 12699 16961
13663 16961 16733 18918 31057 56493 55775 41791 29679 26474 45596 42633 44158 36548 19287
13650 19287 30915 40862 36177 17324 15520 31385 22568 19397 37854 30157 34533 33884 33955 25294
13636 25294 22675 22697 17490 -489 -12525 -15396 1499 10228 16131 16855 2197 -14658 -38263 -24514
13622 -24514 2137 21346 16445 16223 34743 47502 30783 21292 2156 -14166 -1233 15830
13610 15830 27125 22687 24165 34026 34649 21184 7321 15795 18110 25920 6816 -586 8805 26840
13596 26840 25590 31002 36708 27061 34406 40550 33937 29379 45496 51167 41610 23973 25486 55618
13582 55618 61269 60559 53042 62796 61350 43956 43423 32483 20419 13492 18385 22542 38714 43349
13568 43349 45578 35264 29448 22008 13495 19846 32388 44496 55714 58904 63290 71597 59681
13555 59681 57609 60149 58649 79619 105779 123594 126270 102815 86024 70718 65811 63496 44891
13542 44891 28087 32833 41012 33489 19921 28846 34755 44286 37971 42184 39654 55105 54587 50667
13528 50667 44209 34479 47224 47047 13790 73 -2040 20737 55422 55956 65318 59368 44545
13515 44545 35445 38204 29582 35576 47445 48082 31474 5348 11988 31251 24540 29133 33470 36523
13501 36523 25870 20086 20892 24962 40249 35314 25523 16095 13087 12070 16675 15222 14527 21140
13487 21140 40586 56541 50786 43506 38053 30867 28074 27503 13469 17883 19433 15920 21907 36349
13473 36349 39845 41812 50595 55969 60902 49831 21177 10508 1843 14880 30320 36518 31324
13460 31324 32610 18962 32224 48957 43821 17479 18531 30289 52847 49511 49318 45501 35123
13447 35123 25224 31183 34602 33806 29140 30589 13853 19025 32924 34959 47396 43386 23809 13128
13433 13128 18358 16842 19195 27690 35842 40652 30218 15035 -6266 -14833 3459 11164 5326
13420 5326 8936 20506 21712 14191 -3651 -3563 13109 19322 11807 17688 122 15182 16788 24729
13406 24729 17944 7831 5943 -836 -3619 6036 4467 23229 25189 25214 16442 34837 43300 44521
13392 44521 21987 -12493 -1102 5119 1802 21990 26073 24024 19403 2831 -1785 9712 -304
13379 -304 -5236 3653 23895 28350 27577 38813 31064 32248 31539 33414 39899 27887 18050 12373 10047
13364 10047 36118 42709 27671 27264 24956 21249 13088 2177 18850 36607 44699 41455 31818
13351 31818 42984 36355 34200 24797 16153 21678 13456 7041 8808 27616 21154 17658 8931 20062
13337 20062 31792 48924 66272 68612 55227 63407 43626 47266 35298 36466 36285 42620 35757
13324 35757 43213 60157 82840 79203 67121 44225 35709 31834 24089 26928 29812 27422 25814
13311 25814 31484 38747 30550 19374 16976 27848 51895 62442 64284 38857 23340 25796 22707
13298 22707 18699 29570 37351 45032 44957 37446 23234 22089 27622 34378 35282 49752 49034 40894 35424
13283 35424 49580 46932 35274 32112 27718 21798 20809 26549 20495 10415 38642 45087 60889
13270 60889 51804 48541 42653 32690 30789 31413 12277 15983 13712 12642 19473 36587 29685 26740
13256 26740 19307 17871 21962 33768 47186 50498 26714 18770 26254 20227 28893 45380 36800
13243 36800 18594 35510 27684 29404 14696 9787 25553 36862 48411 37780 19383 25186
13231 25186 18857 6389 15446 26439 35952 27589 25586 36607 34734 42072 55938 46573 40718
13218 40718 58179 65989 72083 67467 69045 62860 51233 42893 28737 29405 35224 58469 71126
13205 71126 56668 40487 27767 28470 23432 17555 14882 34155 34582 23807 25929 31208 44569
13192 44569 62404 41570 28687 29179 32081 33310 39523 18759 10475 28582 35729 20190 -5247
13179 -5247 28118 67321 88223 97470 87765 77128 57874 39780 21241 10695 31825 18716
13167 18716 10942 37453 36541 18402 14640 39594 30169 25965 34511 33871 35582 21010 -18 11679
13153 11679 26675 39085 43483 38289 39052 43600 58764 58804 59834 59519 63597 57248 50235 44941 44587
13138 44587 52164 54464 63610 66148 50608 54639 39312 29538 24480 35163 24738 31703 44023
13125 44023 47054 43320 30700 12729 27683 59632 59013 48288 52994 66651 88284 79032 74022
13112 74022 58779 57969 61616 47915 34153 25800 19321 19944 32018 36710 46451 42073 31265 32613
13098 32613 40126 61918 59286 65309 74551 83274 96666 89114 68389 67741 78128 80653 81424 71326
13084 71326 63301 79576 89575 81043 56123 44811 31754 29767 28562 36486 35513 34660 51867 76157
13070 76157 75520 64490 54369 57210 62296 70487 71686 75767 68874 76623 85892 71833 76727 91982
13056 91982 87899 90311 83787 72119 59598 45601 34570 22940 17652 27946 44013 60957
13044 60957 64275 77261 91503 99842 89819 98751 81892 80306 81137 115205 155845 168274 168201
13031 168201 183275 207677 218515 230735 266694 314906 374638 492957 671448 908693 1209182
13020 1209182 1503156 1670110 1657406 1482503 1227990 990428 810982 658102 548699 474541
13010 474541 402278 374561 364549 344029 311657 300793 281586 251406 238790 224438 206772
12999 206772 197059 181533 153677 123188 132510 142189 131472 104546 82814 88776 97667 92169 93964
12986 93964 79961 81599 89294 100061 107816 98728 81489 66065 68395 77220 91384 90055 87558
12973 87558 110931 116765 111437 107028 107770 98362 63497 57373 51813 37953 29217 40461 53417
12960 53417 56940 46728 44597 49770 54429 68345 84215 87427 106636 123704 120609 106388 81142
12947 81142 78891 59219 60272 52059 51782 68902 76467 96698 75714 53254 58595 51745 54459
12934 54459 78409 84135 78199 69526 64111 66434 74205 76391 80230 88115 91636 89044 87198 56399
12920 56399 66136 69837 73627 71012 70536 82973 94895 106779 113539 112850 93476 88038 79147 63889
12906 63889 51508 49971 72171 88573 90198 78953 80442 92235 92812 87199 106517 123548 141160
12893 141160 125483 119602 129715 115217 112334 122392 146656 152071 163712 181626 188655 206244
12881 206244 215231 231681 232833 222476 194996 188575 172241 166981 162057 152500 135394 110375 100777
12868 100777 103562 83543 78227 75643 84734 73250 59163 61896 38586 35817 45119 70296 81322
12855 81322 67286 71284 85806 102738 88085 84571 92158 104939 126025 124975 130622 120682 98983
12842 98983 101326 114348 144887 155673 166774 179557 174817 175587 180401 177595 176839 202083 219695
12829 219695 228746 209847 175955 160584 170523 173859 166683 180408 184539 166816 147291 137203
12817 137203 134165 133360 125485 113564 115118 130978 132136 110343 108652 115538 131485 143660 160899
12804 160899 148902 150621 165500 180600 155473 107522 98760 90243 83243 65217 79477 111135
12792 111135 128367 125720 125501 133716 132643 141550 143844 145488 153776 152789 157709 164396 161797 160478
12778 160478 177389 175752 150895 153084 156905 158863 169902 171053 169103 182341 183382 208394 210467
12765 210467 220720 194707 179560 166923 157910 138179 119309 101350 121510 184275 240122 229821
12753 229821 205999 202403 216941 224846 205185 197194 197238 181226 171543 167428 177395 223637 250492
12740 250492 245587 234486 227919 226274 234428 231746 220390 222193 253015 263468 280262 300357 331134
12727 331134 355970 359214 357351 346871 281944 177290 99032 72935 53888 57362 80773 104604
12715 104604 139709 150441 130527 140544 163977 166233 171001 192766 174143 176815 196779 228179
12703 228179 232611 199458 154147 90645 49371 74864 114939 182022 266108 347428 374281 298998
12691 298998 167561 68650 15474 -2658 25374 52511 64588 78103 170116 296987 369927
12680 369927 416152 441317 422552 399921 378810 382011 396081 375668 369963 385443 400929 397861
12668 397861 410709 428565 459079 467171 452054 443754 445126 467267 488280 499124 507406 505465
12656 505465 510557 505976 512736 513083 525759 539868 542676 537681 524900 524616 501733 500130 503671 499045
12642 499045 500103 502146 499724 513789 536129 553465 599924 646053 696761 731800 772688 815465
12630 815465 826041 830825 827087 845477 900750 976388 1068780 1190984 1314406 1438976 1545039
12619 1545039 1570311 1550206 1538892 1491949 1443155 1405840 1376833 1370321 1337292 1311588 1346027
12608 1346027 1411615 1480304 1566878 1673214 1796797 1907725 1994863 2054936 2144317 2252788
12598 2252788 2383119 2539090 2699328 2868703 3029679 3231680 3480097 3739690 4033836
12589 4033836 4401500 4812777 5281317 5826329 6475121 7255237 8248403 9516342 11053075
12580 11053075 12789496 14687987 16817342 19463058 23051844 28101893 35351493 46014974
12572 46014974 62187902 87234096 126025074 182779580 253325702 316562306 344394527
12565 344394527 323106662 265947176 203815426 155320105 121556728 98420063 82337093
12558 82337093 70934940 62747544 56826117 52499411 49009890 45463862 41451321 37139753
12550 37139753 32975451 29193281 25911894 23075825 20647202 18580258 16807909 15254467
12542 15254467 13865769 12644503 11551612 10523168 9628227 8825582 8088740 7410697 6799826
12533 6799826 6281027 5800422 5340334 4945376 4593655 4277208 4003837 3765766 3540781
12524 3540781 3336650 3113670 2875076 2627366 2402686 2209809 2010643 1855135 1737050
12515 1737050 1645671 1567087 1474719 1386385 1322046 1251637 1201318 1151048 1092027 1032969 983625
12504 983625 948921 899257 868761 838223 798842 760970 736159 710586 710336 700433 694786 699106
12492 699106 685305 669500 668568 652403 620021 586030 558262 538147 519356 484278 467309 474071
12480 474071 479509 459445 438000 429326 423825 401210 397337 396273 404239 399593 375953 345371 335282
12467 335282 319528 315561 299871 287012 279610 268189 264977 257721 271223 281476 270693 273012
12455 273012 260739 217218 144841 95012 96007 118158 160455 224067 305969 364045 386385 430711
12443 430711 460121 468408 452490 398079 347158 310890 333041 365598 415955 484025 571796 583885
12431 583885 524099 464729 390454 356676 353591 357347 342794 354862 365588 369734 363890 360474
12419 360474 360436 375571 390879 392035 410381 432558 435878 404756 360098 267749 183817 117853
12407 117853 78846 55337 62048 63375 62449 64134 91310 112925 123910 143973 164479 163880 158006
12394 158006 132105 109458 91562 83045 99094 109282 110883 122963 110099 80954 75885 82913
12382 82913 82646 88014 82864 56371 41151 55999 92230 147990 185531 180117 172237 166399 185778
12369 185778 204670 238094 283218 369490 435800 466643 442866 381215 306582 262715 217718
12358 217718 189066 177228 192022 188917 185883 191390 177173 160335 146546 130973 128658 134944
12346 134944 144511 126845 114273 115185 110999 109073 100551 121052 131078 145676 143463 135444 127207
12333 127207 122428 96977 81541 93909 90026 77993 81843 80022 68407 80241 105092 119397
12321 119397 101638 85216 95364 91969 100971 90431 76716 68514 79799 84309 78621 79088 83207
12308 83207 80589 80005 94983 101955 94599 94339 80345 75942 78516 77708 71557 76877 62330 45022
12294 45022 34201 51048 84181 110424 117866 102973 101527 90721 93255 99859 107160 107092 130222
12281 130222 143202 143836 145018 146381 126278 124327 152072 188371 228747 231775 225285 231208 244105
12268 244105 255091 247278 210207 193552 164304 144233 128805 109108 90842 59113 29756 36307
12256 36307 50651 32916 3253 -20298 -22710 -11896 -11306 -15162 -44576 -41202 -23297 -30562 -14531
12243 -14531 5323 29123 19306 11029 28310 50716 57314 75441 71995 77877 92060 96132 108418
12230 108418 126270 167232 166195 161379 166275 166785 181128 187391 179941 181714 186688 184722 164915
12217 164915 154135 154532 157434 161876 172991 186949 183581 167028 147825 126427 118155 118192 133644
12204 133644 123699 121109 134970 137180 127093 110466 89985 86199 117134 164147 184294 202171
12192 202171 194848 187044 152857 111244 70115 54233 49736 51350 65320 84658 103506 113933
12180 113933 144359 156420 152390 132983 136313 133171 140403 154145 156961 146727 125165 138315
12168 138315 157875 181408 172057 153319 156324 139221 138364 133929 145257 175904 199229 201849 215472
12155 215472 240967 228505 231727 222502 193709 129524 85269 71801 69025 114982 186392 239000
12143 239000 222331 201756 192893 204016 211338 194144 190359 176100 189895 198727 206032 222919
12131 222919 236576 255019 258738 224494 215041 220179 227434 233891 261606 298486 328941 373679
12119 373679 415428 442957 463944 492134 527403 553223 544278 489947 496435 589521 808127 1140946
12107 1140946 1452749 1637193 1629712 1466652 1215748 976792 796512 684838 602608 553094
12097 553094 527843 506535 494048 479389 477617 439930 364686 268383 192263 157125 179713 237746
12085 237746 299743 370194 390824 364347 274670 166231 96714 86981 100386 99441 69405 61192
12073 61192 140900 286262 442899 529874 522425 468536 449639 454490 465147 462168 474983 480444
12061 480444 480254 477154 476984 464373 452440 456204 456368 453011 446818 460672 476783 492752 518573
12048 518573 525659 527464 520506 504528 491789 480450 511663 523710 511444 490365 474283 466117
12036 466117 461282 460911 485980 505871 501886 480612 474943 475117 488408 511613 536107 584635 623449
12023 623449 636115 646867 645732 649619 684845 715816 717759 698783 705733 740793 773377 807562
12011 807562 835643 870456 927573 973541 1036331 1083500 1111654 1142437 1137574 1126255 1127673 1148053
11999 1148053 1178592 1203986 1263813 1355351 1463164 1587105 1703837 1784647 1858865 1961146
11989 1961146 2073997 2205099 2363326 2546254 2717592 2865780 3054681 3252661 3481378
11980 3481378 3752245 4067767 4446740 4881612 5360648 5919369 6589556 7417996 8391519
11971 8391519 9568943 10996767 12747774 14934506 17766171 21539935 26675614 33881384
11963 33881384 44306941 60014300 84482676 122775155 181002130 260227163 344402690
11956 344402690 400089087 401431141 339907697 252913409 185597857 141756054 112870539
11949 112870539 93211902 79429319 69588503 62441085 57212810 53349502 50028365 46284569
11941 46284569 41882454 37310396 33056987 29284717 25992843 23148095 20707170 18631987
11933 18631987 16872375 15373504 14095838 12983531 11999059 11150214 10423660 9821863 9351671
11924 9351671 8969092 8689149 8468686 8303746 8106345 7845853 7527007 7128101 6686000
11915 6686000 6223513 5762356 5262622 4783667 4321666 3863293 3453642 3117232 2814206
11906 2814206 2559821 2345475 2177142 2029396 1895637 1784302 1673973 1566196 1473840 1386480
11896 1386480 1295076 1220141 1152194 1102853 1050721 994272 943311 884181 834994 821355 798736
11885 798736 792646 777447 750463 735498 748761 744343 721520 685125 647056 608828 571373 521019
11873 521019 494033 489307 475363 454817 438684 440409 429171 414310 395877 405266 409095 389532
11861 389532 373487 357774 353313 354524 338881 316965 302760 305707 303944 285612 250464 233663
11849 233663 229434 223493 213316 223867 235695 204997 130085 55024 -8505 -21199 42791 149024
11837 149024 250597 305287 336833 392776 455534 492390 489241 422229 319470 240269 255074
11826 255074 330506 423731 510257 582138 624522 577767 494602 390101 315247 318165 345444
11815 345444 341424 340316 330611 322080 305967 301454 316790 323610 316215 317801 325121 356106 397688
11802 397688 415153 370839 272953 152317 50786 5054 -23960 -16921 -11575 -11679 11193 32303
11790 32303 55486 67659 67456 72396 76733 59355 39102 21615 14537 23291 16291 36304 50162
11777 50162 41602 47738 36974 23095 10598 11119 12273 -2777 -11397 -6071 10904 38084 83450
11764 83450 123527 120959 87900 53538 32515 36479 30438 3282 -18307 -15321 -8343 8444 18156
11751 18156 20614 36583 42191 30095 33589 33423 19064 22095 27765 18105 2350 -21189 -26874
11738 -26874 -24514 -14097 -4274 -3994 -25131 -32379 -3658 280 1394 25319 44714 56473 56396 74742
11724 74742 79961 82423 64963 53416 41453 22105 2198 -11902 -761 28154 34261 68972
11712 68972 83347 49328 40744 53854 62845 67987 50923 24281 16302 12075 21003 20438 12559
11699 12559 -4431 -709 11641 16597 18227 29768 29199 16874 12957 659 17670 29509 20019
11686 20019 4945 -14631 -14689 1397 43815 66758 56487 57738 57506 40823 37380 44341 59363
11673 59363 57337 49949 52361 55535 55146 50952 38672 26319 33882 34099 40257 37102 21384 17572
11659 17572 6080 2722 6060 7215 16871 26288 14580 31732 43345 52255 24006 -12552 -41335
11646 -41335 -76318 -116098 -151145 -161750 -162500 -129608 -107807 -90827 -56433 -50714 -58011 -53257 -37082
11633 -37082 -26481 -14452 -26648 -30887 -18243 3349 1356 -7402 -9197 -10981 -2374 -9918 -8935
11620 -8935 -9670 12144 18640 6331 14305 7970 -11509 -20481 -23353 -24465 3779 28259 17709
11607 17709 -7129 -288 2388 -4360 -2026 -518 11243 6085 -7541 -29970 -21534 -1371 1675
11594 1675 6399 22150 16490 14000 5694 -4414 830 28498 33667 30460 28781 29076 31453 43952
11580 43952 56956 39504 15224 -2843 -3159 13809 11685 4778 1277 -4245 -7619 -27429 -34172
11567 -34172 -28066 -17663 -18851 -23966 -23442 -21379 -21542 -21649 -18669 -4039 8245 -10357 -8742 -9836
11553 -9836 -9884 -10315 2559 14769 16314 17203 14175 15581 13484 10235 631 -10475 -13376 -14768 -4181
11538 -4181 3307 8549 644 -9111 -11683 -10458 879 -2847 -16895 952 -10175 -13415 -1112
11525 -1112 20774 11003 4916 10589 20819 23127 12086 11335 -13251 -34479 -50618 -32285 -18262
11512 -18262 -24133 -28296 -39279 -36883 -26596 -25799 -26448 -13409 -7222 -21117 -28243 -32877 -34067 -42792
11498 -42792 -54198 -41736 -24974 -26716 -31697 -27314 -31825 -38017 -46579 -39871 -23287 -10314 4142
11485 4142 10169 25768 4284 -10782 -14770 -33492 -37391 -48300 -40554 -29021 -16603 -16305 -22352
11472 -22352 -34291 -36774 -28173 -23943 -22342 -27004 -29753 -21427 -10295 -3147 -4883 -988 -6421 -12997
11458 -12997 -13968 -21698 -16611 -9094 -28956 -18698 -14331 -15384 19396 31010 8691 -1156 10876
11445 10876 29850 7441 -14198 -22413 -37516 -59830 -74407 -47579 -24586 -4749 6392 4883
11433 4883 4385 1806 -6800 -4795 -16896 -8589 15312 28679 6649 5868 2468 -9237 -20480 -23660
11419 -23660 -18619 487 -10710 -23700 2246 14015 7456 -780 -13553 -7553 -8740 -14492 -9312
11406 -9312 -14940 -35198 -53248 -46179 -32345 -26163 -35387 -39294 -37179 -12640 -10556 7069 19093
11393 19093 15743 7578 5343 -12416 -20850 -35472 -50663 -25268 -2359 -18593 -38938 -30179 -26410
11380 -26410 -31974 -33063 -25273 -22846 -33578 -31920 -25292 -25968 -20011 -16861 -15672 -20936 -19577 -27413
11366 -27413 -22126 -272 -5634 -5734 -1362 3567 9210 6119 7014 6584 -1614 3549 3899 756 8319
11351 8319 -5056 -23558 -17783 6378 18871 36319 47428 47523 33655 2048 -321 356 11873
11338 11873 30622 12948 7525 8758 3250 23792 18880 -2948 -15716 -21621 -10109 -13070 -3324
11325 -3324 6625 11965 5401 -4819 -15097 -10039 15649 39587 33696 36287 30244 19481 12653
11312 12653 -6762 7703 13360 -4189 -7019 -7857 -10662 -10025 -4144 -6680 -22130 -28820 -27602 -20740
11298 -20740 -23621 -23354 -13382 -2774 -2895 -2477 10615 9528 -18551 -28466 -28633 -34287 -31990 -19647
11284 -19647 -28185 -25817 -13500 7511 17650 20762 14308 13844 16971 786 -11479 2602 10359
11271 10359 1880 16297 25625 21999 19204 9154 12277 29526 22502 7047 -11409 -6273 -8814
11258 -8814 -21002 -18892 -20288 -2603 2485 -11224 -9234 -14250 -4217 9836 35339 37609 44484
11245 44484 37385 15164 1315 10989 21336 15417 974 -5172 -345 -1647 -4945 -8247 -22448
11232 -22448 -14344 -1261 4787 12904 12090 -1334 -3396 -7006 -161 148 -12496 -8727 2571 21452
11218 21452 14407 29393 17235 4272 -765 -20898 -23806 -16490 -14275 -7645 9898 945 -1997
11205 -1997 3510 -494 15583 20590 -16706 -23783 -24662 -22148 -8908 1363 3160 -1927 1100 -4899
11191 -4899 -8513 -1513 9708 -4762 -14398 -4817 -557 -7076 -2360 -6552 -9699 -6702 -522 -8924
11177 -8924 -8463 -7485 9838 18041 4041 15706 5874 8345 17201 25738 12599 -16561 -13642 -13737
11163 -13737 -24890 -34982 -18987 -2402 3850 -5842 -13695 5160 26412 17165 -8389 -12194 -7240
11150 -7240 272 6116 17636 1597 -8836 4173 109 -8022 -8018 -16785 -4179 -9602 668 -4635
11136 -4635 -1539 1681 -6770 -15622 -31623 -38283 -47686 -40680 -26865 -18412 -14215 -9344 -12500 -7015
11122 -7015 -5221 13102 8502 -19977 -45516 -29563 -29344 -17775 -221 13179 6806 -11130 -8863
11109 -8863 5969 25650 1356 -18551 -15907 -10366 -7872 -14687 -14033 -34233 -33847 -14189 4647
11096 4647 7913 3186 1263 -13864 -40177 -30900 -36884 -26678 -1385 15167 20798 17055 564
11083 564 -10659 -22355 -27421 -29408 -7693 -29159 -28736 -10696 197 3964 -208 -9346 -9535 -10407
11069 -10407 -9440 -30842 -45728 -32639 -40281 -36861 -4037 10794 12978 19344 31051 31354 29096
11056 29096 23968 27897 5691 -16790 -9559 10903 19587 21462 875 -16253 3851 12488 19674
11043 19674 28483 43860 54694 56709 78142 85416 82650 75712 75711 77516 72820 80198 83406 77005
11029 77005 104671 141491 152333 155517 147221 127526 114588 118365 137794 127436 114056 129510
11017 129510 134156 145402 162083 169488 194270 160809 135018 127416 114628 112081 108366 103550 128805
11004 128805 149034 161403 158143 135019 112935 98412 94348 82476 66781 51889 50711 65904
10992 65904 68653 66372 83792 93720 77049 64231 59926 50522 35293 43082 42723 45926 45408 50497
10978 50497 60659 53198 55782 65552 39547 17409 -1433 5635 10007 -832 5872 13896 16700
10965 16700 5298 -8668 -2067 7324 7869 8586 16145 28199 31362 38813 44901 33806 21902 12152
10951 12152 17234 29660 21502 13469 13347 12447 21866 18387 -5859 -11412 4737 2027 1731 -4314
10937 -4314 -9870 8793 14475 7366 -32691 -45301 -20542 -603 -9082 -2991 -11337 -3802 9138
10924 9138 19682 20824 21514 16792 7777 -3763 -18810 8961 9420 10044 23499 826 -8570 -1022
10910 -1022 6979 2420 2901 -11696 -18713 -15442 -14996 -8774 -7590 19054 8822 585 10862 13420
10896 13420 17871 21459 33501 48108 30564 7408 -10331 -7964 -6581 5562 11687 4580 -5259
10883 -5259 -4118 -14670 -18804 9587 20964 9595 12774 27369 28190 21578 27432 32646 33574 12875
10869 12875 5560 3394 -13149 6255 22584 28774 17636 12181 12653 33206 25585 18622 19049 24490
10855 24490 15015 -7157 4885 6553 -19054 -16475 -12820 -4833 4111 25862 5103 -5442 -6714
10842 -6714 8572 28393 29443 37070 26518 9390 7829 13396 36718 60435 37675 18404 11345
10829 11345 13237 19964 12516 3296 3305 -28 7099 25890 25581 20343 19550 10058 3746 9673 16236
10814 16236 7630 30824 47884 28814 7083 16598 9403 -3993 -1861 22607 29644 18380 8003
10801 8003 7635 13782 39787 45682 37175 10044 -9411 -14061 15206 27201 29421 38530 37467 31623
10787 31623 31670 36941 39514 41655 39478 25736 10646 1322 -1814 -14124 7199 24732 26018 11780
10773 11780 21768 37968 26946 27095 14293 12027 15077 27125 27113 29558 29570 35935 53363 57196
10759 57196 40210 14660 15467 35749 49778 46569 31776 33509 35329 25233 17689 35139 32227
10746 32227 6167 8054 33212 46960 41802 24695 25033 41476 30599 18279 7877 14988 22433
10733 22433 38573 54124 29232 19186 23415 30632 39021 42992 14809 11406 24179 7576 32146
10720 32146 52291 48188 15956 24775 26424 26057 32624 62343 80804 70822 60940 59371 33191
10707 33191 29141 19342 10544 22745 44907 62854 77059 80456 82950 74027 54772 33442 37077
10694 37077 44197 44728 49333 59448 65461 78130 70099 69265 65654 49090 68313 98712 98202 80940
10680 80940 72683 75622 93945 95528 92232 84582 106997 113346 92234 94553 89857 80888 83774 96707
10666 96707 98562 89602 75423 70950 63554 58439 54333 63899 72627 72538 69204 64114 76212 88539
10652 88539 91457 69512 66705 88805 108670 123501 120155 110034 107688 133233 131772 142619 145939
10639 145939 151775 166893 183352 194447 202417 216704 214375 240309 281041 306929 308712 337330
10627 337330 400420 461887 536397 579141 629833 676662 740416 819089 924412 1043266 1204282
10616 1204282 1445628 1792072 2262103 2917256 3807604 4983516 6404055 7867124 9078824
10607 9078824 9761219 9846795 9562964 9244077 9160437 9488898 10336956 11834819 14060744
10598 14060744 16911702 19875601 22078166 22798423 22008203 20419942 18898668 17950650
10590 17950650 17813454 18610424 20432591 23308477 26955043 30498649 32626389 32477559
10582 32477559 30192228 26908524 23824192 21537731 20193230 19800584 20317423 21644560
10574 21644560 23478690 25109383 25712031 24737905 22387003 19516863 16917717 14937221
10566 14937221 13618903 12900219 12668382 12809844 13116975 13297978 12995594 12106010 10737111
10557 10737111 9185566 7745861 6537561 5583542 4799960 4187464 3711759 3315375 2999122
10548 2999122 2729960 2494068 2268905 2056289 1853387 1668490 1500071 1346433 1234844
10539 1234844 1130066 1026339 926057 854447 791482 711240 652639 605613 548668 508600 483561
10528 483561 439808 388753 348628 331818 317625 285555 248697 235104 239425 246658 235983 205620
10516 205620 171739 159095 165312 166139 168522 166656 156214 159068 140987 120805 106029 91011 93546
10503 93546 81227 78344 91221 90539 85936 74943 72076 68242 54442 42347 29438 39546 41023
10490 41023 25332 36726 44548 61287 56363 62783 48970 23054 16341 30186 23778 39244 45945
10477 45945 47964 46180 52565 75155 77615 79949 73526 51568 31821 27172 28142 30930 51101 71077
10463 71077 67140 63580 79650 76532 55075 44710 41890 32168 24809 42295 40742 52935 75920
10450 75920 82202 68252 44872 40046 45645 36169 17510 43262 71649 64075 46656 41060 55442
10437 55442 68512 59298 49404 38534 46653 43870 35546 42904 37580 26324 5038 -10029 -26844
10424 -26844 -25726 -9336 9364 18179 10935 4419 6770 10032 26294 22572 -1082 -7416 -14091
10411 -14091 -15826 -12673 -7721 -6190 1080 1542 1368 11823 10737 5692 -2044 -9893 -14519 6128
10397 6128 8111 -90 4895 23367 4521 -10461 -17004 -21238 -7840 5093 433 -27640 -30193
10384 -30193 -22413 -12389 -16568 -26775 -17136 -322 -7826 -12190 -12121 -17250 -19226 -20168 -26484 -46400
10370 -46400 -38764 -27822 -13163 -7650 -14317 -14251 -15578 -15176 -5197 -10157 -21231 -20681 -6280 -4367
10356 -4367 -3835 353 -2326 -50 -2655 -5127 2677 9679 -1564 -22597 -6344 1132 -5431 6772
10342 6772 7056 -4293 412 -5489 1934 700 13791 8919 -25624 -39072 -32798 -18133 -14935 120
10328 120 22482 19215 17186 14395 28612 19929 9322 13837 11140 18256 23053 15501 10253 25209
10314 25209 20208 20353 -3484 -20871 -21889 -21116 -13557 -10169 -7287 -18311 -18787 -9268 -6040 7448
10300 7448 10105 -716 -18573 -27695 -23292 -31648 -32870 -15463 7418 7992 -9198 -36265 -43479
10287 -43479 -28756 -2656 12032 15231 -5420 -20431 -10021 -18261 -1103 9980 25506 29781
10275 29781 15431 15054 11855 -7247 -36735 -7488 10925 23689 9305 6849 -6749 -8621 -12733
10262 -12733 -14087 93 21640 26146 5625 8963 8620 21873 2089 -4597 -4772 -13631 -9246 4437
10248 4437 -8165 -7715 1925 17807 9198 17357 24050 23230 17044 3072 -1649 2652 10423 6577
10234 6577 12342 17527 -10582 -16562 -8542 -6646 -40476 -43724 -21624 -3358 -14542 -27149 -17535
10221 -17535 -18822 -7859 14932 227 10072 10423 -7767 -18736 -17949 -15006 -17559 -27299 -26870 -31214
10207 -31214 -25281 -26504 -30024 -12562 7367 29781 22142 15218 17761 2118 -18255 -28599 -10125
10194 -10125 12010 7489 3938 -8972 -26115 -24624 -1435 -5272 -18255 -19521 -22332 -13549 -10685
10181 -10685 -15389 3165 13553 14855 26252 33281 58545 54485 60827 68808 52922 49475 42977
10168 42977 37053 31351 35038 36666 39530 39853 50125 72226 75260 75490 98161 109819 111190 93049
10154 93049 92701 116389 115258 108494 119600 141080 141746 137097 128198 113704 91990 72528 88327
10141 88327 106345 110889 116466 119303 127887 120831 126830 120878 94926 85961 87420 80294 61750 59499
10127 59499 61494 31683 15483 28169 58802 67302 60696 40345 7191 -6679 -590 18936
10115 18936 17677 4246 9199 2385 -5433 2418 -1097 -18290 -22169 -3240 556 -16178 -10284
10102 -10284 4960 -9970 -14863 -17283 -23989 -7260 -7588 -4627 11726 17966 -18258 -23453 -14531
10089 -14531 -11615 -6812 -5050 203 13600 20716 16406 19090 31971 18624 16172 3205 -13627
10076 -13627 -7686 -2540 -6236 352 -3267 -29740 -9093 -409 -19893 -22076 -10722 -6327 1242
10063 1242 7182 14260 -1643 -15412 -23064 -38622 -45433 -35024 -27819 -15714 -6539 -4427 -11401
10050 -11401 -15086 1314 10108 19808 13834 11455 7917 -2712 -1463 -9667 -9363 -6733 -22736 -19630
10036 -19630 -14166 6507 10961 2958 7677 2896 -82 1298 -8361 -28913 -31027 -14390 -11508 -7709
10022 -7709 3377 3877 -12418 -24491 -26549 -21740 -10273 -3918 -24303 -41722 -44461 -28316 -27933
10009 -27933 -19166 -208 -3078 -5019 -4134 51 3055 -2364 -11700 11241 21477 -5727 -3704 -9598
9995 -9598 -10742 -17537 -26454 -27261 -15823 -9818 -10694 -17577 -3803 -7896 -19836 -9306 168 3826
9981 3826 -1506 1238 3841 -1382 -4720 10167 23349 9784 4268 5934 5380 2384 -3241 -5491
9967 -5491 -7374 5398 14358 10314 1212 -12140 -6642 -7802 -7073 6930 10449 -3632 -10532 -15334
9953 -15334 -16121 -27181 -40635 -13881 -5451 -12536 -18211 -13335 -8925 -13193 -5356 17795 14972 22864
9939 22864 15998 -2302 -4487 12181 11328 16638 31776 43034 33947 39070 49662 62230 85551
9926 85551 116799 173662 293942 542984 968453 1376454 1531591 1324781 906284 594560
9916 594560 421669 326020 243948 196501 161273 156233 152494 127240 118815 114712 83544 82867 81032
9903 81032 69944 76286 88848 82751 61371 46090 58670 71886 50343 46521 50198 53228 39483
9890 39483 30250 31116 20107 8161 -2772 -8509 -34769 -33162 -11861 -8061 -10229 -33871 -31243
9877 -31243 -17156 -15788 -4934 7896 19917 33894 31398 8008 -19898 -14886 5155 17597
9865 17597 4871 2874 11853 14926 -3382 -21463 -23481 -9203 -310 -10794 -10077 -13457 -33918
9852 -33918 -44555 -16386 -2489 12142 580 5300 -1978 -34676 -57482 -56015 -29408 -21944 -11808
9839 -11808 -6279 6248 14378 3886 24938 25305 -1436 -13736 -21046 -11629 -7269 -27371 -34462
9826 -34462 -43997 -23202 -16620 -16175 -22710 -18286 -2786 -303 -23071 -32170 -20296 -16831 -14051 -5595
9812 -5595 8537 6020 -8906 -15240 -10081 -15141 -11515 528 3459 -2831 -2756 4947 -4488 -5286 10970
9797 10970 7340 -94 -10401 5679 17239 1644 -2943 -1344 -3622 3689 -15440 -43442 -48046
9784 -48046 -21607 -1321 -13342 -47821 -41315 -29494 -25882 -29659 -23966 -24747 -30203 -19921 -8411
9771 -8411 -5576 9447 2135 -13388 6984 17359 12238 16082 15310 12593 -76 541 898 -1655
9757 -1655 -8388 -22258 -19863 -5567 -14386 -32020 -24712 -32545 -23693 -8396 -10587 -10847 -12641 2617
9743 2617 -11348 -19112 -22262 -9408 -640 16512 14308 11792 9013 12236 12858 11717 -9646 -13177
9729 -13177 -18899 -7371 4366 -818 -8520 -5931 -13731 -29688 -15491 3297 -4368 -3408 1482 15913
9715 15913 23706 36720 25530 27939 21673 10601 -3727 -22530 -27438 -17614 -513 3118 -10384
9702 -10384 -9347 -11950 -8106 -1698 -595 -6370 -6707 -7186 2952 14333 19372 3841 -222 -19086
9688 -19086 -34687 -30043 -22527 -27049 -14329 -9515 -17472 -24761 7059 15626 27687 23321 978
9675 978 -7885 -12543 -20409 -29555 -33180 -23710 -30230 -24986 -14437 -17890 -14494 2 -4657 -15469
9661 -15469 -31476 -36711 -34863 -21275 -32087 -9585 -8606 -28707 -42237 -39375 -24561 -5447 8947
9648 8947 32862 55410 64053 48404 21686 3284 6304 1579 -5989 -9882 16420 38787 30644
9635 30644 8654 -7672 -12796 -19644 -23385 -33689 -25631 -22159 -8699 -7237 -499 3493 -992 335
9621 335 -12966 -25510 -16328 10803 1173 -12305 -16793 -22427 -19119 -18873 -16015 -25773 -28197 -31217
9607 -31217 -17473 -7671 -4365 -10455 15144 32825 38032 28744 7252 -367 -11140 -21441 -9354
9594 -9354 -1980 810 -3737 -9721 -13412 -7194 -10587 -19343 -21126 -27182 -30285 -20696 -15411 -13390 -21561
9579 -21561 -22126 -24615 -28135 -25450 -31822 -47185 -48300 -33597 -23599 -5425 2526 -5153 -1589 17038
9565 17038 18873 7474 -197 -11608 -7317 -3830 134 -10013 -23203 -40407 -34317 -18419 -10208
9552 -10208 16186 23679 2566 -15599 -21699 -26484 -23706 -19157 -9123 -8251 -2445 -1831 11702 23131
9538 23131 5240 -5492 1706 9360 8020 18996 8240 -15890 -14403 -13797 -2507 -18789 -27464
9525 -27464 -6457 -16332 -29589 -24867 9105 36821 23753 -2747 -10273 11043 27957 16995
9513 16995 11082 -4514 -3242 4044 2776 9976 14457 6876 -1445 -9321 -23548 -29114 -1473 14819
9499 14819 10628 -6218 -1030 2150 205 -4440 4958 1469 -7535 -21071 -25787 -27757 -25627 -19306
9485 -19306 -21045 -11117 -14256 -18333 -19068 -27674 -32476 -21862 -10059 -6990 -24617 -28036 -28996 20637
9471 20637 26892 6912 142 -1782 -1953 1261 727 -8298 -5353 -6238 2772 2715 -3546 9611 14651
9456 14651 126 -10601 -9993 -1446 -3116 -58 -21787 -35045 -14300 7727 -10413 -1331 -6931
9443 -6931 1334 23499 32421 23610 8949 -15658 -17977 -12803 -12918 -4177 -10951 -12212 -3970 5591
9429 5591 1943 4394 -9935 -17283 -11122 -14625 -18415 -20505 -7903 13850 10734 12859 5076 3655
9415 3655 27933 31426 18291 26587 31717 37425 29677 27519 35171 31146 34571 51526 39700 25621
9401 25621 5475 -4633 -6597 -3246 4769 8742 5224 1023 9656 11354 -10802 -27774 -33695 -31017
9387 -31017 -32941 -14864 5405 13118 16651 23451 16155 -10952 -20264 -1501 8744 -656 -23061
9374 -23061 -27320 -3631 -5474 -5256 -5152 947 11103 33429 28381 21124 4178 -13359 -13963 -5370
9360 -5370 4217 -9826 -31202 -29073 -28019 -16690 789 7536 11992 -11061 -32537 -24382 -3085
9347 -3085 -472 -702 624 22508 19527 -4609 -25643 -19453 -24411 -7482 -8017 -23293 -20802 -19341
9333 -19341 -17400 -10361 -10803 -17984 -27951 -17115 -14711 -1599 -14473 -12428 -8120 -11601 -6567 7478
9319 7478 9745 -7863 -21431 -28232 -4847 -12160 -20152 -24509 -31716 -31709 -24308 -24321 -17924 -7741 9501
9304 9501 33650 22099 7330 2257 1117 12659 10724 -2985 -8849 -14890 -16574 2356 10248
9291 10248 15449 -3722 4637 14850 25232 41521 35823 33977 15116 5802 6871 2999 -2607
9278 -2607 13897 20526 9836 5812 2215 11091 7076 5581 15829 3026 5148 13683 16499 8072
9264 8072 -6103 4884 -4626 -11137 -18181 -22382 -10628 -17939 -10798 -4175 -3993 5572 16200 6490
9250 6490 7757 16783 12654 -2171 -7759 9804 19884 16036 17342 -7069 -21970 -26582 -10826
9237 -10826 8735 18414 29405 30939 14527 -4094 6663 -3792 -17571 -24074 -13343 -16505 -20924
9224 -20924 -27065 -36222 -29749 -30337 -25770 -19169 -23686 -13489 -1970 11615 2006 2589 -45 -14199
9210 -14199 -3334 3636 6775 -632 -2774 -20074 -13556 -12785 -13235 -15504 -10968 5297 893 -5108
9196 -5108 -7237 -14997 -21706 -17434 -882 14198 10378 6785 16800 -1413 -645 -9862 -19409 -26480
9182 -26480 -24820 -15973 -10475 -21007 -24748 -23573 -23420 -3384 12668 10973 3776 -2675 10758 22118
9168 22118 29917 23698 16860 32877 47330 19504 13831 18585 4344 -12985 -12994 -24727 -25383 -21297
9154 -21297 -13152 -5682 -9475 -23466 -28830 -33230 -34349 -32635 -23219 -16773 -8747 9144 16379 17023
9140 17023 16211 14048 9193 3970 4 -15975 -15881 -11908 -5008 5984 7708 11187 11833 -1755 -22792
9125 -22792 -15208 -4175 -7063 -4237 -16889 -22947 -19003 -7008 -3019 -81 -1294 1078 4596 14813
9111 14813 5457 5288 21991 22659 2594 -5360 1600 933 2678 -9976 -10241 4509 27613 15866
9097 15866 -5450 7193 20657 29589 16132 14113 24230 15734 18356 12452 -1020 25774 25528
9084 25528 1329 -5394 -15847 -29829 -27570 4231 23751 28642 9431 -12591 -21446 -20351 -28994
9071 -28994 -19546 -15870 -4360 7237 15163 627 -8007 -5950 1914 -5726 -10023 15312 24050 15406
9057 15406 -468 6123 -3529 -8946 -12786 -12664 -18271 -6764 7278 7806 2568 -8712 -22681 -25305
9043 -25305 -27809 -29802 -17868 -6753 8050 -204 -12643 -10547 22246 27840 19907 27851 11952
9030 11952 -13091 -21618 -20033 -25358 -6086 5033 4188 8910 -21361 -47705 -42766 -44450 -27491
9017 -27491 -15499 -5825 3507 -2899 -10566 -16369 -6974 -6351 -16974 -5870 -7662 -7400 -2127 7242
9003 7242 -3011 -3051 2554 7620 10170 17768 860 -1052 -1244 -3659 -18896 -22045 -8149 9860
8989 9860 -4372 -10858 -1167 13714 19451 10628 2468 -14529 -10710 1755 871 -7668 -8886 -12434
8975 -12434 -17734 -25228 -30582 -13244 12469 26346 28577 -9774 -45522 -33034 -17550 -929 16129
8962 16129 9835 6306 6707 -5773 -24952 -19583 6717 10799 7750 31986 29162 -9048 -19041 -5354
8948 -5354 -1046 4727 -9803 -23016 -24215 -30960 -30784 -34853 -17914 -3036 -20997 -35815 -30712 -24610
8934 -24610 -13154 -377 -6731 9872 22372 24134 21803 -733 1290 9467 13155 -1657 4284
8921 4284 8261 -2341 9242 27204 12950 -10821 -14433 -18074 -15694 -175 7961 7555 22389
8908 22389 9959 -3248 -14730 -13231 -22727 -14656 -16033 -13152 -16391 -17797 -17343 -2070 8551 6802
8894 6802 -1991 -2594 -7811 -10353 -4271 -2993 -8584 -7215 -12881 -17063 -13216 -13511 -5311 4027 -756
8879 -756 -2580 9374 2225 -23803 -8159 -2216 -9248 -16272 -14034 -21545 -5152 -19519 -26521 -30478
8865 -30478 -24024 -5914 -7836 -18130 -12907 -13358 -9108 -15093 -12441 -3325 -7701 1039 -11470 -9177
8851 -9177 -17701 -40537 -42474 -14474 -10551 -17065 -26291 -16912 6548 11035 -7292 -18680 -16068 6693
8837 6693 11264 1848 -16984 -24521 -12288 3883 7703 -10954 -2049 -476 -5366 -18729 -14944 6092
8823 6092 20512 29923 30425 40372 49857 38349 29380 24537 32104 8133 -23262 -26048 -12751 -438
8809 -438 -1552 -7889 -4078 13290 14672 18706 19210 4616 2793 8746 11198 16498 4443 4198 4474
8794 4474 4704 18074 20919 645 -9743 7313 -5659 -29830 -36923 -35090 -27955 -6949 10191
8781 10191 6155 -10483 -15118 -1386 -253 -471 4586 5541 728 1586 15151 19272 12991 10879 14602
8766 14602 12942 3590 -17056 -19629 -7192 153 7468 5756 -6618 -834 9540 20248 21990
8753 21990 16602 3757 -4450 3669 11052 7537 -3861 -2354 763 -3892 9684 12690 7563 -14592
8739 -14592 -20588 960 13440 16308 9299 16692 24107 46199 21117 6506 2965 23739 23408
8726 23408 30288 30872 25954 26505 24624 14322 37161 39290 16599 9253 -9544 -11535 9931 4193
8712 4193 6886 22504 33458 27487 25888 45034 46487 49120 41527 30950 43238 55368 57504
8699 57504 50907 45713 22304 -6925 -13724 -15841 -5026 -8011 -14249 -4287 8361 5586 -2438 9431
8685 9431 14431 11845 32855 34721 33453 41714 36985 49950 44438 25906 -370 -18368 -15734 -3509
8671 -3509 3251 6092 14731 9565 -2196 -2420 -1014 4498 -8196 -8926 -25085 -23195 -17283 -23443 -27957
8656 -27957 -18776 -6633 -18991 -30954 -36382 -27939 -1163 15999 10117 6317 7923 429 -7677
8643 -7677 -6823 977 -4594 8669 16905 28863 19855 3441 -3146 1577 11950 23218 3282 -6381
8629 -6381 3538 12180 11577 -188 -8976 -22422 -24589 -600 16579 18956 2223 -13762 -4653 -8843
8615 -8843 11981 15537 18420 10739 8876 13553 10045 1242 15415 10969 2201 6014 15287 13367
8601 13367 -10150 -16105 4872 8764 10729 -49 -12826 -13099 5313 11356 -14252 -31890 -28524
8588 -28524 -8273 -3418 -396 -9669 -8940 6537 23044 10062 -5514 -846 14531 16757 11851
8575 11851 4587 27661 40933 16790 -1997 18459 31408 44451 47186 46934 55446 56863 40035
8562 40035 40810 44617 37610 33981 34773 25753 10995 17623 20057 29434 27179 27385 35985 16553 -7534
8547 -7534 -5787 9823 19183 19116 21245 10057 8104 -9071 -26276 -8828 -3195 8390 9725 14147
8533 14147 1203 -16134 -27760 -43427 -36495 -17348 -1781 14260 28894 29448 34667 72878 99783
8520 99783 102026 91502 69816 37957 32882 34678 27794 24081 44076 45434 34935 18547 13960
8507 13960 -6295 9929 40140 40307 24176 5986 1456 4121 11771 14991 22272 28207 24218 23919
8493 23919 12516 24152 31685 27439 33502 52141 52749 44788 38246 13778 -16885 -17543 3682 -4910
8479 -4910 -1885 7719 4299 -231 3843 11870 16928 17539 8808 -3622 19315 28168 33177 21082
8465 21082 15805 16944 20500 11688 -3279 -4991 7674 1538 1339 6611 4547 -3702 -4669 18676
8451 18676 22088 9162 743 9211 6599 -3894 -22094 -52376 -46417 -20067 -16629 -16731 -14444 -3910
8437 -3910 -7747 -17789 -33588 -37360 -25255 -15031 -16998 -6400 15501 13899 544 5430 5848
8424 5848 10389 7174 6398 26704 14931 -8242 1251 -2296 -5470 -3209 8126 18080 4026 -2826
8410 -2826 -3427 -7430 -7312 17150 16589 -2942 1593 23806 4269 -5625 252 13229 30454 15604
8396 15604 19769 22922 13237 14171 -5690 -20535 -8016 3705 -17636 -26891 -25652 -15335 -10392
8383 -10392 -14216 10 2663 -113 11252 32099 25518 -893 -6085 -823 12132 25995 19816
8370 19816 2032 1513 3267 2346 -1069 -8499 -21351 -32840 -16791 2260 16449 -1837 -9520
8357 -9520 -17030 -7284 10515 -2296 -16383 -24243 -12448 -9113 -22126 -25028 -18228 -8282 -167 14465
8343 14465 24217 9243 -7253 23844 69719 121768 140452 136231 98754 65471 46611 65239
8331 65239 82364 62673 57220 49826 43105 30410 2904 -5131 -8995 -10620 3391 6361 8394
8318 8394 -5983 2119 9758 4232 -1880 -16100 -20111 -3965 8854 19860 18509 15693 20512 10337
8304 10337 -3692 -4022 13187 2703 -13513 -4979 8313 43396 97209 139398 220682 282382
8292 282382 309086 269773 196493 131840 79567 46405 37059 18771 26451 19038 13444 -2410
8280 -2410 -2907 13228 25092 8838 8296 12476 26352 13625 17104 29932 53495 40119 9117
8267 9117 -13108 -2170 30115 38004 25359 12872 -1972 22751 33659 13263 13610 15345 -5913
8254 -5913 -4958 26237 41883 67490 104218 134673 137485 123557 84612 59990 51682 38449 26054
8241 26054 14324 -11396 -34135 -39782 -43468 -29635 -7256 14955 19173 9156 2291 13456 4917
8228 4917 -958 4060 32448 41669 9614 -1587 320 -8024 -11862 -9471 -11817 -14285 -7909 -11122
8214 -11122 -11310 -4906 -16563 -23885 -25720 -13594 10260 25158 20992 10106 8409 -4281 -14254
8201 -14254 283 23783 27053 456 -16140 -39163 -54689 -40718 -40978 -37858 -37218 -24180 -13188
8188 -13188 1348 -6048 -9651 -11474 -26846 -21704 -5504 12153 16038 17289 19764 20891 25030 8742
8174 8742 -1855 6813 2209 3703 2407 -19896 -16336 -8764 2177 -3347 -9828 -7998 -5007 4808
8160 4808 17043 16892 9257 2342 5204 15388 31727 36317 33622 29056 12823 21195 33215 28875
8146 28875 33716 38222 42184 39560 25092 12156 15484 35549 46341 36832 22851 26250 7493
8133 7493 -464 -8827 3916 -593 -13053 3848 18293 21561 7891 -4819 -905 16554 25091
8120 25091 23713 21808 25803 17240 20327 23965 1587 -10011 3947 -7175 5917 40983 27226
8107 27226 -2585 3759 5822 13916 25606 15789 11548 19673 15430 3901 7990 4899 -4271 -2107
8093 -2107 -4879 15911 12560 10404 16176 22326 12439 -13060 2834 3262 -91 6091 -1319 1177
8079 1177 1495 -12493 -22173 -20913 -25000 -38668 -26616 -14679 -3059 -5484 1756 17700 21902 18093
8065 18093 4843 4884 -1611 -561 18480 5943 13267 2461 -2619 -7459 -12015 1957 -470 -3272
8051 -3272 16255 17935 -3766 -13041 -18304 -29701 -27231 -33803 -19029 -9980 -13674 -12353 9342 -7971
8037 -7971 -10696 -7841 -20094 -35850 -22064 -23435 -13807 8164 15253 22228 28785 38505 31828 13494
8023 13494 8235 11626 20228 13885 12256 11530 25972 41027 33875 -1742 -17897 -14116 2141 -2223
8009 -2223 -17268 -17547 -13708 -5522 -3530 -3744 -17081 -13879 -26098 -23069 -23174 -13107 6800 5289
7995 5289 5301 7316 19574 4431 -2492 7631 16000 14560 25272 17309 31169 26677 16166 26399
7981 26399 17145 980 -22403 -4425 -14339 -20006 -2098 7215 24804 12598 23499 14912 8015
7968 8015 26387 32858 29885 29355 43893 35285 23560 -1662 -21774 -18022 10082 25842 23289
7955 23289 8777 -2018 2169 1939 -4010 3265 14577 9659 -11381 -27529 -23369 -19788 -20976 -11410
7941 -11410 -9507 -10215 -5392 -10710 -15004 -7354 491 15572 8730 4930 13601 31333 21460 16444
7927 16444 8998 841 13110 18133 12538 16726 19375 20964 16807 -3796 4575 -2336 -24008 -20541
7913 -20541 -13567 1563 -3474 -8899 -145 1712 7850 12099 1296 -30621 -26052 -7500 3921
7900 3921 5780 3701 4250 11449 116 2284 12616 20122 13866 660 -1367 -13833 -7594 -1100
7886 -1100 -619 8565 32355 34023 24271 16453 578 -8956 -28758 -33433 -23983 -26403 -13942 -15044
7872 -15044 -32260 -49994 -37147 -16001 -11479 -6069 1154 -5290 -20800 -13267 -10155 -11933 -16385
7859 -16385 -10556 -4839 9378 615 4786 17315 20099 12135 11963 20333 22006 12623 21666 35953
7845 35953 22540 34905 32931 21330 10506 -1909 1123 5329 -11821 -33468 -25392 -8836 -6451
7832 -6451 -13376 -10147 -3400 3969 2899 -5494 -18104 -29825 -29115 -26246 -15957 2756 5907 -775
7818 -775 -471 9031 -1144 10821 10784 13623 20546 22673 22469 9792 -10109 -6009 -903 -17992 -22207
7803 -22207 -8486 -5853 -12421 -23285 -37152 -19739 11365 14137 14494 13013 -477 -14277 -14545
7790 -14545 4994 -1010 9171 9591 -5849 -18047 -16575 -11368 -1412 2546 9007 4250 -9952 -6407
7776 -6407 -2763 10104 14934 9282 -238 6108 15780 11030 29967 37295 25547 -344 -8457 -19238
7762 -19238 -2151 15567 15332 8691 5441 11767 6433 -4035 -15610 -11456 -8535 -16448 -6377 -4999
7748 -4999 -13231 -13677 -10453 -7256 -28964 -36789 -40704 -35800 -31919 -16800 -5341 -5355 -45 668 -9356
7733 -9356 -12642 -14178 -20362 -18276 -16894 -16538 -4595 708 -6129 -5742 -994 -17870 -24133 -14006 -11579
7718 -11579 -15421 -6280 -6476 -25393 -12507 -18853 -30931 -28815 -22935 -21352 -14134 -3019 20235 33429
7704 33429 14075 11598 24309 -540 -9491 -16076 7836 46977 41789 36516 47210 28912 9565
7691 9565 -6575 -21293 -16023 -7560 -8994 -28727 -15917 -2783 -133 229 98 -15736 -16773 -17798
7677 -17798 -15523 -32019 -28463 -19403 -24077 -29999 -16105 -2404 14922 30370 17424 1657 1851
7664 1851 8495 17590 9408 -1115 -1121 11053 7865 -1856 11739 8322 5603 -7162 -4486 1781 -16962
7649 -16962 -2323 2543 -330 13115 15210 1829 -14361 -9973 13500 27743 4382 -11836 -9836
7636 -9836 -8488 -6068 -12903 -12248 -1402 -11571 -4371 -8440 1631 4892 17915 12606 -7066 -33122
7622 -33122 -38692 -18973 -114 5510 -264 -5898 -17643 -19468 -17214 12437 16365 -11018 -19826
7609 -19826 -3774 14574 8728 11428 -319 -11210 -6967 -18451 -21446 -23779 -50650 -42292 -17279
7596 -17279 -12322 -12405 -18902 -18671 -11098 5527 1599 944 2292 -13510 -28818 -16288 5314 7783
7582 7783 -12881 -19872 -24087 -44587 -46124 -47954 -31003 -14531 1040 -7632 -13376 -12825 -14541 -19340
7568 -19340 -20488 -14758 -7793 -14430 -22685 -11590 -990 1696 20436 16205 12636 8966 15626 -2697
7554 -2697 -16372 -14908 -7026 -1028 -12505 -5211 15148 23059 13485 11565 -4469 -10711 -9327 -20392
7540 -20392 -24608 -19935 -12445 -5211 -9322 -27580 -41588 -39804 -32928 -34192 -24843 -12528 -20211 -28954
7526 -28954 -19962 -10710 -24496 -34217 -28121 -28405 -24892 -27726 -33334 -19116 5920 -7492 -23797 -29317
7512 -29317 -18958 -9957 -17979 -19212 -9389 13879 19199 15731 13286 5262 2237 -13431 -7829 1271
7498 1271 4392 4894 -6758 -23137 -16628 12778 19475 11796 29636 20502 16332 2480 4541 -3776
7484 -3776 -13908 -15931 -14063 -7361 -10874 -23574 -17698 6775 8939 2779 -543 -6180 -15848 1076
7470 1076 21237 9400 11584 4098 -8570 4247 18557 7715 10134 7630 -6964 -11958 -7520
7457 -7520 -26814 -26829 -7741 2478 -3356 -9068 -994 -2516 -21328 -25565 -28240 -34350 -37481 -33122
7443 -33122 -25812 -10332 -2619 3520 12187 -5586 -15130 -30847 -23341 -14917 -3175 -7223 -16741 -37367
7429 -37367 -35850 -6162 9336 17950 7778 5168 -16633 -6016 21614 26895 31847 34675 26948
7416 26948 3011 -3860 2230 16688 10213 -2604 -8176 -7887 -1971 -25680 -33152 -24014 -21949 -13725
7402 -13725 -11899 -1251 6078 -9265 -22383 -32581 -20375 -14471 9792 30247 33160 19383 9739
7389 9739 -1094 -622 4228 -14457 -22226 -14841 -23718 -34184 -20541 -5265 12699 3068 1125 17342
7375 17342 29328 36436 31106 19643 14400 25788 21128 -245 11895 28537 9152 -7622 -9460
7362 -9460 -9547 -13973 -8783 -2489 15479 17200 766 3294 -6597 -8781 14869 9588 -1956 570
7348 570 -5908 6816 31773 36364 11682 -17335 -35140 -38322 -26353 4521 25668 24282 25221
7335 25221 -1903 -17577 -4989 5816 14148 20103 23861 20018 33172 26198 17435 4059 -1595
7322 -1595 18202 16499 14891 20479 6000 -11581 -21347 -11789 -5075 -2632 -4765 9298 -11558 -67
7308 -67 6514 -7550 -20653 -22643 -8423 -14752 -11916 -16605 -14062 -8069 12065 30044 30250 12531
7294 12531 -15094 -21749 -18868 -6231 -2417 -13491 -11055 -3469 -6064 -12255 -21567 -24885 -21962 -24309
7280 -24309 -20727 -33437 -46166 -38532 -36061 -11718 7586 17406 26051 12911 -2894 -3072 -21217
7267 -21217 -23350 -16319 -26755 -35725 -35136 -23304 -29563 -20326 -11677 -11022 -967 213 1890 12746
7253 12746 18020 6569 12957 12813 26048 11785 -2356 -2250 4079 5038 4031 -7524 4213 14701
7239 14701 15323 -9524 -9623 17016 15670 12433 12742 11129 -5282 7063 33822 29693 15661 6370
7225 6370 -7365 -17895 -27438 -11582 9363 3046 -6450 -18686 -12973 8679 14962 6834 -12226
7212 -12226 -15120 1749 -1656 -922 -2504 -13968 -11826 -7144 -14077 -5746 -4229 -6477 -15937 -18002
7198 -18002 -15603 -8448 8895 15557 7201 -701 -30423 -33535 -24503 -33303 -32872 -23165 -4935 579
7184 579 -13647 -15550 12974 8369 -7914 -25935 -41914 -41931 -27802 -27384 -12068 5718 7780 12494
7170 12494 16928 4732 -9870 5990 8038 -241 9140 17815 8657 3169 -9466 -6574 -10278 5759
7156 5759 24663 39251 32600 32563 28761 10966 -12390 -19966 -18431 -9644 7997 17672 22623 21530
7142 21530 17719 1590 -20670 -20289 -17734 -12485 -11163 -26225 -40690 -12939 6628 15393 10459
7129 10459 16912 26213 9648 8915 8402 1404 14645 22165 1425 -16947 -31907 -15804 -17384 -5634
7115 -5634 1513 12050 15149 1841 -19010 -35139 -27745 -8621 14291 19836 17170 5031 15087
7102 15087 23980 17420 11378 -6784 -9297 4717 20356 21256 29918 44136 23714 -619 -5652
7089 -5652 -26875 -30125 -33153 -34689 -42905 -37247 -22648 16050 21175 4488 -19915 -24007 -17961 6066
7075 6066 21005 16583 19052 23384 4262 -16725 -5866 11566 4230 -10336 -10623 -2910 14971
7062 14971 12971 -2233 -5819 -4399 7718 17746 23456 -1552 -22441 -17744 -6527 11939 10094
7049 10094 3222 16832 10481 18820 30322 20338 -17141 -17461 -393 -8467 -6911 3281 18912
7036 18912 15895 19086 6533 -3156 11243 12558 30311 25522 4196 1699 4886 793 873 -18339
7022 -18339 -28548 -30265 -15423 -11831 -3422 20436 15563 3212 -3104 9594 12966 -9684 -27993
7009 -27993 -11535 -2546 -2536 -19233 -27436 -16105 -5701 6853 11272 18731 4818 -14446 -27014
6996 -27014 -28948 -6006 8314 9579 11587 21251 35194 67022 104680 90306 67424 37468 12472
6983 12472 15761 28617 31961 25594 17963 14426 8485 21249 23650 13500 24178 42240 40833
6970 40833 26648 8231 -24086 -18384 -5531 -4438 -20090 -52592 -48360 -32592 -36307 -36331 -17946
6957 -17946 -3307 8614 9778 -1420 -3513 -9127 -23512 -29018 -21826 -12718 -1195 390 2177
6944 2177 -3177 15350 36618 18647 -5470 -10410 -3322 -7649 12289 38805 41820 26071 17817
6931 17817 13369 6480 -4906 -16102 -11085 -10588 -21427 -11418 -5477 -8953 -16632 -14219 -5095 6058
6917 6058 30172 32007 23520 13929 7857 9303 8450 3076 2116 211 -10870 -32595 -20266 -8594
6903 -8594 -45 18276 18425 1884 -3933 -14747 -24224 -12641 -5595 -23155 -2421 -1779 -16753 -18551
6889 -18551 -42956 -57412 -51272 -45098 -30316 -7356 -5807 -4 -10395 -13604 -10775 -3772 4418
6876 4418 9115 13473 14336 12597 2714 -9183 -14385 -8031 -6384 -9714 -1553 3389 -1210 -10283 -444
6861 -444 11474 7278 17757 21250 6652 6233 15315 21158 17832 3296 -10343 -12153 -29225 -40629
6847 -40629 -18493 -2063 -11284 -44883 -53120 -22411 13067 16851 3567 -6465 532 -1749 -15289
6834 -15289 -16915 -12683 -4789 -758 10221 35881 10212 3013 14605 30798 24239 8049 18636
6821 18636 30976 21247 2027 6366 2670 -14439 -4127 8649 -2175 -16181 2516 950 -9332
6808 -9332 -6030 8007 3813 3225 15354 16146 11825 13850 1732 -1275 -3071 10660 -5510 -10052
6794 -10052 -9001 2361 4935 13119 17314 14757 7806 -8451 -8921 -5887 -5345 12863 33910 42544
6780 42544 23032 14999 14391 11422 14208 10913 13769 27811 8553 -1592 16121 19035 13819 13781
6766 13781 21003 28480 25016 26611 27357 6732 -30743 -33003 -17161 4691 16645 21187 8785
6753 8785 16540 17919 16161 4752 -8366 -18205 -32419 -28057 -8280 2523 -3013 2002 1677 -9480
6739 -9480 -976 21237 32236 21178 16947 17782 21562 26696 23063 16745 12400 21943 27159 17523
6725 17523 15485 28399 18074 12758 10179 -73 9195 11374 12309 14966 12230 10784 22757 17682
6711 17682 17972 11802 18563 48378 54241 42731 24463 22850 28771 31957 8262 -1599 5895 -9917
6697 -9917 -20389 -17672 -7814 13259 29053 6968 6509 16693 16234 15386 11676 2207 4523 -6990
6683 -6990 -8416 -5891 1397 4072 -3265 -4027 -17657 -17503 -6721 20402 51248 37642 14879 1552
6669 1552 4475 18282 20547 29405 26970 37352 45990 33472 28031 31343 32399 40073 41561 33801
6655 33801 23198 33027 66639 76995 90232 73251 54288 50111 43792 61251 69791 62795 75715
6642 75715 93359 103443 141572 198935 305557 413561 436779 375275 295956 257498 235719
6631 235719 212412 227970 246501 272279 323851 431538 574689 755214 982759 1273003 1721115
6620 1721115 2520116 4053107 6881401 10935492 13870605 14240693 11055287 7335710 5107812
6611 5107812 3859958 3078871 2596839 2258262 1960922 1732848 1588314 1493062 1407516 1286068
6601 1286068 1138551 1012439 916042 852146 829023 860318 892750 852661 731812 592191 499845
6590 499845 441760 383344 342824 309391 265532 225319 204811 164077 150998 160633 158139 125773
6578 125773 117706 107245 114337 112707 100421 71472 72357 94597 106499 96571 72596 65363 43560
6565 43560 24294 2128 7964 12460 6013 13474 11880 19437 -4683 -27214 -11194 -16880 -15769
6552 -15769 -9292 16436 23410 12218 17353 7808 16712 23119 28347 11218 -2209 -6689 12630
6539 12630 25147 31600 33155 15378 20358 23379 29366 9840 -9904 -18334 9344 35608 29196
6526 29196 19133 7496 4718 7743 19952 12669 15999 32608 31597 25648 1476 2177 22636
6513 22636 21896 9852 -12910 -8721 -6840 -21085 -18401 -12215 -8670 -6223 4816 9948 -3450 -7315
6499 -7315 982 7210 17830 17656 16476 1371 -16160 -8591 13064 11223 -5164 -14973 -40309 -28677
6485 -28677 -24064 10024 34110 39458 19916 4135 8290 31395 23644 22558 36721 35009 14926
6472 14926 -8801 -29051 -26753 -17248 -10943 1588 -1528 -5381 4046 21655 32225 31494 10720
6459 10720 17624 9462 5799 -1746 -13268 -13968 -9523 3748 -13632 -19742 -12163 -11597 -26366 -26457 -16050
6444 -16050 12812 32327 29391 21257 6745 -3070 7182 13180 17163 -5491 -25812 -19139 -20738
6431 -20738 -8164 -7521 -841 -23006 -26554 -16746 -19163 -10172 -5696 -8378 1672 11386 13297 4488
6417 4488 -14775 -15982 4028 8601 7629 9222 -2510 -1057 -3874 3286 21146 11469 9633 5435
6403 5435 -8544 -11686 -10061 -6638 3195 -18001 -33157 -28908 -30143 -27327 9884 4076 -21600 -31964
6389 -31964 -13451 418 7978 5723 4349 -163 -14890 -10484 -1223 -2375 -3274 -5128 6853 -3718
6375 -3718 -19896 -31055 -14530 13951 8827 -196 -20887 -15270 -14280 -6295 9867 11511 13758 25996
6361 25996 26608 5842 -3918 -5676 7122 25058 26631 21906 4256 -22894 -27932 -28726 -32087 -18325
6347 -18325 -6543 -3747 3639 4059 15579 21895 16038 17802 20195 9512 9471 25320 30586 11232
6333 11232 -9264 -26655 -27598 -26484 -35673 -31582 -24532 -4417 17763 39524 22303 33270 26820
6320 26820 14877 20731 39406 45745 26564 61 -15572 -12302 -5640 -5196 -3414 -14465 -25841
6307 -25841 -34506 -6126 10383 -3450 -25597 -27787 -32649 -21648 -16879 -23035 -25923 -20821 -4969
6294 -4969 6758 15095 -16217 -28569 -23959 -10146 -2163 -8362 1080 8855 5379 -2931 203 16138
6280 16138 17787 -1731 1506 7653 18394 6875 2287 11615 7608 -12867 -18819 -18165 -32721 -27534
6266 -27534 -7136 -2800 8617 6948 9635 26003 44521 38229 39561 24945 5266 -12997 -26045
6253 -26045 -4991 932 -13258 -3820 2048 6843 14711 32414 24783 16792 20693 42619 51569 64525
6239 64525 70544 67964 51136 31219 13849 18039 24878 30036 29776 30755 44728 52761 42508 9609
6225 9609 -1883 2598 -7978 -26261 -19406 -16125 -10177 -3007 -15346 -14306 -15246 -14899 -2545 15536
6211 15536 11773 16442 20039 -5440 -13591 -20963 -31300 -11317 -11569 -3497 -8241 -26091 -30391 -46720
6197 -46720 -45698 -28462 -8389 -10285 -23596 -20110 -420 -11682 -28078 -19287 -112 20288 30362
6184 30362 35363 20724 -1672 -11701 -16281 -8647 3678 12699 -4924 193 1676 -22851 -30031
6171 -30031 -17053 9853 15883 15256 -15028 -20555 -3557 4597 4002 -4214 -13027 11304 9523 -20271
6157 -20271 -37118 -37246 -25907 -5727 -3409 -28133 -28321 -18130 -15842 -6902 -11172 -9397 -1557 11182
6143 11182 18969 7771 -1774 -15181 4309 23610 23259 9805 -9024 2432 -4816 -8251 -778
6130 -778 14320 14125 8881 40 9093 2300 -4275 9995 9181 16762 2030 13918 23387 23471 4368
6115 4368 9048 20370 11128 1756 -4145 -2287 11799 -9644 -12924 -9114 -4800 -18488 -21167 -15057
6101 -15057 -24417 -28746 -11546 -10271 -14440 -23819 -13552 12279 18345 7445 27225 43315 37181
6088 37181 37636 43872 41498 30554 16646 20959 16605 -5202 -17642 -23019 -3216 -1177 -13422
6075 -13422 -21159 -24940 -23288 -3775 429 -192 3836 -271 9376 5785 2281 17104 34442 27224
6061 27224 4226 -1796 1303 -3359 -18076 -20175 -26132 -22535 -22336 -13410 -14510 -16835 -10204 -9601 -20673
6046 -20673 -25020 -23312 -20380 -29198 -45432 -55676 -33190 -30461 -20352 -16093 -12019 -11047 -9603 -721
6032 -721 13965 11039 16178 4423 -6273 -19103 251 10137 16328 29369 9043 -16334 -18689
6019 -18689 -10308 -15916 -30713 -14468 -10072 -21639 -27360 -27292 1054 2755 -6695 -22026 -34032 -37024
6005 -37024 -35653 -42035 -43851 -27975 -23143 -9111 -3478 -7138 -20515 -15337 -2515 11539 23830
5992 23830 17164 26251 22533 11856 19191 14760 2459 2554 19657 17661 16531 7664 -7019 -6187
5978 -6187 -9099 -19613 -14253 4562 757 -19589 1618 -14240 -36134 -43373 -34044 -29117 -20901
5965 -20901 -10272 11412 -4960 -17796 -21582 -27946 -19993 -9283 1210 17168 21640 26714 30416
5952 30416 18105 17006 17771 9848 1083 466 -4401 -15976 -8937 -3390 7098 14578 16798 10198
5938 10198 14992 32940 33296 28604 9472 -2513 954 3188 -506 -5936 -6154 2076 1579 -11892
5924 -11892 -7870 3782 21437 9797 -5771 -4192 -18159 -20749 -20807 -24615 -20376 -22332 -25428 -21404
5910 -21404 -12661 -10529 -12930 -26967 -35128 -19488 -13709 -13766 3984 15863 21207 16689 8780 -964
5896 -964 -15555 -26829 -14816 6132 15835 34283 34163 11199 -3658 3481 15582 19365 20846
5883 20846 10842 13261 -6761 -11820 -8275 3022 -1268 906 11779 -1454 -14881 -2422 9852
5870 9852 7848 8628 25569 19976 166 -7582 -217 -4116 -8676 -695 6323 15151 2394 -14918
5856 -14918 -17398 4082 -2630 -3559 -9018 -14529 -13929 -12100 -1338 619 12026 8290 6501 -6103
5842 -6103 -11780 997 -4856 -3804 14843 13013 18369 15968 12838 19615 22513 12377 -1841 3666
5828 3666 5664 12687 9667 3486 1562 -2976 -13884 -15464 12232 18891 15812 10794 -13840 -16481
5814 -16481 -18233 -31126 -17373 2614 -9418 -13493 -195 -6285 6510 17127 11911 13199 5114
5801 5114 8392 2864 9221 4329 -4764 -3488 275 572 -7087 -14737 -7934 -8985 -8907 -1177 -15659
5786 -15659 -2263 37695 49621 18757 -2974 -11658 -12948 -25305 -7347 5423 -7307 -1177
5774 -1177 10089 7028 7093 23455 26621 14238 -3432 -7777 4466 -12057 -24574 -4013 10560
5761 10560 23176 44234 43512 12990 -2115 -1404 18777 36456 20717 16214 8697 9919 6477
5748 6477 7671 21745 25136 11976 24245 23644 18771 16334 1014 18548 -2899 -30906 -20733
5735 -20733 -711 7921 5734 -9196 -26097 -32752 -19797 -29754 -21669 1381 2810 -4597 -7578
5722 -7578 -387 1585 10342 23351 18551 19038 14054 14432 18174 -14964 -21562 -15177 -10585 -2468 5274
5707 5274 8592 17555 16294 1709 3775 23101 8443 -9112 -25305 -18570 -20565 -18967 -7093
5694 -7093 -3659 -8176 -697 -264 -13588 -13044 -16698 -12228 -4510 -13974 -10965 -7271 -1366 4978 -1171
5679 -1171 -10761 -9813 -28417 -29767 -25628 -17731 -26175 -15618 -19093 -23194 -14346 1664 -128 -12665
5665 -12665 -22533 -19392 -14649 -6705 -9878 -17567 -23250 -9882 -12711 -17397 -16445 -9205 -6348 4072
5651 4072 5874 -4885 -19102 -13935 -13143 -19494 -12645 -4197 267 -7013 -8626 -13769 -12159 -3295 8945
5636 8945 14155 27463 25185 18907 33152 20077 11985 20275 27073 38151 52084 34579 22364
5623 22364 12127 -1047 -15464 -26029 -18753 14574 22654 27996 19712 7444 6201 17884 35518
5610 35518 22924 12626 3171 -3933 -749 1522 5427 1811 10639 19830 20790 2195 -6607 -3824
5596 -3824 -19932 -9297 8937 13557 9713 -10291 -19133 -22606 -4337 -373 -7921 -8586 -7020 -10936
5582 -10936 -5621 182 -5756 -8905 -1957 -1529 -2612 1288 6593 20166 37211 31323 28959 16948
5568 16948 10949 1272 -11457 -5048 18963 23885 -13225 -13293 -1566 15921 20446 -990 -22487
5555 -22487 -20516 -9743 53 7663 11390 3916 -10120 11313 26058 6713 -10347 4792 16908
5542 16908 12357 18669 20641 7442 17077 34255 30426 10889 -18742 -23630 -18331 -8 28390
5529 28390 13258 -127 5010 12640 10702 27459 24161 10233 11417 24301 29870 16649 21336
5516 21336 15593 -2651 -10874 -6158 -373 -8389 -9546 -5843 -10581 -17391 981 11879 16949 14931
5502 14931 8369 -384 -8737 -9247 -23385 -22940 -48 4527 -5061 -10483 19006 22703 21128 21768 34553
5487 34553 21502 8122 -10117 -19870 -29495 -39524 -27463 -12564 -6050 -11141 -3523 644 10469
5474 10469 1900 -12115 -9839 -13962 -11003 7621 8630 -6425 -7253 13729 21503 16648 -21060 -21664
5460 -21664 -4411 18972 36711 23191 1893 -11320 -23969 -6986 18059 22312 12405 1742
5448 1742 -5845 8200 18796 12707 6606 13877 13306 -3062 -6634 -17628 -32672 -13096 -9315 -4621
5434 -4621 7524 11443 16962 10589 4153 7415 -1113 -5914 14748 24720 36706 29319 22058 755
5420 755 -4911 -3368 3489 19764 21211 15083 -6356 -8358 3050 -12292 -25726 -29903 -20828 2355
5406 2355 -1954 -9329 -9072 -8918 -13665 -16973 -18637 -11840 9044 18904 7373 -3312 -6554 -2499 -6980
5391 -6980 -9678 2785 14440 19949 27285 35422 30353 8693 -12215 -24150 -15040 -17701 -5334
5378 -5334 8810 4988 -2346 -14619 -29883 -33389 -32512 -30704 -29479 -31659 -20940 -4965 1548 -14755
5364 -14755 -36480 -43358 -32902 -20565 -18096 -8568 -2308 -17437 -5837 -202 9126 18049 19009 4789
5350 4789 -13485 -16335 -16423 2823 16675 9884 16342 20792 17738 3621 -2564 10625 17811 10710
5336 10710 18534 13121 1741 4516 12873 20899 28260 18921 9562 -1518 -23522 -26678 -16707 6285
5322 6285 370 -9477 456 19638 30805 14697 15105 16343 13926 -2944 -12363 -3258 1299 7720
5308 7720 26189 30947 20166 -12746 -16290 -14381 -21147 -8869 -5593 6159 21823 25570 15956
5295 15956 21832 22747 21170 12035 17498 7226 5498 18892 31171 43912 34946 10485 -15994
5282 -15994 -13421 -8519 -35118 -45986 -16175 -11500 -26085 -28808 -24843 -5271 5195 10676 34013
5269 34013 44139 30097 21378 3622 1058 2504 -7770 -11892 -5324 -6511 -28931 -43399 -33141
5256 -33141 -29295 -28415 -6211 3663 -9811 -30250 -23006 -33274 -47900 -40928 -30522 -12159 -7537
5243 -7537 18472 26558 13275 18443 18607 26893 32028 26119 960 2638 5446 11170 17979 17359 27595
5228 27595 18572 12450 2522 11727 8313 -14919 -28714 -28438 -35516 -37427 -15751 -3168 248 4684
5214 4684 -4149 -8879 -6586 -20377 -30699 -23934 -19476 -2252 -7577 -435 2142 7896 12892 6479
5200 6479 10458 7330 -7531 509 -10350 -20616 6314 14085 -8266 -8203 6316 25662 20021 14788
5186 14788 6210 13368 8688 -15334 -27730 -25820 -5834 953 12327 23650 9899 -4518 -76
5173 -76 4358 1486 -14753 -20735 -20940 -16600 -12439 -25576 -15569 -19849 -36409 -30799 -20211 -17230
5159 -17230 -28099 -34834 -24775 -13636 11322 26928 26449 11860 -7641 -2842 4419 19909 6509
5146 6509 -10799 -2286 21628 3363 6045 19358 33114 34061 15090 5173 5013 -11464 -4022 -3678
5132 -3678 -8528 -15105 -10624 -11930 -14717 -9437 -23532 -49166 -42918 -19755 -1550 10698 -1241
5119 -1241 -15950 -19217 -20249 -16931 -17302 -4568 15186 31294 26503 21200 21320 13177 -3857 -18158
5105 -18158 -3895 6733 18762 32960 47140 26442 7602 -8651 -12368 -18302 -13502 14170
5093 14170 20325 6515 7362 2955 6444 26193 36279 31830 25380 18145 10993 16266 8276 15292
5079 15292 22707 25207 -14057 -27223 -30898 -25251 -23203 -20491 -31271 -22512 -12354 -3842 -16442
5066 -16442 9350 21967 12640 -1126 1979 -1015 9417 11562 9992 18807 28278 30819 44485
5053 44485 36663 28223 8392 -6490 -5535 -9461 -9887 -22604 -12643 6287 9280 10758 17421 15854
5039 15854 24764 28990 24553 5656 -4235 -16993 -8462 -12577 -12389 -10319 1709 6137 25616 28646
5025 28646 15834 8801 8139 4446 4903 16831 14783 10813 9489 2702 -4910 7755 10961 19331
5011 19331 26971 38735 15818 277 -9460 -3669 70 -10350 -26087 -7686 29182 20546 2322
4998 2322 -10861 -698 1075 8756 -14890 -14941 -26055 -12043 -888 14430 -995 4123 7147
4985 7147 -8760 -9641 -513 22533 21175 40477 39171 21428 6425 1833 -263 6567 -3662 -5641
4971 -5641 19517 43581 30995 22312 25699 34064 29625 30708 20554 12270 3654 13924 30596
4958 30596 28229 14625 12414 8220 4156 -4011 -5113 1214 22035 20009 -998 -18800 -18381 -24075
4944 -24075 -15592 -3876 -145 6352 -6240 -7239 22568 31040 18590 -10062 -2909 20646 10828
4931 10828 17896 15301 -2047 -3036 3947 16795 17275 9048 -2837 -2983 -14085 -4350 -5509 -21562
4917 -21562 -20286 -5790 -2242 -3469 -4974 -13571 -7629 4027 -3916 -4724 -2228 -1019 14786 5686
4903 5686 4709 16251 10820 7198 7784 6609 -3008 -2920 -15926 -23986 -15761 -15257 1074 6901 8477
4888 8477 -15350 -42635 -47501 -34928 -37609 -15562 21967 18996 12608 18518 -6439 -13957 -10051
4875 -10051 -10717 9165 18263 15440 913 17584 14286 2921 -1051 -10470 -6356 5056 5679 5121
4861 5121 -7140 5988 22815 2384 -18182 -43068 -40256 -24499 -19962 -31199 -21498 -11608 -295
4848 -295 7000 19939 33644 21057 336 -14322 -19859 -20589 -26264 -36228 -32102 -19096 -1874 9004
4834 9004 8984 15558 22270 27759 5980 -19477 -24925 -2261 6852 2812 2747 10571 20667 16373 22776
4819 22776 20988 20809 8499 5222 -13387 -18021 -12235 2187 8617 12882 17920 10092 18324 12012
4805 12012 7296 -14970 -21101 -28347 -11537 -3275 -349 4418 14211 14505 15861 256 -20587 -9376
4791 -9376 -3235 -4634 -16432 -23762 -8098 1840 4126 14372 33761 17448 12820 20614 4667
4778 4667 14712 22597 -2143 -15848 -22634 2872 11526 5322 1935 6161 12549 4285 10607 6908
4764 6908 2596 13131 9448 -15147 -29029 -17808 -14768 -22812 -26144 -9199 -12404 -9212 -6185 -478
4750 -478 9063 35905 44670 42965 30731 13775 17196 8143 -3243 8804 10326 20147 24349 20495
4736 20495 9090 7965 437 4289 -7767 -19742 -21749 -15645 -1311 10506 21834 7610 761
4723 761 -6692 -12641 -16176 -25038 -8392 2933 -24074 -21026 -27549 -20213 -33212 -44293 -29669 -24408
4709 -24408 -40730 -35759 -22971 -12608 -12920 -10010 -8578 17112 15730 5333 -1447 -4891 -25111
4696 -25111 -26189 -6676 -1744 13063 14445 6540 -1070 -6606 10584 20555 -114 -23779 -21379
4683 -21379 22226 40146 26196 2964 -1295 20413 35830 21202 18467 -1207 10346 -17764
4671 -17764 -39181 -36653 -41616 -35746 -26503 -26599 -17684 -5397 -18579 -31762 -40727 -30720 -20285 -11901
4657 -11901 -22133 -31306 -40618 -51450 -34292 -15346 -21192 -14799 -4070 -4612 -4213 1429 -7745 -12853
4643 -12853 5283 -4293 -22140 -2560 -3012 -13184 -4221 -9938 -8565 4100 -9583 -2501 17940
4630 17940 21182 2707 -12448 -20068 -7628 -9771 637 184 1527 5920 21915 26480 13505
4617 13505 9112 -4580 -12785 -4651 -5202 -7686 -4518 -3589 652 3125 -10343 -19337 -18371 -28300 -20296
4602 -20296 -19916 -29818 -31128 -30246 -24765 974 14783 5082 -3122 7048 4630 79 -21978 -27540
4588 -27540 -17288 13955 21717 27820 26164 24967 10206 399 4202 6371 12173 18937 -273 -2987
4574 -2987 -1782 6815 -2652 -4874 -23259 -17238 -11049 -2924 2005 -11598 -25610 -32930 -34735 -44835
4560 -44835 -30880 -21169 -10354 5761 -11488 -11763 5077 -4946 5563 30073 29868 3167 -3552
4547 -3552 -8817 -1856 -6717 -2704 -6516 -731 19353 27207 29259 17867 13214 8931 7412 -479
4533 -479 -17033 -28534 -30883 -6895 -9113 -3115 -10077 -14669 -14501 -6147 -9213 -13512 1341 -1547
4519 -1547 -23759 -24314 -28701 -24912 -13070 -16464 -11329 -1849 -13552 -20698 -9279 -12800 -3767 -12806
4505 -12806 -5296 -1986 -12020 -25522 -23095 -9741 -3194 11206 15360 12164 -13717 -36123 -42419
4492 -42419 -32025 -12677 15172 4854 -9643 212 -10579 -31687 -37150 -28111 -20548 -21983 -24535
4479 -24535 -18790 4922 20093 20033 20616 11174 -1016 -4916 9221 11193 9553 6513 -2062 -3501
4465 -3501 645 -19637 -6320 -14604 -14982 -14867 -12817 -23574 -11965 5155 10447 7459 6885 -10384
4451 -10384 -17026 -8581 -4845 -9904 -13774 -212 18521 -5055 -25986 -33240 -30743 -18781 -18795 -2856
4437 -2856 -1223 -15353 -23579 -16034 -18104 -11014 -6605 -2035 23562 28383 12150 13926 11345 3565
4423 3565 11182 25527 25255 5856 -4020 -7166 -3343 689 -14436 -11808 -17872 -18272 -1701 -5531
4409 -5531 -11525 -21380 -28928 -23395 -18529 -3876 4844 16793 10634 3160 -4151 -27361 -22959 7622
4395 7622 19618 15165 25668 33863 19985 18255 13180 9786 15197 23529 36455 40362 50818 44043
4381 44043 30888 13327 6076 6764 1329 -20833 -27307 -21905 -4362 8785 -7091 -20491 -6499
4368 -6499 17987 34989 14064 7525 8896 3991 -660 7977 14603 701 -18234 -2410 5023
4355 5023 -11899 -29307 -16254 -8949 -7804 -4685 -25291 -20749 -7226 -958 14779 20740 19104
4342 19104 30205 35371 22372 24644 28634 34500 31803 8078 1185 5013 -2640 1930 2512 9103
4328 9103 13530 1157 -336 7129 15072 21434 35899 37597 16689 -9363 -13428 -10479 1006 2296
4314 2296 -3706 -12173 -12037 -8289 9975 39716 50546 31695 23625 17129 -3287 -12140 -28066 -22205
4300 -22205 -16561 -4752 5108 -2209 -11272 -3423 2258 3134 -1732 -661 -7594 -455 -11080 -29906
4286 -29906 -18732 -1723 12992 28953 35939 44578 22779 12012 785 2785 14525 13970 -1040
4273 -1040 -2752 -6851 -14165 -20736 -22147 -35565 -30227 -18661 -8010 -10513 -10201 3421 -4713 -21190
4259 -21190 -28468 -20184 -2744 14742 16350 8778 3087 29967 38128 32410 18566 8893 4045 7570
4245 7570 -5337 -14738 -12611 7472 7570 -10263 -35886 -36747 -29324 -31173 -35299 -26909 -7880 -10924
4231 -10924 -15686 859 4625 -1427 15626 23751 30295 26379 7879 -499 7082 17054 22658 36252
4217 36252 45348 35565 24223 16946 17608 21318 9974 11509 19444 -1180 9374 592 -29080 -26336
4203 -26336 -10541 7171 36848 30304 26121 22641 20065 5203 265 12840 17188 18939 18198 11439
4189 11439 9177 15238 20426 -1467 -15429 -6446 -1579 -24265 -15391 -16073 -23219 -32612 -37564 -33746
4175 -33746 -4695 12847 -6992 -27132 -30002 -13656 -3159 -10564 -21630 -10801 -12267 -21159 -20268
4162 -20268 -31042 -19221 -6051 5717 4008 -8207 -25285 -13509 12429 22049 20667 17352 10420
4149 10420 24804 33934 45926 23290 13286 19847 13027 -2716 6283 3506 12996 8359 38922
4136 38922 38325 25399 24957 26493 32722 13619 2611 -15053 -8978 -17868 1440 33867 32772 43433
4122 43433 32583 -4893 -22758 -21786 -16106 -7207 -8494 -15035 -12399 -24306 -23108 -10832 7822
4109 7822 -1211 -6542 -9550 -10645 -4482 889 -5969 6687 7360 1578 6021 217 -3911 -8049 13684
4094 13684 20068 21318 26266 30193 41940 41991 29969 23211 -2827 -12129 -7140 9109 1516 -2688
4080 -2688 5405 26926 27206 -3974 -37938 -36436 -2547 13195 18332 19867 29062 36574 28447 37680
4066 37680 39453 21364 1258 10350 17239 4557 -5601 -5179 -97 -18333 -34246 -40087 -33633
4053 -33633 -37714 -30418 -11455 -5752 -23120 -9349 4031 -1698 -23618 -26370 -1210 11889 25179
4040 25179 16145 -117 12612 9323 4627 -11483 -16804 5977 12696 4837 -11690 -13692 -6681
4027 -6681 -1580 -4285 7780 17528 8266 -7569 -22623 -26915 -26174 -16537 -18009 -22052 -8451 -9610
4013 -9610 -6298 -14621 -27680 -33636 -10549 -4255 -8021 -9074 5584 4373 15813 17546 10965 5299
3999 5299 10901 21342 25727 15080 2729 308 15730 4811 -9468 -6384 -13564 -4134 -2216
3986 -2216 -11889 -9289 -942 -6212 1064 -7399 -2456 7081 15540 24243 22295 3515 3365 7094 799
3971 799 7270 20426 16687 10655 -8265 3892 17853 20594 5388 -24308 -28594 -33043 -33078 -28434
3957 -28434 -13184 -2671 -18318 -7807 -1412 378 5078 1139 -4676 5302 3837 -1364 -2649 -1922
3943 -1922 -9159 -11547 -8611 -99 -1029 -3806 2414 216 2608 -8851 2974 9721 11122 -611
3929 -611 -7089 -2141 14352 2154 -2700 1835 -22473 -16158 -6291 -8266 -737 -5056 -12044 -201
3915 -201 20626 31976 23156 17904 5247 2250 10592 10061 6574 3308 5477 4314 14799 17614
3901 17614 11582 6 3050 -2095 -710 5921 14482 18352 2206 1334 7916 -3318 -4724 6149
3887 6149 16736 22882 27533 40512 15909 -5226 9874 9195 -243 -6459 -24727 -24008 -15635 -10803
3873 -10803 -5327 4046 5988 1955 -14506 -15165 -9581 -14772 -19399 -4819 -6998 -8462 -5725 -3320
3859 -3320 -16886 -26678 -37321 -24790 303 6946 -13664 -10748 -11495 -19618 -14059 -15704 -14489 -7950
3845 -7950 -3241 -5730 15351 -733 -19971 -3423 15942 12045 9104 -8486 -11822 -17401 -23556
3832 -23556 -4984 11136 5302 5897 2565 4726 18997 10437 13793 19038 15458 9688 2436 -19575
3818 -19575 -21129 -6214 -4779 -9327 -13594 -18577 -9032 -11549 -25429 -26847 -32031 -22328 -21151 -18666
3804 -18666 -802 22782 34608 27207 7168 -16241 -1525 12551 17886 18232 2520 -6868 -7173
3791 -7173 -11114 -17220 7459 12543 10245 -5184 -12029 -6344 -13753 -16784 -6116 -4052 -21520 -28326
3777 -28326 -19700 108 10571 4257 -9648 -16030 -10053 -14745 -33077 -29565 -32025 -37934 -22358
3764 -22358 -5789 -3967 -5128 -5024 1815 -5773 917 18039 15098 26837 46103 30994 21022 3116
3750 3116 -25694 -23540 -6302 1952 3229 9159 3400 1891 6670 -1784 -19150 -17487 9922 37691
3736 37691 33633 16764 8021 -8141 -24518 -17232 -8882 -20167 -35789 -35307 -22658 -17876 -18557 -14743
3722 -14743 -134 3317 8493 4668 -5739 -10904 -1048 398 14768 31571 25394 26124 25873 10318
3708 10318 -16482 -23752 -7266 393 9049 14972 12095 8623 -7187 -23220 -29492 -34139 -13301
3695 -13301 -3764 3058 4788 10343 16593 7379 -4785 -15637 -26972 -31176 -32201 -29295 -23711 -18892
3681 -18892 -11223 5627 25778 16390 8611 26200 27312 30907 25704 26336 12731 -8320 -14357 -20230
3667 -20230 -23865 -3555 22578 15359 16705 14698 8504 -8934 1213 15323 13216 -5789 -20582
3654 -20582 -3258 -8097 -13540 -9300 13848 4535 -8358 2556 3252 1417 -6527 -19289 10192
3641 10192 28646 31927 24130 9059 7775 2725 -9762 -19006 -19701 -5116 -5605 -5333 9105 24208
3627 24208 25699 11327 7155 -3257 530 11577 21092 4926 6220 17130 15880 -5091 -26354
3614 -26354 -29094 -34325 -9789 -1822 -11263 -18109 -15390 7172 -2020 -7200 6880 9864 -3805 21241
3600 21241 29024 4072 -5568 504 6978 6643 7532 5429 -7105 -12768 -17790 -10061 -22465 -36879
3586 -36879 -17337 -3169 11782 5485 4307 -1757 -17378 3316 17519 15295 14217 6320 -14884
3573 -14884 -20483 -5155 10684 8320 2840 237 -2816 4283 -1346 -16835 -39126 -33098 -17151
3560 -17151 -6232 -8493 -24352 -16627 9080 20207 3666 -9908 -17465 -13614 -9495 -21191 -18687
3547 -18687 -15315 -1602 7659 11384 7191 -12119 -14290 -15171 -12424 -20311 -26896 -39019 -26211 -13059
3533 -13059 -2151 2169 7143 669 -4985 -7047 -163 -11194 -17710 -20233 -16249 -28837 -25619 -22321
3519 -22321 -32475 -42516 -43478 -40127 -25022 -22231 -29886 -16838 -938 3901 -4583 5402 18865
3506 18865 35303 47990 46818 26072 24926 31765 20330 22499 2577 -3971 -706 -4775 -6206
3493 -6206 -16013 -14234 -14468 3053 8827 8297 -2829 3758 8171 3363 1849 -3859 -678 9255 -8383
3478 -8383 -6416 3126 -15061 -13912 2882 13630 13427 13539 -2910 -1257 13087 6039 -6475 -17449
3464 -17449 -11072 1325 9487 12500 4159 8301 7451 3590 -351 -5267 5096 14585 24537 32508
3450 32508 25521 26206 37125 30896 23871 8815 -2544 -11581 -12445 -10868 -7 19978 27327 22338
3436 22338 13188 28829 23135 7411 9546 -2288 8237 19990 24420 17732 13783 1274 2749
3423 2749 8155 10730 18174 -5784 -3602 -2775 -8139 1890 9356 -333 -15211 -17116 -10021 -6063
3409 -6063 -4051 18929 33034 27150 26922 18475 12665 4783 -1407 -10696 -15030 -23237 -17470 -25610 -16111
3394 -16111 -7717 -6988 -19270 -12004 0 -2090 -23723 -19051 -23397 -30900 -32680 -46040 -41586 -32448
3380 -32448 -22183 -13337 -10872 -2834 21542 21198 689 3848 4901 4097 9711 21695 21812 15472
3366 15472 2777 8076 22514 9531 20130 28625 22934 -901 -17758 7274 38139 43503 50827
3353 50827 22919 11945 13233 10422 31621 34340 18824 19823 36830 28879 12742 18879 24204
3340 24204 30464 3175 -14421 -20883 -11367 -5716 -9748 670 2398 9111 17010 20619 23896 4273
3326 4273 -4347 7934 6903 451 5395 11275 21932 23972 9759 1051 -2331 6008 6291 -5874
3312 -5874 -18438 -29026 -27782 -20190 -13466 -14783 -21185 -28073 -35783 -49775 -43404 -36967 -16244 3624
3298 3624 7012 -15795 -27110 -15729 -4169 12504 26729 14780 -7290 -13979 -12933 -7533 -5203
3285 -5203 -8656 7244 -2242 -3895 -3569 -15836 -11344 6838 -8846 -33262 -8063 19 21803
3272 21803 33504 6923 -18851 -14852 2314 13898 32075 39015 32666 21897 15254 17025 18948
3259 18948 33200 24021 26436 12804 15238 40065 45527 27542 3118 -5584 -6261 -16520 -12319
3246 -12319 -5918 285 -2763 -7313 -17978 -4478 9634 17547 26907 2468 -12158 2881 22860
3233 22860 33764 20727 -5746 -20821 -12805 4620 9721 -16820 -33060 -20402 -26448 -27955 -7604
3220 -7604 14858 21384 40626 45564 29358 12328 2257 2406 15036 -1104 -8080 -8580 -8121 -8161
3206 -8161 16875 39298 30973 24616 21093 23228 24804 26824 943 -14406 -17536 -21796 -19792 -21096
3192 -21096 -8102 -1988 1922 -4221 11601 18036 14235 5688 6274 27993 27752 3206 -9751 2029
3178 2029 -6157 -10944 -18460 -12959 -6208 6141 -1000 4757 131 5102 2914 20972 19299 3531
3164 3531 5034 6608 -3462 9277 40901 59537 56843 21364 11875 13502 38829 32515 26151
3151 26151 16596 3966 2226 -12367 -11491 -30741 -33739 -27384 -24375 3784 20096 29755 28359 11993
3137 11993 -15171 -28631 -22433 -13650 -5350 -3194 -2733 -1016 -16981 -20767 -7362 -10377 -16986 -15792
3123 -15792 -23635 -20050 -4488 7989 -4025 844 29684 28585 22108 17355 12545 19628 25650 33351
3109 33351 25117 21640 18782 3633 -18966 -30830 -26420 -21142 -8293 -12695 -21068 -14857 -12239 -16887
3095 -16887 -15347 3329 10901 8653 7223 -10787 -22135 -23886 -33979 -32391 -27503 -2945 14779
3082 14779 405 -7083 77 -970 -11888 -13794 -3975 -8170 -7306 -10901 -18815 -22586 -7900 -2734
3068 -2734 -1003 -3242 -15154 -34147 -29715 -17202 -18408 6051 23860 22721 32571 46754 36179
3055 36179 9883 8225 21097 40524 33646 22433 18748 9258 3657 -22712 -24210 -11160 2903
3042 2903 3153 -2152 -7790 -19888 -23783 -17987 13285 11359 15032 15950 6330 4646 8244 -10939 -1669
3027 -1669 -22082 -29285 -5856 10657 15455 6637 -16584 -15698 -29885 -58968 -62366 -35561 -36465 -22996
3013 -22996 -12811 -2251 -4490 -11377 -16605 -28971 -15907 12733 3183 -226 1973 -17124 -23934
3000 -23934 -16577 -15978 14023 19490 23585 14735 11606 3649 2205 382 6313 6428 14529 12376 15459
2985 15459 9398 -9662 -28324 -39147 -40505 -40659 -17309 -29534 -26402 -4952 7472 10058 -2448
2972 -2448 -732 -10576 -7561 -11132 -13235 -20941 -23114 -28191 -24669 -5759 -2772 -19842 -27655 -29154
2958 -29154 -19547 3905 3931 6985 -3637 -16100 -11833 5303 1724 4733 19188 17175 35355 35318
2944 35318 13107 19520 -8215 -8849 5286 7933 8968 -1351 -17738 11107 25968 7439 -2419
2931 -2419 -6454 -3248 -7247 3730 4849 -5045 -26969 -37167 -18165 -19653 -21385 -11885 9629 8156
2917 8156 -1624 -16017 -8545 -8773 -8207 -6111 -19252 -23578 -14276 -6039 2806 -12096 -23402 -16164
2903 -16164 -1001 1458 1171 6591 8100 11741 9010 -5797 -19916 -15300 10732 29065 26662 23014
2889 23014 8258 -5865 -7341 -19373 -39366 -18770 -9410 -4525 1067 13329 28875 25168 8961
2876 8961 9732 11461 14552 17490 6105 -4528 10959 15490 5806 8009 2225 -1239 -3024 -10127
2862 -10127 -8114 -12309 -9661 -4125 14901 -320 -3514 -11846 -38149 -54168 -36754 -23728 -19906
2849 -19906 -34592 -28020 -30957 -26381 -37733 -32251 -22131 -7619 -16671 -10822 -6673 361 12391
2836 12391 20077 10883 -233 -24543 -30110 -33710 -32423 -33396 -32944 -22327 -19007 -12597 -12524 -23909 -10729
2821 -10729 -14443 -12440 5776 16859 25177 21957 19070 7011 -17022 -25692 -15622 -10075 4380
2808 4380 16194 21375 13344 24947 7300 -24661 -25751 -15603 225 15648 9669 9070 11035
2795 11035 13056 -366 -7835 12258 -5301 -14967 -13727 -19360 -18167 -16407 -27306 -31164 -24890 -15153
2781 -15153 -11873 4199 21759 24505 12433 12656 -378 -17838 -23580 -3819 13434 24061 9689
2768 9689 -15491 -19672 -5373 19275 32904 23416 640 -9801 -19496 -1119 22107 28148 18529
2755 18529 -2004 -19035 -11503 6918 18802 8954 -4951 -28083 -23507 -12743 -17812 -9220 -19732
2742 -19732 -14073 -15001 -20355 -12578 550 -11904 -10374 2882 -15021 -23104 -5699 4434 16428
2729 16428 18252 8221 -345 4099 22657 12247 16201 12809 601 17171 25448 32265 30017
2716 30017 18844 23323 28001 26047 18760 8011 -13113 -17220 -18959 -20309 -17443 -13892 -2052 -17662
2702 -17662 -32484 -9265 9467 5185 -2799 7003 7056 1408 -25083 -26686 -13089 -11704 -5278 67
2688 67 1985 4568 17328 26937 13383 15715 27585 11014 -11612 4476 19447 12305 6459 3277
2674 3277 27037 15332 3947 -209 -2174 6989 15447 6464 -3934 -11497 -10037 -22394 -32439
2661 -32439 -47495 -39136 -24203 -13251 -12687 -7794 11483 9074 21260 27543 13246 8417 8788 10964
2647 10964 1925 6214 24265 28342 22651 11118 -3933 -9060 -10970 -16626 -29010 -37255 -20323
2634 -20323 -4071 -2671 -17733 -6521 12934 21875 23618 19406 31144 48431 33433 22558 32172
2621 32172 33431 25009 -5519 -5635 -6887 -11930 -3673 4016 -415 -11929 -16077 -4334 -5968 -736
2607 -736 16879 33643 22091 18752 21752 11286 18332 7067 4740 20754 17774 10871 3039 -9353
2593 -9353 3508 6090 -20161 -33157 -30161 -41026 -45079 -68258 -68498 -37714 -20753 -14011 -13634 -10208
2579 -10208 -18875 -22633 -13091 -16776 -20240 -22226 -27806 -21431 -5610 467 -10489 8064 24534 36224
2565 36224 23630 23409 20593 18727 15839 22655 17648 -1645 2401 -5023 -13658 -18326 -11451 -12344 -15321
2550 -15321 -13129 5020 3979 -11989 -33403 -26044 -13659 -11088 -21541 -5554 11400 3263 -16266
2537 -16266 -16653 -9194 2204 6223 -5124 -2915 -16260 -24670 -20347 -24690 -15292 -2247 1642 -4494
2523 -4494 -8118 -6600 -3784 -6701 8181 9054 3613 -1036 -21155 -14306 -9988 -8999 -6130 -907 -8857
2508 -8857 -14191 -8429 -10735 -4586 1867 11170 22784 14824 -18 2848 12235 9331 6504 10352
2494 10352 10063 4302 10192 12401 5596 8700 8546 -1335 -2282 8977 10495 -5403 -26043 -22903 -13869
2479 -13869 -20674 5508 3946 -4960 -14676 -3959 1496 -3259 6727 -4069 -9776 -19634 -19061 -2471
2465 -2471 14256 15404 -9402 -1703 3322 -13792 -28386 -22280 -10221 -16482 -1935 25604 31077
2452 31077 16431 5581 -8314 -6456 6355 -7192 -14240 -17764 -19852 2611 25410 23181 27141
2439 27141 34855 38829 19708 7375 5126 3379 1293 -8244 4698 11468 9964 -11220 -36273
2426 -36273 -25219 -7256 -14957 -11972 2113 19937 4490 4605 7330 4375 10650 33473 34059 16870
2412 16870 -2572 -11405 137 -12491 -17843 -9271 -5606 -2552 15306 38642 33823 22078 -2275
2399 -2275 -588 1582 1128 10436 9242 -6838 -14667 -10971 2371 -7566 -13283 -10507 -4325 4168 6502
2384 6502 16279 12305 20491 20499 4116 -10642 -9896 10110 -2800 -16818 -7314 -4457 -6895 12418
2370 12418 32973 28235 9630 -1263 -2694 -1290 -6176 6089 32308 32812 24431 26675 28280 26045
2356 26045 3097 -14536 791 2363 22701 31020 20479 1753 -2864 -18153 -20123 -186 17649
2343 17649 16335 -1225 -21521 -24392 -6699 18274 3769 12733 17438 8368 4555 5230 -10202
2330 -10202 -20689 -17555 -19127 -18279 -9244 -20344 -33315 -20499 -9408 10488 11433 -8239 -21616
2317 -21616 -35158 -24007 -3649 -963 -2190 -5670 -12755 -23718 -9701 -8480 -16044 -30159 -18368
2304 -18368 9297 22985 14125 8335 4373 -629 12278 16545 8364 -1464 1641 10319 2345 -3807
2290 -3807 15714 23635 18931 22131 21431 11050 12465 19916 5968 16140 27188 46902 63796
2277 63796 50641 10433 -9031 -6297 11799 18806 -2313 -1933 -14292 -21577 -7608 1681 12309
2264 12309 35471 24428 22686 22240 35627 36187 9132 1355 -4651 -7595 -10451 -54 -17286 -33350
2250 -33350 -37574 -30438 -9634 -2054 -8284 -11999 -20219 3445 19221 33864 28458 14025 16271
2237 16271 10076 11999 13618 -8849 -22256 -5663 27743 38492 32086 38424 57045 57111 39332
2224 39332 31194 22685 31703 38263 36478 30998 18035 4062 8687 7299 12939 -327 -11568 -11652
2210 -11652 -1842 -2976 5024 15627 11736 13815 7422 5620 27530 16866 7319 10764 18124 26593
2196 26593 21164 12098 -1615 8866 25047 23745 26491 38032 51727 36617 -193 -15434 -13401
2183 -13401 -17312 -19838 -24251 -21687 -16837 -24254 -37587 -28933 -1520 23673 40684 36233 46489
2170 46489 41024 36786 19585 8934 -3037 24841 39270 27287 18610 23021 6974 1536 -6000
2157 -6000 1168 9486 -1611 -4783 -19253 -17232 -33923 -13981 8529 11615 1254 26561 35413
2144 35413 15719 1674 5495 10615 27389 12164 9208 25960 26191 19884 4829 -9282 -22192
2131 -22192 -16954 -10600 -19393 373 19637 9892 15043 7532 -13322 -1675 11563 428 -18039
2118 -18039 861 20893 24203 27952 19958 25431 21138 12992 17315 11449 10062 8140 6746 -5006
2104 -5006 2145 -7305 -30881 -28481 -12496 -6566 -3071 1273 -14610 -11551 -4085 336 -2074 -10370
2090 -10370 -12563 -7060 -12345 -8345 -15582 -10995 -16944 -19060 -20265 -29704 -8555 5589 5781 8752
2076 8752 6820 1488 4282 -8742 -6055 14732 17987 -3487 -2645 5847 14124 9958 -1402 -13290
2062 -13290 -11418 5394 14260 24113 9371 -4877 -12703 -16098 -22111 -22878 -20777 -22007 -16222 -14217
2048 -14217 -16256 -4503 6232 -4586 -12512 -8699 -2843 4171 9157 5616 272 -11842 7231
2035 7231 21282 30578 11024 -10745 -997 -7494 -6548 19723 21496 34483 33145 12880 -13736
2022 -13736 -8614 -3667 -8874 -5562 -7657 -11810 9490 25839 19188 34069 36270 17737 -3731
2009 -3731 2361 4387 17698 2932 4702 -10157 -15588 -6650 -7834 -15072 -8422 10889 20274 25702
1995 25702 18347 11841 15432 10380 4397 -19509 -28493 -46802 -43463 -26157 -12754 -2490 7251
1982 7251 3637 -99 -9442 -9519 -23028 -15512 -162 -3145 -6691 7191 5151 49 -4192 16781
1968 16781 23526 643 -9400 3541 10003 10184 19647 36850 28838 12096 -14688 -24719 -17351
1955 -17351 -4945 2300 3901 11389 22418 8306 7285 -4217 18775 18731 40544 50321 27742
1942 27742 9006 16459 10763 -8899 -19903 -112 10547 10417 16176 17276 16402 5553 10578 16753
1928 16753 17538 9186 -6160 -1681 -12461 -16746 -628 8729 6582 14956 28013 35393 32401 5364
1914 5364 -8244 -9922 -7885 29844 46655 29989 18212 19519 10904 161 2084 -8797 -17259
1901 -17259 -15354 -18469 -12649 250 -6201 -4470 -2691 4736 -4593 182 -952 134 -18246 -30184
1887 -30184 -15112 10478 18355 6779 2392 11005 10673 7628 24552 32789 26040 16309 15955 10620
1873 10620 1056 -16850 -18427 -22618 -21264 -25915 -10948 -30711 -20267 2198 -787 9650 42639
1860 42639 37370 23853 28825 27600 22961 -574 -13207 3270 6180 16741 18122 16394 25181
1847 25181 17093 12630 7565 7857 2682 16928 -5502 -11281 -12867 -18971 7296 27421 23570 33708
1833 33708 13379 -5225 -6831 -11976 918 7469 5830 8344 -7901 -23960 -13402 -6972 -6170
1820 -6170 1377 3828 -4932 -10578 -11862 -4158 9 -4535 -8648 -12385 -10610 -4817 -3696 -18384 -10893
1805 -10893 1114 -3268 -5325 -12674 -3901 11075 -1819 20157 27061 15487 785 298 -16538
1792 -16538 -20852 -22847 -13345 843 -1817 -15982 -28918 -21895 -8719 6772 27258 11664 15905
1779 15905 23344 15362 7920 61 -8161 -8922 -17279 -14234 2918 10698 549 -16070 -24486 -14427
1765 -14427 -2137 -6762 -9464 -30591 -12374 6384 -1280 -19402 -23020 -29240 -27474 -26978 -31116 -41443
1751 -41443 -32427 -29101 -21186 -175 -2262 213 8802 10134 8579 2897 -9609 -2975 -15835 -25511
1737 -25511 -1528 21517 21170 3451 -7962 16 9994 16035 1983 -15730 2704 21267 27781
1724 27781 22793 22750 24428 20689 33287 48432 45252 39539 17271 5661 6575 14936 5177 -9762
1710 -9762 -13311 -471 11197 15142 11712 8960 4497 5267 8784 3888 955 -5356 2929 10199 -14849
1695 -14849 -19937 -11949 -9425 277 18822 21725 18092 6278 -1369 -5013 -8141 4398 8200 3578
1681 3578 -10084 -13348 5172 4530 9636 23155 11227 -12193 -11530 9304 8578 -1055 4706 6684
1667 6684 7078 1501 -1176 -4584 9293 21933 18104 11155 10151 14309 8676 -5230 -5739 1453 -4144
1652 -4144 -13641 -12288 -8928 3965 1124 3686 8725 12625 4972 15217 9993 71 3833 -10363
1638 -10363 -15076 15977 28673 14285 -13008 -19793 -8025 8245 19811 21810 7321 3898 -8590
1625 -8590 -18432 -11873 -6239 400 19925 29643 16368 15457 13613 2832 -4625 16405 27752 10670
1611 10670 -18685 -19561 -17463 902 -2574 2125 -2051 -17647 -3903 3943 -4512 1609 9290 8082
1597 8082 -4354 -5260 -20251 -19153 7764 22456 -3023 -1908 -3368 4594 3831 13176 16755 10667
1583 10667 -6040 -806 4902 13926 6988 1543 1508 11783 16763 20990 18827 15908 14662 30700
1569 30700 34536 19169 31818 37983 19038 22015 8687 -8618 -23363 -33078 -19334 -22632 -18294
1556 -18294 1237 14689 15967 31900 28239 24154 12490 -4127 -15243 -28900 -40201 -35365 -30194
1543 -30194 -25199 -23786 -6392 8746 7224 14597 22215 4384 3958 -3684 1009 -1302 658 14069
1529 14069 7104 -3328 1426 -7465 -10215 8242 18229 18395 15780 6988 6548 11260 18060 21952 16831
1514 16831 -6357 -10511 2884 15275 22439 9087 8314 6314 15644 22476 24284 25745 37441 27921
1500 27921 18350 18561 2766 -4536 5153 23673 27892 29714 12677 -9481 -1232 8029 11017 14497
1486 14497 -3505 -4704 -5098 -11101 -4135 11304 21230 30926 33846 42093 43565 6418 -22076 -9717
1472 -9717 -5172 -2260 -16347 -8541 -9311 -18274 -9038 26092 32162 22292 15355 19382 24656 9883
1458 9883 -6324 2446 13232 33098 24136 15915 -3171 -5663 3991 -8887 -8481 -1616 -3162 -13771
1444 -13771 -20554 -34506 -38741 -32849 -14963 -18563 -14317 -20995 -15058 4084 6363 8388 1441 -16596
1430 -16596 -16204 -4958 -4131 10278 26080 30823 5404 -11907 1948 -1803 -14712 -12738 1697
1417 1697 -6209 -7766 4294 1012 -4060 -8183 -15956 -7940 -13464 -21871 -10066 -9755 -17224 -7647 -8649
1402 -8649 -13089 -25651 -26350 -30985 -38877 -39409 -16918 -14262 -28266 -11277 -612 -3030 3378 17834
1388 17834 24867 19544 12961 4390 -20651 -48545 -43490 -11945 13663 46364 48182 35999 25183
1375 25183 21557 6924 -6924 -15943 -15488 -16168 -19694 -26337 -17338 -21523 -8652 3988 -2681 13854
1361 13854 13851 -1671 13324 19934 4294 -17129 -24227 -28703 -31183 -26729 -28011 -7203 17484 10852
1347 10852 18545 23171 6529 1092 1503 -7319 -11389 -14915 -16153 -23235 -17247 -13185 -15294 -19520 -15822
1332 -15822 12057 9654 -15350 -22021 -16851 -11107 -10215 -1655 3809 960 22765 20753 11766 12226
1318 12226 23345 44639 33820 16043 8081 3244 -6347 -5341 1309 -3512 -778 -28712 -34277
1305 -34277 -14699 737 -4088 -19907 -36864 -35796 -44840 -36085 -20505 -8679 -6217 -17254 -29613
1292 -29613 -18098 -9922 10123 11434 2968 587 24277 18087 -5881 -11760 -20459 -33045 -22797
1279 -22797 -24405 7008 12385 -4441 1273 16464 12878 17686 31471 24796 17358 23071 23074 6020
1265 6020 5285 147 -3853 1299 5980 1190 10365 5915 -4350 -3412 -23714 -29488 -25976 1934 10720
1250 10720 -17481 -21988 -1969 21962 14911 5280 2346 -17720 -17880 8799 7879 -13847 -16622 -3628
1236 -3628 24625 10331 502 -10158 -6957 17901 20775 27850 11176 -12343 -16980 -25488 -25346 -10127
1222 -10127 14446 16429 5662 -11166 -13376 -3801 -5119 -22827 -30803 -36127 -18489 -13374 -103
1209 -103 -1470 2426 -13556 -13344 -6903 9324 15493 7937 6057 -13963 -15669 -7433 -5398 -4464 9442
1194 9442 20049 12339 35807 50274 35113 18259 5764 815 9539 16218 6170 -2595 1015
1181 1015 1127 1623 -12531 -12849 -22605 -11658 -7223 -17500 -14271 -3476 -6183 -14510 -21524 -11296
1167 -11296 -26178 -21822 -1063 -5237 -9861 -147 -6140 -7240 -1228 -2831 4244 32199 47219 33594
1153 33594 30295 38561 33575 16504 -11149 -28441 -43328 -9564 -4611 -2573 -6784 1329 29853
1140 29853 32710 20112 161 -15167 -18938 -8435 -3244 4278 11961 19825 8848 -11324 -17233
1127 -17233 -26091 -25060 -13453 -976 10686 8896 6678 17885 19365 16741 5513 -4893 -7628
1114 -7628 -1424 -3782 -13977 -10603 5577 -1810 -19486 -12443 -16244 -9359 -19359 -23896 -14932 -13827
1100 -13827 -8937 -151 3083 20056 17028 4998 14699 14486 13792 19998 17290 11575 -11555 -16866
1086 -16866 -10287 7919 13424 9949 -5272 132 4390 11959 1714 -17325 -17926 -2138 -7487 -14002
1072 -14002 -34962 -27620 -16004 -4058 -6345 -21198 -6395 -12330 -30468 -24143 -7646 4197 8473
1059 8473 3891 -3519 7901 14726 16714 26244 16644 4655 2195 3515 -8236 -20517 4617 17382
1045 17382 15921 21481 26364 23109 8858 -3854 21 -3749 -5626 -12234 -21598 -9388 -8265 -26665
1031 -26665 -29278 -3428 1429 -4766 -3690 -12887 -3871 -8197 -20366 -15341 3790 5617 11175 -512
1017 -512 -9676 -1531 3147 -1211 -6984 -5902 1150 17734 18631 23151 19146 13908 -9549 -21332 -14721
1002 -14721 -9048 7426 15605 35236 28149 11952 -1729 -443 -2747 -5354 -8607 -12589 -6194 31
988 31 -6603 -10277 -3193 -13845 -38924 -43138 -30161 -28774 -34587 -44751 -29727 -17559 -28155 -21176
974 -21176 -9282 1246 -6508 -9159 -22424 -19209 -8135 1789 4958 -4910 1166 21201 10663
961 10663 1847 3463 -4221 -20617 -25048 -19623 -7113 12811 -583 -10620 -3432 6323 -8497
948 -8497 -15259 -22389 -19817 -15728 -17596 -22414 -19610 -14914 16037 28819 14441 -2234 -3740 8654
934 8654 17085 -1175 404 18455 28244 35123 30627 27457 21979 19334 8580 10795 19151 19524 19725
$$ [...]
##END NTUPLES=NMR SPECTRUM
##END=
