##TITLE=Analysis number 317222
Compound Code ac 31920
Project Code adrs
Chemist Name stores
##JCAMPDX= 6.0         $$ Bruker NMR JCAMP-DX V2.0
##DATA TYPE= NMR SPECTRUM
##DATA CLASS= NTUPLES
##ORIGIN= Bruker BioSpin GmbH
##OWNER= nmr
$$ XWIN-NMR		Version 3.5
$$ Mon Feb 13 09:04:26 2006 GMT Standard Time (UT+0h)  MAYBRIDGE\nmr@NMR_250MHZ
##.OBSERVE FREQUENCY= 250.131544655141
##.OBSERVE NUCLEUS= ^1H
##.ACQUISITION MODE= SIMULTANEOUS (DQD)
##.ACQUISITION SCHEME= undefined
##.AVERAGES= 16
##.DIGITISER RES= 18
##SPECTROMETER/DATA SYSTEM= dpx250
##.PULSE SEQUENCE= zg30
##.SOLVENT NAME= CDCl3
##.SHIFT REFERENCE= (INTERNAL, CDCl3, 0, 16.522)
##AUDIT TRAIL= $$ (NUMBER, WHEN, WHO, WHERE, WHAT)
$$ ##TITLE= Audit trail, XWIN-NMR		Version 3.5
$$ ##JCAMPDX= 5.01
$$ ##ORIGIN= Bruker BioSpin GmbH
$$ ##OWNER= nmr
$$ C:\u/data/dgb/nmr/ADRS/15900/pdata/1/auditp.txt
$$ ##AUDIT TRAIL=  $$ (NUMBER, WHEN, WHO, WHERE, WHAT)
(   1,<2006-02-13 09:03:28.91 +000>,<MAYBRIDGE\nmr>,<NMR_250MHZ>,
      <created by zg, POWCHK disabled, PULCHK disabled
       configuration hash MD5:
       84 BC 41 DB A1 6E 1D 46 DA 25 12 A5 C1 ED C5 3A
       data hash MD5: 64K
       08 6F 8A 63 06 E3 93 E0 DC 47 5D 57 6D 46 2F 3B>)
(   2,<2006-02-13 09:03:58.33 +000>,<MAYBRIDGE\nmr>,<NMR_250MHZ>,
      <Start of raw data processing
       ef LB = 0.3 FT_mod = 6 PKNL = 1 SI = 32K 
       data hash MD5: 32K
       45 BA 1E 17 19 4B CE 43 FA D4 13 51 85 E9 DB 28>)
(   3,<2006-02-13 09:04:01.16 +000>,<MAYBRIDGE\nmr>,<NMR_250MHZ>,
      <apk 
       data hash MD5: 32K
       EE FF 15 C0 FF DF 26 96 7F 27 6B EF AA 55 DE 88>)
(   4,<2006-02-13 09:04:03.00 +000>,<MAYBRIDGE\nmr>,<NMR_250MHZ>,
      <abs ABSG = 5 
       data hash MD5: 32K
       F1 91 44 64 93 27 01 45 1E 10 3C D0 6D 61 2A 2F>)
$$ ##END=
$$ 
$$ hash MD5
$$ 2B 89 C3 5D 96 6D DC 98 CF 67 3C 7B 03 95 ED D5
##$RELAX= 
##$RELAX= 
##$RELAX= 
##$RELAX= 
##$RELAX= 
##$RELAX= 
##$RELAX= 
$$ Bruker specific parameters
$$ --------------------------
##$DU= <C:\u>
##$EXPNO= 15900
##$NAME= <ADRS>
##$PROCNO= 1
##$TYPE= <nmr>
##$USER= <dgb>
##$AMP= (0..31)
100 100 100 100 100 100 100 100 100 100 100 100 100 100 100 100 100 100 
100 100 100 100 100 100 100 100 100 100 100 100 100 100 
##$AQSEQ= 0
##$AQ_mod= 3
##$AUNM= <au_zg>
##$AUTOPOS= <5 >
##$BF1= 250.13
##$BF2= 250.13
##$BF3= 250.13
##$BF4= 250.13
##$BF5= 500.13
##$BF6= 500.13
##$BF7= 500.13
##$BF8= 500.13
##$BYTORDA= 1
##$CFDGTYP= 0
##$CFRGTYP= 5
##$CHEMSTR= <none>
##$CNST= (0..31)
1 1 145 1 1 1 1 1 1 1 1 1 1 1 1 1 1 1 1 1 1 1 1 1 1 1 1 1 1 1 1 1 
##$CPDPRG= <>
##$CPDPRG1= <>
##$CPDPRG2= <>
##$CPDPRG3= <>
##$CPDPRG4= <mlev>
##$CPDPRG5= <mlev>
##$CPDPRG6= <mlev>
##$CPDPRG7= <mlev>
##$CPDPRG8= <mlev>
##$CPDPRGB= <>
##$CPDPRGT= <>
##$D= (0..31)
0 1 0 0 0 0 0 0 0 0.06 0 0 0 0 0 0 0.0002 0 0 0 0 0 0 0 0 0 0 0 0 0 0 
0 
##$DATE= 1139821401
##$DBL= (0..7)
120 120 120 120 120 120 120 120 
##$DBP= (0..7)
150 150 150 150 150 150 150 150 
##$DBP07= 0
##$DBPNAM0= <>
##$DBPNAM1= <>
##$DBPNAM2= <>
$$ [...]
##$SUBNAM7= <"">
##$SUBNAM8= <"">
##$SUBNAM9= <"">
##$SW= 20.6930455092707
##$SWIBOX= (0..15)
0 0 3 0 0 0 0 0 0 0 0 0 0 0 0 0 
##$SW_h= 5175.983436853
##$TD= 65536
##$TD0= 1
##$TE= 294.16
##$TE2= 300
##$TE3= 300
##$TEG= 300
##$TL= (0..7)
0 120 120 120 120 120 120 120 
##$TP= (0..7)
150 150 150 150 150 150 150 150 
##$TP07= 0
##$TPNAME0= <>
##$TPNAME1= <>
##$TPNAME2= <>
##$TPNAME3= <>
##$TPNAME4= <>
##$TPNAME5= <>
##$TPNAME6= <>
##$TPNAME7= <>
##$TPOAL= (0..7)
0.5 0.5 0.5 0.5 0.5 0.5 0.5 0.5 
##$TPOFFS= (0..7)
0 0 0 0 0 0 0 0 
##$TUNHIN= 0
##$TUNHOUT= 0
##$TUNXOUT= 0
##$USERA1= <user>
##$USERA2= <user>
##$USERA3= <user>
##$USERA4= <user>
##$USERA5= <user>
##$V9= 5
##$VALIST= <valist>
##$VCLIST= <CCCCCCCCCCCCCCC>
##$VD= 0
##$VDLIST= <DDDDDDDDDDDDDDD>
##$VPLIST= <PPPPPPPPPPPPPPP>
##$VTLIST= <TTTTTTTTTTTTTTT>
##$WBST= 1024
##$WBSW= 4
##$XGAIN= (0..3)
0 0 0 0 
##$XL= 0
##$YL= 0
##$YMAX_a= 515722
##$YMIN_a= -576192
##$ZGOPTNS= <>
##$ZL1= 120
##$ZL2= 120
##$ZL3= 120
##$ZL4= 120
##$ABSF1= 16.522
##$ABSF2= -4.171173
##$ABSG= 5
##$ABSL= 3
##$ALPHA= 0
##$AQORDER= 0
##$ASSFAC= 0
##$ASSFACI= 0
##$ASSFACX= 0
##$ASSWID= 0
##$AUNMP= <proc_1d>
##$AZFE= 0.1
##$AZFW= 0.1
##$BCFW= 0
##$BC_mod= 0
##$BYTORDP= 0
##$COROFFS= 0
##$CY= 12.5
##$DATMOD= 1
##$DC= 0
##$DFILT= <>
##$DTYPP= 0
##$F1P= 14.0000005364418
##$F2P= -0.99999901652339
##$FCOR= 0.5
##$FTSIZE= 32768
##$FT_mod= 6
##$GAMMA= 0
##$GB= 0
##$INTBC= 1
##$INTSCL= 1
##$ISEN= 128
##$LB= 0.3
##$LEV0= 0
##$LPBIN= 0
##$MAXI= 10000
##$MC2= 0
##$MEAN= 0
##$ME_mod= 0
##$MI= 0
##$NCOEF= 0
##$NC_proc= -2
##$NLEV= 6
##$NOISF1= 0
##$NOISF2= 0
##$NSP= 0
##$NTH_PI= 0
##$NZP= 0
##$OFFSET= 16.522
##$PC= 1
##$PHC0= 96.95123
##$PHC1= 5.99814
##$PH_mod= 1
##$PKNL= yes
##$PPARMOD= 0
##$PSCAL= 4
##$PSIGN= 0
##$REVERSE= no
##$SF= 250.13
##$SI= 32768
##$SIGF1= 0
##$SIGF2= 0
##$SINO= 400
##$SIOLD= 32768
##$SREGLST= <1H.CDCl3>
##$SSB= 0
##$STSI= 32768
##$STSR= 0
##$SW_p= 5175.98343685301
##$SYMM= 0
##$S_DEV= 0
##$TDeff= 65536
##$TDoff= 0
##$TI= <Analysis number 999999
Compound Code 99
Book Reference 9
Project Code 9>
##$TILT= no
##$TM1= 0
##$TM2= 0
##$TOPLEV= 0
##$USERP1= <user>
##$USERP2= <user>
##$USERP3= <user>
##$USERP4= <user>
##$USERP5= <user>
##$WDW= 1
##$XDIM= 32768
##$YMAX_p= 456465015
##$YMIN_p= -440685
$$ End of Bruker specific parameters
$$ ---------------------------------
##NTUPLES= NMR SPECTRUM
##VAR_NAME=  FREQUENCY,     SPECTRUM/REAL,   SPECTRUM/IMAG
##SYMBOL=    X,             R,               I
##VAR_TYPE=  INDEPENDENT,   DEPENDENT,       DEPENDENT
##VAR_FORM=  AFFN,          ASDF,            ASDF
##VAR_DIM=   32768,         32768,           32768
##UNITS=     HZ,            ARBITRARY UNITS, ARBITRARY UNITS
##FACTOR=    0.157963299565203, 1,           1
##FIRST=     4132.6476996994, 0,             0
##LAST=      -1043.33573715361, 0,           0
##MIN=       -1043.33573715361, -440685,     0
##MAX=       4132.6476996994, 456465015,     0
$$ Real data points
##PAGE= N=1
##DATA TABLE= (X++(R..R)), XYDATA
$$ [...]
##PAGE= N=2
##DATA TABLE= (X++(I..I)), XYDATA
18237a4901042M20393L87212L47291L07641K74965K62342K54313K36471K33090
18228a2177324K25999K19155K11308J78840J62860J63225J57038J57754J57827
18219a0543318J46585J44610J49883J51547J44249J36908J21212J15673J13996
18210i318655J02957R6972R6577J02489R1529Q5025J03125J00779Q8429R2633
18200h358140Q8953Q9892P7040O5271O7584O6076P9863P7926O8516Q1187P6173
18189g519659P5083P1197O4603N8892N7661O6856O3047N9313N0581N5526O7141
18178f829759P0526N9405O3558N8566N1414M5584M8850N4307O1107P5314O7328
18167f173800O3020O5988N8112M1957K8768L1952M5227M5518N1831N4159N9692
$$ plain form
18237 -14901042 -14480649 -14093437 -13746146 -13438505 -13163540 -12901198 -12646885 -12410414 -12177324
18228 -12177324 -11951325 -11732170 -11520862 -11342022 -11179162 -11015937 -10858899 -10701145 -10543318
18219 -10543318 -10396733 -10252123 -10102240 -9950693 -9806444 -9669536 -9548324 -9432651 -9318655
18210 -9318655 -9215698 -9118726 -9022149 -8919660 -8828131 -8743106 -8639981 -8539202 -8450773 -8358140
18200 -8358140 -8269187 -8179295 -8102255 -8036984 -7969400 -7903324 -7823461 -7745535 -7677019 -7595832 -7519659
18189 -7519659 -7444576 -7373379 -7308776 -7249884 -7192223 -7125367 -7062320 -7003007 -6952426 -6896900 -6829759
18178 -6829759 -6759233 -6699828 -6636270 -6577704 -6526290 -6480706 -6431856 -6377549 -6316442 -6241128 -6173800
18167 -6173800 -6110780 -6044792 -5986680 -5944723 -5915955 -5884003 -5838776 -5793258 -5741427 -5687268 -5627576
18156e627576O0732O0628N7646M9962M3460M0493L3520L5261M5158M3836M1218
18145e115662N1820O2995O1176N5537N9411M7549M1149M6115N8016O6845O5264
18134d499785O2630M9537L8837L3087L8791N9447Q1947R8044Q0606P0393P4721
18123c811745Q8248R8368J16488J43744J43640J38723J41756J45527J78169K11146
18113b405936K56001L38649M20983N41167P10392Q78236Q50267p4823k208075
18104f93139l652000l177919k407720p61164M94770P36029O41813N19030M16758
18095g883542L45937K96930K50879K06885J72134J55548J40290J31677J25002
18086f058260J15600J08630R2101P7486O8000N8363O1979O3123O5612O5859O7958
$$ plain form
18156 -5627576 -5566844 -5506216 -5448570 -5398608 -5355148 -5314655 -5281135 -5245874 -5200716 -5156880 -5115662
18145 -5115662 -5063842 -5000847 -4939671 -4884134 -4824723 -4777174 -4736025 -4689910 -4631894 -4565049 -4499785
18134 -4499785 -4437155 -4387618 -4348781 -4315694 -4276903 -4217456 -4135509 -4037465 -3956859 -3886466 -3811745
18123 -3811745 -3723497 -3625129 -3508641 -3364897 -3221257 -3082534 -2940778 -2795251 -2617082 -2405936
18113 -2405936 -2149935 -1811286 -1390303 -849136 -138744 739492 1589759 1514936 -693139
18104 -693139 -4345139 -7523058 -9930778 -10691942 -10197172 -9461143 -8819330 -8300300 -7883542
18095 -7883542 -7537605 -7240675 -6989796 -6782911 -6610777 -6455229 -6314939 -6183262 -6058260
18086 -6058260 -5942660 -5834030 -5741929 -5664443 -5596443 -5538080 -5476101 -5412978 -5347366 -5281507 -5213549
18075e213549N2944L2388K6608L0599K8464M1689M8188L7696L1409L2857K4379
18064d826328K4700L1512L3486P710k5976k2692j0664J7753L3031L4966M0180
18053d662322L8377L9230L2318K9434K8031L0105K2432K0383J6154K1371L2642
18042d351845K4263K3420K0091K6556K3021K2896K2921J1712J5181K4465K1033
18031d116286K2407J8099K5327K3145J6794J3034J0996K2126K2225J6280J1846
18020c914007R290K1272K5895K1787J7492J6746J5638J4625J5847J2519J2093
18009c730803J2597J5470P112J1360J6777J7229R501R780R724J4174J7679J9092
17997c570308J7014P670M907R949J7265J9492P978R565J3480J3427J9807J8137
$$ plain form
18075 -5213549 -5160605 -5128217 -5101609 -5071010 -5042546 -5000857 -4952669 -4914973 -4883564 -4850707 -4826328
18064 -4826328 -4801628 -4770116 -4736630 -4728920 -4754896 -4777588 -4788252 -4770499 -4737468 -4702502 -4662322
18053 -4662322 -4623945 -4584715 -4552397 -4522963 -4494932 -4464827 -4442395 -4422012 -4405858 -4384487 -4351845
18042 -4351845 -4327582 -4304162 -4284071 -4257515 -4234494 -4211598 -4188677 -4176965 -4161784 -4137319 -4116286
18031 -4116286 -4093879 -4075780 -4050453 -4027308 -4010514 -3997480 -3986484 -3964358 -3942133 -3925853 -3914007
18020 -3914007 -3904717 -3883445 -3857550 -3835763 -3818271 -3801525 -3785887 -3771262 -3755415 -3742896 -3730803
18009 -3730803 -3718206 -3702736 -3695624 -3684264 -3667487 -3650258 -3640757 -3630977 -3621253 -3607079 -3589400 -3570308
17997 -3570308 -3553294 -3545624 -3540717 -3530768 -3513503 -3494011 -3486033 -3476468 -3462988 -3449561 -3429754 -3411617
17985c411617R242Q813J2812K545Q040J5136O591R991Q954R141J2506Q052J1287
17972c288507J4089J4358R124L468M546Q083J4355J0128K656K1136J7212R272
17960c160080J1828J9003O663P48J4035J4699J2572N606K109Q086J6146J0847
17948c037738K633Q533N909J2997J1959J380R54J352M573L441Q180J4419J0068
17935b951340K2141J0106L244K771Q344J4051Q529J1538J4742M222K840M657J0725
17922b833430J663P563J1163R070O703k989J3467J5086M742M932N930P923J4969
17909b733208J6833Q989M480M85N206Q992J0910K0199J1860J6913J663P862J8341
17896b600475J1543J3437J3291J8643O910N758K253r515j8889k6365l0834l0067
$$ plain form
17985 -3411617 -3402375 -3393562 -3380750 -3378205 -3370165 -3355029 -3348438 -3338447 -3329493 -3320352 -3307846 -3299794 -3288507
17972 -3288507 -3274418 -3260060 -3250936 -3247468 -3242922 -3234839 -3220484 -3210356 -3207700 -3186564 -3169352 -3160080
17960 -3160080 -3148252 -3129249 -3122586 -3121838 -3107803 -3093104 -3080532 -3074926 -3072817 -3064731 -3048585 -3037738
17948 -3037738 -3035105 -3026572 -3020663 -3007666 -2995707 -2994327 -2993373 -2992021 -2987448 -2984007 -2975827 -2961408 -2951340
17935 -2951340 -2929199 -2919093 -2915849 -2913078 -2904734 -2890683 -2882154 -2870616 -2855874 -2851652 -2848812 -2844155 -2833430
17922 -2833430 -2831767 -2824204 -2813041 -2803971 -2797268 -2800257 -2786790 -2771704 -2766962 -2762030 -2756100 -2748177 -2733208
17909 -2733208 -2716375 -2707386 -2702906 -2702421 -2697215 -2688223 -2677313 -2657114 -2645254 -2628341 -2626678 -2618816 -2600475
17896 -2600475 -2588932 -2575495 -2562204 -2543561 -2536651 -2530893 -2528640 -2538155 -2557044 -2583409 -2614243 -2644310
17884b644310j7365p463O099J2754J1209P579J5224J4688J5647J1417J1146Q541
17872b554834R899J4925J4108J1272M644K32Q217Q532L751R967J5041J0981N113
17859b438152M645J9223Q884N250P006P318R708J3676Q287J4100J4534J2311J5186
17846b298024J7157J3101K4483K3102J5619J4828j633k5549m2978n0192n6438
17835b366524n0429l6914k3254K078J2237J5956J8294K1356J7969J4264J5603
17824b359364J3464Q693J1991J7555J4856N357K700J2897J1074J0320J2239L589
17812b234629R810K3998K0800R783N168J6215J2923J7751J4360N276j0707j5411
17800b124663j4805O988J2763J6594R883j2406j2434m779J0604J9781M055k2907
$$ plain form
17884 -2644310 -2661675 -2669138 -2663039 -2650285 -2639076 -2631497 -2616273 -2601585 -2585938 -2574521 -2563375 -2554834
17872 -2554834 -2544935 -2530010 -2515902 -2504630 -2499986 -2499754 -2491537 -2483005 -2479254 -2469287 -2454246 -2443265 -2438152
17859 -2438152 -2433507 -2414284 -2405400 -2400150 -2393144 -2385826 -2376118 -2362442 -2354155 -2340055 -2325521 -2313210 -2298024
17846 -2298024 -2280867 -2267766 -2243283 -2220181 -2204562 -2189734 -2191367 -2216916 -2259894 -2310086 -2366524
17835 -2366524 -2416953 -2453867 -2477121 -2475043 -2462806 -2446850 -2428556 -2407200 -2389231 -2374967 -2359364
17824 -2359364 -2345900 -2337207 -2325216 -2307661 -2292805 -2287448 -2284748 -2271851 -2260777 -2250457 -2238218 -2234629
17812 -2234629 -2224819 -2200821 -2180021 -2170238 -2165070 -2148855 -2135932 -2118181 -2103821 -2098545 -2109252 -2124663
17800 -2124663 -2139468 -2132480 -2119717 -2103123 -2093240 -2105646 -2118080 -2122859 -2112255 -2092474 -2088419 -2111326
17788b111326l5673l7391m0415k3105m378o240o358o491j0666l82R5N432J5958
17775b260940J3606J7792J7463J1124P268J3997J3838R646J2928J2294J4779J2353
17763b103852O958M975R076Q421R640Q867Q994J1935J0084J1676j513m825q256
17750b027820o044J279O355Q928o07n503j1408m125l151l071M11N949n903j2998
17736b057708j534L52J0574R529Q34o453j4987j7106l725R11R765P718N072J0300
17722b046458J4680J3738L29Q448J0904N283O327P921K078L654R535L879P848
17709a951834J1558J217j500P12P826K598J0616K832J493M75P713R437L507J734
17695a891616O984L699j502K216j015L755R499N997K485J4693L037l201p49M908
$$ plain form
17788 -2111326 -2146999 -2184390 -2224805 -2247910 -2252288 -2258528 -2264886 -2271377 -2282043 -2282425 -2282330 -2276898 -2260940
17775 -2260940 -2247334 -2229542 -2212079 -2200955 -2193687 -2179690 -2165852 -2156206 -2143278 -2130984 -2116205 -2103852
17763 -2103852 -2096894 -2091919 -2082843 -2074422 -2064782 -2055915 -2046921 -2034986 -2024902 -2013226 -2014739 -2019564 -2027820
17750 -2027820 -2033864 -2032585 -2026230 -2017302 -2017909 -2023412 -2034820 -2038945 -2042096 -2045167 -2044756 -2038807 -2044710 -2057708
17736 -2057708 -2059242 -2058890 -2048316 -2038787 -2037953 -2044406 -2059393 -2076499 -2080224 -2079313 -2069548 -2061830 -2056758 -2046458
17722 -2046458 -2031778 -2018040 -2017711 -2009263 -1998359 -1993076 -1986749 -1978828 -1976750 -1973096 -1963561 -1959682 -1951834
17709 -1951834 -1940276 -1939059 -1940559 -1939847 -1932021 -1929423 -1918807 -1915975 -1914482 -1914007 -1906294 -1896857 -1893350 -1891616
17695 -1891616 -1884632 -1880933 -1882435 -1880219 -1881234 -1877479 -1867980 -1861983 -1859498 -1844805 -1841768 -1844969 -1845718 -1840810
17681a840810M676k083m533O067P800P07M175J506N367J1140L779l89J260Q174
17667a793164j567r42K764Q51Q351l723L08O039L311J734J1735J4489L577L228
17653a743009L64m133J794M170M34O422P503Q960O896k662N68P097p201L454K383
17638a706960K248L936k211K819N075l925l095Q929O830L103lL796K588J862N265
17623a669743J1499q00n77n086J163M943O27J313J867O350N425L228j505L677
17609a637619J01O056O803Q519Q794J508m545l354N511J017L99M591k343M577
17595a599985J986m493K424N719N595M8r50L342M51J664l2N404J3299L357L07
17580a561864k347K605l576L123Q93K976j273M700K142J352m143J296R608Q89
$$ plain form
17681 -1840810 -1836134 -1838217 -1842750 -1836683 -1828883 -1828176 -1824001 -1822495 -1817128 -1805988 -1802209 -1802598 -1801338 -1793164
17667 -1793164 -1794731 -1795673 -1792909 -1792058 -1783707 -1787430 -1787122 -1781083 -1777772 -1776038 -1764303 -1749814 -1746237 -1743009
17653 -1743009 -1742645 -1746778 -1744984 -1740814 -1740380 -1733958 -1726455 -1717495 -1710599 -1713261 -1712693 -1705596 -1712797 -1709343 -1706960
17638 -1706960 -1704712 -1700776 -1702987 -1700168 -1695093 -1699018 -1702113 -1693184 -1686354 -1683251 -1683254 -1679458 -1676870 -1675008 -1669743
17623 -1669743 -1658244 -1659044 -1659621 -1664707 -1663544 -1658601 -1657974 -1656661 -1654794 -1648444 -1643019 -1639791 -1641296 -1637619
17609 -1637619 -1637518 -1631462 -1624659 -1616140 -1607346 -1605838 -1610383 -1613737 -1608226 -1607209 -1606810 -1602219 -1604562 -1599985
17595 -1599985 -1597999 -1602492 -1600068 -1594349 -1588754 -1588706 -1589656 -1586314 -1585863 -1584199 -1584231 -1578827 -1565528 -1562171 -1561864
17580 -1561864 -1564211 -1561606 -1565182 -1562059 -1561166 -1558190 -1559463 -1554763 -1552621 -1551269 -1555412 -1554116 -1544508 -1543619
17566a543619M794O540N822j800p516j988J1032O523r1O338L409N760M61J079
17552a503256m632k822L375L837J446J344Q851M745L057j898O41p058k219M755
17538a489834P554K361L834O709K896M068Q66l208p36J847M625K466P706J805
17524a447041j029k067j066k939K937P941O719L553k69k926L878J698O787J0474
17510a413350l295q15K445J0172L593K930J627k055k906L515J030Q784Q427J413
17496a378485o580J471m947k079J781N182M694K959M894J735n29j712p585O238
17482a372963Q973P577M358o026j262M548j177o73k0o03O720Q412K153k376o545
17467a348904m446O907J0812L916l032L427N931J3412n02n485M259l666O360l797
$$ plain form
17566 -1543619 -1538825 -1532285 -1526463 -1528263 -1535779 -1537767 -1526735 -1520212 -1520303 -1513965 -1510556 -1504796 -1504335 -1503256
17552 -1503256 -1507888 -1510710 -1507335 -1503498 -1502052 -1500708 -1491857 -1487112 -1484055 -1485953 -1485312 -1492370 -1494589 -1489834
17538 -1489834 -1482280 -1479919 -1476085 -1469376 -1466480 -1462412 -1461546 -1464754 -1465490 -1463643 -1459018 -1456552 -1448846 -1447041
17524 -1447041 -1448070 -1450137 -1451203 -1454142 -1451205 -1443264 -1436545 -1432992 -1433261 -1436187 -1432309 -1430611 -1423824 -1413350
17510 -1413350 -1416645 -1417460 -1415015 -1404843 -1401250 -1398320 -1396693 -1398748 -1401654 -1398139 -1397109 -1388325 -1379898 -1378485
17496 -1378485 -1385065 -1383594 -1388541 -1390620 -1388839 -1383657 -1378963 -1376004 -1371110 -1369375 -1369904 -1371616 -1379201 -1372963
17482 -1372963 -1363990 -1356413 -1352055 -1358081 -1359343 -1354795 -1355972 -1356645 -1356665 -1357268 -1350548 -1342136 -1339983 -1342359 -1348904
17467 -1348904 -1353350 -1346443 -1335631 -1331715 -1334747 -1331320 -1325389 -1311977 -1312479 -1317964 -1313705 -1317371 -1311011 -1314808
17453a314808O697N258m785J789K202N423O275P635P317M277L635P85O624J702
17439a259974r380j4724j5527q652j921Q86N910L223N14o72K763M94O880M614
17425a285566L706J714L255M545J1946O127K300J57r100l341J416o49k809P18
17411a265581L923K089J405L357L546L384n219r32K375K155M457n94J1208R701
17397a224726q11J093J556K679l60j708k954N539N23K719P151k229j900j528n75
17382a215531K42l630r81L297J0722O907M747m369J894J87q021k591N451M017
17368a197659J298Q656J432j417j506L500K984O702L142K504o06M984N19j840
17354a167307M357l907J209K680l386N544O113l987p52L668n45K424k85n641M250
$$ plain form
17453 -1314808 -1308111 -1302853 -1307638 -1305849 -1303647 -1298224 -1291949 -1284314 -1276997 -1272720 -1269085 -1268300 -1261676 -1259974
17439 -1259974 -1269354 -1284078 -1299605 -1308257 -1310178 -1309292 -1303382 -1300159 -1299645 -1300317 -1297554 -1297060 -1290180 -1285566
17425 -1285566 -1281860 -1280146 -1276891 -1272346 -1260400 -1254273 -1251973 -1251816 -1260916 -1264257 -1262841 -1263490 -1266299 -1265581
17411 -1265581 -1261658 -1259569 -1258164 -1254807 -1251261 -1247877 -1253096 -1254028 -1251653 -1249498 -1245041 -1245635 -1234427 -1224726
17397 -1224726 -1225537 -1224444 -1222888 -1220209 -1220569 -1222277 -1225231 -1219692 -1219169 -1216450 -1209299 -1211528 -1213428 -1214956 -1215531
17382 -1215531 -1215289 -1218919 -1219900 -1216603 -1205881 -1198974 -1194227 -1198596 -1196702 -1196515 -1204536 -1207127 -1201676 -1197659
17368 -1197659 -1196361 -1187705 -1186273 -1187690 -1189196 -1185696 -1182712 -1176010 -1172868 -1170364 -1170970 -1165986 -1165467 -1167307
17354 -1167307 -1162950 -1166857 -1165648 -1162968 -1166354 -1160810 -1154697 -1158684 -1159436 -1155768 -1156313 -1153889 -1154174 -1159815 -1155565
17339a155565O112m467J116N59j42M993L707N049j995o225k61J0136Q456j835
17325a130362J512O269J907j188L539N022P177K215j934m394p057k076j671J0474
17311a110567K159k141J192L106M698p681L959Q499o24K748L192M734q76q670
17297a096272n041M752Q737L074k499L629O034m678J955N54P099N501r20K976
17283a065099L059L731j487l610m522K270m527p067N045K817L290K326M020M887
17269a054867m05m515J696J597J195O128m98L740L805M814m526n453l559J307
17255a049541P299K083J318Q160M990J286l408k625L755O073J131J504L66j50
17241a017759k786J77M002O613M904L89k490k473m137l75l035P827N928k640L279
$$ plain form
17339 -1155565 -1149453 -1153920 -1152804 -1152245 -1152387 -1147394 -1143687 -1138638 -1140633 -1146858 -1147119 -1136983 -1128527 -1130362
17325 -1130362 -1128850 -1122581 -1120674 -1121862 -1118323 -1113301 -1106124 -1103909 -1105843 -1110237 -1117294 -1119370 -1121041 -1110567
17311 -1110567 -1108408 -1110549 -1109357 -1106251 -1101553 -1109234 -1105275 -1096776 -1097400 -1094652 -1091460 -1086726 -1087602 -1096272
17297 -1096272 -1101313 -1096561 -1087824 -1084750 -1087249 -1083620 -1077586 -1082264 -1080309 -1079755 -1072656 -1067155 -1068075 -1065099
17283 -1065099 -1062040 -1058309 -1059796 -1063406 -1067928 -1065658 -1070185 -1077252 -1072207 -1069390 -1066100 -1063774 -1059754 -1054867
17269 -1054867 -1055272 -1059787 -1058091 -1056494 -1055299 -1049171 -1049669 -1045929 -1042124 -1037310 -1041836 -1047289 -1050848 -1049541
17255 -1049541 -1042242 -1040159 -1038841 -1030681 -1025691 -1024405 -1027813 -1030438 -1026683 -1020610 -1019479 -1017975 -1017609 -1017759
17241 -1017759 -1020545 -1020368 -1016366 -1009753 -1004849 -1004460 -1006950 -1009423 -1013560 -1013935 -1016970 -1009143 -1003215 -1005855 -1002576
17226a002576q23K622N276K371m940l915r24J820P453p83m215P8K840J835N057
17211i88824j45M753k05k286m526K099J1009O264l285j142k180j76R480m735l998
17196i77897m160O597L447J61k0P280R527j552n99l414r106J237K710k299N476
17181i62612N522J0878n546j1085j917Q930J2157N287K267J338o938k785R53K059
17167i41492Q54r1m806k097M673J0563L572q215J592P483q28j2736m846J0356
17153i36018J402j592L42Q167K228N547n367k638K572M442J895o222n685k314
17139i33241M534R235M683J577k814m633J418Q938L011L930n673l845m446N58
17125i16768o69J751L533k065J3441M926j08q978k974J612L961M877j839k41l029
$$ plain form
17226 -1002576 -1003399 -1000777 -995501 -993130 -998070 -1001985 -1002909 -1001089 -993636 -994419 -998634 -998556 -995716 -993881 -988824
17211 -988824 -988969 -984216 -984421 -986707 -991233 -989134 -978125 -971861 -975146 -976288 -978468 -978644 -969164 -973899 -977897
17196 -977897 -982057 -975460 -972013 -971852 -971872 -964592 -955065 -956617 -957216 -960630 -969736 -968499 -965789 -968088 -962612
17181 -962612 -957090 -946212 -951758 -962843 -964760 -955830 -943673 -938386 -936119 -934781 -941719 -944504 -943551 -941492
17167 -941492 -940638 -940729 -945535 -947632 -942959 -932396 -928824 -937039 -935447 -927964 -928792 -941528 -946374 -936018
17153 -936018 -934616 -936208 -935866 -927699 -925471 -919924 -925291 -927929 -925357 -920915 -919020 -925242 -930927 -933241
17139 -933241 -928707 -919472 -914789 -913212 -916026 -920659 -919241 -910303 -907292 -903362 -909035 -912880 -917326 -916768
17125 -916768 -917437 -915686 -912153 -914218 -900777 -895851 -895959 -904937 -907911 -906299 -902338 -897461 -899300 -899541 -902570
17110i02570j338n14N071J499R166O50k325k120P197K303L146M744P69j547J814
17095h74055L333k93M248M591p66j263n918n615L464P279M08K416O012L996L079
17080h49084L197n518j1664m078k32O561K549k661K573l32L793J0288p8l119J572
17065h46233n21P068P880j946p493o65K349R20O390k372k734p932j013N561N705
17050h35036m39k07N156j663n750J0768O567p579k014l88L274M423m739q634N463
17035h30798R768j261O137N0J016k73J101n089K917N100L652j420P39L143K172
17020h03046k57M324L815J462n239O980p62P36J967q029j957J81P980L653L117
17005g85075m129K779K602L382q03o60P86K160m950M387k710k864r76N159P742
$$ plain form
17110 -902570 -903908 -904422 -899351 -897852 -888686 -888036 -890361 -892481 -885284 -882981 -879835 -875091 -874322 -875869 -874055
17095 -874055 -870722 -871015 -866767 -862176 -862942 -864205 -870123 -875738 -872274 -864995 -864587 -862171 -856159 -852163 -849084
17080 -849084 -845887 -851405 -863069 -867147 -867379 -860818 -858269 -860930 -858357 -858689 -854896 -844608 -844686 -847805 -846233
17065 -846233 -846754 -839686 -831806 -833752 -841245 -841910 -839561 -838641 -832251 -834623 -837357 -845289 -846302 -840741 -835036
17050 -835036 -835475 -835682 -830526 -832189 -837939 -827171 -820604 -828183 -830197 -830585 -827311 -822888 -827627 -836261 -830798
17035 -830798 -821030 -822291 -816154 -816104 -815088 -815361 -814260 -819349 -816432 -811332 -807680 -809100 -808361 -805218 -803046
17020 -803046 -803303 -798979 -795164 -793702 -798941 -791961 -792723 -791987 -790020 -798049 -800006 -799825 -791845 -788192 -785075
17005 -785075 -789204 -786425 -783823 -780441 -781244 -781904 -781118 -778958 -783908 -779521 -782231 -785095 -786071 -780912 -773170
16990g73170K719J949M684j016J610Q76k427q322k520n648r65J1540K652O9n316
16975g73285l402n54N903O118L998j204J80K008l311M619M904o948n899L15N282
16960g61276Q023j25l8l296K099M433k540l280P715L996J956j233k079k844J497
16945g46992M854K495m602j708m427K384j51k58P902O73L656L520M53L290k289
16930g31200j059l47R140l850m329M079N922O807n180j958k098N271M107p03J151
16915g14247j502L700N545k634o426J389k48O94m141J696P00L817r839n839N512
16900g21823L694P658J089M889K11m337m7l528r126J0369O127O593K0j272P863
16885f91620j471q179K204m553p646k363K792O289K785L921N091k949j173M641
$$ plain form
16990 -773170 -770451 -768502 -763818 -764834 -763224 -762348 -764775 -773097 -775617 -781265 -782230 -770690 -768038 -767969 -773285
16975 -773285 -776687 -777241 -771338 -765220 -761222 -762426 -762246 -760238 -763549 -758930 -754026 -760974 -766873 -766558 -761276
16960 -761276 -753253 -753378 -753416 -756712 -754613 -750180 -752720 -756000 -748285 -744289 -742333 -743566 -745645 -748489 -746992
16945 -746992 -742138 -739643 -744245 -745953 -750380 -747996 -748147 -748405 -740503 -739830 -736174 -732654 -732201 -728911 -731200
16930 -731200 -732259 -732606 -723466 -727316 -731645 -727566 -721644 -714837 -720017 -721975 -724073 -718802 -714695 -715398 -714247
16915 -714247 -715749 -712049 -706504 -709138 -715564 -714175 -714423 -713729 -717870 -716174 -715474 -711657 -721496 -727335 -721823
16900 -721823 -718129 -710471 -709382 -704493 -704282 -708619 -708666 -712194 -721320 -710951 -704824 -698231 -698211 -699483 -691620
16885 -691620 -693091 -701270 -699066 -703619 -711265 -713628 -710836 -704547 -701762 -697841 -692750 -695699 -696872 -692231
16871f92231r8L792L131M522j07L96M814Q63k704o189L38L665o17N052P251p736
16855f75858o476M657L218N3P637j045j928m770L662J446J894N880Q09l315k892
16840f67028j630N623K1k745j118j697O860P759p72j19M115q199m379N759m596
16825f62146l261L123J566J988k026N143r6K343M857n33k329m035Q151O09o560
16810f53206L101K186R42j299L822o197K758K653J807M297k602j760L906R779
16796f29813N880M200j931K53k423j007k920n545m668J951J310J540J851J169
16782f30153L026O05n170k462n12K273k134P077J940J719O434m283l798l993p30
16767f30161K319K350J836J26j061l90K053M583q39q19L285O568R77l043j05O104
$$ plain form
16871 -692231 -692329 -688537 -685406 -680884 -680991 -680595 -675781 -674918 -677622 -683811 -683473 -679808 -680425 -675373 -668122 -675858
16855 -675858 -682334 -677677 -674459 -674406 -666769 -667814 -669742 -674512 -670850 -669404 -667510 -661630 -660821 -664136 -667028
16840 -667028 -668658 -663035 -663014 -665759 -666877 -668574 -661714 -653955 -654727 -654846 -650731 -658930 -663309 -657550 -662146
16825 -662146 -665407 -662284 -660718 -658730 -660756 -655613 -655709 -653366 -648509 -649042 -651371 -655406 -647255 -646646 -653206
16810 -653206 -650105 -647919 -646977 -648276 -644454 -650651 -647893 -645240 -643433 -639136 -641738 -643498 -639592 -629813
16796 -629813 -623933 -619733 -621664 -621411 -623834 -624841 -627761 -633306 -637974 -636023 -634713 -633173 -631322 -630153
16782 -630153 -627127 -626522 -631692 -634154 -634666 -632393 -634527 -627450 -625510 -623791 -617357 -621640 -625438 -629431 -630161
16767 -630161 -627842 -625492 -623656 -623530 -624591 -624981 -622928 -618345 -619184 -620003 -616718 -610150 -609173 -612216 -612321 -606217
16751f06217N561J31P26k045N475L008j038p201k881l060l501n07O479O960j764
16736e99874j244K760L957K699j02J131k053L354j319q51N992L721j2348j4588
16722f08765K048R192Q396N216M023O09L812k004n070K708J409k582p865R96K042
16707e85835K658N100P609n231n800m68j063Q836q20J660K504M814j041j271J596
16692e66752N58M549p92k133L959K483Q589L559o403m01P27l559N937O32l038
16677e52085k906K48K630N743J980k329k285m79L144R30Q498J1907K345p671n139
16662e35469r773j2759j3545l149p762k803K236O542O848L581L454k650K984J1803
16648e50462k65j1141N434R386l406r138K912Q367j276l358l930L737K215L227
$$ plain form
16751 -606217 -600656 -600525 -599799 -601844 -596369 -593361 -594399 -601600 -604481 -607541 -611042 -611549 -605070 -598110 -599874
16736 -599874 -601118 -598358 -594401 -591702 -591804 -590673 -592726 -589372 -590691 -591542 -585550 -581829 -594177 -608765
16722 -608765 -606717 -597525 -589129 -583913 -579890 -579281 -575469 -577473 -582543 -579835 -578426 -581008 -588873 -587877 -585835
16707 -585835 -583177 -578077 -570468 -575699 -581499 -581967 -583030 -574194 -575014 -573354 -570850 -566036 -567077 -568348 -566752
16692 -566752 -566194 -561645 -562437 -564570 -560611 -558128 -549539 -545980 -552383 -552784 -552057 -555616 -549679 -549047 -552085
16677 -552085 -554991 -554743 -552113 -546370 -544390 -546719 -549004 -549483 -546339 -545409 -536911 -525004 -522659 -530330 -535469
16662 -535469 -545242 -558001 -571546 -574695 -582457 -585260 -583024 -576482 -569634 -566053 -562599 -565249 -562265 -550462
16648 -550462 -550727 -561868 -556434 -547048 -550454 -559592 -556680 -548313 -549589 -552947 -556877 -553140 -550925 -547698
16634e47698j272j76R792P81l595J387N894l162q866J020J326O237L920K512m440
16619e36340l2J059M54Q54l106J296J000L578J142l569j424M143J283n339j544
16604e36545K159J607N866P468j669j339J072O712K887n028l296L012N244K099
16590e09751J85J589m34K964l13j555k825j584q09j889m533N18j765k652j333
16575e24187Q636Q889Qn975J989K389M5M191l101n663J556L138k586M191m570
16560e11050k414P018Q011M434J711n369L163L62l146P098J941q49m192o780N41
16545d99521l922k842m248J636Q339N926j128j870L377K885J0361N102k679J092
16531d77492O989j420j2530q575j255l750K724p55M948k000o213P623P607L137
$$ plain form
16634 -547698 -548970 -549146 -539354 -538573 -542168 -540781 -534887 -538049 -546915 -545895 -544569 -538332 -534412 -531900 -536340
16619 -536340 -536372 -535313 -534859 -534005 -537111 -535815 -534815 -531237 -530095 -533664 -535088 -530945 -529662 -535001 -536545
16604 -536545 -534386 -532779 -526913 -519445 -521114 -522453 -521381 -514669 -511782 -516810 -520106 -517094 -511850 -509751
16590 -509751 -509566 -507977 -508411 -505447 -505760 -507315 -510140 -511724 -512533 -514422 -518955 -518437 -520202 -522854 -524187
16575 -524187 -515551 -506662 -506654 -512629 -510640 -508251 -508206 -504015 -507116 -512779 -511223 -508085 -510671 -506480 -511050
16560 -511050 -513464 -506446 -498435 -494001 -492290 -497659 -494496 -494134 -497280 -490182 -488241 -489090 -493282 -500062 -499521
16545 -499521 -503443 -506285 -510533 -508897 -500558 -494632 -495760 -497630 -494253 -491368 -481007 -475905 -478584 -477492
16531 -477492 -470503 -471923 -484453 -493028 -494283 -498033 -495309 -496064 -491116 -493116 -499329 -491706 -484099 -480962
16517d80962K310K936K252q07k51m666K626j511m11L714K637j053k23M644M064
16502d64701N011j421m11k463K810O655m364j0696N599N176r93n331R17M046k734
16487d62900O89K601J790L938N176j692n206l748L11l45J647K499K17j245N046
16472d51222Q791l318J743M1l866l225Q191J46j840l269j503k346m295J618K022
16457d52332J176R395M300k591n602k966l068J143n13k792K920P822j138J063
16443d43183K492K31M199K332k789n389p389L756Q807Q259q59Q46P501n302l521
16428d30009J597J41k710m605J004r08l439m60J050m23M708Q259j73L507j157
16413d23618M298M577J765O558k322o405n571j32J736k473N194K316l393r37l018
$$ plain form
16517 -480962 -478652 -475716 -473464 -474271 -474522 -479188 -476562 -478073 -478484 -474770 -472133 -473186 -473409 -468765 -464701
16502 -464701 -459690 -461111 -461522 -463985 -461175 -454520 -458884 -469580 -463981 -458805 -459798 -465129 -464212 -460166 -462900
16487 -462900 -462211 -459610 -457820 -453882 -448706 -450398 -455604 -459352 -459041 -459386 -457739 -455240 -455023 -456268 -451222
16472 -451222 -442431 -445749 -444006 -443965 -447831 -451056 -442865 -442719 -444559 -447828 -449331 -451677 -455972 -454354 -452332
16457 -452332 -451156 -441761 -437461 -440052 -445654 -448620 -451688 -450545 -451058 -453850 -450930 -443108 -444246 -443183
16443 -443183 -440691 -440460 -436261 -433929 -436718 -442107 -449496 -445740 -436933 -428674 -429533 -428687 -421186 -426488 -430009
16428 -430009 -428412 -428271 -430981 -435586 -434582 -435490 -438929 -439389 -438339 -438762 -434054 -425795 -425968 -422461 -423618
16413 -423618 -419320 -414743 -412978 -406420 -408742 -415147 -420718 -420850 -419114 -421587 -416393 -414077 -417470 -418407 -421425
16398d21425J540M657k637l784k002q98O743M534n77R91n256j697M584j8M084
16383d11161J957N193N313n647p726M4M262m033l76J967L184P2N055L529k28o047
16367d04642r82R36l164L045L361l065n677j74l77m16P802m489k38Q544M480J971
16351c93085K996J374L865j3m962k300j583J93L41J612N044k286j401K335M899
16336c82971p23j489l394k264N421O73k218J579K264o950l76L766Q580N058m52
16321c73496l399P22M72o923K45L495K055N102k631l176k703m539L437L069M548
16306c73722l535j728L712l586J710O837NM585k979l289j858l15m10L496K441
16291c68636l352K894l353K494L826m052J810l375M108K254k357m810N677N627
$$ plain form
16398 -421425 -419885 -415228 -417865 -421649 -423651 -424549 -417806 -413272 -413849 -412858 -418114 -419811 -415227 -415245 -411161
16383 -411161 -409204 -404011 -398698 -404345 -412071 -412027 -407765 -411798 -412174 -410207 -407023 -406951 -401896 -398367 -398595 -404642
16367 -404642 -405624 -404688 -407852 -404807 -401446 -404511 -410188 -410362 -410739 -411155 -403353 -407842 -408080 -399536 -395056 -393085
16351 -393085 -390089 -388715 -384850 -384863 -389825 -392125 -393708 -393515 -393174 -391562 -386518 -388804 -390205 -387870 -382971
16336 -382971 -383694 -385183 -388577 -390841 -385420 -384747 -386965 -385386 -383122 -390072 -390448 -386682 -378102 -373044 -373496
16321 -373496 -376895 -376173 -375701 -382624 -382379 -378884 -376829 -371727 -374358 -377534 -380237 -384776 -381339 -378270 -373722
16306 -373722 -377257 -378985 -375273 -378859 -377149 -370312 -370307 -365722 -368701 -371990 -373848 -374163 -374573 -371077 -368636
16291 -368636 -371988 -369094 -372447 -369953 -366127 -370179 -368369 -371744 -367636 -365382 -367739 -372549 -366872 -361245
16277c61245K656l223O075o50k547k429K049K111l91l257P236M983p267J276L494
16262c51129P79J737k483j641M231L70k847M89K785n221N691M74m872j117j830
16247c54584J748J60P669Q94L658J568k468j883j681m081N609j077j347n015n075
16232c55905m609L045J2786L523l722j530j457N189N558K171l414K86N118N390
16218c27571N016o181k367K280L652P942j722m666l310j0014o206M592L542K418
16204c32595j087L197L667K360o090q308n1O065K663O076N514L094j136o747L465
16189c19913Q890m417m834R623M626j611r300k498J436o065J185N293Q3l73K54
16174c17621k173P346M316L540L369l438o507l760j178m107l310q384NQ497R793
$$ plain form
16277 -361245 -358589 -361812 -355737 -356387 -358934 -361363 -359314 -357203 -357594 -360851 -353615 -348632 -355899 -354623 -351129
16262 -351129 -350350 -348613 -351096 -352737 -348506 -348136 -350983 -350494 -347709 -352930 -347239 -346765 -351637 -352754 -354584
16247 -354584 -352836 -352676 -345007 -344113 -340455 -338887 -341355 -343238 -344919 -349000 -343391 -344468 -345815 -350830 -355905
16232 -355905 -360514 -357469 -344683 -341160 -344882 -346412 -347869 -342680 -337122 -334951 -338365 -338079 -332961 -327571
16218 -327571 -322555 -328736 -331103 -328823 -325171 -317229 -318951 -323617 -326927 -336941 -343147 -338555 -335013 -332595
16204 -332595 -333682 -330485 -326818 -324458 -330548 -338856 -338907 -332842 -330179 -324103 -318589 -315495 -316631 -323378 -319913
16189 -319913 -311023 -315440 -320274 -310651 -306025 -307636 -316936 -319434 -317998 -324063 -322878 -317585 -317502 -317875 -317621
16174 -317621 -319794 -312448 -308132 -304592 -301223 -304661 -311168 -314928 -316106 -320213 -323523 -331907 -331902 -323405 -313612
16159c13612J219k90L561l100j098M648P603Q334r142q594L482j70m482K341M284
16144c05016J0242L374n863l693l450o354J159j792L090J576l559N84K63M869
16130c04570K551Q13P318N599k646p993K086L046M1Q301L669o049m9m885q30K386
16114b91212L719O118k050j894m068o953j823Q286Q513R22K095l063j775j531
16100b84716J591R524Q27p452j230j661J83k86K250M674n46k781K216j509O148
16085b72768P939k75j569M476K423o451l126o851r603j097J0532j46J127M939
16071b70450J128L113K186L793m261N81J013j379J817q88K56r52J191m6q98k293
16055b66089L592P399N498n899m15k350m298j257K740N343l620O89N300K408m358
$$ plain form
16159 -313612 -312393 -312683 -309122 -312222 -313320 -308672 -301069 -292735 -301877 -310471 -306989 -307159 -311641 -309300 -305016
16144 -305016 -294774 -291400 -297263 -300956 -304406 -310760 -309601 -311393 -308303 -306727 -310286 -309702 -309439 -304570
16130 -304570 -302019 -301206 -293888 -288289 -290935 -298928 -296842 -293796 -293755 -285454 -281785 -287834 -287883 -292768 -293598 -291212
16114 -291212 -287493 -281375 -283425 -285319 -289387 -296340 -298163 -289877 -281364 -280442 -278347 -281410 -283185 -284716
16100 -284716 -283125 -273601 -272774 -280226 -281456 -283117 -282934 -283220 -280970 -276296 -276842 -279623 -277407 -278916 -272768
16085 -272768 -264829 -265104 -266673 -262197 -259774 -266225 -269351 -276202 -285805 -286902 -276370 -276516 -275389 -270450
16071 -270450 -269322 -266209 -264023 -260230 -264491 -263910 -262897 -264276 -262459 -263347 -263091 -264043 -262852 -262898 -263796 -266089
16055 -266089 -262497 -255098 -249600 -255499 -255914 -258264 -262562 -263819 -261079 -255736 -259356 -258667 -253367 -250959 -255317
16040b55317r714p017J001j392R367J0828J662j278p057m760J0373J2467m626
16027b45463j0214m940O60L610L170M129l563n64N697M02m366K481j690K415l273
16012b51509n776l903J117J403R169Q677J250K111k865n766l268M449l62k334
15998b47607m9J72L873P445k297R123r447k266P166n300L441l02r86M173Q028
15983b24833l165m361l626J303P99j091k928K70j159J1195Q835J396m623o660
15969b28648j776r76K181r47P13K748J89n987l945j020N031N518o498l491j803
15954b38711L217O871Q479K205k839m800k928J457k860P41k948j958P758j379
15940b27695K771L844l412J986N802J579j750k834J971K296k231K750r3R694P481
$$ plain form
16040 -255317 -265031 -272048 -271047 -272439 -263072 -252244 -250582 -251860 -258917 -263677 -253304 -240837 -245463
16027 -245463 -255677 -260617 -259957 -256347 -253177 -249048 -252611 -253175 -247478 -247076 -251442 -248961 -250651 -248236 -251509
16012 -251509 -257285 -261188 -260071 -258668 -249499 -240822 -239572 -237461 -240326 -246092 -249360 -244911 -245273 -247607
15998 -247607 -247656 -247484 -243611 -236166 -238463 -229340 -238787 -241053 -233887 -239187 -235746 -236048 -237034 -232861 -224833
15983 -224833 -227998 -232359 -235985 -234682 -233883 -234974 -237902 -237632 -238791 -227596 -218761 -217365 -221988 -228648
15969 -228648 -230424 -231400 -229219 -230166 -229453 -226705 -226516 -232503 -236448 -237468 -232437 -226919 -233417 -236908 -238711
15954 -238711 -235494 -228623 -220144 -217939 -220778 -225578 -228506 -227049 -229909 -229168 -232116 -234074 -226316 -227695
15940 -227695 -224924 -221080 -224492 -222506 -216704 -215125 -216875 -219709 -217738 -215442 -217673 -214923 -215016 -205322 -197841
15925a97841l003j820k338j601L123q71M545q60j597k050l312j0638N329O612
15911b06322J971n52n089n917j147J766P656M006N31l07M025l184j059j023K286
15896b02359L905N576K399l038m281M908K353j254P86O794j020l705N573K879
15882a80484j0183K6j187K226l113k785o1l776J695Q80n21j876j559o02Q71J2465
15866a87984P114Q11j841j584O007m652n689L723Q16j255N68n157k784K142J858
15851a87907Q59j056l592j45M11L702J886L624n072R66k528M334L026l286o342
15836a91120j518J1452P648l493l00k528k419k090m392J74J2601J541k901l469
15822a80814O142Q307m056L056P02O86o528n407l56K426m56K720M436L839j790
$$ plain form
15925 -197841 -200844 -202664 -205002 -206603 -203480 -204351 -199806 -200666 -202263 -204313 -207625 -218263 -212934 -206322
15911 -206322 -204351 -204903 -209992 -215909 -217056 -215290 -207634 -203628 -203097 -203404 -199379 -202563 -203622 -204645 -202359
15896 -202359 -198454 -192878 -190479 -193517 -197798 -192890 -190537 -191791 -191005 -184211 -185231 -188936 -183363 -180484
15882 -180484 -190667 -190641 -191828 -189602 -192715 -195500 -195561 -199337 -197642 -196762 -197283 -199159 -200718 -201320 -200449 -187984
15866 -187984 -180870 -180059 -181900 -183484 -177477 -182129 -187818 -184095 -183279 -184534 -183966 -189123 -191907 -189765 -187907
15851 -187907 -187048 -188104 -191696 -191841 -191430 -187728 -185842 -182218 -187290 -186324 -188852 -184518 -181492 -184778 -191120
15836 -191120 -192638 -181186 -173538 -177031 -177331 -179859 -182278 -184368 -188760 -188586 -175985 -174444 -177345 -180814
15822 -180814 -174672 -166365 -170421 -167365 -166663 -165977 -172505 -177912 -178268 -175842 -176298 -173578 -169142 -165303 -167093
15807a67093J48J480O75L613k805j1835m455N037Q029K234J308L538j045j064
15793a62235R438K828q91o002M83M659J48k386p185PL713M916Q689K891o319k763
15777a50009o265j138p287k423R684J239J413O731k109K279O511Q44L805Q00K592
15762a33333M033q47m459q214k527M070M464J426R69m113k578k299k931l058M180
15747a45217P627k326J777p75j624k330l041P82L302K870K23Q880k618j841R13
15732a33398p738k305K76J759K161O203k953k642M187M999m525l763P446N744
15718a24549k344M75P097K511J293j0755j0590l130L372M077n173j203K619j852
15704a38152J557N468j056j564J352K352L119N865o278k319l133l783M215Q778
$$ plain form
15807 -167093 -166945 -165465 -164790 -161177 -163982 -175817 -180272 -175235 -167206 -164972 -163664 -160126 -161171 -162235
15793 -162235 -152797 -149969 -150860 -156862 -156379 -151720 -151572 -153958 -161143 -161136 -157423 -152507 -143818 -140927 -147246 -150009
15777 -150009 -156274 -157412 -164699 -167122 -157438 -156199 -154786 -148055 -150164 -147885 -141374 -140530 -136725 -135925 -133333
15762 -133333 -129300 -130147 -134606 -142820 -145347 -141277 -136813 -135387 -134418 -138531 -141109 -143408 -146339 -149397 -145217
15747 -145217 -137590 -139916 -138139 -138914 -140538 -142868 -145909 -145127 -141825 -138955 -138732 -129852 -132470 -134311 -133398
15732 -133398 -141136 -143441 -143165 -141406 -139245 -133042 -135995 -138637 -134450 -129451 -133976 -137739 -130293 -124549
15718 -124549 -126893 -126418 -119321 -116810 -115517 -126272 -136862 -139992 -136620 -132543 -137716 -138919 -136300 -138152
15704 -138152 -136595 -131127 -132183 -133747 -132395 -130043 -126924 -121059 -127337 -129656 -132789 -136572 -132357 -123579
15690a23579N030L539m93K516j652K102j756o893J550p608m626O054R014J1543
15676a05259m787r275k711M278M273n775P179O813P023k618q562M355N760l914
15662a03220k76k230o174n303O374o616p06J162M145N552q9k497n372j842P472
15647a09620J0528Q14m749m261K457m018j712k236N891l61n5k013M286M512j903
15632a02440J988p503j549M919L669j499l939k146K58K256N185J1548k973j3398
15618a05624K01Q212l53l690L730R197J282m151J54M195j805l501m666O262M570
15603h5987o195j0083m147J942J710L268O357k399J568N069K484J809l532n702
15589i3838o96M796K090p44k390N162M365K429P849k64n100n077J096r629R44
$$ plain form
15690 -123579 -118549 -115010 -115503 -112987 -114639 -112537 -114293 -121186 -119636 -127244 -131870 -125816 -116802 -105259
15676 -105259 -110046 -119321 -122032 -117754 -113481 -119256 -112077 -105264 -98241 -100859 -109421 -105066 -99306 -103220
15662 -103220 -103496 -105726 -111900 -117203 -110829 -117445 -118151 -116989 -112844 -107292 -107381 -109878 -115250 -117092 -109620
15647 -109620 -99092 -98278 -103027 -107288 -104831 -108849 -110561 -112797 -106906 -107267 -107322 -109335 -105049 -100537 -102440
15632 -102440 -100452 -107955 -109504 -104585 -100916 -102415 -106354 -108500 -108242 -105986 -100801 -89253 -92226 -105624
15618 -105624 -105423 -97211 -97564 -101254 -97524 -88327 -87045 -91196 -91042 -86847 -88652 -92153 -96819 -90557 -85987
15603 -85987 -92182 -102265 -106412 -104470 -102760 -99492 -93135 -95534 -93966 -88897 -86413 -84604 -88136 -93838
15589 -93838 -94534 -89738 -87648 -88392 -90782 -85620 -81255 -78826 -70977 -71241 -76341 -81418 -80322 -89951 -89007
15574h9007O939N772k729n572M692J628P130J836j0019p215N28J284Q451M878
15560g1404K164o038n950K902K492k126J880K607J326k920J052K230l791j381
15546g6957M918M539O540J437q635l556o299o239Q326J9004K425l753r48J808
15532e7390K99L142p501p587P399J746Rl983k169p85j959L827N974J673k758J422
15516e8641Q032P284R96k217L21r04k138o391p81K280j521o244N72K736N244m400
15500e5772J243N959R958n293j2608M933K900O232j957p960k080k935Q64L041
15486e3475J863J279L431L229M939K25k649l956j729m127J561l29M070K237J83
15471d3248m41J54l337j756M974L512N756J1325L58n077q094j253L136J457J405
$$ plain form
15574 -89007 -82068 -76296 -79025 -84597 -79905 -78277 -71147 -69311 -79330 -86545 -86017 -84733 -76282 -71404
15560 -71404 -69240 -75278 -81228 -78326 -75834 -77960 -76080 -73473 -72147 -75067 -74015 -71785 -75576 -76957
15546 -76957 -72039 -67500 -60960 -59523 -68158 -71714 -78013 -84252 -75926 -56922 -54497 -58250 -59198 -57390
15532 -57390 -57091 -53949 -61450 -69037 -61638 -59892 -59883 -63866 -66035 -66820 -68779 -64952 -58978 -57305 -60063 -58641
15516 -58641 -50609 -43325 -42329 -44546 -44225 -45129 -47267 -53658 -54439 -52159 -53680 -59924 -59352 -56616 -51372 -55772
15500 -55772 -54529 -48570 -38612 -43905 -56513 -51580 -48680 -42448 -44405 -52365 -54445 -57380 -56516 -53475
15486 -53475 -51612 -50333 -46902 -43673 -38734 -38509 -41158 -45114 -46843 -50970 -49409 -49738 -45668 -43431 -43248
15471 -43248 -43689 -43535 -46872 -48628 -43654 -40142 -34386 -23061 -22703 -27780 -35874 -37127 -33991 -32534 -31129
15456c1129K605j614M294L342k883Q19N897j806o825j307J292N758m471k411K027
15441b6412n503o835J0484R349q513m059J86n75M329j369o546Q26M232L452k77
15426b7231P947K277k483r460k568J635L228R137J0152j343l612k313K752o228
15412a8110R81J186j457n22M93l554N210M647l728n20L739j718j552j862Q15M540
15396a1412L767K62q69J50p541J82Q612j763k437L296J310k393N302M428m375
15381c481r526m989N398O663L115m445l889j784N170Q721L85k952M336L323j161
15366D884k604R24p545p38O015j249m977k412o57L941L680N593o5J406M05j810
15350D791M373J641j47K601l613q48J260j074k571m064R35j656m134K928N805
$$ plain form
15456 -31129 -28524 -30138 -25844 -22502 -25385 -24566 -18669 -20475 -27300 -28607 -27315 -21557 -26028 -28439 -26412
15441 -26412 -31915 -38750 -28266 -18917 -27430 -31489 -31303 -31878 -27549 -28918 -35464 -34638 -30406 -26954 -27231
15426 -27231 -19284 -17007 -19490 -28950 -31518 -29883 -26655 -17518 -7366 -8709 -12321 -14634 -11882 -18110
15412 -18110 -17129 -15943 -17400 -17922 -17429 -20983 -15773 -11126 -14854 -15374 -11635 -13353 -14905 -16767 -15952 -11412
15396 -11412 -7645 -7383 -8252 -8102 -15643 -15461 -6849 -8612 -11049 -7753 -6443 -8836 -3534 894 -3481
15381 -3481 -13007 -17996 -12598 -5935 -2820 -7265 -11154 -12938 -7768 953 1338 -1614 2722 6045 4884
15366 4884 2280 3204 -4341 -5079 936 -313 -5290 -7702 -8359 -4418 -738 4855 4790 6196 6601 4791
15350 4791 9164 10805 10658 13259 9646 8798 10058 8984 6413 2349 3284 1628 -2506 422 6227
15335F227N98k641R03q96N263O753J99l384O91k670M263Q319r74o653n85L343
15319A8756O711K247o783k809N82n76N472n457P095O41L15L807p043m835n438
15304A2685N070L830k671m792L537J619j030L826K062J2058n543r499K46O175
15290B7573L888q2J920j902l02q910o306j006J69L815M882O104L607n033K202
15275C0619r34O003L737q566J36o316m40N566K688O54L318o040J984J918k397
15260C1930k16L485L671M549O364j830p524m196J036j917k385L167L551q62l038
15245C5785m937O006J198j846q53M282K733J00K053P349J217n340N606l779l376
15230D6198o759M393O341n062L660q21m237K341O154R84q235k537N247N634K359
$$ plain form
15335 6227 6825 4184 5087 4191 9454 16207 16406 13022 13713 11043 15306 23625 22651 15998 15413 18756
15319 18756 25467 27714 20931 18122 18704 18128 23600 18143 25238 25879 26194 30001 22958 18123 12685
15304 12685 17755 21585 18914 14122 17659 19278 18248 22074 24136 36194 30651 21152 21398 27573
15290 27573 31461 31379 33299 31397 31095 22185 15879 14873 15042 18857 23739 29843 33450 28417 30619
15275 30619 29685 35688 39425 30859 30995 24679 24239 29805 32493 33147 36465 30425 32409 34327 31930
15260 31930 31714 35199 38870 43419 49783 47953 40429 36233 37269 35352 32967 36134 39685 38823 35785
15245 35785 30848 36854 38052 36206 35353 39635 42368 42468 44521 51870 53087 47747 53353 49574 46198
15230 46198 39439 43832 50173 45111 48771 47950 43713 46054 52208 53192 44957 42420 47667 53301 55660
15215E5660O12L0l148k495M375J462M529N790n483O365K825O19N275L425J694
15200H1535m550j0068M58J789M328K232l668n96l553l051l67J661K854M546o46
15185G2904N875m622r737m362j515L129O405J6445N432o201l733J280K266Q420
15171I1986j181m947m692j141L133J971M85P6j108K564k864q359j562K670l117
15156G3914O817R270P774m866n440L16P646j485o847j0867p170O799K339J986
15142H0186O548K778k462Q76M594q49N423Q902n794m682J932M075k165n659M51
15127I4154J960M07M11L28r27o247m94O030M635K85P14j268j779k76l424m899
15111H9610M193K422j432J250o623k171P691N85J691J05L44K120J0P435Q1J602
$$ plain form
15215 55660 56272 56302 53154 50659 55034 56496 61025 66815 61332 67697 70522 71141 76416 79841 81535
15200 81535 76985 66917 67375 69164 73492 75724 72056 71460 67907 64856 64489 66150 69004 73550 72904
15185 72904 78779 74157 64420 60058 58543 61672 68077 84522 89954 83753 80020 81300 83566 91986
15171 91986 90805 85858 81166 80025 83158 85129 85614 85690 84582 87146 84282 75923 74361 77031 73914
15156 73914 80731 90001 97775 92909 87469 87785 95431 93946 87099 76232 69062 75861 78200 80186
15142 80186 86734 89512 87050 87926 92520 91671 97094 105996 100202 95520 97452 101527 99362 93703 94154
15127 94154 96114 96521 96932 97260 96333 90086 89592 95622 100257 100542 101256 99988 98209 97933 94509 89610
15111 89610 93803 96225 94793 96043 89420 87249 94940 95525 97216 97321 97665 99785 99795 107230 107311 108913
15095A08913M068K232m255k85K263l104m475J501O269P915J407m48M309o942j032
15080A18336K695l253p073k766l856l628L381J3130M582k961M912j201r529o694
15066A06075L613q06J082J363J514J90K8M275N449J954k117n684N639J638m447
15051A19766L156M126J990J238k526r37O76M04l245K032N354L283Q30q225p037
15036A20885n44O191N481L901N470O001N392j613p166o429k194K636N141p20K174
15021A44606j220J644M447l690L57m206o536j710p7R205M667R4l679J868K272
15006A48042K676m531m109N205R017j601L783o58p86l821l083j607N744O061J542
14991A61874o779p841k252N330K388O187L991m910k669o719l254k844K983N441
$$ plain form
15095 108913 112981 115213 110958 110673 112936 109832 105357 106858 113127 121042 122449 122001 126310 119368 118336
15080 118336 121031 117778 110705 107939 104083 100455 103836 116966 121548 118587 123499 122298 112769 106075
15066 106075 109688 108882 109964 111327 112841 113031 113059 117334 122783 124737 122620 116936 122575 124213 119766
15051 119766 122922 127048 129038 130276 127750 126813 127489 127893 124648 126680 132034 135317 136147 127922 120885
15036 120885 120341 126532 132013 135914 141384 147385 152777 151164 143998 137569 135375 138011 143152 142432 144606
15021 144606 143386 145030 149477 145787 146144 141938 135402 133692 133615 142820 147487 147581 143902 145770 148042
15006 148042 150718 146187 142078 147283 156300 154699 158482 157824 157038 153217 150134 148527 154271 160332 161874
14991 161874 155095 147254 145002 150332 152720 158907 162898 157988 155319 148600 145346 142502 145485 150926
14977A50926J090p140k775O899Q842N683o649L058l737M470k404m851M742m537
14963A53617l448O286M944J505J707r20J630J437q86J150j164m285n488p32Q852
14948A64205O906J03p070l664j37N115O449o35k626k446J445j8n239N803Q650
14933A76841k444k383p23J800K946j194J982j942j710N244L946J372l338k771
14919A77626M717M425l202p40K05J578j417J494j521j374K754K489l297Q64Q578
14904A93179R642j275j1685N38J06J552N454J30k54J925n32l420R108M451K530
14889B11449n479l795o652j269M551N130j028K584m153N206J624J986o044j075
14875B03035N141j648j324l140l297L838L476l386K542N442L033J451j2196l139
$$ plain form
14977 150926 152016 144876 142101 149000 157842 163525 156876 159934 156197 160667 158263 153412 158154 153617
14963 153617 150169 156455 161399 162904 164611 163691 165321 166758 165872 167022 165858 161573 156085 155353 164205
14948 164205 171111 171214 164144 160480 160343 165458 171907 171272 168646 166200 167645 167627 162388 168191 176841
14933 176841 174397 172014 171291 173091 176037 174843 176825 174883 173173 178417 182363 183735 180397 177626
14919 177626 182343 186768 183566 182826 183031 184609 183192 184686 183165 181791 184545 187034 183737 184601 193179
14904 193179 202821 201546 189861 190399 190505 192057 197511 197641 197387 199312 198780 195360 204468 208919 211449
14889 211449 205970 202175 195523 194254 198805 203935 202907 205491 201338 206544 208168 210154 204110 203035
14875 203035 208176 206528 205204 202064 198767 202605 206081 202695 205237 210679 213712 215163 202967 199828
14861A99828o83Q643J368k371m490j210K521K953L066m1K081l443M758N484M626
14846B23090p783J538K914Q230M685m238j1836j0361m77J1163Q105J212r712j0416
14832B06114m721P371R894O721ok85o001K652j035N49o39R258L732m689J9L810
14816B32744q642p104K410N985J710J463K318k888m743M292O360j356r88J15P087
14801B38763m337J539L680K687l739l62P948N387l689j821n03k817N857j958p509
14786B39126l987K578P835M645l157N309L488l079l56m078m409l110M981J0314
14772B56100N834r38o839o631J702J0924m090q006l217J431j797L007J049K410
14758B50939k57k699j067K466J935k083l451K034j435K977J0343M462P37n634
$$ plain form
14861 199828 199145 207788 209156 206785 202295 201085 203606 206559 209625 209584 211665 208222 212980 218464 223090
14846 223090 215307 216845 219759 227989 232674 228436 216600 206239 205762 216925 225030 226242 216530 206114
14832 206114 201393 208764 218658 225379 225373 225088 219087 221739 220704 221253 220614 229872 233604 228915 228934 232744
14816 232744 224102 216998 219408 225393 227103 228566 230884 227996 223253 227545 233905 232549 231561 231676 238763
14801 238763 234426 235965 239645 242332 238593 238231 246179 251566 247877 246056 245553 242736 248593 246635 239126
14786 239126 235139 237717 245552 250197 247040 252349 255837 252758 252402 248324 243915 240805 245786 256100
14772 256100 261934 260996 254157 247526 249228 260152 256062 248056 244839 246270 244473 247480 248529 250939
14758 250939 250682 247983 246916 249382 251317 249234 245783 247817 246382 249359 259702 264164 264901 259267
14744B59267m146j758j416p5J261L097k27n067M200K156N150L352j617p43P143
14729B70577N929j959m380L371j859j450m901k361L814K066M05k092m118m804
14715B58238M549Q279j345l992J268O109N600P210l006K692K466l102j738l025
14701B80203N39o54P96J368R82N363L406k68N587P79l639j1413k014M917N136
14686B91088M594M145O561J185j608L29j597k904l612M308J290n43o477p481K350
14671B91628L411l528M031J3361N977l860l439n178m508J416l681J979N585J135
14657C04329P3J79M32N17j917k048P652P563k476P089q78j577J458N62J790J252
14641C24000o170n64K02K212N104L917m201m655L481K033l641r811l57M697Q658
$$ plain form
14744 259267 255121 253363 251947 251872 253133 256230 256003 250936 255136 257292 262442 265794 264177 263434 270577
14729 270577 276506 274547 270167 273538 271679 270229 265328 262967 266781 268847 269252 267160 263042 258238
14715 258238 262787 271066 269721 265729 266997 273106 278706 285916 282910 285602 288068 284966 283228 280203
14701 280203 280742 280088 280884 282252 283234 288597 292003 291735 297322 298101 294462 283049 281035 285952 291088
14686 291088 295682 299827 306388 307573 305965 306294 304697 301793 298181 302489 303779 303236 296759 289278 291628
14671 291628 295039 291511 295542 308903 314880 311020 307581 302403 297895 299311 295630 297609 303194 304329
14657 304329 304402 304581 305013 305530 303613 301565 309217 316780 314304 321393 320515 318938 320396 320958 322748 324000
14641 324000 317830 317266 317468 319680 324784 328701 324500 319845 323326 325359 321718 311907 311550 316247 324905
14626C24905O302p448r505P56L36O473O766K900o371J531j203p701r492O096R400
14611C23745M094P84o416j845p34L991K59L264L516O33m92j453j039K130K215
14596C32652M799K275J799o41k699K747J048m397L482L147m42m999J324n47K766
14581C42314o89j656K173p14n410k564n31R13L184OJ102J898O018O930J454n712
14565C48716L78P453M542n064n978k169M128M798O530j916q247K531P174l451
14551C59425O54m162L212Q460L580L475o43p345r695k212K403P98M000N766Q060
14536C75776n54K419P911O374l79j1828r50K522N39N903J787k878l546L006j59
14521C85943k283M029o896j513N474J108r727n118N312R280r18O03M220O408k964
$$ plain form
14626 324905 331207 323759 314254 315010 315346 321819 328585 331485 325114 326645 325442 317741 308249 314345 323745
14611 323745 327839 328623 322207 320362 319628 323619 323878 327142 330658 331291 330799 329346 328307 330437 332652
14596 332652 337451 339726 341525 340884 338185 340932 341980 337583 341065 344212 343770 338771 340095 339548 342314
14581 342314 341625 339969 342142 341428 336018 333454 332923 333836 337020 337026 338128 340026 346044 352974 354428 348716
14565 348716 349094 356547 361089 356025 350047 347878 352006 356804 363334 361418 353171 355702 362876 359425
14551 359425 360079 355917 359129 367589 371169 374644 374001 366656 356961 354749 357152 357950 361950 367716 375776
14536 375776 375222 377641 385552 391926 391547 379719 378769 381291 381830 387733 389520 386642 383096 386102 385943
14521 385943 383660 387689 380793 379280 384754 385862 376135 371017 376329 385609 384691 385294 389514 395922 392958
14506C92958o662p94L489J57n791P410j096q731M877M022K309n421N24P994R20
14491C96165j023J478O772k616p122L784j998R26P308l268j861J434J905O261
14477D08145O258K647k996m548J750k727j562J063J292m977M149J829K487P83
14463D13593l905J459j041K360J0284L618l197M849K11O67M93o645r90Q447R39
14448D31142n493n921j746N251L508Q777R29o574n524o637O491M864L195k3j029
14433D31210J600p80k558j586k42Q446J961n11M341L393k354l891l878j894O112
14418D39369O703j1P697l30P148J516k408L18r391o624o044L111J3439Q306J575
14403D64374n017m396m999J263P211N756K104J737j0208m661N362l137N57l792
$$ plain form
14506 392958 386296 385502 388991 389148 383357 390767 389671 380940 385817 389839 392148 386727 387251 395245 396165
14491 396165 395142 396620 403392 400776 393654 397438 395440 396366 403674 400406 398545 399979 401884 408145
14477 408145 414403 417050 414054 409506 411256 408529 406967 408030 409322 404345 408494 410323 412810 413593
14463 413593 409688 411147 410106 412466 422750 426368 423171 428020 428231 428898 429391 422746 421756 430203 431142
14448 431142 425649 419728 417982 423233 426741 435518 436447 429873 424349 417712 424203 429067 432262 432239 431210
14433 431210 432810 432030 429472 427886 427644 436090 438051 437540 441881 445274 442920 439029 435151 433257 439369
14418 439369 446072 446061 453758 453428 460576 462092 459684 460002 450611 443987 437943 441054 454493 462799 464374
14403 464374 459357 454961 449962 451225 458436 464192 466296 468033 457825 453164 458526 455389 455946 452154
14389D52154J985k314k29N874L028m072m338N990M364n442k416M393Q948M716
14375D72641N13M319j532o28M291j299J148J267r643p097L564N486k060Q12N864
14360D77646p285j172M770K514n105J0185J1580l1j710k833j674P711j772l435
14346D89389K150o9O677O61M856l350m370q094K466l668j035J045P233M394M278
14331E02563K920m626k020M027P697M304l644n170K817L173M764O34k525k944
14317E11970p88M977L554n54J98j33L978J662m505k65j39k325q28N50K478m575
14301E15255j285j248J374J090N381J708O095J710J775K944O63O325m40j834K411
14286E41924k289N540l812j1594L724j89L894M24M081O411j246p992m884Q79J1224
$$ plain form
14389 452154 454139 451825 451596 457470 460498 456426 452088 458078 462442 457000 454584 458977 467925 472641
14375 472641 473154 477473 475941 475313 479604 478305 479453 480720 471077 463980 467544 473030 470970 471782 477646
14360 477646 470361 469189 473959 476473 471368 481553 493133 493102 491392 488559 486885 494596 492824 489389
14346 489389 491539 491470 498147 498808 503664 500314 495944 487850 490316 486648 485613 486658 493891 498285 502563
14331 502563 505483 500857 498837 502864 510561 514865 511221 506051 508868 512041 516805 517439 514914 511970
14317 511970 511182 516159 519713 519159 519357 519224 523202 524864 520359 520094 519955 517630 516802 517352 519830 515255
14301 515255 513970 512722 514096 515186 520567 522275 528370 530080 531855 534799 535462 541787 541347 539513 541924
14286 541924 539635 545175 541363 529769 533493 533304 537198 537622 541703 548114 546868 538876 533992 534871 546095
14271E46095M941O779k370l294j415O374j647O149J572o597q164n65m8k502L14
14256E45622L539L497K933J230L494k56k282k114m46n727O782O984j793K232L252
14241E66947J184m930N352J328k227J823J508j0327q408J868L118Q420N704J577
14227E72937P966M264J325l095o779l265O869K161l732N159L287j984J102j505
14213E84710L146l0j115Q259J247K005L061k089n797M974j306n16M066J319L52
14198F02286O549O7l891J028m286K949L366N41r0k942r49N970M400M305J103k138
14182F18268k543m166J898J516J0758P394O59q728O84K555m408j775P793l251
14168F26654o370k486K471P216l05K826J76p618N82M150L038K333L845N440n945
$$ plain form
14271 546095 551036 557815 555445 552151 550736 557110 555463 561612 563184 556587 548423 547858 547810 545308 545622
14256 545622 549161 552658 555591 556821 560315 560059 557777 555663 555217 549490 556272 563256 561463 563695 566947
14241 566947 568131 563201 568553 569881 567654 569477 570985 560658 552250 554118 557236 565656 571360 572937
14227 572937 580903 585167 586492 583397 576618 573353 580222 582383 578651 583810 587097 585113 586215 584710
14213 584710 587856 587826 586711 594970 596217 598222 601283 599194 593397 598371 597065 596549 600615 601934 602286
14198 602286 608835 608902 605011 606039 601753 604702 608068 608609 608519 605577 604628 610598 614998 619303 620406 618268
14182 618268 615725 611559 613457 614973 625731 633125 633784 625056 625740 628295 623887 622112 629905 626654
14168 626654 620284 617798 620269 627485 627180 630006 630182 622564 623146 627296 630334 632667 636512 641952 636007
14153F36007n647J157J77N193Q391l110l199J112k316r94N049M117M856O19o558
14138F44854J928K088j155K189L189J3405l54r106K696q97K736Q91k65J549l710
14123F60038j853K2K977J120j738K35N872J816J293P507M205J878K752j188O66
14108F85602l65p001L748N928N1J945l281l091M502P652L13L26l655m33k351r83
14092F88907l812P371M603J777J118p46K079M010k505K062J014n297K022L483
14078G06086k193J971n686L732k387Q9M330L231j061J883o40m056K41P014L682
14063G16236L679n698j931m291M326N376J285k677N679o030O679L935O403O606
14049G39577k585j968L386N80J305L841j982n058k479l378k344L646L860L715
$$ plain form
14153 636007 630360 631517 631694 636887 645278 642168 638969 640081 637765 636771 641820 645937 650793 651412 644854
14138 644854 646782 648870 647715 649904 653093 666498 666144 657038 659734 658837 661573 662464 662199 663748 660038
14123 660038 658185 658207 661184 662304 660566 660801 666673 668489 669782 677289 681494 683372 686124 684936 685602
14108 685602 685237 678236 681984 687912 687963 689908 686627 683536 688038 695690 696003 696329 692674 692241 689890 688907
14092 688907 685095 692466 697069 698846 699964 699218 701297 705307 702802 704864 705878 700581 702603 706086
14078 706086 703893 705864 700178 703910 701523 701612 705942 709173 708112 709995 709355 705299 705540 712554 716236
14063 716236 719915 714217 712286 707995 712321 717697 718982 716305 721984 715954 722633 726568 732971 739577
14049 739577 736992 735024 738410 738990 740295 744136 742154 737096 734617 731239 728895 732541 736401 740116
14035G40116L66j040q53K437L196l65M573N913M133l423L223l940j0271R88m54
14020G44599J918O277n60N940R691M020k638l542l370N204N060j113n858p98Q28
14005G65658M615L962K924j806M687O004J512j123j106o494K897O076J0223K278
13991H00307j84n256q036k701Q800O488M156M022P96p314j369L506k62k874L984
13976H04063P527N560q62m416K257J404o365n244L878Q345j533J189P601N673
13962H29077l123l702L088m610j308L937M240M987m217K528N449P97o091m681
13948H26371O492L229O770O07m138P93K750N494P087o071l563J524k591J138J0188
13933H56080l176j875Q234J767K168M397N531L04q102O80K258L812J0N650M189
$$ plain form
14035 740116 740482 739442 738589 741026 744222 743857 748430 754343 758476 755053 758276 754336 744065 745053 744599
14020 744599 746517 752794 752234 758174 767865 771885 769247 765705 762335 767539 772599 771486 765628 764830 765658
14005 765658 770273 774235 777159 775353 780040 786044 787556 786433 785327 778833 781730 787806 798029 800307
13991 800307 800123 794867 786831 784130 792930 799418 803574 807596 808392 801078 799709 803215 802953 800079 804063
13976 804063 811590 817150 816288 811872 814129 815533 809168 803924 807802 816147 814614 815803 823404 829077
13962 829077 825954 822252 825340 820730 819422 823359 827599 832586 828369 830897 836346 837143 831052 826371
13948 826371 832863 836092 842862 843469 839331 840124 842874 848368 855455 849384 845821 847345 844754 845892 856080
13933 856080 852904 851029 859263 861030 863198 867595 873126 873430 865328 866008 868266 872078 872088 877738 881927
13918H81927j032J16j976q09R21k094j283m403l418r23q47J011R732R003P981
13903H93906N74l158N774K341N061J0823K629j210o464R20J3409J82m525k886
13889I17376J634K952j64j7J251q36O383J415n073k883m249k264J841J723O073
13874I25162m304K185M640P489Q766k121l440N632K473J939K76L017j066O26o881
13859I44393J801L218l96O051j19M293O997m564J228N002K843K108j460m669K544
13844I69270m130P83m24M948J0165n842p445M942J2104p004k400K232J0719N841
13830I93759K086j059J824k690N13M330P889P486m02R59N923K642o378k512K394
13815A016764l144l793r49K984j753J349M251Q14L397p294l55J1538R242J706
$$ plain form
13918 881927 880895 881011 879035 878226 879147 877053 875770 871367 867949 867026 866179 867190 876922 885925 893906
13903 893906 894480 891322 897096 899437 904498 915321 917950 916740 910276 911196 924605 924787 920262 917376
13889 917376 919010 921962 921798 921781 923032 922196 928579 929994 924921 922038 917789 915525 917366 919089 925162
13874 925162 920858 923043 927683 935172 943938 941817 938377 944009 946482 948421 948697 951714 950648 951274 944393
13859 944393 946194 949412 949016 955067 954948 959241 966238 961674 962902 967904 970747 972855 971395 966726 969270
13844 969270 965140 965923 965499 970447 980612 974770 967325 972267 984371 977367 974967 977199 987918 993759
13830 993759 995845 994786 996610 993920 994433 998763 1006652 1014138 1013736 1014695 1020618 1023260 1016882 1014370 1016764
13815 1016764 1013620 1009827 1008878 1011862 1010109 1011458 1015709 1016523 1019920 1012626 1012271 1023809 1033051 1034757
13801A034757k342j349o06l89K578M072M344O576P43P58J659m631j097L727R72
13786A049772k77l085j219m861R93N356N262J0261O000P922N032k670K813N549
13772A086848L268M170n061L972J372L979j759M303j809n735m257L173K390K946
13758A097800L517k257p7L505k163M872N298J670J160N66m945K76Q927M499R58
13743A123606j506m113j991Q047R375j118L773O974k556j971j562N129N913P756
13729A155756N401L166q26n753j010r44Q051J940N08N44J154p17J336k228l092
13714A163286K962K795K735J753R223N169q68J675J738K972M250O467j142r19
13700A202096M122K18J869L994m060N41j082M305O626O476K100n36m761q821J939
$$ plain form
13801 1034757 1032415 1031066 1030460 1030071 1032649 1036721 1041065 1047641 1048384 1049142 1050801 1046170 1045073 1048800 1049772
13786 1049772 1049495 1046410 1045191 1040330 1041323 1046679 1051941 1062202 1068202 1076124 1081156 1078486 1081299 1086848
13772 1086848 1090116 1094286 1089225 1093197 1094569 1098548 1096789 1101092 1099283 1093548 1089291 1092464 1094854 1097800
13758 1097800 1101317 1099060 1098983 1102488 1100325 1105197 1110495 1112165 1113325 1113891 1108946 1109222 1118149 1122648 1123606
13743 1123606 1122100 1117987 1115996 1124043 1133418 1132300 1136073 1143047 1140491 1138520 1136958 1142087 1148000 1155756
13729 1155756 1161157 1164323 1163497 1157744 1156734 1155790 1163841 1165781 1166289 1166833 1167987 1167270 1168606 1166378 1163286
13714 1163286 1166248 1169043 1171778 1173531 1182754 1187923 1187055 1188730 1190468 1193440 1197690 1204157 1203015 1202096
13700 1202096 1206218 1206436 1208305 1212299 1208239 1208780 1207698 1212003 1218629 1225105 1227205 1226669 1221908 1213087 1215026
13685A215026Q778J0874M015M148J236Pl358K529N72L920L82q156m308L570J1443
13670A250678N468J2371O518l360j506l889N998J145k188o489j501J0103N330
13657A278678M882j32r812Q13J411Q838O539O000O12O808J00J858N012K364k162
13642A311809o768j278K215L069M123L261O209P734M863O072k580n587j929O365
13628A337578N761j121J940K686J0890J610m017O160R036P931J0332K214l845
13615A387155l299l08J989k625m505Q777R350J625k211Q54M357L064J804M0j099
13600A404968N400L608m090j909L328Q19n085l156N866J0440L394K664J1801N389
13586A443437j426j947K271M546O918M956N51O294N49m231R90Q51J644L198M496
$$ plain form
13685 1215026 1223804 1234678 1238693 1242841 1244077 1244084 1240726 1243255 1243827 1247747 1248129 1239973 1235665 1239235 1250678
13670 1250678 1256146 1268517 1275035 1271675 1270169 1266280 1272278 1273423 1271235 1264746 1263245 1273348 1278678
13657 1278678 1283560 1283428 1273616 1274429 1275840 1284678 1291217 1297217 1297829 1304637 1304737 1306595 1311607 1313971 1311809
13642 1311809 1305041 1303763 1305978 1309047 1313170 1316431 1322640 1330374 1335237 1341309 1338729 1333142 1331213 1337578
13628 1337578 1343339 1342218 1344158 1346844 1357734 1359344 1355327 1361487 1370523 1378454 1388786 1391000 1387155
13615 1387155 1383856 1383548 1385537 1382912 1378407 1387184 1396534 1398159 1395948 1396802 1401159 1404223 1406027 1406067 1404968
13600 1404968 1410368 1413976 1409886 1407977 1411305 1412124 1407039 1403883 1409749 1420189 1423583 1426247 1438048 1443437
13586 1443437 1442011 1440064 1442335 1446881 1453799 1458755 1459306 1465600 1466149 1461918 1462908 1463759 1465403 1468601 1473097
13571A473097N638J0L421j293K305O942Q668M597m492l853P594K552p0k27l247
13556A501642Q339O731J950O369M806J22l271Q982j127J06N754K024J061l573
13542A539915K505L510M38M786L147N084R169Q092L145k052n370J162N381N553
13528A584465Q025J0575K017j0913L681J1015J894J380J0537k747j099K996Q548
13515A630374N242q7Q03k010M987J945j154n5P623J0169L187L586L147K075p073
13500A662759N060J629P648O934P030M397M539O256N966P46m760J561L167j703
13486A711229M177Q374K627K028M974m029J024q31N123N668P217J0425Q502O174
13472A772682N070M389j686L276N845O959k849K301k074P07J994Q757J705L267
$$ plain form
13571 1473097 1478735 1478745 1482166 1480873 1483178 1490120 1498788 1503385 1498893 1495040 1502634 1505186 1505116 1504889 1501642
13556 1501642 1509981 1516712 1518662 1525031 1529837 1529959 1526688 1535670 1534543 1534649 1540403 1542427 1543488 1539915
13542 1539915 1542420 1545930 1546368 1551154 1554301 1559385 1568554 1576646 1579791 1577739 1572369 1573531 1578912 1584465
13528 1584465 1592490 1603065 1605082 1594169 1597850 1608865 1610759 1612139 1622676 1619929 1618830 1621826 1630374
13515 1630374 1635616 1635529 1636332 1634322 1639309 1641254 1640100 1640045 1647668 1657837 1661024 1664610 1667757 1669832 1662759
13500 1662759 1667819 1669448 1677096 1684030 1691060 1695457 1699996 1706252 1712218 1712964 1708204 1709765 1712932 1711229
13486 1711229 1715406 1723780 1726407 1728435 1733409 1729380 1730404 1729573 1734696 1740364 1747581 1758006 1766508 1772682
13472 1772682 1777752 1782141 1780455 1783731 1789576 1796535 1793686 1795987 1793913 1794620 1796614 1805371 1807076 1810343
13458A810343J0745Q124K165K070J187O848O921j786J466N386l776l775P188Q216
13444A861322J0375N082n126L048j041K562J2170L160K348K723M788P686J0164
13431A919261k404m511O418P682j954O539P763J872M752J161O375P371K634M291
13417A967250M021J0302M069n830K209N005K59J2265J3895N392J033k14p88K174
13403B021042Q678O721K098p0P393Q846L404M233M503N427J4505J885j346K989
13389B090308R10P4L279Q098M910K219N895N576M944N388J0022R754k919J869
13375B150327N699J2645J2640J0673j148M735O81N610J203M716J3149l54J0171
13362B230747M770l586N846J3125R046M618M931J0656J0938R838P60P4K688Q642
$$ plain form
13458 1810343 1821088 1829212 1831377 1833447 1834634 1841482 1848403 1846617 1848083 1853469 1849693 1845918 1853106 1861322
13444 1861322 1871697 1876779 1871653 1874701 1873660 1876222 1888392 1891552 1893900 1896623 1901411 1909097 1919261
13431 1919261 1916857 1912346 1918764 1926446 1924492 1931031 1938794 1940666 1945418 1946579 1952954 1960325 1962959 1967250
13417 1967250 1971271 1981573 1985642 1979812 1982021 1987026 1987285 1999550 2013445 2018837 2019870 2019656 2018868 2021042
13403 2021042 2029720 2036441 2038539 2038469 2045862 2054708 2058112 2062345 2066848 2072275 2086780 2088665 2087319 2090308
13389 2090308 2091218 2091292 2094571 2102669 2107579 2109798 2115693 2121269 2126213 2131601 2141623 2151377 2148458 2150327
13375 2150327 2156026 2168671 2181311 2191984 2190836 2195571 2196252 2201862 2203065 2207781 2220930 2220576 2230747
13362 2230747 2235517 2231931 2237777 2250902 2259948 2264566 2269497 2280153 2291091 2300929 2301689 2301763 2304451 2313093
13348B313093J778P771N484Q617J2238N487Q362O300m443L099J619R277J7299
13335B395981J1420J777O13O222O800J6773J3752J0032R412J0000J764Q411R522
13322B502479J0271J13L140M834J6722O309p364Q65J8134K0472K1396K2750R385
13309B629506O710J2847J1444J4038J1672P82J2463K0679K8164K4119J0570K0872
13297B803866K9835J8138J5050K3870M0259M2356M3237M0701M0548M8005N2356
13286C198221O5788R1637J22219J52942J77569J73172O3351k53786o46831p52575
13276B391707o27840l81941m8588J15348J38198J22923J11038R8857P7015O1441
13266B058158M7879M3134L7229L5611L4978K6011L2375L0750L0935L4615K5558
$$ plain form
13348 2313093 2314871 2322642 2328126 2336743 2348981 2354468 2362830 2369130 2364687 2367786 2369405 2378682 2395981
13335 2395981 2407401 2409178 2409791 2416013 2422813 2439586 2453338 2463370 2472782 2482782 2484546 2492957 2502479
13322 2502479 2512750 2512863 2516003 2520837 2537559 2543868 2536504 2537369 2555503 2575975 2597371 2620121 2629506
13309 2629506 2636216 2649063 2660507 2674545 2686217 2686999 2699462 2720141 2748305 2772424 2782994 2803866
13297 2803866 2833701 2851839 2866889 2890759 2931018 2973374 3016611 3057312 3097860 3145865 3198221
13286 3198221 3264009 3355646 3477865 3630807 3808376 3981548 4044899 3791113 3144282 2391707
13276 2391707 1763867 1381926 1333338 1448686 1586884 1709807 1820845 1919702 1996717 2058158
13266 2058158 2106037 2149171 2186400 2222011 2256989 2283000 2315375 2346125 2377060 2411675 2437233
13255B437233K0857J3064J2867J4446N274J3231J9080K1068K3850K0339J4819
13244B616128J3865J3631J4246J5829J0534Q09J0725J6688J3865J1795R587O823
13232B754525J3668J2964N413R490K8520K0174Q267M807J3546J4704J1753R97
13220B898828N453N735L591M504J1433J1293J6374J8524J4837J2539J2097J2558
13208C027766M105J0120J2496L105K268R274J2073K701K215J2899J4487N906Q505
13195C127920J6507J1420o83N481K0828K2378J0184L813K925R724J6245J1075
13183C257817J1572Q435J4025Q640R130J9581J3790Q546J3517J0499l080J524
13171C373996O485J3177J5677K3416K0436P386J4515Q513Q285Q288J2281J4194
$$ plain form
13255 2437233 2458090 2471154 2484021 2498467 2503741 2516972 2536052 2557120 2580970 2601309 2616128
13244 2616128 2629993 2643624 2657870 2673699 2684233 2685042 2695767 2712455 2726320 2738115 2747702 2754525
13232 2754525 2768193 2781157 2786570 2796060 2824580 2844754 2853021 2857828 2871374 2886078 2897831 2898828
13220 2898828 2904281 2910016 2913607 2918111 2929544 2940837 2957211 2975735 2990572 3003111 3015208 3027766
13208 3027766 3031871 3041991 3054487 3057592 3059860 3069134 3081207 3083908 3086123 3099022 3113509 3119415 3127920
13195 3127920 3144427 3155847 3155164 3160645 3181473 3203851 3214035 3217848 3220773 3230497 3246742 3257817
13183 3257817 3269389 3277824 3291849 3300489 3309619 3329200 3342990 3351536 3365053 3375552 3372472 3373996
13171 3373996 3380481 3393658 3409335 3432751 3453187 3460573 3475088 3483601 3491886 3500174 3512455 3526649
13159C526649J1992J1382J0129J6667K1074J7081J8355J2000N248R350Q571M846
13147C673344J7913J4912J4686J0768J1292P593R145J3483J4969J4995O777Q122
13135C817999J4726J3004J8452J5773J5229K9495K8219L1555L4329K6914J0289
13124D055984K666o726l419J0799J6768J1596O373R708J1929m55M327K2787L3218
13111D175555L4215J9599J2130O138P41N395J9409K4973J9829J9706K3786J1722
13099D373198J5949J3905K5608K0013J3081J5786K5475L3394K0963J4434Q229
13088D580035J6773K2066K6486K4193K2803K4272K4830K2103K0861K0543K9945
13077D834910K6489K7487M0061L6274M3015N6381M7698k165k4658o2569n9168
$$ plain form
13159 3526649 3538641 3550023 3560152 3576819 3597893 3614974 3633329 3645329 3650577 3659927 3668498 3673344
13147 3673344 3691257 3706169 3720855 3731623 3742915 3750508 3759653 3773136 3788105 3803100 3809877 3817999
13135 3817999 3832725 3845729 3864181 3879954 3895183 3924678 3952897 3984452 4018781 4045695 4055984
13124 4055984 4058650 4051924 4048505 4059304 4076072 4087668 4094041 4103749 4115678 4115223 4119550 4142337 4175555
13111 4175555 4209770 4229369 4241499 4247637 4248378 4253773 4273182 4298155 4317984 4337690 4361476 4373198
13099 4373198 4389147 4403052 4428660 4448673 4461754 4477540 4503015 4536409 4557372 4571806 4580035
13088 4580035 4596808 4618874 4645360 4669553 4692356 4716628 4741458 4763561 4784422 4804965 4834910
13077 4834910 4861399 4888886 4928947 4965221 5008236 5064617 5112315 5110150 5085492 5022923 4963755
13066D963755o794l3932l0691O904K8704K6431K0492L1415L6369L8088L4522L6748
13054E152011L2133K5716K7265L0252K8164J4117J7794K0956J8588J9855K7516
13043E414367J9329K1154K7250L0613K9401K2022K7728L0368K8673L4079M2506
13032E727490L2672L0484L9004N3027L6545L0046K9541K3494J2900J5667K1827
13021F052697L0942L7498L5417M0000L7991L9189L6694K8015K0610P763R477J5045
13009F391338K7782M6748N7500N9559O0716P0477O0690L7485K9317L2594M6243
12998F920449N4260M9372M4181L0589K9900K3460K8158K4403K9446L3384M4614
12987G312216N3240N0606N6052N4232M0278M1922M1436L7902L8288M6138M9491
$$ plain form
13066 4963755 4956961 4923029 4892338 4899242 4927946 4954377 4974869 5006284 5042653 5080741 5115263 5152011
13054 5152011 5184144 5209860 5237125 5267377 5295541 5309658 5327452 5348408 5366996 5386851 5414367
13043 5414367 5433696 5454850 5482100 5512713 5542114 5564136 5591864 5622232 5650905 5684984 5727490
13032 5727490 5760162 5790646 5829650 5882677 5919222 5949268 5978809 6002303 6015203 6030870 6052697
13021 6052697 6083639 6121137 6156554 6196554 6234545 6273734 6310428 6338443 6359053 6366816 6376293 6391338
13009 6391338 6419120 6465868 6523368 6582927 6643643 6714120 6774810 6812295 6841612 6874206 6920449
12998 6920449 6974709 7024081 7068262 7098851 7128751 7152211 7180369 7204772 7234218 7267602 7312216
12987 7312216 7365456 7416062 7472114 7526346 7566624 7608546 7649982 7687884 7726172 7772310 7821801
12976G821801N6499P5842J01981J66864K42623K45898J46636N6286L911m4019
12966H874322k5081j441J3998K5255M0502N2387M7796M3915M2334L4985M8296
12955I197268N8171O4465O7487P6364P2910P7751Q5875P9271P9236P9574O9847
12944A0008219O2746M6978O0553J18273M6824j2610O5450J40118R9042Q9006R5761
12933A0820360P7808P7855Q5239R3856J07780J13061J13565J10853J15613J13639
12923A1829629J16478J22680J36843J40521J28437J26690J37021J38220J42527
12914A3019046J60493J64336J66156J73001J70618J48891J18094Q4006N4851O6426
12904A4325918R1459J15950J48434J68260J85446K11170K08801K17375K22480
$$ plain form
12976 7821801 7878300 7954142 8056123 8222987 8465610 8711508 8858144 8914430 8918341 8874322
12966 8874322 8849241 8847800 8861798 8887053 8927555 8979942 9027738 9071653 9113987 9148972 9197268
12955 9197268 9255439 9319904 9387391 9463755 9536665 9614416 9700291 9779562 9858798 9938372 10008219
12944 10008219 10070965 10117943 10178496 10296769 10343593 10330983 10396433 10536551 10635593 10724599 10820360
12933 10820360 10898168 10976023 11061262 11155118 11262898 11375959 11489524 11600377 11715990 11829629
12923 11829629 11946107 12068787 12205630 12346151 12474588 12601278 12738299 12876519 13019046
12914 13019046 13179539 13343875 13510031 13683032 13853650 14002541 14120635 14204641 14259492 14325918
12904 14325918 14417377 14533327 14681761 14850021 15035467 15246637 15455438 15672813 15895293
12895A5895293K24419K28645K32060K26500K18635K11038K18581K36130K55256
12886A7946557K69460K83009K70457K64376K77485K87026L09106L25999L46101
12877B0579576L51447L45549L44689L43926L56414L93888M05748M15827M15059
12868B3952123M17901M30575M44214M58064M64182M90307N34183N61796O08552
12859B8361897O56388P08262P51060P90692Q15422Q54363R07766R30951R44508
12850C5721309R76246J030139J116589J184924J248650J326384J403548J483208
12842D5490997J598142J703277J843716K041166K278437K534243K787808L025621
12834F3303407L267050L542267L859783M311670M940663N626584O115664O508268
$$ plain form
12895 15895293 16119712 16348357 16580417 16806917 17025552 17236590 17455171 17691301 17946557
12886 17946557 18216017 18499026 18769483 19033859 19311344 19598370 19907476 20233475 20579576
12877 20579576 20931023 21276572 21621261 21965187 22321601 22715489 23121237 23537064 23952123
12868 23952123 24370024 24800599 25244813 25702877 26167059 26657366 27191549 27753345 28361897
12859 28361897 29018285 29726547 30477607 31268299 32083721 32938084 33845850 34776801 35721309
12850 35721309 36697555 37727694 38844283 40029207 41277857 42604241 44007789 45490997
12842 45490997 47089139 48792416 50636132 52677298 54955735 57489978 60277786 63303407
12834 63303407 66570457 70112724 73972507 78284177 83224840 88851424 94967088 101475356
12826A01475356P405751Q869638J0763855J3509101J6982718K1181182K6197132
12819B06384733L0749216K8450863J089644o4240347j27052195j30951629j08670998
12812a64240713o6709914q131330K0165100K4731441K2099580J8439408J5257074
12805a38389354J2434546R951155P858318O288288N633411N273393N071529M881802
12797h0996912M541855M053938L476338K946463K526570K298239K213737K179558
12789e6760214K159345K085092J945916J790799J644711J511587J374379J272605
12781d2975780J212784J130883J055332J005508R46416R08696Q72138Q42629Q23613
12772c4177781P75104P52031P15488O96829O91363O86182O49741O12253O04616
$$ plain form
12826 101475356 108881107 117750745 128514600 142023701 159006419 180187601 206384733
12819 206384733 237133949 265584812 266674456 202434109 75381914 -55569715 -164240713
12812 -164240713 -230950627 -239081957 -218916857 -194185416 -172085836 -153646428 -138389354
12805 -138389354 -125954808 -116003653 -108145335 -101857047 -96223636 -90950243 -85878714 -80996912
12797 -80996912 -76455057 -72401119 -68924781 -65978318 -63451748 -61153509 -58939772 -56760214
12789 -56760214 -54600869 -52515777 -50569861 -48779062 -47134351 -45622764 -44248385 -42975780
12781 -42975780 -41762996 -40632113 -39576781 -38571273 -37624857 -36716161 -35844023 -35001394 -34177781
12772 -34177781 -33402677 -32650646 -31935158 -31238329 -30546966 -29860784 -29211043 -28598790 -27994174
12763b7994174N87410N42270M69834L77876L34728L40489L75467M12448M36734
12754b4116918M54987M22127L98556L86596L62214L45506L49510L49948L33939
12745b0713535L20978L06778K83746K81914K75660K66457K71270K73680K60873
12736a8172179K37917K24279K15285K11195K00749J93315J95029K09140K04952
12727a6280318K09267K08506J98737J95479J94376J94593J94545J76695J49456
12718a4558664J23040J00826J06063J18780J29912J41915J41746J39387J27183
12709a3429812J17811J17007J16964J13766J11141J18423J15271J11713J12814
12700a2394902J03046J11397J17312J21042J20442J13639J01565R0621Q4268Q1528
$$ plain form
12763 -27994174 -27406764 -26864494 -26394660 -26016784 -25682056 -25341567 -24966100 -24553652 -24116918
12754 -24116918 -23661931 -23239804 -22841248 -22454652 -22092438 -21746932 -21397422 -21047474 -20713535
12745 -20713535 -20392557 -20085779 -19802033 -19520119 -19244459 -18978002 -18706732 -18433052 -18172179
12736 -18172179 -17934262 -17709983 -17494698 -17283503 -17082754 -16889439 -16694410 -16485270 -16280318
12727 -16280318 -16071051 -15862545 -15663808 -15468329 -15273953 -15079360 -14884815 -14708120 -14558664
12718 -14558664 -14435624 -14334798 -14228735 -14109955 -13980043 -13838128 -13696382 -13556995 -13429812
12709 -13429812 -13312001 -13194994 -13078030 -12964264 -12853123 -12734700 -12619429 -12507716 -12394902
12700 -12394902 -12291856 -12180459 -12063147 -11942105 -11821663 -11708024 -11606459 -11515838 -11431570 -11350042
12690a1350042P9201O4646O1189P7128O5689Q0437R3259R6789R0519Q6623P5610
12679a0478952P8184Q3171P0573P1813Q0631P9091Q2006R1078R1013P2090P1881
12668i607421P9048P8125R0446R9238J08939J31548J68781J99304J48570J4994
12658h488428o8243j04361j21515o4480O072L4034M3147N3062N2330N5033N9249
12647h544100O1158N5334N0343M6739L8270L3736L9313L9597M8822N8505O4571
12636h007712O4813O7177N5819M3973M2132L6779L0464L9906M6847M0938K6772
12625g512092J7636J2170O023J6319J5517J9767M3127O1088P3088N9513M6445
12614g141399M1340K8907K9695K5590K4054K0796K1537L9477M5877M6567N0805
$$ plain form
12690 -11350042 -11270841 -11206195 -11145006 -11067878 -11002189 -10921752 -10828493 -10731704 -10641185 -10554562 -10478952
12679 -10478952 -10400768 -10317597 -10247024 -10175211 -10094580 -10015489 -9933483 -9842405 -9751392 -9679302 -9607421
12668 -9607421 -9528373 -9450248 -9359802 -9260564 -9151625 -9020077 -8851296 -8651992 -8503422 -8488428
12658 -8488428 -8556671 -8661032 -8782547 -8847027 -8840955 -8806921 -8763774 -8710712 -8658382 -8603349 -8544100
12647 -8544100 -8482942 -8427608 -8377265 -8330526 -8292256 -8258520 -8219207 -8179610 -8130788 -8072283 -8007712
12636 -8007712 -7942899 -7875722 -7819903 -7775930 -7733798 -7697019 -7666555 -7626649 -7579802 -7538864 -7512092
12625 -7512092 -7494456 -7482286 -7476263 -7459944 -7444427 -7424660 -7381533 -7320445 -7247357 -7187844 -7141399
12614 -7141399 -7100059 -7071152 -7041457 -7015867 -6991813 -6971017 -6949480 -6910003 -6864126 -6817559 -6766754
12603f766754M8228L3342K8217K5850J7579K4616J9674J4511K5517L2373L2522
12592f464325K0704K2755K4069J7903L1520L2240L2710L6925L2077K8748L3229
12581f151445L6754L1119K7728L7489K5965K9792L1114K7856K5334K2318J5496
12570e840480K9555L2354K4730L2399K2695J8489K9851L6200K7365M2741N0268
12559e493833L0370J9894N653j6791k7016k2677j4030J1827K5721K2088K7692
12548e431102L2089L4817L0061K9223L5067L4399L8636L7854L0605K3036j1988
12537e117303m3353m8852l7151j4671J0638K4674L4807L3510K8841J5432K3363
12526e090065K0599J4592J9193J4761J3518K4383L0830K5927J4000M816O852J1946
$$ plain form
12603 -6766754 -6718526 -6685184 -6656967 -6631117 -6613538 -6588922 -6569248 -6554737 -6529220 -6496847 -6464325
12592 -6464325 -6443621 -6420866 -6396797 -6378894 -6347374 -6315134 -6282424 -6245499 -6213422 -6184674 -6151445
12581 -6151445 -6114691 -6083572 -6055844 -6018355 -5992390 -5962598 -5931484 -5903628 -5878294 -5855976 -5840480
12570 -5840480 -5810925 -5778571 -5753841 -5721442 -5698747 -5680258 -5650407 -5614207 -5586842 -5544101 -5493833
12559 -5493833 -5463463 -5443569 -5437916 -5454707 -5481723 -5504400 -5518430 -5506603 -5480882 -5458794 -5431102
12548 -5431102 -5399013 -5364196 -5334135 -5304912 -5269845 -5235446 -5196810 -5158956 -5128351 -5105315 -5117303
12537 -5117303 -5160656 -5209508 -5246659 -5261330 -5250692 -5226018 -5191211 -5157701 -5128860 -5113428 -5090065
12526 -5090065 -5069466 -5054874 -5035681 -5020920 -5007402 -4983019 -4952189 -4926262 -4912262 -4907446 -4900594 -4888648
12514d888648K4938K7650J9319K1820K4277J8530J7289J6090L3821L8639K0535
12503d625740K0131P980l286n178O761R170J3452J6399O670Q023J1476J4258J4987
12490d504897K2541K2694K3052J4292J92J0542J7596J6326K0821J6569R501J2963
12478d317808J4450J9272J1993K200N345P676J2865J3722J2036J0528J2546J7195
12466d177980J2652J6052R961K941M478P616J3816J1665O225J0245J3892J8303
12454d050134J6516J2172J6335J0312R580N449J5713J2003R682P863J0547Q082
12442c915880N409J0352J3851J8024J3621J0077J3079N460J5062J9159N720M138
12430c781928O237L202J2529J3109J7355J7894K1337J4845P674J3557J0898P076
$$ plain form
12514 -4888648 -4863710 -4836060 -4816741 -4794921 -4770644 -4752114 -4734825 -4718735 -4684914 -4646275 -4625740
12503 -4625740 -4605609 -4597629 -4600915 -4606093 -4599332 -4590162 -4576710 -4560311 -4553641 -4545618 -4534142 -4519884 -4504897
12490 -4504897 -4482356 -4459662 -4436610 -4422318 -4422126 -4411584 -4393988 -4377662 -4356841 -4340272 -4330771 -4317808
12478 -4317808 -4303358 -4284086 -4272093 -4269893 -4264548 -4256872 -4244007 -4230285 -4218249 -4207721 -4195175 -4177980
12466 -4177980 -4165328 -4149276 -4139315 -4136374 -4131896 -4124280 -4110464 -4098799 -4092574 -4082329 -4068437 -4050134
12454 -4050134 -4033618 -4021446 -4005111 -3994799 -3985219 -3979770 -3964057 -3952054 -3942372 -3934509 -3923962 -3915880
12442 -3915880 -3910471 -3900119 -3886268 -3868244 -3854623 -3844546 -3831467 -3826007 -3810945 -3791786 -3786066 -3781928
12430 -3781928 -3775691 -3772489 -3759960 -3746851 -3729496 -3711602 -3690265 -3675420 -3667746 -3654189 -3643291 -3636215
12418c636215O340J4784J0781L515M540L763P716J4106K5020K5228J4962N011
12406c500449Q942J2839J3149O598J095M747P394J3720J7777J9457J1102N527
12394c378102M467P040N056P187P897O496R727J3003J0454J1669J3747Q427J4601
12381c258331J0768Q875J9385K3527J4297J6592J8868J6235N613J0843R526J5421
12369c088381J9280K5434K4000J6774J9096K1936L0472K9179K4123K2254L4591
12358b821242L7900L9610M6816M5129N1977O1619P4821J01569J30773J56116J70453
12347a904459J47566k2295l95728p27786p18269n60670k74179J0129J36217J43166
12337d166308J26021J00584Q4692O5064N0470N5332N3489L2525K5381K4284K7846
$$ plain form
12418 -3636215 -3629875 -3615091 -3604310 -3600795 -3596255 -3592492 -3584776 -3570670 -3545650 -3520422 -3505460 -3500449
12406 -3500449 -3491507 -3478668 -3465519 -3458921 -3457826 -3453079 -3445685 -3431965 -3414188 -3394731 -3383629 -3378102
12394 -3378102 -3373635 -3366595 -3361539 -3354352 -3346455 -3339959 -3330232 -3317229 -3306775 -3295106 -3281359 -3272932 -3258331
12381 -3258331 -3247563 -3238688 -3219303 -3195776 -3181479 -3164887 -3146019 -3129784 -3124171 -3113328 -3103802 -3088381
12369 -3088381 -3069101 -3043667 -3019667 -3002893 -2983797 -2961861 -2931389 -2902210 -2878087 -2855833 -2821242
12358 -2821242 -2783342 -2743732 -2696916 -2651787 -2599810 -2538191 -2463370 -2361801 -2231028 -2074912 -1904459
12347 -1904459 -1756893 -1779188 -2174916 -2902702 -3620971 -4181641 -4455820 -4445691 -4309474 -4166308
12337 -4166308 -4040287 -3939703 -3855011 -3789947 -3739477 -3684145 -3630656 -3598131 -3572750 -3548466 -3520620
12326c520620L0246K8103K4767K4548K1405L1760K0429J4284J1557R758R282J9515
12314c274966J7535J3531J0346J3910J1089J8698J0818O726J0739O185O730Q647
12302c140012K0753N955O906P896J2444M886O427R368R660J1618J2473N164J0902
12289c015560M698M539O772Q397P50N243J5613R386P975m60R563P981J3926J2276
12275b908901M07M401N834N480p52J1834J4534K752N31L700M356L211Q887L116
12261b840610N652K903N269R104K275L011P935P57lO335J5306K878O699O420M174
12246b761895R964O770P798P797M251l660R300P784P210L933L832L306J3980P975
12232b671655J943n522K515J195O560M237R081L938L194J0709k571O434Q547N390
$$ plain form
12326 -3520620 -3490374 -3462271 -3437504 -3412956 -3391551 -3359791 -3339362 -3325078 -3313521 -3303763 -3294481 -3274966
12314 -3274966 -3257431 -3243900 -3233554 -3219644 -3208555 -3189857 -3179039 -3172313 -3161574 -3155389 -3148659 -3140012
12302 -3140012 -3119259 -3113304 -3106398 -3098502 -3086058 -3081172 -3074745 -3065377 -3055717 -3044099 -3031626 -3026462 -3015560
12289 -3015560 -3010862 -3006323 -2999551 -2991154 -2990404 -2985161 -2969548 -2960162 -2952187 -2952647 -2943084 -2935103 -2921177 -2908901
12275 -2908901 -2908494 -2904093 -2898259 -2892779 -2893531 -2881697 -2867163 -2864411 -2863880 -2860180 -2855824 -2852613 -2843726 -2840610
12261 -2840610 -2834958 -2832055 -2826786 -2817682 -2815407 -2812396 -2804461 -2803704 -2803707 -2797372 -2782066 -2779188 -2772489 -2766069 -2761895
12246 -2761895 -2751931 -2745161 -2737363 -2729566 -2725315 -2728975 -2719675 -2711891 -2704681 -2700748 -2696916 -2693610 -2679630 -2671655
12232 -2671655 -2669712 -2675234 -2672719 -2671524 -2664964 -2660727 -2651646 -2647708 -2644514 -2633805 -2636376 -2629942 -2621395 -2616005
12218b616005Q87Q071J1015Q440K774l925K871l537L255M081M05P134Q151P252
12204b559131P548N083R13j448L136R006J2157M288L389M861O090m301O41J2116
12190b495652Q553K200R881J654j0523m243M274Q155J2286O88L975L373j847l967
12176b461193N530J0529P933K441J125M611K723M480M842o73R521N761M821j5
12162b397564N253k338o709K112J5175N070J36o327K54O853J1527O259K867R55
12148b356477O348N397P39P340Q231K587M638J291N26k151j670Q663J790M861
12134b307887J999o651k900Q222P073N788M281J1295J3010K181N184m507l034
12121b265946O183J2014Q397j416J046j067J887K971L713L670J075p205p98N409
$$ plain form
12218 -2616005 -2615118 -2607047 -2596032 -2587592 -2584818 -2588743 -2585872 -2589409 -2586154 -2582073 -2581668 -2574534 -2566383 -2559131
12204 -2559131 -2551583 -2546500 -2545587 -2547035 -2543899 -2534893 -2522736 -2518448 -2515059 -2510198 -2504108 -2508409 -2507768 -2495652
12190 -2495652 -2487099 -2484899 -2475018 -2473364 -2483887 -2488130 -2483856 -2475701 -2463415 -2462727 -2458752 -2455379 -2457226 -2461193
12176 -2461193 -2455663 -2445134 -2437201 -2434760 -2433635 -2429024 -2426301 -2421821 -2416979 -2417652 -2408131 -2402370 -2397549 -2397564
12162 -2397564 -2392311 -2394649 -2401358 -2399246 -2384071 -2379001 -2378865 -2385192 -2384938 -2378085 -2366558 -2360299 -2357432 -2356477
12148 -2356477 -2350129 -2344732 -2343993 -2336653 -2328422 -2325835 -2321197 -2319906 -2319380 -2321531 -2323201 -2314538 -2312748 -2307887
12134 -2307887 -2305888 -2312539 -2315439 -2307217 -2300144 -2294356 -2290075 -2278780 -2265770 -2263589 -2258405 -2262912 -2265946
12121 -2265946 -2259763 -2247749 -2239352 -2240768 -2239722 -2240789 -2238902 -2235931 -2232218 -2228548 -2227473 -2234678 -2235476 -2230067
12107b230067R38P97P360J0288M894O844K011J681N366l287O642J195L263j597
12093b183672K820J075P33n39J524L943O034J370O317J306J621K04q46K456O810
12078b148844r94j790Q229J1059R158m952M934L893L436L997N428K969n205N911
12064b102771N014L419M156K818P039L773J226N709K107L016j325L01R01O300
12050b058317P366k241o584P125N043N060j995K849j070K671n323k276n01J0283
12036b037910J0649K729l342L122J1059K164j377j813J16l21P647R200p75N83
12022a998269O11N204P641q39m921L817J2116O294l528K279n793k716O487Q911
12008a962706K441n261o1L657L68l652N594L084j159K224J205R125M979M664L126
$$ plain form
12107 -2230067 -2229129 -2228332 -2220972 -2210684 -2205790 -2198946 -2196935 -2195254 -2189888 -2193175 -2186533 -2185338 -2182075 -2183672
12093 -2183672 -2180852 -2179777 -2179044 -2179583 -2178059 -2174116 -2168082 -2166712 -2160395 -2159089 -2157468 -2157264 -2158110 -2155654 -2148844
12078 -2148844 -2149838 -2151628 -2143399 -2132340 -2123182 -2128134 -2123200 -2119307 -2115871 -2111874 -2106446 -2103477 -2108682 -2102771
12064 -2102771 -2097757 -2094338 -2090182 -2087364 -2080325 -2076552 -2075326 -2069617 -2067510 -2064494 -2065819 -2065518 -2064617 -2058317
12050 -2058317 -2050951 -2053192 -2059776 -2052651 -2047608 -2042548 -2044543 -2041694 -2042764 -2040093 -2045416 -2047692 -2048193 -2037910
12036 -2037910 -2027261 -2024532 -2027874 -2024752 -2013693 -2011529 -2012906 -2014719 -2014603 -2014924 -2007277 -1998077 -1998852 -1998269
12022 -1998269 -1997658 -1992454 -1984813 -1985652 -1990573 -1986756 -1974640 -1968346 -1971874 -1969595 -1975388 -1978104 -1971617 -1962706
12008 -1962706 -1960265 -1965526 -1965587 -1961930 -1961562 -1965214 -1959620 -1956536 -1957695 -1955471 -1954266 -1945141 -1940162 -1935498 -1932372
11993a932372j056L366m310k147M981K600L500P645O816K94J628j983k935O42
11979a913331J59N01K008j0107o086J861Q725L154J766J877J374L701K745P93
11965a900860P79Q998L539J747k070n764N054O472J525K305J221J449j079L499
11951a873185J0174M413J665j213j682J577n77K219J478K548M296R0L165n252
11937a850284l238O035j788J685L154N854k619j567K901k88N170Q299O465L851
11923a816370r74l018j424l77K319L098m36n89O314M430R406O798k595l235m740
11908a801393n99O878P622J1289R848L117j748l58M172l763p649m063O861l891
11894a773677o942J537L011N697N73L987O054o44L398L984L376k262l723Q303
$$ plain form
11993 -1932372 -1933428 -1930062 -1934372 -1936519 -1931538 -1928938 -1925438 -1917793 -1910977 -1910683 -1909055 -1911038 -1913973 -1913331
11979 -1913331 -1913172 -1912671 -1910663 -1920770 -1926856 -1924995 -1916270 -1913116 -1911350 -1909473 -1908099 -1904398 -1901653 -1900860
11965 -1900860 -1900081 -1891083 -1887544 -1885797 -1887867 -1893631 -1888577 -1882105 -1880580 -1878275 -1877054 -1875605 -1876684 -1873185
11951 -1873185 -1863011 -1858598 -1856933 -1858146 -1859828 -1858251 -1858828 -1856609 -1855131 -1852583 -1848287 -1848197 -1845032 -1850284
11937 -1850284 -1853522 -1847487 -1849275 -1847590 -1844436 -1838582 -1841201 -1842768 -1839867 -1840155 -1834985 -1826686 -1820221 -1816370
11923 -1816370 -1817344 -1820362 -1821786 -1822163 -1819844 -1816746 -1817182 -1817771 -1811457 -1807027 -1797621 -1790823 -1793418 -1796653 -1801393
11908 -1801393 -1801992 -1795114 -1787492 -1776203 -1766355 -1763238 -1764986 -1765344 -1761172 -1764935 -1772584 -1776647 -1769786 -1773677
11894 -1773677 -1780619 -1779082 -1776071 -1770374 -1769801 -1765814 -1759760 -1760404 -1757006 -1753022 -1749646 -1751908 -1755631 -1747328
11880a747328J3101J0189M347l446k872L461n381j0970n314K871k159P190J1362
11867a724949J141k389L439J1909K193j973k083M503M546m042j771K014J2306
11854a695156M470j624j67L259P148l561j859j751K775N831j633L044l384j772
11840a684380K218L798K033K210N735M484l350j150N424j970k248M777n77M611
11826a658385j62M218M835l696n315R099N402O9j406m462M074K647k072l356M954
11811a643556M800M414j224L689K547O139M607J824k711m908m179M465K403J071
11797a620619O518M222L342j442J336K696m099Q2R284O67j915M066J121K284L252
11782a589205M72k981J759K599l937k334N863J015K258Q675O05p436N22O486M510
$$ plain form
11880 -1747328 -1734227 -1724038 -1719691 -1723137 -1726009 -1722548 -1727929 -1738899 -1744213 -1741342 -1743501 -1736311 -1724949
11867 -1724949 -1723808 -1726197 -1722758 -1710849 -1708656 -1710629 -1712712 -1708209 -1703663 -1707705 -1709476 -1707462 -1695156
11854 -1695156 -1690686 -1692310 -1692477 -1689218 -1682070 -1685631 -1687490 -1689241 -1686466 -1680635 -1682268 -1679224 -1682608 -1684380
11840 -1684380 -1682162 -1678364 -1676331 -1674121 -1668386 -1663902 -1667252 -1668402 -1662978 -1664948 -1667196 -1662419 -1662996 -1658385
11826 -1658385 -1658547 -1654329 -1649494 -1653190 -1658505 -1649406 -1644004 -1643935 -1645341 -1649803 -1645729 -1643082 -1645154 -1648510 -1643556
11811 -1643556 -1638756 -1634342 -1635566 -1631877 -1629330 -1623191 -1618584 -1616760 -1619471 -1624379 -1628558 -1624093 -1621690 -1620619
11797 -1620619 -1614101 -1609879 -1606537 -1607979 -1606643 -1603947 -1608046 -1607964 -1598680 -1598013 -1599928 -1595862 -1594741 -1592457 -1589205
11782 -1589205 -1588733 -1591714 -1589955 -1587356 -1591293 -1593627 -1587764 -1586749 -1584491 -1575816 -1575211 -1582647 -1582125 -1575639 -1571129
11767a571129J228J864J358m227J101K5K597k716Q425O505l863n5r45m022K855
11752a560999P72j389N271Q488K134P638R602k466n411j402M552L190k995k563
11738a535578M295J205q476N076J0648k833R98k827L760J921O35J445m300j364
11724a525395L763N799P4Q176J212m889o993N244j099l09J759P906L356k238l169
11709a506803P74K917L734k387N33N383P663j44J219q39l687m694J81N678l19
11694a490791R51l180J488R983N162J2290R730k999k048p015K117L710K112O135
11680a452355Q83l980l479M090M181N332k161l475o698j350M515P57p18J770N213
11665a447475j034p06m104M909L216j787k62L264O094R604P95m977l012M19L812
$$ plain form
11767 -1571129 -1569901 -1568037 -1566679 -1570906 -1569805 -1569780 -1567183 -1569899 -1561474 -1554969 -1558832 -1558887 -1559832 -1563854 -1560999
11752 -1560999 -1560227 -1561616 -1556345 -1547857 -1545723 -1538085 -1528483 -1530949 -1536360 -1537762 -1533210 -1530020 -1533015 -1535578
11738 -1535578 -1531283 -1530078 -1538554 -1533478 -1522830 -1525663 -1524665 -1527492 -1523732 -1521811 -1521176 -1519731 -1524031 -1525395
11724 -1525395 -1521632 -1515833 -1515759 -1507583 -1506371 -1511260 -1518253 -1513009 -1514108 -1514417 -1512658 -1504752 -1501396 -1503634 -1506803
11709 -1506803 -1506029 -1503112 -1499378 -1501765 -1501232 -1495849 -1488186 -1488330 -1487111 -1487950 -1491637 -1496331 -1496150 -1490472 -1490791
11694 -1490791 -1489840 -1493020 -1491532 -1481549 -1476387 -1464097 -1454367 -1457366 -1459414 -1466429 -1464312 -1460602 -1458490 -1452355
11680 -1452355 -1451472 -1455452 -1458931 -1454841 -1450660 -1445328 -1447489 -1450964 -1457662 -1459012 -1454497 -1453740 -1454458 -1452688 -1447475
11665 -1447475 -1448509 -1449215 -1453319 -1448410 -1445194 -1446981 -1447243 -1443979 -1437885 -1428281 -1427486 -1432463 -1435475 -1435056 -1431244
11650a431244J869J84O200J060j126R98l967o7J369K831K870m158P365K077N56
11635a413183M530M785L379J851l734K23J336J91l480J45L47k06K376M883N566
11620a390991m178q922N833P100p356k485l811M055J09k547L719J0618j870j1035
11606a401761K759P031K586k533n382L496M500L168J366M684n91q051L017M300
11592a381411L577j253M980N663P164l79J722L04j008p66J120n211k662j058L180
11577a366038M203N396P20n215q31L746M254r160o368k483J3867Q058j009j0747
11563a361607J57L824P236K596L87N772L048N048l330J740l0l770l150P6O541
11548a335462O894q17j0584N94J8141M566p846L014j041j810p866o779K185N132
$$ plain form
11650 -1431244 -1429375 -1429191 -1422991 -1421931 -1423057 -1422059 -1426026 -1426093 -1424724 -1421893 -1419023 -1423181 -1415816 -1413739 -1413183
11635 -1413183 -1408653 -1403868 -1400489 -1398638 -1402372 -1402149 -1400813 -1400622 -1404102 -1403957 -1403610 -1403816 -1401440 -1396557 -1390991
11620 -1390991 -1395169 -1404091 -1398258 -1391158 -1398514 -1400999 -1404810 -1400755 -1400646 -1403193 -1399474 -1388856 -1390726 -1401761
11606 -1401761 -1399002 -1391971 -1389385 -1391918 -1397300 -1393804 -1389304 -1386136 -1384770 -1380086 -1380677 -1388728 -1385711 -1381411
11592 -1381411 -1377834 -1379087 -1374107 -1368444 -1361280 -1361659 -1359937 -1359633 -1360641 -1361407 -1360287 -1365498 -1368160 -1369218 -1366038
11577 -1366038 -1361835 -1356439 -1355719 -1360934 -1361765 -1358019 -1353765 -1362925 -1369293 -1371776 -1357909 -1349851 -1350860 -1361607
11563 -1361607 -1361450 -1357626 -1350390 -1347794 -1347407 -1341635 -1338587 -1333539 -1336869 -1335129 -1335159 -1338929 -1342079 -1342003 -1335462
11548 -1335462 -1328568 -1329385 -1339969 -1339375 -1321234 -1316668 -1324514 -1321500 -1322541 -1324351 -1332217 -1338996 -1336811 -1331679
11534a331679R307N116j773m667k29N663R139P676L792k751k552K119K856j18
11520a298101m137l546L808O342J317j479Q220O237l789m868MK853l905L222K510
11505a285312k670l388J540R96N274k9o928m805P122N595j917n932m367L516Q991
11490a282314P196J137N688J0274K878l698k849N55k563q002m285m016M539J108
11476a274352J527l363R848J0301J25j0670n462J1285L136p266k297O514O894
11463a253780q07O32L377p215N44L291N243j166L11K136Q34k263k04l191m071
11448a256329O8m054J759N199O396N060Q461N284m392Q94O92K165j920k901J252
11433a232366Q49L487j80j983k009K677N625M927n985l480j119J196Q310k769
$$ plain form
11534 -1331679 -1322372 -1317256 -1319029 -1323696 -1323925 -1318262 -1309123 -1301447 -1297655 -1300406 -1302958 -1300839 -1297983 -1298101
11520 -1298101 -1302238 -1305784 -1301976 -1295634 -1294317 -1295796 -1287576 -1281339 -1285128 -1289996 -1289992 -1287139 -1291044 -1287822 -1285312
11505 -1285312 -1287982 -1291370 -1289830 -1288834 -1283560 -1283589 -1290517 -1295322 -1288200 -1282605 -1284522 -1290454 -1294821 -1291305 -1282314
11490 -1282314 -1275118 -1273981 -1268293 -1258019 -1255141 -1258839 -1261688 -1261133 -1263696 -1271698 -1275983 -1279999 -1275460 -1274352
11476 -1274352 -1272825 -1276188 -1266340 -1256039 -1255914 -1266584 -1272046 -1260761 -1257625 -1264891 -1267188 -1260674 -1253780
11463 -1253780 -1254587 -1253955 -1250578 -1257793 -1257249 -1253958 -1248715 -1249881 -1249570 -1247434 -1246600 -1248863 -1249067 -1252258 -1256329
11448 -1256329 -1256261 -1260315 -1258556 -1253357 -1246961 -1241901 -1233440 -1228156 -1232548 -1231654 -1230962 -1228797 -1230717 -1233618 -1232366
11433 -1232366 -1231517 -1228030 -1228210 -1230193 -1232202 -1229525 -1223900 -1218973 -1224958 -1228438 -1229557 -1228361 -1220051 -1222820
11419a222820k095J073j227j411O395M749m754K035J669L668N081K262J166j1488
11405a215697j751j463j94J137J0591K174m940L138L476q882n947O066J1061L533
11391a197698l627K783L261o5O64j482K17L251O750J301K991p179p674m325L44
11376a200488K273k463J637M865j688K372Q14j88l078M936N169J975m390k771
11362a191025n5J230O456P587m298l100m523K642K885o93K129R028N943j0659
11348a176453l500J060m48K323M346J967n111k547O167N255L592K631p59M482
11334a156995L28k916M64k148L773L105J036o043m193m030k57M251J1778P306
11320a144541j445J529j347j194k549J925N468l706J088m369N542M053l672j190
$$ plain form
11419 -1222820 -1224915 -1223842 -1225069 -1226480 -1220085 -1215336 -1220090 -1218055 -1216386 -1212718 -1207637 -1205375 -1204209 -1215697
11405 -1215697 -1217448 -1218911 -1219105 -1217968 -1207377 -1205203 -1210143 -1207005 -1203529 -1212411 -1218358 -1212292 -1201231 -1197698
11391 -1197698 -1201325 -1198542 -1195281 -1195346 -1194682 -1196164 -1195947 -1192696 -1185946 -1184645 -1181654 -1188833 -1196507 -1200832 -1200488
11376 -1200488 -1198215 -1200678 -1199041 -1194176 -1195864 -1193492 -1192678 -1192866 -1195944 -1191008 -1185839 -1183864 -1188254 -1191025
11362 -1191025 -1191080 -1189850 -1183394 -1175807 -1180105 -1183205 -1187728 -1185086 -1182201 -1182894 -1180765 -1171737 -1165794 -1176453
11348 -1176453 -1179953 -1178893 -1179341 -1177018 -1172672 -1170705 -1175816 -1178363 -1172196 -1166941 -1163349 -1160718 -1161477 -1156995
11334 -1156995 -1156667 -1159583 -1159119 -1161267 -1157494 -1154389 -1153353 -1159396 -1163589 -1167619 -1167876 -1163625 -1151847 -1144541
11320 -1144541 -1145986 -1144457 -1145804 -1146998 -1149547 -1147622 -1142154 -1145860 -1144772 -1149141 -1143599 -1139546 -1143218 -1144408
11306a144408N968j782n721N027M219P8o309N40K245J950n762l563P040L190o21
11291a137909l917N374Q94j862L367M293k305j822L742Q083j363n689j342Q88
11277a129568p738M238J1981M077n171n63k148p558j520o48O121N683l898k526
11263a129238L450O077p946j115O883O511n763L13k535n72O734Q541J374J095
11249a106191l305m596O882M196p907o515k72J1321J373k070M938j748n704m08
11235a110006L101O220q46l093q027n132N001M376Q49R782L614N273l047r285
11221a101220k661N784L280K339q695K849L282K374K132L662j169J160M450M637
11207a077796m983q465l904L057L376Q392Q508k676n02n113K718L748l813m793
$$ plain form
11306 -1144408 -1138440 -1140222 -1145943 -1140916 -1136697 -1136619 -1142928 -1142388 -1140143 -1138193 -1143955 -1147518 -1140478 -1137288 -1137909
11291 -1137909 -1141826 -1136452 -1135558 -1137420 -1134053 -1129760 -1132065 -1133887 -1130145 -1122062 -1123425 -1129114 -1130456 -1129568
11277 -1129568 -1137306 -1133068 -1121087 -1117010 -1122181 -1122744 -1124892 -1132450 -1133970 -1134618 -1128497 -1122814 -1126712 -1129238
11263 -1129238 -1125788 -1119711 -1127657 -1128772 -1121889 -1115378 -1121141 -1120828 -1123363 -1123935 -1117201 -1108660 -1107286 -1106191
11249 -1106191 -1109496 -1114092 -1107210 -1103014 -1110921 -1117436 -1117708 -1106387 -1105014 -1107084 -1102146 -1103894 -1109598 -1110006
11235 -1110006 -1106905 -1100685 -1101531 -1104624 -1112651 -1117783 -1112782 -1108406 -1107557 -1097775 -1094161 -1088888 -1091935 -1101220
11221 -1101220 -1103881 -1098097 -1094817 -1092478 -1101173 -1098324 -1095042 -1092668 -1090536 -1086874 -1088043 -1086883 -1082433 -1077796
11207 -1077796 -1082779 -1091244 -1095148 -1092091 -1088715 -1080323 -1071815 -1074491 -1074993 -1080106 -1077388 -1073640 -1077453 -1082246
11193a082246n104N039K09o190m079K747P404R784p51k38l123J625m216J832K148
11178a075159M129L644O0m550k906M687O900N074m904o128o25R90K648N394l119
11163a063865J079M661j259J161M365Q014k428p30m511m304k36k144q96K990N614
11148a052489M201l471M000m242m362L19k023o503N065M087J067J075j818j949
11134a057043L874M195P770M158Q40q056l658K731l562J823J46J197Q754M746
11120a032085M17l085j539k758l232N58N24K525N265M746k62m452j958k787j218
11105a039341l469J0589N607j960J530O10K692K174O49j336P844J142j177K222
11091a012224K562j338p882pj769m051o461L003Q899O491r027m640N795J732J92
$$ plain form
11193 -1082246 -1087350 -1082311 -1082102 -1088292 -1092371 -1089624 -1082220 -1072436 -1073187 -1073425 -1076548 -1074923 -1079139 -1077307 -1075159
11178 -1075159 -1071030 -1067386 -1067326 -1071876 -1074782 -1070095 -1063195 -1058121 -1063025 -1069153 -1069778 -1068788 -1066140 -1060746 -1063865
11163 -1063865 -1062786 -1058125 -1059384 -1058223 -1053858 -1045844 -1048272 -1049002 -1053513 -1057817 -1058053 -1060197 -1061093 -1058103 -1052489
11148 -1052489 -1048288 -1051759 -1047759 -1052001 -1056363 -1056044 -1058067 -1064570 -1059505 -1055418 -1054351 -1053276 -1055094 -1057043
11134 -1057043 -1053169 -1048974 -1041204 -1037046 -1036206 -1044262 -1047920 -1045189 -1048751 -1046928 -1046782 -1045585 -1036831 -1032085
11120 -1032085 -1031668 -1034753 -1036292 -1039050 -1042282 -1041724 -1041200 -1038675 -1033410 -1028664 -1028926 -1033378 -1035336 -1038123 -1039341
11105 -1039341 -1042810 -1032221 -1026614 -1028574 -1027044 -1026434 -1023742 -1021568 -1020919 -1022255 -1014411 -1013269 -1014446 -1012224
11091 -1012224 -1009662 -1011000 -1018882 -1018889 -1020658 -1024709 -1031170 -1028167 -1019268 -1012777 -1021804 -1026444 -1020649 -1018917 -1018725
11076a018725J423M833m857o610j131J772L684O074K766l794K814o343J94P139
11062a010761k188R18R00L429l589N996P027J970K775q669j0600l623P782l252
11048a011885l100L826k400J2075K874J398J328k202m72l235j146M461K691l905
11034i99692J736Q82r57L874L209L570L130p891l467M354Q61q07o058n308M045
11019i98519K074J485M204K004j017K317j622J892O190l663M527O263o935m042
11005i84842j218k891j924K330Q801L499k551o863k339O154J275o237J0753O764
10991i69289J443J960q209l429L149K731m153K029O523j297n826Q130J469o27
10977i65396J296q2l510N867j887m539l322O23M832Q96k797l322k221L99N00j264
$$ plain form
11076 -1018725 -1017302 -1012469 -1017326 -1023936 -1025067 -1023295 -1019611 -1013537 -1010771 -1014565 -1011751 -1018094 -1017900 -1010761
11062 -1010761 -1012949 -1012031 -1011131 -1007702 -1011291 -1005295 -998268 -996298 -993523 -1002192 -1012792 -1016415 -1008633 -1011885
11048 -1011885 -1014985 -1011159 -1013559 -1001484 -998610 -997212 -995884 -998086 -998558 -1001793 -1002939 -998478 -995787 -999692
11034 -999692 -997956 -997074 -998031 -994157 -990948 -987378 -984248 -992139 -995606 -991252 -990391 -991198 -997256 -1002564 -998519
11019 -998519 -996445 -994960 -990756 -988752 -989769 -987452 -989074 -987182 -980992 -984655 -980128 -973865 -980800 -984842
11005 -984842 -986060 -988951 -990875 -988545 -979744 -976245 -978796 -985659 -987998 -981844 -980569 -986806 -976053 -969289
10991 -969289 -967846 -965886 -974095 -977524 -974375 -971644 -975797 -973768 -967245 -968542 -974368 -966238 -964769 -965396
10977 -965396 -964100 -964182 -967692 -961825 -963712 -968251 -971573 -970950 -966118 -965222 -968019 -971341 -973562 -973163 -972663 -973927
10961i73927J852M016l777L176N251M710R06N147M366k930J022K880k157p617
10947i57082o629n487j744j540Q97J082J328j456R29J0808L965j478N037j681
10933i53051o907n618L042j153J042O72R85Q674K911l092k73k956j90J145N873
10918i48896J081m437J655R156J834n360m404J135J0624P320r43L76n256m272
10904i40387m948N265N377L536k341j483q290n541L592N303M635M707o35K791
10890i28419N402j386k071o605o586k338Q596J589M118Q01j92m508R43k269L449
10875i29476n35K180j453j912M975J667l879j97m673J008N132K261m348m768M318
10860i29700M393M448j691j842J953m356k120M473L550L182l000k308J245r11
$$ plain form
10961 -973927 -972075 -968059 -971836 -968660 -963409 -958699 -957793 -952646 -948280 -951210 -950188 -947308 -949465 -957082
10947 -957082 -963711 -969198 -970942 -972482 -971585 -970503 -969175 -970631 -969702 -958894 -954929 -956407 -951370 -953051
10933 -953051 -959958 -965576 -962534 -963687 -962645 -961973 -960988 -952314 -949403 -952495 -952768 -955724 -955914 -954769 -948896
10918 -948896 -947815 -952252 -950597 -941441 -939607 -944967 -949371 -948236 -937612 -930292 -931235 -930859 -936115 -940387
10904 -940387 -945335 -940070 -934693 -931157 -933498 -934981 -943271 -948812 -945220 -939917 -935282 -930575 -931210 -928419
10890 -928419 -923017 -924403 -926474 -933079 -939665 -942003 -933407 -931818 -927700 -926899 -927091 -931599 -930656 -932925 -929476
10875 -929476 -930011 -927831 -929284 -931196 -926221 -924554 -928433 -928630 -933303 -932295 -927163 -924902 -929250 -934018 -929700
10860 -929700 -925307 -920859 -922550 -924392 -922439 -926795 -928915 -924442 -920892 -917710 -920710 -923018 -921773 -922684
10846i22684N735K177L522J174k955o930o001p151K969J637l050L433J3195J0647
10832i04282q84k278q58k664q30k625M691L752j885M30P10l500k492L713k99j286
10816i10587K297J584m057l191J537l866K994L979L057O122l869l356p30J1421
10802h96665O059j552j555r726p529P59R402O353K956K169j777k92j433l953k956
10787h99740l438K720L742K461j0314m331N838P919k505k102j044J848N019M787
10773h89140j721j433L38N07J118k717o144j605j607J228P360R7O753L229j587
10758h85324L262J815k745q00N881P851k280l308m998k404m270l086K000L680
10744h84726O699j968L69L381J758J74j061k991m564K339Q46K265k619K144J684
$$ plain form
10846 -922684 -916949 -914772 -911250 -910076 -913031 -919961 -925962 -933113 -930144 -928507 -931557 -928124 -914929 -904282
10832 -904282 -905166 -907444 -908302 -910966 -911796 -914421 -909730 -905978 -907863 -907433 -906723 -910223 -912715 -909002 -909301 -910587
10816 -910587 -908290 -906706 -910763 -913954 -912417 -916283 -913289 -909310 -906253 -900131 -904000 -907356 -908086 -896665
10802 -896665 -890606 -892158 -893713 -903439 -910968 -910209 -900807 -894454 -891498 -889329 -891106 -891398 -892831 -896784 -899740
10787 -899740 -903178 -900458 -896716 -894255 -904569 -908900 -903062 -895143 -897648 -899750 -900794 -898946 -893927 -889140
10773 -889140 -890861 -892294 -891956 -891449 -890331 -893048 -899192 -900797 -902404 -901176 -893816 -893719 -886966 -883737 -885324
10758 -885324 -882062 -880247 -882992 -883792 -877911 -870060 -872340 -875648 -880646 -883050 -887320 -890406 -888406 -884726
10744 -884726 -878027 -879995 -879626 -876245 -874487 -874313 -875374 -878365 -882929 -880590 -879744 -877479 -880098 -877954 -876270
10729h76270l017J146K781J965k142J776M557p852J0346Q587o565n664K531j423
10715h69244n981l893M273p86K353J458J035k298Q27p323M563Q906K984j690J069
10700h63747l756o45J797j761N068O917j526o494k086J999L656r0J372l335j421
10685h64052L634N167O496K930J953k158k329q07q8J28n354p448K213K564K961
10670h54190k101M212N030q25K848k685o55l370l534J942K282m895j005j884N147
10655h53683L527p080l355R437R738k2q677J824K851L804k584k813P1p56m633
10640h52351k082O797N096K966N704r98k196L946K000m343j588n423j0310q661
10626h61443N683J1219j015p542K127M434K856m01k042K163j963J354l399J862
$$ plain form
10729 -876270 -879287 -878141 -875360 -873395 -875537 -873761 -869204 -877056 -866710 -858123 -864688 -870352 -867821 -869244
10715 -869244 -875225 -879118 -874845 -875631 -873278 -871820 -870785 -873083 -872256 -879579 -875016 -866110 -863126 -864816 -863747
10700 -863747 -867503 -868148 -866351 -868112 -863044 -856127 -857653 -864147 -866233 -864234 -860578 -860668 -859296 -862631 -864052
10685 -864052 -860418 -855251 -848755 -845825 -843872 -846030 -848359 -849166 -849254 -849126 -854480 -861928 -859715 -857151 -854190
10670 -854190 -856291 -852079 -847049 -847874 -845026 -847711 -848366 -851736 -855270 -853328 -851046 -855941 -856946 -858830 -853683
10655 -853683 -850156 -857236 -860591 -851154 -841416 -841438 -850115 -848291 -845440 -841636 -844220 -847033 -846962 -847718 -852351
10640 -852351 -854433 -847636 -842540 -839574 -833870 -834868 -837064 -833118 -831118 -835461 -837049 -842472 -852782 -861443
10626 -861443 -855760 -844541 -845556 -853098 -850971 -846537 -843681 -844082 -846124 -843961 -845924 -844570 -847969 -846107
10612h46107K273O008Q4l701n29Q002L28j66N7N113j19p633J992N056J289j037
10596h29090q857P31M809M293k997n518O79N936N080m881J075k465l830k673r99
10581h38707M79M805O231R022Q059k40n883j2792n858N562P506P63K030N6N165
10566h13802l393r81J0249l562j4216q344O489J410O05M763N313N453r084q984
10552h28084P570R078m50n7J912l398k956l853N603P056J553p609p327J606N184
10537h14172L548N67O232P621J783m142q798j0987m738O834J642J737k889J010
10523h14752Q984K70M660O427K812l155p178n273o410k53K358Q5J770R44m278
10508h12989P193k888l70O689K687j887k269N280P689M475j223q890J823K170
$$ plain form
10612 -846107 -843834 -837826 -837742 -841443 -841972 -833970 -833642 -833808 -833751 -828638 -828757 -836390 -834398 -829342 -828053 -829090
10596 -829090 -837947 -837216 -832407 -828114 -831111 -836629 -835950 -830014 -824934 -829815 -828740 -831205 -835035 -837708 -838707
10581 -838707 -838228 -833423 -827192 -818170 -810111 -810351 -816234 -829026 -834884 -829322 -821816 -821053 -819023 -818967 -813802
10566 -813802 -817195 -818176 -807927 -811489 -825705 -834049 -827560 -826150 -825545 -820782 -815469 -810016 -819100 -828084
10552 -828084 -820514 -811436 -811886 -811943 -810031 -813429 -816385 -820238 -814635 -807579 -806026 -813635 -820962 -819356 -814172
10537 -814172 -810624 -810057 -803825 -796204 -794421 -798563 -807361 -818348 -823086 -816252 -814610 -812873 -815762 -814752
10523 -814752 -805768 -805498 -800838 -794411 -791599 -794754 -801932 -807205 -813615 -813868 -811510 -811425 -809655 -808711 -812989
10508 -812989 -805796 -808684 -809054 -802365 -799678 -801565 -803834 -798554 -790865 -786390 -787613 -796503 -794680 -792510
10494g92510L853m077k861K546k826J921l125m915K44O840j50k403M570M409j305
10479g89789m406J061J737J159O517N450p549k018M986j036j0703K050J0765J904
10465g79872j490n641m522N150j039J803l128k52Q052J699k969m598J662o157
10451g91302p778l982M078R361L636n911j445K691L763P406j036j770p02R436
10437g73555N49j667j591L06K08o367l730L438L565l431J13j045K690K433j565
10422g79649L381m397J738N56Q74j089M796J195K716J980j0226n310N311K761
10408g75363p98K17m93k921j635m742J496P942O524m862k516J885k85k915J722
10393g76744M919k078K50l240M007J969l231P54L48M790M181n656j2655N08L766
$$ plain form
10494 -792510 -788657 -792734 -795595 -793049 -795875 -793954 -797079 -801994 -801750 -794910 -795060 -797463 -792893 -788484 -789789
10479 -789789 -794195 -793134 -791397 -790238 -783721 -778271 -785820 -787838 -782852 -783888 -794591 -792541 -781776 -779872
10465 -779872 -781362 -787003 -791525 -786375 -787414 -785611 -788739 -788991 -780939 -779240 -782209 -786807 -785145 -791302
10451 -791302 -799080 -803062 -798984 -789623 -785987 -791898 -793343 -790652 -786889 -779483 -780519 -782289 -782991 -773555
10437 -773555 -773006 -774673 -776264 -775958 -775750 -782117 -785847 -782409 -778844 -782275 -782162 -783207 -780517 -778084 -779649
10422 -779649 -776268 -780665 -778927 -778371 -777497 -778586 -773790 -772595 -769879 -767899 -778125 -783435 -778124 -775363
10408 -775363 -776161 -775944 -776437 -779358 -780993 -785735 -784239 -776297 -769773 -774635 -777151 -775266 -775551 -778466 -776744
10393 -776744 -771825 -773903 -773653 -776893 -772886 -770917 -774148 -773394 -773046 -768256 -764075 -769731 -782386 -781878 -778112
10378g78112Q76L54N452Q024K95o138K309R805l169l306k613M03m191j281M229
10363g67063m645L142K70O914O151k528j1194j121l457K017J1349L211K77O319
10349g50358J190P9o850N86N406J4J727K445J802l03r348q52K570R94n766k9k122
10332g58815k209n403K290L234M73N58P742N647q30P144j4785o779J540O344L756
10317g50093p69j862Q77L72j0549N866N621j093K892R24O9L878J397J647k422
10302g43245l059L230J342K546o35k542q90L186k43o16k059k340K544M752m577
10287g42606q98o444l84J2689K935o935p093l393O417K419Q910L667m608M142
10273g31182J410o428k296N174N684L538L601j970P86j690L12P439M075m085j2432
$$ plain form
10378 -778112 -777236 -776882 -771430 -763406 -763111 -769249 -766940 -757135 -760304 -763610 -766223 -765820 -770011 -771292 -767063
10363 -767063 -771708 -768566 -768296 -761382 -755231 -757759 -768953 -770074 -773531 -771514 -760165 -756954 -756677 -750358
10349 -750358 -749168 -749089 -755939 -755353 -749947 -749933 -748206 -745761 -743959 -744262 -753610 -754462 -751892 -750898 -756664 -756693 -758815
10332 -758815 -761024 -766427 -764137 -760903 -760430 -759872 -752130 -746483 -747313 -740169 -754954 -761733 -760193 -753849 -750093
10317 -750093 -750862 -752724 -751847 -751475 -762024 -756158 -750537 -751630 -748738 -747814 -747745 -743867 -742470 -740823 -743245
10302 -743245 -746304 -743074 -741732 -739186 -739821 -742363 -743253 -740067 -740310 -740926 -742985 -745325 -742781 -738029 -742606
10287 -742606 -743504 -749948 -750332 -737643 -734708 -741643 -748736 -752129 -745712 -743293 -734383 -730716 -735324 -731182
10273 -731182 -729772 -736200 -738496 -733322 -727638 -724100 -720499 -722469 -721683 -723373 -723061 -715622 -711547 -715632 -728064
10258g28064j4053j0234m047j828N024J050O90N481N584k007k87M671M87m026
10244g41559j0224k13L191N712m77m779k703N561M917Q067J507M307M631l540
10230g25602N57p48j356J36m533l503q652J874J823Q426Q118k189m585p86n726
10215g36746m147N784R038n86p143K381j559L336M886l161P51O545m876j0059
10201g35556N8J3296Q955j356l264l761J465l535l476L702N527K177m537l794
10187g24099j772M774N974K376M096m37n527q705l622L188L210m202j272R286
10173g16732J363O41R1j609O953j31p388q389j094K796N474j781l032J311N577
10158g15950N170l525R829K921o037m379K150m780r60l046M865L426J630l535
$$ plain form
10258 -728064 -742117 -752351 -756398 -758226 -753202 -752152 -751462 -745981 -740397 -742404 -742691 -738020 -737533 -741559
10244 -741559 -751783 -751996 -748805 -743093 -743570 -748349 -751052 -745491 -740574 -732507 -731000 -726693 -722062 -725602
10230 -725602 -725045 -725793 -727149 -727013 -731546 -735049 -743701 -741827 -740004 -731578 -723460 -725649 -730234 -731020 -736746
10215 -736746 -740893 -735109 -726071 -726657 -733800 -731419 -732978 -729642 -724756 -727917 -727166 -720621 -725497 -735556
10201 -735556 -735498 -722202 -713247 -714603 -717867 -721628 -720163 -723698 -727174 -723472 -717945 -715768 -720305 -724099
10187 -724099 -725871 -721097 -715123 -712747 -708651 -709088 -714615 -723320 -726942 -723754 -720544 -724746 -726018 -716732
10173 -716732 -715369 -714728 -714637 -716246 -709293 -709424 -716812 -725201 -726295 -723499 -718025 -719806 -722838 -721527 -715950
10158 -715950 -710780 -714305 -704476 -701555 -707592 -711971 -709821 -714601 -715561 -718607 -713742 -710316 -708686 -712221
10144g12221L097k976K414M90K88k756k726l192r0L551J781O270N610M511j266
10129f97215q416k985O445N936k076k52o313l87K042k150J332K123j640k164j05
10114g05825L50l650o675m95P401J410m138j799O815K315M999l065p166K858Q244
10099f98421J904k801o030j331N711O99L613K030J630r253k575M014M571J865
10085f94374k121J29O108O061J878n280r134o383J116M996J706O084M79k710n515
10070f96960l601N27O108J167j608j176m039M160J0475O374j656j341K285n674
10056f84959M198Q807k564J522m268p829r29m395L529N27J0752N345J248J098
10042f67918j2092r266K981O054p267J637k1N805j163l870l218O323n4J845n259
$$ plain form
10144 -712221 -709124 -712100 -709686 -709196 -708908 -711664 -714390 -717582 -717672 -714121 -712340 -706070 -700460 -695949 -697215
10129 -697215 -705631 -708616 -702171 -696235 -698311 -698563 -704876 -705263 -703221 -705371 -704039 -701916 -703556 -705720 -705825
10114 -705825 -705475 -709125 -715800 -716295 -708894 -707484 -711622 -713421 -706606 -704291 -699292 -702357 -709523 -706665 -698421
10099 -698421 -696517 -699318 -705348 -706679 -700968 -700269 -696656 -694626 -692996 -702249 -704824 -700810 -696239 -694374
10085 -694374 -696495 -696366 -690258 -684197 -682319 -687599 -696733 -703116 -702000 -697004 -695298 -689214 -688735 -691445 -696960
10070 -696960 -700561 -700034 -693926 -692759 -694367 -695543 -699582 -695422 -684947 -678573 -680229 -681570 -679285 -684959
10056 -684959 -680761 -671954 -674518 -672996 -677264 -685093 -686022 -690417 -686888 -686361 -675609 -670264 -669016 -667918
10042 -667918 -680010 -689276 -686295 -680241 -687508 -685871 -685892 -680087 -681250 -685120 -688338 -682015 -682069 -680224 -685483
10027f85483o093J797L621l36K425k025k585K957L563J291l570m859j033k475
10013f92805O903N040q75K887M910P50l027k712o463M321k401M763l461N030j358
9998f78498m767l537L940O964m803k616M607J1381L290j369k766o144j1026O889
9984f78455N065m182j456J557N192p266J890k032j833k916M324J583J130j036
9970f78435K387J0149k036N3k134K746J486n89J082l021R73L427j563n81o749
9955f72805m329l1K52P186K169r72J770M10m069j669L865J009M973L499n432j567
9939f65741O657n23j0023k859K124L323J693L349R88L050M82o73k315j657k90
9924f62415j725L458J271Q15M592k343J622J029K789M95l435j826L945l075q333
$$ plain form
10027 -685483 -691576 -689779 -686158 -686494 -684069 -686094 -688679 -685722 -682159 -680868 -684438 -689297 -690330 -692805
10013 -692805 -685902 -680862 -681737 -678850 -673940 -673190 -676217 -678929 -685392 -681071 -683472 -678709 -682170 -677140 -678498
9998 -678498 -683265 -686802 -682862 -675898 -680701 -683317 -678710 -667329 -664039 -665408 -668174 -674318 -685344 -678455
9984 -678455 -673390 -677572 -679028 -677471 -672279 -679545 -677655 -679687 -681520 -684436 -680112 -678529 -677399 -678435
9970 -678435 -676048 -665899 -667935 -667882 -670016 -667270 -665784 -666373 -665291 -668312 -667339 -663912 -665475 -666056 -672805
9955 -672805 -677134 -677165 -676913 -669727 -667558 -668530 -666760 -666350 -670419 -672088 -668223 -667214 -662241 -658742 -664174 -665741
9939 -665741 -659084 -659607 -669630 -672489 -670365 -667042 -665349 -662000 -661012 -657962 -657480 -658153 -660468 -662125 -662415
9924 -662415 -664140 -660682 -659411 -658596 -654004 -656347 -654725 -653696 -650907 -650412 -653847 -655673 -651728 -654803 -663136
9909f63136J613J79n472j747M47r36K876J82J747J746J0851n78j860m350k478
9894f60916L682r63k345P974K195N038L40p105r398m605O313O205n385k747L379
9879f58338o279k394Q514P843Q260K107k118K17J560L399p148m188N133P492M27
9864f35513n322j372N371k440j964l2p08m838m224K440k660m586m70L68n23R15
9848f55558K308M698N631K097k212o028l437J753O719k481N37M271J1000m609
9834f35311p724L186L426k564l049r907n00P438J032N55q46M448O699J663o874
9819f38328o983m708l168J1607L188q926o233Q293k315m203N973O775L033j807
9805f37802m716O324Q55M6L902K280r89l266Q24J499N193k03n998o454L3Q82L953
$$ plain form
9909 -663136 -661523 -661344 -666816 -668563 -668116 -669052 -666176 -665994 -664247 -662501 -651650 -652228 -654088 -658438 -660916
9894 -660916 -657234 -658197 -660542 -652568 -650373 -645335 -644995 -652100 -661498 -666103 -659790 -653585 -658970 -661717 -658338
9879 -658338 -664617 -667011 -658497 -650654 -642394 -640287 -642405 -642188 -640628 -637229 -644377 -648565 -643432 -635940 -635513
9864 -635513 -640835 -642207 -636836 -639276 -641240 -641272 -641980 -646818 -651042 -648602 -651262 -655848 -656318 -655950 -656473 -655558
9848 -655558 -653250 -648552 -642921 -640824 -643036 -649064 -652501 -650748 -644029 -646510 -645973 -641702 -630702 -635311
9834 -635311 -643035 -639849 -636423 -638987 -642036 -651943 -652443 -645005 -643973 -643418 -644264 -639816 -633117 -631454 -638328
9819 -638328 -645311 -650019 -653187 -641580 -638392 -647318 -653551 -645258 -647573 -651776 -645803 -639028 -635995 -637802
9805 -637802 -642518 -636194 -635339 -635293 -631391 -629111 -630100 -633366 -632542 -631043 -625850 -626053 -632051 -638505 -638472 -637590 -633637
9788f33637K947m278J265N200n818p698R13J715O809M333k655L108L978K37p746
9773f31327k421k509k52l656N599N566L191M38K368O824Pl372k391L646k22j0585
9757f29096n98k30R09k443j295O616J339q2m885r98M996k001M336K946M679l134
9741f18941r131m706J141J820P523j456O058k572k490m569L621Q101K621K439
9727f10541n808p531m773o473P579O211l166o622M059J0758N240O23O94r951k069
9712f21770k407K743M444n798K267M531J1614L869q179o939p655N315M459n647
9698f19153m079M554L85l014m173L077J625k81L933N495n661M935P014l572N047
9683f03868m826n302J574o6L766O14p04J637n761M791M060k880p786j266O667
$$ plain form
9788 -633637 -630690 -634968 -633703 -628503 -634321 -642019 -641106 -639391 -632582 -628249 -630904 -627796 -623818 -623581 -631327
9773 -631327 -633748 -636257 -636509 -640165 -634566 -629000 -625809 -625371 -623003 -616179 -616172 -619544 -621935 -618289 -618511 -629096
9757 -629096 -629694 -629924 -629015 -631458 -632753 -626137 -624798 -624880 -629765 -630763 -625767 -627768 -623432 -620486 -615807 -618941
9741 -618941 -628072 -632778 -631637 -629817 -622294 -623750 -617692 -620264 -622754 -627323 -623702 -615601 -612980 -610541
9727 -610541 -616349 -623880 -628653 -635126 -627547 -621336 -624502 -631124 -627065 -616307 -611067 -610444 -609750 -619701 -621770
9712 -621770 -624177 -621434 -616990 -622788 -620521 -615990 -604376 -600507 -608686 -615625 -623280 -617965 -613506 -619153
9698 -619153 -623232 -618678 -618293 -621307 -625480 -622403 -620778 -621059 -617126 -611631 -617292 -612357 -605343 -608915 -603868
9683 -603868 -608694 -613996 -612422 -612488 -608722 -608108 -608812 -607175 -612936 -608145 -604085 -606965 -614751 -616017 -609350
9668f09350P802m149O2L99Q511k648o812l909K808k02j802M470k808k499k676
9653f12803K856K737O309K303Q27L284k929k084l586L894J1062l26m250j3009
9639f05715j2M202k218j1978j807J1783M312m079m049R397O645k728j42J655l228
9624e97962n659P32K896m1m624J655L760J140n414p865L441l188J297k15K261
9609f07786J614Q098M699l74j737p68J584j811K404m64k293m118M145J333p217
9594f02691j071O180J3653L821n159m384J440K776R42J435k623o519p070M284
9580e94986L728n58N140n519m157N332O876J0525P17n288q762j271J977M560L796
9565e77890l075j640Q28j500p788N157K536n254L685p10p32J046R124j908J265
$$ plain form
9668 -609350 -601548 -605697 -605635 -605236 -596725 -599373 -606185 -610094 -607286 -607488 -609290 -604820 -607628 -610127 -612803
9653 -612803 -609947 -607210 -600901 -598598 -597771 -594487 -597416 -599500 -603086 -599192 -588130 -588456 -592706 -605715
9639 -605715 -605727 -601525 -603743 -615721 -617528 -605745 -601433 -605512 -609561 -600164 -593519 -596247 -596389 -594734 -597962
9624 -597962 -603621 -602889 -599993 -600034 -604658 -603003 -599243 -598103 -603517 -611382 -607941 -611129 -609832 -610047 -607786
9609 -607786 -606172 -598074 -593375 -593749 -595486 -596254 -594670 -596481 -594077 -594541 -596834 -600952 -596807 -595474 -602691
9594 -602691 -603762 -597582 -583929 -580108 -585267 -589651 -588211 -585435 -584493 -583058 -585681 -592200 -599270 -594986
9580 -594986 -591258 -591816 -586676 -592195 -596352 -591020 -584144 -573619 -572902 -578190 -586952 -588223 -586246 -581686 -577890
9565 -577890 -580965 -582605 -581777 -583277 -591065 -585908 -583372 -588626 -584941 -585651 -586383 -585337 -576213 -578121 -576856
9550e76856K876k773l376r950m840P554Q083J089j440m04J330j514n332k608k535
9535e90696l351O443K916Q87K569J1598m196m573M538K848N467l660p26K920n759
9520e72775q07O564J389m649p202k546N614pM148J617O432N867k354m458n984
9505e69151k482l567L204K45L192m461k114J326P859l080l051K283L454R288k799
9490e59854l67M659p50j267N448j703m072k287l687N791N295N408j572q877l808
9475e61643J453K873L445k245O89n907J806J208N396m436Q07J124l61n562q27
9460e62180K046M472J421l776m401l443N187R911R21j339J742n337Q426R352k408
9445e39406L542o802q282Q657Q689j196p317k497L469M112J505K758J658K23k400
$$ plain form
9550 -576856 -573980 -576753 -580129 -590079 -594919 -587365 -579282 -578193 -579633 -580037 -578707 -580221 -585553 -588161 -590696
9535 -590696 -594047 -587604 -584688 -583801 -581232 -569634 -573830 -578403 -573865 -571017 -565550 -569210 -569936 -567016 -572775
9520 -572775 -573582 -567018 -565629 -570278 -577480 -580026 -574412 -574419 -570271 -568654 -562222 -556355 -558709 -563167 -569151
9505 -569151 -571633 -575200 -571996 -571751 -568559 -573020 -575134 -573808 -565949 -569029 -572080 -569797 -566343 -557055 -559854
9490 -559854 -560221 -555562 -556312 -557579 -552131 -553834 -557906 -560193 -563880 -558089 -552794 -547386 -548958 -557835 -561643
9475 -561643 -560190 -557317 -553872 -556117 -555428 -561335 -559529 -558321 -552925 -557361 -556554 -555430 -555791 -561353 -562180
9460 -562180 -560134 -555662 -554241 -558017 -562418 -565861 -560674 -550763 -549842 -551181 -549439 -554776 -546350 -536998 -539406
9445 -539406 -535864 -542666 -550948 -542291 -533602 -534798 -542115 -544612 -541143 -537031 -535526 -532768 -531110 -530887 -533287
9430e33287m063l679k02M360L692J82k91M074M379J456m279l364k844J578K388
9415e29900q973j314j217J083P418M700Q632L846k979o744K00O975K804l328k080
9400e20877j603J087N76L286Q866o264k119o77N859K963J388O22j135j83N640
9385e02571N4l655l179J744N375J693l846j317Q751J035j139N820L566j988n001
9370d94658O66J385o658k838k964K391j726J0666J1646M813j073o506M713K808
9356d77335J3l709j383J929L126n228m233M217K348L96mL479j443K994L418N998
9340d65417K409m116k150K591l428L460l792l371M971N979M952j033j086n535
9326d65566P2O208J0647J2055K403N202J831M276l281N16K955R540o21l497J324
$$ plain form
9430 -533287 -537350 -541029 -541231 -536871 -533179 -532997 -533288 -529214 -524835 -523379 -527658 -531022 -533866 -532288 -529900
9415 -529900 -538873 -540187 -541404 -540321 -532903 -528203 -519571 -515725 -518704 -525448 -525248 -518273 -515469 -518797 -520877
9400 -520877 -522480 -521393 -520817 -517531 -508665 -514929 -517048 -517725 -511866 -508903 -507515 -506893 -508028 -508211 -502571
9385 -502571 -502517 -506172 -509351 -507607 -502232 -500539 -504385 -505702 -496951 -495916 -497055 -491235 -487669 -489657 -494658
9370 -494658 -493992 -492607 -499265 -502103 -505067 -502676 -504402 -493736 -482090 -477277 -478350 -484856 -480143 -477335
9356 -477335 -477322 -481031 -482414 -480485 -477359 -482587 -486820 -482603 -480255 -479859 -479863 -476384 -477827 -474833 -471415 -465417
9340 -465417 -463008 -467124 -469274 -466683 -470111 -466651 -470443 -473814 -468843 -462864 -457912 -458945 -460031 -465566
9326 -465566 -465494 -459286 -448639 -436584 -434181 -428979 -427148 -422872 -426153 -425637 -422682 -413142 -413763 -417260 -415936
9311d15936K306k438M053l000m096O682J2897Q274k79M04L890M554l705P388Q343
9296c70663L700M421N763Q07N544N414M295J0801P993P0L81J0333O999L210P770
9281b93162O932J6439J3353R912J207L352P674Q438J2216R952K0827J5603J5370
9268a51887J7108J7422J3864J1590R175K3038K4550J7977J4380J7920J3943P773
9256C6853J5913L126j8651k9562l0222n5102p3842r6335j25535j26145j25943
9245f25445j25359j10920q7517p2614n4805l5783k0681j3119j133N319Q106K1805
9233a112146J7983J0630R204O904J1556J6371J5538O653J2964K0599J7174N314
9221i61256J0213J5112J1394J2092J1667O276N780O944Q937M174J0406L797N983
$$ plain form
9311 -415936 -413630 -416068 -412015 -415015 -419111 -412429 -399532 -391258 -391537 -391133 -387243 -382689 -386394 -379006 -370663
9296 -370663 -366963 -362542 -356779 -355972 -350428 -345014 -340719 -329918 -321925 -321855 -321474 -311141 -304142 -300932 -293162
9281 -293162 -286230 -269791 -256438 -246526 -245319 -241967 -234293 -225855 -213639 -203687 -182860 -167257 -151887
9268 -151887 -134779 -117357 -103493 -91903 -82728 -59690 -35140 -17163 -2783 15137 29080 36853
9256 36853 52766 55892 37241 7679 -22543 -77645 -151487 -247822 -373357 -499502 -625445
9245 -625445 -750804 -861724 -949241 -1021855 -1076660 -1112443 -1133124 -1146243 -1147376 -1142057 -1133951 -1112146
9233 -1112146 -1094163 -1083533 -1074329 -1067425 -1055869 -1039498 -1023960 -1017307 -1004343 -983744 -966570 -961256
9221 -961256 -951043 -935931 -924537 -912445 -900778 -894502 -888722 -881778 -872841 -868667 -858261 -854464 -848481
9208h48481M206J332J0208J0382Q698Q411K699k748O422L277K341P540N262N988
9194g74463M4j439p628J0106O708L567L040K678M609R653O708L474k35j472L968
9179g30682J032k22r88j528N60L358R945O179j481J802l722O029K450K261L39
9164g04668O91j398L299O096O471q110q148l647R040J2407M241k00j28J525n1
9149f82580J026K570R542k763M043J0992k360l359M32k081K949L804M874J009
9135f51902J974m690j087K386J214J074n407N242O244o13k90L43k916M772l773
9120f47429j624K009L085N300O381j126j513Q78M137j189o356k29N929L377m113
9105f32483P35q11k236M041L31J262M599j562j028N628M553J206m095n273r193
$$ plain form
9208 -848481 -844275 -842943 -832735 -822353 -813655 -805244 -802545 -805293 -798871 -795594 -793253 -785713 -780451 -774463
9194 -774463 -774419 -775858 -783486 -773380 -766672 -763105 -760065 -757387 -752778 -743125 -736417 -732943 -733178 -734650 -730682
9179 -730682 -729650 -729872 -730860 -732388 -731828 -728470 -718525 -712346 -713827 -712025 -715747 -709718 -707268 -705007 -704668
9164 -704668 -703977 -705375 -702076 -695980 -689509 -697619 -705767 -709414 -700374 -687967 -683726 -683926 -684054 -682529 -682580
9149 -682580 -681554 -678984 -669442 -672205 -668162 -657170 -659530 -662889 -662457 -664538 -661589 -657785 -652911 -651902
9135 -651902 -649928 -654618 -655705 -653319 -652105 -651031 -656438 -651196 -644952 -645565 -645855 -645512 -648428 -643656 -647429
9120 -647429 -649053 -647044 -643959 -638659 -632278 -633404 -634917 -634039 -629902 -631091 -637447 -637676 -631747 -628370 -632483
9105 -632483 -631748 -632559 -634795 -630754 -630423 -629161 -624562 -626124 -627152 -621524 -616971 -615765 -619860 -625133 -634326
9090f34326L601M149m753M42M338Q169J295k914p12N928O897j21j0884n012K375
9075f21528J788N32L897j590o223Q89R284L766k29J18L302n280o580k940m228
9060f25022M009M841K425K697O116j010m12m081j038M125K733j01J57n407L592
9045f06376P729l591r305j933L818K218k312k961K198J889j504P341Q812M315
9031e89662j178n160l223k623m600l039P62P815R89m878j074o028Q324p09M631
9016e99653J997k69KJ001L697q8K372N480M868M115p904o79K617J080N53p903
9000e88714n542j233J677l065O192P23L058M482k476N6Q614j872j858Q96P93L97
8984e77872J252L77J710L741m483o257L429L088K215N21k88p356o119J909Q27
$$ plain form
9090 -634326 -630725 -626576 -631329 -630887 -626549 -618380 -617085 -619999 -620711 -614783 -607886 -608007 -618891 -623903 -621528
9075 -621528 -619740 -619208 -615311 -616901 -623124 -622235 -612951 -609185 -609414 -609296 -605994 -611274 -617854 -620794 -625022
9060 -625022 -621013 -616172 -613747 -611050 -604934 -605944 -606356 -610437 -611475 -607350 -604617 -604718 -604561 -609968 -606376
9045 -606376 -598647 -602238 -611543 -613476 -609658 -607440 -609752 -612713 -610515 -608626 -610130 -602789 -593977 -589662
9031 -589662 -590840 -596000 -599223 -601846 -606446 -609485 -608723 -600908 -599919 -604797 -605871 -611899 -603575 -604284 -599653
9016 -599653 -597656 -597925 -597923 -596922 -593225 -593313 -590941 -585461 -580593 -576478 -584382 -585061 -582444 -581364 -580811 -588714
9000 -588714 -594256 -595489 -593812 -596877 -590685 -589962 -586904 -582422 -584898 -584842 -576228 -578100 -579958 -579062 -578269 -577872
8984 -577872 -576620 -576243 -574533 -570792 -575275 -581532 -578103 -575015 -572800 -572279 -572567 -579923 -586042 -584133 -583306
8969e83306L465J242k86l226L938P52N112j154p85K269M022n43j175M341L919
8954e61415j137r69l537o089m711p701M983J0336J098M168k364L956k319n074
8940e70775o160K186Q429K278L132p01p9M8J210j428j910K220j695m897l694k392
8924e74228N559m462J483P358K859n777q01l086j657n81M74l64O419J272L582
8909e61950L716q927n47m308P562N004l390J886N533p14p350j986k089k303j027
8894e70890O725N651p34K266m808m394m765P446J05k146K901J733J432k044M022
8879e57500k632L622J521J526K977r46K470l319K892N573J160q829j0519o356
8865e68360J793j804P71O686J2053L664r785k536l817Q07l87j619K696k567N081
$$ plain form
8969 -583306 -579841 -578599 -578885 -582111 -578173 -577421 -572309 -573463 -574248 -571979 -567957 -568500 -569675 -565334 -561415
8954 -561415 -562552 -563521 -567058 -573147 -577858 -585559 -580576 -570240 -569142 -564974 -567338 -563382 -565701 -570775
8940 -570775 -576935 -574749 -566320 -564042 -560910 -561611 -561690 -561642 -560432 -561860 -563770 -561550 -563245 -568142 -571836 -574228
8924 -574228 -568669 -573131 -571648 -564290 -561431 -567208 -568009 -571095 -572752 -573333 -572859 -573223 -566804 -565532 -561950
8909 -561950 -558234 -567161 -567708 -572016 -564454 -559450 -562840 -560954 -555421 -556135 -563485 -565471 -567560 -569863 -570890
8894 -570890 -564165 -558514 -559248 -556982 -561790 -566184 -570949 -563503 -563398 -565544 -562643 -560910 -559478 -561522 -557500
8879 -557500 -560132 -556510 -554989 -553463 -550486 -551432 -548962 -552281 -549389 -543816 -542656 -551485 -562004 -568360
8865 -568360 -566567 -568371 -567600 -560914 -548861 -545197 -554982 -557518 -561335 -560528 -560915 -562534 -559838 -562405 -557324
8850e57324Q712L800n341n572n239j575J0435M718j203q272o120P460Q408k213
8836e49326q791L420l129l376M846O67K893K675M27L080M60k772r465K061J0951
8821e45379M571l568m374n5p482K075N565R110P662r518r336o221m658j43J569
8806e60182K043L410J611N742R313k969J173j483q456o835K56j951M016K894P586
8791e43832R174p980n18m471J264K055K185l662MN956L006n75L116O591k826o129
8775e36642r79K243j074K654M049M749q681o537j597J234J294k369j75k357l883
8760e48071l344k968M850R298P734Q0O855n659p847m80K845l965M345M947k684
8745e34064K412n455j0539K572M604j715N18o04M843P93k72j999o20L71K945K287
$$ plain form
8850 -557324 -548612 -544812 -550153 -555725 -560964 -562539 -552104 -547386 -548589 -556861 -562981 -555521 -547113 -549326
8836 -549326 -558117 -554697 -557826 -561202 -556356 -555689 -552796 -550121 -549694 -546614 -546154 -548926 -558391 -556330 -545379
8821 -545379 -540808 -544376 -548750 -548805 -556287 -554212 -548647 -539537 -531875 -541393 -550729 -556950 -561608 -561751 -560182
8806 -560182 -558139 -554729 -553118 -547376 -538063 -541032 -539859 -541342 -549798 -556633 -556377 -558328 -554312 -551418 -543832
8791 -543832 -534658 -542638 -543156 -547627 -546363 -544308 -542123 -545785 -545781 -539825 -536819 -537394 -534278 -527687 -530513 -536642
8775 -536642 -537621 -535378 -536452 -533798 -529749 -525000 -533681 -540218 -541815 -540581 -539287 -541656 -541831 -544188 -548071
8760 -548071 -551415 -554383 -549533 -540235 -532501 -532421 -525566 -531225 -539072 -539552 -536707 -540672 -536327 -531380 -534064
8745 -534064 -531652 -537107 -547646 -545074 -540470 -542185 -541667 -542271 -537428 -536635 -536907 -538906 -539526 -539155 -536210 -533923
8729e33923O780m112l211k862m572O647N299K534L37M290o896k912O996k608o708
8714e34921k559j86k780r73J151J212K610M790L002j592M475j609r070J893M170
8699e30387R064K827J858q753n500k154Q078L167K176L429k061k940k402P566
8685e16032N575n938p874r813m872K649M628J360k189k598J124l812j881J62K921
8670e36590J605k280L104P405l189k927Q113N964M747j763j612r74k418n406K917
8655e23304k5N132l058j061R39q604L608L306K399k473n025N946L832k406M989
8640e15805N319K49q889r929j345j366p12N701J404L80k585M442P989L683K71
8625e11193M10P38o75o773p2K137O218L95p623J119K63p183L152R562o000l581
$$ plain form
8729 -533923 -527143 -531255 -534466 -537328 -541900 -535253 -529954 -527420 -527083 -522793 -529689 -532601 -525605 -528213 -534921
8714 -534921 -537480 -537666 -540446 -541419 -540268 -539056 -536446 -531656 -528654 -530246 -525771 -527380 -536450 -534557 -530387
8699 -530387 -521323 -518496 -516638 -525391 -530891 -533045 -524967 -521800 -519624 -516195 -518256 -521196 -523598 -516032
8685 -516032 -510457 -516395 -524269 -534082 -538954 -536305 -531677 -530317 -532506 -535104 -533980 -537792 -539673 -539511 -536590
8670 -536590 -534985 -537265 -534161 -526756 -529945 -532872 -524759 -518795 -514048 -515811 -517423 -518397 -520815 -526221 -523304
8655 -523304 -523329 -518197 -521255 -522316 -521377 -529981 -526373 -523067 -520668 -523141 -528166 -522220 -518388 -520794 -515805
8640 -515805 -510486 -510237 -519126 -529055 -530400 -531766 -532478 -526777 -525373 -524993 -527578 -523136 -515147 -511464 -511193
8625 -511193 -510783 -510045 -510720 -517493 -517565 -515428 -509210 -508815 -516438 -515319 -515056 -522239 -519087 -509525 -515525 -519106
8609e19106K906j779l483J126J267P634N142m61j806j885n398K262N594m243K35
8594e11995J75o113q35J251L094K341L079L902P42N253L721L385l039n218p474
8579e07731J152J771K754J160m026j963p3j675j0153R323O55q937n783j318l361
8564e28205m006J358O72J360j895L801N212l554r623P06L244K744L24k403L14
8549e29951K937m01L293J930q051M634K372o297P741Q961K61n004k852k436J931
8534e20932Q96K668n533j0231o117K913N353J2252K823J514m657k919R56p50j020
8519e22784J207L981N881r12R0k005n145L507K337k255m002K399j712m861K361
8504e21913K025L574m885m553O851J1304P391j556l006m357J941j980k74k642
$$ plain form
8609 -519106 -516200 -517979 -521462 -520336 -519069 -511435 -506293 -506754 -508560 -510445 -515843 -513581 -507987 -512230 -511995
8594 -511995 -511820 -517933 -518768 -517517 -514423 -512082 -509003 -505101 -504359 -499106 -495385 -492000 -495039 -500257 -507731
8579 -507731 -506579 -504808 -502054 -500894 -504920 -506883 -506956 -508631 -518784 -509461 -508806 -517743 -523526 -524844 -528205
8564 -528205 -532211 -530853 -530181 -528821 -530716 -526915 -521703 -525257 -534880 -534174 -530930 -528186 -527862 -530265 -529951
8549 -529951 -527014 -527415 -524122 -522192 -530243 -525609 -523237 -529534 -521793 -512832 -512571 -517575 -520427 -522863 -520932
8534 -520932 -520036 -517368 -522901 -533132 -539249 -536336 -530983 -518731 -515908 -514394 -519051 -521970 -521014 -521764 -522784
8519 -522784 -521577 -517596 -511715 -512627 -512537 -514542 -519687 -516180 -513843 -516098 -520100 -517701 -519413 -524274 -521913
8504 -521913 -519888 -516314 -521199 -525752 -518901 -507597 -500206 -501762 -504768 -509125 -507184 -509164 -509438 -512080
8490e12080o613L022L440j424l221N831M92r87M941N229j691m755k284p0k829
8475e12999Q73R23J705J450N25k172J727q67K339j907O68n0K194n64k267l596
8459e12018l276J168M390n751q17J202L412O268P71j768M196L471q26m51L658
8444d96371j541j3022r705j185P418J837j645l106J169O845R92p653l98N183Q552
8429e02630K475n228n377l405L374M483p75J475M02q12J032J20o76l042K218P151
8413d99215l21l928L511M413l866j550L153M04M49p866m24K074P292O837n282
8398d94319m367J75J402m4K221J707L096k064l80j57j12o857n763p833P01N528
8382e07066O072J314J32j734m7K557O5m209K617K453r16M509P968N112q195k353
$$ plain form
8490 -512080 -518693 -515671 -512231 -513655 -516876 -511045 -510553 -511540 -506599 -501370 -503061 -507816 -510100 -510170 -512999
8475 -512999 -512126 -511203 -509498 -508048 -507523 -509695 -507968 -508835 -506496 -508403 -507735 -507785 -505591 -506155 -508422 -512018
8459 -512018 -515294 -514126 -509736 -515487 -516304 -515102 -511690 -505422 -504651 -506419 -502223 -498752 -499578 -500029 -496371
8444 -496371 -497912 -510934 -520639 -521824 -514406 -512569 -514214 -517320 -516151 -509306 -508314 -515967 -516365 -511182 -502630
8429 -502630 -500155 -505383 -510760 -514165 -510791 -506308 -507083 -505608 -505206 -506018 -504986 -504866 -505542 -508584 -506366 -499215
8413 -499215 -499536 -503464 -499953 -495540 -499406 -500956 -497803 -497399 -496950 -504816 -505240 -503166 -495874 -489037 -494319
8398 -494319 -498686 -498511 -497109 -497153 -494932 -493225 -490129 -492193 -492573 -492730 -492842 -499699 -505462 -513295 -512594 -507066
8382 -507066 -500994 -499680 -499548 -501282 -501329 -498772 -498707 -502916 -500299 -497846 -498762 -494253 -486285 -481173 -489368 -491721
8366d91721K286o633M303K893n939n782K082K134j287J767k235j993K263M326
8352d93536m356J332k287M001M761j2N60l979p539l659J633N897J214J381K494
8337d92095j044l3n881N1l343m85L140J476j96P41K460k024r98M515M66N64K306
8320d90380J212k898m184K7k030j042N161N359J089q379M252N060k201k708J557
8305d90105J287p441J721O357j13n719J56L55L132K436M761l85J024K031P83L016
8289d76704p47R77p822k185j0612l39N812Q403k069K513k791r330m857j318L898
8274d97171O538O716M935k394o215n51J665m560m655J769J291N208l323J928O484
8259d82335R30p954J123j722J813k22q50K686k038k556L965O699K350m903k785
$$ plain form
8366 -491721 -489435 -496068 -491765 -488872 -494811 -500593 -498511 -496377 -497664 -495897 -498132 -500125 -497862 -493536
8352 -493536 -497892 -496560 -498847 -494846 -490085 -490097 -489537 -493516 -501055 -504714 -503081 -497184 -495970 -494589 -492095
8337 -492095 -493139 -493172 -499053 -499002 -502345 -502830 -499690 -498214 -498410 -497669 -495209 -497233 -498231 -493716 -493250 -492686 -490380
8320 -490380 -489168 -492066 -496250 -496223 -498253 -499295 -494134 -488775 -487686 -496065 -491813 -486753 -488954 -491662 -490105
8305 -490105 -488818 -496259 -494538 -488181 -488294 -494013 -493857 -493502 -490370 -487934 -483173 -483558 -482534 -480503 -479720 -476704
8289 -476704 -477451 -476474 -484296 -486481 -497093 -497432 -491620 -483217 -485286 -482773 -485564 -494894 -499751 -501069 -497171
8274 -497171 -490633 -483917 -478982 -481376 -487591 -488142 -486477 -491037 -495692 -493923 -492632 -487424 -490747 -488819 -482335
8259 -482335 -481405 -489359 -488236 -489958 -488145 -488367 -489217 -486531 -488569 -491125 -487160 -480461 -478111 -483014 -485799
8244d85799J505L567M221p934p85J771n026k502J431m462j551m85N480L400n758
8229d92927L119j657q65L57M082N152M208m817j0401L246p572k249K91N503N039
8214d89491K390M011J669K075k228K497qL67J195J851m61K4k112N51m380k126
8198d84176L123m934L213N072J765J81J565k299K295P45Q84n133p556l010L416
8183d84849R966j003l19J512l721p35M600N779O19n303j556l558j822M620O340
8168d69430N062k903q330o02k916m368k620O371L66k890m720j107O230P136r28
8153d75649j823k705k328M1M854O593N602M548m032n049O6j910m132O03l100L487
8137d74934O800O441m942k37k069Q7k514L34N519N90m411J7K193r08j367k513
$$ plain form
8244 -485799 -484294 -480727 -476506 -484440 -485225 -483454 -488480 -490982 -489551 -494013 -495564 -496049 -490569 -487169 -492927
8229 -492927 -489808 -491465 -492330 -491973 -487891 -482739 -478531 -483348 -493749 -490503 -498075 -500324 -500033 -494530 -489491
8214 -489491 -487101 -483090 -481421 -479346 -481574 -479077 -479085 -478718 -477523 -475672 -476133 -476109 -478221 -477670 -482050 -484176
8198 -484176 -481053 -485987 -482774 -477702 -475937 -475756 -474191 -476490 -474195 -473450 -472566 -477699 -485255 -488265 -484849
8183 -484849 -474883 -475886 -476205 -474693 -478414 -479149 -474549 -468770 -468151 -473454 -475010 -478568 -480390 -475770 -469430
8168 -469430 -464368 -467271 -475601 -476203 -479119 -483487 -486107 -479736 -479370 -482260 -486980 -488087 -481857 -474721 -475649
8153 -475649 -477472 -480177 -482505 -482464 -477610 -471017 -465415 -460867 -464899 -469948 -469882 -471792 -475924 -475321 -478421 -474934
8137 -474934 -468134 -461693 -466635 -466872 -468941 -468854 -471368 -471034 -465515 -464925 -469336 -469319 -467126 -468034 -469401 -471914
8121d71914n4O533O115n358j0711k165j114m022q3J268P677P09L903K020m014
8106d71210K723J620K631l837m162L587K9l143J301K268m090k031m845m840k555
8091d86554J108R572J1930l156p715O004R357K141n776N856j712j894l361l546
8077d67746j892Q24l676J082K488N323J03o128M11k481n91N190K854j623q738
8062d74600Q28J0405k612j1859m094M630J022L106k499o012j591P157K359n99
8048d74359N497K634k962K930j01N204N669m542p758J33N584P905M997o188o173
8033d61530J940K906J165J867N997k391j3652j0661l21p22j329K165J3069j203
8019d62700n652O76P429J564K644K089k954l791L135O73m07M793L351N94n133
$$ plain form
8121 -471914 -471968 -465435 -459320 -464678 -475389 -477554 -478668 -482690 -482773 -481505 -473828 -473119 -469216 -467196 -471210
8106 -471210 -468487 -466867 -464236 -468073 -472235 -468648 -468619 -471762 -470461 -468193 -472283 -474314 -479159 -483999 -486554
8091 -486554 -485446 -475874 -463944 -467100 -474815 -468811 -459454 -457313 -463089 -457233 -458945 -460839 -464200 -467746
8077 -467746 -469638 -468814 -472490 -471408 -468920 -463597 -463494 -469622 -469211 -471692 -472283 -467093 -464239 -465862 -474600
8062 -474600 -473772 -463367 -465979 -477838 -481932 -477302 -476280 -473174 -475673 -481685 -483276 -476119 -473760 -474359
8048 -474359 -468862 -466228 -469190 -466260 -466361 -461157 -455488 -460030 -467788 -467655 -462071 -454166 -449169 -455357 -461530
8033 -461530 -459590 -456684 -455519 -453652 -447655 -450046 -463698 -474359 -474680 -475402 -476731 -474566 -461497 -462700
8019 -462700 -468352 -467676 -460247 -458683 -456039 -453950 -456904 -460695 -457560 -456887 -457294 -452501 -449150 -448556 -453689
8004d53689K126n77Q851J517q979r465N24M643J482l672n421n173J077M271O296
7989d56189Rp395m394m177J000O574m51J448O985L409M568j109n539K257k713
7974d55717J227l746p259m474M49J704L16P597o63m348J182P330j536L855O61
7959d53422m524K14K80N553L281L11N59n095o519J323O466o96q558m350o495N826
7943d65846J0192P49j928j656J329M494j688N390P290l046k016m829l788P68J63
7928d54422j086j945m587L401M361m087n421m264M224N216L291K286M861J882
7914d46290l877n809p488j283l594M204O44R67Q470k22K410M431m561p768l136
7899d62902l527J431J0099Q27j160k899l991L657J32J707J237m042p938P31K037
$$ plain form
8004 -453689 -451563 -452140 -443289 -441772 -450751 -460216 -459692 -455049 -453567 -457239 -462660 -467833 -466756 -462485 -456189
7989 -456189 -456180 -463575 -467969 -472146 -471146 -464572 -465023 -463575 -456590 -453181 -448613 -449722 -455261 -453004 -455717
7974 -455717 -454490 -458236 -465495 -469969 -469520 -467816 -467500 -459903 -460566 -464914 -463732 -456402 -457938 -454083 -453422
7959 -453422 -457946 -457732 -457452 -451899 -448618 -448307 -447748 -452843 -459362 -458039 -451573 -452269 -460827 -465177 -471672 -465846
7943 -465846 -455654 -454905 -456833 -458489 -457160 -452666 -454354 -448964 -441674 -444720 -446736 -451565 -455353 -454585 -454422
7928 -454422 -455508 -457453 -462040 -458639 -454278 -458365 -463786 -468050 -463826 -458610 -455319 -453033 -448172 -446290
7914 -446290 -450167 -455976 -463464 -464747 -468341 -464137 -463493 -462526 -454056 -454278 -451868 -447437 -451998 -459766 -462902
7899 -462902 -466429 -464998 -454899 -454072 -455232 -458131 -462122 -458465 -458333 -456626 -455389 -459431 -467369 -466638 -464601
7884d64601J794l524m082L627O696l387o191O370R04k316n910Q56n023J66q78
7869d75499L435j713K341j453m523l00J973M452n233K948M470q13L650J527R850
7854d54888O057K996j2987j553L923n12j400o275j587p06M084L203o05K892J011
7839d56347k258M00R67K994M406J63n58o065N59L013q82J034p621J949K745O816
7823d48685l455p560o010J088J995K781Q48K374o88l67l39m216j601J866K713
7808d59256L157L46l030k145P801j285n311M950K700N58J223L376M922m824q963
7793d55781K319J798K275O366K431L87M499r809j1527M429L672M160Q747M892
7779d31142k731j4643p167M008k653K900M705m292l496k416l59P219o38L037J424
$$ plain form
7884 -464601 -462807 -466331 -470413 -466786 -460090 -463477 -469668 -463298 -462394 -464710 -470620 -469764 -474787 -474621 -475499
7869 -475499 -472064 -473777 -471436 -472889 -477412 -477712 -475739 -471287 -476520 -473572 -469102 -469915 -466265 -464738 -454888
7854 -454888 -448831 -445835 -458822 -460375 -456452 -456964 -458364 -464639 -466226 -466932 -462848 -459645 -460250 -457358 -456347
7839 -456347 -458605 -458205 -457238 -454244 -449838 -449675 -450233 -456298 -455739 -452726 -453608 -452574 -460195 -458246 -455501 -448685
7823 -448685 -452140 -459700 -465710 -464622 -462627 -459846 -458998 -456624 -457312 -457679 -458018 -462234 -463835 -461969 -459256
7808 -459256 -456099 -455753 -458783 -460928 -453127 -454412 -459723 -454773 -452073 -451515 -450292 -446916 -441994 -446818 -455781
7793 -455781 -453462 -451664 -449389 -443023 -440592 -440205 -435706 -445515 -457042 -452613 -448941 -444781 -436034 -431142
7779 -431142 -433873 -448516 -455683 -451675 -454328 -451428 -446723 -451015 -454511 -456927 -457286 -450067 -450705 -447668 -446244
7764d46244K268j108l042J442Q224K446r390l997J042L55on825o853K985J324
7749d56379L991N848k730k552J432n68n190L059K010M527P408j832n14q553J809
7734d48234j64K391M677J199o272J155R380n718l876P85M386K427m160q878K142
7719d48760N428J351R32l15m093k781k373l120l860L563J1922P3P01m945r82L375
7703d43884l227k637J693Q099M765m854k271p481M990J360m885j056r95R11q73
7688d50345Q758L602J774j2o842L807M202l497o846k332p61o87l54M565L662K676
7672d38630K12K190j139l579R0K563L541P63K141L086J781r009p040J534L466
7657d38030j620k455k528j82O570R509o738q795l197k439O959P796q563p990j080
$$ plain form
7764 -446244 -443976 -445084 -448126 -446684 -438460 -436014 -445404 -449401 -448359 -448004 -448010 -453835 -460688 -457703 -456379
7749 -456379 -452388 -446540 -449270 -451822 -450390 -450958 -456148 -453089 -451079 -446552 -439144 -440976 -441490 -450043 -448234
7734 -448234 -448398 -446007 -441330 -440131 -446403 -445248 -435868 -441586 -445462 -444677 -440291 -437864 -442024 -450902 -448760
7719 -448760 -443332 -441981 -441049 -441364 -445457 -448238 -450611 -453731 -457591 -454028 -442106 -442033 -441332 -446277 -447259 -443884
7703 -443884 -447111 -449748 -448055 -439956 -435191 -440045 -442316 -449797 -444807 -443447 -448332 -449388 -450383 -449472 -450345
7688 -450345 -441587 -437985 -436211 -436223 -443065 -439258 -435056 -438553 -445399 -447731 -448492 -449179 -449533 -444968 -441306 -438630
7672 -438630 -438418 -436228 -437367 -440946 -440856 -438293 -434752 -433989 -431848 -428762 -426981 -435990 -443030 -441496 -438030
7657 -438030 -439650 -442105 -444633 -444815 -438245 -428736 -435474 -444269 -447466 -449905 -442946 -435150 -443713 -451703 -452783
7642d52783N818R018K249o079l675l81M857O059Q16j962k774O828j768j667N580
7627d29864N650k612j0008J710Q749M427K82k302n745j39J351p529n704J406l515
7612d43843l783k96l8M115l56J360K252L891K656l382J86q133O85K452J303L260
7596d37671K557K237j725l238p88m43l071N929k777j290P66N53o098J652k346
7581d45753L249N861m802l692Q17M953j973N228p99j61j489l490k493K17L384
7566d40943M034O123q035n555l56K52N295J679K366l885L098Q816N141k538p70
7551d25278n522k332N50Q70L835m131j499n80k798l213O378O961L187r50k796
7536d27318k221j810P91O387J024p14o94K195J351p634m485n289J83N161K432
$$ plain form
7642 -452783 -446965 -437947 -435698 -441777 -445452 -445833 -440976 -434917 -434101 -436063 -438837 -432009 -433777 -435444 -429864
7627 -429864 -424214 -426826 -436834 -435124 -426375 -421948 -421666 -423968 -429713 -429852 -428501 -436030 -441734 -440328 -443843
7612 -443843 -447626 -447922 -447960 -443845 -444201 -442841 -440589 -436698 -434042 -437424 -437238 -445371 -444686 -442234 -440931 -437671
7596 -437671 -435114 -432877 -434602 -437840 -438628 -439071 -442142 -436213 -438990 -440280 -439514 -438961 -445059 -443407 -445753
7581 -445753 -442504 -436643 -441445 -445137 -444320 -439367 -441340 -436112 -436911 -437072 -438561 -442051 -444544 -444327 -440943
7566 -440943 -436909 -430786 -438821 -444376 -444732 -444480 -439185 -437506 -435140 -439025 -435927 -427111 -421970 -424508 -425278
7551 -425278 -430800 -433132 -432582 -431712 -427877 -432008 -433507 -434087 -436885 -440098 -433720 -426759 -423572 -424522 -427318
7536 -427318 -429539 -431349 -430558 -424171 -423147 -423861 -424555 -422360 -421009 -428643 -433128 -438417 -438234 -433073 -430641
7521d30641P20k771k369K709p64N686r12l509n767o99M646R076j277o195j547
7506d33614M775l190k492k670P123R85N75O36m516m212j06P045P847L362j208
7491d19660j182j152p567l292J630J581l279Q015o137l723l76M199P498j069K363
7476d22151J900o61R79n177l65j854m18J115j878k837K281Q207n92k503Q309K004
7460d13641j87j522n22K79m628n32L881m434j938j685l077l018j75q7L233M55
7444d27598j093L553O591J318o613o775m781j960N298J1507q1l008o141m769O14
7429d33938J894q01j789J194N827M966p422K034N429J760j093N94k052j471n146
7414d30014N806K050J06L42J0843Q81l245m858J0016m236j503k710O26J722r97
$$ plain form
7521 -430641 -429921 -432692 -435061 -432352 -433116 -427430 -428342 -431851 -437618 -438317 -433671 -424595 -425872 -432067 -433614
7506 -433614 -428839 -432029 -434521 -437191 -430068 -429083 -428508 -427872 -432388 -436600 -436706 -429661 -421814 -418452 -419660
7491 -419660 -420842 -421994 -429561 -432853 -431223 -429642 -432921 -424906 -431043 -434766 -435142 -430943 -423445 -424514 -422151
7476 -422151 -420251 -420912 -419933 -425110 -425475 -427329 -427747 -426632 -428510 -431347 -429066 -420859 -421451 -423954 -415645 -413641
7460 -413641 -413828 -415350 -415872 -415593 -420221 -420753 -416872 -421306 -423244 -424929 -428006 -431024 -431199 -431286 -428053 -427598
7444 -427598 -428691 -425138 -418547 -417229 -423842 -430617 -435398 -437358 -432060 -420553 -420634 -423642 -429783 -434552 -433938
7429 -433938 -432044 -432845 -434634 -433440 -427613 -422647 -430069 -428035 -422606 -420846 -421939 -421345 -423397 -424868 -430014
7414 -430014 -424208 -422158 -422052 -421710 -410867 -409986 -413231 -418089 -408073 -412309 -413812 -416522 -415896 -414174 -415171
7399d15171K87l665K517j682L548N298m152m262k161j089o850o353K319L339N941
7384d22136Q5j288J513J4k044K113N856K734o169M808N843L173k34m728j1827
7369d22287k414O487m07k956j401m08K029J261O43k642J630l635r86q95K528N31
7353d22922K669k052N408M769n524k156K917M5m003K292L796l925N702O502l111
7338d09593J909P925m153q159q543m489n727O876L4L550K741L556K878J601P548
7323d02046O641l217j3917r353L110J839J047K862p222r14J900J811q38j205k828
7308d22330j516n712j208o135L650M098J146q8p903J822J1750J0264j976q064
7294d22202J742N840m133o547k558m425Q522O67O198O379K495j779K63j49j492
$$ plain form
7399 -415171 -414884 -418549 -416032 -417714 -414166 -408868 -413020 -417282 -419443 -420532 -427382 -433735 -431416 -428077 -422136
7384 -422136 -422051 -423339 -421826 -421812 -423856 -421743 -415887 -413153 -419322 -414514 -408671 -405498 -405732 -410460 -422287
7369 -422287 -424701 -418214 -418621 -421577 -422978 -423386 -421357 -420096 -419453 -422095 -420465 -424100 -425086 -425981 -423453 -422922
7353 -422922 -420253 -422305 -416897 -412128 -417652 -419808 -416891 -416846 -420849 -418557 -414761 -418686 -412984 -406482 -409593
7338 -409593 -407684 -399759 -403912 -412071 -420614 -425103 -430830 -423954 -423920 -420370 -417629 -414073 -411195 -409594 -402046
7323 -402046 -395405 -398622 -412539 -421892 -418782 -416943 -415896 -413034 -420256 -421170 -419270 -417459 -418297 -419502 -422330
7308 -422330 -423846 -429558 -430766 -436901 -433251 -429153 -428007 -428095 -435998 -434176 -422426 -412162 -414138 -422202
7294 -422202 -420460 -414620 -418753 -425300 -427858 -432283 -423761 -423094 -416896 -410517 -408022 -409801 -409538 -409687 -411179
7279d11179M057l79k19q371n462O136j019k742N626P434K532M603L83o648p372
7264d12620l813j10L821L004o460p161l478M920L525n340J14M797o59M390Q097
7249d06973J629j690k352J205k813m885P79O252q57l923o717K154J0835L939j054
7234d04471l031K766L69p327r036N714M109k13L162r02j341L310J135k838J39
$$ plain form
7279 -411179 -407122 -407501 -407720 -416091 -421553 -415417 -416436 -419178 -413552 -406118 -403586 -398983 -398600 -405248 -412620
7264 -412620 -416433 -416543 -412722 -409718 -416178 -423339 -426817 -421897 -418372 -423712 -423598 -418801 -419460 -415070 -406973
7249 -406973 -405344 -407034 -409386 -408181 -410994 -415879 -415100 -408848 -409705 -413628 -420345 -418191 -407356 -403417 -404471
7234 -404471 -407502 -404736 -404367 -411694 -420730 -415016 -410907 -411120 -407958 -408860 -410201 -406891 -405756 -408594 -408455
$$ [...]
##END NTUPLES=NMR SPECTRUM
##END=
