##TITLE=Analysis number 318806
Compound Code ac 33015
Project Code adrs
Chemist Name avocado
##JCAMPDX= 6.0         $$ Bruker NMR JCAMP-DX V2.0
##DATA TYPE= NMR SPECTRUM
##DATA CLASS= NTUPLES
##ORIGIN= Bruker BioSpin GmbH
##OWNER= nmr
$$ XWIN-NMR		Version 3.5
$$ Tue Apr 18 14:33:32 2006 GMT Daylight Time (UT+1h)  MAYBRIDGE\nmr@NMR_250MHZ
##.OBSERVE FREQUENCY= 250.131544655141
##.OBSERVE NUCLEUS= ^1H
##.ACQUISITION MODE= SIMULTANEOUS (DQD)
##.ACQUISITION SCHEME= undefined
##.AVERAGES= 16
##.DIGITISER RES= 18
##SPECTROMETER/DATA SYSTEM= dpx250
##.PULSE SEQUENCE= zg30
##.SOLVENT NAME= DMSO
##.SHIFT REFERENCE= (INTERNAL, DMSO, 0, 16.522)
##AUDIT TRAIL= $$ (NUMBER, WHEN, WHO, WHERE, WHAT)
$$ ##TITLE= Audit trail, XWIN-NMR		Version 3.5
$$ ##JCAMPDX= 5.01
$$ ##ORIGIN= Bruker BioSpin GmbH
$$ ##OWNER= nmr
$$ C:\u/data/dgb/nmr/ADRS/2710/pdata/1/auditp.txt
$$ ##AUDIT TRAIL=  $$ (NUMBER, WHEN, WHO, WHERE, WHAT)
(   1,<2006-04-18 14:33:10.87 +100>,<MAYBRIDGE\nmr>,<NMR_250MHZ>,
      <created by zg, POWCHK disabled, PULCHK disabled
       configuration hash MD5:
       84 BC 41 DB A1 6E 1D 46 DA 25 12 A5 C1 ED C5 3A
       data hash MD5: 64K
       3F 0B 84 5B DB 36 95 BF BC 76 66 99 AF 4D 90 FD>)
(   2,<2006-04-18 14:33:22.75 +100>,<MAYBRIDGE\nmr>,<NMR_250MHZ>,
      <Start of raw data processing
       ef LB = 0.3 FT_mod = 6 PKNL = 1 SI = 32K 
       data hash MD5: 32K
       4D 67 9A F2 86 77 D2 A2 83 0A 8C C6 80 35 F7 29>)
(   3,<2006-04-18 14:33:24.36 +100>,<MAYBRIDGE\nmr>,<NMR_250MHZ>,
      <apk 
       data hash MD5: 32K
       F3 38 98 43 51 85 31 92 C1 20 FF 2E C6 41 8D C2>)
(   4,<2006-04-18 14:33:25.17 +100>,<MAYBRIDGE\nmr>,<NMR_250MHZ>,
      <abs ABSG = 5 
       data hash MD5: 32K
       B0 B1 28 27 B2 41 64 88 32 39 D8 E0 BB 2D 90 DF>)
$$ ##END=
$$ 
$$ hash MD5
$$ 98 B4 49 16 34 7F 33 18 5E BE D7 9B 90 23 83 BE
##$RELAX= 
##$RELAX= 
##$RELAX= 
##$RELAX= 
##$RELAX= 
##$RELAX= 
##$RELAX= 
$$ Bruker specific parameters
$$ --------------------------
##$DU= <C:\u>
##$EXPNO= 2710
##$NAME= <ADRS>
##$PROCNO= 1
##$TYPE= <nmr>
##$USER= <dgb>
##$AMP= (0..31)
100 100 100 100 100 100 100 100 100 100 100 100 100 100 100 100 100 100 
100 100 100 100 100 100 100 100 100 100 100 100 100 100 
##$AQSEQ= 0
##$AQ_mod= 3
##$AUNM= <au_zg>
##$AUTOPOS= <52 >
##$BF1= 250.13
##$BF2= 250.13
##$BF3= 250.13
##$BF4= 250.13
##$BF5= 500.13
##$BF6= 500.13
##$BF7= 500.13
##$BF8= 500.13
##$BYTORDA= 1
##$CFDGTYP= 0
##$CFRGTYP= 5
##$CHEMSTR= <none>
##$CNST= (0..31)
1 1 145 1 1 1 1 1 1 1 1 1 1 1 1 1 1 1 1 1 1 1 1 1 1 1 1 1 1 1 1 1 
##$CPDPRG= <>
##$CPDPRG1= <>
##$CPDPRG2= <>
##$CPDPRG3= <>
##$CPDPRG4= <mlev>
##$CPDPRG5= <mlev>
##$CPDPRG6= <mlev>
##$CPDPRG7= <mlev>
##$CPDPRG8= <mlev>
##$CPDPRGB= <>
##$CPDPRGT= <>
##$D= (0..31)
0 1 0 0 0 0 0 0 0 0.06 0 0 0 0 0 0 0.0002 0 0 0 0 0 0 0 0 0 0 0 0 0 0 
0 
##$DATE= 1145367190
##$DBL= (0..7)
120 120 120 120 120 120 120 120 
##$DBP= (0..7)
150 150 150 150 150 150 150 150 
##$DBP07= 0
##$DBPNAM0= <>
##$DBPNAM1= <>
##$DBPNAM2= <>
$$ [...]
##$SUBNAM7= <"">
##$SUBNAM8= <"">
##$SUBNAM9= <"">
##$SW= 20.6930455092707
##$SWIBOX= (0..15)
0 0 3 0 0 0 0 0 0 0 0 0 0 0 0 0 
##$SW_h= 5175.983436853
##$TD= 65536
##$TD0= 1
##$TE= 294.16
##$TE2= 300
##$TE3= 300
##$TEG= 300
##$TL= (0..7)
0 120 120 120 120 120 120 120 
##$TP= (0..7)
150 150 150 150 150 150 150 150 
##$TP07= 0
##$TPNAME0= <>
##$TPNAME1= <>
##$TPNAME2= <>
##$TPNAME3= <>
##$TPNAME4= <>
##$TPNAME5= <>
##$TPNAME6= <>
##$TPNAME7= <>
##$TPOAL= (0..7)
0.5 0.5 0.5 0.5 0.5 0.5 0.5 0.5 
##$TPOFFS= (0..7)
0 0 0 0 0 0 0 0 
##$TUNHIN= 0
##$TUNHOUT= 0
##$TUNXOUT= 0
##$USERA1= <user>
##$USERA2= <user>
##$USERA3= <user>
##$USERA4= <user>
##$USERA5= <user>
##$V9= 5
##$VALIST= <valist>
##$VCLIST= <CCCCCCCCCCCCCCC>
##$VD= 0
##$VDLIST= <DDDDDDDDDDDDDDD>
##$VPLIST= <PPPPPPPPPPPPPPP>
##$VTLIST= <TTTTTTTTTTTTTTT>
##$WBST= 1024
##$WBSW= 4
##$XGAIN= (0..3)
0 0 0 0 
##$XL= 0
##$YL= 0
##$YMAX_a= 424469
##$YMIN_a= -438480
##$ZGOPTNS= <>
##$ZL1= 120
##$ZL2= 120
##$ZL3= 120
##$ZL4= 120
##$ABSF1= 16.522
##$ABSF2= -4.171173
##$ABSG= 5
##$ABSL= 3
##$ALPHA= 0
##$AQORDER= 0
##$ASSFAC= 0
##$ASSFACI= 0
##$ASSFACX= 0
##$ASSWID= 0
##$AUNMP= <proc_1d>
##$AZFE= 0.1
##$AZFW= 0.1
##$BCFW= 0
##$BC_mod= 0
##$BYTORDP= 0
##$COROFFS= 0
##$CY= 12.5
##$DATMOD= 1
##$DC= 0
##$DFILT= <>
##$DTYPP= 0
##$F1P= 14.0000005364418
##$F2P= -0.99999901652339
##$FCOR= 0.5
##$FTSIZE= 32768
##$FT_mod= 6
##$GAMMA= 0
##$GB= 0
##$INTBC= 1
##$INTSCL= 1
##$ISEN= 128
##$LB= 0.3
##$LEV0= 0
##$LPBIN= 0
##$MAXI= 10000
##$MC2= 0
##$MEAN= 0
##$ME_mod= 0
##$MI= 0
##$NCOEF= 0
##$NC_proc= -3
##$NLEV= 6
##$NOISF1= 0
##$NOISF2= 0
##$NSP= 0
##$NTH_PI= 0
##$NZP= 0
##$OFFSET= 16.522
##$PC= 1
##$PHC0= 158.8513
##$PHC1= 6.883757
##$PH_mod= 1
##$PKNL= yes
##$PPARMOD= 0
##$PSCAL= 4
##$PSIGN= 0
##$REVERSE= no
##$SF= 250.13
##$SI= 32768
##$SIGF1= 0
##$SIGF2= 0
##$SINO= 400
##$SIOLD= 32768
##$SREGLST= <1H.DMSO>
##$SSB= 0
##$STSI= 32768
##$STSR= 0
##$SW_p= 5175.98343685301
##$SYMM= 0
##$S_DEV= 0
##$TDeff= 65536
##$TDoff= 0
##$TI= <Analysis number 999999
Compound Code 99
Book Reference 9
Project Code 9>
##$TILT= no
##$TM1= 0
##$TM2= 0
##$TOPLEV= 0
##$USERP1= <user>
##$USERP2= <user>
##$USERP3= <user>
##$USERP4= <user>
##$USERP5= <user>
##$WDW= 1
##$XDIM= 32768
##$YMAX_p= 526621726
##$YMIN_p= -274069
$$ End of Bruker specific parameters
$$ ---------------------------------
##NTUPLES= NMR SPECTRUM
##VAR_NAME=  FREQUENCY,     SPECTRUM/REAL,   SPECTRUM/IMAG
##SYMBOL=    X,             R,               I
##VAR_TYPE=  INDEPENDENT,   DEPENDENT,       DEPENDENT
##VAR_FORM=  AFFN,          ASDF,            ASDF
##VAR_DIM=   32768,         32768,           32768
##UNITS=     HZ,            ARBITRARY UNITS, ARBITRARY UNITS
##FACTOR=    0.157963299565203, 1,           1
##FIRST=     4132.6476996994, 0,             0
##LAST=      -1043.33573715361, 0,           0
##MIN=       -1043.33573715361, -274069,     0
##MAX=       4132.6476996994, 526621726,     0
$$ Real data points
##PAGE= N=1
##DATA TABLE= (X++(R..R)), XYDATA
$$ [...]
16575B1650J3222P967R204P249q588j8372j445K903J3374n799j6672k6599J7267
$$ 21650 34872 42839 52043 59292 50704 32332 30887 33790 47164 41365 24693 -1906 15361
16562A5361K7357L01l8099l736K2623J6778l1060J8810J5963j2189M763L8840
$$ 15361 42718 43019 4920 1184 23807 40585 9525 28335 44298 32109 36872 75712
16550G5712O355m549p820O567L0248P847k0430j5127L7588O1747N2498O8507M6382
$$ 75712 82067 77518 69698 76265 106513 114360 93930 78803 116391 178138 230636 299143 345525
16537C45525L7274J3049J806k5796l5533k7757j1497k3978j1472K9015O7483O1511
$$ 345525 382799 395848 397654 371858 336325 308568 297071 273093 261621 290636 358119 419630
16525D19630M9092M510M138j4027l0709m1418p2485m2602n2954n9491m0419k7828
$$ 419630 468722 473232 477370 463343 432634 391216 318731 276129 223175 163684 123265 95437
16513I5437K5533L4054j2513k8842j7020k1791M78m376R392J4986k0596m6398
$$ 95437 120970 155024 142511 113669 96649 74858 75336 70960 80352 95338 74742 28344
16501B8344j624K2444k0759m7823J0878J9544J9076l996J5863J6966K427M650
$$ 28344 26720 49164 28405 -19418 -8540 11004 30080 26084 41947 58913 61340 65990
16489F5990J1586L7063m493m8284k2670j680k6921m8185P933L1586J0610K6734
$$ 65990 77576 114639 110146 61862 39192 37512 10591 -37594 -29661 1925 12535 39269
16477C9269m381n239j8255j3076o202K1876J1252j4715O931J3695j3981k1822
$$ 39269 34888 29649 11394 -1682 -7884 13992 25244 10529 17460 31155 17174 -4648
16465d648J3973J5694J6874k4138j7595k997J3658p059L669K8961J7346k6308
$$ -4648 9325 25019 41893 17755 160 -2837 10821 3762 7431 36392 53738 27430
16453B7430k8103j1727K3846R645r374O732n793J5487J3274k2317k5617K3856
$$ 27430 -673 -12400 11446 21091 11717 18449 12656 28143 41417 19100 -6517 17339
16441A7339J5729Q594k3410k2332q595k2044j8963L4320J6075J4525J7822k6131
$$ 17339 33068 41662 18252 -4080 -12675 -34719 -53682 -19362 -3287 11238 29060 2929
16429B929k6301K7643K4568j6881J2801N365k1835J137o438n450q744r85J8901
$$ 2929 -23372 4271 28839 11958 24759 30124 8289 9426 2988 -2462 -11206 -12191 6710
16416F710L6767k6200k3625Q379J6767K5524o737l83j4350j6341m164M741M945
$$ 6710 43477 17277 -6348 2031 18798 44322 37585 37202 22852 6511 2347 7088 12033
16403A2033K643r297p937K1311J8351k1535j8340m142J6923J2130j5421N658j323
$$ 12033 14676 5379 -2558 18753 37104 15569 -2771 -6913 10010 22140 6719 12377 11054
16390A1054k7010o625L4265K0282r292j5812K9694j7216K319K1307N20q444j070
$$ 11054 -15956 -22581 11684 31966 22674 6862 36556 19340 21659 42966 43486 35042 33972
16377C3972k3290q896J2702j2653j096J4287q662Q972j3370O611j0841p24q515
$$ 33972 10682 1786 14488 1835 739 15026 6364 15336 1966 8577 -2264 -2988 -11503
16364a1503J3148J5948K4147q454l0745l1138j0897K8392p27J683l310r402o505
$$ -11503 1645 17593 41740 33286 2541 -28597 -39494 -11102 -11829 -10146 -13456 -22858 -29363
16351b9363j5276p1L2139K3612j8906k4858l194K7327j0243K0768P103j3463k3688
$$ -29363 -44639 -44710 -12571 11041 -7865 -32723 -35917 -8590 -18833 1935 9038 -4425 -28113
16338b8113N509L7034j0878l4681J0103L1743O129J9741l933m103n034r425j9805
$$ -28113 -22604 14430 3552 -31129 -21026 10717 16846 36587 32654 28551 23517 14092 -5713
16325e713J2758l7840M033J5701L7129J7552L743J1077K1269j0410k3216j5707
$$ -5713 7045 -30795 -26762 -11061 26068 43620 47363 58440 79709 69299 46083 30376
16313C0376j1521k0857j2310K3029K4958j397j7468R306m106J6028o871k5843
$$ 30376 18855 -2002 -14312 8717 33675 32278 14810 24116 20010 36038 29167 3324
16301C324k6495J0936o369J4894P98j5604j86o19O447j6576m6953k650L9587l671
$$ 3324 -23171 -12235 -18604 -3710 -2912 -18516 -18702 -19321 -12874 -29450 -76403 -79053 -39466 -43137
16287d3137L0973J0440n324J2041J6392m960J583m116j9756J904K9683J3876k6755
$$ -43137 -12164 -1724 -7048 4993 21385 16425 18008 13892 -5864 -3960 25723 39599 12844
16274A2844n836N37j6946j6321r107K7515J0865K2870j3481j2495J8196J4606
$$ 12844 7008 7545 -9401 -25722 -34829 -7314 3551 26421 12940 445 18641 33247
16262C3247j6533L130M298p899m528K9060l3445k1965j9015l3523K2901P153j1717
$$ 33247 16714 19844 24142 16243 11715 40775 7330 -14635 -33650 -67173 -44272 -37119 -48836
16249d8836Q068J5885K4103l01j2332k7752j1426L468L1006J5091J8995Q233Q072
$$ -48836 -40768 -24883 -780 -1081 -13413 -41165 -52591 -49123 -18117 -3026 15969 24202 32274
16236C2274p646P296l058J0114j1248m328n842l9432k858L5956K9356k597o123
$$ 32274 24628 31924 28866 38980 27732 23404 17562 -21870 -24728 11228 40584 37987 31864
16223C1864k5731K6172p562j9391M781O160r175J2210j7814J241R243j0046K949
$$ 31864 6133 32305 24743 5352 10133 16293 7118 19328 1514 2755 11998 1952 4901
16210D901J7356j0426P356m240k5741j1617O640j5177k0744J5458K2285J2783
$$ 4901 22257 11831 19187 14947 -10794 -22411 -15771 -30948 -51692 -36234 -13949 -1166
16198a166K4185j6919j5318L035j47K981K6608j9821p546P31K1730M2978J831
$$ -1166 23019 6100 -9218 -6183 -6330 -3349 23259 3438 -4108 -3377 18353 61331 63162
16185F3162k3040l1070j5002p333p758q090k1072J6321n318J1800K8727J3703
$$ 63162 40122 9052 -5950 -13283 -21041 -29131 -50203 -33882 -39200 -27400 1327 15030
16173A5030P585j1511P290n661K3893j456j1735m602K6998N103q342J164m1055
$$ 15030 22615 11104 18394 12733 36626 35170 23435 18833 45831 50934 42592 43756 2701
16160B701o408l1689J7360K7224r657R40M764J1915r853p044L5124O317j4209
$$ 2701 -3707 -35396 -18036 9188 -469 471 5235 17150 7297 253 35377 41694 27485
16147B7485p034j2042n526j6260J0495o05q623k1398J3561N0677Q465R716m9857
$$ 27485 20451 8409 2883 -13377 -2882 -3487 -12110 -33508 -19947 30730 39195 48911 -946
16134i46o0528j9531K8771N3843J7695j6450j910P903J221J3870n757k7118K171
$$ -946 -61474 -81005 -52234 1609 19304 2854 944 8847 10068 23938 18181 -8937 -6766
16121f766j0467j4284K6112J3134k0253Q980R513j1741r644J0788J1754m1435
$$ -6766 -17233 -31517 -5405 7729 -12524 -3544 5969 -5772 -15416 -4628 7126 -34309
16109c4309J2900K2140K0638k4816r635k7J6114K540j2783J1082J9813K26k3827
$$ -34309 -21409 731 21369 -3447 -13082 -13109 3005 5545 -7238 3844 23657 23883 56
16096E6L988j4100j3895j2960K4271N381k492Q213P108N190m456p281M925K668
$$ 56 4044 -10056 -23951 -36911 -12640 -7259 -9751 -1538 5570 10760 6304 -977 3948 6616
16082F616m5856j506L6007k2960l1531K207M1961N668j0090j8688k473J7213J5777
$$ 6616 -39240 -40746 -4739 -27699 -59230 -57023 -15062 -9394 -19484 -38172 -40645 -23432 -7655
16069g655j1660k3743J2522L8369j0885j1765q03J3320r279P713l7800l139o836
$$ -7655 -19315 -43058 -30536 7833 -3052 -14817 -15620 -2300 -11579 -3866 -41666 -44805 -51641
16056e1641K6336K8187j8246l197L6321O972R80j0856o063k0048l422j0394Q601
$$ -51641 -25305 2882 -15364 -18561 17760 24732 25712 14856 8793 -11255 -14677 -25071 -16470
16043a6470L111J2452j1031J1993J3049P30Q444k4932j1588N195j2513o347J7348
$$ -16470 -13359 -907 -11938 55 13104 13834 22278 -2654 -14242 -9047 -21560 -27907 -10559
16030a0559j0809k224J6006k6451m8844L1869L6640K9343k2977j4809m125K5828
$$ -10559 -21368 -23592 -7586 -34037 -82881 -51012 -14372 14971 -8006 -22815 -26940 -1112
16018a112J0322Q805j6868L0817K981j0160k6351j3320j351R963J7727K0366J1395
$$ -1112 9210 18015 1147 31964 34945 24785 -1566 -14886 -16237 -6274 11453 31819 43214
16005D3214J1852n8208l2345J9960J6804k887o880J8799L0992K6932k4825j6567
$$ 43214 55066 -3142 -35487 -15527 1277 -1610 -8490 10309 41301 68233 43408 26841
15993B6841n049L285r406k8691k156K901K9501J386M358j9564j2107R805k450
$$ 26841 21792 25077 15671 -13020 -15176 -12275 17226 18612 22970 3406 -8701 1104 -1346
15980a346j9325J6439m314j8584k442J5510j92P281L290o729O296m578m4592k591
$$ -1346 -20671 -4232 -8546 -27130 -29572 -14062 -14254 -6973 -3683 -10412 -4116 -8694 -53286 -55877
15966e5877N2308L2348q490j3648o891j5362m716p747K2887L2462L509o105Q638
$$ -55877 -3569 28779 20289 6641 -250 -15612 -20328 -28075 -5188 27274 30783 24678 33316
15953C3316n506k0449N663L7034j0791j2021o408N051M902Q217P858k9670j4928
$$ 33316 27810 7361 13024 50058 39267 27246 20838 25889 30791 39008 46866 17196 2268
15940B268l6659j0120K2433Q036j5237J002K8388M264l094J3406J7968q407j6568
$$ 2268 -34391 -44511 -22078 -14042 -29279 -28277 111 4375 1281 14687 32655 24248 7680
15927G680J5770Q016j2712k9000j3004M502N81j1423N513L7l2861j303K3713k2462
$$ 7680 23450 31466 18754 -10246 -23250 -18748 -18167 -29590 -24077 -24040 -56901 -58204 -34491 -56953
15913e6953J7261K0293O938k1622m913L836J5726J0972J2000J5446k539J3579
$$ -56953 -39692 -19399 -12461 -34083 -38996 -35160 -19434 -8462 3538 18984 16445 30024
15901C0024J774j0037j4730K1577o260j6536j3889J216O056K338K3950o321j8608
$$ 30024 31798 21761 7031 28608 22348 5812 -8077 -6861 -805 1533 25483 19162 554
15888E54l7971k7582l850M452J7796J4694k026L599P172J7842k2363k5953p319
$$ 554 -37417 -64999 -68849 -64397 -46601 -31907 -33933 -30334 -23162 -5320 -27683 -53636 -60955
15875f0955j2166J1963N9450R440l1242p380Q239p817o551M6350K639J633l4276
$$ -60955 -73121 -61158 -1708 7732 -23510 -30890 -22651 -30468 -37019 9331 11970 13603 -20673
15862b0673J6389J0767L384o655M159l7319j1602K6832J261j2034L4853J8605
$$ -20673 -4284 6483 9867 3212 7371 -29948 -41550 -14718 -13457 -25491 9362 27967
15850B7967j5310J4914j2813r986K1960j752l6011j0901J0468L0646K4471k7268
$$ 27967 12657 27571 14758 4772 26732 24980 -11031 -21932 -11464 19182 43653 16385
15838A6385k6014j1894p130K0377J5798j4862j1998K923N0022j8082m3510o675
$$ 16385 -9629 -21523 -28653 -8276 7522 -7340 -19338 -16415 33607 15525 -27985 -34660
15826c4660j43J0617M350Q656l434j7907j20K6318N1233J0927r693l2652j4397
$$ -34660 -34803 -24186 -19836 -11180 -14614 -32521 -32641 -6323 44910 55837 46144 13492 -905
15813i05J1173M095r153O800J8979j9715j1963j447k5704O754P554R433R528O461
$$ -905 10268 14363 5210 12010 30989 11274 -689 -2136 -27840 -21086 -13532 -4099 5429 11890
15799A1890O207j2073o402K0470j2463m2644L5180K4188J1948J447m2803o398
$$ 11890 18097 6024 -378 20092 7629 -35015 165 24353 36301 37748 -5055 -11453
15787a1453n967M926M270J5465j3034q742K107O940p660j3712j4959K2441L9043
$$ -11453 -17420 -12494 -8224 7241 -5793 -14535 -12428 -5488 -13148 -26860 -41819 -19378 19665
15774A9665R912r209L8511j4789o456j0191r493j2775j98q40r329m620j2062J0343
$$ 19665 29577 20368 58879 44090 37634 27443 17950 5175 4977 4137 -5192 -9812 -21874 -11531
15760a1531Q225J3413j1312k6608K6493K787J0847K2192K036q603k0111j1602
$$ -11531 -3306 10107 -1205 -27813 -1320 1467 12314 34506 36542 27939 7828 -3774
15748c774J178j5537l6630k992K5593J689j4627K0722K569j4866r726k0382J9489
$$ -3774 -2596 -18133 -54763 -57755 -32162 -30473 -45100 -24378 -21809 -36675 -46401 -66783 -47294
15735d7294J8209M1586J2657N392j0415J0714J0845p132l983k568j2688m0181
$$ -47294 -29085 12501 25158 30550 20135 30849 41694 34562 30579 28011 15323 -24858
15723b4858j6143k6483K190J9445j2481j412j0818J2065K7211r15K514L5036K0958
$$ -24858 -41001 -67484 -65294 -45849 -58330 -59742 -70560 -58495 -31284 -32199 -29685 5351 26309
15710B6309j4403j7115J9151K39m591o633j2947K840j2053J5315O825M786l200
$$ 26309 11906 -5209 13942 14181 9590 2957 -9990 -7150 -19203 -3888 2937 7723 4523
15697D523k9584l0226j811N675L4773N1636j0559m054m1644l274M2172q104j7870
$$ 4523 -25061 -55287 -57098 -51423 -16650 34986 24427 20373 -21271 -24545 17627 9523 -8347
15684h347J3333N501J4914k6906J2414n202m3103j1305j9744J9318N0000K4619
$$ -8347 4986 10487 25401 -1505 10909 5707 -37396 -48701 -68445 -49127 873 25492
15672B5492J4968j0345k9520q487k634n379J3275l222l0976j02K9883J5785j6412
$$ 25492 40460 30115 595 -7892 -10526 -15905 -2630 -5852 -36828 -36930 -7047 8738 -7674
15659g674k8568j4607n330K0496J8715K6591j0252j7063k238N4l549p037j6226
$$ -7674 -36242 -50849 -56179 -35683 -16968 9623 -629 -17692 -19930 -19876 -23425 -30462 -46688
15646d6688K121l971M095j1289k736K2533K1105N110r112M530J1220Q784j3111
$$ -46688 -44567 -48538 -44443 -55732 -58468 -35935 -14830 -9720 -18832 -14302 -3082 5702 -7409
15633g409m652J5707K3501K1152j0769j4102l6882j7716K2074K2691P819r300
$$ -7409 -12061 3646 27147 48299 37530 23428 -13454 -31170 -9096 13595 21414 12114
15621A2114r525K0627j3878J860Q391j1549k1359O594Q522J4552k3856k8829m6958
$$ 12114 2589 23216 9338 11198 19589 8040 -13319 -6725 1797 16349 -7507 -36336 -83294
15608h3294j7733N6439M3027M505k5668k0794L2268J1261j9874J5918O949M5160
$$ -83294 -101027 -44588 -1561 2944 -22724 -43518 -11250 11 -19863 -3945 3004 48164
15596D8164K7348k3502l4302j5832L0657n98m3723o196J1891L0961K7675m443
$$ 48164 75512 52010 17708 1876 32533 31935 -11788 -17984 -6093 24868 52543 48100
15584D8100j0752L306O421K2226l4526k0124J0254J6130n115n319N886l9614k7853
$$ 48100 37348 40654 47075 69301 34775 14651 24905 41035 35920 30601 36487 -3127 -30980
15571c0980N917J8646J372p124R073l104j2968k3872N3830L9384j6897j3559k4748
$$ -30980 -25063 -6417 -5045 -12169 -3096 -6200 -19168 -43040 10790 50174 33277 19718 -5030
15558e030K28j809P707m5032j5295K3812L7704K8175R333j6217m2685m9579k6153
$$ -5030 -4802 -6611 1096 -43936 -59231 -35419 2285 30460 39793 23576 -19109 -68688 -94841
15545i4841K5219J8167K8288k2119M706K1670J7105k425J6766J7402J004J4565
$$ -94841 -69622 -51455 -23167 -45286 -40580 -18910 -1805 -4230 12536 29938 30942 45507
15533D5507m791p5644j8561J3214J5214L1994K9935k3322k9263R977O454K1200
$$ 45507 40716 -34928 -53489 -40275 -25061 6933 36868 13546 -15717 -5740 714 21914
15521B1914N970j9540R683m530j2077R564M857j2822j6483l7552R209J5658J0969
$$ 21914 27884 8344 18027 13497 1420 10984 15841 3019 -13464 -51016 -41807 -26149 -15180
15508a5180N274J3492j5291j0452j7907l26j2505J1887L4915K5938k5257k5172
$$ -15180 -9906 3586 -11705 -22157 -40064 -40390 -52895 -41008 -6093 19845 -5412 -30584
15496c0584M3008J956l8565l4640j9311J2572J7366J3811J7399J4157j2247O516
$$ -30584 12424 14380 -24185 -58825 -78136 -65564 -48198 -34387 -16988 -2831 -15078 -8562
15484h562K1464O607r70m820j3442k6046j9316N546J2686N5517l009k8405N467
$$ -8562 12902 19509 18539 13719 277 -25769 -45085 -39539 -26853 28664 25655 -2750 2717
15471B717p119J0700n741j9960m619Q908L4945M99o898r905k5923k1877k4719
$$ 2717 -4402 6298 557 -19403 -24022 -15114 19831 20330 13432 3527 -22396 -44273 -68992
15458f8992J7235L6630N941J934L8171Q021J4567j3358l0283P740L55n383j0093
$$ -68992 -51757 -15127 -9186 -7252 30919 38940 53507 40149 9866 17606 17961 12578 2485
15445B485L248J2048L2649K8120m3137l8185r708j5092L0449J6471k2013K812
$$ 2485 5733 17781 50430 78550 35413 -2772 -12480 -27572 2877 19348 -2665 147
15433A47j5059K477K0779J037k0695J5381O77k0789j8670J9548q400j189K8151
$$ 147 -14912 -12435 8344 9381 -11314 4067 4744 -16045 -34715 -15167 -23567 -24756 3395
15420C395J3654j7239P999k3720j0180K481k434k7147j6923R861M6660J8748o104
$$ 3395 17049 -190 7809 -15911 -26091 -23610 -26044 -53191 -70114 -60253 -13593 5155 -949
15407i49j1140J0013k1506k2925k0057R827J4255J0239j321J6679K0454J5660
$$ -949 -12089 -2076 -23582 -46507 -66564 -56737 -42482 -32243 -33564 -16885 3569 19229
15395A9229N255l765l7408m1669J9921K5120J5680p412M703n902L632j1707O128
$$ 19229 24484 20719 -16689 -58358 -38437 -13317 2363 -5049 -346 -6248 -2616 -14323 -8195
15382h195k0432k5971J97J8275Q44l2426J657K1864L7776p108R658k902Q012L3493
$$ -8195 -28627 -54598 -54401 -36126 -35282 -67708 -66051 -44187 -6411 -13519 -3861 -6763 1249 34742
15368C4742L3011j2792m4415k5266j3444K868j151L1408J3617j7635m485n554
$$ 34742 67753 54961 10546 -14720 -28164 -25296 -26447 4961 18578 943 -3542 -9096
15356i096K3968p511j8825n792r83J7943K1355O900k092j3177k4368K8502L6442
$$ -9096 14872 7361 -11464 -17256 -18239 -296 21059 27959 25867 12690 -11678 16824 53266
15343E3266k454k8223l3069p675m61J1843K2841l966L452n92J0711r820k0914
$$ 53266 50812 22589 -10480 -18155 -18616 -6773 16068 12102 15554 14962 25673 15853 -5061
15330e061p738j3911j0801N949m926k100L6777j4255j766K7599J3656j1686j5784
$$ -5061 -12799 -26710 -37511 -31562 -36488 -38588 -1811 -16066 -17832 9767 23423 11737 -4047
15317d047k6404j3630L8164J6034q400j9144j4149m732k5928L2396j4029N123
$$ -4047 -30451 -44081 -5917 10117 1717 -17427 -31576 -36308 -62236 -29840 -43869 -38746
15305c8746J7341P484l820n747Q846J128L2911j2803k0732J6176K8377J5452k9038
$$ -38746 -21405 -13921 -17741 -23488 -14642 -13514 19397 6594 -14138 2038 30415 45867 16829
15292A6829l3611J266P833q385J2341J3107M323J594k8884k6972K6251Q645O26
$$ 16829 -16782 -15516 -7683 -16068 -3727 9380 13703 15297 -13587 -40559 -14308 -5663 -5037
15279e037K9005r790m992m845J1683m260m566L972O51L472l3561r482k1818J8316
$$ -5037 23968 14178 9186 4341 16024 11764 7198 11170 11821 15293 -18268 -27750 -49568 -31252
15265c1252M531J514J4395K4418j1168l3757M336K3192J6849j2576J2501m043
$$ -31252 -26721 -25207 -10812 13606 2438 -31319 -26983 -3791 13058 482 12983 8940
15253H940o198K3633N346j9822l4820j4466J5118K8876J9915l9726j4406J8176
$$ 8940 2742 26375 31721 11899 -22921 -37387 -22269 6607 26522 -13204 -27610 -9434
15241i434K106o413l612q649K582J261J974J7379n909j0744j9789K999K8107l68
$$ -9434 -7328 -13741 -17353 -26002 -23420 -22159 -20185 -2806 -8715 -19459 -39248 -36249 -8142 -8510
15227h510k5468K2960j36j2417k618r981J471l015O910J0477m46J7704J4195L995
$$ -8510 -33978 -11018 -11154 -23571 -26189 -36170 -34699 -37714 -30804 -20327 -20773 -3069 11126 15121
15213A5121k1961j0899J1907j0264q798J6875Q271j0972J9590j5157K392k294
$$ 15121 -6840 -17739 -5832 -16096 -24894 -8019 252 -10720 8870 -6287 -3895 -6189
15201f189k0358P295J0850o378j4562J2938K0770O246j7735R11J1455oM766l3967
$$ -6189 -26547 -19252 -8402 -14780 -29342 -16404 4366 10612 -7123 -6212 5243 5237 10003 -23964
15187b3964k7083R333N7070J7271P282J5564k1960j6138O171O99k7580l8221m200
$$ -23964 -51047 -41714 15356 32627 39909 55473 33513 17375 23546 24245 -3335 -41556 -45756
15174d5756J4074J1488J7195L6960j1143k2308l93j2418L58r854j9017k0481K9669
$$ -45756 -31682 -20194 -2999 33961 22818 510 117 -12301 -11943 -21797 -40814 -61295 -31626
15161c1626L5460J1513N112q328l111K4584l595o564R893o637K0757k6739k6148
$$ -31626 3834 15347 20459 12131 9020 33604 30009 23445 33338 26701 47458 20719 -5429
15148e429J5921K1989m940m2681J5722p839k6019J0988K6361j372j8756l6775
$$ -5429 10492 32481 27541 -15140 582 -7257 -33276 -22288 4073 2701 -16055 -52830
15136e2830j8248R625K0781l098L602l894O732L807L2853k173J2310J3759j6412
$$ -52830 -71078 -61453 -40672 -43770 -40168 -44062 -37330 -33523 -670 -2843 9467 23226 6814
15123F814j1935m471n801l1772J4639N0982K7591r375o517k9675l6619j1844P350
$$ 6814 -5121 -9592 -15393 -47165 -32526 18456 46047 36672 30155 480 -36139 -47983 -40633
15110d0633K7119n738k0376K916k195k4415K5605L9608j660J2124Q372r011j9206
$$ -40633 -13514 -19252 -39628 -36712 -38907 -63322 -37717 1891 231 12355 20727 11716 -7490
15097g490J2087J9781j5125l6957J5695J8343p386k1294j4442J1735J0566M067
$$ -7490 4597 24378 9253 -27704 -12009 6334 -1052 -22346 -36788 -25053 -14487 -10420
15085a0420k2823k2209k1808J7786K0375L3867j2725J1364L5506L1038j7436m3925
$$ -10420 -33243 -55452 -77260 -59474 -39099 -5232 -17957 -6593 28913 59951 42515 -1410
15073a410j5977Q776k770L7135r639j0651j6680k8014r094K5258K7702Q103j8245
$$ -1410 -17387 -8611 -11381 25754 16115 5464 -11216 -39230 -48324 -23066 4636 12739 -5506
15060e506j6942j0932k4125k1975J7853K4546J7522J5735L4525R783j589l185
$$ -5506 -22448 -33380 -57505 -79480 -61627 -37081 -19559 -3824 30701 40484 38895 35710
15048C5710J4347l3162J392M107l3615l7458M308r509L53K7379L4019j0948j0776
$$ 35710 50057 16895 18287 22394 -11221 -48679 -44371 -53880 -53527 -26148 7871 -3077 -13853
15035a3853Q911o251J8382J7062J4728J0254j1251k5545K5063r145n760j4481
$$ -13853 -4942 -11193 7189 24251 38979 49233 37982 12437 37500 28355 22595 8114
15023H114K1297J2278j0382r302n551L1146j6919l8071j9050J7993m732l8903
$$ 8114 29411 41689 31307 22005 16454 47600 30681 -7390 -26440 -8447 -13179 -52082
15011e2082J7000L9964M55L711J6257J2989o975M11j3838J650O375k7985p455
$$ -52082 -35082 4882 5337 9048 25305 38294 31319 31730 17892 19542 25917 -2068 -9523
14998i523J0397P521j3356N444l555j6214j0615n344L4279J1808j4861j2489Q084
$$ -9523 874 8395 -4961 483 -3072 -19286 -29901 -35245 -966 10842 -4019 -16508 -8424
14985h424l580K1848J4964o878j4422J8205J9295L421J937N863q925j9523k1556
$$ -8424 -12004 9844 24808 17930 3508 21713 41008 44429 46366 52229 43304 23781 2225
14972B225J2297J4508J6760J6513k1611l8659j6578m304L262R132J5660J2302
$$ 2225 14522 29030 45790 62303 40692 2033 -14545 -18849 -15587 -6455 9205 21507
14960B1507l4149k0065p799J3247R769k315K5845r926O673O852R686j2714j5810
$$ 21507 -12642 -32707 -40506 -27259 -17490 -19805 6040 -3886 2787 9639 19325 6611 -9199
14947i199m1384J9480M3990j9966l1738M136J1723j159l34J7495l4637Q332M1843
$$ -9199 -50583 -31103 12887 -7079 -38817 -34681 -22958 -24117 -24451 -6956 -41593 -33261 8582
14934H582l088k4097J845J9491k2552Q63J0354j1693m37N779k3311L518J9293
$$ 8582 5494 -18603 -16758 2733 -19819 -18956 -8602 -20295 -20732 -14953 -38264 -34746 -15453
14921a5453J7850j2258j1436L4551K554k0221k8768r265L8709J2362m946j8818
$$ -15453 2397 -9861 -21297 13254 15808 -4413 -33181 -42446 -3737 8625 3679 -15139
14909a5139M334J3092l3318k5096M8608J7902J1189j4106p165K2785J881o317
$$ -15139 -10805 2287 -31031 -56127 -7519 10383 21572 7466 301 23086 24967 18650
14897A8650j8721j2150R292K6795J1800j1711J0741N690l786k8451j3862l2264
$$ 18650 -71 -12221 -2929 23866 35666 23955 34696 40386 36600 8149 -5713 -37977
14885c7977q864P686L5086L4195l675j1237L58k5017n053K4569o591J0829Q347
$$ -37977 -46841 -39155 -4069 30126 26451 15214 15572 -9445 -14498 10071 3480 14309 22656
14872B2656k890j1317n541q491j3304k0713j5584K4214K7852l510j8096l543J5314
$$ 22656 19766 8449 2908 -5583 -18887 -39600 -55184 -30970 -3118 -6628 -24724 -28267 -12953
14859a2953L513j1615L677L040R386J3677j0787j7984j9504J1556j637j0866k3949
$$ -12953 -9440 -21055 -17378 -14338 -4952 8725 -2062 -20046 -39550 -27994 -29631 -40497 -64446
14846f4446p615q554n448O092J385r793J5102J911J1279P013J4234K5467Q272
$$ -64446 -72061 -80615 -86063 -79971 -78586 -88379 -73277 -71366 -60087 -53074 -38840 -13373 -5101
14833e101P296J3137n041j7993k2994L03J1087j8997m18J6299N755K0535M776
$$ -5101 2195 15332 10291 -7702 -30696 -30393 -19306 -38303 -38721 -22422 -16667 3868 8644
14820H644j605Q732l136j9720J7003J1200l306p979N384n052l2019j3835j0725
$$ 8644 7039 15771 12635 -7085 9918 21118 17812 9833 15217 10165 -21854 -35689 -46414
14807d6414J4652J2737j2785J2266J6837M753l1133r196P616L1901J9809J1651
$$ -46414 -31762 -19025 -31810 -19544 -2707 2046 -29087 -38283 -30667 1234 21043 32694
14795C2694k2738k7611k4406q718L1029R997j6264k946K9825K3916j0210N523
$$ 32694 9956 -17655 -42061 -50779 -19750 -9753 -26017 -28963 862 24778 14568 20091
14783B0091o801L110O96K785M830l529p413j1596J2438j55k0923J128k9288K832
$$ 20091 13290 16400 17096 19881 24711 21182 13769 2173 14611 14456 -6467 -5339 -34627 -31795
14769c1795Q600J3911o271P103K0043k2130j8390j2836o959J3147K2366K4544
$$ -31795 -23195 -9284 -15555 -8452 11591 -10539 -28929 -41765 -48724 -35577 -13211 11333
14757A1333J8250M694j5579M08O264R853m396p220q494l362j7600k4035l334k1835
$$ 11333 29583 34277 18698 19106 25370 35223 30827 23607 15113 11751 -5849 -29884 -33218 -55053
14743e5053r737K6637K6427o367j4031o291q703K563L6780M325j731k9253l4692
$$ -55053 -64790 -38153 -11726 -18093 -32124 -38415 -47118 -44555 -7775 -3450 -5181 -34434 -69126
14730f9126K3337K3489J7797o085l7423q886r295q73J8503K5603k277N858L1540
$$ -69126 -45789 -22300 -4503 -10588 -48011 -56897 -66192 -67065 -48562 -22959 -25236 -19378 12162
14717A2162K410k5613K808K1840l0970J0391J2949P129J6458p720l496J0826j040
$$ 12162 14572 -11041 -8233 13607 -17363 -6972 5977 13106 29564 21844 18348 29174 28134
14704B8134j8262P222n718l9645q923J0145K9415q991J1k1816K2017J0321m4377
$$ 28134 9872 17094 11376 -28269 -37192 -27047 2368 -6623 -6612 -28428 -6411 3910 -40467
14691d0467k1697M804K5872n357J4535K2748L9136j507j0254k9341r834R93O076
$$ -40467 -62164 -57360 -31488 -36845 -22310 438 39574 38067 27813 -1528 -11362 -10369 -4293
14678d293J7375q579j5893J0802J0556k0523m4240j4853J724J7608j2015J2374
$$ -4293 13082 4503 -11390 -588 9968 -10555 -54795 -69648 -67924 -50316 -62331 -49957
14666d9957K2999L4901Q838m7025k2736L0819M6851J7669j2730j2621R618k9527
$$ -49957 -26958 7943 16781 -30244 -52980 -22161 24690 42359 29629 17008 26626 -2901
14654b901q430P795j9452k6025n527R089J8423Q142k1430J0645J1237J6257j164
$$ -2901 -11331 -3536 -22988 -49013 -54540 -45451 -27028 -18886 -40316 -29671 -18434 -2177 -3341
14641c341l5985j4201Q54R528J5833m108j5839R677J9516L8449k6071l4109k0863
$$ -3341 -39326 -53527 -52673 -43145 -27312 -31420 -47259 -37582 -18066 20383 -5688 -39797 -60660
14628f0660r233K4112N9233M3383J1063p722m4304J1780N010k6115J1348R904
$$ -60660 -69893 -45781 13452 56835 67898 60176 15872 27652 32662 6547 17895 27799
14616B7799k2703k4808k4613k6084j0239K9552K8439K4788k1128l1836k049K2889
$$ 27799 5096 -19712 -44325 -70409 -80648 -51096 -22657 2131 -18997 -50833 -52882 -29993
14604b9993K893R194M070O403m747k0060L357J4008O73j5030j72j6204P059o377
$$ -29993 -27100 -17906 -13836 -7433 -12180 -32240 -28883 -14875 -14202 -29232 -29404 -45608 -38549 -44926
14590d4926j8665j055L6107J6142j5692J7963Q584K532J0258l191l4925j4904
$$ -44926 -63591 -64646 -28539 -12397 -28089 -10126 -1542 990 11248 8057 -26868 -41772
14578d1772q055L0400L6219J5645K301j9940P66j1032j8361j9775O836L6455N113
$$ -41772 -49827 -19427 16792 32437 34738 14798 15564 4532 -13829 -33604 -26768 9687 14800
14565A4800m027R438n715k6968j9393l70J5525J771K4494l431k2383k2730K219
$$ 14800 10773 20211 14496 -12472 -31865 -32235 -16710 -14939 9555 6124 -16259 -38989 -36770
14552c6770J4301K0688J1474J107l2143M659J5101k205j2329L052l284j25J7599
$$ -36770 -22469 -1781 9693 10800 -21343 -16684 -1583 -3788 -16117 -13065 -16349 -16474 1125
14539A125r396k9970j0113q0K8454J0201k7453j044J7687Q956j3849R28j2798
$$ 1125 -8271 -38241 -48354 -48434 -19980 -9779 -37232 -38276 -20589 -11633 -25482 -24554 -37352
14526c7352l577l1675Q418N0209Q872o606j8331P269l437P107j2545j1878R865
$$ -37352 -40929 -72604 -64186 -13977 -5105 -11711 -30042 -22773 -26210 -19103 -31648 -43526 -33661
14513c3661L8922K568o050k4921J353J6718K6600q844l2236p518J0087p618K3665
$$ -33661 5261 7829 1779 -23142 -21789 -5071 21529 12685 -19551 -27069 -16982 -24600 -935
14500i35j9933K691L4379j7292j8175K2267r05j4996J588J4072J0783L5885p770
$$ -935 -20868 -18177 16202 -1090 -19265 3002 2097 -12899 -11311 2761 13544 49429 41659
14487D1659m6965l0607Q764o085k4837M569N511J4926L0519J689L750L8344j8529
$$ 41659 -5306 -35913 -27149 -33234 -58071 -53502 -47991 -33065 -2546 -857 2893 41237 22708
14474B2708r674n556j8959P493K1228r027j5914k0567k4227l48J6155K5487J7286
$$ 22708 13034 7478 -11481 -3988 17240 8213 -7701 -28268 -52495 -52843 -36688 -11201 6085
14461F085m355n768J7630J8472O5j8075J5397J889k3357l2244R797L2005r951
$$ 6085 1730 -4038 13592 32064 32129 14054 29451 31340 7983 -24261 -14464 17541 7590
14448G590k9900M0550P428m930j281k5816Q812p852j6508J3712q43j1402K6468
$$ 7590 -22310 18240 25668 20738 19457 -6359 2453 -5399 -21907 -8195 -9038 -20440 6028
14435F028j1126J3519n149J9382K4957k757o084r950j6079P436L5484j8217l7899
$$ 6028 -5098 8421 3272 22654 47611 44854 38770 28820 12741 20177 55661 37444 -455
14422d55k8980n801N750Q123L4349L0208o405k5630r479l797j1545j3705j1379
$$ -455 -29435 -35236 -29486 -21363 12986 43194 36789 11159 1680 -2117 -13662 -27367 -38746
14409c8746K737J4626k571j4439J6461j6008J1907K8461M099l1763j0841Q067
$$ -38746 -36009 -21383 -23954 -38393 -21932 -37940 -26033 2428 6527 -25236 -36077 -28010
14397b8010J2856J602q826j2605M4348K1916j0090l715q664P052P855j4699j6410
$$ -28010 -15154 -13552 -22378 -34983 9365 31281 21191 17476 8812 15864 23719 9020 -7390
14384g390r925N532j0263p989j7399m167L1232K734l426M541J4812p771k7613
$$ -7390 -17315 -11783 -22046 -30035 -47434 -51601 -20369 -17635 -21061 -16520 -1708 -9479 -37092
14371c7092L047o527J2917K2551m132M694P411j5739j7088L092j5674o632m983
$$ -37092 -34045 -40572 -27655 -5104 -9236 -4542 2869 -12870 -29958 -26866 -42540 -49172 -54155
14358e4155L3917J0886j540p059J3257N464j9921K5252J3657j3616l1663O717
$$ -54155 -20238 -9352 -10892 -17951 -4694 770 -19151 6101 19758 6142 -25521 -18804
14346a8804L8156m053N699J320l3005j6241j9936O798K1107j50J5002N048j965
$$ -18804 19352 15299 20998 22318 -10687 -26928 -46864 -40066 -18959 -19109 -4107 941 -1024
14333a024J7193k630j48r600r881q907K204Q999n316j766j0540r533K2731L1355
$$ -1024 16169 13539 13391 3791 -6090 -14997 -12793 -3794 -9110 -10876 -21416 -30949 -8218 23137
14319B3137k4700k3371J8608K5384K0286r423R09K7905k1511n3887N283N721R50
$$ 23137 -1563 -24934 -6326 19058 39344 29921 30830 58735 37224 -16663 -11380 -5659 -4709
14306d709L286q917k6467K9412K343o024p438Q087j3054L652L1892M36j5581K51
$$ -4709 -1423 -10340 -36807 -7395 -5052 -11076 -18514 -10427 -23481 -19829 12063 12499 -3082 -2831
14292b831r999j4006o719J0096K4760R647j88L4095J1023j0775n447l8218k8234
$$ -2831 -12830 -26836 -33555 -23459 1301 10948 10760 44855 55878 45103 39656 1438 -26796
14279b6796j1818Q658r72j7816L2136M190J532K481L1583j7748j5662l0372k1314
$$ -26796 -38614 -29956 -30928 -48744 -16608 -12418 -10886 -8405 23178 5430 -10232 -40604 -61918
14266f1918N143Q60k236J9659j3144q89J1577J5538L7191K9150l7916m3308j3744
$$ -61918 -56775 -55915 -58151 -38492 -51636 -52525 -40948 -25410 11781 40931 3015 -40293 -54037
14253e4037N146J1895j5524P116K7999N8653O567j0023j9153M361K7607j530m3382
$$ -54037 -48891 -36996 -52520 -45404 -17405 41248 47815 37792 18639 23000 50607 49077 5695
14240E695k4548K617J3212j968Q31r504j7415K1722q008j477J409n552m481J0147
$$ 5695 -18853 -16236 -3024 -4992 -4161 -13665 -31080 -9358 -17366 -18843 -17434 -22986 -27467 -17320
14226a7320N285J726j5324l0187j5675K4036K2050K0022K152j266l8244R89R622
$$ -17320 -12035 -10309 -25633 -55820 -71495 -47459 -25409 -5387 -3235 -4501 -42745 -41756 -32134
14213c2134j2702L6165M2626M675r42j5808k0920k0082q398J0591l379j3988l931
$$ -32134 -44836 -8671 33955 38630 37688 21880 960 -19122 -27520 -16929 -20308 -34296 -38227
14200c8227J6885l3296J7101J4122J7540L5676l2769j9516O934L7585L666l8863
$$ -38227 -21342 -54638 -37537 -23415 -5875 29801 -2968 -22484 -15550 22035 25701 -13162
14188a3162j6038r896R873K4887K5992J6135k770M12j4922j3077j4043l00p158
$$ -13162 -29200 -39096 -29223 -4336 21656 37791 35021 35433 20511 7434 -6609 -6909 -14067
14175a4067N507m844l5098j3459K9520K7389q078k5855O05M5300K7553q093l1014
$$ -14067 -8560 -13404 -48502 -61961 -32441 -5052 -13130 -38985 -38380 6920 34473 26380 -4634
14162d634K7753J1252k2245j3054N592K9506j4669Q161j749J544J3512m5044n840
$$ -4634 23119 34371 12126 -928 4664 34170 19501 27662 25913 27457 40969 -4075 -9915
14149i915J4758o998m533K159j6506j9263j2649j8878k3145J5919J8453M667J5795
$$ -9915 4843 -2155 -6688 -4529 -21035 -40298 -52947 -71825 -94970 -79051 -60598 -55931 -40136
14136d0136K9158J1008j8194l1954n10J4508l266l647R201L7868L7371L647l2343
$$ -40136 -10978 30 -18164 -50118 -50628 -36120 -39386 -43033 -33832 4036 41407 45054 12711
14123A2711j6256j912k6035q06J3245K0032k311J1528J4134j5364J3055l315j6569
$$ 12711 -3545 -5457 -31492 -32298 -19053 979 -1332 10196 24330 8966 22021 18706 2137
14110B137K067m540R809J1834m835j2517n637q334O80J4706J6879l1041k9992
$$ 2137 4204 -336 9473 21307 16472 3955 -1682 -10016 -9336 5370 22249 -8792 -38784
14097c8784O389j0242L5361L5196j9135k0424j4171q699J3814K402L1722J4499
$$ -38784 -32395 -42637 -7276 27920 8785 -11639 -25810 -34509 -20695 -18293 13429 27928
14085B7928K4638O234l8067j2030O822K1267M837m043k2536l7819O881N604K7871
$$ 27928 52566 58800 20733 8703 15525 36792 41629 37586 15050 -22769 -15888 -10284 17587
14072A7587n919l7505K225p132J7775o539n723O904j008K323j0794M531J2106
$$ 17587 11668 -25837 -23612 -30744 -12969 -19508 -25231 -18327 -19335 -17012 -27806 -23275 -11169
14059a1169k1437n108O51r413L5167L4948L672q974q83K5757O998j2875k6870
$$ -11169 -32606 -37714 -37063 -46476 -11309 23639 27311 18337 17454 43211 50209 37334 10464
14046A0464j8402k1470o337Q867k2665J4927J7883K7504k0612j3283n543N991
$$ 10464 -7938 -29408 -35745 -26878 -49543 -34616 -16733 10771 -9841 -23124 -28667 -22676
14034b2676J4474Q154j223J2099l1718k3447J4481O713o739k477K5715J2274k2023
$$ -22676 -8202 -48 -1271 10828 -20890 -44337 -29856 -23143 -29882 -32359 -6644 5630 -16393
14021a6393k62J7457j9240J1197J4973L029p373k9082J6134J3817l5891o276M386
$$ -16393 -16655 802 -18438 -7241 7732 10761 3388 -25694 -9560 4257 -31634 -37910 -33524
14008c3524k8094j83M9224J8721N684J3828J0306k8561n5670R9K7389J5317J0492
$$ -33524 -61618 -61801 -12577 6144 11828 25656 35962 7401 -48269 -48170 -20781 -5464 5028
13995E028j661q596m8918P660P539O372J6371j0378K9144j7621l98j5221k6064
$$ 5028 3367 -5229 -54147 -46487 -38948 -32576 -16205 -26583 2561 -15060 -15458 -30679 -56743
13982e6743J5745Q369k1559J0108L659L3814J26j5696j0881q656L8681K278j5165
$$ -56743 -40998 -32629 -54188 -44080 -40421 -6607 -6481 -22177 -33058 -41714 -3033 -755 -15920
13969a5920j1021J4j406M568k1499N553J6269j0984j3791N0080j1796J7727Q522
$$ -15920 -26941 -26927 -28333 -23765 -45264 -39711 -23442 -34426 -48217 1863 -9933 7794 16316
13956A6316K756j0494n011L5014J8185k979l9702k3058J8855L4278q490j4489
$$ 16316 19072 8578 3567 38581 56766 53787 14085 -8973 9882 44160 35670 21181
13944B1181L191P298l3092l8833J7769M543p288L6438N6834K1379j8519m2043
$$ 21181 24372 31670 -1422 -40255 -22486 -17943 -25231 11207 68041 89420 70901 28858
13932B8858m1533j7103J7141l1162o632J7336N035j872j5822J5375K0681m068
$$ 28858 -12675 -29778 -12637 -43799 -50431 -33095 -28060 -29932 -45754 -30379 -9698 -13766
13920a3766R405J0317Q2j1124J6592R166j7991l9702j5057J5050J8368K6465Q723
$$ -13766 -4361 5956 6038 -5086 11506 20672 2681 -37021 -52078 -37028 -18660 7805 16528
13907A6528J3049N403j8104l9542l1939M770O962O950L4448K3588O634j1159m85
$$ 16528 29577 34980 16876 -22666 -54605 -49835 -42873 -35923 -1475 22113 28747 17588 17103
13894A7103R019l3922j6388m225J3468o910J2036q210j9570N114L1124o657k3607
$$ 17103 26122 -7800 -24188 -28413 -14945 -21855 -9819 -18029 -37599 -32485 -1361 -8018 -31625
13881c1625M030M4667J7264n515l5094J3984j1062k4805l0136j9574J2856q657
$$ -31625 -27595 17072 34336 28821 -6273 7711 -3351 -28156 -58292 -77866 -65010 -73667
13869g3667R848J3637L4820K8280j2508M419j7046j826K8593j1761j0530j1512
$$ -73667 -63819 -50182 -15362 12918 410 4829 -12217 -14043 14550 2789 -7741 -19253
13857a9253K017J4302p339O456J4435j997l6151l6868N80P643J2130k6310M1221
$$ -19253 -17236 -2934 -10273 -3817 10618 8621 -27530 -64398 -63818 -56175 -44045 -70355 -29134
13844b9134N3914q392k3472j7345O93J5596K8388k2182N09Q645J4538J7598J2755
$$ -29134 24780 16388 -7084 -24429 -23736 -8140 20248 -1934 -1425 7220 21758 39356 52111
13831E2111l447j7691l1697l548p276j5707J0289J6292o189l3250m898n443j95
$$ 52111 48664 30973 -724 -4272 -11548 -27255 -16966 -674 -6863 -40113 -45011 -50454 -50649
13818e0649O131k83N70L0351L1474Q579M947k0249k2822p675M986k836J6841K9741
$$ -50649 -44518 -44801 -44231 -13880 17594 26173 31120 10871 -11951 -19626 -14640 -17476 -635 29106
13804B9106M626j6790o78j0617j9154j6735J3081J4264P328K5755N31P678o05
$$ 29106 33732 16942 16264 5647 -13507 -30242 -17161 -2897 4431 30186 30717 38395 37790
13791C7790k1010k0169K1887K3027k6183l4094j6608j3619k956M0900K4296L174
$$ 37790 16780 -3389 18498 41525 15342 -18752 -35360 -48979 -51935 -11035 13261 16435
13779A6435M9249J6089l0778j8448M332k4525q283M417P305p263J4494J2986L0149
$$ 16435 65684 81773 50995 32547 36879 12354 4071 8488 15793 8530 23024 36010 66159
13766F6159P803j712k4308o908r151j3222L169j3802j1237N060Q090K2708M917
$$ 66159 73962 72250 47942 41034 31883 18661 21830 8028 -3209 1851 9941 32649 37566
13753C7566k6286J3170J7658m485l2879j0533J3939J4406j3909k4809m3832K4175
$$ 37566 11280 24450 42108 37623 4744 -5789 8150 22556 8647 -16162 -59994 -35819
13741c5819J1401p587R888p87l5626J0618K9437J7533K5257j5226Q923Q694p779
$$ -35819 -24418 -32005 -22117 -22904 -58530 -47912 -18475 -942 24315 9089 18012 26706 18927
13728A8927K0774j1716J806m7170l294P315k0228K2905p32L0663J9889k4810R752
$$ 18927 39701 27985 29791 -17379 -20673 -13358 -33586 -10681 -11413 19250 39139 14329 24081
13715B4081M937j6444j6501k494l463J0330K0795K9426k334j9789R042K921j0744
$$ 24081 29018 12574 -3927 -6421 -9884 446 21241 50667 48333 28544 37586 40507 29763
13702B9763j8289l8601M139M0276K2894l417r566l6922l4426M113J6141J1412
$$ 29763 11474 -27127 -22988 17288 40182 36765 27199 -9723 -44149 -40036 -23895 -12483
13690a2483j6905k5720j5419r007J6380K2370L8597M4517J1022j3955l9073l0611
$$ -12483 -29388 -55108 -70527 -79534 -63154 -40784 -2187 42330 53352 39397 324 -30287
13678c0287l3879P929J5316J0838K1925k646J4149m8811J0M7380K2667k3857l90
$$ -30287 -64166 -56237 -40921 -30083 -8158 -10804 3345 -45466 -45456 1924 24591 734 344
13665C44L3291q578j9162J80Pq428M596p948J4772j3888k352K473K2758j6005
$$ 344 33635 25057 5895 6075 6082 -2346 2250 -5698 9074 -4814 -7166 -4693 18065 2060
13651B060J2469l655k4578L0159R894n632j5741K3641K654l8282k0253n443k6584
$$ 2060 14529 10874 -13704 16455 26349 20717 4976 28617 31271 -7011 -27264 -32707 -59291
13638e9291o4J2518l686M962M654l751L6922O735O761j0213q964J7231k4597p578
$$ -59291 -59355 -46837 -50523 -45561 -40907 -44658 -7736 -1001 5760 -4453 -13417 3814 -20783 -28361
13624b8361Q322K8905K8794J6029j2669l8132o3199k920o392J9629M689P4J4238
$$ -28361 -20039 8866 37660 53689 41020 2888 -60311 -63231 -69623 -49994 -45305 -45231 -30993
13611c0993J8440j5501j0455J8307J438j5082K4742K1726J6828m860m4536j9800
$$ -30993 -12553 -28054 -38509 -20202 -18764 -33846 -9104 12622 29450 24590 -19946 -39746
13599c9746M2891j1557j0950j1124P993q87J9351K5623j8728m2283K482L0164
$$ -39746 3145 -8412 -19362 -30486 -22493 -23380 -4029 21594 2866 -39417 -36935 -6771
13587f771J7120r171r123l6210J1106K6219P249j7526p059j754R843J519k027
$$ -6771 10349 1178 -7945 -44155 -33049 -6830 419 -17107 -24166 -25920 -16077 -14558 -16585
13574a6585j2135j8692k7281J5821J3820J1493J3473O56o371k3368k3487L0384
$$ -16585 -28720 -47412 -74693 -58872 -45052 -33559 -20086 -19430 -25801 -49169 -72656 -42272
13562d2272J9423L7611k979R432P314p055Q618N374k503j4276K785j1689Q568
$$ -42272 -22849 14762 11783 21215 28529 21474 30092 35466 32963 18687 21472 9783 18351
13549A8351j3184o1542L895L8758N042p959J0393j8551J5699j795p609O48Q820
$$ 18351 5167 -56375 -52480 -13722 -8680 -16639 -6246 -24797 -9098 -10893 -18502 -17854 -9034
13536i034L9198k9800M97l175J2908L536k8727k4688K890K2939L0086K9712k5880
$$ -9034 30164 364 861 -2314 10594 14130 -14597 -39285 -36395 -13456 16630 46342 20462
13523B0462p147k0541N385K9247O911k5787k3827K9249L0325l5671l9707J1949
$$ 20462 13315 -7226 -1841 27406 34317 8530 -15297 13952 44277 8606 -31101 -19152
13511a9152J7282q435L824J5466J0361k3453J239P907k5231j0923R747p892J8831
$$ -19152 -1870 -10305 -6481 8985 19346 -4107 -2868 5039 -20192 -31115 -21368 -29260 -10429
13498a0429K891j1309p562r000J3970K0511P6k4338k2333K5963K7572J9511j9151
$$ -10429 -7538 -18847 -26409 -35409 -21439 -928 -852 -25190 -47523 -21560 6012 25523 6372
13485F372m4575k5792K3186K9753K701k9J938K3227k326k0809L2033n831l1464
$$ 6372 -38203 -63995 -40809 -11056 -8355 -8384 -6446 16781 14455 -6354 25679 19848 -11616
13472a1616J9892K2136n5019l1224M6943J6123m744j4698j524K3988j5316j5045
$$ -11616 8276 30412 -24607 -55831 -8888 7235 2491 -12207 -13731 10257 -5059 -20104
13460b0104n6252j9884K2720M8437l544j9557J2183J6920L2946J3609j5567J3110
$$ -20104 -76356 -96240 -73520 -25083 -28627 -48184 -36001 -19081 13865 27474 11907 25017
13448B5017k0850j8957J5614J7991m8118p683K3559M2083J5334N459m0616l1684
$$ 25017 4167 -14790 824 18815 -29303 -36986 -13427 28656 43990 49449 8833 -22851
13436b2851J2398L4272J0837j7717p826n897K0779j5965K192N120L285K0091J3107
$$ -22851 -10453 23819 34656 16939 9113 3216 23995 8030 10222 15342 18627 38718 51825
13423E1825j397o683j7884j0612l333l0338k8643K343K5851L0882M501K19J1133
$$ 51825 50428 43745 25861 15249 11916 -18422 -47065 -44722 -18871 12011 16512 16731 27864
13410B7864L9046j2400o1969j7921j9012p269J6781J0910N6889m551k6268j5456
$$ 27864 66910 54510 -7459 -25380 -44392 -51661 -34880 -23970 32919 28368 2100 -13356
13398a3356j324P79J0640J2666J0182o358j3934Q29L4583N71r141j5353O212p656
$$ -13356 -14680 -13901 -3261 9405 19587 13229 -705 124 34707 35278 26137 10784 16996 9340
13384I340K246P126j2535p437k0103P321j708j6136O643o319P651K5190P825k1498
$$ 9340 11586 18712 6177 -1260 -21363 -14042 -15750 -31886 -25243 -31562 -23911 1279 9104 -12394
13370a2394k4231k1823L0683L3403J7961O166N680m1474J9298k765k4139p178
$$ -12394 -36625 -58448 -27765 5638 23599 29765 35445 -6029 13269 10504 -13635 -20813
13358b0813N897M385l2613k5840K089K2438K9179k875j7998M614J3638J155p995
$$ -20813 -14916 -10531 -43144 -68984 -66895 -44457 -15278 -18153 -36151 -31537 -17899 -16744 -24739
13345b4739Q770J2739K4841l2667n694q566K3527K2614J3893j9343j2225p570
$$ -24739 -15969 -3230 21611 -11056 -16750 -25316 -1789 20825 34718 15375 3150 -4420
13333d420R652j0540j2370J4767L859J3689p21j309r516q262j9554j1064l86k477
$$ -4420 5232 -5308 -17678 -2911 948 14637 13916 12607 3091 -5171 -24725 -35789 -36175 -38652
13319c8652l541o081O849J7449K692l3073k1314R569J7601K502J2366L5142K6912
$$ -38652 -42193 -48274 -41425 -23976 -21284 -54357 -75671 -66102 -48501 -45999 -33633 1509 28421
13306B8421k9809k5829j8629J5960K5095K7733J8883k0726J0987l589l1973l054
$$ 28421 -1388 -27217 -45846 -29886 -4791 22942 41825 21099 32086 28497 -3476 -6530
13294f530K0303J0738k800k0895J2752L6695j8448k4755m458M018r615O479Q448
$$ -6530 13773 24511 21711 816 13568 50263 31815 7060 2602 6620 -2995 3484 11932
13281A1932q319l434O734k550k5417j2722K8637R331J470k551L1609j7521j1763
$$ 11932 3613 179 6913 4363 -21054 -33776 -5139 4192 5662 3111 34720 17199 5436
13268E436M271l2004l716K6201N88j8707J110j3022J002l41J5145K8807J1105
$$ 5436 9707 -22297 -26013 188 776 -17931 -16821 -29843 -28841 -29182 -14037 14770 25875
13255B5875m0391l4861K3191m26k5737J069M2212J0327J7609J2453J1966K6301
$$ 25875 -14516 -49377 -26186 -26612 -52349 -51280 -9068 1259 18868 31321 43287 69588
13243F9588m1589o7705R863K463P232J8577j2746k2675q873J8436L5934J3162
$$ 69588 27999 -39706 -29843 -27380 -20148 -1571 -14317 -36992 -45865 -27429 8505 21667
13231B1667j122l4076j5178J6781l3587j1695J4108j6239K6699K8122Q525P246
$$ 21667 20545 -13531 -28709 -11928 -45515 -57210 -43102 -59341 -32642 -4520 4005 11251
13219A1251j7291m318j5202q902j8019k82L2337J0199j8563j1558M0096L433p229
$$ 11251 -6040 -10358 -25560 -34462 -52481 -52763 -20426 -10227 -28790 -40348 -252 3181 -4048
13206d048K1856K7936j2666j6045n246j720J9671K3487k9423p722J086l2077J9615
$$ -4048 17808 45744 33078 17033 11787 10067 29738 53225 23802 16080 17166 -14911 4704
13193D704j397j624J7382O954j6999k1254m65J269K3060k0437k108L9293o052
$$ 4704 3307 1683 19065 26019 9020 -12234 -12699 -11430 11630 -8807 -10915 28378 22326
13180B2326j176J7051k1371j5113k2316j5507K1151K7778J8765p166r554n878
$$ 22326 21150 38201 16830 1717 -20599 -36106 -14955 12823 31588 24422 14868 8990
13168H990l20j875L596K1226j6078p541N01o673L663o871J797R983l093n929J034
$$ 8990 8670 6795 10391 31617 15539 7998 8499 1826 5489 -1382 415 10398 7305 1376 2410
13153B410j983k3710k0943L1604J2696J7674K0722Q60L394m2540k7810K0647M6791
$$ 2410 427 -23283 -44226 -12622 74 17748 38470 39330 42724 184 -27626 -6979 39812
13140C9812K0058k7236J7899q500j8238N425P267R800q974j5570j2860j6436j9228
$$ 39812 59870 32634 50533 42033 23795 29220 36487 46287 37313 21743 8883 -7553 -26781
13127b6781K6000L9679j8813m6625J5769L0008o227p812K8279k4452k7880n245
$$ -26781 -781 38898 20085 -26540 -10771 19237 13010 5198 33477 9025 -18855 -24100
13115b4100K1907J0514l1279k1888J6524M3640J1223K598N418r156J3160N182
$$ -24100 -2193 8321 -22958 -44846 -28322 15318 26541 29139 34557 25401 38561 43743
13103D3743k842K1243L804l5299k588k1895K7880K9466l7840r725J6244K4828
$$ 43743 40901 62144 65948 30649 28061 6166 34046 63512 25672 15947 32191 57019
13091E7019p831k3804l6453j1738K9110J4976l8287r290q613L413O850j710M183
$$ 57019 49188 25384 -11069 -22807 6303 21279 -17008 -26298 -34911 -31498 -24648 -26358 -22175
13078b2175J2614J3536K028j4100q951l1125J700q429K7000J9784k773j5900l148
$$ -22175 -9561 3975 6003 -8097 -17048 -48173 -46473 -54902 -27902 -8118 -10891 -26791 -29939
13065b9939r986m68J7050J4118r331J703j4939O635j1916j086p078L7358J9281
$$ -29939 -39925 -40393 -23343 -9225 -18556 -16853 -31792 -25157 -37073 -38159 -45237 -7879 11402
13052A1402o996j7041k8111J88P582L3865L3246K2758j9725j2788k7637k4574
$$ 11402 4406 -12635 -40746 -40558 -32976 889 34135 56893 37168 24380 -3257 -27831
13040b7831Q039p27j9782k578J9280N307k2613l1623L2871J4195k3295L9403n403
$$ -27831 -19792 -20519 -40301 -42879 -23599 -18292 -40905 -72528 -39657 -25462 -48757 -9354 -14757
13027a4757l99p165K2108N897r087k4056J9176L475K8236R844l0071m0777j5070
$$ -14757 -15156 -22321 -213 5684 -3403 -27459 -8283 -4808 23428 33272 3201 -37576 -52646
13014e2646K6234K6025j4074j4612J2560R55M995K8531q024K0772L2503k3059
$$ -52646 -26412 -387 -14461 -29073 -16513 -15558 -10563 17968 9944 30716 63219 40160
13002D0160l9491j1166o860J0496l33LK6196j1842l0420k2230k0311J3834L1495
$$ 40160 669 -10497 -17357 -6861 -7194 -7191 19005 7163 -23257 -45487 -65798 -51964 -20469
12989b0469J6870k1727j4128L2932L7246l2371j786j3432J029J3830j8937K4001
$$ -20469 -3599 -25326 -39454 -6522 30724 -1647 -3433 -16865 -15836 -2006 -20943 3058
12977C058j6868m90R586K182K1707k2062Q923Q607m168l402R300p721o185J3008
$$ 3058 -13810 -14300 -4714 -2532 19175 -2887 6036 14643 10475 7073 16373 8652 2467 15475
12963A5475j2835j4846K454j2700J9505P709q693J876r266O33K2748k2305j7341
$$ 15475 2640 -12206 -9752 -22452 -2947 4762 -3931 -2055 -11321 -10688 12060 -10245 -27586
12950b7586j9323L1J5458L6049q387M870k2960O969J5568q879L192J2340K7675
$$ -27586 -46909 -46878 -31420 4629 -3758 1112 -21848 -14879 689 -8190 -4998 7342 35017
12937C5017K3192k2537p17R355k1769j6495k886k9694P527J3234J4782L0790P917
$$ 35017 58209 35672 34955 44310 22541 6046 3160 -26534 -19007 -5773 9009 39799 47716
12924D7716l4181l20J6429k5266j4253J1456J962L506L9531j0260j2475p643J7186
$$ 47716 13535 13215 29644 4378 -9875 1581 3543 7049 46580 36320 23845 16202 33388
12911C3388J9223k674m733j1254q896p117l3497q169L2332K9641K402o15r05Q30
$$ 33388 52611 49937 45204 33950 25054 17937 -15560 -23729 8603 38244 40646 40031 39126 39956
12897C9956j8911j9407q920K3709p798j3253Q211J7082r968N347k388j8214P388
$$ 39956 21045 1638 -7282 16427 8629 -4624 3587 20669 10701 16048 13660 -4554 2834
12884B834l785N57j3330j4963j8658J8724j3270R761M905K1104J4810K6492J0944
$$ 2834 -951 -394 -13724 -28687 -47345 -28621 -41891 -32130 -27225 -6121 8689 35181 46125
12871D6125L784l9354k6423K7332j9019J1391J6609j9660l1402j3001J529L9976
$$ 46125 49909 10555 -15868 11464 -7555 3836 20445 785 -30617 -43618 -42089 -2113
12859b113M1514k988l2344k1122j8679K0545J1000L7515j157k78K4987l060q158
$$ -2113 39401 36413 4069 -17053 -35732 -15187 -4187 33328 32171 31893 56880 53820 45662
12846D5662Q131k245p330k1911q96N232j8617o921j7424M120o514l776L0299Q485
$$ 45662 53793 51548 44218 22307 21411 26643 8026 1105 -16319 -12199 -18713 -22489 7810 16295
12832A6295k8150j4747j4131j4346Q449K9493J677k1310J732O510P555J1467j4333
$$ 16295 -11855 -26602 -40733 -55079 -46630 -17137 -15460 -36770 -35038 -28528 -20973 -9506 -23839
12819b3839k041K2132N255J3691j2500k7336j7395k2086Q449L9610K2568O407
$$ -23839 -25880 -3748 1507 15198 2698 -24638 -42033 -64119 -55670 -16060 6508 12915
12807A2915k5428k4435K150j8143K2187L1531o640j4139J6203Q764k1343J6561
$$ 12915 -12513 -36948 -34798 -52941 -30754 777 -5863 -20002 -3799 4965 -16378 183
12795A83L0448K0217m706m7558j9078P241J6014N282k5600j1375r186j7849M143
$$ 183 30631 50848 46142 -1416 -20494 -13253 2761 8043 -17557 -28932 -38118 -55967 -51824
12782e1824L2087k056J1879J5935q451j3080j1245N172j2791J8894n338m414J8581
$$ -51824 -19737 -21793 -9914 6021 -2430 -15510 -26755 -21583 -34374 -15480 -20818 -25232 -6651
12769f651J0087j3494O629J3791N133k1997j8853M388J3330j6671j72L014Q544
$$ -6651 3436 -10058 -3429 10362 15495 -6502 -25355 -20967 -7637 -24308 -24480 -21466 -12922
12756a2922J3805j7974J7283M729J4865L1726k6578l2983K5858Q052p09j800j2112
$$ -12922 883 -17091 192 4921 19786 51512 24934 -8049 17809 25861 25152 23352 11240
12743A1240k71j2570j239j922J1744j1649o481L422j6300p224j1986j7706r525
$$ 11240 10969 -1601 -2840 -4762 6982 -4667 -11148 -7726 -24026 -31250 -43236 -60942 -70467
12730g0467K0088P543J2325J8064L4767J8370l0702k2214l340Q322n760q938J8043
$$ -70467 -50379 -42836 -30511 -12447 22320 40690 9988 -12226 -15566 -7244 -13004 -21942 -3899
12717c899K4830J3705n866l6985l2743J5955K7200j1513M029o212o120j6051R630
$$ -3899 20931 34636 28770 -8215 -40958 -25003 2197 -9316 -5287 -11499 -17619 -33670 -24040
12704b4040M0047J7032k3194l2326k5459P870N826n388J4716k072P999L398J314
$$ -24040 16007 33039 9845 -22481 -47940 -40070 -34244 -39632 -24916 -26988 -18989 -15591 -14277
12691a4277k3181J4790J2076J9224q402l1682J0521j5387K6861L5880k2460j7958
$$ -14277 -37458 -22668 -10592 8632 230 -31452 -20931 -36318 -9457 26423 3963 -13995
12679a3995J667J8975L192j3990L592J0269j1200N5O688p540k2934K5441Q256
$$ -13995 -12328 6647 9839 -4151 -559 9710 -1490 -1435 5253 -2287 -25221 220 8476
12666H476n410j0409p538J3741k015J1531L7993L22k5880j1242K2052j0172n687
$$ 8476 3066 -7343 -14881 -1140 -3155 8376 46369 46691 20811 9569 31621 21449 15762
12653A5762L083K9407j680l4827k8220K250P198p998j1839l208m664J3627J732
$$ 15762 18845 48252 46572 11745 -16475 -14225 -7027 -15025 -26864 -30072 -34736 -21109 -19377
12640a9377Q202p647j4285j041P80K3082J2504N678l222q255J5322L4032j9856
$$ -19377 -11175 -18822 -33107 -34148 -33368 -10286 2218 7896 4674 -3581 11741 45773 25917
12627B5917n0857n390R142k1496J2346J9925p298P12n82K556m504J7636k799j5032
$$ 25917 -24940 -30330 -21188 -42684 -30338 -10413 -17711 -16999 -17581 -15025 -19529 -1893 -4692 -19724
12613a9724j8731P447R678J7194J2253j1964k8196J4650P697J541o339j4117J7320
$$ -19724 -38455 -31008 -21330 -4136 8117 -3847 -32043 -17393 -9696 -8155 -14494 -28611 -11291
12600a1291J0860l1758J074Q166m979J6465K7943j0565l590m3011j091M6305M71
$$ -11291 -431 -32189 -31115 -22949 -27928 -11463 16480 5915 2325 -40686 -41777 4528 4999
12587D999j0662q034K4004J1371j7497l6995k0452L933L0878l5749K379M7699
$$ 4999 -5663 -13697 10307 21678 4181 -32814 -53266 -49333 -18455 -54204 -51825 -4126
12575d126n984J487j8728O160L406L168n331P064k920J4490j431P611P181P952
$$ -4126 -10110 -8623 -27351 -21191 -17785 -14617 -19948 -12884 -15804 -1314 -2745 4866 12047 19999
12561A9999m831m286K0155N899k4423j3834rj2577j1101P450k4967n43K6578K9303
$$ 19999 15168 10882 31037 36936 12513 -1321 -1330 -13907 -25008 -17558 -42525 -43068 -16490 12813
12547A2813P35n848j7165j7681O149J7233n726J4581J6744j6000j872J2751o922
$$ 12813 13548 7700 -9465 -27146 -20997 -3764 -9490 5091 21835 5835 3963 16714 9792
12534I792k6524J5649J5223P632J6559K226J4781j1522m9471j9155K8624j4490
$$ 9792 -16732 -1083 14140 21772 38331 40557 55338 43816 -5655 -24810 3814 -10676
12522a0676Q191K9157K871l311n476p525m857Q219J0744m128j7483k8450K1013
$$ -10676 -2485 26672 29543 26232 20756 13231 8374 16593 27337 23209 5726 -22724 -1711
12509a711J1757J9276j2494j4613K0742L4112j2355k1712o159l4129K963J7565
$$ -1711 10046 29322 16828 2215 22957 57069 44714 23002 16843 -17286 -14323 3242
12497C242J4945l824q308J5785J4706J7979k0394j8037n693j9566n231J0256L461
$$ 3242 18187 14363 6055 21840 36546 54525 34131 16094 10401 -9165 -14396 -4140 -679
12484f79k435J6815R07N10K857j3686j2821P827K6998J611q438K632k3507r090
$$ -679 -3114 13701 14608 15118 17975 4289 -8532 -705 26293 27904 19466 22098 -1409 -10499
12470a0499L8843J7754o15J5770k7365j0284j8446m484L2535J8603n2062j3916
$$ -10499 28344 46098 45483 61253 33888 23604 5158 674 33209 51812 -250 -14166
12458a4166q977m998K3478J8597j0800l116r579J5132R542k8969p652J5910o995
$$ -14166 -23143 -28141 -4663 13934 3134 18 -9561 5571 15113 -13856 -21508 -5598 -12593
12445a2593K8867J0663K770l0496j5194J2156K3106j1572J2574j2325m340J8218
$$ -12593 16274 26937 29707 -789 -15983 -3827 19279 7707 20281 7956 3616 21834
12433B1834J9991J5747k3886j1589j12l26r240k6659K2400L1798J7630j0625q29
$$ 21834 41825 57572 33686 22097 21985 21659 12419 -14240 8160 39958 57588 46963 46134
12420D6134o926k834j6290J9682J4060O06p93m502o448q872j7452l6557k9779
$$ 46134 39208 36374 20084 39766 53826 54432 53639 49137 42689 33817 16365 -20192 -49971
12407d9971J829K6937J559Q692l622j8951J5879N902j213J393K954J9296K4104
$$ -49971 -48142 -21205 -19646 -10954 -14576 -33527 -17648 -11746 -12959 -11566 -8612 10684 34788
12394C4788K43p62n134l866n419o806J9595J2844j2844j7795J2112L969l169R860
$$ 34788 35031 34269 29135 25269 19850 13044 32639 45483 32639 14844 26956 30925 27756 37616
12380C7616J9332k6373k8989K7265j5163n87J400J5115L2792j2562l0313j7101
$$ 37616 56948 30575 1586 28851 13688 13101 14501 29616 62408 49846 19533 2432
12368B432j1733P37m211K0184N563j6138N032Q54M808p771M5156k2915l3644j0402
$$ 2432 -9301 -8564 -12775 7409 12972 -3166 1866 2720 7528 -243 44913 21998 -11646 -22048
12354b2048Q043K47J427J5998q075n300J3146j850r291L4479j817L0666k5942
$$ -22048 -14005 -13758 -12331 3667 -4408 -9708 3438 1588 -7703 26776 24959 55625 29683
12341B9683k8360L0543P373P362N694r23j4107K0308J4211J647Q280k5501m8276
$$ 29683 1323 31866 39239 46601 52295 51372 37265 57573 71784 73431 81711 56210 7934
12328G934q911L851J413K9110M8290L3183j7462l0655j5290j6179l0551m262M5271
$$ 7934 -977 2874 4287 33397 81687 114870 97408 66753 51463 35284 4733 471 45742
12315D5742J1275l1027k9259K6985J3590j6114L173L0494K4360M206k7908l6509
$$ 45742 57017 25990 -3269 23716 37306 21192 24365 54859 79219 83425 55517 19008
12303A9008k235r619p399m680j9381O923n653P454K2283K0157K763J5922K9644
$$ 19008 16773 7154 -245 -4925 -24306 -17383 -23036 -15582 6701 26858 29621 45543 75187
12290G5187j7640k6989l09j388M73j471j2113J663K5859j0141k3065J0880j864
$$ 75187 57547 30558 30249 28861 29334 27863 15750 17413 43272 33131 10066 20946 19082
12277A9082R73n586j2811L851J5809K7125j0394o547J2699j3002o988P915K1508
$$ 19082 20055 14469 1658 5509 21318 48443 38049 31502 44201 31199 24211 32126 53634
12264E3634K8199j0733k9673k0207J4023k256K4836k314p758J1962K6982R056
$$ 53634 81833 71100 41427 21220 35243 32987 57823 55509 47751 59713 86695 95751
12252I5751k7737j9200j5634n819J5656j0268K3448L5052J4560o160j5269j3647
$$ 95751 68014 48814 33180 27361 43017 32749 56197 91249 105809 99649 84380 70733
12240G0733m6028l0564J7017J5259K904M602j1361N902O731K8728K7453J6844
$$ 70733 24705 -5859 11158 26417 29321 33923 22562 28464 35195 63923 91376 108220
12228A08220K820J3831j1489l5180l9807P031K440k5151j76K5434j5820j6818
$$ 108220 111040 124871 113382 78202 38395 45426 47866 22715 22539 47973 32153 15335
12216A5335J5128J1703L1112q871k3011R994K4533m927j4821K4635O919J6064
$$ 15335 30463 42166 73278 64407 41396 51390 75923 70996 56175 80810 87729 103793
12204A03793j8655p764K0047r82j9641k1975n355m687Q720j4425m0689K8462K1881
$$ 103793 85138 77374 97421 96439 76798 54823 49468 44781 53501 39076 -1613 26849 48730
12191D8730l8759K5261O772j63L9134O018J925k1190J0062J5004J9040N52l2150
$$ 48730 9971 35232 42004 41841 80975 86993 88918 67728 77790 92794 111834 112386 80236
12178H0236j8272J1637n322r943K5908K9532L2419p70L275R136k7348q553j5245
$$ 80236 61964 73601 68279 58336 84244 113776 146195 145425 148700 157836 130488 121935 106690
12165A06690l7906Q15J5277L610J2297M806Q329K2138m20j9944O849J2403j1338
$$ 106690 68784 69599 84876 88486 100783 105589 113918 136056 135636 115692 122541 134944 123606
12152A23606p290r11K8932J1881k1661l936l784J8939P53k9592k2774j279p786
$$ 123606 116316 115405 144337 156218 134557 130621 126837 145776 146529 116937 94163 92884 85098
12139H5098m97R311j7473K54N3799K1146j170Q89J1569K3033j6794m0485k7878
$$ 85098 84601 93912 76439 76693 130492 151638 150468 151357 162926 185959 169165 128680 100802
12126A00802J2712P831k6085l788K0472Q866r050J4444N880n95J7802K6613K3323
$$ 100802 113514 121345 95260 91472 111944 120810 111760 126204 132084 131489 149291 175904 199227
12113A99227J1978Q59l2134k6380k8217L0179M4262L363R684P586l538Q22J8824
$$ 199227 211205 212064 179930 153550 125333 155512 199774 203137 212821 220407 216869 217691 236515
12100B36515k8589O882M0961J1233J2371J3051k0174j7451o483r187J4476J8280
$$ 236515 207926 214808 255769 267002 279373 292424 272250 254799 248316 239129 253605 271885
12088B71885L042j352N83n080J4198K2743M489j1678J5785M909l0473O189j113
$$ 271885 274927 273575 274158 269078 283276 306019 310508 298830 314615 319524 289051 295240 294127
12075B94127j540Q629K0032M2700j6987j5499l039Q769K5888j5121l467J4214
$$ 294127 292587 301216 321248 363948 346961 331462 328423 337192 363080 347959 344492 358706
12063C58706R561J8701K4431R897j978j5725j8109n300J1569K0748r71j9294j7932
$$ 358706 368267 386968 411399 421296 419318 403593 385484 380184 391753 412501 411530 392236 374304
12050C74304Q110J4130M7253J8119j6223l8325J8943L1207J7935R674J9948K0003
$$ 374304 382414 396544 443797 461916 445693 407368 426311 457518 475453 485127 505075 525078
12038E25078j0557R68J4747K8545q096K0971J9308M846K8022J4160M308N032o609
$$ 525078 514521 515489 530236 558781 550685 571656 590964 595810 623832 637992 642300 647332 640723
12025F40723j4290k774K1740M2829k719P407K6484K4582J1118J1977K6264N7339
$$ 640723 626433 623659 645399 688228 685509 692916 719400 743982 755100 767077 793341 850680
12013H50680M9686J6756m956K3499L5015M1185M0719K6897j2918k4078K6750K8615
$$ 850680 900366 917122 912166 935665 970680 1011865 1052584 1079481 1066563 1042485 1069235 1097850
12001A097850K7877L2510J8552O4354L7039L7685L8958L7746P0922O1692L9956
$$ 1097850 1125727 1158237 1176789 1241143 1278182 1315867 1354825 1392571 1463493 1525185 1565141
11990A565141M1784N2934N0496M4741N1648N8292Q7637P5346O4551P8190Q5093
$$ 1565141 1606925 1659859 1710355 1755096 1806744 1865036 1952673 2028019 2092570 2170760 2255853
11979B255853Q1339Q0563R2845J46648J26770J05703J53013J42971J64488J38168
$$ 2255853 2337192 2417755 2510600 2657248 2784018 2889721 3042734 3185705 3350193 3488361
11969C488361J47279J55751J56888J50176J75376J82639K34232K57052K20216
$$ 3488361 3635640 3791391 3948279 4098455 4273831 4456470 4690702 4947754 5167970
11960E167970K31199K81940K60400K87279K90412K94081K79945K87072K78430
$$ 5167970 5399169 5681109 5941509 6228788 6519200 6813281 7093226 7380298 7658728
11951G658728K65448L07383K90268K72106K43170K51554K20511J59701J60317
$$ 7658728 7924176 8231559 8521827 8793933 9037103 9288657 9509168 9668869 9829186
11942I829186J07350P2244J9732K7677k9436q6856r3513j47890j62228j48468
$$ 9829186 9936536 10008780 10028512 10056189 10026753 9939897 9846384 9698494 9536266 9387798
11932I387798j60457k30077k43254k73666k70918k60039k13020k34917k24711
$$ 9387798 9227341 8997264 8754010 8480344 8209426 7949387 7736367 7501450 7276739
11923G276739k40547k42409k42052k47542j89427j99195j82081j85399j81332
$$ 7276739 7036192 6793783 6551731 6304189 6114762 5915567 5733486 5548087 5366755
11914E366755j61572j42254j60952j55536j39813j51011j15892p9483q8444j13152
$$ 5366755 5205183 5062929 4901977 4746441 4606628 4455617 4339725 4260242 4171798 4058646
11904D058646j06823q8702j01245j37542j32329r1381n9233j12973j22775r7121
$$ 4058646 3951823 3863121 3761876 3624334 3492005 3400624 3341391 3228418 3105643 3008522
11894C008522m4914j7484p6882r4082p3011n8596o9014p3688o4542l6202k4296
$$ 3008522 2963608 2946124 2869242 2775160 2702149 2643553 2574539 2500851 2436309 2400107 2375811
11883B375811p6008q1561o1233l4028n5444n4949m9159l3953l0064o0124k9140
$$ 2375811 2299803 2218242 2157009 2122981 2067537 2012588 1963429 1929476 1899412 1839288 1810148
11872A810148l9720l9393k5310n3747l5109r417j6626m1371j5842m2114n1255
$$ 1810148 1770428 1731035 1705725 1651978 1616869 1607452 1590826 1549455 1533613 1491499 1440244
11861A440244k5303p097p063k8007l0242k8873k7797l1277l0592j4193Q245j2466
$$ 1440244 1414941 1407844 1400781 1372774 1342532 1313659 1285862 1254585 1223993 1209800 1218045 1205579
11849A205579o2856l4572l199m0306q258L900l3949j9770k4784j2203k6854j6778
$$ 1205579 1142723 1108151 1104952 1064646 1056388 1060288 1026339 1006569 981785 969582 942728 925950
11837I25950k3375r200J6084k2433m9338l830O12j2091J0009J8504J9290k6664
$$ 925950 902575 893375 909459 887026 837688 833858 834470 822379 832388 850892 870182 843518
11825H43518k0469j1512o46j4414j2056l5233j3734m243j0414l0187m5691k7781
$$ 843518 823049 811537 810891 796477 784421 749188 735454 731211 720797 690610 644919 617138
11813F17138R944K5266J9379M4284k0720l6350O182J8187j2839n1147k8981J1058
$$ 617138 627082 652348 671727 716011 695291 658941 665123 683310 670471 619324 590343 601401
11801F01401k199m9886j4772P107l0498J8930k62k6917j9393k5548K8190J6055
$$ 601401 599202 549316 534544 541651 511153 530083 529821 502904 483511 457963 486153 502208
11789E02208j120N861m9987k4560J5086R415J201j6614l4797k16l635l139K3474
$$ 502208 501088 506949 456962 432402 447488 456903 458104 441490 406693 406477 402842 399703 423177
11776D23177j2238r770j532k0707k0075l0602K3640J4792Mk88j7434N323j718
$$ 423177 410939 401169 399637 378930 358855 328253 351893 366685 366689 366401 348967 354290 352572
11763C52572o631j5569r957j0137J5056r64M32k3888m18R681o753R877K477P464
$$ 352572 345941 330372 320415 310278 325334 324370 324802 300914 300496 310177 303424 313301 315778 323242
11749C23242K8690M631k8688o1994p770L4654J3911O251m1682l6755j9099J9207
$$ 323242 351932 356563 327875 265881 258111 292765 306676 312927 271245 234490 215391 234598
11737B34598l1973j722N653p324q517J8926L6763j9321L689J3200K9330P505k5306
$$ 234598 202625 200903 206556 199232 190715 209641 246404 227083 230772 243972 273302 280807 255501
11724B55501n489N313k7952l5883j0441o586J4130j7798k4867p115J5468R418
$$ 255501 250012 255325 227373 191490 181049 174463 188593 170795 145928 138813 154281 163699
11712A63699J5012K0436k6502k4626J4885J4192K0972l1463m909O205j238k5236
$$ 163699 178711 199147 172645 148019 162904 177096 198068 166605 161696 167901 166663 141427
11700A41427o353m392j6196R243L0856k0395k5317K6054L364k1998k7013j476
$$ 141427 135074 130682 114486 123729 154585 134190 108873 134927 138291 116293 89280 87804
11688H7804L0585Q544L5871l699J6676j8439l6008N65L3826j4344j1606J2592
$$ 87804 118389 126933 162804 159105 175781 157342 121334 121899 155725 141381 129775 142367
11676A42367J3865n003l9435l8469K450L3735K351o032K7562K689L108K6239J7272
$$ 142367 156232 151229 111794 73325 75775 109510 111861 105829 133391 136080 139188 165427 182699
11663A82699J9494j7597j2545P831K1421m021J1854J1783L1284K0573J735O901
$$ 182699 202193 184596 172051 179882 201303 197282 209136 220919 252203 272776 274511 281412
11651B81412j8025k1981j6206l139P918M0831K0235j6866n071N837J1677J8091
$$ 281412 263387 241406 225200 222061 229979 270810 291045 274179 269108 274945 286622 304713
11639C04713j1597J5052R219k7182k4214j4698r668j7309k1380j7604J653j8757
$$ 304713 293116 308168 317387 290205 265991 251293 241625 224316 202936 185332 186985 168228
11627A68228j7258O764M751k2817j5497P322l943k7698j078L4487J9046j104L682
$$ 168228 150970 157734 162485 139668 124171 131493 127550 99852 98774 133261 152307 151203 154885
11614A54885j4248l2055l4353N139L1730j1259j5802J3272q944p708j6045j6685
$$ 154885 140637 108582 74229 79368 111098 99839 84037 97309 88365 80657 64612 47927
11602D7927J200J8494K2067j0218R761R813L774J6489k9383O418K1794J570l540
$$ 47927 49127 67621 89688 79470 89231 99044 102818 119307 89924 96342 118136 119706 116166
11589A16166k1159j3635J2856j0978Q873j1701N929Q34l3905j9188P426K9728
$$ 116166 95007 81372 94228 83250 92123 80422 86351 87185 53280 34092 41518 71246
11577G1246L6234J148k4135j8075q653P550J1346q960p007p060R353P183q342
$$ 71246 107480 108628 84493 66418 57765 65315 76661 67701 60694 53634 62987 70170 61828
11564F1828k2240N821J7268J0593m781J781K189j006k656j0681j3483J0519J6202
$$ 61828 39588 45409 62677 73270 68489 70270 72459 71453 68797 58116 44633 55152 71354
11551G1354J1868r388k3257k973r410n979j998k932R876q7k352O837J4083L405
$$ 71354 83222 73834 50577 47604 38194 32215 30217 27285 37161 37074 34722 41559 55642 59047
11537E9047n997K3474J5112k6790k8129j0249k5333K289M3427q596l1581p889
$$ 59047 53050 76524 91636 64846 36717 26468 1135 3424 46851 38255 6674 -1215
11525a215L5610L7801k6862j8251J5802j4318k5200L8800K0900k6731j3436J6047
$$ -1215 34395 72196 45334 27083 42885 28567 3367 42167 63067 36336 22900 38947
11513C8947J7401O017k0001j864k3762k7685o180O416J923k247k504K0206L4800
$$ 38947 56348 62365 42364 40500 16738 -10947 -17127 -10711 -8788 -11035 -13539 6667 41467
11500D1467K0733m1060o484J7423J2471J30l8575L016N145j2993P353J0334L2259
$$ 41467 62200 21140 14656 32079 44550 44680 6105 9121 14266 1273 8626 18960 51219
11487E1219j5521l0834q110J3403J7683K1586J3052J4525j511n6616m0329l009
$$ 51219 35698 4864 -3246 10157 27840 49426 62478 77003 75492 18876 -21453 -24462
11475b4462P882J836l1249N936M0955J1357l143N94J649j0855M315o765J633M089
$$ -24462 -16580 -14744 -45993 -40057 898 12255 9112 9706 11355 500 4815 -1950 -317 3772
11461C772K0342N139r460k7093K3270J8131K777r023J7102j1223k8815j9307K4142
$$ 3772 24114 29253 19793 -7300 15970 34101 36878 27855 44957 33734 4919 -14388 9754
11448I754J602o964M184J6489j6120k5214J3921o434n12M8915Q543k1237K0470
$$ 9754 11356 4392 8576 25065 8945 -16269 -2348 -8782 -9294 39621 48164 26927 47397
11435D7397K2231j1612l1208k5449n786J9300K0j56l6559j7583P543K8307l607
$$ 47397 69628 58016 26808 1359 -4427 14873 14893 14737 -21822 -39405 -31862 -3555 -7162
11422g162j6468L482P21l099k1743m914K2395O4464L8009j5165m8539k0417o406
$$ -7162 -23630 -20148 -19427 -22526 -44269 -49183 -26788 37676 75685 60520 11981 -8436 -14842
11409a4842m412J0706K1702K3970j4369m1156j0944K2401K2292l957J4608p055
$$ -14842 -19254 -8548 13154 37124 22755 -18401 -29345 -6944 15348 11391 25999 18944
11397A8944k2410j0367N003K1757j105K6590K522J981j0405p691Q016j2492P455
$$ 18944 -3466 -13833 -8830 12927 11822 38412 40934 42915 32510 24819 32835 20343 27798
11384B7798L511n264k3312j3308m308K8486J0308k1641m0677L486K1688J1986
$$ 27798 31309 26045 2733 -10575 -14883 13603 23911 2270 -38407 -34921 -13233 -1247
11372a247p404k1514J7736m814R672J1435M284K1315O73J0042J7874k3563N219
$$ -1247 -8651 -30165 -12429 -17243 -7571 3864 8148 29463 30136 40178 58052 34489 39708
11359C9708l929k3237j5575j7985L3753J7679R447m0057m934J1341k0802k3945
$$ 39708 35779 12542 -3033 -21018 12735 30414 39861 -196 -5130 6211 -14591 -38536
11347c8536M3989K7791O840R142q332j7893p204J9437o08j2444p364j1087K3878
$$ -38536 5453 33244 40084 49226 40894 23001 15797 35234 34626 22182 14818 3731 27609
11334B7609k2021m582R468o666k8295J0385K4235j9359n942J025J8479M085k6103
$$ 27609 5588 1006 10474 3808 -24487 -14102 10133 -9226 -15168 -14143 4336 8421 -17682
11321a7682J0741Q466j59m994j8642j3232J605J830K5705M6147K680j3383J6368
$$ -17682 -6941 1525 1366 -3628 -22270 -35502 -33897 -32067 -6362 39785 42465 29082 45450
11308D5450O256J254O00k1923j6830k4589j3445L2378J2107k032k1K9683r226
$$ 45450 51706 52960 53560 31637 14807 -9782 -23227 9151 21258 19226 19205 48888 39662
11295C9662k3756k5188K2709J4365j1460K8814k1179m164j694J0436j832m702
$$ 39662 15906 -9282 13427 27792 16332 45146 23967 19803 18109 28545 26713 22011
11283B2011q523K530K6881q876j9996k603j036O22J2395j7078P847n8K0119K4359
$$ 22011 13488 16018 42899 34023 14027 11424 10388 11010 23405 6327 14174 14116 34235 58594
11269E8594J0863O775k2450k2354J3071j1566k0628L895P638J167n618L2310o865
$$ 58594 69457 76232 53782 31428 44499 32933 12305 16200 23838 25005 19387 51697 44832
11256D4832k9547L3278J3087j5272M529K0783j2025l6550J4920J1595j3872l240
$$ 44832 15285 48563 61650 46378 50907 71690 59665 23115 38035 49630 35758 32518
11244C2518K5523M428J5794p705j2122l8204m74k5664N943J7895j0058N997J4356
$$ 32518 58041 62469 78263 70558 58436 20232 19758 -5906 37 17932 7874 13871 28227
11231B8227k1442M504j9819j5677J3264j223K4323J4455M265J6249l181j7309
$$ 28227 6785 11289 -8530 -24207 -10943 -12166 12157 26612 30877 47126 43945 26636
11219B6636Q565j3810n3974k228L2533J6953k1104q061J4632J6704j798j3587
$$ 26636 35201 21391 -32583 -34811 -2278 14675 -6429 -14490 142 16846 15048 1461
11207A461L72J8068J0632j8817l96L8133j1094j4710k9021L0019K1834j7529K582
$$ 1461 1833 19901 30533 11716 11320 49453 38359 23649 -5372 24647 46481 28952 31534
11194C1534K530q539j8118K040N029J8918m99r260J3863l213l2360q645j5988
$$ 31534 34064 25525 7407 9447 14476 33394 32895 23635 37498 34285 1925 -6720 -22708
11181b2708K0117J95q683p620K3278j9733k1930j0310L5953L4764j5335L479N582
$$ -22708 -2591 -2396 -11079 -18699 4579 -15154 -37084 -47394 -11441 23323 7988 11467 17049
11168A7049r507M793K798j9023N081n767Q55L56Q423J7294K082J206j8715j8027
$$ 17049 7542 12335 15133 -3890 1191 -4576 -3721 -3365 5058 22352 24434 25640 6925 -11102
11154a1102k5789q030K4820L0076M1235j3763J4925l3496l2598j9264K0626K3283
$$ -11102 -36891 -44921 -20101 9975 51210 37447 52372 18876 -13722 -32986 -12360 10923
11142A0923J5892M2913j600j5505J532l0528m313K7609p450k3810P167k7298q070
$$ 10923 26815 69728 68128 52623 54155 23627 19314 46923 39473 15663 22830 -4468 -12538
11129a2538l866J9561j05k0831J2848k5038n601K0830j0780j6414L753L3184P436
$$ -12538 -16404 3157 3052 -17779 -4931 -29969 -35570 -14740 -25520 -41934 -38181 -4997 2439
11116B439J4889M960j3108j6139J5097J7976j5077n356J3864K2403J4623K7506
$$ 2439 17328 22288 9180 -6959 8138 26114 11037 5681 19545 41948 56571 84077
11104H4077j9461j2875j9835j4388j5812J3601J2706J7132P141j1768l6606J4339
$$ 84077 64616 51741 31906 17518 1706 15307 28013 45145 52286 40518 3912 18251
11092A8251q842j7833J0470K2164K7361k1784j3004Q684J6085l3826j549K2491
$$ 18251 9409 -8424 2046 24210 51571 29787 16783 25467 41552 7726 6177 28668
11080B8668l008o252l7853j1353J2587J7367J8285Q552n610j7959l3872m5253
$$ 28668 25660 19408 -18445 -29798 -17211 156 18441 26993 21383 3424 -30448 -75701
11068g5701l3728n8584o7656l8400J7270J6535m008o600L8441M8971N0701N4233
$$ -75701 -109429 -168013 -235669 -274069 -256799 -240264 -244272 -250872 -212431 -163460 -112759 -58526
11056e8526L8821Q903J2392J2364K0998K1470j7664j6619M1295M1649Q696J706
$$ -58526 -19705 -10802 1590 13954 34952 56422 38758 22139 63434 105083 113779 115485
11044A15485K376J8387j4429K450K3306k979k1131q242K6977M3751K3285N0714
$$ 115485 117861 136248 121819 124269 147575 144596 123465 115223 142200 185951 209236 259950
11032B59950K7201k3091l221l0069m255J3543P269N7L4422K3995K9810J6610L3956
$$ 259950 287151 264060 260839 230770 226515 240058 247327 247384 281806 305801 335611 352221 386177
11019C86177K9311K2197n223j436L1584P1933J42637K23227K98340L22372L85465
$$ 386177 415488 437685 432462 431026 462610 534543 677180 900407 1198747 1521119 1906584
11008A906584L65294L21764K21521K4024j07450l24150l82975l70710l83854k85540
$$ 1906584 2271878 2593642 2815163 2839187 2731737 2407587 2024612 1653902 1270048 984508
10998I84508j53266r6408p8013p8979p0640n1287m4389l6064m8533l7823o2110
$$ 984508 831242 734834 656821 577842 507202 455915 411526 375462 326929 289106 226996
10987B26996l3821P286K5173J0441j1157p887j8185j7905j0055o888J1352L2366
$$ 226996 193175 200461 225634 236075 224918 217031 198846 180941 170886 163998 175350 207716
10975B07716k1982J7295J4969k9177l4023k2776J8199J3218l6359m3682j3530
$$ 207716 185734 203029 217998 188821 154798 132022 150221 163439 127080 83398 69868
10964F9868J5967L8726p648J077J4534k4634K3918R411l753K395J1714O729J1465
$$ 69868 85835 124561 116913 117990 132524 107890 131808 141219 137466 139861 151575 158304 169769
10951A69769k02k1482k7884l577Q702q359p216j5837j8788K1011L2493K537m5002
$$ 169769 169567 148085 120201 116624 125326 116967 109751 93914 75126 96137 128630 131167 86165
10938H6165j9938M805K4717N149O781n8967n1517P157J8844J5364L7995J627J9654
$$ 86165 66227 71032 95749 100898 107679 48712 -2805 4352 23196 38560 76555 78182 97836
10925I7836j0238j5297J2149M2056m871k2927j1455k759J025J5846L0725J6065
$$ 97836 87598 72301 84450 126506 121635 98708 87253 84494 85519 101365 132090 148155
10913A48155j1215j3943K3487R609p276l351q277k3319j1006k59n36k7736J901
$$ 148155 136940 122997 146484 156093 148817 145466 137189 113870 102864 102605 102069 74333 76234
10900G6234m393p291l5401l1627l8334l0801K4178J8252K3083J7687K0870r713
$$ 76234 71841 64550 29149 -2478 -40812 -71613 -47435 -29183 -6100 11587 32457 22744
10888B2744p933K880n536j2056k1813J4272n947l8200J0396J1009K019j6651L9285
$$ 22744 14811 17691 12155 99 -21714 -7442 -13389 -51589 -41193 -30184 -28165 -44816 -5531
10875e531K7011M1313M0232j850p187K4435j1118J8417M0396J3622L9649M2624
$$ -5531 21480 62793 103025 101175 93988 118423 107305 125722 166118 179740 219389 262013
10863B62013L3112j7635n2642j8526L1733J1873j75J0626p62k6086k3309P722
$$ 262013 295125 277490 224848 206322 238055 249928 249753 260379 259617 233531 210222 217944
10851B17944j01P135J3793K2452n122l6082l9268J2401j6663m046m018j1044k7652
$$ 217944 217843 224978 238771 261223 256101 220019 180751 193152 176489 172443 168425 157381 129729
10838A29729k2900k9814j9409k3576j4400k2760K871l898Q776K0157o257J7882
$$ 129729 106829 77015 57606 34030 19630 -3130 -259 -4157 4619 24776 18519 36401
10826C6401K1167k8427n8224L980K9138o059Q8J9102n247j650j3671k4511L419
$$ 36401 57568 29141 -29083 -25103 4035 -2024 -1936 17166 11919 10269 -3402 -27913 -24494
10813b4494L2301J4789K483k430j6030j4515K7875j3797k124P829K4642R207O871
$$ -24494 7807 22596 25079 22649 6619 -7896 19979 6182 4058 11887 36529 45736 52607
10800E2607J9035M843j342k6785K0146J188p199K0596J8008K6111J3773j0059
$$ 52607 71642 76485 75143 48358 68504 69692 62493 83089 101097 127208 140981 130922
10788A30922n123j5519j4122j7913J3584K0864L4819q013j4017o149J1929j0400
$$ 130922 125799 110280 96158 78245 91829 112693 147512 139499 125482 119333 131262 120862
10776A20862k1818J2997K3247R95K5071j3777J7539M1351J9010J1713J9102q884
$$ 120862 99044 112041 135288 136283 161354 147577 165116 206467 225477 237190 256292 247408
10764B47408r234k4065k3884l063K5771o424L1627J4684k7515j2466P762j5187
$$ 247408 238174 214109 190225 187162 212933 206509 238136 252820 225305 212839 220601 205414
10752B05414N236K6078J8964k8246K2824K4549L647K2696J2992M6963O2198N3010
$$ 205414 210650 236728 255692 227446 250270 274819 278466 301162 314154 361117 423315 476325
10740D76325N9991N9018R9704J20914J20917J50439J30541J34531J96362J62286
$$ 476325 536316 595334 695038 815952 936869 1087308 1217849 1352380 1548742 1711028
10730A711028J50419J62724J52105J08636O6115Q9967j419k9923k5976m5334p8683
$$ 1711028 1861447 2024171 2176276 2284912 2351027 2440994 2439575 2409652 2383676 2338342 2259659
10719B259659p9729q1491r5366p9882j3888n2107m9914m8811m3012n5827p5477
$$ 2259659 2179930 2098439 2003073 1923191 1909303 1857196 1807282 1758471 1715459 1659632 1584155
10708A584155k288K0955m708m7889l5061K9120L0813r99j9059m034J964j9494
$$ 1584155 1581867 1602822 1598114 1550225 1515164 1544284 1575097 1574098 1555039 1551005 1552969 1533475
10696A533475k9832J3283J7449j3222l9111r859k570m4802n5318l4397n4255l8848
$$ 1533475 1503643 1516926 1534375 1521153 1482042 1472183 1469613 1424811 1369493 1335096 1280841 1241993
10684A241993p2255o4254n9851j5127K5407J3398Q499K61l2801O123K7707j1880
$$ 1241993 1169738 1105484 1045633 1030506 1055913 1069311 1077810 1078071 1045270 1051393 1079100 1067220
10672A067220K4413J7825K2977M1675n498l3624J9293L2485n231P415M0140O622
$$ 1067220 1091633 1109458 1132435 1174110 1168612 1134988 1154281 1186766 1181535 1188950 1229090 1235712
10660A235712l909K6075L9312O859L4918N9666M5968P7820O9050O8838P1003m952
$$ 1235712 1231803 1257878 1297190 1304049 1338967 1398633 1444601 1522421 1591471 1660309 1731312 1726360
10648A726360k254M5751J4437j096K107J5517J06649R4465J35175J20797J87614
$$ 1726360 1724106 1769857 1784294 1783198 1785305 1800822 1907471 2001936 2137111 2257908 2445522
10637B445522J77219J96301K48693K81613K77679K99649L28746L98944L94655
$$ 2445522 2622741 2819042 3067735 3349348 3627027 3926676 4255422 4654366 5049021
10628E049021M08874N98126Q18437R41523J182493J388275J575875J808049K040583
$$ 5049021 5457895 6056021 6874458 7815981 8998474 10386749 11962624 13770673 15811256
10619A5811256K357855K481327K420190K414296K532909K717047K784614K827450
$$ 15811256 18169111 20650438 23070628 25484924 28017833 30734880 33519494 36346944
10611C6346944L338646M662887O984186J0578602J5892649K3975662L6671840
$$ 36346944 39685590 44348477 51332663 61911265 77803914 101779576 138451416
10604A38451416N3225484O4440637O9983925P2190926O1152323M7952306J9224709
$$ 138451416 191676900 256117537 326101462 398292388 459444711 507397017 526621726
10597E26621726o580015l6323415o5968659o8975090p2183315n7776307l6298235
$$ 526621726 520041711 483718296 417749637 348774547 276591232 218814925 182516690
10590A82516690k3131130j7433027j5479272j3713469j0969069p791293m954079
$$ 182516690 159385560 141952533 126473261 112759792 101790723 93999430 89045351
10583H9045351k706174j384573j064602j129000j228223j823542l189391m701388
$$ 89045351 86339177 84954604 83890002 82761002 81532779 79709237 76519846 71818458
10575G1818458n113034m364594l194259k131776j446682j032345r87878j010915
$$ 71818458 66705424 62340830 59146571 57014795 55568113 54535768 53547890 52536975
10567E2536975j022275j312278j919167k525182k794626k620370k304987j990267
$$ 52536975 51514700 50202422 48283255 45758073 42963447 40343077 38038090 36047823
10559C6047823j710565j482968j279656j221758j121959r81534q94131q47558
$$ 36047823 34337258 32854290 31574634 30352876 29230917 28249383 27355252 26507694
10551B6507694p81094p61377p03578o45727o17223n98728n97339o22954o09242
$$ 26507694 25726600 24965223 24261645 23615918 22998695 22399967 21802628 21179674 20570432
10542B0570432o06458n54630n05560m82063m49157m18285l88621l86475l95199
$$ 20570432 19963974 19409344 18903784 18421721 17972564 17554279 17165658 16779183 16383984
10533A6383984l42054l52914l85476l66213l61185l39075l45028l51697l24420
$$ 16383984 16041930 15689016 15303540 14937327 14576142 14237067 13892039 13540342 13215922
10524A3215922k97767k99247k72066k64836k61370k94763k37323k06999k32940
$$ 13215922 12918155 12618908 12346842 12082006 11820636 11525873 11288550 11081551 10848611
10515A0848611k24941k13404k24571k04931j99404j98747k23276j99262j84260
$$ 10848611 10623670 10410266 10185695 9980764 9781360 9582613 9359337 9160075 8975815
10506H975815j91070j89403j76616j79298j21388r7259j18862j29996j51302j13324
$$ 8975815 8784745 8595342 8418726 8239428 8118040 8020781 7901919 7771923 7620621 7507297
10496G507297j21473j26140j21568j30703r9861j04876k4989l7793n7086m2187
$$ 7507297 7385824 7259684 7138116 7007413 6907552 6802676 6777687 6739894 6682808 6640621
10486F640621J4851J5756K2488L2347L2460M51l1080n5777q6101j05212m3736
$$ 6640621 6655472 6671228 6693716 6726063 6758523 6758974 6727894 6672117 6586016 6480804 6437068
10475F437068n6166k3145j2805n2293p1854q5943j70147k14282k53280k04329
$$ 6437068 6380902 6357757 6344952 6292659 6220805 6134862 5964715 5750433 5497153 5292824
10465E292824j54760j69890m6011k0873p3345q1597o2360r6561q2993n3281n4115
$$ 5292824 5138064 4968174 4922163 4901290 4827945 4746348 4683988 4587427 4504434 4451153 4397038
10454D397038m6324l7890k7629l5037k6340n0854o5458n2088k3842m8937m5816
$$ 4397038 4350714 4312824 4285195 4250158 4223818 4172964 4107506 4055418 4031576 3982639 3936823
10443C936823q6227j14163q8930r5251r6341p1330o0665j00555p1673q8053q1622
$$ 3936823 3850596 3736433 3647503 3552252 3455911 3384581 3323916 3223361 3151688 3063635 2982013
10432B982013j06256m0570m3469o4492o6741n7111l8283l5525m1861m7417k4481
$$ 2982013 2875757 2835187 2791718 2727226 2660485 2603374 2565091 2529566 2487705 2440288 2415807
10421B415807m2978l3933n9546n5047j9810l0770m9559k7814k5505k6348k66k9404
$$ 2415807 2372829 2338896 2279350 2224303 2204493 2173723 2124164 2096350 2070845 2044497 2044231 2014827
10409B014827p0514m0443q681j4962j4709l4443l7927o8404l8040j6470o045M92
$$ 2014827 1944313 1903870 1895189 1880227 1865518 1831075 1793148 1724744 1686704 1670234 1664189 1664681
10397A664681k9506k2845j3325N924O292Q106k9482n3608n4461m5106j9500k0477
$$ 1664681 1635175 1612330 1599005 1604929 1611221 1619327 1589845 1536237 1481776 1436670 1417170 1396693
10385A396693k8850O340J2307j0208o8l429l1694k1173l1101k3325k6185K5356
$$ 1396693 1367843 1374183 1386490 1376282 1376214 1372785 1341091 1319918 1288817 1265492 1239307 1264663
10373A264663L2192l7619k9693k8345l1723j6712k1680j241j6379p363r867j6152
$$ 1264663 1296855 1259236 1229543 1201198 1169475 1152763 1131083 1129842 1113463 1106100 1096233 1080081
10361A080081n130r655o632m5774l2694r956j4020l3223j2734j876p990j1951
$$ 1080081 1074951 1065296 1058664 1012890 980196 970240 956220 922997 910263 908387 900397 888446
10349H88446k3155j8232k645l7828K4509j6199k1886l6196K19K799k3966j6414
$$ 888446 865291 847059 844414 806586 831095 814896 793010 756814 757033 759832 735866 719452
10337G19452n696L204M54j6500p080l8564k2744o419o237k3528q487K2002j3476
$$ 719452 713756 716960 717414 700914 693834 655270 632526 626107 619870 596342 587855 609857 596381
10324E96381J5386K2528Q314P566K064m1718Q906Q132L1532j398l7323k3483m1322
$$ 596381 611767 634295 642609 650175 652239 610521 619427 627559 659091 657693 620370 596887 555565
10311E55565j3193J5286M296M426M631k869K1636j9119l9333j2314o496l4066
$$ 555565 542372 557658 561954 566380 571011 568142 589778 570659 531326 519012 512516 478450
10299D78450k319J8650k2555m9787j53j0710m4748p522L9172Q198l6682k0000
$$ 478450 476131 494781 472226 422439 422286 411576 366828 359306 398478 406676 369994 349994
10287C49994k8184J5226k409N348L5032J285m8251j9433j9799J0378L7407L7149
$$ 349994 321810 337036 334627 339975 375007 376292 328041 308608 288809 299187 336594 373743
10275C73743l759O50o866m3999m4779R515J5130j743Q23l5124j6492K325J8199
$$ 373743 369984 370634 363768 319769 274990 284505 299635 297892 298715 263591 247099 249424 267623
10262B67623l257M6483K4575k4816l8768k00N435q894r72j028j4439o434j4244
$$ 267623 264366 310849 335424 310608 271840 271640 277075 268181 267209 266181 251742 245308 231064
10249B31064j209J5655J0177j8861j323j1591j9789l40o832j5402L9071J6793
$$ 231064 229855 245510 255687 236826 235503 223912 204123 203783 196951 181549 220620 237413
10237B37413n872J0872j8625q272p527N1072M0621l864j2619l0557k3596J9485
$$ 237413 231541 242413 223788 215516 207989 259061 299682 295818 283199 252642 229046 248531
10225B48531P657k0811j896o445j8640J3021J4990J624L517l792j442n504K2100
$$ 248531 256188 235377 233481 227036 208396 221417 236407 238031 241548 237756 236314 230810 252910
10212B52910k0369M565O615q342J9900L6366j286j6273k4103j4862n0508L401
$$ 252910 232541 237106 243721 235379 255279 291645 290359 274086 249983 235121 184613 188014
10200A88014L6159N5643M1307k8721P373L1033J11646J04625J63247K92810L25131
$$ 188014 224173 279816 321123 292402 299775 330808 442454 547079 710326 1003136 1328267
10189A328267L55317L82961L23541K50598J59459R981j86032l65750l63433l68868
$$ 1328267 1683584 2066545 2390086 2640684 2800143 2810124 2624092 2258342 1894909 1526041
10179A526041l34085k20207j48109p1372l4273n1231o6127k8652p201l8257O63
$$ 1526041 1191956 971749 823640 752268 717995 666764 600637 571985 564784 526527 527190
10168E27190K1568j4824r229J0311l0863j1179r682k4792J6127Q29P181N9881
$$ 527190 548758 533934 524705 535016 504153 492974 483292 458500 474627 475456 482637 542518
10156E42518K6434l2690j391K6433M103l7271m4542k3018J946K242K4005R540
$$ 542518 568952 536262 534871 561304 565407 528136 483594 460576 462522 464764 488769 498309
10144D98309m402J953K3257k1830j7072l1784k7695K474J7608O5482K8365L406
$$ 498309 493907 495860 519117 497287 480215 448431 420736 423210 440818 506300 534665 538071
10132E38071K433l0905j8142j2710p9265o3342k5065l7619j936j8707K390j3376
$$ 538071 540504 509599 491457 478747 399482 336140 311075 273456 271520 252813 255203 241827
10120B41827j1028R590k051n759j5887j1455M66l801n499J1479J2160p452k534
$$ 241827 230799 240389 238338 232579 216692 205237 205703 201902 196403 207882 220042 212590 210056
10107B10056K4581m536j6957m873l7597k1945J2894J4542J0860Q48j3536k978
$$ 210056 234637 230101 213144 208271 170674 148729 161623 176165 187025 187873 174337 171359
10095A71359K8542J0047j1005q585j2188m7855l3473j5870L3003L6587J239j3759
$$ 171359 199901 209948 198943 190358 178170 130315 96842 80972 113975 150562 151801 138042
10083A38042k0322j0162L7464J9863J4656J2622j2674o1970k5787J9094Q341j6967
$$ 138042 117720 107558 145022 164885 179541 192163 179489 117519 91732 110826 119167 102200
10071A02200q440J8873K2776J8878r44k4341l1929l113J0775K2693j1412P056
$$ 102200 93760 112633 135409 154287 153343 129002 97073 93960 104735 127428 116016 123072
10059A23072j619K038J0183j5665n342j5702q263J1197J8652M317k0511j8306
$$ 123072 121453 123491 133674 118009 112667 96965 88702 99899 118551 122868 102357 84051
10047H4051K47Q856n033r224J1821j4300K2183j2244o603M3675N2374j9297q500
$$ 84051 84298 93154 88121 78897 90718 76418 98601 86357 79754 123429 175803 156506 148006
10034A48006j0603m029M745j6021P190j963j4724p037k779L0893k2017k9151r159
$$ 148006 137403 133374 138119 122098 129288 127325 112601 105564 102785 133678 111661 82510 73351
10021G3351p741q488L4939M406k858K4194L460l878j1587j9428J2841J695k7625
$$ 73351 65610 57122 92061 96467 93609 117803 121263 117385 105798 86370 99211 100906 73281
10008G3281r715Q70J6205K5041m0123J7374M1112j2627n3262K3170N023j8926
$$ 73281 63566 64436 80641 105682 65559 82933 124045 111418 58156 81326 86349 67423
9996F7423q003L3682Q390K946p015k2595k6347l2233K9330M9302K409l7168k292
$$ 67423 59420 93102 101492 104438 97423 74828 48481 16248 45578 94880 97289 60121 57829
9983E7829k199l4647K756J7259j4508M545K2424N6949L1252k9496o050N394l3501
$$ 57829 55630 20983 23739 40998 26490 31035 53459 110408 141660 112164 106114 111508 78007
9970G8007K978R542j9416k7102m783K992Q107j4148J7607j5232J7171K2390q038
$$ 78007 80985 90527 71111 44009 39226 42218 50325 36177 53784 38552 55723 78113 70075
9957G0075j5845J368M068j3306Q590M417j4441J4996k223k4746l1863j0306L0511
$$ 70075 54230 55598 59666 46360 54950 59367 44926 59922 57699 32953 1090 -9216 21295
9944B1295J4249R641J0471j6130l225N665N347k0087m736j0557p102K4245P071
$$ 21295 35544 45185 55656 39526 36301 41966 47313 27226 22490 11933 4831 29076 36147
9931C6147K946n055K729L6795K573l623l573Q978o928P516k0131J6263M841j7744
$$ 36147 39093 34038 36767 73562 76135 72512 68939 77917 70989 78505 58374 74637 79478 61734
9917F1734M600L82j4396J3290P360p440l0724k3838l096O046M515N840r77m38
$$ 61734 66334 66716 52320 65610 72970 65530 34806 10968 7872 13918 18433 24273 23296 22858
9903B2858Q366q168k8493O220k2413r166L325J3717J7503J2362J4649J7138p702
$$ 22858 31224 23056 -5437 783 -21630 -30796 -27471 -13754 3749 16111 30760 47898 40196
9890D0196j1485J3695j23K55q603J0631O009o142j4962j292k553J40m8660n401
$$ 40196 28711 42406 42283 42538 33935 44566 50575 44433 29471 28179 25626 25766 -22894 -28295
9876b8295L5831n845R508K4856K2543R564K5136r081j8252K0583J7825n689l8077
$$ -28295 7536 1691 11199 36055 58598 68162 93298 84217 65965 86548 104373 98684 60607
9863F0607k0935j2919n038J3016P610L293m570J5419p385k1463m311o398m752
$$ 60607 39672 26753 21715 34731 42341 45634 41064 56483 49098 27635 23324 16926 12174
9850A2174J5606o950M289j7880J5768K91M001j3771j3162n463K5844n643P010
$$ 12174 27780 20830 25119 7239 23007 23298 27299 13528 366 -5097 20747 15104 22114
9837B2114n46P787J3856k6508o247K2515K3438P912q38k3161k9778q152k2437
$$ 22114 21568 29355 43211 16703 10456 32971 56409 64321 63483 40322 10544 2392 -20045
9824b0045L841L4352K5332j7242j5561k4796J1772J5859K1416L4930k212P640
$$ -20045 -16204 18148 43480 26238 10677 -14119 -2347 13512 34928 69858 67646 75286
9812G5286o277j0217l981r276j9255j1474J5545L2127J405l1156o500k479j862
$$ 75286 69009 58792 54811 45535 26280 14806 30351 62478 63883 32727 26227 23748 21886
9799B1886l996J8527j5789j367r079K4094J7646r884N738P148j4235j226N234
$$ 21886 17890 36417 20628 19261 10182 34276 51922 42038 47776 54924 40689 39463 44697
9786D4697q172K0674M4738k5173l9183n322N099K1781M349J1108K2882P165k1135
$$ 44697 36525 57199 101937 76764 37581 32259 37358 59139 63488 74596 97478 104643 83508
9773H3508k5714J0181K2076L558j7579r846l1118j031J2969m130q360k221p462
$$ 83508 57794 67975 90051 93609 76030 66184 35066 34035 47004 42874 34514 32293 24831
9760B4831j929L4528K0109J2720j3426p117J064j7392k6964l715k241J4568J5795
$$ 24831 22902 57430 77539 90259 76833 69716 70780 53388 26424 22709 20468 35036 50831
9747E0831m639L1700j853j6671k4347K5732K1517k2207m3706k2818l6763J0521
$$ 50831 46192 77892 76039 59368 35021 60753 82270 60063 16357 -6461 -43224 -32703
9735c2703L5363R834N621p14j8753M163K2401l515j5020r767k4649L1633K7640
$$ -32703 2660 12494 18115 17401 -1352 2811 25212 21697 6677 -3090 -27739 3894 31534
9722C1534O978R980J8465N313j3279k5745J94q793r217J0204j3545M543p264K02
$$ 31534 38512 48492 66957 72270 58991 33246 33440 24647 15430 25634 12089 16632 9368 9570
9708I570J8913r16J68n702l3499J1133L2570k8809P784r02P268J4751r638j5318
$$ 9570 28483 27567 27735 22033 -11466 -333 32237 3428 11212 10310 17578 32329 22691 7373
9694G373j329P331L805o47J8107m134j9862j0833j5057L560J1472o673N074K7050
$$ 7373 6044 13375 17180 16533 34640 30506 10644 -189 -15246 -11686 -214 -6887 -1813 25237
9680B5237j225O012k1328j0301j1888J7072P08l5706k239K9190K2992l734J941
$$ 25237 24012 30024 8696 -1605 -13493 3579 4287 -31419 -33658 -4468 18524 14790 16731
9667A6731j3377k2917O025j0740k645K9708K1497J1479j0428k09N349M076J5859
$$ 16731 3354 -19563 -13538 -24278 -26923 2785 24282 35761 25333 25124 30473 34549 50408
9654E0408L8640O0378M576l0417j3633P731L5133J3331m1774o0004k6608p694
$$ 50408 89048 149426 154002 123585 109952 117683 152816 166147 124373 64369 37761 30067
9642C0067k1481M330r549k0020J0128J6322J0070k4745o015K3488N146l979N056
$$ 30067 8586 12916 3367 -16653 -6525 9797 19867 -4878 -10893 12595 17741 13762 18818
9629A8818K0123J418p239P723m640n3262k5061K3924K0711k519k69K318K1734
$$ 18818 38941 40359 33120 40843 36203 -17059 -42120 -18196 2515 -4 -273 2045 23779
9616B3779P707J1210R319k1836l9359L3552k604r811l26j9489p532J0363L4603
$$ 23779 31486 42696 52015 30179 -9180 24372 21768 11957 11631 -7858 -15390 -5027 29576
9603B9576K4302J2544P724O500l5394K286j8292n165J1644K8387p083n214o241
$$ 29576 53878 66422 74146 80646 45252 47538 29246 24081 35725 64112 57029 51815 45574
9590D5574J5674j1816j0475K85l8927k2978J616L7313O581J1060K6433K4817p010
$$ 45574 61248 49432 38957 39242 315 -22663 -21047 16266 22847 33907 60340 85157 78147
9577G8147j5635r023J2620r063j6166j9969j8377M832J8507K0488p298k8188P986
$$ 78147 62512 53489 66109 57046 40880 20911 2534 7366 25873 46361 39063 10875 18861
9564A8861J7297m1400j4726l409K2867J3869N519j36j7725J8945N974O398L4060
$$ 18861 36158 -5242 -19968 -23377 -510 13359 18878 18742 1017 19962 25936 32334 66394
9551F6394j2343k3419k3545k907M482n275K6360J8305r095j1348J271j8248j944
$$ 66394 54051 30632 7087 4180 8662 3387 29747 48052 38957 27609 28880 10632 8688
9538H688r343j5253k474J8712J0932N9424K4210J1893l5295k0883O186j4301M404
$$ 8688 -655 -15908 -18382 330 11262 70686 94896 106789 71494 50611 56797 42496 46900
9525D6900J9915p87k1957j6332K0381J6028k6282k2241L065j9971N242o180k4597
$$ 46900 66815 66028 44071 27739 48120 64148 37866 15625 18690 -1281 3961 -2219 -26816
9512b6816K0582K2514j7368N249K4237k5625q790J5570N232J1278J6993o2n0054
$$ -26816 -6234 16280 -1088 4161 28398 2773 -6017 9553 14785 26063 43056 42994 -7060
9499g060j8793o145P386K7296j5079q430M521K3367O488P65k9383p835K359P585
$$ -7060 -25853 -31998 -24612 2684 -12395 -20825 -16304 7063 13551 14316 -15067 -22902 -20543 -12958
9485a2958K9097N445l529j759q806j4360K648N727R195l9K3205j2076k7034J7801
$$ -12958 16139 21584 18055 16296 7490 -6870 -4222 1505 10700 10661 33866 21790 -5244 12557
9471A2557K4790J2490O858J567j7862j8083o051K1394L8205n547j8040l4784l5943
$$ 12557 37347 49837 56695 58262 40400 22317 16266 37660 75865 70318 52278 17494 -18449
9458a8449r359O897L8854L7412j9445j7450j3450k4087m1014O668L2754J9093
$$ -18449 -27808 -20911 17943 55355 35910 18460 5010 -19077 -60091 -53423 -20669 -1576
9446a576L8517P979k0641j0252K3618J3072j3582l1344L6364L9967k3518k6044
$$ -1576 36941 44920 24279 14027 37645 50717 37135 5791 42155 82122 58604 32560
9434C2560J4760J6180K5143J8244L680q325m2660r820k377m055l4904j2303J1271
$$ 32560 47320 63500 88643 106887 110567 102242 59582 49762 47385 43330 8426 -3877 7394
9421G394R702J5508j1589l0948l0803R707J5261L416Q873K4796J1344j4494L135
$$ 7394 17096 32604 21015 -9933 -40736 -31029 -15768 -12352 -3479 21317 32661 18167 21302
9408B1302r917P395m837j9427M6146j91j9021K5858o464K5861k886j7082J082
$$ 21302 11385 18780 13943 -5484 40662 40471 21450 47308 40844 66705 63819 46737 47819
9395D7819J2235l5402N16L76K1729L0724j4124l4738n1803K0332L176l1447L324
$$ 47819 60054 24652 25168 25544 47273 77997 63873 29135 -22668 -2336 840 -30607 -27283
9382b7283k1633j4820L2761L3551j3801N785j3306r259j749M0029K0257L350j6305
$$ -27283 -48916 -63736 -30975 2576 -11225 -5440 -18746 -28005 -29754 10275 30532 33882 17577
9369A7577j9273Q554J893R873J160N386R222n2606k4811J5569L9789J2975P686
$$ 17577 -1696 6858 8751 18624 19784 25170 34392 -18214 -43025 -27456 12333 25308 32994
9356C2994p155R496J0119J1905l2764l879J5117k6046l6338m1961k161K7128J1173
$$ 32994 25839 35335 45454 57359 24595 20716 35833 9787 -26551 -68512 -70673 -43545 -32372
9343c2372k7853P4K5797K6673K8025N472j950o467p138J523J1250J3865k9035
$$ -32372 -60225 -60151 -34354 -7681 20344 25816 23866 17399 10261 11784 23034 36899 7864
9330G864R117J0679m3128l3230K2391M2068J8232k1416k3859m586N148l11j350
$$ 7864 16981 27660 -15468 -48698 -26307 15761 33993 12577 -11282 -15868 -10720 -11031 -12381
9317a2381k439m617k0055k9345m6395J8564M0962L4062r207k144L2721K3397k2815
$$ -12381 -14820 -19437 -39492 -68837 -115232 -96668 -55706 -21644 -30851 -32995 -274 23123 308
9304C08K813l727L4355j0148k6532q12R590K731J3576j5208n344K994o234m193
$$ 308 3121 -606 33749 23601 -2931 -3743 5847 8578 22154 6946 1602 4596 -1638 -5831
9290e831k4336K7269J9312j4715J4532J1752j909Q279j6539K1123p643K778K1306
$$ -5831 -30167 -2898 16414 1699 16231 27983 26074 34353 17814 38937 31294 34072 55378
9277E5378K773J977j0896j9196k0774K2755m705N82o396j5616L003K6986K3262
$$ 55378 58151 60128 49232 30036 9262 32017 27312 27894 21498 5882 8885 35871 59133
9264E9133Q349o214j3544j2122j8570k5603j1864J4098O0724J7202p239m9727
$$ 59133 67482 61268 47724 35602 17032 -8571 -20435 -6337 54387 71589 64350 14623
9252A4623j6785J4267k0577l68J1114k1256K0057K9316J2922q902n9341Q870j318
$$ 14623 -2162 12105 -8472 -8840 2274 -18982 1075 30391 43313 34411 -24930 -16060 -17378
9239a7378q652N761R148J3590j1607j3917L2214L4173o518l769k2117L167k3231
$$ -17378 -26030 -20269 -11121 2469 -9138 -23055 9159 43332 36814 33045 10928 14095 -9136
9226i136n151J5151l43J657m058J4355p753k3174M783m306J5916K9210J390k6339
$$ -9136 -14287 864 521 2178 -1880 12475 4722 -18452 -13669 -17975 -2059 27151 28541 2202
9212B202k75L7456L949l6395O044K9182L1673k0027J260r003K406k7248l5443
$$ 2202 1927 39383 43332 6937 12981 42163 73836 53809 55069 46066 48472 21224 -14219
9199a4219r936j7588o565K2314J7218l458k6377l544L4902M2792m2062o45J7054
$$ -14219 -24155 -41743 -48308 -25994 -8776 -12234 -38611 -42155 -7253 35539 -6523 -7168 9886
9186I886K6267k2902j0397K6182j6023j7834J4762J8902K7570O356j2048m5737
$$ 9886 36153 13251 2854 29036 13013 -4821 9941 28843 56413 62769 50721 4984
9174D984k2558K2123k750J9617j8213l3686j8811Q246n429L632l030L142o50L6419
$$ 4984 -17574 4549 1799 21416 3203 -30483 -49294 -41048 -46477 -42845 -45875 -42733 -43383 -6964
9160f964K4386p043j3568o949J7708o577j224J2838Q924j2447J3030m5226l2931
$$ -6964 17422 10379 -3189 -10138 7570 993 -231 12607 21531 9084 22114 -23112 -56043
9147e6043K5120M7851J9402k4982m00J6172m458j8275N43K8043k8825k7971j3961
$$ -56043 -30923 16928 36330 11348 10948 27120 22662 4387 4930 32973 4148 -23823 -37784
9134c7784l4109k6924J0020L8956M4013J7104j7020k1480J6847J482K1418O513
$$ -37784 -71893 -98817 -88797 -49841 -5828 11276 -5744 -27224 -10377 -8895 12523 19036
9122A9036n22K261J5816k669k2090k2648j0696J2905K050L2591J0797j3274j459
$$ 19036 18514 20775 36591 33922 11832 -10816 -21512 -8607 -6557 26034 36831 23557 22098
9109B2098Q13j5450j4921K2982K315L047K2038k7353j0524R239P949j2628k4210
$$ 22098 22911 7461 -7460 15522 17837 20884 42922 15569 5045 14284 22233 9605 -14605
9096a4605m873J2154L8943K8785k0394p073O949j4075l3800j6908L304j5014K2573
$$ -14605 -19478 -7324 31619 60404 40010 32937 39886 25811 -7989 -24897 -21593 -36607 -14034
9083a4034P484L0820j3533k5689l5668k2523K1370P106j1173Q462L8102J6564
$$ -14034 -6550 24270 10737 -14952 -50620 -73143 -51773 -44667 -55840 -47378 -9276 7288
9071G288J5307n542j5226k9128J8599K7417k240r579q67m063j382L590l1384o018
$$ 7288 22595 17053 1827 -27301 -8702 18715 16475 6896 6029 1966 584 4174 -27210 -33228
9057c3228j0815N825P740J3477K2834j4902k0979k8619M149K6626L4303o897N408
$$ -33228 -44043 -38218 -30478 -17001 5833 -9069 -30048 -58667 -54518 -27892 6411 -486 4922
9044D922j3455L4578j969m9686j096K6562J1277j1673r749m374Q670j6889r418
$$ 4922 -8533 26045 24076 -25610 -26706 -144 11133 -540 -10289 -14663 -5993 -22882 -32300
9031c2300K5164Q095k455q670K792m363p490k3464j3628Q071L9454J2086j624
$$ -32300 -7136 959 -1496 -10166 -7374 -11737 -19227 -42691 -56319 -48248 -8794 3292 1668
9018A668j0179L71l7805J30L3513P259q928K641M235J4094k7181J193N2832J340
$$ 1668 -8511 -8140 -45945 -45815 -12302 -5043 -13971 -11330 -7095 6999 -20182 -18989 33843 35183
9004C5183k8265p554J5861n4646j8238K0392Q726P177J4566j8420l859L4132K7033
$$ 35183 6918 -636 15225 -39421 -57659 -37267 -28541 -21364 -6798 -25218 -29077 5055 32088
8991C2088j3018k578m126j9011k0892J0029N560j7535J7616j21M6353J028k8647
$$ 32088 19070 16492 12366 -6645 -27537 -17508 -11948 -29483 -11867 -11988 34365 35393 6746
8978F746m309K2961N1093n80l3417j6245l12N664J1440j6724k2133K0660j690
$$ 6746 2437 25398 76491 75911 42494 26249 25937 31601 43041 26317 4184 24844 23154
8965B3154j0142Q75j59O664k31J0379k4403M813l892k766L3930N505n702m162
$$ 23154 13012 13887 13728 20392 20161 30540 6137 10950 7058 4292 38222 43727 38025 33863
8951C3863P69j8248k351r874l217K9739Q838k6524j2406K5669O800J2191p109
$$ 33863 34632 16384 14033 4159 942 30681 39519 12995 589 26258 33058 45249 38140
8938C8140l6507p641j4018K745L753r26K1107K4176K976j0059M177j4168J1279
$$ 38140 1633 -6008 -20026 -17281 -13528 -14454 6653 30829 33805 23746 27923 13755 25034
8925B5034j9570j8590J6020J9664N248j4656l3739J6219J1917L2883J2986L24
$$ 25034 5464 -13126 2894 22558 27806 13150 -20589 -4370 7547 40430 53416 53740
8913E3740p086m3101k9111J0995J4000P382j507M4717O077k4735j6946J0953J659
$$ 53740 46654 3553 -25558 -14563 -563 6819 5312 50029 56106 31371 14425 25378 27037
8900B7037j7548j1601P449J3242P257K212n689p12n823J5174o21l0837k7793L602
$$ 27037 9489 -2112 5337 18579 25836 28048 22359 21647 15824 30998 30377 -460 -28253 -24651
8886b4651J863N805j979K6414M309o629J7208k5515n047K5932J8954k9483L611
$$ -24651 -22788 -16983 -18962 7452 11761 5132 22340 -3175 -8222 17710 36664 7181 10792
8873A0792N255l0692R412j798M3405k9384m3237J9732J3123O502J5241J9859l100
$$ 10792 16047 -14645 -5233 -7031 36374 6990 -36247 -16515 -3392 3110 18351 38210 35110
8860C5110k5493j4006j0398J1533Q708L1475K2695j4581n1482l3817n074R146
$$ 35110 9617 -4389 -14787 -3254 5454 36929 59624 45043 -6439 -40256 -45330 -36184
8848c6184K8754O64J4803m0903Q4L779o738L4045L7489O706j4216J145q982l0546
$$ -36184 -7430 -6766 8037 -32866 -32782 -29003 -35741 -1696 35793 42499 28283 29428 20446 -10100
8834a0100K612J040J0117o182j7672J898J4971K8312n742k4220r982j5027O52
$$ -10100 -7488 -6448 3669 -2513 -20185 -18287 -3316 24996 19254 -4966 -14948 -29975 -29323
8821b9323j0688j4496J4092Q655O137K0566J9184K3451R957j7568J4629k0690
$$ -29323 -40011 -54507 -40415 -31760 -25623 -5057 14127 37578 47535 29967 44596 23906
8809B3906k4914k1598L3292J2459q481q561J6837m730O354o982N395O967j1282
$$ 23906 -1008 -22606 10686 23145 14664 6103 22940 18210 24564 17582 22977 29944 18662
8796A8662n710j4668k5826K166J6290J8976j5626r124l166k4630K2634L5968q081
$$ 18662 12952 -1716 -27542 -25376 -9086 9890 -5736 -14860 -18026 -42656 -20022 15946 7865
8783G865l5952L5576M9256o842j7526j7738j1455k228j761M0721P576J9101J1871
$$ 7865 -28087 7489 56745 49903 32377 14639 3184 956 -805 39916 47492 66593 78464
8770G8464k4623m0317k8328j194j4483l6520p437L4906N1481J1216J3903j9148
$$ 78464 53841 13524 -14804 -15998 -30481 -67001 -74438 -39532 11949 23165 37068 17920
8758A7920M872p803m4692j3633J256K0254K9179j8504j3486L1079Q916k301j9539
$$ 17920 22792 14989 -29703 -43336 -42080 -21826 7353 -11151 -24637 6442 15358 13057 -6482
8745f482L8226j1331k6316m984J7080m2963q510O730J2121J7621r62J7291Pr552
$$ -6482 31744 20413 -5903 -10887 6193 -36770 -45280 -38550 -26429 -8808 -9770 7521 7528 -2024
8731b024N817M393j4281j3461r948K562j7708Q524M859o280j3440n253J5126l428
$$ -2024 3793 8186 -6095 -19556 -29504 -26942 -44650 -36126 -31267 -37547 -50987 -56240 -41114 -44542
8717d4542M2895K7032o003j6296K375j9196K4404P906l470m934l688J4322K8560
$$ -44542 -1647 25385 19382 3086 5461 -13735 10669 18575 15105 10171 6483 20805 49365
8704D9365J3967o55l6665n442j6744n402r11j2272Q569K5153l150l5970J372j2157
$$ 49365 63332 62677 26012 20570 3826 -1576 -2487 -14759 -6190 18963 15813 -20157 -18785 -30942
8690c0942O732K1908r274j94k901O510K0994r232K1699j844k683Q574j2478l634
$$ -30942 -24210 -2302 -11576 -11770 -14671 -8161 12833 3601 25300 23456 20773 29347 16869 13235
8676A3235p079k2616j0479J7369j1958m097o973K9747j3631J2178L109k0766l287
$$ 13235 6156 -16460 -26939 -9570 -21528 -25625 -32598 -2851 -16482 -4304 -1195 -21961 -25248
8663b5248R391K14k1158p842K3834k933l753K1241P257l1092p090L6591Q645k7291
$$ -25248 -15857 -15643 -36801 -44643 -20809 -23742 -27495 -6254 1003 -30089 -37179 -588 8057 -19234
8649a9234m003L4806j0411j2778J6852K144N547l724K94J9215J9957k7619R91
$$ -19234 -23237 11569 1158 -11620 5232 7376 12923 9199 9493 28708 48665 21046 22037
8636B2037J8935j9419l0337J102r10K4086L9934J6226n6196l0703J2433N506o042
$$ 22037 40972 21553 -8784 -7682 -8592 15494 55428 71654 15458 -15245 -2812 2694 -3348
8623c348J4027J3141J9807m5177n5281K0519L1622o805J7063L2106j02j2860J578
$$ -3348 10679 23820 43627 -1550 -56831 -36312 -4690 -11495 5568 37674 37572 24712 26290
8610B6290m629k7271R959K2947Q970j7213J2362r066j6719m0K9843j2299p867
$$ 26290 21661 -5610 4349 27296 36266 19053 31415 22349 5630 5590 35433 23134 15267
8597A5267o106j4520j6118K2258Q118J487M1868j8484O041K1095J4920k331j6261
$$ 15267 9161 -5359 -21477 781 8899 10386 52254 33770 39811 60906 75826 73495 57234
8584E7234k7942R248L9919k9210m1273k0946K752j0653J5194N291j7183N072Q348
$$ 57234 29292 38540 78459 49249 7976 -12970 -10218 -20871 -5677 -386 -17569 -12497 -4149
8571d149J4546K9870K101k4972p264K1797K623J9942l0574l5170J4378Q971L331
$$ -4149 10397 40267 42368 17396 10132 31929 34552 54494 23920 -11250 3128 12099 15430
8558A5430J2849J6290o329j892Q242K0441p822l0791j0152J7840k004k1621p336
$$ 15430 28279 44569 38240 36348 44590 65031 57209 26418 16266 34106 32102 10481 3145
8545C145l0005M866M1074J4794n230l4675J2446o882l652j89k92J2190L8794k2129
$$ 3145 -26860 -21994 19080 33874 28644 -6031 6415 -467 -4119 -4308 -4600 7590 46384 24255
8531B4255l2757R836K1940J2813J2555k2641k3030k841Q835Q306k7711O05J6390
$$ 24255 -8502 1334 23274 36087 48642 26001 2971 130 8965 17271 -10440 -9835 6555
8518F555J8222j4583j6875j8368L1277J7241N041K3673P850k5189n3328J0855
$$ 6555 24777 10194 -6681 -25049 6228 23469 28510 52183 60033 34844 -18484 -7629
8506g629K4472R891N109J823q81K721J1143R159J2161J034l9476m1329q031J2989
$$ -7629 16843 26734 31843 33666 32785 35506 46649 55808 67969 69003 29527 -11802 -19833 -6844
8492f844K5692K325K313k2808r816j2017O02l669M2151q289j4997K5508J9552
$$ -6844 18848 21173 23486 678 -9138 -21155 -20553 -24222 17929 9640 -5357 20151 39703
8479C9703k55R12m670k9306p113j3495M451J2290J5675Q206p509j0658n4441K1946
$$ 39703 39448 40360 35690 6384 -729 -14224 -9773 2517 18192 26398 18889 8231 -46210 -24264
8465b4264K9768J4368J0385k0199q19j3222J8975m287j4424K2540J2417q005j363
$$ -24264 5504 19872 30257 10058 9239 -3983 14992 10705 -3719 18821 31238 23233 21870
8452B1870j4180l713J5462M429R195K7091k1028L32P488m0151J2646R123p47N571
$$ 21870 7690 3977 19439 23868 33063 60154 39126 39458 46946 6795 19441 28564 27817 33388
8438C3388k3264j8012K3559r991k4914k2351n516Q158K7659O231n738K1634J6757
$$ 33388 10124 -7888 15671 5680 -19234 -41585 -47101 -38943 -11284 -5053 -10791 10843 27600
8425B7600n763J0268l0462l1782J0812J9701L5492j5187n275J3612P020K2035
$$ 27600 21837 32105 1643 -30139 -19327 374 35866 20679 15404 29016 36036 58071
8413E8071N733k114j2482l8259r845j930J2385p53N109j9959K77R083k864L0544
$$ 58071 63804 61690 49208 10949 1104 -826 11559 10806 15915 -4044 -3767 5316 2452 32996
8399C2996J4940k5261j8740j324O20N005R992k7921r115K628J297J5896K9179
$$ 32996 47936 22675 3935 2611 3231 8236 18228 -9693 -18808 -16180 -14883 1013 30192
8386C0192k5606l9318J825J1980J3235J9895J7225K5515L2541p703m2160j7309
$$ 30192 4586 -34732 -32907 -20927 -7692 12203 29428 54943 87484 79781 37621 20312
8374B0312q638j1425L989k5078l8440K3181Q466j1633K6850Q104J7527j5049k9626
$$ 20312 11674 249 4238 -20840 -59280 -36099 -27633 -39266 -12416 -4312 13215 -1834 -31460
8361c1460J1800K3360M346n479O896l210j5934J5404J8808R930J1391j3928j7449
$$ -31460 -19660 3700 8046 2567 9463 6253 -9681 5723 24531 34461 45852 31924 14475
8348A4475n175J0569L689k5392n124K664j3481Q324J225L273n597J1159L686j7928
$$ 14475 9300 19869 23558 -1834 -6958 -4294 -17775 -9451 -8226 -4953 -10550 609 4295 -13633
8334a3633l121J3600J2672J8442o933L6137k1414k7865J498j1701k5567J3872
$$ -13633 -16754 -3154 9518 27960 21027 57164 35750 7885 9383 -2318 -27885 -14013
8322a4013K2936P337N389P241J0079J641O229n4228j1941K5375J3458k7241k4688
$$ -14013 8923 16260 21649 28890 38969 40610 46839 -7389 -19330 6045 19503 -7738 -32426
8309c2426M5359L4670J0788j2175K6545j5278n944j0996k5177k5329K411K9572
$$ -32426 12933 47603 58391 46216 72761 57483 51539 40543 15366 -9963 -7552 22020
8297B2020O424j8636k6035L6260J1526k2636J4037J2960J9158j1190n277l2693
$$ 22020 28444 9808 -16227 20033 31559 8923 22960 35920 55078 43888 38611 5918
8285E918l423K0218k25q222k9614k3184J8852Q055k2256J3239J6499R00k7295
$$ 5918 2495 22713 22488 14266 -15348 -38532 -19680 -11625 -33881 -20642 -4143 -3243 -30538
8272c0538j9312J6639M6585j412j1600m2266j4595R343J2181M8637J4070L525
$$ -30538 -49850 -33211 13374 11962 362 -41904 -56499 -47156 -34975 13662 27732 31257
8260C1257J6076j6425k8678K1434K5575p450m3631p889L4731P077k0313k9849
$$ 31257 47333 30908 2230 23664 49239 41789 -1842 -9731 25000 32077 11764 -18085
8248a8085J7801J98k1017M473J0020o739L844K3629M715n476j5367j2468O743
$$ -18085 -284 -86 -21103 -16630 -6610 -13349 -9505 14124 18839 13363 -2004 -14472 -7729
8235g729p099J7666J7433K3864l316l0228k0411J6769K1378O101Q17l548j0010
$$ -7729 -14828 2838 20271 44135 40819 10591 -9820 6949 28327 34428 35245 31697 21687
8222B1687j4110n830K0522J632j8113k4190j9392n909L3663K9887k531k7959j509
$$ 21687 7577 1747 22269 23901 5788 -18402 -37794 -43703 -10040 19847 17316 -10643 -12152
8209a2152L1641O144j5278K0207N132J8344K415J6646q299k4466J6111k0493k1312
$$ -12152 19489 25633 10355 30562 35694 54038 56453 73099 64800 40334 56445 35952 14640
8196A4640j5098p292j476K9337M304J5832l2981q069J8272L596j5530J5229j2135
$$ 14640 -458 -7750 -9226 20111 24415 40247 7266 -803 17469 21065 5535 20764 8629
8183H629J3976J267j4557l8145j204Q328o765j503l755J9847R786o182L9234J3430
$$ 8629 22605 23872 9315 -28830 -30034 -21706 -28471 -29974 -33729 -13882 -4096 -10278 28956 42386
8169D2386j6151k5176r711k0091M0465K0092o186j9406l2263j7187J1440L2975
$$ 42386 26235 1059 -8652 -28743 11722 31814 25628 6222 -26041 -43228 -31788 1187
8157A187J2852r815J1801J3292n175o097j4199j5854K1734K3444K304k7788n436
$$ 1187 14039 4224 16025 29317 24142 18045 3846 -12008 9726 33170 35474 7686 2250
8144B250p967k9170J3423K2312p195P510j6301j3577L4378M663r784j7353j7121
$$ 2250 -5717 -34887 -21464 848 -6347 1163 -15138 -28715 5663 10326 542 -16811 -33932
8131c3932J82P650K4563J6609j0102j6917k1844j5514L2090J2486K3288p123l585
$$ -33932 -33750 -26100 -1537 15072 4970 -11947 -33791 -49305 -17215 -4729 18559 11436 7851
8118G851J0425J393J0932j5651Q050L1307P362J423k3611k3592k2965j3675j461
$$ 7851 18276 19669 30601 14950 23000 54307 61669 63092 39481 15889 -7076 -20751 -22212
8105b2212K1750N394j0778Q652Q884r675O921J0255M932p532q442j2900o671J6386
$$ -22212 -462 4932 -5846 2806 11690 2015 8936 19191 24123 16591 8149 -4751 -11422 4964
8091D964O162Q005K509L014j315r877m394m233K168L269M8500N651j7147q836
$$ 4964 11126 19131 21640 24654 23339 13462 9068 4835 7003 10272 58772 64423 47276 38440
8077C8440R859o686j4755l0151K5204l607j533p160k7206o966k1041l0051j141
$$ 38440 48299 41613 26858 -3293 21911 18304 16771 9611 -17595 -24561 -45602 -75653 -76794
8064g6794L0473J1388L6666J7335K2571p15P812j0933k1623O983J0688O956K7010
$$ -76794 -46321 -34933 1733 19068 41639 40924 48736 37803 16180 23163 33851 40807 67817
8051F7817K610l8954m0907J832R085L6887j9248k1065k3411j058J6074K3485J2954
$$ 67817 70427 31473 -9434 -7602 1483 38370 19122 -1943 -25354 -26412 -10338 13147 26101
8038B6101j0727J1301L285L518r635r503j726J8j7914n785j0048l154L5271K1308
$$ 26101 15374 26675 29960 33478 23843 14340 12614 12632 -5282 -11067 -21115 -24269 11002 32310
8024C2310j3134J9564j1722k3018O599k010n743k5895j6913J2110J5554k243J0256
$$ 32310 19176 38740 27018 4000 10599 8589 2846 -23049 -39962 -27852 -12298 -14541 -4285
8011d285j0174J9797j5136l3817K4447L0554p893o315j0721J8056L623J1219p035
$$ -4285 -14459 5338 -9798 -43615 -19168 11386 3493 -2822 -13543 4513 8136 19355 12320
7998A2320k0784j5K1512j9889J9663j065l399Q33j2479k4141j6300K4579K0983
$$ 12320 -8464 -8479 13033 -6856 12807 11742 8343 9176 -3303 -27444 -43744 -19165 1818
7985A818O064l3623k0287J2565L7040n022M483Q09j7693J871R551n121J0501j5010
$$ 1818 7882 -25741 -46028 -33463 3577 -1445 3038 3847 -13846 -11975 -2424 -7545 2956 -12054
7971a2054j0244R496M945o657L1814L3568m001j897r821P084k871o663j3769K0803
$$ -12054 -22298 -12802 -7857 -14514 17300 50868 46867 44970 35149 42233 39362 32699 18930 39733
7957C9733l3531j3327K275K0700q452k6124k7158J5867K9444J4337K0555l9336
$$ 39733 6202 -7125 -4850 15850 7398 -18726 -45884 -30017 -573 13764 34319 -5017
7945e017k1364L2352j4797l2376K8532L1973K481k1215J8064O1203L1544k3327
$$ -5017 -26381 5971 -8826 -41202 -12670 19303 21784 569 18633 79836 111380 88053
7933H8053l4276j9705k4122j8190k7718j3006K2599K0968k1879N798M1567q423
$$ 88053 53777 34072 9950 -8240 -35958 -48964 -26365 -5397 -27276 -21478 20089 11666
7921A1666k2152k3937j9309m966K9046K0256N052k2035k7208K804j192L8973J9663
$$ 11666 -10486 -34423 -53732 -58698 -29652 -9396 -4344 -26379 -53587 -50783 -51975 -13002 6661
7908F661Q750j1476j4913K6636J6469j7132K089j0599j394j8118k6504k32j3677
$$ 6661 15411 3935 -10978 15658 32127 14995 17084 6485 5091 -13027 -39531 -39763 -53440
7895e3440m1L1068M796J161K5605j9774l3919J3098K5954J3991P030k0121N352
$$ -53440 -53481 -22413 -17617 -16456 9149 -10625 -44544 -31446 -5492 8499 15529 -4592 760
7882G60M882m471n696j0144J6672k100J968r912k3948K5041M3759K2748j0471
$$ 760 5642 1171 -4525 -14669 2003 -97 1871 -8041 -31989 -6948 36811 59559 49088
7869D9088l8416r323N1150r031l3962j1697L3314J9668j731m0523l6399q045J0025
$$ 49088 10672 1349 52499 43468 9506 -2191 31123 50791 49060 8537 -27862 -35907 -25882
7856b5882J1574j200j7740p799O661j0067J2548L5941j2461k0959J1814K1578
$$ -25882 -14308 -15508 -33248 -41047 -34386 -44453 -31905 4036 -8425 -29384 -17570 4008
7844D008J6620k3867q031J1395K2043j9012J5134J2290j3244j484J1316l4730
$$ 4008 20628 -3239 -11270 125 22168 3156 18290 30580 17336 15852 27168 -7562
7832g562k5095J6721L3817O231K908P186q615l0985l5993k6862K8869N4980J6132
$$ -7562 -32657 -15936 17881 24112 27020 34206 25591 -5394 -41387 -68249 -39380 15600 31732
7819C1732N127k0501P209k0554j8481o928P793Q732j0529p337J4575R462K6937
$$ 31732 36859 16358 23567 3013 -15468 -22396 -14603 -5871 -16400 -23737 -9162 300 27237
7806B7237N874j6840k981q308q365p057L775j0878K6793R446k257n852J0374j0414
$$ 27237 33111 16271 13290 4982 -3383 -10440 -6665 -17543 9250 18696 16439 10587 20961 10547
7792A0547M504J9286J435k5195j0301Q650R613J1356k9290j0120J1261k0520j3194
$$ 10547 15051 34337 35772 10577 276 8926 18539 29895 605 -9515 1746 -18774 -31968
7779c1968l14J4929K3226J4297O383L575Q672J3001k4259l2038m919J3892o301
$$ -31968 -32282 -17353 5873 20170 26553 30128 38800 51801 27542 -4496 -9415 4477 -1824
7766a824R474J9535q771M010k4209l4626K527K1480O464j4044P231Q463j7806
$$ -1824 7650 27185 18414 22424 -1785 -36411 -33884 -12404 -5940 -19984 -12753 -4290 -22096
7753b2096j5769K7502L5282k1070l7944K6549K8822n691k074j8852o616N648L3091
$$ -22096 -37865 -10363 24919 3849 -34095 -7546 21276 15585 13511 -5341 -11957 -6309 26782
7740B6782j0256l064l708R563p024k6139m7337q340J6186J2455K3979J1647j2822
$$ 26782 16526 13462 9754 19317 12293 -13846 -61183 -69523 -53337 -40882 -16903 -5256 -18078
7727a8078j8146L36n888O197L020J779J1489J1621j3971k6968j8734K6408M3102
$$ -18078 -36224 -35888 -41776 -35579 -32559 -30780 -19291 -7670 -21641 -48609 -67343 -40935 2167
7714B167J1849J6848j7929m9700j2919K8847K3993Q227p171L9236R776j6340l5134
$$ 2167 14016 30864 12935 -36765 -49684 -20837 3156 11383 4212 43448 53224 36884 1750
7701A750Q826R407j932r279R835J8374J441K4478k2514p655k273n935j2847k0498
$$ 1750 10576 19983 18051 8772 18607 36981 38422 62900 40386 32731 30458 24523 11676 -8822
7687h822M0735K7361p002q890j0261j6226j1750l016K761r807R914O625j4673
$$ -8822 31913 59274 52272 43382 33121 16895 5145 2129 4890 -4917 4997 11622 -3051
7674c051j4487J0598R561k5335k0026p229j8517K5645J5194L0541K2065J8164
$$ -3051 -17538 -6940 2621 -22714 -42740 -49969 -68486 -42841 -27647 2894 24959 43123
7662D3123J4877m6037m4027j2213R289o495o831J2608L218L468N96K4647j878
$$ 43123 58000 11963 -32064 -44277 -34988 -41483 -48314 -35706 -32488 -29020 -28424 -3777 -5655
7649e655j5993M0P092O558k4535J730r221m172K2373N05R375j9032j313J0420
$$ -5655 -21648 -21608 -14516 -7958 -32493 -30763 -39984 -44156 -21783 -21278 -11903 -30935 -32248 -21828
7635b1828J9871M313j8358p950N478K3132q51J1148n57l3018q394J8959k1148
$$ -21828 -1957 2356 -16002 -23952 -18474 4658 3807 14955 14398 -18620 -27014 -8055 -29203
7622b9203n3l908Q168K2618m366j4124j1362J778j311L5001R148O461M442Q734
$$ -29203 -29256 -33164 -24996 -2378 -6744 -20868 -32230 -30452 -31763 3238 12386 18847 23289 32023
7608C2023m655j0235k4238j4446R167q162O859K2339o6K4712j0787j3932k8592
$$ 32023 27368 17133 -7105 -21551 -12384 -20546 -13687 8652 8586 33298 22511 8579 -20013
7595b0013k0179K401L265K0227M872M268k6716K1535P902K535m46N766O379J8869
$$ -20013 -40192 -37791 -34526 -14299 -9427 -5159 -31875 -10340 -2438 97 -349 5417 11796 30665
7581C0665j7367n1230l8427K590L2053K1826j2487j130N4452M2746j0912K652
$$ 30665 13298 -37932 -76359 -73769 -41716 -19890 -32377 -33507 20945 63691 52779 55431
7569E5431L12j2192k3695l1495k5047L5301p725j1110K3614j6437l3411L946L6203
$$ 55431 55743 43551 19856 -11639 -36686 -1385 -9110 -20220 3394 -13043 -46454 -42508 -6305
7556f305J3352K718R835R777J000M672L545k3026r412J3489J5356j0043k2704
$$ -6305 7047 9765 19600 29377 30377 35049 38594 15568 6156 19645 35001 24958 2254
7543B254j1008J4251P737p520J2989M9557O536m1381p886j804O206k007k3876
$$ 2254 -8754 5497 13234 5714 18703 68260 74796 33415 25529 23725 29931 27924 4048
7530D048j8612L1646L7364J646j6485k2393j1250k5204j6800n049J1670Q140J869
$$ 4048 -14564 17082 54446 56092 39607 17214 5964 -19240 -36040 -41089 -29419 -21279 -19410
7517a9410L9964K1380k9241m8348J619L0092K5024k1655k2171j9396m318K025
$$ -19410 20554 41934 12693 -35655 -34036 -3944 21080 -575 -22746 -42142 -46460 -44435
7505d4435K1643J8286J546n3455l2185N378l583K4259L1832r777M925L5748R117
$$ -44435 -22792 -4506 -2960 -56415 -88600 -83222 -86805 -62546 -30714 -40491 -35566 182 9299
7492I299n248j3108j8699K3469J86j0911J2037J882O968O777K1733J667j7992
$$ 9299 4051 -9057 -27756 -4287 -4101 -15012 -2975 -1093 5875 12652 34385 36052 18060
7479A8060Q962J2912L601J4885j137j8093k7860j5177m686r204l129J0522N391
$$ 18060 27022 39934 43535 58420 57283 39190 11330 -3847 -8533 -17737 -20866 -10344 -4953
7466d953J113j5496J4853J4954j0735j1309j5594k8117J2238J8859J9141P659
$$ -4953 -3840 -19336 -4483 10471 -264 -11573 -27167 -55284 -43046 -24187 -5046 2613
7454B613J4052J5038k1975p403J8126j3980J3863J1540k935r010J6654K9313J3853
$$ 2613 16665 31703 9728 2325 20451 6471 20334 31874 28939 19929 36583 65896 79749
7441G9749o159o064k5231r669n856J7393N583R64l2922j9087j0621j0363Q174
$$ 79749 73590 67526 42295 32626 26770 44163 49746 50710 17788 -1299 -11920 -22283 -14109
7428a4109N690K6636j3983j1977m435J1364J1466J3316J4907j3171k5787k5546
$$ -14109 -8419 18217 4234 -7743 -12178 -814 10652 23968 38875 25704 -83 -25629
7416b5629l1362j0488J7410M2276O604j6088k087Q473K3107K999l4426J3105O348
$$ -25629 -56991 -67479 -50069 -7793 -1189 -17277 -19364 -10891 12216 15215 -19211 -6106 242
7403B42M549l1184J6347L683p922m2645p429L1434J2460J0554M804j3667J0477
$$ 242 4791 -26393 -10046 -6363 -14285 -56930 -64359 -32925 -20465 -9911 -5107 -18774 -8297
7390h297k134J4920l4925l2651L7817J6562q104N457J8999J5319j2056k964R601
$$ -8297 -10431 4489 -30436 -63087 -25270 -8708 -16812 -11355 7644 22963 10907 7943 17544
7377A7544l7472j9270O401R698K6029q148p093K6625l3691k5504J2868J0734L935
$$ 17544 -19928 -39198 -32797 -23099 2930 -5218 -12311 14314 -19377 -44881 -32013 -21279 -17344
7364a7344K772J4932n762q942P081N3912J5819j489j7563j7276l819J3751j4531
$$ -17344 -14572 360 -5402 -14344 -7263 46649 62468 60979 43416 26140 22321 36072 21541
7351B1541J2935J0051l0649k9466J4548K1530J4732L7J1123R813m0977j826l3426
$$ 21541 34476 44527 13878 -15588 -1040 20490 35222 35259 46382 56195 15218 13392 -20034
7338b0034k8237O772K1415J6129P15j921P118j7899r262n139K4756J4552m509
$$ -20034 -48271 -41499 -20084 -3955 -3240 -5161 1957 -15942 -25204 -30343 -5587 8965 4456
7325D456j5168q647J590K9785p581p354o597j9111N389q412M109J3596l257j7596
$$ 4456 -10712 -19359 -17769 12016 4435 -2919 -9516 -28627 -23238 -31650 -27541 -13945 -17202 -34798
7311c4798m19J5490L3340K8728J1191k7857l2461K1060n79O09L1174k1964l5864
$$ -34798 -35217 -19727 13613 42341 53532 25675 -6786 14274 13695 14304 45478 23514 -12350
7298a2350j5885j5881m107K5579P364m0198j604J2769K9148K5209J1296p979K851
$$ -12350 -28235 -44116 -48223 -22644 -15280 -55478 -57082 -44313 -15165 10044 21340 13361 16212
7285A6212m652j4260P74R73n1655k2312K4372K9547n300j1364M448j2758m133
$$ 16212 11560 -2700 -1926 -953 -52608 -74920 -50548 -21001 -26301 -37665 -33217 -45975 -50108
7272e0108L3943K031k2073J3406j6363l043O81k3963j259L5860J8064K6334l6071
$$ -50108 -16165 -14134 -36207 -22801 -39164 -42207 -41526 -65489 -66748 -30888 -12824 13510 -22561
7259b2561r519J6964J746j2867J2237N0411J1146j5797j8230j9510j339P795o722
$$ -22561 -32080 -15116 -13370 -26237 -14000 36411 47557 31760 13530 -5980 -7319 476 -6246
7246f246K8201m771J0975o305j1149p480l1458j7459q61J468K376J7915o438l2746
$$ -6246 21955 17184 28159 21854 10705 3225 -28233 -45692 -46553 -45085 -42709 -24794 -31232 -63978
7232f3978L0887J6872K4943M5464n713k4213n773J0142O65k8893j276j5065j4580
$$ -63978 -33091 -16219 8724 54188 48475 24262 18489 28631 29296 403 -873 -15938 -30518
7219c0518K3021J3358p541l195N515j7712o534K1803J8093k6575j0018n417k56
$$ -30518 -7497 5861 -1680 -4875 640 -17072 -23606 -1803 16290 -10285 -20303 -25720 -25976
7206b5976Q981P737J9941J0668j9490j1591o065J2465J0254k265k1371J6940k288
$$ -25976 -16995 -9258 10683 21351 1861 -9730 -15795 -3330 6924 4659 -16712 228 -2060
7193b060j808J4871O543J255j5987j326j170j5654k915N729m0K2263J311j3994
$$ -2060 -3868 11003 17546 18801 2814 1488 318 -15336 -18251 -12522 -12562 9701 11012 -2982
7179b982k1940J7427r969P945K4637J8189m387N693q011l2855N707l373l3440
$$ -2982 -24922 -7495 -17464 -9519 15118 33307 28920 34613 26602 -6253 -546 -3919 -37359
7166c7359J6676K8544l35M203k0287K7932j2315n572N50M086l050j8983k9355
$$ -37359 -20683 7861 7526 11729 -8558 19374 7059 1487 2037 6123 3073 -15910 -45265
7153d5265k787L6072L30l1339J4235N868P270j2210K2820K5577j3251l0478J6786
$$ -45265 -48052 -11980 -11650 -42989 -28754 -22886 -15616 -27826 -5006 20571 7320 -23158 -6372
7140f372j7709m7788J4921J2071J8932J7888K7481J6475J69q225r030r025o324
$$ -6372 -24081 -71869 -56948 -44877 -25945 -8057 19424 35899 36068 27843 18813 9788 3464
7127C464k1935k4490l2365N565O551R699N526L1012L1515K4070j2414p623K3529
$$ 3464 -18471 -42961 -75326 -69761 -63210 -53511 -47985 -16973 14542 38612 26198 18575 42104
7114D2104P349j9207k7731k2593k2063R581P684K5932k7731m9232J0496L5922
$$ 42104 49453 30246 2515 -20078 -42141 -32560 -24876 1056 -26675 -75907 -65411 -29489
7102b9489J3507o381P773J7439o250L734k2135j9018q972J8813K3734k583r793
$$ -29489 -15982 -22363 -14590 2849 -3401 333 -21802 -40820 -49792 -30979 -7245 -9828 -19621
7089a9621l727J4238J9054J4546Q944J2981k2466j415m003N3o351M963o993k1082
$$ -19621 -23348 -9110 9944 24490 33434 46415 23949 22534 18531 18584 12233 17196 10203 -10879
7075a0879q450k81k1783J6784J2071P646J4035k2608k596j1480L3983R854K686
$$ -10879 -19329 -19610 -41393 -24609 -12538 -4892 9143 -13465 -16061 -27541 6442 16296 18982
7062A8982r528j5398L386p420K2057M2862J265m6116j6341r95K060O609l190K073
$$ 18982 9454 -5944 -2558 -9978 12079 54941 56206 10090 -6251 -7246 -5186 1423 -1767 306
7048C06L4412K4547p08n5391k4027j1766J2778J309O922l2959p204o899N56J3569
$$ 306 34718 59265 58557 3166 -20861 -32627 -19849 -18540 -11618 -44577 -51781 -58680 -58124 -44555
7034d4555m836M409l3j2748R810L0721J5850J6544J2314j4560J2584J4983n3350
$$ -44555 -49391 -44982 -45015 -57763 -47953 -17232 -1382 15162 27476 12916 25500 40483 -12867
7021a2867l5718J1593J1065K6640M889m8306j7601M254J9516J5123j0699K8734
$$ -12867 -48585 -36992 -25927 713 5602 -42704 -60305 -56051 -36535 -21412 -32111 -3377
7009c377j663K8888Q272l2154j0678J7762R527M1L105j5350P80J9521k0931J2785
$$ -3377 -5040 23848 32120 -34 -10712 7050 16577 16618 19723 4373 5153 24674 3743 16528
6995A6528k693m923R270M219K1621P908l6547m3504n533J2586J3204j345P338
$$ 16528 13835 8912 18182 22401 44022 51930 15383 -28121 -33654 -21068 -7864 -9209 -1871
6982a871j0411j569m738J3945L317k1610k624j8495j8613J1699N3598K24J0851
$$ -1871 -12282 -13851 -18589 -4644 -1327 -22937 -25561 -44056 -62669 -50970 2628 2852 13703
6969A3703P408k0873j6705P750J736J3946l5105j617o638L2331j1625J8322K2337
$$ 13703 21111 238 -16467 -8717 -6981 6965 -28140 -29757 -36395 -4064 -15689 2633 24970
6956B4970Q981k5371l8373P20L5017J4859Q593K719J8722p927k1289k5612Q706
$$ 24970 33951 8580 -29793 -29073 5944 20803 29396 32115 50837 42910 21621 -3991 4715
6943D715K4166O189j926J612L042j2932l9535J9041j458m4109N327K7801K9107
$$ 4715 28881 35070 33144 34756 37798 24866 -14669 4372 2914 -41195 -35868 -8067 21040
6930B1040J1879J1072j504j0990j8954j9028k3592k7489K7875J4625m2032O366
$$ 21040 32919 43991 42487 31497 12543 -6485 -30077 -57566 -29691 -15066 -57098 -50732
6918e0732M6805J134J557M637k5695R544M2294J9849m4049j4066j7779p949p630
$$ -50732 -3927 -2793 -1236 3401 -22294 -12750 29544 49393 5344 -8722 -26501 -34450 -42080
6905d2080o548M1111L3670k1881j1432q990J8035M6894K1828j9927k2574l1223
$$ -42080 -48628 -7517 26153 4272 -7160 -16150 1885 48779 70607 50680 28106 -3117
6893c117l0131p812j705L104K0926j9197j203K6290K7925P7r549j1811m605j3230
$$ -3117 -33248 -41060 -42765 -39661 -18735 -37932 -39135 -12845 15080 15157 5608 -6203 -10808 -24038
6879b4038p61q294Q353Q775l8253R424M614K3778q940J0590M514j2492k7267K2222
$$ -24038 -24799 -33093 -24740 -15965 -54218 -44794 -40180 -16402 -25342 -14752 -10238 -22730 -49997 -27775
6865b7775J1463Q459o571J4189O27J958p470p876J0068J0248L426J2735j954r597
$$ -27775 -16312 -7853 -14424 -235 392 2350 -5120 -12996 -2928 7320 10746 23481 21527 11930
6851A1930j0019m260J2449J6526K4731k2368m7902j2835k910J1706j2527Q60J3658
$$ 11930 1911 -2349 10100 26626 51357 28989 -18913 -31748 -34658 -22952 -35479 -34619 -20961
6838b0961R877p938k6614O178L3064K4168l546j8605m4489j011K4534j2563J4140
$$ -20961 -11084 -19022 -45636 -39458 -6394 17774 14228 -4377 -48866 -49877 -25343 -37906 -23766
6825b3766N5752L0035o514k8908o234O675q793k4196m460Q912L25L1503J3025
$$ -23766 31986 62021 55507 26599 20365 27040 18247 -5949 -10409 -1497 -1172 30331 43356
6812D3356l0278k5686l4325k2071K6625K0704J0558J0758j2020j1522J7084L1229
$$ 43356 13078 -12608 -46933 -69004 -42379 -21675 -11117 -359 -12379 -23901 -6817 24412
6800B4412J1754L597N788n677n999m1659l3919k1032M274L8636L0042O181m683
$$ 24412 36166 39763 45551 39874 33875 -7784 -41703 -62735 -58461 -19825 10217 16398 11715
6787A1715R014R971K3313k0548q048N469m36l708k5492q447j8171J0022l045l4903
$$ 11715 20729 30700 54013 33465 25417 30886 30450 26742 1250 -7197 -25368 -15346 -18391 -53294
6773e3294K8258M8853M179k1134K7283j4979k1600N059k1557j3319j954j2560
$$ -53294 -25036 23817 27996 6862 34145 19166 -2434 2625 -18932 -32251 -34205 -46765
6761d6765l278J4785r9J1014j0625J1752J8669j3963j5417J0564L5720P557j0039
$$ -46765 -50043 -35258 -35357 -24343 -34968 -23216 -4547 -18510 -33927 -23363 12357 19914 9875
6748I875J5356J4856j5368q692K011j6169j0273r349k9706k7819J8125J1120M0209
$$ 9875 25231 40087 24719 16027 18038 1869 -8404 -17753 -47459 -75278 -57153 -46033 -5824
6735e824j5343o681Q155K4732q963p821j7530j1044K566l872L0106M7870O939
$$ -5824 -21167 -27848 -19693 5039 -3924 -11745 -29275 -40319 -37753 -41625 -11519 36351 43290
6722D3290k3537m149o818J893m91j1500J1260M599k730l0659l2132J0004K956
$$ 43290 19753 15604 8786 10679 10188 -1312 9948 14547 11817 -18842 -50974 -40970 -38014
6709c8014p007J6817j2403l5336J5189L1912L0509J1368k0173j8178R957Q592
$$ -38014 -45021 -28204 -40607 -75943 -60754 -28842 1667 13035 -7138 -25316 -15359 -6767
6697f767J0174J9413o481l5590k8788J2859L4030J0317K748j8753K423K6671N967
$$ -6767 3407 22820 16339 -19251 -48039 -35180 -1150 9167 11915 -6838 -4415 22256 28223
6684B8223M626M193m682j2622J4498l483q18n353j2089j5148L096l718j4818m777
$$ 28223 32849 37042 32360 19738 34236 30753 29935 24582 12493 -2655 441 -3277 -18095 -22872
6670b2872N094L939R610j286k795L752j882j6351K504J1429O847J5078J0317l0188
$$ -22872 -17778 -13839 -4229 -5515 -8310 -4558 -6440 -22791 -20287 -8858 -2011 13067 23384 -6804
6656f804k8377L3282J7568j2509l1668P957L0326L1553j8726k7884P417P255K1313
$$ -6804 -35181 -1899 15669 3160 -28508 -20551 9775 41328 22602 -5282 2135 9390 30703
6643C0703j1811P008n200k6452j8905J8549J4593m6515k0864K0261L4304L1848
$$ 30703 18892 25900 20700 -5752 -24657 -6108 8485 -38030 -58894 -38633 -4329 27519
6631B7519J4975j6290k6154j5743q206N499K6376K3274j2162j3754j8701l472
$$ 27519 42494 26204 50 -15693 -23899 -18400 7976 31250 19088 5334 -13367 -16839
6619a6839j875L20m0159K1696N584j2116K683q936r3J8014K6043K9702J5073Q390
$$ -16839 -18714 -18394 -58553 -36857 -31273 -43389 -40706 -49642 -49735 -31721 -5678 24024 39097 47487
6605D7487R287k4852k6944O68j1369J894n807j8307l056R32K6215j6458O257J240
$$ 47487 56774 31922 4978 5646 -5723 -3829 -9636 -27943 -30999 -30067 -3852 -20310 -14053 -12813
6591a2813k977J3173j5650k2849L7081J8479j5109J2676j0111o498J4144j0046
$$ -12813 -15790 -2617 -18267 -41116 -4035 14444 -665 12011 1900 -4598 9546 -500
6579e00K4276L1819Q636p754j1219m2698j8994J173j3423j590J2377L1094j8702
$$ -500 23776 55595 64231 56477 45258 2560 -16434 -15261 -28684 -30274 -17897 13197 -5505
6566e505j5741R045K6652j699J3828j6539K735o408M590j4286K925j3385K2270
$$ -5505 -21246 -12201 14451 12752 26580 10041 12776 6368 10958 -3328 -403 -13788 8482
6553H482n264l8333m3366j0658N420K4108K9318J6724K6871M094j9198m683J5474
$$ 8482 3218 -35115 -78481 -89139 -83719 -59611 -30293 -13569 13302 17396 -1802 -6485 8989
6540H989K290P069N498J3151J1319j5897k5764m5321j2102J9473K7941K0848j5356
$$ 8989 11279 18348 23846 36997 48316 32419 6655 -38666 -50768 -31295 -3354 17494 2138
6527B138j9538k3640j2704K7964K4959R594J0622n444k2307K725j2867K48J5101
$$ 2138 -17400 -41040 -53744 -25780 -821 8773 19395 13951 -8356 -5631 -18498 -18250 -3149
6514c149J7143L6676j2703m9998m5001k312j2287L1872N3325Q130l94o962j838
$$ -3149 13994 50670 37967 -12031 -57032 -59344 -71631 -39759 13566 21696 21302 14340 12502
6501A2502J2686j9200j3780r721Q873k564L107K0510k2428m741j5017k2862l2678
$$ 12502 25188 5988 -7792 -17513 -8640 -11204 -8097 12413 -10015 -14756 -29773 -52635 -85313
6488h5313r782M497K0071K3273J5095O870J399K3366L6581K6954j3878l3739j3263
$$ -85313 -95095 -90598 -70527 -47254 -32159 -25289 -23890 -524 36057 63011 49133 15394 2131
6475B131M4695J759j6542o14j915o688q005k0668j5339k7082j6676K8122R145
$$ 2131 46826 48585 32043 31429 29514 22826 14821 -5847 -21186 -48268 -64944 -36822 -27677
6462b7677j0954j6263J3042K1698J667J7877r13k1913r488Q751k986Q214J2723
$$ -27677 -38631 -54894 -41852 -20154 -18487 -610 -1523 -23436 -32924 -24173 -27159 -18945 -6222
6449f222j3965l712j6127J0032j9503j4885J5985L4935j4231j5330K593J2208
$$ -6222 -20187 -23899 -40026 -29994 -49497 -64382 -48397 -13462 -27693 -43023 -40430 -28222
6437b8222K956M2864L401j520J0559M551k2424r390j5385k6397Q516P725J3896
$$ -28222 -25266 17598 20999 19479 30038 34589 12165 2775 -12610 -39007 -30491 -22766 -8870
6424h870k291j3466j0234q298J9552M4872J9350L955j1109l8639r854J7996j3623
$$ -8870 -11161 -24627 -34861 -43159 -23607 21265 40615 44570 33461 -5178 -15032 2964 -10659
6411a0659k7405O883K3683J0506n228P294r976j9952M509J2279k1295J3490r294
$$ -10659 -38064 -31181 -7498 3008 -2220 5074 -4902 -24854 -20345 -8066 -29361 -15871 -25165
6398b5165L230Q307L3151j0806j1667j7143j1007j865K9055R349l0323J1842L4305
$$ -25165 -21935 -13628 19523 8717 -2950 -20093 -31100 -32965 -3910 5439 -24884 -13042 21263
6385B1263N944p868P704m712K344k3299j1341J195K1122J4433l4109l4987j9261
$$ 21263 27207 19339 27043 22331 24675 1376 -9965 -8770 12352 26785 -7324 -42311 -61572
6372f1572J0177O881K6730K5006j0132Q8m473k2053j4539J1324N185J1900J1936
$$ -61572 -51395 -44514 -17784 7222 -2910 -2822 -7295 -29348 -43887 -32563 -27378 -15478 -3542
6359c542J9257j1620r361L417o985P642k574l6210J4006M8508J5274j1745j1659
$$ -3542 15715 4095 -5266 -1849 -8834 -1192 -3766 -39976 -25970 22538 37812 26067 14408
6346A4408K1188J1208K1477J3524n07l9726l5994j4900L5761R605M804o933n844
$$ 14408 35596 46804 68281 81805 81298 41572 5578 -9322 26439 36044 40848 33915 28071
6333B8071L231k2074O624J6149j9742j4298K4689l540m1776n29L6694K1786r187
$$ 28071 31302 9228 15852 32001 12259 -2039 22650 19110 -22666 -23195 13499 35285 26098
6320B6098K112M261O56O447P869k5509m948L4491K098j2656l0576j4653K0402
$$ 26098 28210 32471 33127 39574 47443 21934 16986 51477 53575 40919 10343 -4310 16092
6307A6092L396n396j0893j3386j2952L000R404J1486j0677L022j8887K0664L255
$$ 16092 19488 14092 3199 -10187 -23139 -20139 -10735 751 -9926 -6904 -25791 -5127 -1872
6294a872L5945N874p266j1004j1492J2610j4458J3468j1311j1399j2590q225J8257
$$ -1872 34073 39947 32681 21677 10185 22795 8337 21805 10494 -905 -13495 -21720 -3463
6281c463M3467N92j4737k4515j3050M300K8283N251j0505k1919l186m909o796
$$ -3463 40004 40596 25859 1344 -11706 -7406 20877 26128 15623 -6296 -9482 -14391 -21187
6268b1187K0947M652k0902k426M031J0668k3802n078J716n809P578j0479P403
$$ -21187 -240 4412 -16490 -18916 -14885 -4217 -28019 -33097 -31381 -37190 -29612 -40091 -32688
6255c2688n234q819p427J0456K7105L423l353K9287J482n189k8866k8715L0527
$$ -32688 -37922 -46741 -54168 -43712 -16607 -13184 -16537 12750 14232 9043 -19823 -48538 -18011
6242a8011J9974J018J3034K688M854J9294l2547l0020p770q515M4016l079m5361
$$ -18011 1963 2981 16015 18703 23557 42851 10304 -19716 -27486 -36001 8015 4936 -40425
6229d0425k2182O697K2803N5495j5018j1896K913J1489M917j3471p399k1300L0853
$$ -40425 -62607 -55910 -33107 22388 7370 -4526 -1613 9876 14793 1322 -6077 -27377 3476
6216C476M3499Q41l3730k9750o967L2869O337r419L0991j559J3935j2535K358
$$ 3476 46975 47816 14086 -15664 -22631 10238 16575 7156 38147 36588 50523 37988 40346
6203D0346M185j6471j9778k7931L2036P225m6976k9442J7421K4785J6355m093
$$ 40346 44531 28060 8282 -19649 12387 19612 -27364 -56806 -39385 -14600 1755 -2338
6191b338l7687O225J9120m590n151n265J1207K340o391j0174P240n586R516L1841
$$ -2338 -40025 -33800 -14680 -19270 -24421 -29686 -18479 -16139 -22530 -32704 -25464 -31050 -21534 10307
6177A0307K1541k2133L91Q363j1025l0607k4844K5820J2933J338Q061J0164j864
$$ 10307 31848 9715 10106 18469 7444 -23163 -48007 -22187 -9254 -7916 145 10309 8445
6164H445k303r655M22o48Q723r349l5815M983r159k226L2169j0045O800K1337
$$ 8445 6142 -3513 -3091 -3739 4984 -4365 -40180 -35197 -44356 -46582 -14413 -24458 -17658 3679
6150C679P507K588k5738j9643p343k7396k9973K2309L0712J8773J2464k6126m404
$$ 3679 11186 13774 -11964 -31607 -38950 -66346 -96319 -74010 -43298 -24525 -12061 -38187 -42591
6137d2591K0399j9884L1636J670J0772L3196K8700j4945r715K2759J9107l9924
$$ -42591 -22192 -42076 -10440 -8770 2002 35198 63898 48953 39238 61997 81104 41180
6125D1180j3594M190o520p960k5358m2561L3507M2376j662k122q412j6309l9927
$$ 41180 27586 31776 25256 17296 -8062 -50623 -17116 25260 23598 21476 13064 -3245 -43172
6112d3172r957j487L3347J0726k992L5712j1681L176l5979k0424K0136M2328p917
$$ -43172 -53129 -54616 -21269 -10543 -13535 22177 10496 13672 -22307 -42731 -22595 19733 11816
6099A1816l3224J3023j5485L882k405J2995j1653j1649K0712J8927j6248J0247
$$ 11816 -21408 -8385 -23870 -19988 -22393 -9398 -21051 -32700 -11988 6939 -9309 938
6087I38J8313J6586J5347j7707j0007j7580j0526j2991j793J4276q842j9702k0037
$$ 938 19251 35837 51184 33477 23470 5890 -4636 -17627 -19420 -5144 -13986 -33688 -53725
6074e3725j5215M085M3439K7386Q639l6530l749L4948J1173j7632k63J923Q471
$$ -53725 -68940 -64855 -21416 5970 14609 -21921 -25670 9278 20451 2819 2556 4479 12950
6061A2950j9380m6184n440K5569k7585j4984K5202K567M0356K1476j9889j157
$$ 12950 -6430 -52614 -58054 -32485 -60070 -75054 -49852 -47285 -6929 14547 -5342 -6499
6049f499n554k5525R274N8033k550k1085Q225j3291K2944l4772L170J1504p291
$$ -6499 -12053 -37578 -28304 29729 27179 6094 14319 1028 23972 -10800 -7630 3874 -3417
6036c417N844K5102J8571O450j6159k311K3288j6321l9682l0848j0963K2999J1262
$$ -3417 2427 27529 46100 52550 36391 34080 57368 41047 1365 -29483 -40446 -17447 -6185
6023f185J0110J1729k6337k2811n613J2400p04k1065M982j6638K2659k59K627
$$ -6185 3925 15654 -10683 -33494 -39107 -26707 -27411 -48476 -43494 -60132 -37473 -37732 -35105
6010c5105K0009j9626j840j9685k318P550N706L3617K3388l3242k0556J759J0499
$$ -35105 -15096 -34722 -36562 -56247 -58565 -51015 -45309 -11692 11696 -21546 -42102 -40343 -29844
5997b9844J2538k0543q715J8972N0167J4306j4343l0576k1797n031J9033J5893
$$ -29844 -17306 -37849 -46564 -27592 22575 36881 22538 -8038 -29835 -34866 -15833 60
5985F0j950m674J0696K968j3273L102J9054M909j0326o863k6919q617K214K1505
$$ 60 -1890 -6564 4132 7100 -6173 -3071 15983 20892 10566 3703 -23216 -31833 -29619 -8114
5971h114k8242j1552R942R704j3582J2819L5453J5558k5385k1797J6864K315L2403
$$ -8114 -36356 -47908 -37966 -28262 -41844 -29025 6428 21986 -3399 -25196 -8332 -6017 26386
5958B6386p584l3231k9036R58n514j659R06J082R87J8465J2174J5500J5669n60
$$ 26386 18802 -14429 -43465 -42507 -48021 -49680 -48774 -47692 -46705 -28240 -16066 -566 15103 14543
5944A4543k725q02O150K373m2618l8000M0600M3066n446k6660J657J6625m671
$$ 14543 11818 11016 17166 19539 -23079 -61079 -20479 22587 17141 -9519 -7862 8763 4092
5931D092l4573j1375R848J5607J4659K3622j3744j7716p028Q793k0364k2565K2267
$$ 4092 -30481 -41856 -32008 -16401 -1742 21880 8136 -9580 -16608 -7815 -28179 -50744 -28477
5918b8477J5658K125K4793j3827K028K1377P783j3546k4312l964r012j76J8875
$$ -28477 -12819 -10694 14099 272 2300 23677 31460 17914 -6398 -10362 -19374 -19550 -675
5905f75J9785K1773J464j8048j0838j0179P142q739j3229k542K308J5809k6256
$$ -675 19110 40883 42347 24299 13461 3282 10424 1685 -11544 -14086 -11778 4031 -22225
5892b2225k562j8196J7507J3575J5674L5694j9157l8389N345L9195o6j7117m0702
$$ -22225 -24787 -42983 -25476 -11901 3773 39467 20310 -18079 -12734 26461 26395 9278 -31424
5879c1424j095O704J8591K5385p294J0975p663J2879K356m589m1621j8354L1960
$$ -31424 -32519 -25815 -7224 18161 10867 21842 14179 27058 29414 24825 -16796 -35150 -3190
5866c190J8661j3361l644j2783l271J7598j1041L312m557K3184l8860k2651K5909
$$ -3190 15471 2110 -1534 -14317 -17588 10 -11031 -7719 -12276 10908 -27952 -50603 -24694
5853b4694L5423K2141j1981m5173k461P392R091M698L16j8706N696K1315L5507
$$ -24694 10729 32870 20889 -24284 -26745 -19353 -10262 -5564 -5248 -23954 -18258 3057 38564
5840C8564p670Q81j5417j57l9022J0574L0541o660J9672O568m7483j4248j8972
$$ 38564 30894 31775 16358 16201 -22821 -12247 18294 11634 31306 37874 -9609 -23857 -42829
5827d2829l3879J5950O571R579O973J6000j721k1797l0329q99K2649p142j5676
$$ -42829 -76708 -60758 -54187 -44608 -37635 -21635 -23356 -45153 -75482 -76381 -53732 -60874 -76550
5814g6550n400K2999K1266K9916j2138J3057J0614j2105j850N187r809k9693M688
$$ -76550 -81950 -58951 -37685 -7769 -19907 -6850 3764 -8341 -10191 -5004 -14813 -44506 -39818
5801c9818R177J1838J8976k313J5598J0390O57j2979m601N147L110j85l3972r449
$$ -39818 -30641 -18803 173 -2140 13458 23848 24505 11526 6925 12072 15182 14997 -18975 -28424
5787b8424N036k8850j1751K3488K3158l212j0118k241J9730m444r386K1359j0517
$$ -28424 -23388 -52238 -63989 -40501 -17343 -20555 -30673 -32914 -13184 -17628 -27014 -5655 -16172
5774a6172r305L0737k0015l5673r572K8951M738j0920k216J3467O099J8266K8724
$$ -16172 -25477 5260 -14755 -50428 -60000 -31049 -26311 -37231 -39447 -25980 -19881 -1615 27109
5761B7109j3622j42l4419m9603J1322L3385K7800J8239K070j8445r429J834j2842
$$ 27109 13487 13345 -21074 -70677 -59355 -25970 1830 20069 22139 3694 -5735 -3901 -16743
5748a6743m35L4976J7853M904J171N631L4048l4186k4615K0690O997l3931O713
$$ -16743 -17178 17798 35651 40555 41726 47357 81405 47219 22604 43294 50291 16360 23073
5735B3073O304J494n369n8265J34L5028J0094j6054k0184l5090l904M3491J4856
$$ 23073 29377 30871 25502 -32763 -32629 2399 12493 -3561 -23745 -58835 -62739 -19248 -4392
5722d392j749K3016K520k3972P217R137K7684L1052l0689j1772k3631j9602M391
$$ -4392 -6141 16875 19395 -4577 2640 11777 39461 70513 39824 28052 4421 -15181 -10790
5709a0790k7022o584K7315R417J2406k110j9954k3062l691K0159K1948L2519Q842
$$ -10790 -37812 -44396 -17081 -7664 4742 2632 -17322 -40384 -44075 -23916 -1968 30551 39393
5696C9393j3707l1723m477k914P035J1647j3718k1870k8969K200k3227K9644L1944
$$ 39393 25686 -6037 -10514 -13428 -6393 5254 -8464 -30334 -59303 -57103 -80330 -50686 -18742
5683a8742l2584J781J4315L2848J9182J6062j388j1542K2074J5721n429k452k4050
$$ -18742 -51326 -49545 -35230 -2382 16800 32862 31474 19932 42006 57727 52298 49846 25796
5670B5796j3527j2160L661o705j6354P203j7995L0643J6814k3399l7646n117K3167
$$ 25796 12269 109 3770 -2935 -19289 -12086 -30081 562 17376 -6023 -43669 -48786 -25619
5657b5619K445o025R918J2892r789j1747m200L0094L078o440J803K2495j9764
$$ -25619 -23174 -29199 -19281 -6389 -16178 -27925 -32125 -2031 1047 -5393 -3590 18905 -859
5644h59l2012k582M306K1339L865m440J3164M421j3195m132q784J7422M377k53
$$ -859 -32871 -35453 -31147 -9808 -5943 -10383 2781 7202 -5993 -10125 -18909 -1487 2890 2637
5630B637J216j5448L9979J6785j1113k7425j042P840K647k0298n489p179j432
$$ 2637 3853 -11595 28384 45169 34056 6631 5589 13429 16076 -4222 -9711 -16890 -18322
5617a8322j5551J5280K1606J8087K4286k9168j7596o053r402k2736n838J1455
$$ -18322 -33873 -18593 3013 21100 45386 16218 -1378 -7431 -16833 -39569 -45407 -33952
5605c3952q670J4080J6056J2776J4421j922k667j2302j7676m335K2738j0562j4768
$$ -33952 -42622 -28542 -12486 290 14711 12789 10122 -2180 -19856 -24191 -1453 -12015 -26783
5592b6783k1211R63K7863k492q933m395Q711K4578L4666j0859k1276l4087Q097
$$ -26783 -47994 -47031 -19168 -21660 -30593 -34988 -26277 -1699 32967 22108 832 -33255 -25158
5579b5158K0503j689K638j6818K828J93l5363R44L2136K4292J3858k331o993L697
$$ -25158 -4655 -6344 -3706 -20524 -17696 -17503 -52866 -51922 -19786 4506 18364 16033 9040 12737
5565A2737j4935j2141j3856J0831K3591K025k2623k7746O391P583j4719P304M070
$$ 12737 -2198 -14339 -28195 -17364 6227 8252 -14371 -42117 -35726 -28143 -42862 -35558 -31488
5552c1488O967N188j2767j909J6866L5534J8142j73j1069J677j8205o889J8520
$$ -31488 -24521 -19333 -32100 -34009 -17143 18391 36533 36360 25291 26968 8763 1874 20394
5539B0394K1359j6040r079l1806K087J292j431K767o515j6137J4073L647M4354
$$ 20394 41753 25713 16634 -15172 -13085 -11793 -13224 -10457 -16972 -33109 -19036 -15389 28965
5526B8965J8232l2259l0434J0322O674k3804k1855K867J3845L2011R97m1470k0905
$$ 28965 47197 14938 -15496 -5174 1500 -22304 -44159 -41292 -27447 4564 5561 -35909 -56814
5513e6814M813L7170Q726q023j4019l5993o698R545M66K8082L7601m817j3187
$$ -56814 -52001 -14831 -6105 -14128 -28147 -64140 -70838 -61293 -60827 -32745 4856 39 -13148
5500a3148k2092j6811J2657L546J4671r328K5212q186k3305K2377K3453kJ466
$$ -13148 -35240 -52051 -39394 -35848 -21177 -30505 -5293 -13479 -36784 -14407 9046 9044 10510
5487A0510J0569j1481j343m8745J718l753J2725j7075J1467p403o41L1649p478
$$ 10510 21079 9598 8255 -40490 -38772 -42525 -29800 -46875 -35408 -42811 -43452 -11803 -19281
5474a9281o268J4651J0425K269r301j8657j3243J6021K120j35M71J2770L1706
$$ -19281 -25549 -10898 -473 1796 -7505 -26162 -39405 -23384 -21264 -21399 -20928 -8158 23548
5461B3548M410l2412m748J1586k3049j3839J5918L1464J1481k858n377j480M3002
$$ 23548 27958 -4454 -9202 2384 -20665 -34504 -18586 12878 24359 21501 16124 14644 57646
5448E7646J2205j4250l4768M515k0919j3545r894J690j5190K4455L0947K040K4534
$$ 57646 69851 55601 20833 25348 4429 -9116 -19010 -17320 -32510 -8055 22892 24932 49466
5435D9466k0748k7492j3612J9905N158k6732l211Q679O549Q948J1643k6718j6588
$$ 49466 28718 1226 -12386 7519 12677 -14055 -17266 -8587 -2038 6910 18553 -8165 -24753
5422b4753M089j4431J0629N2183M1383q880k7486K726J6165m4252l5494R231J5082
$$ -24753 -20664 -35095 -24466 27717 69100 60220 32734 35460 51625 7373 -28121 -18890 -3808
5409c808J0211k2373k3523L1p290k482p724J1607Q627J2706J2500j5247l097J4118
$$ -3808 6403 -15970 -39493 -39462 -46752 -49234 -56958 -45351 -36724 -24018 -11518 -26765 -29862 -15744
5395a5744N184j6585j0838K2834P391k545j1950L352L544L397J4979j555k6602
$$ -15744 -10560 -27145 -37983 -15149 -7758 -10303 -22253 -18901 -15357 -11960 3019 1464 -25138
5382b5138N304N315J6477K8186j2438j2113q809J6245J9350J6564j1888k008j1803
$$ -25138 -19834 -14519 1958 30144 17706 5593 -3216 13029 32379 48943 37055 35047 23244
5369B3244K468J4543j0281l989j216K1492m553j2396m6218l0661O424J1073J6936
$$ 23244 25712 40255 29974 25985 24769 46261 41708 29312 -16906 -47567 -41143 -30070 -13134
5356a3134K106K103m291J704K2305J431j3697k2024n607L1674P338J0649K087
$$ -13134 -11028 -8925 -13216 -11512 10793 12224 -1473 -23497 -29104 2570 9908 20557 22644
5343B2644L0151J9273k7084k2950j7230M139L1861K3301l8858m1896j357l718
$$ 22644 52795 72068 44984 22034 4804 8943 40804 64105 25247 -16649 -18006 -21724
5331b1724q22j6965R070K5758J018J4716q953m6312M708K9983J0948J9937K7226
$$ -21724 -22546 -39511 -30441 -4683 -3665 11051 2098 -44214 -39506 -9523 1425 21362 48588
5318D8588M116l7253q921L0278q040l1740n40l7910K688L0752M8932M722m2201
$$ 48588 52704 15451 6530 36808 28768 -2972 -3512 -41422 -38734 -7982 40950 45672 3471
5305C471N031m175l3437J3182k915J9751L257J3495K024p211j0801Q119k750l6849
$$ 3471 8502 4327 -29110 -15928 -18843 908 4165 17660 19684 12473 1672 9791 7041 -29808
5291b9808J3360K1015j4635j3849o373J7523K0973J008K573k0579j82K4012M4345
$$ -29808 -16448 4567 -10068 -23917 -30290 -12767 8206 9214 11787 -8792 -8974 15038 59383
5278E9383p079k489j4547l5410j7005O111J2253j2854j6916l97K5135M6293q481
$$ 59383 52304 49815 35268 -142 -17147 -11036 1217 -11637 -28553 -28950 -3815 42478 33997
5265C3997m262j2414j5074j6787j2129J9491J3144J2052j5688l0280n918p80M4403
$$ 33997 29735 17321 2247 -14540 -26669 -7178 5966 18018 2330 -27950 -33868 -34648 9755
5252I755R488j4269o020j5216l477M800K7866q532p280J8462J8529k0480p616
$$ 9755 19243 4974 -1046 -16262 -19739 -14939 12927 4395 -2885 15577 34106 13626 6010
5239F010j5408n305k697M939j4991j6488J964L4156J6808m33r086k3645Q078L4605
$$ 6010 -9398 -14703 -17400 -12461 -27452 -43940 -41976 -7820 8988 8555 -531 -24176 -16098 18507
5225A8507P541J3179l643k9076k720m045K6954j8919J272k14r85Q055k2341j8209
$$ 18507 26048 39227 35584 6508 3788 -257 26697 7778 9050 8836 7851 15906 -6435 -24644
5211b4644L0110R135j7513J0858J0166M115L736J0627K5152m4086l3281J0299
$$ -24644 5466 14601 -2912 7946 18112 22227 25963 36590 61742 17656 -15625 -5326
5199e326L6334n536r981j7311k4847l1471l675k030K2689L31n956L5547k455j4623
$$ -5326 31008 25472 15491 -1820 -26667 -58138 -61813 -63843 -41154 -40823 -46779 -11232 -13687 -28310
5185b8310j1591j173L790k6003K5894O53q79Q773J558M084M1950j4503O868J5325
$$ -28310 -39901 -41074 -37284 -63287 -37393 -36740 -37619 -28846 -27288 -23204 18746 4243 11111 26436
5171B6436n267Q656l744j8258j1293j1280N622j7952J3000J6397J3059Q689m372
$$ 26436 21169 29825 26081 7823 -3470 -14750 -9128 -27080 -14080 2317 15376 24065 19693
5158A9693p855k0087L151J9180k0225k1246q308J0128J5769j4076J82L27m18j4746
$$ 19693 11838 -8249 -5098 14082 -6143 -27389 -35697 -25569 -9800 -23876 -23694 -23367 -23785 -38531
5144c8531K998K4316j4669K0730L0321j416m3179q191M0090J3801M064j3825j4117
$$ -38531 -35533 -11217 -25886 -5156 25165 23749 -19430 -27621 12469 26270 30334 16509 2392
5131B392K0852j308N230M5871K3854k7678m5714l3403j9451J8443j337k0769L249
$$ 2392 23244 21936 27166 73037 96891 69213 23499 -9904 -29355 -10912 -12249 -33018 -29769
5118b9769J1030Q010j1770m942K4223R854M65K3227K3937j8821k7914R287K6298
$$ -29769 -18739 -10729 -22499 -27441 -3218 6636 7101 30328 54265 35444 7530 16817 43115
5105D3115j1749k0473J3507M2466j996m4731k1858K163p695J1411J0627n170k1982
$$ 43115 31366 10893 24400 66866 64870 20139 -1719 444 -7251 4160 14787 9617 -12365
5092a2365K6219K8315q484p407J2127K1693j3111m5594l4829m857J1874N0183
$$ -12365 13854 42169 33685 26278 38405 60098 46987 1393 -33436 -38293 -26419 23764
5080B3764O695J8481k3707m0492l3991m984K4971L2933Q908Q759O183N147O55
$$ 23764 30459 48940 25233 -15259 -49250 -54234 -29263 3670 12578 21337 27520 32667 33322
5067C3322k4976j7005R500Q057j8665R808M2884K8290o238j3639n924k1252r215
$$ 33322 8346 -8659 841 8898 -9767 41 42925 71215 64977 51338 45414 24162 14947
5054A4947k0769J5835P862k6794m875M6979J2521j4599k162k6845j9680K185m843
$$ 14947 -5822 10013 17875 -8919 -13794 33185 45706 31107 28945 2100 -17580 -15395 -20238
5041b0238j60L048O596J6392N024j434j2358l6214M6581K8511r703l4813M613
$$ -20238 -20398 -17350 -10754 5638 10662 9228 -3130 -39344 7237 35748 26045 -8768 -4155
5028d155j4277K5718m631M588j5966R85J954R723r572Q581P970p492j4846j5574
$$ -4155 -18432 7286 2655 7243 -8723 -7738 -5784 3939 -5633 2948 10918 3426 -11420 -26994
5014b6994P992K9691O897l1420k4314N271K9859J6193m780p923j2618k074M731
$$ -26994 -19002 10689 17586 -13834 -38148 -32877 -3018 13175 8395 472 -12146 -14220 -9489
5001i489J1515K2098J5672Q542k0138j9879J9562N199l2129o128J2715n377m0243
$$ -9489 2026 24124 39796 48338 28200 8321 27883 33082 953 -5175 7540 2163 -38080
4988c8080J038M342K9981L8610l525k70j2839n686L2007J1745j6409J949J7132
$$ -38080 -37042 -32700 -2719 35891 32366 32096 19257 13571 45578 57323 40914 42863 59995
4975E9995k2520m691J0773l320j1487k8088N266J7881J3535J0653k0974j9878
$$ 59995 37475 32784 43557 40237 28750 662 5928 23809 37344 47997 27023 7145
4963G145q583P53r214L625l9227j1671M2071L6952j6059j4375j9315J6188K5606
$$ 7145 -1438 -685 -9899 -6274 -45501 -57172 -15101 21851 5792 -8583 -27898 -11710 13896
4950A3896R818j4948o183k1345j412o699J5856K9622k181l401j3456j2739N888
$$ 13896 23714 8766 2583 -18762 -20174 -26873 -11017 18605 16424 13023 -433 -13172 -7284
4937g284l637p202j843m346m708r705l487M48K9076J0367q155R257J613q695j5479
$$ -7284 -10921 -18123 -19966 -24312 -29020 -38725 -42212 -41764 -12688 -2321 -10476 -1219 394 -8301 -23780
4922b3780k2087n838k306K3158K1286k091j1977j4336J1240K1481J1660j5991
$$ -23780 -45867 -51705 -54011 -30853 -9567 -11658 -23635 -37971 -26731 -5250 6410 -9581
4910i581k3047j2574j2381K0698L5926K3572j0793k0175k4388j8017o157J6741
$$ -9581 -32628 -45202 -57583 -36885 -959 22613 11820 -8355 -32743 -50760 -56917 -40176
4898d0176P323Q857M392J6535L0870J066k871J8857k8167j1557j2481L2272j4941
$$ -40176 -32853 -23996 -19604 -3069 27801 28867 25996 44853 16686 5129 -7352 24920 9979
4885I979O571P372J440J089o667q383p217J9378K6m566j7501P958j4771k584j0289
$$ 9979 16550 23922 25362 26451 19784 11401 4184 23562 23588 19022 1521 9479 -5292 -7876 -18165
4870a8165R640J9372J8879j9035l7714O297J3292j1098m704L4178J1077m87j6382
$$ -18165 -8525 10847 29726 10691 -27023 -20726 -7434 -18532 -23236 10942 22019 21532 5150
4857E150k3521J0995K7076J5624P639k966j4671r774j377p980K3569L788J9436
$$ 5150 -18371 -7376 19700 35324 42963 39997 25326 15552 14175 6195 29764 33552 52988
4844E2988k6946n5403r643N883J734L3981P060K5856K1091j3156j2903M432m441
$$ 52988 26042 -29361 -39004 -33121 -31387 2594 9654 35510 56601 43445 30542 34974 30533
4831C0533r529j6329l3094k0615N0713J3160k8037k1370R769j8156R325j191j3923
$$ 30533 21004 4675 -28419 -49034 1679 14839 -13198 -34568 -24799 -42955 -33630 -34821 -48744
4818d8744L519L5835L3524j4200m912J1064J5566l0541l7688J5538J2656K7107
$$ -48744 -45225 -9390 24134 9934 5022 16086 31652 1111 -36577 -21039 -8383 18724
4806A8724J6555q436j8737k205K3181P991j5307k0232q413L013M6539M3647l3368
$$ 18724 35279 26843 8106 5901 29082 37073 21766 1534 -6879 -3866 42673 86320 52952
4793E2952m8037j7357K5581K5932p599j1436J3395L504M631K129j5481l0527k1044
$$ 52952 4915 -12442 13139 39071 31472 20036 33431 36935 41566 43695 28214 -2313 -23357
4780b3357R191j6579O69O058K5924J2508j6741m0954J473L0857n63J0296q628
$$ -23357 -14166 -30745 -30076 -24018 1906 14414 -2327 -43281 -41808 -10951 -11514 -1218 -9846
4767i846J6654K3015J8367r579j5301j4435k8240j772J1954J1056l5209K1472
$$ -9846 6808 29823 48190 38611 23310 8875 -19365 -21137 -9183 1873 -33336 -11864
4755a1864L6970N620r970j3254j2605m031J1567p0j5014L971m805K9779l72J990
$$ -11864 25106 30726 20756 7502 -5103 -9134 2433 2363 -12651 -8680 -13485 16294 15922 17912
4741A7912k5191j6150j3921j2240j8896R052L1737P494j4046P68q46K422N108
$$ 17912 -7279 -23429 -37350 -49590 -68486 -59434 -27697 -20203 -34249 -33481 -34327 -31905 -26797
4728b6797R522j1208j0580P485K8950p764n84j0229o660j0753m641q193k5335
$$ -26797 -17275 -28483 -39063 -31578 -2628 -10392 -10976 -21205 -27865 -38618 -43259 -51452 -76787
4715g6787N728l882K1888M9966k384l1131N51l3672j7383J9165K6620J8370K1945
$$ -76787 -71059 -74941 -53053 -3087 -5471 -36602 -36051 -69723 -87106 -67941 -41321 -22951 -1006
4702a006Q794r590J7730m441j8399l1682o969j1381j2527n83K3573J9060k2887
$$ -1006 7788 -1802 15928 11487 -6912 -38594 -45563 -56944 -69471 -70054 -46481 -27421 -50308
4689e0308J939j7772k657K8942K4194Q41J0213O351K7749P681o126j4511m0589
$$ -50308 -48369 -66141 -68798 -39856 -15662 -14821 -4608 1743 29492 37173 31047 16536 -24053
4676b4053j9898j1682j5500N450L5340L6688R769l257m007k5423q423K9587k221
$$ -24053 -43951 -55633 -71133 -65683 -30343 6345 16114 12857 8850 -16573 -24996 4591 2370
4663B370j9687o971N499J0778j8815k5359m302K2060J4369J0484r645k7639K3712
$$ 2370 -17317 -24288 -18789 -8011 -26826 -52185 -56487 -34427 -20058 -9574 -19219 -46858 -23146
4650b3146N117j0656L917o197O379L0602K6064p887O101k939P453m3845l7242
$$ -23146 -18029 -28685 -24768 -30965 -24586 6016 32080 24193 30294 27355 34808 -9037 -46279
4637d6279j8853L461J2269p719q791J4577J5123J8354J4912L1323n287l9718k4396
$$ -46279 -65132 -61671 -49402 -57121 -65912 -51335 -36212 -17858 -2946 28377 23090 -16628 -41024
4624d1024N244L2710J6791M80j5752n797j9033o424k7465J0719L144J7898J9035
$$ -41024 -35780 -3070 13721 14201 -1551 -7348 -26381 -32805 -60270 -49551 -46407 -28509 -9474
4611i474k5831o473L3690J8480k263J2732k0515k6469J834j5134K1709L3563K3508
$$ -9474 -35305 -41778 -8088 10392 8129 20861 346 -26123 -24289 -39423 -17714 15849 39357
4598C9357q939k041k0750J0790j308k455J6044k2272k4046j5641J8290K1553m1005
$$ 39357 30418 28377 7627 18417 17109 14654 30698 8426 -15620 -31261 -12971 8582 -32423
4585c2423N873O24j6411k8106J9723k2032r942J0688L7082Q017r533P727J5062
$$ -32423 -26550 -25926 -42337 -70443 -50720 -72752 -82694 -72006 -34924 -26907 -36440 -28713 -13651
4572a3651J9274k309k2721J4364l670k343P623L0032l356j1658L577K1524k7891
$$ -13651 5623 3314 -19407 -5043 -8713 -11056 -3433 26599 23243 11585 15162 36686 8795
4559H795k1537J8820r250o172j0282O606P787p377R735m464j4060q104J2486K9089
$$ 8795 -12742 6078 -3172 -9344 -19626 -13020 -5233 -12610 -2875 -7339 -21399 -29503 -17017 12072
4545A2072K195P275o243j9039k6397j3218J2287k515m844J0325j8266M085J1562
$$ 12072 14267 21542 15299 -3740 -30137 -43355 -31068 -33583 -38427 -28102 -46368 -42283 -30721
4532c0721J3365K326n733J3604j2053k688K0409K7854j415q004j0602L3577m024
$$ -30721 -17356 -15030 -20763 -7159 -19212 -21900 -1491 26363 24948 16944 6342 39919 35895
4519C5895k7806j7404r448n591R903J3571k1897Q596k264J5862J5037k817M961
$$ 35895 8089 -9315 -18763 -24354 -14451 -880 -22777 -14181 -16445 -583 14454 11637 16598
4506A6598J242Q721L516l9445n6200m675J3270K3733J4731O144J2989J1622O510
$$ 16598 17840 26561 30077 -9368 -65568 -70243 -56973 -33240 -18509 -12365 624 12246 18756
4493A8756J236m3125m1900m940M1324L683J6138J3267L0986K7221j8317j7137
$$ 18756 19992 -23133 -65033 -69973 -28649 -24966 -8828 4439 35425 62646 44329 27192
4481B7192j7179j3541j349Q936l064J3445K9109k0348j7690J982J3672n271j0609
$$ 27192 10013 -3528 -4877 4059 995 14440 43549 23201 5511 7493 21165 15894 5285
$$ [...]
##END NTUPLES=NMR SPECTRUM
##END=
