##TITLE=Analysis number 316412
Compound Code ac 34441
Project Code adrs
Chemist Name new century
##JCAMPDX= 6.0         $$ Bruker NMR JCAMP-DX V2.0
##DATA TYPE= NMR SPECTRUM
##DATA CLASS= NTUPLES
##ORIGIN= Bruker BioSpin GmbH
##OWNER= nmr
$$ XWIN-NMR		Version 3.5
$$ Fri Jan 13 09:53:52 2006 GMT Standard Time (UT+0h)  MAYBRIDGE\nmr@NMR_250MHZ
##.OBSERVE FREQUENCY= 250.131544655141
##.OBSERVE NUCLEUS= ^1H
##.ACQUISITION MODE= SIMULTANEOUS (DQD)
##.ACQUISITION SCHEME= undefined
##.AVERAGES= 16
##.DIGITISER RES= 18
##SPECTROMETER/DATA SYSTEM= dpx250
##.PULSE SEQUENCE= zg30
##.SOLVENT NAME= DMSO
##.SHIFT REFERENCE= (INTERNAL, DMSO, 0, 16.522)
##AUDIT TRAIL= $$ (NUMBER, WHEN, WHO, WHERE, WHAT)
$$ ##TITLE= Audit trail, XWIN-NMR		Version 3.5
$$ ##JCAMPDX= 5.01
$$ ##ORIGIN= Bruker BioSpin GmbH
$$ ##OWNER= nmr
$$ C:\u/data/dgb/nmr/ADRS/14560/pdata/1/auditp.txt
$$ ##AUDIT TRAIL=  $$ (NUMBER, WHEN, WHO, WHERE, WHAT)
(   1,<2006-01-13 09:52:58.57 +000>,<MAYBRIDGE\nmr>,<NMR_250MHZ>,
      <created by zg, POWCHK disabled, PULCHK disabled
       configuration hash MD5:
       62 19 C7 07 E1 42 D1 B7 37 6C 3D D0 77 39 F9 E6
       data hash MD5: 64K
       7E 31 73 9A 03 B2 B9 26 28 B2 D6 DC 7A F1 53 91>)
(   2,<2006-01-13 09:53:22.57 +000>,<MAYBRIDGE\nmr>,<NMR_250MHZ>,
      <Start of raw data processing
       ef LB = 0.3 FT_mod = 6 PKNL = 1 SI = 32K 
       data hash MD5: 32K
       26 05 DC D9 FD 3E BD 56 A7 6B 09 3B B0 67 10 3F>)
(   3,<2006-01-13 09:53:26.07 +000>,<MAYBRIDGE\nmr>,<NMR_250MHZ>,
      <apk 
       data hash MD5: 32K
       EA 8B ED B4 0D C7 F2 6B 08 FB FB C4 BF 75 19 DB>)
(   4,<2006-01-13 09:53:27.01 +000>,<MAYBRIDGE\nmr>,<NMR_250MHZ>,
      <abs ABSG = 5 
       data hash MD5: 32K
       63 FB C6 9E 79 6B 56 BF 8B 7B 8D 35 31 C5 4C 21>)
$$ ##END=
$$ 
$$ hash MD5
$$ FB 9A 22 28 59 1F 71 3A 59 15 17 9F 58 4E BD 13
##$RELAX= 
##$RELAX= 
##$RELAX= 
##$RELAX= 
##$RELAX= 
##$RELAX= 
##$RELAX= 
$$ Bruker specific parameters
$$ --------------------------
##$DU= <C:\u>
##$EXPNO= 14560
##$NAME= <ADRS>
##$PROCNO= 1
##$TYPE= <nmr>
##$USER= <dgb>
##$AMP= (0..31)
100 100 100 100 100 100 100 100 100 100 100 100 100 100 100 100 100 100 
100 100 100 100 100 100 100 100 100 100 100 100 100 100 
##$AQSEQ= 0
##$AQ_mod= 3
##$AUNM= <au_zg>
##$AUTOPOS= <52 >
##$BF1= 250.13
##$BF2= 250.13
##$BF3= 250.13
##$BF4= 250.13
##$BF5= 500.13
##$BF6= 500.13
##$BF7= 500.13
##$BF8= 500.13
##$BYTORDA= 1
##$CFDGTYP= 0
##$CFRGTYP= 5
##$CHEMSTR= <none>
##$CNST= (0..31)
1 1 145 1 1 1 1 1 1 1 1 1 1 1 1 1 1 1 1 1 1 1 1 1 1 1 1 1 1 1 1 1 
##$CPDPRG= <>
##$CPDPRG1= <>
##$CPDPRG2= <>
##$CPDPRG3= <>
##$CPDPRG4= <mlev>
##$CPDPRG5= <mlev>
##$CPDPRG6= <mlev>
##$CPDPRG7= <mlev>
##$CPDPRG8= <mlev>
##$CPDPRGB= <>
##$CPDPRGT= <>
##$D= (0..31)
0 1 0 0 0 0 0 0 0 0.06 0 0 0 0 0 0 0.0002 0 0 0 0 0 0 0 0 0 0 0 0 0 0 
0 
##$DATE= 1137145972
##$DBL= (0..7)
120 120 120 120 120 120 120 120 
##$DBP= (0..7)
150 150 150 150 150 150 150 150 
##$DBP07= 0
##$DBPNAM0= <>
##$DBPNAM1= <>
##$DBPNAM2= <>
$$ [...]
##$SUBNAM7= <"">
##$SUBNAM8= <"">
##$SUBNAM9= <"">
##$SW= 20.6930455092707
##$SWIBOX= (0..15)
0 0 3 0 0 0 0 0 0 0 0 0 0 0 0 0 
##$SW_h= 5175.983436853
##$TD= 65536
##$TD0= 1
##$TE= 294.16
##$TE2= 300
##$TE3= 300
##$TEG= 300
##$TL= (0..7)
0 120 120 120 120 120 120 120 
##$TP= (0..7)
150 150 150 150 150 150 150 150 
##$TP07= 0
##$TPNAME0= <>
##$TPNAME1= <>
##$TPNAME2= <>
##$TPNAME3= <>
##$TPNAME4= <>
##$TPNAME5= <>
##$TPNAME6= <>
##$TPNAME7= <>
##$TPOAL= (0..7)
0.5 0.5 0.5 0.5 0.5 0.5 0.5 0.5 
##$TPOFFS= (0..7)
0 0 0 0 0 0 0 0 
##$TUNHIN= 0
##$TUNHOUT= 0
##$TUNXOUT= 0
##$USERA1= <user>
##$USERA2= <user>
##$USERA3= <user>
##$USERA4= <user>
##$USERA5= <user>
##$V9= 5
##$VALIST= <valist>
##$VCLIST= <CCCCCCCCCCCCCCC>
##$VD= 0
##$VDLIST= <DDDDDDDDDDDDDDD>
##$VPLIST= <PPPPPPPPPPPPPPP>
##$VTLIST= <TTTTTTTTTTTTTTT>
##$WBST= 1024
##$WBSW= 4
##$XGAIN= (0..3)
0 0 0 0 
##$XL= 0
##$YL= 0
##$YMAX_a= 424184
##$YMIN_a= -355847
##$ZGOPTNS= <>
##$ZL1= 120
##$ZL2= 120
##$ZL3= 120
##$ZL4= 120
##$ABSF1= 16.522
##$ABSF2= -4.171173
##$ABSG= 5
##$ABSL= 3
##$ALPHA= 0
##$AQORDER= 0
##$ASSFAC= 0
##$ASSFACI= 0
##$ASSFACX= 0
##$ASSWID= 0
##$AUNMP= <proc_1d>
##$AZFE= 0.1
##$AZFW= 0.1
##$BCFW= 0
##$BC_mod= 0
##$BYTORDP= 0
##$COROFFS= 0
##$CY= 12.5
##$DATMOD= 1
##$DC= 0
##$DFILT= <>
##$DTYPP= 0
##$F1P= 14.0000005364418
##$F2P= -0.99999901652339
##$FCOR= 0.5
##$FTSIZE= 32768
##$FT_mod= 6
##$GAMMA= 0
##$GB= 0
##$INTBC= 1
##$INTSCL= 1
##$ISEN= 128
##$LB= 0.3
##$LEV0= 0
##$LPBIN= 0
##$MAXI= 10000
##$MC2= 0
##$MEAN= 0
##$ME_mod= 0
##$MI= 0
##$NCOEF= 0
##$NC_proc= -4
##$NLEV= 6
##$NOISF1= 0
##$NOISF2= 0
##$NSP= 0
##$NTH_PI= 0
##$NZP= 0
##$OFFSET= 16.522
##$PC= 1
##$PHC0= 75.91914
##$PHC1= 9.670348
##$PH_mod= 1
##$PKNL= yes
##$PPARMOD= 0
##$PSCAL= 4
##$PSIGN= 0
##$REVERSE= no
##$SF= 250.13
##$SI= 32768
##$SIGF1= 0
##$SIGF2= 0
##$SINO= 400
##$SIOLD= 32768
##$SREGLST= <1H.DMSO>
##$SSB= 0
##$STSI= 32768
##$STSR= 0
##$SW_p= 5175.98343685301
##$SYMM= 0
##$S_DEV= 0
##$TDeff= 65536
##$TDoff= 0
##$TI= <Analysis number 999999
Compound Code 99
Book Reference 9
Project Code 9>
##$TILT= no
##$TM1= 0
##$TM2= 0
##$TOPLEV= 0
##$USERP1= <user>
##$USERP2= <user>
##$USERP3= <user>
##$USERP4= <user>
##$USERP5= <user>
##$WDW= 1
##$XDIM= 32768
##$YMAX_p= 320407154
##$YMIN_p= -450650
$$ End of Bruker specific parameters
$$ ---------------------------------
##NTUPLES= NMR SPECTRUM
##VAR_NAME=  FREQUENCY,     SPECTRUM/REAL,   SPECTRUM/IMAG
##SYMBOL=    X,             R,               I
##VAR_TYPE=  INDEPENDENT,   DEPENDENT,       DEPENDENT
##VAR_FORM=  AFFN,          ASDF,            ASDF
##VAR_DIM=   32768,         32768,           32768
##UNITS=     HZ,            ARBITRARY UNITS, ARBITRARY UNITS
##FACTOR=    0.157963299565203, 1,           1
##FIRST=     4132.6476996994, 0,             0
##LAST=      -1043.33573715361, 0,           0
##MIN=       -1043.33573715361, -450650,     0
##MAX=       4132.6476996994, 320407154,     0
$$ Real data points
##PAGE= N=1
##DATA TABLE= (X++(R..R)), XYDATA
$$ [...]
23731e3105l1108J1457N971M9103J30072J182n0281K074j19481m8474J11597N8632
23719F7639j4908k8207l1224j08154o024J07898N8070j74823j03994J1181N7134
23708a65412N437Q447Q4123J3429n1864n048L8889m326L2250j7313L9667l6594
23696e8315J3443j5044n8203m360M7169M1902j2444m7961j29838k3796N7229O3971
23684a26247M8471M2686k8790O4420M8310k9930j0913k3097l7504l2695l6372
23673a21661m1638K4609o4091L1698J38740M4896J0333o5936n5960O4478M6780
23662A2248k1015L0808P4080J8898K8390L9927j08026j7921O258j5333l8437l2997
23650b3120M3118k0008j34864O445R2O381J12033K4559N120K8716r3457L657Q4828
$$ y = [-53105, -84213, -72756, -66785, -17682, 112390, 113572, 63291, 65365, -54116, -102590, 9007, 67639, 52731, 24524, -6700, -114854, -120878, -12980, 45090, -129733, -233727, -222546, -165412, -159975, -151528, -67405, -53976, -105840, -110888, -71999, -76325, -44075, -61388, -21721, -58315, -44872, -59916, -118119, -122479, -75310, -33408, -45852, -93813, -223651, -247447, -190218, -126247, -77776, -35090, -63880, 540, 48850, 18920, 8007, -15090, -52594, -85289, -121661, -163299, -138690, -202781, -171083, -32343, 12553, 22886, -43050, -99010, -34532, 12248, -8767, 22041, 96121, 115019, 143409, 183336, 75310, 57389, 63647, 48314, 9877, -23120, 19998, -10, -134874, -128429, -128337, -121956, -9923, 14636, 19756, 48472, -44985, -41328, 43500]
23637D3500l6463j6538O1164q150j4472N8020M9469r8609j13674j2333m749l5838
23625a28673L172Q4231K8272q7664N1272L0798l8718k235k1077L5282K7596M4764
23613B7020o997n0519n9346j3002J6419j1348q4191L6697L8356O7037L4489k709
23601h094M116L8435k9137p8582j37687m2354J13966J10386P119q2234k6634L0495
23589a00205L4071N5392O9707O4281k6107j25298m1475K8465j5272l3219p758
23578i7418J3377J4584n574o966K7701K8218L6281J25066n2410j68653J8477J10430
23566D3113N4522M8219J2435J7154n306j4235j084P2774j12618j01530J1692Q642
23554C3778l1439R872M5110J14149K8197j62921n1306q051m5656o0771o8748Q5696
$$ y = [43500, 7037, -9501, 51663, 43513, 29041, 87061, 136530, 37921, -75753, -88086, -92835, -128673, -125501, -41270, -12998, -100662, -49390, -18592, -57310, -59545, -80622, -45340, -17744, 27020, 20023, -30496, -89842, -102844, -86425, -97773, -181964, -145267, -106911, -39874, -5385, -8094, -3978, 34457, 5320, -73262, -210949, -253303, -139337, -28951, -21832, -104066, -130700, -100205, -66134, -10742, 58965, 123246, 97139, -28159, -69634, -41169, -56441, -89660, -97418, -84041, -69457, -75031, -81997, -54296, -26078, 10203, 135269, 82859, -85794, -67317, 43113, 97635, 145854, 158289, 175443, 170137, 155902, 154818, 227592, 114974, 13444, 25136, 33778, 2339, 12211, 57321, 171470, 199667, 36746, -14560, -22611, -68267, -129038, -197786, -112090]
23542a12090R9577m018o6516n9266K5431J14926L9375j25048N5999M0196j4118
23531e552l652O2205Q642k8649O2233p364r5362m7754J4211O9163Q8759O135m939
23518A18076l5968o6034r9807l4093K7865J25825J31005k6501m5922j00039N696
23507A03Q754J2685l0059j90636m532N3094j2963j5913m2289J955Q7967M7984
23495h3850N5048O0009n5142K093K7386j0227o1209O3266j48748l0799o8561k5636
23483b76370J45845j5473m4280J39222Q6167k2034M3802O6488j9589n4138M3960
23472I3600N5247o2911K1248J12297j5123q3554l1546Q570l048j55467m3992j8746
23460a23425j4592O4691P7750k9172m0906q2530l5152n003j0782Q311P735K8066
$$ y = [-112090, -12513, -16531, -83047, -142313, -116882, -1956, 37419, -87629, -31630, 8566, -5552, -9204, 53001, 61643, 32994, 95227, 87863, -7499, -55253, -41042, 28121, 116880, 123015, 118076, 82108, 16074, -83733, -117826, -89961, 35864, 166869, 140368, 94446, -5593, 103, 8857, 21542, -8517, -199153, -203685, -150591, -163554, -179467, -221756, -219801, -131834, -83850, -28802, 31207, -23935, -21842, 5544, -4683, -65892, -2626, -151374, -182173, -250734, -276370, -130525, -145998, -190278, -51056, 35111, 13077, 56879, 123367, 103778, 49640, 93600, 148847, 85936, 107184, 219481, 204358, 120804, 89258, 97828, 94780, -60687, -104679, -123425, -138017, -73326, 4424, -24748, -65654, -148184, -183336, -188339, -199121, -190810, -183075, -155009]
23448a55009Q08P7817N5105J43383L9572j20967J8327J05988K8171q309o6241
23437A18645j19781l7986K1216j4429J0744p4213j15893k7923Q7747L8357O3279
23426e0237m5096n8162M1819N5614m1135M7884M893M6800Q7371K3818l6573J8053
23414I5049J5801j12869m8520m1149N0382L1793j3956J12384O6694n3033m8611
23403E3965L1619K1277R105K3326P8232m1887p9153n7205r0074o4762M8083N2421
23391a5053P6942Q9368q9081j14573p8826o1080L5406R5356R3111J05573k9058
23380A08085r4005K9120l4005j09976K2636J38045q4117j51794P8748O0351L6739
23369a73k2743J3940J4266k5964j4979R3055n2403Q171l768L2619J04001N5553
$$ y = [-155009, -154201, -76384, -21279, 122104, 161676, 40709, 59036, 165024, 193195, 184886, 118645, -1136, -39122, -17906, -32335, -21591, -95804, -211697, -239620, -151873, -113516, -50237, -95333, -153495, -111676, -56062, -97197, -49313, -44420, 2380, 89751, 113569, 76996, 95049, 110850, -2019, -50539, -91688, -41306, -9513, -23469, 88915, 155609, 102576, 53965, 85584, 106861, 115966, 139292, 217524, 175637, 96484, 39279, -50795, -115557, -67474, -15053, 61889, 151257, 62176, -52397, -131223, -192303, -156897, -61541, 31570, 137143, 108085, 14080, 43200, 9195, -100781, -78145, 59900, -24217, -176011, -97263, -36912, -173, -22916, -8976, 5290, -20674, -35653, 57402, 4999, 13170, 9402, 42021, 146022, 201575]
23357B01575j12132k0040m7690p8700j02603k1238Q4323k2937M5522O2376N4917
23346D3373l8471k0937k3945R7928o2334l5245M9432R6759O156n6955n3811m3158
23334d1208R7518L8013R554N3590q5149j8575n2253q1425L4816o2581n3782j1307
23322a72789K8548K8662N529R1197M779p2274l3609m7109p357P6851J45268p6464
23310b8768j11273M5804Q9074P106n4140K6837n3903m5818j2371N7281P3230N174
23298a767k0101P7829j4284j26734R970j103m3596O556N5917K5087k4912K9770
23286b7368K0j4899o8373K4915j3352j5589N2326r966L8588l9113K0010q563P1350
23273I986j3918o1417p4237Q7488Q1161j323O4344R9605j23691o3923j2368j07166
$$ y = [201575, 89443, 69403, 21713, -56987, -159590, -180828, -96505, -119442, -73920, -11544, 43373, 4902, -16035, -39980, 57948, -4386, -39631, 9801, 106560, 112716, 55761, 1950, -41208, 56310, 94323, 103877, 157467, 72318, 53743, 1490, -79935, -45119, -107700, -161482, -172789, -144241, -115579, -110050, -18853, -14074, -86348, -119957, -167066, -174423, -97572, 47696, -28768, -140041, -94237, -5163, 1943, -52197, -25360, -79263, -125081, -137452, -80171, -6941, -1767, -21868, 55961, 41677, -85057, -75087, -76190, -119786, -113230, -57313, -32226, -57138, -27368, -27348, -42247, -110620, -85705, -99057, -114646, -62320, -72286, -33698, -72811, -52801, -61364, 9986, -3932, -65349, -139586, -52098, 29063, 27740, 92084, 191689, 67998, 4075, -8293, -115459]
23261a15459p3341Q3828J01236O979R8080R6525N0024K6980m5427j8212k8536
23250A82677j10845K9855R3535j5471k2798r1252L0358O8156j8122n4420k0687
23239G0986M1640L7040J70j20021l2847m5336Q9974r1250L6265l9418j1181L7566
23227b6412l8816M9413P6998R0510K6287m1670j6832r8273j29040O1616O6863
23216B0644J8692n853o3965R0892M6813J1909l1332P3802J442j02474m9298L2411
23204D3683j0293L6843r0965j18617J05689J08116N536j14790j03164L8723N2730
23193d6509L3069j953Q785k1759k2030N0543p8715N4660J70035j01331p6797N6718
23181B4716l3986j19057J0119l1587l0217J21633O2467J0937k8625O703K1740
$$ y = [-115459, -188800, -104972, -3736, 3243, 101323, 197848, 247872, 274852, 229425, 211213, 182677, 71832, 101687, 195222, 179751, 156953, 65701, 96059, 164215, 146093, 91673, 70986, 112626, 149666, 149836, 29815, -3032, -48368, 41606, -49644, -13379, -52797, -63978, -26412, -65228, -15815, 61183, 151693, 177980, 136310, 119478, 21205, -107835, -46219, 20644, 39336, 33483, -30482, 60410, 107223, 119132, 87800, 161602, 163044, 60570, 11272, 43683, 33390, 70233, -20732, -139349, -33660, 74456, 79992, -34798, -137962, -99239, -46509, -13440, -15393, -6608, -28367, -50397, 146, -78569, -23909, 146126, 44795, -32002, 24716, -9270, -128327, -118208, -149795, -180012, -58379, 4088, 15025, -13600, -6897, 14843]
23170A4843P290J3449l5879J742j34305o2754m967N7954N1948J947J0255J43142
23158F4665K756n2074m8085q4234n5629L9828J18410L6829n4355p689l9002o074
23146h4654J13186n7221k8444K998O9205J29205K3707q15p1266j08054O4556O9738
23134A22141n7182j12593J7458M6830J5457O1254O8159k7622j31945N312N7l7742
23122c0416J1013Q3386q8155n0692j70057J8613j3227j4770J75084J97507k0010
23111I8276l6182j1116n7408Q379M5487J6489J6615J8290l0361j20426q8225N058
23099a35124J02365M5860q2066N3309P4694O2073m4372L7538Q672j90345k1118
23088h8514J7084p3587J07904J00559p132j03036n3322O3562K1929n6095k3115
$$ y = [14843, 22133, 35582, -297, 1445, -132860, -195614, -200581, -142627, -90679, -88732, -78477, 64665, 67421, 15347, -32738, -116972, -172601, -132773, -14363, 22466, -31889, -39578, -78580, -84654, 28532, -28689, -57133, -54135, 15070, 144275, 167982, 167167, 95901, -12153, 52403, 122141, 64959, -47634, -30176, 16654, 32111, 93365, 161524, 133902, 1957, 7269, 7326, -30416, -19403, 63983, -24172, -74864, -244921, -226308, -239535, -254305, -79221, 118286, 98276, 62094, 50978, -6430, 1949, 47436, 63925, 80540, 98830, 68469, -51957, -140182, -135124, -32759, 13101, -68965, -15656, 59038, 121111, 76739, 114277, 122949, -67396, -88514, -71430, -145017, -37113, 63446, 56314, -46722, -100044, -36482, -14553, -70648, -93763]
23077i3763r7845J03873Q2364k8986m0575l4609N1531J0053j9879J3565P6440
23066B2169l5631j25041n6637J0486Q657Q5179L1175L8327P1709o5402N030K193
23054g786J6840k5572K6496j33391k4739J84359O9934K9401m4158p8900j0791
23043A693J2933J78209N7443k763n4873k9113K0424l4576j7748K1443j70628k1491
23031c9047k3678N51M6185O3485J09721j2569n5849k4343n9704m5331j3231j22301
23019a76111k02369J09753K13710J13775j1244R1248K5763o8575K9323K2581K931
23008A50785m8404j27112p7280K7832N3040R269P957o2092q5525J02952M1307
22997g271P6743L3902M3272q2234q6128Q03L1747j6385k288k8650j17413k2302
$$ y = [-93763, -191608, -87735, -5371, -34357, -74932, -109541, -58010, -47957, -67836, -54271, 22169, -13462, -138503, -195140, -184654, -175997, -90818, -59643, -21316, 50393, -15009, -9979, -7786, 9054, -16518, 9978, -123413, -148152, 36207, 106141, 135542, 91384, 12484, 1693, 14626, 192835, 250278, 247515, 192642, 163529, 183953, 149377, 131629, 153072, -17556, -39047, -62725, -62174, -15989, 47496, 157217, 144648, 88799, 64456, 4752, -40579, -53810, -176111, -378480, -268727, -55017, 58758, 47514, 138762, 164525, 95950, 125273, 147854, 150785, 102381, -24731, -102011, -74179, -21139, -11870, -3913, -66005, -151530, -48578, -7271, 69472, 103374, 146646, 64412, -21716, -20913, 10834, -5551, -7839, -36489, -153902, -176204]
22985a76204l438P1458N1293J3599k2928M4259o5072j02414q33K9249N3117R6220
22973a1694R5559l2288j34449K207M2723L3938j8210l3748J41885K9848l4891
22962H0880L9585Q5977R74j08194j37904K2367L150k7105K9627K1919n7332K2720
22950b3336K6564n0818P145J10934J0577m9018l7267n14l4100k1564N2148l5444
22938d4693j8148M0656M4471l9927O3952K84P5772o6240l0617k2151N9646l3264
22926B9741r4444p034L7894M4292m1131r8655J29264j4925k8688n6885k8269R7259
22914c1581n2999q534N0251J9268N6498J2009q4403J6301j6300m14J46354o9135
22902C7315l3064K6151k3015o1960k1332M9726J19666O463o7920R463P0887r9254
$$ y = [-176204, -179642, -108184, -56891, -43292, -66220, -21961, -87033, -189447, -190280, -161031, -107914, -11694, 83865, 51577, -82872, -80665, -37942, -4004, -22214, -55962, 85923, 115771, 80880, 120465, 206442, 207416, 99222, -38682, -16315, -13165, -40270, -10643, 11276, -46056, -23336, 3228, -47590, -40445, 70489, 81066, 32048, -5219, -5733, -39833, -61397, -9249, -44693, -62841, -22185, 22286, -17641, 46311, 46595, 122367, 56127, 25510, 3359, 63005, 29741, -64703, -71737, -33843, 10449, -30682, -129337, -73, -14998, -43686, -100571, -128840, -31581, -84580, -93114, -42863, -23595, 32903, 44912, -39491, -23190, -39490, -39904, 106450, 37315, 4251, 30402, 7387, -54573, -75905, -26179, 93487, 99950, 32030, 41493, 112380, 13126]
22890A3126l7168m3461K1089j09750n8788j1856Q067L5030N3548L6321o6409l3453
22878a93704Q5459L1835j1164k2014J7420k2613K6438J29567M1827K8810Q2387
22867A94248j0567o8574q5214n8770o150N4905K5025j4910Q1495M5015q0490j44053
22855f8040n6526Q2342Q3438K9533q799r5990j03590j05573M9531Q4858J10100
22844A284k7340j15575n6811L491k3753J8981L3964O6530J32277q9612N182m6681
22832i8063K8172L3185J00897L0527N0970R3986j8043n2544j42204j2021m1634
22821b6772p2729m2258j5897Q3578P7701K3260o9295K5312l6459o4588k96n311
22809a23754M1568p1153n0837o1969K8856O8513P0042j2574n3005m8380j0458
$$ y = [13126, -24042, -67503, -46414, -156164, -214952, -226808, -218741, -183711, -130163, -93842, -160251, -193704, -108245, -76410, -87574, -109588, -92168, -114781, -88343, 41224, 83051, 111861, 194248, 183681, 115107, 29893, -28877, -35027, 19878, 44903, 29993, 111488, 156503, 76013, -68040, -124566, -42224, 41214, 70747, 61948, -34042, -137632, -243205, -193674, -108816, 1284, -26056, -141631, -198442, -194951, -218704, -199723, -165759, -99229, 33048, -56564, -51382, -98063, -69891, -36706, 64191, 94718, 145688, 239674, 221631, 169087, 26883, 14862, -26772, -99501, -141759, -157656, -74078, 3623, 26883, -42412, -17100, -53559, -118147, -118443, -123754, -82186, -153339, -204176, -266145, -237289, -168776, -98734, -111308, -164313, -212693, -223151]
22798b23151J01273J32010K1257j61388p3508Q0106J43053K5040j7881J8260l4732
22787A0339m1953J06817J6403P618N3248l8952n5700J4145L4445m234n3455l1395
22775A7326O5898O2887n9896j40991J3643J12024L104M7472j4421k8030M3187
22764A22203O813j39459j00783L4218P0083N3570K4563k0314n8047j5368l7115
22753e9636K2086n5287P1543J33203J06750j41862j50008j42857L4780J77353
22743c935J6626K49p4530J1314j0036k1424J4882m2542K603Q6233L964k9020O1292
22730A5676K2099k5554M4140L9786j8230J1133p6300o0524m9344J437M3406Q586
22718d3689J33690j9616p1944M7114R0906R92j05432k7242j2734M576l659O9563
$$ y = [-223151, -121878, 10132, 31389, -129999, -203507, -123401, 19652, 44692, 26811, 45071, 10339, -31614, 75203, 91606, 99224, 152472, 113520, 57820, 71965, 106410, 102176, 48721, 17326, 83224, 146111, 86215, -54776, -41133, 70891, 73995, 121467, 107046, 79016, 122203, 129016, -10443, -111226, -77008, -6925, 46645, 71208, 50894, -7153, -22521, -59636, -37550, -92837, -21294, 111909, 218659, 76797, -73211, -216068, -181288, -3935, 12691, 12940, -61590, -50276, -60312, -81736, -66854, -109396, -106793, -20560, -16596, -45616, 15676, 37775, 12221, 56361, 96147, 77917, 89050, 12750, -47774, -97118, -95681, -52275, -43689, 90001, 70385, -1559, 45555, 136461, 137453, 32021, 4779, -7955, -3379, -7038, 62525]
22706F2525J3022j53489j8792k5943J7274J5524Q7520O8642M8052r665m0353P6121
22694A40438j0170n1461k6812l1566k755K2144L1062m4226l6753r015J0573o536
22682a5077n9068j24103n9950K6549N5709Q2131J5187M6196P5220J5202o7842
22671i846N2842l4372r0872q6526q2362K2107K5644O3523J44956Q5525J2152J0266
22659A13037n7599m907j4758k4274N2200l5738O7694k2476L3998o6643o0669l1423
22647e1558P5973O535o645n0065r8984K2025L8364N6084M5548N501L222l4286
22635A1714J4024J3746k0123m1627n0278n6766j3710J9968J598j1701P0561Q103
22623e4491j3849P414N5064m1314k6406J6666M1526N3837K5571j794P1239R0408
$$ y = [62525, 75547, -77942, -96734, -122677, -105403, -89879, -2359, 66283, 114335, 104670, 64317, 140438, 130268, 78807, 51995, 20429, 17674, 39818, 70880, 26654, -10099, -19114, -8541, -15077, -74145, -198248, -258198, -231649, -175940, -93809, -78622, -32426, 42794, 57996, -9846, 42996, 8624, -82248, -168774, -251136, -229029, -203385, -139862, 5094, 90619, 102771, 113037, 55438, 50531, 35773, 11499, 63699, 27961, 95655, 73179, 107177, 40534, -20135, -51558, 24415, 30950, 24305, -25760, -124744, -102719, -64355, -8271, 37277, 42778, 46000, 11714, 25738, 39484, 19361, -22266, -72544, -129310, -143020, -123052, -121454, -133155, -62594, -54491, -68340, -60926, -5862, -47176, -73582, -56916, -15390, 38447, 64018, 62224, 133463, 223871]
22611B23871m6994m897k1829j59593o5048J6930K2344N5785M1501o0115l9888
22600c7933j9445k585p1140Q5603k4613j13276L8868J16995j17761j9393J466
22589a63214n9980R5912N2015N4322J00775J9132R3592L8277M1991l1840j96311
22578D4671n8457m263k320O7481M9653r6222r0576O4045K5478o2606J4121l8873
22566h7868L5176P5285n673n8756o4553L7308j5791L2579J25578l6322k4514n8587
22554d6138m6997O9746P9560o515J8329J4532m4820r8165K3908k8424k2361O3098
22542b4247M4875m0125M7263Q1963l6230p1157L5314L1648p5897L829J7204l8646
22530b4206r367J1420p3822o7036P5542L6361n7063o1621M9602P9076O7193K5165
$$ y = [223871, 176877, 171980, 150151, -9442, -74490, -57560, -35216, 20569, 62070, 1955, -37933, -57378, -59963, -131103, -45500, -70113, -183389, -144521, -27526, -145287, -164680, -163214, -223194, -127282, -75267, -20945, 79830, 98962, 192554, 230831, 272822, 240982, 44671, -13786, -18049, -20369, 47112, 96765, 543, -90033, -25988, -510, -63116, -48995, -87868, -52692, 22593, 16920, -41836, -106389, -69081, -84872, -52293, 73285, 36963, 12449, -46138, -93135, -23389, 56171, 49656, 67985, 82517, 37697, -60468, -36560, -64984, -87345, -24247, 20628, -19497, 27766, 109729, 73499, 2342, 37656, 69304, -6593, -2764, 14440, -24206, -33573, -22153, -95975, -163011, -87469, -51108, -108171, -169792, -120190, -41114, 26079, 51244]
22518E1244L3393r4091n0384k3102M5055N4483O423n3670Q9542L2364k3358n4316
22506A3583l4134J5237N510m990K5204L0582R1023L5362j24932N7085L3302j5897
22494A26935m6303r6860j5232O563l536Q31m9075k6773O222J9594j8134J14106
22482A8338O5603o6725M5568J1646m686j19751J8287M3399L4972r5145n5515Q8289
22470a5720J5270l3545j4964K1247M4084M8232n0970N8501p2536j20809l7758
22459a58968J10328P8711L0907k08937n9768J35715J61960p300k2678r7512Q147
22448b9395R5507O1450K910J448p6046Q162M2616n0299r1980n3108l7054M3830
22436h1959J7280M0250Q0662l324M5781l2533j05620q721J10050p6416j27968
$$ y = [51244, 84637, -9454, -59838, -82940, -37885, 16598, 23021, -30649, 58893, 91257, 67899, 13583, -20551, -5314, 196, -4794, 20410, 50992, 142015, 177377, 52445, 109530, 142832, 126935, 80632, -16228, -31460, -24897, -28433, -27602, -76677, -103450, -97228, -77634, -95768, 18338, 83941, 17216, 62784, 74430, 69744, -50007, -31720, 11679, 46651, -48494, -104009, -15720, -450, -33995, -48959, -27712, 16372, 64604, 13634, 72135, -401, -121210, -158968, -48640, 30071, 60978, -147959, -207727, -72012, 89948, 82648, 59970, -37542, -29395, 66112, 127562, 130472, 131920, 55874, 64036, 106652, 56353, -35627, -88735, -125789, -81959, -64679, -24429, 56233, 52909, 98690, 66157, -39463, -48184, 61866, -14550, -142518]
22425a42518n3320J711N5708N6443P5219K0606n7626l3121O2650L7980N5415r5312
22413a6165k0661R3401O2392o1981K6624q760M8346L4903q7234j17452K403K9788
22401a4396L0866J4255k3416O0448j32682q2580J03619K2905o492j501n0990j4911
22389i4875J7950l4725J02590P8472m6731M3222N0737j01456k8766o874k2989
22378d3445J0577l2072K6621R2850J07440l5433j34584j12890m5216K2289N9792
22367h4071k8077k302J00384N0934l1803m7986r0868m0295M0565k5550J005L5723
22355a22341J17974P8032k0013O8470m1261j21164k7863O5856K8015R2391l2654
22344H5442j16572j0665M4477N0069N5630M0083j6943k8358k8050p1425O28m6562
$$ y = [-142518, -195838, -194127, -138419, -81976, -6757, 13849, -43777, -76898, -14248, 23732, 79147, -16165, -36826, 56575, 118967, 56986, 83610, 74850, 123196, 158099, 70865, -46587, -44184, -14396, 16470, 30725, 7309, 67757, -64925, -147505, -43886, -20981, -27473, -28974, -79964, -94875, -76925, -111650, -9060, 69412, 22681, 65903, 116640, 15184, -13582, -20456, -43445, -32868, -64940, -38319, 54531, 161971, 126538, -8046, -120936, -166152, -143863, -84071, -112148, -114450, -14066, 36868, 5065, -42921, -133789, -174084, -133519, -159069, -158064, -122341, -4367, 73665, 53652, 122122, 80861, -40303, -68166, -2310, 25705, 118096, 85442, -31130, -41795, 2682, 52751, 108381, 148464, 131521, 103163, 75113, 3688, 4316, -42246]
22332d2246k9851j1329P5088o8854k9936L3893R7755N6843J7990m023n9970j05314
22320f9954l3265J6935K5680n185k8427M6182N2388M4471K2321p569P777j5432
22308E5922j9128o4945j2399j0952P7446K8049K0286J0349j13223m2329o8009
22297a38933M0575m4769k5520L8433Q8037P8799J8420j78825K6866J19601L2330
22286E5014n5636o1343L956O210J6800R887r8108N9514K0784j0762j4530M2725
22274b5489J42189J49574j084l7984j25044p2898J7665l7621J0937K2193K919
22263D5357m307k4804p4587j15270J01099J20930J01758N7523p4254m9015K6117
22252A10547M5958o7769o5873p7376L3184Q9291m6138j20082K253J29874R1643
$$ y = [-42246, -72097, -83426, -8338, -77192, -107128, -73235, 24520, 81363, 99353, 95330, 35360, -69954, -103219, -86284, -60604, -65789, -94216, -48034, 4354, 48825, 71146, 63577, 71354, 55922, 36794, -28151, -40550, -51502, 25944, 53993, 74279, 84628, -28595, -70924, -138933, -98358, -143127, -168647, -130214, -42177, 36622, 55042, -123783, -96917, 22684, 55014, -622, -61965, -58009, -51799, -34999, -25112, -123220, -63706, -42922, -53684, -68214, -25489, 116700, 266274, 265190, 227206, 102162, 29264, 46929, 9308, 20245, 42438, 45357, 41050, 16246, -58341, -173611, -72512, 48418, 150176, 207699, 133445, 84430, 110547, 156505, 88736, 22863, -54513, -21329, 67962, 21824, -98258, -96005, 33869, 125512]
22241A25512j1514n4024K7532j21829o0957L6763K9574N700o9573R3857M2735
22230D3776N5384o8763N7287J047m2494R2931j520K2890K6949m4509r6458j8136
22218B8384k077j8691M6570M8116n217j2095j6939j7141l2976n5218j8036K9965
22206b5355L6912n0469J3182N4676J6188L1674m4276m4364M0422O8575M0536K908
22194A40609k5213L508k0639l2731m9516p1131n2327J11489k1426M270O2147k0968
22182B8072j4696R6986K2774l4079k5698k3640K588k9360O6107k2454p4776L3215
22170B5039K7712N3259P8359l5936r8322n1624k9363j15187K2999N3136k2438
22159i2366M9558l9318K2039l310J20173M1024j19579j21736k6721N1144L7920
$$ y = [125512, 113998, 59974, 87506, -34323, -95280, -58517, -28943, -23243, -92816, 1041, 43776, 99160, 30397, 87684, 88731, 46237, 139168, 137648, 160538, 187487, 142978, 46520, 28384, 26307, 7616, 54186, 102302, 97085, 84990, 68051, 50910, 17934, -37284, -55320, -25355, 11557, -38912, -25730, 28946, 45134, 76808, 32532, -11832, 28590, 97165, 137701, 140609, 115396, 118904, 98265, 65534, 16018, -55113, -107440, 4049, -17377, -13107, 49040, 28072, 13376, 110362, 133136, 99057, 73359, 49719, 52307, 22947, 89054, 66600, -8176, 25039, 52751, 106010, 184369, 148433, 50111, -1513, -30876, -146063, -123064, -69928, -92366, -42808, -82126, -60087, -63397, 56776, 97800, -21779, -143515, -170236, -119092, -81172]
22148h1172m8605k6309Q2540k1060O5441n5741l6307J6469N6836m3409Q4760P5241
22136F8684k5964n4405j1744J7303n1558l2088N2911O7115J5827O9026J3835j11461
22124A7481j41530m873M3007L1859r0126n0920L3780J04342j7265O8096K2349
22113A6200j30455k396M4047L0345R8141J907r1892p9668J18556O1908O3818k8995
22101A01516n1462q163j2919k1297m0432j0864j25331n4260Q3559Q9346O4047
22090A3740j5597j8419k607K4734o791q72J6202N895l9341J6123m3467j8303p501
22077g6204N98J9111q087l0468N4765O88j1r9279n1237R466J19547R302Q2968
22064C1159j8680j2205n3213J7986l3430o1206O4906l0477L3045j3120M0063P5917
$$ y = [-81172, -129777, -156086, -73546, -94606, -29165, -84906, -121213, -104744, -47908, -91317, -6557, 68684, 42720, -11685, -23429, -6126, -57684, -89772, -36861, 30254, 46081, 115107, 128942, 17481, -124049, -128922, -85915, -54056, -144182, -195102, -161322, -56980, -74245, -6149, 16200, -114255, -116651, -72604, -42259, 55882, 57789, -34103, -113771, 4785, 66693, 130511, 101516, 50054, 41891, 28972, 7675, -32757, -43621, -168952, -223212, -139653, -50307, 13740, -1857, -20276, -22883, 1851, -4940, -5812, 10390, 16285, -23056, -6933, -50400, -68703, -76204, -75606, -56495, -64582, -95050, -40285, -39597, -39608, -138887, -190124, -180658, -61111, -51809, 31159, 12479, 274, -52939, -34953, -68383, -129589, -64683, -95160, -62115, -75235, -35172, 40745]
22052D0745l0855Q1597O8373j24541j10229j06066J8631L5624Q702J5948j2084
22041a14155M7213O5275j4552q528j07542L3400J18132O844j3126j5717k6002
22030b8758k3819M0625m395L5801N3986n0746p7128q1038M5306J0379r9259J2899
22018a66147P0934J30928R0630j6186j35919j50850L273O0473J6397Q2536R6799
22007H2868M5156q7150p7205P863j2766k441m6762l4429j0360R631k070K3196
21995a04469J37001o7093l3028m2958o0295O0654Q5307K3016j4690j44423k2083
21984a83061K8312Q1034P509k6452o160k5281m2553N5303J15155l1643J14877
21973H7040N8738M1955k1957r0767j3854k1680l1737o2088l8598J07661P6177
$$ y = [40745, 9890, 91487, 159860, 35319, -74910, -180976, -162345, -126721, -118019, -102071, -114155, -66942, -1667, -16219, -24747, -132289, -98889, 19243, 26087, 12961, -2756, -28758, -52577, -11952, -16347, 19454, 73440, 22694, -54434, -135472, -90166, -79787, -179046, -166147, -95213, 35715, 126345, 110159, -25760, -176610, -173337, -112864, -96467, -13931, 82868, 128024, 40874, -36331, -28468, -41234, -43675, -90437, -124866, -135226, -125595, -127665, -104469, 32532, -34561, -67589, -110547, -170842, -110188, -24881, -1865, -16555, -160978, -183061, -154749, -73715, -66206, -92658, -98818, -124099, -166652, -111349, 3806, -27837, 87040, 145778, 187733, 165776, 75009, 61155, 39475, 7738, -54350, -92948, 14713, 90890]
21962I0890J1434p5496k0864m833K1351M7492J0804j16800j457M8506R5361L837
21950A10225j2183J1845o8034j13775O542O6517j8860J2067n6051L5246J6750
21939i711M121q9493j35000J9200O3484O9483J01646n215N0146K058m0166m964
21927B5589P5787k7320n9776l1799R638k1806q5095k0651M6653J164k0501m7992
21915a56109L8021R0008M7545k8522p5826j4247P9651O421R567M2251O4821n6449
21903D7132n4359n5678J1406Q5458L7320J7920K5194o676o4680n3171l6139J5251
21891c1022M0168N8508M2757m9679l8871L6516M2097m5491j9032j32838k7751
21880a24638J08153Q6061N8222k8281l3656k1911M6989J03415j82548k0183o3252
$$ y = [90890, 102324, 26828, 5964, 1131, 22482, 69974, 80778, -36022, -37479, 11027, 106388, 110225, 98042, 109887, 41853, -71922, -65380, 1137, -17723, -5656, -61707, -26461, -9711, -5590, -95083, -230083, -210883, -147399, -77916, 23730, 18515, 68661, 70719, 30553, 25589, 101376, 74056, 14280, -17519, -7881, -29687, -114782, -135433, -88780, -87616, -108117, -156109, -118088, -28080, 19465, -9057, -84883, -99130, -19479, -13058, -3491, 38760, 103581, 47132, -7227, -62905, -51499, 33959, 71279, 89199, 114393, 107717, 43037, -10134, -46273, -31022, 9146, 67654, 110411, 60732, 21861, 58377, 100474, 54983, 35951, -96887, -124638, -16485, 69576, 127798, 99517, 65861, 43950, 90939, 194354, 11806, -8377, -71629]
21869g1629l2981M6852M8621M0759j4593J5017j7783M732l6387P2566M8876r671
21857I4379o3968K2221p9809k4719K19Q6139M305R0420Q9835j3749j67799l0842
21845F632L6813l8129p3104n002M4347N6586o5984L8945P580O78J13197L5821
21833A58380o57p4078k9199M8373j05558m4111K0590j00121j03022M5940J27715
21822e5748J93741O042r9899L217o3487L9846j6814M2780p4217m971K2341O1369
21810E4200l426k0910m1441k9501n6889k0305K9684n398l6064m8096Q5737J64010
21798G1601Q4063m2778l1294M8306p0235j62895m4987P2113O9567N508J3858o268
21786F559n7913n7636N9747R31N0526N5943j32677j8544Q9492J40151L3495q1117
$$ y = [-71629, -104610, -57758, -9137, 31622, 17029, 32046, 14263, 18995, -17392, 55174, 104050, 94379, 30411, 52632, -27177, -51896, -51677, 34462, 38767, 129187, 219022, 205273, 37474, 6632, 43445, 5316, -67788, -72790, -28443, 28143, -37841, 1104, 8684, 9362, 122559, 158380, 157723, 83645, 54446, 102819, -2739, -46850, -26260, -126381, -229403, -183463, -55748, 137993, 144035, 44136, 47353, -16134, 23712, 6898, 49678, -24539, -29510, -7169, 54200, 50774, 29864, -11577, -41078, -97967, -118272, -88588, -93986, -130050, -178146, -92409, 71601, 155664, 112886, 81592, 129898, 59663, -103232, -148219, -76106, -6539, -1031, 12827, 6559, -51354, -108990, -49243, -48312, 2214, 58157, -74520, -93064, -3572, 136579, 170074, 88957]
21774H8957N1921k8100p5794K1114K9519k9688r248J2180J7313L4658n161l20
21762A07351j03799l7336J5336J4010k9456P466K8109l2472K1844p28P3936K226
21750F6487m1653P3540M1979J730m2890q3119q3548K5309K1547l3580J57220L9599
21738A42621q9191j04393l8257R8950M8603j4100k6922l6831J3711n6052j749
21727f3610L6089j6988M1933k409L6759k4095R275l7687q2060l0535J0127l5541
21715a58742n4928J0107k7781J7242Q7379K2847J11238K5732n1564M0657M9267
21704G1454Q632j48873j67481m1333J27500N9609J35861J9124m8163o2434N9242
21693A3138q716l3426R1200l1804o7829J39218J6605o7852n5163j2341k1353q515
$$ y = [88957, 140878, 112778, 36984, 58098, 87617, 57929, 48681, 60861, 78174, 112832, 107671, 107351, 3552, -33784, -18448, -4438, -33894, -26428, 1681, -30791, -8947, -9675, 64261, 66487, 24834, 98374, 140353, 142083, 99193, 16074, -67474, -42165, -20618, -54198, 103022, 142621, 53430, -50963, -89220, 9730, 58333, 44233, 17311, -19520, -5809, -61861, -63610, -27521, -44509, -2576, -4985, 31774, 7679, 16954, -20733, -102793, -133328, -123201, -158742, -213670, -203563, -231344, -214102, -126723, -103876, 7362, 33094, -18470, 22187, 71454, 80086, -68787, -236268, -277601, -150101, -90492, 45369, 64493, 16330, -46104, 13138, 4422, -29004, 62196, 30392, -37437, 101781, 118386, 50534, -4629, -16970, -38323, -46838]
21681d6838n8471M3736J23887j0898n8176M6855m3305K7684P2052o661M3284l9478
21669I3671l8432j4595M7868l6033o0053N5401o9414r9606R1794R8617k5386J7782
21657F1614J8343L4969l9620n8713P1332q9361j55656L1068R9189Q6980l6857
21646B3288n6876N3820p2464n2908j9110R9984P9952Q0185k3793j18441N223J1461
21634A0321M9389J035N8876p021J3941j3710n6562l9702J6333K9413k1330p4265
21622c3282N3677J0984Q3129O7760l6527j34188N0909O943p4050p0479J3222O2273
21610C71M7161l6312r892k7066n7281J8069L9490r2220j12252L4945O2611O6887
21598f5489J8283J489K094k8095K3957J10790P761j36206p3168l3053j2073M5944
$$ y = [-46838, -105309, -61573, 62314, 51416, -6760, 40095, -3210, 24474, 96526, 89865, 133149, 93671, 55239, 40644, 88512, 52479, -7574, 47827, -21587, -121193, -29399, 69218, 43832, 61614, 79957, 114926, 75306, 16593, 87925, -1436, -157092, -126024, -26835, 60145, 23288, -33588, 20232, -52232, -105140, -124250, -24266, 55686, 135871, 112078, -6363, -1140, 10321, 59710, 60745, 119621, 112600, 126541, 112831, 56269, 16567, 32900, 62313, 40983, -33282, 20395, 31379, 114508, 182268, 145741, 11553, 62462, 69405, -4645, -75124, -61902, 371, 47532, 11220, 1328, -25738, -83019, -64950, -25460, -117680, -229932, -194987, -132376, -65489, -47206, -45717, -43623, -71718, -47761, 63029, 70790, -65416, -138584, -171637, -183710, -137766]
21586a37766P2780K0624Q906j4774K8747K6121n4024l8415R551Q0232Q166r1669
21574h1521l76m5525K6424Q3656J24405k7143k5335k1759N128Q2641J080j49718
21562b8043j20463l907N4448J34912J4269k6497P281K1907l819l7400j14156L003
21550i8465J9670M0037m4756l1505L2831O3769Q1931l5799j17205k2967M9450
21539f3009o3973L1446Q9725k2320k2474M7368p6774j1477n175m666L2710O1587
21527g032J01316J04610j1888l4710L276r2832l4538o5269L7685K7161Q615k1260
21515A5134M176R80k5474J2128q4774M1851J31914J3990M11K6508R6338j14639
21503A18543j44174k3530L5559J9328m5003q7988J08085j0576J40064M8062j07451
$$ y = [-137766, -64986, -44362, -35456, -50230, -21483, 4638, -49386, -87801, -78250, 1982, 10148, -81521, -81897, -127422, -100998, -17342, 107063, 79920, 54585, 32826, 37954, 120595, 121675, -28043, -148506, -152413, -97965, 36947, 51216, 24719, 32000, 53907, 50088, 12688, -101468, -98465, -78795, -38758, -83514, -115019, -82188, -18419, 63512, 27713, -89492, -112459, -63009, -126982, -95536, -5811, -28131, -50605, -3237, -80011, -91488, -96663, -101329, -68619, -7032, 94284, 198894, 187006, 152296, 155572, 62740, 28202, -37067, 618, 27779, 36394, 15134, 19310, 20290, -5184, 6944, -77830, -35979, 95935, 109925, 110336, 136844, 233182, 118543, -25631, -49161, -13602, 5726, -39277, -127265, -19180, -29756, 110308, 158370, 50919]
21492E0919j0262j1720J9680n9862j8976N6066O558k1027K8938p8094l388R5994
21480E4826N8552K9285n3803p7365m6564N8003q8056j2787J54714K3848n9830
21469D0823m4988j02700m8761N8955J0700R9911J0573m7726q5905L3064J02527
21458B6473Q405j358R1413k1736k1573p869o2119L7494N4166j34288M4749K0595
21446C4352k0753l596j23332n4821K3446N6861J39471O3137p5751n2884j32020
21435a45890k3450l6727N7029j984R2624L5954J6050m8403n775J828j00929q5436
21423b45109Q3851J10263J32221p090q4769l9612P8881R1127o390r661j576L8286
21411A40422r1053j10156k6662k5871m4320J0214o7505J0461O9528N2523R383
$$ y = [50919, 40657, 28937, 48617, -11245, -30221, 25845, 32403, 11376, 40314, -37780, -41168, 54826, 113378, 142663, 88860, 11495, -35069, 22934, -65122, -77909, 76805, 100653, 40823, -4165, -106865, -155626, -96671, -85971, 13940, 24513, -23213, -109118, -76054, 26473, 34878, 33520, 124933, 103197, 81624, 73755, 11636, 49130, 103296, -30992, 13757, 34352, 13599, 10003, -113329, -168150, -144704, -87843, 51628, 114765, 39014, -13870, -145890, -169340, -206067, -149038, -151022, -58398, -22444, -6394, -54797, -60572, -58744, -159673, -245109, -161258, -50995, 81226, 74136, -10633, -50245, 28636, 119763, 113373, 103712, 102136, 140422, 49369, -60787, -87449, -113320, -157640, -147426, -214931, -204470, -134942, -82419, -73036]
21400g3036p356Q5022M6053L073J12076j54306J0940k6097J608O5504j0130K1536
21388G4887l107K559l3438m2524j0418m0860J21j8776P713R1571L3988n7381p4522
21375g0187r0901L8240R7277O7345m9607k4792K9808j5775q137k9449J7120l5103
21363g4161m0395M6553j8059P4930k1165J7940J6070O0956P684L5593j19560p296
21351b0910O4862L2323k5940N9677K6448j41711k4808J31777P8864q9155p2300
21340A9127J15916J25322o4291j08889r7743j09474L167L8469O2135J03248P1470
21329A58457j9339L499j707N3240l7532K7606K7104l6930k6887o5996j52654r501
21317h0640P2484n8293p7844p0020N1583J48491J4215q4414K0346J09940J54551
$$ y = [-73036, -80392, 4630, 50683, 53756, 165832, 11526, 22466, -3631, -2023, 63481, 53351, 74887, 71780, 74339, 40901, -1623, -12041, -52901, -52780, -71556, -63843, 27728, 61716, 4335, -70187, -161088, -122848, -25571, 41774, -7833, -32625, -2817, -18592, -26729, -56178, -39058, -74161, -114556, -68003, -86062, -11132, -32297, -14357, 1713, 62669, 70353, 105946, -13614, -20910, 43952, 76275, 50335, 110012, 136460, -5251, -30059, 101718, 180582, 91427, 19127, 135043, 260365, 196074, 87185, -10558, -120032, -116865, -78396, -16261, 86987, 158457, 139118, 142617, 140910, 194150, 156618, 184224, 211328, 174398, 147511, 81515, -71139, -80640, -8156, -66449, -144293, -214313, -162730, -14239, -24, -84438, -64092, 45848, 200399]
21306B00399N9455j12360j2807l5014k2152p058k4620M1699r106n1309l7841K3454
21294A2740r7556m7582J24440j4845P259J4005r274O2697k282j12691m9479Q2196
21282c0372L5484j4464k6362N354M2500N9356Q33k6700L9473m142K2354N6526
21270A59840J16752o0420o3594l5692j5752n4167j38840m7778l7901k67O2660
21259a15159L3256M2527P0766K7659m44p2450O68K0790j4634l9347M7725L8677
21247D0034p0385l7479O2556K0799j0916q1177J869K1736l4443M0851N4874N4914
21235F3233r475k2708r8219j5265k3098n8685K9401Q8724j8039r4021q349J29475
21223c7026P3209R9364K0127j8438q0733n6528o3255l4149R077N5352l720m924
$$ y = [200399, 259854, 147494, 134687, 99673, 77521, 70463, 45843, 87542, 78436, 27127, -10714, 12740, -84816, -132398, -7958, -22803, -15544, -1539, -10813, 51884, 49602, -63089, -112568, -30372, 5112, -9352, -35714, -30360, 12140, 71496, 72329, 45629, 85102, 80960, 103314, 159840, 276592, 216172, 152578, 116886, 101134, 46967, -91873, -139651, -177552, -177819, -115159, -81903, -39376, 31390, 59049, 58605, -13845, -13177, 7613, -7021, -46368, 1357, 40034, -30351, -67830, -5274, 15525, 4609, -76568, -74699, -52963, -87406, -46555, 8319, 63233, 53758, 31050, -67169, -82434, -105532, -164217, -134816, -46092, -64131, -158152, -166501, -37026, 36183, 135547, 155674, 137236, 56503, -25, -63280, -97429, -88352, -33000, -36720, -41644]
21211d1644Q920J06377M7821j51019q3211J7197q7425m6767J26215R4735L5957
21200B7156L1912Q0784M2869r5549j61283n0852J8795q062M7784L672L0654J7168
21188a4952m2053N6857O5572r1603j2534r7881r7500J07360r69N2081M6389Q8498
21176E9265K2023M2180j06273l0833P1873j05215M0980P823q0096o1825k0963
21165a61061q142P8233M0305N947Q5884P2934O6229l3987q9509j3007M5715p3363
21153A6178l1559N1087M5772q0368p9229J8226K6365Q6179R6195K2528J118O74
21141A73166p7998l9648j6255r668K7330m4681q1758p8355o3360L0892J00078
21130h0257L7485j8059R9287N13q1587M2697M5318j6367j261O4730o5029l448
$$ y = [-41644, -32724, 73653, 121474, -29545, -112756, -95559, -182984, -229751, -103536, -8801, 27156, 59068, 139852, 182721, 87172, -74111, -124963, -106168, -114230, -66446, -62774, -32120, -14952, -57005, -148, 65424, -26179, -38713, -136594, -234094, -126734, -127703, -75622, -29233, 59265, 81288, 123468, 17195, -13638, 58235, -46980, -6000, 1823, -78273, -140098, -161061, -169203, -90970, -50665, -44718, 41166, 114100, 180329, 146342, 56833, 43826, 89541, 16178, -15381, 35706, 81478, 1110, -78119, -59893, -33528, 52651, 148846, 171374, 172492, 173166, 95168, 55520, 39265, 29597, 56927, 12246, -69512, -147867, -211227, -180335, -80257, -42772, -60831, 38456, 38969, -42618, 79, 45397, 29030, 27769, 92499, 27470, 24022]
21118B4022n8358K2740N2177K3011Q8209J8286m1856m668p2774j11262k384L2834
21106c0023N1437N7135K8131K6626O8556j0402m6868J9513O6760l0464R828n7484
21094A52745p4724j23580M9863J30056n6770N307j303n0595L7185P7663J560M1597
21082A89004M1941q6053J4099J9155q6185J05292n5945K4331L582l0670p0288
21071F8263r171l749R079J4851n1170J8375M7496p6944r5057o0821P7423O4273
21059B848o3519J8910O7713O4691m7459q6945o9659q7081K1644P639N9539L6030
21047g5649J4301J18626Q2813m2935l5362o0370L7543l3628L1561j09365k4170
21036i6635O703j875j9316K3899Q4257p2274K3809K5079l0971m4319J08771o340
$$ y = [24022, -34336, -11596, 40581, 63592, 151801, 170087, 128231, 123563, 50789, -60473, -62857, -30023, 21414, 78549, 106680, 133306, 201862, 191460, 144592, 164105, 230865, 200401, 210229, 152745, 78021, -45559, 4304, 134360, 77590, 82897, 81594, 30999, 68184, 145847, 147407, 189004, 230945, 144892, 158991, 178146, 91961, 197253, 141308, 165639, 169221, 138551, 68263, 59092, 55343, 64422, 79273, 28103, 46478, 93974, 17030, -78027, -138848, -61425, 2848, -60671, -41761, 25952, 90643, 43184, -43761, -113420, -200501, -178857, -171218, -111679, -75649, -61348, 57278, 140091, 97156, 61794, 1424, 38967, 5339, 36900, -72465, -96635, -89932, -91807, -111123, -87224, -2967, -75241, -51432, -26353, -57324, -101643, 7128, 788]
21024G88l7145K0074R135j21430m3091M0667N3680O1146J5083O722O4970r050
21012F1549k1520k2324L2974J3652L7429Q525O613M9461J8472m2721n2245m6866
21000D2999l3369J1687n749o5567j3634L3493Q786r4359o4351Q474P350K6467
20988a37773J49407O5685N646n1280k5743P0582P2633l5580r6624L0548j08459
20977f0958l0093L0365J8443J9115K2727P1707J1742J4519j43554K5175P8327
20966E7515n9880o1954O1251m4507n4270L1191L6248M56J3850j36997j06225O1054
20954b02268K4993J05507N7666Q8232n0798L0373o9420m7677R3264N5883j83082
20943i7327o9368O0997N2625M0729o5170P6411O6465j09243j08291q117l5306
$$ y = [788, -36357, -16283, -7148, -128578, -171669, -131002, -77322, -16176, -1093, 5629, 70599, 61549, 40029, 17705, 50679, 64331, 101760, 110285, 116898, 166359, 184831, 142110, 89865, 42999, 9630, 21317, 15568, -49999, -63633, -30140, -21354, -115713, -180064, -171590, -164240, -137773, 11634, 77319, 82965, 31685, 5942, 76524, 149157, 113577, 16953, 47501, -60958, -91051, -60686, -42243, -23128, -401, 71306, 83048, 97567, -45987, -20812, 57515, -2365, -64319, -3068, -47575, -101845, -70654, -34406, -33950, -20100, -157097, -263322, -202268, -177275, -71768, -14102, 74130, 23332, 53705, -15715, -63392, 29872, 85755, -97327, -166695, -105698, -53073, -12344, -77514, -1103, 65362, -43881, -152172, -160289, -195595]
20932a95595O4249M8753J43238N907m5778p7609m6023k2892J19635J24640K9441
20921A47966m0340q3274M5726O6756m1943m431m9663L1872l149J9131o6330m0462
20909a8141J9855M5873P3085J023l0575m4252q407o2164m6143l2386n0624K4728
20897a28128J05247J01719k8464J7083m1883Q131l4073N585P7968M9862q1975
20886E1072m5220r7650N582O9961N9548J1578J3348o7533j9538J1765q99o0058
20874f8044m8616n8176k4067n0097R78L3756J4222j20391O704O6258N5040P5376
20862a17057R571j3449O5065k8862M0206R3205L6467m8267o6652j20403R899M2573
20850i7704L8926N7464M77k9117o8560N1037P4356q903K1053l5594m9886L649
$$ y = [-195595, -131346, -82593, 60645, 66552, 20774, -56835, -102858, -125750, -6115, 118525, 147966, 107626, 24352, 70078, 136834, 94891, 90460, 40797, 72669, 69520, 88651, 22321, -18141, 1714, 47587, 120672, 121695, 91120, 46868, 38461, -23703, -69846, -102232, -152856, -128128, -22881, 78838, 50374, 67457, 25574, 33705, -368, 5217, 83185, 133047, 51072, 5852, -91798, -86216, -16255, 43293, 54871, 68219, 686, -18852, -7087, -7986, -68044, -116660, -174836, -198903, -249000, -248022, -214266, -200044, -320435, -313731, -247473, -192433, -117057, -107486, -120935, -55870, -84732, -44526, 48679, 85146, 36879, -29773, -150176, -140277, -97704, -58778, -1314, -837, -29954, -98514, -47477, 26879, 17976, 39029, 3435, -46451, -42802]
20838d2802l6442o2639n149R1519K4020r3844J2718j9949L1163J8392m134L6184
20826e0963Q816l9463l0563L2249Q0147J8504k6407P6987K0606M3768m7675p9262
20814F744j0397O6354O5572p4110p5303K1973j6825O1356N6973K9197L4141o7176
20802I8499K2199m902j66942q1291L7356J8376L4980l1806L2906P3232L6341P9210
20790A48158j17239j77408n9903O6646J28658K9594k81L1369j4329m4228k8577
20779c7540o9226K349p246q031o1300K8696O644P7748P0528n7110K2182P992k2904
20766d7218q2320J3654Q7701M3618q091J37k6068j5492P0655J635K3158m9678
20754A1691j19373o3323K5444m9007J9451o950L8748K6619k5841M3297n4972K4798
$$ y = [-42802, -79244, -141883, -147032, -55513, -31493, -125337, -112619, -132568, -101405, -83013, -87147, -50963, -42147, -81610, -112173, -79924, 223, 18727, -7680, 69307, 89913, 133681, 86006, 6744, -3653, 62701, 128273, 54163, -21140, 833, -15992, 45364, 102337, 131534, 165675, 98499, 120698, 115796, -51146, -132437, -95081, -76705, -41725, -73531, -40625, 32607, 68948, 148158, 30919, -146489, -206392, -139746, -11088, 18506, 18225, 49594, 35265, -8963, -37540, -106766, -104417, -111663, -119694, -180994, -152298, -145654, -67906, 2622, -54488, -32306, -24314, -47218, -129538, -115884, -28183, 15435, 7344, 7481, -18587, -34079, 36576, 38211, 61369, 11691, -107682, -171005, -145561, -194568, -175117, -182067, -143319, -116700, -142541, -99244, -154216, -129418]
20742a29418m2971K9105Q2667n2325l7327K7163M9937n209K5797J9606o3615K4995
20730g1595L3064n3174j2301m0133m9169Q2035O5666l2302P622K8802J0445l5092
20718f6132L8489L7924k0154M4935J23629p029q3150k2969k5473j0140O8366K4816
20706A03112n033p9329o627L2407P5574J256J3636p2002k2821j06593k0133O8223
20694a8330N8651M900j40830J7064J9938J939N4120O30k5811M3923o1345k8360
20682g3511m6361q2574R7930Q1156n6142k2564J9560m8882P8755R8235J8493k5768
20670C8327j06675p7286J6768l3454P7602N8911k8261L9137M254M7934l0455o6046
20658e9244k2186j8240n6030k8827o090P2229O0222j09228K5516P5233O1251q9706
$$ y = [-129418, -172389, -143284, -60617, -112942, -150269, -123106, -73169, -78378, -52581, -32975, -96590, -71595, -38531, -91705, -104006, -144139, -193308, -111273, -45607, -77909, -70287, -41485, -31040, -66132, -27643, 10281, -9873, 35062, 158691, 151662, 68512, 45543, 20070, 9930, 78296, 103112, 98079, 18750, 12123, 44530, 120104, 121360, 134996, 62994, 40173, -66420, -86553, -18330, 40321, 45221, -95609, -78545, -58607, -56668, -2548, -1918, -27729, 16194, -45151, -73511, -119872, -202446, -104516, -23360, -79502, -102066, -82506, -131388, -52633, 45602, 64095, 38327, -68348, -145634, -128866, -162320, -84718, -25807, -54068, -14931, -10677, 37257, 6802, -59244, -81430, -99670, -155700, -184527, -190617, -118388, -58166, -167394, -141878, -66645, -5394, -95100]
20646i5100r4266K4894j8532K2301O4457O1302k0346o8463N6055R9856L4697m7165
20634A9690p9774P5185J119L7094O4253j9175M3503K3360o0658P487p1530r5496
20622e4942l1994K3453k4579k9593L3642K9906j6490M9377J3810N2861J14573
20611A60024m804J6099R5694j22712j63768o6995p8653k7552O2179K1067L2653
20600g6768p51P7302O9370o5064N5482N2900p0079l3144M9708N6877o9935p1241
20588b5343M1936O5805k2517k1980j7143J3127p8386L194K9805M2101l1436p2539
20576g3376j470N2644M5881k5651q449o2857Q6346R9000J8422l4185j25248J367
20564b7576K6360P25j19927k8889M2314L5867J08673N9617l9560J8320N1889J8985
$$ y = [-95100, -189366, -164472, -183004, -160703, -96246, -34944, -55290, -123753, -67698, 32158, 66855, 19690, -60084, 15101, 16220, 53314, 117567, 98392, 141895, 165255, 104597, 112084, 40554, -54942, -86936, -63483, -88062, -117655, -84013, -54107, -70597, -21220, -7410, 45451, 160024, 155220, 171319, 267013, 144301, -19467, -86462, -165115, -192667, -130488, -109421, -76768, -77519, -217, 69153, 4089, 59571, 112471, 42392, 9248, 58956, 115833, 45898, -25343, 16593, 82398, 59881, 37901, 20758, 33885, -44501, -41307, -11502, 30599, -837, -73376, -74846, -22202, 23679, -1972, -10421, -73278, 13068, 112068, 130490, 96305, -28943, -27576, -1216, -491, -120418, -149307, -106993, -71126, 37547, 97164, 57604, 75924, 127813, 146798]
20552A46798o7620P5666O7347O5123k030j09761j21483M5344P6103j3649j10471
20541E1367L2400J8146p1360l3671j1240M359k4039o0687n472M8336L4117L1521
20529A3777k1812L1470j4802j0045L9607L0102J4203M4136L0967M4613M995P9740
20517B86951J2924j6587l7809l4443n1800q6452n5427r2650L2133R9192n0937
20506E095j38965k8311M0597L7963P0087M9994R778l8153J7679o4366n2823P5618
20494a5807N0160k0906L1891J17429K8223n9433M6286P3680j7681o105o9111p1052
20482H7574R540j27173j35362K0885J4479P0396P3833P9899n6792l9141k2592
20471b4454n3266K7821j8163m0561P5041Q7722p8689M9210j5763R696n1413q4319
$$ y = [146798, 79178, 154844, 222191, 287314, 285284, 175523, 54040, 99384, 175487, 161838, 51367, 83767, 101913, 30553, -3118, -14358, -9999, -34038, -94725, -100197, -51861, -17744, 13777, -8035, 23435, 8633, -1412, 38195, 68297, 82500, 126636, 157603, 202216, 207211, 286951, 299875, 283288, 245479, 211036, 159236, 72784, 17357, -75293, -43160, 56032, 5095, -133870, -162181, -121584, -83621, -13534, 36460, 46238, 8085, 25764, -38602, -91425, -15807, 34353, 13447, 45338, 162767, 190990, 131557, 177843, 251523, 233842, 227737, 158626, 87574, 97114, -30059, -165421, -144536, -130057, -59661, 14172, 94071, 37279, -1862, -24454, -77720, -49899, -68062, -108623, -33582, 54140, -24549, 24661, 8898, 18594, -32819, -117138]
20459a17138R496p846j950Q2116J383K1565K0370J04775j5842k1636n8702m810
20447A1781m9054O3876K9805q825j04583o7209Q3597k459J0231O1416J28268Q1631
20435B38475p2681m7951m4141l8462l3391j7870N1964J8566l191l9117J9182k6059
20423E324L2696P4099o3643J2613P8426l311k772P3216n5618p1636m4572J7732
20411E2554l8159m3409N6055k0758K852m0170J1289n3073j7098j3425J2664J00756
20399A0078L5167n6984m3066N0807m8440j3617J22791Q1371l2906M82N8187j8555
20387A45315m9332q6923l3631K0548k6037j3938K4886Q614p489K0273p910J9196
20375A3572p6565P5233J08839M8624q8362q6807j9507O4684J08240P7630N327
$$ y = [-117138, -107642, -115488, -117438, -35322, -33939, -12374, 7996, 112771, 96929, 75293, 16591, 11781, -37273, 26603, 56408, 47583, -57000, -124209, -40612, -43071, -32840, 28576, 156844, 238475, 165794, 117843, 73702, 35240, 1849, -16021, 35943, 54509, 51318, 12201, 31383, 5324, 38020, 112119, 48476, 61089, 139515, 136204, 133432, 206648, 151030, 79394, 34822, 52554, 14395, -29014, 27041, 6283, 9135, -31035, -19746, -72819, -89917, -103342, -90678, 10078, 45245, -11739, -54805, -3998, -52438, -66055, 56736, 138107, 105201, 105683, 163870, 145315, 95983, 9060, -24571, -4023, -30060, -43998, -19112, -10498, -17987, 2286, -5624, 13572, -62993, 12240, 121079, 169703, 81341, -5466, -24973, 39711, 147951, 225581, 230908]
20364B30908j59126o5767j2539M0065N5543j08514p4712O5601o9390p1047N4220
20353a14758R1367r353o3366n9L8048O8792P6866O289R0861p5825j76957O7937
20341a58R1627P2592j843M207o4966o4898r948j4669J09145j9145q7448r8230
20329h3734j0949j28353O1856J27301P7429m3853J3545R1642l6315l9301r295
20318A9973O8354k2091j57579K9533J5675Q4171M3927k7433Q41O5974J8301q5482
20306E4164l2605k8577k0872J3808p1234k971L4902J03030O200p4878K7808j6662
20294g887k5944r1160n2097J21941L9251L5934O1366l6170M5525r4105o3625j5425
20282h2396O4862J7807M5240M1084m7810m0598K0285J4263R6996N7367p9981n6562
$$ y = [230908, 71782, 6015, -6524, 33541, 89084, -19430, -94142, -28541, -97931, -168978, -114758, -23391, -32744, -96110, -96169, -58121, 10671, 87537, 93826, 184687, 108862, -68095, -158, 91469, 164061, 162218, 166425, 101459, 36561, 26613, 11944, 121089, 101944, 14496, -83734, -94683, -223036, -161180, -33879, 43550, -303, 13242, 104884, 68569, 29268, 19973, 88327, 66236, -91343, -61810, -46135, 38036, 81963, 54530, 55371, 121345, 139646, 54164, 21559, -7018, -27890, -14082, -85316, -88287, -53385, 49645, 55845, -19033, 8775, -7887, -33831, -124991, -177088, -55147, -15896, 20038, 81404, 45234, 90759, -3346, -66971, -82396, -17534, 273, 45513, 86597, 38787, -1811, 18474, 32737, 129733, 187100, 107119, 50557]
20270E0557k8014N7185R333L3806q1864N6311m5570p3895N0413N7374j5191P016
20258G7461m7049j5348o458k1315P423J1280m5222l2355k0458M8442j5561N8279
20246h81O7974J9341m3881j80052m1786j0967Q6255Q2746J72440k9133j15360
20235F696P3963M6918q6976k4564P928m3069m6523j4278k8532O1436P6624K6337
20223E5960L6625l364K0794l885j38370j38512P0282J22580J25385K5700O038
20212A79233O4765k5615j46843M694Q1748j05197r7142K2825Q2213O918Q538o4421
20200A1716L3911J48380O4323O7161n2250j05099k9105m3479j596M361k2913m8226
20188B7184O1319Q0425l1136k0980q8993j4897Q9478L2733J51852K4662q7582
$$ y = [50557, 22543, 79728, 89061, 122867, 41003, 97314, 51744, -22151, 28262, 85636, 70445, 77461, 30412, 15064, 8606, -12709, -5286, 5994, -39228, -71583, -92041, -43599, -59160, -881, 67093, 86434, 42553, -137499, -179285, -190252, -103997, -21251, 151189, 122056, 6696, 80659, 127577, 40601, 16037, 23965, -19104, -65627, -79905, -108437, -47001, 29623, 55960, 92585, 89221, 110015, 106130, -32240, -170752, -100470, 22110, 147495, 173195, 179233, 243998, 218383, 71540, 76234, 157982, 52785, -44357, -21532, 60681, 67599, 76137, 11716, 45627, 194007, 258330, 325491, 273241, 168142, 139037, 95558, 93962, 98323, 75410, 27184, 88503, 168928, 137792, 116812, 27819, 12922, 102400, 135133, 286985, 311647, 224065]
20177B24065k2810n7873J140l1488q9074q7090L0498J05181M2449J03003p675
20166B10326J461M7114m260j5642o9979n4055N4272O023j7241q0198N1171M9841
20154A78833m6769m175L0569m884p8602L9733P1934k4791j7609J2424p5349p6923
20142D391p0972N780K0377k5865j4101R8010J27678R1979j04038o2131K497N9437
20130A33042K0400k6362j40000l9302l9846m8368M1988L634M1064N0183r549m502
20118a7618N2151J8168n6694l1576P4625J19923j19916m8966O2971O6911L2559
20107A52538r9985j20235P2949J2060o837P2246j5228l4910m4844j7888j5238
20096d5372M5088K7196q930J1864N1977N8116L5127M4803k3152n4166J1960k940
$$ y = [224065, 201255, 143382, 144522, 113034, 23960, -63130, -32632, 72549, 114998, 218001, 210326, 211787, 258901, 254641, 238999, 169020, 114965, 169237, 175260, 158019, 77821, 128992, 178833, 132064, 127889, 158458, 153574, 74972, 114705, 186639, 161848, 144239, 156663, 81314, 4391, -66581, -60801, -40424, -66289, -80390, 17620, 145298, 237277, 133239, 71108, 73605, 133042, 153442, 127080, -12920, -52222, -92068, -140436, -98448, -94814, -53750, -3567, -13116, -17618, 34533, 52701, -3993, -35569, 39056, 158979, 39063, -9903, 53068, 119979, 152538, 52553, -67682, 5267, 17327, 10490, 82736, 67508, 32598, -12246, -30134, -45372, -284, 26912, 17982, 29846, 81823, 139939, 175066, 219869, 196717, 142551, 154511, 151571]
20084A51571n7805j39371k8326L983K7053l6874l9753L8929N8779n6448j6301
20073i4563N9575M1543k2207M5263P1930M4878m4241n7472j01593j1442l4285
20062a02614R4678J02667l086k3443q1410r14O846R4793K2921O9702Q7211m6743
20050B20608J1235p684m7344o1551j09091J378r530N9799j5836k6421Q9598J34390
20038B39551m4328l716o457k9212J9375j185o7254n3714j6387J02899P6928j13992
20026A02508K7871p857P8869K4420L9894m9125J3814O857q8603n1579n5479O456
20014D8046Q449M4522r984L0828l8044o7158R6588J8890L8224K6357l2343o2802
20002A01573q1493j6815j1811J20158M1757J5608m181J8135n4059j14787j52825
$$ y = [151571, 93766, -45605, -73931, -69948, -42895, -79769, -119522, -80593, -21814, -78262, -94563, -34988, 6555, -15652, 29611, 101541, 146419, 102178, 44706, -56887, -68329, -102614, -7936, 94731, 91645, 68202, -13208, -14122, -7276, 87517, 110438, 180140, 267351, 220608, 231843, 224159, 176815, 115264, 6173, 7551, -1979, 57820, 41984, 15563, 105161, 239551, 195223, 191507, 185050, 155838, 175213, 174028, 106774, 53060, 36673, 139572, 216500, 102508, 130379, 122522, 201391, 225811, 265705, 216580, 230394, 237251, 148648, 97069, 41590, 48046, 56495, 101017, 91033, 121861, 83817, 16659, 113247, 132137, 170361, 196718, 164375, 101573, 20080, 3265, -8546, 111612, 153369, 168977, 164796, 182931, 128872, 14085, -138740]
19991a38740K3203J42257O7187J668K1555N4333J8404k7427L5284O9667j1776
19980B55615k6804n2941J7254o3989P8245P1612k5066l3313m9610K7055n2183
19969A45875o3380q490l6360J7066J05623q603K3234m284j1516r4370j44481R9641
19957A9955L0744K2893p0883j2567R4155M5441j8303M1036j5622l9016l1422O1102
19945A27513m4158p5450K2558J29091P1630k8036k7725J5035k2774K1416k3315
19934A65785n509o0030l3039p776P0462M3895J0354m401K1102J26528j5021j7254
19922B95096m4678o3977Q092P5760N5144J4568j05706p0646J3327N9938J6809
19911B53727o9181k7289L6699N1017j8323l9479q2282j8946P1682l4620O1922
$$ y = [-138740, -115537, 26720, 93907, 95575, 117130, 171463, 189867, 162440, 197724, 267391, 255615, 228811, 175870, 193124, 129135, 207380, 278992, 253926, 220613, 171003, 198058, 145875, 82495, 74005, 37645, 54711, 160334, 151731, 174965, 170681, 159165, 64795, -79686, 19955, 50699, 73592, 2709, -9858, 84297, 129738, 111435, 152471, 136849, 97833, 66411, 127513, 83355, 7905, 30463, 159554, 231184, 203148, 175423, 190458, 167684, 189100, 165785, 160276, 100246, 67207, 59431, 129893, 173788, 184142, 179741, 200843, 327371, 312350, 295096, 250418, 186441, 194533, 270293, 325437, 340005, 234299, 163653, 176980, 236918, 253727, 184546, 157257, 193956, 244973, 226650, 187171, 104889, 85943, 157625, 123005, 184927]
19900A84927N1705J1543j8580L3082k3169N7496m929p5496j09277l1992P1696
19889A47006Q6083k3837r8288M8387J33787J5780m8410l314R1168M730M0266o3097
19877C30261m479J7809j02178j4964L2330J0196P8459L0572K0K7384r0803J1732
19865C26339J33557J976j2822p3626k222J19837j1112j03066j06341l0305R7276
19854C39491J38115N0807m3162j2753p020K4466O7538M9523l7566l9697j9330
19843E10412p839k8890j55251j22638R1716l333j01260O1943M2294J7069m5178
19832B59045M9183J21833O686r568R3691N2941L6095M5673r279j55938j14049
19821C76313P9566J03140M1591L9237j53601m373Q8544o0650p4476L6561N9215
$$ y = [184927, 236632, 248175, 229595, 262677, 239508, 297004, 292075, 216579, 107302, 75310, 147006, 233089, 209252, 110964, 159351, 293138, 308918, 260508, 257194, 348362, 353092, 393358, 330261, 325782, 343591, 241413, 226449, 258779, 268975, 347434, 378006, 378026, 405410, 314607, 326339, 459896, 461872, 449050, 375424, 373202, 493039, 481927, 378861, 272520, 242215, 339491, 477606, 528413, 485251, 472498, 465478, 489944, 557482, 607005, 569439, 529742, 510412, 502573, 473683, 318432, 195794, 287510, 284177, 182917, 244860, 287154, 304223, 259045, 308228, 430061, 436747, 427179, 520870, 573811, 609906, 655579, 646300, 490362, 376313, 455879, 559019, 600610, 639847, 486246, 481873, 570417, 509767, 435291, 471852, 531067]
19810E31067K8216l568j66387j29787j2866M983j9943L4302L8851L3946J60774
19799D99588M5149l0946l3907q208L7164O6080l1203m8667M7410O5690L0161p4742
19787E63569l9203K5652O8012L8208K4861N1743j44970p7504R7707O0641P847
19776F76563K5830j0693n9062J2878K8460o5932l881J41055M12n646P979O472
19764G54435k6049p8812r120M6856J81593L7506q0825o8361R4687M8440J9012
19753I19362J1964K4960k2653o5557j3173l6004J522Q7065L6897k6066R59K1783
19741I41059L8674J5050J03806N812n2995J351O140K8011J30662K3613l796n0743
19729A186644k5585j6422R5980P7302M2322p8194j0572N5924j8380j6984O817
$$ y = [531067, 559283, 555715, 389328, 259541, 246675, 251658, 231715, 266017, 304868, 338814, 499588, 544737, 513791, 479884, 471676, 508840, 574920, 543717, 495050, 542460, 608150, 638311, 563569, 524366, 550018, 618030, 656238, 681099, 732842, 587872, 510368, 608075, 668716, 676563, 702393, 691700, 632638, 645516, 673976, 608044, 604163, 745218, 745630, 739984, 747963, 754435, 728386, 649574, 640454, 687310, 868903, 906409, 825584, 757223, 851910, 900350, 919362, 931326, 956286, 933633, 868076, 854903, 818899, 820421, 907486, 944383, 918317, 919276, 941059, 979733, 994783, 1098589, 1104401, 1051406, 1052757, 1058897, 1086908, 1217570, 1241183, 1237387, 1186644, 1161059, 1144637, 1240617, 1317919, 1360241, 1282047, 1271475, 1327399, 1309019, 1292035, 1298852]
19718A298852n1258j5509Q8240J09030O4946j36945l2011k011O1739R6379P6823
19707A558275p273n1435J04640K3393P6861J4038L0310M6643l5836J3190J10970
19696A883776J28755r3415J3904Q9386P152O4514P6780P5511J11494M3299j6380
19685B384776j20630l138J16807R8793O5413R7021J10772K2071K2303P2627P5990
19674B942805J4708K4255J10180J12278M8589L1725J50520J00497O2673L7596
19664C635826J43162N7324L7767L6228K4332N2456J96887J33827Q9148J20116
19654D527073J45158J52393K36781J72525J24145P8635J08775K51837J71267R3554
19644F062143K15458J63613J96664K75138L07633K86392K49207K38117K23661
$$ y = [1298852, 1247594, 1232085, 1320325, 1429355, 1494301, 1357356, 1325345, 1323334, 1385073, 1481452, 1558275, 1551002, 1499567, 1604207, 1627600, 1704461, 1718499, 1748809, 1795452, 1759616, 1772806, 1883776, 2012531, 1919116, 1933020, 2022406, 2029558, 2094072, 2170852, 2246363, 2357857, 2401156, 2384776, 2264146, 2261008, 2377815, 2476608, 2542021, 2639042, 2749814, 2771885, 2794188, 2866815, 2942805, 2957513, 2981768, 3091948, 3204226, 3252815, 3284540, 3435060, 3535557, 3598230, 3635826, 3778988, 3836312, 3874079, 3910307, 3934639, 3987095, 4183982, 4317809, 4406957, 4527073, 4672231, 4824624, 5061405, 5233930, 5358075, 5436710, 5545485, 5797322, 5968589, 6062143, 6277601, 6441214, 6637878, 6913016, 7220649, 7507041, 7756248, 7994365, 8218026]
19635H218026J71073J39458L04684L64149K77410K56533K81786L26558L32436
19626A0672113M45842M04388M25793L31872M09372N54138O30764N60940M51852
19617A4887074M14932M86735N98163N75766M98008M46172N01237M89794N79969
19608A9477850O23788O23048O03659N26607M97821M97649M80756L57458K31580
19599B3920216L24316M27904L29718J79540J30558Q2032J3469R6205K8546l2681
19589B5499823j14761k79544k86078k75720l30136l63263m82229m82247m19288
19580B2466557k75175l88761m61617m56302n67972n55908n80710n86525m53190
19571A8140397m95378n61422m59642l73307m57126m38830l98165n03086n48706
$$ y = [8218026, 8389099, 8528557, 8833241, 9197390, 9474800, 9731333, 10013119, 10339677, 10672113, 11117955, 11522343, 11948136, 12280008, 12689380, 13243518, 13874282, 14435222, 14887074, 15302006, 15788741, 16386904, 16962670, 17460678, 17906850, 18408087, 18897881, 19477850, 20101638, 20724686, 21328345, 21854952, 22352773, 22850422, 23331178, 23688636, 23920216, 24244532, 24672436, 25002154, 25181694, 25312252, 25394284, 25407753, 25503958, 25532504, 25499823, 25385062, 25105518, 24819440, 24543720, 24213584, 23850321, 23368092, 22885845, 22466557, 22191382, 21802621, 21341004, 20884702, 20316730, 19760822, 19180112, 18593587, 18140397, 17645019, 17083597, 16623955, 16250648, 15793522, 15354692, 14956527, 14453441, 13904735]
19562A3904735l80886m35716l15670l76320l79394l78038m16161l33499k70293
19553A0618758k90300k89559k95808m28238m28245l77628l22096j70914k67493
19544G748477k68036k61620k34409k15465j74586k77646k40165j17846j11846
19535E846858j70451j39907j80972r5419m4241j73104j42010j07534j06700j66534
19525D519986r4433j14013l2763p7794j61962j96012j36031j31756j35962m2048
19515C397212K7548l2143n2051K7354j00660o5937j42640j5878j8558o4544m1756
19504B917947K3215n0232j47843l3401Q0239n0379O066J7214k8672j27687r8502
19493B507965p225j7576p3541p3332o713J9692r3450o0201p6373n8696n9393l4029
$$ y = [13904735, 13523849, 13088133, 12772463, 12396143, 12016749, 11638711, 11222550, 10889051, 10618758, 10328458, 10038899, 9743091, 9314853, 8886608, 8508980, 8186884, 8015970, 7748477, 7480441, 7218821, 6984412, 6768947, 6594361, 6316715, 6076550, 5958704, 5846858, 5676407, 5536500, 5355528, 5260109, 5215868, 5042764, 4900754, 4793220, 4686520, 4519986, 4425553, 4311540, 4278777, 4200983, 4039021, 3843009, 3706978, 3575222, 3439260, 3397212, 3424760, 3392617, 3340566, 3367920, 3267260, 3201323, 3058683, 3042805, 3024247, 2959703, 2917947, 2941162, 2890930, 2743087, 2709686, 2789925, 2739546, 2745612, 2762826, 2734154, 2606467, 2507965, 2500740, 2483164, 2409623, 2336291, 2329578, 2349270, 2255820, 2195619, 2119246, 2060550, 2001157, 1967128]
19481A967128j3454k4504l6321m2389N727N2578k2616k7421p2499q0411K7497
19470A733315k0215k4221m1834j05460L8675Q244n8746M5718M7570k3233o1830
19459A537983k3946J14228l3041o6332L8090m5627k6334p9728j8058L3509O0258
19448A491002J09059l0200j47860j3647J2675k5459j5060L5813L1792n3922j19093
19437A275100r5915L1645r2058k0479j7604J927j0020M3601K7785o1341j55673
19426I26968l3729j6336J4245l533O7l779J2319p3877j02160j45227J3328m3188
19414E45098K9673M1914k5802M7367O9706K3700J55J9344n0843K940J6594j5932
19402G03914p242m323m8461O5738P3803l1182K1472O9934o7935o45Q1553J27301
$$ y = [1967128, 1953674, 1929170, 1892849, 1850460, 1856187, 1908765, 1886149, 1858728, 1786229, 1705818, 1733315, 1713100, 1688879, 1647045, 1541585, 1580260, 1588504, 1529758, 1575476, 1623046, 1599813, 1537983, 1514037, 1628265, 1595224, 1528892, 1566982, 1521355, 1495021, 1415293, 1397235, 1430744, 1491002, 1600061, 1569861, 1422001, 1408354, 1421029, 1395570, 1380510, 1416323, 1448115, 1394193, 1275100, 1179185, 1210830, 1118772, 1098293, 1080689, 1082616, 1072596, 1116197, 1143982, 1082641, 926968, 893239, 876903, 891148, 887615, 887682, 883903, 896222, 822345, 720185, 574958, 588286, 545098, 574771, 616685, 590883, 638250, 707956, 731656, 731811, 751155, 700312, 703252, 719846, 703914, 696672, 692349, 643888, 709626, 783429, 752247, 773719, 843653, 775718, 775073, 856626, 983927]
19390I83927m129p1691r9147n4994o6213O2610R2461O3837p8455q5691o3249o8757
19378F10509M9834J09230J858o5749m3831j3967M4107M3094L0552j12455o6402
19367E86780L5319N8794k3167o5775K6138K1834n0391K404J74237J42770O8367
19356I77310P9137J0768r7656r2588J54337J13801L6307r5721j37927r6542k0276
19345H30950Q5534J57418q2657j49826p2800k5567p0500R614J6218N3419K1572
19334G73375O7211J37659N0950j25329o6862Q6306P815q2211J3057N5647O8123
19323I85741J20898J07311P5572J38552J49017R5607J4450o6135j28534j45022
19313A347457J4989M0735o4399j78543n4063N402L4604L5158J4446j3470N8674
$$ y = [983927, 979798, 908107, 808960, 753966, 687753, 750363, 842824, 906661, 828206, 742515, 679266, 610509, 660343, 769573, 771431, 705682, 661851, 647884, 691991, 735085, 765637, 653182, 586780, 622099, 680893, 657726, 591951, 618089, 639923, 589532, 591936, 766173, 908943, 977310, 1056447, 1067215, 969559, 876971, 1031308, 1145109, 1181416, 1085695, 947768, 851226, 830950, 916484, 1073902, 991245, 841419, 768619, 743052, 672552, 682166, 698384, 751803, 773375, 840586, 978245, 1029195, 903866, 837004, 923310, 931125, 848914, 861971, 917618, 985741, 1106639, 1213950, 1289522, 1428074, 1577091, 1672698, 1687148, 1621013, 1492479, 1347457, 1362446, 1403181, 1338782, 1160239, 1106176, 1111578, 1146182, 1181340, 1195786, 1182316, 1240990]
19302A240990k300j02983m7871j0394p6606j17532N974j13706j23206r173m0370
19291F02823M7555k2365p3839P803N4493r1831k4611L266L8350J15297J17578
19280G74519m680R1903R7645P7192N3152o4141q3767N9914L531M7894l313Q3084
19268A132933K17823M7664n1043R2558J55802P9881k15829j58186j36029j22290
19258A043284j00264j86526N119J32365l2370m9434j0010o3669L930k199R1444
19247H31670o036o6497Q432N4847j23701j64714J2818k2805M3955M2592l8212
19236E72349L2002l0974Q1734m0582J34923J33335O9777j04742n0416J6224K1382
19225H35012J0873J81350J27112N4454M6201M3453L4384M2645J1268p5135l838
$$ y = [1240990, 1238690, 1135707, 1087836, 1077442, 1000836, 883304, 889278, 775572, 652366, 643193, 602823, 650378, 628013, 554174, 561977, 616470, 524639, 500028, 503294, 541644, 656941, 774519, 769839, 861742, 959387, 1036579, 1089731, 1025590, 941823, 1001737, 1005268, 1053162, 1049849, 1132933, 1350756, 1398420, 1347377, 1439935, 1595737, 1675618, 1459789, 1301603, 1165574, 1043284, 943020, 756494, 761613, 893978, 861608, 812174, 802164, 738495, 742425, 740226, 831670, 825634, 759137, 767569, 822416, 698715, 534001, 546819, 524014, 567969, 610561, 572349, 604351, 573377, 655111, 614529, 749452, 882787, 952564, 847822, 797406, 813630, 835012, 845885, 1027235, 1154347, 1208801, 1255002, 1298455, 1332839, 1375484, 1386752, 1311617, 1307779]
19214A307779J5828L7778L7260k9327P3572J8912M7647l1681j01350j1373o8282
19203A296763r3863j5908m3240r19j492M196l8100j8883n877k02n0204P6751O9063
19190A178085j4178j6374N942J42118J14674K5011r987N4677M6359r5986J1007
19179A441348k7022N1836R4908O5716J5804p088M2555J01187K0104Q4150P2746
19168A956244J4818L9820K8975l673p981L0486M0424M6990J59938J36942J67839
19157B610822L0299J16483R1539l3125l9264n370M9929J11326L1343Q9515M7188
19146C100685K66259K75208K59037K36958L38166L05670K55742J61373K22160
19137E421258K72062J99490J35030L00585K23789L46428L62985O13676O73804
$$ y = [1307779, 1323607, 1361385, 1398645, 1369318, 1442890, 1461802, 1509449, 1477768, 1376418, 1365045, 1296763, 1202900, 1186992, 1143752, 1142833, 1141341, 1145537, 1107437, 1088554, 1082677, 1082475, 1032271, 1109022, 1178085, 1163907, 1147533, 1153475, 1295593, 1410267, 1435278, 1425291, 1479968, 1526327, 1430341, 1441348, 1414326, 1466162, 1561070, 1626786, 1642590, 1635502, 1678057, 1779244, 1799348, 1883498, 1956244, 1971062, 2010882, 2039857, 2036184, 2028203, 2058689, 2099113, 2146103, 2306041, 2442983, 2610822, 2641121, 2757604, 2849143, 2816018, 2776754, 2771384, 2821313, 2932639, 2963982, 3053497, 3100685, 3366944, 3642152, 3901189, 4138147, 4476313, 4781983, 5037725, 5199098, 5421258, 5693320, 5892810, 6027840, 6328425, 6552214, 6898642, 7261627, 7875303, 8549107]
19128H549107O07593P77095J073873J380158J661964K218765K745948L330607
19120B2345110L898035M114332L770061K987899K606508K622829L144809M548251
19112E0037834O779622J0120288J4775338K0392977K5958709K9112336K7034477
19105A84211581J8433019N936525m789578j1431867j5638577j8614997j9429334
19098A38676772j7289335j3331589r161615o175435m612445n031819o449982p723943
19090F8900609q246296p885503p301098o547900n456633m302442l327397k511301
19082B3322039j836339j283024q96921m46556k5262L19717N75840Q84669J475090
19073B2089253K010542K658569L504387M466449N779828P436728Q940866R741784
$$ y = [8549107, 9156700, 9933795, 11007668, 12387826, 14049790, 16268555, 19014503, 22345110, 26243145, 30357477, 34127538, 37115437, 39721945, 42344774, 45489583, 50037834, 56817456, 66937744, 81713082, 102106059, 128064768, 157177104, 184211581, 202644600, 208581125, 203791547, 192359680, 176721103, 158106106, 138676772, 121387437, 108055848, 98894233, 92718798, 88106353, 83074534, 76624552, 68900609, 60654313, 52768810, 45467712, 38919812, 33463179, 29160737, 25833340, 23322039, 21485700, 20202676, 19305755, 18859199, 18833937, 19153654, 19729494, 20614163, 22089253, 24099795, 26758364, 30262751, 34729200, 40509028, 47945756, 56886622, 66628406]
19065F6628406R394338P658114N385435L987872M536988O645633J0376384J5159927
19057A29773097J9763791K3430628K5357423K4785147J9767985Q336983q464162
19050B42750892k2833123k9449820l0193941k8367813k4837850j9910302j4559243
19043G2598800r859161o069512l997920l150248l584350m348027m722361m805710
19035C2061511m390282l916836l231208k650887k168117j685394j262639q20101
19027A1936047n69455n68245n68818n02340m85755l46379k25687k19657j08776
19018H340935r787L8990j0164L4331o4111j21011q2289L3379J54739K21465M55714
19007H992191O02605J032613J404554J362653P59838J26834n3955K4639N83960
$$ y = [66628406, 76022744, 83680858, 89066293, 93054165, 97591153, 104236786, 114613170, 129773097, 149536888, 172967516, 198324939, 223110086, 242878071, 251215054, 242750892, 219917769, 190467949, 160274008, 131906195, 107068345, 87158043, 72598800, 62739639, 56670127, 52672207, 49521959, 45937609, 41589582, 36867221, 32061511, 27671229, 23754393, 20523185, 17872298, 15704181, 14018787, 12756148, 11936047, 11366592, 10798347, 10229529, 9727189, 9241434, 8895055, 8669368, 8449711, 8340935, 8331148, 8370138, 8359974, 8394305, 8330194, 8209183, 8126894, 8160273, 8315012, 8536477, 8992191, 9594796, 10627409, 12031963, 13394616, 14154454, 14281288, 14227333, 14251972, 14835932]
18998A4835932J039229J903160L188611M833781P254534J0543009J3228121J1568032
18990F8394409M500691k817857o838824p718601p754526p440361o338498m777152
18982B9209281k819177q94708N89459Q22925n64303k352442l277087l414273k991323
18973A4308352k275120j752510j290799q00775o63500o65328m11639k72828n4469
18964F121384k7110k093J14850K77202M50348M58502N40013P26382J101508J390511
18954A1151497J819413K556362L396839M030582L813889K334422L73573n91360
18946B8885217l22602Q93014K744215M948987P221794Q588640R330643J0501450
18938G2791358J0234389M950347n148282j2858951j5102174j3370267j0056108
$$ y = [14835932, 15875161, 17778321, 20966932, 25800713, 33055247, 43598256, 56826377, 68394409, 72895100, 70077243, 63238419, 55519818, 47765292, 40324931, 33986433, 29209281, 26390104, 25495396, 26084855, 26907780, 26343477, 23991035, 20713948, 17299675, 14308352, 12033232, 10280722, 8989923, 8189148, 7525648, 6860320, 6448681, 6175853, 6121384, 6094274, 6092181, 6207031, 6484233, 6934581, 7393083, 7933096, 8659478, 9760986, 11151497, 12970910, 15527272, 18924111, 22954693, 26768582, 29103004, 29476577, 28885217, 28562615, 29455629, 32199844, 37148831, 44370625, 52959265, 62289908, 72791358, 83025747, 87976094, 82827812, 69968861, 54866687, 41496420, 31440312]
18931C1440312o825210m474765k832984j607116n49332J25783K05062m46928j367568
18922A3667254j993044j982229j623468j276011r48096p14604n10345l25585l97368
18913C896504l49296k08146k08529j71403j57355j66430j36002k1358j0938Q1692
18903B548739J43225k5855j62680j39356j85460k4240P3687l9513j8268l1236
18893B139043N9248J11266M63k9905j39606m9932j8944j47215j02832j10505n3393
18882A657688Q80M0693j6110j3331j01706q7676N7843J28484j4865j05049j27906
18871A418945j58710o942J4539k3888Q4799n652j49574j05174P820J1629m1683
18860A046109j22160l2352P6899j9127j6348Q612J9693Q388J00414j505p3838
$$ y = [31440312, 24615102, 20140337, 17307353, 15700237, 15150905, 15276688, 15481750, 15034822, 13667254, 11674210, 9691981, 8068513, 6792502, 5844406, 5129802, 4619457, 4293872, 3896504, 3547208, 3339062, 3130533, 2959130, 2801775, 2635345, 2499343, 2477985, 2467047, 2548739, 2691964, 2666109, 2503429, 2364073, 2178613, 2154373, 2228060, 2188547, 2170279, 2139043, 2198291, 2309557, 2310020, 2280115, 2140509, 2090577, 2071633, 1924418, 1821586, 1711081, 1657688, 1658568, 1699261, 1683151, 1669820, 1568114, 1480438, 1538281, 1666765, 1651900, 1546851, 1418945, 1260235, 1253293, 1267832, 1243944, 1328743, 1323091, 1173517, 1068343, 1076163, 1087792, 1046109, 923949, 891597, 968496, 949369, 933021, 941633, 961326, 969714, 1070128, 1068623, 994785]
18849I94785J34082M5095l2777q0180k0825o873r4531k2605J9796j00319q0113
18838G55535l105k3198n3215K4279M4361k477j07800o7721J30036P0790L8000
18827H05485J01434o6601p3058p4127k3550l7560l0370l549m0104q0646O2462
18816E39816J02285M0805K2681m8529k5319n8318N260J7337M2819M5136J26541
18805H10514J65887M9232K4424N7523J50338J4719n0106l9314r3116O1428M1607
18794A193136l8584J6500p6649j22948l1313l7870l8579Q638j0523r6413j74834
18783E90561m4457N7102O6143n6617j2543r5405l6086l420m3431q9883j46537
18772A85427r5908R9464R9285P654o7511L7876K06504O0472j15146q6583L180
$$ y = [994785, 1128867, 1173962, 1141185, 1061005, 1040180, 1033307, 938776, 916171, 935967, 835648, 755535, 752430, 729232, 676017, 700296, 744657, 742180, 634380, 566659, 696695, 767485, 805485, 906919, 840318, 767260, 693133, 669583, 632023, 601653, 598104, 558000, 477354, 539816, 642101, 682906, 705587, 657058, 631739, 573421, 578681, 596018, 638837, 683973, 810514, 976401, 1025633, 1050057, 1107580, 1257918, 1272637, 1222531, 1183217, 1090101, 1151529, 1193136, 1154552, 1171052, 1094403, 971455, 940142, 902272, 863693, 872331, 861808, 765395, 590561, 546104, 603206, 669349, 612732, 600189, 504784, 468698, 465278, 421847, 331964, 185427, 89519, 188983, 288268, 295922, 228411, 266287, 472791, 533263, 418117, 331534, 334714]
18761C34714O6691K7750o3256j7024p29L3996j1190j4628P8939M1933Q5200J59034
18749G21430O0663n1792K178j13291K7320Q3063O0470K678n2043p7778j20077
18738E42821J814j5903j03774n3682N7967R51j17113r7078n5001M6517L2050J00390
18726C39959M6217k3872m9366n5461k8137P858J22182L1542o1817N790n1256l9977
18714B43662o5404m3133k0785R6402O7641K6341L1399J0694N8789O8965j0471
18703D64100j2130j6270m0309j16108j57918l867L2185J22231L0031j8851N1833
18692C34927o0006J3675J5340o7416r4210k4755j4851P0989o825O4206N5645j00990
18680A85729j0610k0535O0925N957O5928L1938L4303N944R0075K54n4699j0560
$$ y = [334714, 401405, 429155, 365899, 348875, 348146, 382142, 370952, 356324, 435263, 477196, 562396, 721430, 782093, 730301, 732479, 619188, 646508, 729571, 790041, 792719, 740676, 662898, 542821, 544635, 528732, 424958, 371276, 429243, 430194, 313081, 216003, 161002, 207519, 239569, 339959, 386176, 362304, 312938, 257477, 229340, 237198, 359380, 390922, 329105, 334895, 283639, 243662, 178258, 135125, 114340, 210742, 278383, 304724, 336123, 346817, 405606, 474571, 464100, 451970, 435700, 395391, 279283, 121365, 117498, 149683, 271914, 301945, 283094, 334927, 274921, 288596, 303936, 236520, 142310, 117555, 102704, 173693, 166868, 231074, 286719, 185729, 175119, 154584, 215509, 221466, 287394, 319332, 353635, 359579, 449654, 449908, 395209, 384649]
18668C84649k9118j01825N2693J73971R516r597l3891l6386r2458n525J4206R3777
18656D20012J9887m8266j04869J19093J7681j00548p1643m0119n0743Q1346J02265
18645C44096P4897J5448l654p4664n3172k400M9082L7758J4761N8783l7001j02727
18633C21207L9880J00854O6842Q2585O1560J5510k034K442J6063P908p2648M5646
18621F85815L5103N993O8543O4373j8479N3382O764j0060l1361o6153m4000J155
18609G51075k7206L555m7725k4463j0105Q9259L1907K4089N1471J3443K8681N2386
18597I36367J2399N1811n2766J6257J30485M5740j06107n8736k0669o1681m4728
18586H48372P642j32813J1564J35456O8818n091M7206j5186M8889o284m3291K324
$$ y = [384649, 355531, 253706, 306399, 480370, 489886, 480289, 446398, 410012, 317554, 312029, 326235, 420012, 439899, 391633, 286764, 405857, 423538, 322990, 251347, 211228, 160485, 241831, 344096, 418993, 434441, 430787, 356123, 302951, 300551, 349633, 387391, 402152, 460935, 423934, 321207, 361087, 461941, 528783, 611368, 672928, 688438, 686404, 688846, 704909, 712817, 640169, 685815, 720918, 726911, 795454, 859827, 841348, 894730, 901494, 891434, 860073, 793920, 749920, 751075, 723869, 727424, 679699, 655236, 645131, 734390, 766297, 790386, 841857, 855300, 883981, 936367, 948766, 1000577, 947811, 964068, 1094553, 1140293, 1034186, 975450, 954781, 893100, 848372, 856014, 723201, 734765, 870221, 939039, 933948, 981154, 965968, 1014857, 1008573, 965282, 967606]
18574I67606R7764J45861K0044j22738o1161q8572j08910j74100k9202L0111J45206
18563H21909J31134p6778J5219J12774J06787k7086j85081M742J4850N085M0891
18552I64446O4181M2373L3339N5978R6848L7304k1731P1166J19495J06168l5625
18541A533942o5798P2038N5373l1658q926Q0764k377j552P8355q947R5025J60767
18529A957006o12j27456j52155j88295j52499q5583l4618k1180O7276j12932k1359
18518A127593L0083q6354j01753o1094o5674R595N6190k5614L4431P5670K0952
18507A014025Q982N420O3273j5876K6621K9292R0550q2364q0611O2733j4086P5363
18495A183322m5626p7802K30231K02009J21176L2376m954P0510N5644J4488J5833
$$ y = [967606, 1065370, 1211231, 1231275, 1108537, 1047376, 958804, 849894, 675794, 646592, 676703, 821909, 953043, 876265, 891484, 1004258, 1111045, 1083959, 898878, 903620, 918470, 923555, 964446, 1028627, 1071000, 1104339, 1160317, 1257165, 1294469, 1272738, 1343904, 1463399, 1569567, 1533942, 1468144, 1540182, 1595555, 1563897, 1554971, 1635735, 1633358, 1631806, 1710161, 1701214, 1796239, 1957006, 1956394, 1828938, 1676783, 1488488, 1335989, 1250406, 1215788, 1194608, 1261884, 1148952, 1127593, 1157676, 1071322, 969569, 908475, 842801, 852396, 908586, 882972, 917403, 993073, 1014025, 1023007, 1028427, 1091700, 1075824, 1102445, 1131737, 1222287, 1139923, 1059312, 1122045, 1107959, 1183322, 1137696, 1059894, 1290125, 1492134, 1613310, 1645686, 1640732, 1711242, 1766886, 1781374, 1797207]
18484A797207J65219O3389L6642J40201J40508N9854J99905Q7092p9631q0173
18474B530213j51904j89982j29373J40942J61471J4454p251n7536J19882J15199
18464B546115R4872N4526J58905N3996O2586R6786J04822K29885K38033L14630
18454C955156K19868J36482K47295M01344L89191L40460N85495O43416P13205
18445G631912Q61656J011465J123291J402154J695752J898396K035939K466548
18437B0127113L125097L945233M963451N714194N382000M031054K551100J793608
18429E1632850K146900L730377O672514J0762093J6715130K4888359L5398584
18422A51946807M4820409M5013109L0273130O372564j5174462k7895161l2041144
$$ y = [1797207, 1962426, 2025815, 2062457, 2202658, 2343166, 2403020, 2602925, 2690017, 2610386, 2530213, 2378309, 2188327, 2058954, 2199896, 2361367, 2375821, 2368570, 2311034, 2430916, 2546115, 2640987, 2695513, 2854418, 2908414, 2971000, 3067786, 3172608, 3402493, 3640526, 3955156, 4175024, 4311506, 4558801, 4960145, 5349336, 5689796, 6275291, 6918707, 7631912, 8493568, 9505033, 10628324, 12030478, 13726230, 15624626, 17660565, 20127113, 23252210, 27197443, 32160894, 37875088, 43257088, 47288142, 49839242, 51632850, 53779750, 57510127, 64182641, 74944734, 91659864, 116548223, 151946807, 196767216, 241780325, 272053455, 278426019, 263251557, 235356396, 203315252]
18415B03315252l0897873k6466941k0736353j4411802q174761l587240j599442
18408I7440840k886305o358319r693633j1270478j0946702r272819p234528n424081
18400C4353975l924032k856365k046170j366225q04495j82680M4907J15022K00508
18391B3534445L45590O81879J062546J601065K139551K808080L769900N152711
18383D1095767P192773R720489J2068753J2993588J1180573O829212L024042J543006
18375A05648203L269812P903367J3924516K0102910K6006025L2585087L9095840
18368B48535760M0362330K8732400K776664k6533391m4549467m7606932m1255784
18361A60461580l2473183k4114269j6672776j0457271n541171j850217q1443j019262
$$ y = [203315252, 172417379, 145950438, 125214085, 110802283, 102627522, 99040282, 97440840, 94554535, 88196216, 78502583, 67232105, 56285403, 47012584, 39778056, 34353975, 30429943, 27573578, 25527408, 24161183, 23356688, 23174008, 23218915, 23333937, 23534445, 23880035, 24561914, 25624460, 27225525, 29365076, 32173156, 35943056, 41095767, 48288540, 58009029, 70077782, 83071370, 94251943, 101081155, 104105197, 105648203, 108918015, 116821382, 130745898, 150848808, 176854833, 209439920, 248535760, 288898090, 317630490, 320407154, 293873763, 249324296, 201717364, 160461580, 127988397, 103874128, 87201352, 76744081, 71202910, 69352693, 69271250, 68251988]
18353F8251988m128946p281935q776325q309774o960718n399017l960790k804898
18345B0629585k222700j762008j366345j083938q50018p60141p22945n69828l83840
18336A0907822l64692j24994K3255K01227L46184N57666Q29667J294294K191214
18327A5861643L103426L908197L866441K193610K26850p20898n65390O32973K487960
18318C0994812M627366O224917P056359Q516783J0262880R178577K088570q034832
18310G0915432j3645616j4092165j1255575p805737n059143l273845j986216j110812
18302A2686323l22641L69318L49148l76020j201865j709590j641891j247466q29840
18293F075476n66347m82741m63586l91464m68647l77350l12076j16039j47159
$$ y = [68251988, 64123042, 56841107, 48064782, 39755008, 32794290, 27395273, 23434483, 20629585, 18406885, 16644877, 15278532, 14194594, 13344576, 12584435, 11861490, 11291662, 10907822, 10543130, 10418136, 10441391, 10642618, 10988802, 11546468, 12376135, 13670429, 15861643, 18965069, 22873266, 26739707, 28933317, 29160167, 28439269, 27873879, 28506852, 30994812, 35622178, 41847095, 48903454, 57420237, 67683117, 76861694, 78950264, 70915432, 57269816, 43177651, 31922076, 24116339, 19057196, 15783351, 13797135, 12686323, 12363682, 12733000, 13082148, 12706128, 11504263, 9794673, 8152782, 6905316, 6075476, 5509129, 5026388, 4562802, 4171338, 3702691, 3325341, 3013265, 2897226, 2750067]
18284B750067p8368p7940j67682j53617j5503j05021n8097j07017r2660l0053
18274A864109m9779j40687r7478L4513J9535P500j35867j60155m2777n0727k0218
18263A227969o086j41335p5664J4135j4997q1975n2402J4093R7639R1728N9178
18252A132283p9153m7115m0026n6463n1700Q7920J04155R2277M79m8579o8726
18241A025352j972p3753P4396O5491m4956r1229Q4742K7168l9511k8998M7075
18230A043805m1861r8884p9139r1167n7872k4970m7446R05N2154P0116j8941j12871
18218E93829n7802o2377K5627p7844l8093O7125M9904O9986j7527q7092M0109
18207E05845J9296J959J1272j8300J34956O4414J1572q8373j05824q5771O4413
$$ y = [2750067, 2671699, 2593759, 2426077, 2272460, 2256957, 2151936, 2093839, 1986822, 1894162, 1864109, 1814330, 1673643, 1576165, 1610678, 1630213, 1637713, 1501846, 1341691, 1298914, 1248187, 1227969, 1221883, 1080548, 1004884, 1019019, 1004022, 922047, 869645, 883738, 981377, 1073105, 1132283, 1053130, 1006015, 965989, 909526, 857826, 945746, 1049901, 1142178, 1142657, 1094078, 1025352, 1023380, 949627, 1024023, 1089514, 1044558, 953329, 1038071, 1065239, 1025728, 996730, 1043805, 1001944, 903060, 823921, 732754, 674882, 649912, 602466, 603371, 655525, 725641, 706700, 593829, 536027, 473650, 499277, 421433, 383340, 450465, 500369, 570355, 552828, 465736, 505845, 525141, 527100, 538372, 520072, 655028, 719442, 731014, 642641, 536817, 451046, 515459]
18196E15459M5557p4394K3332J53234J4383p6737j00985m0049m260L6241J00445
18185E92226R6854L3436o9294m3588J32282n7346r7573P2476k4714j06821r9858
18174D28080r7846K3080J5544l1062q453j7609K6418m0571N2594N0951K1419N9195
18162D81740m0402p7232n4309o2920k9951J08571J4614M5063Q0889m1062m0979
18151C84022M3246j08943o9849l1515J03362N9299j06081j12735K036L7695J2007
18140B12544r7698q9594J01603Q7575L49p4922j1705N8616P6974J41688N0863
18129D56293k2489p1848m5804j50435J1879P1068p4804l898m1369o0218n3977
18118A4398k2884L3184N9011R2155N9039O0906j5330k3214m3191m0351P4420Q334
$$ y = [515459, 561016, 486622, 509954, 663188, 677571, 600834, 499849, 459800, 455540, 491781, 592226, 689080, 722516, 653222, 609634, 741916, 684570, 586997, 659473, 634759, 527938, 428080, 330234, 353314, 368858, 337796, 329343, 311734, 338152, 297581, 350175, 401126, 422545, 481740, 441338, 364106, 309797, 246877, 216926, 325497, 340111, 385174, 466063, 425001, 384022, 427268, 318325, 248476, 216961, 320323, 379622, 273541, 160806, 162842, 200537, 212544, 114846, 25252, 126855, 214430, 214779, 139857, 128152, 186768, 263742, 405430, 456293, 433804, 361956, 316152, 165717, 177596, 248664, 173860, 169962, 128593, 68375, 14398, -8486, 24698, 83709, 175864, 234903, 295809, 280479, 257265, 214074, 173723, 248143, 256477]
18106B56477n1402j1516P0003p1434l0033j7282p3137n2937M2368q0769K2037
18095B375N4395M824P3555R0142m3261L6252O6511M2212n5316p1892q3074Q6874
18083B03597l6535o8070M245K2168p3319n4497L14K1798J09100K8481m8183l0683
18071G8416j13074J63396J03694l7282R5882R4862r1450K7282J1361O7059L6555
18060D36701P5253J7941K3702q1831r0961k050l1781j6825J00730j0355j14453
18049C06071k9787n2089p437Q8255Q3060n765o7316r5111r3965j8594L0070O8886
18037B06278K7396j16612n4863J49679P0529N62L6760j7334M072M9387j06587
18026B49267r137K4224k3633o5490k670k3008k6276J4332m2049J2571Q9378K1259
$$ y = [256477, 205075, 193559, 263562, 192128, 162095, 144813, 71676, 18739, 61107, -19662, 2375, 56770, 61594, 135149, 225291, 182030, 218282, 284793, 327005, 271689, 199797, 116723, 203597, 167062, 98992, 103237, 125405, 52086, -2411, -2097, 19701, 128801, 157282, 109099, 78416, -34658, 128738, 232432, 195150, 291032, 385894, 294444, 321726, 333087, 400146, 436701, 511954, 529895, 553597, 471766, 380805, 378755, 346974, 330149, 430879, 420524, 306071, 276284, 224195, 216758, 305013, 388073, 382308, 314992, 219881, 125916, 107322, 137392, 206278, 233674, 117062, 62199, 211878, 282407, 282969, 319729, 302395, 306467, 355854, 249267, 240130, 264354, 240721, 175231, 172561, 149553, 123277, 137609, 95560, 108131, 197509, 218768]
18014B18768j10877N8645k7047j3175K7614J02956K0690j6237J5340J2853k5209
18003B64321p9731n1462M5302P5342J8279N7409j0648j09160n3775P7822m1446
17992A92253M2025m5091L0722L9339O6131l428M549J02750j84200j19672q203
17981A17175j08328l0866O9848K462n082M9409m0466n9922K951M9208J01773M4488
17969A92650M6494q4443j48009L8780J30010M6605K2910p2364J9011j3419o3819
17958A14406J5866N4545M621L6573j8241n3601O5959o6725q7967o1583L7887M36
17946D2176M3847R0997O928m2062l0987Q7730q4189n704J4150j996M0744j2650
17934A48984Q4038M0077o3589j4629N2374K8862P2576O192o1196q7144k3887k3244
$$ y = [218768, 107891, 166536, 139489, 126314, 153928, 256884, 277574, 261337, 276677, 289530, 264321, 184590, 133128, 178430, 253772, 272051, 329460, 318812, 209652, 155877, 233699, 192253, 234278, 189187, 219909, 259248, 325379, 321951, 326500, 429250, 245050, 125378, 117175, 8847, -22019, 47829, 50291, 45209, 94618, 54152, -5770, -2819, 46389, 148162, 192650, 239144, 154701, 6692, 45472, 175482, 222087, 244997, 172633, 191644, 178225, 114406, 130272, 184817, 189438, 226011, 207770, 154169, 220128, 153403, 65436, 3853, 41740, 42176, 86023, 177020, 183948, 141886, 110899, 198629, 114440, 108736, 122886, 120890, 161634, 148984, 233022, 273099, 209510, 194881, 247255, 276117, 348693, 354885, 293689, 206545, 182658, 159414]
17922A59414J05364J22519k7065j39540O1191M2952l7704q4055J6206n8392R33
17911A61823M5995J48758J67533N7223o3385P7380O039P5447N5749M0665N3233
17900H26460M6014j05809K481m953p7710k5007L3787L3232q0655M0866L5272r0663
17888F33315M7017q2704j09658R790N9357j05350r829J12926k4341n1176k9489
17877D49858k1679n6720k5190l1923O8840N0709l9221j03651Q0947K06077K53378
17866H31425K29372J40066k1261P459p7068j55939r2637m8051q1644M1524J25684
17855H98930J22223J09153J33885p245j4248J6104K1957p9400j84235j52890n6735
17844H07499J0327l2517L7046P9932l0786n6124o280O2700L7315L1438p8706n784
$$ y = [159414, 264778, 387297, 360232, 220692, 281883, 324835, 287131, 203076, 219282, 160890, 161823, 207818, 356576, 524109, 581332, 517947, 595327, 601366, 676813, 732562, 773227, 826460, 872474, 766665, 769146, 764193, 686483, 661476, 695263, 728495, 647840, 688706, 723978, 633315, 680332, 597628, 487970, 497760, 557117, 451767, 441938, 554864, 530523, 479347, 449858, 428179, 371459, 346269, 314346, 383186, 433895, 394674, 291023, 371970, 578047, 831425, 1060797, 1200863, 1179602, 1187061, 1109993, 954054, 861417, 813366, 731722, 773246, 898930, 1021153, 1130306, 1264191, 1256946, 1242698, 1258802, 1280759, 1201359, 1017124, 864234, 807499, 817826, 785309, 822355, 902287, 871501, 815377, 809097, 871797, 909112, 940550, 861844, 856060]
17832H56060P883M4064r9890q4060o8077j2209L994j27609P384K2414r635k283
17820E38036J02655K3378K9768n1154N6466J47274J21791L0152n2016j16668j43129
17809F86553j53217j51023r9095q0640r7563p0761P2072J40502P5546Q8459M0197
17798D51030j31037k3187L9998L8911K1590O3539j3451j32994m7570p6481k2824
17787A67524J00767Q6391j5387O5072m522M902M321R7424j0639L7522K076p7740
17775D57711j35742j32870j054p6857m913n7473q4369J31793J11508o393l9213
17764A62128p2162l815n7009j7M3654n7872M3903O1694n3027m9411M3566J5055
17752G6687R7963R1209J6133q4307p5737K1614m6870p8070p7149j0121K901K8802
$$ y = [856060, 863943, 908007, 808117, 724057, 655980, 643771, 647765, 520156, 527540, 549954, 540319, 538036, 640691, 664069, 693837, 642683, 699149, 846423, 968214, 998366, 946350, 829682, 686553, 533336, 382313, 283218, 202578, 105015, 34254, 106326, 246828, 322374, 410833, 451030, 319993, 296806, 336804, 375715, 397305, 460844, 447393, 314399, 266829, 190348, 167524, 268291, 354682, 339295, 404367, 399845, 404747, 409068, 506492, 495853, 533375, 535451, 457711, 321969, 189099, 188045, 111188, 106275, 48802, -35567, 96226, 207734, 201341, 162128, 89966, 86151, 29142, 29125, 72779, 14907, 58810, 120504, 67477, 18066, 61632, 76687, 174650, 265859, 281992, 197685, 121948, 143562, 96692, 18622, -58527, -68648, -65747, -36945]
17740c6945K5894K2019o5217l8857K1560M1685Q8383P2747k7600j3358N2572k5764
17728A17119L4095p4236P983N5423J0389n1204Q6659K8517r4641j6321M0877L594
17716A48254j7914R5533q9171m6286k9970j7378L1157P8370J3060q9276q5152
17705h773j7307m1043p2833O1865N5800M120J368P1784L7180j22271j5738o5751
17693a11599k9167R8775Q6195J11177L1663j8342j03300j01842n7914R6651P2427
17682G4724K3627j9126O7930J2265o0367o9348J9484J3558o8943O164M711N9279
17670F3958N1881p3645r3783k4518J167O1674P747j47521K3111J57223M5709q4843
17658a1840l0368L2753Q9838r8571J1168o4720J2419N575m5487l7687n0877j18
$$ y = [-36945, -11051, 10968, -54249, -93106, -71546, -29861, 58522, 131269, 103669, 90311, 142883, 117119, 151214, 76978, 84961, 140384, 150773, 99569, 186228, 214745, 120104, 103783, 144660, 148254, 130340, 225873, 136702, 90416, 60446, 43068, 74225, 152595, 165655, 76379, -8773, -26080, -67123, -139956, -78091, -22291, -18171, -16803, 54981, 92161, -30110, -45848, -111599, -140766, -41991, 44204, 155381, 187044, 168702, 65402, -36440, -94354, 2297, 74724, 98351, 79225, 147155, 159420, 99053, 29705, 49189, 62747, -6196, -32, 4679, 63958, 115839, 42194, -51589, -76107, -74940, -13266, -5519, -153040, -129929, 27294, 73003, -11840, -42208, -9455, 80383, -18188, -7020, -71740, -59321, -53746, -99233, -136920, -187797, -187915]
17646a87915o5392R8746R9646p8991K812J48282J5234n8947J127m4914K6862L7227
17634f223L0269l0339L626j7263M2677O2392J28752j9169j18894r7471J2730L4556
17622B5643k8253K8556R9043Q3211m8295n5416P1260k9332o6726m0736o6972O7205
17610C9188M1370m9260m0352J12699k7743q3822j17485O8255K9810j05254O370
17599a26224R1324J60142K4941j67893n8915O2092j5706K3846O1346n2393j01657
17588i9097l152N2455K54J26732o0555n3628N6521l1537M6958M090J8641K3054
17576H0736j04257l2617Q4998P3190m464q7070l4157Q4150j5419j77698l2429
17565a65037P3669K08996k1621n927L2979k4629j46292r0733j7765q9451K5641
$$ y = [-187915, -253307, -154561, -54915, -133906, -131094, 17188, 32422, -26525, -25398, -70312, -43450, -6223, 24046, -6293, -2667, -19930, 22747, 85139, 213891, 194722, 75828, -21643, -8913, 25643, -2610, 25946, 124989, 208200, 159905, 104489, 175749, 146417, 79691, 38955, -28017, 39188, 80558, 31298, -9054, 103645, 75902, -7920, -125405, -57150, -27340, -132594, -126224, -34900, 125242, 150183, -17710, -76625, -14533, -30239, -6393, 54953, 2560, -99097, -102249, -49794, -49540, 77192, 16637, -36991, 19530, -12007, 34951, 39041, 57682, 80736, -23521, -56138, 28860, 102050, 97586, 10516, -23641, 60509, 45090, -132608, -165037, -91368, 117628, 96007, 90080, 123059, 98430, -47862, -138595, -156360, -245811, -220170]
17554b20170J33841N1176k6988K7761o3561m2490O0294K5573M3315J300q932n3992
17542g2873q4357P2904Q927k7680k4424n1743M3906P3560M9716Q720K9434Q280
17530C4370O0061j13737N068l062M1266j9659j6422j13950o3127J31082N5510
17519b600o0530k3858k7301P3778L4404P205m0428R3183k8128M510N1564J4629
17507I6428q3k4054j14891l0334O7162R2143L4107m4762N0197m9214n9046Q2495
17495A00148J0568k9679m9068P0178J8341l1472o447Q7507j5264j73399j7824
17484c6411P3179J8890k5037L2586J3637n4050J5730l7361k5599K9246n7126K6944
17472b5372L9463R3334M4351l4730l2575j26460l8335L3541Q2203M3697r66q1969
$$ y = [-220170, -86329, -35153, -62141, -34380, -97941, -140431, -80137, -54564, -11249, -9949, -18881, -72873, -157230, -84326, -75399, -103079, -127503, -179246, -135340, -61780, -12064, -3344, 26090, 34370, 94431, -19306, -14238, -17300, 23966, 4307, -12115, -126065, -189192, -58110, -2600, -63130, -86988, -114289, -40511, -6107, 1098, -39330, 53853, 25725, 30235, 81799, 96428, 96345, 72291, -42600, -72934, -5772, 86371, 120478, 75716, 125913, 76699, 17653, 100148, 110716, 81037, 31969, 102147, 120488, 89016, 82569, 170076, 154812, -18587, -36411, 36768, 55658, 30621, 63207, 76844, 22794, 38524, 1163, -24436, 4810, -52316, -25372, 14091, 107425, 151776, 117046, 84471, -41989, -80324, -46783, 35420, 79117, 78151, -3818]
17460c818m7556K1169K2137k3258q4611O4343P1144Q6208J30891m6904m0374j64658
17448a5287q0601m4697l2180j0032P8102O0642o8153l8577N1339j07127J5769
17437a90802R1176M2703J34989n2392k3017N2926n8670o1472n9463N2969L2183
17426c8870n6318K7288n6086l3438M8460P9096R5916k5194K414N643k9419j05759
17414h6267p6648n4793O1093J27543o8769L3617K5061l6574J6582j2330O1636
17403i849M8919J4817O5373L0189j03166o2897O9830K7355l2268L501q471m2972
17391C61j9938N4636L4278o4575p894R6638m0229n9033l4371N6541P2643P950
17379I7007j7079l252o6465k0823N4731N4053r6136m4829N1757J04235P7796J7337
$$ y = [-3818, -51374, -30205, -8068, -31326, -115937, -51594, 19550, 105758, 236649, 189745, 149371, -15287, -95888, -140585, -172765, -182797, -104695, -44053, -112206, -150783, -99444, -206571, -190802, -99626, -56923, 78066, 25674, 2657, 55583, -3087, -64559, -124022, -71053, -38870, -95188, -67900, -123986, -157424, -108964, -29868, 66048, 40854, 43268, 48911, 19492, -86267, -162915, -217708, -156615, -29072, -97841, -64224, -39163, -75737, -59155, -71485, -9849, 39070, 53887, 119260, 149449, 46283, -16614, 53216, 80571, 48303, 51804, 43333, 361, -19577, 35059, 69337, 4762, -3132, 93506, 53277, -5756, -40127, 16414, 89057, 97007, 79928, 76676, 10211, -10612, 44119, 98172, 2036, -42793, 8964, 113199, 190995, 208332]
17367B08332k147l1936p0643m5551m8977O7553L7029j35725p2585N9214o1919
17356i7355k1768J39828J01589J3285j21481j06642R466J7795o2006J13431M0746
17345B6888n1715M5093P3364J03793l5666q5599p6472J1607O2839K9658N6595
17334A60385p5667j02541j02013K7980K7232J9464R88N0395m102l826L8992O9433
17322A06720k2455M6816n3785q7408k4409M4387O0745L2419j4281p3902J4400
17311B9247J28404l3382n7421k0184l0545N426n725J3933n2283o9060j6722P2145
17299c6167Q4930O3123j1059r9986Q097j1069j1982j7965M3508Q889j0366l9705
17287b9752J6906N3636K6440J05759n1705j20677r6936o4794r4818J16299Q4692
$$ y = [208332, 206185, 174249, 103606, 58055, 9078, 76631, 113660, -22065, -94650, -35436, -97355, -119123, 20705, 122294, 135579, 14098, -92544, -83078, -65283, -127289, -13858, 26888, -24827, 20266, 93630, 197423, 161757, 76158, -314, 11293, 74132, 103790, 160385, 84718, -17823, -119836, -91856, -64624, -45160, -44172, 6223, 2121, -1705, 37287, 106720, 84265, 131081, 77296, -10112, -34521, 9866, 70611, 103030, 88749, 14847, 29247, 157651, 124269, 66848, 46664, 16119, 21545, 15820, 29753, -22530, -91590, -108312, -36167, 48763, 111886, 100827, 841, 8938, -2131, -14113, -32078, 11430, 20319, 9953, -29752, -12846, 40790, 67230, 172989, 121284, 607, -96329, -161123, -255941, -139642, -54950]
17276e4950j1909K0108K4061j13142q5551L6910N8481J789j7312o3868Q4588Q5154
17264c5641J1981n0229j36133l3611P3414J04358J8371l0790j643q0623P4790
17253h5756R277N1190J10571K9054j51576o4723P4918Q366j00606L6171L7702
17242d5412j8834K9062l1981J237k0814O3418K471K090L5468r1810j13245j7932
17230b06282J37953M1220o5904O3790M4661m7552M4738K7722p614r7194j8308
17219h2770K9274J2783m9229N6328J8485j8962j318L4298n5309p4944o9985J13037
17207h8312k9651r3452r082L7730k1862l1133N315K8892J33605L6076K0927k573
17195a3520q323J2347M0619m0024r7820m4174l9100J49075R3770K1401j16743
$$ y = [-54950, -66859, -46751, -22690, -135832, -221383, -184473, -125992, -124203, -141515, -205383, -120795, -35641, -23660, -73889, -210022, -243633, -170219, -65861, -47490, -78280, -79923, -160546, -85756, -76479, -25289, 85282, 114336, -37240, -101963, -27045, -18679, -119285, -83114, -45412, -64246, -35184, -67165, -65928, -86742, -23324, -20853, -18763, 16705, -75105, -188350, -206282, -68329, -27109, -93013, -29223, 15438, -32114, 12624, 40346, 32732, -64462, -82770, -53496, -40713, -89942, -33614, -15129, -34091, -35409, -1111, -56420, -131364, -201349, -88312, -117963, -211415, -220497, -182767, -204629, -235762, -230447, -201555, -67950, -31874, -10947, -13520, -21843, -9496, 31123, -8901, -106721, -150895, -189995, -40920, 52850, 74251, -42492]
17184d2492j28162j9882J14286n935l0304k8893J6756P3785k4482j13376K3170
17173a65529o255P8167J09902j93n5063O3511L918R4457L0069j72162n2423K0215
17161e1386L259j1676P9609N6055J3672O7289o001p1213n6257l7096o99q0485
17149i4929M2293N0373p2897j00193p7489L0185M1283L3838P5787M2757l3849
17138f2841N2224J3452k7818q9450M1649J1186J2927K9804m1761M8153Q8633J0479
17126H6637r9429k0066p6890j7188J42372M1308J5912K760K8576Q64l789K7099
17114A28166n1104k7067o9102n9873k9174N2281pJ35147M7832j36654O2979N7731
17102A11155k9343r3777m2738P8876J04836M8927l5597n2290K4243j1035o0657
$$ y = [-42492, -170654, -190536, -76250, -82185, -112489, -141382, -124626, -50841, -75323, -188699, -165529, -171784, -93617, 16285, 16092, -38971, 24540, 28458, 122915, 152984, -19178, -71601, -51386, -48127, -59803, 19806, 75861, 89533, 156822, 150821, 79608, 23351, -13745, -14444, -94929, -52636, -2263, -75160, -175353, -252842, -222657, -181374, -147536, -71749, -28992, -62841, -10617, 2835, -24983, -114433, -72784, -61598, -48671, -18867, -60628, -12475, 76158, 86637, -12792, -32858, -109748, -126936, 15436, 56744, 72656, 75416, 103992, 104856, 101067, 128166, 77062, 49995, -19107, -78980, -108154, -55873, -55880, 79267, 127099, -9555, 53424, 111155, 81812, -11965, -54703, 24173, 129009, 177936, 142339, 90049, 114292, 103257, 42600]
17091D2600j00715K9387m685j7566j6326j36316n1796J09435P2614K0004J0496
17080d2868O8422K1659j2406r2119o4649K1897Q7978r647k8620R3422q6832j56828
17068b00591O9369J67870k9429J1769K3722N4359O3056j28083k9953l473p1322
17057g2706m5799O479m4391o9888J2586K6306J24725R0024j699r8803j03680N1730
17045a25116M5109j6931l8599O32O0764O7322N363N8404p083r057j10210M746
17033f4656r846n8912K3943Q6226n3946j8979r696K4095M4424l479j0663m6434
17021i7923Q7038M7085K3504k1599N394J8217l0028l6624n3105L5610o5985m5024
17009a33440j011M4109Q2385J22712N205k6909j1485l0322j03519j42808Q9737
$$ y = [42600, -58115, -28728, -33413, -50979, -67305, -203621, -255417, -145982, -73368, -53364, -42868, 25554, 47213, 34807, -57312, -121961, -100064, -12086, -21733, -50353, 43069, -43763, -200591, -131222, 36648, 7219, 18988, 42710, 97069, 160125, 32042, 2089, -1384, -72706, -118505, -112026, -156417, -226305, -213719, -187413, -62688, 27336, 25637, -73166, -176846, -125116, -80007, -96938, -135537, -134905, -74141, -6819, -1456, 56948, 49865, 40808, -69402, -64656, -74502, -133414, -109471, -23245, -77191, -96170, -105866, -81771, -37347, -40826, -51489, -97923, -10885, 36200, 59704, 38105, 43499, 61716, 31688, -4936, -58041, -22431, -88416, -133440, -134451, -90342, -7957, 114755, 119960, 93051, 81566, 51244, -52275, -195083, -105346]
16998a05346J64975L1099j3721q6947j78445K0111M9338J21179J31057j252l8436
16987I3612r0354m297L0379j104M0973n1428K2692m1903K7353M5980J0357k0717
16975F1543l7424Q5212j18792o4271l4590m8256J5395O6561R4956o3021k8149
16964g0836P7896P8433m9544R5938n7034j29851m1290K1129L9165m017l3341M6231
16952b7121n3354J3390M0359J9990j1388o0311J3114n3027k3573O8341M3203m3620
16940g3997N3678J03936k8579j21460j25815K1428R1766O4964r138r441J2165
16929b0493O9804N3625o0834m8532r3200P5030k6361k0947N020o3292K3125n0905
16917a57960o0316O7406J5095M0699O3270M8401j927L0394J7262J5231j3187j3505
$$ y = [-105346, 59629, 90728, 77007, -9940, -188385, -168274, -118936, 2243, 133300, 132048, 93612, 3258, -1039, 29340, 28236, 69209, 17781, 40473, -1430, 25923, 71903, 82260, 61543, 24119, 109331, -9461, -73732, -108322, -156578, -141183, -74622, 20334, -42687, -70836, 7060, 85493, 35949, 131887, 74853, -54998, -96288, -75159, -35994, -40011, -73352, -27121, -80475, -67085, -26726, -6736, -18124, -78435, -65321, -118348, -141921, -73580, -30377, -73997, -20319, 83617, 55038, -66422, -192237, -170809, -79043, -14079, -23217, -32658, -20493, 49311, 102936, 42102, -6430, -99630, -24600, -50961, -71908, -66888, -130180, -107055, -157960, -218276, -150870, -135775, -95076, -31806, 16595, 14668, 45062, 62324, 77555, 64368, 50863]
16905E0863P1543n6932P849L9750K808m7674j8137K8349p1383j04421n6294R6587
16893e7092j801R1613p721K8894L2075k4110k5199K580K7469L6271k0569r7039
16881a4629j10585J6575K7990L0804L9554r6084q4313j0023K6120J0903N3532
16870a10156m4920P3326J52396R9522j01159l9097o8140j02650K3252O5979K3882
16859b7765l0997R492j3253j4956j5224l6604M7479O366P2565q7948j8058O8241
16847d0662n341J5132J06916N8624m8576n1109J20Q0678L9927K2694n0787n1708
16835G5908l2414k7007o3633j9088Q240O2695K1156j4468o8082L2458o2086J3575
16823g2746Q5863M746K7024n6260J1802O7657K5162j0674l8872n0069p158l6546
$$ y = [50863, 122406, 65474, 73323, 113073, 115881, 68207, 50070, 78419, 7036, -97385, -153679, -57092, -58893, 32720, 24999, 53893, 85968, 61858, 36659, 39239, 66708, 102979, 82410, -14629, -125214, -108639, -80649, -49845, -10291, -106375, -190688, -200711, -174591, -163688, -110156, -155076, -81750, 70646, 170168, 69009, 29912, -38228, -140878, -117626, -51647, -27765, -58762, -49270, -62523, -77479, -92703, -129307, -81828, -75462, -2897, -90845, -108903, -40662, -46003, -30871, 76045, 134669, 86093, 34984, 35104, 115782, 155709, 178403, 127616, 75908, 43494, 16487, -47146, -66234, -57994, 4701, 25857, 11389, -56693, -24235, -86321, -72746, 13117, 17863, 44887, -11373, 429, 68086, 93248, 82574, 43702, -6367, -13525, -50071]
16811e0071j4404J2695M4706N5854n1744N3353n002o3601n56l1574j16507j38682
16799c05533J06300R0445J19383N3267q7758q2472k3806Q175m6625K4510M2146
16788a01968n1189K1531P7530k279P463o2427j23818P4446j4659N125o4253J1171
16776b23327J56059J36047L4232l9660j12680m7219J18673M8731L9894p1171p6526
16765c6947o545N1210P618j1697r98p2793o6922Q63l4089L5307L8702Q8185O3713
16752E5607r140L1508O886k7197m9127j05081j3611o935Q1664R5161j15352m8642
16740a04259p224j1150J8774L4338j037r666j0408L2555L8902L4825l35m6323
16728c1008O2346Q3566L2169k7337J7190k4545k1172j0358j5722n3002q9772O0628
$$ y = [-50071, -64475, -51780, -7074, 48780, -2964, 50389, 45387, -18214, -18770, -50344, -166851, -305533, -199233, -108788, 10595, 63862, -23896, -106368, -130174, -121999, -168624, -144114, -101968, -153157, -131626, -54096, -56375, -48912, -111339, -235157, -160711, -175370, -170245, -234498, -223327, -67268, 68779, 103011, 63351, -49329, -96548, 22125, 70856, 110750, 39579, -36947, -43492, 7718, 15336, 3639, 2641, -70152, -137074, -136211, -170300, -134993, -96291, -8106, 55607, 46467, 77975, 84861, 57664, 8537, -96544, -110155, -117090, -35426, 59735, -55617, -104259, -111483, -122633, -103859, -69521, -70558, -80224, -90632, -58077, -19175, 15650, 15315, -31008, 31338, 114904, 147073, 119736, 136926, 112381, 91209, 80851, 65129, 12127, -77645, -17017]
16716a7017K373p6364j2231R2718L2624N0353n7415m0466L3464j6380M2918l1404
16704C173M829j4471k9138r5932q2718J1621J131K2198O4888J58648Q0018J7546
16692A41793j22142J354j0030p012k1225l9676J17535J07754K3532j26771K7557
16681I2669l6045j21212l8960j570L4648M2225M4191M9041k7745L25L2128M3682
16669A13377j25223j5865m1473J9864j5433K2230J0526l7683J07593j2801m642
16658B0470M2026p4728J619R423l847Q2653J1982M5457q5615m0613R566R268m7052
16645a9391p3126k5279J5617L2912m5438r795L3624Q046J5420R9326k2882k6864
16633a7830K0025l037L4364P5358L7089j5598j01444m5581M6601R8500J298q5255
$$ y = [-17017, -14644, -91008, -103239, -10521, 22103, 72456, 15041, -25425, 8039, -8341, 34577, 3173, 8002, -6469, -35607, -131539, -214257, -202636, -201505, -179307, -114419, 44229, 124247, 141793, 19651, 21005, 10975, 3963, -17262, -56938, 60597, 168351, 191883, 65112, 92669, 56624, -64588, -103548, -105118, -70470, -28245, 15946, 64987, 37242, 37567, 69695, 113377, -11846, -27711, -69184, -49320, -64753, -42523, -31997, -69680, 37913, 25112, 20470, 62496, -12232, -10613, -1190, -5037, 77616, 89598, 135055, 49440, 8827, 18393, 27661, -19391, -92517, -117796, -102179, -69267, -114705, -124500, -90876, -82830, -67410, 31916, 9034, -17830, 2195, -842, 33522, 108880, 145969, 130371, 28927, -16654, 29947, 128447, 129745, 44490]
16621D4490j7135K2245l8398L8663Q8000J5486p3275m5372n5657O4225l0590q5083
16609g2401N6428L3373J5999k4687J7307J984j08328M4554J0348J3668O8620K9719
16597H6584r9413K5974P3330K8452j65394j26920n1854O7983R6479M519M0054
16586b0206J27707M8968P8422j0795o4768j21752q5181k845L2627K2277k2415
16575a7961K632M5002O7273k5339l2872J6952O0956J1519p5389o610p3223M1681
16563A4621p723K0080N4911j1911k0666k0761l7786k7670n3607R890M0282o5114
16551a05454N4108k0109J1430J00717k4501k5335k4239q03m2135P1471O8684Q8736
16539A52570K1309k5436l1768l0594m4118r4053Q068O275P7278R6444K643J4105
$$ y = [44490, 27355, 49600, 11202, 49865, 137865, 153351, 80076, 34704, -20953, 43272, 12682, -72401, -15973, 17400, 33399, 8712, 26019, 28003, -80325, -35771, -25423, -11755, 56865, 86584, -12829, 13145, 86475, 114927, -50467, -177387, -229241, -161258, -64779, -60260, -20206, 107501, 156469, 234891, 224096, 159328, 37576, -47605, -50450, -17823, 4454, -17961, -15329, 29673, 96946, 71607, 38735, 55687, 116643, 128162, 52773, 46163, -27060, 14621, 6898, 26978, 81889, 69978, 49312, 28551, -9235, -36905, -90512, -80622, -40340, -105454, -51346, -71455, -60025, 40692, 16191, -9144, -33383, -34186, -76321, -4850, 63834, 152570, 173879, 148443, 116675, 86081, 41963, -52090, -44022, -37747, 39531, 135975, 138618, 152723]
16527A52723m7466l1388M1760j0939n4233j7142n4633k9088k2995j9405N2005
16516d0801K7551O3210L3304p973j06810r2805M0972l5125J5444O4662L9070L8040
16504C8739r896m9056o317K9192m5345R1315J9573n8637M4885n5614p5440j06401
16492a83002J12279P4607k5031o6882n2365Q2732l5384n1120L3267l1314o281
16481a48494R53M1456K3752k9159r380K4379O7485N8470K1532n7045n4629k585
16469f3265J28967K7640K6404m8358K1713J04643j7215j13838o9790p8905L6852
16458d5152P7562k465j2618L6088K148o3856j0741P2891q2213o4243q1941J1020
16446a63520n794k3336N9900L8290J19938K8696O0158l8076n3935j51683n9240
$$ y = [152723, 105257, 73869, 115629, 104690, 50457, 33315, -21318, -50406, -73401, -92806, -40801, -13250, 49960, 83264, 75291, -31519, -124324, -83352, -118477, -103033, -38371, 699, 38739, 28843, -20213, -26530, 2662, -42683, 48632, 68205, 9568, 54453, -1161, -76601, -183002, -70723, 3884, -21147, -88029, -140394, -57662, -93046, -144166, -110899, -142213, -148494, -147541, -106085, -82333, -111492, -120872, -96493, -29008, 29462, 50994, -6051, -60680, -63265, 65702, 93342, 119746, 71388, 93101, 197744, 180529, 66691, -3099, -82004, -45152, 32410, 29945, 17327, 53415, 55563, -8293, -19034, 53857, -28356, -92599, -174540, -163520, -169314, -192650, -132750, -94460, 25478, 54174, 114332, 76256, 22321, -129362, -188602]
16435a88602k105O2555N9820O738j4850j1127l9223k6731P1474L8044j1699K1498
16423c4208o549k1691O609j2670L6498J17046l1199r5007N52N2634K9923j03014
16411f1076n2629J9442K7978j01436K3706N5779O4283J19495P938r2337o2781
16400e1638M8836N6951P6080J1378K6742o9502m9449O8696o0631q2489M9859k6289
16388a456o7479p9088K360J1209j9082N2494O69J482j1013L0458j1620J2257K2641
16375e6168P1820l1498r0806J606J05264L7817n3408o3389k5374r3772l1719K1757
16363b07870o341j2366L0951N972N2652Q5421r721k6112p8050j14316J1949O6078
16351b01753M1846J4916j9227k1385J20876P0151j7927O5127K7938q1068j02514
$$ y = [-188602, -190707, -128152, -68332, -61594, -76444, -87571, -126794, -153525, -82051, -44007, -55706, -34208, -40757, -62448, -55839, -68509, -32011, 85035, 53836, -41171, -40619, 12015, 41938, -61076, -113705, -94263, -66285, -167721, -144015, -88236, -23953, 95542, 103480, 11143, -51638, -2802, 54149, 130229, 141607, 168349, 98847, 49398, 118094, 57463, -25026, 24833, -1456, -68935, -148023, -145663, -134454, -153536, -101042, -100373, -98891, -109904, -79446, -91066, -78809, -56168, 15652, -15846, -106652, -105046, 218, 38035, -15373, -78762, -104136, -197908, -229627, -207870, -214211, -226577, -195626, -189654, -137002, -51581, -61302, -87414, -165464, -279780, -267831, -201753, -159907, -144991, -164218, -185603, -64727, 5424, -12503, 52624, 80562, -506, -103020]
16340a03020m7108k8291R9272R3285M4248M4444N965K7031l0502L3508o0932j00436
16328b2536j7343k7196k1940j2127J04856K8545M8803K5770n5301Q944M2271O9672
16316A72418L770j8268l630O066q898j0720N987p9106J793K3853j0372q0411K8645
16303C1127P9172O1141L3817j7470j32194l8577p105j6741K7996J40359J72166
16292C33691r4666j51843q1263o0510J00023Q1570j01015j41286l9330J78067
16282B3438P6786J3454j12673K2546N3804j04232N3241l4471J3187o5733o6599
16271a27252N4121k3187j3757J3518J1590R6860P0850q494M0448k3409K2913n6000
16259E8201l0672K4631j2284k4117n5339l2204L5511J2598J561l4377n044N5472
$$ y = [-103020, -150128, -178419, -79147, 14138, 58386, 102830, 108795, 135826, 105324, 138832, 77900, -22536, -39879, -67075, -89015, -101142, 3714, 32259, 81062, 106832, 51531, 60475, 102746, 172418, 176188, 157920, 154290, 160356, 151458, 140738, 146725, 67619, 69412, 93265, 82893, 2482, 31127, 110299, 171440, 205257, 187787, 55593, 17016, 9911, -6830, 21166, 161525, 333691, 239025, 87182, 5919, -54591, 45432, 127002, 25987, -115299, -154629, 23438, 100224, 113678, 1005, 23551, 77355, -26877, 26364, -8107, 5080, -60653, -127252, -73131, -96318, -110075, -96557, -84967, 11893, 82743, 74249, 114697, 91288, 114201, 58201, 27529, 52160, 39876, 15759, -39580, -71784, -36273, -23675, -22114, -56491, -61535, -6063]
16247f063j9554M8502j4757m367m3206M8994N5351k8082p716l3298p771Q3843
16235G1876J0601m4301r4401L3707r2739N1763P2842r8887j18212N6711O3997
16224h7043o704L73L8832L4444j1541L4717o456o0233j0538M8539m5956p6272
16212a47838L2255m1644o0792O6937J42764Q3673K4935K5608J04333j34188j09817
16201a3774o8426P3867q053J20676J03108n7848k15552l4695N4713K366N7198
16190A3580l7360M6188j8152j66072r1702N4276P0629P5867O6971O8496j7270
16179F5451j8889N3391N1486R589l3539o1691k5483O6890q5204j3049N7520P883
16167G4355J224o7557j9142p3075L8547K6968K5331J0746M3619M6612k2140o8239
$$ y = [-6063, -25617, 22885, 8128, 3761, -39445, 9549, 64900, 36818, 29102, -4196, -11967, 71876, 82477, 38176, -56225, -22518, -115257, -63494, 9348, -89539, -207751, -151040, -87043, -93747, -93374, -54542, -20098, -31639, 3078, -3378, -63611, -74149, -25610, -71566, -147838, -115583, -157227, -218019, -151082, -8318, 75355, 100290, 125898, 230231, 96043, -13774, -82200, -8333, -16386, 104290, 207398, 149550, -66002, -100697, -45984, -43618, 13580, -23780, 22408, 4256, -161816, -253518, -199242, -128613, -52746, 14225, 82721, 65451, 46562, 99953, 151439, 161028, 127489, 65798, 40315, 107205, 22001, 8952, 66472, 74355, 75579, 8022, -11120, -84195, -45648, -18680, 6651, 17397, 61016, 107628, 85488, 17249]
16155A7249k9722J1644o7870l7613O1438o3106l7418M7916L2097l9186L8348l6033
16143a02256l2163O5365r487m6102Q0236O8268l6807J2979O6212L7337m742j05422
16131f582k9228K7612l5706J5413j0168j2766J7995J6905j3244l10o637Q7801
16119E1085Q3261L0086j1681k29169k048P2914O7434K5989r9966L5961N3394J1135
16107H8395n0164L4661r340k9750m6950N7040L2684j12192m1436Q2355M8689j20965
16095f6973m9568j05974Q6446J39104r6533K6215J7990L949R123M4652P9675J3450
16083A01556k5061q2010K9356k2986K5980Q0850n1336l39P0859k0555j27989K0877
16071g98j5866j13433r3127N5366J13074O3777R3667P0151j4796q8777o5443o4545
$$ y = [17249, -12473, -829, -68699, -106312, -44874, -107980, -145398, -97482, -65385, -104571, -66223, -102256, -134419, -69054, -78541, -124643, -44407, 23861, -12946, 33, 66245, 103582, 98840, -6582, -35810, -8198, -43904, -28491, -38659, -51425, -33430, -16525, -29769, -30079, -36716, 51085, 134346, 164432, 152751, -76418, -78466, -5552, 61882, 87871, -12095, 23866, 77260, 88395, 38231, 72892, 63552, 33802, -13148, 43892, 76576, -35616, -77052, 5303, 53992, -66973, -116541, -222515, -136069, 3035, -93498, -67283, -49293, -45344, -36221, 8431, 88106, 101556, 76495, -5515, 23841, 855, 26835, 107685, 56349, 56010, 126869, 106314, -21675, -798, -16664, -130097, -223224, -167858, -54784, 8993, 102660, 172811, 158015, 69238, 3795, -60750]
16059f0750J5041J0803J8389O470O106j2348N9170M0894M6221L7892j14548l9331
16047A4009J14461K5220j1089l0762o9592j23866o1062o083L5761L9249j7215
16036i0969j8161R6370J11422k1806n6490m6962k5668k7852j8154K6326K8238
16025d3706p9844p7572J01900J42461K0122m395m6787l5949o519n2024l3901m9193
16013a65407M7205K4506q3373m554M8347J81O9613Q7665m341J8367J04679j04188
16001C8700k22955l5774J16681J47025L7861Q100o143p697k2618O3910J19437
15990B36527K1488o3704o5814q9095o9508P280L5845l9773j2512k0798M802J0278
15978d4984L7519L1508k2535m4929k6488R8591R385j6608M1165J284p6839l5483
$$ y = [-60750, -45709, -34906, -16517, -10047, -3941, -16289, 42881, 83775, 129996, 167888, 53340, 14009, 128470, 153690, 142601, 111839, 42247, -81619, -142681, -148764, -113003, -73754, -90969, -109130, -12760, 98662, 76856, 20366, -26596, -52264, -80116, -98270, -71944, -43706, -123550, -201122, -99222, 43239, 63361, 58966, 12179, -23770, -30289, -82313, -116214, -165407, -118202, -93696, -177069, -181623, -133276, -133095, -63482, 24183, 19842, 38209, 142888, 38700, -184255, -220029, -103348, 43677, 81538, 89638, 83495, 75798, 53180, 117090, 236527, 258015, 194311, 128497, 39402, -30106, -22826, 13019, -26754, -39266, -60064, -55262, -44984, -7465, 24043, 1508, -43421, -69909, 28682, 38067, 21459, 62624, 63908, -12931, -48414]
15966d8414n0450n200J06587k096p3896o5677M1088O171K844J25261P5835r0836
15954B1217p0090q551k3931K0547m0218J9666O4030Q3911j4159k37n1203n5575
15942e4593k4569L7685m8550n5354R1977O706K4980J0437K5490N443j8469J0997
15930A2180o3855M8431J0770O3091o7164J3623M5844o0618r6411Q065l6409J2470
15918a09983K8401J1311M1094L2900j4539p117L4491K1666n5125l3348Q6622K8460
15906F4833M79m0236p391J6468l7089o1956m6049n153L6633J08437R2521N041
15894A26538q3117r0688j31778K048N1218J0846k4197K2020M8383l6450K2034
15883h3143N5196r314O7515N8237k9844l4726o4775j8014P0083Q1233J8422O349
$$ y = [-48414, -98864, -104064, 2523, 427, -73469, -139146, -98058, -91887, -89043, 36218, 112053, 21217, -48873, -57424, -81355, -60808, -101026, -81360, -17330, 66581, 52422, 52185, 982, -54593, -79162, -41477, -90027, -145381, -53404, -46698, -21718, -11281, 14209, 19652, 1183, 12180, -51675, -3244, 7526, 70617, 3453, 17076, 62920, 2302, -94109, -86044, -122453, -109983, -81582, -70271, -29177, 3723, -10816, -17933, 16558, 38224, -16901, -50249, 36373, 64833, 65312, 25076, 17685, 34153, -2936, -64892, -110941, -116094, -79461, 28976, 121497, 126538, 43421, -47267, -179045, -176997, -125779, -114933, -139130, -117110, -68727, -105177, -83143, -27947, -37261, 30254, 88491, 58647, 23921, -40854, -58868, 11215, 92448, 110870, 117219]
15871A17219p3184L2782M308r1973k2536M6354j28124p2425J0565Q0708k6433
15860a22739n6517K7280q404J634K0364r392P5257k839M5411m4499P9888n2575
15848d7131n9694j00496j9895J20458O4969N2855N8398o1764k1026l0601j5100
15837e9027M2044P3665p2892p9464K7976j1181P7073o380p8089j19592L3346J08685
15825f3836P0659P8568N0592J6413n8072p9048J01692k4595j06872j4201O0235
15814C1535r7941q102R190P494O7594L5830l6735j10371j40360K3816J64893K3236
15802b9921P338m028n4865J06999N4873m4312o4721o6244J8040j7135P2863N7209
15790C6096q020r5700n2287l2971k8104K9561Q6940J36143k7862j09802l2098
$$ y = [117219, 44035, 76817, 81125, -10848, -33384, 12970, -115154, -187579, -177014, -96306, -122739, -179256, -151976, -160380, -158746, -138382, -147774, -72517, -75356, -29945, -74444, 5444, -47131, -106825, -207321, -227216, -106758, -41789, 11066, 69464, 7700, -13326, -43927, -59027, -16983, 56682, -16210, -95674, -67698, -78879, -1806, -8186, -86275, -205867, -172521, -63836, 6823, 85391, 135983, 152396, 94324, 15276, 116968, 92373, -14499, -28700, 31535, -66406, -74508, -65318, -57824, 9770, 45600, 8865, -101506, -241866, -218050, -53157, -29921, -22583, -26611, -81476, 25523, 80396, 36084, -28637, -94881, -76841, -93976, -21113, 36096, 28076, -67624, -119911, -152882, -180986, -151425, -64485, 71658, 43796, -66006, -98104]
15779i8104l2171K8443n5337k4719Q7186N9585J09694q3136q1642J1808p8987
15768a57380m9920R7717J00976l2113L789k0289j7227l5235N5449J08645q851
15757D5561o1000j9937n3422M4333q5721k9489R3166M3724L6967N9216m0635L2635
15745F5398J3611m7746J2609J2825M2175k275L8265j26001o5226J04495N0859
15734I8989Q7487q7228j38021Q3635R7595l9460M8143M093k1598o7682J5666j22981
15722d1362p4158N4863m4753r4758M8577J14380J2658j8257l696j0822k4982R4408
15710A2098M4960k0236o1011l1778K6301n5641K4636P0643R0953Q697j3083j25076
15698b8537r2821r597J30693K6186K6979m6211L5392K6754n0925n2474M7806K6113
$$ y = [-98104, -130275, -101832, -157169, -181888, -94702, -35117, 74577, -8559, -90201, -78393, -157380, -207300, -109583, -8607, -40720, -36931, -57220, -74447, -109682, -54233, 54412, 45561, -15439, -35376, -88798, -44465, -130186, -159675, -66509, -22785, 14182, 73398, 32763, 65398, 79009, 31263, 43872, 56697, 98872, 96597, 134862, 8861, -56365, 48130, 98989, 186476, 99248, -38773, 44862, 142457, 102997, 151140, 155233, 133635, 65953, 81619, -41362, -115520, -60657, -105410, -200168, -151591, -37211, -24553, -42810, -46506, -57328, -82310, 12098, 57058, 36822, -24189, -55967, -29666, -85307, -60671, 9972, 100925, 109622, 96539, -28537, -121358, -130955, -262, 25924, 52903, 6692, 42084, 68838, 17913, -34561, 13245, 39358]
15686C9358j47985j26665l7101o2786R1793O8435J6471P7017q9J20737O7222m0283
15674F6124J105J8747K4373q1500Q382j0131N7548K1709k6077J6717K5140m7817
15662G4320L4661j06722r8047M981L7888M7725L3876m2288K1308j9102l8347n7476
15650a07223j10966O9706p0241q6150J35066R1455O0285R872J2842j46140l1103
15639a72597k057o1517Q815J18071J07925P235l5135M9290q7615k5123m104J4627
15627h2185o0338r8858O541O4937P0408O8287L7381r959L3217r8877q7055l4308
15615a90809Q3293L0418k7163l852n8565p2218K7951J7170J53672N749r354L9597
15603d111Q2503Q0681j43437j78483k219J1531L5622J24468M0411P1014K9955
$$ y = [39358, -108627, -235292, -272393, -335179, -243386, -174951, -158480, -81463, -81552, 39185, 106407, 66124, 67229, 85976, 110349, 28849, 37231, 27100, 84648, 106357, 80280, 96997, 122137, 74320, 108981, 2259, -95788, -90807, -52919, -5194, 28682, -13606, 7702, -11400, -49747, -107223, -218189, -148483, -218724, -304874, -169808, -78353, -18068, -8196, 4646, -141494, -172597, -174654, -236171, -227356, -109285, -1360, 5875, -29260, 20030, -67585, -92708, -96812, -82185, -142523, -241381, -234840, -169903, -99495, -31208, 6173, -3786, 29431, -69446, -156501, -190809, -107516, -77098, -104261, -108113, -166678, -238896, -210945, -193775, -40103, -34354, -43708, -4111, 78392, 159073, 15636, -162847, -165066, -153535, -117913, 6555, 46966, 117980, 147935]
15592A47935p2385J7042k7067L6711m1523k1947m3755m5862O2745m826m6910k9873
15580f9715P5012L2392n4644q6139l2719q4821j0398N8414J0253r201J17156J25790
15568G1380N9539O543j08953l9062o7486J32L099n4647Q78J7152p6136N1039K4488
15555a12034R5454J5691j8001Q876O3595j2719l2791p2034j4342O8607Q186m1381
15543d2893j22307O534M5779L7159L8162K0845O80J18479l3775L7203L7519k9753
15531A13632L205k3463p5419j3299R6591j30281r3707M8899M439l397J13975M2639
15519H3814q2432j17211J7246R2307r7728M8743J9479l546L4372l5346j068k9346
15507g0716m8495J2737j0708L7921L3587o9122m7567j7410O7921L4939M4130K3385
$$ y = [147935, 75550, 92592, 65525, 102236, 60713, 38766, -4989, -50851, 11894, 7068, -39842, -69715, 5297, 37689, -16955, -103094, -135813, -220634, -231032, -172618, -162365, -171566, -54410, 71380, 130919, 137462, 28509, -10553, -78039, -77907, -74808, -129455, -128577, -111425, -187561, -136522, -112034, -16580, -889, -18890, -10014, 53581, 40862, 8071, -63963, -78305, -9698, -1512, -42893, -165200, -158666, -112887, -75728, -37566, -16721, -16041, 102438, 68663, 105866, 143385, 113632, 116837, 93374, 17955, 4656, 101247, -29034, -122741, -73842, -69403, -72800, 41175, 83814, 1382, -115829, -98583, -6276, -104004, -55261, -35782, -39328, -4956, -40302, -41370, -70716, -119211, -106474, -117182, -79261, -45674, -114796, -162363, -179773, -111852, -76913, -32783, -9398]
15495i398j3986k9895P0454j3078j02880j30486N3762O2396O7156R6100K3247
15484G3392L9468k48k1399j0926J17483m77o9875n8589l7925L3787L1339k0750
15472G5280n2611K0494l8177K0630L4372P7252r5415N9867q6010k1574Q5436J14743
15460A94287M7080o9879j19430r9114k2744p5023k6011J20037Q4662Q1115n0460
15449F4520l0995n7708q2241L5848j4872r033M0912K0673q717J20068K7134k0330
15437H5259l728k41686q8291l9331K1957J12074J19605r108M9510K5127M1877
15426G3265p5240j16011K6022J03168k0574j7741K0009K7653O7709O4723m4038
15415A08945p3696j04056j5207K3621n3706j1937Q5522R2810n9598m5581J1620
$$ y = [-9398, -23384, -53279, 17175, 4097, -98783, -229269, -175507, -113111, -45955, 50145, 73392, 112860, 112612, 91213, 80287, 197770, 197293, 127418, 68829, 30904, 64691, 96030, 75280, 22669, 43163, 4986, 25616, 59988, 137240, 41825, 101692, 15682, -5892, 79544, 194287, 241367, 171488, 52058, -47056, -69800, -144823, -170834, -50797, 33865, 114980, 64520, 33525, -24183, -106424, -70576, -85448, -94481, -53569, -32896, -41613, 78455, 105589, 85259, 81531, -160155, -248446, -287777, -265820, -153746, -34141, -43249, 6261, 31388, 73265, -1975, -117986, -91964, 11204, -9370, -27111, -7102, 20551, 88260, 152983, 108945, 35249, -68807, -84014, -60393, -114099, -126036, -40514, 52296, -7302, -52883, -41263]
15404d1263K5407l8486l6994K9937K0379o1423L7960M5779M010k3322l3926P0812
15392a130q9000j4106J18519N1720P7503L370j29546o8199J1630o943n3106J14693
15380A5405J00006j30518o0023k2667R720K5148o1417j2323M7505k9075q6176
15369b04415J6957r1872M6247K03538Q0583J5214n8790p4915l3844l5866K4964
15358a12199P8996Q2481l1105o7368j4929n8836l7851J47659P7873j3128l1242
15347B0351m7717p9136k441P2428m8698j6670K6253r2351L0010K9361j03058J7992
15335a93676O9504O8896L1306k7894k81r2637j4235l3343M201L9583J0444n5319
15323a93451k9223P4694P3390J07053m1084O9232k4490l5457n6140M000l150L5499
$$ y = [-41263, -15856, -54342, -91336, -61399, -41020, -102443, -64483, -18704, -14694, -38016, -71942, -1130, -90130, -104236, 14283, 66003, 143506, 146876, 17330, -50869, -39239, -46182, -99288, 15405, 115411, -15107, -75130, -97797, -88077, -62929, -124346, -136669, -89164, -118239, -204415, -187458, -279330, -233083, -29545, 51038, 66252, 7462, -67453, -101297, -137163, -112199, -33203, 49278, 18173, -49195, -64124, -122960, -160811, -13152, 64721, 51593, 20351, -27366, -106502, -108943, -36515, -85213, -101883, -75630, -167981, -137971, -108610, -211668, -193676, -124172, -55276, -23970, -51864, -52145, -144782, -159017, -192360, -188159, -148576, -138132, -193451, -222674, -147980, -74590, 32463, -8621, 60611, 36121, 664, -55476, -51476, -54626, -19127]
15311a9127O001k9055q601r723j48742j9038P6690N2686k9145N0698j1547p8996
15299a67899j8574k4462K1972j9771n5437J0848R2589J13094O3177J39364m7410
15288A07491l3758k7290K583P857k9057K1759j7738O5452N2323l058q6595l5504
15276B4465l6589L9523o0265j5297n3054n9306j6378K0675j5884K9996J26220
15265a5894J9676q7379M778o4169J893J58L5164J8048J9340j4538M6079N746J0524
15252b0574K5030J09357o1424m5854o241m3035K7687P4270j2492L52m846L414
15240D5644Q2650k4530q468K9624m1899q3154l1410R922O0814J02991L9573q8687
15228I3070j06331j18378J2281j850J5787l942J5549N0440Q7983o8324k4298M540
$$ y = [-19127, -13126, -42181, -50782, -60505, -209247, -228285, -151595, -98909, -128054, -77356, -88903, -167899, -186473, -210935, -188963, -208734, -264171, -253323, -160734, -47640, 15537, 154901, 107491, 73733, 46443, 49026, 56883, 27826, 49585, 31847, 97299, 149622, 146564, 59969, 24465, -12124, 27399, -32866, -48163, -101217, -160523, -176901, -156226, -172110, -142114, -15894, 3782, -83597, -78819, -142988, -141095, -140937, -105773, -87725, -68385, -82923, -36844, -31098, -20574, 4456, 113813, 52389, 6535, 294, -42741, -15054, 59216, 46724, 47076, 42230, 45644, 128294, 103764, 95296, 124920, 83021, -133, -31543, -21621, 39193, 142184, 181757, 93070, -13261, -131639, -119358, -121208, -105421, -109363, -93814, -43374, 44609, -23715, -48013, -43473]
15216d3473Q3488P2127n2970r7358n8038j9702K500p7772k4810N0911J8970k6305
15204a72432o7091O7827J76117M344P9544R3780j13940j30392l1048m9772N796
15193a37267O4668L038N9651Q324m2509k3430j1937L0023K6745k5839p2719j12185
15181b33437k121J60840J26243m5908m9689n2022r541o208O4936K3306q030j0670
15169d2301m2254L2814k5535j29352k572N1036r870j2976j5567Q5621O4219M6160
15157e77q7052r1955o0093J16186O2332k7510J7111J03620J8454m3629k4801N5852
15145C7938m5143N7566J53q0217j0582P2372L1745j3804j9393k6902K7417J0430
15133D1580Q738m7005M1179p043K6151o910q9951k3502p181J3961n5956J570J36506
$$ y = [-43473, 40015, 112142, 59172, -38186, -96224, -115926, -113426, -191198, -216008, -165097, -146127, -172432, -239523, -171696, 4421, 8765, 88309, 182089, 68149, -62243, -93291, -143063, -137267, -72599, -69561, -9910, -1586, -44095, -67525, -79462, -49439, -22694, -48533, -121252, -233437, -235558, -74718, 51525, 5617, -44072, -96094, -105635, -111843, -46907, -23601, -31631, -42301, -84555, -51741, -77276, -206628, -209200, -158164, -168034, -181010, -196577, -110956, -46737, -577, -87629, -179584, -239677, -123491, -61159, -88669, -71558, 32062, 50516, 6887, -17914, 37938, -7205, 50361, 50514, -29703, -40285, 32087, 63832, 50028, 30635, 3733, 31150, 41580, 50318, 3313, 44492, 37449, 63600, 56690, -33261, -56763, -63944, -49983, -105939, -104369, 32137]
15120C2137k948p4099j08711R2917J24290q1361m3404k3144N0700J5488k6437
15109d4572q1943p92R2963L768K1379J40233J0491o6414n5569q0323N280m3965
15097i9464J3773q2573n1860O4000L6102m4975N6484M5952m9630o4895Q9917J14436
15085B7267k216j00350o6078N1643k7247k2815K3043N5933K9483N5266q8826k0599
15073h5496N4448O4085K6229k0991j3318K7606J48727P353J3843o9469q4170j17998
15061d9151j32412J5043J44750J04984l8322Q625j214l2086K5441j9087k1030
15050E541o0208k6480l5975m4213j5442N8010K2214l1040R3913O6150L5061Q8486
15038A56017l2373o3343k285m2248l8512M5088M5105o2508K60L5355n9489M8400
$$ y = [32137, 29189, -44910, -153621, -60704, 63586, -17775, -61179, -84323, -33623, -18135, -44572, -126515, -127307, -34344, -30576, -9197, 131036, 141527, 75113, 19544, -60779, -55499, -99464, -85691, -168264, -220124, -156124, -120022, -164997, -108513, -62561, -112191, -177086, -87169, 27267, 25051, -75299, -141377, -89734, -116981, -139796, -116753, -60820, -31337, 23929, -64897, -85496, -31048, 33037, 59266, 38275, 24957, 52563, 201290, 208643, 222486, 153017, 68847, -49151, -181563, -166520, -21770, 83214, 44892, 53517, 52303, 20217, 45658, 26571, 5541, -54667, -81147, -117122, -161335, -176777, -118767, -96553, -127593, -33680, 32470, 67531, 156017, 123644, 60301, 58016, 15768, -22744, 22344, 67449, 4941, 5201, 40556, -18933, 29467]
15026B9467O6431L6902L839p1976l4573J47496M7072r7645q5825n5289L4697M7088
15014F7684p3171l1329O1617J24020J5503l7696K145l7982q0142R2576m9488l9110
15002A4627k3486P117K9022L0882k1745o6131M1574P1335m8447L4474N432J8515
14990I3169K7736m6417N0438k0385L0508M252l1690r8512j22537j2759P6394m9224
14978i9027L6136J30215l0519q1064n1326m0761R5188Q496q295k2378L6846j07487
14966a33976j1914J01628P367j1852Q5632j3993p6334j05791K4492J16918m2035
14955e9858j7630l0157Q0589O0149k7320M3121j8371k8814n0417o583n6138j1794
14943a23223m1115O0329J11118K3697k6455o022R235j0480n649o3305l1613n0751
$$ y = [29467, 95898, 132800, 136639, 64663, 30090, 177586, 224658, 127013, 41188, -14101, 20596, 67684, -5487, -36816, 24801, 148821, 164324, 126628, 128773, 90791, 10649, 103225, 53737, 14627, -8859, -1742, 27280, 58162, 36417, -29714, 11860, 83195, 34748, 69222, 74654, 93169, 120905, 74488, 124926, 104541, 135049, 139301, 107611, 9099, -113438, -126197, -49803, -99027, -62891, 67324, 36805, -44259, -95585, -136346, -41158, -32662, -40957, -63335, -26489, -133976, -145890, -44262, -36895, -48747, 36885, 22892, -53442, -159233, -134741, -17823, -59858, -77488, -107645, -27056, 33093, 5773, 48894, 30523, 1709, -48708, -55291, -111429, -123223, -164338, -104009, 7109, 30806, 4351, -1671, 7564, -2916, -8565, -71870, -103483, -154234]
14931a54234L1330J16803K7223j10175r3040P0416J03201R3158Q3078l4192j14227
14920A9341j45403K8262J34500M6083R252j13202m1372P2177l7755m5079l7406
14909a10602K5984n1554o5522N4829L3819Q6652m0256J01093J14872J3362n5008
14898A07669n5211P3065N3164n9125j40140J03797N1642r1692m8616J7303o1105
14887d9249m215k5015N9399r578N2147N2539M6323m8393j3776k0392o13M0762
14875G9939l2244J8707j7560k3825j5580r7757K9453J17696O08l7767j4167J8210
14863B5713o2198n1763L6250J7610J02747P4180k8377o0081O4446l2915J7145
14852A02757O0290l6018m3325o0562K8377M3089k4373l8227P8417Q2824M3431
$$ y = [-154234, -122904, -6101, 21122, -89053, -182093, -111677, -8476, 84682, 167760, 133568, 19341, -126062, -97800, 36700, 82783, 92035, -21167, -62539, 9638, -28117, -73196, -110602, -84618, -136172, -201694, -146865, -113046, -26394, -66650, 34443, 149315, 162677, 107669, 52458, 125523, 178687, 119562, -20578, 83219, 134861, 43169, -5447, 11856, -49249, -53464, -78479, -19080, -28658, 23489, 76028, 122351, 73958, 60182, 39790, 39177, 79939, 47695, 66402, 48842, 25017, 9437, -88320, -58867, 58829, 59437, 21670, 7503, 25713, -36485, -88248, -51998, -34388, 68359, 142539, 114162, 54081, 118527, 85612, 102757, 163047, 127029, 83704, 23142, 51519, 94608, 70235, 32008, 110425, 193249, 236680]
14841B36680n8025p3184l8478r5797l5342K7388M1841J7122L9739k4997r0261
14830e3314j5134J45506J579m8335r3266J9852Q0038N5283q7159J8431m1322j6039
14818c3880P8070M1818o9446J4031K6855J5831l4787k6415n9109l8597P222J6390
14806f2017m1790K0855j1875k0341j6460o1643O2854J01697J05887J04558j9926
14795A61799m2402n7946j09382J5627l3692l2048m2292J7841J57080M8876J1463
14784I4924r559j3912O7822k3331r7121n317m9996K6692p7585p5277M2733J22238
14772B311J50830j4460l3751j16037j09977n2901L4176K9574M0794J4676J2759
14761d2006O5060J1104q2625m1112J31384J08735l9642j10368J3086k7625r1298
$$ y = [236680, 178655, 105471, 66993, -28804, -64146, -36758, 5083, 22205, 61944, 36947, -53314, -68448, 77058, 78637, 30302, -62964, -43112, 36926, 92209, 5050, 23481, -17841, -33880, 44190, 86008, 16562, 30593, 57448, 73279, 38492, 12077, -47032, -85629, -78407, -62017, -103807, -82952, -94827, -115168, -131628, -193271, -130417, -28720, 77167, 181725, 161799, 119397, 61451, -47931, -32304, -65996, -98044, -140336, -122495, 34585, 83461, 94924, 85365, 71453, 139275, 115944, 18823, 13506, -36490, -9798, -87383, -162660, -119927, 2311, 153141, 138681, 104930, -11107, -121084, -173985, -139809, -110235, -69441, -54765, -42006, 23054, 34158, -48467, -89579, 41805, 150540, 110898, 530, 13616, -14009, -105307]
14750a05307n0036p3113j5362M0242n4106O4290K2446N6902L0573m6720m6496
14739a76687J1661O7694N5263o47K5333m4066j1241P6064k5995q6522m7023o101
14727a62267J07134O9886m748K4309N7716j02649P649J3802n3784L061L1243P8969
14715G0321J8019m6940J05944K5572m0189j3095o4265k9926o231l835j2756l5852
14703c3233R5349J00748j43162n0823p077q0296M89n520n8762Q178J1819l5019
14691a97309n0924J1788P8763N2213P2879R1004m9215o9936R3602l8562j02657
14680a08354J00828Q8673J3495P488l8780j954K9036k3395j14168J6365M8388
14669A7622L5083M0714m1913j47168O0812K9315N9006r5099L4732m6422m3586
$$ y = [-105307, -155343, -228456, -243818, -203576, -257682, -193392, -170946, -114044, -83471, -130191, -176687, -165026, -97332, -42069, -42716, -17383, -61449, -72690, 3374, -22621, -109143, -156166, -162267, -55133, 14753, 10005, 34314, 92030, -10619, -2970, 10832, -42952, -39891, -8648, 70321, 88340, 41400, 147344, 172916, 132727, 119632, 55367, 25441, 19210, 15375, 2619, -33233, 62116, 162864, 19702, -31121, -38198, -118494, -118005, -123525, -182287, -174109, -162290, -197309, -248233, -236445, -157682, -105469, -32590, 58414, 9199, -60737, 32865, -5697, -108354, -7526, 81147, 94642, 102130, 63350, 61396, 90432, 67037, -47131, -30766, 17622, 52705, 93419, 51506, -95662, -34850, -5535, 53471, -41628, -6896, -53318, -96904]
14658i6904L06N7076L5391M937Q8047m5874l1259O980K1446K5318j6082l2077
14646A7305P747N8853j04827k5880J24722R6862K192j5415j07619j3791K1301
14635F1450R620q2680j8020K3375k7930J7100L967m045K4492L8242q728M2706
14623G9549j4219j44478n2412O7708R1908j8318j00263p731M410m6262l3293p0587
14611b43988l3989Q0385J01735j4719L0737K1169j5019J0591Q109q0721J0180
14600a25530Q2013J08746L5220m6758q174l2745l1921K1886J4863j5675l7930
14589c6005J0154O8688R6388o8117q4151J1590M9476K120K4733K7454L52r3043
14577I639k4189M6986n6263l6411r7128l1366J53989J0816m3189k9405L7503L0703
$$ y = [-96904, -96598, -39522, -4131, 806, 88853, 42979, 11720, 18700, 40146, 65464, 49382, 17305, 25052, 83905, -20922, -46802, 77920, 174782, 176974, 161559, 53940, 40149, 61450, 71070, -11610, -29630, -6255, -34185, -17085, -13118, -17163, 7329, 45571, 36843, 79549, 65330, -79148, -131560, -63852, 28056, 9738, -90525, -98256, -93846, -140108, -173401, -243988, -277977, -197592, -95857, -110576, -79839, -58670, -73689, -63098, -54989, -135710, -125530, -43517, 65229, 100449, 53691, 45517, 12772, -19149, 2737, 17600, 1925, -36005, -25851, 42837, 139225, 71108, -13043, -1453, 48023, 50143, 74876, 102330, 102682, 9639, -14550, 32436, -23827, -60238, -157366, -188732, -34743, -23927, -67116, -96521, -59018, -28315]
14565b8315P706M6635N4639J1580q8676r2634L4328o2846j2197p3047j9299R3558
14553a28568M4712N8020L775j1018o0550J04959N518L812O4307M5479r7965m4525
14541a2044j1903R267L2812L5913l0937p0057J7635N3271O7247P9026N7809p8885
14529A49154r6418j27773q4612J70410J10381j04263p5276r6899k1102K866L6201
14518a37331M6829j08019j24674M1269P1920J36128J72503J423j19975j4806P7295
14507D2562Q872p7396n4208o268K9241K1293r2565n9836j5884J33J02422J24011
14495B2377M5275q0079o8853O7347K4767l3140J19840J5954m8114o898p779o9890
14483a9193m40K7092n7591o0261K4886n8640n2886J2721Q457O8022J37276P2477
$$ y = [-28315, -20609, 26026, 80665, 92245, 3569, -89065, -54737, -117583, -129780, -202827, -222126, -128568, -83856, -25836, -22061, -33079, -93629, 11330, 16848, 20660, 84967, 130446, 32481, -12044, -23947, -14680, 18132, 54045, 23108, -46949, -29314, 23957, 91204, 170230, 228039, 149154, 52736, -75037, -159649, 10761, 121142, 16879, -58397, -155296, -176398, -173532, -137331, -90502, -198521, -323195, -281926, -210006, -73878, 98625, 100048, -19927, -34733, 42562, 51434, -25962, -80170, -86438, -57197, -35904, -128469, -188305, -204189, -204056, -101634, 22377, 67652, -12427, -81280, -13933, 10834, -22306, 97534, 113488, 65374, 58476, 50697, -19193, -19633, 7459, -50132, -110393, -85507, -144147, -197033, -184312, -175855, -107833, 29443, 101920]
14471A01920O9871o6168l2831J6774r8607n3516N9150M0013L2056K3035q8630
14460C067q127p736K1014L7177k5778N0298q552k9089j97457k695J34298P2561
14448C8981K5390K743m2916j604l4498M1032O0935J1690n9490n4737O0404R8274
14436A46204k2763j47438p3266M8521p1230O6239M6320q2701n3811P2865l6091
14425a07151m8769J36536N1270N95j8002L5657P4012P9791m0730j04438q8342
14414b9571k3691j51093q9195M4437O0759M5971N4231j1932j349Q386J0297O5423
14402a7327K2883Q6719l5305j0443L2105k7265k895k4459K9975M591n9738j00745
14390a01904J117Q1416Q9771l2351j14049m7161j8125M8390J36642O3728L2563
$$ y = [101920, 171791, 105623, 72792, 89566, -9041, -62557, -3407, 36606, 68662, 91697, 3067, -5060, -12796, 8218, 45395, 19617, 69915, 61363, 32274, -165183, -167878, -33580, 38981, 64371, 67114, 24198, 22594, -11904, 29128, 90063, 101753, 42263, -12474, 47930, 146204, 123441, -23997, -97263, -48742, -119972, -53733, -7413, -90114, -143925, -71060, -107151, -155920, -19384, 31886, 32481, 14479, 50136, 124148, 203939, 163209, 58771, -29571, -53262, -204355, -293550, -249113, -188354, -142383, -88152, -100084, -101433, -93047, -82750, -17327, 5556, 92275, 56970, 46527, 78632, 51367, 48472, 24013, 53988, 58579, -1159, -101904, -100787, -19371, 70400, 38049, -76000, -123161, -141286, -92896, 43746, 107474, 140037]
14379A40037R831l6821j8247p3306O5389p538r9195j663l2662j09534M1670j2006
14367a34045L0750j1857O8752P7987o681l6065n1117M6672J11963M6838q8447
14356E4750j19032l8388K1582Q2099J32279P3190j96665j33185M0960Q1129q711
14345i992M153P5820k6205o4754k6970m293Q813J4206m081O1481j6933m5619M5535
14332A1161P2670J1517l6936q5356j81301j1462N3995M5517L1751M1241o590q389
14320f2182O7674m728P6608n3327j08679q8846n509Q5282Q1948M7723k3675k7956
14308a5667l8015Q1393l3373R042p6978m5797O260N3333l8181p7010m2163p8968
14296b96124j8033N6680M0317P6031J59079q131j3717r0872l9174J29908J4169
$$ y = [140037, 149868, 113047, 94800, 21494, 86883, 79345, -19850, -21513, -54175, -163709, -122039, -134045, -103295, -115152, -46400, 31587, 24906, -11159, -62276, -15604, 96359, 143197, 54750, -64282, -102670, -81088, 1011, 133290, 206480, 9815, -123370, -82410, -1281, -9992, -5839, 69981, 43776, -20978, -47948, -52241, -43428, -29222, -33303, 28178, 11245, -34374, 11161, 83831, 95348, 58412, -26944, -208245, -219707, -165712, -120195, -88444, -47203, -53793, -62182, 5492, 764, 77372, 24045, -84634, -173480, -178989, -93707, -11759, 35964, 12289, -15667, -53682, 27711, -5662, 3380, -73598, -119395, -113135, -59802, -97983, -174993, -217156, -296124, -314157, -257477, -217160, -141129, 17950, 9819, -3898, -94770, -133944, -4036, 10133]
14285A0133k8537k3393M9940k9898K234J38959N555j41820l7223j5941J8726m2628
14273i3893L7965R4877k223N7661J05672n0097q4670o4279m862R0077m5917k3440
14261A6871P8724J0819k4073Q5581M5641p6804m2267m757Q7208m1780j7713q503
14249A08947P4246N646o4077j53071j23234O0176M9251l1955n3663l3394L7877
14238a23251M8312O5376J24020j8426l1100m7461r7698J6298P908K480L4187M3278
14226B3923M9737k4629n2930p3611k7304K5742J09119O1647q812l1960l8980L535
14214A5477n3607m0026q1269k9759O6739J302p356R7816m1362l0161O9101o4933
14202i8038J5687O5601K686j01126k1145O8745p9393o3682J6996R4548N4587l6418
$$ y = [10133, -18404, -41797, 8143, -21755, -19521, 119438, 124993, -16827, -54050, -69991, -51265, -93893, -55928, 38949, 36726, 94387, 200059, 149962, 65292, 1013, -3849, 86228, 40311, 16871, 95595, 106414, 82341, 167922, 213563, 136759, 94492, 89735, 176943, 135163, 117450, 108947, 183193, 188839, 124762, -28309, -151543, -91367, -42116, -74071, -127734, -161128, -123251, -74939, -9563, 114457, 96031, 64931, 17470, -80228, -63930, -56022, -53542, -19355, 23923, 73660, 49031, -3899, -77510, -104814, -79072, 30047, 91694, 82882, 50922, 11942, 15477, -38130, -78156, -159425, -189184, -122445, -121143, -128499, -30683, -72045, -102206, -33105, -98038, -82351, -16750, -14064, -115190, -136335, -67590, -146983, -210665, -193669, -99121, -44534, -80952]
14190h0952M2224m3527J6959N6600M9797l9458j06262Q056q448J8772M6875j04253
14178a43617l4501J149Q2846K7980J7888O3460q5246o5172r613N8024M5801P572
14166c3429n1865n0744M6759L6883P6031J9166n4645o2185j9183L2951k7220K263
14154h5218P1497j3390k1779n4706K2794K1681m9393n5884N3218Q2565q328k7343
14142f4286R840M6568N9755o400k0238n8556l0036K5233p8063J7109N9905L8769
14130d00J07282M1114o7267j5545P0269q5253p1548M0524r096j01650L7740J24273
14118G0443j6440m2613L465n1935O4041k3237O3536J62268P7318n8295p4003j98224
14106b3676j78496k2226J41096J24380n484j4684L1960j09965K1165K6949L628
$$ y = [-80952, -38728, -82255, -65296, -8696, 41101, 1643, -104619, -96563, -105011, -86239, -39364, -143617, -178118, -176969, -94123, -66143, -48255, 15205, -70041, -135213, -144826, -86802, -41001, -33429, -85294, -136038, -89279, -52396, 23635, 42801, -11844, -74029, -93212, -60261, -87481, -85218, -13721, -27111, -48890, -103596, -80802, -59121, -108514, -164398, -111180, -28615, -36943, -64286, -54446, -7878, 51877, 45477, 25239, -33317, -63353, -38120, -116183, -99074, -39169, -400, 106882, 147996, 80729, 65184, 135453, 50200, -21348, 19176, 10080, -91570, -53830, 70443, 54003, 11390, 14855, -37080, 26961, 3724, 67260, 229528, 306846, 248551, 174548, -23676, -202172, -224398, -83302, 41078, 35594, 20910, 52870, -57095, -35930, -8981, -5353]
14095e353j9773j04931q5429J10231Q9999o7007N1889k0188P901J0228R1548R9500
14083A58615k886m9635l8604n2948N4688l8519j13154j18812K9245J61496J39017
14072A28503K3221j9656j1786Q364O3762j7356q5736l3861K2477p5599m3703L6263
14060e107Q2799J33348l9290m9550O1971P738J9632j89878j11653m2817N5883
14049g6924M625R057q010K7555O6363k2650M3523m2374J540j134P5677n590l2979
14036C8679K4013N0353p1406o4656J7147j1895j01695q9351M4209P0839N9583
14025c4180M3209K7437N2644L2323M0622o8276p0099L3785J43139j8155j50401
14014C2048R270J2929r0870J3788j7598K4605P0315M36q9661l587K2403m8217
$$ y = [-5353, -25126, -130057, -215486, -105255, -15256, -82263, -30374, -50562, -42661, -32433, 59115, 158615, 155729, 106094, 67490, 14542, 69230, 30711, -82443, -201255, -172010, -10514, 128503, 151724, 132068, 120282, 128646, 192408, 175052, 89316, 55455, 77932, 2333, -41370, -5107, 77692, 211040, 171750, 122200, 184171, 191909, 211541, 21663, -89990, -132807, -76924, -72299, -63242, -71252, -43697, 22666, 16, 43539, 1165, 2705, 1571, 77248, 71658, 38679, 62692, 113045, 41639, -23017, -5870, -17765, -119460, -208811, -164602, -93763, -34180, 9029, 36466, 89110, 121433, 162055, 93779, 23680, 57465, 200604, 182449, 32048, 41318, 54247, -36623, -22835, -40433, -15828, 54487, 54923, -34738, -38325, -15922, -64139]
14002f4139m6097L457p240J0254P8872O6354J12037p8160j24201o1973p5219R9923
13990h6132O403m2776J03973M3640l8063R7324M5059L8743q489l9137J2646q2023
13978E1168J5954J3290K1957m0392j7630K7470o004n9539O9220P0503Q3595r2554
13966A37038j07116n7997j6601K1686p5566O792R3435P4439M4833L2181l2042
13955A21082n2643r4160K3493M5012j39748l7723Q3292J3868q4006Q167k1306
13944a34672l4060J32322J02456l7994q4623Q984L0622M0219j840m1581L9958
13933A9791O0987k6740n5138m9631l8251L4093M6442l4638j7282k6384k6912K12233
13921I8570q459p5218K446r2302M0610L0356J5078L4441K3366J9206R054j1060
$$ y = [-64139, -110236, -106779, -114019, -103765, -24893, 41461, 153498, 75338, -48863, -110836, -186055, -86132, -79729, -122505, -18532, 25108, -12955, 84369, 129428, 168171, 159682, 120545, 133191, 51168, 67122, 80412, 102369, 61977, 44347, 71817, 65813, 6274, 75494, 145997, 229592, 137038, 29922, -28075, -44676, -22990, -98556, -91764, 1671, 76110, 120943, 153124, 121082, 68439, -25721, -2228, 42784, -96964, -134687, -51395, -37527, -121533, -113366, -134672, -168732, -36410, 66046, 28052, -56571, -47587, -16965, 23254, 21414, -20167, 19791, 80778, 54038, -1100, -50731, -88982, -54889, -8447, -43085, -60367, -86751, -113663, 98570, 90111, 14893, 17339, -74963, -34353, -3997, 11081, 45522, 68888, 88094, 97148, 86088]
13909H6088L4143k7920j09365k5108M1951J05880N3161O101j16702J6036O1952
13898A26217J7886n1324L9031N2450q8156K4616K7588m3812n467N3789L513m4083
13886A12248K3360j05172r7332J3384J13420P4334j6449n6394n6008j6892M6734
13875C5233J7166O2537m5710q5253m2117o9601K5549R8661R614K4883l8563j24510
13863a32111n109J15161O1921J13706M632L8205r8381j63603n7531j5019M125
13852a34004N15L5845K3004M1819k0263Q1634Q5207M1185r1436m1740J01441j27831
13840d624q0578j3345L5443J1344J2504K7523O6420r20r052J2618k2842o0548
13828b6057j08977M172l0676q5039p752J07779J34911L6016K4585r994r4653o0687
$$ y = [86088, 120231, 92311, -17054, -42162, -211, 105669, 158830, 164931, 48229, 64265, 126217, 144103, 92779, 131810, 184260, 96104, 120720, 148308, 104496, 99029, 152818, 156331, 112248, 135608, 30436, -66896, -53512, 59908, 134242, 117793, 61399, 5391, -11501, 35233, 52399, 114936, 69226, -16027, -58144, -127745, -102196, -3535, 6079, 30962, -7601, -132111, -137220, -22059, 39862, 153568, 158200, 196405, 98024, -65579, -123110, -138129, -134004, -133489, -97644, -74640, -32821, -53084, 28550, 113757, 154942, 63506, 21766, 123207, -4624, -85202, -98547, -63104, -51760, -39256, -11733, 54687, 53767, 44715, 57333, 34491, -26057, -135034, -130862, -161538, -246577, -254329, -146550, -11639, 24377, 48962, 38968, -55685, -116372]
13816a16372J8485N3525k0994m0314M4814l7972k8559k8234J6791O7586R8445
13805B7201N0220j3042j1113k038k6367O471j888L0894j02303l621L8229l1805
13793c9162k7209J2643k4030M5881P1868J2893l4463Q0626l3343j00646j3105
13782d8047l595P2711q183L7125R080m5950r4464N2448Q7121j26648r9616j5689
13770a83707M4745K5940o262J29167J04218M2702o2607r3914j31618K8366J31438
13759B8468L5986l2897O6204n8978j74989r2047M8614N6066J00432k8573J3144
13748c8570R2653R036o35q2946O7108J18763n5200M487j05795m8297P5274N9551
13736I5429n8098j14560L4637M1661J4275K7872M6084K355m3156N2756L7616J9226
$$ y = [-116372, -97887, -44362, -65356, -105670, -60856, -98828, -127387, -155621, -138830, -71244, 27201, 77421, 64379, 53266, 51228, 24861, 31332, 29444, 60338, -41965, -45586, -7357, -39162, -66371, -53728, -77758, -31877, 39991, 52884, 18421, 99047, 65704, -34942, -48047, -51642, 21069, 12886, 50011, 59091, 13141, -81323, -28875, 58246, -68402, -168018, -183707, -138962, -113022, -119284, 9883, 114101, 156803, 94196, 282, -131336, -102970, 28468, 64454, 31557, 97761, 38783, -136206, -228253, -179639, -123573, -23141, -51714, -38570, 54083, 63119, 62484, -20462, 46646, 165409, 110209, 114696, 8901, -39396, 35878, 95429, 37331, -77229, -42592, -931, 13344, 41216, 87300, 89655, 46499, 99255, 136871, 156097]
13724A56097q5963K5081N2655r5901o3667M8536Q6394l7725n985k7607L1934P996
13712I1845q2254m8785j30438j0519R6864P966J01467Q40q5258J9710O460K4458
13700g644O2149m0687m8778P1405o6140o3807K0660K8738m0075J01999R5877j14567
13688h70o6262L6202o3464p5671Q6745O2662R3222M8718q3967j60052R123j8958
13676a32572L7728M2366Q2200l8094J5490j5452m7035m5036k1207L858o4694R8611
13664h3837N3639L4347J7826l5048m6060O5527o8925L1443Q4559O1633L3022j2812
13652A35314n308J7729m0049k105n0327j7248J343m2578n2354J2522L7121P5111
13640F9171J5917l7790K6306J1653j17724j47463N600J09646L8380N0526j1717
$$ y = [156097, 70134, 95215, 147870, 51969, -11698, 36838, 123232, 85507, 79522, 51915, 83849, 91845, 9591, -39194, -169632, -180151, -83287, -75321, 26146, 26986, -58272, -38562, -32102, -7644, 54505, 13818, -34960, 36445, -29695, -93502, -72842, -44104, -84179, 17820, 113697, -870, -67132, -30930, -94394, -170065, -83320, -20658, 72564, 121282, 37315, -122737, -113614, -132572, -94844, -52478, 29722, -8372, 7118, -8334, -55369, -100405, -121612, -117754, -182448, -83837, -30198, 4149, 21975, -13073, -59133, 6394, -62531, -31088, 53471, 115104, 148126, 135314, 130006, 147735, 107686, 105581, 55254, 38006, 39349, -3229, -55583, -43061, -5940, 69171, 85088, 47298, 73604, 85257, -32467, -179930, -174330, -64684, -26304, 24222, 12505]
13629A2505l0569m8264L1992K1710m0351N4487M5964M0988J3877l2668m1957J1736
13617C9450r5679Q8866R9996N0367L0851L3527r1034j08894L0566n5729m8334
13606b6047J10565k2350m2004j1642L6362K6156o3590J29992Q769l7436j27838
13595a9063K8055Q3593P048K3920q7706p0739p1051l9128J17955k3301L7777l5252
13583d7892J4549Q7740K5431o5143o2170j8151o6992l1389Q579O5598R3233l4088
13571c0695L7363J7679o4706k2841M9916M4424M2218k2823j7821R265K9053L6633
13559A07665J5181l467n0891M664O2430K4403K1198j14307j11524K9247J7929
13548B528L7053K5805q3318L8850m2644p7829l1397L8015L693l8955j3143N3102
$$ y = [12505, -18064, -66328, -34336, -12626, -52977, 1510, 47474, 88462, 102339, 69671, 27714, 39450, -56229, 32637, 132633, 183000, 213851, 247378, 156344, 47450, 78016, 22287, -26047, 84518, 62168, 20164, 8522, 44884, 71040, 7450, 137442, 146211, 108775, -19063, 8992, 92585, 99633, 123553, 35847, -34892, -105943, -145071, -27116, -50417, -12640, -47892, -33343, 54397, 79828, 14685, -47485, -65636, -132628, -164017, -155438, -89840, 3393, -30695, 6668, 24347, -40359, -63200, -13284, 31140, 73358, 50535, 32714, 41979, 71032, 107665, 122846, 119379, 68488, 73152, 135582, 159985, 181183, 66876, -44648, -15401, 2528, 39581, 65386, -17932, 20918, -21726, -99555, -130952, -92937, -89244, -128199, -141342, -88240]
13536h8240Q7870J9152k6792l1844L4056M8808K0448j3359q0534j8302J8858p5390
13524a05269k9168K4803k9327N5633N2476l5375l6438l253k1899K3964L7241j7594
13512h4206O6360m2197j16299p8887M872J26461M7242O249N1584o6276o283J4581
13500g6799L4912l4766L7435O6849m1368K9615J5370m3881k0769n0549L7286J06681
13488F0016m9022q0393o9578J3143k3467Q7015Q8308J8302l7859k5707O7957j8599
13476C0116p2648M4461J2333M2792k3701n1595j10232Q527J44136P4752l5273
13465F3668m4686m2712o2753J45686N782j5453m3339m2047L1236o8694j4538N5350
13453c2500l6308j793P4585p7604M5047O1251O1760J063n4876M9235K9753n0892
$$ y = [-88240, -370, 18782, -8010, -39854, -5798, 43010, 63458, 50099, -30435, -48737, -29879, -105269, -134437, -109634, -138961, -83328, -30852, -66227, -102665, -105918, -127817, -103853, -66612, -84206, -17846, -60043, -176342, -255229, -250357, -123896, -76654, -70405, -18821, -85097, -91380, -76799, -41887, -76653, -39218, 27631, -13737, 15878, 31248, -12633, -33402, -83951, -46665, 60016, 10994, -69399, -138977, -125834, -149301, -62286, 26022, 44324, 6465, -19242, 48715, 30116, -42532, 1929, 14262, 57054, 33353, -18242, -128474, -119947, 24189, 98941, 63668, 18982, -23730, -86483, 59203, 64985, 49532, 6193, -35854, -4618, -73312, -87850, -32500, -68808, -70601, 3984, -73620, -28573, 32678, 94438, 95501, 40625, 89860, 119613, 68721]
13441F8721j3785q353n7010j34456K0429M4835Q4590j2673o0045k9594N1211N7479
13429A1349m8063p7076o3749j7251q0694J7527J46958O7979K6570L7963o1040
13418c9527K5803J3901j2851m4755o4089J3336J29882P1112l2039n0661O8523
13407G8635o607m1481J6584n6177Q823J3131K4351r259K8385O9490n9938j32647
13395f6710p3143k4768j3906J2437K6857O3504J29412O8370R903J320m9433j07996
13383b4153P8092J3127P299j5511j55099n6219J3807O4073O0802J26777P3925
13372A86920l7681o959K526m6734n9795q9171n3195K732k3852O4148j0538n6636
13360a28235P8773N2196k1494m96p9611q0350J7258J07351Q8217N0818R571Q0167
$$ y = [68721, 54936, 46583, -10427, -144883, -124454, -79619, 4971, -7702, -67747, -97341, -46130, 11349, -36714, -113790, -177539, -194790, -275484, -257957, -110999, -43020, -16450, 21513, -39527, -13724, 177, -12674, -57429, -121518, -108182, 21700, 92812, 60773, 10112, 78635, 72028, 30547, 47131, -9046, -223, 12908, 37259, 28000, 56385, 125875, 65937, -66710, -139853, -164621, -178527, -166090, -139233, -75729, 53683, 122053, 131956, 133276, 83843, -24153, 53939, 67066, 74365, 58854, -96245, -152464, -138657, -74584, -13782, 112995, 186920, 149239, 142280, 144806, 98072, 38277, -50894, -104089, -101357, -125209, -61061, -71599, -128235, -49462, 2734, -18760, -19256, -98867, -179217, -161959, -54608, 33609, 84427, 93998, 174165]
13348A74165m0889q3421p5333m3383K7769P8955k7164L7317n5174q1939r928o248
13336a05273L443p1799j0656R5488p947n4601L5230J40302O4356o7278K317K7673
13324E1255k5637j6617P70l8336j7190K3104M3828M6820q5881r7089L573Q8079
13312b3321J65248m0693q3318k8265j06900n5265M5076N7936n0570j12747J5519
13301b17300J95488J31898l8837p5982J9179O9331j3328P2434L0489r5024j5937
13290F2411K7190m5812j00900J9290R2034J21184k6584J4743p2061j47805j8020
13279g4330O719j0220M8987K8458q51r0237J35652L7556l8652k4662K694K9359
13267E0473L4523j1369p2514p5260j11689J7071n0615M0949N3261j4365Q9007
$$ y = [174165, 133276, 49855, -25478, -68861, -41092, 37863, 10699, 48016, -7158, -89097, -99025, -105273, -101830, -173629, -184285, -88797, -96744, -151345, -116115, 24187, 88543, 21265, 23582, 51255, 25618, 9001, 9771, -28565, -45755, -22651, 21177, 67997, -17884, -114973, -111400, -23321, 141927, 101234, 17916, -10349, -117249, -172514, -127438, -69502, -120072, -232819, -217300, -21812, 110086, 71249, -4733, 14446, 83777, 70449, 142883, 173372, 78348, 62411, 89601, 43789, -57111, -37821, 54213, 175397, 148813, 163556, 91495, -56310, -74330, -67611, -77831, -28844, -386, -1237, -91474, 44178, 81734, 43082, 18420, 21114, 50473, 84996, 73627, 1113, -74147, -185836, -168765, -219380, -178431, -125170, -139535, -50528]
13256e0528k7323J8005j100L9665j1355o3757j2063L2822k8652P8946L7656l199
13244I117o0812m488j9689n3340N2364R4149L6805p4227q6419L4360O7956o1648
13232f5872n6958L3927j01688P993P6858K6017K820K383O6884L9990K2997j6344
13220C9007M7478o0481l4290o4932M2391J26334p5372N8689J74613m5698j19971
13209H7768l4917j04794j8731L3509K9162N310M6376p61R446m7583p7355N729
13197f6841Q7176M443L3903J11984j7656o471j6995M180n2663J9868q452M416
13185I6892j1180M6751j420p6114k1071J20J4249Q679K8015R1611k9195l8448
13173A08889M4519m9697m6616l5028l1806m568K3677O6899n2386k9305q2072R3354
$$ y = [-50528, -77851, -59846, -60946, -21281, -32636, -96393, -108456, -75634, -104286, -25340, 12316, 9117, -51695, -56183, -75872, -129212, -76848, 17301, 54106, -20121, -106540, -72180, -4224, -65872, -122830, -88903, -190591, -182598, -105740, -79723, -76903, -74520, -7636, 32354, 55351, 39007, 86485, 26004, -8286, -73218, -30827, 95507, 20135, 78824, 253437, 207739, 87768, 52851, -51943, -70674, -37165, -8003, -2693, 43683, 42922, 52368, 4785, -72570, -66841, 20335, 24778, 58681, 170665, 153009, 146538, 129543, 133723, 81060, 100928, 92476, 96892, 85712, 132463, 131043, 54929, 33858, 33978, 48227, 56906, 84921, 176532, 147337, 108889, 153408, 103711, 57095, 22067, -9739, -14307, 9370, 76269, 23883, -5422, -87494, 5860]
13161E860J25204k3548j15329j9691L2110k0159N5452N6956j190k0166o9874m677
13149I48m346m4231q2720K8064j9473j4280J9834N6976j266J08127R3970o5680
13137G5923m6485J17469j6835q3705K6340L4526R8814m1994j287N145p4803n6029
13125C7079K0664n2231k1347m470Q0303P052M5794M7355m4806j42190k5103N4675
13113B775J40135m0616o1618p8110j050Q7331P567Q3181N8000m8433q0781j00196
13101c1815j5240J4460m4861J7762r087m7840M0886P2207p579p440j45302N1177
13089a12672O6085j12183m9247J56389L7045K8786l0442R969N1619M7987m5666
13078D7670o6700p3167n6496J48149O3402N7551P0438r0386l9989J3345k0202
$$ y = [5860, 131064, 107516, -7813, -27504, 4606, -15553, 39899, 96855, 95665, 75499, 5625, 948, -3398, -47629, -130349, -102285, -121758, -136038, -116204, -59228, -60494, 47633, 141603, 75923, 29438, 146907, 130072, 46367, 72707, 107233, 206047, 164053, 162766, 167911, 93108, 37079, 57743, 5512, -15835, -20305, 59998, 67050, 112844, 160199, 115393, -26797, -51900, 2775, 142910, 102294, 40676, -37434, -38484, 48847, 56414, 139595, 197595, 149162, 68381, -31815, -47055, -32595, -77456, -59694, -68781, -116621, -75735, -3528, -11107, -18547, -163849, -112672, -46587, -158770, -208017, -51628, -14583, 14203, -16239, -6270, 45349, 93336, 47670, -19030, -92197, -148693, -544, 62858, 120409, 190847, 100461, 60472, 73817, 53615]
13067E3615q3900m2721o657N4085j3479n086R321Q1924j896j54527j8261J35584
13055H002J23673R4267j2170M6271p957j11886m7665J4972M5789L4670p7461o0711
13043D9794K0913M1204k7153j13584P6521Q4079K1651q8893q2968m8554k0763
13032h7753J49309O2245j32743k8104Q4312K9900m2627P852p5011m4535L7292
13021c9863J34777M3824q3447K6224O3459j00856j45258K622K4047m6457n561
13010a26489n939p4082O229Q5010P0398p2344k2163K0741J24706R1570L1896o2115
12998F7418m798R1784L6394m9763q4393N685j8863M9864J6676l7349n3250j14239
12986i4834p1516K1202J81858j5419n6154L5924M0599N1033N1447J3258n1831
$$ y = [53615, -30285, -73006, -79663, -25578, -39057, -44143, -34822, 47102, 45206, -109321, -127582, 8002, 131675, 225942, 213772, 260043, 252086, 140200, 92535, 107507, 153296, 187966, 110505, 49794, 70707, 111911, 84758, -28826, 47695, 131774, 153425, 64532, -18436, -66990, -87753, 61556, 123801, -8942, -37046, 47266, 77166, 34539, 42391, -32620, -77155, -39863, 94914, 138738, 55291, 81515, 144974, 44118, -101140, -98518, -74471, -120928, -126489, -132428, -206510, -200281, -115271, -44873, -117217, -139380, -118639, 6067, 97637, 129533, 67418, 62620, 154404, 190798, 141035, 56642, 62327, 43464, 93328, 110004, 72655, 19405, -94834, -166350, -145148, 36710, 21291, -34863, 1061, 41660, 92693, 144140, 157398, 105567]
12975A05567l8011k7619Q937j0943k5211N8115j2198l6187o3415O3475K4498O0518
12963A07526j14654N483O6639L554M9917O8393o2000r1178j0593R875L4236l5364
12951C1834j2583n0580j5972O7198K5029j5030l6937l9255K1438R9013m7300N1773
12939G8628P3680r3723j0175Q93j4121k0280j18197o845P7801J45882N9326j1368
12927A61501k2319M4512l7936J8049m0858L7362p0887p0079j0902R080m1128L4363
12915A0758K4723j5834O3890m7355m8937K3172r23J43818J12846j1130j23750
12904A31278n7442k1917l2094k3695n8165p3694O3561O3844Q3861j8379o9524
12893a2366k5718P3649J00735K3662n8755J5524n9527n1559P3701M8410K9161
$$ y = [105567, 67556, 39937, 48874, 37931, 12720, 70835, 58637, 22450, -40965, 22510, 47008, 107526, -7128, -1645, 64994, 68548, 118465, 186858, 124858, 33680, 23087, 32962, 67198, 31834, 19251, -31329, -47301, 19897, 44926, 29896, -7041, -46296, -24858, 74155, 26855, 78628, 152308, 58585, 48410, 49303, 35182, 14902, -103295, -110140, -32339, 113543, 172869, 161501, 139182, 183694, 145758, 163807, 122949, 160311, 89424, 19345, 8443, 17523, -23605, 10758, 35481, 19647, 83537, 36182, -12755, 10417, 9494, 153312, 266158, 255028, 131278, 73836, 51919, 19825, -3870, -62035, -135729, -72168, -8324, 75537, 57158, -12366, -38084, 35565, 136300, 159962, 101207, 116731, 57204, 5645, 79346, 127756, 156917]
12882A56917J3443n9461o7666J9883m4159p531R9678l6523m5471m0555l7183m3607
12870i2235J03650k4199n5207J74253L5264n1275J2390l9526J461o7982L1562
12859B8156L7403L7247N9415M1625n9776J6931p715M990M7284k0115k01930l9242
12847e5727J41268P056L7877l1649j03822j0489k3362p6325j4395p4224J5163
12836a88629K9117M5659M0662j3037J03143J69903j05031n9092l7148K3538Q4458
$$ y = [156917, 170360, 110899, 43233, 63116, 18957, 11426, 111104, 74581, 29110, -11445, -48628, -92235, 11415, -12784, -67991, 106262, 141526, 90251, 102641, 63115, 64576, -3406, 28156, 65559, 102806, 162221, 203846, 144070, 161001, 153286, 158276, 205560, 185445, -16485, -55727, 85541, 92597, 130474, 98825, -4997, -15486, -38848, -115173, -129568, -203792, -188629, -159512, -113853, -73191, -86228, 16915, 186818, 81787, 22695, -14453, 9085, 93543]
$$ [...]
##END NTUPLES=NMR SPECTRUM
##END=
