##TITLE=Analysis number 315785
Compound Code ac 34545
Project Code adrs
Chemist Name combi-blocks
##JCAMPDX= 6.0         $$ Bruker NMR JCAMP-DX V2.0
##DATA TYPE= NMR SPECTRUM
##DATA CLASS= NTUPLES
##ORIGIN= Bruker BioSpin GmbH
##OWNER= NMR
$$ XWIN-NMR		Version 3.5
$$ Thu Dec  1 15:08:29 2005 GMT Standard Time (UT+0h)  MAYBRIDGE\NMR@NMR_250MHZ
##.OBSERVE FREQUENCY= 250.131544655141
##.OBSERVE NUCLEUS= ^1H
##.ACQUISITION MODE= SIMULTANEOUS (DQD)
##.ACQUISITION SCHEME= undefined
##.AVERAGES= 16
##.DIGITISER RES= 18
##SPECTROMETER/DATA SYSTEM= dpx250
##.PULSE SEQUENCE= zg30
##.SOLVENT NAME= CDCl3
##.SHIFT REFERENCE= (INTERNAL, CDCl3, 0, 16.522)
##AUDIT TRAIL= $$ (NUMBER, WHEN, WHO, WHERE, WHAT)
$$ ##TITLE= Audit trail, XWIN-NMR		Version 3.5
$$ ##JCAMPDX= 5.01
$$ ##ORIGIN= Bruker BioSpin GmbH
$$ ##OWNER= NMR
$$ C:\u/data/dgb/nmr/ADRS/13310/pdata/1/auditp.txt
$$ ##AUDIT TRAIL=  $$ (NUMBER, WHEN, WHO, WHERE, WHAT)
(   1,<2005-12-01 15:07:58.03 +000>,<MAYBRIDGE\NMR>,<NMR_250MHZ>,
      <created by zg, POWCHK disabled, PULCHK disabled
       configuration hash MD5:
       62 19 C7 07 E1 42 D1 B7 37 6C 3D D0 77 39 F9 E6
       data hash MD5: 64K
       FB 6D F1 7D DC 56 05 41 52 3E 51 15 AA A9 74 E3>)
(   2,<2005-12-01 15:08:15.42 +000>,<MAYBRIDGE\NMR>,<NMR_250MHZ>,
      <Start of raw data processing
       ef LB = 0.3 FT_mod = 6 PKNL = 1 SI = 32K 
       data hash MD5: 32K
       32 36 7B C1 5E E2 ED 90 39 FA F2 41 54 89 2B A3>)
(   3,<2005-12-01 15:08:17.37 +000>,<MAYBRIDGE\NMR>,<NMR_250MHZ>,
      <apk 
       data hash MD5: 32K
       7D 2B C5 90 3F 9D EE 41 12 40 62 57 43 F3 56 17>)
(   4,<2005-12-01 15:08:18.12 +000>,<MAYBRIDGE\NMR>,<NMR_250MHZ>,
      <abs ABSG = 5 
       data hash MD5: 32K
       AC 64 74 DC D6 99 70 21 53 67 07 D2 70 A6 AA C4>)
$$ ##END=
$$ 
$$ hash MD5
$$ 16 A4 26 02 EE 22 1D ED 54 97 A8 6C 75 3B 5E 47
##$RELAX= 
##$RELAX= 
##$RELAX= 
##$RELAX= 
##$RELAX= 
##$RELAX= 
##$RELAX= 
$$ Bruker specific parameters
$$ --------------------------
##$DU= <C:\u>
##$EXPNO= 13310
##$NAME= <ADRS>
##$PROCNO= 1
##$TYPE= <nmr>
##$USER= <dgb>
##$AMP= (0..31)
100 100 100 100 100 100 100 100 100 100 100 100 100 100 100 100 100 100 
100 100 100 100 100 100 100 100 100 100 100 100 100 100 
##$AQSEQ= 0
##$AQ_mod= 3
##$AUNM= <au_zg>
##$AUTOPOS= <28 >
##$BF1= 250.13
##$BF2= 250.13
##$BF3= 250.13
##$BF4= 250.13
##$BF5= 500.13
##$BF6= 500.13
##$BF7= 500.13
##$BF8= 500.13
##$BYTORDA= 1
##$CFDGTYP= 0
##$CFRGTYP= 5
##$CHEMSTR= <none>
##$CNST= (0..31)
1 1 145 1 1 1 1 1 1 1 1 1 1 1 1 1 1 1 1 1 1 1 1 1 1 1 1 1 1 1 1 1 
##$CPDPRG= <>
##$CPDPRG1= <>
##$CPDPRG2= <>
##$CPDPRG3= <>
##$CPDPRG4= <mlev>
##$CPDPRG5= <mlev>
##$CPDPRG6= <mlev>
##$CPDPRG7= <mlev>
##$CPDPRG8= <mlev>
##$CPDPRGB= <>
##$CPDPRGT= <>
##$D= (0..31)
0 1 0 0 0 0 0 0 0 0.06 0 0 0 0 0 0 0.0002 0 0 0 0 0 0 0 0 0 0 0 0 0 0 
0 
##$DATE= 1133449676
##$DBL= (0..7)
120 120 120 120 120 120 120 120 
##$DBP= (0..7)
150 150 150 150 150 150 150 150 
##$DBP07= 0
##$DBPNAM0= <>
##$DBPNAM1= <>
##$DBPNAM2= <>
$$ [...]
##$SUBNAM7= <"">
##$SUBNAM8= <"">
##$SUBNAM9= <"">
##$SW= 20.6930455092707
##$SWIBOX= (0..15)
0 0 3 0 0 0 0 0 0 0 0 0 0 0 0 0 
##$SW_h= 5175.983436853
##$TD= 65536
##$TD0= 1
##$TE= 294.16
##$TE2= 300
##$TE3= 300
##$TEG= 300
##$TL= (0..7)
0 120 120 120 120 120 120 120 
##$TP= (0..7)
150 150 150 150 150 150 150 150 
##$TP07= 0
##$TPNAME0= <>
##$TPNAME1= <>
##$TPNAME2= <>
##$TPNAME3= <>
##$TPNAME4= <>
##$TPNAME5= <>
##$TPNAME6= <>
##$TPNAME7= <>
##$TPOAL= (0..7)
0.5 0.5 0.5 0.5 0.5 0.5 0.5 0.5 
##$TPOFFS= (0..7)
0 0 0 0 0 0 0 0 
##$TUNHIN= 0
##$TUNHOUT= 0
##$TUNXOUT= 0
##$USERA1= <user>
##$USERA2= <user>
##$USERA3= <user>
##$USERA4= <user>
##$USERA5= <user>
##$V9= 5
##$VALIST= <valist>
##$VCLIST= <CCCCCCCCCCCCCCC>
##$VD= 0
##$VDLIST= <DDDDDDDDDDDDDDD>
##$VPLIST= <PPPPPPPPPPPPPPP>
##$VTLIST= <TTTTTTTTTTTTTTT>
##$WBST= 1024
##$WBSW= 4
##$XGAIN= (0..3)
0 0 0 0 
##$XL= 0
##$YL= 0
##$YMAX_a= 614048
##$YMIN_a= -469148
##$ZGOPTNS= <>
##$ZL1= 120
##$ZL2= 120
##$ZL3= 120
##$ZL4= 120
##$ABSF1= 16.522
##$ABSF2= -4.171173
##$ABSG= 5
##$ABSL= 3
##$ALPHA= 0
##$AQORDER= 0
##$ASSFAC= 0
##$ASSFACI= 0
##$ASSFACX= 0
##$ASSWID= 0
##$AUNMP= <proc_1d>
##$AZFE= 0.1
##$AZFW= 0.1
##$BCFW= 0
##$BC_mod= 0
##$BYTORDP= 0
##$COROFFS= 0
##$CY= 12.5
##$DATMOD= 1
##$DC= 0
##$DFILT= <>
##$DTYPP= 0
##$F1P= 14.0000005364418
##$F2P= -0.99999901652339
##$FCOR= 0.5
##$FTSIZE= 32768
##$FT_mod= 6
##$GAMMA= 0
##$GB= 0
##$INTBC= 1
##$INTSCL= 1
##$ISEN= 128
##$LB= 0.3
##$LEV0= 0
##$LPBIN= 0
##$MAXI= 10000
##$MC2= 0
##$MEAN= 0
##$ME_mod= 0
##$MI= 0
##$NCOEF= 0
##$NC_proc= -4
##$NLEV= 6
##$NOISF1= 0
##$NOISF2= 0
##$NSP= 0
##$NTH_PI= 0
##$NZP= 0
##$OFFSET= 16.522
##$PC= 1
##$PHC0= 80.06315
##$PHC1= 6.270263
##$PH_mod= 1
##$PKNL= yes
##$PPARMOD= 0
##$PSCAL= 4
##$PSIGN= 0
##$REVERSE= no
##$SF= 250.13
##$SI= 32768
##$SIGF1= 0
##$SIGF2= 0
##$SINO= 400
##$SIOLD= 32768
##$SREGLST= <1H.CDCl3>
##$SSB= 0
##$STSI= 32768
##$STSR= 0
##$SW_p= 5175.98343685301
##$SYMM= 0
##$S_DEV= 0
##$TDeff= 65536
##$TDoff= 0
##$TI= <Analysis number 999999
Compound Code 99
Book Reference 9
Project Code 9>
##$TILT= no
##$TM1= 0
##$TM2= 0
##$TOPLEV= 0
##$USERP1= <user>
##$USERP2= <user>
##$USERP3= <user>
##$USERP4= <user>
##$USERP5= <user>
##$WDW= 1
##$XDIM= 32768
##$YMAX_p= 413925400
##$YMIN_p= -261361
$$ End of Bruker specific parameters
$$ ---------------------------------
##NTUPLES= NMR SPECTRUM
##VAR_NAME=  FREQUENCY,     SPECTRUM/REAL,   SPECTRUM/IMAG
##SYMBOL=    X,             R,               I
##VAR_TYPE=  INDEPENDENT,   DEPENDENT,       DEPENDENT
##VAR_FORM=  AFFN,          ASDF,            ASDF
##VAR_DIM=   32768,         32768,           32768
##UNITS=     HZ,            ARBITRARY UNITS, ARBITRARY UNITS
##FACTOR=    0.157963299565203, 1,           1
##FIRST=     4132.6476996994, 0,             0
##LAST=      -1043.33573715361, 0,           0
##MIN=       -1043.33573715361, -261361,     0
##MAX=       4132.6476996994, 413925400,     0
$$ Real data points
##PAGE= N=1
##DATA TABLE= (X++(R..R)), XYDATA
$$ [...]
22498b3518m0754k265L0307j6885J1152K1947r494j3967o8906J7206K3778J4017
22486e7382L3570M1747L1532k3901n3505K6160Q195k7615k5038K3551k7140j5975
22474f5801J4267L6502J7105m8227l757Q412J1412M5318K1223j1207m5250K4224
22462D221l4963K2517O066K4879M2363p904m6667q804L8807j3997O142r7659K606
22449f2393R5863K8407R847l2086k8025l2648n7958M677j3686N893N6098M5659
22437A9648m1726R086l9986k1377n8153L2118O5061N1690j7906l902M878j9478
22425b0047o086k9374k2033j1495m869n9620J2588O7517K2073o191L7289J862
22413a8386K8322j6763J2037n926K7026m879j7363l9081r566N0042K318k09J5576
$$ y = [-23518, -64272, -66537, -36230, -53115, -41963, -20016, -29510, -43477, -112383, -95177, -71399, -57382, -23812, 17935, 49467, 25566, -27939, -1779, 6416, -21199, -46237, -22686, -49826, -65801, -51534, -15032, 2073, -46154, -49911, -41499, -30087, 15231, 36454, 25247, -20003, 4221, -30742, -8225, -2159, 22720, 65083, 57179, 10512, 1708, 40515, 26518, 32660, -64999, -62393, 33470, 61877, 71724, 39638, 11613, -21035, -78993, -74316, -88002, -82109, -26011, 19648, -22078, -12992, -52978, -74355, -132508, -100390, -35329, 16361, -1545, -5447, -569, -20047, -26133, -55507, -77540, -89035, -93904, -153524, -140936, -73419, -51346, -57537, -20248, -18386, 9936, -6827, 5210, -716, 26310, 21431, 4068, -35013, -44579, 5463, 7781, 7572, 23148]
22400B3148K9796Q914k3697K2696K8001l5532j3822k9960J9530q114m6366n8214
22388h3620k4805n943M5286j479J0870L259N998k3432J0432K0313N7533M1973
22376E6385j167J9630j9877k2459L1164j0455l0577j6014m8118M4397M7928j1241
22364C9596J6066K8929N9789k2371q2969r0506J0069O47l350K0805O9545J9528
22352F5778r1136j1346K5391J4855P373m5663R087l4233Q30K6911k8709k3921
22340h4783O1919M5618n4439o053Q0274L5197k1025k4907r654k6879l9083k849
22328d6664M1988K0434R982J7979K3161Q011n6394Q805K910K5517L201r741k6502
22315B2687m657j4787j6582L7512K1924k4684J2051o125n146k6983n403k489k0386
$$ y = [23148, 52944, 61858, 38161, 60857, 88858, 53326, 39504, 9544, 29074, 20960, -25406, -83620, -108425, -114368, -69082, -70561, -59691, -56432, -50434, -73866, -63434, -43121, 14412, 56385, 55218, 74848, 54971, 32512, 63676, 53221, 22644, 6630, -41488, 2909, 50837, 39596, 55662, 84591, 144380, 122009, 39040, -51466, -41397, -40750, -44100, -23295, 46250, 65778, -25358, -36704, -11313, 3542, 10915, -34748, -25661, -59894, -59064, -32153, -60862, -84783, -22864, 22754, -31685, -37738, 42536, 77733, 56708, 31801, 22147, -4732, -43815, -46664, -4676, 15758, 25740, 43719, 66880, 74891, 18497, 27302, 30212, 55729, 58930, 49189, 22687, 18030, 3243, -13339, 24173, 46097, 21413, 33464, 27339, 22193, -4790, -10193, -12682, -33068]
22302c3068K3321L9707k1414m1229J0505K1064l280K120k4690M3174K2933j3719
22290B5424L5885P1193R453o8926m1832l4452j9935K5524o3666q6753j0968N0001
22278a09052J9774O099n239P5923L825j8561l377O586J1489J9558J3994J3156
22266C4175k6133o4774M2550L0795n2011j3818k543n9858P53M386J9969l7871
22254a24380K742R897J7278N4642J235j9266j095l3998P752M6940K6681k0215
22242c1787r047K836K8841k1444l6336j3395p774M8773L4070q32L3027M2553K7074
22229I6559l6699q5589N34Q347k670L5844M2945J5772l9966n1429j5953j6306
22217d8611n65N1424J386j6113j2330M2144K1077L2180L5621o2589j10389J2111
$$ y = [-33068, -9747, 29960, 8546, -32683, -22178, -1114, -4394, -2274, -26964, 16210, 39143, 25424, 61309, 132502, 141955, 73029, 31197, -3255, -23190, 2334, -61332, -148085, -159053, -109052, -89278, -83179, -88418, -12495, -8670, -27231, -30608, -24022, -12533, 7025, 21019, 34175, 8042, -56732, -14182, 16613, -35398, -49216, -51759, -111617, -110864, -106478, -86509, -124380, -121638, -111741, -94463, -39821, -38586, -57852, -58947, -92945, -85193, -38253, -11572, -31787, -40834, -37998, -9157, -30601, -66937, -80332, -88106, -39333, -5263, -6095, 26932, 69485, 96559, 59860, -25729, -25195, -16848, -19518, 16326, 59271, 75043, 35077, -16352, -32305, -48611, -49176, 2248, 3634, -12479, -24809, 17335, 38412, 70592, 106213, 43624, -66765, -54654]
22205e4654K2289k0272Q409k2828J3447M225k1547k7728j0817l8399K414O0781
22193h4680N4713L3444J1515m2036J5527J9782r610l7028l305K8966J3943l409
22181b178J0191j2800J488N2712k7814j1673L7130M335l5112j7018k5327l6706
22169f2772m262Q0628P0614l8418o6803p369q4038n0759K9637N3556j6647L9613
22157e7020M2955k597M417o745J0777K064R1646J4074o0109k3826l4673l2407
22145e1444J1453J319j5191K2083P801M0822N6940P3800k8196j5349q1492l946
22133A8600L2506L832j3030j8506l9576j6675J2381J1559J3315k0664K7502L1003
22121D2247J2000j2368J1852j0163l9817p1040N7898O2593K327Q851m2867l9617
$$ y = [-54654, -32365, -52637, -44228, -67056, -53609, -49384, -70931, -98659, -109476, -147875, -145461, -84680, -29967, 3477, 14992, -27044, -11517, 8265, -1345, -38373, -41678, -12712, 1231, -2178, 8013, -4787, -3299, 49413, 21599, 9926, 47056, 51391, 16279, -739, -26066, -62772, -67034, 13594, 84208, 45790, -21013, -28382, -112420, -163179, -133542, -79986, -96633, -57020, -14065, -16662, -12245, -18990, -8213, -6149, 85497, 99571, 39462, 15636, -19037, -51444, -39991, -38672, -53863, -31780, -23979, 16843, 73783, 147583, 119387, 104038, 22546, 18600, 51106, 54938, 41908, 23402, -16174, -32849, -20468, -8909, 4406, -16258, 11244, 42247, 54247, 41879, 53731, 43568, 3751, -67289, -9391, 53202, 55529, 64380, 21513, -18104]
22109a8104p65n372J5607k5056P56K7507k2607K0873M6468M9297j1907p4424n4686
22096e2413m093K4910k554n7073p3122m707N425K8952P0222Q8764J7413n5970
22084a4246q7648l2812M9116P3147J11784k7506m6543l4486Q133K7221J9380J2311
22072E7851M2906l0604m4973M2665k2484l547m7027k5682j7848m5405K2345N1778
22060b0025K7523p316l2283l321l2553l3065K8785M8437R384l4728m391M4636
22048h917j3539l2761n2566m7797j3222Q1611L3091M7981K6281k0378l379l6787
22036d0382L6752L0471q1014j1094q471m0523L1439K3888N3985L9311J2237k3475
22024B3124p9111k1465N0022J4787k4538K3505j9669J8642K2328M1467m5654p7892
$$ y = [-18104, -18869, -24241, -8634, -33690, -32934, -5427, -28034, -7161, 39307, 88604, 76697, 2273, -52413, -56506, -31596, -34150, -91223, -164345, -169052, -163627, -134675, -64453, 24311, 41724, -14246, -101894, -134706, -85590, -12443, 99341, 71835, 25292, -9194, -1061, 26160, 45540, 57851, 100757, 70153, 25180, 67845, 45361, 41814, -5213, -30895, -48743, -94148, -71803, -20025, 7498, 182, -32101, -35422, -67975, -101040, -72255, -23818, -14434, -49162, -53553, -8917, -22456, -55217, -107783, -155580, -168802, -87191, -54100, -6119, 20162, -216, -3595, -40382, -3630, 26841, -54173, -65267, -73738, -114261, -82822, -58934, -4949, 34362, 46599, 23124, -55987, -77452, -27430, -12643, -37181, -13676, -33345, -14703, 7625, 49092, 3438, -74454]
22012g4454n2907j1156L8038J0781N1391o703m2054M8383J1960l9266K8857j0915
22000d8045K9961K1818J1452j0258k1127O544J2140J8761j9905m1218p32K1611
21988a8998J4126R660L647M3237o095l6313l9719k2277K5808k0362J6731L2147
21976A592N6586M7343n5776j9149K7645j921M8954j8605q0711K8193K8483N290
21964F7924l7383O677J0162k9544o0761J7687k7724l139m0j144J8022J0315k4835
21951e3783K2521N7837L5606Q18J1702o0537p8792K1381m963K3669J7748p3997
21939h0790m6512M0607K8389l2658p437j1077M917K7521L9264K6010j6333k2880
21927e0979J9047M007N58m023J1545K7755k2202n66O430j3841k8501M153K1574
$$ y = [-74454, -127361, -138517, -100479, -89698, -38307, -45010, -87064, -38681, -26721, -65987, -37130, -48045, -18084, 3734, 15186, 4928, -16199, -9655, 2485, 21246, 1341, -39877, -40609, -18998, -4872, 4788, 8435, 51672, 45577, 9264, -30455, -52732, -26924, -47286, -30555, 1592, 58178, 105521, 49745, 30596, 58241, 56320, 105274, 86669, 5958, 34151, 62634, 67924, 30541, 37218, 47380, 17836, -42925, -25238, -52962, -56101, -56141, -57285, -39263, -28948, -53783, -31262, 26575, 62181, 62999, 74701, 14164, -64628, -43247, -48210, -24541, -6793, -80790, -127302, -86695, -58306, -90964, -98401, -109478, -104561, -77040, -37776, -11766, -28099, -50979, -31932, -27925, -27367, -31390, -19845, 7910, -14292, -14858, -8428, -22269, -50770, -46617, -25043]
21914b5043j1197K8384N8322k1263j17192M696O5934M6260J7105o5097m4870k0401
21902h4362J9938j6057M4328L4263K1596L1559j4819j4403n3567l340O9431j7265
21890A7302l9881j236j5239k1999k3997p4348L8101O8135K4123J631L0087P169
21878I848k342j0866K6973J4470q5915q5784J7400N5245J5663l5895n4565j8241
21866a54009L981n897L0166Q7497M280m090J2330J8413l551M4774j7089j3785
21854C020n6422j9739j917p161l231n6276L4948Q0411N3857J4480o7288l1611
21842e6929P5887N1462m1422n0998o1893P927M0091k3646m868K5876K1744N9488
21830D2719n8503j12362L4123P3070L0017l7004K8534M545k7854l9317P9561P9867
$$ y = [-25043, -36240, -7856, 50466, 29203, -87989, -83293, -17359, 28901, 46006, -19091, -63961, -84362, -64424, -80481, -36153, -1890, 19706, 51265, 36446, 22043, -31524, -34864, 34567, 17302, -22579, -23815, -39054, -61053, -85050, -159398, -121297, -53162, -29039, -27408, 2679, 9848, 7506, -3360, 23613, 38083, -47832, -133616, -116216, -60971, -45308, -81203, -135768, -154009, -150028, -155925, -125759, -38262, -33982, -38072, -25742, -7329, -10880, 33894, 16805, 3020, -53402, -73141, -75058, -82219, -85450, -141726, -106778, -26367, 27490, 41970, -25318, -56929, 18958, 70420, 28998, -22000, -83893, -75966, -35875, -59521, -64389, -38513, -16769, 42719, -15784, -128146, -94023, -20953, 9064, -27940, 594, 5139, -22715, -62032, 17529, 97396]
21818I7396m381m7990o6051m0094J8257K4696m2730q906K2919j3933r4489N8183
21806i7123L1332O2297J9450k1220j7962o3404o7839K5504k5570M3023R7339m2525
21794e6698r070L5237l0655o1470l8010k0899L8818N6849J9779k337M1032Q3455
21782E6031l871l0743m7626k2750N1185L2192n3944m6096N9414N6K3307l9861
21770b2706m2689j5612J5042q7064M2228M012L1167J2414l34o9700J6990L7743
21758g8509J5032N796L0860l5238m4674K7179J07677L7548p5790o0944l4892O268
21746i9687M4492L3962k08j7926o0120K8744M6643m3303P3247K1567m7482l1731
21734e1802q547L1529k0557m9157P437O0399j4895m0468J8337N473R151j8156
$$ y = [97396, 93015, 45025, -21026, -61120, -42863, -18167, -60897, -69803, -46884, -60817, -155306, -97123, -65791, -3494, 15956, -5264, -23226, -86630, -154469, -128965, -154535, -111512, -14173, -56698, -65768, -30531, -61186, -122656, -160666, -181565, -142747, -85898, -66119, -68456, -27424, 56031, 52160, 21417, -26209, -48959, 2226, 34418, -19526, -65622, -6208, -6152, 17155, -22706, -65395, -81007, -65965, -153029, -110801, -106789, -75622, -63208, -63542, -133242, -116252, -78509, -63477, -57681, -26821, -62059, -106733, -79554, 28123, 65671, -10119, -71063, -105955, -99687, -55195, -21233, -21441, -39367, -99487, -70743, -24100, -67403, 5844, 27411, -20071, -51802, -60349, -28820, -49377, -98534, -91097, -30698, -45593, -86061, -67724, -62251, -53100, -71256]
21722g1256l9204q896m9341L3031O7535j054J5270M902L0747j0214K4083m8386
21710e2783R506L1507j0183n7910O0580L7816M591l1585p2589L3886l089M2678
21698g575O4571M5551k3443J4660J4422k9184q1219k5535J5207K0055K8774J5988
21686E2272k5452L3675K7364j807j7584q594o93O207L5444R595l0609J008j5412
21673F5414m5241l9506J2500J1043J0348J1151n326k3506j6265O7522O978n3388
21661A724n4320k7652O6930P350k0958j069J7054k022j4977j7955r449K909p739
21648f0174K6467L7634O6646J4700l7173k4761j7100j6011k7914m1788K0150K0582
21636c8742q492j6318l9846j2148K6071K0855j2961q596L9481r854Q677m0377
$$ y = [-71256, -110460, -119356, -168697, -135666, -68131, -69185, -53915, -49013, -18266, -28480, -4397, -52783, -43277, -11770, -21953, -79863, -19283, 18533, 23124, -8461, -81050, -47164, -50253, -7575, 56996, 102547, 79104, 93764, 108186, 79002, -2217, -27752, -12545, 7510, 36284, 52272, 26820, 60495, 87859, 86052, 68468, 59874, 59181, 65388, 100832, 110427, 79818, 80826, 65414, 20173, -19333, -6833, 4210, 14558, 25709, 20383, -3123, -19388, 48134, 55112, 1724, -52596, -80248, -13318, -5968, -26926, -27995, -10941, -12963, -27940, -45895, -55344, -52435, -60174, -33707, 3927, 70573, 85273, 48100, 23339, 6239, -9772, -37686, -79474, -59324, -38742, -47234, -63552, -103398, -115546, -89475, -68620, -81581, -90177, -50696, -60550, -51873, -92250]
21624i2250K4140O6564k2806r876K0026j1514L1564k9047m4415k7020N6309M3409
21612E084k3532Q433k4393j041M8898L7912J7221l4284J2712k2567P394L7991
21600F9828j7852k2033l9690k106j2889K2786K2482l7196m970p988O945J7143
21588e540L7615j7399J1140M4320p761l6846r8005N274j6069N647L5067j4487
21576e7044M2903L0631p479j2190n646j7111L568N986l0468J7315J3039j6891
21564c3387n25j2007j1141K2513j7732J0309K7738q416P6550P4333k8596L6254
21552A35893o641q7783o0517j4917M673j7676K3100l1999j1641K5277J6205j6021
21540d2047L7850K9136j5938r512M0727p6306k1446K8413k8102J7904J2695k3832
$$ y = [-92250, -68110, -1546, -24352, -34228, -14202, -25716, 5848, -23199, -67614, -94634, -38325, 5084, -18448, -10015, -34408, -35449, 13449, 51361, 68582, 34298, 47010, 24443, 31837, 69828, 51976, 29943, -9747, -11853, -24742, -1956, 20526, -16670, -21640, -29628, -22683, -5540, 32075, 14676, 25816, 70136, 62375, 25529, -72476, -67202, -83271, -77624, -42557, -57044, -14141, 16490, 9011, -3179, -8825, -25936, -22368, -16382, -46850, -29535, -16496, -33387, -33912, -45919, -57060, -34547, -52279, -41970, -14232, -22648, 53902, 128235, 99639, 135893, 129252, 41469, -19048, -33965, -29292, -46968, -23868, -55867, -67508, -42231, -26026, -42047, -4197, 24939, 9001, -511, 40216, -36090, -57536, -29123, -57225, -39321, -26626, -50458]
21528e0458p8945P766M7419Q3768R623j1906n1348j6430O1310L1280n6444k7597
21516e1962P3447k3895q6313K4794p06J7336K7991j1012n9414O935K4745K022
21504e6032O2518M9766L6941o760l9525j3714q10o0083q099M915j2609Q614O922
21491b7956N0863J9420K9263m5872J7268J2699k3142n2233p7088N9671M2929l9179
21479c3357m2058M8034M1097k938k6386k7886J9904l8218K7759j924j4666J7487
21467c3152o669k0967P665J882K8037N2003n3244l8385M2252M0498p739j214J4452
21454B5419P877J9553k9147L2596m3415J7763k9994p515n4164K7783L3578o5339
21442f5005q4580L8836M0194k1882n661K2315J5519L6653M2524R604k5424j5281
$$ y = [-50458, -129403, -121637, -74218, 9550, 19173, 7267, -44081, -60511, 799, 32079, -24365, -51962, 21485, -2410, -88723, -63929, -64635, -47299, -19308, -30320, -89734, -82799, -58054, -56032, 6486, 56252, 93193, 86433, 46908, 33194, 32384, -27699, -35798, -30883, -43492, -34878, -27956, 22907, 42327, 71590, 25718, 42986, 55685, 32543, -19690, -96778, -37107, 5822, -33357, -75415, -27381, 13716, 10778, -15608, -43494, -23590, -61808, -34049, -35973, -50639, -33152, -39821, -60788, -53123, -51241, -23204, 28799, -24445, -62830, -20578, 19920, 12181, 10967, 25419, 33296, 52849, 23702, 56298, 12883, 30646, 652, -6863, -61027, -33244, 334, -65005, -149585, -110749, -70555, -92437, -98098, -75783, -60264, -23611, 18913, 28517, 3093, -12188]
21430a2188k5492j3565j2442L9380P0491j761M2325j9399o6476m3567k4846J0698
21418e6842j2664j7339K8898k1399j9168J1602M8720M5734J0952l1530m8087l5256
21406i6379k7191J3185M0999k5160M0111M8747J955p8539L8820Q2917N313J5657
21394F0435K0752k7964n2069p690K6292m3984J7633j4488l2981k8721n1362M9913
21382h4234Q3799K4546l99p917o7019R811O7855O144k8704j1703K9607Q011o568
21369B3229J6442J922m5644M645j415m0107J8490M2477m9952L5642p632o8183
21357g0086k4973N6440L9128O4601K2280m9902l4516J2274j6679n9181k8631M5404
21345d3841M0456N724L0014M5223O389o5136l9289N6543R430J2763J6546L1792
$$ y = [-12188, -37680, -51245, -63687, -24307, 46184, 44423, 86748, 67349, 873, -42694, -67540, -56842, -69506, -86845, -57947, -79346, -98514, -86912, -38192, 7542, 18494, -13036, -61123, -96379, -123570, -110385, -69386, -94546, -54435, -5688, -3733, -82272, -43452, 39465, 44778, 60435, 81187, 53223, 1154, -6536, 19756, -24228, -6595, -21083, -54064, -82785, -134147, -84234, -435, 24111, 23712, 15795, -51224, -41413, 26442, 32586, 3882, -7821, 21786, 29797, 23229, 39671, 41593, -4051, 594, -821, -40928, -22438, 20039, -29913, 5729, -1903, -70086, -95059, -38619, 509, 65110, 87390, 37488, 2972, 15246, -1433, -60614, -89245, -43841, -3385, 2339, 32353, 77576, 83965, 18829, -20460, 36083, 45513, 58276, 74822, 106614]
21333A06614o9598p2534n351k0706K8888K1364O388p0L8700k264p0640o5647J5047
21320h9809j6931J7095j5236k0019P8642N5646M9220L4310J5576j0491K103L6311
21308A36417l6799r4190m429L1687N263J7956l2507K9000R975n6090m4201m1831
21296g9749K2103J9744L0616r596L6156O0611k4760m4509l3446l3380L5390q05
21284b1625n0255O5297K895R503N183M838j1361J8073K299J690j1984j4551l0043
21271c0041O7708J6868M949J9084M5341k6356l2032J2452j5431l9501l7993K6778
21259A1826O5393K3156N2239m5438o4222o920l7074j4970p518l1992k8242J4936
21247f8826L4423j1236m2866J9834Q494k5800L4507N3679J9689j7618K8178L877
$$ y = [106614, 37016, -35518, -40869, -61575, -32687, -11323, -4935, -5005, 33695, 31431, -39209, -104856, -89809, -106740, -89645, -104881, -124900, -46258, 9388, 58608, 92918, 108494, 98003, 100106, 136417, 99618, 5428, 999, 32686, 37949, 55905, 23398, 52398, 62373, 6283, -37918, -79749, -57646, -37902, -7286, -16882, 19274, 79885, 55125, 10616, -22830, -56210, -20820, -21625, -71880, -6583, -3688, 5815, 10998, 15836, 4475, 22548, 24847, 26537, 14553, 2, -30041, 37667, 54535, 59484, 78568, 123909, 97553, 65521, 77973, 62542, 23041, -14952, 11826, 77219, 100375, 152614, 107176, 42954, 36034, -1040, -16010, -23528, -55520, -83762, -68826, -34403, -45639, -88505, -68671, -60177, -85977, -51470, 2209, 21898, 4280, 32458, 36335]
21235C6335p9236j7205L8823j309q258K1521K6070r0284k3775L5933L9406J3126
21223h853l15J64R674L539l5388k5499K2196N465n3079l8817J8790M7002j7639
21210g2760K9399N446K4391J9326q273n937K5189j09M7455o7577J357J5308p446
21197E769m8887j3780n296Q146m13N518L4262R338M989O2003O2519j1901n4454
21184E7813l9212J1955j6317l7557j21946R122O9362K9992j3236L9544L0350J552
21172B1422n2891o551k4688J1205N8832L026K5274M6313j6281o4839K1220k5555
21160c513J1657N8933N55j1318J7242o12m0186J7242M7694L7125K6831j14311
21148D7339l6321J0444K2385N684k6781n3250K2817L627j1209j6894N125K7510
$$ y = [36335, -42901, -60106, -21283, -22592, -30850, -9329, 16741, -73543, -97318, -61385, -21979, -8853, -9168, -9004, 670, 4209, -31179, -56678, -34482, -29017, -82096, -120913, -102123, -55121, -72760, -43361, -37915, -13524, 5802, -2471, -8408, 16781, 16672, 64127, -3450, -2093, 13215, 5769, -43118, -56898, -62194, -54048, -54461, -48943, -14681, -5343, -354, 61649, 124168, 112267, 57813, 18601, 30556, 14239, -23318, -145264, -136142, -66780, -36788, -50024, -10480, 19870, 21422, -31469, -38020, -62708, -51503, 7329, 10355, 35629, 81942, 65661, 822, 22042, -3513, 8144, 67077, 67632, 56314, 73556, 72944, 32758, 50000, 97694, 134819, 161650, 47339, 11018, 21462, 43847, 49531, 22750, -30500, -7683, -4056, -15265, -32159, -27034, 476]
21136D76k830j4272O8580L259j2014K0697L4431k3875J1669P927m8196o4300j4057
21123c2505J2387q620N939L9492r412o899q162j6834J9610j7435j9148q167J8963
21110c0791J8709k0729m8262r846N6726P4533K7445o8408l4122O9683L7604J4319
21098H6861j445k8999o4414k0385J9482m2779m0567J1989k6820k421J07696L1316
21086B9514o5130j0632J1709J5366j5502l4593J8398L9189L3753l3144p0784K0120
21074f1736j105n269o078K3680N9943k7407M140n185L2404j0696L9277j5906k1129
21061D933k2881o918m3803o283P722m6923K0340N3531P5435j2085M2603K9264
21049I4935K5910J3028k9318j6699l7884n7678n3901k3781m044M0068l1434q18
$$ y = [476, -2354, -16626, 51954, 55213, 43199, 63896, 98327, 74452, 86121, 94048, 45852, -18448, -32505, -20118, -28738, -22799, 16693, 7281, 382, -7780, -24614, -5004, -22439, -41587, -49754, -30791, -12082, -32811, -81073, -90919, -34193, 40340, 67785, -623, -34745, 34938, 72542, 86861, 85416, 56417, -7997, -28382, -8900, -51679, -92246, -80257, -107077, -109498, -1802, 29514, -35616, -46248, -34539, -19173, -34675, -69268, -50870, -11681, 22072, -11072, -81856, -61736, -62841, -68110, -74188, -50508, 9435, -17972, -13832, -19017, 13387, 2691, 41968, 26062, 4933, -17948, -24866, -68669, -74952, -67230, -114153, -93813, -40282, 35153, 23068, 65671, 94935, 120845, 133873, 104555, 87856, 49972, -7706, -61607, -85388, -89432, -49364, -80798, -81616]
21037h1616L4519R167l6830N6295L5834k740j6734k473l0083L3797j3621L0787
21025A6302M4072K0109o7207n4957j213J2888m515L9254J5075K6022j4716j334
21013B9780j3170P830j5073l938K5109j8807p6265k6724P2256L5490K068J888
21001B0444J4007O9073k7876j7757J8256J4881L1858k1750k5475n5110K91K4152
20989D4994k0966n0573k3090M2672P8618K5850O184k7445J2820k7706l4436J7558
20977D4480M1383J5851m5542l197K5704M402N212K4278k7354j29j8768m6286N2328
20964G2362r994k1882l71l0604q554n4869l8812n5467O9785J7962L5184N2942
20952B7682K552j4249j8824p076M444j491j382j2107k0812j2079j908K9938J7333
$$ y = [-81616, -47097, -37930, -74760, -18465, 17369, 14629, -2105, -4578, -34661, -864, -14485, 16302, 60374, 80483, 13276, -41681, -42894, -30006, -34521, 4733, 19808, 45830, 31114, 29780, 16610, 24440, 9367, 5429, 30538, 11731, -64534, -91258, -19002, 16488, 18556, 20444, 34451, 103524, 75648, 57891, 76147, 91028, 122886, 101136, 75661, 20551, 20842, 44994, 24028, -26545, -49635, -6963, 71655, 97505, 103689, 76244, 89064, 61358, 26922, 44480, 85863, 101714, 56172, 52975, 78679, 83081, 88293, 112571, 85217, 85088, 66320, 20034, 72362, 62368, 40486, 40115, 9511, 957, -53912, -92724, -148191, -78406, -60444, -25260, 27682, 30234, 15985, -2839, -9915, -5471, -6962, -8344, -20451, -41263, -53342, -55250, -25312, -7979]
20939g979J0987p958Q858k6938q759O1970J0974j9477K0506j8066q620Q1l6270
20926b0691p6284l1110P113M2859N8513K2921J4006m5605L8681L8635k5893j7340
20914E805N4902N7387j22616r2751O8205J053k2113O2454M2429o7450o5890j0233
20902h8818j128J2605M3320J5571k473J586k6054n7121J8369M4893l7513k5418
20890a02181r943J20760Q7495j9857n3452q301L582l2509l1525k5846N9661N693
20878f423j1572Q623l55o0192l7229k0538N284L0455J0611M0858K5297j9606J0276
20865b4511J9503m1359L5350J7612K5487K1121j4201k2195k9337K5532k0107r0379
20853i7484o5937J8229M2436K8557K0381k680k4875M4601Q6559K2782n466n5788
$$ y = [-7979, 3008, -4950, 3908, -23030, -31789, 30181, 41155, 21678, 42184, 24118, 15498, 15579, -20691, -96975, -128085, -120972, -78113, -19600, 3321, 17327, -28278, 10403, 49038, 23145, 5805, 60707, 118094, -4522, -97273, -29068, -28015, -50128, 12326, 54755, -12695, -78585, -88818, -89946, -77341, -34021, -18450, -20923, -19337, -45391, -102512, -84143, -39250, -76763, -102181, -112124, 8636, 96131, 76274, 22822, 14521, 18103, -14406, -45931, -71777, -12116, -6423, -17995, -9372, -9727, -69919, -107148, -127686, -122402, -91947, -81336, -40478, -15181, -34787, -24511, -5008, -46367, -11017, 6595, 32082, 53203, 39002, 16807, -12530, 13002, -7105, -97484, -163421, -145192, -102756, -74199, -53818, -56498, -81373, -36772, 49787, 72569, 67103, 11315]
20841A1315j7165L538n028n3312n0196M2865L4350q866M4119J9501N002n7486
20829c1363l2932q684K7324l5849K907N2446N4683L1294n7787l7217M1212M9593
20817E5627j2916J2942q648J022l3887o0436O307L4117J09408j9340q2669m0520
20805c8993n1756M2718M9045J2717l4369j852l8715n9479J3563O0789M5824K3363
20793B2855j3687M2682K1471M010m987M0959K7854q4651q342J9694K087J6137
20781H6082n7484m5159j0036m8997o1978O822O2494Q6850N090m0925n7667j3534
20769h8442K310L6498M4792N811J0204J825J2986K0016K8625j8897p4160L3416
20757A4984K1768m5343j839K6338L6319P2877j3062J6449n8878l4830l1628k8404
$$ y = [11315, -5850, -2312, -7340, -60652, -110848, -67983, -33633, -42499, 1620, 21121, 26123, -31363, -64295, -72979, -45655, -81504, -78597, -26151, 28532, 59826, 2039, -35178, 6034, 55627, 42711, 55653, 47005, 48027, 14140, -46296, -39989, -5872, 103536, 84196, 1527, -38993, -90749, -48031, 1014, 13731, -20638, -22490, -61205, -120684, -107121, -46332, -508, 22855, 9168, 51850, 73321, 77331, 72344, 113303, 141157, 56506, 48164, 67858, 69945, 86082, 28598, -16561, -26597, -75594, -137572, -130750, -68256, 18594, 23684, -17241, -74908, -88442, -86132, -49634, -4842, 969, 11173, 12998, 25984, 46000, 74625, 55728, -18432, 14984, 36752, -8591, -10430, 15908, 52227, 125104, 112042, 128491, 69613, 34783, 3155, -25249]
20745b5249l0244m3524o634j5285J5570L4459K4536P021J6007m3663K3863K5333
20733a7810n2740K9230L8466O779k4035k6201J9846P971J4803l7965j1946j8471
20721g2073L4725L2399m896m1038M954k9145K1077K4269l8596J822L0003K6410
20709a0089k172M6809K4865M625l1395l1648p2060O2613L8978o235Q1773K1114
20697A27178q992l4246K0180N1701l8128n2420n7997j38916K066P0360L6590J5897
20685f727O359o781L0239J7737j6500m3922K2922L9515o398R172l0280j4955J9639
20672B0020l1233j1672L5094k0320p3716L5712O4945N1835O546J3338j1193J5367
20660I4723J4213j6113j9312j5252o382k2460o1320k5296M2889l8713J7229M1903
$$ y = [-25249, -55493, -99017, -105651, -120936, -105366, -70907, -46371, -39350, -23343, -67006, -43143, -17810, -70550, -41320, -2854, 3925, -20110, -46311, -26465, -18494, -3691, -41656, -53602, -72073, -37348, -4949, -9845, -50883, -45929, -75074, -53997, -29728, -68324, -66502, -36499, -10089, -12261, 34548, 59413, 64038, 32643, 995, -71065, -8452, 30526, 24291, 106064, 127178, 118186, 83940, 104120, 155821, 117693, 65273, 7276, -131640, -129574, -59214, -22624, -6727, -368, -7149, 23090, 40827, 24327, -19595, 3327, 42842, 36444, 45616, 15336, 381, 20020, -11213, -22885, 12209, -8111, -81827, -46115, 18830, 70665, 77211, 90549, 79356, 94723, 108936, 92823, 73511, 58259, 51877, 29417, -31903, -57199, -14310, -53023, -35794, 6109]
20648F109J0845K41M433k9716L4383P98p9070l8204L9477L6035O053J1664N4923
20635E7971O6639m1904j3972K0301K1424M0990p7617l1139m363k2057q051R424
20623A7646p530J6574J7308j9383l7827J6547L855K2495L339j8031k5527j7061
20611b7595K110L2673J9475M7033L0915j7334m3655o1079m7348j312K5112P4973
20599C3968N321p705p2406J5604J07471O587q0216p1393q311l4619L3713j7193
20587h9179M9021K6846J8941M096l6526j8966L0289N2366j0374j3454Q8696p441
20575I4315j01289K6381P4268r0976k721K2372j1048j3339k7369k4847m209p207
20563f5669N3458L4388j4850O599J4341k7388j5129J2785l022p279K359l45j2829
$$ y = [6109, 16954, 17195, 21628, -8088, 26295, 27093, -51977, -90181, -50704, -14669, -8616, 3048, 57971, 124610, 82706, 68734, 89035, 110459, 151449, 73832, 42693, 38330, 16273, 8222, 17646, 10116, 26690, 43998, 24615, -13212, 3335, 7190, 29685, 33024, 14993, -10534, -27595, -25485, 7188, 26663, 73696, 104611, 87277, 43622, -17457, -64805, -66117, -41005, 33968, 39289, 31584, -40822, -25218, 82253, 88840, 8624, -62769, -71080, -105699, -71986, -89179, -40158, -13312, 5629, 9725, -26801, -45767, -15478, 36888, 26514, 13060, 101756, 94315, -6974, 19407, 93675, 2699, -22, 22350, 11302, -2037, -29406, -54253, -58462, -65669, -12211, 22177, 7327, 13926, 28267, 879, -14250, -1465, -4487, -11766, -9407, -9752, -22581]
20550b2581K8618P790J3322J5096M8514j8269q0759m1762J3571L2512j1555J2162
20538c341N2248Q8923K9423o7153l4123J2688j5197q5771p5772J00500P1912K3050
20526I7387n6083M688l2848j1487P2322J8464j9367K1602k6978k5989L217m8705
20514c777n8627k4412l4468N4236R3067M4940j4435k6306M8890k2340m9747j4372
20502g351Q1405l5610m4031J6734l9810q502L1072k78O1057J819k7407m1904L1677
20489A8871K6931L2324k5878K749k2326j3120l0093K974l874k9526L1442K6908
20477A7382K1309M8461J23l2770k3058J6389k4711K879j9788l4325j2386l9387
20465g9882n6773k5589Q6362J25332J8444P775r408j0963O9094m227o9764l6370
$$ y = [-22581, 6037, 13827, 27149, 42245, 90759, 72490, -8269, -50031, -36460, -3948, -15503, -3341, 48907, 137830, 167253, 100100, 65977, 78665, 63468, -22303, -98075, 2425, 74337, 97387, 41304, 45992, 13144, 1657, 73979, 92443, 73076, 94678, 67700, 41711, 44928, -3777, -62404, -86816, -121284, -67048, 26019, 70959, 56524, 30218, 79108, 56768, 7021, -7351, 74054, 38444, -5587, 11147, -28663, -37165, -6093, -6371, 54686, 56505, 29098, -12806, 18871, 45802, 78126, 52248, 54997, 32671, 19551, -10542, -7568, -11442, -40968, -9526, 17382, 38691, 87152, 87275, 54505, 31447, 47836, 23125, 26004, 6216, -28109, -40495, -79882, -136655, -162244, -75882, 49450, 67894, 75669, 66261, 55298, 124392, 120165, 50401, 14031]
20453A4031l747p0244P5985J15061L086r5897m5929J5132K0643L7771K9724N0594
20441A46210J7770l6801q1617m2331m6060l3752k7409N3133O1796l2960l8538
20430f0559O871J4734N6314L0307k3060m0145L4880n6407k4745J7599L0342k4910
20418c8779l7497K6264K2241k3613K168J9115J6462J2625Q173O356o411J7607
20406B4711m9632l7825j1699j449Q0592K4767k0047J3196K961k4852L9924l8905
20394A742j7227k5911k2394L2694J2298j7405J5723L9005k9561j1706J8169J6624
20382A2051k8565M1715j04697l9052L7016P9877J7556L077J6993Q378m8093k6622
20370c0366k9546J8474K1295n3672L9006N7335M4967k2632n6623L2083p334n8953
$$ y = [14031, 10284, -59960, 16025, 131086, 134172, 38275, -7654, 7478, 28121, 65892, 95616, 146210, 163980, 127179, 45562, 3231, -42829, -76581, -103990, -50857, 10939, -22021, -60559, -53688, -38954, 17360, 47667, 24607, -15538, 19342, -37065, -61810, -44211, -13869, -38779, -76276, -50012, -27771, -51384, -49216, -30101, -13639, -1014, 7159, 13515, 7104, 24711, -24921, -62746, -74445, -75894, 4698, 29465, 9418, 22614, 25575, 723, 40647, 1742, -15485, -41396, -63790, -31096, -18798, -36203, -20480, 18525, -11036, -22742, -4573, 12051, -16514, 25201, -79496, -118548, -81532, -1655, 15901, 18978, 35971, 44349, -3744, -30366, -59912, -41438, -20143, -73815, -34809, 22526, 67493, 44861, -11762, 20321, 12987, -45966]
20358d5966k7592k3675N15q904L1855j7761K1380J551J6210N3431M6170p7618
20346c0404q0345J9291P0436L1882m7129m9253l2597M9201r821J8975R8530J9623
20334E8389l0021l9728J6566L3166j1258j0793J0987l2572k9992r759l3677Q2346
20322C654J008L012J6022L8193j031k7780J3717k0135j4183J0560L0457J2850
20310F6344j616J1467J3162n5084o5402k1708N0505M6582K7631m8563J298M4206
20298F8822K7163l6254m5979j6509L588q602O4828K6866M3012J5395K012m2113
20286A02229o4387l1782N305N9771J6556m3997K5785N4373l5464p7877l033L30
20274G809P519M9215l2000l2620M0113n9676l6309O5467Q179j9602n92K0173K8125
$$ y = [-45966, -73558, -97233, -96718, -105622, -73767, -91528, -70148, -68597, -52387, 1044, 47214, -30404, -110749, -91458, -21022, 10860, -36269, -85522, -118119, -68918, -78739, -59764, 38766, 58389, 28368, -11360, 5206, 38372, 27114, 16321, 27308, -5264, -35256, -45015, -78692, 3654, 4662, 7674, 23696, 61889, 60858, 33078, 46795, 26660, 12477, 23037, 53494, 66344, 64728, 76195, 89357, 34273, -31129, -52837, -2332, 44250, 71881, 23318, 24616, 68822, 95985, 59731, 13752, -2757, 831, -7771, 57057, 83923, 126935, 142330, 144342, 102229, 37842, 6060, 11365, 71136, 87692, 43695, 69480, 123853, 88389, 10512, 7479, 7809, 15328, 64543, 32543, -77, 40036, -19640, -55949, 9518, 17697, -1905, -2497, 17676, 45801]
20261D5801o8875r4173J1659O7028O644J4730L2096n0401m3581m461N4474Q2927
20249E3868J3541n3215l1180J1877N6514j4026l5580l725M6366J2500k4463K8398
20237F0875K0772l3779m4967J3002O1359P647p1728n1005L561j9620k2335k1157
20225i7375J5271M4974M9196N0601M7395J1892R75n2581m1917q552Q5624J2890
20213A18393r9068n725M8120j1503l4527p480P3615O4190m7126j02580l779p619
20201a5089J432j7930l1932L7522L0983Q7652j8703k7388l6447K960K6656q2384
20189d2668j8032K5029K6254J214J6247L1339M9877j3488n3322n5131L3091L9709
20177D0119J4031P842K6030q9183k7417L5149l0605j0078L0577L4878m3954J2323
$$ y = [45801, -23074, -117247, -105588, -38560, -31916, -17186, 14910, -35491, -79072, -83533, -29059, 53868, 67409, 14194, -16986, -5109, 51405, 37379, 1799, -1926, 44440, 56940, 32477, 60875, 81647, 47868, 2901, 15903, 77262, 84909, 13181, -37824, -34263, -53883, -76218, -97375, -82104, -37130, 12066, 62667, 110062, 121954, 122929, 70348, 28431, 19879, 105503, 118393, 19325, 13600, 61720, 50217, 15690, 8210, 81825, 146015, 98889, -3691, -7470, -15089, -13657, -31587, -63519, -25997, 4986, 92638, 73935, 46547, 10100, 13060, 39716, -42668, -60700, -35671, -9417, -8203, 8044, 39383, 89260, 75772, 22450, -32681, 410, 40119, 54150, 61992, 88022, -1161, -28578, 6571, -24034, -34112, -3535, 31343, -12611, -288]
20165b88N4057L5314j3251k8380L549k5475M3717K4536j3658p1411q4531n429
20153h1250L9299O604l9855N8236K1745k6733l2311M8666j4752j3714M784P5576
20141D6295O341M1428P668J4330n578p3717L796L3582k7017n0174L2004o5850
20129c6892n5401M103O8578L4750l8981o0901L6276L4447N1374L9239j1901m1164
20117B3527n217P808j4180j4754m7168j60M8132J4120O90n9502N4602R80q450
20104D28O2867l0950l9792L2007j957n5333M237N2865o1338M1983R6464m4209
20092E7272j2122N722o960k0251n9971l1559M445K4351O7611L9498l0844k9579
20080G613j1114j589k0923L2478K2737o461J4171J9886m5120j960j9443k026M0615
$$ y = [-288, 53769, 89083, 75832, 47452, 51001, 25526, 69243, 93779, 80121, 8710, -75821, -81250, -41951, -35347, -75202, -16966, 4779, -21954, -54265, -5599, -20351, -34065, -29281, 46295, 52636, 94064, 101732, 116062, 110484, 36767, 40563, 74145, 47128, -3046, 28958, -36892, -92293, -88190, -19612, 15138, -23843, -84744, -48468, -14021, 37353, 76592, 64691, 23527, 18310, 26118, 11938, -2816, -49984, -50144, -2012, 12108, 12798, -46704, 7898, 8878, 428, 63295, 32345, -7447, 24560, 22603, -32730, -28493, 24372, -36966, 5017, 101481, 57272, 45150, 50872, 43912, 23661, -36310, -67869, -63424, -39073, 28538, 68036, 37192, 7613, -3501, -5090, -26013, 6465, 29202, 22741, 36912, 56798, 11678, 9718, -9725, -11751, 28864]
20067B8864J1069P2669M987j4910M2034m0972l5076P399k5586n1547M7879R822
20055E6632m6977j3464K7686N4780N4389o179m8463j5329J6632j9395j2945j7755
20043B9612J2051K4835M1263l5946p5801M235Q921M0254N732K2708j8333m6129
20031A3402K3462K5245n8100j0232J2633J09209P2672l178l9450p4690l1451K8678
20019F8200l8172K7771M800j15833n8403N7605M5846n859k7222k177K6792M4008
20007B7356L2186l2706j1688L3994P137J9249j6956o042j1667j1415J7957j6979
19995C0426l548n7019j0032L8124N8712K2244K4909k8070n1094n631k2487k6307
19983b9773K9616P0509m1214K7237K7047J8078K4531K844j2105L9092K1095j9069
$$ y = [28864, 39933, 112602, 117589, 102679, 144713, 103741, 68665, 76064, 50478, -1069, 46810, 56632, 9655, -3809, 23877, 78657, 133046, 126867, 78404, 63075, 79707, 60312, 47367, 29612, 41663, 66498, 107761, 71815, -3986, 249, 9170, 49424, 55156, 77864, 59531, 13402, 36864, 62109, 4009, -6223, 6410, 115619, 188291, 185113, 145663, 70973, 39522, 68200, 30028, 57799, 62599, -53234, -111637, -54032, -8186, -14045, -41267, -43444, -16652, 27356, 59542, 26836, 15148, 49142, 56279, 75528, 58572, 52530, 40863, 29448, 47405, 30426, 26878, -30141, -40173, -2049, 56663, 78907, 103816, 75746, 24652, 19021, -3466, -29773, -157, 70352, 29138, 56375, 83422, 101500, 126031, 128875, 116770, 155862, 176957, 157888]
19971A57888j3713r747m6337R190M8733j00814o8077O2248L8194o197q562J9967
19959H2773q845p1298K3378K9116J4589l7662K97j0935o1594j1090N5446k6324
19947b2149l114O6055p5180J7223L8095M9814J1474n3271q375O6169P407O169
19935A00317k8783k064M594o1004J0877L2002k5661P5712M1599p1416m8278p0788
19923d2893L3070J5203m0653m1610j1620R4208J0639M0540K1736l5206n3511j466
19911a1563k7755k4740m1996l447O8458L1434K8127L8898j4243O2398P3405l7865
19899A41111r1901k4427l8940o1944N4629n254m1773K029K9568M729J0369P8107
19887E6303K803j3349l0837j2351K6975L3242J6490J457j924m1192k4614m4438
$$ y = [157888, 144175, 134428, 88091, 97281, 146014, 45200, -22877, 39371, 77565, 71368, 62806, 82773, 73928, 2630, 26008, 55124, 69713, 32051, 32348, 21413, -40181, -51271, 4175, -22149, -25263, 40792, -34388, -17165, 20930, 70744, 82218, 28947, 20572, 86741, 94148, 100317, 71534, 69470, 74064, 13060, 23937, 55939, 30278, 105990, 147589, 76173, 27895, -42893, -9823, 5380, -35273, -76883, -88503, 5705, 16344, 56884, 78620, 43414, -10097, -11563, -39318, -64058, -106054, -109501, -41043, -9609, 18518, 57416, 43173, 105571, 178976, 141111, 49210, 24783, -14157, -76101, -21472, -26726, -68499, -66470, -36902, -32173, -21804, 56303, 59106, 45757, 14920, 2569, 29544, 62786, 79276, 80733, 78809, 37617, 13003, -31435]
19875c1435k7467N9812Q4076J429n7183j8825Q1652K4533l040l4639o9764j6768
19863g619j870k8872J9462O1294L7874k1136o1627k7510N2445P0368K400M8507
19851A43716K789m8360k0230k8022p0501o8563K0117O8678P6608M3696k1287j2182
19839H6459L1506L1052k4715r317L1724l2439j2375r2203N070N3042r461O3948
19827A22291l3704o7244L0811j3194M3749K3718L9528k6763J339k0166j2109M5364
19815A33620m4454P833k7304m836J5055m3169o9200K2510J19267l632k4513k537
19803G8640J1982q059j8116K7608K1399P3155j6808o0196J2747Q513N877K0936
19791A57678j9408M990L032l3868K8897L9651M6096k1163J02014R4108L627O3559
$$ y = [-31435, -58902, 910, 84986, 86415, 29232, 10407, 92059, 116592, 113552, 78913, 9149, -7619, -9489, -38361, -18899, 42395, 80269, 59133, -2494, -30004, 22441, 92809, 95209, 143716, 146505, 98145, 77915, 49893, -20608, -89171, -69054, -376, 76232, 119928, 98641, 86459, 117965, 149017, 124302, 114985, 146709, 114270, 101895, 9692, 14762, 67804, 58343, 122291, 88587, 21343, 52154, 38960, 82709, 106427, 145955, 119192, 120531, 100365, 88256, 133620, 89166, 96999, 69695, 64859, 79914, 36745, -32455, -9945, 109322, 105690, 81177, 78640, 90622, 82563, 64447, 92055, 113454, 186609, 169801, 109605, 122352, 130865, 136742, 157678, 138270, 143260, 146292, 112424, 141321, 180972, 227068, 205905, 307919, 402027, 405654, 469213]
19779D69213O7663O9153M8599J11835K36436K15606J92513J72702M7135q5125
19769A545730j58718k21989k50987j27240r9634j58643j15532k7272m1065m4922
19759B99728j9837k0918o770k0978j7451R546K9190K16k596n2034N4584M2718
19747B95398M6357K4769L2037P5169J45288P1949J10953J92562K72883J77228
19737A444593J17177R3135M6098j25625j95179j67039k40639j78975j22275j19100
19727E52171j47436m3803m2200l3067k9251n5388m2417l3190K8003P697j0271
19716A50848n1627L3917M3509r631j3614p3840o2696O6375R4950j0386m4323j3402
19704A10080N750l720L6742K3478J7226L8814r288R3781J30001p6894j6013M4298
$$ y = [469213, 536876, 606029, 654628, 766463, 1002899, 1218505, 1411018, 1583720, 1630855, 1545730, 1387012, 1165023, 914036, 786796, 687162, 528519, 412987, 385715, 344650, 299728, 279891, 258973, 252203, 231225, 213774, 223320, 252510, 252726, 250130, 198096, 252680, 295398, 341755, 366524, 398561, 473730, 619018, 690967, 801920, 994482, 1267365, 1444593, 1561770, 1654905, 1701003, 1575378, 1380199, 1213160, 972521, 793546, 671271, 552171, 404735, 360932, 318732, 285665, 256414, 201026, 158609, 125419, 153422, 161119, 150848, 99221, 133138, 176647, 167016, 153402, 79562, 16866, 83241, 178191, 167805, 123482, 110080, 115830, 112110, 148852, 172330, 189556, 228370, 219082, 312863, 442864, 365970, 349957, 394255]
19692C94255j1406m4162o7637r2596m0239L8252j1025k364o0888J4792M9451k3551
19680A42882J0287J4085r414j0547J9779l8859o9528K9097K1505K774o5187L2927
19668G9801M4216M711P2084j0775l5208m5574k8757P585l2814o794Q8508k3173
19656A13810m1180M0362j6094j2599J8216p208m2885K6160N9202p32j7067l3516
19644H6469K6029L486k7222j1220N8730P2968J7596K3345j9808n14M848l1556
19632B03151J0064m0386K043o029K3361N618M3037k5463q0942r7542p1227M5983
19620A1668M0568K8181K2272k7122K719P061R5788l6710j6113N880m6552K9781
19608A17421n62L3610J1513m1199K6750K3001L7334M6577n4437J5651p706l9590
$$ y = [394255, 382849, 338687, 271050, 178454, 138215, 176467, 165442, 163078, 102190, 116982, 166433, 142882, 153169, 167254, 157840, 147293, 167072, 128213, 58685, 87782, 109287, 112061, 46874, 79801, 124017, 128728, 200812, 190037, 154829, 109255, 80498, 88083, 55269, 48475, 136983, 113810, 72630, 112992, 96898, 84299, 102515, 95307, 52422, 78582, 137784, 137052, 119985, 86469, 112498, 115984, 88762, 77542, 136272, 209240, 226836, 250181, 230373, 229859, 234707, 203151, 213215, 172829, 174872, 168843, 192204, 197822, 240859, 215396, 134454, 36912, -34315, 11668, 52236, 80417, 102689, 75567, 78286, 85347, 181135, 144425, 128312, 134192, 87640, 117421, 116859, 150469, 161982, 120783, 147533, 170534, 207868, 254445, 200008, 215659, 207953, 168363]
19596A68363q7232p312O6145K5416N5961K2180M943j8791q7926p4941k9444P3890
19584A11252N7845l3257j8750l0356L5146J726j1029j3718l5518P2039N0868j4063
19572A72185o3363j6593J0276K6045M8498L2527M97O5115k147m9339m0335l0371
19560A52995k9723Q142P541J6196L2152M2975N1633m8480n7042q965Q336M3133
19548B18893K4054m6262K2178J2087J353k387J4413n5419j5529j2042l0680j6987
19536A13672J4705M5969L3777m3158p1923j2108L7500O9151n819k8295m34k8496
19524A24541J5789P5863N1783J9615m5044n5463l1695M976L5568K9558k1036j510
19512B02945j4001l574L0593J1193K1296p458o4826j370J1375r2896l0777K2893
$$ y = [168363, 81131, 73819, 139964, 165380, 221341, 243521, 248464, 229673, 141747, 66806, 37362, 111252, 169097, 135840, 117090, 86734, 121880, 123606, 112577, 98859, 63341, 135380, 186248, 172185, 108822, 92229, 102505, 128550, 177048, 209575, 210072, 275187, 273040, 223701, 183366, 152995, 123272, 131414, 138955, 155151, 187303, 230278, 281911, 233431, 176389, 167424, 175760, 218893, 242947, 196685, 218863, 230950, 232303, 229916, 244329, 188910, 173381, 161339, 130659, 113672, 128377, 174346, 208123, 164965, 93042, 80934, 118434, 187585, 181766, 153471, 153037, 124541, 140330, 216193, 267976, 287591, 242547, 187084, 155389, 160365, 195933, 225491, 204455, 202945, 188944, 185370, 215963, 227156, 248452, 240994, 176168, 174798, 186173, 93277, 62500, 85393]
19500H5393L9915J6281j9562k8422J02599N7396o3564n83R915l9381j7534J9453
19488A61906L4883Q398p189l7110J8674j2263j0897j579K4423K7316j8141j1597
19476A76824Q668K5056J2061l9148O1031M2847L888L7778J605j3829K0096O1310
19464C98187N7994m3135l8003M9822M713p0693k53N9896k8560j03114n7645M2116
19452B71325j9697J6349K0847L844m582r3216O015K7093J2785L1227r202M68p577
19439B55679J4424o561o293j5688J3587k227K4258O35J8566m325k543M7535M268
19426C41315N1869j0311l6370p023O6254L8347k9372j7412k419L366J4108O6458
19414D78810L0521K034p9559m1316L581j5714j0318n4594l8558P3941m99n6153
$$ y = [85393, 125308, 141589, 122027, 93605, 196204, 253600, 190036, 189453, 199368, 159987, 142453, 161906, 196789, 205187, 197998, 160888, 179562, 167299, 156402, 154823, 179246, 206562, 188421, 176824, 185492, 210548, 222609, 183461, 244492, 287339, 291227, 329005, 330610, 316781, 336877, 398187, 456181, 413046, 375043, 424865, 429578, 358885, 358632, 418528, 389968, 286854, 229209, 271325, 251628, 267977, 288824, 292668, 288086, 194870, 200885, 227978, 240763, 271990, 262788, 263256, 255679, 270103, 263542, 257249, 241561, 255148, 252921, 277179, 277814, 296380, 292055, 289512, 337047, 341315, 393184, 382873, 346503, 339480, 405734, 444081, 414709, 397297, 394878, 398244, 412352, 478810, 509331, 511365, 431806, 390490, 394071, 378357, 368039, 313445, 274887, 348828, 348329, 292176]
19402B92176o2359q0821M4634K3700p07k5626K5321L3406R3856J14675o2048j11538
19390B84669K1749L7032j5979l8793j6938K5673O8252M6897k0499j4400M8038
19379D25701o174k487L1976K6677p998m5509k6978k7208k2928k7116K5319O573
19367C49848p8253n1901j1679o0323L0732M3900O9979N1059M1553N6568O6395
19356E07878k4440j1717K9766L6864m1659l925K4965j3181K3911j3421n3474o917
19344D54650O4437P8250K0325N2727P8421M1557K0246N5999M9622K7086L8591
19333I81911q0498q7839q8146o4283k4858o3969j15100j5204j4251m4093P2217
19322D55887O3706M868M6894k1512j839k8939L8887K2929Q074k079L9516O3561
$$ y = [292176, 229817, 148996, 193630, 217330, 216623, 190997, 216318, 249724, 343580, 458255, 396207, 284669, 306418, 343450, 327471, 288678, 271740, 297413, 365665, 412562, 392063, 377663, 425701, 419527, 417040, 449016, 475693, 467695, 422186, 395208, 368000, 345072, 317956, 343275, 349848, 271595, 219694, 208015, 147692, 178424, 222324, 292303, 343362, 384915, 441483, 507878, 483438, 471721, 501487, 538351, 496692, 492767, 517732, 504551, 528462, 515041, 461567, 454650, 519087, 597337, 617662, 670389, 748810, 790367, 810613, 866612, 916234, 943320, 981911, 901413, 813574, 725428, 661145, 636287, 572318, 457218, 442014, 427763, 383670, 455887, 519593, 524461, 571355, 549843, 548004, 519065, 557952, 580881, 588955, 586876, 626392, 689953]
19310F89953K9249Q4174P9543l3779j821J5890P8635R2177M4893L6631M9672K6365
19298A191582L3100L5445n3732n6462m6878k2983j03660o2432j9413L6285K1853
19287I52705L3251j2861m0971K5282N1990L5143Q9950M5015L4008O959q5281K7969
19275A163159J30283R7826P0863N0153K6767O0335M5382Q7408L7808L5303R5000
19264A900287P2704J55802P6756P0660J51776K16988L05780L10862K95280K65913
19254C822808J39912N7210P6784m5256o9322p5607m7159K0935J63419K02965J97787
19243D444476J91455K43671K61289K57728L87205M84574M84526N85341P14201
19234H054466O93080O97919N30235L93892L22228L32626M77032M98342O69618
$$ y = [689953, 719202, 803376, 882919, 849140, 847319, 863209, 941844, 1034021, 1078914, 1115545, 1165217, 1191582, 1224682, 1260127, 1206395, 1149933, 1103055, 1080072, 976412, 913980, 894567, 930852, 952705, 985956, 973095, 932124, 957406, 1009396, 1044539, 1134489, 1179504, 1213512, 1220471, 1135190, 1163159, 1293442, 1391268, 1462131, 1512284, 1539051, 1599386, 1644768, 1732176, 1769984, 1805287, 1900287, 1972991, 2128793, 2205549, 2276209, 2427985, 2644973, 2950753, 3261615, 3556895, 3822808, 3962720, 4019930, 4096714, 4051458, 3982136, 3906529, 3859370, 3880305, 4043724, 4246689, 4444476, 4635931, 4879602, 5140891, 5398619, 5785824, 6270398, 6754924, 7340265, 8054466, 8747546, 9445465, 9975700, 10369592, 10691820, 11024446, 11501478, 11999820, 12669438]
19225A2669438Q74762J241196J521455J892370K281306K706925L262791L994938
19217C0445181N185882O915887R596850J3681270J9838288K7738451L5265728
19210A48667537M0307879M0182959L1184308J8213501K549500j5866636k9057819
19203B36181229l5361906l6683272l3392178k7370793k1137953j5517336j0946790
19196E5771001p780223n742008m381351l393379k635054j982170j325635p76616
19188B7754565k01391L20192Q24283J392274K089297K808981L721647N144434
19180D3854282O984819R772559J4054295K0492169K8726808L6372092M1256210
19173B01513234M0188159L0262562J6693567J15444j8748919l1470250l7407598
$$ y = [12669438, 13544200, 14785396, 16306851, 18199221, 20480527, 23187452, 26450243, 30445181, 35631063, 42546950, 52143800, 65825070, 85663358, 113401809, 148667537, 188975416, 229158375, 260342683, 278556184, 281105684, 265239048, 236181229, 200819323, 164136051, 130743873, 103373080, 82235127, 66717791, 55771001, 47990778, 42248770, 37867419, 34474040, 31838986, 29856816, 28531181, 27754565, 27553174, 27873366, 28697649, 30089923, 32179220, 34988201, 38709848, 43854282, 50839101, 60611660, 74665955, 95158124, 123884932, 160257024, 201513234, 241701393, 271963955, 288657522, 288772966, 270024047, 238553797, 201146199]
19166B01146199l8332767l4663859k8386746k1887199j6150442j1532464q327106
19159D1865616o176548m703989l838963l222960k678408k262745j933186j615421
19151A5433396j268272j012647q47819n70754m02064l37385l97771m86118o15299
19142I495267o88787p08219o70624n65417n26258m20458l40661l53696k69669
19133D951478k64548l67363l46571k04183j37360o6107n147k1265M4841r673j35465
19122C438637k44380k74541k43946k08643k32727j86480j18455j75548k02502
19113A551415j15697k8260o0322l5053L6421k0472r2667j40262q3568l6477O847
19102I81905m9565n4812k8022j2980j7485m7694p9415k5023J7390K992R7434j0641
$$ y = [201146199, 162813432, 128149573, 99762827, 77875628, 61725186, 50192722, 41865616, 35689068, 30985079, 27146116, 23923156, 21244748, 18982003, 17048817, 15433396, 14165124, 13152477, 12304658, 11733904, 11331840, 10994455, 10596684, 10110566, 9495267, 8806480, 8098261, 7427637, 6862220, 6335962, 5915504, 5574843, 5221147, 4951478, 4686930, 4319567, 3972996, 3768813, 3631453, 3565346, 3560199, 3538934, 3583775, 3574102, 3438637, 3194257, 2919716, 2675770, 2467127, 2234400, 2047920, 1929465, 1753917, 1551415, 1435718, 1407458, 1347136, 1312083, 1348504, 1328032, 1235365, 1095103, 1011535, 975058, 981905, 932340, 877528, 849506, 836526, 819041, 771347, 691932, 666909, 684299, 687291, 784725, 774084]
19090G74084r8739j11528l7770N6230K3410l3436k6319L2126o5077o8583m4370
19079D00028r3424m6930p8872l7864O4082K1679J3860K4078L6238R863m450J0212
19067C18500k7502k4339l1932O8937J8341l1544M0649p266q7681m5769K0985j051
19055B10328j2680L5936J04639M5326K136L7334K7371l9549r2050o6858m8576
19044B03357l563o5336m198K1892J2867m8530k3539J1212J3446N4003R945l1308
19032A50248j431k2806n7971n4217Q4568K25N5781K3409l4252r3637n6408M481
19020b010O7890N2295Q7823L2445L8294J6819o2835J9578J3118L9452k0021M60
19008B83308J0404n2198l5107J579o6665m0727l1185o2014M6182k8817l4401j0963
$$ y = [774084, 675345, 563817, 526047, 582277, 605687, 572251, 545932, 578058, 512981, 444398, 400028, 306604, 259674, 180802, 142938, 207020, 228699, 242559, 266637, 302875, 312738, 308288, 318500, 290998, 266659, 234727, 303664, 322005, 290461, 331110, 323844, 236163, 190394, 211379, 210328, 197648, 233584, 338223, 383549, 385685, 423019, 450390, 410841, 318791, 251933, 203357, 199794, 134458, 130260, 152152, 165019, 116489, 92950, 104162, 117608, 171611, 181556, 150248, 148817, 126011, 68040, 13823, 98391, 98616, 154397, 177806, 143554, 49917, -6491, -2010, 65880, 118175, 205998, 238443, 276737, 293556, 230721, 250299, 263417, 302869, 282848, 283308, 293712, 241514, 206407, 207986, 141321, 100594, 69409, 7395, 53577, 24760, -9641, -20604]
18996b0604k0802R7684R8173l2055o474k910N0440L2471o7421j18771k066N55
18984H220J6777O6332M0046j7710k8794j6968P976M8286o1743K2427M189J7782
18972A06820p4734l5326K4660J0793K0538P1473j3242m4210n1684j7236j8808
18961b0956K6461J9334L6751J0418j0331r974k9987J5289k104k8290M2871M4010
18949I3492K5578k6472J8036k1731l5490J5751l7937L9355K1434k305o8476j6832
18937D403L15j3455j7903q391n033J1353J9096J3646K4625o150l9921J9738O0945
18924F3268k6759k4509k4380O0318k5365J9785k5844N7109J02263J8387l3266
18913A61007J3896p67l1557m0815j10372j9734p307J183J5535K4962M604J8278
$$ y = [-20604, -41406, 56278, 154451, 122396, 115922, 113012, 163452, 195923, 128502, 9731, 7665, 8220, 24997, 91329, 131375, 113665, 84871, 67903, 75879, 124165, 62422, 84849, 89038, 106820, 32086, -3240, 21420, 32213, 52751, 124224, 110982, 66772, 15088, -2148, -20956, 5505, 24839, 61590, 72008, 61677, 51703, 21716, 37005, 34901, 6611, 49482, 93492, 119070, 92598, 110634, 88903, 53413, 69164, 31227, 70582, 92016, 89711, 21235, 4403, 4718, -8737, -26640, -35031, -40064, -28711, -9615, 4031, 28656, 22506, -17415, 2323, 63268, 36509, 12000, -12380, 47938, 22573, 42358, 16514, 73623, 175886, 194273, 161007, 174903, 174136, 142579, 101764, -8608, -28342, -35649, -34466, -18931, 6031, 10635, 28913]
18901B8913k5983J5393j0847L0753n1903o6676k9236J3932M1826j5895N4978j0393
18889b5138P119P8525P5647k1054n1331n6795K7662L5920q3677j5607O0407l4298
18877b620o0441N824M1235M114k9045K072K6503j662m7723K884J382L3045P0472
18864D6040p072j0098O2910o1707j2225K5916j3373q980k695J4053l0658k2456
18852b0345k6795n4185o4433O7294M644j300n4353p388M792L5922J02461N3445
18840C9759j4431j3330L2610P843j4175N7376j1580j6802J13k6437k0768k3303
18828c125J0210j9432k1278k900K387p9339K4583M7922L345n081k2246K5954K3343
18815a5657J0829l4311J3572j3911j1632K2655M3545J6638k7500l0258k7544R703
$$ y = [28913, 2930, 18323, 7476, 38229, -13674, -80350, -109586, -95654, -53828, -69723, -14745, -25138, -18019, 60506, 136153, 115099, 63768, 6973, 34635, 70555, -13122, -28729, 31678, -2620, -63061, -57237, -16002, -11888, -40933, -38861, -12358, -14020, -61743, -58859, -57477, -24432, 46040, 38968, 28870, 91780, 30073, 17848, 43764, 30391, 21411, 18716, 32769, 2111, -20345, -47140, -101325, -165758, -98464, -93820, -95120, -149473, -156861, -152069, -116147, -13686, 39759, 25328, 11998, 44608, 52451, 38276, 95652, 84072, 67270, 67383, 40946, 20178, -3125, 7085, -12347, -33625, -36525, -34138, -113477, -88894, -40972, -37627, -42708, -64954, -39000, -15657, -4828, -39139, -25567, -39478, -51110, -28455, 15090, 31728, 4228, -26030, -53574, -43871]
18803d3871k3534L1431N8801k1849l1863l9274J3893R4655L3713n75l2354j7421
18791B1752K4457j2778j7493P612n7418n0585O05K1860P8081O9675q5678l5624
18779c5534M1144J08829N3227p9571o1813Q755O1644O388k832N14M6468P1192
18767B18411N1999J15786J23594J56929m9217j11811q0312q1243j70272j21951
18757E1913k8648J3507K8161K6541n7846l0510k2100m895j7172R84m3327p1763
18745a55155J7960M5332P1721m8957k4349O9924j4037o1832N0465L5377L1076
18734A7525l8012r971j5541K850k966J4959n6784n3499K879n27L698N6920Q0363
18721A894J5832l0302L1033N7428j938o0229J136K8454j4640m1354L9937J2385
$$ y = [-43871, -67405, -35974, 22827, 978, -30885, -70159, -56266, 38389, 72102, 71527, 39173, 21752, 46209, 33431, 15938, 23550, -33868, -84453, -83848, -61988, 16093, 85768, 90, -35534, 5610, 114439, 167666, 88095, 26282, 35037, 96681, 103069, 100237, 100751, 147219, 218411, 270410, 386196, 509790, 666719, 617502, 505691, 425379, 344136, 173864, 51913, 23265, 36772, 64933, 91474, 33628, 3118, -18982, -23877, -41049, -40065, -83392, -155155, -137195, -91863, -20142, -69099, -93448, -23524, -37561, -99393, -48928, -13551, 17525, -20487, -30458, -45999, -43149, -46115, -31156, -87940, -141439, -138560, -139087, -135389, -78469, 1894, 17726, -12576, 18457, 75885, 73947, 13718, 14854, 43308, 28668, -12686, 27251, 39636]
18709C9636k4125j1353J1732o1724l0968K0839l2506j2944M8152N2573N4544j3637
18697D0219k0909M9978r672p397j2237o5080K3949L3189j6936P531M5670m1424
18685B6881o748J7477O4461k4537m6945n3875j0827n3392L3635L1127K2904P505
18673G666j1623n5600O5892N0487R647j09169l5203L1923j0058L139K821N7812
18661G734l805n2580J5712J9990l8526o4651M8047J11190M7173p4935L688L389
18649B2426J1088J5200N2828Q415J0240N9705Q1896O4553R4144N5662J99177K24407
18637H99741K62187J89078R1684P266j1711j06852j73919j65014k27007j27832
18627F37621r7853j80308j64674j3454K0407J4765N0320j4475q9690o6182l5720
$$ y = [39636, 15511, 4158, 15890, -45834, -76802, -55963, -88469, -101413, -53261, -688, 53856, 40219, 19310, 69288, 59616, 52219, 39982, -25098, -1149, 32040, 15104, 22635, 68305, 26881, 20133, 37610, 102071, 77534, 30589, -23286, -34113, -87505, -53870, -22743, 161, 7666, -3957, -59557, 6335, 56822, 66469, -42700, -77903, -45980, -56038, -52899, -50078, 7734, 3929, -48651, -32939, -12949, -51475, -116126, -68079, 43111, 90284, 15349, 19037, 22426, 33514, 48714, 101542, 109957, 120197, 179902, 261798, 326351, 420495, 476157, 675334, 899741, 1161928, 1351006, 1442690, 1449956, 1438245, 1331393, 1157474, 992460, 765453, 637621, 539768, 359460, 194786, 181332, 201739, 216504, 266824, 252349, 162659, 96477, 60757]
18616F0757m9937K5271K7594K8419p673J02697M2351j9420J8210L3575N0367J49119
18604D61330J37753J38178K40156K07416J34128J01671N7456K0786l152j93569
18594A302153k71601k23637k35656j33561r1195k1050k5725q1218r8541O385Q3744
18583B10098l9080o8229j0946R890N1052k529m3851j03277j260L627K8242Q969
18571D2706J7852J6939J4856O60l2446o5040n4082m5043O3382O3787j804j6211
18559E556p057k9284m6300R691N5668q312l0901m997M1275Q7729j4622l9044k0419
18546a017R563k0150L8418K2457J9653P393j3907n4238q356J5498l390l215l6449
18533b7740j7041O3048L2583J6299n9434j25819J6679Q0946L5946M2956J18553
$$ y = [60757, 10820, 36091, 63685, 92104, 84431, 187128, 229479, 210059, 228269, 261844, 312211, 461330, 599083, 737261, 977417, 1184833, 1318961, 1420632, 1478088, 1498874, 1495722, 1302153, 1030552, 806915, 571259, 437698, 346503, 325453, 299728, 218510, 119969, 126354, 210098, 171018, 102789, 91843, 101733, 152785, 150256, 106405, 3128, 1868, 5495, 33737, 42706, 60558, 77497, 92353, 93013, 60567, -4473, -58555, -103598, -40216, 23571, 21767, 5556, -1501, -30785, -77085, -67394, -11726, -20038, -50939, -55936, -14661, 73068, 58446, 19402, -1017, 8546, -11604, 26814, 49271, 68924, 76317, 62410, 8172, -184, 15314, 11924, 8709, -27740, -44781, 18267, 50850, 67149, 7715, -118104, -101425, -20479, 15467, 58423, 176976]
18522A76976M4453m0508n5475p0483L5833m1257o2697k027k4873k7353P6716o3817
18510e4512n3002K2248O1695m0326M3887Q5416P440k7549M301k9991k571L5730
18498E2766j370l7730M827K2345K5612J5916J2346R238N3798K390k3424J6458
18486A53172p717K2552L0106L554m8862n1230J1606l172L1559L731m2891r7635
18474D773o9624q524L2678N6176J671j16110n20O8513O4539j251l0533J1327K5081
18461C8196l4251l9195j0059L1075k2567l1235K6826L9728k24J1438p1789k3646
18449h5703L0317K9384M308j0993m1159O437M3387M4107K3233M066n5806j7886
18437b6308J2244l50K3526n4436k6347K5138Q1351N0889m3536q4625o6665n083
$$ y = [176976, 221429, 180921, 125446, 54963, 90796, 49539, -13158, -15185, -40058, -67411, 9305, -54512, -107514, -85266, -23571, -63897, -20010, 65406, 72846, 45297, 49598, 19607, 17036, 52766, 51396, 13666, 18493, 40838, 66450, 82366, 94712, 103950, 157748, 160138, 136714, 153172, 145455, 168007, 198113, 201667, 152805, 101575, 113181, 110009, 141568, 145299, 102408, 4773, -64851, -73375, -40697, 15479, 17150, -98960, -99480, -30967, 33572, 32321, 1788, 13115, 38196, 3945, -35250, -45309, -14234, -36801, -68036, -41210, -1482, -1706, 9732, -62057, -85703, -55386, -26002, -21694, -32687, -73846, -67409, -24022, 20085, 43318, 47384, -8422, -26308, -14064, -14414, 9112, -45324, -71671, -46533, 34818, 85707, 42171, -42454, -109119, -114202]
18425a14202M2990O9743j859n647K8017J1561l0767n7194J5643J3390j7668o5399
18413a11392n497O9233j0552K5720L0961N3129P0948q506p025j00710p2099j2108
18401g7898N7910R0708K025K3315N691l1890l7817K356n8262J9797j7493j9264
18389d0822m368P029j8856N7944O3490n2925j2530J0866N6306m224k2953M1458
18377H0415J2719j8590L7496j6934k1914l1630R889k0915J3085j9818q1697J69
18365e7725K1311j3050R523m6252o655Q7065k367j7543J205r5789J2284R0915
18353a7078M7266M1586k0044m7906n778M3525n2802r5695R459O1694M4206L965
18341A2398J1881k5545k9213k0139k9597Q533j6762j2682J2075J7963J1030N0590
$$ y = [-114202, -71212, -1469, -3328, -8975, 19042, 30603, -164, -57358, -41715, -28325, -45993, -111392, -116889, -47656, -58208, -32488, -1527, 51602, 122550, 114044, 107019, 6309, -65790, -77898, -19988, 70720, 72745, 96060, 101751, 69861, 32044, 34400, -23862, -4065, -21558, -40822, -45190, -38161, -57017, 927, 64417, 11492, -1038, 9828, 66134, 61910, 38957, 80415, 93134, 74544, 112040, 95106, 73192, 41562, 51451, 30536, 43621, 23803, -57894, -57725, -36414, -49464, -39941, -86193, -92848, -5783, -8150, -25693, -24488, -120277, -107993, -17078, 30188, 71774, 51730, 3824, -1954, 41571, -11231, -106926, -97467, -35773, 8433, 12398, 24279, -1266, -30479, -50618, -80215, -71682, -88444, -101126, -89051, -71088, -60058, -9468]
18329i468N6485o860N457l6619K2322M0843o062J5339n4720k1928M1091m4677
18317A203m9589R667j9144J4328J0427J5512j0914M3361K3919M036K5446l8169
18305C0083l5208N0436N9115n1560m743K709m0120k68j0312J6756K6472o188R127
18292D6299l257l1211K943j6584L4786L6802l1331n0276m5918R833m381J0260
18280d2035Q7315J1468J1509m5222n1995K7246j798O8650O7494L4181r71J6885
18268A82727m8291K455K147k5481m291n570l2074k8497k7404K0351J3250j0081
18256C9241p1869N0460P3108P5031M6110K6931n2046k3237j1686J4543q2876r1510
18244g800J4457L5720M53j1123K5144N96K7803L7294K9831R0790M1790n8069m4760
$$ y = [-9468, 47017, 40157, 45614, 8995, 31317, 72160, 66098, 81437, 26717, 4789, 45880, 1203, -48386, -38719, -57863, -43535, -33108, -17596, -28510, 14851, 38770, 42806, 68252, 30083, -5125, 45311, 104426, 52866, 48123, 50832, 10712, 10444, 132, 16888, 43360, 37172, 46299, 43042, 11831, 14774, -1810, 32976, 69778, 38447, -11829, -57747, -47914, -52295, -42035, 45280, 56748, 68257, 23035, -28960, -1714, -3512, 65138, 132632, 166813, 165842, 182727, 134436, 136891, 139038, 113557, 109266, 103696, 71622, 43125, 15721, 36072, 49322, 39241, -32628, 17832, 90940, 165971, 212081, 239012, 186966, 163729, 152043, 166586, 83710, -7800, 6657, 42377, 42830, 31707, 56851, 57447, 85250, 122544, 152375, 243165, 284955, 226886, 182126]
18231A82126j8664j485j9824p5330j7945j4680l5503M9384K2427K417k9469o6664
18219b3210k0608J6506Q8619O5000n644m1545k6747n3767N1482P2631j6127m1275
18207F5315K280j7968j0289O8172k103n143o4891q113J6897M7277J1281O4455
18195A67170M7613l9595l3785r009J3749O3417m485j7935k3343n8330J632N4786
18183A61885k6670k0699j470K3014L4572K1732o647l1280R1216M0242p3095l1004
18171A81796n4900m3864L6760J6737K5176M0361O438K6024O7064K0858K2009l9770
18159C04689J5597K8145q037j9276l0963p1084R725M7428L1741M2398q849K0065
18147C61579L1260M0105O0261M5950l7621m775q185j6149j4452k4619R5582J30098
$$ y = [182126, 163462, 161977, 142153, 66823, 48878, 34198, -1305, 48079, 70506, 72923, 43454, -23210, -43818, -27312, 61307, 126307, 120663, 79118, 52371, -1396, 50086, 122717, 106590, 65315, 67595, 49627, 39338, 107510, 105407, 100264, 35373, 27260, 44157, 91434, 102715, 167170, 214783, 175188, 141403, 132394, 146143, 209560, 205075, 187140, 163797, 105467, 107099, 161885, 135215, 114516, 113046, 136060, 170632, 192364, 185717, 154437, 245653, 285895, 212800, 181796, 126896, 83032, 119792, 136529, 161705, 202066, 208504, 234528, 301592, 322450, 344459, 304689, 320286, 348431, 340394, 321118, 290155, 219071, 228796, 276224, 307965, 350363, 341514, 361579, 392839, 432944, 493205, 539155, 501534, 496759, 488574, 472425, 457973, 433354, 528936, 659034]
18135F59034N3374L2496Q4098O1214Q2410J44608J05983j5929q177N6218J22135
18124A377464J28747J93011K45220K32784L41154M30066L91420M45233N37850
18115D322949P06696Q88160J240460J823653K463071L751694O347255J1879650
18107C3423588K3068449L4200216J0009440j7705264j3518015j0544158j6170735
18100D2763521j5125511r259997n105449k882325j926630j455385j098886q56531
18092E052807o73043n57126m26101l39010l15136k34961k06157j91348k40502
18083A869423k34987k21449j03790j07907n0852p6187j29436j15024l9242k2137
18073G68412l7232j9284k381m7492o8659p3988O868j649k2246l3818J2396p9432
$$ y = [659034, 712408, 744904, 829002, 890216, 972626, 1117234, 1223217, 1207288, 1199111, 1255329, 1377464, 1506211, 1699222, 1944442, 2177226, 2518380, 2948446, 3339866, 3785099, 4322949, 5029645, 5917805, 7158265, 8981918, 11444989, 15196683, 21543938, 33423588, 56492037, 90692253, 100701693, 82996429, 69478414, 58934256, 42763521, 27638010, 18378013, 13272564, 10390239, 8463609, 7008224, 5909338, 5052807, 4379764, 3822638, 3396537, 3057527, 2742391, 2507430, 2301273, 2109925, 1869423, 1634436, 1412987, 1309197, 1201290, 1150438, 1074251, 944815, 829791, 790549, 768412, 731180, 711896, 709515, 662023, 593364, 519376, 526244, 524595, 502349, 468531, 480927, 401495]
18061D01495q1793N26j258m8907M793m1565k0080J5915L1319l53l2744q140K961
18048B22169k0400p6434l5765j464K4986n896K8840L7344l1621M0586j0465m9514
18036A22366m1023j9050J6493L1662M9008j8496K0864J0709p9217p5158l824P0614
18024H4948J7693m9281Q167P4619O6624l3058m6801l2456r028L9771n6575p1394
18012f771J3154K5730k1106K2825j8607L3625M3723L2672m3291k5919J6006J6264
18000H8305J6707O475l3201P12l6213n0982n757j4916j8452N0994O5962k3619
17988D6015k0509l0602o200k3096J7640K0967M1411M1369j072L584j5871k4905
17976D8731o976K1126n5941l0000J3673O937J7639J0438k3570n2542K8542M4565
$$ y = [401495, 319702, 320228, 318970, 270063, 274856, 233291, 213211, 229126, 260445, 260092, 227348, 219208, 222169, 201769, 125335, 89570, 88106, 113092, 107196, 136036, 173380, 141759, 182345, 171880, 122366, 81343, 62293, 78786, 110448, 159456, 140960, 161824, 172533, 93316, 18158, 14334, 84948, 102641, 53360, 61527, 136146, 202770, 169712, 122911, 90455, 81427, 121198, 64623, -6771, 6383, 32113, 11007, 33832, 15225, 48850, 92573, 125245, 81954, 56035, 72041, 88305, 105012, 111487, 78286, 78998, 42785, -8197, -13954, -28870, -47322, 3672, 69634, 46015, 25506, -5096, -11296, -34392, -16752, 4215, 45626, 86995, 85923, 89507, 73636, 48731, 41755, 62881, 6940, -23060, -9387, -2450, 15189, 25627, 2057, -50485, -21943, 22622]
17964B2622K7952J578n2222j6490k0622L7629M1998J4008K6295K8292k7931m9422
17952C3687J8834K4994o647q84L465M635L1484R2491j835p7069r4119k0937L2922
17939D1021O4846m0253j8939J7987J4884j9854l4782Q022M5625M3691o519m6088
17927F9641k9732L574j294N397k168l4294J087k1285O946m1409K9404j6106R641
17914b0598J0951M8328M4912M4044l9250p6892j0123P7828k3212j8478J8278L4215
17902I0003q638j5250M0479r180P947K9917k8471r500m522n35l9775L4861j1448
17889G5888n3062L436O043L613M1928m9620J5617M638n10J4609n1225O920m878
17876A3397j1503l4124O1789O3670K9594k0617P424m035n0006J9574J3835n1196
$$ y = [22622, 50574, 52152, -70, -16560, -37182, 447, 42445, 56453, 82748, 111040, 83109, 33687, 52521, 77515, 70868, 69984, 73449, 78084, 109568, 202059, 200224, 123155, 29036, 8099, 41021, 105867, 65614, 46675, 64662, 79546, 59692, 24910, 32932, 78557, 122248, 115729, 69641, 39909, 43483, 42189, 47586, 45418, 11124, 12211, -9074, -2128, -43537, -14133, -30239, -20598, -9647, 38681, 83593, 127637, 88387, 11495, 1372, 79200, 55988, 37510, 55788, 90003, 81365, 66115, 106594, 97414, 105361, 135278, 106807, 97307, 92785, 92250, 52475, 87336, 75888, 22826, 26262, 32305, 35918, 77846, 28226, 43843, 48481, 47971, 62580, 11355, 18275, 13397, 1894, -32230, 29559, 93229, 122823, 102206, 109630, 105595, 55589, 75163, 88998, 37802]
17864C7802R444Q974j348l6778o5781J090O0806L7227l2875l1144K701l8745L3336
17851a5291K8817K9508L8658K2836l6673j6245J0729K150k5175k9243j5365J6168
17839A0874N7179q998m361k3335l2585L4266M6066l7512m8403j6025k9438n1030
17827a03302l2777O6727P1632N7087m769j01306m2639O1506N0901L8581Q7055
17816A48696p949p6024o2893L2964m07k743K2353M4235k5896L1508n1223m3585
17804I036K0979j7819J6953M1599k9972j2389j4741J9552L4125K3660J5879m7335
17792E9527m1415k34k7190k0828J7320P2503j2264l3531m4334k6399J7241Q921
17780c0683J2615J7135m1505J6836O7063N434j0977j6747K7101n2615k113P163
$$ y = [37802, 47246, 56220, 54872, 18094, -47687, -46597, 14209, 51436, 18561, -12583, -9882, -48627, -15291, 13526, 43034, 81692, 104528, 67855, 51610, 62339, 64489, 39314, 10071, -5294, 10874, 68053, 59055, 54694, 31359, -1226, 33040, 79106, 41594, -6809, -22834, -52272, -103302, -136079, -69352, 2280, 59367, 54598, -46708, -89347, -27841, 23060, 61641, 148696, 140747, 64723, 1830, 34794, 34387, 31644, 53997, 98232, 72336, 103844, 52621, 9036, 30015, 12196, 29149, 70748, 40776, 28387, 13646, 33198, 67323, 90983, 106862, 59527, 18112, 17878, -9312, -30140, -12820, 59683, 47419, 13888, -30446, -56845, -39604, -30683, -18068, -933, -42438, -25602, 41461, 46895, 35918, 19171, 46272, -6343, -8456, -1293]
17768a293L6559M4227l0815p6521J4042J11101l781k7644p873N7719k5277p0494
17756A9950k1104P141j6576k7151k4652k769M8825O7413m223j6180K1781Q5546
17744A38001J1527r0081n2392M6520J0913j3947J3800j0829J3636j0074k5392
17733C1682m1982O775Q99N0901J5014m0689K736K379m1735N888k7010j1281O939
17720c9484J6199M2184M8967N9366L1271K0385j5414l8401p2427o9370l332L5338
17708A5282P2697j9929k0691K1940L3081Q152L7834l7654o0163O335K7110p632
17696G6362l5675J5205M908J8867n9417j06328j4573N8615J15986N521k0366M8852
17684A07957M6987r6092n2702m1109K9234L0083K4183K2600N821K2957q8932o420
$$ y = [-1293, 35266, 79493, 48678, -27843, -13801, 97300, 93519, 65875, 58002, 115721, 90444, 19950, -1154, 5987, -10589, -37740, -62392, -65161, -16336, 51077, 46854, 30674, 52455, 138001, 149528, 59447, 7055, 53575, 64488, 50541, 64341, 53512, 67148, 57074, 31682, -10300, -3525, -2626, 48275, 63289, 22600, 25336, 27715, -14020, -8132, -35142, -46423, -39484, -23285, 18899, 67866, 127232, 158503, 178888, 163474, 125073, 52646, -16724, -20056, 15282, 87979, 68050, 47359, 69299, 102380, 110532, 148366, 110712, 50549, 56884, 83994, 76362, 40687, 55892, 60800, 79667, 20250, -86078, -100651, -42036, 73950, 79471, 59105, 107957, 154944, 58852, 6150, -34959, -5725, 24358, 48541, 71141, 76962, 99919, 10987, 4567]
17672D567L8254j9275p1330J24022n660q5292M0500J2382l0697l5110J2942J4239
17660d58M7966M5520N478J3304m4758k6361K5300P9039K6051l4233j1018r780
17648A16050L4289J0767K126j4250o7489k0124K7623J5870M3462j079j1121j1982
17636A24142j6838l0414p831L573L6796m3954m1448k4817K5171N646j4524j0118
17624E384J8626M3378K7152J552K281L1863N190K0992J0443k8715l0079k8529
17612G9538j0968K3277l2764o285K5795J71k815m1743j5858j308K8742L1959N3909
17599A31650O2341o288m2651o2637M4069j0010l6855J1342l9170n0837k3478p0492
17587i3016l3783L7867N8785O0193P100K4189l8470m2329j5462J1034L5404Q6909
$$ y = [4567, 42821, 23546, -47784, 76238, 70578, -14714, 25786, 38168, 7471, -27639, -14697, -458, 47508, 93028, 98506, 111810, 67052, 40691, 65991, 145030, 171081, 136848, 125830, 116050, 150339, 161106, 163232, 148982, 81493, 61369, 88992, 104862, 148324, 147245, 136124, 124142, 107304, 76890, 69059, 72632, 109428, 65474, 24026, -791, 24380, 30026, 15502, 5384, 24010, 67388, 94540, 96092, 98373, 130236, 135426, 156418, 166861, 138146, 108067, 79538, 68570, 91847, 59083, 52798, 78593, 78764, 75949, 34206, 18348, 17040, 45782, 77741, 131650, 193991, 187703, 145052, 82415, 126484, 116474, 79619, 90961, 51791, 954, -22524, -93016, -126799, -88932, -30147, 30046, 37146, 61335, 22865, -19464, -34926, -23892, 11512, 98421]
17575I8421L6426l6205j0763K2167R419J0149n0258n9365N9780m232p300L5943
17563A04182J7084m5982j3306L2615m9612n5388K9577P8553J6167J2761j8962
17552A07689o2722R729J7331J2716J12130J7789o2464r9845R955j1060k5438L5923
17540F1733J5238M0609n653n7209L6848L0207O5051K60j9952J5806n21L097k8255
17527A57259o3515n6441k4116J4439M5001M0955m2468J7361M6238K4578k2867
17516A36424k36m3958q9426L0685M591N4053N4702J3887n1254j8565J3729R978
17504A14610N8755j8392n9081K5609M8565j3483K2930J1064N579k0382k9770l644
17492A42360l3486J4839J9558P7807N3778K2046O9136R5236M5470O1596K03045
$$ y = [98421, 134847, 98642, 87879, 110046, 119465, 129614, 79356, 19991, 79771, 75539, 68239, 104182, 121266, 75284, 61978, 94593, 44981, -10407, 19170, 97723, 113890, 126651, 107689, 44967, 54696, 72027, 84743, 196873, 214662, 152198, 52353, 62308, 51248, 25810, 61733, 76971, 117580, 111927, 54718, 91566, 121773, 186824, 187084, 167132, 182938, 182417, 185514, 157259, 93744, 37303, 13187, 27626, 72627, 113582, 71114, 88475, 134713, 159291, 136424, 136188, 92230, 2804, 33489, 38080, 92133, 146835, 160722, 109468, 90903, 104632, 114610, 173365, 154973, 95892, 121501, 170066, 156583, 179513, 190577, 196156, 175774, 146004, 142360, 108874, 123713, 143271, 221078, 274856, 296902, 366038, 461274, 506744, 568340, 771385]
17481G71385L54158M17590K57230K16196J88550j16724l16278k69373k40483j93451
17471A068800j21001j3538P2764K08570L62002L81462J99007J21659J6770k10103
17461B086392l75250k74403l02342k92867j96344j16948j11687o4768k7296L8336
17451C62823k8550k0241j0568M4992j4557l5959K5512N4163M8234k7878M2250
17440D40221J62282K07271p7204j47983o4400j0385m5471j20534o8732j7895o2750
17429A94420p3003l3227L039O217K9613J23294N6803J3953k7033J1459n5760r2168
17417A57607M222L2992P4256p1824k4422L3967J7699L9202O1426J1476l5902p6363
17405B24336n4138L9038J7177p08P971J0800J8887n6063J7793j2562K923n485
$$ y = [771385, 1125543, 1543133, 1800363, 2016559, 2205109, 2088385, 1772107, 1502734, 1262251, 1068800, 947799, 934261, 1007025, 1215595, 1577597, 1959059, 2158066, 2279725, 2296495, 2086392, 1711142, 1436739, 1134397, 841530, 645186, 528238, 416551, 351783, 324487, 362823, 334273, 314032, 303464, 348456, 333899, 297940, 323452, 377615, 425849, 397971, 440221, 602503, 809774, 732570, 584587, 520187, 509802, 464331, 343797, 275065, 257170, 194420, 121417, 88190, 91229, 97446, 127059, 250353, 307156, 321109, 294076, 305535, 249775, 157607, 161829, 194821, 269077, 197253, 172831, 206798, 224497, 263699, 325125, 336601, 300699, 224336, 170198, 209236, 226413, 225705, 233676, 244476, 263363, 207300, 225093, 212531, 215454, 209969]
17393B09969L0788O237n5913k9290Q331k8990l4486k8251L3986J3601J5973J3346
17381A55301J1341k3394K2802N9530J5893l5187m6209K2938M4513j9241J3497
17370B21784k8057l47m0832J6831L0131k2995M69J7735k1001J7120M2399k8867
17358B04370o0516m6897j1041J5530P3474K1083j4893Q8583j7241o7134K0486
17347B05804n533J7632L5126l8661o5336J4065j3660q19M1352J6935K8433R0680
17335C26018j525o6547r3823l087P6600K1825M7070N6440N2719M3813o469J3505
17323D66539M0176R6619J84299K76754K34265M7253j26536j29412j37047j68667
17313G84243j22688m4602q564N6949J5122J20557K29276L52103J44900j68792
$$ y = [209969, 240757, 246994, 191081, 161791, 170122, 141132, 106646, 78395, 112381, 125982, 141955, 155301, 166642, 143248, 166050, 225580, 241473, 206286, 160077, 183015, 227528, 208287, 221784, 193727, 193380, 152548, 169379, 199510, 176515, 176984, 194719, 173718, 190838, 233237, 204370, 143854, 96957, 85916, 101446, 174920, 196003, 181110, 269693, 252452, 185318, 205804, 200271, 217903, 253029, 214368, 149032, 163097, 149437, 148618, 189970, 206905, 235338, 326018, 324493, 257946, 164123, 161036, 237636, 259461, 306531, 362971, 415690, 459503, 453034, 466539, 506715, 603334, 787633, 1064387, 1298652, 1345905, 1219369, 1089957, 952910, 784243, 661555, 616953, 608389, 665338, 680460, 801017, 1030293, 1382396, 1527296, 1358504]
17303A358504k22344j18857p8235j72676j96727q1797j9342K851k4391k0490J8310
17292D44806j5306l6167l1479J9686J02807P7765J13045J22941K05826K63691
17282A267615L9112r0395j30467j62473j21673n1556j5519p0330n9461L5016J20495
17271G60364K42489K86700K12940o5025j07859j77969k04041j93769j55274r2723
17261E05833n6182J7142l4699m2965m4817p097M4632N2276J8288o5792o4537P210
17249C29292J9950p7867k804p2093m2293q339p23Q3902K1113M9280M0479k051
17237C37846j3319j5008k4305L103j1650o2084M9444M091n3417P525K2201L3188
17225B77615K3318N838j7688J2699K0040L0628k0645l7414J7289m8758J3946L6484
$$ y = [1358504, 1136160, 1017303, 939068, 766392, 569665, 487868, 468526, 471377, 446986, 426496, 444806, 429500, 393333, 361854, 381540, 484347, 562112, 675157, 798098, 1003924, 1267615, 1306727, 1216332, 1085865, 923392, 801719, 750163, 734644, 664314, 604853, 639869, 760364, 1002853, 1289553, 1502493, 1437468, 1329609, 1151640, 947599, 753830, 598556, 505833, 449651, 466793, 432094, 389129, 344312, 337215, 381847, 434123, 452411, 386619, 322082, 329292, 349242, 271375, 268571, 196478, 154185, 145846, 145123, 229025, 250138, 299418, 339897, 337846, 324527, 309519, 285214, 288317, 276667, 214583, 264027, 268118, 214701, 222226, 244427, 277615, 300933, 306771, 289083, 301782, 321822, 352450, 331805, 294391, 311680, 262922, 276868, 313352]
17213C13352O8064P0819j4932k1387k4335m2358L7399L8431J6640O033L0158m674
17201D73210m6025j6397L4529L148J4884J0322J1716K3775k076o7994n91N0889
17189D89390j3100j02240m7052J0486L3077n05J51K1128k6387L6773K1305J5931
17177D38957K0286n1526m684J2362k6766m2176k5121M4490n1578m0681O1555Q4330
17165D19448j8366j9963K1498l7545j7805K0393L5223k6096n0682l1771J9508
17154C13842M9716K7457K38n6984J4358P3435L4737n3583j7068o7068m5330P8277
17142C52027k0407l197J306L2062p318J737N316l6837m3801k6210J515R630J6807
17129B82630P9887O0697J1285n585K737K0008J8837O895q986K0786j2194j6199
$$ y = [313352, 381416, 452235, 437303, 415916, 391581, 349223, 386622, 425053, 441693, 447726, 477884, 473210, 427185, 410788, 445317, 448465, 463349, 473671, 485387, 509162, 507086, 439092, 438501, 489390, 476290, 374050, 326998, 337484, 370561, 370056, 370207, 391335, 364948, 401721, 423026, 438957, 459243, 407717, 403033, 415395, 388629, 346453, 321332, 365822, 314244, 273563, 335118, 419448, 401082, 381119, 402617, 365072, 347267, 367660, 402883, 376787, 326105, 294334, 313842, 363558, 391015, 391253, 334269, 348627, 422062, 456799, 403216, 386148, 319080, 273750, 352027, 331620, 328423, 329729, 361791, 354473, 356210, 361526, 324689, 280888, 254678, 256193, 265823, 282630, 362517, 423214, 434499, 428914, 431651, 451659, 470496, 477391, 468405, 489191, 476997, 460798]
17117D60798n8352p5339m1542j4636j2865M0191j9271K4395L1288L7393O0214
17106D32274j042L4426K0407j5793j8431m5443o5246J1537L7135l8419O1841M1708
17094D54954K6295J28912J11458K5836Q1979Q3608P3992N7064O2926L3538P9065
17083A219627L4735p6653j23429r5201J3281K9185m8989k8978p7200J6110P5808
17072I38296R2413J12077P1505j2806k9601m081p020k6472j57489j36300m1211
17061G99311l0454o8726l3515L9280L1356K8984K2338J2690K9113O1924M9998
17050I42299l3191j4341m9066l8780J7402P6757J874M2407M2740m0136k3566K1658
17038I46057M3461O1077Q4923L8395J238J7514M4135P3211J13454O7417m4210
$$ y = [460798, 402446, 327107, 285565, 270929, 258064, 298255, 278984, 303379, 334667, 372060, 432274, 431232, 465658, 486065, 470272, 451841, 406398, 341152, 352689, 389824, 351405, 413246, 454954, 481249, 610161, 721619, 747455, 829434, 913042, 987034, 1044098, 1107024, 1140562, 1219627, 1254362, 1177709, 1054280, 959079, 972360, 1001545, 952556, 923578, 846378, 862488, 938296, 1030709, 1142786, 1214291, 1201485, 1171884, 1167803, 1160783, 1134311, 976822, 840522, 799311, 768857, 700131, 666616, 705896, 737252, 766236, 788574, 801264, 830377, 892301, 942299, 909108, 894767, 845701, 806921, 824323, 901080, 902954, 945361, 988101, 947965, 924399, 946057, 989518, 1050595, 1135518, 1173913, 1175151, 1192665, 1236800, 1310011, 1423465, 1490882, 1446672]
17027A446672k860J4637L8103m2374l783L7235M3948M9110Q8482n1358J3555J07954
17015A739321O0922o408n7486J2193Q5842R2325P1803L5800J9475K6651Q5387
17004B165825N5409N6845K9428M0317R8451R9707J28417J25288O9808K1807L2155
16993B923457J66184J51131J34487J57637K10926K22009P7893J36164K50126K85601
16983D715615K74119L02901M19262L78729L99324M60245M39417N41547O60395
16974H591554P25638Q52557J198448J454894J723323J878955J989864K138280
16966B0553513K375872K717004L474403M817913O606735Q937905J3242758K1146730
16958H3872833L5535281O0199163P6228848M3168608K5794594L3673355j6654895
$$ y = [1446672, 1443812, 1458449, 1496552, 1454178, 1450395, 1487630, 1531578, 1580688, 1669170, 1617812, 1631367, 1739321, 1800243, 1793835, 1736349, 1748542, 1834384, 1926709, 1998512, 2034312, 2053787, 2080438, 2165825, 2221234, 2278079, 2307507, 2347824, 2446275, 2545982, 2674399, 2799687, 2869495, 2891302, 2923457, 3089641, 3240772, 3375259, 3532896, 3743822, 3965831, 4043724, 4179888, 4430014, 4715615, 4989734, 5292635, 5711897, 6090626, 6489950, 6950195, 7389612, 7931159, 8591554, 9317192, 10169749, 11368197, 12823091, 14546414, 16425369, 18415233, 20553513, 22929385, 25646389, 29120792, 33938705, 40545440, 49483345, 62726103, 83872833, 119408114, 179607277, 255836125, 299004733, 324799327, 358472682, 341817787]
16951C41817787n8787359m8392696l6569862l4207780k1804302k690161J8128924
16944A57494551M5286288P8263856P0426408K3243869K8149141J1061287n9003236
16937C54922164p4754629n6569847n2032013m7548021l3373772k0759310j3067238
16930E6817334r024742o807288n290123m287413l468533k978506k641122k223569
16922B0096038k018858j785257j578672j401100j279186j148068r78872q86990
16914I019035p59684o63466n85554m71938l71263k87436l05480l57627k50828
16905D965759k02597k40187j64698j07444j43107k18369k18242k43868k22350
16896C204897j79493j98965j73502j74131k04883r3318l4583j1143O3752L9233
$$ y = [341817787, 283030428, 234637732, 198067870, 163860090, 142055788, 139365627, 157494551, 202780839, 281044695, 351471103, 374714972, 402864113, 413925400, 354922164, 280167535, 223597688, 171565675, 124017654, 90643882, 69884572, 56817334, 47792592, 40985304, 35695181, 31407768, 27939235, 24960729, 22319607, 20096038, 18077180, 16291923, 14713251, 13312151, 12032965, 10884897, 9906025, 9019035, 8259351, 7595885, 7010331, 6538393, 6167130, 5879694, 5574214, 5216587, 4965759, 4763162, 4522975, 4358277, 4250833, 4107726, 3889357, 3671115, 3427247, 3204897, 3025404, 2826439, 2652937, 2478806, 2273923, 2180605, 2146022, 2134879, 2198631, 2237864]
16886B237864q473q1696j05319k0073n5121q3213o8327m8034p1958j6727l0483
16875A648440j00306j3698k5918J064l7966j7757J1799K4676J088J0405J7743
16864A519570K132R339Q1887J9422L1573N3628R2223M6444M6394P4215P4604P1714
16852B123145R1439O8145M1434Q6678Q5256N2032m096M5418Q5990J61853J91688
16841C028982J65766J69621K85378L05257K19729R3249J39487K30970K10239K38847
16831E087525L11012L28424L87624M07661N46891P60238R48347R77917R81261
16822A0736900R90843R97796J230290J510359K042335K877333L959845N513651
16814B9859352P352962J0388954J6569936K8456732N0431321P1243475L6972627
$$ y = [2237864, 2229391, 2147695, 2042376, 2022303, 1967182, 1883969, 1815642, 1767608, 1695650, 1678923, 1648440, 1548134, 1534436, 1508518, 1509582, 1471616, 1453859, 1465658, 1490334, 1491422, 1501827, 1519570, 1521702, 1531041, 1612928, 1632350, 1663923, 1717551, 1809774, 1856218, 1902612, 1976827, 2051431, 2123145, 2214584, 2282729, 2324163, 2410841, 2496097, 2548129, 2544033, 2589451, 2675441, 2837294, 3028982, 3194748, 3364369, 3649747, 3955004, 4174733, 4267982, 4407469, 4638439, 4848678, 5087525, 5398537, 5726961, 6114585, 6522246, 7069137, 7829375, 8777722, 9755639, 10736900, 11727743, 12725539, 13955829, 15466188, 17508523, 20385856, 24345701, 29859352, 37212314, 47601268, 64171204, 92627936, 143059257, 214302732, 251275359]
16807B51275359k4007792l1773313k5895596l3795644l3960394k1900375j0262364
16800F9679881k174431M670411J3194566K7486402M9132604N0735526K70850l0581386
16792A82414423k5278685k6327661l2362460k6668315j6685261r767079n730974
16785C9593988l405884k260221j361631k09330J052642K512990M139577O033609
16777D6095740R230804J5627312K7824754M9386005O7115601K9448240k6099013
16770B18629443l0474737k5638561l3314077l2115558k0235979r227699j713141
16763F5909691M945528J3676074K8391885M9726090M7442766m543564l1277110
16756A74271360k5206841k7261625l2864631k6618289j6856854j0146485o331622
$$ y = [251275359, 227267567, 195494254, 169598658, 135803014, 101842620, 79942245, 69679881, 67505450, 72175861, 85370427, 112856829, 161989433, 212724959, 212995809, 182414423, 157135738, 130808077, 98445617, 71777302, 55092041, 45324962, 39593988, 36188104, 33927883, 32566252, 32356922, 33409564, 35922554, 40062131, 46095740, 55326544, 70953856, 98778610, 148164615, 215280216, 244728456, 218629443, 188154706, 162516145, 129202068, 97086510, 76850531, 67622832, 65909691, 70855219, 84531293, 112923178, 162649268, 210092034, 205548470, 174271360, 149064519, 121802894, 88938263, 62319974, 45463120, 35316635, 28985013]
16749B8985013m378215l468671k785636k148064j686072j347465j327049j236906
16741A0606935j048333r39177q57367p25899o11688o07334n70623m82985l98035
16732D365494l30651l43082l68484k78996j51873j69200k14932j06957r0064j21135
16722B190120p8602j43004r0572j13459j76766j40483j14235r6705l1373l1452
16712A173469q8103q5962j5155K5168q38L5375m8290p8672j16855l7662l8964
16701G23511o9466p0079N315J0696N017M1449K8053l7706o9284j6588m9622l8773
16689D62523q2570K231K3417J3489M2912O3965j0621q0999q2949j07326j5715
16678B28357P895J8401R4342j4660J759q719l1578N2783O2126l1771j33584j01173
$$ y = [28985013, 24606798, 21138127, 18352491, 16204427, 14518355, 13170890, 11843841, 10606935, 9558602, 8619425, 7762058, 7036159, 6424471, 5817137, 5246514, 4763529, 4365494, 4034843, 3691761, 3323277, 3044281, 2892408, 2723208, 2508276, 2401319, 2311255, 2190120, 2111518, 1968514, 1877942, 1764483, 1587717, 1447234, 1332999, 1236294, 1204921, 1173469, 1085366, 999404, 984249, 1009417, 1008579, 1043954, 995664, 916992, 800137, 762475, 723511, 654045, 583966, 589281, 599977, 604994, 646443, 674496, 636790, 567506, 550918, 501296, 462523, 379953, 382184, 405601, 419090, 462002, 525967, 515346, 434347, 351398, 244072, 228357, 236252, 254653, 348995, 334335, 336094, 327375, 295797, 348580, 410706, 378935, 245351, 144178]
16666A44178j4926j5799R7866K5895k0703l9213J6408K2207n2988j3240j0938
16655A38747O405n9950j816J31090R9460K6309N92j2946l1546m0118j42813q6190
16643B7224K8245J095j4033l4329N8363J05925K483j4704M8410J351l0631p341
16631A72058o7210l8392L35l8422n6703k492M1767p5474q4243k7570K9224P4857
16619g2265M0957K0418J46045J14172k47J3585m189p8978r4251j7780q2083Q717
16607e899j0025n630k0434M2542J24875M3026j8852n8260o2996o0972K8491K2471
16595A8337O2187N5834k5564L9217j7636o4474j00008q8109J0851R801K5309K5650
16583d8605K3954M3383P4837M8295l2758n6966L211m386l6348j6757r271l8954
$$ y = [144178, 129252, 113453, 211319, 237214, 216511, 177298, 193706, 215913, 162925, 149685, 138747, 145152, 85202, 83386, 214476, 313936, 340245, 340837, 327891, 296345, 256227, 113414, 27224, 55469, 56564, 42531, 8202, 66565, 172490, 174973, 160269, 208679, 210030, 179399, 172058, 104848, 66456, 66791, 28369, -28334, -30826, 10941, -64533, -148776, -176346, -147122, -72265, -31308, -10890, 135155, 249327, 249080, 262665, 258476, 179498, 85247, 67467, -14616, -5899, -15924, -21554, -41988, 554, 125429, 168455, 149603, 91343, 28347, -32625, -4134, 18337, 80524, 136358, 110794, 150011, 132375, 67901, -32107, -120216, -109365, -99564, -74255, -48605, -24651, 18732, 93569, 141864, 109106, 52140, 55351, 50965, 14617, -2140, -11411, -50365]
16571e0365l5112j0069P0308j746j0014K5732L7551j4848j1857p762M5994l2280
16559E532m4936k2482L9266K8183n336o5166j8849P8672K1242j5238K633m9747
16547d6226N221M7430K7025o423k1864j7912N838k4080j7739m4572M185J0856
16535g8261k947K1221n108k4307K4602M7994K8185J34K5070J4986M8146k1824
16523G7891m7945m7100p3086k8141k9604O1540K6936R815p564K3376K1480j5810
16511b8212m3394k203K0095m364J0739l9877N2928J0608L090P8433M5562K9682
16499A33087k6678n5872m8680m9768l8572k7557k43j793O540K6670J5556K4174
16487d3136L0772L6416k5268m1015k7737l7008j092l6482m4667O804P6278l4230
$$ y = [-50365, -85477, -95546, -25238, -26984, -36998, -11266, 26285, 11437, -420, -8182, 37812, 5532, -39404, -61886, -22620, 5563, 227, -64939, -83788, -5116, 16126, 888, 3521, -46226, -41005, 6425, 33450, 27027, 5163, -12749, -6911, -30991, -48730, -93302, -89117, -78261, -81208, -59987, -65095, -89402, -64800, -16806, 11379, 11513, 36583, 51569, 99715, 77891, 29946, -17154, -90240, -118381, -147985, -86445, -59509, -49694, -57258, -33882, -12402, -28212, -71606, -73809, -53714, -58078, -47339, -87216, -34288, -23680, -20590, 57843, 103405, 133087, 106409, 50537, 1857, -47911, -86483, -114040, -114283, -116076, -109536, -82866, -67310, -43136, -12364, 24052, -1216, -42231, -69968, -106976, -108068, -144550, -189217, -182413, -106135, -140365]
16475a40365j9156M1744M5829k44L4362l3369m4197R209O8128N2253K6435L6231
16463G6860K888o04k2445p292k0998p150m5054O002K5992R158o511O0748N0199
16450A21793O99m5435j5949m6055k2695m0412j2491P72K4951L4722k6253J4929
16438a1424R823j0951j3999O5012J2477N9051Q0670L5943L7167J25098J72642
16427E61509K59658M02030L65325J75558K36899O3315k38730l11918k48174k63188
16417A002284k47941r8702M0487J27670L48139L63805K27237J22145O0332k05464
16407A739992l50099k78103k74387k29224k10465n4510o5568l9559Q325l4408
16397B11994l1902p1811J776J5524j6789k4681N671K9836K794l1634m1156p3958
$$ y = [-140365, -159521, -117777, -71948, -72192, -37830, -71199, -115396, -106187, -38059, 14194, 40629, 76860, 79748, 79144, 56699, 49407, 28409, 21259, -23795, -17793, 8199, 17357, 10846, 71594, 121793, 122492, 77057, 61108, 15053, -7642, -48054, -60545, -59773, -34822, -100, -26353, -11424, -1601, -12552, -26551, 38461, 50938, 109989, 190659, 226602, 263769, 388867, 561509, 821167, 1223197, 1588522, 1764080, 2000979, 2064294, 1825564, 1513646, 1265472, 1002284, 754343, 655641, 696128, 823798, 1171937, 1535742, 1762979, 1885124, 1945456, 1739992, 1389893, 1111790, 837403, 608179, 397714, 343204, 277636, 238077, 246402, 211994, 180092, 108281, 110057, 125581, 108792, 84111, 89782, 119618, 122412, 90778, 49622, -24336]
16385b4336l1106q389K5229j2195n2450l0006L4744P2388J9424q357m7344j7626
16373h0024l3541J0342O4135l809j0228l4361j4651k9417j8783j9222J4292M9510
16361a05757K3517N1890J107j9932k484k7653q305L684n512l9070k0091o9665
16349b18271k4698M3784J08001N4603j2094k3857n5172l1044J7084J4983N1667
16338g5014j4051m7005L1850L5641j3141M2130L9498j1751m1682K4720P231j0980
16326c2554k2877k2719K0740K6543j0105j8513O604K7954r08L4556R94p7523m3808
16313a11616k7M7766K0185k3220n599k5219M3529L5031j0595k2696M3336O6673
16301E7548k5726k273o72M4720P8566J32605J41259K39392K95200J94859l8536
$$ y = [-24336, -55442, -63831, -38602, -50797, -103247, -133253, -98509, -26121, -6697, -15054, -62398, -80024, -113565, -103223, -39088, -42897, -53125, -87486, -102137, -131554, -150337, -169559, -155267, -105757, -82240, -30350, -29243, -49175, -51659, -79312, -87617, -83933, -89445, -128515, -148606, -218271, -242969, -199185, -91184, -36581, -48675, -72532, -127704, -158748, -141664, -126681, -75014, -89065, -136070, -104220, -68579, -81720, -39590, -92, -11843, -53525, -28805, -21574, -32554, -55431, -78150, -57410, -30867, -40972, -59485, -52881, -24927, -25835, 8721, 9715, -67808, -111616, -111643, -63877, -43692, -66912, -72511, -97730, -54201, -19170, -29765, -52461, -9125, 57548, 31822, 29549, 28877, 73597, 152163, 284768, 426027, 665419, 960619, 1155478, 1116942]
16290A116942r3263j18307j25749j29943j95430r8743p957J7506R3102O2871L19469
16279H40498K26192l9548j39792j47488j63848j36127r0599r3420r6779p4108
16269H4981n0611n9928L0533J1288N0633O5616k824M6870N8797J15960J07568
16258D58883K60642L79678J17623j46359j74689j39840j76874j45449p7094k293
16248C54228L8768J4698N1347J85060K80867J62783j9297j51685j33743j34111
16238F48915j89455j92898j40100k2036k1534J855q4616q3697L6033J1558K7015
16227h960N3778p2437l7412N1051M0511N9603k7738q0017j6272K2254j0636j0901
16215c7176L1862l1214Q429j0231m4456m5188j4288K3832N1372K2044m8857K2278
$$ y = [1116942, 1023679, 905372, 779623, 649680, 454250, 355507, 347550, 365056, 458158, 521029, 840498, 1066690, 1027142, 887350, 739862, 576014, 439887, 349288, 255868, 159089, 84981, 34370, -25558, 4975, 16263, 66896, 132512, 129688, 176558, 235355, 351315, 458883, 719525, 1099203, 1216826, 1070467, 895778, 755938, 579064, 433615, 356521, 354228, 392996, 407694, 459041, 644101, 924968, 1087751, 1068454, 916769, 783026, 648915, 459460, 266562, 126462, 104426, 82892, 84747, 131, -83566, -47533, -35975, -8960, 44818, -27619, -65031, -13980, 26531, 86134, 58396, -21621, -37893, -15639, -26275, -37176, -5314, -36528, -28099, -38330, -82786, -127974, -142262, -118430, -67058, -45014, -93871, -71593]
16203g1593M0415J1577k9525l5400J8512K6606p213n021N5377j1844l1237K8110
16191a1236k5455o1995M6834M5443O465q535p462k3723k8329q551j4474P8789
16179a2229O20l2261m9j9784K8345Q292k0934l4017R0643Q1655n5891n1738R188
16166h160k6927m9003j5811k0069j2463R3634J9015j0950l0970j6301O286k5990
16154i7709j9606P2130J206o9747r348j3166O0770N7268r2588k1348K7259j0751
16142a15630L0581Q3858J5646j7856l0922N928m2346r0444n0836j5570l3770O3693
16130a97668P6297N3564j7672j2390K4792K1204l2572m5237q192J8206K8369N8704
16118c2595O641r382j1186P251k2860l6952k7996l295J6182O0117j1726j7373
$$ y = [-71593, -31178, -19601, -49126, -84526, -66014, -39408, -46621, -51642, 3735, -8109, -39346, -11236, -36691, -98686, -51852, -6409, 56, -8479, -15941, -39664, -67993, -76544, -91018, -12229, -11609, -43870, -43919, -63703, -35358, -27066, -48000, -82017, 8626, 90281, 34390, -17348, -8160, -35087, -84090, -99901, -119970, -132433, -38799, -19784, -30734, -61704, -78005, -71719, -97709, -117315, -45185, -43979, -113726, -123074, -136240, -75470, -18202, -110790, -132138, -104879, -115630, -85049, -1191, 14455, -3401, -34323, -28395, -70741, -161185, -212021, -227591, -261361, -197668, -121371, -67807, -85479, -97869, -73077, -51873, -84445, -129682, -137874, -119668, -91299, -32595, -25954, -35336, -46522, -39271, -62131, -99083, -127079, -130374, -114192, -54075, -65801, -83174]
16106h3174R575K6105r027l3762Q863J12492L2482l1099p4277l8544k817J0067
16094g3116l9386K0080j0940J4487R453J1038K7843j2175r120N1775P087j1190
16082a4164l3978O581l1594m8702k2075L4881j8789o980O082O6952L3599J1942
16070a6245m533m4741L3397P493n0505k858J1892p172k0391J062n6777j2501K7045
16057a34834q884J4328O0661Q558M0400J2725p1790o4489K6593Q939M5357m359
16045f6795j4726Q689M7034J725O391K9960l1463n2500m4986J3914J0270Q567
16033h3920J507J5919k8756Q975R6088k2085o8506l5139n420K6278M399o659N3446
16020d3873K0081L0463j0238q1212o3403L1274P5910P487N7375K0419l0798n0924
$$ y = [-83174, -73599, -47494, -56521, -90283, -81420, 31072, 63554, 32455, -41822, -80366, -83183, -73116, -112502, -92422, -103362, -88875, -79422, -68384, -40541, -52716, -61836, -10061, -2974, -14164, -48142, -41561, -73155, -121857, -143932, -109051, -127840, -134820, -128738, -61786, -28187, -16245, -20778, -65519, -32122, -24629, -75134, -77992, -66100, -73272, -93663, -92601, -149378, -161879, -134834, -143718, -129390, -68729, -60171, -19771, -7046, -78836, -143325, -116732, -107793, -62436, -66795, -81521, -72832, -25798, -24073, -17682, 12278, -19185, -71685, -116671, -102757, -92487, -83920, -82413, -66494, -95250, -86275, 9813, -12272, -80778, -115917, -121337, -95059, -90660, -97319, -43873, -23792, 6671, -3567, -84779, -148182, -116908, -40998, -33511, 23864, 44283, 13485, -37439]
16008c7439k1285K5865q263j8952O7616O0295l42k5363k4011J2546M3754J3856
15996H8277k4257K3492K6353o5549o7870M504o4060m1937l8005O8097K0973k5405
15984i5387m0399l4666L2942Q200K0396J014P213n258m2394j5367L130K5772J7612
15971a17192l3521l011j0084M4068O5514K6193L3391M0877k3716N468J0447Q981
15959D7415J1949O990j9482J1516k3596n0526k2765N555L2712L0456j2235n1650
15947c3661m8165R858L5422n5440n030N2748L2876Q6885p4294l5914o62K2887
15935a2490J5228k4784L896l0959K4595m0184O086J9425p4395l4231L4285N1717
15923f1811O988J5398J2930p6480l4664L2441K3543N7678L4312j0104o1789j6555
$$ y = [-37439, -58724, -32859, -41122, -60074, 7542, 67837, 67495, 42132, 18121, 30667, 74421, 88277, 64020, 87512, 113865, 48316, -19554, -15050, -79110, -121047, -159052, -90955, -69982, -95387, -135786, -170452, -137510, -129310, -108914, -107900, -100687, -105945, -148339, -163706, -160576, -134804, -117192, -150713, -153724, -163808, -119740, -54226, -28033, 5358, 46235, 22519, 27987, 38434, 47415, 59364, 66354, 46872, 58388, 34792, -15734, -38499, -32944, -232, 30224, 17989, -33661, -81826, -71968, -36546, -91986, -97016, -44268, -11392, 75493, 1199, -34715, -35377, -12490, 2738, -22046, -18150, -49109, -24514, -64698, -58612, -39187, -113582, -147813, -113528, -61811, -54823, -39425, -26495, -102975, -137639, -105198, -81655, -23977, 10335, 231, -61558, -78113]
15911g8113k8723o870L1254J478K4448n7350L111P7972K9447p5751k7545O1594
15899d5048L9951l4771k6111O138j8667K1553O8211j5278J2875l2757l008K0756
15887f156o653n0403o0162n8861j1625L6306M2420M7415K3793l147M4374L6487
15875C3788L9317j3439L6749j7173K2667r1766m7078L347l9671o9855P7834J05583
15863D0303J5757l4488m4442n6768j0037l734L0977l31J0980j6164j4218L2207
15851d9958K5813M7369l5455m6911o988L2842L4848L3729J7842M6449n6372n9246
15839a6038l7254L7205M545O47J7340n452j2657l525l5154N7916j6421n7320m0585
15826a06753j7917O9931P6409j2275j0608j1774K7922l2430k5711j00355k4487
$$ y = [-78113, -106836, -113706, -82452, -80974, -56526, -113876, -110765, -32793, -3346, -79097, -106642, -45048, -5097, -39868, -65979, -59841, -78508, -56955, 11256, -4022, 8853, -23904, -26912, -6156, -12809, -63212, -123374, -182235, -193860, -157554, -115134, -67719, -43926, -47073, -2699, 33788, 73105, 59666, 96415, 79242, 101909, 10143, -36935, -33588, -73259, -143114, -65280, 40303, 56060, 21572, -22870, -79638, -89675, -93409, -62432, -62763, -51783, -67947, -82165, -49958, -24145, 23224, -12231, -59142, -66130, -33288, 1560, 35289, 53131, 99580, 43208, -16038, -53292, -16087, -11542, -10895, 6445, 993, -11664, -15189, -50343, 7573, -8848, -66168, -106753, -124670, -54739, 21670, 9395, -1213, -12987, 14935, -17495, -43206, -143561, -168048]
15815a68048J105J9391L7570J05097l7512p996K8010k8766j0138m5657m7961N9748
15803i5157J4036J4155P0667j106M406M3001J2025k2697r511o8264J9254P16r806
15790b8281q1k6688k8311L833k8940J1175M0496n571k538l8414j6584r888K6114
15777a03678O4723Q7740R377q884L4210J036p6602l6446l5770L4014K6537r718
15765a3461O238O6037o541p2072n80l936m3629r278K0543M5562L0124j7585N884
15752G306j7458n966p409J8490K5353m0491j8260R857n765l1094Q102j265m5907
15739a04507M576K0888J6025J1186M5146K1790k0070j6074n283L1369O3265k7219
15727D1092j7620j9100n073m676L6827K5325j1872m1405j3780K7145k4013o1903
$$ y = [-168048, -166943, -147552, -109982, -4885, -42397, -50393, -22383, -51149, -61287, -106944, -154905, -95157, -81121, -66966, 3701, 2595, 7001, 50002, 62027, 39330, 29819, -38445, -19191, -18475, -28281, -28362, -55050, -83361, -79528, -108468, -97293, -56797, -62368, -64906, -103320, -119904, -129792, -103678, -38955, 48785, 58162, 49278, 83488, 84524, 7922, -28524, -64294, -30280, -3743, -13461, -7223, 58814, 52273, -19799, -20379, -24315, -67944, -77222, -56679, -11117, 19007, 1422, 7306, -10152, -16118, -23527, -5037, 20316, -20175, -38435, -28578, -34343, -65437, -57335, -58600, -104507, -99931, -79043, -63018, -51832, -6686, 15104, -4966, -21040, -26323, 5046, 68311, 41092, 23472, 4372, -701, -5377, 31450, 56775, 44903, 3498, -10282, 16863, -7150, -69053]
15715f9053J5433O175O875J6650Q9492k1420l9187j4600J6836M0870K0979j9524
15703D9526k5181K821l8443p6127Q579K9911p072J1544k3353j0907j4698N6612
15691c6788K8338J2654J7859m9729p2371N2588k4984K7547Q2129l5601n7503m238
15679f0099p333J5450M5659K5530n096m8000o5465p3443K6939N4842N3952L0165
15667f899J1284M4986L034l4354l1685j6189p78j56k9478L650P1997J8660L775
15654C7847p464j2704n5561p0700L1776J8364p420M741M1852j2714j8899n9232
15642a10114k5290K8763N7730J54k564K6354m864k1101N3947j2051m8399j0888
15630f8323J558J743j5419J9604q595L6961O5494o25m628m0297m994J7087L992
$$ y = [-69053, -53620, -47445, -40570, -23920, 65572, 44152, 4965, -9635, 7201, 48071, 69050, 49526, 24345, 27166, -11277, -87404, -78825, -48914, -55986, -44442, -67795, -78702, -93400, -36788, -8450, 4204, 22063, -27666, -100037, -47449, -72433, -44886, 37243, 1642, -55861, -60099, -67432, -51982, -6323, 19207, 14111, -33889, -99354, -172797, -145858, -91016, -37064, -6899, 4385, 49371, 52405, 18051, -13634, -29823, -30601, -30757, -60235, -56585, 15412, 34072, 37847, 30383, 17679, -37882, -108582, -76806, -58442, -65862, -61121, -19269, -31983, -50882, -110114, -135404, -106641, -48911, -48757, -51321, -24967, -29831, -50932, 3015, -9036, -57435, -68323, -66765, -65022, -80441, -60837, -69432, -32471, 33023, 32398, 27770, -12527, -17521, -434, 3558]
15617C558J4974k406o289K2596K8530Q999m1086j7784K5355k7883q2044o867P5531
15604d816N1041m8713m6270K3306p314p788q854N3075l2108J2780L6348n572q1380
15591f6265L4996r65P145M1526L1909M695n927J938J9876O884j8014K6755j7622
15578F6931p0474R67o415J8680j8754m6292J3840j7695J0398O22J7108J0593N0716
15565C0225j8017l9344L89K3700R554l0845l2832J1491j987J9905n254M7358O9770
15552H4113L0564k7946J7408k0952p6708o8499M2854q343k4330J0126J1032J6462
15540a4219j3432n4899J5440N4052L0655K6504k8918J6646l5199r3468J579P0236
15528b5023M373P6268K7999p314o504j00635m032O8405P6879K051j6019n7201
$$ y = [3558, 18532, 16126, 9837, 32433, 60963, 69962, 28876, 11092, 36447, 8564, -73480, -80347, -4816, 46225, -2488, -48758, -25452, -32766, -40554, -49408, 3667, -28441, -15661, 20687, 15115, -66265, -31269, -32234, -25089, 16437, 48346, 53041, 47114, 49052, 68928, 75812, 57798, 84553, 66931, -3543, -2576, -8991, 9689, -9065, -55357, -41517, -59212, -48814, -48192, -31084, -20491, 30225, 12208, -27136, -26747, -3047, 6507, -24338, -57170, -45679, -47666, -27761, -33015, 14343, 84113, 114677, 86731, 104139, 83187, 6479, -62020, -19166, -27509, -51839, -41713, -30681, -14219, -27651, -82550, -67110, -13058, 17597, 44101, 15183, 31829, -3370, -96838, -95259, -25023, -20650, 55618, 83617, 76303, 69799, -30836, -34868, 33537, 110416, 112467, 96448, 39247]
15516C9247p957j3260j5157K8314L3154k4719j258J797k8863k8450l221m0688
15504f1061k3669M3209J3528Q4854m9512j9959j6156j5141J5490L6217N5309Q606
15492G1715K43K7116l2575P995j602J9502j3322m0348N6146L8245q5175l9364
15480H576M9803J9246l4900k8057N7308L2893J2633O131J552k004j9044p3270
15468C0867k1589m616q70K6084L3093N4729M5083j8568n1318l0248m3052o8086
15456d8491l5901J7104L3170l0954J5659j4867N4742O148k426J7132J7552L2457
15444F1325p449r5004J958K3216M4216Q6821l7137o9907l343n2208l4924L3772
15432d8664N3645M154j5486m4532L1959N979J4754P8780J6412K4784L6694k1525
$$ y = [39247, 31290, 18030, 2873, 31187, 64341, 39622, 38364, 40161, 11298, -17152, -20373, -61061, -84730, -41521, -27993, 56861, 7349, -12610, -28766, -43907, -28417, 7800, 63109, 71715, 71958, 99074, 66499, 74494, 72892, 92394, 79072, 38724, 94870, 133115, 47940, 8576, 58379, 77625, 42725, 14668, 71976, 104869, 117502, 123633, 125185, 123181, 104137, 30867, 9278, 4662, 3792, 29876, 62969, 117698, 162781, 144213, 92895, 62647, 19595, -48491, -84392, -67288, -34118, -65072, -49413, -64280, -9538, -3390, -5816, 11316, 28868, 61325, 53876, -41128, -39170, -15954, 28262, 115083, 77946, 8039, 4696, -47512, -82436, -48664, 4981, 9135, -6351, -50883, -18924, -12945, 1809, 80589, 97001, 121785, 158479, 136954]
15420A36954l3448J2885n4329m3296K3117n5577j3154Q872J0685L3007L3886k2915
15408C6687p3159p3400j1956R0141N8761K2215K6283m4718L0095L2350M1K8259
15396A21599j3382k8891K9035j1680n5548P856J5371r9335k0775L9514N5867l8720
15384I11k4828l1873k3328M9152N713j520J7411k5078j755K8837P6771L4802L8222
15371A43437J7582o4603q637j0298k2964o514j1411L655J6602n8577k1538M1583
15359A8317M0964J9880p6981n8269O1332O2978l1041l3743j6633J7561M1851r4965
15347d8749j8707M0652L2180N0598L2393m8812o5254J2408j8908M8292N2563n7892
15335A0764P426j9740l2180Q9545O8581L2849m7466m6060J0935j3629n8501n3899
$$ y = [136954, 103506, 116391, 62062, 18766, 41883, -13694, -26848, -17976, -7291, 25716, 59602, 36687, -36472, -109872, -121828, -31687, 27074, 49289, 75572, 30854, 60949, 93299, 93340, 121599, 108217, 79326, 108361, 96681, 41133, 48989, 64360, -34975, -55750, -16236, 39631, 911, -23917, -55790, -79118, -29966, -24253, -25773, -8362, -33440, -35195, -6358, 70413, 105215, 143437, 161019, 96416, 87779, 77481, 54517, 48003, 36592, 40247, 56849, -1728, -23266, 18317, 59281, 79161, 2180, -56089, 5243, 68221, 37180, 3437, -13196, 4365, 46216, -48749, -67456, -26804, 5376, 55974, 88367, 39555, -25699, -13291, -32199, 16093, 68656, 10764, 18190, -1550, -33730, 55815, 124396, 157245, 109779, 63719, 74654, 61025, 2524, -51375]
15323e1375M6409M0155n5571K1946M5361k9837j6176K5184k697P5157k3808K861
15311G7609O5328L3745m8787n8758m7816k8753J4920L8677L322l074j3178j1499
15299B1736o184M760j5906j0367N4433J2835k3485J4753l2695j2713L1743m820
15287C4090J5285L7914k1119l2044n048o455l6211j3372r78J5975k0557L5969
15275C449L8002j5866k5062K8267M1598k8772k9297R524M5072L401J4571J8374
15263A03261m3171r462O3579L3500o3003l8584j0608rm5974p936O1587O2703M0041
15250A45924q603k5436n3104j2040n8649l7813L8599O473k926J128O5851N880
15238F5284l470o243o3113M823K7045j9924K4437N3146N0904O5297k3354m6227
$$ y = [-51375, -4966, 35189, -20382, 1564, 46925, 17088, 912, 26096, 23399, 98556, 74748, 77609, 142937, 176682, 127895, 69137, 21321, -7432, 7488, 46165, 49487, 46413, 33235, 21736, 15552, 20312, 4406, -5961, 48472, 61307, 37822, 52575, 19880, 7167, 38910, 34090, 49375, 87289, 66170, 34126, 29078, 22623, -13588, -26960, -27938, -11963, -32520, 3449, 41451, 25585, 523, 28790, 70388, 41616, 12319, 21843, 66915, 70316, 84887, 103261, 60090, 50628, 114207, 147707, 84704, 46120, 35512, 35503, -10471, -18407, 43180, 105883, 145924, 137321, 111885, 58781, 46741, -11908, -49721, -11122, -4649, -7575, -6447, 59404, 65284, 61814, 55571, -7542, -2719, 24326, 4402, 28839, 81985, 132889, 198186, 174832, 128605]
15226A28605o7017p0272j5549J2037j0407M039N314j1121L5923J19538Q084m2431
15214I6743j2863Q639M9884p5802m10M2623Q681p6090L7869Q7248L7111k5426
15202A78207j6175o540k7262K9263m7161o3126j7949l335M4699Q657l8239k86
15190D0753k2281M3906P3503n061Q019l197o1217k5960J9992K2034l512o017k3651
15177E7311j2760J3762J8710r9047p2334N3426L5900l6390p6538Q386R2274L2751
15165A5451M7955n689m4798N7444O3594K9467k7201j9533M2564j923l7089r262
15153A10980n6619j19293L0000K5513m0540j5987L6195L2782k132p902K3254K4511
15141D0762M893k6528j6335K9047K7732m1704j2156P073M3263P6552j0334k1506
$$ y = [128605, 61588, -8684, -24233, -12196, -22603, -18564, -13250, -24371, 11552, 131090, 139174, 96743, 83880, 92519, 142403, 66601, 66191, 108814, 117495, 41405, 79274, 166522, 203633, 178207, 162032, 155492, 128230, 157493, 110332, 47206, 29257, 25922, 70621, 79278, 41039, 40753, 18472, 62378, 135881, 130820, 138839, 135642, 74425, 48465, 68457, 90491, 86979, 80962, 57311, 44551, 58313, 77023, -22024, -94358, -40932, -5032, -41422, -117960, -109574, -17300, 15451, 63406, 57717, 12919, 70363, 133957, 163424, 136223, 116690, 159254, 157331, 120242, 110980, 54361, -64932, -34932, -9419, -49959, -65946, -29751, 3031, 899, -7003, 16251, 40762, 45655, 19127, 2792, 31839, 59571, 17867, 5711, 12784, 56047, 132599, 122265, 100759]
15129A00759J9164p883l4980j2150J5525m6127n5527J4451L7538J7358O2571J9238
15117A29937o867m9360L7378J7933o062l8622l3849k0700j5902M4171K3527J6582
15105I8166j9367J2198K1106j8912j4146M989J1304O5738N8952p800l4430l115
15093A74683o5104j8714m0631n9406K3841J03723O3794j6387k6015m4015m0128
15082E5641J0787r711j9141L0332M1943L4388J2360j9720n7251k8352L3619L1941
15070A16836K8464q37q93K3563K592l0147K2839J2086K4974L0197k2045l7517
15058A70112n7652n5152K694L5470N2333m681J6301L2035q375R367J87o0634l2819
15045I9186P545q7291j4297J3868P9322J8559k5638K6843O640k8421L4924L8227
$$ y = [100759, 119923, 112040, 77060, 64910, 80435, 34308, -21219, -6768, 30770, 48128, 110699, 129937, 123070, 73710, 111088, 129021, 122959, 84337, 50488, 29788, 13886, 58057, 81584, 98166, 78799, 90997, 112103, 93191, 79045, 84034, 95338, 161076, 220028, 212228, 177798, 174683, 109579, 90865, 50234, -9172, 14669, 118392, 182186, 165799, 139784, 95769, 55641, 66428, 56717, 37576, 67908, 109851, 144239, 156599, 136879, 79628, 51276, 84895, 116836, 145300, 144463, 143570, 167133, 169725, 139578, 162417, 174503, 199477, 229674, 207629, 170112, 112460, 57308, 60002, 95472, 147805, 143124, 159425, 191460, 183085, 192452, 192639, 132005, 99186, 106731, 19440, 5143, 19011, 98333, 116892, 91254, 118097, 124737, 96316, 131240, 169467]
15033A69467j8085l5285n7671o2532k791K9574M9478Q7883L6870o1241r993r026
15021A16648k9354j0850N8287M3144n413k7807n8591m8829j0727n2161J7479L3823
15009B5649M171K42r655J9510j207j5487K0076O3900R8585k6018o9636K3288L322
14996A36740k6241K4896j671l5850M4971M3516m323l4688m6197M2234M8273j8644
14984A73016l9668p5449m8482L4904N6602M22L075N2613J9278j2610m007l9546
14972A20148l6650J6054l601k329k4082m646M13L7397k9264n0365M859Q6418K7153
14959A41505J3184j3947j789k3679R325L3241j4355l3199p8689q675N7109j3796
14947F6235N0876M3478j9564J7179j611l0618M4687m9493P7K7536M0435j3551
$$ y = [169467, 151382, 116097, 58426, -4106, -6897, 22677, 72155, 160038, 196908, 135667, 125674, 116648, 87294, 76444, 134731, 177875, 172462, 144655, 86064, 37235, 26508, -25653, -8174, 25649, 29820, 30062, 20407, 39917, 38710, 23223, 43299, 107199, 205784, 179766, 110130, 133418, 136740, 110499, 135395, 133724, 97874, 142845, 186361, 182038, 147350, 101153, 143387, 191660, 173016, 133348, 57899, 9417, 44321, 100923, 101345, 104420, 157033, 176311, 163701, 159694, 120148, 83498, 99552, 95951, 93622, 69540, 64894, 65307, 102704, 73440, 23075, 27934, 114352, 141505, 154689, 140742, 138953, 115274, 124599, 157840, 143485, 110286, 31597, 22922, 80031, 66235, 117111, 160589, 141025, 158204, 156593, 125975, 170662, 121169, 121246, 148782, 189217, 175666]
14935A75666l2393J731j6829J2325K9897L2593p1241k0948l7242k8693J23061
14924A67927J0340k0570O660k2982J0572K4785L6995L4353n3607o2697n719M79
14912A26536l585P331j2452M345k468N0315K276m9883m75k8244l4678k9305N8288
14899H8001L5227j3963P485K2750K1056L014L5706k2511q0413m649M6570K9512
14887A67785K9736j4299l5855l6363j7675j6662J3933p2213L9028K1621j6177
14876F2859N662L2228k9274L9921O1106K6806p336j0709k6267j1419J5566q3101
14864G6042J8217K3078J9804P4191R286M451m3070l6203k3885j7323J8439Q7515
14852B10542M0028k9721m9744k0340K6069M4547L1365j2892l5221l045n0156l5317
$$ y = [175666, 143273, 145004, 128175, 140500, 170397, 202990, 131749, 110801, 73559, 44866, 167927, 178267, 157697, 164357, 141375, 151947, 176732, 213727, 248080, 194473, 131776, 126057, 126536, 122951, 130282, 117830, 122175, 119707, 170022, 172298, 122415, 121940, 93696, 59018, 29713, 88001, 123228, 109265, 116750, 139500, 160556, 163570, 199276, 176765, 96352, 91703, 138273, 167785, 197521, 183222, 147367, 111004, 93329, 76667, 90600, 18387, 57415, 79036, 62859, 68521, 100749, 71475, 111396, 172502, 199308, 191972, 181263, 154996, 143577, 159143, 76042, 94259, 117337, 137141, 211332, 220618, 225069, 181999, 145796, 121911, 104588, 123027, 210542, 250570, 220849, 171105, 150765, 176834, 221381, 252746, 239854, 204633, 201588, 151432, 116115]
14840A16115l2331k122M1600L274K6570N5568j4137n805M8160j712m8750k7954
14828A58476k0159m2343J963J3062P672k2697O9477N0717k6658O9657K2948J4298
14816B96413M4402n8026m0131l4766p983q874K1772n035l3124k847L437j2373
14804A62865M920k0550o518J3687n387L5717N0537K7572L0861J2437p368k4039
14792B74734k3778O44m633k0129l3934K6228K1258k4348m4093m1092l9764L899
14780I4992O710N4590O4397M4967J4329k5809k2103L050K5070K7281J9803L2439
14768C39716l3265j06546j8011l7376Q5077N8000q827l5739j0754O634L184j2230
14756B29863N053L9128o275l1564l1114k9563J2704P9752M3479n4642q1553n491
$$ y = [116115, 83784, 81662, 123262, 126536, 153106, 208674, 194537, 188732, 236892, 235180, 186430, 158476, 138317, 95974, 97937, 110999, 118671, 95974, 165451, 216168, 189510, 259167, 282115, 296413, 340815, 282789, 242658, 207892, 199909, 191035, 212807, 207772, 174648, 171801, 175238, 162865, 167785, 147235, 140717, 154404, 149017, 184734, 235271, 262843, 293704, 306141, 298773, 274734, 250956, 251600, 246967, 226838, 192904, 219132, 240390, 216042, 171949, 130857, 91093, 94992, 101702, 156292, 220689, 265656, 279985, 254176, 232073, 235123, 260193, 287474, 307277, 339716, 306451, 199905, 181894, 144518, 229595, 287595, 278768, 243029, 232275, 238909, 242093, 229863, 234916, 274044, 267769, 236205, 205091, 175528, 188232, 267984, 311463, 256821, 175268, 169777]
14744A69777l6442q351K7776O0626K0059k5038m2514j2718N61M5246Q1754K342
14732B83078j6193J8814n2111J4287Q2388k0562l56M7863j8110K594J43k298m6029
14719B93508m8530q0906l1455l9107Q9600P1647L0746j9177Q8k9538J4410l4629
14707B16657m6984k7668M1036L9070M704q91k3059K13j5572P0714L7912K3692
14695C19824m6890j9234n6123k5218J1545J02362M687J7037k5347j1751k5764
14684B45128K0216J8604k4719N2610L6257m2025o9403m0384l7250R315K5929N2978
14672B47256M9067k2120m6122M954K7085L390l1822k4711k1115K9158j7558j0711
14660A86751m806Q1187L6043K7549k4278J9604M560k0019n0412l7975m6722N1462
$$ y = [169777, 133335, 124984, 152760, 213386, 233445, 208407, 165893, 153175, 153736, 198982, 280736, 283078, 266885, 285699, 233588, 247875, 330263, 309701, 309345, 357208, 339098, 341692, 341835, 339537, 293508, 244978, 164072, 132617, 93510, 183110, 254757, 285503, 266326, 266414, 236876, 251286, 216657, 169673, 142005, 183041, 222111, 226815, 225924, 202865, 203078, 187506, 258220, 296132, 319824, 272934, 253700, 197577, 172359, 183904, 286266, 290953, 307990, 282643, 270892, 245128, 265344, 283948, 259229, 311839, 348096, 306071, 236668, 196284, 159034, 168349, 194278, 247256, 296323, 274203, 228081, 233035, 260120, 263510, 231688, 206977, 185862, 215020, 197462, 186751, 181945, 263132, 299175, 326724, 302446, 322050, 326610, 306591, 256179, 218204, 171482, 222944]
14648B22944K9189N8651P756k2880r5502n0828K6017K9483K6327p407k5221L1879
14636B30408k9088k4627P4308N3137P101o4511m7192k8878O920J4118P076j8192
14624A80580M1438K0424M6164m756l3104O7034N6796k7137l2626l1948K8274J6852
14612C27991o080l3940r666L982J6772L0562n8576m3643m3816l1879K425K5374
14600A79506M8867K1864L5606N1366p74J8042j0923n6468m0727O3970M4188L549
14588C58066k9205N7256j0893o0928K3468J4998k5184o249K4178q6561r3815M7135
14576B12266J09344M3027k8800l6438o4197k2069J7811J0338J3553n4927J7656
14565B17564M7122O7698L5986j04764j8791L233L1245M0092N7316K6610J7340
$$ y = [222944, 252133, 310784, 318540, 295660, 200158, 149330, 175347, 204830, 231157, 223750, 198529, 230408, 201320, 176693, 251001, 304138, 311239, 246728, 199536, 170658, 177578, 191696, 198772, 180580, 222018, 242442, 288606, 283850, 250746, 317780, 374576, 347439, 314813, 282865, 311139, 327991, 321911, 287971, 278305, 282287, 299059, 329621, 271045, 227402, 183586, 151707, 154132, 179506, 228373, 250237, 285843, 337209, 336435, 354477, 343554, 287086, 246359, 310329, 354517, 358066, 328861, 386117, 375224, 314296, 337764, 352762, 327578, 321329, 345507, 258946, 165131, 212266, 321610, 364637, 335837, 299399, 235202, 213133, 230944, 241282, 254835, 199908, 217564, 264686, 332384, 368370, 263606, 244815, 248048, 279293, 319385, 376701, 403311, 420651]
14554D20651n9495n3596J1681j5426K6959j8792K262l2717J3430L5612Q1184N135
14542D16888n1905l2676K6995m2095m5013L8775L0268m382r6683m0903Q0730O3793
14530C43792M3217P8414l8959o8856q177Q9994O6303O447p2527o878n7157k4542
14518C51071r732p809p269k4354L3580M931l218J6177K1069j5422k999O4000L1290
14505D51315j4689k9758N318M3877j1090k6645O703P6663n2557M0964O2201K8326
14493E80628j9366j03368l2301l0783j143N7697J5446j4036k8098k4673j9439
14482C80564M1394L1852o2328l1266R10O6919J32041l1237j23297l7626n5420
14471C12506m1865L4370l7177M4487M6512K8475K5537J425L0374M0177L7506K7251
$$ y = [420651, 361156, 307560, 319241, 303815, 330774, 311982, 314244, 281527, 294957, 330569, 411753, 416888, 364983, 332307, 359302, 317207, 272194, 310969, 341237, 336855, 240172, 199269, 279999, 343792, 387009, 465423, 426464, 357608, 349431, 439425, 505728, 512175, 439648, 432770, 375613, 351071, 341339, 333530, 326261, 301907, 335487, 340418, 337200, 353377, 374446, 359024, 356025, 420025, 451315, 436626, 406868, 412186, 456063, 444973, 418328, 425031, 501694, 449137, 490101, 552302, 580628, 561262, 457894, 425593, 394810, 393667, 451364, 466810, 452774, 424676, 400003, 380564, 421958, 453810, 391482, 360216, 361126, 428045, 560086, 528849, 405552, 367926, 312506, 270641, 305011, 267834, 312321, 358833, 387308, 412845, 414270, 444644, 484821, 522327, 549578]
14459E49578j5499L7088J5707k5569p5475m3528P902J8741J7302k335m9688k259
14447D31965k195J9671M5162K5069Q4171l3004l8705N265o335k1191q26j0338
14435D98709q343l2632L663J7774l2133J2269k8304Q0927L4425j5868m9421k4419
14423D56647L6359k903J4733Q4405k99n2365K0919M0988p630n5424j7466L3584
14411E51548K3937q855Q324m2863j1202P0357r679q8554m4269j1502m8217m1888
14399C47137O7285R4055J1916J1598l4557J1653j2594J3308N5341P172K6769J221
14387F00304J105k2870K967l3130q033l7998N8299N5584K4728m1094l8056J5913
14375E77719Q001l874m2633K6149k4724k2393j251L6766L614L1325J0900m3692
$$ y = [549578, 534079, 571167, 586874, 561305, 485830, 442302, 450204, 468945, 486247, 483912, 434224, 431965, 429770, 449441, 494603, 519672, 603843, 570839, 532134, 537399, 531064, 509873, 509047, 498709, 490366, 457734, 461397, 479171, 447038, 459307, 431003, 511930, 546355, 530487, 481066, 456647, 493006, 490103, 504836, 589241, 588942, 536577, 557496, 598484, 590854, 535430, 517964, 551548, 575485, 566630, 574954, 532091, 520889, 591246, 581567, 493013, 448744, 437242, 389025, 347137, 414422, 508477, 520393, 531991, 497434, 509087, 496493, 509801, 565142, 572314, 599083, 600304, 601409, 578539, 581506, 548376, 540343, 502345, 560644, 616228, 640956, 599862, 561806, 577719, 585720, 581846, 539213, 565362, 540638, 518245, 516994, 553760, 557374, 588699, 599599, 555907]
14363E55907L0669P8810O5057k3355n3213j3226R151l2461m8732n821M0577K3359
14351F26722P207m8373m5761L9261J6422o925J0649J813k7633j1129J9756K4963
14339F06972k375p935R164j7516L6663K8150K7204k8327j9877j8167j1495M550
14327F07011j2183K5442Q9663K1291o8505m2958K0578J8957P0474M8789j4392
14316G64167q5733q4168m736L4836K0831R221K0606L2993K7374o414j6069m1516
14304F71392K1780N8954O3859n0240q171p037k5131l487l4689O6651J18326K7276
14292H99483q4793m1520j7725o917J6390p866k5202l3601k5235K1967k5715k4862
14280F44404M5049J6474J9441O1496K746L531N5420L4121n6524l0804j9633j4552
$$ y = [555907, 586576, 665386, 730443, 707088, 653875, 640649, 649800, 617339, 568607, 562786, 603363, 626722, 633929, 585556, 539795, 579056, 595478, 588553, 599202, 601015, 573382, 562253, 582009, 606972, 604597, 596662, 605826, 588310, 624973, 653123, 680327, 652000, 632123, 613956, 602461, 607011, 594828, 620270, 709933, 731224, 662719, 619761, 640339, 659296, 729770, 778559, 764167, 678434, 594266, 589530, 624366, 645197, 654418, 675024, 708017, 735391, 728977, 712908, 671392, 693172, 752126, 815985, 765745, 757574, 750537, 725406, 721919, 687230, 753881, 872207, 899483, 814690, 773170, 755445, 748528, 764918, 757052, 731850, 698249, 673014, 694981, 669266, 644404, 689453, 705927, 725368, 786864, 789610, 793141, 848561, 882682, 826158, 795354, 775721, 761169]
14268G61169l446M1082J2150K6399R850M968j4018L1617k0109q0027r810k696
14256G57129Q592J6843R612O904K2733J1925M7728O4263J9252r9505o1999l311
14244H00166M2132M342j5126L5836M2518L8935n0984l2250n1847R39L0699N2410
14232H97770J43o27L7555q299K7095l5721j0993M6760n976l0114J6758P5585Q7645
14219A097581k3977j4880M713j7743o9288l5658l5671P4590N1542J0818O101l8103
14207A010025k6650j7739L6570k5448p6552k2842O1298J7377J3256M8504N1861
14196A069660N1670M3799M0900l9095k7145l9509l5213P25r246j1471O4951J076
14184A111102r433K6012N3019j1982n2398j3734n0864J6003O6986m4922j8589
$$ y = [761169, 757723, 798805, 810955, 837354, 847204, 852172, 838154, 869771, 849662, 769635, 759825, 757129, 765721, 782564, 792176, 799080, 821813, 833738, 881466, 945729, 964981, 865476, 803477, 800166, 842298, 846640, 831514, 867350, 909868, 948803, 897819, 865569, 813722, 814661, 845360, 897770, 897913, 897286, 934841, 926542, 953637, 917916, 906923, 953683, 947707, 917593, 934351, 1009936, 1097581, 1073604, 1058724, 1063437, 1045694, 976406, 940748, 905077, 979667, 1031209, 1042027, 1048128, 1010025, 983375, 965636, 1002206, 976758, 900206, 877364, 938662, 956039, 969295, 1017799, 1069660, 1121330, 1165129, 1206029, 1166934, 1139789, 1100280, 1065067, 1065792, 1056546, 1045075, 1110026, 1111102, 1101669, 1127681, 1180700, 1168718, 1116320, 1102586, 1051722, 1067725, 1134711, 1089789, 1071200]
14173A071200J9947M0913K0931M6964k2905k8499L8793K6679K8162j8892K191
14162A225484M759l5549K4932J0117l1964j6655J2949P375n287j1826J0604N256
14150A200195K6390N3553o497J6082J6719N997m6016n8150j074n1439M8455M7629
14138A251844R154j332n8044P157M1647N9730K478M2793k3836l2859K2154n3601
14126A267285k1474N1517j4957p36Q3815j402J1206j1586K1481K8523j2260J9304
14114A420716K997l474K6177N6013M0451l3311m1887J4059N9391j2998l9510j7588
14102A471036J3875j1072J468l9401o244Q3880M0227M8667P8867J6483j246r0879
14090A605661k1614j8232p605J2488j299j5865L1808K7801K9512L2558M8605O189
$$ y = [1071200, 1091147, 1132060, 1152991, 1199955, 1177050, 1148551, 1187344, 1214023, 1242185, 1223293, 1225484, 1230243, 1194694, 1219626, 1229743, 1197779, 1181124, 1194073, 1201448, 1196161, 1184335, 1194939, 1200195, 1226585, 1280138, 1273641, 1289723, 1306442, 1312439, 1266423, 1208273, 1207199, 1155760, 1204215, 1251844, 1260998, 1259666, 1201622, 1208779, 1250426, 1310156, 1312634, 1355427, 1331591, 1298732, 1320886, 1267285, 1245811, 1297328, 1282371, 1281635, 1365450, 1364048, 1375254, 1363668, 1385149, 1413672, 1401412, 1420716, 1423713, 1420239, 1446416, 1502429, 1542880, 1509569, 1467682, 1481741, 1541132, 1528134, 1488624, 1471036, 1484911, 1473839, 1475307, 1435906, 1429662, 1513542, 1553769, 1602436, 1681303, 1697786, 1696540, 1605661, 1584047, 1565815, 1558210, 1570698, 1569399, 1553534, 1585342, 1613143, 1642655, 1675213, 1723818, 1730007]
14078A730007j3135k4893J5120l2660N1071O2476r862k8084p1046l1120K729P9443
14066A730046J4528j9710j8581k0757L0292L9439M4605j6403l0308N0263K7324
14055A830738j3194j3167M691j8022R727O3472O399l2451p8898J9825P1197J19890
14043A970207L0340J355K5577m295m9383p764J5689m8428q1N3759Q9396M5141
14031B121513J5063l384j6874j5566Q767L7831K8372l4765K1037M5148L2362j9524
14019B219980l6079P306N9338K1239o3411m6682P0155N1266K8571K4487k8693
14008B307477n5035r963O8779Q8877J1729l4787l7120L2151N3455N0131P1751
13997B547445J9548k7450m3865M0791O7813l3111k5406N5067o095J3574P5218
$$ y = [1730007, 1716872, 1691979, 1707099, 1674439, 1725510, 1787986, 1778124, 1750040, 1678994, 1647874, 1650603, 1730046, 1744574, 1724864, 1706283, 1685526, 1715818, 1755257, 1799862, 1783459, 1753151, 1803414, 1830738, 1817544, 1804377, 1809068, 1791046, 1800773, 1864245, 1870644, 1838193, 1759295, 1779120, 1850317, 1970207, 2000547, 2001902, 2027479, 2023184, 1973801, 1966037, 1981726, 1933298, 1933217, 1986976, 2076372, 2121513, 2136576, 2133192, 2116318, 2100752, 2109519, 2147350, 2175722, 2140957, 2161994, 2207142, 2239504, 2219980, 2183901, 2191207, 2250545, 2271784, 2208373, 2161691, 2231846, 2283112, 2311683, 2336170, 2307477, 2252442, 2242479, 2311258, 2400135, 2411864, 2377077, 2339957, 2372108, 2425563, 2475694, 2547445, 2566993, 2539543, 2495678, 2536469, 2604282, 2571171, 2545765, 2600832, 2594737, 2608311, 2683529]
13986B683529R5925M4681l1332j0445P099o0847j2347l0234O393O2028Q7612N2273
13974B894335l271j6743k0415N3774M8439o9780k3554L4729L8512J2524K1610
13963B970160M7239k1593j7967R316N7545P7878P3178J8570M436K1485n681K1453
13951C256019K659J9667M4948k3512j4811J2053M9935Q8365L3018q455N0637M9339
13939C559862M219J6131K0580k5826L7618L1860l815P4877K7773o9969M8117N9499
13927C780926P3698l0654m599K5876J09282P7105N8666P1402J54305J80303J21221
13916D617531J53617L46249N44605N59879L74413K80429m9304l47243m40953l47668
13906E691555l53408k94673j64835r6754m1623j2798m7061j0496L6117L3778k1112
$$ y = [2683529, 2779454, 2824135, 2792803, 2782358, 2789457, 2728610, 2716263, 2686029, 2692422, 2754450, 2842062, 2894335, 2891064, 2874321, 2853906, 2907680, 2956119, 2886339, 2862785, 2897514, 2936026, 2948550, 2970160, 3017399, 2995806, 2977839, 2987155, 3044700, 3122578, 3195756, 3214326, 3218762, 3240247, 3234566, 3256019, 3258678, 3278345, 3323293, 3299781, 3284970, 3297023, 3346958, 3435323, 3468341, 3459886, 3510523, 3559862, 3564081, 3580212, 3600792, 3574966, 3612584, 3644444, 3640629, 3715506, 3743279, 3673310, 3721427, 3780926, 3854624, 3823970, 3819371, 3845247, 3954529, 4031634, 4090300, 4161702, 4316007, 4496310, 4617531, 4771148, 5117397, 5662002, 6221881, 6596294, 6876723, 6827419, 6480176, 6039223, 5691555, 5338147, 5043474, 4878639, 4781885, 4740262, 4727464, 4680403, 4669907, 4706024, 4739802, 4718690]
13895D718690K0750K2698n327N5585P9548k1361r813N8528r663L4479J207N2709
13883D998030R1061M4917M3263L9156N9063O4395K2132M3692J2483L9915M3363
13872E501470K0122K672P2228J02139L6511l6951L5199Q7891O6957O6986J20287
13861F075511M6538j8590k5271O1596N5954M1097R3051L1718K0770O7097M9063
13850F498534L5185J0643L1809L5584M8427J45614P6966O2088Q2636N7963J26785
13839G212234J01080K5328M0639J26448L5798M3238N5180J7825Q5028P2121J23088
13828G938007J04398M3722O5381J42390O1140M1113Q0508M0834P8379J15856N3768
13817H765496M0849Q7901J09605R0518N3301J71224J54891O9005N0482R1466R4227
$$ y = [4718690, 4739440, 4762138, 4756811, 4812396, 4891944, 4870583, 4860770, 4919298, 4909635, 4944114, 4945321, 4998030, 5089091, 5134008, 5177271, 5216427, 5275490, 5339885, 5362017, 5405709, 5418192, 5458107, 5501470, 5521592, 5524264, 5596492, 5698631, 5735142, 5698191, 5733390, 5821281, 5888238, 5955224, 6075511, 6122049, 6103459, 6078188, 6139784, 6195738, 6236835, 6329886, 6361604, 6382374, 6449471, 6498534, 6533719, 6544362, 6576171, 6611755, 6660182, 6805796, 6882762, 6944850, 7027486, 7085449, 7212234, 7313314, 7338642, 7379281, 7505729, 7541527, 7584765, 7639945, 7657770, 7742798, 7814919, 7938007, 8042405, 8086127, 8151508, 8293898, 8355038, 8396151, 8476659, 8517493, 8595872, 8711728, 8765496, 8806345, 8894246, 9003851, 9094369, 9147670, 9318894, 9473785, 9542790, 9593272, 9684738, 9778965]
13806I778965J68900Q8539R1616J00233J06438Q2313J12747J63611J33818P3490
13796A0900670R2014P6420J36305J01636K00741J80175J45565Q7053J38445J08713
13786A2167737J51593K10703J46929J52732J31214J07961J51668J01512J36018
13777A3458067K18501J71587J44227K20024J82476J76715J91539J57462J72066
13768A5092664K75723K51494J17393J45810J92294K55262K25774K51081K35492
13759A7042987K35704J81143K08973J87484K04751K41904K75104K54970K17187
13750A9050207K91237K63832K92959K90608J89165J86396L26706L93587L34642
13741B1619339L27152K82261L40200L10098L37515M25653L51133K92421M03991
$$ y = [9778965, 9947865, 10036404, 10128020, 10228253, 10334691, 10417004, 10529751, 10693362, 10827180, 10900670, 10992684, 11069104, 11205409, 11307045, 11507786, 11687961, 11833526, 11920579, 12059024, 12167737, 12319330, 12530033, 12676962, 12829694, 12960908, 13068869, 13220537, 13322049, 13458067, 13676568, 13848155, 13992382, 14212406, 14394882, 14571597, 14763136, 14920598, 15092664, 15368387, 15619881, 15737274, 15883084, 16075378, 16330640, 16556414, 16807495, 17042987, 17278691, 17459834, 17668807, 17856291, 18061042, 18302946, 18578050, 18833020, 19050207, 19341444, 19605276, 19898235, 20188843, 20378008, 20564404, 20891110, 21284697, 21619339, 21946491, 22228752, 22568952, 22879050, 23216565, 23642218, 23993351, 24285772, 24689763]
13732B4689763M01773L79794M10348M16745M51310L78835M01286M10660M19449
13723B8359963L86287M51357M32586M47712M93174N36010M64898N01876N78962
13714C2652825N50766N75895N97823N41371N53323O19469N88499N19497O46296
13705C7845764O54344O24518O45234O77072P05465O22024O79969P41050Q14951
13696D4010391P88632Q18319P54645P43600P87442Q34070Q30173Q26228Q60228
13687E1253728P97257Q29477Q83346Q30380Q87624Q75554R77739J008951R65841
13678E9309897R26158R46202R63488R54132R81112J018993R40263R67501J032670
13669F8040416J033250R80381R52954J000776J023992R83829Q97152R13967R78675
$$ y = [24689763, 25091536, 25471330, 25881678, 26298423, 26749733, 27128568, 27529854, 27940514, 28359963, 28746250, 29197607, 29630193, 30077905, 30571079, 31107089, 31571987, 32073863, 32652825, 33203591, 33779486, 34377309, 34918680, 35472003, 36091472, 36679971, 37199468, 37845764, 38500108, 39124626, 39769860, 40446932, 41152397, 41774421, 42454390, 43195440, 44010391, 44799023, 45617342, 46371987, 47115587, 47903029, 48737099, 49567272, 50393500, 51253728, 52050985, 52880462, 53763808, 54594188, 55481812, 56357366, 57335105, 58344056, 59309897, 60236055, 61182257, 62145745, 63099877, 64080989, 65099982, 66040245, 67007746, 68040416, 69073666, 70054047, 71007001, 72007777, 73031769, 74015598, 74912750, 75826717, 76805392]
13660G6805392R49434Q76015Q13389Q11148P90692Q63273Q61287P52876O91873
13651H4215379O70419O72638O09693N76411O13929N84550M94791L03694L01784
13642H9043288L70840L37000J62177J11681J64199J42667Q8830j5796j01157j38430
13632I0165299j41953k59311k77271l06239l43260l62103m24747n05184n21480
13623H7023751n89815o30732o90670p18758p87325p39011q11746q12810q14050
13614H0428834q54716q83723q76401q78124r27638r40773r54393r13978j001576
13605G2197512r88428r88284r38108r82197j015117j012649j024201j021754r80009
13596F3246765r36453r64592r98788r42292r63453j026481r18470q70043r06916
$$ y = [76805392, 77754826, 78630841, 79444230, 80255378, 81046070, 81909343, 82770630, 83523506, 84215379, 84885798, 85558436, 86168129, 86744540, 87358469, 87943019, 88437810, 88741504, 89043288, 89414128, 89751128, 89913305, 90024986, 90189185, 90331852, 90420682, 90404886, 90303729, 90165299, 90023346, 89764035, 89486764, 89180525, 88837265, 88475162, 88050415, 87545231, 87023751, 86433936, 85803204, 85112534, 84393776, 83606451, 82867440, 82055694, 81242884, 80428834, 79574118, 78690395, 77813994, 76935870, 76008232, 75067459, 74113066, 73199088, 72197512, 71209084, 70220800, 69282692, 68300495, 67285378, 66272729, 65248528, 64226774, 63246765, 62310312, 61345720, 60346932, 59404640, 58441187, 57414706, 56496236, 55626193, 54719277]
13587E4719277r36935r07984q34752p87034p80700q90448q57379q21593q72160
13578D7030292q46553p97949p26716p46390p44955p24997p21792o60202p05162
13569D0355576o40615o47916o78434o44889o20085o17284n75939o46268n54973
13560C4729173n61596n28314n91741n72569m78722n00573n28057m96789m88911
13551B9981901m29276n08016n04722m98275m40973m02750m30802m60049m43020
13542B5864018m14636m08139l95777l88028l33672l27796k93104l66574l54608
13533B2581684l41166l17226l30032k99739k99066l30628k95465k45684l22052
13524A9800626l29440k79851k31710k25702k59057k46759k45328k50679k57954
$$ y = [54719277, 53782342, 52874358, 52039606, 51252572, 50471872, 49581424, 48724045, 47902452, 47030292, 46183739, 45385790, 44659074, 43912684, 43167729, 42442732, 41720940, 41060738, 40355576, 39714961, 39067045, 38388611, 37743722, 37123637, 36506353, 35930414, 35284146, 34729173, 34167577, 33639263, 33047522, 32474953, 31996231, 31495658, 30967601, 30470812, 29981901, 29552625, 29044609, 28539887, 28041612, 27600639, 27197889, 26767087, 26307038, 25864018, 25449382, 25041243, 24645466, 24257438, 23923766, 23595970, 23302866, 22936292, 22581684, 22240518, 21923292, 21593260, 21293521, 20994455, 20663827, 20368362, 20122678, 19800626, 19471186, 19191335, 18959625, 18733923, 18474866, 18228107, 17982779, 17732100, 17474146]
13515A7474146k32349k55495k69542k04501j88304k14529k38365j79352k11495
13506A5480214j98278j26166j13765k48006k54331k27452k40525j56785j67269
13497A3747637k30655j91773q8109j59253j85302j58666j10678j40207j33756
13488A2349238r2549q9880j32178j58460k36683j22761j02126j63517j10266j52286
13478A0988532j32589j21819j19215j20152j41039q5993j55528p6206l9600j24965
13468I871426j36230l6590j10417j20959j01299q9429r8753q7573o2817j38885
13458H888474o8609j26246j31770q1606m7335j8536j01007j16977j03356j16888
13448G976144j07264j02668M391K901k8037q2875k3758p9177r1018p3728o3905
$$ y = [17474146, 17241797, 16986302, 16716760, 16512259, 16323955, 16109426, 15871061, 15691709, 15480214, 15281936, 15155770, 15042005, 14793999, 14539668, 14312216, 14071691, 13914906, 13747637, 13516982, 13325209, 13237100, 13077847, 12892545, 12733879, 12623201, 12482994, 12349238, 12256689, 12166809, 12034631, 11876171, 11639488, 11516727, 11414601, 11251084, 11140818, 10988532, 10855943, 10734124, 10614909, 10494757, 10353718, 10267725, 10112197, 10035991, 9996391, 9871426, 9735196, 9698606, 9588189, 9467230, 9365931, 9276502, 9177749, 9090176, 9027359, 8888474, 8819865, 8693619, 8561849, 8480243, 8432908, 8414372, 8313365, 8196388, 8093032, 7976144, 7868880, 7766212, 7770603, 7773504, 7745467, 7662592, 7638834, 7559657, 7468639, 7394911, 7331006]
13437G331006j44415j04216l5348p3414j46890j29305l2227J165n1500q0360j451
13426F533045k0425r3259k7278J1333m2361j19372r9881j8212p5118j56310p3629
13415E818533j3847k2834m220n2767l2693k9675q9943k3447o411l2245j5058q3879
13403E411514j30122r5663j09857n9855k7894k2966l1686m9069l7766n58j5348
13392D830730o0696l9940M092J9517l5423p4055m8735n6643j3570M6196n4146
13381D517327q6733k9686K8589o939Q668j620j7698j35995m2146k0236j2317O0334
13369D261548J2931K9846N6730O2794J96538K24260M32914N51648L85283J92909
13359F407401q2329m35073m79105m21364l56987l25439k88166j68523j20244j595
$$ y = [7331006, 7186591, 7082375, 7047027, 6973613, 6826723, 6697418, 6665191, 6666356, 6614856, 6534496, 6533045, 6512620, 6419361, 6392083, 6403416, 6361055, 6241683, 6141802, 6123590, 6048472, 5892162, 5818533, 5804686, 5781852, 5777632, 5724865, 5692172, 5662497, 5572554, 5549107, 5542696, 5510451, 5495393, 5411514, 5281392, 5185729, 5075872, 5016017, 4988123, 4965157, 4933471, 4884402, 4846636, 4846078, 4830730, 4770034, 4730094, 4734186, 4753703, 4718280, 4644225, 4595490, 4538847, 4525277, 4571473, 4517327, 4430594, 4400908, 4429497, 4422558, 4431226, 4429606, 4411908, 4275913, 4233767, 4213531, 4201214, 4261548, 4274479, 4304325, 4361055, 4423849, 4620387, 4844647, 5277561, 5829209, 6214492, 6407401, 6325072, 5889999, 5410894, 4989530, 4632543, 4307104, 4018938, 3850415, 3730171, 3728576]
13349C728576k1208k1542j18875o1669l4457k6341m6917l5586k8235k9967n3426
13338C250353j6613q8116j1225k4608J2043K7444m8614J1352M948m6422p6592
13327B993950r072L7325n4021j04654r2186k4169O167P1830L0318J5684J3388
13316B884560k2844j11478n8652j6917K2057j861k4525q6718j6130p1889N0791
13305B546394L446m8454l811k7536k9115J7561j0308M6768N6474p9137m1754k9129
13293B401399j7486J9381j2315m0132m232j6072o1252j7868j953k8969n6343m174
13281B159984p578Q398K41m6902M375M4230K510m4705o0382m0433k2365L7626
13269B034999k0162r1030l4145J3299M2886L3231J3835K2652m5059k6522j2452
$$ y = [3728576, 3707368, 3685826, 3566951, 3505282, 3470825, 3444484, 3397567, 3361981, 3333746, 3303779, 3250353, 3233740, 3145624, 3134399, 3109791, 3121834, 3149278, 3100664, 3112016, 3116964, 3070542, 2993950, 2984878, 3022203, 2968182, 2863528, 2771342, 2747173, 2753340, 2825170, 2855488, 2871172, 2884560, 2861716, 2750238, 2691586, 2674669, 2696726, 2694865, 2670340, 2583622, 2567492, 2495603, 2546394, 2549840, 2501386, 2497575, 2470039, 2440924, 2458485, 2448177, 2494945, 2551419, 2472282, 2430528, 2401399, 2383913, 2403294, 2390979, 2350847, 2346615, 2330543, 2269291, 2251423, 2249470, 2220501, 2164158, 2159984, 2152406, 2160804, 2161045, 2114143, 2118518, 2162748, 2165258, 2120553, 2060171, 2019738, 1997373, 2034999, 2014837, 1923807, 1889662, 1902961, 1945847, 1979078, 1992913, 2015565, 1970506, 1943984, 1931532]
13258A931532k348J2314o249j05923k1854K894L8531J8344j9956k8905k42k0461
13246A797677p928l1464k0832O9354L5354n6913m4258K7066q700k2014k6510l6713
13234A674119l1415m0384p433R473N3971J3089m3979K7879N5595m4222l8632N9564
13222A687625P205o7752k7k2688l2956n062k4172J6080M9486k5388M5899j0384
13210A617866m0318l8116p3813n2225L6022K1345p811k9248n7262L4451L2589
13199A443480L0724M7890J4699o5618Q871J7344K4842J900j02751n777R3477n3897
13187A455184o6975k6984O5072o0671q7409J4897p657l1710q460k1525L2822j4901
13175A241683O053L6274j288k4869J2006n1586j6439m822L467l6246l9381j3745
$$ y = [1931532, 1929184, 1941498, 1935249, 1829326, 1807472, 1810366, 1848897, 1867241, 1847285, 1818380, 1818138, 1797677, 1789749, 1758285, 1737453, 1806807, 1842161, 1785248, 1740990, 1768056, 1759356, 1737342, 1710832, 1674119, 1642704, 1602320, 1594887, 1604360, 1658331, 1671420, 1627441, 1655320, 1710915, 1666693, 1628061, 1687625, 1694830, 1627078, 1627051, 1604363, 1571407, 1566345, 1542173, 1558253, 1607739, 1582351, 1628250, 1617866, 1577548, 1539432, 1465619, 1413394, 1449416, 1470761, 1462950, 1433702, 1376440, 1410891, 1443480, 1474204, 1522094, 1536793, 1471175, 1480046, 1497390, 1522232, 1524132, 1421381, 1415604, 1509081, 1455184, 1388209, 1361225, 1426297, 1365626, 1278217, 1293114, 1285457, 1253747, 1245287, 1223762, 1256584, 1241683, 1247736, 1284010, 1282722, 1257853, 1269859, 1218273, 1201834, 1197012, 1200479, 1164233, 1124852, 1111107]
13163A111107R945m8015m6376J7063J0792N6290O7919M090n0813L0680O100o1256
13151A107526J0154k5041J9991l7693J802M926J5875P5149l757k4447Q736l3096
13139A120125J9016m9989o8189l9190j5227m1484K2494L388q785j1761J2228O140
13127I48766M8600k8506M517M3518o959m1752j5132L6970l973P660K1109L4615
13115A049433j5165l5799M2o0352K2922l618M374Q821M9057l5696p6463M4604
13103I52160K5213k8632k2342j1081J2602j6276l365k6995j00423l1679L5862
13092G85044O3682n152m3647J7611K2347l2939j8905r832L1812R3495J5273k9000
13080H89789l4795K8755l901m1872p4634K5102j074k0405m272k9055m0338N8375
$$ y = [1111107, 1121052, 1073037, 1026661, 1043724, 1054516, 1110806, 1178725, 1182815, 1132002, 1162682, 1168782, 1107526, 1117680, 1092639, 1112630, 1074937, 1076739, 1081665, 1097540, 1172689, 1168932, 1144485, 1153221, 1120125, 1139141, 1089152, 1020963, 981773, 966546, 925062, 947556, 950944, 942159, 930398, 942626, 948766, 997366, 968860, 973377, 1016895, 1009936, 968184, 953052, 990022, 986049, 993709, 1014818, 1049433, 1034268, 998469, 998511, 938159, 961081, 957463, 961837, 970658, 1019715, 984019, 907556, 952160, 977373, 948741, 926399, 915318, 927920, 911644, 908279, 881284, 780861, 749182, 785044, 848726, 843574, 799927, 817538, 839885, 806946, 788041, 778209, 810021, 903516, 918789, 889789, 854994, 883749, 879848, 837976, 763342, 788444, 787370, 766965, 762693, 733638, 693300, 751675]
13068G51675N4083k666p8891m5065L4445O066P8349K731L7693k0141l0646J5537
13056H03170Q350R111j0890n5917l9355l2597k9234K8370K6969L8678r13q814
13044G36928n6927k3021N3753J0405o3337n6220J9593J09768N4626l0790r3159
13033F61619n9426n6965J3693q331o372P0334M1431j6668n3782l4115L2774M852
13021E89044l6123k0872L137N9140M3643K9273K313N858n5341K8311N11n313k2674
13008F20907K4603L2708j1740l8458l2374j5836q329J5265k2421L6284K8983k2179
12996F07413k1640o5313M9003j7495n0579j4827m2781R8479N6306m5124l0241
12985E23201l1605k9096R873l0108K8383J5663M146p3933m4348O2714N8738M1301
$$ y = [751675, 805758, 803092, 724201, 679136, 713581, 719647, 797996, 800727, 838420, 818279, 787633, 803170, 811520, 820631, 809741, 753824, 714469, 681872, 652638, 681008, 707977, 746655, 745742, 736928, 680001, 656980, 710733, 721138, 657801, 601581, 621174, 730942, 785568, 754778, 661619, 602193, 545228, 558921, 550590, 544218, 614552, 655983, 639315, 585533, 551418, 584192, 589044, 552921, 532049, 535186, 594326, 637969, 667242, 669555, 675413, 620072, 648383, 648894, 643581, 620907, 645510, 678218, 666478, 628020, 595646, 579810, 571481, 586746, 564325, 600609, 629592, 607413, 585773, 520460, 569463, 551968, 501389, 486562, 443781, 542260, 598566, 553442, 523201, 491596, 462500, 472373, 442265, 470648, 486311, 490457, 416524, 372176, 434890, 493628, 534929]
12973E34929L8471k6638K4922M3926k7852o939N829r375j0984K4901k4790m5506
12961E20894p2952J8413N217J4395J4986M3404L3236M3939n4784p5238p895o599
12949D77016Q128m1732j8723K9753k8344q235M1184L5662O233l4385j7711J4207
12937D63053n5361m9385L5702L5748J9206k86M7371k5046p024O316m9557k6773
12925C93964k0122k751j9202n148r21N9177K3859l0230P68K2225n6837m2383M2452
12912C64851P5315j0925k4750j407m5225p800L963p5225J2829l524k6387M7987
12900C09702R5708Q4212r1064n2724N582L8768J9192M6040k5822n6862K123P6468
12888D51323N8547j8418K3942n2506n7833R43L8779k4992j6651J6489j4652k346
$$ y = [534929, 573400, 546762, 571684, 615610, 587758, 580819, 586648, 577273, 566289, 591190, 566400, 520894, 447942, 466355, 471572, 485967, 500953, 544357, 577593, 621532, 566748, 491510, 483615, 477016, 485144, 443412, 424689, 454442, 426098, 417863, 459047, 494709, 500942, 466557, 448846, 463053, 407692, 358307, 394009, 429757, 448963, 448677, 496048, 471002, 463978, 470294, 420737, 393964, 373842, 371091, 351889, 346741, 345820, 404997, 428856, 398626, 399394, 421619, 364782, 322399, 364851, 440166, 429241, 404491, 403084, 357859, 350059, 354022, 278797, 291626, 288102, 261715, 309702, 405410, 489622, 398558, 345834, 351416, 390184, 409376, 455416, 429594, 372732, 374855, 451323, 509870, 491452, 515394, 462888, 405055, 405998, 444777, 419785, 403134, 419623, 404971, 402625]
12876D02625m851j2644K4822N8923K5147r0246o6101J7176K3649j1069K5589J9924
12864D12944l8343m2214N6938K1149p7502o930M2051r363p3114R578Q1603N8163
12852D34960k0779M7048n43k0376l5736j3564l0997j280l5389o3233l5224L4137
12840B59024M7174j9876N88k6414M4338K9432k2835R378j4918J1922k095L1326
12828C47044J7163p896N732K7188M3530l6260k6301K6251m5308m5287O7553J9430
12816C92839l0819n9655j5053j24r100m4131K2146N1206K5010l2782j2534l1131
12804B55872K5500n416m6884M5168O1185r786j1816m110j1432j2067m9046l4636
12792B02532j0347N4094L5454k9459p0492k91n6185j6322J777J1422N9361M0507
$$ y = [402625, 397774, 385130, 409952, 468875, 494022, 403776, 337675, 354851, 378500, 367431, 393020, 412944, 374601, 332387, 389325, 410474, 332972, 326042, 368093, 358730, 285616, 295194, 376797, 434960, 414181, 461229, 460686, 440310, 404574, 391010, 360013, 358733, 323344, 260111, 224887, 259024, 306198, 286322, 286910, 260496, 304834, 334266, 311431, 320809, 305891, 317813, 315718, 347044, 364207, 356311, 362043, 389231, 432761, 396501, 370200, 396451, 351143, 305856, 373409, 392839, 362020, 302365, 287312, 287188, 278088, 233957, 256103, 307309, 332319, 299537, 287003, 255872, 281372, 275956, 229072, 274240, 335425, 325639, 313823, 309713, 298281, 286214, 237168, 202532, 192185, 246279, 281733, 252274, 181782, 181491, 125306, 108984, 110761, 122183, 181544, 222051]
12780B22051l8146K8553O1124M8557l8005m8793l2132R430P6010o821m6936m9994
12768A84898l3722J7811L0387k8631q097K3480J5388K2496l6753n6670n2697K4051
12756A01941K9184L4078J7645L9207j5886o3106j7199M1893J1771K9832P7694
12745B87054k214n0910n0150l7629N2706J0235J1762J9143o472m2912J9718N6958
12733B67289k72M787j8945k9811j5127j4203n0543R112L1578O8962l4896k7458
12721A90473k763l6290J3210J3174l5342N913n1561L599O2132R098l4951l5741
12709A00951M643M1818n091M2196L8295J1139j5878o648L9180j4212K164j7565
12697B20992j7210j9813J732J9339k2182L0301M1206M8359K8219J0464p2280l6645
$$ y = [222051, 183905, 212458, 273582, 322139, 284134, 235341, 203209, 212639, 288649, 281828, 234892, 184898, 151176, 168987, 199374, 170743, 162646, 186126, 201514, 224010, 187257, 130587, 77890, 101941, 131125, 165203, 182848, 222055, 206169, 143063, 125864, 167757, 179528, 209360, 287054, 284840, 233930, 183780, 146151, 198857, 209092, 220854, 239997, 233525, 190613, 210331, 267289, 267017, 271804, 252859, 223048, 207921, 193718, 143175, 152287, 183865, 252827, 217931, 190473, 187710, 151420, 164630, 177804, 142462, 148375, 96814, 100413, 162545, 171643, 136692, 100951, 105594, 147412, 142321, 184517, 222812, 233951, 218073, 211425, 250605, 236393, 238557, 220992, 203782, 183969, 185701, 205040, 182858, 213159, 254365, 302724, 330943, 341407, 269127, 232482]
12685B32482m2985N517J8243K1691n4685J0766L3400n737p961l249o2331m4848
12673A00303N0637r580N9047K4293m2903J3410L0721P6799K9967r7118p9001K0020
12661A76595N8393M7190k9473n6116Q115j2278n4152k5574R540K8906k9140j4091
12649A07915K7382J8951j2219M6881J8678j4224Q622Q109p1604J1280K2895p1317
12637A01349k5093J9449L4631P935k0925K5322N985J132J1030J852K2926L8594
12625B24187m1106r226L66n5297k5053q859J3548k3027l69j0377J4989l338P0125
12612A46563L5920L1467j0325j9299p7534j6301J4996J4319N4462r917K502J8476
12600A85329k6834k792o2671l6041J5924L7326L5134K1218l2040J0289Q826R244
$$ y = [232482, 189497, 195014, 213257, 234948, 180263, 191029, 224429, 218692, 210731, 207482, 145151, 100303, 150940, 141360, 200407, 224700, 181797, 195207, 225928, 302727, 332694, 235576, 156575, 176595, 234988, 282178, 252705, 196589, 204704, 192426, 138274, 112700, 122240, 151146, 122006, 107915, 135297, 154248, 142029, 188910, 207588, 193364, 201986, 210095, 138491, 149771, 172666, 101349, 76256, 95705, 130336, 138271, 117346, 142668, 148653, 149785, 160815, 162667, 185593, 224187, 183081, 173855, 174221, 118924, 93871, 85012, 98560, 75533, 75164, 64787, 79776, 76438, 146563, 182483, 213950, 203625, 184326, 106792, 90491, 105487, 119806, 174268, 164351, 166853, 185329, 158495, 155703, 93032, 56991, 72915, 110241, 145375, 166593, 134553, 144842, 153668, 162912]
12588A62912m7288K3107K012J2493l9132J0799M8077j2780j0171M5137k716l7280
12576A55170p7076m2835n6553M8934N3558l8932P8974J2373j9520m1439k1230
12565E1424L3821M9635L20j01894O904P9J9570N6659l1584J128N1203N5085j3918
12552A78432l1436J896J416n3000j3336O4915L3431K6800p897k3711m4279Q6241
12540B19472K9059M936j0271k1874n9514o9383p7953L0032K1830K1176O7684k2252
12528A32942n0410j1803O8016K9518M4211j0833o4185j2029M3423j46m966l9418
12516A24320l4128k8684J4244j933N9331k976K1608k1723o698j6108L1964M7438
12504A86655k4826j4317k8391m1679m7210Q4j0594K2568K4378K6256K3440p166
$$ y = [162912, 115624, 138731, 140743, 153236, 114104, 124903, 172980, 160200, 150029, 195166, 192450, 155170, 78094, 35259, -21294, 27640, 81198, 42266, 121240, 133613, 114093, 72654, 51424, 85245, 134880, 135200, 33306, 40210, 40289, 59859, 116518, 84934, 86062, 137265, 192350, 178432, 146996, 148892, 150308, 97308, 83972, 148887, 182318, 209118, 201221, 177510, 133231, 219472, 248531, 253467, 243196, 221322, 161808, 92425, 14472, 44504, 66334, 87510, 155194, 132942, 82532, 70729, 138745, 168263, 212474, 201641, 137456, 125427, 168850, 168704, 163738, 124320, 90192, 61508, 75752, 73819, 133150, 130174, 151782, 130059, 123361, 107253, 139217, 186655, 161829, 147512, 119121, 77442, 30232, 30316, 19722, 42290, 66668, 92924, 116364, 109198]
12492A09198j3340K6271J1634J3377N1622j8442m3605K143j5744j0731k5468k4485
12480F2430J4576M6102q21l9376o3799m197L8100N2055K0671L688L6146n6002
12468A09573k8902Q383n903K8514M9781M267K4045K956o5701l4581J5319l2968
12456G4783m1952q786J8945J9358J0860J0048L8055K8684k6393l3732j00395J838
12444h687L7232K6611R5709M002o7102o8418p63K7021j1194k0422L8535J04040
12432A56564L7523M3611n3705k3400n8061l3812j9295m647J6432L6477j9136l5355
12420D3196n677J820j6974K6582K4449J8900j3819m1427J3870O937L114l0612
12408C0359J7269L4040J228J2574m3005k2481N1532J2958o49M703J0981K1184
$$ y = [109198, 95858, 122129, 133763, 147140, 198762, 180320, 136715, 138858, 123114, 112383, 86915, 62430, 77006, 123108, 122287, 82911, 19112, 14915, 53015, 105070, 125741, 129429, 165575, 109573, 80671, 89054, 83151, 111665, 161446, 165713, 189758, 192714, 127013, 92432, 107751, 74783, 32831, 24045, 42990, 62348, 73208, 83256, 121311, 149995, 123602, 89870, -10525, -8687, 28545, 55156, 150865, 154867, 87765, 19347, 18584, 45605, 34411, 13989, 52524, 156564, 194087, 237698, 183993, 160593, 102532, 68720, 49425, 44778, 61210, 97687, 78551, 43196, 37519, 39339, 22365, 48947, 73396, 92296, 78477, 37050, 50920, 57857, 60971, 30359, 47628, 81668, 82896, 95470, 52465, 29984, 81516, 94474, 93825, 98528, 109509, 130693]
12396A30693M674r52M381j573l5713j4269K3575k6043L706m314J8249J8915k3055
12383I8274r4730l1883m916L5580M2292J2935m6705K8823K4620m511n8424o6763
12371f5408K2318K2832N0256J1197J8072J7023k9094l181Q1509L0046p5439o653
12359G3478j4668K2885l6856R435k2605R88j2979N198M1544l7406k8185j3666
12347a2837n921K8269O7478L1987j1711j5731j795M6292N293l8110n945P648K6924
12334A21841o2646m5372J7643Q8289O8723L5831o6070l8448K8306j1039n7816
12323G9242r0364J0471O6598n8323K3844N6886J9802J8511j9659L4553L7359K3033
12311B01953n4959n3631n7153J020L4600O969k4357k4770L045L362M1686m8910
$$ y = [130693, 135367, 134415, 138796, 137223, 101510, 87241, 110816, 84773, 88479, 84165, 102414, 121329, 98274, 3544, -28339, -33255, 2325, 44617, 57552, 10847, 39670, 64290, 59779, 1355, -65408, -43090, -20258, 29998, 41195, 59267, 76290, 47196, 44015, 125524, 155570, 80131, 73478, 58810, 81695, 44839, 54274, 31669, 32657, 19678, 24876, 66420, 29014, 829, -12837, -18758, 9511, 76989, 108976, 97265, 81534, 79739, 126031, 131324, 93214, 87269, 94917, 121841, 59195, 13823, 31466, 119755, 188478, 224309, 158239, 119791, 148097, 137058, 79242, -11122, -651, 65947, 7624, 31468, 88354, 108156, 126667, 107008, 141561, 178920, 201953, 146994, 93363, 36210, 37230, 71830, 78799, 54442, 29672, 32717, 36079, 77765, 28855]
12299B8855J5681N1283L5880j04708q3251k5729M298L3707M3049K5571j3288k4404
12287a3056Q864L6757N9215Q247K5502l7510m0356J6367N8954o4021o0916j6773
12275a8726j2371M1242K924N635J0536K664j1804N5820K5787P297mk2945M7353
12262A33408L3616p6938n8165m931R78K6738K9394k7237m4898j7988O7715j6288
12250D5404o1022j2717J7115K6806j5838o273q085Q667J3767M545N1417J8107
12238H1893K140k3290j7403K581J5240M8550m7134n567N081J6440L6640K1565
12226A36736l1107j5211j2802k1405K2209M685J4175m171k049N691q4015o0684
12214d7948j1866K0708l451K1111k7477q399M0059M5896K7374K340N3810N7399
$$ y = [28855, 44536, 95819, 131699, 26991, -56260, -81989, -77691, -43984, -935, 24636, 11348, -13056, -4192, 32565, 91780, 100027, 125529, 88019, 47663, 64030, 122984, 58963, -1953, -18726, -31097, 10145, 13069, 18704, 29240, 31904, 20100, 75920, 101707, 109004, 109000, 86055, 133408, 167024, 90086, 31921, 26990, 27968, 54706, 84100, 56863, 11965, -6023, 61692, 45404, -15618, -28335, -11220, 15586, -252, -6525, -14610, -5943, 7824, 12369, 63786, 81893, 84033, 60743, 43340, 45921, 61161, 109711, 62577, 57010, 62091, 78531, 115171, 136736, 105629, 90418, 77616, 56211, 78420, 83105, 97280, 93109, 91060, 96751, 12736, -47948, -59814, -39106, -42557, -21446, -48923, -57322, -17263, 28633, 56007, 58347, 112157, 169556]
12202A69556k2328k0796K1771K6707Q003l9384r6372o3580j0237J9191k3760J3729
12190a7500N8880k3749o2224P4135R2437l005p2001m2494m7803o095m194l864
12178e7477R467k5587N2507K1132q7284l9086J3639K4245K1338J914P699M0939
12166a6554L5754N2515J063k6159O311J5636K7021j0245J2602M312k9919m4715
12154B7622K8774k5132o0126O6307J9907l0950j7136N7910k856p1276O4943M6402
12142A04389N034k0166m1460N0512K7797k3236p4918n0864n247N7891Q4873R58
12130A15563n4685K195l5536k196k7934L4094N9169L5050O905o8005l9527r479
12118A5614m3473k891J7747N2494M1935J1218n4261k7134M1133J441Q709K117
$$ y = [169556, 147228, 126432, 148203, 174910, 182913, 143529, 47157, -16423, -26660, -7469, -31229, -17500, 41380, 17631, -44593, 29542, 121979, 118974, 46973, 4479, -43324, -49419, -53613, -57477, -48010, -73597, -21090, 42, -87242, -126328, -112689, -88444, -67106, -65192, -57493, -16554, 19200, 71715, 72778, 46619, 52930, 68566, 95587, 85342, 97944, 102256, 72337, 27622, 56396, 31264, -28862, 37445, 57352, 26402, 9266, 67176, 64320, -6956, 57987, 104389, 109423, 89257, 47797, 98309, 126106, 102870, 27952, -22912, -28159, 29732, 114605, 115563, 60878, 63073, 27537, 25341, -2593, 31501, 90670, 125720, 132625, 64620, 25093, 15614, -27859, -30750, -13003, 39491, 81426, 92644, 38383, 11249, 52382, 53823, 62532, 64649]
12106F4649J4804m0059j2437M3047J2040l3268j9478k13k7414l7262N5520K6393
12094D6322j9002m8427Q093O387m2037n9157M9268J19567Q6476j5778n8781l2700
12082D0231J4394k9199r503P4940J2819k0187R987q806m0428m7766p393k751N915
12069g747j2079j8796M3991P9420K0532J0801R269r0935o8050l0048O0237Q7251
12057H3846L0562m5034m3242J6067p892J2276j9142J8358M2648j1717q3560M562
12045b268n914k3899p083Q8934l5986l840N8763M014L8514j8202k8207J3995o6039
12032A2782Q992R0616P987l8878k0467L556n0645K7434j1185j5763L8212L2468
12020H5109n8761k3514n585M7644j702L6863k9774k826l006l2597l4281p441P4561
$$ y = [64649, 79453, 39394, 26957, 70004, 82044, 48776, 29298, 29085, 1671, -35591, 19929, 46322, 27320, -21107, -13014, -6627, -48664, -107821, -58553, 61014, 147490, 131712, 72931, 40231, 54625, 25426, 15923, 90863, 103682, 83495, 93482, 84676, 44248, -3518, -10911, -13662, -7747, -19826, -38622, 5369, 84789, 105321, 116122, 125391, 34456, -33594, -63642, -3405, 83846, 114408, 69374, 26132, 42199, 34307, 46583, 27441, 45799, 88447, 76730, -6830, -2268, -8182, -32081, -39164, 49770, 13784, 9944, 68707, 72721, 111235, 93033, 64826, 78821, 12782, 21774, 112390, 120377, 81499, 61032, 64588, 13943, 41377, 30192, 14429, 52641, 85109, 26348, 2834, -2751, 44893, 43191, 80054, 50280, 47454, 44448, 11851, -22430, -29871, 44690]
12007D4690M8058j4419k9798L03j2698m0449K0206K8445n7590l0518O612K6667
11995a0491L091K5776K4536L9424j4339k1733l9559O096M5322o395K4796m4818
11983C1706n6540K8218K623n0389K5301L6774P661m6872m1995L7385N6912K8679
11971E9463m324P913l3284l8421j6003j0191J7282M4192N7583J720o5791l4471
11959a4332o0487n5732K4704Q1116O5047L181q586j3133O696N179l0375M789L879
11946A1946l4231L8562O5991m1351n375L6087q464m0661j469p7285n7227N3234
11934f0243Q1089P400N8243k971k9598m0401m3045L0331K5904k5838r885R229
11922B15l055j0699J180k0963m5435R24J9241K0916O833k9049k56M7785N7028
$$ y = [44690, 92748, 78329, 48531, 48834, 36136, -4313, 15893, 44338, -13252, -43770, -37158, -10491, -7400, 18376, 42912, 82336, 67997, 46264, 6705, 12801, 58123, 51728, 76524, 31706, -24834, 3384, 6007, -44382, -19081, 17693, 25354, -21518, -63513, -26128, 30784, 59463, 55139, 63052, 29768, -8653, -24656, -34847, -17565, 26627, 84210, 85930, 20139, -14332, -74819, -130551, -105847, -24731, 40316, 43497, 34911, 21778, 28474, 33653, 3278, 8067, 11946, -22285, 16277, 82268, 40917, 35542, 71629, 63165, 22504, 21035, -56250, -113477, -60243, 20846, 28246, 86489, 83518, 53920, 13519, -29526, 805, 26709, 871, -9014, 215, -2840, -13539, -12359, -33322, -78757, -77833, -58592, -37676, -30843, -59892, -60148, -12363, 44665]
11909D4665N8395k6454o1628j8252J7909K6821l5827m6826N6502O3130m601k5619
11897D8215P243q9138q2477K7578M8685P3798j9053L67m1963k3381L1566L9969
11885B1409j962n9211m7160n2202O5358L7021J4768O2297k5928m5829J576K876
11873b6987j8202K4059M4002J8640n364l0710l2643N338K5246M188J2031P545
11861B7143J1546l0791m9763k905L2575O9887K8122o6711l7395m1063R567l1385
11849h1173N053K8429L8853P3110L2341p5941k483L569l0261J4693q642R640O122
11836A3310l1996r89J9983L55N820p898j9256m0598k7635L3123M7757O391O0307
11823E8674L432n9711m12J7727L6462k1970l0770o145j1916N963J6891j6673M2359
$$ y = [44665, 103060, 76606, 14978, -3274, 14635, 41456, 5629, -41197, 15305, 78435, 73834, 48215, 55458, -33680, -116157, -88579, -39894, 33904, 14851, 15218, -26745, -50126, -18560, 21409, 19447, -39764, -86924, -139126, -73768, -36747, -21979, 40318, 14390, -31439, -29863, -26987, -45189, -21130, 22872, 41512, 36148, 5438, -27205, -21867, 3379, 7567, 19598, 27143, 38689, 7898, -41865, -44770, -12195, 57692, 85814, 19103, -18292, -59355, -49788, -81173, -76120, -47691, -8838, 64272, 96613, 20672, 18189, 21758, -8503, 6190, -2452, 7188, 13310, -18686, -19675, 308, 663, 6483, -1415, -20671, -61269, -88904, -55781, -8024, -1633, 58674, 62106, 2395, 1983, 19710, 56172, 34202, 3432, -2713, -14629, -8666, 8225, -8448, 33911]
11810C3911M476k5501j7076k5588l7112k2136R3526N5334q39k9243J474K533l3458
11797C01q666R24Q3845R473l0793K8936l1368p8059k40N2224q773o6807j3617
11784f2620j265L9868n9421k0934J1061L8273O8387J2270j9240L9646K9310m5786
11772B9549n1126M216l5179n0594O2297N7239Q374L7190j7409m6066O7122r87
11760F4626j4031N532q923p1613l5128n876N3638Q8985L1968N922k1680j9631
11748G3789L398n9923l0688K4911M1339n2137J9594l3794m2410p847M2802L0240
11736I274M894m8788q4946J6523O4744O5120j3436m3599n0683N0736M4803J9325
11724C3967L2099Q063p421k4749p784j8889l5938O334r800N9240J5577j0815r8906
$$ y = [33911, 38387, 12886, -4190, -29778, -66890, -89026, 4500, 59834, 58995, 29752, 31226, 33759, 301, -8365, -7441, 76404, 85877, 55084, 84020, 52652, -25407, -25647, 26577, 17804, -49003, -62620, -63885, -24017, -83438, -104372, -93311, -55038, 13349, 25619, 6379, 46025, 75335, 29549, -21577, -17361, -52540, -103134, -40837, 16402, 24776, 61966, 44557, -1509, 65613, 64626, 50595, 56127, 47204, -24409, -59537, -65413, -11775, 77210, 109178, 115100, 93420, 73789, 77187, 17264, -13424, 11487, 52826, 689, 20283, -13511, -55921, -63768, -20966, 9274, 14168, -34620, -119566, -103043, -38299, 26821, 13385, -30214, -80897, -30161, 14642, 33967, 66066, 74129, 66708, 41959, 34175, 15286, -20652, -14318, -24118, 35122, 50699, 39884, -59022]
11711e9022p0768M3680N9564N6190j9952J0029l3431m1843l6206L7572j1956N2417
11699a3726J07967N104n7304l524K7645K7499k9731k9801L3749m746J9143J4496
11687I6771m6595j9874m3741p3555M7727K6835m2919M7662q979k1827j0617J0546
11675c8566M8845j1022l0291L0038N7431k529K0381m659m0036j4482r3329L2931
11663d5288K5690j8614k0959K3154n9003O0052N0847O675k3437q632Q872K291
11651A648o531J1395J9140L703O3109J5031m6959j9021n654j6816K0502k4715
11639A4832m6310L3197k004m5726l5089J8866P1006N7156k1494j6302L3760K2386
11627H4278n8079r0537j4981O493j7833Q5458O2829M966j1627l3168n1674J5255
$$ y = [-59022, -129790, -86110, -26546, 29644, 9692, 19721, -13710, -55553, -91759, -54187, -66143, -13726, 94241, 99345, 42041, 38517, 66162, 93661, 63930, 34129, 67878, 63132, 82275, 96771, 50176, 30302, -13439, -86994, -39267, -12432, -55351, -7689, -16668, -38495, -49112, -38566, 10279, -743, -31034, -996, 56435, 53906, 74287, 69628, 29592, 15110, -78219, -45288, -19598, -38212, -59171, -36017, -95020, -34968, 15879, 22554, -883, -9515, -643, 1648, -4883, 6512, 25652, 29355, 92464, 107495, 60536, 41515, 35861, 19045, 39547, 14832, -31478, 1719, -285, -46011, -81100, -62234, 8772, 65928, 44434, 28132, 61892, 84278, 26199, -64338, -79319, -72826, -90659, -5201, 57628, 62594, 50967, 17799, -33875, -18620]
11615a8620m5345j0692R746K4774K6399m5577l5158J3093k084J8259K3510P3289
11603C1594K2272p825k359O5516J219m0370j6708r5195o7541K2838L0670j5131
11591g1020M1520m7026j13J9479J2877j0893l31M0936k9492N2715l146j5337J6369
11578F538m1194K9606l651J3222R7662K1246k4593J3025k8524q9604k2477N1190
11566B2446N227K1906R366j9325k9296o1988R447M972n5991j811j9526j5742m274
11553a34589M6867J1281k1504J7671k0946J750M5875L8977K0433K1502j0155l9100
11541b1938j2655P7457K599J487J2018m1847K3314R523n1010l8801J755M517L1932
11528a649L1115q3970l4507L1951L3926L1850j5991n3844J7474M1546j6847m8449
$$ y = [-18620, -63965, -74657, -64911, -40137, -13738, -59315, -94473, -81380, -83464, -65205, -41695, 31594, 53866, 46041, 43682, 109198, 110417, 70047, 53339, -41856, -109397, -86559, -55889, -71020, -29500, -76526, -76639, -57160, -44283, -55176, -55507, -14571, -44063, 8652, 5506, -9831, 6538, -34656, -5050, -8701, 4521, 102183, 123429, 98836, 111861, 83337, -6267, -28744, 22446, 27673, 49579, 58945, 39620, 10324, -51664, -42217, -37245, -93236, -95047, -114573, -130315, -134589, -87722, -76441, -97945, -80274, -101220, -99470, -53595, -14618, 5815, 27317, 17162, -21938, -34593, 42864, 45463, 46950, 58968, 17121, 40435, 49958, -1052, -39853, -38098, -33581, -1649, 29466, -54504, -89011, -57060, -23134, 8716, -7275, -61119, -43645, -2099, -18946, -67395]
11516f7395M9544R3582O810l6314m3755n6851J8372K3092K4746J0535k1721n1474
11504e0829j7031L9811K2575L8893R816K3642L8119J6560o9978k8512L3992k1905
11492C5153l3049r456j9540q5225K1483J10376L8747J6537o3390L172p176k8788
11480b1156K5785J1705m9485J5796j1190k6067l495K5165L2165J3915R207j2628
11468I717l1787m0998j7051K6087L1669k6319n0581M6593j7344k0133j7914K1942
11456h6119l182O836k8257L1952o501m364L4575K2986J9843l6536l2782N8114
$$ y = [-67395, -17851, 75731, 82541, 46227, 2472, -54379, -36007, -12915, 11831, 22366, 645, -50829, -67860, -28049, -5474, 33419, 43235, 66877, 104996, 121556, 51578, 23066, 57058, 35153, 2104, -7352, -26892, -112117, -90634, 19742, 58489, 75026, 11636, 14808, 7632, -21156, 4629, 16334, -33151, -17355, -28545, -54612, -58107, -32942, -777, 13138, 22345, 9717, -22070, -63068, -80119, -54032, -22363, -48682, -99263, -52670, -70014, -90147, -108061, -86119, -89301, -82465, -110722, -78770, -85271, -89635, -55060, -32074, -12231, -48767, -81549, -23435]
$$ [...]
##END NTUPLES=NMR SPECTRUM
##END=
