##TITLE=Analysis number 319055
Compound Code ac 35886
Project Code adrs
Chemist Name frontier sci
##JCAMPDX= 6.0         $$ Bruker NMR JCAMP-DX V2.0
##DATA TYPE= NMR SPECTRUM
##DATA CLASS= NTUPLES
##ORIGIN= Bruker BioSpin GmbH
##OWNER= nmr
$$ XWIN-NMR		Version 3.5
$$ Fri Apr 28 11:02:41 2006 GMT Daylight Time (UT+1h)  MAYBRIDGE\nmr@NMR_250MHZ
##.OBSERVE FREQUENCY= 250.131544655141
##.OBSERVE NUCLEUS= ^1H
##.ACQUISITION MODE= SIMULTANEOUS (DQD)
##.ACQUISITION SCHEME= undefined
##.AVERAGES= 16
##.DIGITISER RES= 18
##SPECTROMETER/DATA SYSTEM= dpx250
##.PULSE SEQUENCE= zg30
##.SOLVENT NAME= DMSO
##.SHIFT REFERENCE= (INTERNAL, DMSO, 0, 16.522)
##AUDIT TRAIL= $$ (NUMBER, WHEN, WHO, WHERE, WHAT)
$$ ##TITLE= Audit trail, XWIN-NMR		Version 3.5
$$ ##JCAMPDX= 5.01
$$ ##ORIGIN= Bruker BioSpin GmbH
$$ ##OWNER= nmr
$$ C:\u/data/dgb/nmr/ADRS/3370/pdata/1/auditp.txt
$$ ##AUDIT TRAIL=  $$ (NUMBER, WHEN, WHO, WHERE, WHAT)
(   1,<2006-04-28 11:02:18.20 +100>,<MAYBRIDGE\nmr>,<NMR_250MHZ>,
      <created by zg, POWCHK disabled, PULCHK disabled
       configuration hash MD5:
       84 BC 41 DB A1 6E 1D 46 DA 25 12 A5 C1 ED C5 3A
       data hash MD5: 64K
       B3 2C 52 90 DE F0 79 77 45 34 6B 31 75 22 25 45>)
(   2,<2006-04-28 11:02:29.64 +100>,<MAYBRIDGE\nmr>,<NMR_250MHZ>,
      <Start of raw data processing
       ef LB = 0.3 FT_mod = 6 PKNL = 1 SI = 32K 
       data hash MD5: 32K
       15 6E 9D D5 0E D5 10 2B A2 DF C4 52 9C 7C DA 9B>)
(   3,<2006-04-28 11:02:31.28 +100>,<MAYBRIDGE\nmr>,<NMR_250MHZ>,
      <apk 
       data hash MD5: 32K
       87 04 6E 00 26 F4 60 1E FC 96 F0 0C 2A 52 73 89>)
(   4,<2006-04-28 11:02:32.06 +100>,<MAYBRIDGE\nmr>,<NMR_250MHZ>,
      <abs ABSG = 5 
       data hash MD5: 32K
       C9 73 0D B3 66 A9 6B C3 9F BA 44 C6 69 45 DA FF>)
$$ ##END=
$$ 
$$ hash MD5
$$ DE 03 40 5F 44 1B E8 0F B4 93 7B FA 43 2F 64 B5
##$RELAX= 
##$RELAX= 
##$RELAX= 
##$RELAX= 
##$RELAX= 
##$RELAX= 
##$RELAX= 
$$ Bruker specific parameters
$$ --------------------------
##$DU= <C:\u>
##$EXPNO= 3370
##$NAME= <ADRS>
##$PROCNO= 1
##$TYPE= <nmr>
##$USER= <dgb>
##$AMP= (0..31)
100 100 100 100 100 100 100 100 100 100 100 100 100 100 100 100 100 100 
100 100 100 100 100 100 100 100 100 100 100 100 100 100 
##$AQSEQ= 0
##$AQ_mod= 3
##$AUNM= <au_zg>
##$AUTOPOS= <18 >
##$BF1= 250.13
##$BF2= 250.13
##$BF3= 250.13
##$BF4= 250.13
##$BF5= 500.13
##$BF6= 500.13
##$BF7= 500.13
##$BF8= 500.13
##$BYTORDA= 1
##$CFDGTYP= 0
##$CFRGTYP= 5
##$CHEMSTR= <none>
##$CNST= (0..31)
1 1 145 1 1 1 1 1 1 1 1 1 1 1 1 1 1 1 1 1 1 1 1 1 1 1 1 1 1 1 1 1 
##$CPDPRG= <>
##$CPDPRG1= <>
##$CPDPRG2= <>
##$CPDPRG3= <>
##$CPDPRG4= <mlev>
##$CPDPRG5= <mlev>
##$CPDPRG6= <mlev>
##$CPDPRG7= <mlev>
##$CPDPRG8= <mlev>
##$CPDPRGB= <>
##$CPDPRGT= <>
##$D= (0..31)
0 1 0 0 0 0 0 0 0 0.06 0 0 0 0 0 0 0.0002 0 0 0 0 0 0 0 0 0 0 0 0 0 0 
0 
##$DATE= 1146218537
##$DBL= (0..7)
120 120 120 120 120 120 120 120 
##$DBP= (0..7)
150 150 150 150 150 150 150 150 
##$DBP07= 0
##$DBPNAM0= <>
##$DBPNAM1= <>
##$DBPNAM2= <>
$$ [...]
##$SUBNAM6= <"">
##$SUBNAM7= <"">
##$SUBNAM8= <"">
##$SUBNAM9= <"">
##$SW= 20.6930455092707
##$SWIBOX= (0..15)
0 0 3 0 0 0 0 0 0 0 0 0 0 0 0 0 
##$SW_h= 5175.983436853
##$TD= 65536
##$TD0= 1
##$TE= 295.16
##$TE2= 300
##$TE3= 300
##$TEG= 300
##$TL= (0..7)
0 120 120 120 120 120 120 120 
##$TP= (0..7)
150 150 150 150 150 150 150 150 
##$TP07= 0
##$TPNAME0= <>
##$TPNAME1= <>
##$TPNAME2= <>
##$TPNAME3= <>
##$TPNAME4= <>
##$TPNAME5= <>
##$TPNAME6= <>
##$TPNAME7= <>
##$TPOAL= (0..7)
0.5 0.5 0.5 0.5 0.5 0.5 0.5 0.5 
##$TPOFFS= (0..7)
0 0 0 0 0 0 0 0 
##$TUNHIN= 0
##$TUNHOUT= 0
##$TUNXOUT= 0
##$USERA1= <user>
##$USERA2= <user>
##$USERA3= <user>
##$USERA4= <user>
##$USERA5= <user>
##$V9= 5
##$VALIST= <valist>
##$VCLIST= <CCCCCCCCCCCCCCC>
##$VD= 0
##$VDLIST= <DDDDDDDDDDDDDDD>
##$VPLIST= <PPPPPPPPPPPPPPP>
##$VTLIST= <TTTTTTTTTTTTTTT>
##$WBST= 1024
##$WBSW= 4
##$XGAIN= (0..3)
0 0 0 0 
##$XL= 0
##$YL= 0
##$YMAX_a= 350931
##$YMIN_a= -499787
##$ZGOPTNS= <>
##$ZL1= 120
##$ZL2= 120
##$ZL3= 120
##$ZL4= 120
##$ABSF1= 16.522
##$ABSF2= -4.171173
##$ABSG= 5
##$ABSL= 3
##$ALPHA= 0
##$AQORDER= 0
##$ASSFAC= 0
##$ASSFACI= 0
##$ASSFACX= 0
##$ASSWID= 0
##$AUNMP= <proc_1d>
##$AZFE= 0.1
##$AZFW= 0.1
##$BCFW= 0
##$BC_mod= 0
##$BYTORDP= 0
##$COROFFS= 0
##$CY= 12.5
##$DATMOD= 1
##$DC= 0
##$DFILT= <>
##$DTYPP= 0
##$F1P= 14.0000005364418
##$F2P= -0.99999901652339
##$FCOR= 0.5
##$FTSIZE= 32768
##$FT_mod= 6
##$GAMMA= 0
##$GB= 0
##$INTBC= 1
##$INTSCL= 1
##$ISEN= 128
##$LB= 0.3
##$LEV0= 0
##$LPBIN= 0
##$MAXI= 10000
##$MC2= 0
##$MEAN= 0
##$ME_mod= 0
##$MI= 0
##$NCOEF= 0
##$NC_proc= -5
##$NLEV= 6
##$NOISF1= 0
##$NOISF2= 0
##$NSP= 0
##$NTH_PI= 0
##$NZP= 0
##$OFFSET= 16.522
##$PC= 1
##$PHC0= 163.453
##$PHC1= 7.270866
##$PH_mod= 1
##$PKNL= yes
##$PPARMOD= 0
##$PSCAL= 4
##$PSIGN= 0
##$REVERSE= no
##$SF= 250.13
##$SI= 32768
##$SIGF1= 0
##$SIGF2= 0
##$SINO= 400
##$SIOLD= 32768
##$SREGLST= <1H.DMSO>
##$SSB= 0
##$STSI= 32768
##$STSR= 0
##$SW_p= 5175.98343685301
##$SYMM= 0
##$S_DEV= 0
##$TDeff= 65536
##$TDoff= 0
##$TI= <Analysis number 999999
Compound Code 99
Book Reference 9
Project Code 9>
##$TILT= no
##$TM1= 0
##$TM2= 0
##$TOPLEV= 0
##$USERP1= <user>
##$USERP2= <user>
##$USERP3= <user>
##$USERP4= <user>
##$USERP5= <user>
##$WDW= 1
##$XDIM= 32768
##$YMAX_p= 301683816
##$YMIN_p= -656299
$$ End of Bruker specific parameters
$$ ---------------------------------
##NTUPLES= NMR SPECTRUM
##VAR_NAME=  FREQUENCY,     SPECTRUM/REAL,   SPECTRUM/IMAG
##SYMBOL=    X,             R,               I
##VAR_TYPE=  INDEPENDENT,   DEPENDENT,       DEPENDENT
##VAR_FORM=  AFFN,          ASDF,            ASDF
##VAR_DIM=   32768,         32768,           32768
##UNITS=     HZ,            ARBITRARY UNITS, ARBITRARY UNITS
##FACTOR=    0.157963299565203, 1,           1
##FIRST=     4132.6476996994, 0,             0
##LAST=      -1043.33573715361, 0,           0
##MIN=       -1043.33573715361, -656299,     0
##MAX=       4132.6476996994, 301683816,     0
$$ Real data points
##PAGE= N=1
##DATA TABLE= (X++(R..R)), XYDATA
$$ [...]
24617H3521l0304n5562K0597R4860L1350j7550J9148O7602Q3288m0804o1198J5288
24605B10236n9948p6139j1999Q8477j96300j13579R8177P7454J54242k9035N7895
24594A99481j17148k4863m260j07940L7233J760O3883P6489o6400m0482l8202
24583b0449P145N3199J13186K2740j51295j00920n268j39281m9162N6976M7519
24572a65610J35463P1933k4043n8192q6428O2017K0512k6401j54802m2796J49630
24561a18717J98178o7230m6420M0208j70810j3395J63138J72955p3639O6950j01997
24550D9221M384J0457j26636N3493J03555k5919J1136k0654m993o474j18928k6255
24538i7613O3030O8694r2479o2682n733J59926j1640k2741j52076j9703J18092
$$ y = [83521, 53217, -2345, 18252, 113112, 144462, 126912, 146060, 213662, 296950, 256146, 194948, 210236, 150288, 74149, 62150, 150627, -45673, -159252, -61075, 16379, 170621, 141586, 199481, 82333, 57470, 53210, -54730, -17497, -15737, 48146, 124635, 58235, 17753, -20449, -13304, 39895, 153081, 175821, 24526, -76394, -81662, -220943, -270105, -213129, -165610, -30147, 41786, 17743, -40449, -126877, -64860, -44348, -70749, -225551, -268347, -118717, 79461, 12231, -34189, 6019, -164791, -178186, -15048, 157907, 84268, 151218, 49221, 53605, 64062, -62574, -9081, 94474, 68555, 79691, 59037, 54044, 47570, -71358, -97613, -34583, 34111, -58368, -121050, -126783, 33143, 21503, -1238, -153314, -173017, -54925]
24527e4925L2406L1149J43693O0658j10565j81975k92J87637R8173N4726l318
24516B57367L8636r3052p8716j40217o5245K64826J60590j15333k47918k00603
24506b19665m2743L9370K1700Q1097K83131L1913P3007L6809j98049j16262n8983
24495f8675j38473p1253L4605N7578J07198j4169j54492J33959Q7360P3883k6399
24484B1122j67722R2696M3249J07382J18126k08391j96336o2738J46511P6298
24474b9803J34318o8719k39861j9563K34128J57285l5892M9955p1474l14830n4438
24463b58894O9110M620K4524R5612q5115L7494O532j27006P3101Q8437r5730n2372
24451b19687j32281Q3914J66160R8308O6288K873k89114j18451M0916K27650J79883
$$ y = [-54925, -22519, 8630, 152323, 212981, 102416, -79559, -79851, 107786, 205959, 260685, 257367, 296003, 202951, 124235, -15982, -81227, 183599, 344189, 228856, -19062, -219665, -262408, -223038, -201338, -120241, 162890, 194803, 267810, 304619, 106570, -9692, -68675, -207148, -278401, -243796, -186218, -79020, -93189, -247681, -113722, -26362, 47521, 21122, -146600, -53904, -10655, 96727, 214853, 6462, -189874, -252612, -106101, -29803, 104515, 35796, -204065, -223628, 10500, 167785, 131893, 181848, 110374, -204456, -258894, -189784, -185164, -160640, -65028, -150143, -112649, -106117, -233123, -160022, -71585, -167315, -219687, -351968, -268054, -101894, -3586, 62702, 65575, -223539, -341990, -301074, -73424, 106459]
24440A06459j036q6644L6239j3802J29970Q768j41485K8443p076j24313L6213
24429b8264L6687q8208J09585J43508j6410j65815j19901n5532J26318l3607n1204
24418a42843m4752J3912M0732K9596j30282p4276J55822l6024p0150K6901R9650
24407a31714J235j44207J16649R0791K02799J62034Q4572p413k2865j62347j05886
24396H3648j14483o8131J19891R7019j8346j03473M0360j21911r660P9029q9234
24385a05291j12674j2820j08829J576J21033M7052P6934o2483J09143m7393k2605
24374a16357K29479J03069L096o4785N457K401J55061Q3913r4012n6650j50495
24363A00177k6491j55841k2924R76m7029M4550P1035J16524n6663Q4764J49407
$$ y = [106459, 105423, 18779, 55018, 41216, 171186, 179954, 38469, 66912, 59836, -64477, -28264, 8423, -79785, 29800, 173308, 156898, -8917, -128818, -184350, -58032, -91639, -142843, -187595, -173683, -132951, -103355, -233637, -307913, -152091, -188115, -258265, -231364, -131714, -130479, -274686, -158037, -67246, 135553, 297587, 382159, 374746, 351881, 189534, 83648, -30835, -98966, 20925, 117944, 99598, -3875, 36485, -85426, -95086, -16057, -105291, -217965, -230785, -339614, -338038, -217005, -169953, -93019, -155502, -46359, -93752, -116357, 113122, 216191, 219287, 154502, 159959, 162360, 317421, 401334, 307322, 250672, 100177, 73686, -82155, -105079, -104103, -151132, -106582, -35547, 80977, 24314, 109078, 258485]
24352B58485O3013j14148J7859o6900q3556K9355j46437k7180K5754J48248N6097
24341A60590j6036p2431M4439L0665j68721r2132K3535J37679j91774n3248m0358
24330b37792J62232N0989Q6334N086p0346m0086L6894M8870k5386j97571k247
24319a83023P4421l7867J10057L1641j10529K0042k1473k732j22098N7243K03861
24308A9543O3280l6735o2746P3126j12622j82865q7377R3301J39455J12557Q9815
24297A08732n1949j61210J67327Q4548J01663M8817O8358p6596j60193m2822J39710
24286B26385o645j25430p9363J86688J2485n5327r1124j17972n5780k213m2559
24275a50855j37938R9507O5445M2082J28205o2118j40179L8739r7222M2355K91136
$$ y = [258485, 321498, 207350, 225209, 158309, 74753, 104108, -42329, -69509, -43755, 104493, 160590, 144554, 72123, 116562, 147227, -21494, -113626, -90091, 47588, -144186, -197434, -237792, -75560, -24571, 61763, 66849, -3497, -43583, -6689, 42181, 16795, -180776, -183023, -108602, -146469, -36412, -4771, -115300, -95258, -116731, -119463, -241561, -184318, 19543, 82823, 46088, -16658, 56468, -56154, -239019, -326396, -233095, -93640, 18917, 108732, 56783, -104427, 62900, 147448, 249111, 297928, 366286, 289690, 129497, 86675, 226385, 219740, 94310, 14947, 201635, 214120, 158793, 67669, -50303, -106083, -108296, -150855, -288793, -189286, -123841, -81759, 46446, -15672, -155851, -117112, -214334, -171979, 119157]
24264A19157K93094J1835j13298L262m2048j25403n6971q9670R5674J49230J43092
24253C87954j89280l5645n5771m1421o7284j53331R6316J05839j5876M192q1913
24242d6220q7249J03330J55262P0452p7711j33000J56335L4900K2137K1138j42556
24231G6818k23581j08424J7018R1950o247J1570M3756N704Q6003m6861j49878
24220b02172m3560j9343J78067O9501R8036J175J01732l3110k15800J2014l2633
24209h6093M8943L8537Q1748q514j650j22883J3425o8924j05779M2752M941O080
24197a57417M5399M2878N09O7352L4142j49245o789J44645J29904m3196j36173
24186b7991J00058O036J417J48459r2580k12998J01525N35k9955k5735J39863
$$ y = [119157, 412251, 424086, 310788, 314050, 272002, 146599, 89628, -42, 95632, 244862, 387954, 198674, 163029, 107258, 65837, -1447, -154778, -58462, 47377, 31501, 35693, -46220, -133469, -30139, 125123, 195575, 117864, -15136, 141199, 176099, 198236, 219374, 76818, -146763, -255187, -238169, -146219, -152466, -140896, -97140, -91436, -5433, -52294, -202172, -245732, -265075, -87008, -17507, 80529, 81704, 183436, 150326, -65474, -53460, -86093, -37150, 1387, 83135, 74621, 72971, -49912, -36487, -105411, -211190, -168438, -163497, -157417, -112018, -69140, -68631, -1279, 32863, -116382, -123171, 21474, 151378, 108182, -27991, 72067, 78103, 79520, 227979, 135399, -77599, 23926, 24461, -5494, -31229, 108634]
24175A08634K6938m3294k2510q2399K5414l9977m1300Q0457j51463j64827J96492
24164a07835R0930j13818n0640q7406Q1092J05281j75924K1791L15524J47156
24154B26151P0831l1085n44o9056n2101M0838J43186l6178k43839j48544J13556
24143A3215Q7697n228j62048P156m5791L9021M909j16417L4351J4384K4786j63342
24131b67307L9815J4356J14088J37533j4639m6451j0907j11127j7418P0046K12095
24120A20084n1532n9708o4250j08595j11045K3308J42336O2631M1162J15390P5297
24109A85078K4215Q2052K8693l6114m774o2538j39015m029j34889j70079j44014
24098c75414J51871J57146Q369m1792p7552J4790K4911J62996P1250M0075j10027
$$ y = [108634, 135572, 92278, 69768, -12631, 12783, -27194, -68494, 11963, -139500, -304327, -107835, -16905, -130723, -181363, -268769, -187677, -82396, -258320, -236529, 78995, 226151, 296982, 265897, 265353, 196297, 144196, 185034, 328220, 292042, 48203, -100341, 13215, 100912, 95684, -66364, -59208, -104999, -65978, -61069, -177486, -143135, -128751, -103965, -267307, -227492, -213136, -99048, 38485, 23846, -22605, -33512, -144639, -162057, -92011, 120084, 68552, 8844, -55406, -164001, -275046, -251738, -109402, -46771, -5609, 109781, 185078, 209293, 291345, 320038, 283924, 279150, 216612, 77597, 73568, -61321, -231400, -375414, -223543, -66397, -58028, -99820, -177372, -162582, -137671, 25325, 96575, 136650, 26623]
24087B6623k18910O1025J78425O5214j21242p0419J64349l803J5339o7356P9712
24076A08957j344L9509q3726L8256q169k23213m5897l7324n097J21523Q5685Q3550
24064G2710k0918K8206K38313o5214o5510l6468p2080r7125k4753q6676P5636
24053e3879m148M4088o3080J16323N1945j19681k19156q1354j7693j20205o4113
24042e30953K54509K80594L6381j22425q4645J04615Q0207r9406n3678J81978
24032D7177j05651M8373K00643R5539j46391q9102n6210n2029J18891l702k0584
24021C6954R8336n6465j42275Q8176K9721J32472J25298J27886J5324j52803j92972
24010A09652q8628o3339l5251j9412L450J45771J0686O6560J6364j22483p3471
$$ y = [26623, -192287, -131262, 47163, 112377, -8865, -79284, 85065, 81262, 96601, 29245, 108957, 107613, 147122, 63396, 101652, 93483, -129730, -175627, -212951, -218048, -96525, -10840, 72710, 51792, 79998, 318311, 253097, 187587, 151119, 79039, -18086, -42839, -129515, -53879, -58027, -13939, -77019, 39304, 91249, -28432, -247588, -328942, -346635, -466840, -530953, -276444, 4150, 40531, -81894, -166539, -61924, 18283, -81123, -134801, 47177, -58474, -10101, 190542, 286081, 139690, 50588, -5622, -57651, 61240, 57538, 36954, 135290, 78825, -63450, 24726, 54447, 186919, 312217, 440103, 455427, 302624, 109652, 21024, -42315, -77566, -96978, -93528, 52243, 62929, 129489, 145853, 23370, -50101]
23999e0101n8550p2545n1159K21690J10912j56806m9935P0667P8149L8943J865
23988H3130K7241R338o8601j03908P7955O9064N6333M0381m9086J351o8520o5507
23976I171O7752o6133J44112l6378J32953J38099r214j6866M9778j88270j20769
23965A04235o7274q7625j081N090J26326l6295q6026J45456O0024j92111r343
23954c8624J51006K51351j07850j19030k15686l6432n1964k4582o6796R5629J47958
23943a5020J48894j6801J00484k5041j21708K4232n3099j79493j51996N6271N8447
23932a74830J7739J02886N0036l3677k2258m0475J6826J79293J86743k01753j50946
23921g0416J18344P5347p2520m7421J7366k9743J470J8056K17686L5332k20338
$$ y = [-50101, -108651, -181196, -232355, -10665, 100247, -56559, -106494, -35827, 42322, 81265, 83130, 110371, 119709, 51108, -52800, 25155, 94219, 150552, 190933, 141847, 143198, 74678, 9171, 76923, 10790, 154902, 118524, 251477, 389576, 380362, 363496, 413274, 225004, 104235, 36961, -50664, -51745, -46655, 79671, 43376, -42650, 102806, 162830, -29281, -38624, 112382, 363733, 255883, 136853, -78833, -115265, -167229, -191811, -258607, -162978, -15020, 133874, 117073, 217557, 192516, 70808, 95040, 41941, -137552, -289548, -233277, -174830, -157091, -54205, -4169, -37846, -60104, -100579, -83753, 95540, 282283, 80530, -70416, 47928, 123275, 50755, 3334, 20700, -9043, -7573, 10483, 228169, 263501, 43163]
23910D3163K8343l536J65929m1805o7168K7392j4068j31347j28183M2167k9442
23899a08555K3710J45727r684o550J7326r8112L4897M2682l5335J75333m4627
23888A36812K5407J95349j32987j57041J8435J17066J61301q1416o7540j3224
23878B02162r7478M8482m0415j05652l7310o2246N2275J52468n0383l4851l5703
23867h651j30448O365P5328j09651Q6792J95446R9033j87625o8555P5717j49705
23856a15954Q2465N5058J14416M5618j40757L5178M9487j24799j62643P6628J61351
23845G6048L8313j84474j83428o9754K1147M1625k1559K38012j06058N0511O2877
23834c6740j7774N4185J69134K4186r2317j5316m0080n8163J3120P1001N5033
$$ y = [43163, 71506, 67970, 233899, 192094, 124926, 152318, 138250, 6903, -121280, -79113, -108555, -84845, 60882, 51198, 44648, 61974, -36138, -1241, 41441, 6106, 181439, 136812, 162219, 357568, 224581, 67540, 85975, 203041, 364342, 282926, 215386, 202162, 104684, 153166, 112751, 7099, -30211, -92457, -40182, 112286, 61903, 27052, -8651, -139099, -132734, -57406, -167057, -80265, 115181, 214214, 26589, -41966, 33751, -115954, -33489, 21569, 135985, 181603, 40846, 76024, 125511, 712, -161931, -85303, 76048, 114361, -70113, -253541, -323295, -302148, -260523, -282082, -44070, -150128, -99617, -36740, -54514, -329, 168805, 192991, 100674, 85358, 45278, -12885, 235, 71236, 126269]
23823A26269l7965j7894Q9512m8918j07115L4044J09422P9747j86094l3559J054
23812H503K6572r5310k7709r7863j51226J3350J72217J33508J79692j75634j34618
23801a48518J20902J09882N0868j09581J02087q7386N3715L622j18883l5892O8151
23790H967j20374l5953N1315K5606P1131m3918r0415Q7462P4480R3094O8597n2334
23778A37658j64228k21049k334J49815l2025j03968n78J57272K6185j3066j6472
23767h2790j04568j20201M0077P4097J4270Q1461J63528J90849r3984j28234k92021
23756b57516j62873J28792J37071L6709J60181L0304k8412p4198q0545n1024k46523
23745d08034J9629K74196K60096P836k7721k7515k75152k59034J50003K19251
$$ y = [126269, 88304, 70410, 159922, 111004, 3889, 37933, 147355, 227102, 41008, 7449, 8503, 35075, -60235, -87944, -185807, -337033, -323683, -151466, -17958, 161734, -13900, -148518, -27616, 82266, 133134, 23553, 125640, 38254, 91969, 95591, -23292, -59184, 8967, -111407, -147360, -96045, -70439, 692, -43226, -133641, -46179, 28301, 121395, 189992, 137658, -26570, -247619, -249953, -100138, -132163, -236131, -236709, -79437, -53252, -66318, -82790, -187358, -307559, -267482, -193385, -179115, -97654, 65874, 256723, 162739, 34505, -257516, -420389, -291597, -154526, -117817, 42364, 72668, 44256, -29942, -110487, -161511, -408034, -388405, -114209, 145887, 153723, 126002, 98487, -176665, -435699, -285696, -66445]
23735f6445J2638M082L1129J24199p6874Q32O7528j19711n8052R2212Q1829K7280
23723A20647r2637k2460O9716K7896K11758R0858Q3265r7042r9941p0279Q703
23712B30484k6692j78426N9967L1802L9306j27153r5332j27567r1400M0793K93809
23701D9591R2637j61096j79894j8519J02327J81616O6299q6067j10799J30869
23691F6964p1481j61188J37925J01170P258P6598j3745J30886Q8761K4286j71001
23680B16433k58024K7347J35081J19896p3853j67715j23811J29330K26575P7157
23670C08416L1627m4596p3573M6977p3449n5534j55228p208K00021N5565j50391
23659H2627k4824p7181J29983L5741r1237P605n5001l5095N7529m518j11530M4349
$$ y = [-66445, -53807, -49725, -18596, 105603, 28729, 29561, 97089, -22622, -80674, 11538, 93367, 120647, 28010, 5550, 75266, 103162, 314920, 405778, 489043, 392001, 292060, 221781, 230484, 203792, 25366, 85333, 117135, 156441, 29288, -66044, -193611, -285011, -244218, 49591, 142228, -18868, -198762, -217281, -114954, 66662, 132961, 46894, -63905, 66964, -4517, -165705, -27780, 73390, 80648, 157246, 143501, 274387, 363148, 387434, 216433, -41591, -14244, 120837, 240733, 166880, -835, -124646, 4684, 231259, 308416, 340043, 295447, 221874, 268851, 195402, 139868, -15360, -22568, 177453, 233018, 82627, 57803, -19378, 110605, 146346, 55109, 62714, 7713, -27382, 30147, 25629, -85901, -41552]
23647d1552n3052N1582R2617J10632O397o3030j6138M5689j3679L0563j02367
23636D7662k00038J9101J25543N4838J51632M4880k08658j07110k0074m2544L4157
23625a00611O407q5636j57901J61521J10668o4524m3918k5585K27751J09035k9658
23614A07549m9271j00773j11718M7261J45184j85581q7071J47680J16069J1842
23604D1171j87101L9975q5915j16923J34778J54222l3945j95109R998j58194M0250
23593c56793J67736J23312J30122L5883k0768j2086M9873n5283j09291j56237
23583b03532K4683J63641l4683r3206P1624K0523n0655J93036Q5928k4030N4585
23572B07914P14K15961j01865j41955j01506k50777k3975J48642J01005j19341
$$ y = [-41552, -94604, -43022, 49595, 160227, 166624, 103594, 87456, 133145, 119466, 150029, 47662, -152376, -133275, -7732, 47106, 198738, 243618, 34960, -72150, -92224, -134768, -100611, -94204, -179840, -337741, -176220, -65552, -130076, -173994, -199579, 28172, 137207, 107549, 58278, -42495, -154213, -106952, 38232, -147349, -234420, -86740, 29329, 41171, -145930, -105955, -191870, -308793, -174015, -19793, -53738, -248847, -238849, -397043, -356793, -189057, -65745, 64377, 100260, 79492, 67406, 117279, 61996, -47295, -203532, -178849, -15208, -49891, -143097, -71473, -50950, -101605, 91431, 177359, 153329, 207914, 208628, 424589, 322724, 180769, 79263, -171514, -195489, -46847, 54158, -65183]
23562f5183M7481j46566o6870q8039o2575O8210J27440L5865J37493j13284n649
23551a31677K2708J3884R4428R8590j49916o1966J11164j410M2739j28630J43343
23540E3257n699l3933J62269P202P5628j42356k21015o3261j84545k4409J29231
23529b47631n0571J83609R7281j07237J02004K20439N55j67439j22403J74622
23519H3229M6724j36205j66665p622L7135J10370R4447K02300K4566J2673j96545
23508A04407m553R1885p6584n9465J09362p3129j65975J46713Q5056K4658k1339
23497A61036k70361l6674J16777l5634J15835N1230l615k64693N6167J12607R956
23486A2631K301L9688J29759R2705j09299l4416n8315l9342n3626K5582L0664
$$ y = [-65183, -17702, -164268, -231138, -319177, -381752, -313542, -186102, -150237, -12744, -126028, -131677, -108969, -95085, -657, 97933, -51983, -113949, -2785, -4195, 38544, -90086, 53257, 47558, 13625, 175894, 183096, 258724, 116368, -104647, -167908, -352453, -376862, -247631, -298202, -114593, -17312, -124549, -22545, 197894, 198449, 31010, -91393, 83229, 129953, -6252, -172917, -180539, -143404, -33034, 61413, 263713, 288279, 300952, 104407, 99854, 191739, 115155, 55690, 165052, 91923, -74052, 72661, 157717, 182375, 161036, -109325, -145999, -29222, -64856, 50979, 102209, 98594, -166099, -109932, 2675, 12631, 14932, 54620, 184379, 277084, 167785, 133369, 75054, 35712, -17914, 7668, 38332]
23475C8332N551k51372K340q5645J39392J31257l8567Q0212P4382K7261j25661
23464b518j17233P2073r9496J76231J38537j13423k42513j23755O9199J57577
23454h5321p0360k9602p3674Q9850N8404N620j05885J39152M0679N4076k865j51796
23442a31722O9878P8959p6401K36766P9495l17788k4041J51990p0261J3041M2068
23431E1984P7501J81530L00137j01099l17349k49723l4680m5940j01299j54940
23421c93878R3429L0132Q5452J38427k35211J5579Q7399J00773P2003J33251Q8634
23410B15990J69664J07166k50171k96915p2916m1180M8672O8905J08231J76309
23400B33755P945j70715r2143J11539K03854j46694j41071j15883J54115P7661
$$ y = [38332, 43883, -207489, -205149, -290794, -151402, -20145, -58712, 21500, 95882, 123143, -2518, -119751, -47678, -147174, 29057, 167594, 54171, -188342, -312097, -242898, -85321, -155681, -185283, -258957, -169107, -110703, -105083, -210968, -71816, -31137, 22939, 20074, -131722, -61844, 17115, -59286, 177480, 256975, -60813, -84854, 67136, -3125, 9916, 51984, 129485, 311015, 611152, 510053, 192704, -57019, -91699, -137639, -238938, -393878, -300449, -270317, -184865, -46438, -281649, -266070, -178671, -77898, -5895, 127356, 215990, 385654, 492820, 242649, -54266, -127182, -168362, -119690, -50785, 57446, 233755, 241700, 70985, -21158, 90381, 294235, 147541, 6470, -109413, 44702, 122363]
23390A22363J3545j565m3831m006P6345O9111j67573j28225Q1651J37038j197
23379A53656J1347j35535J11046p7339m1979J3548J83019J2887q0010J4208R3109
23368B57957N8913n3160K537P6159M5951k152k38931j25862K0227K4390N2558
23357A18587J12845k17826k42535j8713J37743q0247Q6564P2916L2407J61594
23347A63335n2031m3898P5335J9952J4024j7874N2493j9139j75338k55574J95447
23336d3268K59162L1239j52485j14852J57366Q2309j03322j69291k5244J10644
23326C2258j56376j61369K4662Q3792Q8918J95522J4862j34450j4815k4374r522
23315f0892K5619j82070j3241K17967J96468Q8649j50035j67749K5176J61702
$$ y = [122363, 135908, 134343, 90512, 86506, 162851, 231962, 64389, -63836, 17815, 154853, 153656, 165003, 29468, 140514, 63175, 21196, 34744, 217763, 230650, 150640, 164848, 257957, 316870, 263710, 266247, 342406, 388357, 386205, 147274, 21412, 41639, 66029, 118587, 231432, 13606, -228929, -247642, -109899, -190146, -103582, -30666, 1741, 163335, 111304, 67406, 142741, 162693, 176717, 158843, 211336, 192197, 16859, -238715, -43268, 215894, 247133, 94648, -20204, 137162, 219471, 116149, -53142, -78386, 32258, -124118, -285487, -260825, -177033, -88115, 107407, 122269, -12181, -26996, -51370, -60892, -35273, -217343, -230584, -12617, 183851, 272500, 122465, -45284, -20108, 141594]
23305A41594m396J504j18961m774K37127m9773k60074o0136O3377n1792R8440
23294g864K36590n3645m8938K2203j15985q4434J11139q565J03922O6207J1315
23283B31945R1740p4286m8109j04606j3281k775p1746O148L3599k8943j7216J77247
23271A79717Q3671J11919p9264r4784L6922K0789M0395J21492l8778j32462k08190
23260D1427q3573n9045p0089K27610R2400k7144j6628r2512r7103M57J69972p00
23248H5072j10785o2988N0385O1284m3175J06298J46925q5905r2205L1263J0690
23237I6859P770O679j38j03797N3309L4832m6295j06028L8670J13207J64748j16148
23225A43668k9427J11473J15402R4788k17230j56141j97433P7088P6035K0622
$$ y = [141594, 137198, 138702, 19741, 14967, 252094, 202321, -57753, -117889, -54512, -106304, -7864, 228726, 175081, 126143, 148346, 32361, -52073, 59066, 50501, 154423, 220630, 231945, 323685, 249399, 201290, 96684, 83403, 80628, 8882, 15030, 48629, 19686, 2470, 179717, 263388, 375307, 296043, 201259, 238181, 258970, 299365, 420857, 382079, 249617, 41427, -42146, -101191, -171280, 56330, 148730, 121586, 104958, 12446, -84657, -84200, 85772, 85072, -25713, -88701, -38316, 22968, -20207, 86091, 233016, 147111, 54906, 86169, 96859, 104629, 111308, 111170, 7373, 60682, 95514, 49219, -56809, -18139, 95068, 259816, 143668, 114241, 225714, 341116, 435904, 218674, 62533, -134900, -57812, 18223, 38845]
23215C8845L740J16563j2647J6487O7224J37620o8759j94102k25749l2533K20880
23204F7569J60926J65134J68126J3208j88710j93871j9114k9180j4020J5367O9510
23193B14945R5460p1428l7230j4977M0485l5932j01847j60862j57347p8194P9173
23182b27754J9093m2514q9887P659J60471R955q457n6366M1956L8413R3756l0211
23170h3886j04481j12735R2284O2564J7984L4917K6311r4402k16517p9029J48381
23159c08609J04127J44266j13805j46153J97907M3769k0324R4128J7364J9057
23149C1727L5403K3681R4666J3135j70186j12376J29217K15452j69020m1546J73351
23138B23504O9011j18536j13665l6301P658j32665r106O7718M5010l5255J9750
$$ y = [38845, 42585, 159148, 146501, 162988, 230212, 367832, 299073, 104971, -120778, -153311, 67569, 228495, 393629, 561755, 574963, 386253, 192382, 173268, 144088, 130068, 145435, 214945, 310405, 238977, 201747, 186770, 227255, 191323, 89476, -71386, -228733, -306927, -227754, -208661, -251175, -341062, -333403, -172932, -162977, -171434, -227800, -185844, -147431, -53675, -83886, -188367, -301102, -208818, -146254, -128270, -93353, -67042, -161444, -377961, -456990, -308609, -204482, -60216, -174021, -320174, -122267, -78498, -98822, -4694, 12670, 31727, 67130, 90811, 185477, 198612, 28426, -83950, 45267, 260719, 91699, 50153, 223504, 292515, 173979, 60314, 24013, 31671, -100994, -110100, -42382, 2628, -32627, -12877]
23127a2877o390J43103M4394j07241j18462j43630j4628J01333j9654Q7941Q1507
23116C5396m2869o5074Q4823P6646P9565N2843k33363j65406q8164J32452L6395
23105i6756R8328n261m5124o101l731M1584m201o2197N1470J4610K1310J22379
23093A26310n663L7372r9446p6387K7331J99891j02371j58297J25252J71180k49328
23082d156K5500M3950j04541o1718K3008m1343J8869Q2314L4883j08731O3150
23071b8815J16850N7943R8309j24526k20520J05034K47903J7188l1493p2720j76611
23060a1458q6515r387O7505J50806J01358m4820j73955q8950L7574J33482o2489
23049A3151m7988J03800M9359R1976j01377l6607L7990o6801j73645k4272Q2341
$$ y = [-12877, -19267, 123836, 168230, 60989, -57473, -201103, -215731, -114398, -134052, -46111, 35396, -7473, -72547, 12276, 88922, 168487, 221330, -12033, -177439, -265603, -133151, -96756, 1572, -3689, -48813, -54914, -58645, -17061, -21262, -83459, -31989, -17379, 3931, 126310, 120647, 158019, 58573, -17814, 9517, 209408, 107037, -51260, 73992, 245172, -4156, 21344, 65294, -39247, -100965, -77957, -119300, -100431, -18117, 16766, -91965, -28815, 88035, 145978, 244287, 119761, -100759, 4275, 252178, 269366, 237873, 165153, -11458, -97973, -107360, -39855, 110951, 212309, 167489, -6466, -95416, -57842, 75640, 13151, -34837, 68963, 118322, 210298, 108921, 72314, 110304, 43503, -130142, -154414, -72073]
23038g2073m5392r8442L6638R0487j0079l2060n6889O2648m07Q6112P9082L4298
23026G3923p6982r2158J99032K0433l0776q5890j8534J9775J43213q4809j90929
23015a23702j10495J9392N1135o1246r9932K65553K56129O1717J9433l1001p3679
23004A73304n9462j42673j07590j0184N4737J4614k085j96879m7158O68N734n0422
22992c67396O2152J67420m0036j15305J22351K16656L2543n1313q9941l3608M4604
22981e1873J75952R242m8782m7547p4639L211J6316K05042K955m8097K9751J31428
22969C02959Q3620j51796j37962q0859j96767j49044k7969K35449J30784M6940
22959E5355p4575P2234r8388q8942n1346L9465K80662k7717N5579j02737k3567
$$ y = [-72073, -117465, -215907, -179269, -88782, -98861, -130921, -187810, -125162, -125569, -39457, 39625, 73923, -3059, -95217, 103815, 124248, 93472, 7582, -10952, 8823, 152036, 67227, -123702, -234197, -214805, -163670, -224916, -324848, -59295, 196834, 258551, 277984, 246983, 173304, 113842, -28831, -136421, -146605, -91868, -77254, -79339, -276218, -323376, -322708, -316974, -367396, -305244, -137824, -177860, -293165, -170814, 45842, 78385, 27072, -62869, -96477, -51873, 124079, 133321, 84539, 36992, -37647, -34436, -18120, 186922, 189877, 141780, 171531, 302959, 386579, 234783, 96821, 15962, -180805, -329849, -357818, -122369, 8415, 55355, -19220, 53014, -45374, -134316, -185662, -146197, 134465, 106748, 162327, 59590, 36023]
22948C6023J33301N913j51276K6767q1687R5898J69013J6749j09634l7031r293
22937I4743m8065l3789P6003M6516P8010k12840j06124j6795o8771k8187R6042
22926a23257j15518q4996O375J70998J96087n9117p4805l3120j31457j11433k7477
22915c87720R9471n5277N4247K05138J27629J1890O2624Q5734J945l19953k27446
22904c41718m5265J21031K58065O5631j22610j94679Q9082O2610j36424J68745
22894g5532K00037J5580J00692l1898j43976j99722r7037n1924n7131o789M8008
22883b99692r540R7691J20362P9387Q7025P5309j07930k24842j44917J68751K69598
22872A11202l9998q2087j16360r6155o4265r053J18107J70438j2065O135K8385
$$ y = [36023, 169324, 175237, 23961, 50728, -30959, 64939, 233952, 250701, 141067, 104036, 94743, 46678, 12889, 88892, 135408, 213418, 578, -105546, -122341, -191112, -219299, -123257, -238775, -323771, -317396, -146398, 49689, -9428, -84233, -117353, -248810, -360243, -387720, -288249, -343526, -289279, -84141, 43488, 55378, 118002, 203736, 205681, -114272, -341718, -386983, -265952, -7887, 57744, -64866, -259545, -170463, -107853, -244277, -75532, 124505, 140085, 240777, 208879, 64903, -134819, -231856, -283780, -340911, -347700, -299692, -309232, -211541, -91179, -11792, 75233, 150542, 42612, -182230, -327147, -158396, 111202, 71204, -10883, -127243, -223398, -287663, -296716, -178609, -8171, -20236, -14101, 14284]
22861A4284J604L7351R9501J11262o4722j38761q5773J01832J06709K50309J2980
22850D46576k84444j71465j30610l2799J39050K2684K2941j27599P3287J53774
22840A11395r7342r1063Q3356J38320J7576P2908k2393O1436L4636O5764k27433
22829A47160j51273M0405q9530o3776J22580J52089J37414l7421k03560r8378
22819d4290n286j2793j36923R2747j22163q6565N5556R3409O9496j4524O92m889
22807a15533j62609O1746J39855L9771R0182k6137n212m9406K2644m160q5866
22796i4725P2191N3948o7434j1813r583J38389R8114j01369K1728l8866j1743
22785D8837J50104O0286j01270j84240j08430k6584j09341j0947J39885R9444
$$ y = [14284, 15888, 53239, 152740, 264002, 199280, 60519, -25254, 76578, 183287, 433596, 446576, 162132, -9333, -139943, -172742, -33692, -11008, 11933, -115666, -42379, 111395, 14053, -77010, 6346, 144666, 162242, 235150, 212757, 274193, 308829, 374593, 147160, -4113, 36292, -53238, -117014, 5566, 157655, 295069, 257648, 54088, -44290, -49576, -62369, -199292, -106545, -228708, -315273, -259717, -166308, -96812, -111336, -110644, -115533, -278142, -216396, -76541, -36770, 53412, 27275, 22063, -27343, -4699, -8859, -94725, -22534, 31414, -36020, -47833, -57416, 80973, 179087, 77718, 99446, 60580, 48837, 198941, 259227, 157957, -26283, -134713, -161297, -270638, -281585, -141700, -42256]
22775d2256K8132K5060J15658p6350p4219j8595n0954O1977k18463K6127J26959
22764i6924J14743m7169k6938K30388l5832l8469J07038j14314k14836l0358o6353
22753b19024J69262k2834P8231J51799o1716j75464P2978Q867l5066O8287J80334
22742B15654k7290k62868q8141j72704l3656J65643K14096K3317p5262j15000
22732a56211J12637o9095k4059n6014k1633P7508M1452O8191q9510J756m8515
22721a63493N4020k2452o4012M2683J10649m5518j20518j27038J45913J02543
22711h7223R8155J9678m8471j71408J09956J55734J4689Q5559o1602o8311j36619
22700h9863j3833K9359q675J0443K2141o5130L1506J18142r2604j48799L3887
$$ y = [-42256, -14124, 10936, 126594, 50244, -23975, -42570, -93524, -31547, -250010, -223883, -96924, 17819, -29350, -56288, 174100, 138268, 99799, 206837, 92523, -122313, -152671, -219024, -49762, -72596, 5635, 157434, 95718, -79746, -6768, 2099, -32967, 35320, 215654, 188364, -74504, -162645, -335349, -369005, -203362, 10734, 34051, -41211, -156211, -43574, -112669, -136728, -192742, -214375, -136867, -95415, -27224, -116734, -114978, -163493, -109473, -131925, -195937, -153254, -42605, -88123, -208641, -335679, -189766, -87223, 10932, 30610, -17861, -189269, -79313, 76421, 91110, 176669, 115067, 46756, -89863, -103696, -74337, -83012, -72569, -50428, -115558, -84052, 34090, -58514, -207313, -173426]
22689a73426J93215J11984K0804L2058J57484K1355j94624j19478j73825o5507
22679a89960J17528m4582q8011l768J71901J19005O118q587r112k6620J51907
22668A95819J5875j09725N423q8829m7510j3344m8325J4846R72j89791l385J0185
22656b57789J25654P6609m0184j13095K6947M1472L0113n3090J63785J07104j669
22645A05857P0412q6761j58395P9570K00483n5820j28578n8049J50803J14686
22635B34208O1516n8091j42683R4049p4101L0491J03826L6972j06363p1876m4718
22624F3230k854L1645l2003p3090n2734K1339j3586P8629M9503O9502M143J05865
22612B49589m3245M9607j64854j42384j05914N9272J81361L3823N0536J0757r5067
$$ y = [-173426, 19789, 131773, 152577, 184635, 342119, 363474, 168850, 49372, -124453, -189960, -72432, -117014, -205025, -208793, -36892, 82113, 88231, 79644, 70532, 43912, 195819, 211694, 101969, 107392, 18563, -28947, -42291, -90616, -75770, -74798, -264589, -267974, -257789, -132135, -55526, -95710, -208805, -181858, -140386, -110273, -163363, 422, 107526, 105857, 176269, 89508, -68887, 10683, 211166, 155346, 26768, -31281, 119522, 234208, 295724, 237633, 94950, 188999, 114898, 145389, 249215, 286187, 179824, 107948, 63230, 60376, 92021, 60018, -13072, -65806, -44467, -58053, 20576, 70079, 139581, 143724, 249589, 206344, 255951, 91097, -51287, -157201, -97929, 83432, 117255, 167791, 178548, 83481]
22601H3481r6327j14460j2561J78306l3025l0699m099j61859L3201J10088J98407
22590A50453L094j21097N4883j61857p1642J92276K8172j56671j86753O8125L5423
22579a65594n8863J05234k0002K19186J39125P4056K0480K0727l225j98988j44618
22568a2482M1290l574m1692j40281r9365J84590k8736n8483n4873j02439l4820
22557c50865k667J0229K42325k6654j48857J29960R7857L4347n5071J67942K57488
22546C56034o4391k59145n6896j9743J0894j05543o6052O3455J11696N7494R8575
22535A26378j8135L8146L016j46577l2866m1456q0272L40K7942L7432R1769N1038
22523E6755J77581J94819j07464k87991n1749J4531j4521K01177Q9286P8023K6814
$$ y = [83481, -12846, -127306, -139867, 38439, 5414, -25285, -29384, -191243, -158042, -47954, 150453, 153547, 32450, 87333, -74524, -146166, 46110, 74282, -82389, -269142, -201017, -165594, -224457, -119223, -139225, 79961, 219086, 293142, 313622, 334349, 331124, 132136, -12482, 28808, 25234, -16458, -156739, -256104, -71514, -100250, -158733, -213606, -316045, -350865, -353532, -343303, -100978, -127632, -276489, -146529, -48672, -14325, -69396, 98546, 356034, 291643, 32498, -24398, -44141, -33247, -138790, -204842, -141387, -29691, 27803, 126378, 108243, 146389, 149405, 2828, -30038, -71494, -151766, -151426, -123484, -86052, 5717, 56755, 234336, 429155, 321691, 33700, -18049, -3518, -18039, 183138, 272424, 350447, 377261]
22512C77261o0538j2430K2842l5700j28409j01517k4537K5862O9569j01932R6424
22501A26895J15603J08840j48307k09268j89843L091J44333R5113k0018j45679
22491a19240j16462P0399R348R1775j05567p8015J00116J85744J25693J18739
22481B82530L9356p4338j07491n0935o9809j34010l1107J9565N7972j00502l8265
22470b07034l1744n2525N8862K07484K44369N8897p7233Q9363j43204Q6215m9866
22459A83584m9127J84243R3359j3618j34300j72094j9000J2545j14008N4056K8742
22448E4382l6032k473M7614L0263j48345j47196J1963j12333J33132K50954J60649
22437B42578o3115j89210m4870n8926j14602P6553K17420J46502j43739r8104
$$ y = [377261, 316723, 304293, 327135, 291435, 163026, 61509, 36972, 62834, 132403, 30471, 126895, 242498, 351338, 203031, -6237, -196080, -192989, -48656, 46457, 26439, -119240, -235702, -165303, -155955, -64180, -169747, -247762, -147646, 38098, 163791, 282530, 321886, 247548, 140057, 89122, 19313, -114697, -145804, -126239, -68267, -168769, -207034, -238778, -291303, -232441, -24957, 219412, 278309, 201076, 290439, 147235, 233450, 183584, 134457, 318700, 412059, 398441, 264141, 92047, 73047, 85592, -28416, 25640, 54382, 18350, 15877, 63491, 93754, -54591, -201787, -189824, -302157, -169025, 81929, 242578, 179463, -9747, -54617, -113543, -228145, -151592, 65828, 212330, 68591, -29513]
22427b9513m6740j33342k6540J14870k3223J3178m730k0285R647Q7309N1416j51332
22415a59285j1842J64265O0213J25965j624j376Q8159j82399k07332J33793R9532
22404A08069j00702j63465J562o8139J2220n144j0216K9977k4779K88019O5054
22393A32456q7546L1217Q9996J18234r3627j24923k69644r1487j04569J82743
22383b17150R6675j3664J83109J56036k11936r5628O4927l9819n751q5988j176
22372a70365M1719k2791J76012J1479j00247N7274K54838j7950j51561M8195j6793
22361A09810o9921k1461J02460J30852n0453l39063L9023R9411Q338K36479J93661
22350D39136j55292j54812q8294j22398l4104J89407O2148j7897J8543r0883n4013
$$ y = [-29513, -76253, -209595, -236135, -121265, -144488, -131310, -136040, -156325, -146678, -59369, -7953, -159285, -171127, -6862, 53351, 179316, 177692, 176316, 264475, 82076, -125256, 8537, 108069, 7367, -156098, -154536, -222675, -210455, -215599, -225815, -195838, -220617, 67402, 132456, 44910, 76127, 166123, 284357, 190730, 65807, -203837, -295324, -399893, -217150, -120475, -134139, 48970, 205006, -6930, -102558, -37631, -77450, -83201, -169189, -170365, -128646, -151437, 24575, 36054, -64193, -6919, 247919, 229969, 78408, 126603, 109810, 39889, 18428, 120888, 251740, 201287, -137776, -98753, 658, 8996, 245475, 439136, 283844, 129032, 40738, -81660, -115764, 73643, 135791, 117894, 136437, 45554, -8459]
22339h459l7229n6198M8150J92300N9927L6523O2675J12460j27838j18764o3781
22328I9766J16040j63354j37051k00187j35805j6227m9208J87610J58425j00246
22318b40237j5791J25245J17856l566r722P1383j27464p1917m4500J00583J73309
22307G5179N0836Q989j2010m4660j45256j0185J27265j07784m07L1325k30091
22296b56799k65589J21222J10299J08872O2127K29883l4807j43923n0789p4485
22286a93989o4600J03250j2146O3591L494q819l2204M9542R0569O4183p0121j15789
22274a23039K06598n1570r5165Q1019P9432N4998q3729j25418j80726K1407K40274
22263B4081R1861m2117j78459j67783J91613K43431j93506r5543q5453M4498K1618
$$ y = [-8459, -45688, -101886, -53736, 138564, 198491, 235014, 297689, 410149, 282311, 163547, 99766, 215806, 52452, -84599, -284786, -420591, -436818, -486026, -298416, -139991, -240237, -256028, -130783, -12927, -16493, -26215, 45168, -82296, -154213, -198713, -98130, 75179, 126015, 135004, 122994, 78334, -66922, -77107, 50158, -57626, -58033, -26708, -256799, -522388, -401166, -290867, -181995, -119868, 110015, 75208, -68715, -119504, -193989, -258589, -155339, -167485, -103894, -100400, -109219, -141423, -91881, -1312, 62871, -7250, -123039, 83559, 31989, -63176, 17843, 97275, 152273, 68544, -56874, -237600, -216193, 24081, 115942, 73825, -104634, -272417, -80804, 162627, -30879, -126422, -211875, -167377, -145759]
22252a45759L5285L3828j1419j4319Q7676r216J24147J49854j58492m3724j31628
22241h3767M2631j0628J04625j87555j95411R5374r9776j9099O840R5355R3740
22230a57671N4520n4363m1766j1240K5161J37186R5388J42910P6642j45158j65577
22219d3968n9157J82120R5185n2792p1213o971p1238j89687o9510J9601j0428
22208b78058Q2609J54828m8850O238k5792o2022j8942j46912m2020J21144J12710
22197a45067J29018J917o1536J66677J88888L064j90810j10180J39823q7265j00858
22186f6329O6883Q3890n9759j02042Q3856j5746o6146j60727J3319J28063o1215
22175a55953p5838N0645Q4457N5992k6887j1608J553l525N2632o5736k4664J32538
$$ y = [-145759, -110474, -76646, -88065, -102384, -14708, -23924, 100223, 250077, 91585, 47861, -83767, -41136, -51764, 52861, -134694, -330105, -234731, -334507, -353606, -346766, -251411, -157671, -103151, -157514, -199280, -210520, -185359, -48173, 47215, 190125, 266767, 121609, -43968, -103125, 78995, 174180, 121388, 50175, 43204, -28034, -217721, -287231, -267630, -278058, -195449, -40621, -89471, -83233, -109025, -171047, -189989, -336901, -378921, -257777, -145067, -16049, -14132, -75668, 91009, 279897, 282961, 92151, -18029, 121794, 34529, -66329, 554, 84444, 24685, -77357, 6499, -9247, -75393, -236120, -222801, -94738, -155953, -231791, -181146, -96689, -40697, -67584, -79192, -77639, -81164, -28532, -94268, -118932, 13606]
22163A3606n8746K1779J33599m3036j10065q570J87641L8335k11j24402n7709
22152g779m9456Q8853K5263k7783k3042Q0023J74921k00311j92973q4843J3014
22141b04113P5403k25P8014M798O292m1709p646R1381K04289j76430j28252j9881
22129a18079j21289K7509J54943L06805J65180q3279k43638j25150M2168n6975
22119e1805r6666J71677J17462r1304o4439J15724P4492j31197j06380j47070
22109b09506R6222R4850J15744M933K3583J55368O6200l9371j49752j24941j25008
22098i1678j20146r9207j42766k8024R0582J08717P6196o7080p816J15063J05310
22087f0849J4026n9868j33198R5675J06736j48769m4881J92469J65439k9010j19587
$$ y = [13606, -45140, -23361, 110238, 67202, -42863, -51433, 136208, 174543, 174332, 49930, -7779, -57235, 31618, 56881, 29098, 6056, 86079, 261000, 60689, -132284, -217127, -204113, -128710, -128935, -50921, -46123, -39831, -81540, -89186, 2195, 206484, 30054, -98198, -118079, -239368, -211859, -56916, 249889, 415069, 331790, 88152, -36998, 5170, -51805, -148471, 23206, 140668, 49364, -15075, 100649, 175141, 43944, -62436, -209506, -113284, -18434, 97310, 102243, 125826, 281194, 347394, 308023, 158271, 33330, -91678, -211824, -311031, -453797, -481821, -391239, -282522, -206326, -273406, -281222, -166159, -60849, -46823, -106691, -239889, -144214, -37478, -186247, -231128, -38659, 126780, 97770, -21817]
22076b1817n7001J40551J29744m9105j54590k5502J60793N3178L5888J2058j22990
22065A01207P3819l6992j1099r8561j02163m3045j9403q8836r3190J80706M7353
22054i0204P2751k560j947o1343o300K81993N4392j71198j9340M7369l5355j12811
22042d4553r0066k1170k7719j3454K037m7175M4235J55432M6058k4124r4766n278
22030a20543L9362O2645O2465k5017O3361J097j64519p2295j0662j16590j37375
22019d18071o373J92014K152J01257K2262L6852K40058l1068k2988k4318j18567
22008b6790L1643M0738R207m6162l8757L003m4638m7379j5115O4746r0299n2271
21996b12074J3209M1702q7886j362Q0024L8575O5436R2077K1279P8133j12299
$$ y = [-21817, -78818, 61733, 191477, 142372, -12218, -37720, 123073, 176251, 212139, 224197, 101207, 175026, 138034, 126935, 28374, -73789, -116834, -136237, -225073, -318263, -137557, -90204, -17453, -20013, -21960, -83303, -89603, 192390, 246782, 75584, 56244, 103613, 68258, -44553, -134619, -155789, -183508, -196962, -194925, -242100, -197865, -42433, 3625, -20499, -115265, -120543, -81181, -18536, 43929, 18912, 82273, 83370, -81149, -153444, -164106, -280696, -418071, -424444, -232430, -230278, -129021, -106759, -69907, 170151, 139083, 116095, 91777, -26790, 4853, 45591, 54798, 8636, -30121, -27118, -71756, -119135, -134250, -69504, -159803, -212074, -198865, -157163, -245049, -246411, -166387, -127812, -62376, 29701, 50980, 129113, 16814]
21985A6814k5532P9747R3612n2760p7536L2883R3231l5103q9409M1497l7450k848
21973C7146m0887n2811L9335N7274j42588k5280p4870j0066M4977O0410j57656
21962b65016j73077J20743J92004O0617q6370P7975M7304O5730l5582M5039o6699
21951a7332Q3350J05782j0675j31875N0524K1914o7763J95761P4082l7256j19700
21940A46812o8928k77953j32107K42770P9933r995L2832N747k73337n3105L5902
21929b71429J80297N9620n1730j26285J72183J26834j9816K9452Q5278L6677k57543
21918c6462j47424P7812J84467J90248l904j04570j16094J55850J24169p5716
21908B48376j14990J1021J29841j52817J9345N931L3337l5078L0952J8869K0998
$$ y = [16814, -8718, 71029, 164641, 111881, 34345, 67228, 160459, 125356, 35947, 77444, 39994, 37146, -3741, -56552, -17217, 40057, -102531, -127811, -202681, -212747, -167770, -107360, -265016, -438093, -317350, -125346, -64729, -151099, -73124, -25820, 39910, 4328, 49367, -17332, 66018, 171800, 161125, 29250, 79774, 101688, 33925, 229686, 303768, 266512, 146812, 77884, -200069, -332176, -89406, -9473, -19468, 13364, 19111, -254226, -307331, -271429, -91132, -31512, -83242, -209527, -37344, 89490, 69674, 99126, 184404, 221081, -36462, -183886, -106074, 78393, 268641, 264737, 160167, 44073, 199923, 324092, 248376, 133386, 144407, 274248, 121431, 140776, 146707, 180044, 144966, 175918, 194787, 215785]
21897B15785O6572r8408j43938j44728m8143Q0624Q2078J77504O3271N3641p9325
21886B24933j87975j69607j4552M7859J69711k50229J9171L05025R941m9324j33202
21875b8249R538J12604p4082j35067J96613J92963j93119j37431J12874j0014
21865D6630n7922p2281q5730n0558l4799l8859J31959J8343R2405j06223j0129
21854a67164N056M0907n7187n6974o842J9921M2504M4889J85670p5280j20308
21843a44808L6636k2868j10889J0117K40433J42883r6583k64113N9654Q3888J49471
21832H3821L0005L6730p1651j16298K5951l1397K9007K0336j41150j7179K1641
21821a30184q3119k8574N661K38240l4612J1947j36143m2369J55106N5534N0655
$$ y = [215785, 282357, 183949, 40011, -104717, -152860, -72236, 9842, 187346, 250617, 304258, 224933, 36958, -132649, -147201, -99342, 70369, -179860, -160689, 144336, 154277, 104953, -28249, -18711, 93893, 19811, -115256, 81357, 274320, 81201, -56230, 56644, 46630, -11292, -83573, -169303, -219861, -254660, -293519, -161560, -143217, -50812, -157035, -167164, -162108, -121201, -178388, -235362, -242204, -222283, -179779, -134890, 50780, -24500, -144808, -108172, -131040, -241929, -231812, 8621, 151504, 54921, -209192, -149538, -65650, 83821, 113826, 150556, 78905, -37393, -11442, -42839, -13832, 6504, -134646, -151825, -130184, -213303, -241877, -236216, 2024, -32588, -20641, -156784, -199153, -44047, 11487, 62142]
21810F2142r2625o3868L8188J13001m5715K868p6615m5676O1919P1444j137j4697
21798I229J19179J23994N4723r1478j97106j13130O9918O8194n3273j67377p2830
21787b49957J9575l7356Q8575J93186n5989r8667l3971R3353M1078L0432k3347
21776c3088j39097J2144n155k8415n513o1263l6169q4521l7846J60116K20003
21765c8804J64016r1270j58922n4510n3893J35127q3718O7735P4299L0529l1883
21754d1294r6483k3156O8731P4461O7105M3613m8656j29229j26532j65818J18968
21743b58290Q2291M5219n9777O7533n8960j09383J94592J57305q0894L6481J86174
21732B02291j97813p9320Q4926j4838N4490M1094m8931l0120o065M9877m5899
$$ y = [62142, -30483, -94351, -56163, 56838, 11123, 13991, -62624, -108300, -46381, 25063, 23926, 9229, 128408, 252402, 307125, 215647, 18541, -94589, -24671, 43523, -9750, -177127, -249957, -230382, -267738, -179163, 14023, -41966, -140633, -174604, -81251, -40173, -9741, -33088, -172185, -160041, -165196, -193611, -199124, -260387, -296556, -381077, -418923, -258807, -38804, 125212, 33942, -124980, -179490, -233383, -98256, -181974, -114239, -39940, -9411, -41294, -137777, -160933, -92202, -17741, 49364, 92977, 44321, -84908, -211440, -377258, -258290, -175999, -130780, -190557, -123024, -181984, -291367, -96775, 60530, -20364, 16117, 202291, 4478, -74842, 10084, -4754, 49736, 90830, 41899, 11779, 5714, 55591, 9692]
21721I692o1630J5817p2008K1930O4950o0767M102j10116l9436K61101J13778
21710A47413Q0145r5718k58814j3019K03028K6813K1551J34405k5264j57483j50592
21699h7535P772M3382m947J53429j4654J4153J89608m3819l32280r0916J29338
21688c6469L1965n8826O1796j39125M4952M8821J32385Q1967p4112q0255r7144
21677h4045M911l489k7581R4030L1986q2370L5668m26l5063N5757j2435J01188
21665G8131J78387j95230k69154O9715M8840n8617r8821p409J79772k2862k72711
21654c69959k1825J97236L1068j74610j01961L13157K18421M255r7260p2130M5808
21643b7800p4834L0009k8861N1127j15623M4938Q1117K55542l0351j17792j12536
$$ y = [9692, -51938, -36121, -108129, -86199, -21249, -82016, -77914, -188030, -227466, 33635, 147413, 227558, 131840, -126974, -139993, 63035, 89848, 111399, 245804, 220540, 63057, -87535, -79763, -36381, -41328, 112101, 97447, 111600, 301208, 257389, -74891, -165807, -36469, -4504, -63330, -1534, -140659, -95707, -46886, 85499, 167466, 93354, 13099, -84045, -79134, -82623, -110204, -16174, 15812, -66558, -30890, -31316, -66379, -10622, -23057, 78131, 256518, 61288, -207866, -138151, -89311, -147928, -246749, -254158, -74386, -97248, -369959, -391784, -194548, -163480, -338090, -440051, -126894, 91527, 95782, -1478, -73608, -27800, -102634, -72625, -101486, -50359, -165982, -121044, -39927, 215615, 185264, 67472, -45064]
21632d5064M9611Q4705J64956J7191p9365k00871j9458J40533k6635p3980j08550
21621i6927r0965l5952n9487J74806L252j30910l2925L15996J12950j89531o8729
21610i8422M4484j4791R1423j17059l4380M2908m6664j36742M8048L1546K6436
21599a63213N5003J91411q3170j12028r3447j3507N1586P7428p0760M7293O4358
21588d9046M911Q2118R7334j56665k3109l3626n4548n8966O1837J83543L6973
21577I0756J1927J24183M0242j05364K7451j19808o8058K5466Q7379n2657O4375
21566A25892j6879o5638n5494r5906K8250M3849P2925R367Q4330J197l5834p2354
21554B3705j81990o6657J41087M4370j01919q3548L7310j8972J83287J40246o6281
$$ y = [-45064, 4547, 89252, 254208, 271399, 192034, -8837, -28295, 112238, 85603, 11623, -96927, -187892, -223844, -283331, -108525, -105273, -236183, -269108, 46888, 159838, -29693, -98422, -53938, -68729, 22694, -94365, -128745, -85837, -132501, -269243, -221195, -189649, -163213, -108210, 83201, 31, -111997, -205444, -218951, -167365, -89937, -160697, -113404, -49046, -44135, 37983, 135317, -21348, -44457, -78083, -132631, -191597, -129760, 53783, 90756, 102683, 226866, 267108, 161744, 189195, 69387, 1329, 26795, 114174, 61517, 125892, 109013, 43375, -12119, -108025, -79775, -35926, 36999, 46366, 130696, 131893, 96059, 23705, -158285, -224942, -83855, -39485, -141404, -224952, -187642, -206614, -23327, 116919, 50638]
21543E0638r6288k07170L07769J39964j32995j21599K755J9769k4405m318l1662
21532i7542q1445j09762J07513R8197M7621k20946J2964M0970K33396N5232M980
21521I1178k06729m254L5157M1227k9418n8093M6648N9407Q8104j14520l90l5835
21509h7518l4060o0641K13441J5179m1883J36736o6742K550J18410Q2931R9230
21498C77633o4495k17732j75143j06971N1962j12265K531J57266J83819R2119
21488A88724j79863j71180P7369R0171j60220j35621O9530j2897P0556n0785L6612
21477a77604Q8122j8575O4929J62862j10515o919p5977J13453J25611p6550r4437
21466e600Q6286N3244q0697M981J4967k03922j04806K8525J8901M0188K12081
$$ y = [50638, -45650, -252820, 54949, 194913, 61918, -59681, -56926, -37157, -61562, -65880, -97542, -178987, -288749, -181236, -83039, -35418, -256364, -243400, -202430, 30966, 86198, 91178, -115551, -119805, -84648, -43421, -72839, -130932, -84284, -24877, 63227, -51293, -51683, -87518, -121578, -182219, 31222, 46401, 4518, 141254, 74512, 77062, 195472, 278403, 377633, 313138, 95406, -79737, -186708, -134746, -247011, -244480, -87214, 96605, 188724, 8861, -162319, -84950, 5221, -154999, -290620, -221090, -233987, -163431, -214216, -177604, -89482, -108057, -43128, 119734, 9219, 2300, -73677, 39776, 165387, 88837, -5600, 80686, 133930, 53233, 58214, 73181, -130741, -235547, -207022, -188121, -147933, 64148]
21455F4148M5209j23781j84595m5888J67651o6068N352k026k175j38271N0352
21444b30092J22383K950Q166K28337l9309j55631M1908m0295q7962p5107Q9620
21433a35032K27752Q9856j88689k38444m3326J04377J61477n2742M3198j6019
21423d7592P737p2136j19756J39577J38627n7676l0326l0559j33636k9239O7005
21412a67974P0121k4446m3417J75606j03173m5199J1961N7754j33304l46j1401
21401b13818O6164J24658l3962j55489j68310P9898k0682L9324Q8414L75867J04935
21390B86999J1918n5566j66875R2594p2736j79371j03523J92153J93619q4332
21380A14880k12672j51173k2693M8099j311N5094L3079K5981L4559J29108J76147
$$ y = [64148, 109357, -14424, -199019, -244907, -77256, -143324, -137972, -139998, -142173, -280444, -230092, -107709, -104759, -96593, 131744, 92435, -63196, -21288, -61583, -149545, -224652, -135032, 92720, 182576, -6113, -244557, -287883, -183506, -22029, -74771, -31573, -47592, -39855, -111991, -231747, -92170, 46457, -11219, -41545, -72104, -205740, -234979, -167974, -97853, -122299, -165716, 9890, -93283, -138482, -126521, -68767, -202071, -202417, -213818, -147654, -22996, -56958, -212447, -380757, -300859, -321541, -282217, -193803, 182064, 286999, 298917, 243351, 76476, 169070, 96334, -83037, -186560, 5593, 199212, 114880, -97792, -248965, -271658, -223559, -224870, -169776, -136697, -110716, -76157, 52951, 229098]
21369B29098m6355j36810J0553p5833o7595M7680K1260R9982m786n5057n0832
21358b8695J88850j7260k02604j08258R6399K0656j0846l9557P7629J05993n7682
21347B4625j13924l1916Q1985P934j40465J7770M5245l7132L4413J58467M8031
21336I5033K2852J28853j398j93522j23249l311o839m1354j04302Q323K0271p3811
21324b72454j20156Q3129K9247J23147Q9022l0186J40875K21919j62652m1572
21314F0319n5027m5060k07182m8572Q5882p111j00925P0281q6127J2581J66357
21303a54584K4320M5345P8355K19685o158M5209j09894k57288Q633j4378o2293
21292a83048Q8613k3592Q229j02015k427J15245Q239K816r7909j8137J1557k01774
$$ y = [229098, 182743, 45933, 56486, -19347, -86942, -39262, -18002, 81980, 77194, 22137, -28695, 160155, 142895, -59709, -167967, -71568, -50912, -61758, -101315, -23686, 82307, 24625, -89299, -121215, -39230, -31296, -171761, -153991, -108746, -145878, -111465, 47002, 95033, 117885, 246738, 245340, 51818, -71431, -74742, -81581, -122935, -227237, -218914, -198643, -272454, -392610, -309481, -280234, -157087, -68065, -98251, 42624, 264543, 101891, 60319, 5292, -39768, -246950, -295522, -209640, -216751, -317676, -247395, -333522, -320941, -154584, -130264, -84919, -6564, 213121, 206963, 252172, 142278, -115010, -106377, -120755, -183048, -94435, -118027, -109798, -211813, -214240, -98995, -90756, -87940, -185849, -203986, -192429, -394203]
21280c94203l3089M6001K6648k6400J55052L34822N690o678j18854q9196N4092
21269d6115J18233J13350o4999j04301k3350j4888j55258O265Q7522j1861k888
21258i8290n8648N4105q0281j83863P6869K09319P4357J39612J9883P3505p09
21247B25859O900j31426j80063q6487O951K21199j0430J4468m0783n9613J1501
21236b1924J12390m6875J5001J36609J489k3316k8152j13069j54358k11910r0249
21225d24364J0801J10930K6789P119J55862Q2743J40326L9784J7592n6614k4608
21214H6360M4638J2149n7314P455P3825j29008k9598J2906l9214L5942j39551
21203a21410o0710P0793j60666J3990J45945Q6845j14713p4847m5394l1304J78482
$$ y = [-394203, -427292, -381291, -354643, -381043, -225991, 108831, 114521, 107843, -11011, -100207, -46115, 72118, 185468, 120469, 16168, -7182, -22070, -177328, -171063, -83541, -95402, -98290, -156938, -102833, -183114, -366977, -290108, -80789, -6432, 133180, 153063, 226568, 225859, 232759, 101333, -78730, -165217, -158266, 62933, 52503, 66971, 26188, -33425, -21924, 90466, 43591, 58592, 195201, 196690, 173374, 145222, 32153, -122205, -334115, -424364, -413563, -302633, -275844, -268725, -112863, -30120, 110206, 149990, 167582, 110968, 86360, 130998, 143147, 85833, 93288, 167113, 38105, 8507, 21413, -17801, 18141, -121410, -182120, -111327, -271993, -258003, -112058, -25213, -139926, -214773, -260167, -291471, -112989]
21192a12989J7115r9098K35619Q0490K7338K2725j95953M4087j7997q7634J05875
21181A9578J47912J1817n9393n6106j80451j60298r1882J01005J7780j85225o1203
21170d96466k0746J15894L50249J92712q0651j2593L9293j4540j09955L3046P4871
21159G1114j69095J42620O9424j63632k22902J47238J43685N3164O6266J08766
21149B46648L4508j21618j33011J04714k6180j89820J630k0989L5712m1112j74821
21138b84339J74074K18545n6074j42491l5182K75359J19168j24957k22360j63738
21128b41995j44527P4275P4816O0254q2233M6182J06870J16199J40507q126n4874
21117H7348j92217q516R1583j1905R2376j09089o7149m1857p5226J7880n9130
$$ y = [-112989, -95874, -194972, 40647, 121137, 148475, 171200, -24753, 19334, 1337, -86297, 19578, 167490, 179307, 119914, 63808, -116643, -276941, -368823, -267818, -250038, -435263, -496466, -517212, -401318, -51069, 141643, 60992, 48399, 87692, 73152, -36803, -3757, 71114, -97981, 44639, 114063, -49569, -272471, -125233, 18452, 71616, 137882, 246648, 281156, 159538, 26527, 131241, 105061, -84759, -83129, -104118, -68406, -109518, -284339, -110265, 108280, 52206, -90285, -125467, 149892, 269060, 144103, -78257, -241995, -386522, -312247, -237431, -177177, -259410, -213228, -106358, 9841, 150348, 142222, 87348, -104869, -113385, -21802, -33707, 58669, -50420, -117569, -159426, -234652, -216772, -275902]
21106b75902R7513J20471m0840K35320K31090r6456k13334j45137J3361M6697
21096b7217j11053J94513P0474N9221M5688k43425k89192r1385O1446J00869l790
21085b33851j8492P6638M1330l3003k9360j07402K32162L5667J14886J6285j58535
21074f3675K9394J31326k37010r5405J69945J4508L2024J5531j4763o890R9444
21063G4429j71337n8094Q0067M9837J8512p7846M8234r7081j13879n1071N8486
21052b39743M0629J32191J02891n2672l1743K9444J6299k9518q4181k19616o4227
21041d00246P8820J33319R3119j83886r2316k7037J17644J51605J13001M0642
21031B4665n9618j53387j21056M5303K55458P4293j45725N6772P3239q2942j78200
$$ y = [-275902, -178389, -57918, -98758, 136562, 367652, 271196, 57862, -87275, -73914, -27217, -138270, 56243, 126717, 185938, 231626, -11799, -300991, -392376, -330930, -230061, -233851, -252343, -175705, -134375, -167378, -196738, -304140, -71978, -36311, 78575, 94860, -63675, -34281, 97045, -139965, -235370, -65425, -50917, -18893, -3362, -18125, -25015, 74429, -96908, -155002, -74935, -25098, -6586, -84432, -36198, -133279, -247158, -298229, -239743, -199114, -66923, 35968, -16704, -48447, -19003, -2704, -32222, -116403, -336019, -400246, -321426, -188107, -94988, -278874, -371190, -398227, -280583, -128978, -15977, 24665, -34953, -188340, -309396, -264093, -8635, 65658, -80067, -23295, 49944, -32998, -211198]
21020b11198l9250J25786J60331M8146j56440k45487j0098L8443R9648J41916
21010d8203O8887m423k4493l0939j77122j17038J33434M5576j07032N9730P0284
20999a31339j0809J2839J166j4041M4980L1862j30662r8913n7395K12457J49334
20988I479n3898q754k20741l5893J68643Q5181j07107j03422q0525J58529J85043
20977c465l864J8719j79354K637J6999O7087J21571j29549l7023Q5018P9275N3010
20965I1061n5218m4090o5402n2338p21M4005J5082N1547j64763J5881J84643J12401
20953A32088j0320q564j07763j65538Q2182J16984Q4535K1524J444q2827j6536
20942D7209L2633J3773P4385J7003o2417j61057K2058J31382j96573j59021J8613
$$ y = [-211198, -250448, -124662, 35669, 83815, -72625, -318112, -328210, -289767, -190119, -48203, 20684, 16261, -8232, -39171, -216293, -333331, -199897, -154321, -261353, -201623, -131339, -142148, -129309, -128143, -142184, -97204, -65342, -196004, -294917, -352312, -139855, 9479, -44419, -53173, -273914, -309807, -141164, -55983, -163090, -266512, -347037, -188508, -3465, -7329, 11390, -167964, -165327, -148328, -81241, 40330, -89219, -126242, -41224, 38051, 91061, 35843, -8247, -73649, -125987, -126708, -82703, -67621, -16074, -180837, -164956, 19687, 132088, 121768, 113204, 5441, -160097, -77915, 39069, 123604, 145128, 146572, 63745, 47209, 79842, 93615, 168000, 185003, 122586, -38471, -16413, 114969, -81604, -240625, -222012]
20931b22012J03951m5205O7021Q2572p0452j65220R3140J4255o8133J1777J71853
20920b6453R1572k077j97888o2138j02751L6600K26420J55917J56220j47554j23452
20909D416j9465J12351N4460j24036j23311J11952r9285j8905q024j33570j7882
20898b61299M2528J61864R9338l129K502j78389k1021j00704J7409p4010Q7374
20887b27537J29701O5765J75249J6472p9753J16238J01675j12496J066l5431J10407
20876B61356J18588J99341o3005j73013j10889p7104j06406O4670l0815j2404
20866G0319o9848m0154l2361J27819j29015m7649K83395J91559J08844k31206
20856B31703j76818J90835p8353n8908P6387Q7175J4063k6752K2248n9115J00268
$$ y = [-222012, -118061, -163266, -96245, -13673, -84125, -249345, -156205, -141950, -210083, -198306, -26453, 65119, 63042, -134846, -196984, -299735, -263135, -36715, 119202, 275422, 127868, 4416, -15049, 97302, 151762, 27726, -95585, 16367, -82918, -101823, -109847, -243417, -261299, -218771, -56907, 42431, 39302, 41804, -136585, -157606, -258310, -240901, -314911, -227537, -97836, -32071, 143178, 159650, 79897, 196135, 297810, 185314, 186380, 150949, 261356, 379944, 579285, 516280, 343267, 232378, 155274, 48868, 113538, 82723, 70319, 471, -39683, -72044, 55775, -73240, -120889, 162506, 354065, 462909, 231703, 54885, 245720, 167367, 108459, 184846, 272021, 286084, 259332, 281580, 222465, 322733]
20845C22733l8186r6745O7935j38317o200L8180j19506n5203n2099J05139J16572
20834A44303m5573p7602L4607n6026J03394P3809o1412l6934j47343j73692M609
20823b37860O479M2175Q5409J39365R9413j10364l8446q85j66049J58654J98180
20812A76071R563P5247O5311r30m4155j17301j32925Q2588N9695m1592l6046k3782
20800G1744k077n2735N0920K04550Q1234j53913j39246m5184l5468N3438J10893
20789A44156n1847k26593n9115J19786J5676K6546n2939J6123M4629l0864J12660
20778E8218N2205K920k4059j67320Q1020K75682n4167j88079j43985L5558K9142
20767d2865P2211J36340O824O4544p0809k21511K2813Q8402k1421j41525j34086
$$ y = [322733, 284547, 187802, 255737, 117420, 111220, 149400, 29894, -25309, -77408, 27731, 144303, 98730, 21128, 55735, -291, 103103, 176912, 115500, 78566, -68777, -242469, -237860, -231381, -189206, -103797, 35568, 134981, 24617, -13829, -14714, -180763, -22109, 176071, 185634, 260881, 326192, 325262, 281107, 163806, 30881, 113469, 173164, 131572, 95526, 71744, 69667, 16932, 67852, 272402, 353636, 199723, 60477, 15293, -20175, 33263, 144156, 92309, -134284, -193399, -73613, -57937, -31391, -84330, -68207, -23578, -54442, 58218, 110423, 113343, 89284, -78036, 2984, 278666, 224499, 36420, -107565, -72007, -42865, 29346, 165686, 172510, 237054, 166245, -55266, -32453, 55949, 34528, -106997, -241083]
20756b41083L1752K9668l884j07665J09561n461R573o0117J26631K06403j47775
20745e2397r4545K1634J8160j59261j77128M2707O9131R3102Q8633O4219K8144
20734e7601L5998r4849j88833L6603R0302N2510R9338J9490n2803m6591q5748
20723a92184j23159J12448O9743Q8698R687M4459j8893r9985K8633J71231k7733
20712F2945j41746K815p9727L9946Q5260P7271p774o1351k7715J47878P007p3888
20700C0921q7411J31493l9533P0564m7681r6844J3557m716j12168J1555P3116
20689e7147P2357q4953p2531N2948j1821K1658j65446r8881J89861k2893j68984
20678c45832O4054K34430J72144L3946j75352q0291j35774q070J00981P4151M3350
$$ y = [-241083, -209331, -179663, -183547, -291212, -181651, -187112, -177539, -237656, -111025, 95378, -52397, -146942, -125308, -107148, -266409, -443537, -400830, -331699, -238597, -149964, -85745, -57601, -21603, -116452, -305285, -268682, -178380, -125870, -26532, -7042, -59845, -106436, -192184, -315343, -202895, -133152, -44454, -34767, 9692, -9201, -109186, -80553, 90678, 62945, -78801, -75986, -155713, -115767, -30507, 46764, 38990, -22361, -50076, 97802, 104809, 30921, -56490, 75003, 35470, 106034, 58353, -38491, -24934, -29650, -141818, -130263, -57147, 15210, -69743, -142274, -89326, -101147, -79489, -244935, -343816, -153955, -176848, -345832, -281778, -47348, 124796, 158742, -16610, -96901, -232675, -240745, -139764, -65613, -22263]
20667b2263M4392O4513j15092j39666j2975J67157J37634r469o640L8909j77234
20656c0734n8500J01378q0110p9565q0950J36150J16466j19968Q7805R3854L4772
20645A20598j6418r5030r4308j1660j12880m3391J6035k3710O1820N7112R1714
20634e0118J49896N3165q3422j3804o2923l9365K5254K02291J34525j43042k36701
20623f4244l0030m9536N4228L5549k0524l1421O7824o6689l5614K83977J58048
20612C01568j14705j25693j91192p4055r9472K9875J65263N4612M6035O3018j8971
20601C6283q9331K4657K3546P6864J59965N4674j17525j45777l4188J06685K6795
20590A22648o9890L5858j09534k4033O170M0803O172P7427J46075J8490j32943
$$ y = [-22263, 22129, 86642, -28450, -168116, -181091, -13934, 123700, 114231, 107591, 146500, -30734, -89234, 12144, -67966, -147531, -228481, -92331, 24135, -95833, -8028, 85826, 120598, 104180, 9150, -85158, -96818, -209698, -253089, -237054, -260764, -198944, -141832, -50118, 99778, 152943, 69521, 55717, -7206, -46571, -21317, 180974, 315499, 172457, -64244, -94274, -143810, -89582, -54033, -74557, -105978, -38154, -104843, -140457, 143520, 301568, 186863, 61170, -130022, -204077, -303549, -273674, -108411, -53799, -7764, 55254, 36283, -53048, -28391, -4845, 72019, 231984, 286658, 169133, 23356, -10832, 95853, 122648, 52758, 88616, -20918, -44951, -38781, 2022, 8194, 85621, 231696, 250186, 117243]
20579A17243k0383L321J28950o0172j69740j04320m8866j32090l1647J03002L4661
20568a80041n624J51409K32545l8623k45819n0364j6706j22874j4702J1112r4136
20557c73823O9425Q3279N7783K02663k167k1064j13302n9533k6053K6237j11129
20546b67684J65746Q1438k2533l6103j5158J63815k8184Q321l110j08706j34007
20535a96165n4440J23471J37369n9211Q5852J0413o6453Q896j89852j43676L7202
20524c06594J00393P7318n4638o8446J97390J39905K9051j2301j68366J2062q8679
20513a42905Q8137J19545r4512n4830q9231l212Q3868O3988J22419k4993N3333
20502A21607r1629K5380J62K11176J02964m3629k18913m2945j21240p420J4221
$$ y = [117243, 96860, 100181, 229131, 168959, -781, -105101, -153967, -286057, -317704, -214702, -180041, -185665, -34256, 198289, 159666, -86153, -136517, -153223, -276097, -290799, -279687, -373823, -304398, -221119, -163336, 39327, 37160, 16096, -97206, -156739, -182792, -156555, -267684, -101938, -20500, -43033, -79136, -94294, 69521, 41337, 49658, 46548, -62158, -196165, -250605, -127134, 10235, -48976, 36876, 47289, -19164, -10268, -200120, -343796, -306594, -206201, -128883, -183521, -251967, -54577, 85328, 114379, 102078, -66288, -54226, -142905, -54768, 64777, -29735, -84565, -173796, -177008, -93140, -29152, 93267, 68274, 121607, 29978, 55358, 55520, 266696, 369660, 326031, 107118, 64173, -57067, -64487, -50266]
20491e0266K5023P7316M1449r2382k03381Q0274k343J07545R979m0561r9943r5010
20479b42300j40391J10667J92716R3934j07492o2640J66322m360k2997J62709
20469A46168N004j63323r5991m6075n7327q2718K3882O696J9628p0446L1906K99258
20457A6662K8313r6851j02506j66987J00598J70859J39427p6372J6663M0544m5197
20446B5153j65955l547J22161O5292O8449R5661q3995N6910K14407k00807l13581
20435a19852j43608R0689J77485J61139j05711L2522j52421l0349P9803j13k8737
20424c9153q8304l4485K63283n6780j02612R3081O5415j5833r9744L9608K50462
20413B74938J09250j48589j51496m9453r1086P2204Q2177m7465k1060j11242p2601
$$ y = [-50266, -25243, 52073, 93522, 1140, -202241, -121967, -124310, -16765, -6786, -47347, -147290, -242300, -382691, -272024, -79308, 14626, -92866, -155506, 10816, 6456, -16541, 146168, 151172, -12151, -108142, -154217, -211544, -294262, -270380, -263684, -244056, -314502, -282596, 16662, 44975, -51876, -154382, -321369, -220771, -49912, 89515, 13143, 29806, 70350, 25153, -140802, -144349, -22188, 43104, 111553, 207214, 123219, 180129, 394536, 193729, -119852, -263460, -172771, 4714, 165853, 60142, 92664, -59757, -90106, -10303, -10416, -39153, -127457, -161942, 101341, 44561, -58051, 35030, 100445, 84612, -15132, 24476, 274938, 384188, 235599, 84103, 34650, -56436, 15768, 97945, 50480, 29420, -81822, -154423]
20402a54423l0297P9194k7587j5264o1517K0358k4724J65363M0518Q0013J47186
20391B18820J00647j1982r2744o879j4862k36240q2463P4502M7013n07J3532L6451
20379D5288J04161L994N3107p5255L650K6645r3998j97225J48713Q5174j8252
20368H6002n9173j0130K7562R9576j82288k90521R5750J49416M3265j6569k3761
20357h0871q6899J68324K3651j66826j9722L0254L9474L8697R8131j7414j32173
20346a05374o9653J84882J25711o8058k41249j13062R4204N8067k9647M9182K7393
20335h7604K8982J36q3230N3920R6614q6447j00552N1282O2157n1769q3636k725
20323b02872K08942N2560L7083m7376p3510j40552N9314o918p7635Q157J43056
$$ y = [-154423, -184720, -105526, -133113, -148377, -209894, -189536, -214260, -48897, -8379, 71634, 218820, 319467, 307485, 214741, 207862, 193000, -43240, -125703, -51201, -4188, -4695, 8837, 45288, 149449, 153443, 206550, 131295, 134945, 161590, 67592, -129633, 19080, 104254, 86002, 26829, 16699, 44261, 143837, -38451, -328972, -233222, -83806, -40541, -57110, -80871, -167770, 554, 24205, -142621, -162343, -132089, -92615, -53918, 44213, 26799, -105374, -175027, 9855, 135566, 67508, -173741, -286803, -192599, -134532, -164179, -114997, -87604, -58622, -58486, -141716, -87796, 8818, -77629, -178181, -126899, -64742, -116511, -200147, -202872, 6070, 58630, 95713, 48337, -25173, -165725, -106411, -113329, -190964, -182807, -39751]
20312c9751O9145j67616j49972J3946J51007J37555j9072r6579M9106Q2532R1339
20301A21640L7426k5579j31430K9548R1023J26530J8164o6951J69936j49273j49699
20290G1335N2644n6880j38845p9728M1371n4256M8958m6432O8688k2105n6152
20279a71402M4267O0670L2742o6500P071l6014o7598R2342l1107N5545l0392R6587
20267a3789K30011J69640j31739j56754j31458r5453l7866R0611O3365j26329
20257a39761p1697Q0873J97211j06887k00899J230Q3071J63025R2023K448j75953
20246g5316n5188j4528j38208j0064n8136m355P9216l6576J7506J95199J04088
20235C638o4461p3373j12313k3993O184M5765k277r1752O1200Q9962N7857k1498
$$ y = [-39751, 29394, -138222, -288194, -274248, -123241, 14314, -4758, -101337, -52231, 30301, 121640, 159066, 133487, 2057, 31605, 122628, 249158, 267322, 200371, 370307, 221034, 71335, 123979, 67099, -71746, -151474, -110103, -164359, -115401, -161833, -93145, -115250, -171402, -127135, -66465, -33723, -100223, -93152, -129166, -196764, -104422, -135529, -79984, -110376, -13789, 216222, 385862, 254123, 97369, -34089, -129542, -167408, -76797, -13432, -139761, -211458, -130585, 66626, -40261, -241160, -239930, -156859, 6166, 98189, 100637, -75316, -130504, -145032, -283240, -293304, -351440, -355795, -276579, -313155, -295649, -100450, 3638, -60823, -134196, -246509, -270502, -264318, -218553, -220830, -312582, -251382, -161420, -103563, -125061]
20223a25061j5271K5457M7523j3865L0308m2789j16367J18171K20388J055j37522
20212g973n3645K2226J55841L5190r609J90190Q0258j62852j61505Q833n6972
20201C9982M5467R121K14185J53656k06564k23103k08466j1343p934Q8230L1826
20190g4943r3362K1369j768o0434m4910K32181L8426N8408J6440m9962P2663m3936
20178G0172o9843j34616j66798P0725l7725l6956M2805Q6649k3702j04292K16841
20167h6740j9581o3325l5072J01454K0505P6694K3886j71465J8679m8097L6035
20156a47027J4721J1927j8130m1902K15659j06657N1590j7856m2300m3935m4774
20145a68684J18630J14198r9734l5287P1916Q1048j80837j37203J84714K50340
$$ y = [-125061, -140332, -114875, -67352, -81217, -50909, -93698, -210065, -91894, 128494, 129549, -7973, -61618, -39392, 116449, 151639, 142030, 332220, 412478, 249626, 88121, 96954, 39982, 85449, 94570, 308755, 462411, 255847, 32744, -175722, -187065, -194999, -106769, -74943, -168305, -146936, -148704, -209138, -254048, -21867, 16559, 74967, 91407, 41445, 114108, 70172, 329, -134287, -301085, -230360, -268085, -305041, -262236, -175587, -199289, -303581, -86740, -106321, -169646, -204718, -103264, -82759, -6065, 17821, -153644, -134965, -183062, -147027, -132306, -120379, -138509, -180411, 35248, -71409, -19819, -37675, -79975, -123910, -168684, -50054, 64144, -35590, -70877, 1039, 82087, -98750, -235953, -51239, 199101]
20135A99101L8987m8129n0592n2489j42630k1265M9569J28448j26972n4400o2959
20124a43331p9103R6409J53567j7830J31038j943n460K4045J23495L6310q2331
20113B34866j22328k2995N92k04340k45675L9960R9086M2127K07937P5582M6528
20102A51340m880q892K2282J2845k3724P235l5295q1027Q233k395J17976p6321
20090H7377k42760j26199J3496N8280L5923L2954J62269L5852k4345r289J26551
20079A50109j07728j17363O7932k2729J23251N2887j59809k530J04978M514N8491
20068A52003L153l9287j4874j8889O4011L6943M1603j18855o6891L5514q6483
20057a2052m6528o8687J9320k1328J5535m0794J3062N2159k14332q8434L38621
$$ y = [199101, 238088, 189959, 139367, 86878, -55752, -77017, -27448, 101000, -25972, -80372, -143331, -222434, -126025, 27542, 9712, 140750, 138807, 133347, 157392, 280887, 317197, 234866, 112538, 89543, 90135, -114205, -359880, -319920, -220834, -178707, 29230, 104812, 151340, 146460, 137568, 159850, 172695, 148971, 156206, 120911, 39884, 48117, 45722, 163698, 87377, -155383, -281582, -268086, -209806, -173883, -140929, 21340, 57192, 32847, 23558, 150109, 42381, -74982, -7050, -29779, 93472, 146359, -13450, -15980, 88998, 93512, 152003, 155156, 115869, 100995, 82106, 146117, 183060, 224663, 105808, 38917, 74431, -12052, -58580, -127267, -107947, -129275, -113740, -154534, -141472, -89313, -303645, -392079, -53458]
20046e3458K41694J20466j3107j5463q6034M2199N0516k29660P5093R7413o6298
20035A63361q2853r3839O4627K08302j03082j40594p5378l4035L6185J64989P2011
20024A79694Q1608J52963j64899j71714m3326j0176k6558L2940J11423k443m8425
20013I1087L8072q8608R0739L6356m4796n756J67767j30720J469J05611j90244
20002G0977j64188n406J58165J08535J5796J31979j30934l89727L6278J46937
19992b1588M1917J16046M0890k3758l7841m5423m9766m5962O5172j60307p1864
19981a92484M9593L3786J20832j21422j8729Q8473r4150M8710R2736o0476n9115
19970a12246J13215m9846j32364j40222M5864J38448L1364K87951k13981q9051
$$ y = [-53458, 188236, 308702, 295595, 280132, 194098, 236297, 286813, 57153, 132246, 229659, 163361, 80508, -13331, 51296, 259598, 156516, 15922, -59456, -93491, -57306, 107683, 179694, 261302, 414265, 249366, 77652, 34326, 24150, -2408, 30532, 141955, 139512, 91087, 129159, 40551, 131290, 167646, 122850, 117094, 284861, 154141, 155610, 261221, 70977, -93211, -98617, 59548, 168083, 183879, 315858, 184924, -204803, -168525, -21588, 20329, 136375, 177265, 153507, 115666, 70243, 20477, -25485, 39687, -120620, -192484, -142891, -109105, 11727, -109695, -128424, -39951, -134101, -85391, 7345, -53131, -112246, 969, -48877, -181241, -321463, -275599, -137151, -105787, 182164, -31817, -120868]
19960a20868n2341m2095j23493J86825l7855k4846Q5599K9952L8062J52395k2088
19949F9247P0998l6307J7579j80253k0056J3468L7676O8245J19847j65802l1094
19938c6452J84379o1119k8886J8338N1830j32097p3991N9692R9889q6684J7031
19927A1930J29710l181j45596K25333R5060p0473P9679j95685j1473R0185j23340
19916H2149j01590j5409K7197Q8430j9395J52979J438N7607j51580j29738M9904
19905D1992Q8288l0768J1541j39579r3880O2533J05528J09590j84614J18904J20958
19894B10493n2822J30649j03990l1033n8606k843k181l3080K2895K0238R0808
19883A90528j2596j12862K2565N4017k31665p2358P8675J9602j62393L919K83751
$$ y = [-120868, -173209, -215304, -338797, -151972, -189827, -214673, -129074, -99122, -61060, 91335, 69247, 140245, 103938, 121517, -58736, -78792, -65324, -27648, 40597, 160444, -5358, -36452, 147927, 86808, 57922, 76260, 128090, -4007, -77998, -18306, 81583, -5101, 11930, 141640, 138459, -7137, 218196, 313256, 242783, 322462, 126777, 115304, 205489, 82149, -19441, -34850, -7653, 80777, 61382, 214361, 215799, 273406, 121826, -7912, 41992, 130280, 99512, 111053, -28526, -122406, -59873, 45655, 155245, -29369, 89535, 210493, 157671, 288320, 184330, 153297, 94691, 91848, 89667, 56587, 79482, 99720, 190528, 177932, 65070, 87635, 141652, -90013, -162371, -83696, -64094, -226487, -222568, 61183]
19872F1183M3041o0205M1834k2665K7530j15093k261J32766j83006m590L07044
19861B25578N3831j03360m4973k7864J5566n7226N623J7705J28391J50539M1379
19850D05189n1768n7209l8510J07093J03902l2512j52369j26679j18986l9385
19840a234n4219l9169K38828J20217R0146J4494K7230K8529j56268j55564j81288
19829f8298l9863o7055P5792K22918j08484j9123l5031L6847M791L9382j01273
19818e9397r8042j6245L746K02861J08861j35991J21977P5364q3988o5078r5706
19807d1638l7911j04450m1775J23302J42022j072p6865m7171J33321J83169J2549
19796B43481j86485k10953J36007J15567n2037L8554J18205J5984J17794n189
$$ y = [61183, 104224, 44019, 85853, 63188, 90718, -24375, -26636, 106130, -76876, -81466, 225578, 279409, 176049, 131076, 103212, 118778, 61552, 67175, 84880, 213271, 363810, 405189, 353421, 296212, 257702, 364795, 468697, 436185, 283816, 157137, 38151, -1234, -55453, -94622, 144206, 264423, 354569, 369063, 396293, 424822, 268554, 112990, -68298, -108161, -175216, -99424, 123494, 15010, -4113, -39144, -2297, 2494, 41876, -59397, -157439, -173684, -169938, 32923, 141784, 5793, 127770, 203134, 119146, 54068, -41638, -79549, -183999, -225774, -102472, 39550, 38478, -38387, -85558, 47763, 230932, 243481, 56996, -153957, -17950, 97617, 45580, 84134, 202339, 218323, 336117, 330928]
19786C30928k44195q1777o8488M2198J72317j9738j75733j43097R0894J31806
19776C5115L7240p29J14667J37061N9149j64101r0956R265J00827q206K1842j15225
19764A35949j38265j04335J72127J83857n7882j39812j30630l7773N3325N6331
19754g108l8442K3820M9540Q8093J71011M3216o8261r889P7083O3455L4283k42270
19742A84531k06148R541J03794J16569o8233P5218J434m6154N2129m3390j14172
19731F5119o529J69970l3112l4329j14078j0032q9860j67588R5014J79608r1866
19720c7683j4620K12814R9990M7446n5287l396j4639J07707J34862k00336l21375
19709d4517k7976N1986J04553M3919K2995O9531K3868J08043j33769j35889p6314
$$ y = [330928, 86733, 4956, -63532, -21334, 150983, 131245, -44488, -187585, -96691, 35115, 72355, 71626, 186293, 323354, 382503, 218402, 127446, 136711, 237538, 229332, 251174, 135949, -2316, -106651, 65476, 249333, 191451, 51639, -78991, -116764, -63439, -7108, -45550, -21730, 27810, 115903, 286914, 330130, 261869, 251980, 329063, 392518, 426801, 184531, -21617, -12076, 91718, 208287, 140054, 215272, 216706, 170552, 222681, 179291, 65119, 58590, 228560, 195448, 161119, 47041, 37009, -52851, -220439, -125425, 54183, -37683, -52303, 160511, 260501, 307947, 252660, 249264, 234625, 342332, 477194, 276858, -44517, -72493, -20507, 84046, 127965, 150960, 220491, 244359, 352402, 218633, 82744, 6430]
19698F430j17977J05474J84038L2233k501L0056j68952n0534j9120P5636j083
19687G3700O6161J46956O3973j08770p5729j80213J33630j05531O6869j5897p7028
19676a1879m8450K65150J39498k03471n6520p7855K6877j06357J37826O2264j17650
19665I433J43629J28844r14j00200j13151j33705L0164J86819M7450j38638k53487
19654a93756m171P4477L6044J08837o7904n1261r182K21562K44530j05063j82582
19643G1531O8353J12748K303K629P0060j49261Q202r535j56091r2055J36790J44076
19631B09750L8060n8640K4529K35506m214n9058L259j58402o5915L1071R1544
19620B87490J16658l9027k4648p1097P064p7413j20647k4876q2746O0574k27L1247
$$ y = [6430, -111547, -6073, 177965, 210198, 207697, 237753, 68801, 18267, -853, 74783, 73700, 139861, 286817, 350790, 242020, 166291, -13922, 119708, 14177, 81046, 65149, -11879, -60329, 204821, 344319, 140848, 84328, 6473, 33350, -73007, 64819, 127083, 9433, 153062, 281906, 280992, 180792, 67641, -66064, -35900, 150919, 198369, 59731, -193756, -197927, -123450, -87406, 21431, -46473, -97734, -106916, 114646, 359176, 254113, 71531, 139884, 252632, 254935, 257564, 327624, 178363, 186565, 177030, 20939, -71116, 65674, 209750, 247810, 189170, 213699, 449205, 444991, 385933, 389192, 230790, 164875, 195946, 287490, 404148, 365121, 340473, 269376, 276440, 199027, 78380, 53504, -29242, 31332, 31105, 62352]
19608F2352J90135q1374K1702P2863o9848J0223K9268M3259m2074Q729m9148o8462
19596A27625p121O5233j61494k0536K50495R1066k4229l3340j51749q7913O7281
19585A15318J39457O758j22549k2620r1740L3685M6492n5095o4296L6476K75313
19574B97199j08071j05870P3314R6340M5436K7472k7227j40345k37906L0931M0353
19563h374K40569L4310o0969K0237N4075m8396r7882K3356L16215L3416K0589
19552E27146j00314L5072o2651k1280J88183q2395p0613p8562m0400J18564L9178
19541D51928K4698r2556j41248M2888n1185j31128P970O0562J41163J0375m0360
19530B83107j4129K2936m491J63030J74384K67750P8067k36405j18481J759j5498
$$ y = [62352, 252487, 171113, 192815, 265678, 195830, 206053, 235321, 278580, 236506, 245235, 196087, 127625, 120504, 185737, 24243, 3707, 254202, 345268, 321039, 287699, 135950, 48037, 115318, 254775, 261533, 138984, 116364, 24624, 58309, 104801, 49706, -14590, 21886, 297199, 189128, 83258, 156572, 252912, 298348, 325820, 298593, 158248, -79658, -48727, -8374, 232195, 266505, 205536, 225773, 279848, 231452, 133570, 156926, 473141, 506557, 527146, 426832, 461904, 399253, 377973, 566156, 483761, 413148, 334586, 294186, 412750, 451928, 476626, 384070, 242822, 285710, 234525, 103397, 111367, 171929, 313092, 323467, 283107, 268978, 291914, 287423, 450453, 624837, 892587, 970654, 734249, 615768, 617527, 602029]
19519F02029R9771Q981J7031J00086N4844n96j26166q1660O9880K14968N6096
19508A015264J75076J67158n7155J67289J56432J18305J90746J71999J40059J92639
19498B437812K03894L00819J30306P2219k87977j96383l14362k51230j70274n1744
19488A873080j19883q9999k47478k50045K2799k8818l2133J76690J07382k17928
19478A193667j18768N5618Q5993m6344k52108j35239K8121J53390J57873k4923
19468A097280r1659r9254L1905K23388j11558j97054J35759L9205J50470o8606
19458A109876J08039J19378O4595Q3659J5369l2212N1318J61917N4888j21885
19448A614942p9620R4671J0408K1867J79101J27635n2987m633N0164K2144K1275
$$ y = [602029, 701800, 710781, 727812, 827898, 882742, 882146, 755980, 674320, 744200, 959168, 1015264, 1190340, 1357498, 1300343, 1467632, 1624064, 1742369, 1933115, 2105114, 2245173, 2437812, 2641706, 2942525, 3072831, 3145050, 2857073, 2660690, 2346328, 2095098, 1924824, 1873080, 1753197, 1663198, 1415720, 1165675, 1188474, 1159656, 1127523, 1304213, 1411595, 1193667, 1074899, 1130517, 1216510, 1170166, 918058, 782819, 810940, 964330, 1122203, 1097280, 1005621, 906367, 938272, 1161660, 1050102, 853048, 988807, 1028012, 1178482, 1109876, 1217915, 1337293, 1401888, 1485547, 1500916, 1468704, 1520022, 1681939, 1736827, 1614942, 1535322, 1629993, 1640401, 1662268, 1841369, 1969004, 1916017, 1911384, 1961548, 1983692, 2004967]
19437B004967J21324p2988Q227J50232J26999m035j30725k3958J69642N1630l0091
19426B371224J42139K17419J27805j8646K69409J94598J75202M3813J18138J92056
19416C833157J69487j35621k8130J09062L93541K57923K31117K43925K68899O4304
19406E407664K82200O93493N13778K04296L87565N19439M79639P60360P56553
19397A0004987O40444N83184P05880Q64334J170802J477260J360094J564216J776862
19388B0148063K148340K452419K749687L052151L642842M403067N158427O291397
19380E0046393P762563R549434J1958997J5071716J9132993K3346299K7520027
19373A64388422L0792958L1356754K8050444K1772895J3583819L553399p338814
$$ y = [2004967, 2126291, 2053303, 2061530, 2211762, 2338761, 2334726, 2204001, 2180043, 2349685, 2401315, 2371224, 2513363, 2730782, 2858587, 2839941, 3109350, 3303948, 3479150, 3522963, 3641101, 3833157, 4002644, 3867023, 3838893, 3947955, 4341496, 4599419, 4830536, 5074461, 5343360, 5407664, 5689864, 6383357, 6897135, 7101431, 7488996, 8008435, 8488074, 9248434, 10004987, 10645431, 11228615, 11934495, 12798829, 13969631, 15446891, 16806985, 18371201, 20148063, 22296403, 24748822, 27498509, 30550660, 34193502, 38596569, 43754996, 50046393, 57808956, 67358390, 79317387, 94389103, 113522096, 136868395, 164388422, 195181380, 226538134, 254588578, 276361473, 289945292, 293498691, 286159877]
19366B86159877j8059020k6188104k9873910k8901390k5391367k1306050j7446557
19359A18993479j4110577j1174518r305120p784763o420783n564436m785929l953320
19351E5894033l544911l204756k830318k463697k218916j856949j940822j795238
19343C6038426j406188j419236j623932j286677j348166j118193j060985j024688
19335B5750361q37515q48482q94473p68621p30654q51081o09927n32204m05282
19326A9272122l14960n80413p18879n84644n40834m06356m74536n37785l67626
19317A4746089l73139l37358k29103m01474l65349m32264m22116l28250l57760
19308A1499276m62905l43038k47574j05386k25346j17947j71486k08810k00148
$$ y = [286159877, 268100857, 241912753, 212038843, 183137453, 157746086, 136440036, 118993479, 104882902, 93708384, 84403264, 76618501, 70197718, 64633282, 59847353, 55894033, 52349122, 49144366, 46314048, 43850351, 41631435, 39774486, 37833664, 36038426, 34632238, 33213002, 31589070, 30302393, 28954227, 27836034, 26775049, 25750361, 24912846, 24064364, 23169891, 22401270, 21670616, 20819535, 20209608, 19677404, 19272122, 18957162, 18376749, 17657870, 17073226, 16532392, 16126036, 15651500, 15113715, 14746089, 14372950, 14035592, 13806489, 13405015, 13039666, 12607402, 12185286, 11857036, 11499276, 11036371, 10693333, 10445759, 10340373, 10115027, 9997080, 9825594, 9616784, 9416636]
19299I416636j88745j43583j58227k83658j47715m9254j95664n20341l45411M3970
19289G428008o9357j60071k44563k87057r1j13211m3561q8718k65311P2710j55792
19278F072986l49718j53789Q1397O0845k30628l43064p6044P9162r6938k84659
19268D759550M2521R4051k4521J676J15427k9395j11816R3606J02144J41190K45287
19257E429720M63571L28812K03478N0221m1931j09803k31506l11801r8121j52108
19247E530532q5338N2181N3826K66759m7016j51485l9451N3795j23299k54766
19237E255738l44745l5906O0853l41720k91560k41731k57577k05986j47390l30431
19227C119545k45773k6759K4067l546J35379J11343j63937j38422j38103k21412
$$ y = [9416636, 9227891, 9084308, 8926081, 8642423, 8494708, 8445454, 8249790, 7729449, 7384038, 7428008, 7358651, 7198580, 6954017, 6666960, 6666869, 6553658, 6510097, 6421379, 6156068, 6228778, 6072986, 5723268, 5569479, 5650876, 5711721, 5481093, 5138029, 5061985, 5141147, 5044209, 4759550, 4802071, 4896122, 4871601, 4873277, 4988704, 4959309, 4847493, 4941099, 5043243, 5184433, 5429720, 5893291, 6222103, 6425581, 6475802, 6433871, 6324068, 6092562, 5780761, 5682640, 5530532, 5445194, 5497375, 5551201, 5817960, 5770944, 5619459, 5580008, 5633803, 5510504, 5255738, 4910993, 4875087, 4935940, 4594220, 4302660, 4060929, 3803352, 3597366, 3449976, 3119545, 2873772, 2847013, 2871080, 2867534, 3002913, 3114256, 2950319, 2811897, 2673794, 2452382]
19217B452382j26694m8162l3598K6307L2098J5818j61011n4698q4113M238q785
19206B013782j2390J15462M5369j57669j51062j60514l9188k2039Q5969j4882
19196A702838r9375k33637o6424J32098K7863q369q6648q1258j54105r3337K8097
19185A067743l7338N9930o97k0999k9923Q0797r2621r7021j00257J79044P5421
19174A084079P2244K23501k2112n4078k30876p3895J47594K75269j49338j46468
19164A125920J25518k5294j15468o6108J40234J65655k43752k70195j16327K10698
19154I30881k146l1646l6922k2898L0976j2618J20860P8426m0917L064l1198p4898
19142I10964j12061j74240J67085R1400J17942j51864j38038L0871j42024n9507
$$ y = [2452382, 2325688, 2277526, 2243928, 2270235, 2302333, 2318151, 2157140, 2102442, 2018329, 2022567, 2013782, 2001392, 2116854, 2162223, 2004554, 1853492, 1692978, 1653790, 1631751, 1717720, 1702838, 1603463, 1369826, 1303402, 1435500, 1463363, 1454994, 1368346, 1287088, 1132983, 1039646, 1067743, 1030405, 1090335, 1089638, 1068639, 1038716, 1119513, 1026892, 929871, 829614, 1008658, 1084079, 1156323, 1379824, 1357712, 1303634, 1072758, 998863, 1146457, 1421726, 1272388, 1125920, 1251438, 1226144, 1110676, 1044568, 1184802, 1350457, 1106705, 836510, 720183, 930881, 928735, 897089, 860167, 837269, 868245, 855627, 976487, 1054913, 1013996, 1017060, 985862, 910964, 798903, 624663, 791748, 883148, 1001090, 849226, 711188, 742059, 600035, 540528]
19132E40528N3789O8067R3910L0216j78075o1883k66957k81l3385P4108P5941
19121C95978J2674J99212J13173j32293r5011o0711j35395n4354K07082J93917
19111F44272J53851j26259j52992P7499M5068Q6605p2305p1823j2922m5356k3769
19100E01869n5446j16734M5172J61864R562n4314J41183o7747k07351j24348N6322
19089B90032J87995J32978k97733l2089p1060p3113J73611k7612J4155J50727
19079D47891k3496j34369K4000q1326p234J9166R050R6101K47261O3962k3007
19068F37999n9674j96295j68043r3336L6674q467l6052j06870Q3887P0215M4293
19057B04331j3039N3272J38501J50975q1708j68084k1576J29162L525P0462J760
$$ y = [540528, 594317, 662384, 756294, 786510, 608435, 546552, 279595, 279314, 245929, 320037, 395978, 408652, 607864, 721037, 588744, 493733, 433022, 297627, 243273, 450355, 644272, 798123, 671864, 518872, 596371, 641439, 728044, 655739, 583916, 570994, 525638, 501869, 446423, 329689, 374861, 536725, 546287, 491973, 633156, 565409, 358058, 233710, 290032, 478027, 611005, 313272, 281183, 210123, 137010, 310621, 283009, 297164, 447891, 424395, 290026, 314026, 232700, 225466, 244632, 253682, 349783, 597044, 661006, 637999, 578325, 382030, 213987, 120651, 157325, 148858, 112806, 5936, 89823, 160038, 204331, 191292, 244564, 383065, 534040, 452332, 284248, 262672, 391834, 395359, 465821, 467581]
19046D67581j02724j68708o5555J34086J24344r7916O01j23616q5415R8680J5691
19035A97049q6290j52569k8252M755m2235K39553K20674K0632P4494p7124n9824
19024C10863R3691J24583J29000j79414j20716k9863j09269j64208K14918K25445
19014D95030J42066j29807r6700r0373o9783j38744j08352P4487J9077O6290J35713
19003B98904P8993j95985k82970J11940J04569k0606J57503J29385k7579q5389
18993B68765j52733k42741J68679K76435N6248J6688J02156O5387O3568l8193
18983E84259j27588j81857M0436j01701j10026P7160M1830n5826j31017J8724
18973E4394Q0381J33706J42230J04877L1870m3121n7562q2896N7201J48963L3798
$$ y = [467581, 364857, 196149, 130594, 264680, 389024, 291108, 291709, 168093, 82678, 181358, 197049, 110759, -41810, -70062, -65307, -107542, 132011, 352685, 373317, 447811, 370687, 310863, 404554, 529137, 658137, 478723, 358007, 328144, 218875, 54667, 269585, 495030, 637096, 507289, 410589, 320216, 250433, 111689, 3337, 77824, 96901, 163191, 298904, 377897, 181912, -101058, 10882, 115451, 94845, 252348, 381733, 354154, 268765, 116032, -126709, 41970, 318405, 374653, 391341, 493497, 558884, 622452, 584259, 456671, 274814, 315250, 213549, 103523, 180683, 222513, 166687, 35670, 54394, 134775, 268481, 410711, 515588, 547458, 504337, 446775, 363879, 421080, 570043, 603841]
18962F03841O081l1211N6039M4526j1669j17574N5298L0089q2725p4162R1209
18951E69742r462N8931J94771J31612J31879M6677j82021J4599k7912k65215p089
18940F56512q0249J38847j366j70988N6260R6703N6433o2623Q9635J3207q1408
18929G10963l2384j06311j2032L3435j78405J4480J05698k8000J8382R4219q207
18918F11838J18676J98297N2902n740q3765n4158k3769M5334K6235k7032Q1654
18907I40472Q374J117N5590O3371J14852K5937k6476J16022J532M5617N8772j50526
18895A254654k71637M1171J78822M8948p0030r4623n2526O3086j03739k86217
18885G07909m7827R8707J84278o8133l2165P5279k68071n9740n0891J5172q9457
$$ y = [603841, 609922, 578711, 634750, 679276, 667607, 550033, 605331, 635420, 552695, 478533, 569742, 560280, 619211, 813982, 945594, 1077473, 1124150, 942129, 956728, 928816, 663601, 656512, 576263, 715110, 713744, 542756, 599016, 695719, 752152, 689529, 779164, 792371, 710963, 678579, 572268, 560236, 593671, 415266, 429746, 535444, 507444, 525826, 620045, 611838, 730514, 928811, 981713, 975973, 892208, 838050, 814281, 859615, 885850, 858818, 940472, 948846, 949963, 1005553, 1068924, 1183776, 1209713, 1183237, 1299259, 1300791, 1346408, 1405180, 1254654, 983017, 1024188, 1203010, 1251958, 1181928, 1087305, 1034779, 1097865, 994126, 707909, 660082, 758789, 943067, 874934, 842769, 918048, 649977, 590237, 539346, 554518, 465061]
18874D65061J65218K5666k456k33311j44953j1240M3032L074J19142m7274m2108
18863C39851K11587O2511j19053j66221J232k6876N4483J39346M5726l07037k10765
18852B4784j29708J15353K18613K45102K11462j473l2882j9758J17354N2048j57684
18841F43211j52206M1185J27819J19664K21248J61378j82347p3042o3383m5429
18831G98098l1467k4823j00326q0857Q2169J73178J00915q9846r6529j62433Q3049
18820F51128M476J07958q4881j48106R2560j19833k06910k347N395J13241O5599
18809D78280J05921m0677N571J01725m6111N1859K1719j61776P9126K00961P0860
18798H67458p0281k5146L4926J33741j9522j14526q3702J19662P4419L9676P3672
$$ y = [465061, 630279, 655945, 653489, 420178, 275225, 263985, 307017, 310091, 429233, 381959, 339851, 551438, 613949, 494896, 328675, 329907, 303031, 357514, 496860, 542586, 235549, 24784, -104924, 10429, 229042, 474144, 685606, 684133, 651251, 631493, 748847, 800895, 643211, 491005, 532190, 660009, 779673, 1000921, 1162299, 979952, 906910, 843527, 798098, 766631, 741808, 641482, 560625, 642794, 815972, 916887, 827041, 730512, 568079, 651128, 655604, 763562, 678681, 530575, 623135, 503302, 296392, 294045, 299440, 412681, 478280, 584201, 543524, 549095, 650820, 604709, 656568, 678287, 516511, 595637, 796598, 867458, 797177, 772031, 806957, 940698, 921176, 806650, 722948, 842610, 917029, 956705, 1030377]
18787A030377L834J34465j12819j21923k6609j20127m2600J42292P4324N8013
18777A019227M6015l9702k5789J43914o1052q0781j15723M3475J02251n0522k48599
18766G32714j22207j47850L559J73617L6669m3074q510j13283J74611o022l38679
18755C41545j36534P9304J26417N6276p0435j39852r2258J09140o695r3080q462
18744A65366J32380J04512J07202J29220K3969o5453J38690r2730j42204J16522
18734F17474O6867J01341J68074j15167j12033j7090J3913P8539L7867j80993
18724F58792p8925o7287p158k7933k9765k8928O4306k9239n5742l9590Q638Q1646
18712D48815j5184R9576J08632q9042j75108k0832N6122J57346L7146q7243L0143
$$ y = [1030377, 1034211, 1168676, 1055857, 933934, 907325, 787198, 744598, 886890, 961214, 1019227, 1065242, 1025540, 999751, 1143665, 1082613, 1001832, 886109, 929584, 1031835, 981313, 732714, 610507, 462657, 466216, 639833, 676502, 633428, 624918, 511635, 686246, 680224, 341545, 205011, 284315, 410732, 467008, 396573, 256721, 164463, 273603, 266908, 173828, 165366, 297746, 402258, 509460, 638680, 662649, 597196, 735886, 643156, 500952, 617474, 684341, 785682, 953756, 838589, 726556, 709466, 723379, 801918, 839785, 658792, 579867, 512580, 505422, 477489, 447724, 418796, 483102, 453863, 398121, 358531, 367169, 448815, 433631, 533207, 641839, 552797, 377689, 356857, 412979, 570325, 607471, 520228, 550371]
18701E50371l9266J1653P705O1658J8087J1330k9157j43590j47311O9612N2997
18690D24089j33728j18972M7952J37636R2681j2954K3236j36260q8159j38069
18680I7452r243P789P9111J46051J33385p0794n4919l54Q956J5064Q4271J52034
18668E88803N7310n9705l6318J2110L5309R3747K18745p457l3465j8984j13529
18657G36566j07926k9516j21473k60867q9658J50959K2921J01018J61848L1145
18647E95017l1273P6187Q5066j18848J68k078j55349L9356m605p7315n5389J32530
18635D83467N5763r4773l7526N4269p56o8038K8641N4278O4170j41694P2070K82865
18623G52736k5996P8m6945k4030P455R0477O9615L2239j53441l8852Q1668J78352
$$ y = [550371, 511105, 522758, 530463, 592121, 610208, 621538, 592381, 448791, 301480, 371092, 424089, 290361, 171389, 219341, 356977, 449658, 436704, 459940, 323680, 235521, 97452, 88209, 95998, 175109, 321160, 454545, 383751, 328832, 328478, 337434, 352498, 436769, 588803, 646113, 586408, 550090, 562200, 597509, 691256, 910001, 902544, 869079, 850095, 736566, 628640, 599124, 477651, 216784, 127126, 278085, 301006, 402024, 563872, 595017, 563744, 639931, 724997, 606149, 606317, 604239, 448890, 488246, 483641, 406326, 350937, 483467, 539230, 444457, 406931, 461200, 460444, 392406, 421047, 475325, 539495, 397801, 469871, 752736, 726740, 726818, 679873, 655843, 663298, 753775, 823390, 855629, 702188, 663336, 745004, 923356]
18611I23356m3461o8247O8630j47720q2566R9979j0134p3735N8389p4844k965
18600F46682k3517r4155j8707J66771M2317n5712L9538J74797M0696l3329O2527
18589I47908R5161N6058J676o0215p2922J1447Q8975R4173N0432M129o9343L0468
18577A177947J3730k5216o4655O4142P0748k10L8279N3993o8735k02123q9531
18566I68369J29650K1229K277M923l3438n7679J00687L05087J76108j59208m366
18555A453639N649r1552j7644O2364K52272J51505L01968K1027j16365Q4374M8583
18544B155820j26970J39043J90254K69356R1292P8629J53426J18196m9763j57876
18534B861407J1428j846N9009J15434J41984J78697o4616R941q5388k89100j10854
$$ y = [923356, 879895, 811648, 880278, 732558, 649992, 749971, 739837, 666102, 724491, 649647, 646682, 623165, 529010, 510303, 677074, 719391, 663679, 703217, 878014, 918710, 885381, 947908, 1043069, 1099127, 1100803, 1040588, 967666, 979113, 1068088, 1162261, 1212693, 1216822, 1147479, 1177947, 1191677, 1166461, 1101806, 1165948, 1236696, 1236486, 1274765, 1328758, 1260023, 1057900, 968369, 1098019, 1119248, 1121525, 1126448, 1093010, 1035331, 1136018, 1441105, 1617213, 1458005, 1453639, 1459288, 1367736, 1350092, 1412456, 1664728, 1816233, 2118201, 2139228, 2022863, 2107237, 2155820, 2028850, 2167893, 2358147, 2627503, 2718795, 2797424, 2950850, 3069046, 3019283, 2861407, 2872835, 2870989, 2929998, 3045432, 3187416, 3366113, 3301497, 3311438, 3226050, 2936950, 2826096]
18523B826096l4127L3397j830M7010k96336j6808M9804l8630j7895M9939P0379
18512B670999o18J2826K90316M8170j8248P1591j26213J44041J63942L80875P10999
18501D348680M54874J07552J72993J83783M48206N97436K47651l0051m1811J15277
18491F604590J12896K81558K34066J71757L80469L34441K59969K80640K61042
18482H921428K12567j92557k66396k82967j8930J23488K02132N33541O85132P91971
18472A0709409J426298J942472K504999L148278L983316M452954M460529M358434
18464C6986689L697166K823331J875398Q23407j32598m98040m3862J235822K427039
18455D9194352L672265M613468M313207L173082J936929J062874k37623k063963
$$ y = [2826096, 2791969, 2825366, 2823536, 2870546, 2574210, 2557402, 2607206, 2568576, 2550681, 2600620, 2670999, 2670381, 2683207, 2973523, 3021693, 3003445, 3075036, 2948823, 3092864, 3256806, 3637681, 4348680, 4803554, 4911106, 5084099, 5267882, 5716088, 6313524, 6561175, 6531124, 6489313, 6604590, 6717486, 6999044, 7233110, 7404867, 7785336, 8119777, 8379746, 8660386, 8921428, 9133995, 8941438, 8675042, 8392075, 8373145, 8496633, 8698765, 9232306, 9917438, 10709409, 12135707, 14078179, 16583178, 19731456, 23714772, 28167726, 32628255, 36986689, 40683855, 43507186, 45382584, 46205991, 46073393, 45575353, 45531491, 46767313, 49194352, 52866617, 57480085, 61793292, 64966374, 66903303, 67966177, 67728554, 65664591]
18447F5664591l350860l463525k613041j915104j353637r60192q48398o62620
18439E0497214m07004l89026n68556n12656n63497q64187j082121r01520l03345
18430D4905302O55349J862424L356398N166647P165845R315504J1548912J2675520
18422I6651901J3031365J3058464J2785583J1975267J0773788R214914Q084309
18415A75575591P905453P924152O766729M392333J881741N80071N90349K08989
18407B05825408J81918J213475L382626O764920Q600929O783513L693549K90107
18399B36736445l265409p207057j1499763j4693660j6693937j7092058j6160597
18392A50123964j4482258j2011467r421993o740631l894613r73682J688669K839866
$$ y = [65664591, 62313731, 58850206, 56237165, 54322061, 52968424, 52008232, 51159834, 50497214, 50090210, 49701184, 49132628, 48619972, 48056475, 47192288, 46110167, 45208647, 44905302, 45560651, 47423075, 50779473, 55946120, 63111965, 72427469, 83976381, 96651901, 109683266, 122741730, 135527313, 147502580, 158276368, 167491282, 175575591, 183481044, 191405196, 198171925, 202564258, 204445999, 205026070, 205616419, 205825408, 206007326, 207220801, 210603427, 217368347, 225969276, 232752789, 236446338, 236736445, 233471036, 226263979, 214764216, 200070556, 183376619, 166284561, 150123964, 135641706, 123630239, 114208246, 107467615, 103573002, 102599320, 104287989, 107127855]
18384A07127855J718267J67211n12181n32722j344560l718631n016154l108745
18376I4780340Q7878K873663L848199K715532J54121k598245m160995o047181
18368I1653312q766599r755923q236120n754332l501474j859934o73448Q5503
18360E3190985J17204j36509l23000o23903j240599j888233k292019j947552j182736
18351D3673638m01886L87871J280410K118920K697647K827994K303922K430624
18343E7319140L098071M053884M594087N381056P536973R371859R604065J0492276
18335A11451411J2675767J4636122J2751481P604941L136052P48805m17678l428050
18327A59158851r112051j3974777j3917488r776553m633850J1892K692029L481404
$$ y = [107127855, 108846122, 109013333, 108501152, 107968430, 106623870, 102905239, 97889085, 94780340, 94868218, 97741881, 101590080, 104305612, 104459733, 101861488, 97700493, 91653312, 82886713, 73130790, 64894670, 59140338, 55638864, 53778930, 53105482, 53190985, 53308189, 53171680, 52848680, 52224777, 50984178, 49095945, 46803926, 44856374, 43673638, 43271752, 43659623, 44940033, 47058953, 49756600, 52584594, 54888516, 57319140, 60417211, 64471095, 69065182, 74446238, 81983211, 91355070, 100959135, 111451411, 124127178, 138763300, 151514781, 159119722, 162255774, 163004579, 162586901, 159158851, 150046800, 136072023, 122154535, 112377982, 107744132, 107756024, 110448053, 113929457]
18319A13929457L170932K447849J321600r85632l149519m413487n261347o251358
18311A00808495p008670o209093m809823l916563l687090m149159m709203m343286
18303F1975608l538475k832218j839931p43383Q72182K553847L609171L878566
18295F3935367L435889K970174K816538K653731K263393J832828K364721L164682
18287H5437323M196648N366575N738503M258792K637441K846708L450163K585725
18279A16517878J375978J705957K970022L202253L507233M968791N788876N409616
18271A45446604M190856K705692J241704j633817n692654p729826o712683l783310
18263A28032566l89503J464906J365705j123404l844089n776275p496499r485422
$$ y = [113929457, 117100389, 119548238, 120869838, 119884206, 116734687, 112321200, 107059853, 100808495, 93799825, 87590732, 82780909, 78864346, 75177256, 71028097, 66318894, 61975608, 58437133, 55604915, 53764984, 53021601, 53893783, 56447630, 60056801, 63935367, 67371256, 70341430, 73157968, 75811699, 78075092, 79907920, 82272641, 85437323, 89633971, 95000546, 100739049, 104997841, 107635282, 110481990, 113932153, 116517878, 117893856, 119599813, 122569835, 125772088, 129279321, 134248112, 140036988, 145446604, 149637460, 152343152, 153584856, 151951039, 146258385, 138528559, 131815876, 128032566, 127643063, 129107969, 130473674, 129350270, 125506181, 119729906, 112233407, 102747985]
18255A02747985j0506756r531203p030367m130346k076611j380693j326775j126245
18247F5638989j324181j876435l030697m087332l311540j732124m31508M60244
18239E0305416Q07651M77162J58023k09284p82724j330580k052845k017190j720692
18230D3634937j311589q79655l88803J35187N84900R38190J700635K728841L588344
18221E0730987M582021N144182M852461L845051K033505O42868q96120k729583
18213F8205372m875667o404530o164927n485659m931495m003311l049700k313088
18205C0976995j801913j330864r52506p78420o86903m77015j18170J53810N45538
18196B5530552M34836L61645J74577J02455N2422k4910m13658l20942J39851Q66389
$$ y = [102747985, 92241229, 82710026, 75679659, 71549313, 69472702, 68092009, 66765234, 65638989, 64314808, 62438373, 59407676, 55320344, 52008804, 50276680, 49845172, 50305416, 51113067, 51590229, 51748252, 51538968, 50756244, 49425664, 47372819, 45355629, 43634937, 42323348, 41443693, 41054890, 41190077, 41774977, 42713167, 44413802, 47142643, 50730987, 55313008, 60457190, 65309651, 69154702, 71188207, 71831075, 70934955, 68205372, 63329705, 56925175, 50760248, 45274589, 40343094, 36339783, 33290083, 30976995, 29175082, 27844218, 26891712, 26113292, 25426389, 24949374, 24831204, 24985014, 25530552, 25965388, 26327033, 26501610, 26604065, 26656487, 26631577, 26217919, 25896977, 26036828, 26903217]
18186B6903217J203346J096280R54528N74133M01555J90726l13442q20383p09067
18177B9480893k91354K22094K20534P493o3875k12021n61810r40602j284896j045901
18167B5530555k42864J025756J719733K503170L559785M861320O047496O797396
18159E1802347O473037N592678M088872J633213j254488m138265o202142p550632
18151E0444620p800334o690518m867818l449823k433093j817536j181512j021975
18143B1182011q55832n62181o06062n55047j57993j03926k20178L9599k6513N7999
18133A8191877O5317k58538l79884j33530l95193n85803o26638l62532j68453
18124A5346623j14507m4887K33898M91272Q44845J135876J664513K581261L803037
$$ y = [26903217, 28106563, 29202843, 30157371, 30731504, 31133059, 31323785, 31010343, 30189960, 29480893, 29189539, 29411633, 29632167, 29639660, 29575785, 29363764, 28801954, 27861352, 26576456, 25530555, 25287691, 26313447, 28033180, 30536350, 34096135, 38957455, 45004951, 51802347, 58275384, 63868062, 67956934, 69590147, 68335659, 64197394, 57995252, 50444620, 42644286, 35953768, 31085950, 27636127, 25203034, 23385498, 22203986, 21182011, 20326179, 19763998, 19157936, 18602889, 18444896, 18340970, 18120792, 18160391, 18133878, 18191877, 18257194, 17998656, 17618772, 17485242, 17090049, 16504246, 15877608, 15515076, 15346623, 15232116, 15187229, 15421127, 15912399, 16757244, 17893120, 19557633, 22138894, 25941931]
18115B5941931N045813N989724O750363P611155Q409519Q952597Q427892O911300
18107H4040294M850513K437072k88957l384509o701245q522535r988744j0555495
18099E1886394r230079p006585m967377l420953k383829j745873j582085j274750
18091B0274863r59443p96776o91423o83521n92167o54225l75088m17633n09532
18082A4595055m22953l77015l27465l71002j75513M4552j22187j70208j5624j49975
18072A2507665k2908J69320N03006P46181J284067J825941K744685M083518N234737
18063B9076212N790877O134013N605201M287490K204013n81191l379791m983540
18055D4153284o042588o662773n991167m488269l047087k024370j422108j007197
$$ y = [25941931, 30987744, 36977468, 43727831, 51338986, 59748505, 68701102, 77128994, 84040294, 88890807, 91327879, 91038922, 87654413, 80953168, 72430633, 62441889, 51886394, 42656315, 35649730, 30682353, 27261400, 24877571, 23131698, 21549613, 20274863, 19315420, 18518644, 17827221, 17143700, 16551533, 15897308, 15522220, 15104587, 14595055, 14172102, 13795087, 13467622, 13096620, 12921107, 12965659, 12843472, 12673264, 12657640, 12507665, 12484757, 12654077, 13157083, 13903264, 15187331, 17013272, 19757957, 23841475, 29076212, 34867089, 41001102, 46606303, 50893793, 53097806, 52516615, 49136824, 44153284, 38110696, 31447923, 25456756, 20968487, 17921400, 15897030, 14474922, 13467725]
18047A3467725q92329o97087o96613n16559l31097k40544l52745l53417l21038
18038I066296k14481k92932P735j38418k41263l30283k93791j36142r915k27420
18028G189386l21999l07993j17548k37028j70128j59206r0935j96664k75453j91303
18018E121129q3899j1530j11967j03271j12755j40047j75735p4109k477J9106
18008D324445q9320q7224j47988k26058m7821j44791j19627q4524J79232P1473
17998C627797j22898j04521j48491j10270j16682j34188j9960R576N4601J14989
17988C049953O2635k3811J26476o261l7453m6197j5475K04004o6517m6803o9782
17977C130769k96195j29276k7413J98247M1616k17595k18171j19637q6082j6463
$$ y = [13467725, 12575396, 11878309, 11181696, 10665137, 10334040, 10093496, 9740751, 9387334, 9066296, 8851815, 8558883, 8566618, 8428200, 8186937, 7856654, 7562863, 7426721, 7416806, 7189386, 6867387, 6559394, 6441846, 6204818, 6034690, 5875484, 5784549, 5587885, 5312432, 5121129, 5037230, 5025700, 4913733, 4810462, 4697707, 4557660, 4381925, 4307816, 4305339, 4324445, 4235125, 4147901, 3999913, 3773855, 3726034, 3581243, 3461616, 3377092, 3556324, 3627797, 3504899, 3400378, 3251887, 3141617, 3024935, 2890747, 2870787, 2880363, 2934964, 3049953, 3112588, 3088777, 3215253, 3208992, 3171539, 3125342, 3109867, 3313871, 3247354, 3200551, 3130769, 2834574, 2705298, 2677885, 2876132, 2917748, 2700153, 2481982, 2362345, 2276263, 2259800]
17967B259800j59573O136N060K18129P6301K14489J2422j69080o1992K92505l6014
17956B658183k26910K5024k13749j18630r521n487o1281j31899o8218J5970J31286
17945A994768O2276j46981L965K200p5869J45041Q7415J21627J0257J25407j6519
17934B313587q8761k3156j83818j951J45649P5270m6906J41428j17699j67357
17924B046286k1084j24964j23210J46096J08877K3262J45042K30934J2909L1401
17914B475549p4542j37568J59240Q221J5350J13693j4107r8744M1303o3022k08115
17903B217258P2482O381l6158J29114N8839l933j79933k92482p0404k8169j58045
17892A714950m5554J76946J1175P2938K2675m3914j28417j29981j13424j06880
$$ y = [2259800, 2100227, 2106363, 2111423, 2329552, 2405853, 2620342, 2632764, 2463684, 2401692, 2694197, 2658183, 2431273, 2456297, 2242548, 2123918, 2114397, 2108910, 2047629, 1915730, 1847512, 1863482, 1994768, 2057044, 1910063, 1914028, 1916228, 1840359, 1985400, 2072815, 2194442, 2204699, 2330106, 2313587, 2224826, 2201670, 2017852, 2015901, 2161550, 2236820, 2189914, 2331342, 2213643, 2046286, 2025202, 1900238, 1777028, 1923124, 2032001, 2055263, 2200305, 2431239, 2444148, 2475549, 2401007, 2263439, 2422679, 2430900, 2446250, 2559943, 2545836, 2447092, 2488395, 2425373, 2217258, 2289740, 2296121, 2259963, 2389077, 2447916, 2443983, 2264050, 1971568, 1901164, 1872995, 1714950, 1669396, 1846342, 1857517, 1930455, 1953130, 1909216, 1780799, 1650818, 1537394, 1430514]
17882A430514k1610J31694J76662K27397k13392k36300P2722J02649L2393K457
17872A705186J65386q2236j03786O9260j7743J37885P8r8728N3755j36298l7894
17861A654865K6204j06180l5586J1687J1076K1478j1745l066L3936M2922J36977
17850A782568R402N411J3859j13415n0770k9751j19295r4911R9178J29402p7684
17839A553994k25J53065m6880k9229j5765K2267R0049J0888J01828J02259J17315
17828B059566J46603J28467P5101K4726J41644J2051j31170L01298K85770J27012
17818C171068J28259K40112K21199L08781M70557L49279K93143O12308P25363
17809F520069Q45555P76212J065858J304336J469569J996958K931095L994030
$$ y = [1430514, 1408904, 1540598, 1717260, 1944657, 1731265, 1494965, 1567687, 1670336, 1702729, 1705186, 1870572, 1788336, 1684550, 1753810, 1736067, 1873952, 1874030, 1775302, 1829057, 1692759, 1654865, 1681069, 1574889, 1539303, 1550990, 1562066, 1583544, 1571799, 1568733, 1602669, 1645591, 1782568, 1791970, 1797381, 1811240, 1697825, 1647055, 1617304, 1498009, 1403098, 1502276, 1631678, 1553994, 1553769, 1706834, 1659954, 1630725, 1614960, 1637227, 1727276, 1738164, 1839992, 1942251, 2059566, 2206169, 2334636, 2409737, 2434463, 2576107, 2588158, 2456988, 2758286, 3044056, 3171068, 3299327, 3539439, 3760638, 4069419, 4539976, 4889255, 5182398, 5794706, 6520069, 7365624, 8141836, 9207694, 10512030, 11981599, 13978557, 16909652, 20903682]
17801B0903682M828588M732347M174248L629939L263162K773825J795902Q98018
17793D6999711N91136L84188M86683L77788l08q65390k522612l057898j632268
17784D0761030P648J444470J955574J630419J368361J377888R25444j05578m47249
17775D8918007p33421r25677j044410j253266j962945l611238n052323n297139
17767B9037588m252095l138515k427163j539704q92230n37596l53860l65643k19715
17758A5311067P0328J60200L41500M38009P40519J259902J796041K596164L104568
17749B5818298L529396L252923K670394K305518K062409J496747L99173k92503
17741D1242355k76989k67382k05724J389o56409j631164k157027j569048K0967
$$ y = [20903682, 25732270, 30464617, 34638865, 38268804, 41531966, 44305791, 46101693, 46999711, 47590847, 47975035, 48461718, 48839506, 48839198, 47973808, 45451196, 42393298, 40761030, 40768678, 42213148, 44168722, 45799141, 47167502, 48545390, 49470834, 49365256, 48918007, 48184586, 47258909, 46214499, 44961233, 42998288, 39387050, 34334727, 29037588, 24785493, 21646978, 19219815, 17680111, 16787881, 16250285, 15896425, 15530782, 15311067, 15381395, 15541595, 15883095, 16321104, 17061623, 18321525, 20117566, 22713730, 25818298, 29347694, 32600617, 35271011, 37576529, 39638938, 41135685, 41534858, 41242355, 40965366, 40697984, 40492260, 40493649, 39837240, 38206076, 36049049, 34480001, 34500968]
17732C4500968J258819J498285J341895J083763J153549P89512m02625j100358
17724D0123808j208021j128818j091426j223105j724824k496499l502595m015091
17716B3733429l527817k637736k131642j444939j082300p48225o59683o64155
17708A0836932k72481m76764n88902l09742k46182j90506l29848m04845l25774
17699G691888l13251k34112l7811N301j62872j89998k33149k38129j64453k33423
17689E889991k29401j42015q6150k6516k14971o5316j77411q8018j82073m1248
17679D636872j61459p1749L6835r9333r0630O8833R1975j42674j69181j21493
17669C977996j88233q1481N185r7941j87746k40523P1432k03356q7125o6141J81680
$$ y = [34500968, 35759787, 37258072, 38599967, 39683730, 40837279, 41626791, 41224166, 40123808, 38915787, 37786969, 36695543, 35472438, 33747614, 31251115, 27748520, 23733429, 20205612, 17567876, 15436234, 13991295, 12908995, 12160770, 11501087, 10836932, 10564451, 10087687, 9498785, 9189043, 8942861, 8752355, 8422507, 8017662, 7691888, 7378637, 7144525, 7106714, 7112015, 6949143, 6759145, 6525996, 6287867, 6123414, 5889991, 5660590, 5518575, 5432425, 5405909, 5190938, 5125622, 4948211, 4860193, 4678120, 4636872, 4475413, 4403664, 4440499, 4341166, 4250536, 4319369, 4411344, 4268670, 4099489, 3977996, 3789763, 3708282, 3713467, 3615526, 3427780, 3187257, 3258689, 3055333, 2968208, 2902067, 3083747]
17658C083747M8049k4122N341j02582N8899Q3384o5012o4503p8088j6114l9440
17647B889559p9238j49653j18647j14918r4347j6873j0860n2340o5487q8721L5063
17636B133538n9353j03564k0297p4583j74936P5887K6475j13679N8736L338N4399
17625A805961j59271q1510K18711k8754L4712N3748p9690k21213n3001J50033
17615A639726p2963m1331m6738L4163m867L964Q2462Q8053l5642J00295k0676
17604A726446j04489J77998J44718p3875j36828m4238j84315N5121m2954J0533
17594A528117M4211L8834j12423j43602j27327n1269o147o8403J71334p756K6856
17583A292425p8797j626q005j96837k8002l6582j23447n5253P7301j23414j25929
$$ y = [3083747, 3131796, 3107674, 3113015, 3010433, 3069332, 3152716, 3087704, 3023201, 2945113, 2928999, 2889559, 2810321, 2660668, 2542021, 2427103, 2332756, 2315883, 2305023, 2252683, 2187196, 2098475, 2133538, 2074185, 1970621, 1950324, 1875741, 1700805, 1776692, 1803167, 1689488, 1748224, 1751562, 1805961, 1646690, 1565180, 1783891, 1755137, 1789849, 1843597, 1763907, 1542694, 1489693, 1639726, 1566763, 1525432, 1478694, 1512857, 1507990, 1511954, 1594416, 1682469, 1646827, 1747122, 1726446, 1621957, 1799955, 1944673, 1870798, 1733970, 1689732, 1505417, 1560538, 1517584, 1528117, 1572328, 1611162, 1498739, 1355137, 1227810, 1176541, 1170394, 1101991, 1273325, 1265569, 1292425, 1213628, 1212002, 1203997, 1007160, 979158, 942576, 819129, 763876, 841177, 717763, 591834]
17572E91834j1629m5470l0079J17344R1428j6871N5661O821J38781J51400m2371
17561A006849k20200j88392J12663K9316n4606R7272J1537J13048K53491Q2209
17551A243187j67542n9878l2919m432R5266q8158l7664o476K1499K4850P9788
17540A067521R4014m0834j14248k43982l7826K6595L5105J0016J32789m9339j22662
17529G57149q7962r86n9395j90433j54663J5117J19322R7829J57489j38971j72462
17518C42034M3378j7743q2424M4093m4811k5318K8928O355l8883j61791Q5787
17507A79605J18021K50021M4600k7082J21079J08774o027j15283j7988o5905q1302
17496E08513J0728L33R6970j30109J32230J36635n1498n4205j6434L231q1987
$$ y = [591834, 580205, 534735, 504656, 622000, 713428, 696557, 752218, 759039, 897820, 1049220, 1006849, 786649, 598257, 710920, 740236, 685630, 782902, 794439, 907487, 1160978, 1243187, 1075645, 1015767, 982848, 978416, 1073682, 985524, 947860, 941384, 962883, 987733, 1067521, 1161535, 1120701, 1006453, 762471, 724645, 751240, 786345, 796361, 929150, 879811, 757149, 669187, 668201, 608806, 418373, 263710, 278827, 398149, 495978, 653467, 514496, 342034, 385412, 367669, 285245, 329338, 284527, 259209, 288137, 294492, 255609, 93818, 179605, 297626, 547647, 592247, 565165, 686244, 795018, 788991, 673708, 655720, 589815, 508513, 519241, 519574, 616544, 486435, 618665, 755300, 703802, 649597, 633163, 636394, 554407]
17485E54407L9052M1657j93802k4663M4584M5553q2728J11992R9155j77715n5262
17474D02230j37485j10577J48761K54550O8079k01800j43069K462j1965j04530
17464A66656j24294r5745j0332L430o952J38741L2396L0996k3982K3042M3857
17453A77813J8613M3436R7279j6042o2336R7708j99866j94312l761P4038N2569
17442H5139N7718K069N3744m2365N5078J95223K2030N9439J19329r4419k48025
17431B64960J1599p0932r0426J0431l0445k3209J19659J64367q3166j86362j3054
17420G3422N602l7549Q9324J8832J12365J73850k93263q3018J08405n232k7013
17409A35725m0651k4273L9923Q0733L0686m593r666M9324N425L5814m5683j80117
$$ y = [554407, 593459, 635116, 441314, 416651, 461235, 506788, 424060, 536052, 635207, 457492, 402230, 264745, 154168, 302929, 557479, 625558, 423758, 280689, 283151, 271186, 166656, 42362, -53383, -63715, -60285, -67237, 71504, 103900, 134896, 110914, 133956, 177813, 196426, 239862, 337141, 321099, 258763, 356471, 156605, -37707, -41468, 32570, 85139, 142857, 144926, 198670, 156305, 211383, 406606, 428636, 488075, 607404, 512985, 264960, 276559, 205627, 115201, 125632, 95187, 71978, 191637, 356004, 272838, 86476, 73422, 79024, 41475, 130799, 149631, 261996, 435846, 142583, 59565, 167970, 162738, 135725, 95074, 70801, 110724, 191457, 222143, 217550, 207884, 257208, 262633, 298447, 252764, 72647]
17397G2647k8040Q8832Q6645J33346L54p6706q3688J1465K3128n6291k3352M8008
17385A96348J06119j44272j45437n2698O6097k0043L2345n7585K0648P3007m381
17374G0148j21536J2972N9729k4849n0244q7599n4751J64690P2358j09729p7653
17363a46464M0689J38461K3799j23380m0875J03223O1085J31322q8817Q5938j28999
17352E5982J8460j30802k45443o4973P0659M1630M3183L61769N6208j41145Q6101
17341A51629Q854J8653k92496k05692j26592J19561K24036J47843q9144P0305
17331B6957J21397j25098K6464j10088o5935r9435Q5896K06054J34523q058N8623
17320B51300K1156O6641o7031o1651l2674J01619j74652j83680p5859j53919R3768
$$ y = [72647, 44607, 133439, 220084, 353430, 353784, 277078, 193390, 204855, 227983, 171692, 148340, 196348, 302467, 158195, 12758, -39940, 26157, 6114, 38459, -19126, 1522, 74529, 70148, -51388, -38416, 21313, -3536, -53780, -141379, -196130, -31440, 40918, -68811, -146464, -105775, 32686, 56485, -66895, -107770, -4547, 56538, 187860, 99043, 184981, 55982, 74442, -56360, -301803, -366776, -296117, -254487, -211304, 150465, 206673, 65528, 151629, 160483, 179136, -113360, -319052, -445644, -326083, -102047, 45796, -43348, 26957, 148354, 23256, 49720, -60368, -126303, -225738, -139842, 66212, 200735, 192677, 251300, 272456, 339097, 272066, 210415, 177741, 279360, 104708, -78972, -154831, -308750, -214982]
17309b14982K38853N0181n982l3455r2541J0075Q0753j04557J47211P8900k1531
17298A32925j14248O5450M2987J01130m0585Q2899l76j63695M1928J46339P5954
17287C70708P083j8308K9823j28923k2660j78943j30645J4594J88572J93490J53434
17276D78225q2811j16755Q1555j0930j22189k11789l7872J97250j3465p7576r792
17265G3851Q9578J11870Q8117J62577k37214n2873N1887m3907n743j6554j9690
17254B01899l1355j49343j90177J46619J00423j0041p9794J42024J72318o9725
17244B32848J1049l4743q2366K05400J57144Q897j13723k7985r9227j72911k26631
17233a42248j51905J56812J89031K13950j40684J5835l5839k4463P7758J33190
$$ y = [-214982, 23871, 74052, 68070, 34615, -57926, -47851, 32902, -71655, 75556, 154456, 132925, 18677, 84127, 127114, 228244, 187659, 270558, 270182, 106487, 148415, 294754, 370708, 377791, 359483, 389306, 260383, 237723, 58780, -71865, -57271, 131301, 324791, 478225, 395414, 278659, 360214, 349284, 227095, 15306, -22566, 174684, 161219, 83643, 73851, 163429, 275299, 363416, 525993, 288779, 235906, 287793, 243886, 238143, 221589, 201899, 170544, 21201, -168976, -22357, 78066, 68025, -11769, 130255, 302573, 232848, 243897, 209154, 126788, 332188, 489332, 498229, 384506, 356521, 257294, 84383, -142248, -294153, -137341, 51690, 265640, 124956, 140791, 104952, 80489, 158247, 291437]
17223B91437Q0367q0918L2531L0759p0212j04803L3426r0180j6964J43459Q8003
17212C36905P2205m7080j63701M9880K6289j29733R467Q2980l100J1672J2635
17201B58419q707P3461J61020j03224l20598O9613K98323L0543k2622l8348q199
17190C89681m8502j51326J544r5179j39958m6190K5177Q874L6851J27671J0941
17179A19584Q9552M8028r1263j15679n6547Q0137n5736j0296p1942J7473m7490
17168i4179J65992J12822k32357m6778O3467Q5550R5681j07024k01067R8336J98524
17157A38967r1782j96015P0093n8962K5569m8297J07450J47853K44533l1261p0817
17146B37331J05665p0069j1778q4955k23269j11356J48156J2781m5665l606J3508
$$ y = [291437, 371804, 290886, 323417, 354176, 283964, 179161, 212587, 122407, 105443, 248902, 336905, 409110, 362030, 198329, 248209, 274498, 144765, 154232, 237212, 234112, 245784, 258419, 249712, 323173, 484193, 380969, 60371, 129984, 428307, 458850, 436228, 397880, 389681, 341179, 189853, 191397, 96218, -43740, -89930, -64753, -55879, -19028, 108643, 119584, 209136, 257164, 165901, 50222, -6325, 73812, 18076, 7780, -64162, -46689, -94179, 71813, 184635, -47722, -94500, -31033, 54517, 150198, 43174, -157893, -59557, 138967, 47185, -148830, -78737, -137699, -112130, -160427, -52977, 94876, 339409, 308148, 237331, 342996, 272927, 261149, 176194, -47075, -158431, -10275, 2506, -43159, -46765, -33257]
17135c3257K2246R2234R3073J01735j14361k17679j78205P6681l4010N3018J44896
17124F371R8738j08950r9270k7529N2729J19025R3744o277j39347M1101N8773
17113H9108k02041l5605m0832k0067p853q86j1142m6747J22673J59416m282P1203
17101G2945O3684k3383o9531J4396r8061j20709M3219j54704j29614m4980K3489
17090d23249K75304J44509L6016n8601k59062J30615L53252M8801j10726j3623
17080A23236q4050m2128q6234o8663R865m4994j22466R7897K16647Q9483l7398
17069E1195m4328O6726q7422j21231K0632J00314o6790J02531j66557N993M2678
17058i6259Q4889j16165J11503J3169n1181J19447J37903J21977j26367l8986
$$ y = [-33257, -11011, 81223, 174296, 276031, 161670, -56009, -234214, -157533, -191543, -138525, 6371, 105109, -3841, -103111, -130640, -77911, 41114, 134858, 128581, -10766, 30335, 89108, -112933, -148538, -189370, -209437, -217290, -218176, -229318, -276065, -153392, 6024, 1742, 72945, 136629, 113246, 43715, 58111, -39950, -160659, -117440, -272144, -401758, -446738, -423249, -147945, -3436, 32580, -26021, -285083, -154468, 198784, 247585, 136859, 123236, 39186, -2942, -89176, -157839, -147974, -192968, -315434, -217537, -890, 88593, 51195, 6867, 73593, -13829, -135060, -114428, -14114, -80904, 21627, -144930, -138937, -96259, -11370, -127535, -16032, -2863, -54044, 65403, 203306, 325283, 198916, 159930]
17048A59930j0170J30814p3434j34980j35860m1959K39340R4690p6982q1147M5032
17037A15274P1370O2037k13568N0744K14779K8729j6779j8168o1847r7702J92391
17026C27260O0697K6641n0161m1859j48906j75247j3650P1414J19115m2553K17338
17015C50089O0540r0878k42467l1015j00259j37298J33386K63477r9196j9271
17005H7108j5907K1885K3264N2934J64947n5019l0215j88699p9712R3600Q2639
16994A56825j76105R1219J39027m6551L8529K8684j44441n9266O7102o0382n6894
16983b2253J15373R1386R7503J2725j28442m9518J39803N8903j46685n6709q0455
16972C1631j22255J67861J2507k7746M6924P6480j03227m1718k2713K1105L5824
$$ y = [159930, 149760, 280574, 207140, 72160, -63700, -105659, 133681, 228371, 151389, 70242, 115274, 186644, 248681, 35113, 85857, 300636, 329365, 312586, 294418, 232571, 134869, 327260, 387957, 414598, 364437, 322578, 173672, -1575, -15225, 56189, 175304, 132751, 350089, 410629, 319751, 77284, 46269, -53990, -191288, -57902, 205575, 106379, 87108, 71201, 93086, 116350, 169284, 334231, 279212, 248997, 60298, -19414, 74186, 156825, -19280, 71939, 210966, 164415, 202944, 231628, 87187, 27921, 95023, 34641, -22253, 93120, 184506, 282009, 294734, 166292, 116774, 256577, 315480, 168795, 112086, 31631, -90624, 77237, 89744, 61998, 108922, 185402, 82175, 40457, 17744, 38849, 74673]
16961G4673J33393o5117j16807j11767K4150L6656M7429L4263j51944J0800Q0095
16950d176J2705j50649J00407K08849j58015l0781J45054M9589j54650O779m5424
16939b0312k0214o2494K2411J13105J13512N8581J5458j66392j65589l5857j85264
16928c33055o7833K10966J80227l9582l2289r0470j18087n3755P9119J8216J39638
16917a06905O8772j126J0184o9706j4229l4678P2380J5149p0817j38637Q5964
16906a83649J10730j13323M5879J48143J3597j52706r0784K04994J9231j12396
16896a10284l0352M9024O4568J1903P631J73912l8108j21107j64757K14568J22233
16885A79231k7786k3624k03264j71137J7760K9633K5358J02981K4084J5978p7807
$$ y = [74673, 208066, 142949, 26142, -85625, -61475, -24819, 22610, 56873, -95071, -84271, -4176, 8529, -142120, -41713, 167136, 9121, -21660, 123394, 172983, 18333, 25112, -20312, -40526, -103020, -80609, 32496, 146008, 204589, 220047, 53655, -111934, -147791, -333055, -400888, -189922, -9695, -49277, -81566, -172036, -290123, -343878, -264759, -246543, -106905, -38133, -39259, -29075, -98781, -113010, -147688, -75308, -60159, -130976, -269613, -183649, -72919, -186242, -140363, 7780, 21377, -131329, -222113, -17119, 2112, -110284, -140636, -91612, -27044, -15141, -7510, 166402, 128294, 7187, -157570, 56998, 179231, 151445, 127821, -75443, -246580, -228820, -199187, -173829, -70848, -46764, -30786, -108593]
16874a08593p3081M832l8765k8159J33741J75876O1399k52736j44291l3927J17282
16863a86422J18990N3475M1172r115r7959R4279q4096k16919q2039R9910J50987
16852a17737J58794K09629j03348l03748p3327J44805L6721j80119Q2380J96597
16842E0647l9079Q172K847J5390l6334q4231o0851M5795n0R4120o6589l4177J59937
16829E5597P3357j19043k13015o3719N9377J12350l6587j5478m542L7034r2257
16818b06926K527L0908J93896L4611o5997n6352m5970o9853J27382J25964j38594
16807f8404k6870p5614k3959J67878J86356r981j8890n3434k9431l2782R7819
16796A12688K10177r4914j71448M0582j19170l4740n8263N0430q7763P4512N6476
$$ y = [-108593, -181674, -176842, -215607, -243766, -110025, 65851, 127250, -125486, -269777, -303704, -186422, -67432, -13957, 27215, 18100, -79859, 14420, -69676, -286595, -368634, -268724, -117737, 41057, 250686, 147338, -156410, -229737, -84932, -48211, -228330, -145950, 50647, 11568, 19740, 22587, 37977, 1643, -82588, -143439, -97644, -97694, -3574, -70163, -104340, 55597, 128954, 9911, -203104, -266823, -207446, -95096, -131683, -147161, -151703, -114669, -206926, -204399, -173491, 20405, 55016, -10981, -67333, -113303, -183156, -55774, 70190, -68404, -95274, -170888, -194847, -26969, 159387, 149406, 130516, 77082, 47651, 14869, 112688, 322865, 227951, 56503, 97085, -22085, -56825, -115088, -64658, -152421, -77909, -21433]
16785b1433m5221K2330Q1080j10883j7737K7981N4478J477j15036j24905n0896
16774b98765Q9502J58601K2193P1382K42433m9913r5502j97758j11594M1183k9904
16763a58142l2577K53619J88144q8034k31089j28719K3764j04545r7113q657J32493
16752b50856K15166Q2061J29095M1183k16135J5650q5426k10761o4287P3691J43620
16741a26999J9855j32430k45958j579O6563N3195J88302q0119J48585M9332J9665
16730d1588K4508L7060j99814n9314k5159J54386J33457j37961j44753M7700J16530
16719i4948J2014k24309r1341J59395P5399N3823O6418J15416o2941L9977l4462
16708A4441J1237k4665p8087J58635J48925J84678j98907k98264j09090R3028
$$ y = [-21433, -66654, -44324, 36756, -74127, -91864, -63883, -9405, -7928, -122964, -247869, -298765, -209263, -50662, -28469, 42913, 285346, 235433, 139931, -57827, -169421, -128238, -158142, -190719, 62900, 251044, 163010, -68079, -196798, -173034, -277579, -374692, -383349, -250856, -35690, 46371, 175466, 216649, 514, 16164, -69262, -280023, -344310, -270619, -126999, -107144, -239574, -485532, -487111, -420548, -367353, -179051, -259170, -110585, -61253, -41588, -17080, 19980, -179834, -239148, -264307, -109921, 23536, -114425, -259178, -211478, -94948, -82934, -307243, -398584, -239189, -163790, -109967, -43549, 71867, 8926, 48903, 14441, 25678, 1013, -77074, 81561, 230486, 415164, 216257, -82007, -191097, -98069]
16698i8069o7077n4562N1811P031j7250P4379J74179M6776L532J13431K8462n8446
16686B04197j30403j84306o9355j0947N9980j10684J6944j6622L7678M7454J37405
16675a8659k4197m0817P8211q9289l9738J60106k7578J6840j02917j45709J14663
16664a19084J59528R3328J55735j19066k35023j74292J13348m3720j3941k3283
16654b06470r0168J17375J96029J19145o6195j39264p9517k3751N697L027j90323
16643c54415j7729j5999J70464J71800k20j02579L780J46396J73870k05043K0693
16632h982K2136R1484n2973j61590J75620J04132j9552j66662j63502K4382K3663
16621a31844J33202N8860J49735Q1680l04644j64544r0774j7134m2274O8361K27767
$$ y = [-98069, -165146, -219708, -167897, -160866, -178116, -103737, 70442, 117218, 120750, 234181, 262643, 204197, 73794, -110512, -179867, -190814, -130834, -241518, -224574, -241196, -203518, -156064, -18659, -42856, -83673, -5462, -94751, -134489, 25617, -1961, 14879, -88038, -233747, -119084, 40444, 133772, 289507, 170441, -64582, -238874, -125526, -169246, -183187, -206470, -296638, -179263, 16766, 135911, 69716, -69548, -149065, -172816, -167119, -164092, -354415, -372144, -388143, -217679, -45879, -46099, -148678, -144898, 1498, 175368, -29675, -8982, 13154, 104638, 51665, -109925, 65695, 169827, 150275, -16387, -179889, -155507, -131844, 1358, 60218, 209953, 291633, -13011, -177555, -268329, -285463, -327737, -259376, -31609]
16610c1609N648K3972n9999l4904K4699M1920j28373J02641J36605o8903p0940
16599e9243n3161K3045o2999k696J69327K9921j07432M2519q6093k00368N681
16588c01499K01104K421k3130Q3031O5034M150P7061J21327r5194q3328q794m6645
16576d462K1545K9700j34250j88473j1014J41132N2993O5662q8726K2788J76573
16565H3468o0038n8134J08681R420p8876r3571m1941m8695N1417m7885M579J7217
16553a54358J73829P1557j6954J36577k5067l8703J10006n8180k1034o0047p3993
16542D3633J8818R4284J88908R3088P2480j17728j81315j31914R738Q2658O7257
16531B39907j58678o2877j38147J42447J14734J12278N4483k91252K8817K7296
$$ y = [-31609, -25961, -1989, -61988, -96892, -72193, -30273, -158646, -56005, 80600, 11697, -59243, -112404, -89359, -152358, -155054, 14273, 44194, -63238, -20719, -106812, -307180, -301499, -100395, -97974, -121104, -38073, 26961, 31111, 108172, 229499, 134305, 50977, 42183, -4462, 17083, 46783, -87467, -275940, -286954, -145822, -92829, -27167, -115893, -93105, 83468, 23430, -34704, 73977, 83397, 4521, -89050, -130991, -179686, -128269, -176154, -171575, -154358, 19471, 91028, 74074, 210651, 185584, 146881, 256887, 198707, 177673, 117626, 43633, 62451, 156735, 345643, 438731, 511211, 393483, 212168, 80254, 89992, 172650, 239907, 81229, 18352, -119795, 22652, 137386, 249664, 304147, 12895, 41712, 69008]
16521F9008k0672K1995J6615j17624J4257k9221L1971J6082j59566l8658O8740
16510a27073j10271l2825O0491R8572K53169N2835K6090k4430j22161k56437M7165
16499a34875m6437Q4329Q0594j40765k13623q2080R9707N2506p8417O3074J26555
16488a89432R8472L7986n9855k312P3307q173k7376l8367J46478l5830j35920
16477a41022K4609m3453J53030K02134p238l7730o5218o3592p3760M6155j987
16466h072r7605r86k000N0399r8347k27179L1975J17768K38599P0488j61301j2464
16454i8725K11107j4982q1487L0620l05919j30956n6473M0145N2389M1388J42758
16443a70135O1978J96779j4895k4193k6758j02692N9830r5783k8656K1449p5610
$$ y = [69008, 48336, 70331, 86946, -30678, -16421, -45642, -13671, 2411, -157155, -195813, -127073, -237344, -270169, -209678, -111106, 142063, 194898, 220988, 196558, 74397, -182040, -134875, -181312, -96983, -16389, -157154, -370777, -452857, -353150, -300644, -379061, -315987, -189432, -90960, -52974, -112829, -115141, -41834, -50007, -77383, -115750, 30728, -5102, -141022, -116413, -159866, -6836, 195298, 188060, 150330, 85112, 21520, -52240, -6085, -8072, -105677, -106663, -108663, -58264, -156611, -383790, -351815, -234047, 4552, 75040, -86261, -98725, 112382, 97400, 15913, 46533, -259386, -390342, -446815, -406670, -354281, -312893, -170135, -108157, 88622, 73727, 49534, 22776, -79916, -20086, -115869, -144525, -123076, -198686]
16432a98686j18008J06614J73669M1916j07845q6096J34115P2644N6516o0887
16422A3952j57264Q0752N8992j12349k52800N4393J77690J99618J4829K8933l8780
16411F7966r7963n4166j6382K445L5197j01716J12025n131K1295J6399m3455r778
16399g3264r9258L006L5237L9313N4163J47184J94584q0814j54189P3424j12376
16388B7010j95688p1164M1430K8096J23975M8571j4585q8970K3r5785j03278O4935
16376b35430N7091Q6776n8535J25681j6772R3793N9234k9242o7747J17524Q3731
16365B16104j00216L372j33808j20137J2375M9359O6830o3890K3752j42889P9776
16354a09372J02154N0295j90065j94701N0880j38701j1248K22997L06440n1261
$$ y = [-198686, -316694, -210080, -36411, 5505, -102340, -188436, -54321, 18323, 74839, 13952, -143312, -62560, -3568, -115917, -368717, -314324, -136634, 62984, 77813, 106746, 67966, -29997, -84163, -100545, -98100, -62903, -164619, -52594, -57725, -36430, -20031, -63486, -73264, -172522, -169516, -134279, -94966, -40803, 106381, 300965, 220151, 65962, 139386, 27010, -168678, -239842, -198412, -170316, -46341, 2230, -12355, -101325, -101302, -197087, -300365, -235430, -178339, -91563, -150098, -24417, -41189, 52604, 111838, 82596, 14849, 132373, 216104, 115888, 119260, -14548, -134685, -122310, -72951, -6121, -70011, -46259, -189148, -109372, -7218, 43077, -146988, -341689, -290809, -429510, -440758, -217761, 88679, 37418]
16344C7418m9897O4987P2192p8208j14809P8758O9888o7546Q5469J093j25276
16333b5931o0020k9704m6750L4430J9337j433O2935l832j61429o948J1320J53892
16321e4133J18879R2249j84842k32372K4417J67329K5140j00424m0701M7421Q5341
16310e1696j8737p2433O3208O4526J0169m4139j82117k2106O0909R3990l1274
16299a29700j67399J3745J91617P9720j72798j26536O3665M4505k8291O1036J99450
16288B9014K25q6539l7622N7163m677K4031n5874j4932o685N711j19399k57566
16276d67150n2728J85985K01253Q7336r9566j04223k5500J15217Q2442q8551m982
16265a70467J00655L8365q7082j86133O0909K0431m482N7657l9176N4497R3784
$$ y = [37418, -12479, 52508, 124700, 46492, -68317, 10441, 80329, 12783, 98252, 99345, -25931, -85951, -115655, -162405, -127975, -108638, -110071, -47136, -50968, -212397, -219345, -208025, -54133, 64746, 156995, -27847, -260219, -235802, -68473, -43333, -143757, -184458, -137037, -51696, -70433, -142866, -79658, -15132, -4963, -49102, -231219, -253325, -192416, -98426, -129700, -297099, -283354, -91737, -12017, -184815, -311351, -247686, -203181, -231472, -170436, 29014, 29239, -57300, -94922, -37759, -42436, -18405, -74279, -89211, -95896, -90185, -209584, -467150, -519878, -333893, -132640, -45304, -144870, -249093, -274593, -159376, -76934, -165485, -170467, -69812, -31447, -118529, -304662, -243753, -223322, -227804, -170147, -209323, -154826, -61042]
16254f1042j09786j43707r384M7894o79J8819P3972k9935P9632J3917j39973k4955
16242b85227o117n500Q2573K7166J36751l4953j78114j12126J56488p3189l3561
16231c25809P1616k0659j27195M0550R8075J04631R2644l5276j49031J29075J08018
16220a3361J12750k4515k01703q8598m968P1957J80471M7632M9042J0300j90696
16209e1689L2384J50483l9427j63662J62738M8425K7905n7193p3245m1243j50003
16198a54527K4117l2807O6339j81443J39324R5084P5435O6165m9452m379j22184
16187g8328j63209j76449J83967K22398k9184j97130N0608M3990l341j23292n9513
16176c29483j32814M0464J17435K39724R5818j69267j65190j20928L3395J91857
$$ y = [-61042, -170828, -314535, -323919, -276025, -276704, -257885, -183913, -213848, -134216, -120299, -260272, -285227, -291344, -296844, -214271, -187105, -50354, -85307, -263421, -375547, -219059, -292248, -325809, -254193, -274852, -402047, -361497, -263422, -158791, -66147, -101423, -250454, -121379, -13361, 99389, 74874, -126829, -215427, -220395, -148438, 32033, 79665, 128707, 139007, -51689, -19305, 131178, 91751, -71911, 90827, 139252, 167157, 109964, 36719, -4524, -154527, -130410, -163217, -96878, -278321, -138997, -43913, 31522, 97687, 48235, 43856, -78328, -241537, -417986, -234019, -11621, -40805, -237935, -187327, -143337, -146678, -269970, -329483, -462297, -421833, -304398, -64674, 31144, -138123, -303313, -424241, -390846, -198989]
16166a98989J12995r5738R298Q8848j17971R9977j4132J15626J14138J62899k8731
16155B48220j84167P206m0396k44740J58276K47157n1312j36875P0267j2502j57229
16144i6095R2856J36337k025j31023r398K5678J63588j3092j51708k65321m3810
16133b94013k9125J17102j854Q6773M9532L441R4884j14581m4107K9763J727l4665
16121a35123j8280J82809J7117j33538n7047l368p1213N3365Q6406R7017o035
16110A2110j82009o5175L3887L8205N0456K3133J30621L9052P4730J43252r3610
16099B04652k3055l0977N4063J37717J3529n9277q4548k50386j28422l3674K5709
16088a74669M3634k2936J00303K22276j33823l8592O7403k8665r6047k7986M9058
$$ y = [-198989, -85994, -181732, -172434, -83586, -201557, -101580, -115712, -86, 114052, 276951, 248220, 64053, 71259, 30863, -213877, -55601, 191556, 140244, 3369, 73636, 61134, -96095, -3239, 133098, 131073, 50, -9348, 16330, 179918, 166826, 15118, -250203, -294013, -323138, -206036, -207890, -121117, -71585, -68144, 26740, -87841, -131948, -102185, -100458, -135123, -153403, 29406, 46523, -87015, -144062, -147430, -218643, -165278, -78872, 18145, 12110, -169899, -235074, -201187, -162982, -112526, -89393, 41228, 80280, 155010, 298262, 204652, 181597, 150620, 204683, 342400, 355929, 296652, 212104, -38282, -166704, -200378, -174669, -131035, -153971, -53668, 168608, 34785, -3807, 63596, 34931, -61116, -89102, -40044]
16077d0044Q3321m7406m2304O940J55417J08870o967j86045o4547j5637R4666
16066D6264O5114J5350l34881j85753o1030J53675J74731O3708j12864j5076L1483
16055a59279N6453j13653O0644J86333P6397Q2594o9005o3058j42616m8041J75831
16044D2600L6309j68904m7391P497r1389j62904K6520j00841j28923J23656J01157
16033c62613J68818K11435m8371R4846J2558j01170j5347N8752n367r4640P6729
16022d370J15624K3993o146m4992p6219q5778j16158O9266J53313Q812J28422
16011A65767Q4544p9897n7236q2163n6271J65006J0652k6566k08227M1146M4120
16000H75m7403m7720j2977N4083n0183q5085j46132M0080j7729P2798J56598K1959
$$ y = [-40044, 43277, -4129, -46433, -39493, 115924, 224794, 217827, 31782, -32765, -48402, 46264, 111378, 126728, -208153, -393906, -454936, -301261, -126530, -62822, -175686, -190762, -159279, -102826, -216479, -155835, 30498, 106895, 189489, 120484, 57426, -85190, -133231, 42600, 78909, -89995, -137386, -129889, -221278, -384182, -357662, -458503, -587426, -463770, -362613, -193795, 17640, -30731, 64115, 76673, -24497, -39844, 18908, 13541, -81099, -4370, 111254, 135247, 129101, 84109, 7890, -77888, -194046, -124780, 28533, 37345, 165767, 250311, 170414, 113178, 31015, -25256, 139750, 150402, 123836, -84391, -43245, 875, -46528, -94248, -107225, -53142, -103325, -188410, -334542, -294462, -312191, -239393, -82795, -60836]
15988f0836k8446R9632j8262P1379N7993m7950n4733L9636k38130K4811J03742
15977e1164r2052j83997o9355J89601J06610K7865r058j34923P083l7644j2567
15966b59601M6069P4946M9102q0387R7203K8492j51412K746j82223P2780K26348
15955g5937l1734j7480M8758N8914k4348R9795o6149O6211K4051j40232n9278
15944a17429n3611M2349p250o3014p5259o7699j7569N2789M8668P3906J73868
15933a0251R1498R0997q8992j92785j4695p2554Q2322J21806J5507m6577J3213
15922a0511Q2805k8834j16330j54350j09340P5432R5046J33944M1355L2643O7263
15911A09123J1996m6000p0671l4684L5197o8526q5611k9797N443j7631O0042N3059
$$ y = [-60836, -89282, 10350, -7912, 63467, 121460, 73510, 18777, 58413, -179717, -154906, -51164, -143216, -327213, -396568, -206967, -100357, -72492, -81550, -216473, -209390, -247034, -259601, -213532, -138586, -89484, -169871, -72668, -44176, -195588, -192842, -375065, -302285, -75937, -107671, -125151, -76393, -17479, -41827, 57968, -8181, 58030, 82081, -58151, -117429, -171040, -128691, -135941, -198955, -274214, -341913, -359482, -306693, -258025, -184119, -10251, 81247, 172244, 83252, -109533, -124228, -196782, -114460, 7346, 22853, -23724, -10511, 72294, 43460, -72870, -227220, -336560, -261128, -166082, -32138, 9217, 41860, 109123, 121119, 75119, 4448, -30236, 4961, -63565, -149176, -178973, -173530, -191161, -131119, -78060]
15899g8060P8536P1559l8002l0223O170J8886O4810Q7846P0631j4856j18988j30618
15887a2309q9389o7178L5249J57457J2042j44465k73646q4002M0992Q0579K3151
15876c21519L2346K01462L8708l4992r3044m8065R5849P5937K4560j36920j66766
15865c32444O3183m4060J25200J89057L8639k76639j46664Q902J35625J29018
15855a10183n7693N1810J8561j98312k02L8303J22114o6797J62947J42739l4075
15844F9212p4870k7987k3314l1889R7062o8812p9656k1377J9785J32853k5142
15833c4135n5223R1910Q5297j49785q0745j9544P0520k04351J73887L9651j2058
15822i4576j4235Q1871j6212J2446J82543j37977k54682J0117J57784m9894p3387
$$ y = [-78060, 476, 72035, 34033, 3810, 9980, 28866, 93676, 181522, 252153, 237297, 118309, -12309, -101698, -168876, -133627, 23830, 35872, -108593, -382239, -466241, -425249, -344670, -321519, -289173, -87711, -49003, -83995, -177039, -225104, -129255, -53318, -28758, -165678, -332444, -269261, -313321, -188121, 936, 39575, -237064, -383728, -374826, -239201, -110183, -167876, -116066, -97505, -295817, -296019, -257716, -135602, -202399, -39452, 103287, 69212, -5658, -33645, -56959, -88848, 8214, -60598, -140254, -161631, -141846, -8993, -34135, -89358, 2552, 87849, -61936, -142681, -162225, -91705, -296056, -122169, -82518, -94576, -108811, -26940, -43152, -30706, 151837, 13860, -240822, -230705, -72921, -122815, -196202]
15811a96202N6979m959k3889q674O425o9855J21079j00292M4358P0720l9446J23465
15799b0291O5123j09475l6546K42720K15716j2366o6110R2230j08642p1193j30130
15788F1036l7237M6452P405j2455p2312j78587j95825J336K3888Q3801J20340
15777a52158m8004M8248J25334Q4959p425k0288N0880J10927K4723n9881k19148
15766f1833j76159p5355J25391Q5453j9783L7675L2954J41627p6367p4785O2177
15755I95J929j49510l9059j24226l0460J57935J46574J9439j23166j07105K8871
15744b17783P3438J0266k5810K3996k6580N4091q8423J52116R2730j02837k28588
15733b83384k4091J53419J39951J09262j958j73280n0655j31552o1857J48710
$$ y = [-196202, -139223, -144182, -168071, -176745, -170320, -240175, -119096, -219388, -175030, -104310, -143756, -20291, 44832, -64643, -101189, 141531, 357247, 344881, 278771, 371001, 262359, 191166, 61036, 23799, 70251, 77656, 65201, -7111, -185698, -381523, -380187, -356299, -272498, -152158, -200162, -151914, -26580, 58379, 50954, 30666, 81546, 192473, 217196, 157315, -61833, -237992, -313347, -187956, -102503, -122286, -84611, -51657, 89970, 13603, -61182, 995, 2924, -146586, -185645, -309871, -340331, -182396, -35822, -16383, -139549, -246654, -217783, -144345, -134079, -159889, -135893, -162473, -108382, -196805, -44689, 48041, -54796, -283384, -307475, -154056, -14105, 95157, 93199, -80081, -130736, -262288, -324145, -175435]
15723a75435J65794n5767o9436J33057m4950m0629l6541p5152K7675L2079J90119
15712E0814Q9299J00704N0368j41526l7058J31731j17541j30203N4611j68980
15702a17781m7897Q9890O336O8461J77581N89j19402n1832j24948k2824J66865
15691B5038K6523k372r049k1009J29706M2490j1983O7478J035j36593r4850J3619
15679C0033J2945j37045l4230J04656J62115l7135j78450k9368j30723j10285
15669c47487R0307K8152j7192L8494L2396O1307o6337O5645L1160k8968l0164
15658a42687r5971l2894r3502M5357J16609Q405L1833L3766Q5526j37569r0337
15647b71464J76836J50518M7028J39259r2689j28012Q8523r7492N9083m501j49925
$$ y = [-175435, -9641, -65408, -134844, -1787, -46737, -87366, -123907, -199059, -171384, -139305, 50814, 140113, 240817, 291185, 149659, 112601, 244332, 126791, -3412, 51199, -117781, -165678, -75788, -69452, -991, 176590, 177179, 57777, 5945, -119003, -141827, 25038, 51561, 49189, 40140, 19131, 148837, 191327, 179344, 246822, 247857, 111264, 16414, 30033, 42978, -94067, -128297, -23641, 138474, 101339, -77111, -106479, -237202, -347487, -257180, -229028, -246220, -207726, -175330, -114023, -180360, -114715, -83555, -112523, -142687, -238658, -271552, -365054, -319697, -203088, -194683, -162850, -129084, -43558, -181127, -271464, -94628, 55890, 102918, 242177, 149488, 21476, 109999, 12507, 71590, 67089, -82836]
15636h2836j25878P223J4766M4008l9604R4595K9361j16068P4128J70720M8300
15625A18715j76449M4320N9144J22603R5742k25724k10427Q5676K16329Q3028
15615B12957j11576r5661m4094L5382J6338r5740j10242l9680Q5675J38296k0147
15604b8492j8611R1177j4365j62282k819J65416r9005j3801J80150l2154J5364
15593H0578p8971L7164K8084p9984R9455J65485J4591j95702L5093O2846O4560
15582B33199j05454j3952m9237q7593j89355O6340Q1472L2109l9995N3150k1830
15571d1146N8569P7064n7727k5168K2654J38933j50151n1656J76144j05542k01430
15560a59456J38667J61949j36220o4396R9041K6121j15680J1405L6411l0743j69276
$$ y = [-82836, -208714, -201491, -186725, -142717, -182321, -87726, -58365, -174433, -100305, 70415, 118715, -57734, -13414, 45730, 168333, 264075, 38351, -172076, -86400, 129929, 212957, 101381, 5720, -38374, -2992, 13346, -82394, -192636, -232316, -146641, -8345, -28492, -47103, 44074, 29709, -132573, -135392, 30024, -68981, -82782, 97368, 65214, 80578, 1607, 38771, 66855, -13129, 86326, 251811, 266402, 70700, 105793, 168639, 233199, 127745, 113793, 64556, -23037, -212392, -146052, -64580, -32471, -72466, -19316, -41146, 17423, 94487, 36760, 11592, 34246, 173179, 23028, -28628, 147516, 41974, -159456, -20789, 141160, 4940, -59456, 39585, 65706, -49974, -38569, -2158, -32901, -202177]
15549b02177P6834m8244J12192M6729j36965p7386j48382J90155L51675L2933
15539A97364k68693j13878N4938P3379q7719J05985j5918m8139j640M0114r841
15528g4048K43518l0606k11409J23841J3529j7480N4215O4484m0066M7136p4814
15517I8300j00692n373k1336L1248n4527J2352K14776R6017J1884j70177j12673
15506b01P5695P4203Q3276K5610j8117j8958k26572O9735L4263n2940L9058k18044
15494a32992r9506J25492p1783J15208K90325j34638k5641K9412j54665q2742
15484a41530O0848p785m9323M1956R2712O5409P3432m8381j48231j11669J29373
15473d3189N042j37377j85166k7895J20429O7689j55418J6512J39086R3607J0213
$$ y = [-202177, -125343, -173587, -61395, -14666, -151631, -229017, -377399, -187244, 164431, 197364, -71329, -185207, -130269, -56890, -144609, -38624, -54542, -102681, -104321, -64207, -74048, 169470, 138864, -72545, 51296, 64825, 47345, 101560, 166044, 125978, 173114, 98300, -2392, -7765, -29101, 2147, -52380, -40028, 174748, 270765, 282649, 112472, -201, 75494, 149697, 232973, 258583, 240466, 221508, -5064, 64671, 98934, 45994, 85052, -132992, -232498, -107006, -178789, -63581, 226744, 92106, 66465, 95877, -58788, -141530, -80682, -88467, -137790, -95834, -3122, 62287, 135719, 87338, -60893, -172562, -43189, -38147, -175524, -360690, -388585, -268156, -200467, -355885, -339373, -200287, -106680, -96467]
15462i6467K1171j5645K1983J27288m3435O0678l281k9767n2958P4020J0072P5031
15450A48690j10078M9264J24159J21504o4189k55259j55730M2191J66237J22588
15440A89377m6867j76232j31694q9303R4658r3850k6621J80864Q5646k6583r7576
15429a38181R7697Q8305l4891m3624O2262J0743j20140K6617L0607l1432l6148
15418h8185N9802L1612l1277r9106j04094K12834J81649r8414j99946j72272m8454
15407c55851j23032J22960O9714J75357m373J9088J67050k12900j99709Q8958
15397b52738R1431J2884J83937K5408j75599M5623J04739m2892o8026J03390N5991
15386H4148K2919R6002j51234j59632j00388M7071J30200J30377J45797J48189
$$ y = [-96467, -75296, -90941, -68958, 58330, 14895, 75573, 72292, 42525, -10433, 63587, 73659, 148690, 38612, 87876, 212035, 333539, 269350, 14091, -141639, -99448, 66789, 189377, 142510, -33722, -165416, -254719, -160061, -253911, -280532, -99668, -14022, -40605, -138181, -40484, 47821, 12930, -30694, 31568, 42311, -77829, -51212, -20605, -52037, -88185, -28383, 3229, -28048, -127154, -231248, -18414, 163235, 64821, -135125, -307397, -355851, -478883, -355923, -286209, -110852, -115225, -96137, 70913, -141987, -341696, -252738, -161307, -148423, 35514, 60922, -114677, -69054, 35685, -7207, -75233, 28157, 84148, 107067, 203069, 51835, -107797, -208185, -161114, -30914, 99463, 245260, 393449]
15376C93449p4621M5610n2210j75713j00676J34405k7545L4076j22348j78574
15366a24147m0096m5371J61316J51862j00496J0658O2479R625n6740r0033Q3367
15355B2424L2131o2697l877K1097P5585j1472l944j26631p0480M9181L2785r251
15343e5149j18322R7598k5112j46554q4099k8523M9484J70690J81602P8694j28975
15332h666j1779n1853j14237K5905M8694r752L656O9997O891N0183l0762O868
15320a4855O2984K9001q318j08768J29908J6869j3556m1250k0450j6640p2570
15309e7645k3475Q1071j57902L947J27485J31705J96493j74947k8476M3195j42628
15298a177l3728j10527j01111p3642K00587J67524j40026m9511m1386n0470p677
$$ y = [393449, 318828, 364438, 312228, 136515, 35839, 170244, 142699, 176775, 54427, -124147, -164243, -209614, -48298, 103564, 3068, 13726, 76205, 85830, 29090, -60943, 22424, 54555, -8142, -12019, 9078, 84663, 73191, 69247, -57384, -127864, -78683, -45898, -55149, -173471, -75873, -100985, -247539, -331638, -360161, -310677, -139987, 41615, 120309, -8666, -20445, -72298, -186535, -160630, -111936, -121688, -118032, -48035, -41144, 9039, -21723, -14855, 48129, 77130, 68812, -39956, 89952, 106821, 93265, 52015, 31565, 14925, -57645, -81120, -49, -157951, -154004, -26519, 105186, 301679, 126732, 98256, 141451, -1177, -34905, -145432, -246543, -320185, -119598, 47926, -92100, -141611, -182997, -233467, -241144]
15287b41144l0453o0418M0740M3384J54831J13147o8796M3721j58201P7912J12507
15276B7230J34826O6234o1032p253L0352m027k3702j90492N601K875k20064J29663
15264a09789O8672j10610L6791R8734J15192N3952q8762K3454p9883K8570M5591
15253H1912q5592L9582q3405K6477j04047O2966O483P0086O0455r9549N2381J64995
15241A92744p2205k15748l7148K16269n8365Q879k16649q9318J4482K68966P0194
15230H2101P7220J1006p8518j31286j17335k0553K1624K4465P6554J15647j23445
15219f2520q7322Q1419L3401Q1384O8221k3493N6285M6730J8801k3396N7115m6413
15207B00212r5938k05012j958K20079O1604n6622L1145j33065j30558l1953K44675
$$ y = [-241144, -271597, -332015, -291275, -247891, -93060, 20087, -48709, -4988, -163189, -85277, 27230, 162056, 228290, 167258, 160005, 190357, 186330, 162628, -27864, -22263, -19388, -239452, -109789, -41117, -151727, -114936, -16202, 98990, 152942, 64180, 87634, 7751, 36321, 81912, -3680, 35902, -47503, -21026, -125073, -62107, -55624, 14462, 74917, -24632, 27749, 192744, 120539, -95209, -132357, 83912, 25547, 34426, -182223, -271541, -257059, 11907, 82101, 159321, 170327, 91809, -39477, -156812, -177365, -155741, -131276, -54722, 60925, -62520, -149842, -68423, -35022, 46362, 114583, 91090, 147375, 194105, 212906, 189510, 246625, 200212, 104274, -100738, -102696, 117383, 178987, 122365, 153510, 20445, -110113, -142066, 102609]
15196A02609q2231K5368J6956o7293L388Q0107Q1963N9225n3337n7774j96606
15185h7625j79716M1553O1481J16637O1213j32797m6390q3031M4750l061k9553
15174b36539J06641J36375J75731q2426j46935J58393K0617j0428o9344j38109
15164h6024Q1769K33586j4512k37804j74492J58164J85965l4229L519N1252p3299
15153I3895J43272M8662J52960J41998N7800J18473J5536O7291N924J16374J36239
15142A098424N8872K05471Q2380j28525J13801j60776k14465p4446l2199j39324
15132H09213q2533q5935j86363k78907P1345M5103j10356N7609J93865o4472j32752
15121B35817o0664K453j340J310J28321n1981m4850p5053r1887n1549m6583j2377
$$ y = [102609, 20378, 45746, 62702, -4591, -1203, 78904, 160867, 220092, 166755, 108981, -87625, -267341, -225788, -164307, -47670, 13543, -119254, -165644, -248675, -203925, -206986, -236539, -129898, 6477, 182208, 99782, -47153, 111240, 131857, 121429, 52085, -86024, -4255, 229331, 214819, -22985, -197477, -39313, 146652, 112423, 115942, 167194, 93895, 237167, 285829, 438789, 580787, 638587, 757060, 772596, 839887, 845811, 962185, 1098424, 1157296, 1362767, 1445147, 1316622, 1430423, 1269647, 1055182, 980736, 948537, 809213, 726680, 640745, 454382, 175475, 246820, 291923, 181567, 239176, 433041, 368569, 235817, 175153, 177606, 176266, 177576, 305897, 253916, 209066, 134013, 42126, -9423, -56006, -68383]
15109f8383M9943P9916J03990q7565K6507m8182l4394m6802J73092L7559N5010
15098B40691J25111j08251j62515r2911J7150J24031m1969L2457l5941o3718J69971
15087B04106J08250j43073k8529J06199j37295j36776r3603K45954n5681m1730
15077B7822N0998n6860n3591Q3352j7719R0691J71389p652K7535j20999P5098
15066B70064n30m1176m5347j20433R765j2927M5149P996m4379j8705o7327P2759
15054E4909Q3525M0087K9668j36214K0871m1468m0450Q1304n2285j51502K911
15043a08644R2086J54741l4491K7960N0865k0661l8234J66267K64787k01909k53366
15032I9401k8195O9499J67088k7523j76561K5436K50918M4938j5681M2177l5872
$$ y = [-68383, -18440, 61476, 165466, 77901, 104408, 56226, 21832, -24970, 148122, 185681, 240691, 365802, 257551, 95036, 2125, 19275, 143306, 101337, 133794, 97853, 34135, 204106, 312356, 169283, 140754, 246953, 109658, -27118, -120721, 125233, 69552, 27822, 78820, 21960, -31631, 51721, 34002, 124693, 296082, 288430, 315965, 194966, 270064, 269534, 228358, 183011, 62578, 72343, 59416, 104565, 112561, 68182, 49477, -17850, 54909, 138434, 178521, 208189, 71975, 92846, 51378, 10928, 92232, 39947, -111555, -108644, -16558, 138183, 103692, 131652, 182517, 161856, 123622, 289889, 554676, 352767, 99401, 71206, 140705, 307793, 280270, 103709, 129145, 380063, 425001, 409320, 451497, 415625]
15021D15625p3608l5997L6353J29944j08769J17867L2481k41242j34576J07625
15011B45703J07304R5254m6745j03115q070q6503o571r2510j58361K1416J75622
15000A43424O272j45236r9872J28574K10088J41013j20107J60355P5158j93168
14990C06501j29423k6771J17738J795R1019K4313O5349Q0575o1976j19113R5649
14979D45656J09326K41769o1115k35633j09340j5499L7630M0683P6516k3211r3681
14968D13101K393j30296R2174R3559L0646q1898o9077o7883L5292j6534m5998
14957B55479n5962R7327J36661p7829j7232j34396M3604J85212K9393q2177j2258
14946C67822J18732R6513l2926J0004J12871j67687k6833K1496n3889k2287K7183
$$ y = [415625, 342017, 306020, 342373, 472317, 363548, 481415, 513896, 272654, 138078, 245703, 353007, 448261, 401516, 298401, 290331, 203828, 197257, 104747, -53614, -32198, 143424, 149696, 4460, -95412, 33162, 243250, 384263, 264156, 424511, 499669, 306501, 177078, 150307, 268045, 269840, 360859, 385172, 450521, 531096, 469120, 350007, 445656, 554982, 796751, 735636, 500003, 390663, 375164, 412794, 453477, 529993, 506782, 413101, 415494, 285198, 377372, 470931, 501577, 419679, 350602, 282719, 318011, 301477, 255479, 199517, 296844, 433505, 355676, 338444, 204048, 247652, 432864, 462257, 380080, 367822, 486554, 583067, 550141, 560145, 673016, 505329, 478496, 499992, 446103, 423816, 450999]
14935D50999j38502J51440J42595j39950j07882j2415R5825N4342j04271k40364
14925A51817q3370O5642K0501K1789J6887j6258L8954J9137R8131J7726J6920
14914C67876N2797L0756o3965J4189r891r3915J7049J3142J45323q4426r8142
14903B90793k13341j60263J54161J78357R962J19226N5585j45402j55717N0486
14893A83847K7175q9061K258J48433p408O3582K05695q767p7618m0020J03750
14882E11866Q9888k00781q4025L523Q4879P664j83679j05378Q629N8788o2828
14871A28546R9652R7796N1366L6318N1883O657j20728j44319O7028K33629l3319
14860D74509q7834j18719J8629J35701l1859p7044j43120l0898J05062J23396
$$ y = [450999, 312497, 463937, 606532, 466582, 358700, 346285, 442110, 496452, 392181, 151817, 68447, 134089, 154590, 176379, 193266, 177008, 215962, 235099, 333230, 350956, 367876, 420673, 451429, 387464, 401653, 391762, 297847, 314896, 328038, 473361, 388935, 290793, 77452, -82811, 71350, 249707, 259669, 378895, 434480, 289078, 133361, 183847, 211022, 121961, 124219, 272652, 265244, 328826, 534521, 525754, 448136, 408116, 511866, 601754, 400973, 316948, 320471, 405350, 413014, 229335, 123957, 132586, 191374, 128546, 228198, 325994, 377360, 413678, 465561, 472218, 351490, 207171, 274199, 507828, 474509, 386675, 267956, 286585, 422286, 390427, 313383, 170263, 139365, 244427, 367823]
14850C67823m3886n5771M1272K10833P2626K4712k59882k35483o3882K12116J90241
14839D60719J61498O3510j94093q6766m6866N9662P4150K04381P9687K4428L6092
14828H36402N3686l2026k27115m6690j6541K13990K97018K89480K23808K95735
14818A887747K73032J98752P9402K03826L08915K89122J28666p8558j49467k18389
14808B923048k79663p6539k51532j29003p6536k21580j80212j19997L257r0798
14798A500445J71125L9845k0489O8787o7865O5902k6339J29448R4894J42298K91783
14787B389834K00051J75001j1666P4008J61326K80875M91936M08794N11359N43711
14777E225229N12246P86418Q42890J198333J243186J093153J336109J492246J434377
$$ y = [367823, 323937, 268166, 309438, 520271, 592897, 617609, 357727, 122244, 58362, 270478, 460719, 622217, 685727, 491634, 404868, 358002, 417664, 491814, 696195, 775882, 800310, 836402, 890088, 858062, 630947, 584257, 567716, 781706, 1078724, 1368204, 1592012, 1887747, 2160779, 2359531, 2438933, 2642759, 2951674, 3240796, 3369462, 3290904, 3141437, 2923048, 2643385, 2566846, 2315314, 2186311, 2109775, 1888195, 1707983, 1587986, 1591243, 1500445, 1671570, 1711415, 1690926, 1759713, 1691848, 1757750, 1731411, 1860859, 1955753, 2098051, 2389834, 2589885, 2764886, 2753220, 2827228, 2988554, 3269429, 3761365, 4170159, 4681518, 5225229, 5737475, 6523893, 7366783, 8565116, 9808302, 10901455, 12237564, 13729810, 15164187]
14768A5164187J179961J106367N84046K51359M5563k88971m35346p06714r82356
14759A5918096j201670j103104j202632j094032r23937q59544q59194o28660n05171
14750G540152n86345n32269m73265k57366m9618m9639j43987k80629r4387r5978
14740D976669j39849j46775O4511O6597j05193p4420N1204j56311j63619P1398
14730D444212M5839j6300J39227K87165J32899r1230M5380K26500J33713M14161
14720E761566K68842R5101K71096K67768L11564L45050L49757N86190N82569M95130
14710I334633P43398R89014J197271J583338J617906J765079K194606K681708
14702B2106953L093339L622624M394081N258193O502546Q243517J0489363J3506931
$$ y = [15164187, 16344148, 17450515, 18034561, 18285920, 18331483, 18042512, 17607166, 16900452, 15918096, 14716426, 13613322, 12410690, 11316658, 10392721, 9533177, 8673983, 8045323, 7540152, 6953807, 6421538, 5948273, 5690907, 5641289, 5591650, 5447663, 5167034, 5072647, 4976669, 4836820, 4690045, 4754556, 4821153, 4715960, 4641540, 4692744, 4536433, 4372814, 4444212, 4490051, 4473751, 4612978, 4900143, 5033042, 4941812, 4987192, 5213692, 5347405, 5761566, 6030408, 6125509, 6396605, 6664373, 6975937, 7320987, 7670744, 8256934, 8839503, 9334633, 10078031, 11067045, 12264316, 13847654, 15465560, 17230639, 19425245, 22106953, 25200292, 28822916, 33216997, 38475190, 44977736, 53221253, 63710616, 77217547]
14694G7217547J7125894K1190436K5079581K8097715L0309126L0179929K7647125
14687B56847353K2779873J5550956O505634k785546j1647897j9198454k4338789
14680B43713130k7213759k7443698k5764800k2777630j9655063j5909095j2811674
14673I2137411j0193054p963657o413606n371075m575737l903675l436737l062018
14665D7217852k817012k592332k159443j987236j500001j558701j680570j610989
14657C1311568j156734j061431j136153j122836r95646j101602j032491q43989
14649B2860686p78703q14488n86715o90985m15380n57547n80381m68412n83043
14640A7385032o94774m34081n06337l60689m62257m81738l21004l69022k65581
$$ y = [77217547, 94343441, 115533877, 140613458, 168711173, 199020299, 229200228, 256847353, 279627226, 295178182, 301683816, 298898270, 287250373, 268051919, 243713130, 216499371, 189055673, 163290873, 140513243, 120858180, 104949085, 92137411, 81944357, 73980700, 67567094, 62196019, 57620282, 53716607, 50279870, 47217852, 44400840, 41808508, 39649065, 37661829, 36161828, 34603127, 32922557, 31311568, 30154834, 29093403, 27957250, 26834414, 25838768, 24737166, 23704675, 22860686, 22081983, 21267495, 20680780, 19989795, 19574415, 19016868, 18436487, 17968075, 17385032, 16690258, 16256177, 15749840, 15389151, 14926894, 14445156, 14124152, 13755130, 13489549]
14631A3489549j70212l06557m93942l67006j79993l08393l13209l09483m54495
14622A0586259k47153m48683l24075k69840j14811r8116l86446k12752k5551n1011
14612H407821k3901k17723m90449k43281p7327j56297j29793j79571q4990j58933
14602F645556j42776r683j35671j38418k64036j64594o3650j38219j57073J0509
14592E441945O9369J09347j88835k51052q0764r9114j23322l7682j98203L9005
14582D680694N4986j35756k0124M8063j50612k33473j02559n5255O0654j38308
14572D008310j57533L6485O0748J79319L54608J60901N9718J8769J11747J1766
14562D844838L9739K84648J91785J13270K0149J10275K8986N6356k25355m30148
$$ y = [13489549, 13319337, 13012780, 12518838, 12151832, 11971839, 11663446, 11350237, 11040754, 10586259, 10339106, 9890423, 9566348, 9296508, 9181697, 9083581, 8697135, 8484383, 8458832, 8407821, 8383920, 8166197, 7675748, 7432467, 7355140, 7198843, 7069050, 6889479, 6804489, 6645556, 6502780, 6493097, 6357426, 6219008, 5954972, 5790378, 5726728, 5588509, 5431436, 5441945, 5511314, 5620661, 5431826, 5180774, 5100010, 5000896, 4877574, 4839892, 4641689, 4680694, 4735680, 4599924, 4579800, 4627863, 4477251, 4243778, 4141219, 4085964, 4146618, 4008310, 3850777, 3887262, 3948010, 4127329, 4481937, 4642838, 4702556, 4721325, 4833072, 4844838, 4884577, 5169225, 5361010, 5474280, 5494429, 5604704, 5633690, 5690046, 5464691, 5034543]
14552E034543k36451k88375k25000l08052m19320k35720n7205r2767j96007k78589
14542B697057j32295J24321Q9757n7520j87576m9345Q2860q2776l6552p1719j29251
14531B246961k3992j95266j54502O5259J37647j11778k62311j0852J92949p4588
14521A809527p9651P4476J45838M508k01641j75159N5418R7077k4293j98536q9694
14510A417870N170j49059L3202L0227p3043n759j07956o7954J15239N183q4217
14499A118903n9708l1084j2038m9300n6863P7490J4826l0468K5423J239o4689
14488I33731j9599O0999j34945n0706l579J09068J22207n9353j52677J24090J2791
14477I42027J7429j38568N8077K5930q5858J81142N7441k9393Q5938K063j35360
$$ y = [5034543, 4798092, 4509717, 4284717, 3976665, 3557345, 3321625, 3264420, 3171653, 2975646, 2697057, 2564762, 2689083, 2778840, 2721320, 2533744, 2484399, 2567259, 2484483, 2447931, 2376212, 2246961, 2222969, 2027703, 1873201, 1938460, 2076107, 1964329, 1702018, 1691166, 1884115, 1809527, 1729876, 1804352, 1950190, 1954698, 1753057, 1577898, 1633316, 1730393, 1706100, 1507564, 1417870, 1423040, 1273981, 1307183, 1337410, 1264367, 1258608, 1150652, 1082698, 1197937, 1203120, 1118903, 1059195, 1028111, 1016073, 966773, 909910, 987400, 1002226, 971758, 997181, 998420, 933731, 914132, 975131, 840186, 789480, 785901, 894969, 1017176, 957823, 805146, 929236, 942027, 959456, 820888, 878965, 904895, 819037, 1000179, 1057620, 1028227, 1114165, 1116228, 980868]
14466I80868j21531J11019j69073l4843J2793O5068K9399j05994p0058o9565K05712
14455H33795L2422J7146j06878l16864n2963K06148N9040k8391N8847r4736o0883
14444E46683p8184m2580N9551O5890K351o167J2577j12854L2550M7498m2220J32459
14432F17554j4536N1164j25611r1281K4253K7959j72080K2290m9193j6951l0690
14421B42878p3098l297J32032J94334m663M6810q537m1228O9468L6462j02063
14410D89098j19578Q0461o8755j37552L6134O077L2261Q0967P1795r2791k1758
14399C56359q5507p9008L8027m080m4065l0923J98292J46759r1471r3961r3181
14388B17241n3466m459K46856m2415j76324n5719M6878J41414J39534o7113j07964
$$ y = [980868, 859337, 970356, 801283, 766440, 779233, 844301, 873700, 767706, 697648, 628083, 833795, 866217, 883363, 776485, 459621, 406658, 612806, 671846, 643455, 702302, 607566, 546683, 468499, 425919, 485470, 551360, 553711, 547544, 560121, 447267, 479817, 527315, 485095, 617554, 603018, 654182, 528571, 437290, 461543, 489502, 317422, 339712, 290519, 273568, 242878, 169780, 166483, 298515, 492849, 488186, 534996, 526459, 485231, 554699, 591161, 489098, 369520, 449981, 381226, 243674, 279808, 285885, 318146, 399113, 470908, 378117, 356359, 270852, 191844, 229871, 225791, 181726, 150803, 349095, 495854, 404383, 310422, 217241, 163775, 159316, 406172, 363757, 187433, 131714, 178592, 320006, 459540, 392427, 284463]
14377B84463j01754J6287J7852l2163Q5233q1355L988j3233j02404j775Q167J0712
$$ y = [284463, 182709, 198996, 216848, 184685, 269918, 188563, 192551, 179318, 76914, 75139, 83306, 94018]
$$ [...]
##END NTUPLES=NMR SPECTRUM
##END=
