##TITLE=Analysis number 315671
Compound Code ac 35894
Project Code adrs
Chemist Name ryscor
##JCAMPDX= 6.0         $$ Bruker NMR JCAMP-DX V2.0
##DATA TYPE= NMR SPECTRUM
##DATA CLASS= NTUPLES
##ORIGIN= Bruker BioSpin GmbH
##OWNER= NMR
$$ XWIN-NMR		Version 3.5
$$ Tue Nov 29 08:44:20 2005 GMT Standard Time (UT+0h)  MAYBRIDGE\NMR@NMR_250MHZ
##.OBSERVE FREQUENCY= 250.131544655141
##.OBSERVE NUCLEUS= ^1H
##.ACQUISITION MODE= SIMULTANEOUS (DQD)
##.ACQUISITION SCHEME= undefined
##.AVERAGES= 16
##.DIGITISER RES= 18
##SPECTROMETER/DATA SYSTEM= dpx250
##.PULSE SEQUENCE= zg30
##.SOLVENT NAME= DMSO
##.SHIFT REFERENCE= (INTERNAL, DMSO, 0, 16.522)
##AUDIT TRAIL= $$ (NUMBER, WHEN, WHO, WHERE, WHAT)
$$ ##TITLE= Audit trail, XWIN-NMR		Version 3.5
$$ ##JCAMPDX= 5.01
$$ ##ORIGIN= Bruker BioSpin GmbH
$$ ##OWNER= NMR
$$ C:\u/data/dgb/nmr/ADRS/13120/pdata/1/auditp.txt
$$ ##AUDIT TRAIL=  $$ (NUMBER, WHEN, WHO, WHERE, WHAT)
(   1,<2005-11-29 08:43:28.76 +000>,<MAYBRIDGE\NMR>,<NMR_250MHZ>,
      <created by zg, POWCHK disabled, PULCHK disabled
       configuration hash MD5:
       62 19 C7 07 E1 42 D1 B7 37 6C 3D D0 77 39 F9 E6
       data hash MD5: 64K
       9A C4 4B 51 86 FF 6D 13 D5 BB A2 BE 1E CC 98 87>)
(   2,<2005-11-29 08:43:56.09 +000>,<MAYBRIDGE\NMR>,<NMR_250MHZ>,
      <Start of raw data processing
       ef LB = 0.3 FT_mod = 6 PKNL = 1 SI = 32K 
       data hash MD5: 32K
       CA C8 AF 24 4B EF EF 68 11 18 CD 42 91 D1 78 1B>)
(   3,<2005-11-29 08:43:59.64 +000>,<MAYBRIDGE\NMR>,<NMR_250MHZ>,
      <apk 
       data hash MD5: 32K
       52 55 17 6A 88 0D 32 26 B6 24 96 B8 2F 2E 5F 1C>)
(   4,<2005-11-29 08:44:01.87 +000>,<MAYBRIDGE\NMR>,<NMR_250MHZ>,
      <abs ABSG = 5 
       data hash MD5: 32K
       5E 1B 65 C3 21 63 ED D2 43 ED 24 CA C2 3A 65 2A>)
$$ ##END=
$$ 
$$ hash MD5
$$ 35 61 5B E8 BF FF 2F E1 E7 DE 5C B5 57 01 62 F9
##$RELAX= 
##$RELAX= 
##$RELAX= 
##$RELAX= 
##$RELAX= 
##$RELAX= 
##$RELAX= 
$$ Bruker specific parameters
$$ --------------------------
##$DU= <C:\u>
##$EXPNO= 13120
##$NAME= <ADRS>
##$PROCNO= 1
##$TYPE= <nmr>
##$USER= <dgb>
##$AMP= (0..31)
100 100 100 100 100 100 100 100 100 100 100 100 100 100 100 100 100 100 
100 100 100 100 100 100 100 100 100 100 100 100 100 100 
##$AQSEQ= 0
##$AQ_mod= 3
##$AUNM= <au_zg>
##$AUTOPOS= <34 >
##$BF1= 250.13
##$BF2= 250.13
##$BF3= 250.13
##$BF4= 250.13
##$BF5= 500.13
##$BF6= 500.13
##$BF7= 500.13
##$BF8= 500.13
##$BYTORDA= 1
##$CFDGTYP= 0
##$CFRGTYP= 5
##$CHEMSTR= <none>
##$CNST= (0..31)
1 1 145 1 1 1 1 1 1 1 1 1 1 1 1 1 1 1 1 1 1 1 1 1 1 1 1 1 1 1 1 1 
##$CPDPRG= <>
##$CPDPRG1= <>
##$CPDPRG2= <>
##$CPDPRG3= <>
##$CPDPRG4= <mlev>
##$CPDPRG5= <mlev>
##$CPDPRG6= <mlev>
##$CPDPRG7= <mlev>
##$CPDPRG8= <mlev>
##$CPDPRGB= <>
##$CPDPRGT= <>
##$D= (0..31)
0 1 0 0 0 0 0 0 0 0.06 0 0 0 0 0 0 0.0002 0 0 0 0 0 0 0 0 0 0 0 0 0 0 
0 
##$DATE= 1133253806
##$DBL= (0..7)
120 120 120 120 120 120 120 120 
##$DBP= (0..7)
150 150 150 150 150 150 150 150 
##$DBP07= 0
##$DBPNAM0= <>
##$DBPNAM1= <>
##$DBPNAM2= <>
$$ [...]
##$SUBNAM7= <"">
##$SUBNAM8= <"">
##$SUBNAM9= <"">
##$SW= 20.6930455092707
##$SWIBOX= (0..15)
0 0 3 0 0 0 0 0 0 0 0 0 0 0 0 0 
##$SW_h= 5175.983436853
##$TD= 65536
##$TD0= 1
##$TE= 294.16
##$TE2= 300
##$TE3= 300
##$TEG= 300
##$TL= (0..7)
0 120 120 120 120 120 120 120 
##$TP= (0..7)
150 150 150 150 150 150 150 150 
##$TP07= 0
##$TPNAME0= <>
##$TPNAME1= <>
##$TPNAME2= <>
##$TPNAME3= <>
##$TPNAME4= <>
##$TPNAME5= <>
##$TPNAME6= <>
##$TPNAME7= <>
##$TPOAL= (0..7)
0.5 0.5 0.5 0.5 0.5 0.5 0.5 0.5 
##$TPOFFS= (0..7)
0 0 0 0 0 0 0 0 
##$TUNHIN= 0
##$TUNHOUT= 0
##$TUNXOUT= 0
##$USERA1= <user>
##$USERA2= <user>
##$USERA3= <user>
##$USERA4= <user>
##$USERA5= <user>
##$V9= 5
##$VALIST= <valist>
##$VCLIST= <CCCCCCCCCCCCCCC>
##$VD= 0
##$VDLIST= <DDDDDDDDDDDDDDD>
##$VPLIST= <PPPPPPPPPPPPPPP>
##$VTLIST= <TTTTTTTTTTTTTTT>
##$WBST= 1024
##$WBSW= 4
##$XGAIN= (0..3)
0 0 0 0 
##$XL= 0
##$YL= 0
##$YMAX_a= 567082
##$YMIN_a= -441835
##$ZGOPTNS= <>
##$ZL1= 120
##$ZL2= 120
##$ZL3= 120
##$ZL4= 120
##$ABSF1= 16.522
##$ABSF2= -4.171173
##$ABSG= 5
##$ABSL= 3
##$ALPHA= 0
##$AQORDER= 0
##$ASSFAC= 0
##$ASSFACI= 0
##$ASSFACX= 0
##$ASSWID= 0
##$AUNMP= <proc_1d>
##$AZFE= 0.1
##$AZFW= 0.1
##$BCFW= 0
##$BC_mod= 0
##$BYTORDP= 0
##$COROFFS= 0
##$CY= 12.5
##$DATMOD= 1
##$DC= 0
##$DFILT= <>
##$DTYPP= 0
##$F1P= 14.0000005364418
##$F2P= -0.99999901652339
##$FCOR= 0.5
##$FTSIZE= 32768
##$FT_mod= 6
##$GAMMA= 0
##$GB= 0
##$INTBC= 1
##$INTSCL= 1
##$ISEN= 128
##$LB= 0.3
##$LEV0= 0
##$LPBIN= 0
##$MAXI= 10000
##$MC2= 0
##$MEAN= 0
##$ME_mod= 0
##$MI= 0
##$NCOEF= 0
##$NC_proc= -5
##$NLEV= 6
##$NOISF1= 0
##$NOISF2= 0
##$NSP= 0
##$NTH_PI= 0
##$NZP= 0
##$OFFSET= 16.522
##$PC= 1
##$PHC0= 68.65467
##$PHC1= 17.59411
##$PH_mod= 1
##$PKNL= yes
##$PPARMOD= 0
##$PSCAL= 4
##$PSIGN= 0
##$REVERSE= no
##$SF= 250.13
##$SI= 32768
##$SIGF1= 0
##$SIGF2= 0
##$SINO= 400
##$SIOLD= 32768
##$SREGLST= <1H.DMSO>
##$SSB= 0
##$STSI= 32768
##$STSR= 0
##$SW_p= 5175.98343685301
##$SYMM= 0
##$S_DEV= 0
##$TDeff= 65536
##$TDoff= 0
##$TI= <Analysis number 999999
Compound Code 99
Book Reference 9
Project Code 9>
##$TILT= no
##$TM1= 0
##$TM2= 0
##$TOPLEV= 0
##$USERP1= <user>
##$USERP2= <user>
##$USERP3= <user>
##$USERP4= <user>
##$USERP5= <user>
##$WDW= 1
##$XDIM= 32768
##$YMAX_p= 381986194
##$YMIN_p= -730298
$$ End of Bruker specific parameters
$$ ---------------------------------
##NTUPLES= NMR SPECTRUM
##VAR_NAME=  FREQUENCY,     SPECTRUM/REAL,   SPECTRUM/IMAG
##SYMBOL=    X,             R,               I
##VAR_TYPE=  INDEPENDENT,   DEPENDENT,       DEPENDENT
##VAR_FORM=  AFFN,          ASDF,            ASDF
##VAR_DIM=   32768,         32768,           32768
##UNITS=     HZ,            ARBITRARY UNITS, ARBITRARY UNITS
##FACTOR=    0.157963299565203, 1,           1
##FIRST=     4132.6476996994, 0,             0
##LAST=      -1043.33573715361, 0,           0
##MIN=       -1043.33573715361, -730298,     0
##MAX=       4132.6476996994, 381986194,     0
$$ Real data points
##PAGE= N=1
##DATA TABLE= (X++(R..R)), XYDATA
$$ [...]
23222a3515P3376k8611K4088q2310P5374R4860o2708m4331M7053K398o8656r6253
$$ -13515 59861 31250 55338 -26972 48402 143262 80554 36223 83276 85674 17018 -79235
23210g9235r0707L0502M0071M4011m1372K0929P2583N2471J70475K8358j24365
$$ -79235 -169942 -139440 -99369 -55358 -96730 -75801 -3218 49253 219728 248086 123721
23199A23721m8639l3266q6104m4993K2420n4024j830J06053N3243j68o7090R3758
$$ 123721 75082 41816 -44288 -89281 -66861 -120885 -122715 -16662 36581 36413 -30677 63081
23187F3081O8051L5730j31141n8713M8936p8930j26100K6344K15160J05695P1508
$$ 63081 131132 166862 35721 -22992 25944 -52986 -179086 -152742 62418 168113 239621
23176B39621j03109l9881L7443N042j19624p2372k6998N8255L7587q3984k8614
$$ 239621 136512 96631 134074 139116 19492 -52880 -79878 -21623 15964 -68020 -96634
23165i6634Q6818L8195L1647m3550q6764l6877K1247O6844N172j0612k4806j879
$$ -96634 -9816 28379 60026 16476 -70288 -107165 -85918 -19074 -13902 -24514 -49320 -51199
23153e1199P5203J21323N0611r0822j22049o9259J09723n4964o3576q2964k8346
$$ -51199 24004 145327 195938 105116 -16933 -86192 23531 -31433 -95009 -177973 -206319
23142b06319J78918k5567O829L9897N9809L6897j41129r2248N7659j5740O1712
$$ -206319 -27401 -52968 -46139 -6242 53567 90464 -50665 -142913 -85254 -100994 -39282
23131c9282j8510n9271J2988p991K2051J02482N1231p4268j03773o1265O3381
$$ -39282 -57792 -117063 -104075 -112066 -90015 12467 63698 -10570 -114343 -175608 -112227
23120a12227n1031k7219L5365R4726L0528Q121j6716L9913J3466J4344j2178l5156
$$ -112227 -163258 -190477 -155112 -60386 -29858 -21737 -38453 1460 14926 29270 17092 -18064
23108a8064J9014J5180q0349K5258K289K3405n3727N4441N2827p6040l5032k576
$$ -18064 950 16130 -64219 -38961 -36672 -13267 -66994 -12553 40274 -35766 -70798 -73374
23096g3374Q8245M5106J7000j49453j90732n0819P2536J18686O1227k5716n7053
$$ -73374 14871 59977 76977 -72476 -263208 -314027 -241491 -122805 -61578 -87294 -144347
23085a44347k1245Q8585j02142m2849J27541R697P694m3837k1314L4475J44969
$$ -144347 -165592 -77007 -179149 -221998 -94457 -84760 -77066 -120903 -142217 -107742 37227
23074C7227R352k8555j9160P4522L0412R130p1765o7555L5892R2919o9478m2456
$$ 37227 46579 18024 -1136 73386 103798 112928 41163 -26392 9500 102419 32941 -9515
23062i515l3918R6999R3374k3263j30283J1418o0032j9803p843K3750L872j7842
$$ -9515 -43433 53566 146940 123677 -6606 4812 -55220 -75023 -82866 -59116 -55244 -73086
23050g3086P735J9624n6068J27713j9357q389n1129k8988k2053K7152N6247J7392
$$ -73086 -65351 -45727 -101795 25918 6561 -1828 -52957 -81945 -103998 -76846 -20599 -3207
23038c207P3060k8570l1923l5769q5186o0896L7012o098Q2940N0288m1329j00688
$$ -3207 69853 41283 9360 -26409 -111595 -172491 -135479 -141577 -58637 -8349 -49678 -150366
23026a50366o2280P1552K994O8913L2107M0904L1204L0924J6984P0239j84109
$$ -150366 -212646 -141094 -138100 -69187 -37080 3824 35028 65952 82936 153175 -30934
23015c0934q1732P8592O1232m9178m1905m8012J2556M9493Q9995N6955N2607N7821
$$ -30934 -112666 -34074 27158 -22020 -63925 -111937 -99381 -49888 40107 97062 149669 207490
23003B07490r9028q0507l4642n4301J1291l3060l3887l4238N382r017j270k4107
$$ 207490 108462 27955 -6687 -60988 -49697 -82757 -116644 -150882 -145500 -154517 -155787 -179894
22991a79894L9617N4414J14533J32359p6405k46705j44087J0926J64078L5917
$$ -179894 -140277 -85863 28670 161029 84624 -162081 -306168 -295242 -131164 -95247
22981i5247j03361N159k5486L4533N3067J04113k9321J26296r673j02942M7416
$$ -95247 -198608 -193449 -218935 -184402 -131335 -27222 -56543 69753 60080 -42862 4554
22970D554R1992q5811k2341p0902k306K1161K078j5117j03618M0882P4153J1485
$$ 4554 96546 10735 -11606 -82508 -84814 -63653 -61575 -76692 -180310 -139428 -65275 -53790
22958e3790L7310j32547m0101J8939J59341P2680k4050j23983j42001p366R0858
$$ -53790 -16480 -149027 -189128 -170189 -10848 61832 37782 -86201 -228202 -235568 -144710
22947a44710K8505N7966M5200n7238J2594P2536m0049O1217m0707k9014M825o3119
$$ -144710 -116205 -58239 -13039 -70277 -57683 14853 -25196 36021 -4686 -33700 -28875 -91994
22935i1994P5277R011j4786K3115M0230J149j04252q2062Q4180P6394m5246P1786
$$ -91994 -16717 -7706 -22492 623 40853 42002 -62250 -144312 -60132 16262 -28984 42802
22923D2802N6567k9511l0095n1406P1398J3905l8012n9562j2225N4876K1373j1099
$$ 42802 99369 69858 39763 -11643 59755 73660 35648 -23914 -36139 18737 40110 29011
22911B9011l6523J1854j7277N692J04704r4275j35821L2291l8502O0755J221m759
$$ 29011 -7512 4342 -12935 -7243 97461 3186 -132635 -100344 -138846 -78091 -76870 -81629
22899h1629J27211K6135j11357k1670m3126L6444L2006J16685O9709q6039k2828
$$ -81629 45582 71717 -39640 -61310 -104436 -67992 -35986 80699 150408 64369 41541
22888D1541k9994J01723J2064l8678l6408M5210k8552p5270j75659j7427J14827
$$ 41541 11547 113270 125334 86656 50248 95458 66906 -8364 -184023 -201450 -86623
22877h6623J37802n4966o8961R063J2470r335K7835J48324p2890j32862J04869
$$ -86623 51179 -3787 -72748 -63685 -51215 -60550 -32715 115609 42719 -90143 14726
22866A4726M3194N5937m8031o3657N716p140q9419j5697m9459M3116P1988K9710
$$ 14726 57920 113857 65826 2169 7885 745 -88674 -104371 -153830 -110714 -38726 -9016
22854i016p1120L4422J2560J4828M2776J1371R8898M9562r9912p3801O175M0906
$$ -9016 -80136 -45714 -33154 -18326 24450 35821 134719 184281 84369 10568 16743 57649
22842E7649j3154r573r2707l6594p46k2326q9057P1348J6404N9716M5261j4616
$$ 57649 44495 34922 -57785 -94379 -95125 -117451 -206508 -135160 -118756 -59040 -13779 -28395
22830b8395o7420j14249J519J4145o4959J1183Q9071M6368o9624j3754J4755J40381
$$ -28395 -95815 -210064 -208545 -194400 -259359 -248176 -159105 -112737 -182361 -196115 -181360 -40979
22818d0979p6684q2243j070J45739L749m4150l1829Q1896j4995j27523M1188N0079
$$ -40979 -117663 -199906 -200976 -55237 -51488 -95638 -127467 -45571 -60566 -188089 -146901 -96822
22806i6822L8328J7163l2543m3898l7432m614L6321m0436J4315J66700N8414k6975
$$ -96822 -58494 -41331 -73874 -117772 -155204 -159818 -123497 -163933 -149618 17082 75496 48521
22794D8521J6399M5230J8315J5565m2805L141j45626m4749k7426o0523k9813M8792
$$ 48521 64920 110150 128465 144030 101225 104366 -41260 -86009 -113435 -173958 -203771 -154979
22782a54979J43525L9509O354l5564M9423p8584M3583j7205n6035j06592r8873
$$ -154979 -11454 28055 34409 -1155 48268 -30316 13267 -3938 -59973 -166565 -265438
22771b65438K493O7619P4841n8963L2752r143J9457Q2213J4450J08159L8897N9822
$$ -265438 -262945 -195326 -120485 -179448 -146696 -155839 -136382 -54169 -39719 68440 107337 167159
22759A67159N4672n918o5986j68399Q208J37588O457j08484p4654J21672O863
$$ 167159 221831 215913 149927 -18472 -10264 127324 133781 25297 -49357 72315 79178
22748G9178J7293K2296N98j41266m737O4845L2918n211K3252o0139p1008J911
$$ 79178 96471 118767 119365 -21901 -26638 38207 71125 65914 89166 29027 -41981 -40070
22736d0070K2000p0869L8918p8575o1668J16012Q7844N269l5254k6105M068m9960
$$ -40070 -18070 -88939 -50021 -128596 -190264 -74252 13592 18861 -16393 -42498 -38430 -88390
22724h8390m2189m1738q5229r3962L6439J23589J24882o5538M6107M2499K5396
$$ -88390 -130579 -172317 -257546 -351508 -315069 -191480 -66598 -132136 -86029 -43530 -18134
22713a8134M5989N7099M3800j0262n3972j03649J05090r717m710P1110O8159M0133
$$ -18134 27855 84954 128754 118492 64520 -39129 65961 56244 51534 122644 190803 230936
22701B30936k7937o4164j04251j49021L4706J98088L572O7155K4794j92736m8865
$$ 230936 202999 138835 34584 -114437 -79731 118357 121929 189084 213878 21142 -27723
22690b7723K3314P6763K9355M4436J02028j25765n8675N6670j33438n1502p9910
$$ -27723 -4409 72354 101709 146145 248173 122408 63733 120403 -13035 -64537 -144447
22679a44447K4233m4904o1315k7260M495L1768O4241J38260K07269K6455q5241
$$ -144447 -120214 -165118 -226433 -253693 -249198 -217430 -153189 -14929 192340 218795 133554
22668A33554j26783n1M9386M3580J227O0430L0537J681n9031p1671j01525m9665
$$ 133554 6771 6720 56106 99686 100913 161343 191880 193561 134530 62859 -38666 -88331
22656h8331N3255L8426L8446K7348L2333Q2445l4942o1877K3645O149p3278o3914
$$ -88331 -35076 3350 41796 69144 101477 183922 148980 87103 110748 116897 43619 -20295
22644b0295k9794k6298q1509K4408N1258j3769k1134m7159o6651J4005R722J78819
$$ -20295 -50089 -76387 -157896 -133488 -82230 -95999 -117133 -164292 -230943 -216938 -207216 -28397
22632b8397o6155j06043p400J24130J1420J5785o0254J07395J693M0042n3280
$$ -28397 -94552 -200595 -207995 -83865 -72445 -56660 -116914 -9519 -7826 32216 -21064
22621b1064j07909j80293R9405K45499M3780Q228k3547j8311m6774J43210R7578
$$ -21064 -128973 -309266 -209861 35638 79418 87646 64099 45788 -986 142224 239802
22610B39802j9668L1250r7176r8652k9691o2895m3520O6541P112L2209L2500j3858
$$ 239802 220134 251384 154208 55556 25865 -37030 -80550 -14009 -6897 25312 57812 43954
22598D3954p1764n4301P0585J7690p6077j9626L6822R509J9234J72827N4138n2809
$$ 43954 -27810 -82111 -11526 6164 -69913 -89539 -52717 -43208 -23974 148853 202991 150182
22586A50182l1198M5468l0104o6757j03960L1936K3505K24439j914j14627K9611
$$ 150182 118984 164452 134348 67591 -36369 -4433 19072 243511 241597 126970 156581
22575A56581l4933q6465R3740K5158m2684m5160M0454l8198k7395j08384l5905
$$ 156581 121648 35183 128923 154081 111397 66237 106691 68493 41098 -67286 -103191
22564a03191Q4895J38775n9861r2301R3355P2264p2296K2225j48927j27114L1263
$$ -103191 -18296 120479 60618 -31683 61672 133936 61640 83865 -65062 -192176 -160913
22553a60913j6113R6656L1752p5057L733M8317n3928o9239Q7683J50310J15519
$$ -160913 -177026 -80370 -48618 -123675 -119942 -71625 -125553 -194792 -107109 43201 158720
22542A58720l7287p3406j18674Q0197k829l005k7778k8622J62411n9555j09788
$$ 158720 121433 48027 -70647 9550 6721 3716 -24062 -52684 109727 50172 -59616
22531e9616j09258O1800K7070m666M1775R467L4878j9497o8140q043O2446Q3069
$$ -59616 -168874 -107074 -80004 -84670 -42895 -33428 1450 -18047 -86187 -94230 -31784 51285
22519E1285l0431n153o493j8182m2490J1121q4255p0213J22284K33747r563j27646
$$ 51285 20854 15701 9208 -8974 -51464 -40343 -124598 -194811 -72527 161220 151657 24011
22507B4011Q7313J57940r3205j30596l3724k210O0843n4267j1394m5778J5027
$$ 24011 111324 269264 176059 45463 11739 9529 70372 16105 4711 -41067 -26040
22496b6040P6811q5905q2663m9791j8326Q3500J04911j1255K0355P2698k6866
$$ -26040 50771 -35134 -117797 -167588 -185914 -102414 2497 -8758 11597 84295 57429
22485E7429J5945p453l0770l6721q1955q726P7007k1404j9786M8380N4818R136
$$ 57429 73374 65921 35151 -1570 -83525 -92251 -15244 -36648 -56434 -8054 46764 55900
22473E5900n9877J2089J27890Q4110l6289j33995k04012K9574k9339M5927Q0344
$$ 55900 -3977 8112 136002 220112 183823 49828 -154184 -124610 -153949 -108022 -27678
22462b7678N1727K6540n2337q92r8725j2139J45590M3131j88687p7495J60462
$$ -27678 24049 50589 -1748 -2640 -101365 -113504 32086 75217 -113470 -190965 -30503
22451c0503O8699J1851n6751n1287N0878M359j6004N5430P8709P186K2176n5734
$$ -30503 38196 50047 -6704 -57991 -7113 -2754 -18758 36672 115381 122567 144743 89009
22439H9009M2404k5074r7091M3195L395N980P4757p5504l6286J80886Q107j11230
$$ 89009 131413 106339 9248 52443 55838 61818 136575 61071 24785 205671 213778 102548
22427A02548j17419N5159k2229l9152j7346J0799N9914k4377j18157m2994J8222
$$ 102548 -14871 40288 18059 -21093 -38439 -27640 32274 7897 -110260 -153254 -135032
22416a35032R1905j7321o7136N5284P0998j0033p9639M3019l878O8750Q0978p489
$$ -135032 -43127 -60448 -127584 -72300 -1302 -11335 -90974 -47955 -51833 16917 97895 90406
22404I0406j06719k4698M6693J20843j9972m1740Q015J02886p4852o7698l5593
$$ 90406 -16313 -41011 5682 126525 106553 64813 72828 175714 100862 33164 -2429
22393b429L906M7587q5525o9937r7107m9593R7163R3939n258O8175L1823m5948
$$ -2429 1477 49064 -36461 -106398 -203505 -253098 -155935 -61996 -67254 921 32744 -13204
22381a3204n253m9771l5133o8468J9741M4066r897n9423R4281o1343k621M5711
$$ -13204 -18457 -68228 -103361 -171829 -152088 -108022 -117919 -177342 -83061 -144404 -147025 -101314
22369a01314N1704M4933J9893Q2206p0816p1960J13748J05028l6531p4433j24946
$$ -101314 -49610 -4677 15216 97422 26606 -45354 68394 173422 136891 62458 -62488
22358f2488p2692J07075L8311L6170R234Q3647j34426k4133K171J9454J55153
$$ -62488 -135180 -28105 10206 46376 55610 139257 4831 -19302 -17131 2323 157476
22347A57476l2567n4335J3498l6527o0478j83232J02955P9002Q2343l3662j5918
$$ 157476 124909 70574 84072 47545 -12933 -196165 -93210 -14208 68135 34473 18555
22336A8555J1946j32216j22618m0306J383L4524J71445K7321K757n9223p9569
$$ 18555 30501 -101715 -224333 -264639 -263256 -228732 -57287 -29966 -27209 -86432 -166001
22325a66001k024R7960Q1349q1740p7450J6426J192n2900O7283J81667J18703
$$ -166001 -168025 -70065 11284 -70456 -147906 -131480 -130288 -183188 -115905 65762 184465
22314A84465q9198r8595m4102Q1664L901q3931K3858l824P9642J28432p7356k7887
$$ 184465 95267 -3328 -47430 34234 38135 -45796 -21938 -25762 53880 182312 104956 77069
22302G7069q6555m1944J0168O2384m6455L5274P0005n1029p5805J0371R398Q6642
$$ 77069 -9486 -51430 -41262 21122 -25333 9941 79946 28917 -46888 -36517 -27119 59523
22290E9523O6445m7181j8559M1072L4138n5716n7294l047j271R3221r73q5583
$$ 59523 125968 78787 60228 101300 135438 79722 22428 19381 18110 111331 110358 24775
22278B4775Q720j136q2324q9558j46913Q2899Q3050R7011J16221q57N7011p142
$$ 24775 33495 32359 -49965 -139523 -286436 -203537 -120487 -23476 92745 91888 148899 141757
22266A41757q9997o3648J1925Q4503o7977k6698P97p6459M1721Q9671j4296k8131
$$ 141757 51760 -11888 37 84540 16563 -10135 -9338 -85797 -44076 45595 31299 3168
22254C168m8661J20823M5514k4394m5371m5945J0668j25972O3107N5984P544Q935
$$ 3168 -45493 75330 120844 96450 51079 5134 15802 -110170 -47063 8921 16465 25400
22242B5400m4748J15867J52240O0038j09557m3598o442R473R7003O1677j73591
$$ 25400 -19348 96519 248759 308797 199240 155642 149200 158673 255676 317353 143762
22231A43762p956O9640j14777j29296q5481L4056J49176R6295q8869J8893R399
$$ 143762 135806 205446 90669 -38627 -124108 -90052 59124 155419 66550 85443 94842
22220I4842m1331m3055j3303o5070P5461P7597j6927k419p2077k738N7963J49913
$$ 94842 53511 10456 -2847 -67917 7544 85141 68214 65795 -6282 -9020 48943 198856
22208A98856j8699j52684Q950K9007m2669j36663P0006O5981o2182j7442p7679
$$ 198856 180157 27473 36423 65430 22761 -113902 -43896 22085 -40097 -57539 -135218
22197a35218O0968j6710n317l0909n5526R5543J27616L3674j51555K1413O6306
$$ -135218 -74250 -90960 -96277 -127186 -182712 -87169 40447 74121 -77434 -56021 10285
22186A0285p26n0971k9062J2450M7140n977K2201J97141r8730k56299P0791J52708
$$ 10285 9559 -41412 -70474 -58024 -10884 -16861 5340 202481 103751 -152548 -81757 70951
22174G0951n6481O5340O8228j48369k5868N3922J9325j7541O5961P5610o9255
$$ 70951 14470 79810 148038 -331 -26199 27723 47048 29507 95468 171078 101823
22163A01823n0637k4514k3803J4073O8098k3855p1453O0546N8383j53039j17811
$$ 101823 51186 26672 2869 16942 85040 61185 -10268 50278 108661 -44378 -162189
22152a62189n4355o4362j4265Q3453J52840O4519K8330m4718j1279m1810p6247
$$ -162189 -216544 -280906 -295171 -211718 -58878 5641 33971 -10747 -22026 -63836 -140083
22141a40083o8142L3479n1596l1806P2196K0036P3497O0978K4550l5176M6409
$$ -140083 -208225 -174746 -226342 -258148 -185952 -165916 -92419 -31441 -6891 -42067 4342
22130D342P5688K5848q00K37k3951r261p482r065o25n0350q5547n1680L2582N7412
$$ 4342 80030 105878 105078 105315 81364 72103 64621 55556 54931 4581 -80966 -132646 -100064 -42652
22116d2652J83013J2268m2078M4190N7881q7571j14511l7111K5730O2544j09622
$$ -42652 140361 152629 110551 154741 212622 125051 10540 -26571 -841 61703 -47919
22105d7919l9236O5643O9068o1136M3274L4258m3844k5818N4770r5814O9072J16322
$$ -47919 -87155 -21512 47556 -13580 29694 63952 20108 -5710 49060 -46754 22318 138640
22093A38640J5446o9411r9696m2696N4131J3883L1427l8950m4065N0611o3985
$$ 138640 154086 84675 -15021 -57717 -3586 10297 41724 2774 -41291 9320 -54665
22082e4665m6415r9203O3184Q2299Q132j2461L9601j4864M3160L8709K0865j9358
$$ -54665 -101080 -200283 -137099 -54800 -46668 -59129 -19528 -34392 8768 47477 68342 48984
22070D8984k1397k7684r6966r4239J873R7948P8985o9405m3741J9013m6996m2434
$$ 48984 27587 -97 -97063 -191302 -189429 -91481 -12496 -81901 -125642 -106629 -153625 -196059
22058a96059k4033K582n5508J22874J14117k2170k2060n5884j9630j6136O5841
$$ -196059 -220092 -217510 -273018 -150144 -36027 -58197 -80257 -136141 -155771 -171907 -106066
22047a06066R1662l8492j11937j2877O3007K2247J276Q7970Q1083O9717o0920
$$ -106066 -14404 -52896 -164833 -177710 -114703 -92456 -91180 -3210 77873 147590 86670
22036H6670j17379r8442J6711j8852q8214Q0391J12681p9603k2131O3070N8414
$$ 86670 -30709 -129151 -112440 -131292 -219506 -139115 -26434 -106037 -128168 -65098 -6684
22025f684K2688L091j8383o0570O9793K3551j0399p2131J09659P7427j1614l0276
$$ -6684 16004 19095 712 -59858 9935 33486 23087 -49044 60615 138042 126428 96152
22013I6152M4970P2404k4501j10982j54879k0066P9102J10962L8372n8488J05235
$$ 96152 141122 213526 189025 78043 -76836 -96902 -17800 93162 131534 73046 178281
22002A78281k9310j88497j30454p599o7496Q1810J10863J20837l7408N3672L175
$$ 178281 148971 -39526 -169980 -177579 -245075 -163265 -52402 68435 31027 84699 87874
21991H7874n3542k9597L0527o3985J9752N5364p6659o6721O0726M1629j32766
$$ 87874 34332 4735 35262 -28723 -8971 46393 -30266 -96987 -36261 5368 -127398
21980a27398K4167Q2497j2020o3554l8878m4058J88671J24267K0665M912n9027
$$ -127398 -103231 -20734 -32754 -96308 -135186 -179244 9427 133694 154359 159271 100244
21969A00244m423O557L8324k3421j01120O269R8513k0823j6122j4694L7824R5573
$$ 100244 95821 102378 140702 117281 16161 22430 120943 100120 83998 69304 107128 202701
21957B02701n7887j15099o2837K01346q126k08750l3494J48190O2544o9974q4231
$$ 202701 144814 29715 -33122 168224 160098 -48652 -82146 66044 128588 58614 -25617
21946b5617j25222L3467J27290j3298p9915l0154Q2375Q4991K3300l3224q1842
$$ -25617 -150839 -117372 9918 -3380 -83295 -113449 -31074 53917 77217 43993 -37849
21935c7849J231M5206J1370k3696j1050R6543P7332k9639j17366k7311l2989j5318
$$ -37849 -36618 8588 19958 -3738 -14788 81755 159087 129448 12082 -15229 -48218 -63536
21923f3536k3013O5173N4662r849P2181J6315J5799k2232N152o3864K4128J40758
$$ -63536 -86549 -21376 33286 23437 95618 111933 127732 105500 110652 46788 70916 211674
21911B11674n6696j06025j49762J2702Q9229L2970O9013l3140M5091o9400l1486
$$ 211674 154978 48953 -100809 -88107 1122 34092 103105 69965 115056 45656 14170
21900A4170N8645K5128J838k6557L916J38940j9708O3659m767p8868p3588J81975
$$ 14170 72815 97943 99781 73224 77140 216080 196372 260031 255264 176396 102808 284783
21888B84783l4259n0143j72332j10367l122J9928O6438R0514N1453k4136M8157
$$ 284783 250524 200381 28049 -82318 -85440 -65512 926 91440 142893 118757 166914
21877A66914o495o1912j1708k9498M5614N7594l2392l9008n4717j3132j4355K3455
$$ 166914 160419 98507 86799 57301 102915 160509 128117 89109 34392 21260 6905 30360
21865C0360K7579L1578O6715o7030o0836j7229l7719r7806k8730J34075J57062
$$ 30360 57939 89517 156232 89202 28366 11137 -26582 -124388 -153118 -19043 138019
21854A38019M3047N0325j08138o0230r0444j3205P0307k8888J73625K8743n0116
$$ 138019 181066 231391 123253 63023 -27421 -40626 29681 793 174418 203161 153045
21843A53045l6606O0497l6247M529k3512j10346N6607k9232o4026o2080m8494
$$ 153045 116439 176936 140689 145218 121706 11360 67967 38735 -25291 -87371 -135865
21832a35865j10107J25197J62371Q9333q1454j25630j1440K4438P7049p822l5462
$$ -135865 -245972 -120775 41596 130929 49475 -76155 -87595 -63157 13892 6070 -29392
21821b9392l3355m0662L2108N9805L2270j301j1755p4372n9723K8110N6540O5914
$$ -29392 -62747 -103409 -71301 -11496 20774 19473 7718 -66654 -126377 -98267 -41727 24187
21809B4187n6127q5264J0620R1245r770j3803O913p4766l6345K5320J0043J64191
$$ 24187 -31940 -117204 -106584 -15339 -25109 -38912 -31999 -106765 -143110 -117790 -107747 56444
21797E6444R1042j11618k0455N1521n9619r2355R3596J5534m5793O5867P9257
$$ 56444 147486 35868 15413 66934 7315 -85040 8556 24090 -21703 44164 123421
21786A23421k3955M527K6280K820n9861M339Q541N9112K8930k8770l6348M8376
$$ 123421 99466 103993 130273 133093 73232 77571 86112 145224 174154 145384 109036 157412
21774A57412k7720K4419j06708j31492R0812J61781J6605j50863r727L3660M972
$$ 157412 129692 154111 47403 -84089 6723 168504 185109 34246 24519 58179 63151
21763F3151o9484o175o3602K6471r798l95J10762K6871j67805Q531R7305K9134
$$ 63151 -6333 -12508 -76110 -49639 -59437 -59832 50930 77801 -90004 -81473 15832 44966
21751D4966q5588n3210J3173J1754K9422R962n0033J9046Q5019k6877O5480j23351
$$ 44966 -40622 -93832 -80659 -68905 -39483 -29521 -79554 -60508 24511 -2366 63114 -60237
21739f0237L4906K577l8522N4698J27245J15117j13562q0246n8997j03098M8922
$$ -60237 -25331 -22754 -61276 -6578 120667 235784 122222 41976 -17021 -120119 -71197
21728g1197J27435J461q8938J2514M6511M753j33459M4405N8281N961K5111l8405
$$ -71197 56238 57699 -31239 -18725 27786 32539 -100920 -56515 1766 7727 32838 -5567
21716e567K9628n3632R2827R0628N050o7629k1155L0594r3661J1267k2714r0006
$$ -5567 24061 -29571 63256 153884 158934 91305 70150 100744 7083 18350 -4364 -94370
21704i4370j21560k9033Q7667L1586j2892k7637L4708J51527L6323J031P7177
$$ -94370 -215930 -244963 -157296 -125710 -138602 -166239 -131531 19996 56319 57350 134527
21693A34527k2947q1502K2701O8618j15049j52938j61584P6296J09984o701R2194
$$ 134527 111580 30078 52779 121397 6348 -146590 -308174 -231878 -121894 -128595 -36401
21682c6401R5726K0363m9423J3988l59o4781O352k6182M2176M6506o87L8570L822
$$ -36401 59325 79688 30265 44253 43894 -20887 -14535 -40717 1459 47965 47278 85848 89670
21669H9670q1194K9147J5723L0880J07823r9213M631O4776M876j07669L4336M4049
$$ 89670 8476 37623 53346 84226 192049 92836 97467 162243 167119 59450 93786 137835
21657A37835r4471r3967r019k9713P09J59188K4013q1229J0874K0247P487q733
$$ 137835 43364 -50603 -59622 -89335 -88626 70562 94575 13346 24220 44467 51954 43221
21645D3221l0439n6021L5341l0379L9615Q9933p1163n037k498N1614J13020o2901
$$ 43221 12782 -43239 -7898 -38277 1338 91271 20108 15071 12573 64187 177207 114306
21633A14306j57637M6295J5568M179Q3332m9267o9786l2455N2423Q4043k0334
$$ 114306 -43331 2964 18532 22711 106043 56776 -13010 -45465 6958 91001 70667
21622G0667O2620j9224p4529J12006O6204J2183p3066l6622L584k4528l1807l5441
$$ 70667 133287 114063 39534 151540 217744 229927 156861 120239 123823 99295 67488 32047
21610C2047p7668m8671L1186n4593P1267N7066O7320M2003j9877n7607n5884J8467
$$ 32047 -45621 -94292 -63106 -117699 -46432 10634 77954 119957 100080 42473 -13411 5056
21598E056L6528k701L5337O2390p4293q1212P2673J42732k289j61993n4801J08816
$$ 5056 41584 38883 74220 136610 62317 -18895 53778 196510 194221 32228 -22573 86243
21586H6243N3051O3799r6702q8966N508Q4536J9304j17017l2994R908K1055o7808
$$ 86243 139294 203093 106391 17425 22933 107469 126773 9756 -23238 -13330 7725 -60083
21574f0083j3931J072m024j9368o864J2673N4918J19216p5667P0087o5345j15094
$$ -60083 -74014 -72942 -76966 -96334 -103198 -90525 -35607 83609 7942 78029 12684 -102410
21562a02410j7714O9612P2012R3754J00613j48786j46534N540L5327m4107l3535
$$ -102410 -120124 -50512 21500 115254 215867 67081 -79453 -73913 -38586 -82693 -116228
21551a16228K4975R3985O6575q351m6595J863n3704l4536M1341L741m1202o6355
$$ -116228 -91253 2732 69307 60956 14361 16224 -37480 -72016 -30675 -26934 -68136 -134491
21539a34491J00997J85614l5480J9977j8823m0458N8170J0931r9995j2320L7412
$$ -134491 -33494 152120 116640 136617 117794 77336 135506 146437 46442 34122 71534
21528G1534n4220M6474J01219o1773N0107j5299l6095k3600k1445j5543m4701
$$ 71534 17314 63788 165007 103234 153341 138042 101947 78347 56902 41359 -3342
21517c342n0394J09198J12619L5038k6071j21760j22115M3453Q8443K3274k7520
$$ -3342 -53736 55462 168081 203119 177048 55288 -66827 -23374 65069 88343 60823
21506F0823n0525o4859p0530P164O7754p1007l0696J45708R2074q566n5950O8337
$$ 60823 10298 -54561 -125091 -117927 -50173 -121180 -151876 -6168 85906 77340 21390 89727
21494H9727J3647k714Q1697N882j9222l2639j35951p7639J0371O5870L5214k7401
$$ 89727 103374 100660 182357 188239 169017 136378 427 -77212 -66841 -971 34243 6842
21482F842O9790R2068K8222n4612P3435m8013j99043o3040p6221j1806m6491L4882
$$ 6842 76632 168700 196922 142310 215745 167732 -31311 -94351 -170572 -182378 -228869 -193987
21470a93987O6490P4430J8317L0355J09505K1894Q0787n6106l2622P7012l9821
$$ -193987 -127497 -53067 -34750 -4395 105110 127004 207791 151685 119063 196075 156254
21459A56254j39045q3050m0115j4579J11792J21615J38132j18125q6154M9575
$$ 156254 17209 -65841 -105956 -120535 -8743 112872 251004 132879 46725 96300
21449I6300j223N4901k9838j04320j11842J18228J75837p4843o4148m77n9395
$$ 96300 95077 149978 120140 15820 -96022 22206 198043 123200 59052 58575 -820
21438h20j9516j47871M9198L5148l0260J59832J33150O0194j0592o8044m4509
$$ -820 -20336 -168207 -119009 -83861 -114121 45711 178861 239055 228463 160419 115910
21427A15910q2141L1792N2884j38621N2783L4371L159m0834m5970J13533P7439
$$ 115910 33769 65561 118445 -20176 32607 66978 70137 29303 -16667 96866 174305
21416A74305j1279n5453N936J9779J2981l4363K5740j43303r1563R3126R5142
$$ 174305 163026 107573 113509 133288 146269 111906 137646 -5657 -97220 -4094 91048
21405I1048K3324J48650L795p0119q1179O2424K7471j696o1819Q731J03278m2000
$$ 91048 114372 263022 266817 196698 115519 177943 205414 203718 141899 150630 253908 211908
21393B11908l1619j24083o9413K4461Q6659J8163N0183O3465o7079j1019J1870
$$ 211908 180289 56206 -13207 11254 97913 116076 166259 229724 162645 151626 163496
21382A63496r4199o6037J18666J16716M3895m9156K9134L9465j05296j03788L587
$$ 163496 69297 3260 121926 238642 282537 233381 262515 301980 196684 92896 96483
21371I6483P5081m4051l3308l8215O6231M2952l5565m9125K4544J10491k3442
$$ 96483 171564 127513 94205 55990 122221 165173 129608 80483 105027 215518 192076
21360A92076m191l4739N5481q1088j23117L3390K5776P2455M4704J23744N3295
$$ 192076 187885 153146 208627 127539 4422 37812 63588 136043 180747 304491 357786
21349C57786r3044j72081L0186R7534k0891J9149j7099q7794j65180n8l6423l1221
$$ 357786 264742 92661 122847 220381 199490 218639 201540 113746 -51434 -51492 -87915 -119136
21337a19136L6906O9444k3870n545J40062p7728l2859q899R8040J25299L308l5941
$$ -119136 -82230 -12786 -36656 -42201 97861 20133 -12726 -21625 76415 201714 205022 169081
21325A69081R083m6020l129P5393n4392n9280P1000j365J31625k0066j54606l5779
$$ 169081 178164 132144 129015 204408 150016 90736 161736 160371 291996 271930 117324 81545
21313H1545L3869O7629J966j5457L6945j67306L272J43374K9467L0174n5588m2182
$$ 81545 115414 183043 185009 169552 206497 39191 42463 185837 215304 245478 189890 147708
21301A47708o5568p013N956Q68m662K4359q1677O958O6904J0658O2737J19037
$$ 147708 82140 75127 81083 81951 77289 101648 19971 26929 93833 104491 167228 286265
21289B86265J6295O874q9758L9219o9559m7967k5502J36827k8017p6731j4477
$$ 286265 302560 309434 219676 258895 189336 141369 115867 252694 224677 147946 133469
21278A33469J10320R781m4944j85847O7945O0020P9302K4614o9568j32951M0607
$$ 133469 243789 253570 208626 22779 90724 150744 230046 254660 185092 52141 92748
21267I2748L5851P7812J0368K1309P7728l7303j09542o6525j54734J447N720J76082
$$ 92748 128599 206411 216779 238088 315816 278513 168971 102446 -52288 -50841 -45121 130961
21255A30961J35098Q7530j8093r9329p6344J0914J10451L3737K2148n8562l364
$$ 130961 266059 353589 335496 236167 159823 170737 281188 314925 337073 278511 275147
21244B75147O5846j9035k523l9228P475r1842M1298J73773M9924n5582J18120
$$ 275147 340993 321958 319435 280207 287682 195840 237138 410911 460835 405253 523373
21233E23373J9614q1071j5949p2901j23467p09J5049O249l674J0919J19878J60297
$$ 523373 542987 461916 445967 373066 249599 248890 263939 270188 266514 277433 397311 557608
21221E57608j3179o8411j18434M0176j04345r4384J12542J83482o806M1408O893
$$ 557608 544429 476018 357584 397760 293415 199031 311573 495055 488249 529657 536550
21210E36550q8513m3721O535k652l2653k7881n5896o3038J54629J52727n2774
$$ 536550 448037 404316 410851 408199 375546 347665 291769 228731 383360 536087 483313
21199D83313m4953j08709j10009j3835M6797j5819l1208o0940J2788n8429q442
$$ 483313 438360 329651 219642 205807 252604 236785 205577 144637 157425 98996 90554
21188I0554L0457L5066P5512J50674J09564k9895r3943o3121L0239J10877K6070
$$ 90554 121011 156077 231589 382263 491827 461932 367989 304868 335107 445984 472054
21177D72054m0353k6319K7032k3118j05222o3763r1701M8451j3282Q833j6979
$$ 472054 431701 405382 432414 409296 304074 240311 148610 197061 183779 192612 175633
21166A75633J01071L9685j1480K1814N7350m7838j9892k5103N8542K9509l4195
$$ 175633 276704 316389 304909 326723 384073 336235 316343 291240 349782 379291 345096
21155C45096r9603r413j00878O4714N7846L080M6490P9761j434J6471Q7180j89993
$$ 345096 245493 236080 135202 199916 257762 260842 307332 387093 385659 402130 489310 299317
21143B99317k30032m7362O6379l5102R6272Q0657R0550j3978j0362r3271pm0647
$$ 299317 69285 21923 88302 53200 149472 230129 320679 306701 296339 203068 203061 162414
21131A62414j41641J57K5548R3971R9367m4204J59875Q5530q3826k2242j6061
$$ 162414 20773 20930 46478 140449 239816 195612 355487 441017 357191 334949 318888
21120C18888M4989O8896l9645q8335q8967m4998L7923N3046l3946J3705j35591
$$ 318888 363877 432773 393128 304793 215826 170828 208751 261797 227851 241556 105965
21109A05965M4873J17304n6490j04643j0898K9600L7539P6626r187j47441j24509
$$ 105965 150838 268142 211652 107009 96111 125711 163250 239876 230689 83248 -41261
21098d1261O2901R2990j9794m7744j8797K8491l5662J34918J09376Q9990K6006
$$ -41261 21640 114630 94836 47092 28295 56786 21124 156042 265418 355408 381414
21087C81414o9003n8624M9321p6288P54p757k6157p9537l4616J2508P1130j09836
$$ 381414 312411 253787 303108 226820 227574 219817 193660 114123 79507 92015 163145 53309
21075E3309M770J39629m1032m4897j8366r46p4869M1776J17071q1995J44604J16903
$$ 53309 58079 197708 156676 111779 93413 92467 17598 59374 176445 94450 239054 355957
21063C55957r3038j5816m0212p528m9600n3220P2986N028O809N3270j1587o5406
$$ 355957 262919 247103 206891 199363 149763 96543 169529 174557 181366 234636 223049 157643
21051A57643j6607l8322l3022Q0939J06520O0266o1701M9913q1497j31582m808
$$ 157643 141036 102714 69692 150631 257151 317417 255716 305629 224132 92550 87742
21040H7742L3292J13191o2289j13699j8364J83537J41696l1739j76691q208n7110
$$ 87742 121034 234225 171936 58237 39873 223410 365106 333367 156676 148468 91358
21029I1358q6219P1210J26028p090J02197Q064r9742K1928J02011O537j24550
$$ 91358 5139 76349 202377 195287 297484 305548 205806 227734 329745 336282 211732
21018B11732j9514P7697j42384n2429N4992m3915p6604N2250J2538J24995J39765
$$ 211732 192218 269915 127531 75102 130094 86179 9575 61825 74363 199358 339123
21007C39123o9011K5655j3300l3427n9995N1457L3642J07205n6485o7684O9389
$$ 339123 270112 295767 282467 249040 189045 240502 274144 381349 324864 257180 326569
20996C26569J4671o3676o9055l2520M681O0138L7167k5784j2996K0239N5669m3556
$$ 326569 341240 277564 208509 175989 180670 240808 277975 252191 239195 259434 315103 271547
20984B71547l0523K1450K4040R3646N1358o1038M6695l246k2060o3054n5573j20027
$$ 271547 241024 262474 286514 380160 431518 370480 417175 413929 391869 328815 273242 153215
20972A53215n7104j23024Q8920J44329j6339r8737m7617n8590j3581N4317R9610
$$ 153215 96111 -26913 62007 206336 189997 91260 43643 -14947 -28528 25789 125399
20961A25399m1496M9226J25905k3190o3433K5946L3161n8289n7273N0820M9907
$$ 125399 83903 133129 259034 235844 172411 198357 231518 173229 115956 166776 216683
20950B16683Q4279o1272r5423K6887j5261J3975l1242j4100N1929l1728j04869
$$ 216683 300962 239690 144267 171154 155893 169868 138626 124526 176455 144727 39858
20939C9858L9101l0371o2226N1823K8263l184L4866L9359O4808n0634J1266K8605
$$ 39858 78959 48588 -13638 38185 66448 63264 98130 137489 202297 151663 162929 191534
20927A91534Q1132j12855K500Q8377N8963K5508k3348J8070L3782m7110K8428
$$ 191534 272666 159811 162311 250688 309651 335159 311811 329881 363663 316553 344981
20916C44981L1056r2349q4688j8867k6175O2327k3987m4748P3087J15598Q0316
$$ 344981 376037 283688 199000 180133 153958 216285 192298 147550 220637 336235 416551
20905D16551m0513j21769K1687j8505k0106O3174k619r1359r9039q6622J48988
$$ 416551 376038 254269 275956 257451 237345 300519 297900 206541 107502 20880 169868
20894A69868J46778j6746o2309k8283N7322j0043Q1864J12975M7110N6230J7055
$$ 169868 316646 299900 237591 209308 266630 256587 338451 451426 498536 554766 571821
20883E71821r3329j89134j24718M935J33414J41228j27790j08515K6441R4075
$$ 571821 478492 289358 164640 169575 302989 444217 316427 207912 234353 328428
20873C28428L7651j35314r7814m7937n333N0075K4958Q6255M9856M3593L281o941
$$ 328428 366079 230765 132951 85014 79681 129756 154714 240969 290825 334418 337699 330758
20861C30758m3542n5844N3759M2949L0647k8332m0968p184P3751L5833m8593r2960
$$ 330758 287216 231372 285131 328080 358727 330395 289427 282243 355994 391827 343234 250274
20849B50274K8205o8850m6994j02094l924J60110l892j32522O1302M5355Q5880
$$ 250274 278479 209629 162635 60541 56617 216727 212835 80313 141615 186970 272850
20838B72850N876l9889O8242R3278n3237k5932L6774p4264P2171L1208j22387
$$ 272850 278726 238837 307079 400357 347120 321188 357962 283698 355869 387077 264690
20827B64690m6307M8826L6464q661M9221j6121q21O3296L4016J1221O1785N3955
$$ 264690 218383 267209 303673 295012 344233 328112 327291 390587 424603 435824 497609 551564
20815E51564j04430j00994n2887O044L7306J04110r1534n0124j0176K2584J32679
$$ 551564 447134 346140 293253 299297 336603 440713 349179 299055 288879 311463 444142
20804D44142k7169J8753k579L898o9736o7859k8351Q5835O6854M2471L394o7244
$$ 444142 416973 435726 433147 437045 367309 299450 271099 356934 423788 466259 469653 402409
20792D02409j2958o9686P0094j14067l6125N5076K4643k0414j4762j04497O4675
$$ 402409 389451 319765 389859 275792 239667 294743 319386 298972 284210 179713 244388
20781B44388P3381m0506J7117k0410j2298K4514O708P8624L2136r7693q351N3707
$$ 244388 317769 277263 294380 273970 261672 286186 292894 371518 403654 305961 297610 351317
20769C51317Q7678k5250j97669j24086K3442J78354N0552m8920l557O3465j12900
$$ 351317 438995 413745 216076 91990 115432 293786 344338 295418 291861 355326 242426
20758B42426m30o6611l3207N6841O3491p2775m5953n0408J2201m5496Q5475k598
$$ 242426 241996 175385 142178 199019 262510 189735 143782 93374 105575 60079 145554 142956
20746A42956J32887J12673m9244o5044r1076K2633J82568P9982p3084k3263L8250
$$ 142956 275843 388516 339272 274228 183152 205785 388353 468335 395251 371988 410238
20735D10238K5545m9305L8673j77295j47094J70017J40681l1683j04042j17454
$$ 410238 435783 386478 425151 247856 100762 270779 411460 379777 275735 158281
20725A58281n0235J31945L7995J60626P2878j23028L7440P4786q5912p014M6009
$$ 158281 108046 239991 277986 438612 511490 388462 425902 500688 414776 407762 453771
20714D53771Q0757M9938l1118q1214o5908R2220J15926k952o5488n2173j24169
$$ 453771 534528 584466 553348 472134 406226 498446 614372 611420 545932 493759 369590
20703C69590m581p737j8424L301J29488L6979j33537r2396q6440L4589R5366m805
$$ 369590 365009 357272 338848 342149 471637 508616 375079 282683 196243 230832 326198 321393
20691C21393j4J1388J2595Q5418R1878m162m5030j23632L2900J46666l7781n3729
$$ 321393 321379 332767 345362 430780 522658 518496 473466 349834 382734 529400 491619 437890
20679D37890R619r1942p8723n8504R194M9503L9214M5682l6495L7820k635j2207
$$ 437890 447509 355567 276844 218340 227534 277037 316251 361933 325438 363258 360623 348416
20667C48416J13849m8870r6767N9173J23522O1456O2687j9311q5067R5876o7701
$$ 348416 462265 413395 316628 375801 499323 560779 623466 604155 519088 614964 547263
20656E47263n2389K3300R5569K3203j693J51867L2528r115p8735q1931j00459
$$ 547263 494874 518174 613743 636946 635253 787120 819648 810533 731798 649867 549408
20645E49408J8957j413M8031J46371k1795K3444p5030o8459N000K2822O5690J30645
$$ 549408 568365 566952 614983 761354 739559 763003 687973 619514 624514 647336 713026 843671
20633H43671J30692k03457k40404o8756O1817J0794q4270L2419J20496K831m8429
$$ 843671 974363 770906 530502 461746 523563 534357 450087 482506 603002 605833 557404
20622E57404L627p2603R6353m5309K1041K1070m5434O6915O8820j16551j60829
$$ 557404 561031 488428 584781 539472 560513 581583 536149 603064 671884 555333 394504
20611C94504P1726J44442k8254K7537r4592l1377r063J79813o9758j62210l3026
$$ 394504 466230 610672 582418 609955 515363 483986 474923 654736 584978 422768 389742
20600C89742j0377K6651J27752j3201m4720m002J8231J3782J10889J37004k3863
$$ 389742 379365 406016 533768 520567 475847 471845 490076 503858 614747 751751 727888
20589G27888O5337L953p4274l1416K8633J0263o0833p8491o5499J04815N5064
$$ 727888 793225 797178 722904 691488 720121 730384 669551 591060 525561 630376 685440
20578F85440O3204j17995o224K3033R238m6612J9497k8020R3610J80398n0182
$$ 685440 748644 630649 624425 647458 656696 610084 629581 601561 695171 875569 825387
20567H25387j24947l5552r3345j4442K7384J53340j03819r3243r630P905K9269
$$ 825387 700440 664888 571543 557101 584485 737825 634006 540763 531133 539038 568307
20556E68307j06530k3061N7148J9092J14339O112o8563j7185k6817J7285L2186
$$ 568307 461777 438716 495864 514956 629295 635407 566844 549659 522842 540127 572313
20545E72313q2771m1253k2539L1592R6790Q2129O9714j45303j07363J17992N0825
$$ 572313 489542 448289 425750 457342 554132 636261 705975 560672 453309 571301 622126
20534F22126K7872n7304J1062l5099K3797j2550o9365m7222R9488J10040n3184
$$ 622126 649998 592694 603756 568657 592454 579904 510539 463317 562805 672845 619661
20523F19661o9497k8696j15429N3410P8879m5560L546R8770J4944P0698O2683
$$ 619661 550164 521468 406039 459449 538328 492768 496314 595084 610028 680726 743409
20512G43409N6482j1686j31479j19191L276J23149j5415L2301L2809P3904k6080
$$ 743409 799891 788205 656726 537535 540811 663960 648545 680846 713655 787559 761479
20501G61479q4000l4005l8583L4953R2920m7728l0603R5646j08998q802J01154
$$ 761479 677479 643474 604891 639844 732764 685036 654433 750079 641081 632279 733433
20490G33433Q0289q2037p7643M6234j6706O042m0081l8470N48N5066P3620j8753
$$ 733433 813722 731685 654042 700276 683570 689612 649531 611061 611609 666675 740295 721542
20478G21542Q4708j0338j10186k0267P9293O9359N3428j43309l9794J81186l4750
$$ 721542 806250 795912 685726 665459 744752 814111 867539 724230 684436 865622 830872
20467H30872l8742J70291p9339l0748n3170j20951j0921L2436l8810o7509r2210
$$ 830872 792130 962421 883082 852334 799164 678213 667292 699728 660918 593409 501199
20456E01199R1670O9354o329k3211o293P0137L9333P0385m4283J9086M4768N0112
$$ 501199 592869 662223 655894 632683 626390 696527 735860 806245 761962 781048 825816 875928
20444H75928m0545M3726m354p2829j526J1168j4044J36595J54853m9179j60219
$$ 875928 835383 879109 874755 801926 800400 811568 797524 934119 1088972 1039793 879574
20433H79574M1991O0566j26668j25231M5164Q7315N8510M3258p1132r5052n1603
$$ 879574 921565 982131 855463 730232 775396 862711 921221 964479 893347 798295 746692
20422G46692O956J46711l0098k4536O1763J04786l9784M947J3959m0826J7066
$$ 746692 753648 900359 870261 845725 907488 1012274 972490 977437 991396 950570 967636
20411I67636K9124J3886j5643n0870l4007J20124j0747n6660p6343O6270M0056
$$ 967636 996760 1010646 995003 944133 910126 1030250 1019503 962843 886500 952770 992826
20400I92826K9271j16390K1211j3328j59018j07770k6722J50675R8227R195n3325
$$ 992826 1022097 905707 926918 913590 754572 646802 620080 770755 868982 878177 824852
20389H24852N5238j4729K1815j0785J38977M3854J7061q9190j23752j13124k0333
$$ 824852 880090 865361 887176 876391 1015368 1059222 1076283 987093 863341 750217 729884
20378G29884O706P2578K5332k3174J81447Q6321o0757J1168k2942p9718l2429
$$ 729884 736590 809168 834500 811326 992773 1079094 1018337 1029505 1006563 926845 894416
20367H94416O4588j29366j3308m8002J18437J67134O5406j05312k27555n8178
$$ 894416 959004 829638 816330 768328 886765 1053899 1119305 1013993 786438 728260
20357G28260L5380K4820Q6338Q0032K7143p9066n6587O2758J38083J2994r318
$$ 728260 763640 788460 874798 954830 981973 902907 846320 909078 1047161 1060155 1050837
20346A050837L5487M2414N0149k7068k9555J8073K7463m9421k5099m0322m0656
$$ 1050837 1086324 1128738 1178887 1151819 1122264 1140337 1167800 1118379 1093280 1052958 1012302
20335A012302p3534K7026J19248N7939k2694j51111j70397K9927J37541o5061
$$ 1012302 938768 965794 1085042 1142981 1120287 969176 798779 828706 966247 901186
20325I01186J7461K5653k8931M6928J4226J0124J4097N6021J14465L0474q3360
$$ 901186 918647 944300 915369 962297 976523 986647 1000744 1056765 1171230 1201704 1118344
20314A118344o4859q3860r1020J28368j2892k8657Q8981n4451k3393M3410K0847
$$ 1118344 1053485 969625 878605 1006973 994081 965424 1054405 999954 976561 1019971 1040818
20303A040818P8612l0203l3105J00538J25837j06139n3373j314L9872K9562R8490
$$ 1040818 1119430 1089227 1056122 1156660 1282497 1176358 1122985 1121671 1161543 1191105 1289595
20292A289595J0267o5555p2060K1293J9126L5522j26359j3847N8884K1091O6599
$$ 1289595 1299862 1234307 1162247 1183540 1202666 1238188 1111829 1097982 1156866 1177957 1244556
20281A244556J86421J18800r5229j70584o8465j29905J31402J67492k7388p0993
$$ 1244556 1430977 1549777 1454548 1283964 1215499 1085594 1216996 1384488 1357100 1286107
20271A286107m1515P957r40R9403J05034m9574j2187j3669J8740M852l9931l9066
$$ 1286107 1244592 1252549 1251609 1351012 1456046 1406472 1394285 1380616 1399356 1404208 1364277 1325211
20259A325211L367L7935M2111o3540M8454Q6076L3822o2506n509k4280n8467r2630
$$ 1325211 1328578 1366513 1408624 1345084 1393538 1479614 1513436 1450930 1445421 1421141 1362674 1270044
20247A270044O3764k5169O5297M9859m5400n9925O0018J40611P2593l3038p6193
$$ 1270044 1333808 1308639 1373936 1423795 1378395 1318470 1378488 1519099 1591692 1558654 1482461
20236A482461M9959k2012R6566R0058r7429n7761n7002k2576P2682Q7707L1862
$$ 1482461 1532420 1510408 1606974 1697032 1599603 1541842 1484840 1462264 1534946 1622653 1654515
20225A654515o3442Q8039K9395r935p8021q6397j09469N022J22976J23415M3866
$$ 1654515 1591073 1679112 1708507 1698572 1620551 1534154 1424685 1429707 1552683 1676098 1719964
20214A719964p0028p5726p7939K8710J5786J4615m4341j2865J34649J78749J09470
$$ 1719964 1649936 1574210 1496271 1524981 1540767 1555382 1511041 1498176 1632825 1811574 1921044
20203A921044o8817j25244j5911K8558m4251L4192n4719q4324p040Q0260L9676
$$ 1921044 1852227 1726983 1711072 1739630 1695379 1729571 1674852 1590528 1583488 1663748 1703424
20192A703424R6559L1822N3431j27350l3711O5234J09090J18511Q0152j29502
$$ 1703424 1799983 1831805 1885236 1757886 1724175 1789409 1898499 2017010 2097162 1967660
20182A967660j29263j44812j0505K4834Q5752l6765p4049M8444K1321P3631J62133
$$ 1967660 1838397 1693585 1683080 1707914 1793666 1756901 1682852 1731296 1752617 1826248 1988381
20171A988381Q341j22651p6175R892L5376J23296J23627N1211j9181r9026j03309
$$ 1988381 1996722 1874071 1797896 1807788 1843164 1966460 2090087 2141298 2122117 2023091 1919782
20160A919782Q8024J71532J9801j65695q4796P4740J61336M0580k0166j00882
$$ 1919782 2007806 2179338 2199139 2033444 1948648 2023388 2184724 2225304 2205138 2104256
20150B104256o2440n9676M7416P9376O1079L825j22181J522N6568L0607p0953
$$ 2104256 2041816 1982140 2029556 2108932 2170011 2173836 2051655 2053177 2109745 2140352 2069399
20139B069399m9058J02117O3108R8569L2498o253m2715l6924P6418M0697O8836
$$ 2069399 2020341 2122458 2185566 2284135 2316633 2310380 2267665 2230741 2307159 2347856 2416692
20128B416692N4840L8971p4750r9845K6248R431n0465P8485O5330J3882r2085
$$ 2416692 2471532 2510503 2435753 2335908 2362156 2371587 2321122 2399607 2464937 2478819 2386734
20117B386734m438J2661N5424K906l7723K4784m21P8111N0569M7197j03496l0734
$$ 2386734 2382296 2394957 2450381 2453287 2415564 2440348 2439927 2518038 2568607 2615804 2512308 2481574
20105B481574o9971Q8701O1091N0339m4572n8332l3775K0422J49202Q0002Q5316
$$ 2481574 2411603 2500304 2561395 2611734 2567162 2508830 2475055 2495477 2644679 2724681 2809997
20094B809997L8580j472M4758j02169o0260N2205l9175J83632J1569j97395J2143
$$ 2809997 2848577 2847105 2891863 2789694 2729434 2781639 2742464 2926096 2937665 2740270 2752413
20083B752413J24567l3741J01801K5045Q7361j8418J6417m1483Q8968j5175r8812
$$ 2752413 2876980 2843239 2945040 2970085 3057446 3039028 3055445 3013962 3102930 3087755 2988943
20072B988943m4491J14523L8409M9107m2384K066N5201J19528K6906K8414n0969
$$ 2988943 2944452 3058975 3097384 3146491 3104107 3106173 3161374 3280902 3307808 3336222 3285253
20061C285253m4364M8714N7513J01532l9472Q4041j4451j27504J7979N7214K1282
$$ 3285253 3240889 3289603 3347116 3448648 3409176 3493217 3478766 3351262 3369241 3426455 3447737
20050C447737Q8250R9981Q205j71685J6099R0456O2306J8654k1568P2797l0406
$$ 3447737 3535987 3635968 3644173 3472488 3488587 3579043 3641349 3660003 3638435 3711232 3680826
20039C680826q5631N9150R2773K7123m9268q848n5822m8113N2675l0357O5267
$$ 3680826 3595195 3654345 3747118 3774241 3724973 3716125 3660303 3612190 3664865 3634508 3699775
20028C699775J07089O4489j9731R622J21717o403j6151j3568q678P7011J20042
$$ 3699775 3806864 3871353 3851622 3861244 3982961 3976558 3960407 3946839 3938161 4015172 4135214
20017D135214k8218l4579N4576J34269J48069P6639l4759l3782n9916R3400J09878
$$ 4135214 4106996 4072417 4126993 4261262 4409331 4485970 4451211 4417429 4357513 4450913 4560791
20006D560791j1167r157P4999J7621J243N2845R9308R3598O3801J19333J09606
$$ 4560791 4549624 4540467 4615466 4633087 4634330 4687175 4786483 4880081 4943882 5063215 5172821
19995E172821r207r8843l900O8272M5006m0530l9838l8325Q0424R6003J54206
$$ 5172821 5163614 5064771 5060871 5129143 5174149 5133619 5093781 5055456 5135880 5231883 5386089
19984E386089j13094L750J06438J7659N7085L9567L2037N9874p5457J4972O4933
$$ 5386089 5272995 5276745 5383183 5400842 5457927 5497494 5529531 5589405 5513948 5528920 5593853
19973E593853l8612J4469J60473R9826K04067J23719j3450N0653P3748K4689L9746
$$ 5593853 5555241 5569710 5730183 5830009 6034076 6157795 6144345 6194998 6268746 6293435 6333181
19962F333181j2720k2602P4780J79654j2822j0003m6962P928J21404J00046j4711
$$ 6333181 6320461 6297859 6372639 6552293 6539471 6529468 6482506 6490434 6611838 6711884 6697173
19951F697173P1048N985K9042O2938N3039N7294q18J02025K22260J86769l273
$$ 6697173 6768221 6774206 6803248 6866186 6919225 6976519 6975701 7077726 7299986 7486755 7483482
19940G483482m75K2568O2746L8942j06762J9940J95062Q7751K6627M2004J29411
$$ 7483482 7483007 7505575 7568321 7607263 7500501 7520441 7715503 7803254 7829881 7871885 8001296
19929H001296J47852M9874J5260J9642J09740J12745J18864l3062L812K7677J15647
$$ 8001296 8149148 8199022 8214282 8233924 8343664 8456409 8575273 8542211 8546023 8573700 8689347
19918H689347J99503j7778J6801j6078J17477J84603J21340k3037J30422J67486
$$ 8689347 8888850 8871072 8887873 8871795 8989272 9173875 9295215 9272178 9402600 9570086
19908I570086m3902N093R5919Q8837K09410K62336J04936J8279q1065R5010J06557
$$ 9570086 9526184 9531277 9627196 9716033 9925443 10187779 10292715 10310994 10229929 10324939 10431496
19897A0431496Q4096N8164N9052J84615J93729J69024J49310J60346O6150R9832
$$ 10431496 10515592 10573756 10632808 10817423 11011152 11180176 11329486 11489832 11555982 11655814
19887A1655814J74249J72713L7403J09918K00606J13705R621J47167K04462K17014
$$ 11655814 11830063 12002776 12040179 12150097 12350703 12464408 12474029 12621196 12825658 13042672
19877A3042672O2583N0342K23559J60029J49395J52393J60074J69845K22390N5767
$$ 13042672 13105255 13155597 13379156 13539185 13688580 13840973 14001047 14170892 14393282 14449049
19867A4449049J19453K30367J67250L733J87270J61968J97026J87907J90467P0565
$$ 14449049 14568502 14798869 14966119 14969852 15157122 15319090 15516116 15704023 15894490 15965055
19857A5965055Q5927J87937K47970K18597K08788J64412K89382K69704J93837
$$ 15965055 16050982 16238919 16486889 16705486 16914274 17078686 17368068 17637772 17831609
19848A7831609K79009K77568K42920L00000K28830J69867P7658K58257K97533
$$ 17831609 18110618 18388186 18631106 18931106 19159936 19329803 19407461 19665718 19963251
19839A9963251L23178L02338J96452K05623L07646K84615K58313K66118K66195
$$ 19963251 20286429 20588767 20785219 20990842 21298488 21583103 21841416 22107534 22373729
19830B2373729L77560L27911L47043K68621K85407K54387L66915M59131L88283
$$ 22373729 22751289 23079200 23426243 23694864 23980271 24234658 24601573 25060704 25448987
19821B5448987M13920M25479L92790L26455L03537N33522O01186K85573K71467
$$ 25448987 25862907 26288386 26681176 27007631 27311168 27844690 28445876 28731449 29002916
19812B9002916M65369N46850M75506L89160L61636N08445N14825M74237M39437
$$ 29002916 29468285 30015135 30490641 30879801 31241437 31749882 32264707 32738944 33178381
19803C3178381N26574O07498M31756N48963N09877N66833P31581O88271O06227
$$ 33178381 33704955 34312453 34744209 35293172 35803049 36369882 37101463 37789734 38395961
19794C8395961N17899N38998N65290P08234P80247N95914O95749P73129O41509
$$ 38395961 38913860 39452858 40018148 40726382 41506629 42102543 42798292 43571421 44212930
19785D4212930P90698O97514P87456O79900O68159R19003Q67712Q33714Q14260
$$ 44212930 45003628 45701142 46488598 47168498 47836657 48755660 49623372 50457086 51271346
19776E1271346P63091Q47247R48312J064050Q43859Q61683J011040J012062R07540
$$ 51271346 52034437 52881684 53829996 54894046 55737905 56599588 57610628 58622690 59530230
19767E9530230J086712J114655J079110J094108J007953J014709R61158J118649
$$ 59530230 60616942 61731597 62810707 63904815 64912768 65927477 66888635 68007284
19759F8007284J308131J156644J030984R92469J024425J044037J234549J220313
$$ 68007284 69315415 70472059 71503043 72495512 73519937 74563974 75798523 77018836
19751G7018836J090489J228223J184838J239259J263220J243997J097305J037986
$$ 77018836 78109325 79337548 80522386 81761645 83024865 84268862 85366167 86404153
19743H6404153J100397J158993J224996J051963J035789J172800J189867J153041
$$ 86404153 87504550 88663543 89888539 90940502 91976291 93149091 94338958 95491999
19735I5491999R43589J119985R93067P68024P72642R58950R09998P45018P66385
$$ 95491999 96435588 97555573 98548640 99316664 100089306 101048256 101958254 102703272 103469657
19726A03469657P47438O24468M34368N57141N80949N57819M34925L01279L22842
$$ 103469657 104217095 104841563 105275931 105833072 106414021 106971840 107406765 107708044 108030886
19717A08030886L33920L03944J70685K0074J15402J06325M1193j19058j24611
$$ 108030886 108364806 108668750 108839435 108859509 108974911 109081236 109122429 109003371 108878760
19708A08878760k6132k10065l90343l98427l79052n13704o57086o81795o58027
$$ 108878760 108852628 108642563 108252220 107853793 107474741 106961037 106303951 105622156 104964129
19699A04964129o80742p34073q74000q73745q77649r59147r44213r53561j058507
$$ 104964129 104283387 103549314 102675314 101801569 100923920 99964773 99020560 98066999 97008492
19690I7008492j021086j062646j190192j196889j281652j276923j174598j315869
$$ 97008492 95987406 94924760 93734568 92537679 91256027 89979104 88804506 87488637
19682H7488637j396831j286873j183789j183819j286034j291858j157506j206718
$$ 87488637 86091806 84804933 83621144 82437325 81151291 79859433 78701927 77495209
19674G7495209j129430j121700j162772j126805j065737j150926j133792j021534
$$ 77495209 76365779 75244079 74081307 72954502 71888765 70737839 69604047 68582513
19666F8582513j041476j120493j152202j110945j141538r90257r54435r69437
$$ 68582513 67541037 66420544 65268342 64157397 63015859 62025602 61071167 60101730
19658F0101730j069617r57146r39823r29383q78105r01198q47936p69792q04849
$$ 60101730 59032113 58074967 57135144 56205761 55327656 54426458 53578522 52808730 52003881
19649E2003881r93904q94429o42354q37271q30880q32261o97221p03848p23373
$$ 52003881 51009977 50115548 49473194 48635923 47805043 46972782 46275561 45571713 44848340
19640D4848340o81060n97418p12628p01883p27979o19316o82252n77428n13127
$$ 44848340 44167280 43569862 42857234 42155351 41427372 40808056 40125804 39548376 39035249
19631C9035249o04340p27227n71367n11560o32979n74788n29057m71901m89216
$$ 39035249 38430909 37703682 37132315 36620755 35987776 35412988 34883931 34412030 33922814
19622C3922814m85095n36538m46493m03455m26418m88542m72954m52049m83063
$$ 33922814 33437719 32901181 32454688 32051233 31624815 31136273 30663319 30211270 29728207
19613B9728207m38921l81984l15752k91019n05633m80776k77771m03588m70408
$$ 29728207 29289286 28907302 28591550 28300531 27794898 27314122 27036351 26632763 26162355
19604B6162355m89170l64999l19957k76681k94818m37958k63803k25308l00409
$$ 26162355 25673185 25308186 24988229 24711548 24416730 23978772 23714969 23489661 23189252
19595B3189252k87328k78381k89906k67589k89031k23936l65984j62375j43478
$$ 23189252 22901924 22623543 22333637 22066048 21777017 21553081 21187097 21024722 20881244
19586B0881244l27884l38369k50078l16999k69195j56381k56675k06174j88002
$$ 20881244 20553360 20214991 19964913 19647914 19378719 19222338 18965663 18759489 18571487
19577A8571487l26619l29247j80398o3002j10609k52803k80509l05310k41735
$$ 18571487 18244868 17915621 17735223 17672221 17561612 17308809 17028300 16722990 16481255
19568A6481255j24911o9182j55235l36907k40274k79948k08111m2670j05945r2885
$$ 16481255 16356344 16287162 16131927 15795020 15554746 15274798 15066687 15024017 14918072 14825187
19558A4825187j86187r9027j92227j36539j24480j18341j33663k76557k90245
$$ 14825187 14639000 14539973 14347746 14211207 14086727 13968386 13834723 13558166 13267921
19549A3267921r7505j68222J8643q8202k30465j80255j23747j42839j34045j36445
$$ 13267921 13170416 13002194 13020837 12932635 12702170 12521915 12398168 12255329 12121284 11984839
19539A1984839n4959q1183o9885q0724K7114p836j02917j89694j79427j03649
$$ 11984839 11929880 11848697 11778812 11698088 11725202 11717366 11614449 11424755 11245328 11141679
19529A1141679p3008j35121j39601k1685o1145k8751o6104k03341q5341q3001
$$ 11141679 11068671 10933550 10793949 10772264 10711119 10682368 10616264 10412923 10327582 10244581
19519A0244581j97176l8577j0583r3748l9106j92526j48244r7162M9789m2822
$$ 10244581 10047405 10008828 9998245 9904497 9865391 9672865 9524621 9427459 9477248 9434426
19509I434426o3115j04180j66217j63686j72736j21338P5851r308r4955n0320
$$ 9434426 9371311 9267131 9100914 8937228 8764492 8643154 8719005 8709697 8614742 8564422
19499H564422q2322k55041j08898k72J7420q0591j12268n0516l8165j2468L324
$$ 8564422 8482100 8227059 8118161 8117889 8135309 8054718 7942450 7891934 7853769 7841301 7844625
19488G844625q1043q6006o8781j42968Q665J8592j21624m8092M3023N8823k9435
$$ 7844625 7763582 7677576 7608795 7465827 7474492 7493084 7371460 7323368 7366391 7425214 7395779
19477G395779j82574j20392J22240J13363j55513k62192l3941j972k8623o6145
$$ 7395779 7213205 7092813 7215053 7328416 7172903 6910711 6876770 6874798 6846175 6780030
19467F780030j18633j8881j8466l7422k5450l2492k9105n7876p8391J12177J26888
$$ 6780030 6661397 6642516 6624050 6586628 6561178 6528686 6499581 6441705 6363314 6475491 6602379
19456F602379q7622r4594N3460J6213R3864P9088J11101K7495K0028P7163M2710
$$ 6602379 6514757 6420163 6473623 6489836 6583700 6662788 6773889 6801384 6821412 6898575 6941285
19445F941285J11592Q181j39261l8446q4640j32210j9097L3360O006j88302j22948
$$ 6941285 7052877 7061058 6921797 6883351 6798711 6666501 6647404 6680764 6686770 6498468 6375520
19434F375520j48065p8503n5109m4550j10140p9344k9075p2469k72647j57009
$$ 6375520 6227455 6148952 6093843 6049293 5939153 5859809 5830734 5758265 5485618 5328609
19424E328609M4312J63771k9685k01267j38312j51108p3890P916R5061R0609j03011
$$ 5328609 5372921 5536692 5507007 5305740 5167428 5016320 4942430 4950346 5045407 5136016 5033005
19413E033005r9154J15376Q5295l2264j19542n3847J00735K50470J41112O6276
$$ 5033005 4933851 5049227 5134522 5102258 4982716 4928869 5029604 5280074 5421186 5487462
19403E487462O0444l5379L3961K2725j877O2857O3466n1287l1331j2626j37583
$$ 5487462 5547906 5512527 5546488 5569213 5567336 5630193 5693659 5642372 5611041 5598415 5460832
19392E460832j26282j48730j44119j80536j78095j23346j37905N0886K0291k6379
$$ 5460832 5334550 5185820 5041701 4861165 4683070 4559724 4421819 4472705 4492996 4466617
19382D466617p1552Q512m4703k4829m1753j30829j99248M512N5322J06231O9871
$$ 4466617 4395065 4403577 4358874 4334045 4292292 4161463 3962215 3966727 4022049 4128280 4198151
19371D198151m9473k9280p8370l8395l0535Q3807N50r3101o2649L1096P5550m9343
$$ 4198151 4148678 4119398 4041028 4002633 3972098 4055905 4056455 3963354 3900705 3931801 4007351 3958008
19359C958008r2293Q4162m4326k4113M4240p7887j42026m1809K6667P8228L1253
$$ 3958008 3865715 3949877 3905551 3881438 3925678 3847791 3705765 3663956 3690623 3768851 3800104
19348C800104O2152K3693q5248q866R0367O3086o0310L7837Q2002O0070O5074
$$ 3800104 3862256 3885949 3800701 3791835 3882202 3945288 3884978 3922815 4004817 4064887 4129961
19337D129961j71026k50871l5055j0156K9236M3164P4735o8108M8583Q9118R0921
$$ 4129961 3958935 3708064 3673009 3662853 3692089 3735253 3809988 3741880 3790463 3879581 3970502
19326C970502R6126m5032K3186n2683j7664Q2123J24745n9039j30426m7523P6439
$$ 3970502 4066628 4021596 4044782 3992099 3974435 4056558 4181303 4122264 3991838 3944315 4020754
19315D020754R232P372J11961N9831j32906j90775N0777K9170q7432n7128J0587
$$ 4020754 4029986 4037358 4149319 4209150 4076244 3885469 3936246 3965416 3877984 3820856 3831443
19304C831443N1357j7622j12645r1044j05917j45003j6193J570m1632N7064P5333
$$ 3831443 3882800 3865178 3752533 3661489 3555572 3410569 3394376 3395946 3354314 3411378 3486711
19293C486711j80895j27741j87251q2515L925n3210P4873P6120Q4047M9228N0026
$$ 3486711 3305816 3178075 2990824 2908309 2912234 2859024 2933897 3010017 3094064 3143292 3193318
19282C193318N0211P5095j0144Q6850J13970J19435L5410n2933O5040l6325L4694
$$ 3193318 3243529 3318624 3308480 3395330 3509300 3628735 3664145 3611212 3676252 3639927 3674621
19271C674621m1190p5350J3440M4863K0278Q1742J36234j15900P1145J47059N8024
$$ 3674621 3633431 3558081 3571521 3616384 3636662 3718404 3854638 3738738 3809883 3956942 4014966
19260D014966k1132l7223R74l8430k8087O0038J23994R0826J23540J11083j19055
$$ 4014966 3993834 3956611 3957585 3919155 3891068 3951106 4075100 4165926 4289466 4400549 4281494
19249D281494m3852p2754M6237J34345K03773L6950P0444J12699N3977Q1488M4068
$$ 4281494 4237642 4164888 4211125 4345470 4549243 4586193 4656637 4769336 4823313 4904801 4948869
19238D948869J36173J93866J09520J42809K03562P6333m752P4494J39730K82667
$$ 4948869 5085042 5278908 5388428 5531237 5734799 5811132 5806380 5880874 6020604 6303271
19228F303271K76476L43921J28130J78045L32836K64422L24259M67752M56816
$$ 6303271 6579747 6923668 7051798 7229843 7562679 7827101 8151360 8619112 9075928
19219I075928M67457O27094N80283N03760N78142P02854Q00678P05857J000313
$$ 9075928 9543385 10170479 10750762 11254522 11832664 12535518 13336196 14042053 15042366
19210A5042366J113312J137538J168938J373243J562378J888604K249712K744605
$$ 15042366 16155678 17293216 18462154 19835397 21397775 23286379 25536091 28280696
19202B8280696L165458L958846M741718N678934P087363Q858669J1242181J4825153
$$ 28280696 31446154 35405000 40146718 45825652 52913015 61771684 73013865 87839018
19194H7839018K0362150K8362972L7676391M2957722L9422081L3451522K5934522
$$ 87839018 108201168 136564140 174240531 217198253 256620334 290071856 316006378
19187C16006378J0930526K937463Q138754J2396112Q213213M685918J826510p682001
$$ 316006378 326936904 329874367 338013121 350409233 358622446 363308364 365134874 357452873
19179C57452873j0330899l73837Q195833P804820O855569M790503n598100r872162
$$ 357452873 347121974 346748137 354943970 362748790 369604359 374394862 368796762 358924600
19171C58924600j841361K769161n631871j3842989k0122814l4663715m5000827
$$ 358924600 357083239 359852400 354220529 340377540 320254726 285591011 240590184
19164B40590184m3800062l8950690l2253437k4259985j7533053j2735166r567907
$$ 240590184 196790122 157839432 125585995 101326010 83792957 71057791 61489884
19157F1489884p382012o049981n158489m172513l501292k890030k504900k264544
$$ 61489884 54107872 48057891 42899402 38726889 35225597 32335567 29830667 27566123
19149B7566123j922309j618193j610965j537511j275053j109249j070387j085097
$$ 27566123 25643814 24025621 22414656 20877145 19602092 18492843 17422456 16337359
19141A6337359j059391q70896p99820p77069o95884o79092m57203l52433l91304
$$ 16337359 15277968 14407072 13607252 12830183 12134299 11455207 10998004 10645571 10254267
19132A0254267l65461k94901k43781k89500k28569k75167p3969m3924k52727k61952
$$ 10254267 9888806 9593905 9350124 9060624 8832055 8556888 8482919 8438995 8186268 7924316
19122G924316k84967l46234l04338j65051j85442l9304N9835j11010j17030r2382
$$ 7924316 7639349 7293115 6988777 6823726 6638284 6598980 6658815 6547805 6430775 6338393
19112F338393P4663J3863k06689n431n9674j60451L026l4876k6546k6789n3801
$$ 6338393 6413056 6426919 6220230 6214799 6155125 5994674 5997700 5962824 5936278 5909489 5855688
19101E855688K4168l9524j01362J22439J29090J20026L2980J37190K03067J26698
$$ 5855688 5879856 5840332 5738970 5861409 5990499 6110525 6143505 6280695 6483762 6610460
19091F610460Q1436K28792N03489N12073M46291L90292N73294O26977Q04398R21794
$$ 6610460 6691896 6920688 7424177 7936250 8382541 8772833 9346127 9973104 10777502 11699296
19081A1699296R90037J158506J305637J320556J373809J439709J540423J595329
$$ 11699296 12689333 13847839 15153476 16474032 17847841 19287550 20827973 22423302
19073B2423302J473365J298636J101736J004962P90343M12047K52081j69439l86986
$$ 22423302 23896667 25195303 26297039 27302001 28092344 28504391 28756472 28587033 28200047
19064B8200047o51378r48007j079051j119835j206222j360624j467559j411223
$$ 28200047 27548669 26600662 25521611 24401776 23195554 21834930 20367371 18956148
19056A8956148j376721j322135j170389r38573p48823o15016n42466m37930m24342
$$ 18956148 17579427 16257292 15086903 14148330 13399507 12784491 12242025 11804095 11379753
19047A1379753l80909r2726q8909r8016k5133K0806K39512L84366K98190M02134
$$ 11379753 10998844 10906118 10817209 10719193 10694060 10714866 10954378 11338744 11636934 12039068
19037A2039068O29534Q56358J037015J080358J362872J571945J653491J547222
$$ 12039068 12668602 13524960 14561975 15642333 17005205 18577150 20230641 21777863
19029B1777863J527516J494373J384354J392640J322631J068791O90728L95690
$$ 21777863 23305379 24799752 26184106 27576746 28899377 29968168 30658896 31054586
19021C1054586N9302k60008n02903q13027j127080j303779j300283j407512j624095
$$ 31054586 31113888 30853880 30350977 29537950 28410870 27107091 25806808 24399296 22775201
19012B2775201j647824j544192j605072j506897j446124j234337j008882r98463
$$ 22775201 21127377 19583185 17978113 16471216 15025092 13790755 12781873 11783410
19004A1783410q37866p00132n62686n66115n25096m68598l24247j33946l06479
$$ 11783410 10945544 10245412 9682726 9116611 8591515 8122917 7798670 7664724 7358245
18995G358245m48324j49215j26001r3741j16465q5838j11870p2037P168q7225
$$ 7358245 6909921 6760706 6634705 6540964 6424499 6338661 6226791 6154754 6161922 6074697
18985F074697j41722K6807J6547N697O3820R3690K7665J30290L77264K29737K88273
$$ 6074697 5932975 5959782 5976329 5982026 6045846 6139536 6167201 6297491 6674755 6904492 7192765
18974G192765L95662L00879K33340K77274L64919L46449M71786N36973M77411
$$ 7192765 7588427 7889306 8122646 8399920 8764839 9111288 9583074 10120047 10597458
18965A0597458N15565N60762N62491O99052O95254Q44252J128945J317574J552892
$$ 10597458 11113023 11673785 12236276 12935328 13630582 14474834 15603779 16921353 18474245
18956A8474245J818811K069228K742477L854822N254168P161982J0132320J4604998
$$ 18474245 20293056 22362284 25104761 28959583 34213751 41375733 51508053 66113051
18948F6113051K0918709K7050044K5983791J4509380M238815K704051P342329
$$ 66113051 87031760 114081804 140065595 154574975 158813790 161517841 168860170
18941A68860170J8595632L3015183L5032218J2453749j3995229k4610328k6036173
$$ 168860170 187455802 220470985 255503203 267956952 253961723 229351395 203315222
18934B03315222k0050338p368874P40708n746084j7583755k2454843k3461791
$$ 203315222 183264884 175896010 176636718 170890634 153306879 130852036 107390245
18927A07390245k1656989j7051957j2036698q300451n856816m264620k954489
$$ 107390245 85733256 68681299 56644601 48344150 42487334 38222714 35268225
18920C5268225j997046j551949j311658r76774o33741k93778L7224K67625O48984
$$ 35268225 33271179 31719230 30407572 29430798 28797057 28503279 28540503 28808128 29457112
18911B9457112Q62028J230898J421225J848015K868086M437603O287549Q984212
$$ 29457112 30319140 31550038 32971263 34819278 37687364 42124967 48412516 57396728
18903E7396728J3075728J9200048K7178828L2358344K5143335R369046K258459
$$ 57396728 70472456 89672504 116851332 149209676 174353011 183722057 185980516
18896A85980516M185617J2971407K8608603M0867943K9468815k504793k3881598
$$ 185980516 190166133 203137540 231746143 272614086 302082901 299578108 275696510
18889B75696510l0122997k8205126j6998971l620625j631660j3405304k3289381
$$ 275696510 245573513 217368387 200369416 196748791 195117131 181711827 158422446
18882A58422446k6141505k6257357k2741424j7223490j2316143q800233o442435
$$ 158422446 132280941 106023584 83282160 66058670 53742527 44942294 38499859
18875C8499859m893552l931490l035221k416114k229681j922835j458580j307626
$$ 38499859 33606307 29674817 26639596 24223482 21993801 20070966 18612386 17304760
18867A7304760j271031j075846j001437r25022q00909p89678p06620n35633o43862
$$ 17304760 16033729 14957883 13956446 13031424 12230515 11440837 10734217 10198584 9554722
18858I554722o28374m88573m94254m32596l83548l63321k93785j29726k48249
$$ 9554722 8926348 8437775 7943521 7510925 7127377 6764056 6470271 6340545 6092296
18849F092296j66154j67918j73589r6934j54416j87585j92912k10199k54654j68971
$$ 6092296 5926142 5758224 5584635 5487701 5333285 5145700 4952788 4742589 4487935 4318964
18839D318964j11765j29290r8857n5841j24434j91541o2030K0530O160o8920j66919
$$ 4318964 4207199 4077909 3979052 3923211 3798777 3607236 3545206 3565736 3571896 3502976 3336057
18828C336057j34827j71581l5353J20166J47009k5468J1132j708N9825K01966
$$ 3336057 3201230 3029649 2994296 3114462 3261471 3236003 3247135 3245427 3305252 3507218
18818C507218p8429j65318r7850K7919N2486r4r8397q3208n8310q4259N2199Q4444
$$ 3507218 3428789 3263471 3165621 3193540 3246026 3245932 3147535 3064327 3006017 2921758 2973957 3058401
18806C058401L7154L2989j03324j47529l7132Q7780q4200o570q4683l2567q1166
$$ 3058401 3095555 3128544 3025220 2877691 2840559 2928339 2844139 2837569 2752886 2720319 2639153
18795B639153p147r356q3236P4883O0469O4116q2003j29528j1453J55413L2535
$$ 2639153 2632006 2622650 2539414 2614297 2674766 2738882 2656879 2527351 2515898 2671311 2703846
18784B703846q310N2098p1707j53811K1425J03020l9331n8616N638R6195K40907
$$ 2703846 2695536 2747634 2675927 2522116 2543541 2646561 2607230 2548614 2554252 2650447 2891354
18773B891354P2017j89772K0533K10066J58924K4414O7417L5761p904n4614l9662
$$ 2891354 2963371 2773599 2794132 3004198 3163122 3187536 3254953 3290714 3282810 3228196 3188534
18762C188534R5336J08694O4653J43107J90634K45005O9040J5841N4691q8j47457
$$ 3188534 3283870 3392564 3457217 3600324 3790958 4035963 4105003 4120844 4175535 4175447 4027990
18751D027990q6016M8593l0730J18156l9104j32075r1180j25605J7565n9355r5397
$$ 4027990 3941974 3990567 3959837 4077993 4038889 3906814 3815634 3690029 3707594 3648239 3552842
18740C552842j66693r9403l6868k09183M9464K6425L5607J48430O4103j49080
$$ 3552842 3386149 3286746 3249878 3040695 3090159 3116584 3152191 3300621 3364724 3215644
18730C215644j19680O8685M3588J1055P1486O3736J00920J37025O3487J24507
$$ 3215644 3095964 3164649 3208237 3219292 3290778 3354514 3455434 3592459 3655946 3780453
18720C780453J72367J33239J16125K34746Q3943J59839L34148L80628M74523M81092
$$ 3780453 3952820 4086059 4202184 4436930 4520873 4680712 5014860 5395488 5870011 6351103
18710F351103N37499O54479M51327K83165L81072K92549K09653L15842L74304
$$ 6351103 6888602 7543081 7994408 8277573 8658645 8951194 9160847 9476689 9850993
18701I850993L64338L38640M89949P10032Q29538R20837J150673J454253J418609
$$ 9850993 10215331 10553971 11043920 11753952 12583490 13504327 14655000 16109253 17527862
18692A7527862J426769J550933J558769J664593J947165K275866K466047K835620
$$ 17527862 18954631 20505564 22064333 23728926 25676091 27951957 30418004 33253624
18684C3253624L389125M429963O168053R117844J3578579K0506775K8602352K8044351
$$ 33253624 36642749 41072712 47240765 56358609 69937188 90443963 119046315 147090666
18676A47090666J1318000l682075p277519o234675M92864J3184540K1077141Q516946
$$ 147090666 158408666 154726591 147449072 141214397 141707261 154891801 175968942 184485888
18668A84485888r154836j2037816r996115l784387P735042J1816944J66087j0604580
$$ 184485888 175331052 163293236 153297121 149512734 157247776 169064720 169230807 158626227
18660A58626227j1934914r960074k850860Q888101J4525894J548327j5494681
$$ 158626227 146691313 136731239 133880379 142768480 157294374 158842701 143348020
18653A43348020k0379465k1811147k0933734j5787276j0206545o529095m233790
$$ 143348020 122968555 101157408 80223674 64436398 54229853 47700758 43466968
18646D3466968k607403j609426q14213j98494J28892L66459P06730R68803J253562
$$ 43466968 40859565 39250139 38435926 38237432 38366324 38732783 39439513 40408316 41661878
18637D1661878J557839J938127K512333L071965M209482N996875Q774214J3562280
$$ 41661878 43219717 45157844 47670177 50742142 54951624 60948499 69722713 83284993
18629H3284993K1176349L2001308M0206153K8327698J848237r923496j1170058
$$ 83284993 104461342 136462650 176668803 204996501 206844738 196921242 185751184
18622A85751184p895164L579241J6947561J5800044j982113j2718936j1913483
$$ 185751184 177856020 181435261 198382822 214182866 212200753 199481817 187568334
18615A87568334o151256O857701K0145153J2214545j0452962j8147757j7405865
$$ 187568334 181417078 188274779 208419932 220634477 210181515 192033758 174627893
18608A74627893j3194899j007726J1866437R233550j0328436k2563963k5486947
$$ 174627893 161432994 160425268 172291705 181525255 171196819 148632856 123145909
18601A23145909k6512515k3099791j6754075j1276700p669355n403654l992415
$$ 123145909 96633394 73533603 56779528 45502828 37833473 32429819 28437404
18594B8437404l089991k669950k280632j816572j471943j356424j258907j189535
$$ 28437404 25347413 22677463 20396831 18580259 17108316 15751892 14492985 13303450
18586A3303450j112050r37435q39119o98227n02690n16527m58992m68872l92817
$$ 13303450 12191400 11253965 10414846 9716619 9213929 8697402 8238410 7769538 7376721
18577G376721l75941l24586l38438k83021l43612k71476j89227k69655k53179
$$ 7376721 7000780 6676194 6337756 6054735 5711123 5439647 5250420 4980765 4727586
18568D727586j74341j36971o1350j01665j78307j69737J4603j9242o8761q8750
$$ 4727586 4553245 4416274 4354924 4253259 4074952 3905215 3919818 3900576 3831815 3743065
18558C743065K454J3216j25806j21213j69744j4640J2097o4271n5852n5954p0567
$$ 3743065 3745519 3758735 3632929 3511716 3341972 3327332 3339429 3275158 3219306 3163352 3092785
18547C092785j39089j24269l6001r702n300m9639K0426r2239j75062p0294J43520
$$ 3092785 2953696 2829427 2793426 2783724 2778424 2728785 2749211 2656972 2481910 2411616 2555136
18536B555136J62702M1387k4899N2883p622O1447L8487J826Q2568K2065m0074
$$ 2555136 2717838 2759225 2734326 2787209 2779587 2841034 2879521 2881347 2963915 2985980 2945906
18525B945906R1936k8240p1608p6335j0018K1892P182n7467k6682L9489k7995
$$ 2945906 3037842 3009602 2937994 2861659 2851641 2873533 2880715 2823248 2796566 2836055 2808060
18514B808060P1922m3411l7133J1473j6052k68532k01580j5795K5770m569k0610
$$ 2808060 2879982 2836571 2799438 2810911 2794859 2526327 2324747 2308952 2334722 2330153 2309543
18503B309543R5410Q0474o3640N553p0857k31453q2222p0641n1948m521Q519Q7691
$$ 2309543 2404953 2485427 2421787 2427340 2356483 2125030 2042808 1972167 1920219 1915698 1924217 2011908
18491B011908l1291k3528o9729n0715O7027Q9923L6706o0275n8832K0428J11247
$$ 2011908 1980617 1957089 1887360 1836645 1903672 1993595 2030301 1970026 1911194 1931622 2042869
18480B042869J36270J9634j8961J02805m1429j50930j57800k7988O1529k1315
$$ 2042869 2179139 2198773 2179812 2282617 2241188 2090258 1932458 1904470 1965999 1944684
18470A944684J6644L828r6643m9367J64405J32634J3391j9489j73894j10511K7931
$$ 1944684 1961328 1965156 1868513 1819146 1983551 2116185 2129576 2110087 1936193 1825682 1853613
18459A853613l0778p1440m4685k4641j8093m7778m4410n174n9439O356j644j3562
$$ 1853613 1822835 1751395 1706710 1682069 1663976 1616198 1571788 1566614 1507175 1513531 1511887 1498325
18447A498325k3027o8281l3650k2920J9232N5607J71124M429J06994J95475Q0943
$$ 1498325 1475298 1407017 1373367 1350447 1369679 1425286 1596410 1600839 1707833 1903308 1984251
18436A984251p8063j15640O5076M6100j7013M0398q3359O6202J13310J7459m5046
$$ 1984251 1906188 1790548 1855624 1901724 1884711 1925109 1841750 1907952 2021262 2038721 1993675
18425A993675q0867j75267q5594O8692J16170k8483j8875j09391j28751j984r1078
$$ 1993675 1912808 1737541 1651947 1720639 1836809 1808326 1789451 1680060 1551309 1549325 1458247
18414A458247m3291K0972n852j29669j4594O9619O9696J9058K7566r601J37527
$$ 1458247 1414956 1435928 1430076 1300407 1285813 1355432 1425128 1444186 1471752 1462151 1599678
18403A599678L1876O8569K8003K4981j16130P4297K24407n984k5100J0013J31031
$$ 1599678 1631554 1700123 1728126 1753107 1636977 1711274 1935681 1929697 1904597 1914610 2045641
18392B045641J67089J02939O4073J66414O6730j14J3741k8718O8972K17197K70123
$$ 2045641 2212730 2315669 2379742 2546156 2612886 2612772 2626513 2597795 2666767 2883964 3154087
18381C154087l652n8042j15618j48995O1488J5102j760q3935r8085n6402P9125
$$ 3154087 3150435 3092393 2976775 2827780 2889268 2904370 2902610 2818675 2720590 2664188 2743313
18370B743313m0973j87989j35438j54619j26361o1333q3555j44406j10953Q0099
$$ 2743313 2702340 2514351 2378913 2224294 2097933 2036600 1953045 1808639 1697686 1777785
18360A777785J51018Q5992R9008k5017k0322J36625P8204J356P1848J27993J28808
$$ 1777785 1928803 2014795 2113803 2088786 2068464 2205089 2283293 2284649 2356497 2484490 2613298
18349B613298J04618J95609J87935R9006R5851K12373J49357K73428L52333K24417
$$ 2613298 2717916 2913525 3101460 3200466 3296317 3508690 3658047 3931475 4283808 4508225
18339D508225L16375L21479N89406O04541O39146P52167P86038R81457J298612
$$ 4508225 4824600 5146079 5735485 6340026 6979172 7731339 8517377 9498834 10797446
18330A0797446J432296J683619J922364K033359J949792J679614J175599O27401
$$ 10797446 12229742 13913361 15835725 17869084 19818876 21498490 22674089 23301490
18322B3301490N9898n87356j076593j490477j540355j768020j727154j568891
$$ 23301490 23361388 22774032 21697439 20206962 18666607 16898587 15171433 13602542
18314A3602542j424466j033707r61893p48083o67122o13223l99972k14844j79522
$$ 13602542 12178076 11144369 10182476 9434393 8767271 8154048 7754076 7539232 7359710
18305G359710j39826k37552p5923m5106j14140j78087n1366J16581L13714L08898
$$ 7359710 7219884 6982332 6906409 6861303 6747163 6569076 6517710 6634291 6948005 7256903
18295G256903L41012L53773M33148L51422N83238O93650O36826Q31368R79782
$$ 7256903 7597915 7951688 8384836 8736258 9319496 10013146 10649972 11481340 12461122
18286A2461122J285502J606376J776933J985055K138789K516603K735515K864076
$$ 12461122 13746624 15353000 17129933 19114988 21253777 23770380 26505895 29369971
18278B9369971K784207K337595J699376R41345K17311o43521j297020j703057
$$ 29369971 32154178 34491773 36191149 37132494 37349805 36706284 35409264 33706207
18270C3706207k135284k373000k104304j949454j680566j454606j221437j009873
$$ 33706207 31570923 29197923 27093619 25144165 23463599 22008993 20787556 19777683
18262A9777683q17198o80951m76049j76443L2281K82902N76703R86687J284678
$$ 19777683 18960485 18279534 17803485 17627042 17659323 17942225 18518928 19505615 20790293
18253B0790293J982637K713562L790553N460130P595767J1192798J6914245K6069678
$$ 20790293 22772930 25486492 29277045 34737175 42332942 53525740 70439985 96509663
18245I6509663L9448785N1368558M6064768K8172952J5683327q691947l6396884
$$ 96509663 135958448 187327006 233391774 261564726 277248053 268556106 232159222
18238B32159222m3234121m0399459l5259784k6396174j7531721j1227021p103813
$$ 232159222 188925101 148525642 113265858 86869684 69337963 58110942 51007129
18231E1007129m582605l087284k131055j567855j440975j514272j580037j645643
$$ 51007129 46424524 43337240 41206185 39638330 38197355 36683083 35103046 33457403
18223C3457403j792725j728055j659934j466526j222497j183883j014558p41464
$$ 33457403 31664678 29936623 28276689 26810163 25587666 24403783 23389225 22647761
18215B2647761m93501m13678n2528J66597L56282Q05027J333929J631109K144692
$$ 22647761 22154260 21740582 21688054 21854651 22210933 23015960 24349889 25980998 28125690
18206B8125690K747217L595446M889922O797657R894116J4333794K1332973L2415684
$$ 28125690 30872907 34468353 39358275 46155932 56050048 70383842 91716815 124132499
18198A24132499M6862420N5525849M8953833M4457545M2271102J9782946q322213
$$ 124132499 170994919 226520768 275474601 319932146 362203248 381986194 373663981
18191C73663981k0383159k9600014m7691676n4217994m7428012m0087236l2072358
$$ 373663981 353280822 323680808 275989132 221771138 174343126 134255890 102183532
18184A02183532k2878828j5521955j0893891p864525n772177m470625l689408
$$ 102183532 79304704 63782749 52888858 45024333 39252156 34781531 31092123
18177C1092123k953184k359872j921218j723281j340194j049474r09192q60893
$$ 31092123 28138939 25779067 23857849 22134568 20794374 19744900 18835708 17974815
18169A7974815p47409o69989m42186l96650n00626l64815o4477J31363K77681
$$ 17974815 17227406 16557417 16115231 15718581 15217955 14853140 14788663 14920026 15197707
18160A5197707N12919O10253Q10263J032508J345462J856757K532154L371071
$$ 15197707 15710626 16320879 17131142 18163650 19509112 21365869 23898023 27269094
18152B7269094M972766P440624J1401497J7800184K7287425L6562926L3775484
$$ 27269094 32241860 39682484 51083981 68884165 96171590 132734516 166510000
18145A66510000K0367142J1826478n198081k7022239l2389964l0012118k6626642
$$ 166510000 186877142 198703620 193505539 166483300 134093336 104081218 77454576
18138G7454576k0343886j3608390r029626o161652m328973l312809k553901j869309
$$ 77454576 57110690 43502300 34472674 28311022 23982049 20669240 18115339 16246030
18130A6246030j347453j139618j010948r80901p38281n40764o08666n28636m53755
$$ 16246030 14898577 13758959 12748011 11767110 11028829 10488065 9879399 9350763 8897008
18121H897008n36851n46074n40895m59420l69942k42689k91082k39194j51958
$$ 8897008 8360157 7814083 7273188 6813768 6443826 6201137 5910055 5670861 5518903
18112E518903j49155j93661j75239k16460j86005n7465k83772k82491j50282j32361
$$ 5518903 5369748 5176087 5000848 4784388 4598383 4540918 4257146 3974655 3824373 3692012
18102C692012q7994j12309r9585M1826R9165p5705k04773j74717j75713k12205
$$ 3692012 3604018 3491709 3392124 3433950 3533115 3457410 3252637 3077920 2902207 2690002
18092B690002j36809o2026l8094j1093k9696p0201k5216o5359j0116o4620q3663
$$ 2690002 2553193 2491167 2453073 2441980 2412284 2342083 2316867 2251508 2241392 2176772 2093109
18081B093109j5890P9217O9404L8773L8656j34793o0955N8700n864m3637P368
$$ 2093109 2077219 2156436 2225840 2264613 2303269 2168476 2107521 2166221 2160357 2116720 2124088
18070B124088Q816p6546q6107L0590k2868m2597k42793j99453n9391j2833j80041
$$ 2124088 2132904 2056358 1970251 2000841 1977973 1935376 1692583 1493130 1433739 1420906 1240865
18059A240865j13474l2440M35p0608j1496J301Q2799l2139q9330q7554q655P2193
$$ 1240865 1127391 1094951 1095386 1024778 1013282 1014583 1097382 1065243 975913 888359 879704 951897
18047I51897n2589L4458M321j22433j48221p17j9345Q3583n0940N1500Q4135Q2870
$$ 951897 899308 933766 938087 815654 667433 666716 647371 730954 680014 731514 815649 898519
18035H98519L871P4131j47765j47343K472R1727K6311l2128J15575R9362k3886
$$ 898519 902390 976521 828756 681413 683885 775612 801923 769795 885370 984732 960846
18024I60846K6764p815N8157J31588j07916j10895J342l6413r7519j39979p8415
$$ 960846 987610 979795 1037952 1169540 1061624 950729 952071 915658 818139 678160 599745
18013E99745n6939M3291r111r1045j49529o9666J3651J54242J46430L2871J8510
$$ 599745 542806 586097 576986 485941 336412 266746 280397 434639 581069 613940 632450
18002F32450j181o7274l8145N6736P052r8909J2433L5349n366n933k788n3393
$$ 632450 631269 563995 525850 582586 589638 490729 503162 538511 533145 527212 524424 471031
17990D71031o398k9447R4972j2135n3507j01187K5915M7770J20220J20438O6190
$$ 471031 464633 435186 530158 518023 464516 363329 389244 437014 557234 677672 743862
17979G43862l5554j48923q1643L45L3314p8812m0369o7045o5653J7197J33493
$$ 743862 708308 559385 477742 478087 511401 432589 392220 325175 259522 276719 410212
17968D10212J13168M8624O7932n2616n1609N125Q348m1103k6247K3027Q5185o5901
$$ 410212 523380 572004 639936 587320 535711 540836 549184 508081 481834 504861 590046 524145
17956E24145n1415o2314o3724J04384O7167j0323m7160P8753R936l3742M9112
$$ 524145 472730 410416 346692 451076 518243 507920 460760 539513 549449 515707 564819
17945E64819j46144j24514k2300O6732L9896o8439L742m9843k3824K04014O2262
$$ 564819 418675 294161 271861 338593 378489 310050 313792 263949 240125 444139 506401
17934E06401j01671M2929p6482k6529n6129J9948O568K9398J3528m5497j59554
$$ 506401 404730 447659 371177 344648 288519 308467 315035 344433 357961 312464 152910
17923A52910m7835O7964R3858k1703q655O5659q167R3797R4153j9475p7840m7407
$$ 152910 105075 173039 266897 245194 236539 302198 294031 387828 481981 462506 384666 337259
17911C37259L4473p988m7684k497j01970L5597M2293Q3199N1918r433K0319Q770
$$ 337259 371732 363744 316060 313563 211593 247190 289483 372682 424600 415167 435486 444256
17899D44256j69921L1666O20j54058j06749q678K2778K5795M1506J4912Q0253
$$ 444256 274335 306001 306621 152563 45814 37136 59914 85709 127215 142127 222380
17888B22380J34957K8107j00624J69N6126Q097R7853O4086K7325j12468o2200
$$ 222380 357337 385444 284820 284989 341115 349212 447065 511151 538476 426008 363808
17877C63808k8516j06391k1314j9728r0198J1245P3071L2705m5847j1288k0338
$$ 363808 335292 228901 207587 187859 97661 108906 181977 214682 168835 157547 137209
17866A37209N698R0272j9391m1460N6511p7604O1251k3616j45785o0526J10055
$$ 137209 142907 233179 213788 172328 228839 151235 212486 188870 43085 -17441 92614
17855I2614L5071l1052M6305J05760M9068j8485j27371j2057P5071j36253m2881
$$ 92614 127685 96633 142938 248698 297766 279281 151910 139853 214924 78671 35790
17844C5790N7155P1322L3828N3540N5910l8814l9800n0576k1306j6139k5254M2787
$$ 35790 92945 164267 198095 251635 307545 268731 228931 178355 157049 140910 115656 158443
17832A58443Q5981j06494k4370R2338K7149M4302J073L5793r8061k7242o7272
$$ 158443 244424 137930 113560 205898 233047 277349 278422 314215 216154 188912 121640
17821A21640l9654J751p4487k1209k0508k7079N6752P8445n8964P6658Q7296m9430
$$ 121640 81986 83737 9250 -11959 -32467 -59546 -2794 75651 16687 93345 180641 131211
17809A31211N9373J68547L0856o8278j11413j48559O6182K8645J3498O0671N11
$$ 131211 190584 359131 389987 321709 210296 61737 127919 156564 170062 230733 231244
17798B31244K8093N7610K451l2187j30169K3787N9892o2992j15602j76865j7614
$$ 231244 259337 316947 319398 287211 157042 180829 240721 177729 62127 -114738 -132352
17787a32352J36174M9255o1613O427J5368p0749M8272N3183q1423K4399L1261
$$ -132352 3822 53077 -8536 -2109 13259 -57490 -9218 43965 -37458 -13059 18202
17776A8202J36085M5539L6662l6433J3915l5538N4260J0368K5976M7594J06635
$$ 18202 154287 199826 236488 200055 213970 178432 232692 243060 269036 316630 423265
17765D23265N4660Q788m6525n3020M0950m4763n0362l5845O9147P8938K5442j69979
$$ 423265 477925 486713 440188 387168 428118 383355 332993 297148 366295 445233 470675 300696
17753C00696q2125K7246j5639j30690j26154k8279J61294m1134m2164k7174l0877
$$ 300696 218571 245817 230178 99488 -26666 -54945 106349 65215 23051 -4123 -35000
17742c5000k5441M0151j0117L1289J93455J93003j981l0403J05068J30309P0843
$$ -35000 -60441 -20290 -30407 882 194337 387340 385359 354956 460024 590333 661176
17731F61176J60745Q8356J20157J16560L4268l6097j74321Q638j01065j98129
$$ 661176 821921 910277 1030434 1146994 1181262 1145165 970844 979482 878417 680288
17721F80288m8015p8141j88062q3236O2019j822Q4230j3527n1001l0637K4716
$$ 680288 632273 554132 366070 282834 344853 343031 427261 413734 362733 332096 356812
17710C56812m0733j05967K067K1437J157j22172J2830L1440O8469r0842l0693
$$ 356812 316079 210112 212179 233616 234773 112601 125431 156871 225340 134498 103805
17699A03805J42367j2520J02958J7323r7613q8838Q1929J05437R7136R0454O3291
$$ 103805 246172 233652 336610 353933 256320 167482 249411 354848 451984 542438 605729
17688F05729q7411L8286j8383K23930J67254J35737K53809K09482J17941M3515
$$ 605729 518318 556604 538221 762151 929405 1065142 1318951 1528433 1646374 1689889
17678A689889K1039o6497p0146n4901j22250l41472k50302n4621r6653j61276
$$ 1689889 1710928 1644431 1574285 1519384 1397134 1055662 805360 750739 654086 492810
17668D92810j46316m3830N2702j6885L2331J0058J0569q5854N987j25404j73165
$$ 492810 346494 302664 355366 338481 370812 380870 391439 305585 311572 186168 13003
17657A3003r0896P9767K9793R2608O1522o8951R5113P2677p1364m3692q1833j05146
$$ 13003 -77893 1874 31667 124275 185797 116846 211959 284636 213272 169580 87747 -17399
17645a7399K8770J91512N9047k5006n057J21944N2321j8680K5872L4885L7624
$$ -17399 11371 202883 261930 236924 231867 353811 406132 387452 413324 448209 485833
17634D85833J20979Q4810m0979L1436L3515J03382k3731j05456j61410o2760r5175
$$ 485833 606812 691622 650643 682079 715594 818976 795245 689789 528379 465619 370444
17623C70444q8305m4595K3012j6465n3676L4745p2533N1556J41675P6117j8790
$$ 370444 282139 237544 260556 244091 190415 225160 152627 204183 345858 421975 403185
17612D03185q374j12601j10933n8522j34441P0821n8471R0648J05497r1676j43667
$$ 403185 394811 282210 171277 112755 -21686 49135 -9336 81312 186809 95133 -48534
17601d8534o526J22718l1745m0400n9354P465K0965j3651j4522N8101L3533n8702
$$ -48534 -55060 67658 35913 -4487 -63841 -56376 -35411 -49062 -63584 -5483 28050 -30652
17589c0652l5620N7451J14303L9916j73870l7485J92638n4517m0748N9708r3771
$$ -30652 -66272 -8821 105482 145398 -28472 -65957 126681 72164 31416 91124 -2647
17578b647l9046J19836K5174K7404O7151q6981o4518K3291J0781j7989P4335M92
$$ -2647 -41693 78143 103317 130721 197872 110891 46373 69664 80445 62456 136791 137283
17566A37283r7282n1903L3093p2266K830Q853M2371L8872j6637j77951J5993O8876
$$ 137283 40001 -11902 21191 -51075 -48245 -39392 2979 41851 25214 -152737 -136744 -67868
17554f7868P9264J4819R8210J30545J1888k9780K0119L0920J3987j05958p0697
$$ -67868 11396 26215 124425 254970 266858 237078 257197 288117 302104 196146 125449
17543A25449K5235J02015K0782N6449K6864J5269k4633o1566k21647j06819p931
$$ 125449 150684 252699 273481 329930 356794 372063 347430 285864 64217 -42602 -50533
17532e0533N5662K7594J3029J7419n7633K1272J38N8354M4061J4175P803j8943
$$ -50533 5129 32723 45752 63171 5538 26810 26948 85302 129363 143538 151341 132398
17520A32398q7475N5394K9849J7112m8342m7510O3866k9671o0816q4393R9015
$$ 132398 44923 100317 130166 147278 98936 51426 115292 85621 24805 -59588 39427
17509C9427J46440p9547j06844k1188K2077j0081l5035Q5494R0677l7088K9083
$$ 39427 185867 106320 -524 -21712 365 -9716 -44751 40743 131420 94332 123415
17498A23415L1030J3197r2318N6250k8463r457O0660J9046L1801J07227n620j48709
$$ 123415 154445 167642 75324 131574 103111 93654 154314 173360 205161 312388 306768 158059
17486A58059m3790n2550P634j28561j21944k56k871J6219O6126N2101j02607o85
$$ 158059 114269 61719 69353 -59208 -181152 -181408 -184279 -168060 -101934 -49833 -152440 -153125
17474a53125J222J77743Q2157K1532j8349j7008K1050n0997q0666l9974J2444
$$ -153125 -151903 25840 107997 129529 111180 94172 115222 64225 -16441 -56415 -43971
17463d3971k2960j1698J8657M0366L1014l3774J3473J19471J3401m4978n1136
$$ -43971 -66931 -78629 -59972 -19606 11408 -22366 -8893 110578 123979 79001 27865
17452B7865K0379Q7919M110r559P732n0226Q0163L687p2280o5491o6690p413K8839
$$ 27865 48244 136163 140273 130714 138446 88220 168383 172070 99790 34299 -32391 -39804 -10965
17439a0965n8447M9143P5387J8968q1801p3443L882J638l1204r519Q0601M3045
$$ -10965 -69412 -20269 55118 74086 -7715 -81158 -77276 -75638 -106842 -116361 -35760 7285
17427G285O2364j9532r1088j13816l584N7465L2512J87232m7964j34793l5803
$$ 7285 69649 50117 -40971 -154787 -158371 -100906 -68394 118838 70874 -63919 -99722
17416i9722L6028N0540Q3668j6708m0414J43693O40j22820j5902p1600Q618K3862
$$ -99722 -63694 -13154 70514 53806 13392 157085 157725 34905 19003 -52597 -43979 -20117
17404b0117j700o1201J03280J05529l7453l8154l2761r1515K1302K0985p8978
$$ -20117 -21817 -83018 20262 125791 88338 50184 17423 -74092 -52790 -31805 -110783
17393a10783l9829O7736J37971N9822K0787N6505j2773M4603p8179p0752n0351
$$ -110783 -150612 -82876 55095 114917 135704 192209 179436 224039 145860 75108 24757
17382B4757r3215J3536n8685n8572L1735M1261p4212j3317O1210m7106N7002Q5144
$$ 24757 -68458 -54922 -113607 -172179 -140444 -99183 -173395 -186712 -125502 -172608 -115606 -30462
17370c0462K1276j2812L0891Q4320p8131l203O2939l5492J1636o682q1750j7736
$$ -30462 -9186 -21998 8893 93213 15082 11879 74818 39326 50962 44280 -37470 -55206
17358e5206J525m9901p0146J00614M2613o5994P2842n659L4235P3510R6560j1593
$$ -55206 -53681 -103582 -173728 -73114 -30501 -96495 -23653 -29312 4923 78433 174993 163400
17346A63400j55395j5626q2598O2412o4548l6902L7317N7132N082K2823P3377
$$ 163400 8005 -7621 -90219 -27807 -92355 -129257 -91940 -34808 -29726 -6903 66474
17335F6474o7833q1929M8319J34379J13700P7150j14801j23876r4814l4911j29139
$$ 66474 -1359 -83288 -34969 99410 213110 290260 175459 51583 -43231 -78142 -207281
17324b07281j720n0375J31304O5890Q3572k9724j0657r70r1135J16091K3422l473
$$ -207281 -209001 -259376 -128072 -62182 21390 -8334 -18991 -19961 -111096 4995 28417 24944
17312B4944j14818o2401j4199N1660J55468k6946K8874j2001r0538q9612O1487
$$ 24944 -89874 -152275 -166474 -114814 40654 13708 42582 30581 -59957 -149569 -88082
17301h8082M6822O024q724l4832J27826M5108J5412J4652L6725Q4497P1559l2844
$$ -88082 -41260 -35236 -43960 -78792 49034 94142 109554 124206 160931 245428 316987 284143
17289B84143k20142j16360Q7035R3556L628o6968J7620N5180n7352q5709o962
$$ 284143 64001 -52359 34676 128232 131860 64892 82512 137692 80340 -5369 -12331
17278a2331P2654J7279p20j8516p5246p1733m4996L9334O9136k3819m7361R625
$$ -12331 60323 77602 76882 58366 -16880 -88613 -133609 -94275 -25139 -48958 -96319 -86694
17266h6694J60140J6605o6657J33082O1793j30618j04920j65612l4963r426N4517
$$ -86694 73446 90051 23394 156476 218269 87651 -17269 -182881 -217844 -227270 -172753
17255a72753R6938M8588p0081r8105J18283J71834J5866R711l0775J6839j52005
$$ -172753 -75815 -27227 -97308 -195413 -77130 94704 110570 120281 89506 106345 -45660
17244d5660j1308m1207J3293P7714j45460n3393J2805N0809J70145O1279R7679
$$ -45660 -56968 -98175 -84882 -7168 -152628 -206021 -193216 -142407 27738 89017 186696
17233A86696R4504o048q4102L5877P018j23365p7462j43421o0523j9350O5964
$$ 186696 281200 275152 191050 226927 233945 110580 33118 -110303 -170826 -190176 -124212
17222a24212M8890N8137J14067k3819K0176Q959K0328r291k08914p9710O3126
$$ -124212 -75322 -17185 96882 73063 93239 102198 122526 113235 -95679 -175389 -112263
17211a12263J08486O211l2426r5692J763k7443L0704R0772J10007J929p0562j4626
$$ -112263 -3777 2434 -29992 -125684 -123921 -151364 -120660 -29888 80119 82048 11486 -3140
17199c140L4050O3318O4006K9145j48384M800j1163j3625j29119j29844J05167
$$ -3140 30910 94228 158234 187379 38995 43795 32632 19007 -110112 -239956 -134789
17188a34789J73526P1136j14905p9832k7898K085R007P8148J74566L837K2165
$$ -134789 38737 109873 -5032 -84864 -112762 -110677 -101670 -23522 151044 154881 177046
17177A77046N628K8763K7334q7358k02218O9103J06751L6623N0756r1391L5777
$$ 177046 182674 211437 238771 151413 -50805 18298 125049 161672 212428 121037 156814
17166A56814n6625m9885n1800r2621J31164O4404j567M1191k2116l5174k151p9379
$$ 156814 100189 50304 -1496 -94117 37047 101451 99884 141075 118959 83785 81634 2255
17154B255j23047M3166j9354J03239M5402K700O094j7183P2953J3493j857N6444
$$ 2255 -120792 -77626 -96980 6259 51661 54361 60455 43272 116225 129718 127861 184305
17142A84305n2296j37340j7418J9934J13225k4325q0612m9633j10278o2153l7063
$$ 184305 132009 -5331 -22749 -2815 110410 86085 5473 -44160 -154438 -216591 -253654
17131b53654R0673J81799k1337n2329Q5681k5431N5086r2230k0701j6134l1265
$$ -253654 -162981 18818 -2519 -54848 30833 5402 60488 -31742 -52443 -68577 -99842
17120i9842j1804O7158J49717L1211k2553J2311j3915o2281m5257K8418K8582
$$ -99842 -111646 -44488 105229 136440 113887 126198 112283 50002 4745 33163 61745
17109F1745r6833N1785L9614R2382J25968r728o3539j09038k0335L0514N9026
$$ 61745 -35088 16697 56311 148693 274661 264933 201394 92356 72021 102535 161561
17098A61561J03534K8936m0085q4851J7984J9318j1553k02963q4977m8113P7534
$$ 161561 265095 294031 253946 169095 187079 206397 194844 -8119 -93096 -141209 -63675
17087f3675O6821L5252J0415L9029j7175l7109n0443l5620P2397M5099K5021q0156
$$ -63675 3146 38398 48813 87842 70667 33558 -16885 -52505 19892 64991 90012 9856
17075I856j16496j46895P3592Q9480j3282J23866J8532N5149O399j0513M0928
$$ 9856 -106640 -253535 -179943 -90463 -103745 20121 38653 93802 100201 89688 130616
17064A30616l435j05685p2171Q1464R1268K4078J42105r8803L1971N7953j65267
$$ 130616 127181 21496 -50675 30789 122057 146135 288240 189437 221408 279361 114094
17053A14094M8231o6143o834O8884P6034M7916j45261m7949J31053l4607o3529
$$ 114094 162325 96182 89348 158232 234266 282182 136921 88972 220025 185418 121889
17042A21889M3804M4600r270k5751Q4531j0495o7650N6261Q9415K9574k7198j32477
$$ 121889 165693 210293 201023 175272 259803 249308 181658 237919 327334 356908 329710 197233
17030A97233m0840Q2363k630L7625N6j20136p4473o9521l9941J6165j6215k0106
$$ 197233 156393 238756 236126 273751 273807 153671 79198 9677 -30264 -14099 -30314 -50420
17018e0420l1228Q8608j076m7840J8670J75072j0928j32285p5752k503O7059m5491
$$ -50420 -81648 6960 5884 -41956 -23286 151786 140858 8573 -67179 -69682 -2623 -48114
17006d8114j7669k4171N6002Q4742J5274k1454q7842n8174l7961P7141P527k9816
$$ -48114 -65783 -89954 -33952 50790 66064 44610 -43232 -101406 -139367 -62226 -54699 -84515
16994h4515J9635l4933j906P2194P676J08505N9277J3553J7409j6001n1731n6687
$$ -84515 -64880 -99813 -101719 -29525 -21849 86656 145933 159486 176895 160894 109163 52476
16982E2476L4569l8229r0057m5835J48178J0316q2705O5M1150O1410j10665M7498
$$ 52476 87045 48816 -41241 -87076 61102 71418 -11287 -11222 29928 91338 -19327 28171
16970B8171L5797r5289o668M427k6459j6121O0721M8354P5025J33863m5134J0146
$$ 28171 63968 -31321 -37989 -33562 -60021 -76142 -15421 32933 107958 241821 196687 206833
16958B06833k5667p3778m2260l4472k9198l3861n4060Q0595N6787P3003Q4072
$$ 206833 181166 107388 65128 30656 1458 -32403 -86463 -5868 50919 123922 207994
16947B07994j4688l6271k5668j59671k5480N0489n6435p0252O6538J24679j7643
$$ 207994 193306 157035 131367 -28304 -53784 -3295 -59730 -129982 -63444 61235 43592
16936D3592j11277l4831N6655J59081P0918j3865l4256j9826q9590J4661k0593
$$ 43592 -67685 -102516 -45861 113220 184138 170273 136017 116191 26601 41262 20669
16925B0669n1588J79936n2786j92550n1769R0270M3122O8368M4273R8731N9673
$$ 20669 -30919 149017 96231 -96319 -148088 -57818 -14696 53672 97945 196676 256349
16914B56349L1647o4248j92478J59303J83391j25349j71531n0684K1215j3423
$$ 256349 287996 223748 31270 190573 373964 248615 77084 26400 47615 34192
16904C4192o0893l0345M8890j32488r9938J83515M6025j2481j22516k3896M5062
$$ 34192 -26701 -57046 -8156 -140644 -240582 -57067 -11042 -23523 -146039 -169935 -124873
16893a24873M7728J7915O3593J56890M3080o4749L1305p9360k04299j49218J09597
$$ -124873 -77145 -59230 4363 161253 204333 139584 170889 91529 -112770 -261988 -152391
16882a52391J32431L3321l7689K7986J27466r817r8082j4766J20222m6543p2444
$$ -152391 -19960 13361 -24328 3658 131124 121307 23225 8459 128681 82138 9694
16871I694N1256j63963L3100J46729L793n3064L3771M9265Q7541r8720L4474l0287
$$ 9694 60950 -103013 -69913 76816 80609 27545 61316 110581 198122 99402 133876 103589
16859A03589o0958N4279Q6590m6110l1532Q357o4976Q418L0859j9138n9013R4685
$$ 103589 42631 96910 183500 137390 105858 114215 49239 57657 88516 69378 10365 105050
16847A05050Q8971j01348q7069k9036O824o1682J05889j94324k8447J46860Q0491
$$ 105050 194021 92673 5604 -23432 -16608 -78290 27599 -166725 -195172 -48312 32179
16836C2179K2581j0236k9257j5708O1197o5680r0107J18334L5305r24k6607M8788
$$ 32179 54760 44524 15267 -441 60756 -4924 -95031 23303 58608 57684 31077 79865
16824G9865l3391o6273l2689K1751P7826n7029k9405l7777K6829J4564J00691
$$ 79865 46474 -19799 -52488 -30737 47089 -9940 -39345 -77122 -50293 -35729 64962
16813F4962p682r5034N3750N8057r0637P8864K4646r4359q3955L9729O8517J5829
$$ 64962 57280 -37754 15996 74053 -16584 62280 86926 -7433 -91388 -51659 16858 32687
16801C2687p678m0116J7408q5681M3830j07265J0864J26629q825p7801j2581j46236
$$ 32687 25009 -15107 2301 -83380 -39550 -146815 -135951 -9322 -18147 -95948 -108529 -254765
16789b54765J15794R1303n596N5016o935J4842J09007Q297j2123l7786j05755
$$ -254765 -138971 -47668 -53264 1752 -5183 9659 118666 126963 114840 77054 -28701
16778b8701l4652J0722m8499P4510k0165q3753J66471J17161K4009r6771n4476
$$ -28701 -63353 -52631 -101130 -26620 -46785 -130538 35933 153094 177103 80332 25856
16767B5856N6110p5119m4281j7840Q5313P2155M0864j15250K164N2277o4210K7062
$$ 25856 81966 6847 -37434 -55274 30039 102194 143058 27808 29972 82249 18039 45101
16755D5101k482p9075P7222J1639Q92O461j28436o2993J02656J59811j2826o8235
$$ 45101 42619 -36456 40766 52405 53297 59758 -68678 -131671 -29015 130796 117970 49735
16743D9735l3831N8401Q9128n0193q8585r3043L0955N1819k2695Q0155L3078m6279
$$ 49735 15904 74305 163433 113240 24655 -68388 -37433 14386 -8309 71846 104924 58645
16731E8645k319R245L2532q7642l8549m4127O2789J02766n8454j62739k7025m0241
$$ 58645 56326 65571 98103 10461 -28088 -72215 -9426 93340 34886 -127853 -154878 -195119
16719a95119J12053R7906M2262j6040j2996M2848K6139l7049j15635J07179M6182
$$ -195119 -83066 14840 57102 41062 28066 70914 97053 60004 -55631 51548 97730
16708I7730m210o8970r4812j27606M2031J27452n600p5723o2081M4825O5637J5261
$$ 97730 93520 24550 -70262 -197868 -155837 -28385 -33985 -109708 -171789 -126964 -61327 -46066
16696d6066m7090l8865O4262R199M7014N23n1949p6689Q2055J21670j3271q5254
$$ -46066 -93156 -132021 -67759 -58560 -11546 -11023 -62972 -139661 -57606 64064 50793 -34461
16684c4461l5179N1281M7215l9143J24364M1738m0416p2285p2063J29796m5356
$$ -34461 -69640 -18359 28856 -10287 114077 155815 115399 43114 -28949 100847 55491
16673E5491j11402n4175K7740L2069N2273L0254J9706k5144J0035m8661j40720
$$ 55491 -55911 -110086 -82346 -50277 1996 32250 51956 26812 36847 -11814 -152534
16662a52534m8252M1024L3968L8277K8125r9267J2830O7029J20379O1043l3229
$$ -152534 -200786 -159762 -125794 -87517 -59392 -158659 -145829 -78800 41579 102622 69393
16651F9393L8635k0734Q395j00699r5393n3974l8598J4937L5043Q7550N4005n8301
$$ 69393 108028 87294 95689 -5010 -100403 -154377 -192975 -178038 -142995 -55445 -1440 -59741
16639e9741q1465R5905J12525R431j40438k9637J458P3824j14434p6347J6425
$$ -59741 -141206 -45301 67224 76655 -63783 -93420 -91962 -18138 -132572 -208919 -192494
16628a92494J14987k9937p4193J37301J00566J3294m2045n6319n210j4159n0985
$$ -192494 -77507 -107444 -181637 -44336 56230 69524 27479 -28840 -34050 -48209 -99194
16617i9194j3987J87230N8011j6868j15738o2195l87M4046Q5888l2788p3148p4306
$$ -99194 -113181 74049 132060 115192 -546 -62741 -63128 -19082 66806 34018 -39130 -113436
16605a13436l173N3362r758r4574j9750R5042R5675O6907k3057L2130j11557j21361
$$ -113436 -116609 -63247 -73005 -167579 -187329 -92287 3388 70295 47238 79368 -32189 -153550
16593a53550Q0971K7593J45714J19606o3315p2340o7769n3398J8430n6007k4302
$$ -153550 -72579 -44986 100728 220334 157019 84679 16910 -36488 -18058 -74065 -98367
16582i8367j913k5705Q3111R5074K4188R505M439o1748q8480p333q229l2501O7277
$$ -98367 -100280 -125985 -42874 52200 76388 85893 90332 28584 -59896 -67229 -75458 -107959 -40682
16569d0682J51626M9240p1606l5321l3992j2839L0839j59083j10999J4530R2805
$$ -40682 110944 160184 88578 53257 19265 6426 37265 -121818 -232817 -218287 -125482
16558a25482J61813n7803p2538m4905L5971J29200R4046L0540L2112o8506j85255
$$ -125482 36331 -21472 -94010 -138915 -102944 26256 120302 150842 182954 114448 -70807
16547g0807j06250J521j7255k1390m5241J74127J55661k7199p8885O5889N4821
$$ -70807 -177057 -175536 -192791 -214181 -259422 -85295 70366 43167 -35718 30171 84992
16536H4992Q0156p3957j9306p5558n0440n6437m908N2173j3683k1254o2529L6011
$$ 84992 165148 91191 71885 -3673 -54113 -110550 -115458 -63285 -76968 -98222 -160751 -124740
16524a24740Q1356p9975n2649Q7975N0641N168m9716l7096Q8121J9684q8493o2245
$$ -124740 -43384 -123359 -176008 -88033 -37392 -32224 -81940 -119036 -30915 -11231 -99724 -161969
16512a61969P9004N0035K6570l7762n7810o7755n7416P8119J41245J4742R6954
$$ -161969 -82965 -32930 -6360 -44122 -101932 -169687 -227103 -148984 -7739 7003 103957
16501A03957Q085m041n6946k1182k7613j1582P2783j3350L7386p619L5633j0631
$$ 103957 112042 108001 51055 29873 2260 -9322 63461 50111 87497 79878 115511 104880
16489A04880n0842q7709r7067o8589K6939R4811L4989N5873P2339L3835M4029
$$ 104880 54038 -33671 -130738 -199327 -172388 -77577 -42588 13285 85624 119459 163488
16478A63488j16668k12014r9067O8718J29726J00797O9123n9611l3698L0223N1777
$$ 163488 46820 -165194 -264261 -195543 -65817 34980 104103 44492 10794 41017 92794
16467I2794k7439j6686n2654r5973l8781M6382P0661M3323M8233R2488j54807
$$ 92794 65355 48669 -3985 -99958 -138739 -92357 -21696 21627 69860 162348 7541
16456G541p8634K9779K1004l0777P498p0841P5647P194n7235Q7693J02643j04015
$$ 7541 -71093 -41314 -20310 -51087 -43589 -114430 -38783 -31589 -88824 -1131 101512 -2503
16444b503k6897l4982j38822L390M1752R9185O8132N5944j2682j62940L6382J26993
$$ -2503 -29400 -64382 -203204 -199814 -158062 -58877 9255 65199 52517 -110423 -74041 52952
16432E2952l7193r5647p1511q6721r4005l883J11295O2829P3353R1486L825j72705
$$ 52952 15759 -79888 -151399 -238120 -332125 -336008 -224713 -161884 -88531 2955 6780 -165925
16420a65925o8825J7983J53677K4039j1039J591l9765l1674O624K2579J6916L9216
$$ -165925 -234750 -216767 -63090 -39051 -50090 -48499 -88264 -119938 -113314 -90735 -73819 -34603
16408c4603l734Q677L356K7900q8429K2875m132j6163K5817m4653j2873N2550
$$ -34603 -38337 -29660 -26304 1596 -86833 -63958 -68090 -84253 -58436 -103089 -115962 -63412
16396f3412J20339O242K8431r6127j79052j71R0061P9593N7371M2162j9494p9578
$$ -63412 56927 63169 91600 -4527 -183579 -183750 -93689 -14096 43275 85437 65943 -13635
16384a3635Q8692j6436j03665j38946N9640P3331M4312o2346m4104N4414P3652
$$ -13635 75057 58621 -45044 -183990 -124350 -51019 -6707 -69053 -113157 -58743 14909
16373A4909N0029j36615j6241J2916M0271m3302k1936n5156J32062J62023k9932
$$ 14909 64938 -71677 -87918 -75002 -34731 -78033 -99969 -155125 -23063 138960 109028
16362A09028o0377j5424m0434J5192k1959L392j08088o0369Q6982O3933M5097
$$ 109028 48651 33227 -7207 7985 -13974 -10582 -118670 -179039 -92057 -28124 16973
16351A6973l7458l8742j05610r8334J1828M3661O176q9499q8363P5603L9085J2280
$$ 16973 -20485 -59227 -164837 -263171 -251343 -207682 -201506 -291005 -379368 -303765 -264680 -252400
16339b52400J29704K3335p7989Q527O3501L3995j9394Q167K7631p7044N8205n0929
$$ -252400 -122696 -99361 -177350 -168823 -105322 -71327 -90721 -82554 -54923 -131967 -73762 -124691
16327a24691K0431m215O8151L5906p6192k462L0415P048o4868m9580J23788Q1436
$$ -124691 -104260 -108475 -40324 -4418 -80610 -83072 -52657 -45609 -110477 -160057 -36269 45167
16315D5167j0882q9920O7661N2724j08025r2898K8751J9213O4147n9756j12199
$$ 45167 34285 -55635 12026 64750 -43275 -136173 -107422 -88209 -24062 -83818 -196017
16304a96017k8218K9750L5651J06606J27267o058n5907m5473j2936k0590J15044
$$ -196017 -224235 -194485 -158834 -52228 75039 68981 13074 -32399 -45335 -65925 49119
16293D9119l2352N2190k3082o2102m8674j6813n4702l3087O5004J60910M1453
$$ 49119 16767 68957 45875 -16227 -64901 -81714 -136416 -169503 -104499 56411 97864
16282I7864l0375n9140j6707N51k9145j3846k0133L6267N1721J31377J57628j18322
$$ 97864 67489 8349 -8358 -7807 -36952 -50798 -70931 -34664 17057 148434 306062 187740
16270A87740j03635k8842r3303p9219K4422N7472l296J395K1775K2856j78754
$$ 187740 84105 55263 -38040 -117259 -92837 -35365 -38661 -37266 -15491 7365 -171389
16259a71389n0772R542N9329J31703J8412j6558K4440p8998Q4983j3091n6506
$$ -171389 -222161 -212619 -153290 -21587 -3175 -19733 4707 -74291 10692 -2399 -58905
16248e8905N22L0073J11566k0776n9473m7047O7650K3476J6465l2895m0557K1441
$$ -58905 -58383 -28310 83256 62480 3007 -44040 23610 47086 63551 30656 -9901 11540
16236A1540j02824j28440R9664J97448k1705o1474j51456o3111J5891J5013Q9137
$$ 11540 -91284 -219724 -120060 77388 55683 -5791 -157247 -220358 -204467 -189454 -100317
16225a00317N2560N4287J7167p2369o0607l5356J05162M8430O9876k839L9548
$$ -100317 -47757 6530 23697 -48672 -109279 -144635 -39473 8957 78833 75994 115542
16214A15542l2815p0485j11467j8505k7259j1885M1280L7970m2513q234M9950
$$ 115542 82727 12242 -99225 -117730 -144989 -156874 -115594 -77624 -120137 -128371 -78421
16203g8421r7005m9336J41950K3713j8087k1861O3872l6018m6604N3125N1604
$$ -78421 -175426 -224762 -82812 -59099 -77186 -99047 -35175 -71193 -117797 -64672 -13068
16192a3068L7178o645q4979P4718l5411q0085J19801M6023l9321Q0437R4333n5022
$$ -13068 24110 17465 -67514 7204 -28207 -108292 11509 57532 18211 98648 192981 137959
16180A37959n2863Q9970j24054k5457K5880j4038N1419j1615l1181p5008K2015
$$ 137959 85096 175066 51012 25555 51435 37397 88816 77201 46020 -28988 -6973
16169f973K9537l0061j00425m8762M8707J577J00775P3414k7891k7647j04532
$$ -6973 22564 -7497 -107922 -156684 -107977 -106400 -5625 67789 39898 12251 -92281
16158i2281O0053J67374K7730o5874r3663q3068M0532J15235L3249r9803rO5143
$$ -92281 -32228 135146 162876 97002 3339 -79729 -39197 76038 109287 9484 9475 74618
16146G4618n0965R709q0937j9668L2784n7679n6574L1877L7633J0514O8044l8291
$$ 74618 23653 33362 -47575 -67243 -34459 -92138 -148712 -116835 -79202 -68688 -644 -38935
16134c8935O115p7179n1387J2032J13676K4053P6780k3134J06265j3559j23303
$$ -38935 -32820 -109999 -161386 -149354 -35678 -11625 65155 42021 148286 134727 11424
16123A1424j6573J8804m9344L1598N8542K543l8104P483n9465N8099n695Q933
$$ 11424 -5149 13655 -35689 -4091 54451 56994 18890 26373 -33092 25007 19312 28245
16111B8245j9049Q797k3779N7798K5757J7698J0901l6858n887j53626p4143p2533
$$ 28245 9196 17993 -5786 52012 77769 95467 106368 69510 63623 -90003 -164146 -236679
16099b36679L9430O4941R3037K0524J9905K5689n4112j9983l1578n3739J1616
$$ -236679 -197249 -132308 -39271 -18747 1158 26847 -27265 -47248 -78826 -132565 -120949
16088a20949p2426n7111L1503J32806M8538j02184n5707J34359N5677n2264J7591
$$ -120949 -193375 -250486 -218983 -86177 -37639 -139823 -195530 -61171 -5494 -57758 -40167
16077d0167l791K629m0731O3394j8444M937L0806L3929Q653j9148j17360o8768
$$ -40167 -43958 -41329 -82060 -18666 -37110 -32173 -1367 32562 41215 22067 -95293 -164061
16065a64061J4921m1034J17221K5100r1588L1304J3454k1540O4445L0056j00792
$$ -164061 -149140 -190174 -72953 -47853 -139441 -108137 -94683 -116223 -51778 -21722 -122514
16054a22514j15350M6122K05551N9465j675o9681j47557o8397J20128L9275q9312
$$ -122514 -237864 -191742 13809 73274 71599 1918 -145639 -214036 -93908 -54633 -143945
16043a43945R3498J55710o9890j40632K7257P027J13622M2739p0917j87225Q795
$$ -143945 -50447 105263 35373 -105259 -78002 -70975 42647 85386 14469 -172756 -163961
16032a63961M6796k136Q208K8842K0718M750J18228K5411K2175L5980j46778j56991
$$ -163961 -117165 -119301 -111093 -82251 -61533 -56783 61445 86856 109031 145011 -1767 -158758
16020a58758L880J98798K02732L5363j28705k7098j05990q0520m2442M5511P82
$$ -158758 -154878 43920 246652 282015 153310 126212 20222 -60298 -102740 -57229 -56447
16009e6447j9372j768l2313j850O3653J10980m9996r142K4759n5830j11299l6808
$$ -56447 -75819 -77587 -109900 -111750 -48097 62883 12887 3745 28504 -27326 -138625 -175433
15997a75433l4263r7271N7115R3298Q0561j0443M9788K3811l0416j27207j6296
$$ -175433 -209696 -306967 -249852 -156554 -75993 -86436 -36648 -12837 -43253 -170460 -186756
15986a86756J78324N6567Q540q1895j5792J4162p461K6517j14442p2634K2969
$$ -186756 -8432 48135 56675 -25220 -41012 -26850 -34311 -7794 -122236 -194870 -171901
15975a71901O7098K3638M070N4437l6749l4904o6508n5240o3960J24606M7917
$$ -171901 -104803 -81165 -77095 -22658 -59407 -94311 -160819 -216059 -280019 -155413 -107496
15964a07496J0304r1908J136Q2856J08256K2555j0612j3456q0339l369Q0329K4919
$$ -107496 -97192 -189100 -187964 -105108 3148 25703 15091 1635 -78704 -82073 -1744 23175
15952B3175J06063O7057l7172j66812p8700M2689n7327j04345M0711Q6940j837
$$ 23175 129238 196295 159123 -7689 -86389 -43700 -101027 -205372 -164661 -77721 -79558
15941g9558K5310m4878k0139M5375P5016P2395m3070j32305j31303k211k6136
$$ -79558 -54248 -99126 -119265 -73890 1126 73521 30451 -101854 -233157 -235368 -261504
15930b61504N5821J02990O6119P3382p2829O5416M0391k9949K3791J5594P6420
$$ -261504 -205683 -102693 -36574 36808 -36021 29395 69786 39837 63628 79222 155642
15919A55642j10380j12827q5575l3428P3553M3264L4367j5867l6910P8999O6171
$$ 155642 45262 -67565 -153140 -186568 -113015 -69751 -35384 -51251 -88161 -9162 57009
15908E7009j06594p8206j5549Q460R0639n6900N9427P7105N9365m6949k12958
$$ 57009 -49585 -127791 -143340 -134880 -44241 -101141 -41714 35391 94756 47807 -165151
15897a65151J7334k2020N4938P3076n1317r8867n6209N6172O2402R9566l75r1411
$$ -165151 -147817 -169837 -114899 -41823 -93140 -192007 -248216 -192044 -129642 -30076 -30451 -121862
15885a21862m9045N4910M6319o5523j34232K6459j3501L2464R9781K7111L711
$$ -121862 -170907 -115997 -69678 -135201 -269433 -242974 -256475 -224011 -124230 -97119 -93408
15874i3408O1821M0805Q4772P3908m0749p6830j5029J18449m1119j42818q5584
$$ -93408 -31587 9218 93990 167898 127149 50319 35290 153739 112620 -30198 -115782
15863a15782l3287n7176J0983N10Q801R1745j820m3759m9529K1157n9238q562
$$ -115782 -149069 -206245 -195262 -194752 -185951 -94206 -96026 -139785 -189314 -168157 -227395 -235957
15851b35957P7636k6465N7180j854K1335N0059R5808K0757j73687l7158m7586
$$ -235957 -158321 -184786 -127606 -129460 -108125 -58066 37742 58499 -115188 -152346 -199932
15840a99932l0027k9688K5284J66782o520j40079o6658P8775Q8980Q7347Q0644
$$ -199932 -229959 -259647 -234363 -67581 -74101 -214180 -280838 -202063 -113083 -25736 54908
15829E4908n186Q9577j8495j19019l9055p0524J1480O3826J7658m8467o1623l0487
$$ 54908 49722 139299 120804 1785 -37270 -107794 -96314 -32488 -14830 -63297 -124920 -155407
15817a55407J9422j3556m6140M2095L7084n6023J7137M1539P2616O324p6091M1161
$$ -155407 -135985 -149541 -195681 -153586 -116502 -172525 -155388 -113849 -41233 -34909 -111000 -69839
15805f9839J722n3709m6066k5023o8845J14131K33001r321j74418j36984o3176
$$ -69839 -68117 -121826 -167892 -192915 -261760 -147629 85372 76051 -98367 -235351 -298527
15794b98527R0177J01765J27199N08L424N627K1855l1602q6806N3578N3903r3755
$$ -298527 -208350 -106585 20614 21122 24546 30173 52028 20426 -66380 -12802 41101 -52654
15782e2654r0247r5462k0279M1343L1419r392o334J11937n2918R9141N8837n2602
$$ -52654 -142901 -238363 -258642 -217299 -185880 -195272 -201606 -89669 -142587 -43446 15391 -37211
15770c7211n2320L9616n3071n6691M6555J9550q789q3496j08631K0297J08211
$$ -37211 -89531 -49915 -102986 -159677 -113122 -93572 -102361 -185857 -294488 -274191 -165980
15759a65980j3542J26972O0461O579N2003j28228N5425P9624q3945j0116L9282
$$ -165980 -179522 -52550 7911 14490 66493 -61735 -6310 73314 -10631 -20747 18535
15748A8535j19228j70942k9681N7248O0583k4315n9714J20633J36308q1764k1409
$$ 18535 -100693 -271635 -301316 -244068 -183485 -207800 -267514 -146881 -10573 -92337 -113746
15737a13746M7100n242j34008q1231O3672J4445L5113l7060K5647J86151o7743
$$ -113746 -66646 -71888 -205896 -287127 -223455 -209010 -173897 -210957 -185310 841 -66902
15726f6902j54410J4598R9833m8701Q5387J1109j10713j5727M2811J02389J3871
$$ -66902 -221312 -206714 -106881 -155582 -70195 -59086 -169799 -185526 -142715 -40326 -26455
15715b6455O1567q7688j30482k8974R7418M7270K5087O388K6066k2212N9016j16019
$$ -26455 35112 -52576 -183058 -212032 -114614 -67344 -42257 -35869 -9803 -32015 27001 -89018
15703h9018K9091m7985m8574J7138J11617l238M4538m7415l3869R4833o4213q1694
$$ -89018 -59927 -107912 -156486 -139348 -27731 -30969 13569 -33846 -67715 27118 -37095 -118789
15691a18789m9412O0658R9144M1852j22230K5352J7236N0538L6316o838n2626
$$ -118789 -168201 -107543 -8399 33453 -88777 -63425 -46189 4349 40665 33827 -18799
15680a8799P0612J15935j13013n2734K4954L5674N3064o0468L3866L8787j11046
$$ -18799 51813 167748 54735 2001 26955 62629 115693 55225 89091 127878 16832
15669A6832Q702k3794M7461O2195J4233M033n0398L5669j18643q8589M8574l4056
$$ 16832 25534 1740 49201 111396 125629 129662 79264 114933 -3710 -92299 -43725 -77781
15657g7781m9478J9737l3117j17620r8002J40866Q317o1154o6286L3014k0889
$$ -77781 -127259 -107522 -140639 -258259 -356261 -215395 -207078 -268232 -334518 -301504 -322393
15646c22393J20519J34392J9856j0315n0244n792j8675K183p7380q2343R1864
$$ -322393 -201874 -67482 -47626 -57941 -108185 -113977 -132652 -130469 -207849 -290192 -198328
15635a98328L972K5459K0888O7657l7345N2441r9761o2938n7862j24764l628O1305
$$ -198328 -194356 -168897 -148009 -80352 -117697 -65256 -165017 -227955 -285817 -410581 -414209 -352904
15623c52904P7404J44926P8672L1844N8252L9136J02575j49884j05268q317r100
$$ -352904 -275500 -130574 -51902 -20058 38194 77330 179905 30021 -75247 -83564 -92664
15612i2664N8948n3340o9052J1914N0035m4534m991M2185J9937J85691j6015m2150
$$ -92664 -33716 -87056 -156108 -144194 -94159 -138693 -143684 -101499 -81562 104129 88114 45964
15600D5964j51968l2057K308L8825P1682N5772J5500l7703P9384r71l3260j08222
$$ 45964 -106004 -138061 -135753 -96928 -25246 30526 46026 8323 87707 86736 53476 -54746
15588e4746r9126j7479j01381k817P6453n7322k178J65074P2988O562r605K2074
$$ -54746 -153872 -171351 -272732 -275549 -199096 -256418 -258596 -93522 -20534 -13972 -23577 -1503
15576a503j13639o216M3685J9076m5053k1L8081k6452L0782M5497N6814j03684
$$ -1503 -115142 -121358 -77673 -58597 -103650 -103671 -65590 -92042 -61260 -15763 41051 -62633
15564f2633q2916l889n1030K0734K3277J9704R4237K8114j8753q2990j01094M1648
$$ -62633 -145549 -149438 -200468 -179734 -156457 -136753 -42516 -14402 -33155 -116145 -217239 -175591
15552a75591R8578Q0184O1678r2708j26789m8700J38535O361K1049n061j6388
$$ -175591 -77013 3171 64849 -27859 -154648 -203348 -64813 -58452 -37403 -42464 -58852
15541e8852k4141o997P8116l7100m2516j6993n3996L8495k9625Q8000J9441J26967
$$ -58852 -82993 -89990 -11874 -48974 -91490 -108483 -162479 -123984 -153609 -65609 -46168 80799
15529H0799K4828j07585n778Q7656m3727n3598m4066K1446k323J97853P0271j04969
$$ 80799 105627 -1958 -7736 79920 36193 -17405 -61471 -40025 -42348 155505 225776 120807
15517A20807j1907l0376l9431o5603q2611O3632J94108m9931r4390j0592J3777
$$ 120807 108900 78524 39093 -26510 -109121 -45489 148619 98688 4298 -6294 7483
15506G483P9367P379k3317n6917j00420J2536k1744r4655O7380m2560n1231o5115
$$ 7483 86850 94229 70912 13995 -86425 -73889 -95633 -190288 -122908 -165468 -216699 -281814
15494b81814O4388J17523J21383L6306J38065q5805M0224K7868m65o5465l6358
$$ -281814 -217426 -99903 21480 57786 195851 110046 150270 178138 177673 112208 75850
15483G5850K5885n3662O6502j5486k5093m4846o1887p4644m5485j6533O9682n919
$$ 75850 101735 48073 114575 99089 73996 29150 -32737 -107381 -152866 -169399 -99717 -105636
15471a05636n4646P3650P5653J08554L1800m7281m1297n6422J0255p3573J6826
$$ -105636 -160282 -86632 -10979 97575 129375 82094 40797 -15625 -5370 -78943 -62117
15460f2117J52876m4568J9650J1992j18546P8062l1650p0571L6735j04661r0440
$$ -62117 90759 46191 65841 77833 -40713 37349 5699 -64872 -28137 -132798 -223238
15449b23238J50097N0645Q942j6037J1847m1834K1172J01329j06398K0679L950
$$ -223238 -73141 -22496 -13554 -29591 -17744 -59578 -38406 62923 -43475 -22796 -18846
15438a8846k5133n0658J2314O0194L9860l0638k6156J16099J03204j36434j73793
$$ -18846 -43979 -94637 -82323 -22129 17731 -12907 -39063 77036 180240 43806 -129987
15427a29987j51797K7428K43567N2741m7608K5506j5125j10096O494J04886j2265
$$ -129987 -281784 -254356 -10789 41952 -5656 19850 4725 -105371 -98877 6009 -6256
15416f256j56002O801J38878J72878J0282j38319j942L5347J64308m7126j08995
$$ -6256 -162258 -155457 -16579 156299 166581 28262 26320 61667 225975 178849 69854
15405F9854l786n0170n4557q4983o3566L1210M1274M5298m947o6787k0928K2022
$$ 69854 66068 15898 -38659 -123642 -187208 -155998 -114724 -69426 -74373 -141160 -162088 -140066
15393a40066Q8312J3244P3599N4931l1507p2036m2954O4596J09787k3165j26108
$$ -140066 -51754 -38510 35089 90020 58513 -13523 -56477 8119 117906 94741 -31367
15382c1367P5768M2618j14470k1534p0678l77r552o929J661j02500j5854O0183
$$ -31367 44401 87019 -27451 -48985 -119663 -120040 -129592 -136521 -134860 -237360 -253214 -193031
15370a93031K02020L7583n1946n6095l6089n3372j1830M6859J87819L2942r2635
$$ -193031 8989 46572 -5374 -61469 -97558 -150930 -162760 -115901 71918 104860 12225
15359A2225k573J8132j39926J7450J13381m048k4859o9205N3807O9033L6357j8025
$$ 12225 9652 27784 -112142 -94692 18689 14641 -10218 -79423 -25616 43417 79774 61749
15347F1749M5249o9146j76035j32080K2683j1934j30930J68523K36375Q8868m517
$$ 61749 106998 37852 -138183 -270263 -247580 -259514 -390444 -221921 14454 103322 98805
15336I8805J4705L4146p7868j38717R2826K5517o2631l0695k8051j74724k669
$$ 98805 113510 147656 69788 -68929 23897 49414 -13217 -43912 -71963 -246687 -249356
15325b49356K43533M2253n5828J10695j24960n9158Q5369r3868r1459J7660n7627
$$ -249356 -5823 36430 -19398 91297 -33663 -92821 -7452 -101320 -192779 -175119 -232746
15314b32746O7232Q7884k7180M7789l3092o3776J31531N3878n8554m8351l7447
$$ -232746 -165514 -77630 -104810 -57021 -90113 -153889 -22358 31520 -27034 -75385 -112832
15303a12832R0969M4313m5060n4502k3218q1425k2218Q5224k3621p2163o569N936
$$ -112832 -21863 22450 -22610 -77112 -100330 -181755 -203973 -118749 -142370 -214533 -221102 -215166
15291b15166O1289P0299k7739k7512L0892K3799L1218l5920q3207m3105l8113
$$ -215166 -153877 -83578 -111317 -138829 -107937 -84138 -52920 -88840 -172047 -215152 -253265
15280b53265q311O5630J07647q3332J60609n498q4570j0677P085J85737k312r6766
$$ -253265 -261576 -195946 -88299 -171631 -11022 -16520 -101090 -111767 -104682 81055 78743 -18023
15268a8023Q0256r31k7026j52526L8831J2479N7972M3404m6048K9287l9492j0435
$$ -18023 62233 61302 34276 -118250 -79419 -66940 -8968 34436 -11612 17675 -21817 -32252
15256c2252n6044P756j519m1317l1212p5078l0471N9606N8710j08142q4822J2211
$$ -32252 -88296 -80540 -82059 -123376 -154588 -229666 -260137 -200531 -141821 -249963 -334785 -322574
15244c22574J39769l4973j7704l5725P5478L2595q1210k7443J42202p40m7166
$$ -322574 -182805 -217778 -235482 -271207 -195729 -163134 -244344 -271787 -129585 -130325 -177491
15233a77491R5093j947j2213N2313L3037P4419N4265r5700O8199O6665n3732j12303
$$ -177491 -82398 -84345 -96558 -44245 -11208 63211 117476 21776 89975 156640 102908 -9395
15221i395j6495j1530L2811N7532L1196n4370q6958j21364K6928M2187n3242m868
$$ -9395 -25890 -37420 -4609 52923 84119 29749 -57209 -178573 -151645 -109458 -162700 -167568
15209a67568k6814M6219J707K2838k6868l8598R560J1595J66563J13035k2992
$$ -167568 -194382 -148163 -146456 -123618 -150486 -189084 -179524 -167929 -1366 111669 88677
15198H8677l7446r400o2705p1214L7692N8691M2154n1365M0230j2300J4104O6690
$$ 88677 51231 41831 -20874 -92088 -54396 4295 46449 -4916 35314 23014 37118 103808
15186A03808m0981j00384m1020J842P8n2426L4277l5755m6594m8089P2753L5653
$$ 103808 62827 -37557 -78577 -76735 -76657 -129083 -94806 -130561 -177155 -225244 -152491 -116838
15174a16838n3227l170P415m4091K4083J1360m3065J93088N3112j14335j2714
$$ -116838 -170065 -173235 -165820 -209911 -185828 -174468 -217533 -24445 28667 -85668 -98382
15163i8382l4327N9053O3091O6439n7179K9012Q0657q1501L0787j4403q9001k9427
$$ -98382 -132709 -73656 -10565 55874 -1305 27707 108364 26863 57650 43247 -45754 -75181
15151g5181Q7229J01263k2585m1662l4936K9758r7185j13291M6295k0714o0280
$$ -75181 12048 113311 90726 49064 14128 43886 -53299 -166590 -120295 -141009 -201289
15140b01289K7808P8333O768k8813L3567J08428N028j39651r7310m2879P3130
$$ -201289 -173481 -95148 -88380 -117193 -83626 24802 29830 -109821 -207131 -250010 -176880
15129a76880J9609M737J12089k9442M8l630j9322l6646j14478o4015o4807j16772
$$ -176880 -157271 -152534 -40445 -69887 -69839 -73469 -92791 -129437 -243915 -307930 -372737 -489509
15117d89509N053K32228J12142O5037l076q4213N453Q560n904J53415j0140o2373
$$ -489509 -484456 -252228 -140086 -75049 -78125 -162338 -156885 -148325 -154229 -814 -10954 -73327
15105g3327O3423L0980j03852J28226k8077j08664l182O8140K8727K2053L6930
$$ -73327 -9904 21076 -82776 45450 17373 -91291 -94473 -26333 2394 24447 61377
15094F1377m4094p3406L8604J299O0937N6839p0786r4023j7988J34309l846M850
$$ 61377 17283 -56123 -17519 -16220 44717 101556 30770 -63253 -81241 53068 49222 54072
15082E4072l0332k4561L5988j7565j10932K5775O5795J5131m2817m2930n0145
$$ 54072 23740 -821 35167 17602 -93330 -67555 -1760 13371 -29446 -72376 -122521
15071a22521j1020k6769k5901P1609O8478N5461l6876m1090R3537p2559j22957
$$ -122521 -133541 -160310 -186211 -114602 -46124 9337 -27539 -68629 24908 -47651 -170608
15060a70608q1259k8514J57826K11202j9772q7601j03109K7529J40795o9660K5443
$$ -170608 -251867 -280381 -122555 88647 68875 -18726 -121835 -94306 46489 -23171 2272
15049B272P7641J2635p6422j35427r0817J93338j8812m2551R4446p5762j14966
$$ 2272 79913 92548 16126 -119301 -210118 -16780 -35592 -78143 16303 -59459 -174425
15038a74425r6147l7880l9674l9642N935J56036L5963j5400J2321L4364K7677
$$ -174425 -270572 -308452 -348126 -387768 -381833 -225797 -189834 -205234 -192913 -158549 -130872
15027a30872p1307p710Q0008M8320J00602O4595q1644o4169R8961O2041q3818
$$ -130872 -202179 -209889 -129881 -81561 19041 83636 1992 -62177 36784 98825 15007
15016A5007k46113k5380J70178R1478k9210j7766r9811k6664Q2959N3969o6243
$$ 15007 -231106 -256486 -86308 5170 -24040 -41806 -141617 -168281 -85322 -31353 -97596
15005i7596q0290n6163p161r7838J08095Q5613j01797J7763R7865m344l0940K4079
$$ -97596 -177886 -234049 -241210 -339048 -230953 -145340 -247137 -229374 -131509 -135853 -166793 -142714
14993a42714O7192J58849R3204l4962m4207n246j68298p8617l1474l007R1601
$$ -142714 -75522 83327 176531 141569 97362 92116 -76182 -154799 -186273 -189280 -97679
14982i7679n7552l7920l834K00753O6056k0160r6995k9202K7255J00826J73087
$$ -97679 -155231 -193151 -196985 3768 69824 49664 -47331 -76533 -49278 51548 224635
14971B24635M9252r1870j52098j64881n1710r265Q3279N4613O5381N9370n1278
$$ 224635 273887 182017 29919 -134962 -186672 -195937 -112658 -58045 7336 66706 15428
14960A5428j90420m0914K7441Q4136J09843l7262o8309k9219m4031K0570j37103
$$ 15428 -174992 -215906 -188465 -104329 5514 -31748 -100057 -129276 -173307 -152737 -289840
14949b89840L9400J46196O9417P8921J1567M7035O039n1680M9631j44942j31734
$$ -289840 -250440 -104244 -34827 44094 55661 102696 108735 57055 106686 -38256 -169990
14938a69990L428Jl5446L6302j8210p0013M7742l0291Q9779N8082L3332m3535
$$ -169990 -166562 -166561 -202007 -165705 -183915 -253928 -206186 -236477 -146698 -88616 -55284 -98819
14926i8819Q7057M3345J20988m888q1452Q7216J03157l2263m9998j55750j73920
$$ -98819 -11762 31583 152571 147683 66231 153447 256604 224341 174343 18593 -155327
14915a55327r1126k0451M4961l1472r3703N1256J02043J933O0425O6134j4956
$$ -155327 -246453 -266904 -221943 -253415 -347118 -295862 -193819 -191886 -131461 -65327 -80283
14904h0283o2706k7840l1705O6254Q9770J3792M2543J26975p6393j81572n5513
$$ -80283 -142989 -170829 -202534 -136280 -46510 -32718 9825 136800 60407 -121165 -176678
14893a76678O8622O3444J9046q0087j07363k9130K3348K9007K0391N2566l841
$$ -176678 -108056 -44612 -25566 -105653 -213016 -242146 -218798 -189791 -169400 -116834 -120675
14882a20675Q2096R981P4040J2505j9178j77466K1632J14176P5063J8903n6035
$$ -120675 -38579 -28598 45442 57947 38769 -138697 -117065 -2889 72174 91077 35042
14871C5042m3781J6918L4206j3093m2700l9271K2138n1026j5585Q0411m83J9000
$$ 35042 -8739 8179 42385 29292 -13408 -52679 -30541 -81567 -97152 -16741 -17224 1776
14859A776n6884l2812o4658N876O8122j51954P5933N7423M5781k3823l8794n5376
$$ 1776 -55108 -87920 -152578 -146702 -78580 -230534 -154601 -97178 -51397 -75220 -114014 -169390
14847a69390j5337r963j5933L9110P8633J04034J40987K033J668J11055r8281
$$ -169390 -184727 -194690 -210623 -171513 -92880 11154 152141 154174 155842 266897 168616
14836A68616j52281m3774J24579m0872q7102q8006M3558L3151m3755n5489k0908
$$ 168616 16335 -27439 97140 56268 -30834 -118840 -75282 -42131 -85886 -141375 -162283
14825a62283J32342K1525R3684M1554l7292K4187K905l4664R757j3822m7849j2302
$$ -162283 -29941 -8416 85268 126822 89530 113717 116622 81958 91715 77893 30044 17742
14813A7742K4194p1751q5615o7844M3209R4643M2732M856o151j01367P4747J1071
$$ 17742 41936 -29815 -115430 -183274 -140065 -45422 -2690 2166 -3985 -105352 -30605 -19534
14801a9534m7269j0942M1807l7269R0892J82172k1678k00926Q6640O1371o0940
$$ -19534 -66803 -77745 -35938 -73207 17685 199857 178179 -22747 63893 125264 64324
14790F4324p5309N0593J5688j25165J5700M2211R5524M8097q6070o34L5477m7395
$$ 64324 -10985 39608 55296 -69869 -54169 -11958 83566 131663 45593 44959 80436 33041
14778C3041J18N8148J24622J60096O4160k44991j39456r6984r5575M9408J63992
$$ 33041 33159 91307 215929 376025 440185 195194 55738 -41246 -136821 -87413 76579
14767G6579j8681m5253r8906q3901K8595Q3406J25498r323q2714j72518k6415
$$ 76579 57898 12645 -86261 -170162 -141567 -58161 67337 58014 -24700 -197218 -223633
14756b23633L1641M5117Q8740N9226j4420J06782J4780j59102j55305n6971K9001
$$ -223633 -191992 -146875 -58135 1091 -13329 93453 108233 -50869 -206174 -263145 -234144
14745b34144O2199K31660M0783j40313m8679K1704k5878Q965N8775M2383j856
$$ -234144 -171945 59715 100498 -39815 -88494 -66790 -92668 -83703 -24928 17455 15599
14734A5599j9265j58683L1525O1316j5655P4944J36821l315j8117l3565j16451
$$ 15599 -3666 -162349 -130824 -69508 -85163 -10219 126602 123287 105170 71605 -44846
14723d4846j7505L6946l1125J23856r5906L5104J13462j25149m0643P1630O0768
$$ -44846 -62351 -25405 -56530 67326 -28580 6524 119986 -5163 -45806 25824 86592
14712H6592L3676l4063R9397L6109j39267m0509L7402k7330o1690n359M3121k1235
$$ 86592 120268 86205 185602 221711 82444 41935 79337 52007 -9683 -15042 28079 6844
14700F844p2939k3567P3093J13909P1034p5591p1359n8715k5305l1932l8559J02552
$$ 6844 -66095 -89662 -16569 97340 168374 92783 21424 -37291 -62596 -94528 -133087 -30535
14688c0535K0536l2534j18221k1241P1568J6018j3146P309P8361J25535j3749
$$ -30535 -9999 -42533 -160754 -181995 -110427 -94409 -107555 -100246 -21885 103650 89901
14677H9901j68336n0561J0608n3184L572k7490l4987L6686K8741J4421Q0865N7513
$$ 89901 -78435 -128996 -118388 -171572 -168000 -195490 -230477 -193791 -165050 -150629 -69764 -12251
14665a2251j2867M0065K5575N3743o0794j21612l6096Q7623K8453O6511L9443
$$ -12251 -25118 14947 40522 94265 33471 -88141 -124237 -36614 -8161 58350 97793
14654I7793k0097j8213j13357P1168J58130L4532m7020p2543q6152j5042Q8724
$$ 97793 77696 59483 -53874 17294 175424 209956 162936 90393 4241 -10801 77923
14643G7923l8191n9094L7735m8745n3818q2283K565M6976J5921o6684k1318J52247
$$ 77923 39732 -19362 18373 -30372 -84190 -166473 -163908 -116932 -101011 -167695 -189013 -36766
14631c6766J14315K1167l9192M5295p598q6202J9729o8406j09865N3204N3645
$$ -36766 77549 98716 59524 104819 97221 11019 30748 -37658 -147523 -94319 -40674
14620d0674N4842l4375p183L0582k7127n5814j00380P3638P6318K9794j40506
$$ -40674 14168 -20207 -27390 3192 -23935 -79749 -180129 -106491 -30173 -379 -140885
14609a40885l5051L7700Q6275N0975O6866J7285j24812R623L2753N863j01282
$$ -140885 -175936 -138236 -51961 -986 65880 83165 -41647 -32024 729 6592 -94690
14598i4690j22513m3530J151P9955R3659Q0944P7017k2926n5878O7803k6022l7706
$$ -94690 -217203 -260733 -259582 -179627 -85968 -5024 71993 49067 -6811 60992 34970 -2736
14586b736l8587k62l6973R2078N8267J5302M9236p0586m3872m9565l4136J00030
$$ -2736 -41323 -41585 -78558 13520 71787 87089 136325 65739 21867 -27698 -61834 38196
14574C8196J53176l0431j7855j6290L2630j4512q6150j11948L7344J35657j1139
$$ 38196 191372 160941 143086 126796 159426 144914 58764 -53184 -15840 119817 108678
14563A08678n5382N534q801J7739N5438m5379K0716J08747n868j03433q9463p800
$$ 108678 53296 58830 50029 67768 123206 77827 98543 207290 201422 97989 8526 726
14551G26k8949j59664j8770j3421O1306J25147O7202k4614j6213N3706P2389k9827
$$ 726 -28223 -187887 -206657 -220078 -158772 -33625 33577 8963 -7250 46456 118845 89018
14539H9018j38370K9834K6748L5711l8501j6970j54054p1966J43785J46795M7924
$$ 89018 -49352 -19518 7230 42941 4440 -12530 -166584 -238550 -94765 52030 99954
14528I9954j06022p9138O9744K2391K1061R8842j9472j34729j56550Q9147J35858
$$ 99954 -6068 -85206 -15462 6929 27990 126832 107360 -27369 -183919 -94772 41086
14517D1086p0206j20123K5668J1788p7867P985P2676j31946L589K1421m1093P8777
$$ 41086 -29120 -149243 -123575 -111787 -189654 -181669 -108993 -240939 -237350 -215929 -257022 -178245
14505a78245N5469j02003k6523Q1572n6588J588R2274J6963j3357J6993P3691
$$ -178245 -122776 -224779 -251302 -169730 -226318 -224730 -132456 -115493 -128850 -111857 -38166
14494c8166R5875O7153r4712n0610j18903J2549J07929j0962J2176N883L2661
$$ -38166 57709 124862 30150 -20460 -139363 -126814 -18885 -29847 -17671 -11788 20873
14483B0873J6070K5355J08268J132j10407m0957k6243p2370n574p1858L7630Q2241
$$ 20873 36943 62298 170566 171698 61291 20334 -5909 -78279 -83853 -155711 -118081 -35840
14471c5840K3672K1574k0042k4005M8757O6292m1592j24391l3258J39036L7191
$$ -35840 -12168 9406 -10636 -34641 14116 80408 38816 -85575 -118833 20203 57394
14460E7394j29430o7914K883J8162j33612n9988P5632m8611M5045R1280J06127
$$ 57394 -72036 -139950 -137067 -118905 -252517 -312505 -236873 -285484 -240439 -149159 -43032
14449d3032P1871q1478k147m395m002j09942P9687R2685l9351j29479j50074k9737
$$ -43032 28839 -52639 -54786 -59181 -63183 -173125 -93438 -753 -40104 -169583 -319657 -349394
14437c49394J43313O5769N6717l6265P0760k0358j34651L3279J41942Q4581l828
$$ -349394 -206081 -140312 -83595 -119860 -49100 -69458 -204109 -170830 -28888 55693 51865
14426E1865j6509k1668L050n3374P5106Q2643n2402q3209j3281l68J6640o5421
$$ 51865 35356 13688 16738 -36636 38470 121113 68711 -14498 -27779 -28147 -11507 -76928
14414g6928J7251J24852J5773j08572M253J18002n4195o9396j7843J5638J7618
$$ -76928 -59677 65175 80948 -27624 -23371 94631 40436 -28960 -46803 -31165 -13547
14403a3547m6355p9153p1043J59762J78059L3225j05191p7030j28012j16753N3765
$$ -13547 -59902 -139055 -210098 -50336 127723 160948 55757 -21273 -149285 -266038 -212273
14392b12273O519K5048K0093j6357M0952P399N4678N9948J20761m2044k30238
$$ -212273 -205754 -180706 -160613 -176970 -136018 -128619 -73941 -13993 106768 64724 -165514
14381a65514p5943J51539m5004n9777Q1613K2462Q9845Q212M7632r2917o032q487
$$ -165514 -241457 -89918 -134922 -194699 -113086 -90624 -779 7433 55065 -37852 -43884 -52371
14369e2371q1860k1785M1710m8881j77409m3377Q6759L8236K40587Q3571L8332
$$ -52371 -134231 -156016 -114306 -163187 -340596 -383973 -297214 -258978 -18391 65180 103512
14358A03512r0209k9250O2490J47032n164n6732n4446o7988j6204p9398j37424
$$ 103512 13303 -15947 46543 193575 188411 131679 77233 9245 -6959 -86357 -223781
14347b23781O6925m8890R2081J88651O3127k1916j5830o7382j29760N2447J21195
$$ -223781 -156856 -205746 -113665 74986 138113 116197 100367 32985 -96775 -44328 76867
14336G6867O051R0840p9463o2062l1343n399k4497K7690l5597R5957Q9720N1438
$$ 76867 82918 173758 94295 32233 890 -4509 -29006 -1316 -36913 59044 148764 200202
14324B00202M346o2309r7943P4412P2261j73738j06407l9240K257K127M7999L1054
$$ 200202 204548 142239 44296 118708 190969 17231 -89176 -128416 -126159 -124032 -76033 -44979
14312d4979J89650R1271j9127m4148J176j15577o138J3075j23039K4696J30137
$$ -44979 144671 235942 216815 172667 173843 58266 52128 65203 -57836 -33140 96997
14301I6997K2128j85452m3844P3416o2495K0928j7344q4997J01342K1169j20550
$$ 96997 119125 -66327 -110171 -36755 -99250 -78322 -95666 -180663 -79321 -58152 -178702
14290a78702n2027O0349R567K5967K3430M7136M4337L8880n787p376k9337j0309
$$ -178702 -230729 -170380 -160813 -134846 -111416 -64280 -19943 18937 13150 5774 -23563 -33872
14278c3872n9544p0209o188N6895j4945n4041M3714m315l516L109Q6331N6321
$$ -33872 -93416 -163625 -169813 -112918 -127863 -181904 -138190 -142505 -146021 -142912 -56581 -260
14266b60K1260j12177m3050Q2176L1395P7644l3514K9359Q927r1164J1340R6852
$$ -260 21000 -91177 -134227 -52051 -20656 56988 23474 52833 61760 -29404 -18064 78788
14254G8788J626M9461P1365r0035L0185p0213j58692p7454L3539J87931J23691
$$ 78788 80414 129875 201240 111205 141390 71177 -87515 -164969 -131430 56501 180192
14243A80192m1653m4205m8173J04788P6516o8189N9385J533J03420O7130j51249
$$ 180192 138539 94334 46161 150949 227465 159276 218661 220194 323614 390744 239495
14232B39495o8536J7546K711j53106j16867J8168O45M6060Q4808J33182n9145
$$ 239495 170959 188505 191216 38110 -78757 -60589 -59944 -13884 70924 204106 144961
14221A44961K1165r5870M3217m2056q6658n8251n2753L7975j2819k0687m5762
$$ 144961 166126 70256 113473 71417 -15241 -73492 -126245 -88270 -101089 -121776 -167538
14210a67538J15539K3323J3143P4283J19388J09034L262j44983n1162P3706J8461
$$ -167538 -51999 -28676 -15533 58750 178138 287172 290434 145451 94289 167995 186456
14199A86456q3669j58373j99166N526J32726J04524r4923J9389q027J11768N3144
$$ 186456 102787 -55586 -254752 -249226 -116500 -11976 -106899 -87510 -95537 16231 69375
14188F9375m3751L8477m5958o8799O0589j8289p1693J15976J25318p3319m0611
$$ 69375 25624 64101 18143 -50656 9933 -8356 -80049 35927 161245 87926 47315
14177D7315N2763j47976P7198J55933J2090j10075k9266J03481k9831k17938j28232
$$ 47315 100078 -47898 29300 185233 197323 87248 57982 161463 131632 -86306 -214538
14166b14538R9200J24469K1187j15605p3597J94632J12857n0819q1865K079J10389
$$ -214538 -115338 9131 30318 -85287 -158884 35748 148605 97786 15921 18000 128389
14155A28389L6542j1758j3216k6307O4587J6432l6608j30240r9203j4249N2900
$$ 128389 164931 153173 139957 113650 178237 194669 158061 27821 -71382 -85631 -32731
14144c2731O7531O5436J08453m4022j42438Q0210N1030O2854m0909k6456o6552
$$ -32731 34800 100236 208689 164667 22229 102439 153469 216323 175414 148958 82406
14133H2406L5024k2246m600o1439K2917q3850J25731k9981K305J3715p8376L1020
$$ 82406 117430 95184 90584 29145 52062 -31788 93943 63962 66267 79982 1606 32626
14121C2626J04367k5859q5991j38569j6735J06749o0228j12325m1606M6804R3435
$$ 32626 136993 111134 25143 -113426 -130161 -23412 -83640 -195965 -237571 -190767 -97332
14110i7332Q4712m4647n0261M5269J58839M9898L0768p6222j05822O189N1443
$$ -97332 -12620 -57267 -107528 -62259 96580 146478 177246 101024 -4798 1391 52834
14099E2834j04436J52825Q9354j92815j14567j6715J5957P7832L1064R857j50239
$$ 52834 -51602 101223 190577 -2238 -116805 -133520 -117563 -39731 -8667 1190 -149049
14088a49049r9002M0989L4982J90287J67566q4743o7439P9474n7112j30106K7040
$$ -149049 -248051 -207062 -172080 18207 185773 101030 33591 113065 55953 -74153 -47113
14077d7113j9021j82255O3372Q0587k479M7186R2168k8083M2123N9709o7344M462
$$ -47113 -66134 -248389 -185017 -104430 -106909 -59723 32445 4362 46485 106194 38850 43312
14065D3312j5452o2331R7504j56657p7469j635L0539L4895K2461J22627l4296
$$ 43312 27860 -34471 63033 -93624 -171093 -172728 -142189 -107294 -84833 37794 3498
14054C498j01053K1529k100K5152n5915l593L1876K0276q381M2552R2825O2423
$$ 3498 -97555 -76026 -78126 -52974 -108889 -112482 -80606 -60330 -68711 -26159 66666 129089
14042A29089j122N5608m9453j19535M4041O1214L7822N0990p2971q9588p2379
$$ 129089 127967 183575 134122 14587 58628 119842 157664 208654 135683 46095 -26284
14031b6284J504L489r0591J4323J68632J12285p6180m0832m1227j24221q236J31893
$$ -26284 -24780 -21291 -111882 -97559 71073 183358 107178 66346 25119 -99102 -107338 24555
14019B4555J04006J2561m2360n5816o1666q6573R6074J04631J9567K8714j2943
$$ 24555 128561 141122 98762 42946 -18720 -105293 -9219 95412 114979 143693 130750
14008A30750q4770j13517n0365P4861p7249o0957l9421N3736J15171K1222n969
$$ 130750 45980 -67537 -117902 -43041 -120290 -181247 -220668 -166932 -51761 -30539 -36508
13997c6508k9551J7320Q0066o2547l858o8523q559O6081J10146M6073m3979J700
$$ -36508 -66059 -48739 31327 -31220 -35078 -103601 -112160 -46079 64067 110140 66161 67861
13985F7861p2429k6492m0547J10729O308j3768m428K8418m0798K0205j243K1946
$$ 67861 -4568 -31060 -71607 39122 45430 31662 27234 55652 14854 35059 33816 55762
13973E5762o2397o9400n7029o3745J02899J27103r36J1600Q101N175n7037O0096
$$ 55762 -6635 -76035 -133064 -196809 -93910 33193 32257 43857 51958 57133 96 60192
13961F0192Q1972k6870p0414N891M1138O4107k8350l3050p2876Q925J0072J4634
$$ 60192 142164 115294 44880 50771 91909 156016 127666 94616 21740 30665 40737 55371
13949E5371o0107k27027j76278J17545J89689M1101k5469l8004k1226l4677P0289
$$ 55371 -4736 -231763 -408041 -290496 -100807 -59706 -85175 -123179 -144405 -179082 -108793
13938a08793J01679M3807j31443R317J11366n8763p0598l7531K7034J8161J46506
$$ -108793 -7114 36693 -94750 -85433 25933 -32830 -103428 -140959 -113925 -95764 50742
13927E0742J63056o7408K5830k2709J2063o3363j6532J7353J220j0821q0608j42284
$$ 50742 213798 146390 172220 149511 161574 98211 81679 99032 100252 89431 8823 -133461
13915a33461o6182J13290K04041m6290j68698P208R6329k2926O9423P4976N8553
$$ -133461 -199643 -86353 117688 71398 -97300 -90092 6237 -16689 52734 127710 186263
13904A86263K6093o5868j17759q6866j005J3178l7567p5273l6505L7368j27515
$$ 186263 212356 146488 28729 -58137 -59142 -45964 -83531 -158804 -195309 -157941 -285456
13893b85456O2503J14611L7003J19273J43413N0849j23130q1205m7636j85569
$$ -285456 -222953 -108342 -71339 47934 191347 242196 119066 37861 -9775 -195344
13883a95344m7714R8053J33404J9473l7942m8301K5862N9860K4564K5295k442
$$ -195344 -243058 -145005 -11601 7872 -30070 -78371 -52509 7351 31915 57210 54768
13872E4768j9058l9939k6092J93943K8963M2406j09865j25626j30455L3873J6436
$$ 54768 35710 -4229 -30321 163622 192585 234991 125126 -500 -130955 -97082 -80646
13861h0646P717J9839k482n3622J2731o3696M5833P8770m177k0527R8237K7342
$$ -80646 -72929 -53090 -55572 -109194 -96463 -160159 -114326 -35556 -39733 -60260 37977 65319
13849F5319j22218m0207j29307o7705J92757J33862k1131j1756M916J44264J68636
$$ 65319 -56899 -97106 -226413 -294118 -101361 32501 11370 -386 4530 148794 317430
13838C17430l7673j00010j30310p6111K4825j679m0416k3389J02873L3755k2288
$$ 317430 279757 179747 49437 -26674 -1849 -3528 -43944 -67333 35540 69295 47007
13827D7007J23638q302l6042j9754r6145n0232L0059J6851j3740j6484l186M4192
$$ 47007 170645 162343 126301 106547 10402 -39830 -9771 7080 -6660 -23144 -26330 17862
13815A7862n1739k805O1592K9855m7745j04312k4823o1362L3489N1052n157o4455
$$ 17862 -33877 -36682 24910 54765 7020 -97292 -122115 -183477 -149988 -98936 -104093 -168548
13803a68548p4225M8667K060l9421M1186J6479k0538J05143l231p257N8149O2758
$$ -168548 -242773 -194106 -192046 -231467 -190281 -173802 -194340 -89197 -92428 -99685 -41536 21222
13791B1222j4853l0653L9185M6412J2244q3299j22816J6791N1703P3527M475J04308
$$ 21222 6369 -24284 14901 61313 73557 -9742 -132558 -115767 -64064 9463 13938 118246
13779A18246K5812K4145q4166M5973N903k12557p6043N7521M1320M0357j3079
$$ 118246 144058 168203 84037 130010 135913 -76644 -152687 -95166 -53846 -13489 -26568
13768b6568P0976O7609N1487m8176Q715J4805J9186l2314J2027L1549M1314N1421
$$ -26568 44408 112017 163504 115328 124043 138848 158034 125720 137747 169296 210610 262031
13756B62031P0230n7884J2285J02125p0855k9626k7804o4593r2504o6125j27384
$$ 262031 332261 274377 286662 388787 317932 288306 260502 195909 103405 37280 -90104
13745i0104p6927L1809K19379l6199l9044K888j0555J1813K7805Q1931J7184p8862
$$ -90104 -167031 -135222 84157 47958 8914 11802 1247 13060 40865 122796 139980 61118
13733F1118J6167P713p4619l2592R4355Q87o857J7198J7051o2974m4627N4518
$$ 61118 77285 84998 10379 -22213 72142 73029 66172 83370 100421 37447 -7180 47338
13721D7338K6663o1065p4349R7466K1685q2457m105n7834o3665P2444J46257Q370
$$ 47338 74001 12936 -61413 36053 57738 -24719 -28824 -86658 -150323 -77879 68378 76748
13709G6748j13285j03772k68k2437J00406N7567l2701p1501M4533N3613K0257
$$ 76748 -36537 -140309 -140577 -163014 -62608 -5041 -37742 -109243 -64710 -11097 9160
13698I160q2032q5561M5644P033N3479K2029n2088O4695K8863M9468J18292J51509
$$ 9160 -72872 -158433 -112789 -105756 -52277 -30248 -82336 -17641 11222 60690 178982 330491
13686C30491q9470p1932M0018n2289j18567j12001j7069J90914R305r494m9136
$$ 330491 241021 169089 209107 156818 38251 -73750 -90819 100095 109400 99906 50770
13675E0770j42559k6414l1375m1491O139L7264K3314O7137n8797j919L7963M8440
$$ 50770 -91789 -118203 -149578 -191069 -184930 -147666 -124352 -57215 -116012 -117931 -79968 -31528
13663c1528L4661Q1273k1650r2744m5149k6787M4879M6944p296M2333p134l3538
$$ -31528 3133 84406 62756 -29988 -75137 -101924 -57045 -10101 -17397 24936 17802 -15736
13651a5736L5620J0794Q067k5230P9330L0110j6501k7784L7050l767j01967j14370
$$ -15736 19884 30678 38745 13515 92845 122955 106454 78670 115720 111953 9986 -104384
13639a04384q3068L0786L8752K6485Q1235P4289K7031o6218o303o92k6073q061
$$ -104384 -187452 -156666 -117914 -91429 -10194 64095 91126 24908 18605 17913 -8160 -16221
13627a6221J1043Q8048J17830K5306j05905l2056p1608j23432Q0930M5814j5903
$$ -16221 -5178 82870 200700 226006 120101 88045 16437 -106995 -26065 19749 3846
13616C846j9069J9874m4947o8810l6485j6291K14438J14080M9846M6903l0742
$$ 3846 -15223 4651 -40296 -109106 -145591 -161882 52556 166636 216482 263385 232643
13605B32643j01707p5391q290R8322L4234m1498j50973Q8996Q1879p6604j76781
$$ 232643 130936 55545 47255 145577 179811 138313 -12660 76336 158215 81611 -95170
13594i5170p8324J21576P3426N0942J9273N2746l4175j23917j5229M030M2811
$$ -95170 -173494 -51918 21508 72450 91723 144469 110294 -13623 -28852 -24822 17989
13583A7989M920O5385K9016K5279J05182q0433j09443n6185N9654p5172n1400
$$ 17989 22909 88294 117310 142589 247771 167338 57895 1710 61364 -13808 -65208
13572f5208O4507o4404P7684J22473O3127R9720m3725j8350n8884n2234j19033
$$ -65208 -701 -65105 12579 135052 198179 297899 254174 235824 176940 124706 5673
13561E673r4093R8130P4882R9863j4560j31307r2438q0196P3499J55536N1642
$$ 5673 -88420 9710 84592 184455 169895 38588 -53850 -134046 -60547 94989 146631
13550A46631n5325j8644J7630k7609j9871N0894R7478p5910L4701K2008q7760
$$ 146631 91306 72662 90292 62683 42812 93706 191184 115274 149975 171983 84223
13539H4223o2219Q8814m4401n5857J7262k2283k3126K9003O6536q1617m8312m0490
$$ 84223 22004 110818 66417 10560 27822 5539 -17587 11416 77952 -3665 -51977 -92467
13527i2467O5838J10425m1591l4862j21709j03793m6854Q6570J69933J47404r6088
$$ -92467 -26629 83796 42205 7343 -114366 -218159 -265013 -178443 -8510 138894 42806
13516D2806p9063j10642K6216M3547m7864j6398K1112R3863P7229K3275K3737
$$ 42806 -36257 -146899 -120683 -77136 -125000 -141398 -120286 -26423 50806 74081 97818
13505I7818P832L1478L1481o6833r3362o3924n8056O6429O8934P6709m3404q6950
$$ 97818 105650 137128 168609 101776 8414 -55510 -113566 -47137 21797 98506 55102 -31848
13493c1848j13779P5179J05242N8823K3381k7528K7089j7819P5238L7662p6202
$$ -31848 -145627 -70448 34794 93617 116998 89470 116559 98740 173978 211640 135438
13482A35438r2449q3567J3204P8912K7854J61207N7990j15083j55372k5087n9154
$$ 135438 42989 -40578 -27374 51538 79392 240599 298589 183506 28134 3047 -56107
13471e6107J14058Q5886j7846R1355j04407j41512K0070Q5222l5182R81J9569
$$ -56107 57951 143837 125991 217346 112939 -28573 -8503 76719 41537 42518 62087
13460F2087J8032j9359j148r735L450R2835p3234m6989m6366r2197Q3198K22472
$$ 62087 80119 60760 59612 49877 53327 146162 72928 25939 -20427 -112624 -29426 193046
13448A93046J00174J2720n0103r8705j6544K9482q8102j0720j08088O3629J43517
$$ 193046 293220 305940 255837 157132 140588 170070 81968 71248 -36840 26789 170306
13437A70306K4237n8335k313Q86K1986m5040J9440r8189r299j3213k9832k9472
$$ 170306 194543 136208 133895 134781 156767 111727 131167 32978 23679 10466 -19366 -48838
13425d8838O1321M9274n1756m2129M1786L2203J1392O1468J23198R8312p2016
$$ -48838 12483 61757 10001 -32128 9658 41861 53253 114721 237919 336231 264215
13414B64215j034K47m0209n8595q2238l4252l0172o6509j8426N3534O7962N3833
$$ 264215 263181 263428 223219 164624 82386 48134 17962 -48547 -66973 -13439 54523 108356
13402A08356l4447j04399o7750P9195k399M4431R2090J7918P4958J3109o3543
$$ 108356 73909 -30490 -98240 -19045 -21444 22987 115077 132995 207953 221062 157519
13391A57519j77517o2139m7103Q1738J78847R1740M0320N7447k469p4854p5460
$$ 157519 -19998 -82137 -129240 -47502 131345 223085 263405 320852 318383 243529 168069
13380A68069j2322O6230J7083o2145q6068K7451O5275j04915o6519N5436M3156
$$ 168069 155747 221977 239060 176915 90847 118298 183573 78658 12139 67575 110731
13369A10731M2439j26582l9155R3352N1478j9305m4632o4558O4128K3540J32416
$$ 110731 153170 26588 -12567 80785 132263 112958 68326 3768 67896 91436 223852
13358B23852J18127k0500q4555j55026n0761Q3699j10531Q10M2574K844N0580
$$ 223852 341979 321479 236924 81898 31137 114836 4305 5115 47689 50533 101113
13347A01113M531L4774o1581K3806N9717j01096m3053m2069j11189K8638J00910
$$ 101113 105644 140418 78837 102643 162360 61264 18211 -23858 -135047 -106409 -5499
13336e499K4493J9635Q3256O3048O7348n5422L0611j2528q3587r6857o2992M0081
$$ -5499 18994 38629 121885 184933 252281 196859 227470 214942 131355 34498 -28494 11587
13324A1587J05921r8102j1512j04982J41236J47286j0877j13521q1203P8261P3719
$$ 11587 117508 19406 7894 -97088 44148 191434 180557 67036 -14167 64094 137813
13313A37813J8869o704J9083O5461k3205P350k4544k0834o6436K1780L959m3142
$$ 137813 156682 149978 169061 234522 211317 218667 194123 173289 106853 128633 132592 89450
13301H9450N979J2621J37507R0852J7624K476q5371L1398j10519j28038R6462
$$ 89450 95429 108050 245557 336409 354033 356509 271138 302536 192017 63979 160441
13290A60441J40178r21j31194p9660J03092K7265O2128j24446p6053j924P5930
$$ 160441 300619 299698 168504 88844 191936 219201 281329 156883 80830 78906 154836
13279A54836J2837Q2337r9380k0843K3721K0565J4383l8999O45J4585J9903M6041
$$ 154836 167673 250010 150630 129787 153508 174073 188456 149457 150102 164687 184590 230631
13267B30631L3986R959k00725l7908j5885m3651K6928J23254M3274j859k4437
$$ 230631 264617 274576 73851 35943 20058 -23593 3335 126589 169863 168004 143567
13256A43567Q8379N1487p7018q5142p6352J23768Q2499n6933p177K2541l1486
$$ 143567 231946 283433 206415 121273 44921 168689 251188 194255 187078 209619 178133
13245A78133R733n7805o8176n8427M4360l8348M6044L4279J8287M6678j4110m9358
$$ 178133 187866 130061 61885 3458 47818 9470 55514 89793 108080 154758 140648 91290
13233I1290L0689K2132O2563j7497n2814J05661j06440j25655l367L5155N4920
$$ 91290 121979 144111 206674 189177 136363 242024 135584 9929 6562 41717 96637
13222I6637J37855K1734J1895O4928M910j63688j18712N1941m2016K1228L7471
$$ 96637 234492 256226 268121 333049 337959 174271 55559 107500 65484 86712 124183
13211A24183q662L4169q9611l8481O9788J23358N9724l5424j41842L5109o4415
$$ 124183 115521 149690 60079 21598 91386 214744 274468 239044 97202 132311 67896
13200F7896p7145n4047K05922J01474q8684Q1209m9636o3651J3413M7495l4048
$$ 67896 -9249 -63296 142626 244100 155416 236625 186989 123338 136751 184246 150198
13189A50198l8645M6782j31056k6592N4168P0664J56426j82090m0234P0826q5406
$$ 150198 111553 158335 27279 687 54855 125519 281945 99855 59621 130447 45041
13178D5041m487K3414r056R9673K5653n28J4895l9292j8164p453m9506L2150P7035
$$ 45041 40554 63968 54912 154585 180238 179710 194605 155313 137149 129696 80190 112340 189375
13165A89375O2606K19K7022K0393q9282P8066J3527m4046N8561n5724n2249p4734
$$ 189375 251981 252200 279222 299615 210333 288399 301926 257880 316441 260717 208468 133734
13153A33734l7602O3869k4656r100Q1582N2253j12075P8396o0894o0223N4115
$$ 133734 96132 160001 135345 126245 207827 260080 148005 226401 165507 105284 159399
13142A59399M4875K7118J00842q5167k7939m7640J3776m4008j6801K3128L3584
$$ 159399 204274 231392 332234 247067 219128 171488 185264 141256 124455 147583 181167
13131A81167R4373J5209q8599M2101P8802q6378k4569O3343M7178k1509O6563
$$ 181167 275540 290749 202150 244251 323053 236675 212106 275449 322627 301118 367681
13120C67681l4885k9287P0883J4402n0083o2284N7091n5343N481p1043L6324r932
$$ 367681 332796 303509 374392 388794 338711 276427 333518 278175 283656 212613 248937 239005
13108B39005m9363K8415q0617n7225M7499k1777o4751J4263N8221O4595P1812
$$ 239005 189642 218057 137440 80215 127714 105937 41186 55449 113670 178265 250077
13097B50077N3892L7363Q612P737q890J1329M5928m4768j06979L2576o6047p3830
$$ 250077 303969 341332 349944 357681 348791 360120 406048 361280 254301 286877 220830 147000
13085A47000n945L2553l363M7358o1152j49213R2534P7860R4104M6709l0320r8063
$$ 147000 141055 173608 170245 217603 156451 7238 99772 177632 271736 318445 288125 190062
13073A90062j11651r3366Q5766J01696J07187l766n67N0856o7976J8646J42507
$$ 190062 78411 -14955 70811 172507 279694 275928 275361 326217 258241 276887 419394
13062D19394J0053o1541n0104J8661J5628j3346m3040p4877n826j69728Q604J07198
$$ 419394 429447 367906 317802 336463 352091 338745 295705 220828 215002 45274 53878 161076
13050A61076J7748q5849Q2217J08789m494j43597q813J43867P1567j1213k6546
$$ 161076 178824 92975 175192 283981 279487 135890 127077 270944 342511 331298 304752
13039C04752n5053K9473O593j21082l3903R850k2015R1556j7710J08391R3721
$$ 304752 249699 279172 285765 164683 130780 140630 118615 210171 192461 300852 394573
13028C94573m7216n4298m4742p0724P9260J15204R2296O6071p1599r0727m1213
$$ 394573 347357 293059 248317 177593 256853 372057 464353 530424 458825 368098 326885
13017C26885p3519O3345J15423j37016k17812Q9652J81382P5149J2603j6941m1395
$$ 326885 253366 316711 432134 295118 77306 166958 348340 423489 436092 419151 377756
13006C77756q9224J9021O7075m2986p9471J08774M6795K9678P1062o0370j46897
$$ 377756 288532 307553 374628 331642 252171 360945 407740 437418 508480 448110 301213
12995C01213j20761J15227Q1008j12071j19469J80538Q5225L3806n0440J10632
$$ 301213 180452 295679 376687 264616 145147 325685 410910 444716 394276 504908
12985E04908Q687m4707q2195J2456l7876m0168k5707k988p2433L466O0528k4614
$$ 504908 513595 468888 386693 399149 361273 321105 295398 292410 219977 223443 283971 259357
12973B59357r909O1946Q8136N0435N8382k0291j28448p3926n9617p2054N4061
$$ 259357 249448 311394 399530 449965 508347 488056 359608 285682 226065 154011 208072
12962B08072N0313K0687N278l0925J3615J03817l7054j62572M5425R0998j913
$$ 208072 258385 279072 284350 253425 267040 370857 333803 171231 216656 307654 305741
12951C05741p4324O0629N4000n2325o3459Q5924P1721m4593k2598k5715Q6355
$$ 305741 231417 292046 346046 293721 230262 316186 387907 343314 320716 295001 381356
12940C81356N9571j09287l2780M1247N9872O3353K8636r7397r4955L9161J16377
$$ 381356 440927 331640 298860 340107 399979 463332 491968 394571 299616 338777 455154
12929D55154J9637l0166K1123J3383k0456m4113P379K576j7989N0007Q8519Q2521
$$ 455154 474791 444625 465748 479131 458675 414562 421941 424517 406528 456535 545054 627575
12917F27575k4594j35587j4729m3399J230J19184m5189r0696J949M6887R36l9892
$$ 627575 602981 467394 452665 409266 410496 529680 484491 393795 395744 442631 443567 403675
12905D03675K1039M4129o5749j37935l7079N3675N413J90425N1173o681m7967
$$ 403675 424714 468843 403094 265159 228080 281755 287168 477593 528766 522085 474118
12894D74118P9817O8852M0003j7904p4005j19762l0156m8030o6032L8219Q0029
$$ 474118 553935 622787 662790 644886 570881 451119 420963 372933 306901 345120 425149
12883D25149N2842K5522K9755j5401r3684j36173r8923M8028J34739K5977K4345
$$ 425149 477991 503513 533268 517867 424183 288010 189087 237115 371854 397831 422176
12872D22176N4625n3278K2895J6449k8207K5107j8600k5490n925O4985O7642j70816
$$ 422176 476801 423523 446418 462867 434660 459767 441167 415677 409752 474737 542379 371563
12860C71563m7063N5166n407J17820R6953q8024j44723Q1610J38697k827L3374
$$ 371563 324500 379666 374259 492079 589032 501008 356285 437895 576592 573765 607139
12849F07139O6415j00264j07085l1638m820J02323N8365n6080m7512L9712L8105
$$ 607139 673554 573290 466205 434567 429747 532070 590435 534355 486843 526555 564660
12838E64660O803n1280r0273J8337J04021L4231Q6661K2194j12700r4596n8343
$$ 564660 571463 520183 429910 448247 552268 586499 673160 695354 582654 488058 429715
12827D29715R7201j3209N928P7645O0505j9895P68J6634p7384j07474n793l6335
$$ 429715 526916 513707 519635 597280 657785 637890 638658 655292 577908 470434 464641 428306
12815D28306o8935N9781M6762O8472p8159j29621J9600J3106J7442R5361n1102
$$ 428306 359371 419152 465914 534386 456227 326606 346206 359312 376754 472115 421013
12804D21013J27291J26122p623r2202j40312J20069O0516j02184m4069K5909M8023
$$ 421013 548304 674426 666803 574601 434289 554358 614874 512690 468621 494530 542553
12793E42553l7820r0225j05961N2460J43659N5453Q4337O019r0209j8742l9816
$$ 542553 504733 414508 308547 361007 504666 560119 644456 650475 560266 541524 501708
$$ [...]
##END NTUPLES=NMR SPECTRUM
##END=
