##TITLE=Analysis number 318116
Compound Code ac 35897
Project Code adrs
Chemist Name frontier sci
##JCAMPDX= 6.0         $$ Bruker NMR JCAMP-DX V2.0
##DATA TYPE= NMR SPECTRUM
##DATA CLASS= NTUPLES
##ORIGIN= Bruker BioSpin GmbH
##OWNER= nmr
$$ XWIN-NMR		Version 3.5
$$ Thu Mar 16 08:32:14 2006 GMT Standard Time (UT+0h)  MAYBRIDGE\nmr@NMR_250MHZ
##.OBSERVE FREQUENCY= 250.131544655141
##.OBSERVE NUCLEUS= ^1H
##.ACQUISITION MODE= SIMULTANEOUS (DQD)
##.ACQUISITION SCHEME= undefined
##.AVERAGES= 16
##.DIGITISER RES= 18
##SPECTROMETER/DATA SYSTEM= dpx250
##.PULSE SEQUENCE= zg30
##.SOLVENT NAME= DMSO
##.SHIFT REFERENCE= (INTERNAL, DMSO, 0, 16.522)
##AUDIT TRAIL= $$ (NUMBER, WHEN, WHO, WHERE, WHAT)
$$ ##TITLE= Audit trail, XWIN-NMR		Version 3.5
$$ ##JCAMPDX= 5.01
$$ ##ORIGIN= Bruker BioSpin GmbH
$$ ##OWNER= nmr
$$ C:\u/data/dgb/nmr/ADRS/820/pdata/1/auditp.txt
$$ ##AUDIT TRAIL=  $$ (NUMBER, WHEN, WHO, WHERE, WHAT)
(   1,<2006-03-16 08:31:52.73 +000>,<MAYBRIDGE\nmr>,<NMR_250MHZ>,
      <created by zg, POWCHK disabled, PULCHK disabled
       configuration hash MD5:
       84 BC 41 DB A1 6E 1D 46 DA 25 12 A5 C1 ED C5 3A
       data hash MD5: 64K
       9E 2B 0A 9D AE CE D8 43 A6 86 C7 2C 08 D9 5D 66>)
(   2,<2006-03-16 08:32:05.14 +000>,<MAYBRIDGE\nmr>,<NMR_250MHZ>,
      <Start of raw data processing
       ef LB = 0.3 FT_mod = 6 PKNL = 1 SI = 32K 
       data hash MD5: 32K
       5C 32 80 8C 9D E5 FC 26 A1 A8 80 7E B7 88 93 89>)
(   3,<2006-03-16 08:32:06.61 +000>,<MAYBRIDGE\nmr>,<NMR_250MHZ>,
      <apk 
       data hash MD5: 32K
       9E EA 00 B7 E6 28 69 9C C4 2C 3D CA 19 0D 19 52>)
(   4,<2006-03-16 08:32:07.41 +000>,<MAYBRIDGE\nmr>,<NMR_250MHZ>,
      <abs ABSG = 5 
       data hash MD5: 32K
       9F 70 15 E8 60 B7 F0 F5 00 6A 30 5C 66 71 E2 21>)
$$ ##END=
$$ 
$$ hash MD5
$$ 91 D1 FA 05 99 24 41 AD FC EF 21 09 B3 95 BE F0
##$RELAX= 
##$RELAX= 
##$RELAX= 
##$RELAX= 
##$RELAX= 
##$RELAX= 
##$RELAX= 
$$ Bruker specific parameters
$$ --------------------------
##$DU= <C:\u>
##$EXPNO= 820
##$NAME= <ADRS>
##$PROCNO= 1
##$TYPE= <nmr>
##$USER= <dgb>
##$AMP= (0..31)
100 100 100 100 100 100 100 100 100 100 100 100 100 100 100 100 100 100 
100 100 100 100 100 100 100 100 100 100 100 100 100 100 
##$AQSEQ= 0
##$AQ_mod= 3
##$AUNM= <au_zg>
##$AUTOPOS= <4 >
##$BF1= 250.13
##$BF2= 250.13
##$BF3= 250.13
##$BF4= 250.13
##$BF5= 500.13
##$BF6= 500.13
##$BF7= 500.13
##$BF8= 500.13
##$BYTORDA= 1
##$CFDGTYP= 0
##$CFRGTYP= 5
##$CHEMSTR= <none>
##$CNST= (0..31)
1 1 145 1 1 1 1 1 1 1 1 1 1 1 1 1 1 1 1 1 1 1 1 1 1 1 1 1 1 1 1 1 
##$CPDPRG= <>
##$CPDPRG1= <>
##$CPDPRG2= <>
##$CPDPRG3= <>
##$CPDPRG4= <mlev>
##$CPDPRG5= <mlev>
##$CPDPRG6= <mlev>
##$CPDPRG7= <mlev>
##$CPDPRG8= <mlev>
##$CPDPRGB= <>
##$CPDPRGT= <>
##$D= (0..31)
0 1 0 0 0 0 0 0 0 0.06 0 0 0 0 0 0 0.0002 0 0 0 0 0 0 0 0 0 0 0 0 0 0 
0 
##$DATE= 1142497911
##$DBL= (0..7)
120 120 120 120 120 120 120 120 
##$DBP= (0..7)
150 150 150 150 150 150 150 150 
##$DBP07= 0
##$DBPNAM0= <>
##$DBPNAM1= <>
##$DBPNAM2= <>
$$ [...]
##$SUBNAM7= <"">
##$SUBNAM8= <"">
##$SUBNAM9= <"">
##$SW= 20.6930455092707
##$SWIBOX= (0..15)
0 0 3 0 0 0 0 0 0 0 0 0 0 0 0 0 
##$SW_h= 5175.983436853
##$TD= 65536
##$TD0= 1
##$TE= 294.16
##$TE2= 300
##$TE3= 300
##$TEG= 300
##$TL= (0..7)
0 120 120 120 120 120 120 120 
##$TP= (0..7)
150 150 150 150 150 150 150 150 
##$TP07= 0
##$TPNAME0= <>
##$TPNAME1= <>
##$TPNAME2= <>
##$TPNAME3= <>
##$TPNAME4= <>
##$TPNAME5= <>
##$TPNAME6= <>
##$TPNAME7= <>
##$TPOAL= (0..7)
0.5 0.5 0.5 0.5 0.5 0.5 0.5 0.5 
##$TPOFFS= (0..7)
0 0 0 0 0 0 0 0 
##$TUNHIN= 0
##$TUNHOUT= 0
##$TUNXOUT= 0
##$USERA1= <user>
##$USERA2= <user>
##$USERA3= <user>
##$USERA4= <user>
##$USERA5= <user>
##$V9= 5
##$VALIST= <valist>
##$VCLIST= <CCCCCCCCCCCCCCC>
##$VD= 0
##$VDLIST= <DDDDDDDDDDDDDDD>
##$VPLIST= <PPPPPPPPPPPPPPP>
##$VTLIST= <TTTTTTTTTTTTTTT>
##$WBST= 1024
##$WBSW= 4
##$XGAIN= (0..3)
0 0 0 0 
##$XL= 0
##$YL= 0
##$YMAX_a= 437618
##$YMIN_a= -449454
##$ZGOPTNS= <>
##$ZL1= 120
##$ZL2= 120
##$ZL3= 120
##$ZL4= 120
##$ABSF1= 16.522
##$ABSF2= -4.171173
##$ABSG= 5
##$ABSL= 3
##$ALPHA= 0
##$AQORDER= 0
##$ASSFAC= 0
##$ASSFACI= 0
##$ASSFACX= 0
##$ASSWID= 0
##$AUNMP= <proc_1d>
##$AZFE= 0.1
##$AZFW= 0.1
##$BCFW= 0
##$BC_mod= 0
##$BYTORDP= 0
##$COROFFS= 0
##$CY= 12.5
##$DATMOD= 1
##$DC= 0
##$DFILT= <>
##$DTYPP= 0
##$F1P= 14.0000005364418
##$F2P= -0.99999901652339
##$FCOR= 0.5
##$FTSIZE= 32768
##$FT_mod= 6
##$GAMMA= 0
##$GB= 0
##$INTBC= 1
##$INTSCL= 1
##$ISEN= 128
##$LB= 0.3
##$LEV0= 0
##$LPBIN= 0
##$MAXI= 10000
##$MC2= 0
##$MEAN= 0
##$ME_mod= 0
##$MI= 0
##$NCOEF= 0
##$NC_proc= -2
##$NLEV= 6
##$NOISF1= 0
##$NOISF2= 0
##$NSP= 0
##$NTH_PI= 0
##$NZP= 0
##$OFFSET= 16.522
##$PC= 1
##$PHC0= 164.0068
##$PHC1= 6.183571
##$PH_mod= 1
##$PKNL= yes
##$PPARMOD= 0
##$PSCAL= 4
##$PSIGN= 0
##$REVERSE= no
##$SF= 250.13
##$SI= 32768
##$SIGF1= 0
##$SIGF2= 0
##$SINO= 400
##$SIOLD= 32768
##$SREGLST= <1H.DMSO>
##$SSB= 0
##$STSI= 32768
##$STSR= 0
##$SW_p= 5175.98343685301
##$SYMM= 0
##$S_DEV= 0
##$TDeff= 65536
##$TDoff= 0
##$TI= <Analysis number 999999
Compound Code 99
Book Reference 9
Project Code 9>
##$TILT= no
##$TM1= 0
##$TM2= 0
##$TOPLEV= 0
##$USERP1= <user>
##$USERP2= <user>
##$USERP3= <user>
##$USERP4= <user>
##$USERP5= <user>
##$WDW= 1
##$XDIM= 32768
##$YMAX_p= 294282879
##$YMIN_p= -113450
$$ End of Bruker specific parameters
$$ ---------------------------------
##NTUPLES= NMR SPECTRUM
##VAR_NAME=  FREQUENCY,     SPECTRUM/REAL,   SPECTRUM/IMAG
##SYMBOL=    X,             R,               I
##VAR_TYPE=  INDEPENDENT,   DEPENDENT,       DEPENDENT
##VAR_FORM=  AFFN,          ASDF,            ASDF
##VAR_DIM=   32768,         32768,           32768
##UNITS=     HZ,            ARBITRARY UNITS, ARBITRARY UNITS
##FACTOR=    0.157963299565203, 1,           1
##FIRST=     4132.6476996994, 0,             0
##LAST=      -1043.33573715361, 0,           0
##MIN=       -1043.33573715361, -113450,     0
##MAX=       4132.6476996994, 294282879,     0
$$ Real data points
##PAGE= N=1
##DATA TABLE= (X++(R..R)), XYDATA
$$ [...]
14966I675K668l1106k5549P710K4140K4212j1225J0724n59Q31k602J3119R687
14953C1725J1915k108k1609j5667J932j5716n866J157J549J0508p735K661o12
14940g866Q040L768O546R381m998m244j155j1479o028o200q068Q987P408j669
14926g577J1073m280R644K742O38j0581L82O871j4220R408N733j330m766K7P47
14911D511O688j571Q738n349j9047L268J5117N381n027j5520J5310j128p99L65
14897A0937j2144K495J1309j0282OJ384J2404k3189p365j2626J8330J8884K707
14884A2850m874o319J424J1181O897K951R216j4908q392K056r070m466K33K594
14870A373K650k3262P234J0543r315R60o144N214O117O602J0530O526j5049r609
$$ plain form
14966 9675 12343 -18763 -44312 -36602 -12462 11750 525 11249 10690 11521 8919 22038 31725
14953 31725 43640 41532 19923 4256 6188 -9528 -15394 -14237 -12688 -2180 -9915 -7254 -7866
14940 -7866 174 3942 10488 19869 14871 10627 9472 -2007 -8035 -14235 -22303 -13316 -5908 -7577
14926 -7577 3496 -784 8860 11602 12240 1659 2041 8912 -5308 4100 9833 8503 3737 3764 4511
14911 4511 11199 9628 18366 13017 -6030 -2762 12355 17736 12709 -2811 12499 11371 10572 10937
14897 10937 -1207 1288 12597 2315 2321 3705 16109 -7080 -14445 -27071 -8741 10143 12850
14884 12850 7976 1657 3081 14262 21159 24110 33326 18418 10026 12082 3012 -1454 -1221 1373
14870 1373 4023 -19239 -12005 -1462 -10777 -9817 -15961 -10747 -4630 1972 12502 19028 3979 -5630
14856e630Q183r372p076J0996J4474K156q592m975n501j0348R095O316J3249o719
14842F256l498o733L575l453J1575K595J2260j477N056j2760k3423k0074K0663
14829i438K2235m530j8849n762M537J268k438j4107Q567J301P863O625K396J6736
14815A6404k671j259j838N775r033j9787j2072R014q71J4961K852P003R327L019
14801B0824M505P930o81j0707j5379L835J5540J751r372l093K7486M754j7102
14788C0291j7380j4758p200p487L970l105L634J0448q019r015J645Q737J4077
14775E838l155N236o655q534K83j860j0242J645l902J2683J1709J9479K02j0292
14761A2435O843j8168j1347k372O11N969o929k2301J4759J4347j1493N432O926
$$ plain form
14856 -5630 2553 -6819 -13895 -2899 11575 13731 5139 164 -5337 -15685 -6590 -274 12975 6256
14842 6256 2758 -3975 -400 -3853 7722 10317 22577 21100 26156 13396 -10027 -30101 -9438
14829 -9438 12797 8267 -10582 -16344 -11807 -10539 -12977 -27084 -18517 -17216 -9353 -2728 -332 16404
14815 16404 13733 12474 10636 16411 7378 -12409 -24481 -15467 -16338 -1377 1475 8478 17805 20824
14801 20824 25329 33259 32578 21871 6492 10327 25867 27618 18246 15153 42639 47393 30291
14788 30291 12911 -1847 -9047 -16534 -12564 -15669 -12035 -1587 -9606 -18621 -16976 -8239 5838
14775 5838 2683 7919 1264 -7270 -6987 -8847 -19089 -17444 -21346 -8663 3046 22525 22727 12435
14761 12435 19278 1110 -10237 -12609 -11998 -6029 -12958 -35259 -20500 -6153 -17646 -12214 -5288
14748e288J0404Q307j0462q06J4901J2112j2892j5721j4814l465n16O651J365
14735a0224n38j831l424P762K778M472m826q086Q230J021Q372K1208Q299q462
14721B4751n932j2742l773L003J6148O969o281j7971j8868p150J5708M749K623
14708A234J0702J7080o673k0026L376R697j1990j575j2195m922Q503J0457J1739
14695A5407q970k1039O637J0980J5487j4541m309M431j3900N996Q479l0459j4904
14682d0705R698J4242Q942j619L427Q094m037j1334j335k662p985J260K4553J0463
14668A1002j251J2227p090j0631j289k3577M099k726J6957K2689j2306p324L704
14655D484Q480Q11L040j2356j2672r598O048O003o29j942r442m733j378n353r558
$$ plain form
14748 -5288 5116 13423 2961 2155 17056 29168 16276 555 -14259 -17724 -18240 -11589 -10224
14735 -10224 -10762 -12593 -16017 -8255 -5477 -1005 -5831 -13917 -5687 -4666 3706 24914 33213 24751
14721 24751 18819 6077 2304 5307 21455 28424 22143 4172 -14696 -21846 -6138 -1389 1234
14708 1234 11936 29016 22343 2317 5693 15390 3400 1825 -10370 -15292 -6789 3668 15407
14695 15407 6437 -14602 -7965 3015 18502 3961 -348 4083 -9817 -3821 4658 -25801 -40705
14682 -40705 -31007 -16765 -7823 -9442 -6015 2079 -1958 -13292 -14627 -17289 -25274 -24014 539 11002
14668 11002 9751 21978 14888 4257 2968 -20609 -16510 -19236 -2279 20410 8104 780 4484
14655 4484 12964 13775 16815 4459 -8213 -17811 -11763 -5760 -6389 -8331 -17773 -22506 -23884 -29237 -38795
14640c8795J6979l445n435M391N242O09J2247J0391q480j5642j2278j3354K1164
14627b6406J4367n813J1950N735M110q564n106J6302J0603M23r011j0604j1007
14614a3021k075m862J46J9536K741R585k963r778k983J4661L781m787O684qj6918
14599b61j2979k103j318K702P68N836M722l718k0365j6777J9281R896Q386M404
14585a526j1572j618Q37R345l455j120k587P219N844r152K307J1739P471J364
14571A5096n414k820M211j2769m11J2792j287q484K0340M860j0322j3254n133
14558b595k0079M935J2914l570M929m698l837n34K047j6324j0166J4192L831J949
14544a7006J0490K2677j7103m580J062P389j0572j183n587r025K4824J6946J48
$$ plain form
14640 -38795 -21816 -25261 -30696 -26305 -21063 -20454 -8207 2184 -6296 -21938 -34216 -47570 -26406
14627 -26406 -12039 -17852 -5902 -167 3943 -4621 -9727 6575 17178 17601 8590 -2014 -13021
14614 -13021 -15096 -19958 -19812 -276 2465 12050 9087 -691 -3674 10987 14768 9981 16665 16657 -261
14599 -261 -13240 -15343 -16661 -13959 -13191 -7355 -2633 -6351 -26716 -43493 -24212 -14316 -5930 -1526
14585 -1526 -13098 -14716 -13879 -4534 -7989 -9109 -11696 -4477 1367 -7785 -5478 6261 13732 15096
14571 15096 9682 6862 11073 -1696 -2107 10685 9398 914 21254 26114 15792 2538 -2595
14558 -2595 -22674 -17739 -4825 -8395 -3466 -8164 -12001 -12535 -10488 -26812 -36978 -22786 -18955 -17006
14544 -17006 -6516 16161 -942 -5522 -4460 2929 -7643 -8826 -14413 -23438 1386 18332 18480
14531A8480j4459q34L782o289K63r51J6250L760j9202k0216N538J5161l359P191
14517E115J7064r349k22j1180j1665Q516J1892j4090K218o528L162J000M256j4388
14503a4199o791O703J5118j3180K573p492N541R405M624k689k7737k97L876K0209
14489d336j533o557p147L525p182L532M54R179o934r080O379M200j787N865P165
14474d257o573J2254O108q362n390M118K386j0820j9814m854K7135j239k493n597
14460a7398J824L725L773n092j7793K061q15K124J725K2L661M722r190n58l332
14445c0541R631J8160Q775R263l834r947k579p778j6201J4958o60R166k239J131
14431b695R953J2476m635j8922j1107O081J954p495N309Q592M916j7593q676j0482
$$ plain form
14531 18480 4021 3187 6969 680 943 -8 16242 20002 800 -19416 -13878 1283 -2076 5115
14517 5115 22179 12830 12608 1428 -10237 -1721 10171 -3919 -1701 -8229 -5067 -4067 189 -14199
14503 -14199 -20990 -14287 831 -12349 -9776 -17268 -11727 -2322 2302 -387 -28124 -28421 -24545 -4336
14489 -4336 -5869 -12426 -19573 -16048 -23230 -19698 -19244 -10065 -16999 -26079 -19700 -15500 -17287 -11422 -4257
14474 -4257 -10830 1424 7532 -830 -6220 -2102 284 -10536 -30350 -35204 -8069 -9308 -11801 -17398
14460 -17398 -15574 -11849 -8076 -13168 -30961 -28900 -29715 -27591 -25866 -25844 -22183 -17461 -26651 -27209 -30541
14445 -30541 -20910 -2750 6025 15288 11454 1507 -1072 -8850 -25051 -10093 -10753 -1587 -3826 -2695
14431 -2695 7258 19734 15099 -3823 -14930 -8849 -6895 -14390 -9081 -489 4427 -13166 -21842 -32324
14417c2324J9974J0021k375J199N365r71p002K42j4957n156M248K727k107o764
14403b7880J2740O314m19j2989q102R848J6042r401R40o808J2349J1852K370m835
14389B021J125l595P356o796p669J2023j280r399k718p878j0081r40n667j1693
14375d5191J1400N691p744K4384L06K775n853R38J0724M097j811L454l454j3903
14361a4187k797Q451L074J6647K421m00Q959q417j3630l150j181j0506k88J1113
14347c891K0427p969j3831j0153M719j7357k99J0110R41l638M964J5032P375j7211
14333a0781m490N055r739R434K2677J807k705n085k6643L558n688j1196j864J0426
14319b5234J8951K922N859j852P120M887M347J757r557l0851j6840K1007L326
$$ plain form
14417 -32324 -12350 -2329 -4704 -3505 1860 889 -6113 -5871 -20828 -25984 -21736 -19009 -21116 -27880
14403 -27880 -15140 -8826 -9245 -22234 -30336 -20488 -4446 -13847 -12907 -19715 -7366 4486 6856 2021
14389 2021 3146 -449 6907 111 -7558 4465 3185 -6214 -8932 -16810 -26891 -27831 -33498 -45191
14375 -45191 -33791 -28100 -35844 -11460 -11154 -8379 -14232 -13294 -2570 1527 -284 3170 -284 -14187
14361 -14187 -16984 -8533 -5459 11188 13609 13209 22168 13751 121 -3029 -4210 -14716 -15004 -3891
14347 -3891 16536 8567 -5264 -15417 -10698 -28055 -28354 -18244 -17303 -20941 -15977 -945 6430 -10781
14333 -10781 -15271 -10216 -19955 -10521 12156 13963 11258 6173 -20470 -16912 -22600 -33796 -35660 -25234
14319 -25234 -6283 -3361 2498 646 7766 12653 17000 18757 9200 -21651 -38491 -17484 -14158
14306a4158P410K19r574o514N217N510p301J956k215o683Q404P512k982J4167
14292I68Q797p104j2086P602J6161k097N409J5762j6286j7821j4322Q737J9925
14279A3645J9806p804j2680o39O30J2193k31j7535j967j3023j5504o358q199P470
14265c0196J9926J1956J2138L31j4940q726J489k460l038J224K934L356Qm647
14251a0645l550J528n988p305n773N019K4459J9956L704M759o043n006O003l097
14237A8021l343p052P64p35L295P944j5780N846J722j3768j2536K984j2058N816
14223a8880K5523J6278m110k7887j6327k431M320J5285J4490k712k8117j7961
14211d2529L683J3789J770L234J3383l398o183j4253j153Q29Q15J413J3095K2732
$$ plain form
14306 -14158 -6748 -6529 -16103 -22617 -17400 -11890 -19191 -17235 -19450 -26133 -17729 -10217 -13199 968
14292 968 9765 2661 -9425 -1823 14338 12241 17650 33412 17126 -695 -15017 -6280 13645
14279 13645 33451 25647 12967 12328 12958 25151 24920 7385 5418 -7605 -23109 -29467 -37666 -30196
14265 -30196 -10270 1686 13824 14155 -785 -9511 -8022 -10482 -13520 -12296 -9362 -6006 -5998 -10645
14251 -10645 -14195 -12667 -18655 -25960 -31733 -26714 -2255 17701 21405 26164 20121 15115 21118 18021
14237 18021 14678 7626 8390 7655 10950 18894 3114 8960 10682 -3086 -15622 -12638 -24696 -18880
14223 -18880 6643 22921 18811 -9076 -25403 -27834 -23514 -8229 6261 3549 -24568 -42529
14211 -42529 -38846 -25057 -23287 -20053 -6670 -10068 -16251 -30504 -31657 -30828 -30013 -28600 -15505 7227
14197G227l281n889m547n721R541M191n339j4762j2025R324J7406J1389R887J837
14183A9238j4758M170L13J1714m385J1702l503n490J6443k825j0058J1678p839
14170B6400j0370l221k613l365K660J053l446j072J853j1402j2615m469Q800j6623
14156b8430q181J9944L2117L012j6150P344R522n948j3744Q376K412j5672j0292
14143a5690J3304K3244o173J0063o357q960j1648J125J660k908J9051O397l706
14130A9402Q286j2026j9123Q852j6822J709J5517O662R50n948r957r494q238Q926
14116a1304K1510n754p102K899J7101L509L753k0813k0853O611r28n492n438J7771
14102d530Q438K937N703j1631M276J4308q235j1251o866J5618L241j3856j2566
$$ plain form
14197 7227 3946 -1943 -6490 -12211 -2670 1521 -3818 -18580 -30605 -21281 -3875 7514 17401 19238
14183 19238 4480 8650 8963 20677 16292 27994 24491 19001 35444 32619 22561 34239 26400
14170 26400 16030 12809 10196 6831 9491 10544 7098 6026 7879 -3523 -16138 -20607 -11807 -28430
14156 -28430 -36611 -16667 15450 18462 2312 9656 19178 13230 -514 7862 10274 -5398 -15690
14143 -15690 -2386 20858 14685 24748 18391 9431 -2217 -1092 568 -2340 16711 23108 19402
14130 19402 27688 15662 -3461 5391 -11431 -9722 5795 12457 13407 7459 -2498 -11992 -20230 -11304
14116 -11304 10206 4452 -2650 249 17350 20859 24612 3799 -17054 -10443 -11371 -16863 -22301 -4530
14102 -4530 3908 6845 12548 917 5193 19501 11266 15 -6851 8767 12008 -1848 -14414
14089a4414J5903L107o376J2839N565o863j2667n170Q70j0120k434O481l783p331
14075b4393m61J9353O817R870M213r768j9217P799j499j0718N427N129J1294N516
14061I362j0224k090q504j6696J0881M486l656j970Q867J5392J354k095O933q22
14047A1218j8792M609J5940p657k5896j1835J594l386J5136l21l733J7128J5738
14034I743M672P398k089j2435j1972J0178j422l655J5583p992j9082k4067J4178
14021b0962K1659M588j2040m107K2352O541p723J3035q050p9q48j5953J359k099
14007b327N519N427J3335K310n296j367j093j9114p214L685o812O303J0170n341
13993a815J4357J7682j7262k2556r256O950J7389k075j8316j6755p345L1655l113
$$ plain form
14089 -14414 1489 4596 -1780 11059 16624 9761 -2906 -8076 -7206 -17326 -19760 -13279 -17062 -24393
14075 -24393 -24854 -5501 1316 11186 15399 5631 -13586 -5787 -7286 -18004 -12577 -7448 3846 9362
14061 9362 -862 -2952 -11456 -28152 -17271 -12785 -16441 -18411 -9544 5848 7202 5107 12040 11218
14047 11218 -7574 -2965 12975 5318 -20578 -32413 -30819 -34205 -19069 -19390 -23123 -5995 9743
14034 9743 14415 21813 19724 7289 -4683 5495 4073 418 16001 8009 -11073 -35140 -20962
14021 -20962 697 5285 -6755 -10862 11490 18031 10308 23343 15293 15214 14366 -1587 -228 -2327
14007 -2327 3192 8619 21954 24264 18968 17601 16508 -2606 -9820 -6135 -12947 -6644 3526 -1815
13993 -1815 12542 30224 12962 -9594 -18850 -11900 5489 3414 -14902 -31657 -39002 -7347 -10460
13980a0460M635K616r083m635R96Q61N195l259Q155J3824o544j0656m986n374
13966a8715l524J3816Q157J5922M021l485j777m078m543M801o081n169j15j4435
13952a5205p920j1640N830J4407K481j0166M047J0266K3372m596j5433L017O995
13939E455R023j1635j7805l054Q219J2351J987J621R442O94o162K94r750J008
13925A688R107R40Q386K966j3951j3266J2239J263j2118j9213L031J1633J0589
13912C294J590K036L591N496P809j8001j0413L297J185J5855k680r859q643k224
13898g667L976R010L721N123p381K236N87r751k091o231o235K682N364k596n652
13883a4905J0308j0181J1129K2689M013j0060k042p466k7533j3014J8403J0577
$$ plain form
13980 -10460 -5825 -3209 -12292 -16927 -15931 -15070 -9875 -13134 -4979 8845 2301 -8355 -13341 -18715
13966 -18715 -22239 -8423 -266 15656 19677 16192 14415 10337 5794 10595 4514 -655 -770 -15205
13952 -15205 -23125 -34765 -28935 -14528 -12047 -22213 -18166 -7900 15472 10876 -4557 -1540 5455
13939 5455 14478 2843 -14962 -18016 -9797 2554 4541 6162 15604 16298 10136 10430 680 1688
13925 1688 10795 11735 20121 23087 9136 -4130 8109 9372 -2746 -21959 -18928 -7295 3294
13912 3294 4884 6920 10511 16007 23816 5815 -4598 -1301 -116 15739 13059 3200 -5443 -7667
13898 -7667 -3691 5319 9040 14163 6782 9018 9605 -146 -2237 -8468 -14703 -12021 -6657 -9253 -14905
13883 -14905 -4597 -14778 -3649 19040 23053 12993 10951 3485 -24048 -37062 -18659 -8082
13871h082m095J198K241K0007n705q116n994O329o35K790K2681Q445k6935j2564
13857h435J164J7072j5167J5442L400k420j765K940j6247J044R101n540Q719j1274
13843a966j2771P864J894M507k236P751m092j908l33P034J3065j3272k7951l275
13829b5689J9496R436J441p440p398k0603O895Q170J6952L242J2020m683N009
13816A6848P323l352O967O733n143k35n186k2634r311m604l062j6719m842n103
13802d2320k168L933P945Q225K791K735k664r013L810J3144j711r569j5503j413
13788d1778J4812J4582J7343p210N38j3395p594J6445K4208k2095q910L995L012
13775f047J8631J6298J114j3980j5507j1319k1616k42L872m67P322J0589J3279
$$ plain form
13871 -8082 -12177 -10979 -8738 11269 5564 -2552 -8546 -2217 -2852 -62 22619 31064 4129 -8435
13857 -8435 -7271 9801 -5366 10076 13476 11056 9291 12231 -4016 -2972 6129 589 9308 -1966
13843 -1966 -14737 -6873 -4979 -472 -2708 5043 951 -957 -1290 5744 18809 5537 -22414 -25689
13829 -25689 -6193 3243 4684 -2756 -10154 -30757 -23862 -15692 1260 4502 16522 11839 16848
13816 16848 24171 20819 27786 34519 29376 29141 23955 1321 -7990 -12594 -15656 -32375 -37217 -42320
13802 -42320 -44488 -40555 -32610 -24385 -21594 -18859 -21523 -30536 -26726 -13582 -15293 -24862 -40365 -41778
13788 -41778 -26966 -12384 4959 -2251 -1713 -15108 -22702 -6257 17951 -4144 -13054 -9059 -6047
13775 -6047 12584 28882 29996 16016 509 -10810 -32426 -32668 -28796 -29263 -21941 -11352 1927
13762A927j6459j730N363J1384j166r681K321K0725J914j2036j1905q972J0182
13749h133M624q419n11j5898J597K3247L982r159J9934l77j7344M38P693o086
13735d412n509j4703m309K869J3683M984o692l533q160M197r224Q748J8175j3655
13721a7541m963P337l292L318K088p685J3779K189M247O560k799K007R472O5N069
13706A9851K0835O695j2417l554j1201j7704K87N554J4975K379m606j4199M532
13693A1427l848j62R302N134k7822j3982K2545J0778o411q577k911m655J5377
13680F195J094j9664r613m06K5190J087j7349l384K9753o780p972p271q612N568
13666a2164J4559J1944j8487j3552M369J6236L666N571p914j3762O244r181m440
$$ plain form
13762 1927 -14532 -16262 -10899 485 -681 -10362 -8041 12684 14598 2562 -9343 -18315 -8133
13749 -8133 -3509 -11928 -12439 -28337 -26740 -3493 489 -8670 11264 10887 -6457 -6019 1674 -4412
13735 -4412 -9921 -24624 -28933 -26064 -12381 -7397 -14089 -17622 -25782 -21585 -30809 -22061 -3886 -17541
13721 -17541 -22504 -15167 -18459 -15141 -13053 -20738 -6959 -4770 -523 6037 3238 5245 14717 14782 19851
13706 19851 40686 47381 34964 31410 20209 2505 2792 8346 23321 25700 21094 6895 11427
13693 11427 7579 7417 16719 21853 -5969 -19951 2594 13372 6961 -1616 -4527 -9182 6195
13680 6195 7289 -12375 -21988 -22394 2796 3883 -13466 -16850 12903 6123 -1849 -9120 -17732 -12164
13666 -12164 2395 14339 -4148 -17700 -13331 2905 6571 12142 4228 -9534 -3290 -12471 -16911
13653a6911J223Q942j271K743O790j3607M720L796l649r615l313k759o623P335
13639b2199J8895Q783M58J0099j819r051j944N214J1697m5N00r604o579k473k2467
13624b0535J3353J8366l481M465J3577j4536q148k641P213o760L587N703O466
13611A6629L0j8523j2620R886M037O728p241N237k065j4467M316J1027N076n91
13597G459j1200j0621o215J2176P782r254j3171j3819N426K3002O045K507o745
13584f628k3390r681K2128K0117R253j9402k2915j2149R745K9209J9140j446p917
13571F064l480l157K137L620m622o695k304J221k902J1831J0832n621N044n334
13557F634j2558j0700L720J776p264k678n656J8162J3084O842p786k621m081q651
$$ plain form
13653 -16911 -15688 -6746 -8017 -5274 1516 -12091 -7371 -3575 -7224 -16839 -20152 -22911 -29534 -22199
13639 -22199 -3304 5479 5937 16036 14217 5166 3222 8436 20133 20088 20588 10984 4405 1932 -20535
13624 -20535 -7182 11184 7703 12168 25745 11209 3061 420 7633 873 4460 10163 16629
13611 16629 16659 -1864 -14484 -4598 -561 6167 -1074 4163 2098 -12369 -8053 2974 8050 7459
13597 7459 -3741 -14362 -20577 -8401 -619 -9873 -23044 -36863 -31437 -8435 -2390 117 -6628
13584 -6628 -30018 -39699 -17571 2546 11799 -7603 -30518 -42667 -32922 -3713 15427 13981 6064
13571 6064 2584 -573 1564 5184 562 -6133 -8437 -7216 -10118 1713 12545 6924 11968 6634
13557 6634 -5924 -16624 -12904 -11128 -18392 -21070 -26726 -8564 4520 11362 3576 955 -3126 -11777
13543a1777J6425K902Q314r57M072k352j6788j20j3873l076J2171J5017k785L230
13529A0403Q145R961R291o159j2749j3709K206l512j8579k0997r576J5134J7270
13516a2871N001k349q696M507K5894O282j0577L817J1598P71k1950j6836l088
13503a8497k433K187j573p741K1556K715o495J1916J2866J2134L392m571j9160
13490F296j0115L039j2127J2707J7044j6166j9026k3917j0139K1146O515J1121
13478a3622O194n08Q442Q503J4402o314j1175p718J1766J24j8599j4081L581K0216
13464A211m613j7799j7015L787L17n886J7451J1190L728j890k5388K8005J9696
13451A2794k9093j4628p832q427J9170P828l54O880P550M050n741k743J6217K906
$$ plain form
13543 -11777 4648 7550 15864 14907 18979 16627 -161 -281 -14154 -17230 -5059 9958 7173 10403
13529 10403 18548 28509 37800 31641 18892 5183 7389 3877 -14702 -35699 -45275 -30141 -12871
13516 -12871 -7870 -10219 -18915 -14408 11486 17768 7191 11008 22606 23377 1427 -15409 -18497
13503 -18497 -20930 -18743 -20316 -28057 -6501 -3786 -10281 1635 14501 26635 30027 25456 6296
13490 6296 -3819 -780 -12907 -200 16844 678 -18348 -42265 -52404 -31258 -24743 -13622
13478 -13622 -7428 -7936 506 9009 23411 17097 5922 -1796 9970 10094 -8505 -22586 -19005 1211
13464 1211 -3402 -21201 -38216 -34429 -34112 -39998 -22547 -11357 -7629 -9519 -34907 -6902 12794
13451 12794 -16299 -30927 -38759 -47186 -28016 -20188 -20542 -13662 -6112 -2062 -7803 -10546 5671 8577
13437H577j3776M624K6052j9136k6670J006Q496K891o069M960O759J0698M822
13424A3234q123k0126J501J0717j0779o835R860l452O665J5750J1154N910j437
13411B4039m880j2585m549J099o00K575j7104j1365r760L545J4854J7026k504
13398b09k6730M494J9054J6172K522r888k8096n611J4173J201L268J0378l248
13385b520r272J0509J6510k410r812n786m620p667N46k089p510K185O083O206
13371i647J5274p181j4341N494r459L952K3511j4362j0077P807N68O938J2836
13358A1313j8414l009K4909K858n522j677j0209j262j3713j2178J7932J2213J1671
13345A4912n042j5943N641j767n994l696N202K1969n301j0120J9331O751p213
$$ plain form
13437 8577 -5199 -575 25477 6341 -20329 -19323 -10827 -7936 -14005 -9045 -2286 8412 13234
13424 13234 5111 -15015 -13514 -2797 -13576 -20411 -10551 -14003 -7338 8412 19566 25476 24039
13411 24039 19159 6574 2025 3124 2524 5099 -12005 -23370 -33130 -29585 -14731 2295 -209
13398 -209 -26939 -22445 -3391 12781 15303 5415 -22681 -28292 -14119 -12918 -9650 728 -2520
13385 -2520 -11792 -1283 15227 12817 3005 -2781 -7401 -15068 -14522 -16611 -24121 -21936 -15853 -9647
13371 -9647 5627 -1554 -15895 -10401 -19860 -15908 7603 -6759 -16836 -9029 -8461 -1523 11313
13358 11313 -7101 -10110 14799 17657 12135 10458 249 -1013 -14726 -26904 -8972 3241 14912
13345 14912 9870 -6073 -432 -2199 -8193 -11889 -6687 15282 9981 -139 19192 25943 18730
13332A8730j0254j7566o501J769j2960O511R727j087R830J1047L552m673J445
13319I570Q13o003N57J556K1423m073k5378j290M115K527l926J470J4226J800
13305A7387q286j8598j5645k100J6930k609j446K950J903q864n247m454M977l775
13291b6877J0315k830J6931M764k776o085k908R578R936R425q837J161l500j2035
13277c738J3552J189K542l079J2101j278M465Q44o004m167p791k677R410R911
13263B5280p377r727j3133O295J4020r56j5610n10j354Q244q601O601m169l880
13249d877L401L20j5569l575l129J3559Q43r589j5458O545o365j837K8445R606
13235B320l575j5994j0591J7319K675j4184m538R662n539M379O674p177K66o41
$$ plain form
13332 18730 8476 -9090 -15591 -13822 -26782 -20271 -10544 -11631 -1801 9246 12798 8125 9570
13319 9570 10383 4380 4937 6493 27916 23843 -1535 -2825 1290 3817 -109 1361 15587 17387
13305 17387 9101 -9497 -25142 -27242 -10312 -12921 -14367 -11417 -9514 -18378 -23625 -28079 -23102 -26877
13291 -26877 -16562 -19392 -2461 2303 -473 -6558 -9466 112 10048 19473 10636 11797 8297 -3738
13277 -3738 9814 11003 13545 10466 22567 21289 25754 26598 20594 16427 8636 5959 15369 25280
13263 25280 17903 8176 -4957 1338 15358 14402 -1208 -1718 -3072 5172 -3429 3172 -997 -4877
13249 -4877 -1476 -1156 -16725 -20300 -23429 -9870 -9027 -18616 -34074 -27529 -33894 -35731 -7286 2320
13235 2320 -1255 -17249 -27840 -10521 -7846 -22030 -26568 -16906 -22445 -18066 -11392 -18569 -18303 -18944
13221a8944j244L911r485J261r09O110o869N433J4467r201j6452K682Q432J2064
13207h744K944m959q143j8130j1013m035O513J5516m969M502J8106J9495O548
13194A3631k0862j1949L587Q801N362J136O817o608q678J0556J4493k137j7352
13181c203j7612m505M599R00P642J6057k429p069m95j1855M155P192l099q186
13167a7908o331L568j885Q701k564m327j58n385Q2n010J565N426J3312J4569J7484
13152B1139Q565K989k0688k0850k086J2776N613l2Q269J3564m563p973j8568K634
13138G89R605J1028k311j1943p707O256q89p375q898R665P149j0993J936O564
13124B876J775k6426R952Q397k5719o601Q260R487J9775Q866l71j2347j2128J4534
$$ plain form
13221 -18944 -20188 -16277 -25762 -24501 -25410 -19300 -26169 -20736 -6269 -15470 -31922 -29240 -20808 -8744
13207 -8744 -5800 -10759 -18902 -37032 -48045 -52080 -45567 -30051 -35020 -30518 -12412 7083 13631
13194 13631 -7231 -19180 -15593 -6792 -1430 -294 6523 -85 -8763 1793 16286 14149 -3203
13181 -3203 -20815 -25320 -20721 -19821 -12179 3878 1449 -5620 -6115 -17970 -13815 -6623 -9722 -17908
13167 -17908 -24239 -20671 -22556 -13855 -16419 -20746 -20904 -26289 -26207 -31217 -29652 -24226 -10914 3655 21139
13152 21139 29704 32693 12005 -8845 -10931 1845 7458 7426 15695 29259 24696 16723 -1845 789
13138 789 10394 21422 19111 7168 -539 5717 4828 -2547 -11445 -1780 5369 -5624 -3688 2876
13124 2876 4651 -21775 -11823 -3426 -29145 -35746 -27486 -17999 1776 10642 10271 -2076 -14204 330
13110C30j350k2079K810K0320l823n989k8604N283K9499L281m123p75j548J2145
13096E377k16O387J818q55l592j1363K500P157m200Q751Q601j76j0103m085j0006
13081d005O462K409J6852l679k0023p478R440P751J9987p602r158j7792m499k143
13067a3478M605p494M295J8759j709n071q888j7127p101K1736J8465o874m902
13054d784j2781j417O110p39J164M641J1545J775j3875j761J5494K1612q66k7075
13040i57j7149R721L868r306q696r88L206R844L938j853L985J3353O173J1987
13026B7126j7444l0161J138n277j6644J4787J7008K1700R865L499J804l730k2379
13013A292k1892L747L205K914J0124J000k962J3452L237K0407P243j3442q871
$$ plain form
13110 330 -1020 -23099 -20289 31 -3792 -9781 -38385 -33102 -3603 -322 -4445 -5220 -6768 5377
13096 5377 5161 11548 13366 12511 8919 -2444 56 7213 3013 11764 20365 20189 10086 6001 -4005
13081 -4005 2457 4866 21718 18039 -1984 -9462 -22 7729 27716 20114 10956 -6836 -11335 -13478
13067 -13478 -8873 -16367 -12072 6687 4978 -93 -8981 -26108 -33209 -11473 6992 118 -4784
13054 -4784 -17565 -18982 -12872 -13611 -12447 -7806 3739 5514 -8361 -10122 5372 26984 26118 -957
13040 -957 -18106 -8385 -4517 -13823 -22519 -23507 -20301 -10457 -6519 -8372 -4387 8966 15139 27126
13026 27126 9682 -20479 -19341 -24618 -41262 -26475 -9467 12233 22098 25597 27401 23671 1292
13013 1292 -20600 -16853 -13648 -10734 -610 390 -2572 10880 14117 34524 41767 28325 19454
13000A9454j552L025J3965L121j0086j1028j2842j5361l796J2036K4559N184j2380
12987A4299j1130J708j0176q264J1015j773j308L729q20j0657m831J9763J0944
12974A2499k736o659r682p283L0649J845j0603K473q521j3090P227n230o134j433
12960a6678r972m547m08n582J6428J1357r91M491O965J2502n95R410M891q91p809
12945A8571o549j2117j4642L206J852J5784M672o816o39k799K885J2395M189l280
12931A6712O299j7415Q378j9279q182j867J1394K626j932O223J9887M632j0490
12918A6986q252l435L941m101L42j7896k038J0830j1243q284K1466K1757j1245
12905H828o074J2291K834k1415l969P418N116K55O241L22m91J550o952n967l649
$$ plain form
13000 19454 17902 20927 34892 38013 27927 16899 4057 -11304 -15100 -3064 21495 26679 14299
12987 14299 3169 4877 -5299 -13563 -2548 -4321 -5629 -1900 -2720 -13377 -18208 1555 12499
12974 12499 9763 3104 -6578 -13861 16788 18633 8030 10503 1982 -11108 -3881 -9111 -15245 -16678
12960 -16678 -26650 -31197 -31605 -37187 -20759 -9402 -10393 -5902 1063 13565 12970 22380 27271 26380 18571
12945 18571 12022 -95 -14737 -11531 -9679 6105 10777 3961 3322 523 3408 15803 19992 16712
12931 16712 23011 5596 13974 -5305 -13487 -15354 -3960 -1334 -3266 2957 22844 27476 16986
12918 16986 8734 5299 9240 5139 5481 -12415 -14453 -3623 -14866 -23150 -1684 20073 8828
12905 8828 2754 15045 17879 -3536 -7505 -87 5029 5284 11525 11847 11356 12906 5954 -13 -3662
12890c662n582l345n609J4207o86q243l615J9593R847j5167q910O781Q90j3673
12876a7174J4245L538p902l224O520j2383J523N40P948J311m21N676l138q212
12862a1153L980j369J1313N753Q428K4259j1087l2732j9454k835O7n560Q298P181
12848a4911Q568K9596M755j021l004j7461q611J2412K6666N570r521j0283k3629
12835h74r980j3952p609Q562o565N736O592K7283P530j4161l820J8210Q205j9427
12821E730j1761p332j3019Q544L99J991L0414K6456m3140k7048J6691L154j0705
12808a9626N288Q023L668M58O067l411m754j364J8364K1491m289j1988j7661O903
12794G169J261j4065R235m339j7313q274P47l245O404N346j7494n939J4995O232
$$ plain form
12890 -3662 -9244 -12589 -18198 -3991 -4677 -12920 -16535 3058 12905 -2262 -11172 -4391 -3501 -17174
12876 -17174 -2929 609 -7293 -10517 -3997 -16380 -14857 -14317 -6369 -5058 -5479 197 -2941 -11153
12862 -11153 -7173 -8542 2771 8524 16952 41211 30124 -2608 -22062 -24897 -24830 -30390 -22092 -14911
12848 -14911 -6343 23253 28008 26987 23983 6522 -2089 10323 36989 42559 33038 22755 -874
12835 -874 -10854 -24806 -32415 -23853 -30418 -24682 -18090 9193 16723 2562 -1258 16952 25157 5730
12821 5730 -6031 -13363 -26382 -17838 -17439 -15448 14966 41422 -1718 -28766 -12075 -8921 -19626
12808 -19626 -14338 -6315 -2647 -2189 3878 467 -4287 -5651 12713 34204 29915 17927 266 7169
12794 7169 8430 -5635 3600 -739 -18052 -26326 -25579 -28824 -22420 -17074 -34568 -40507 -25512 -19280
12780a9280R264N407J3953P234p74j0574q852m330K478n877o067J1339K4960O465
12766B5346M018o857n3L920r28m815j8865q850O842J8114J355n996p698K165m708
12751B990j654O270j936k1758K989P499L485qk7290L578K1578J7992P490j3882
12737G343q875k7309j3887K1122K7043n524m804J441k596J744N917j4105j1955
12724b4445K7847K6948m3j4668O5j9405k1924K953P261M303Q196O967r468k914
12710h327p48J1870J275m86n870q273n981P7J4296k889K339O382J995j0737q462
12695a3539j179%P366O557k422P04n233o682R463L108J869j3500j2514J3076O861
12680f065P084j0524M598N003M327p893M258J0358M420j5980L870M466R298j7650
$$ plain form
12780 -19280 -10016 -4609 9344 16578 15804 5230 -3622 -7952 -5474 -11351 -17418 -6079 18881 25346
12766 25346 29364 22507 22454 26374 25446 20631 1766 -7084 -242 17872 19227 13231 5533 7698 2990
12751 2990 1336 7606 5670 -16088 -13099 -5600 -2115 -2123 -29413 -25835 -4257 13735 21225 7343
12737 7343 -1532 -28841 -42728 -21606 5437 -87 -4891 -3450 -6046 -4302 1615 -12490 -24445
12724 -24445 3402 30350 30307 15639 15704 -3701 -25625 -22672 -15411 -11108 -2912 4055 -5413 -8327
12710 -8327 -9075 2795 4070 3584 -2286 -10559 -16540 -16463 -2167 -5056 -2717 3665 5660 -5077 -13539
12695 -13539 -14718 -14718 -7352 -795 -3217 -2513 -7746 -14428 -4965 -1857 12 -13488 -26002 -12926 -6065
12680 -6065 1019 -9505 -4907 96 4423 -3470 788 11146 15566 -414 3456 7922 17220 -430
12666d30k3752j2128J9995K737j2854j724O835R218R490J3201o592q335J1330
12653F991J2049m96q339j4992K659p774l791j1146j08N881k027J7618J3462j2151
12639b164j5730p11K1155Q648N828q724P732m517r736j8298R972J777L162j160
12625b766K015R400l004L078q833k2142n309Q96K349P281L931k143j9439J9193
12611a5493K1818L232M153K069K936L822N121M241K611n178r82k987j8909k245
12597D209j214j0263J4792K600N942K507L413l0912r815K4863K3146m093L203
12584B8378M789k58q796j5514k910q327l098n185r75q716j0695P497J3046Q092
12570b672K4591M738j3045O107r86q780Q135m390j6866n939N304P678N337j0544
$$ plain form
12666 -430 -24182 -36310 -16315 -13578 -26432 -28156 -21321 -12103 -2613 10588 3996 -4339 6991
12653 6991 19040 18544 10205 -4787 -2128 -9902 -13693 -24839 -24947 -19066 -21093 -3475 9987 -2164
12639 -2164 -17894 -18605 2550 11198 17026 8302 16034 11517 1781 -16517 -6545 -4768 -1606 -2766
12625 -2766 -751 8649 5645 8723 -110 -22252 -27561 -26665 -24316 -17035 -13104 -15247 -34686 -15493
12611 -15493 6325 9557 13710 15779 18715 22537 27658 31899 34510 29332 28350 25363 6454 4209
12597 4209 2995 -7268 7524 10124 16066 18573 21986 -8926 -18741 6122 29268 25175 28378
12584 28378 33167 32909 24113 8599 5689 -2638 -5736 -10921 -11896 -20612 -31307 -23810 -10764 -2672
12570 -2672 21919 26657 13612 19719 18733 9953 18088 13698 -3168 -9107 -3803 3875 9212 -1332
12556a332j60j633k0657j1481n031K5619J8959P653J86q324n07J4912M591q393
12542A4402L700q624l832j4566R681J4343K999j8924j0611q626j0188K8977Q212
12529F943l1267n105N970L946J323J3289J5264k666q892p890j1774L46K477M512
12515a3524Q611m218P065l014p169j082j697J1352l983j2025O911J5945P125r341
12501I56p079M701L458o446Q427Q062k797J512r925m255O494j284p066p011j050
12486a3303l246q588P480l138q32k745k794P416K2220K417n657O493K138P677
12472A5538N372n636j5402j5525J6606J8286k49l387O378J0451j3827j4796n700
12459a891J3733N514j1146o698O005K351p289j2600N629K6041J0642j2625j1621
$$ plain form
12556 -1332 -1492 -3125 -23782 -35263 -40294 -14675 4284 11937 12123 3799 3292 18204 22795 14402
12542 14402 18102 9478 5646 -8920 761 15104 18103 -821 -11432 -20058 -30246 -1269 6943
12529 6943 -24324 -29429 -23459 -19513 -18190 -4901 10363 7697 -1195 -9085 -20859 -20513 -18036 -13524
12515 -13524 -4913 -9131 -2066 -5080 -12249 -13331 -15028 -3676 -7659 -19684 -12773 3172 10297 956
12501 956 -6123 -1422 2036 -4410 4017 12079 9282 10794 869 -3386 3108 1824 -5242 -12253 -13303
12486 -13303 -16549 -25137 -17657 -20795 -21627 -24372 -27166 -19750 2470 4887 -770 5723 7861 15538
12472 15538 20910 15274 -128 -15653 953 19239 18990 15603 21981 32432 18605 3809 -1891
12459 -1891 11842 17356 6210 -488 5517 7868 579 -12021 -6392 19649 30291 17666 6045
12446F045R6L933j7904J685m0L459j1023J351M257J0779N835l2704p429R760J4505
12431g395J2795j3932n477J0415k102R877K556Q464m73J1122q376K930r80k0216
12417g92m2424J4604L4611j9265m787J8914j769p836O94q852J3881j1564j620
12404a6205N570J2296Q759j0480o989P925j0057m76J49l223J8024J0573l555q996
12390C315j985L537p79q184m279Q135J7549n124j075l036j6760n343p128N14N998
12375a4645O140p725J734R341Q034M278o456j3163M242o336P213L524J4566K997
12361A3744r722j1626J2852K248j0313j5876K879J6503k681J681J0459o169j9180
12348a5201o247J2340J9111L856j5105M559J2432l336l902j1111l340J6438K035
$$ plain form
12446 6045 6141 10074 -7830 -6145 -6185 -2726 -13749 -12398 -8141 2638 8473 -24231 -31660 -21900 -7395
12431 -7395 5400 -8532 -14009 -3594 -5696 4181 6737 15201 14728 25850 17474 20404 19424 -792
12417 -792 -43216 -28612 5999 -13266 -18053 861 -908 -8744 -8050 -16902 -3021 -14585 -16205
12404 -16205 -10635 1661 10420 -60 -7049 876 -9181 -9657 -9508 -12731 5293 15866 12311 3315
12390 3315 1330 4867 4088 -4096 -8375 -240 17309 12185 11110 8074 -8686 -14029 -21157 -20643 -14645
12375 -14645 -8505 -16230 -14496 -5155 2879 7157 701 -12462 -8220 -14556 -7343 -3819 10747 13744
12361 13744 4022 -7604 5248 7496 -2817 -18693 -15814 689 -1992 -311 10148 3979 -15201
12348 -15201 -21448 -9108 10003 13859 -1246 3313 15745 12409 8507 -2604 -5944 10494 12529
12335A2529N286m337R060J54k041O471M950N211n252N326j2277j9345r098j0600
12321a3963J1051Q349k295j3620O251J9583Q56j3972p425M363o924o249J3034
12308i61J2701J4226k3702k2371j972k595P096p259N22K3441j636n590P776R226
12294H902P276q637q63q9j843M743O737M742K802j1356J0585R665n427o590J866
12279B2513j622j0386j7110M437j643k216p34k814K190q572Q201R293J7497j062
12265A7972r055j4261n030r798J3296J5647L23k29p864J1313O278P78j1793m572
12251C005M563M756K7407J4151j9244j5819P829j1964m13n39j4266o399m545J1702
12237B24P569p919n996K1265L824o08j083p824L29J0161j9526l448K9789J5743
$$ plain form
12335 12529 17815 13478 22538 22692 20651 27122 32072 37283 32031 37357 25080 5735 -3363 -13963
12321 -13963 -2912 5437 3142 -10478 -4227 15356 16212 2240 -5185 -822 -7746 -13995 -961
12308 -961 11740 25966 2264 -20107 -22079 -24674 -17578 -24837 -24315 -874 -2510 -8100 -324 8902
12294 8902 16178 7541 6678 6589 4746 9489 16226 20968 23770 12414 22999 32664 27237 20647 22513
12279 22513 20891 10505 -6605 -2168 -3811 -6027 -6761 -9575 -7385 -15957 -7756 1537 19034 17972
12265 17972 8917 -5344 -10374 -20172 -6876 8771 9094 8865 1001 12314 18592 19370 7577 3005
12251 3005 7568 12324 39731 53882 34638 18819 26648 14684 14271 13732 -534 -6933 -11478 224
12237 224 7793 -126 -6122 15143 18967 18359 17276 9452 9781 19942 416 -3032 26757 42500
12223D2500j4584j1418M547P78j4102k1737o976j451m811j107J7058K4340L730
12210A6767q640P992p501j0518p030J629J3167K774J5699j9240r172J0364J0774
12197A7065q304j622R894Q665k592r718j4423n98M155r821J1287K4210Q293j0147
12183B6344j9710j577J4640r393q476J3445P749l028j2888L465K2697j1437j4600
12170G231N129Q427n719j1681M195N147K059Q795J344m067k1770j0617K105K569
12156f853Q697k461l488o587M791o739o461J8699L43j3359r893Q963M648K1140
12142A1440O633J9943M67q751j3437J2113L573j6795j2999q951J296P519q02j070
12128A79m958j3770r358K1919J8677j270k435M899n173p180l541j5461j5324R477
$$ plain form
12223 42500 27916 16498 21045 21823 7721 -14016 -20992 -22443 -27254 -28361 -11303 13037 16767
12210 16767 8127 16119 8618 -1900 -8930 -7301 5866 8640 24339 5099 -4073 6291 17065
12197 17065 8761 7139 17033 25698 23106 13388 -1035 -1633 2522 -7299 3988 28198 36491 26344
12183 26344 6634 5057 19697 10304 1828 15273 23022 19994 7106 10571 33268 21831 7231
12170 7231 12360 20787 15068 3387 7582 12729 14788 23583 24927 20860 -910 -11527 -9422 -6853
12156 -6853 1844 -617 -4105 -10692 -5901 -12640 -19101 -402 -59 -13418 -23311 -14348 -9700 11440
12142 11440 18073 38016 38483 29732 16295 28408 31981 15186 2187 -6764 -5468 2051 1249 179
12128 179 -4779 -18549 -27907 -5988 12689 11419 8984 13883 8710 1530 -2011 -17472 -32796 -23319
12114b3319J0545J0870R784J1969N223l979k40J528M134M73N94O08l271k962n503
12099A6454P801J0006r81j8011N342K8485k30j3093j2961L639J2440Q853n901
12086D1843j2072k731J2985J255o914K066P32n833j0898m134K855J8755O751k866
12072D1794k1678J058j0170M250n252J1361k232r163N278J927J3944K433j3786
12059A9764j3619j3515N850K904J1194J8810J4085n499j0670J1615J8706p320
12047E2305j6629j6239J0197n668Q990J6953R290J3542p621p655m847J1277q830
12034E5065l832J747o85J1972O230R85N499j62k724j840O689P268L54O510J0030
12019A03106J4591K0406J5391p261k702K668J3428J1989P102L750R097J3049J5795
$$ plain form
12114 -23319 -12774 -1904 7880 19849 25072 21093 20853 22381 26515 26988 27582 28190 24919 21957 16454
12099 16454 24255 34261 33280 15269 20611 49096 48866 35773 22812 26451 38891 47744 41843
12086 41843 29771 27040 40025 41280 34366 36432 37164 31331 20433 16299 19154 37909 44660 41794
12072 41794 20116 21174 11004 15254 10002 21363 19131 9968 15246 17173 31117 33550 19764
12059 19764 6145 -7370 -1520 1384 12578 31388 45473 39974 29304 40919 59625 52305
12047 52305 35676 19437 29634 23966 32956 49909 59199 72741 65120 57465 52618 63895 55065
12034 55065 51233 52980 52295 64267 70497 71482 76981 76819 74095 72255 78944 86212 86566 93076 103106
12019 103106 117697 138103 153494 146233 143531 146199 159627 171616 178718 182468 191565 204614 220409
12006B20409J4169R722J7972K4646J2881J3485Q841K3641L0991M7507L7961L8987
11994E01212L2127K6012L3046O0589N3942M4068O4733P6345J12059J24225J34770
11983A263128J36586J48025J81200K42703K60025L01924L63781M21076M60321
11974C778769N07088N23657N28792M94668M32836K80943R7408r3939k70849l89749
11964E889624m66994n06128m96489m88506m42022l77559l41007l07876k64366
11955B198677k26069k05318j81137j41797j32743j21080j03145p5353p2987p3938
11945H65110n8372o9196n9319l8847l8466m0134m6663k4854k0960j5478j4764
11934D38057k5407l8302k2251k7982j3010r248j1148k7030j1327k492q576r124
$$ plain form
12006 220409 234578 244300 262272 286918 299799 313284 322125 345766 376757 424264 462225 501212
11994 501212 533339 559351 592397 652986 706928 750996 815729 892074 1004133 1128358 1263128
11983 1263128 1399714 1547739 1728939 1971642 2231667 2533591 2897372 3318448 3778769
11974 3778769 4285857 4809514 5338306 5832974 6265810 6546753 6644161 6550222 6279373 5889624
11964 5889624 5422630 4916502 4420013 3931507 3489485 3111926 2770919 2463043 2198677
11955 2198677 1972608 1767290 1586153 1444356 1311613 1190533 1087388 1012035 939048 865110
11945 865110 806738 737542 678223 639376 600910 560776 514113 489259 468299 452821 438057
11934 438057 412650 374348 352097 324115 311105 301857 290709 263679 252352 249860 241284 232160
11922B32160q912R7J565k9299l5546l838J2393J4591n489j0104N089R577j9628
11909A62656k6047J552k385j6062j6612J3360J4282j3822j0779M794j3147k1857
11897G5933m63p315j4309m116L0572P035j1769r361j1322R455K851P312m127j6730
11883E3646l872q539j2424J1457J0838p671j2416n822J1780N468O718N532J0169
11870F4864J0607J548k987k4021j6150J1625K7265j0734k5808p168J2281k110
11858C9212j8043P322M034Q717N223K836l354R02N584N396j5797j1850Q204J0133
11844D8519J9019q377j6369p903q846j5649k5517L289J1277J413l219o711J3620
11831D546J6304j9260q969J8176Q803J384j1763p664K264P129J2998N975J460
$$ plain form
11922 232160 223248 223345 224910 195611 160065 156227 168620 183211 177722 167618 172707 182284 162656
11909 162656 136609 138161 135776 119714 103102 116462 130744 116922 106143 110937 97790 75933
11897 75933 75470 68155 53846 49730 80302 87337 75568 66207 54885 64340 67191 74503 70376 53646
11883 53646 49774 41235 28811 40268 51106 43435 31019 25197 36977 42445 49163 54695 64864
11870 64864 75471 77019 74032 50011 33861 45486 72751 62017 36209 29041 41322 39212
11858 39212 21169 28491 32525 41242 46465 49301 45947 46849 52433 57829 42032 30182 38386 48519
11844 48519 67538 59161 42792 34889 26043 10394 -15123 -11834 -557 856 -2363 -9074 4546
11831 4546 20850 1590 -7379 10797 19600 20984 9221 1557 3821 10950 23948 29923 31383
11818C1383p835N877m894j1499k194J4069R800n111o284K949N375q872n323k137
11804A5304L180j2079j2702J4872J8311L856j6196j994j4463m067m41k179K1646
11791A3048N710J686l639j6148L575j208P72o434k399N689J0642Q42j1994M676
11777D818m588O808K3103j4108p545j8830r576K182J1138J0321R593k962n880
11764D474O839o977r37j5176k0162l151j063L399P394K849j64J5934J029l728
11750i440j0707L58J6360J3270P558j3757j1860l268j2721J2076K9852K8358J1083
11737E7162p172j2615j1725q902j4308R696K0165o982j5901J6907Q740j5053Q015
11724B8027R68k1849k0572k5790K55J4283O290j0904N651J7845J4286m713J530
$$ plain form
11818 31383 23548 29425 24531 13032 10838 24907 34707 29596 23312 26261 31636 22764 17441 15304
11804 15304 18484 6405 -6297 8575 26886 30742 14546 12552 -1911 -5978 -6419 -8598 13048
11791 13048 18758 20444 16805 657 4232 3024 3796 -2638 -5037 652 11294 12136 142 4818
11777 4818 230 7038 30141 16033 8488 -10342 -19918 -17736 -6598 3723 13316 10354 4474
11764 4474 11313 4336 3399 -11777 -31939 -35090 -36153 -32754 -25360 -22511 -22675 -6741 -5712 -9440
11750 -9440 -20147 -19789 -3429 9841 17399 3642 -8218 -11486 -24207 -12131 17721 46079 57162
11737 57162 49990 37375 25650 16748 2440 12136 32301 25319 9418 26325 35065 20012 28027
11724 28027 28995 7146 -13426 -39216 -38961 -24678 -18388 -29292 -23641 -5796 8490 3777 5307
11711E307K4866l016j2403J836k0268j4738j9005M321L343q0J1693J747l06L316
11697a3387P969O88l364j1321r552J9173K4634j5374j4393n414M079J667j0583
11684b5178q635J1343J4698m012P56R014m582m060r134o683J7694J5470j5174
11671h483r96j062q28k054M8j1978M805K2166L2492J0378k4164j9350j927J2242
11657A1289K0774J893l661j0819j301N928n759L706Q513q964j41p062k3158j6013
11643b4775K806o301L102J2246J0863J6433L858K782j2031k3642j6723j6536p446
11630e5364J5906J880K6315K5308q545K231o245k2689M943J6117j138k6800j5334
11617d3415j812J0709J6702K933J1052o909j8714j6814M641O747J619J9941K2457
$$ plain form
11711 5307 30173 27157 14754 16590 -3678 -18416 -37421 -33100 -29757 -29837 -18144 -16397 -16703 -13387
11697 -13387 -5418 -4730 -8094 -19415 -28967 -9794 14840 -534 -14927 -20341 -16262 -14595 -25178
11684 -25178 -33813 -22470 -7772 -11784 -11028 -2014 -6596 -10656 -19790 -26473 -8779 6691 -8483
11671 -8483 -9479 -10541 -11369 -13423 -13375 -25353 -20548 1618 34110 44488 20324 974 -953 11289
11657 11289 32063 33956 30295 19476 18175 24103 18344 22050 30563 21599 21458 14396 -8762 -24775
11643 -24775 -21969 -28270 -25168 -12922 -2059 14374 18232 21014 8983 -14659 -31382 -47918 -55364
11630 -55364 -39458 -37578 -11263 14045 5500 7731 1486 -21203 -16260 -143 -1281 -28081 -43415
11617 -43415 -45227 -34518 -17816 -14883 -3831 -10740 -29454 -46268 -41627 -34880 -33261 -13320 9137
11604I137n875J1156P069j2129l950J0132N253R333P592m3j8364j8654q567n881
11590a3791K1323J124o522k820n816K0025O446K823K68m214m403k771r997j0719
11576i044o871O245J8465L284o177k2459m91K3637N510j7318j2790n894P775O099
11562a0029J7757m615o193J197L18J748K5074J0738k6033j8399j1343J189M696
11549a3895K1388P499j0644m915j595K129p38j5881K757J1205r745r320L774q164
11535b6145K279K0981J696q832N279J0473J824M259L989n467j0673k804J7277
11522A4136J1980j0297k5145q496q387k5579o60K5539L1141M889j5828m24J2064
11509D933j930J7220K0343J376l1553m3301j2318J9989L2849J0120m950N375j016
$$ plain form
11604 9137 3262 14418 21487 9358 5408 15540 20793 30126 37718 37675 19311 657 -7910 -13791
11590 -13791 7532 8656 2134 -686 -6502 13523 19969 22792 23060 18846 14443 11672 1675 -9044
11576 -9044 -15915 -9670 8795 12079 5902 -16557 -17048 6589 12099 -5219 -18009 -23903 -16128 -10029
11562 -10029 7728 3113 -3080 -1883 -1565 183 25257 35995 9962 -8437 -19780 -18591 -13895
11549 -13895 7493 14992 4348 -567 -2162 -33 -771 -16652 -13895 -2690 -12435 -21755 -17981 -26145
11535 -26145 -23866 -2885 -1189 -10021 -4742 5731 7555 11814 15803 10336 -337 -3141 14136
11522 14136 26116 15819 -9326 -17822 -26209 -51788 -52448 -26909 4232 9121 -6707 -7131 4933
11509 4933 3003 20223 40566 41942 10389 -32912 -45230 -25241 7608 17728 12778 18153 17137
11496A7137K908j2040r590j856r2M372q717j3641L008J1624J1910L614k837M90
11482F290N255j6768n397N404J0815J163K765k378q071J489p47l503k1724q79
11468b6286J917q121J6197J134j2652L5662j784L400j9439j0524K0093j6269j239
11455a7911M020k463r387P658Q828L752j2560L0R941J4625M762j8798j8240k699
11441b8442N39P430K789n260J487J3506k813J1266R495m239N348j4630j8160k32
11427b1916P650q026O107L984J0543K0930R916O206j1450j8436k8791j6041r8
11414c9422K7131R136o893N518M501P94j3622P593J7608J1064m445r700j0604
11401a341j9965l946N682M411J1538p484K223R841j909Q633Q268O312p069k4147
$$ plain form
11496 17137 20045 8005 -1585 -3441 -3533 839 -7878 -21519 -18511 -6887 5023 8637 5800 6290
11482 6290 11545 -5223 -10620 -5216 5599 6762 9527 7149 -922 567 -180 -3683 -25407 -26286
11468 -26286 -24369 -32490 -16293 -15159 -27811 7851 6067 9467 -9972 -20496 -403 -16672 -17911
11455 -17911 -13891 -16354 -25741 -18083 -9255 -5503 -18063 -18033 -8092 6533 11295 -7503 -25743 -28442
11441 -28442 -27903 -20473 -17684 -22944 -21457 -7951 -10764 502 9997 5758 11106 -3524 -21684 -21916
11427 -21916 -14266 -22292 -16185 -12201 -1658 19272 29188 35394 23944 5508 -23283 -39324 -39422
11414 -39422 -12291 -3155 -10048 -4530 -29 765 -12857 -5264 12344 23408 18963 9263 -1341
11401 -1341 -21306 -25252 -19570 -15159 -3621 -11105 -8882 959 -950 7683 15951 22263 15194 -8953
11387h953k8710o620J0475q284M193J3601J028N021K0389p412n796O813J8494
11374A4239j5499j6797l751o598R916N877K0113Q607k1429j7190j269J8512J0789
11361E520j7689r85J4576M828j1375N154K063P098j0222O778p039k5994P28Q701
11347a7858J9328J070l972J1081n634j542j4185r646J0862K2702j0579q288r314
11334a5975N08R71j0444k965O69m540J197J0366o086j7790o672Q852K7336L750
11320a0823R431K397k847P722m574j1945n164P55j2268P131J5643J1k100o707
11306a3338N1l954O739l406j1384J2874R566O674Q897k163p121J1028R077N589
11292B9129r829n229J0073k1566j08J6345n814n632j998R2q699M337P944q471
$$ plain form
11387 -8953 -37663 -44283 -33808 -42092 -37899 -24298 -23270 -18249 2140 -5272 -11068 -4255 14239
11374 14239 -1260 -18057 -21808 -28406 -18490 -12613 7500 16107 -5322 -22512 -23781 -5269 5520
11361 5520 -12169 -13154 1422 6250 -5125 29 2092 9190 -1032 5746 -1293 -27287 -26559 -17858
11347 -17858 1470 2540 -1432 9649 4015 2473 -11712 -21358 -10496 12206 1627 -6661 -15975
11334 -15975 -15467 -14496 -24940 -27905 -27236 -31776 -30579 -20213 -26299 -44089 -50761 -41909 -14573 -10823
11320 -10823 -1392 1005 -1842 5880 1306 -10639 -15803 -15048 -27316 -20185 -4542 -4531 -6631 -13338
11306 -13338 -13287 -17241 -10502 -13908 -25292 -12418 -2852 3822 12719 10556 3435 14463 23540 29129
11292 29129 19300 14071 24144 2578 2470 18815 13001 7369 5371 5463 -3236 1101 9045 574
11278E74J3783m152j4771j648m787j6296l248K1839J602M44K0316Q17k321O589
11264A8741p051r910J1528j6600j4839M179J7266O503j4849j1372M338k829L109
11251a1786P418j0181P196J2383K9263j6619m0175l749J1310R563K3888N019n476
11238A8054j7599q549J7451o97j3026R19M728m810q843K108O606J053J3114J0886
11224B1395l790o060P035p092p513j099j1382k803r510K367M06n576j0181J0990
11210b2813O198K1548r415j5044r284J3764J4868J9499p178o097J81j2888p507
11197a4168L915O973j6426m134n385j947K838R534J5154N533J2557J4570N073
11184C4087J0218Q106j3145k2469k753j1249L23j8311j2251k876N615J3293P53
$$ plain form
11278 574 14357 10205 -4566 -6214 -11001 -27297 -30545 -8706 -7104 -6660 13656 14473 12152 18741
11264 18741 11690 1780 13308 -3292 -18131 -13952 3314 9817 -5032 -16404 -12066 -14895 -11786
11251 -11786 -4368 -14549 -7353 5030 34293 17674 -22501 -26250 -14940 -5377 18511 23530 18054
11238 18054 455 -8094 9357 8660 -4366 -3447 1281 -3529 -12372 -10264 -3658 -2605 10509 21395
11224 21395 17605 11545 18580 11488 3975 2876 -8506 -11309 -20819 -18452 -18046 -23622 -33803 -22813
11210 -22813 -16615 4933 -4482 -19526 -28810 -15046 -178 19321 12143 6046 6227 -6661 -14168
11197 -14168 -10253 -3280 -19706 -23840 -29225 -31172 -28334 -18800 -3646 1887 14444 29014 34087
11184 34087 44305 52411 39266 16797 14044 2795 3118 -15193 -27444 -30320 -24705 -11412 -10659
11171a0659R8J1708j847K932m593j3838R593K294J8378o022J570p306j1988o295
11157a5975N14j0576L452L987M797K649K781O029K131O560P1J8965j1234j0654
11143C497L114P543J2568q486j1117l677k442O15r12j018j266J6152p98j6992
11129c219l626O087J6360n461j5216J1001M125k374k622q498R653r53M01J4810
11115B0468k0925j3078J0275j61l332l483q623L606Q415K383J623Q513j043j7129
11101a2491l727K407p02q334J3251M678j5187r083K0756L474m636r46r71M338
11087g173K095r83P952J7000k921N643q643K874R489n814l822k241K596P309j3798
11072I563o118r498p0j076k743K246j5648R05K918o639J4471L1986M219p351m386
$$ plain form
11171 -10659 -10561 1147 -700 2232 -2361 -16199 -6606 -4312 14066 8044 9614 2308 -9680 -15975
11157 -15975 -15461 -26037 -22585 -18598 -13801 -11152 -8371 -2342 -211 6349 6420 25385 14151 3497
11143 3497 6611 14154 26722 18236 7119 3442 1000 1615 703 -315 -1581 14571 13773 -3219
11129 -3219 -6845 -758 15602 10141 -5075 5926 10051 7677 5055 -3443 6210 5257 5658 20468
11115 20468 -457 -13535 -3260 -3421 -6753 -10236 -18859 -15253 -6838 -4455 -2832 5681 4638 -12491
11101 -12491 -16218 -13811 -14513 -22847 -9596 -4918 -20105 -29188 -8432 -4958 -9594 -10540 -11511 -7173
11087 -7173 -5078 -6061 1891 18891 15970 21613 12970 15844 25333 19519 15697 13456 16052 23361 9563
11072 9563 3445 -6053 -6123 -7199 -9942 -7696 -23344 -22439 -19521 -26160 -11689 20297 24516 17165 12779
11057A2779K691j7721M418R479o399p45L660j320k674J4886J719L879P382K1540
11043E3574r7n3J272j517J8894Q226J0022L3964J4845R874R883q102k039J18n996
11028A42868j0285R290K6061K0578J3519J3993L753K34K031p439j8427j2214k1333
11015A62629k6532l546L919L973J1784M50N789J329p541l1701l4795j3422p138
11002F5198n606O203J847L716K792m662q998j9637j1326m174J2316j90j4385L053
10988B6147j2072q731o80J0547J1152m270j3995j8962j8612J0121J922j6581L245
10975c0769J0038J0193J0003n327L602j0415L694j347j1813q29p349k568l094
10962c5981Q460O996Q785l990J6832R888R360k2327k1651L0031O290j3878J102
$$ plain form
11057 12779 15470 -2251 2167 11646 5247 4502 8162 6842 4168 19054 20773 24652 32034 53574
11043 53574 53477 53424 54696 53179 72073 80299 90321 124285 139130 149004 158887 150785 148746 148864 142868
11028 142868 132583 141873 167934 188512 202031 216024 219777 220011 222042 214603 196176 183962 162629
11015 162629 136097 132551 136470 140443 152227 152677 158466 159795 152254 120553 85758 72336 65198
11002 65198 59592 65795 67642 71358 74150 69488 60490 40853 29527 25353 37669 37479 23094 26147
10988 26147 14075 5344 4664 15211 26363 22093 8098 -10864 -29476 -19355 -17433 -34014 -30769
10975 -30769 -20731 -10538 -535 -5862 -2260 -12675 -8981 -10328 -22141 -22970 -30319 -32887 -35981
10962 -35981 -27521 -20525 -11740 -15730 1102 10990 20350 -1977 -23628 6403 12693 -1185 -83
10949h3J7301k047l372m487j179k297O996o45q75J2281n902k401l823n727j1475
10934g735J2199o258M109Q97j3561Q278J23r636L679k034J8612K7030j4499o650
10920A4554J7566k2243j8384R089J7778Q095o03J067j4992J4697K3506n443j0483
10907C4204m449k3971j5203m289j73N074J75o256k055m144q960J9271J0264L758
10893C246M010j1771q20J5383J9897o848qq219l2694l100J3223J3940N86r477
10879b652q60L717K612K72J0461J3519O0J1754k110k7759j2822k243R829J2188
10865A5966M216J3557k413q444k637j1894n499j897k146K3413K0858o056q089
10852B8935p210q337q769P891P460r730N346K2009K865N692j3815j485j4974q245
$$ plain form
10949 -83 17218 15171 11799 7312 6133 3836 10832 10187 9312 21593 15691 13290 9467 3740 -7735
10934 -7735 4464 -1794 2315 3212 -10349 -2071 -1948 -11584 -7905 -9939 8673 35703 21204 14554
10920 14554 32120 9877 -8507 582 18360 26455 25852 26919 11927 26624 50130 44687 34204
10907 34204 29755 5784 -9419 -13708 -13881 -8807 -8632 -14888 -16943 -21087 -30047 -10776 -512 3246
10893 3246 7256 -4515 -5335 10048 29945 23097 23089 14870 -17824 -20924 -7701 6239 6825 -2652
10879 -2652 -3512 205 2817 3089 13550 27069 27129 38883 36773 9014 -3808 -6051 3778 15966
10865 15966 20182 33739 31326 22882 20245 8351 2852 955 -1191 22222 43080 37024 28935
10852 28935 21725 13388 4619 12510 19970 10240 15586 37595 40460 46152 32337 30852 15878 7633
10838G633K641O089N781M591o402j0257N747J6546J362k922P274j404r1J0920
10824D7508P171n899k5123r613M604r381K0915K1243p263j9809P07N358R258j1093
10810B8583j8865K281j230M720K4920M748n644K1734J167k0119j2692M267j11
10797C3759j000m537j8157r768l41R050J4353L205J319m151j8483r878J0211P396
10783A2978q843j0144r905j7700J0678P446J2665k382j5829n710J0156m413j001
10770b2004m054M475k626M96J3452K6890K8502l917J77o745j8546k6895J2479
10757A684M671m711k173Q07O170K997L095K586j237k1087j2752J0700J6414O156
10743A3320P967M173j65o750M11J167K252N758m863K3L2374J3161p158j3473j1574
$$ plain form
10838 7633 10274 16363 22144 26735 20333 10076 15823 32369 33731 30809 38083 36679 36588 47508
10824 47508 54679 48780 23657 14044 18648 9267 30182 51425 44162 24353 25060 30418 39676 28583
10810 28583 9718 11999 10769 15489 40409 45157 39513 61247 62414 42295 29603 33870 33759
10797 33759 32759 28222 10065 297 -44 9006 23359 26564 27883 23732 5249 -4629 5582 12978
10783 12978 4135 -6009 -15914 -33614 -22936 -15490 -2825 -5207 -21036 -26746 -16590 -21003 -22004
10770 -22004 -26058 -21583 -24209 -23713 -10261 16629 45131 41214 41391 34646 16100 -10795 1684
10757 1684 6355 1644 -529 278 6448 9445 12540 15126 13889 -7198 -19950 -9250 7164 13320
10743 13320 21287 25460 25295 18545 18956 20123 22375 28133 23270 23293 55667 68828 61670 48197 36623
10728C6623nm508Q856l264L139J2570M689K629K2090P782K427k842o249k1899
10714F2038j1001l12N178l337O040O654R777p064J2941j430n347p493j7667q310
10700D0667k42k718L214j1919n229K8335J2912j3201k3538k1004r872M216M832
10687F453j0331r300n789J7643J1168j388O548O515n931P964M877j4437j409K1941
10673C4524J3848j0624O741O68j7637j2309K3187L114J4440p344r256n603L662
10660C7411J6237J7007J3728M0294L5414L8062L9629J6173J8102J3863J6583O000
10648C08503k5555p722j5974l3686k3241J4598K6971M173L2037O0876O4747Q3878
10636D89605R2275J15603J39511J48884J03936M9626L9234K9550L0224R6944J53118
$$ plain form
10728 36623 36618 32110 40966 37702 40841 53411 58100 60729 82819 90601 93028 90186 83937 62038
10714 62038 51037 50725 55903 52566 58606 65260 75037 67973 80914 79484 74137 66644 48977 40667
10700 40667 40425 37707 40921 29002 23773 52108 65020 51819 28281 7277 -2595 1621 6453
10687 6453 -3878 -13178 -18967 -1324 9844 8456 15004 21519 15588 23552 28429 13992 12583 34524
10673 34524 48372 37748 44489 45157 27520 15211 38398 41512 55952 48608 39352 33749 37411
10660 37411 53648 70655 84383 124677 160091 198153 237782 253955 272057 285920 302503 308503
10648 308503 282948 275226 259252 225566 202325 216923 243894 248067 280104 340980 405727 489605
10636 489605 581880 697483 836994 985878 1089814 1139440 1178674 1208224 1238448 1335392 1488510
10625A488510K35941L16953M34489O16951Q33501J067454J364946J716514J924120
10616I999379J733833J167726M67861m4952k61354k43093N5842N98206J382371
10607A4855819K360533L380774L899205L255239J572309j62556j338106j843878
10599B5979339j736248j066010K9884J419250L003120M405505M880784L580986
10591D0496610Q84057j643655l204815l853473l721664k925093j690660l10435
10583B4030872J029458K083367K322338J319146n00781k107424k979855l268203
10575B1928918l033683k413786j584104p73456q8021L62144M08126k6497p32464
10566A4047177j336779j684798j775330j671182j428769j151087q79714o61127
$$ plain form
10625 1488510 1724451 2041404 2475893 3092844 3926345 4993799 6358745 8075259 9999379
10616 9999379 11733212 12900938 13368799 13323847 13062493 12819400 12875242 13473448 14855819
10607 14855819 17216352 20597126 24496331 27751570 29323879 29161323 27823217 25979339
10599 25979339 24243091 23177081 23206965 24626215 27629335 32034840 36915624 40496610
10591 40496610 41380667 39737012 36532197 32678724 28957060 26031967 24341307 24030872
10583 24030872 25060330 27143697 29466035 30785181 30284400 28176976 25197121 21928918
10575 21928918 18895235 16481449 14897345 14123889 14035868 14398012 14806138 14779641 14047177
10566 14047177 12710398 11025600 9250270 7579088 6150319 4999232 4119518 3458391
10558C458391m86481l71713l01473k43487k00060j65597j65315j46981r3607p8709
10548A204968j11090q2446p9023n9465l8946m2968n1098n5236l2510m0885l2967
10537E78334l8161k2977j1355j5909j8987m6195l7099m891j5525o161J41k0113
10525C41102j8191k3717j5153j5988l2568j2967R814K370lm733k3452r541r166
10512A87807p824J5546J5662n341j3148k3119K24j5009J2262k285j1120j3418
10500A40237L568K5300j0228j9155J540j5977R21k010N506j177j8021j3356j1399
10487H5749J3738J538J0194J3345J0482k5376j8416J632n266j0976r607J5841
10475H2878N887R126P07j5176j412J6299M788j4484j4786j6095j5444q786j235
$$ plain form
10558 3458391 2971910 2600197 2298724 2055237 1855177 1689580 1524265 1377284 1283677 1204968
10548 1204968 1093878 1011432 932409 872944 833998 791030 739932 684696 652186 611301 578334
10537 578334 540173 517196 505841 489932 470945 424750 387651 382760 367235 361074 361215 341102
10525 341102 322911 299194 284041 268053 235485 222518 232332 234702 234699 229966 206514 196973 187807
10512 187807 179983 195529 211191 205850 192702 169583 169807 154798 167060 164775 153655 140237
10500 140237 143805 169105 158877 139722 141262 125285 126206 124196 129702 128525 110504 97148 85749
10487 85749 99487 101025 111219 124564 135046 109670 91254 92886 87620 76644 67037 82878
10475 82878 88765 97891 98598 83422 82010 98309 103097 88613 73827 57732 42288 33502 32267
10462C2267q354L727J6507K3249l625k0963l932R946n609p545k078r359j1387
10449A2844J0129L689J3927k273j2849o994K1569J0079r136p699L892P266N829
10436E0273Q31J7463m996o294j5956j0731M746J7778J2408j5111j4922k909J1315
10423D3895P03k419p825K637q984O846L886K630P4rM364R434k2346j1787J0559
10408C1658J3361j1354j3076J3387N41m938J6830J9831m736k3171k3594O546p985
10395A3300n124l688R144J7746K191k0525K071R558J2395M498Q453r511j2273
10382B8235K44q923o619M235R57J1069O444L418k6914j9096Q094M248l429N485
10368G448O08j0970Q155K0002O787j4556j2602n370j8468j5366K1512L4931J1271
$$ plain form
10462 32267 23913 27640 44147 67396 63771 42808 38876 48822 43213 35668 33590 24231 12844
10449 12844 22973 26662 40589 38316 25467 18473 40042 50121 40985 33286 37178 44444 50273
10436 50273 51104 68567 63571 57277 41321 30590 35336 53114 65522 50411 35489 32580 43895
10423 43895 44598 42179 34354 36991 28007 34853 38739 41369 41443 41434 45798 55232 32886 21099 31658
10408 31658 45019 33665 20589 33976 34517 29579 46409 66240 61504 38333 14739 21285 13300
10395 13300 8176 4488 13632 31378 33569 13044 15115 24673 37068 41566 50019 40508 28235
10382 28235 28479 19556 12937 17172 18129 29198 35642 39060 12146 -6950 1144 5392 1963 7448
10368 7448 8056 -2914 5241 25243 32030 17474 4872 -498 -18966 -34332 -12820 22111 33382
10355C3382j4493j7946J2j1757j0850n019k090K0654J3759J4585N588J422k4121
10342C126k3867N740J6776J5072K715J8460k507j8010n391M61j786p61L591K6231
10328C9850k712M291j060j1774r384J6434K405Q226l783k4873k194J0144r90j5296
10314I284p093J4748q03J3513L856j3129j8344k55n922N953r435O804J4445Q275
10300B1897p923j0828Q867M025J613K429J5270j6288p392J2173R622O724K09o506
10286C3892o811j3942r484j6188n418O984J450o153O916J1574n325L539J391m071
10272a646j6405n289j727J753J1116K1628O401j9319p981n255j8999P630J0308
10259a7785j0226L495J1677J6789Q644J1038P898j6665O622j3891o48K1953k571
$$ plain form
10355 33382 18889 943 955 -10802 -21652 -26671 -28761 -8107 5652 20237 25825 27247 3126
10342 3126 -20741 -15001 1775 16847 19562 38022 35515 17505 12114 12575 10789 10028 13619 39850
10328 39850 37138 41429 40369 28595 19211 35645 38050 46276 42493 17620 15426 25570 24580 9284
10314 9284 2191 16939 16136 29649 33505 20376 2032 1777 -4145 1808 -7627 -823 13622 21897
10300 21897 13974 3146 12013 16038 17651 20080 35350 19062 11670 23843 33465 40189 40398 33892
10286 33892 27081 13139 3655 -12533 -17951 -10967 -9517 -15670 -8754 2820 -2505 1034 2425 -1646
10272 -1646 -18051 -23340 -25067 -23314 -12198 9430 15831 -3488 -11469 -16724 -35723 -28093 -17785
10259 -17785 -28011 -24516 -12839 3950 12594 23632 31530 14865 21487 7596 6948 28901 26330
10246B6330j0388j0168J77Q503K490L022L867J199j1218j1338o536p801j5492
10233b7353m514J6055K0240j736j1396j8724l551R504R422M51P663j1108M676
10220a0371J8659Q44m749j5857Q542O913K050o459J3482p560r437K318K400O013
10206F788Q231R652J0237K059o637m159N92N605J483k360m875r043j2111r66j458
10191C038j323J0529Q622j77P480j0576p262j1731J4834J6722Q487J6527J893
10178E7063K784M110R093J0246j0566r885J395K80M572L3679K3503J2427M074
10165A42775K0898o903P280J036j8543k3193j0929L0313M4084M6062J8172j3092
10153B37960k5136j6796l1118j5187k6402k444k292K0387O967J3357K0839j3808
$$ plain form
10246 26330 15942 5774 5951 14454 16944 19966 23833 25032 13814 2476 -4060 -11861 -27353
10233 -27353 -31867 -15812 4428 2692 -8704 -27428 -30979 -21475 -12053 -11602 -3939 -15047 -10371
10220 -10371 8288 9132 4383 -11474 -2932 3981 6031 -428 13054 5494 -3943 -1625 775 6788
10206 6788 15019 24671 34908 36967 30330 26171 26763 32368 33851 31491 26616 17573 5462 4496 3038
10191 3038 1715 12244 20866 20689 28169 17593 10331 -1400 13434 30156 38643 55170 57063
10178 57063 59847 63957 73050 83296 72730 62845 64240 64520 69092 102771 126274 138701 142775
10165 142775 163673 156770 164050 165086 146543 123350 112421 142734 186818 232880 251052 237960
10153 237960 212824 196028 164910 149723 123321 120877 118585 138972 145939 159296 180135 166327
10141A66327l3345r652k3030M975n680k749r832n076j2740Q335N484q98j4981
10128F7138N064j3350j6033j1914k846O515p75n706p285j8499m306N089J0723
10115A3815L601r756k364j7497j6898m648O335J2309Q899Q618p856R663O397J04
10101A0722N663Q687N83L655l955J066L650q805k3861j5062M97J9442J5407m752
10087A2937n771J6234J395j626M428P064m385j3489j0138o864Q193L90k4702q519
10073b4853p72K2216j52l576o524M444m514l022o878q98l653j7602N517K3529
10059a6738J3290n112j7635j6516K63J1262L1450J1168r54q437j4340p377J8680
10046i96J996j096j024M550N0o147J2004m567J6758j643j4169j3163l963m592
$$ plain form
10141 166327 132982 123330 100300 105275 99595 96846 87014 81938 69198 77533 83017 82119 67138
10128 67138 72202 58852 42819 30905 28059 34574 33799 28093 20808 2309 -1997 3092 13815
10115 13815 17416 7660 5296 -12201 -29099 -33747 -27412 -15103 -6204 2414 -5442 4221 10618 10722
10101 10722 16385 25072 25655 29310 25355 26421 30071 21266 -2595 -17657 -17160 2282 17689 12937
10087 12937 7166 23400 24795 23169 27597 34661 30276 16787 6649 -215 7978 8368 -16334 -24853
10073 -24853 -25625 -3409 -3561 -7137 -13661 -9217 -13731 -16753 -23631 -24529 -28182 -45784 -40267 -16738
10059 -16738 -3448 -8560 -26195 -42711 -42448 -31186 264 11432 10478 2041 -12299 -19676 -996
10046 -996 1000 -96 -1120 3430 3480 -2667 9337 4770 21528 19885 5716 -7447 -11410 -16002
10032a6002K942J2167J9013J407N470k7160n068M54J2685j2519K038K791k70R910
10018G858Q277L887o250q549j2716n874J2926K024J3499j1926p076k032o391P42
10004a1601J5718j899r415J2102K473j7365K711q155m884m705m174K0070J4165
9991E041j1478k7454L647n350O614K2203K237k7665m646J2394m05j3782L191r361
9977d4814k268j1143L252J4878J0715L7559J4574k1494q088N796l730m025j379
9964a0167J7208J2704p330n620k1031p490Q465j0251K1072J4197j1543L369K0152
9951B3735R734j457o59j4419j389k229K751j3010q405n901j075J82j255L0991
9937A7594K0031n838j1981O495K6648J5281p893l984K219k5170k1023j5115j3323
$$ plain form
10032 -16002 -13060 -893 18120 19527 24997 -2163 -7231 -6777 5908 -6611 -4573 -1782 -2052 7858
10018 7858 16135 20022 13772 5223 -7493 -13367 -441 1583 15082 3156 -3920 -5952 -12343 -11601
10004 -11601 4117 2218 -7197 4905 7378 -9987 -7276 -15431 -20315 -25020 -29194 -9124 5041
9991 5041 -6437 -33891 -30244 -35594 -28980 -6777 -4540 -32205 -36851 -24457 -24862 -38644 -35453 -44814
9977 -44814 -47082 -58225 -54973 -40095 -29380 8179 22753 1259 -6829 -1033 -4763 -8788 -10167
9964 -10167 7041 19745 12415 6795 -14236 -21726 -13261 -23512 -2440 11757 214 3583 23735
9951 23735 33469 32012 31353 16934 15545 13316 16067 3057 -5348 -11249 -12324 -12142 -13397 17594
9937 17594 37625 31787 19806 26301 52949 68230 60337 56353 58572 33402 12379 -2736 -16059
9924a6059N552O543Q656L1430N975k0292k3110n21O553l942O589k088j0025P790
9910C051n537N078l601k683o33J466J5844R417j075r049j6486j6504N957K0963
9896F208M747K158j5199Q33Q731J4795q82Q672l654n150q672l72j0248j2590J3762
9881C139P184J1651K2295R48l895k0439j4133L83j0367p85m812j0478L312o333
9867b2330Q855J1493K829k2236l56J5508P753o256k71N803j1616J214O860J2362
9853I612J4694k3190o609L158L277P573L615j2793k2944M955Q878p47P805p84
9839c500J5805J2993o274j0001N12p224k0969j4818M463K6157K1519j7376n163
9826c876K1393J7627j8978K501k837j2087m731M321l583n206n063R568J0717K614
$$ plain form
9924 -16059 -10507 -3964 4692 36122 42097 21805 -1305 -1826 4727 785 7374 5286 -4739 3051
9910 3051 -2486 2592 -1009 -3692 -4325 -2859 12985 22402 21327 12278 -4208 -20712 -14755 6208
9896 6208 10955 13113 -2086 -1253 7478 22273 21391 30063 26409 21259 12587 12215 1967 -10623 3139
9881 3139 10323 21974 44269 45217 41322 20883 6750 7133 -3234 -4019 -8831 -19309 -15997 -22330
9867 -22330 -13475 -1982 847 -21389 -21745 -6237 1516 -4740 -5011 792 -10824 -9610 -2750 9612
9853 9612 24306 1116 -5493 -2335 942 8515 12130 -663 -23607 -18652 -9774 -10521 -2716 -3500
9839 -3500 12305 25298 19024 9023 9535 2311 -18658 -33476 -29013 -2856 18663 1287 -3876
9826 -3876 17517 35144 16166 18667 15830 3743 -988 3333 -250 -5456 -10519 -951 9766 12380
9812A2380l972n406r40J1664m007j7184m652L443J734r345k598J4643P285K43
9798C288l0701Q896L0389j3868j9937L323K6096k879m229k00R984NJ098j161J9559
9783B9663J0370J2019K659k5657k08j1005j9722p419p260L363L265J3412l273
9770B07j1188k467N202j8015n990M363J1510r08N452J736k023J05n925J06k46
9755a8081P84j0514L530J8967O564L44m814j3193K52P846J289J4039K85j1813
9741d515J9057n509p697J1602m137N466M001J4754p989O515N103o849j188j3700
9727A4914o760J7267J444Q731p932l199L301j018K242p232l491P148M767j997
9713B8185q123o080j4356k206K68q18J1931l04n757k233J5672M821j9393O038
$$ plain form
9812 12380 8408 3002 2062 13726 9719 -7465 -12117 -8674 -6940 -16285 -18883 -4240 3045 3288
9798 3288 -27413 -18517 11872 -1996 -21933 -18610 7486 4607 378 178 10162 10167 11265 10104 29663
9783 29663 40033 52052 54711 29054 28846 17841 -1881 -9300 -16560 -13197 -9932 3480 207
9770 207 -10981 -13448 -8246 -26261 -32251 -27888 -16378 -17286 -11834 -10098 -12121 -12016 -17941 -17835 -18081
9755 -18081 -17297 -27811 -24281 -5314 1250 1594 -3220 -16413 -16161 -8315 -7026 7013 7298 -4515
9741 -4515 14542 9033 1336 12938 8801 14267 18268 33022 25033 31548 36651 29802 28614 14914
9727 14914 8154 25421 26865 35596 27664 24465 27766 26748 28990 21758 18267 25415 30182 28185
9713 28185 20062 13982 -374 -2580 -2312 -3130 8801 8497 2740 507 16179 21000 1607 7645
9699G645N369q391q609K5879M145j5226l863J479J653n9l791p960K492j1457n924
9684a6618P83P207J6524Q155K978n649M964n287j7701p249J1436j363j4188Q705
9670g303K468k011R213j934j0136M636l302j59Q102J9952J0954L70P567J5922
9656E4339K1248J8301K6245J7917j5652K768j444k3126j9243k2277j7754r612
9644C1710r022r845k772n708M737N860J2382j3418j3164j7655P599r34Q607R672
9630H049P78j2293j2262K1211J1153r092P994q897O37L633J5950j1072j7888k915
9616e014J7774N908m637J895p146r702j4233M964J0374q535n607L406P83L490
9602f280n817m749k413K096J1273J1625K386j6754J960J93p669j0066J8321J8953
$$ plain form
9699 7645 13014 4623 -3986 21893 26038 10812 6949 8428 10081 10022 6231 -1729 763 -10694 -16618
9684 -16618 -15835 -8628 7896 16051 19029 13380 18344 13057 -4644 -11893 -457 -1820 -16008 -7303
9670 -7303 -4835 -6846 2367 433 -9703 -5067 -8369 -8528 -426 19526 30480 30850 38417 54339
9656 54339 75587 93888 120133 138050 122398 125166 123722 100596 81353 59076 41322 31710
9644 31710 22688 12843 10071 4363 9100 14960 27342 13924 760 -16895 -9296 -10230 -1623 8049
9630 8049 8827 -3466 -15728 5483 16636 7544 15538 6641 7278 10911 26861 15789 -2099 -5014
9616 -5014 12760 18668 14031 15926 8780 -922 -15155 -10191 183 -8352 -13959 -10553 -9770 -6280
9602 -6280 -12097 -16846 -19259 -17163 -5890 5735 8121 -8633 -6673 -6480 -14149 -24215 -5894 13059
9588A3059j4335j8907j1387J0097n49j2028K235K4444J6434M111j6014r041k045
9575a3926K548j0321o358K764l776L7640R69k2973O704O025M137j3619o272O532
9561i926N911M691r01J3255Q056o121p058j1258j0652q643J3525J4421J2090R083
9547B6473j2865q052P93J7515K920j1473k985K565j0394j2198j94K229O814L7
9533A185o105P968r120j7044J0615l167N651j186j0116m126J15j004M578O631
9519a5125N110j7131p522O865Q834P92p448l632J1474N940n520m941q916Q49K0108
9504a0263M182j4680J6669J4580k139m40R161M746N073J947q907o017L780l270
9490A4422N923Q985j045j4678n214j3534M603J8068j3176k943l652j130j0328
$$ plain form
9588 13059 -1276 -20183 -31570 -21473 -22022 -34050 -31815 -7371 9063 13174 -2840 -11881 -13926
9575 -13926 -11378 -21699 -28057 -25293 -29069 8571 9540 -13433 -6729 -704 3433 -10186 -16458 -9926
9561 -9926 -4015 676 -225 13030 21086 14965 7907 -3351 -14003 -22646 -9121 5300 17390 26473
9547 26473 13608 5556 6349 23864 26784 15311 12326 14891 4497 -7701 -7895 -5666 1148 1185
9533 1185 -4920 3048 -6072 -23116 -12501 -15668 -10017 -11203 -21319 -25445 -25330 -26334 -21756 -15125
9519 -15125 -10015 -27146 -34668 -27803 -18969 -18177 -25625 -29257 -17783 -11843 -17363 -22304 -31220 -30371 -10263
9504 -10263 -6081 -20761 -4092 10488 8349 7909 17070 21816 26889 28836 19929 13912 17692 14422
9490 14422 20345 29330 28285 13607 8393 -5141 -538 17530 4354 1411 -2241 -3371 -13699
9477a3699K648M856J6817L109j3369r982K82J6187P437k759P501M470M102L354
9463C0954j0890k6099l771Q214j346Q573L172J4462k0151l754J6538R852q281
9450A7473j4161j4150J5571N747j0839j0922q705K1730k0042m342K5272O256n563
9437C325k127J81N398O525J1127J6959O967P4r365o857m286q371j6537N194o54
9422G553n428o373K816o21J4332J6093Q307p685Q518K5347Q773n374o925j8235
9408D1098j0110o333l798P415l471r515j827J7993K493j2196j02J0817K662L122
9394C8248j6410m318M030q11j513R377j767k160M500J5759m281j7774O394P677
9380C6951k2044N442j3145O692Q621J1183n11m607n605p979o669J2542J0412K831
$$ plain form
9477 -13699 -11051 -6195 10622 13731 362 -9620 -9338 6849 14286 11527 19028 23498 27600 30954
9463 30954 20064 -6035 -9806 -1592 -2938 5635 8807 23269 3118 -636 15902 25754 17473
9450 17473 3312 -10838 4733 10480 -359 -11281 -19986 1744 -18298 -22640 2632 8888 3325
9437 3325 1198 1379 6777 13302 24429 41388 48355 48429 39064 32207 27921 19550 3013 8207 7553
9422 7553 2125 -4248 -1432 -2053 12279 28372 36679 28994 37512 62859 71632 66258 59333 41098
9408 41098 30988 24655 20857 28272 24801 15286 13459 31452 33945 21749 21647 32464 35126 38248
9394 38248 21838 17520 21550 20739 19226 28603 26836 24676 29176 44935 40654 22880 29274 36951
9380 36951 14907 20349 7204 13896 22517 33700 33189 28582 22977 14998 8329 20871 31283 34114
9366C4114L220J6775p183k7667o705l596k1629k0216K6507J5224l451L022M787
9353A3202q901n283o365J9981J3835M49o838M916l640n225R392L420J1682n122
9339C5503k7194j0888N022j068j7706J1399R545J4991J6124J77L84k0527n859
9326I903m125M10q361j908O326O672q624k282r47k327Q188P924N337O013J6727
9311C8926R382M99j639j9029r266j1300L362P958J5799k097r655j4361p42P665
9297A5502j4413n721O375r314m525K0629K375J0678J0091O920j2907j687j789
9284B2214j9526r28K173K7413P875j1419j5200J1176k091L795K1515p719j0509
9271B8769j1239P516j0105k4242j843J0769J3817n387K405N085N644N285J0653
$$ plain form
9366 34114 37334 54109 46926 19259 12554 8958 -12671 -32887 -6380 8844 5393 8415 13202
9353 13202 4301 -982 -7347 12634 26469 26918 20080 24996 21356 16131 25523 28943 40625 35503
9339 35503 8309 -2579 2443 1375 -16331 -4932 4613 19604 35728 35905 36289 15762 9903
9326 9903 5778 6188 -2173 -4081 2245 8917 293 -1989 -2936 -5263 2925 10849 16186 22199 38926
9311 38926 48308 48807 47168 28139 18873 7573 10935 18893 34692 32595 22940 8579 7837 15502
9297 15502 1089 -4632 1743 -7571 -12096 8533 10908 21586 31677 38597 25690 24003 22214
9284 22214 2688 1760 3933 31346 39221 27802 12602 23778 21687 25482 46997 39278 28769
9271 28769 17530 25046 14941 -9301 -11144 -375 13442 8055 10460 15545 21189 26474 37127
9258C7127j0046j7637N315O038J0902M021j558k633j3320O531J876k8620k52J2351
9244A0095M051K2736J7027k3644k5613J6947K2726j676j2123j0968n425j9974
9232e841J136J3204P011j8513j0475k503M0767Q644q312Q009k213q004Q917R32
9218C2759m6q492Q184j2883j0991M786K0043P24m999P725K1054J0768K502q917
9204F2217j1296J601k384N369J226r34L148o015j0223M513Q739R952J0955j0536
9190F6332k736r657p194p377p80K20J801P025N666j6663K619J9869L388k848J0378
9175G0043j73p024r337j0897J3589l694j3048j2947L360J6814J1686j6205J060
9162D3227K0775O604J884J995j267o744R91K1939K1203L445j9655j1159l2317
$$ plain form
9258 37127 27081 9444 14759 20797 31699 35720 34162 31529 18209 24740 26616 -2004 -2256 10095
9244 10095 14146 36882 53909 30265 4652 21599 44325 42649 30526 19558 14133 -5841
9232 -5841 -4705 8499 15510 -3003 -13478 -15981 24786 33430 25118 33127 30914 22910 31827 32759
9218 32759 32713 24221 32405 19522 8531 13317 33360 34084 29085 36810 57864 68632 71134 62217
9204 62217 50921 52522 50138 55507 56733 55799 58947 52932 42709 47222 55961 65913 76868 66332
9190 66332 63596 53939 46745 39368 38588 38808 40609 47634 53300 36637 39256 59125 62513 59665 70043
9175 70043 69870 62846 53509 42612 56201 52507 39459 26512 29872 46686 58372 42167 43227
9162 43227 64002 70606 72490 74485 73218 66474 67465 89404 110607 114052 94397 83238 50921
9149E0921j3912p974O126M576J960L572r570N11R797N354N476J250R703J6001
9135H3791j8276o420P75N056m876j4657o881j4055o114J1474L3894Q346J3594
9122H5651k6356k1206p530K469O541J7906q56j221K493N886J1830J3159K2266
9109A11032J840j9593q909O354o367R498k729l690r914M94j7010l019K3852J2503
9095I4342j2922J4565K1645R470r472J137j3765J1172K7208K1748n896K4637M0185
9082B24054K3527K1024M8151L7504M1318M8042Q6475Q4357R5299J16915J29031
9071I55697J04486P2503L7896N453k1914n7728p4793r9105j23405q7943q2559
9060F28588q3057r4153n2103m2872k7875p955k0194k5302j3834j9088K229J0417
$$ plain form
9149 50921 37009 29035 35161 39737 41697 45269 35699 36210 46007 51361 56837 58087 67790 83791
9135 83791 65515 59095 59870 64926 60050 45393 38512 24457 18343 29817 63711 72057 85651
9122 85651 59295 38089 30559 33028 39569 57475 56619 55398 57891 63777 75607 88766 111032
9109 111032 112872 93279 84370 90724 84357 93855 91126 87436 77522 78016 61006 57987 81839 94342
9095 94342 81420 95985 117630 127100 117628 118765 105000 116172 143380 165128 159232 183869 224054
9082 224054 247581 268605 316756 354260 395578 443620 530095 614452 709751 826666 955697
9071 955697 1060183 1132686 1170582 1176035 1154121 1096393 1021600 922495 799090 711147 628588
9060 628588 545531 451378 399275 356403 328528 320573 300379 275077 261243 242155 244384 254801
9048B54801J5849Q634J4990J5213J0559L7043K4975K6525P160K5360o417k1577
9036D13115j7195r087k4343m3852l2083k9994l9182l2332j3796P393k645j1105
9024A64894j3870j946k5673m690J0470k673o631p372K855J0125J5880j2437j4511
9011A14421k4065j6887k848P473j6840j189K1301J398N332q41j0995J0128J0024
8998I6412P36o538L825j0917k0704J455R805P103J368P727J9091L0500K0358K973
8984A63194O296r113j9161j689r34k6319k9372j3779k138k406O369J6324o930
8971H0342j0647N101J1625p465Q798M066j2038j3232P597j126k461k1156q50P118
8957E5672K9388j028k733K0307L109j9979j8667J1806K1603l0163j1770o908j827
$$ plain form
9048 254801 270650 279284 294274 309487 320046 357089 382064 408589 415749 441109 434692 413115
9036 413115 395920 386833 362490 318638 286555 256561 217379 185047 171251 178644 175999 164894
9024 164894 151024 149078 123405 118715 129185 126512 119881 112509 115364 125489 141369 128932 114421
9011 114421 90356 73469 70621 78094 61254 60065 81366 82764 88096 87255 76260 86388 96412
8998 96412 97148 90610 94435 83518 62814 64269 74074 81177 82545 90272 109363 139863 160221 163194
8984 163194 169490 160377 141216 139527 138593 112274 82902 69123 66985 64579 70948 87272 80342
8971 80342 69695 74796 86421 78956 87754 91820 79782 66550 74147 73021 70560 49404 48554 55672
8957 55672 85060 84032 81299 101606 104715 84736 66069 77875 99478 69315 57545 50637 48810
8944D8810O571P443K2526K4137J7822k7942k8661J2929J7365J5339J6721J5930
8932A48990L1900L9060K4695L6466J107k5883k5559j4578P30o951l3569j6085
8920A60323j7427q654k86M135K555j4881l0991j1603J5053J3872O478k595P757
8907A23736K114N13J2194K346M072r375J2843K5451J7268r520j1747J4467j535
8894A82827J87j6641K575j525j4823P668P614q118j0714J516n873J117m4j00P801
8879A53467j0679l0R540J6932n938N110p147n021k039J6226O320p059k2316m2617
8865A04749k4255l3790j2998L797m280K7380J0094N699J9940J7387K5400J2012
8853A51135m396L406O189j1176j2141j580R206P282P439j160m905J4442K6489
$$ plain form
8944 48810 55381 62824 85350 109487 127309 99367 70706 83635 101000 116339 133060 148990
8932 148990 180890 219950 244645 281111 282218 256335 230776 216198 216928 209977 176408 160323
8920 160323 142896 134242 133956 138091 140646 125765 94774 83171 98224 112096 118574 115979 123736
8907 123736 125850 126363 138557 140903 144975 135600 148443 173894 191162 181642 169895 184362 182827
8894 182827 183014 166373 168948 167423 152600 160268 167882 159764 149050 150566 144693 145810 145766 145666 153467
8879 153467 142788 142758 152298 169230 163292 168402 161255 156234 154195 170421 176741 169682 147366 104749
8865 104749 80494 46704 33706 37503 33223 60603 70697 76396 96336 113723 139123 151135
8853 151135 146739 150145 156334 145158 133017 131437 140643 147925 155364 154204 149299 163741 190230
8840A90230K5420M482r188j9858k2878m3657n5745l9332m8493m7166l8829q436
8828a13450J8293L7116M3533M3405J5556K1761K4770Q075J3642K0457J6788J4913
8816A64859K2408L307Q248K5685K0116J237L457J7956K7085L4838O4246Q5332
8804D78774R3697O4755M2400l004l3054q0008j01174j04575p7218o1088m5256
8793A74249j6694J4732N946o006j0702O838L624m858Q841J1860L029L5637J9929
8780B46425J4109R258m385M104K3005N0672K0776K1537K5432J3008j060P363r484
8767D20760k1839k4887j3589j5951m426L96R135j6490L0152R261J2568K9262K1947
8754D36299K9635M1800J7584J5104N090N66N298J0530J6436L277J1790J5225L6726
$$ plain form
8840 190230 215650 220132 210944 191086 168208 124551 68806 29474 -19019 -66185 -105014 -113450
8828 -113450 -95157 -58041 -14508 28897 44453 66214 90984 99059 112701 133158 149946 164859
8816 164859 187267 190574 198822 224507 244623 245860 249317 267273 294358 329196 393442 478774
8804 478774 572471 637226 679626 676622 643568 563560 462386 357811 280593 219505 174249
8793 174249 157555 172287 178233 172227 161525 168363 171987 167129 175970 187830 190859 226496 246425
8780 246425 260534 269792 265407 269511 292516 343188 363964 385501 410933 423941 422881 430244 420760
8767 420760 398921 374034 360445 344494 340068 340464 349599 333109 363261 372522 385090 414352 436299
8754 436299 465934 507734 525318 540422 545512 546078 551376 561906 578342 581619 593409 608634 645360
8741F45360M8970L9018L4804K8744L2117M7190M9579N2684O1603N6874O0464N4340
8729A211747O3331Q7436J24181J35881J62274J99984K18818J75364R3046K7648
8719B499710o746j2789m6070k7132J0442M4354Q2211J04938J34147J68050J77650
8708C128765K01731K38143K68566K80159L11730L52424L67369L99449M78929N67537
8698F594802O46665P62744R05820J046773J221229J426832J639868J866438K218859
8689A8330030K627818L016772L394363L847286M567818N735461P595748J0372876
8681E9488172J4534750K0540341K8901721L9273977M8088250M7312362L0948758
8674B89088331N194548j7277671l1382061l8166164l8479773l3817366k7036743
$$ plain form
8741 645360 694330 733348 768152 796896 829013 876203 925782 978466 1040069 1096943 1157407 1211747
8729 1211747 1275078 1362514 1486695 1622576 1784850 1984834 2203652 2379016 2472062 2499710
8719 2499710 2492964 2480175 2434105 2406973 2417415 2461769 2543980 2648918 2783065 2951115 3128765
8708 3128765 3330496 3568639 3837205 4117364 4429094 4781518 5148887 5548336 6027265 6594802
8698 6594802 7241467 8004211 8910031 9956804 11178033 12604865 14244733 16111171 18330030
8689 18330030 20957848 23974620 27368983 31216269 35784087 41519548 49115296 59488172
8681 59488172 74022922 94563263 123464984 162738961 210827211 258139573 289088331
8674 289088331 294282879 277005208 245623147 207456983 168977210 135159844 108123101
8667A08123101k0520574j5146460j1016515q031474n976605m691976l869101l257101
8659C5613295k732861k272941j877039j517584j043756m75723K15837J128862
8651B7038090K363538M128134O760957J0443924J4336558J5191204R657349O38148
8643I0557902o049254r378082j0799757j0720954r526004p855680o243745m930333
8635B5054093l837282k900973k232596j766073j431640j247151j108775r65783
8627I563820q58557p71607o71758n85280m82293m22265l66965l39591l11388k81369
8617D472747k61459k24091k08229j75112j63865j68666j61789j27127j19549r8435
8607B764425j04437j20513r9927r9672q4607r4542p8465p0332r0443p5755m9805
$$ plain form
8667 108123101 87602527 72456067 61439552 53408078 47431473 42739497 38870396 35613295
8659 35613295 32880434 30607493 28730454 27212870 26169114 25693391 25909228 27038090
8651 27038090 29401628 33529762 40290719 50734643 65071201 80262405 89919754 90557902
8643 90557902 84508648 75130566 64330809 53609855 44083851 36228171 29984426 25054093
8635 25054093 21216811 18315838 16083242 14317169 12885529 11638378 10529603 9563820
8627 9563820 8705263 7933656 7261898 6676618 6194325 5772060 5405095 5065504 4754116 4472747
8617 4472747 4211288 3987197 3778968 3603856 3439991 3271325 3109536 2982409 2862860 2764425
8607 2764425 2659988 2539475 2439548 2339876 2255269 2160727 2082262 2011930 1921487 1845732 1795927
8596A795927n9154o1500n4074m1818l1354k0439j9039k8007l7160m2278m6906
8585A354198l7771k1700k6272k7334k4413k1337j8873l1127k4860k0790k3740
8574A075981j7739j9199k8524k0018j0234k6000k8686o107o189j0228o260j4524
8562H82273j065j2992L237r34N697j0773k4570j9949k0179m5406o1941q4708r5211
8549E13479j02566p7299k5173P084K9758K1932K5896M1086L4912J6815N175l144
8537D87955q478o478P426J3266R008K2093L482K352k403k584k379n650M445K2992
8523E45047K9921K8527M912J778l3173m2088k9736l3855j0103j9767k1263r924
8511D10276k4673r296K5395R37J1415K026j0829O533J6505O545J2375m954k0016
$$ plain form
8596 1795927 1736773 1675273 1621199 1579381 1548027 1527588 1508549 1480542 1443382 1401104 1354198
8585 1354198 1316427 1294727 1268455 1241121 1216708 1195371 1176498 1145371 1120511 1099721 1075981
8574 1075981 1058242 1039043 1010519 990501 980267 954267 925581 919474 913285 903057 896797 882273
8562 882273 881208 868216 871453 870519 876216 865443 840873 820924 800745 755339 693398 608690 513479
8549 513479 410913 333614 308441 315525 345283 367215 393111 434197 469109 485924 491099 487955
8537 487955 479477 472999 480425 493691 502699 524792 528274 530626 528223 525639 523260 517610 522055 545047
8523 545047 574968 603495 608407 610185 577012 534924 505188 471333 461230 441463 420200 410276
8511 410276 385603 376307 401702 402639 414054 416080 405251 411784 428289 434834 447209 442255 422239
8498D22239n172o110j7082m3261k8165K6550L7630J6264K2746J4676p919o885
8486D25511k8533k1998j3635k5439l2569m1472m0762L004o838p399J0462K1357
8474B41689R509L195J2535q984k0531m15J6435j5484k8168k722Q480k6696k1821
8461A67022J0364O604L058n059m423j9616j0886j4174p522q77n224k0687o467
8448I2113J0282M442J4091J7954k690j890J3095J222p729J6224K8730R530k6014
8435A69360j2515J2670R530k2285k7907k755R999K838N51j3266l32j3996p215
8422A04677K292O520K078n468J1683J406o558n636j603K2515P307r958k5445j1046
8408I2764Q723J4464J0333R374q8n515j4916j6004L76l725q155j5648P188J1462
$$ plain form
8498 422239 417067 410957 393875 350614 322449 348999 386629 402893 425639 440315 432396 425511
8486 425511 396978 374980 361345 335906 303337 261865 221103 224107 217269 209870 220332 241689
8474 241689 251198 254393 266928 257944 237413 236998 253433 237949 209781 207059 215539 188843 167022
8461 167022 177386 183990 187048 181989 177566 157950 147064 132890 125368 124491 119267 98580 92113
8448 92113 102395 106837 120928 138882 136192 134302 147397 148619 140890 157114 185844 195374 169360
8435 169360 156845 169515 179045 156760 128853 126098 136097 138935 139486 126220 125888 111892 104677
8422 104677 106969 113489 115567 110099 121782 123188 116630 110994 109391 131906 139213 129255 103810 92764
8408 92764 101487 115951 126284 135658 135570 130055 115139 99135 99511 95786 87631 71983 79171 90633
8394I0633J7186N091j3084P321Q260k1437n242J8210O291O407o413j2713p825
8381I2685l96j636p236L601k296o903r936J2002R394J582J0412P121j2795j5189
8367H0410l0315j1500n423M195l048k55J1259J4068J5911O153j2904K375P416
8354G8342m227Q703nl824r366k2825j3903j631N958J9644M164j06q760p621Q977
8339E3520M565K016m047N936J572k093J0440O56j728p831j1883J1207J2415j266
8325G3479J4062P217o580j8999j565O082j5440Q504J5479J467J1107N789j4090
8312H6512j7406r252K1951m559j2137m816Q005J974q701K2072K3557M858o091
8299A05967j0033L440l136j8K7318K1734J4280L861J3238L0812L3213J6207J2519
$$ plain form
8394 90633 107819 112910 99826 107147 115407 93970 88728 106938 113229 119636 113223 100510 92685
8381 92685 92289 90653 83417 87018 84722 77819 67883 79885 89279 90861 101273 108394 95599 80410
8367 80410 50095 38595 33172 37367 34319 34064 45323 59391 75302 81455 68551 70926 78342
8354 78342 74115 82818 82813 78989 69623 46798 32895 31264 37222 56866 61030 60924 52164 44543 53520
8339 53520 58085 60101 56054 61990 63562 61469 71909 72565 70837 63006 51123 62330 74745 73479
8325 73479 87541 94758 88178 69179 67614 73696 58256 66760 82239 83706 94813 100602 86512
8312 86512 69106 59854 81805 77246 65109 60293 68298 70272 61571 83643 107200 112058 105967
8299 105967 95934 99374 96238 96220 123538 145272 159552 163413 176651 207463 240676 256883 269402
8286B69402K1906M6069L8606M9761P9050P0195Q7353J10525J31674J04183P6823
8275A085547N9757J1057n425n5186o8365r8748j18348j04498o5354q4934p4517
8264D80986p3264n2235l5019k9995k5215o511o977m086O235k876o893J115K2752
8251B68017K5518K1863R603J9515K1032K5762J6802k1893j4961r684p058k3523
8239C30993l1633l6937k7099j4078j8359k5667j8296l883k1269j4843k262O543
8227A23210P330R575j3263p815k0129j8242o727P221J5970O717n527r218k0370
8214F8732j2848j6465P726j1996r341Q267K0877R36k0076r86j382K93L982n722
8200C1997J0891K1750M7k1765j9624N240M44j722Q231p75J4017L902j0113r485
$$ plain form
8286 269402 291308 337377 375983 425744 504794 574989 662342 772867 904541 1008724 1085547
8275 1085547 1145304 1156361 1150936 1095750 1027385 928637 810289 705791 640437 555503 480986
8264 480986 407722 355487 320468 290473 265258 258747 251770 247684 253919 251043 244150 245265 268017
8251 268017 293535 315398 325001 344516 365548 391310 408112 386219 371258 361574 354516 330993
8239 330993 299360 262423 235324 221246 202887 177220 158924 155041 133772 118929 116667 123210
8227 123210 130540 140115 126852 119037 98908 80666 73939 81160 97130 103847 98320 89102 68732
8214 68732 55884 39419 47145 35149 25808 34075 54952 55888 35812 34826 33444 33737 37719 31997
8200 31997 42888 64638 64685 42920 23296 28536 28980 27258 35489 34714 48731 52633 42520 33035
8186C3035o084j1574j8773k137k830n833K789J0357P002m069l607J4991J0669
8173B3936Q641j8842P476K0969k239L192m31O165J3048j1992j3969j3654K823
8160B5123M488Q506K095j7814k0683L887J6923L531m349j4967J8377J3492L640
8147D2249K141k017p067j5347j2994j502j222R093o182q132J6646K972J864J0499
8133C1001J3485j4588k5006K466J6278j219m965L498O061n354M337l490j281R685
8119C0908J4359L814k321j508q487j4985j0598J7648K2911j209j8959J3736l962
8106D1347O011J0234m269m397p411j6756p605J3808N424j8496j567P251K271J485
8092B7330p227L489R950k0134o083l670J6087J3716O312O034l939m960P451n789
$$ plain form
8186 33035 26951 15377 -3396 -5533 -8363 -14196 -11407 -1050 5952 1883 -1724 13267 23936
8173 23936 32577 13735 21211 42180 39941 43133 42702 48867 61915 49923 35954 22300 25123
8160 25123 29611 38117 40212 22398 1715 5602 22525 26056 21707 6740 25117 38609 42249
8147 42249 44390 42373 35306 19959 6965 5463 4241 13334 7152 -980 15666 18638 20502 31001
8133 31001 44486 29898 4892 7358 23636 22417 17452 20950 27011 21657 25994 22504 21223 30908
8119 30908 45267 49081 46760 45252 36765 21780 11182 28830 51741 50532 31573 45309 41347
8106 41347 47358 57592 53323 48926 41515 24759 17154 30962 36386 17890 16323 23574 25845 27330
8092 27330 20103 23592 33542 13408 7325 3655 19742 33458 39770 45804 41865 36905 44356 38567
8078C8567O928j0884R575j5184J30M312k005j672n498j2908K635Q939P722j5382
8064A5275j2106j02J816l790M905O215J3196k051j0631r761p19M803N194j759
8050A0485n790P217N832l268j2916J0223J1138j1923j770J100P561K183Q649L060
8036C1781J2108J4147j411j5470p848O669K733J485r559J0036K622K185J3088
8023F2566j9523q297N720k489J7675L250k190o258j2062J473j1042l554P765L812
8009C6846k888K275o923k21K208M485K040J1129J1672O359j5215o900N999n344
7995D5522m147R422N531L3218J4554J0418j787m460k2069p821J2440R521j117
7982I9225O61L440n095n835j6115k952j842p665j7887p712j2702R681M573J1688
$$ plain form
8078 38567 45495 34611 44186 29002 29132 33444 31439 29767 24269 11361 13996 22935 30657 15275
8064 15275 3169 3067 4883 1093 5998 12213 25409 23358 12727 2966 2247 7050 12244 10485
8050 10485 4695 11912 17744 14476 1560 11783 22921 10998 9228 10328 17889 20072 28721 31781
8036 31781 43889 58036 56625 41155 33307 39976 42709 44194 34635 44671 47293 49478 62566
8023 62566 43043 34746 40466 37977 55652 58902 56712 50454 38392 39865 28823 25269 33034 36846
8009 36846 33958 36233 29310 29089 31297 35782 37822 48951 60623 66982 51767 44867 50866 45522
7995 45522 41375 50797 56328 89546 104100 114518 112731 108271 86202 78381 90821 100342 99225
7982 99225 99886 103326 98231 92396 76281 73329 71487 63822 45935 38223 25521 35202 39775 51463
7968E1463J1277N247q215j5926m402J73j2265m361J6308J824p893M615J996r665
7954C0176r673K0265L741L761J3422J1563J3770J2496j8949l075R670K962j0581
7941G9548k1078l6540n025J3025Q643O049j0781P211m854k3286J2405K3772Q365
7928E7454j1253k3989k790J5034m079j5014j5382k206L604P553J3836O413J4650
7915D3831J6674r4j5967k2056L85L321m928r031O661K1611J2615K56p399J9333
7901F5212O545m961K709M783J6918K2551k511L746l489j3907j9597r941L622j3027
7887E8653r777l004m589K956J648j1725p971J5370J9725j684j1484M870O567j46
7873E9409q626j1568j4480N905J3760L435L096N034k735m442r800m713l230p85
$$ plain form
7968 51463 62740 67987 59772 43846 39444 39617 27352 22991 39299 41123 33230 37845 39841 30176
7954 30176 20503 40768 44509 48270 61692 73255 87025 99521 80572 77497 87167 90129 79548
7941 79548 58470 21930 16905 29930 38573 44622 33841 41052 36198 12912 25317 49089 57454
7928 57454 46201 22212 19422 34456 30377 15363 -19 -2225 1379 8932 22768 29181 43831
7915 43831 60505 60411 44444 22388 22773 26094 21166 12135 18796 40407 53022 53278 45879 65212
7901 65212 71757 66796 69505 74288 91206 113757 111246 114992 111503 97596 77999 68058 71680 58653
7887 58653 48876 45872 41283 44239 45887 34162 26191 41561 61286 59602 48118 52988 59555 59409
7873 59409 50783 39215 24735 30640 44400 47835 50931 55965 53230 48788 38988 34275 31045 30260
7859C0260J0788J1377J2890L235J5786L8974M4357J4966K6584L2376o430k6076
7847B09087l4743k7130k4408j0119j3724k1337n80J5662J4655k967k6147j9009
7835E9240J767J3352j1767j5968k241j568P611J7333m14q697j3278j2898M915
7822C7387P570J8669J8156O375N161L793q576j5857l1355j4429K657J6886K4392
7809G0829N130p732J2725J4953R298J4961J03J003q792q930k0181j0293r050l4141
7795B9883j7492M140O054q66J5681O320l171o366p07r168J3814Q652K026k1104
7781B7696n127n545k315P52j6054O418J4849N027J914q428m24J0361o755j269
7767B1100M587l355O66r079j7750l235o956n571J050J5708J1090j6393R306k910
$$ plain form
7859 30260 41048 52425 65315 68550 84336 123310 167667 182633 209217 241593 235163 209087
7847 209087 174344 147214 122806 112687 98963 77626 77046 92708 107363 104396 78249 59240
7835 59240 61007 74359 62592 46624 44383 42815 50426 67759 67345 58648 45370 32472 37387
7822 37387 44957 63626 81782 88157 93318 97111 88535 72678 41323 26894 29551 46437 70829
7809 70829 75959 68227 80952 95905 105203 120164 120267 121270 112478 103548 83367 73074 64024 29883
7795 29883 12391 16531 22585 21719 37400 43720 40549 34183 33476 24308 38122 46774 48800 27696
7781 27696 22569 17024 14709 15461 -593 5825 20674 25701 27615 19187 18763 29124 22369 21100
7767 21100 25687 22332 22998 13919 -3831 -7066 -14022 -19593 -18543 -2835 8255 -8138 1168 -1742
7753a742n854M846p72J3556J5371r092j4775O26j0523K169J514J010j158J0783
7739E959J2929q708j1142K5864o663j0338J800J3883L980p643p768M106N987R135
7725C1381J4113K652j2771j1696q21O041N712j0415j9524l802m554Q445P167O06
7711A2534K399j753j13m374r670J2323K438r945r387P096K1524n098p884r88m203
7696D899P966K312n22n181L601j717q737r106m684P798L751l679j3993j1801M984
7681b4109M634J2123J3844J7471o256m473O588j968P40P84P463O23o025j2701
7667H738n978J0700L043n451q616r817l235M858j748j0410M08Q203k592J8124
7653F227J5746m043O5j1740r48J2401j12n161K622R579l978j0966k9452m193J9740
$$ plain form
7753 -1742 -7596 -2750 -3522 10034 25405 16313 1538 2164 -8359 -6190 -4676 -3666 -4824 5959
7739 5959 18888 10180 -962 24902 18239 7901 9701 23584 27564 19921 12153 16259 22246 31381
7725 31381 45494 48146 35375 23679 22858 28899 34611 24196 4672 870 -3684 4761 11928 12534
7711 12534 14933 13180 13067 8693 -977 11346 13784 3839 -5548 1548 23072 17974 10090 9102 4899
7696 4899 12865 15177 14655 9474 13075 11358 2621 -6485 -11169 -3371 380 -3299 -17292 -29093 -24109
7681 -24109 -19475 -7352 6492 23963 17707 13234 19822 17854 18594 19378 26841 27464 21439 8738
7667 8738 2760 13460 16503 11052 2436 -7381 -10616 -5758 -7506 -17916 -17508 -9305 -11897 6227
7653 6227 21973 17930 17995 6255 5307 17708 17596 12435 15057 24636 20658 9692 -19760 -23953 -4213
7638d213L448N521Q926Q828p114L41j2447Q516M308k099j0480k0919R13J0599
7624e872J7243j3086J4595j358k2535N096J8829q77q391J1245L140m367o83j289
7610A1690j2847O220J9275L259L964j0948j5813o478r868p91J6718K6229l23k1325
7596H962j8248M732k01J2940J4360Q820J5799j6419j8573n279p751j735N006J774
7582D187Q172Q068r063O769J2903n775j2449j0135l756N958J1901J7007R594r65
7568D2416o419j3319L328q27j1498o17q847j0264M664J0384K2296O499J2221l534
7554D6483j7906J177r814q980K8092j898j5555j2631J816k581j5894M686K593
7541d12K598m312L431J0025J5254r18l0353j0389k485L905J3405j0213j872n465
$$ plain form
7638 -4213 -765 4756 13682 22510 15396 15737 3290 11806 16114 14015 3535 -17384 -16471 -5872
7624 -5872 11371 -1715 12880 11522 -11013 -5917 12912 12035 3644 14889 18029 13662 12979 11690
7610 11690 -1157 5063 24338 27597 31561 20613 4800 -1678 -11546 -12337 4381 30610 30287 8962
7596 8962 -9286 -4554 -4755 8185 22545 31365 47164 30745 12172 6893 -858 -2593 2413 4187
7582 4187 12359 20427 11364 18133 31036 25261 12812 2677 -1079 4879 16780 33787 43381 42416
7568 42416 35997 22678 26006 25179 13681 13064 4217 -6047 -1383 9001 31297 37796 50017 46483
7554 46483 28577 29754 19940 10960 39052 37154 21599 8968 10784 8203 -7691 -3005 -412
7541 -412 2186 -2126 1305 11330 26584 25666 -4687 -15076 -17561 -13656 -251 -10464 -12336 -17801
7527a7801J3764j491K148J0056j210K119o462o845J035K782P282k443q723J2663
7513F874J9131l666o2M214r36L145q337j728j7616j0864Q544K0979Q008K901j269
7498B9318k0687k0032N660J8037j1376k4044M948K6503M744Q720k0561j4192n461
7485a8423L308J3902J2282j2611j4576k493K913n638Q151M395o392J1768j457
7472d871N170r82j1961j825J6078K372J1412K050j6818j212j6584N62J870J1270
7458c469R480l082l560N048R588o989p55J6804K1320l605j4579p169q90n47r861
7443G734L806n867J3337J0606n64J3489j044j2527K934L044l535j8839M173P995
7429B4742J1814k156j5715J510L1173O589k0070n861l039r393m251o346O782p009
$$ plain form
7527 -17801 -4037 -5528 -3380 6676 5466 7585 1123 -5722 -4687 -1905 5377 2934 -5789 6874
7513 6874 26005 22339 22277 26491 25555 28700 20363 18635 1019 -9845 -1301 19678 27686 30587 29318
7498 29318 8631 -11401 -5741 12296 920 -23124 -18176 8327 13071 21791 1230 -12962 -18423
7485 -18423 -15115 -1213 11069 -1542 -16118 -18611 -15698 -21336 -13185 -8790 -15182 -3414 -4871
7472 -4871 299 -683 -12644 -14469 1609 3981 15393 17443 625 -587 -17171 -16609 -14739 -3469
7458 -3469 6011 2929 -631 4417 14005 7016 6261 23065 44385 40780 26201 19032 18142 17595 7734
7443 7734 11540 5673 19010 29616 29052 42541 41497 28970 31904 34948 31413 12574 16747 24742
7429 24742 36556 34400 18685 20195 51368 57957 37887 32026 28987 19594 15343 8997 15779 8770
7415H770o923j2013j3975J6723J1446l31j4963j6112L107J4847p609j944j220
7402b0197N610L4994K344l894l299k7381L651J4527P646R3j2030o288P774L366
7388F916J0101l008j8746j6975o256P650J4960J5353R446n280j6507P793J6084
7375B1531J2779m771j3961n430K494J108J825O763j899K696j1424j7007R36J7670
7361A3310Q429k9661k0418q296P556K1696l619p408J3891K791j4175K985L374
7348i545m734P758K5638J5940j9182j9537J3597M207p5J2128K563K461j1055j7783
7334B381j7822N658K0289J915L354k197k209m887O602n890L351p391O58R952r032
7319D732L654O603J0103O538j1483r848p680j7386j2565M637J290k072J1683r564
$$ plain form
7415 8770 1847 -10166 -24141 -7418 4028 3697 -11266 -27378 -24271 -9424 -17033 -18977 -20197
7402 -20197 -14587 20407 22751 18857 15558 -11823 -8172 6355 14001 14094 2064 -4224 3550 6916
7388 6916 17017 14009 -4737 -21712 -27968 -20318 -5358 9995 19441 14161 -2346 5447 21531
7375 21531 34310 29539 15578 10148 12642 13750 15575 22338 20439 23135 11711 -5296 -4360 13310
7361 13310 21739 -7922 -28340 -36636 -29080 -7384 -11003 -18411 -4520 -1729 -15904 -12919 -9545
7348 -9545 -14279 -6521 19117 35057 15875 -3662 9935 14142 14067 26195 28758 31219 20164 2381
7334 2381 -15441 -9783 10506 12421 15775 13578 11369 6482 13084 7194 10545 3154 3812 13764 4732
7319 4732 8386 14989 25092 31630 20147 10299 2619 -14767 -27332 -22695 -21405 -23477 -11794 -21358
7305b1358M580Q544r433p707J3097R905j5508N916M197j3685J5682J9431Q30O177
7291B0668j480k0929j6544o65J4749J1936J8797L916j4737j1369o682j1861r681
7278b3882j4283L3674J3244P605L476r857q018J1540j444r159j3751J0235K2757
7265B2137o280j2342j3769J103J168j3447K4240Q865j38o056q442J3547N952l41
7251A6197l939k5719p089N399K699J3998q399r015L013J8205J8563J3398o452
7238C0859o194p543j9553j0321j6102K4794K2528J358J2900j5732k3541l620R869
7225b98J362j124j0282R843k988J957M095l523R236Q04J0054Q384j7217j5326
7211e023j6790J7381K1382m637k5909j0474q08K4861J2784k219J1120L674j6027
$$ plain form
7305 -21358 -16778 -8234 -17667 -25374 -12277 -2372 -17880 -11964 -7767 -21452 -5770 13661 14491 20668
7291 20668 19188 -1741 -18285 -18950 -4201 7735 26532 30448 15711 4342 -2340 -14201 -23882
7278 -23882 -38165 -4491 8753 16358 19834 9977 1959 13499 12055 2896 -10855 -620 22137
7265 22137 15857 3515 -10254 -9151 -7983 -21430 2810 11675 11537 5481 -2961 10586 16538 16197
7251 16197 12258 -13461 -20550 -15151 -12452 1546 -6853 -15868 -12855 5350 23913 37311 30859
7238 30859 24665 17122 -2431 -12752 -28854 -4060 18468 19826 32726 16994 -6547 -10167 -298
7225 -298 1064 -60 -10342 -499 -3487 -1530 2565 -958 8278 9082 19136 27520 10303 -5023
7211 -5023 -21813 -4432 16950 12313 -13596 -24070 -24878 -17 12767 10548 21668 25342 9315
7198I315j5488p613M613J0478J9728l875p231o574L348l770j6212J4522J0203
7185A1444J620j0206L509j0982r663J8077n17m997p293O750J9081n838k043K0411
7171B9353k275j3725j6632jR436J042m724O521m185j2794j312M97j1621L0631
7157A0211J6438M929j1570j2220k314j6049k405O589J9215Q512n309M21k919j3564
7143c5k35p713P656m299m325p668j2534K179N338O582J8056N324K2006J9701O112
7128E6145j234j4959o107l141m836o371n434o239q926j0919o84Q889k274r636
7114a5726j6246q876q786K2915K2235R216R838j443J3154J1792k1006k2358k442
7101g733K673j5337K037J0024Q09M192K281J6625q013j5238K141j0420m515J0983
$$ plain form
7198 9315 -6173 -13786 -9173 1305 21033 17158 9927 3353 6701 2931 -13281 1241 11444
7185 11444 13064 2858 6367 -4615 -14278 3799 3282 -1715 -9008 -2258 16823 10985 8942 29353
7171 29353 27078 13353 -3279 -3280 6156 7198 2474 8995 4810 -7984 -9296 -8799 -20420 10211
7157 10211 26649 31578 20008 7788 5474 -10575 -12980 -6391 12824 21336 16027 16448 13529 -35
7143 -35 -270 -7983 -327 -4626 -8951 -16619 -29153 -26974 -21636 -15054 3002 8326 30332 50033 56145
7128 56145 54911 39952 33845 30704 25868 19497 14063 7824 -1102 -12021 -12705 -3816 -6090 -15726
7114 -15726 -31972 -40848 -49634 -26719 -4484 4732 14570 13127 26281 38073 17067 -5291 -7733
7101 -7733 -5060 -20397 -18360 -8336 -7527 -3335 -1054 15571 7558 -7680 -5539 -15959 -20474 -9491
7087i491j134j1649J2659Q086Q915r809j743J0983K2734J0623j1151l1940j3585
7074a6502L489R443P182k437J3830K545j0578j424j6369j4879M669O821l220n844
7060b3274J5764K0891k020p704J2893P133L838K824j3400j9269p967o485L485
7047a3291O761J6157J038r223l307J6285r975k4873J0189P108n61K491P704J2201
7033A8704j4549j0815M023Q386j4052J0430J4544j420j0736M25l506l330N104
7020C208k330j3358q212Q853J3177J0824R411j9480n772N677q997Q508R630Q231
7006A9370J0742j5180r251K873N438j3205m313J1565L178j0255j1619j4364P976
6993a7045J1190L415p409k0433K330N194j0148J8236R500J5338K6187N209j825
$$ plain form
7087 -9491 -10625 -22274 -9615 -1529 7386 -2423 -4166 6817 29551 40174 29023 -2917 -16502
7074 -16502 -13013 -3570 3612 1175 15005 17550 6972 5548 -10821 -25700 -21031 -14210 -17430 -23274
7060 -23274 -7510 13381 11361 3657 16550 23683 27521 30345 16945 -2324 -10291 -16776 -13291
7047 -13291 -6530 9627 10665 1442 -1865 14420 4445 -20428 -10239 -3131 -3692 -1201 6503 18704
7033 18704 4155 -6660 -2637 5749 -8303 2127 16671 15251 4515 4940 1434 -1896 3208
7020 3208 878 -12480 -20692 -11839 1338 12162 21573 2093 -3679 1998 -6999 1509 11139 19370
7006 19370 30112 14932 5681 8554 13992 787 -3526 8039 11217 962 -10657 -25021 -17045
6993 -17045 -5855 -2440 -9849 -30282 -27952 -22758 -32906 -14670 -5170 10168 36355 41564 39739
6980C9739K072K453j3731j0911j0011J2984m742j7452m390M98j763M167R949R799
6966A8661k0625j1339J1323N882j4175J1640J353M2m070k336J2743J2133o046
6953A5186p532l384R582k775q247O603L638M34k4184k688K3828O98l0669l388
6939b2898R123J0340k057N779m462k4847J0841L215M209q241p382P912R982L201
6925e285K662j2488M707O848M226l735l093O049J4455J18J876L366n610k095j1557
6910D44L560p682j15j2283m114p146n252P68Q931K3085j4j4455q731j2492K025
6895c3471O709J1712J4021L845j9631k59J4109L989J5779J4093p257j6086P280
6882A4833j1746l700o070J025L183l160R029Q716p540j2748m675l689J240J5546
$$ plain form
6980 39739 41811 44264 30533 19622 9611 22595 17853 401 -3989 -3491 -5254 -1087 8862 18661
6966 18661 -1964 -13303 -1980 3902 -10273 1367 2720 2762 -1308 -3644 9099 21232 15186
6953 15186 7654 4270 13852 11077 2830 9433 13071 13505 -10679 -13367 10461 11159 -19510 -22898
6939 -22898 -13775 -3435 -5492 287 -4175 -29022 -18181 -14966 -10757 -18998 -26380 -18468 -8486 -5285
6925 -5285 -2623 -15111 -10404 -3556 670 -3065 -6158 -109 14346 14464 16340 19706 14096 12001 444
6910 444 4004 -3678 -3793 -16076 -20190 -27336 -32588 -31820 -22889 196 182 -14273 -23004 -35496 -33471
6895 -33471 -26762 -15050 -1029 2816 -16815 -17074 -2965 1024 16803 30896 23639 7553 14833
6882 14833 3087 -613 -6683 -5658 -2475 -5635 3394 12110 4570 -8178 -12853 -16542 -15302 244
6868B44J7097J03j3252k981m281L767J921l819n962Q101P619J930j0535J17n345
6853e276k535Q25R170o085O433q97O536j6750J84r685m34J3312M633P863r676
6838b382k379l300p046N674l277j672J2387J4044m926j0661o683K412K0309Q539
6824B1039n597k142l385j4720j459J4844O318P671j211j3690K919J3609k6305
6811b109j8231l957J4066L1046j2348N789J7133Q242q79j1264j8639p362p12M749
6797E524n034l896R487j336P828K1724o2o456J1184j3660k6272j1916n547q510
6783b6942R321N906m944L437p673j7011L179j380m413Q931J7987J6194J1701j616
6769A2677O207J2108l494k0802k7959J1639j937j647K6494J0593M313l315j3704
$$ plain form
6868 244 17341 17444 4192 1211 -3070 697 2618 -1201 -7163 938 8557 10487 -48 69 -5276
6853 -5276 -7811 -6986 2184 -3901 2532 1635 8171 -8579 -8395 -18080 -18514 -5202 -569 7294 -2382
6838 -2382 -4761 -8061 -15107 -9433 -12710 -14382 -1995 12049 7123 -3538 -10221 -7809 12500 21039
6824 21039 15442 13300 9915 -4805 -6264 8580 14898 22569 21358 7668 10587 24196 -2109
6811 -2109 -20340 -24297 -10231 20815 8467 14256 31389 39631 38752 27488 8849 1487 775 5524
6797 5524 490 -3406 6081 4745 12573 34297 34235 27779 38963 25303 -969 -12885 -18432 -26942
6783 -26942 -17621 -11715 -16659 -13222 -20895 -37906 -34727 -36107 -40520 -31589 -13602 2592 14293 12677
6769 12677 18884 30992 27498 6696 -21263 -9624 -11561 -13208 13286 23879 28192 24877 11173
6756A1173p239J684J0261J1353o487j5371R446O836m708J477M413r063j3182j6971
6742a6378j1279J0061n477J6183J3104J0006o597n809j9865r609J346L630K405
6729a8279Q223P67J4334K603Q229n762k1044r89Q274P738Q93j4478o760J1092
6715e159q616k626Q242O444k0881J463J6592q66j8168R088N807J267Q364k3294
6701b2343L032J31L493N244J3313l683K513J0661O523O088m374n059Q62K5606
6687D2007j3604r490j0236j3362M671K884m407j1750n393R494O996K1956m971
6674A4795j6281k010L789j897Q487m188J2108J003j6409j2433L092J1106k666
6661a504O343K999k2799j4395j2925M432J7230k272K2294R318j1314n011l378
$$ plain form
6756 11173 3934 5618 15879 27232 20745 5374 14820 21656 16948 18425 22838 13775 593 -16378
6742 -16378 -27657 -17596 -23073 -6890 6214 16220 9623 3814 -16051 -25660 -24314 -20684 -18279
6729 -18279 -10056 -9289 5045 7648 15877 10115 -10929 -11918 -3644 4094 4987 -9491 -16251 -5159
6715 -5159 -13775 -16401 -8159 -1715 -22596 -21133 -4541 -5407 -23575 -14487 -8680 -7413 951 -22343
6701 -22343 -19311 -19180 -15687 -10443 2870 -813 1700 12361 18884 24972 20598 15539 16401 42007
6687 42007 28403 18913 8677 -4685 -14 2870 -1537 -13287 -18680 -9186 -2190 19766 14795
6674 14795 -1486 -3496 293 -1604 6883 2695 14803 15806 -603 -13036 -9944 1162 -1504
6661 -1504 4839 7838 -14961 -29356 -42281 -37849 -20619 -22891 -597 8721 -2593 -7604 -10982
6648a0982k264J5601n305j205J179L499N320P808J8758p69k3244O697J5687j3826
6634A6954j3959O139M644k5343m596J5657L551o070n870M185r13j644M425J3413
6620A0573O794o780J1907M084k7945k944J8141J2126l722L849l192j7081k0343
6607a4533k834N261Q79O984K0943j1950p457P829K1289j365m433j2329K126j896
6593H514l31l993k488j1951l168j023k1427L717J8224N244K023J4785j3416J0762
6579E472M918l158k229k692j570N592j9488j7094M583k092K0570o13j1738J4007
6565e532J5338j6543J0452m04r663K28J5301M908m397k378K771L242J963N067
6551B0353j516k4452j2016J4511J5652J5660O22q451L693n835r982J4157M630
$$ plain form
6648 -10982 -13246 2355 -2950 -4155 -2976 523 5843 13651 32409 31640 8396 15093 30780 16954
6634 16954 2995 9134 13778 -11565 -16161 -504 3047 -3023 -8893 -4708 -5621 -7265 -2840 10573
6620 10573 17367 10587 22494 26578 -1367 -4311 13830 25956 22234 26083 22891 5810 -14533
6607 -14533 -17367 -12106 -11227 -4243 16700 4750 -2707 5122 26411 25046 20613 8284 10410 8514
6593 8514 8183 4190 1702 -10249 -13417 -14440 -35867 -32150 -13926 -8682 -6659 8126 -5290 5472
6579 5472 10390 7232 5003 2311 741 6333 -13155 -30249 -25666 -27758 -7188 -7801 -19539 -5532
6565 -5532 9806 -6737 3715 3311 -6352 -6124 9177 14085 9688 7310 10081 13323 15286 20353
6551 20353 18837 -5615 -17631 -3120 12532 28192 28814 20363 24056 18221 8239 22396 27026
6538B7026q128L558o336j2003j9990P659n896J0013j1138l18L774j4644M672J9865
6524a886l180M581K00r616N715K4898Q986j0227j0740N854j5510n271p324q649
6510b2169N922n249j700j795K172K5173j1270P95M679L751J7384O137o486L247
6496B0591j2119q073j785J460j0614l367O075J2078n297j5684j5335j281j6536
6483d9887J0712J7804J1046J1976J4437N484q155j1210j1101j6100K6401J0274
6471A1681j2204k469J12K752k1422n356j861p57R156R644p11k060P522N635j0449
6456a0787j5941J147J4341o217J3262M977k481L941j2436j7093R917J4718N958
6443C306J5234k1537j1327M015J0649R954L13k0544l122J3064P330o903r248m137
$$ plain form
6538 27026 18898 22456 16120 4117 -15873 -8214 -14110 -4097 -15235 -15553 -11779 -26423 -21751 -1886
6524 -1886 -5066 -485 -285 -9901 -4186 20712 29698 19471 8731 14585 -925 -6196 -13520 -22169
6510 -22169 -16247 -21496 -23196 -24991 -22819 2354 -8916 -8121 -3442 309 17693 23830 17344 20591
6496 20591 8472 399 -1386 74 -10540 -13907 -7832 4246 -1051 -16735 -32070 -33351 -49887
6483 -49887 -39175 -21371 -10325 1651 16088 21572 13417 2207 -8894 -24994 1407 11681
6471 11681 -523 -2992 -2880 -128 -21550 -26906 -28767 -29524 -20368 -10724 -11435 -13495 -5973 -338 -10787
6456 -10787 -26728 -25581 -11240 -17457 -4195 782 -1699 2242 -10194 -27287 -17370 -2652 3306
6443 3306 18540 -2997 -14324 -10309 340 10294 10607 -9937 -13059 5 7335 432 -8816 -12953
6429a2953J0233O756r769R935n515m648J1710K293j7089j3498L210Q977K839M156
6415c363p56l371N190L439n517k275N056j1653n927K7612J5257j4840n420q015
6401d583J54Q419m825p027P715k900K200L48J5710L273P385J954J1913J0117l2985
6386A6868k9962r569R612m206J1571K6508J4827N324M65J228p096j7749q131R117
6372A8807J0837j76o128O218m515k0923j8868K401r810J382J0543J0083J2971
6359A2822L722l2184m661K7828L146j126O763k8757j5063l661R251J2836J1706
6346B622J4101P395k2253j7109J3567K0986j6718k936K1767O311R035j9447l1908
6333a4587l061P528l619k251J3666R473k375J007J2599l88j4703j4876o524P023
$$ plain form
6429 -12953 -2720 4036 -5733 4202 -1313 -5961 5749 8042 -9047 -22545 -19335 -10358 -7519 -3363
6415 -3363 -4119 -7490 -2300 1139 -4378 -6653 -1597 -13250 -19177 8435 23692 8852 3432 -4583
6401 -4583 -4429 3990 -835 -7862 -147 -3047 -847 -499 15211 18484 25869 27823 39736 49853 16868
6386 16868 -13094 -22663 -13051 -17257 -5686 20822 35649 40973 41438 42666 35570 17821 9690 18807
6372 18807 29644 29468 23340 29558 25043 4120 -14748 -12347 -22157 -20775 -10232 -149 12822
6359 12822 16544 -15640 -20301 7527 10673 9547 16310 -12447 -27510 -31171 -21920 -9084 2622
6346 2622 16723 24118 1865 -15244 -1677 19309 2591 -345 21422 27733 36768 17321 -14587
6333 -14587 -17648 -10120 -13739 -15990 -2324 7149 4774 5781 18380 17992 3289 -11587 -18111 -11088
6319a1088J6802J1086J0222J2190J6675j3631O42m413p072o887j6310j6570j785
6306a0139m020L587q464K499J1917O369l350N121J8579J7062O259j4417j6666
6293A4337o53J675k4105j2884l212J863N576M368L79j7570r089J4569J4593M089
6279f064M341J2202K100l804N745l260q811j2472j3087K435K3374r012R87L058
6265b268j4066K072o45P653J3483J8048o712n11j1544m237O039J3649J9886M281
6251D5128l282j4067p429k844m154j1853j3612j3132J5421K3003L114r532q592
6238a831o528o012j3476J0611J101n140M120j30K364J048q259k0235J685N552
6224c5130j3452K091J0951j7165n616J1972K25K5739K6638J4689J3725O14k1385
$$ plain form
6319 -11088 5714 16800 27022 39212 55887 42256 42898 38485 31413 24526 8216 -8354 -10139
6306 -10139 -14159 -10572 -19036 -16537 -4620 1749 -1601 3520 22099 39161 45420 31003 14337
6293 14337 13684 15359 -8746 -21630 -24842 -22979 -17403 -13035 -12656 -30226 -39315 -24746 -10153 -6064
6279 -6064 -1723 10479 12579 8775 14520 11260 2449 -10023 -23110 -20675 2699 -6313 -5326 -2268
6265 -2268 -16334 -14262 -14907 -7254 6229 24277 17565 17054 5510 1273 7312 20961 40847 45128
6251 45128 41846 27779 20350 17506 13352 1499 -12113 -25245 -9824 13179 16293 6761 -1831
6238 -1831 -8359 -14371 -27847 -17236 -16135 -21275 -17155 -17285 -14921 -13873 -22132 -42367 -40682 -35130
6224 -35130 -48582 -46491 -35540 -52705 -58321 -46349 -46124 -20385 6253 20942 34667 35281 13896
6211A3896j9725K558J026k800P619p021N188P580L29j0093L096m813l518K974
6197c704J7584O469k867j1042k7640p70J2959j592j2226J436O620K682p71l395
6183a6257O109l089N98p452n831k033o22Q26J970J3495P876J6854K321j5479j1625
6168a2339j6536N854O377J7570p465l0167n570K7781J7199n845L876j3406n990
6155a8661j613J754O782J745j6899j3726p536Q210K1641K3858P460k3422p609
6142a8016j6431K2002J943J0662L757p486N180M783L291K704j6024j4251M474
6129a3412R677o161j822N635J6090P114l468j1703K368n521L012r10j0825J4751
6115D825J4688j2122n468n97J5642o843j678L482j6102M135J100N9J701N016k541
$$ plain form
6211 13896 -5829 -3271 -2245 -5045 2574 -4447 741 8321 8650 -1443 1653 -3160 -6678 -3704
6197 -3704 13880 20349 17482 6440 -21200 -21970 -9011 -10603 -22829 -21393 -14773 -12091 -12862 -16257
6183 -16257 -10148 -13237 -12639 -20091 -25922 -27955 -28577 -27751 -25781 -12286 -4410 12444 14765 -714 -12339
6168 -12339 -28875 -23021 -16644 926 -6539 -36706 -42276 -14495 2704 -3141 735 -12671 -18661
6155 -18661 -20274 -18520 -11738 -9993 -26892 -40618 -48154 -39944 -18303 5555 13015 -10407 -18016
6142 -18016 -34447 -12445 -10502 160 3917 -3569 1611 6394 9685 12389 -3635 -17886 -13412
6129 -13412 -3735 -9896 -11718 -6083 10007 17121 13653 1950 4318 -1203 1809 899 -9926 4825
6115 4825 19513 7391 1923 1326 16968 10125 8447 11929 -4173 -38 1062 1121 2822 7838 5297
6100E297l081N423R661k572n721l208K3155m315R368J025k8528k1715k801P19
6086a7293p833O212r392k63K3913L0193J4785o370n976j0496o531Q923r217j5961
6072e306o185k924J0350J744k4045j8914R607K3695O155K608J1724J6515N678
6059C0702K137j4336o794M577m885j4168Q067K092j4371o063j020J5181R128o334
6045C913J252j656j0636q942j4787P979J8992J1268j0643j9468K581J9547J9567
6032A8967J7089j6408m973j0097Q335J2759J0667n806j634J266j4740p842J286
6019H869M801p580k0070J5110k282l174M362M983J0581N92n75K670o013N669N726
6004B3669j2281j9244Q834p690j3042Q591J4579m870j0039L049m981J9399K0673
$$ plain form
6100 5297 2216 7639 17300 14728 9007 5799 28954 24639 34007 35032 6504 -15211 -18012 -17293
6086 -17293 -25126 -18914 -28306 -28569 -4656 25537 40322 33952 27976 17480 10949 19872 10655 -5306
6072 -5306 -11491 -14415 -4065 -2321 -26366 -45280 -35673 -11978 -5823 -3215 8509 25024 30702
6059 30702 32839 18503 11709 16286 11401 -2767 5300 7392 -6979 -13042 -14062 1119 10247 3913
6045 3913 5165 3509 -7127 -16069 -30856 -22877 -3885 7383 -3260 -22728 -20147 -600 18967
6032 18967 36056 19648 14675 4578 12913 25672 36339 30533 28899 30165 15425 7583 8869
6019 8869 13670 6090 -13980 1130 -1152 -4326 36 5019 15600 16192 15617 18287 12274 17943 23669
6004 23669 11388 -7856 978 -6712 -19754 -11163 3416 -1454 -11493 -8444 -13425 5974 26647
5991B6647k6444p852j1645j5244K0234J4443R20o978p20j1781M569J6648J3897
5978A6694m676n106R888O679j0927k0402p485J3040J4806J0020j7620m977N250
5965E184j0997Q66J0683J0093R991r665R323j3050n54k218j5712m665m519O471
5951h769j527R800J9936M751j1313j4321N087j0461j1024Q464m928o716K946J4785
5937c290K732N366l033j947Q517K95m485O576n918o571M72k487j918k326K762
5922e255R169p388l695K988j2843O704k581j840L858O23J636J4167N299j4315
5908c473m99m506K2259O074l972p660m545k0400k70p256n425J4826K6236l40o912
5893D137k778J2095R096l934l880q674j3049j6446o192n859R746O306J442J9446
$$ plain form
5991 26647 203 -7649 -19294 -34538 -14304 139 1059 -5919 -6639 -18420 -13851 2797 16694
5978 16694 12018 6912 16800 23479 12552 -7850 -15335 -2295 12511 22531 4911 -66 5184
5965 5184 -5813 -4947 5736 15829 25820 16155 25478 12428 11874 9656 -6056 -10721 -15240 -8769
5951 -8769 -10296 -496 19440 24191 12878 -1443 3644 -6817 -17841 -9377 -14305 -21021 -18075 -3290
5937 -3290 -558 4808 1775 -172 8345 8640 4155 10731 4813 -1758 -1286 -3773 -5691 -8017 -5255
5922 -5255 3914 -3474 -7169 -4181 -17024 -10320 -12901 -14741 -10883 -10260 -8624 5543 10842 -3473
5908 -3473 -3972 -8478 13781 19855 15883 8223 3678 -16722 -16992 -24248 -29673 -14847 11389 11049 4137
5893 4137 1359 13454 22550 18616 14736 6062 -6987 -23433 -29625 -35484 -25738 -19432 -17990 1456
5879A456J3104J2551P385r265l026K404k693L35J450J7844n961j5581k1880r61
5865b838J251N87j0041J0897J5773j0313j204l05j7835N273J5679j9247j2537
5852b4860P661K2883Q040k590j2281j7374k899P015M488q640N002L264Q568J75
5838a548J1871L388r504q17M833j048o965j3752k448L394l78P617J1253L113K76
5823I285n734o119r3o161j8117Q680L2621K898j769O285M864k180q787j4935k701
5808a963q889k676j4105n693K1058K238j0058l347L381J4116J246q219J3933O717
5794G739n312L936J0551j459k440j738J0681M559M70j5540L810P384j4212k3042
5780a4613k180K647j883J887L24n731R094J4106K906j3468J666Q248p437n782
$$ plain form
5879 1456 14560 27111 34496 25231 22205 24609 21916 22251 23701 41545 35584 20003 -1877 -2838
5865 -2838 -1587 -1000 -11041 -144 15629 5316 4112 3807 -14028 -8755 6924 -12323 -24860
5852 -24860 -17199 5684 13724 11134 -1147 -18521 -21420 -14405 -9917 -18557 -13555 -10291 -1723 -1548
5838 -1548 10323 13711 4207 3390 8223 7175 210 -13542 -15990 -12596 -12974 -5357 5896 9009 9285
5823 9285 3551 -2568 -2661 -8822 -26939 -18259 14362 17260 15491 21776 26640 24460 15673 738 -1963
5808 -1963 -10852 -13528 -27633 -33326 -12268 -10030 -20088 -23435 -20054 -5938 -4692 -12911 1022 7739
5794 7739 2427 6363 16914 15455 13015 11277 21958 26517 26987 11447 15257 22641 8429 -14613
5780 -14613 -16793 -14146 -16029 -14142 -13818 -19549 -10455 3651 6557 -6911 -5245 3003 -4434 -10216
5766a0216J355j549k1185J0930L1377o893m359P28J85Q217j2790l264N3k882J120
5751i173J0486N479O101k390m816l877l270j1630j1195n283j140K2992J2562k073
5737B773m335J475j8101m378o868j7206J2895M84J581R249Q054O196j3311M965
5723a6527K695J7115O855j2259j9787j7234J1581J9426P646l832K1893O997O114
5710C0683J3006k6280k5833p133r110J5045j1284R559K96k256r684j1109R554
5697b4546J1687J8149P169P127j3311j0539q422k792K0424j1096j060J0169P269
5684A0228r1m920k935p304J0032p804l2770o04K9615J1747j7455P048J5542j926
5670H403k0176n712J765J072P691O528j608p77j4387N916J6244R546M281J3496
$$ plain form
5766 -10216 -8861 -10410 -31595 -20665 10712 3819 -540 188 373 8590 -4200 -7464 -7411 -10293 -9173
5751 -9173 1313 6792 12893 10503 5687 1810 -1460 -13090 -24285 -29568 -30708 -7716 4846 2773
5737 2773 -1562 -87 -18188 -22566 -29434 -46640 -33745 -33261 -31680 -22431 -14377 -8181 -21492 -16527
5723 -16527 -13832 3283 10138 -2121 -21908 -39142 -27561 -8135 -489 -4321 17572 24569 30683
5710 30683 43689 17409 -8424 -15557 -24667 -9622 -20906 -11347 -11051 -13307 -22991 -34100 -24546
5697 -24546 -12859 5290 12459 19586 6275 -4264 -12686 -15478 4946 -6150 -7210 2959 10228
5684 10228 10137 5217 2282 -5022 5010 -2794 -35564 -36168 -6553 5194 -12261 -5213 10329 8403
5670 8403 -11773 -17485 -15720 -14648 -6957 -429 -2037 -2814 -17201 -11285 4959 14505 18786 32282
5656C2282M015j7581j0673q996R10K122n022R431N685n600J0711k6416k5134J8210
5642a6056J5197J8229r189j5779r151J0567p028j3582q031p780o341O998q540
5629e0486j944K9796J0298K65q002J1007J1409o760r152j077j046j937M730K417
5615a0482n327M356j1689N616P614j952M610P352m844r080p367L350K898J540
5601a3405J8780j2212p626p953N498R13m057J9424m917j1433j0640J1685N348
5588a0595K092L359q825p935k299P878P268j2750J218q643J0440O932L551j3815
5574b2124j4684J6971L369m220n88K560K2053P954l399j9697j0011q02J0503P0
5560a2045q351n782J5542P042k062j280j1288k10J7918N482J6278j1018r296q224
$$ plain form
5656 32282 36297 18716 8043 -953 -43 2079 -2943 6488 12173 6573 17284 -9132 -34266 -16056
5642 -16056 -859 17370 8181 -7598 -16749 -6182 -13210 -26792 -34823 -42603 -48944 -41946 -50486
5629 -50486 -52430 -22634 -12336 -12071 -20073 -9066 2343 -4417 -13569 -14646 -15692 -17629 -12899 -10482
5615 -10482 -15809 -11453 -23142 -17526 -9912 -11864 -7254 98 -4746 -13826 -21193 -17843 -14945 -13405
5601 -13405 5375 -6837 -14463 -22416 -16918 -16005 -20062 -638 -5555 -16988 -27628 -15943 -10595
5588 -10595 -8503 -5144 -13969 -21904 -24203 -16325 -9057 -21807 -20589 -29232 -18792 -11860 -8309 -22124
5574 -22124 -36808 -19837 -16468 -20688 -21276 -18716 3337 11291 7892 -11805 -21816 -22618 -12115 -12045
5560 -12045 -20396 -26178 -10636 -3594 -5656 -6936 -18224 -18434 -516 4966 21244 10226 930 -7294
5546g294Q73J8549o884j0003R298M74o62j040k0328M861P890l215l320N843l910
5531h868j7692j1596J5678J7722J6718J268j2410r665m71k223k150K0854O22k1902
5517a4115Q548m204j920O850K944k364j061Q208j449j0233N166p942J4342n634
5503b864j1562M013K827O884n050P30J1954J5698l036r320j921j0403n618J0680
5489C012p127r031L384J8517m171m362n8l946j731K808n3r651o963L747J5516
5474a09O674q00r380k0167M750K4457M326P938k432M883Q34J228j2702p904o97
5459H99k1366L65m765j069l755k661J9920M585m849J755L560O097n681K544J0605
5444F184P112n144L618j6136j4299R444P554j3174j2962R530J4003J9819L806
$$ plain form
5546 -7294 -6421 12128 5244 -4759 4539 5013 4351 3311 -17017 -12156 -4266 -7481 -10801 -4958 -8868
5531 -8868 -26560 -38156 -22478 -4756 11962 13230 820 -8845 -9316 -11539 -13689 7165 7787 -14115
5517 -14115 -5567 -9771 -11691 -4841 -1897 -4261 -5322 2886 1437 -8796 -3630 -11572 2770 -2864
5503 -2864 -14426 -10413 -7586 -702 -5752 -5022 6932 22630 19594 10274 8353 -2050 -7668 3012
5489 3012 -4115 -13146 -9762 8755 4584 222 164 -3782 -5513 -2705 -2758 -12409 -19372 -15625 -109
5474 -109 6565 5765 -3615 -23782 -19032 5425 9751 17689 15257 20140 20974 22202 9500 1596 899
5459 899 -20467 -20102 -24867 -25936 -29691 -32352 -12432 -7847 -12696 -10941 -7381 -1284 -6965 -4421 6184
5444 6184 13296 8152 11770 -4366 -18665 -9221 -1667 -14841 -27803 -18273 -4270 15549 19355
5431A9355k5630o834J1282n277o995j0719m7K9524M408j5329K093n902J079K2000
5417A3008j682j4971m286N272L91r975J834J192O245K985J1434n454j5105o896
5403a6008p125J1223R835K740R647r022m252P331Q20o775o290Q297J9061n417
5389A4065J542J0342n939j6140k929K4400k284j3403k1582j6229Q445j794J1996
5376i510J2658J840Q13P092k121r78k2819j749J0710J9892k361k0313k6977K2028
5362a1795J1567j0094j6998n738o756J95Q701k1257O85J6550J2924L1695K0474
5349C0153m177k6428l389K820k029o821j1058r479O788J5957R853j0195j6544
5336b4549l61O806P131N713m310Q277k1237J0109J2605m219M4J040j614K933j3258
$$ plain form
5431 19355 -6275 -13109 -1827 -7104 -14099 -24818 -24865 4659 9067 -6262 -4169 -10071 -8992 13008
5417 13008 11326 -3645 -7931 -2659 -2268 -12243 -10409 -9217 -2972 13 11447 5993 -9112 -16008
5403 -16008 -23133 -11910 -2075 665 10312 1290 -2962 4369 5189 -1586 -7876 421 19482 14065
5389 14065 15607 25949 20010 3870 941 25341 23057 9654 -11928 -28157 -19712 -21506 -9510
5376 -9510 3148 4988 5801 12893 10772 9794 -13025 -14774 -4064 15828 13467 -6846 -33823 -11795
5362 -11795 -228 -10322 -27320 -33058 -39814 -39619 -30918 -52175 -51490 -34940 -22016 9679 30153
5349 30153 25976 -452 -3841 -1021 -3050 -9871 -20929 -30408 -23620 -7663 2190 -8005 -24549
5336 -24549 -24910 -18104 -10973 -5260 -9570 -1293 -22530 -12421 184 -4035 -3991 -2951 -4565 -1632 -14890
5321a4890p894l306J0559L094N178J2020q954j222M764j2794J279L350k517o402
5307a7735l137M490P049j178j1533m0K641o298k850N495M519k962J367R516J3657
5292C001J3411k991m330j0827P031K232j9753p622j818l501N286J7511j8865m352
5278b5587p73J2090K5142N755j1866j732J44J3296o215j3686n172n795O213j2064
5264b0250q39J1183O337q099J87J4691Q277L991k1032k634N129j1859n641q840
5250b9399j4065j6507K1502K8680K5835o935J14p722r95J9324P580j0159n032
5237A2221O037j1008r968k514m932o554l034O05J1176J4532O887j2099p206J2961
5223G104K265m960m200j6101j4823N277J8334L2725l020j4790p4P794J030L471
$$ plain form
5321 -14890 -22784 -26090 -15531 -12437 -7259 4761 -4193 -5415 -651 -13445 -12166 -8816 -11333 -17735
5307 -17735 -20872 -16382 -9333 -10511 -22044 -22084 -19443 -25741 -28591 -23096 -18577 -21539 -20172 -10656 3001
5292 3001 16412 13421 9091 -1736 5295 7527 -12226 -19848 -21666 -25167 -19881 -2370 -21235 -25587
5278 -25587 -26360 -14270 10872 16627 4761 3029 3173 16469 10254 -3432 -8604 -14399 -8186 -20250
5264 -20250 -21089 -9906 -3569 -11668 -11481 3210 11487 15478 -5554 -8188 -3059 -14918 -20559 -29399
5250 -29399 -43464 -59971 -38469 -9789 16046 9111 9225 1503 508 19832 27412 17253 12221
5237 12221 18258 7250 -2718 -5232 -10164 -16718 -19752 -19147 -7971 6561 13448 1349 -5857 7104
5223 7104 9369 4409 209 -15892 -30715 -25438 -7104 25621 22601 7811 7737 15531 16561 20032
5209B0032n547O633o282n170k709o297j1215j0128R746J2058k308J045K625J9247
5195B1730O256k7071N76L709o982J1520j74j7753J1821q714r345P956M933j4260
5181a5798q530k791J541N781m157l202j20K3704K2112P134j057j2204j1292m516
5167c395j054o932m368O059J838J711k3401j888M973O274J6554m805n196o392
5153b0022N838M660p653j0778r818P534Q907K364j515n09o730J5964Q552J0649
5139G443n864j5115r10m917O652l932O071P400K087j3080J0688J1081N469m825
5125H248L905k332k452J0881o525j2515j487J845j294k2804j5948Q224K1799N797
5111d658P527m820m927J1981m946j5417P368L331O401J7572J1402P0r314j0838
$$ plain form
5209 20032 14485 21118 14836 9666 6957 660 -10555 -20683 -10937 1121 -1187 -142 2483 21730
5195 21730 27986 915 1491 5200 -1782 9738 9564 -8189 3632 -5082 -14427 -6471 -1538 -15798
5181 -15798 -24328 -27119 -25578 -19797 -23954 -27156 -27276 -3572 18540 25674 24617 12413 1121 -3395
5167 -3395 -4449 -11381 -15749 -9690 -7852 -6141 -29542 -31430 -26457 -20183 -3629 -8434 -13630 -20022
5153 -20022 -14184 -9524 -17177 -27955 -37773 -30239 -21332 -18968 -20483 -20992 -27722 -11758 -3206 7443
5139 7443 1579 -13536 -14446 -19363 -12711 -16643 -10572 -3172 -1085 -14165 -3477 7604 13073 8248
5125 8248 12153 9821 7369 18250 11725 -790 -2277 -432 -1726 -24530 -40478 -32254 -10455 -4658
5111 -4658 2869 -1951 -6878 5103 157 -15260 -7892 -4561 1840 19412 30814 30884 21570 10732
5097A0732j7079j5548j6733j2935R087K8946J5676J41n3n357N652m935P307j097
5083C804j7252O439J0166j035l368j083M299j6696J3079N504r877M76r503j8437
5069c3484P07Q438K4278Q751p961n45j783R520k18n004l370l512l668R816k45
5054A720o664R951k1778n545K0731l637p117O304J070j4283l060J0577o02L382
5040h951J0196r046m700J136k222K1860o283k74j0322j4177M830k340r659J8546
5026a1406J4438m964O467l565J1924J700j2270q013k3109O630J2638K2270R78
5013A3718j5908J954L850J2801P101N836j0165m602n762J04R865J7675m701j1358
4999B0408j3162m640L640m024j5495j3095k964J648M42J1746N309r609J2632L0136
$$ plain form
5097 10732 -6347 -21895 -38628 -51563 -42476 -13530 2146 2287 2234 -3123 2529 -2406 4901 3804
5083 3804 -13448 -7009 3157 2122 -1246 -2329 1970 -14726 -1647 3857 -6020 -5544 -15047 -33484
5069 -33484 -32777 -24339 -61 8690 729 184 -1599 7921 7703 2699 -671 -4183 -7851 1965 1720
5054 1720 -4944 5007 -16771 -22316 -1585 -5222 -12339 -6035 -4965 -19248 -22308 -11731 -12333 -8951
5040 -8951 1245 -7801 -12501 -11365 -13587 8273 1990 1716 -8606 -22783 -17953 -20293 -29952 -11406
5026 -11406 3032 -1932 4535 970 12894 14594 2324 -5689 -28798 -22168 -9530 12740 13718
5013 13718 -2190 -236 3614 16415 23516 29352 19187 14585 8823 8927 18792 36467 31766 20408
4999 20408 7246 2606 6246 2222 -13273 -26368 -29332 -27684 -27242 -15496 -10187 -19796 -7164 22972
4985B2972J7070m900k3276j2046Q773R625j1025J6636o432J3858k2595r324J258
4972E94O629J6275J662l372P271j0868r108j2405o525J6598J2424j0730o247k48
4958A950L352m329l440M031K3576j292j258n052o618j131J6944J8120J5396j7545
4944D2704q719k5375j0074r602j815j3724K516P302m934j0342Q850O125O070O900
4930d118K596k4770M319J2109j6422j0691M939J842j1257P6n918M469P489K0463
4916a4874K7793J4316N243n301j3690j8618Q786k22N366K691J3158N221j0046
4903A9823p765m772j7641j2859J2616j6161l818o568J5728J6158J0381N915p038
4890C999j6372m074j0217R801j1508k178K1400J2463k1245q485J3521M814L300
$$ plain form
4985 22972 40042 35142 11866 -180 8593 18218 7193 23829 17397 31255 8660 -664 594
4972 594 7223 23498 25160 21788 29059 18191 9083 -3322 -9847 6751 19175 8445 2198 1950
4958 1950 5302 973 -2467 1564 25140 23848 22590 17538 10920 9789 26733 44853 60249 42704
4944 42704 33985 8610 -1464 -11066 -12881 -26605 -24089 -16787 -21721 -32063 -23213 -17088 -11018 -4118
4930 -4118 -1522 -26292 -21973 -9864 -26286 -36977 -32038 -30196 -41453 -41377 -47295 -42826 -35337 -14874
4916 -14874 12919 27235 32478 27177 13487 -5131 3655 3433 8799 11490 24648 29869 19823
4903 19823 12058 7286 -10355 -23214 -10598 -26759 -30577 -37145 -21417 -5259 5122 11037 3999
4890 3999 -12373 -16447 -26664 -16863 -28371 -30549 -9149 3314 -17931 -26416 -12895 -8081 -4781
4877d781j5781J2460J3688m412p893o667N264K3144R606j9545j8017R518k234
4864e650j2391K787N06m109J0925R794l61O561j4988j8281K54O917L640o99o490
4849b1585k079Q225P148J9073m275o881j7607j2782R507Q532K962K140O483J580
4835D41k526o893n439R853J4002l046j1819o500N45P356J0054K003r362Q910J1488
4820A9067m476j4241K75J193L91q25j5794r034k67m456K465L848J4754J804K079
4805c217O859P387N342q037j1495L510o99m878J0511o894N848J6683K8j0272p326
4790C350J1864q2j9177p522J3985M471l764o336o709J1275J132j517m882R817
4776E905n27o672J635M369r907J6834M43k8912j240P554O786O068J48l52r096
$$ plain form
4877 -4781 -20562 -8102 5586 1174 -6719 -13386 -8122 15022 24628 5083 -12934 -3416 -5650
4864 -5650 -18041 -15254 -14748 -18857 -7932 1862 1501 8062 -6926 -25207 -24953 -18036 -14396 -15095 -21585
4849 -21585 -23664 -15439 -8291 10782 6507 -374 -17981 -30763 -21256 -12724 -9762 -7622 -1139 441
4835 441 -2085 -8978 -14417 -4564 9438 6392 -5427 -11927 -11382 -4026 6028 8031 -1331 7579 19067
4820 19067 14591 350 625 1818 2209 1384 -14410 -23444 -23711 -28167 -25702 -21854 -7100 -5296 -3217
4805 -3217 3642 11029 16371 8334 -3161 349 -350 -5228 5283 -1611 4237 20920 20948 10676 3350
4790 3350 15214 15132 -4045 -11567 2418 6889 3125 -3211 -9920 1355 2487 970 -3912 5905
4776 5905 5378 -1294 341 4710 -5197 11637 12080 -16832 -18072 -10518 -3732 2336 2484 2132 -6964
4761f964r36j599n031o602M740J7833N213J1604J0691j7345j5887J1109J0267
4748A7093o463J1415J802j3090p210J146j8965q828K1609J56L674M559K69j4169
4734g002j3040l787R720n004M973J2945P340m602r839J4277R942Q922n368j7428
4720B049j4046P384J3398l143j1168m38P706K435N411j3861M194J9804j3831r002
4706c108k760k7044O075J5583J0621N527j2398k2423j593J1816O148j2884J0479
4693a5961J6045J5506J5263J141p287j7406J1951N38n486j4583M308O846n24j0846
4679d95o833L819R3k1912J596K0095L726j614l101M485p946Q488J2939j1149o156
4664c965R925N28l267N5j4138r228J181K736k319P119J5222J5891o97j6157l791
$$ plain form
4761 -6964 -7900 -9499 -14530 -21132 -16392 1441 6654 18258 28949 11604 -4283 6826 17093
4748 17093 10630 22045 23847 10757 3547 4693 -14272 -23100 -1491 -1335 2339 6898 7167 -7002
4734 -7002 -20042 -23829 -14109 -19113 -14140 -1195 6145 1543 -8296 5981 15923 24845 19477 2049
4720 2049 -11997 -4613 8785 5642 -5526 -5964 1742 4177 9588 -4273 -79 19725 5894 -3108
4706 -3108 -5868 -32912 -26837 -11254 -633 4894 -7504 -29927 -31520 -19704 -13556 -26440 -15961
4693 -15961 84 15590 30853 31994 24707 7301 19252 19790 14304 -279 4029 10875 10351 -495
4679 -495 -7328 -3509 -3416 -25328 -23732 -3637 89 -1525 -4626 -141 -8087 401 13340 2191 -3965
4664 -3965 5960 6488 3221 3276 -10862 -20090 -18909 -16173 -18492 -11373 3849 19740 19043 2886 -905
4649i05j762l581n234O175J999k0085p240N359J5104J7660j2128r953K5421N306
4635A6136o374n898j2048o346N208L497P290l839N180j563P274j7102j2867J0681
4621a0771J8453J0750o881o055k079l234m492o350o71j0797L82J3217R450j736
4607h14j0801l755J4233J3939N09J541j1938q046j7572p889J998J9096L604k416
4593h311M053J548J9052J1000J1991r760p326O705j2030r117J6059j730k6737
4580d603j8231R764K283J711J4645J5215j0300j1436Q185J172l634j3237N326
4567c140N070j3134j3743j33P896N306J440J9646J0664j5090k1522J272O127P222
4553b119J893K722J08q372L830Q222J660p171K984J7636k5397k7394P385p423
$$ plain form
4649 -905 -2667 -6248 -11482 -5307 -3308 -23393 -30633 -25274 -10170 7490 -4638 -14591 10830 16136
4635 16136 9762 3864 -8184 -14530 -9322 -5825 1465 -2374 2806 1243 8517 -8585 -21452 -10771
4621 -10771 7682 18432 11551 5496 3417 183 -4309 -10659 -11330 -22127 -21745 -8528 922 -814
4607 -814 -11615 -15370 -1137 12802 13311 14852 2914 -5132 -22704 -30593 -28595 -9499 -5895 -8311
4593 -8311 -4258 -2710 16342 27342 39333 29573 22247 28952 16922 7805 23864 22134 -4603
4580 -4603 -22834 -13070 -10787 -9076 5569 20784 10484 -952 7233 8405 4771 -8466 -3140
4567 -3140 1930 -11204 -24947 -25080 -17184 -11878 -10438 9208 19872 4782 -16740 -15468 -9341 -2119
4553 -2119 -226 2496 2604 -5768 -1938 6284 7944 773 3757 21393 -4004 -31398 -24013 -31436
4539c1436j2085N850N634J8628J1297K1626M666N900K762j8609j7923p524O890
4526d324K583p901l504J4460L2028J098j8893k320L927j1450j3008J2502L67J7203
4512B2768j2806L37P130j1755j906R012n451O007P045q197L234j274k273j5239
4498c368N408l714L100n634j5236m405K770M812K446M903J4426j067r401J527
4484c433R406J8177m109p937j2712j1571P883P28N94J589J3446o000q352j68j686
4469d145n741J734J7471r632j2955l89j71J3939r20j1287j5339n758J1592K3124
4455A523J8596J273j3363j3865J1453O842J596j3380j925r904j0340J138K5133
4442D777J7678k860k510r910q316q169j573J787O693L238O531j0432l152j6683
$$ plain form
4539 -31436 -43521 -37671 -32037 -13409 -2112 19514 24180 30080 32842 14233 -3690 -11214 -4324
4526 -4324 -1741 -9642 -13146 1314 33342 34440 15547 13227 17154 5704 -7304 5198 5565 22768
4512 22768 9962 10299 17429 5674 3768 12780 7329 13336 20381 12184 15418 14144 11871 -3368
4498 -3368 2040 -1674 1426 -4208 -19444 -23849 -21079 -16267 -13821 -8918 5508 4441 -4960 -3433
4484 -3433 5973 24150 20041 12104 -608 -12179 -4296 -3568 -2974 -1385 12061 6061 -2291 -2459 -4145
4469 -4145 -9886 -8152 9319 -313 -13268 -13657 -13828 111 -809 -12096 -27435 -33193 -21601 1523
4455 1523 20119 21392 8029 -5836 5617 12459 14055 675 -1250 -11154 -21494 -20356 4777
4442 4777 22455 19595 17085 7175 -1141 -9310 -10883 -9096 -2403 835 7366 -3066 -6218 -22901
4428b2901J1876J7213J2334k020j5704k264q691N475p927K239J0478l362q073
4415a1327K58k481K327j4244n249O758J0382J8299j2113m193J0749P661L733j8613
4401h053q03J7248J0902P700r420j0541k49N492j0787k0171k4289J1189l624M049
4387c1357J7686k435j0188J6487j315j0868p35j5070M486Q00N438N541P782q78
4373a4626P909J294R5p370N529j8532k090J7540J2583M444j0557n755l227N673
4359g090k415m839L172N360J2972r256Q237j8016r979J8821J7200m788r772o356
4345f749J216j3457j676O680N245j987o766K926J3974J4258p380P206n680j7994
4331a0184J4349K706o213r239l086R661R619j638j5511l126N954P911P037j5148
$$ plain form
4428 -22901 -11025 6188 18522 16502 798 -1466 -10157 -4682 -12609 -10370 108 -3254 -11327
4415 -11327 -11069 -13550 -11223 -25467 -30716 -23958 -13576 4723 -7390 -11583 -834 6827 10560 -8053
4401 -8053 -8856 8392 19294 26994 17574 7033 6784 12276 1489 -18682 -42971 -31782 -35406 -31357
4387 -31357 -13671 -16106 -26294 -9807 -11122 -21990 -22725 -37795 -33309 -32509 -27071 -21530 -13748 -14626
4373 -14626 -6717 -5423 -5328 -12698 -7169 -25701 -27791 -10251 2332 6776 -3781 -9536 -12763 -7090
4359 -7090 -9505 -14344 -11172 -5812 7160 -2096 6141 -11875 -21854 -3033 14167 9379 -393 -6749
4345 -6749 -5533 -18990 -20666 -13986 -8741 -10728 -17494 -14568 -594 13664 6284 13490 7810 -10184
4331 -10184 4165 6871 658 -8581 -11667 -2006 7613 5975 -9536 -12662 -6708 1203 8240 -6908
4317f908q774q506J0088J0915K2063J4830k6708j1395j1541k080P306m091J3356
4304a445q570j7587j9608J924J5415J6972M052M156k182O408N374r467j7490n173
4290b7221l412L237J0199o287J0123J2343k674P021J3996O159P065o813k0705
4277C031n451j2581j3154J0023K1141J063j28n469M7n846q411l167j1217N73j266
4262c0812J4430L5202J1581k2424k2407m15n504K44N740o647k57K2440R490J6530
4248B7191J3059j9093r762J2460J4429K675j1857j9855j6480j4208J4913J3220
4236F692j7488r425l148J2312p107L750k920P502K99n863q744p170O985q350j3400
4221d6075J0072K3543J2746J6606k272o558J403q112P435j1039j2021J768Q827
$$ plain form
4317 -6908 -15682 -24188 -14100 -3185 18878 33708 7000 -4395 -15936 -18016 -10710 -14801 -1445
4304 -1445 -10015 -27602 -47210 -45286 -29871 -12899 -8847 -4691 -6873 -465 4909 -4558 -22048 -27221
4290 -27221 -30633 -27396 -17197 -23484 -13361 -1018 -3692 3329 17325 23484 30549 23736 3031
4277 3031 -2420 -15001 -28155 -18132 3009 4072 3944 -1525 -1478 -7324 -15735 -18902 -30119 -29546 -30812
4262 -30812 -16382 18820 30401 7977 -14430 -14845 -20349 -20105 -14365 -21012 -21269 1171 10661 27191
4248 27191 40250 21157 11395 23855 38284 40959 29102 9247 -7233 -21441 -6528 6692
4236 6692 -10796 -20221 -23369 -11057 -18164 -14414 -17334 -9832 -9533 -15396 -24140 -31310 -24325 -32675 -46075
4221 -46075 -36003 -12460 286 16892 14620 8062 9465 1353 8788 -2251 -14272 -12504 -3677
4208c677J489m641K024o886Q365J4166n003J5236M990m596l663j8752m179O954
4194A827N996N510Q358j5296m768J5475M275O44J0479N312k6399r316K450K937
4180G484P923m974j5268N185N122K2087K2247l161j7130j4532l3574k2829Q27
4167d0593J1718K5803J8668R159J0469r165N416j626l81K50p269m80m019j1299
4153F651l003j447j1827j2994k85K1530J1013k196J2370P698m1o701j2028l455
4139E285j0107j0257N896J5646o503n384N534j3113K2478j1308j963O018m988
4126b766j3979j0078M865J1009J2100O086j3534q079N07J082M898m5m519K263
4112a0190K70K724J2851M545k0433L778O157m827q144j3394o798j0003J6105J7886
$$ plain form
4208 -3677 -2188 -6829 -4805 -11691 -3326 10840 5837 21073 26063 21467 17804 -948 -5127 1827
4194 1827 7823 13333 21691 6395 1627 17102 21377 22021 32500 37812 11413 2097 4547 7484
4180 7484 15407 10433 -4835 350 5472 27559 49806 46645 29515 14983 -18591 -41420 -40593
4167 -40593 -28875 -3072 15596 24755 35224 26059 31475 29849 29468 29718 22449 21969 17950 6651
4153 6651 3648 2201 -9626 -22620 -22905 -1375 9638 7442 19812 27510 27469 20768 8740 5285
4139 5285 -4822 -15079 -9183 6463 -40 -5424 110 -13003 9475 -1833 -3796 2222 -2766
4126 -2766 -16745 -26823 -21958 -10949 1151 7237 -6297 -14376 -13869 -12787 -7889 -7934 -12453 -10190
4112 -10190 -9920 -7196 5655 10200 -10233 -6455 -298 -5125 -13269 -26663 -33461 -43464 -27359 -9473
4098i473J2236r140j3091J1571k970j979j0108O851r39k054K62K6107M587m866
4084F994j591l243O558J8075L021j2814l0951k4097J985k386P150K9817J9J696
4070B33M846m038r744j0279M553L128P52L446n861j532J3290K726M068J0738P837
4055B4163J1621j3395q859M66j856o276J9845Q394k2570J609R681j427M550o007
4041A9939l852j3753r439q916J1092M998J0120P321N26Q300N839N766j8933M781
4027B3789O286o450j5191j5212J0119q640l663k841j5145j3949M36J4642J5691
4014a0128L449m32J191m858l012J0111R404j7705J4115p531j2080J1979M158P435
4000F096J5105L817j1944q794p738J2434P705p578k3929n416J2446N185N307K3531
$$ plain form
4098 -9473 2763 -6377 -19468 -7897 -10867 -12846 -22954 -16103 -17042 -19096 -18834 7273 11860 6994
4084 6994 5403 2160 8718 26793 29814 17000 -13951 -38048 -36063 -38449 -31299 -1482 -1463 233
4070 233 5079 1041 -8703 -18982 -14429 -11301 -10549 -7103 -12964 -14496 -1206 1520 5588 16326 24163
4055 24163 35784 22389 13530 13996 12140 5864 25709 34103 11533 13142 22823 21396 25946 19939
4041 19939 16087 2334 -7105 -16021 -4929 69 10189 17510 18036 26336 32175 37941 19008 23789
4027 23789 30075 23625 8434 -6778 3341 -5299 -8962 -11803 -26948 -40897 -40461 -25819 -10128
4014 -10128 -6679 -7111 -5920 -10778 -13790 -3679 5725 -11980 2135 -5396 -17476 -5497 -1339 6096
4000 6096 21201 25018 13074 4280 -3458 8976 16681 9103 -14826 -20242 -7796 -2611 2696 26227
3986B6227r251k8195m855K1662J896j0360j462L832k142r329l727k004P779J5336
3972E407J7469j4798k1948O58J829r826K923J5133R671K739p602r893J4720K792
3958I274J2352j1794m568K636O093J522m900L70j3604j0522J2907R920r6j845
3944G745o284J4366O546j8596l471O665r545p020N468j551j5877n125O268K2799
3930B388J0282J527j2799r778r578Q82J1136j206N50o102J4386j4163P469r360
3916a4366J1913j952J657K968J9399j8846j1244O858J4925o980J6046L264J676
3903B5318o173j7840l830k2121Q983K3088J6677P41k0236j0709j2469p458K846
3890b3183N371l864J1429L874n276N082J291O459k088q36R0P923Q990K659J5338
$$ plain form
3986 26227 16976 -11219 -16074 5588 7484 -2876 -4338 -506 -2648 -11977 -15704 -17708 -9929 5407
3972 5407 22876 8078 -13870 -13212 -11383 -21209 -18286 -3153 6518 9257 1655 -8238 6482 9274
3958 9274 21626 9832 5264 7900 13993 15515 10615 10985 -2619 -13141 -234 9686 9590 7745
3944 7745 1461 15827 22373 3777 306 6971 -2574 -9594 -4126 -5677 -21554 -26679 -20411 2388
3930 2388 12670 14197 1398 -8380 -17958 -17076 -5940 -7146 -6596 -12698 1688 -12475 -5006 -14366
3916 -14366 -2453 -4405 -2748 220 19619 773 -10471 -3613 11312 4332 20378 23642 25318
3903 25318 19145 1305 -2525 -24646 -15663 7425 24102 24843 4607 -6102 -18571 -26029 -23183
3890 -23183 -17812 -21676 -10247 -6373 -11649 -6567 -5276 1183 -905 -1741 -1651 6272 15262 17921 33259
3875C3259R136j5926j6958k0650j0398K140k646Q306O314n388n490M765k907J8005
3861A562j338j5870l450P509J3855J0515N556N889j257j7546k3150L61k179j2418
3847c1961j3894P414O59K1317J2787p05k7104j9431O257K8272K1795j376o273
3834b243J1701M330j0519l101J0039l046j107J1602j723k0453R443J1952j0707
3821F168K378R51j1229K074p793L437K049J2651J888J427K50r990j9309j169m904
3806b1121j2364R736K210J5485J3327j0845j0865K154R021N857q467O881N295
3793F304q464J3604J587q141o394q694j1109L521k586n1Q454P77p148N949r159
3778b1550r359J846R548M115R421Q460R987J3807N162Q243j3542n327j294k5131
$$ plain form
3875 33259 42395 26469 9511 -11139 -21537 -19397 -22043 -13737 -7423 -12811 -18301 -13536 -16443 1562
3861 1562 224 -15646 -19096 -11587 2268 12783 18339 24228 22971 5425 -17725 -17364 -19543 -31961
3847 -31961 -45855 -38441 -37782 -16465 -3678 -4383 -31487 -50918 -44661 -16389 5406 4030 -2243
3834 -2243 9458 13788 3269 168 10207 7161 6054 17656 15933 -4520 4923 16875 6168
3821 6168 8546 9497 -1732 342 -7451 -4014 -1965 10686 12574 14001 14251 4261 -15048 -16217 -21121
3806 -21121 -33485 -23749 -21539 -6054 7273 -3572 -14437 -12283 -3262 2595 -5872 1009 6304
3793 6304 -2160 11444 13031 4890 -1504 -10198 -21307 -17786 -20372 -20423 -11969 -11192 -18340 -12391 -21550
3778 -21550 -30909 -29063 -19515 -15400 -5979 2481 12468 26275 31437 39680 26138 20811 19517 -5614
3764e614K036R180J6100r715j0723p591j964j0357k167j4129j7040K4903K0066
3751g015m15q052J0610k539j1990K2700K7436l2027j8459O479k34RN641k172K429
3736g599o826J085J6672Q652K48j7514j0234Q537J1197o98r654j3579O88k392
3722b1417p984Q22J9009K255j2277M737j523N732j527q783J8477O51j6882J593
3708a7117j475J2112m318N647m18J8042J1544j2736k2038M146N455j0123l281
3695a4560M559J1725o601k112n490R052J3441P182j1958J47P239j0143r505N510
3681a514l181M358J1137M206r389j2941k813r653l842J3684j886k2296j1107J5920
3667b9317J5679O877r706j329j9365J199L947J1348J3425q130j872K0232Q981
$$ plain form
3764 -5614 -3578 5602 21702 11987 1264 -6327 -8291 -18648 -20815 -34944 -51984 -27081 -7015
3751 -7015 -7430 -15482 -4872 -7411 -19401 3299 30735 -1292 -19751 -13272 -13506 -13497 -7856 -10028 -7599
3736 -7599 -14425 -13340 3332 11984 12232 -5282 -15516 -6979 4218 3520 -6134 -19713 -19025 -21417
3722 -21417 -29401 -28579 -9570 -7315 -19592 -14855 -16378 -10646 -12173 -20956 -2479 -1828 -18710 -17117
3708 -17117 -18592 -6480 -10798 -5151 -5569 12473 24017 11281 -10757 -6611 -1156 -11279 -14560
3695 -14560 -10001 1724 -4877 -6989 -12479 -3427 10014 17196 5238 5385 12624 2481 -7024 -1514
3681 -1514 -4695 -337 10800 15006 5617 -7324 -10137 -19790 -23632 -9948 -11834 -34130 -45237 -29317
3667 -29317 -13638 -6761 -16467 -17796 -37161 -35962 -32015 -20667 -7242 -15372 -17244 2988 11969
3654A1969J4159n589l3380j8206p010K0424J0437k304O630p019L230o187O114
3641f732Q068M236l576r475j884J558m939J827L151J5491Q899L343Q877O39l239
3626B6244j4434n713O720j0523j2477q086m081R939O515l885J065J6347J4553
3613B2184k0200j8313R862J0708M941J1692o961n722L358k950n982j0299Q080
3600C98M588j836j9447n609m66K1066J3635k2058j1327Q178k25K593P350N929
3586B769p680P159J0099q743k358p504J924o36j3474k944l345L819m725M501J4628
3571f510K706p442K3347m072j4490L390j2694r877P089J4918j2024j4569L548
3558b6680R499P259J0744k88j2071p211j5563J5750M754j439j544J031N011K1764
$$ plain form
3654 11969 26128 20539 -12841 -31047 -38057 -17633 -7196 -9500 -2870 -9889 -6659 -12846 -6732
3641 -6732 1336 5572 1996 -7479 -9363 -7805 -12744 -10917 -7766 7725 16624 19967 28844 29483 26244
3626 26244 11810 6097 12817 2294 -10183 -18269 -22350 -12411 -5896 -9781 -8716 7631 22184
3613 22184 1984 -16329 -6467 4241 9182 20874 13913 8191 11549 8599 2617 -7682 398
3600 398 4986 3150 -16297 -21906 -22372 -1306 12329 -9729 -21056 -12878 -13103 -10510 -3160 2769
3586 2769 -4911 2248 12347 3604 1246 -6258 -4334 -4970 -18444 -21388 -24733 -20914 -25639 -21138 -6510
3571 -6510 -3804 -11246 12101 8029 -6461 -3071 -15765 -25642 -18553 -3635 -15659 -30228 -26680
3558 -26680 -17181 -9922 822 534 -11537 -18748 -34311 -18561 -13807 -15246 -16790 -15759 -10748 11016
3544A1016r379O96m802j1643j2384j919R259O502j358k529K252j3841J388J1596
3530a5146O810L042j384K128j2636j0541M5J6913J5659o550k964o717k0230L12
3516c1259K1232l946j4333M701l191J3280J6778L744O632j37r253r082J032L928
3502A26m394M643k425o249R292J3391L141m738q700j4904m704j624N530l909Q424
3487g100m690m621M310K293Q910K07l57j312J726j8860k805J7362k835m942n609
3472a8323Q292j0641m830Q429j0094J2277J3463K795J8178o204k0013j0633p656
3459b4960K897L1790k256r921j443L039k289Q062J4837j6579p055J202m732l532
3445a0940Q49N306M010J8056O779l480j7219o056R77K725J8116J2988j0616r29
$$ plain form
3544 11016 1637 2333 -2469 -14112 -26496 -28415 -19156 -12654 -14012 -16541 -14289 -28130 -26742 -15146
3530 -15146 -8336 -5294 -6678 -4550 -17186 -27727 -27682 -10769 4890 -1660 -4624 -11341 -31571 -31259
3516 -31259 -10027 -13973 -28306 -23605 -26796 -13516 3262 7006 13638 13501 4248 -4834 -3802 126
3502 126 -4268 375 -2050 -8299 993 14384 17525 12787 4087 -10817 -15521 -17145 -11615 -15524 -7100
3487 -7100 -11790 -16411 -12101 -9808 -898 -691 -1048 -2360 -634 -19494 -22299 -4937 -7772 -12714 -18323
3472 -18323 -10031 -20672 -25502 -17073 -27167 -14890 -1427 1368 19546 13342 -6671 -17304 -24960
3459 -24960 -22063 9727 7471 -2450 -3893 -854 -3143 4919 19756 3177 -3878 -2676 -7408 -10940
3445 -10940 -10091 -4785 -775 17281 24060 20580 3361 -2695 -1718 1007 19123 32111 21495 20566
3431B0566j6245K73N41j2452P08j3540p663J8793Q180N963K860r12q871J8656
3417A6857J6097M54p388M079N262j124k2832r061P285J5044J509r287k8033j6408
3403b7546k497J5144P530L932r123Q270J829O690m171o525J4714Q680J3277q463
3389B1741k4754j4503j1593J2569O434K9152J3741k8720l875J5471R778K562l55
3376B7648q548q799j9859l916J704J668J5240J9923j0484j0158j1962j2121J632
3363a8032K669L780O144j5771j727J742q979N821J9682J5463j4230k0667J1056
3350a3049J760K569M581M088R82K12O469m055p030P984m56p114L523M160k161
3335B463O155l0735p056J5989M433J2878J2068J1836j3189j2025m89L916j3687
$$ plain form
3431 20566 4321 4594 5135 -7317 -6609 -20149 -27812 -9019 -839 5124 7984 7072 -1799 16857
3417 16857 32954 33408 26020 30099 35361 34237 11405 2344 9629 24673 26182 16895 -11138 -27546
3403 -27546 -30043 -14899 -7369 -3437 -12560 -4290 -2461 4229 58 -6467 8247 16927 30204 21741
3389 21741 -3013 -17516 -29109 -16540 -10106 19046 32787 4067 192 15663 25441 28003 27648
3376 27648 19100 10301 -9558 -13474 -11770 -10102 5138 25061 14577 4419 -7543 -19664 -18032
3363 -18032 -15363 -11583 -5439 -21210 -22937 -21195 -30174 -24353 -4671 10792 -3438 -24105 -13049
3350 -13049 -11289 -8720 -4139 -51 931 1143 7612 3557 -3473 4511 4055 -3059 464 4624 2463
3335 2463 8618 -22117 -29173 -13184 -8751 4127 16195 28031 14842 2817 2328 6244 -7443
3322g443j0752M318M122M000k064j0729j9022o146J1207O868J4747L585j0104
3309a7413J458n453O273o752J6074J4669n20O238n126l990q283M819R51j3956
3295a1011j5851l354Q826l137J6781J0827k473P630N332m204r344r129j056r168
3281a9331K445J3448J3342M692r953j0374q63Q627j4557N250J2254N620j3284
3268b684m08N84k586J8712O445m405J3363o606r207M593j184m883k1624J2722
3254B832J232j0055m924J2118P339o956o858P919K53p63Q82p404k761l367N836
3239d677m791m106j0748n077J4498K4407j077j0123R374j657L649q252M219j8853
3225a3214l020J0041j4333m255o938M388J6811P825m550m577K710m776J0132l829
$$ plain form
3322 -7443 -18195 -13877 -9755 -5755 -7819 -18548 -37570 -43716 -32509 -25641 -10894 -7309 -17413
3309 -17413 -15955 -21408 -15135 -21887 -5813 8856 8336 14574 9448 5458 -2825 1994 2945 -11011
3295 -11011 -26862 -30216 -21390 -24527 -7746 3081 608 8238 13570 9366 22 -9107 -10163 -19331
3281 -19331 -16886 -3438 9904 14596 4643 -5731 -6594 2033 -12524 -7274 4980 10600 -2684
3268 -2684 -3092 -2508 -5094 13618 20063 15658 29021 22415 13208 17801 16617 11734 -9890 2832
3254 2832 4064 -5991 -10915 1203 8542 1586 -5272 2647 2900 2137 3019 -4385 -7146 -10513 -4677
3239 -4677 -9468 -13574 -24322 -29399 -14901 9506 8429 -1694 7680 6023 9672 1420 5639 -13214
3225 -13214 -16234 -6193 -20526 -24781 -31719 -27331 -10520 -2695 -7245 -11822 -9112 -13888 -3756 -7585
3211g585k599N888k4697q177J788Q571J4118J1372p124l015L915l770k1061o36
3197c3012J2802J2619J5285O36r56l825l130J878M039M56n40q756K166M407r157
3182e088K2k612n12p503J5565P280K001L870j3883j3263Q63j583J8813L800p641
3167A29p011M064m47p95K1178J4792k8809j1687n627J2475J5918K793j2522K064
3153F515J2633l273P68J2287J0448j4718o063R283p830j1111K347K2261R409j313
3139D1643j7152k2357k2701j421o083R897J8372j597M577l0371j1888J2659K8214
3126A792Q945p520J1673N019j7402m423o822l257j9211n012J6629k918Q902K1934
3112H329r725j0398M843J2613L212m742k57k803Q036q179N329J2895O5j8427l272
$$ plain form
3211 -7585 -10184 -4296 -28993 -37170 -35382 -26811 -12693 -1321 -8445 -11460 -7545 -11315 -32376 -33012
3197 -33012 -20210 -7591 7694 8330 7374 3549 419 2297 6336 6792 6252 -2504 -338 4069 -5088
3182 -5088 -5066 -7678 -8190 -15693 -128 7152 9153 13023 -860 -14123 -13260 -14843 3970 7770 129
3167 129 -6882 -2818 -3265 -4060 17118 31910 3101 -8586 -14213 -1738 14180 16973 4451 6515
3153 6515 19148 15875 16643 28930 39378 24660 18597 27880 20050 8939 11286 33547 42956 41643
3139 41643 24491 2134 -20567 -21988 -28071 -18174 198 -1399 3178 -27193 -39081 -26422 1792
3126 1792 10737 3217 14890 19909 2507 -1916 -8738 -11995 -31206 -36218 -19589 -22507 -13605 8329
3112 8329 -1396 -11794 -6951 5662 8874 4132 3875 1072 9108 929 6258 19153 19218 791 -2481
3097b481K992j7728q393R358L4451J6122K75l920n896P336j3550K561l097j8660
3083f30j1873k357P565J7682N827p710j8355j6559J7564L0914O332k3166L689
3070H923Q052j2226j5680r7J0519R282r685K759J9051P16R64J0975p573J0693
3056C6673n450l9366j299J644J94o238m711j423j014R916Q006N499J9073K0269
3042D1773n649k8452q904J2078J880j4722J6535K104j1973R926P546j4879o373
3029H90p776N145J1233n182P748O409k4429k1591L832J6289J1366p984p251p429
3015a8730j968P015k1838j0977K6938R759J3899m222j7700J396j228o452k348
3002b6456J6913J7509J4177o129j3714l996R229Q083N115m041j6963O70P485O540
$$ plain form
3097 -2481 511 -17217 -25610 -16252 18199 34321 34596 30676 24780 32116 18566 21127 18030 -630
3083 -630 -12503 -14860 -7295 10387 16214 8504 -9851 -26410 -8846 22068 28400 5234 8923
3070 8923 16975 4749 -10931 -11028 -509 8773 -912 1847 20898 21614 22578 33553 25980 36673
3056 36673 31223 -8143 -9442 -7798 -7604 -13842 -18553 -19976 -20990 -11074 -3068 2431 21504 41773
3042 41773 36124 7672 -1232 10846 12726 -1996 14539 16643 4670 14596 22142 7263 890
3029 890 -6886 -1741 9492 4310 12058 18467 -5962 -27553 -23721 -7432 3934 -4050 -11301 -18730
3015 -18730 -20698 -13683 -35521 -46498 -19560 -9801 4098 -124 -17824 -16428 -17656 -24108 -26456
3002 -26456 -9543 7966 22143 16014 2300 -1696 7533 15616 20731 16690 -273 397 7882 14422
2988A4422p170j4395r912j3278k2123P023R381J1042N677N543N910J5912J1429
2975A9461J31l922k1334N478k046j007J112j8128j0846K1935K2123M070k3154
2962f127n234O725L474n519j9136L817j39O203M532o496J2190J0837J1449R563
2948B6139R454m074l1141l0396J4822J0476j716R810P915j1122r999P070K1486
2935A8724r041k3603r360p11j5158Q09P928J7455N692R575K3228j550j1979o750
2921E259j002j2790l805O01l934L574P898J955j8134n6J1839J505K390J4486J8254
2906B8040Q207q378M519l08k2275j3755k137P182J8110M257o621j3392j1309m614
2892a2474J1717J4423k311q842j0673n205j7457l054O782L2536J7614j2920k1667
$$ plain form
2988 14422 7252 -7143 -17055 -30333 -52456 -45433 -36052 -25010 -19333 -13790 -7880 8032 19461
2975 19461 19592 15670 -5664 -186 -2232 -3239 -2127 -20255 -31101 -9166 12957 17027 -6127
2962 -6127 -11361 -4636 -1162 -6681 -25817 -22000 -22139 -15936 -11404 -17900 -5710 5127 16576 26139
2948 26139 35593 31519 378 -30018 -15196 -4720 -6436 3374 11289 167 -9832 -2762 18724
2935 18724 9683 -13920 -23280 -23991 -39149 -38340 -30412 -12957 -7265 2310 25538 23988 12009 5259
2921 5259 4257 -8533 -12338 -11737 -15671 -12097 -4199 -2244 -20378 -20434 -8595 -7090 -4700 9786 28040
2906 28040 36247 27869 32388 32080 9805 -3950 -6087 1095 19205 23462 16841 3449 -7860 -12474
2892 -12474 -757 13666 11355 2513 -8160 -13365 -30822 -33876 -27094 5442 23056 10136 -11531
2879a1531k228Q958m624m046Q336O719R390O85J213n972L298M708j1034l95P218
2864A0695K937j3917j6962l645n12O160O720n950K580J5026K2895j8390n735R071
2850A0973k47j9285j260J0278j2599j4519o664P718J4832J1698p12O633o196j8713
2836a8063O157O490J2521m238j3538n661r00J7872J0149m945J089K701Q91o804
2822C721n157j404m456q03j3378n63J7002j3988P430J3448O927J177l917J8388
2808B4427O126j2431n720P519o998n404j5035k712J2080J0348l812K146j5082
2795d548J436J9157o807q204j4683j375N130k932K3407J3311k0868J665Q649n222
2781H116j7892K937L4778q928k0732j3278N779N645l783M124n89m406j188m361
$$ plain form
2879 -11531 -13759 -4801 -9425 -13471 -5135 1584 10974 11659 12872 6900 10198 14906 3872 3477 10695
2864 10695 13632 -285 -17247 -20892 -21404 -15244 -8524 -14474 -11894 3132 26027 7637 1902 10973
2850 10973 10726 -8559 -9819 459 -12140 -26659 -33323 -25605 -10773 925 213 6846 650 -18063
2836 -18063 -11906 -5416 7105 2867 -10671 -16332 -17232 640 10789 5844 6933 9634 10525 3721
2822 3721 -1436 -2840 -7296 -8099 -21477 -22040 -5038 -19026 -11596 1852 8779 9956 6039 24427
2808 24427 30553 18122 12402 19921 12923 7519 -7516 -10228 1852 12200 8388 10534 -4548
2795 -4548 -3112 16045 9238 1034 -13649 -15024 -9894 -12826 10581 23892 3024 4689 13338 8116
2781 8116 -9776 -6839 27939 19011 -1721 -14999 -9220 -3575 -7358 -3234 -3823 -8229 -9417 -13778
2767a3778n28n163q029J493j3277k621O09L1877K1073p638p532n741M93m275m19
2752a3456j1816n231M896P523J4931L673J71J135J0880L498k2935k3470J0942
2739a9259M993P828J0393J7635k235j424r964j7776k4947j3915L917J6749R638
2726a8367J5643K2358P853j6941j6254q159j0106m353j4584L189L61J1298Q583
2713a9479R192K246J2921R122p606r274R618L574J6295K4732l104j7142j9778
2700A1317p375p031P92O788P498l326j6750j3303j051n80o109R965J2967M362
2686a836O176k647q013q423J609K0280M916k6759j3741J415J0177m501O253J2414
2672b680o814j3336J4236J4634J29P870k65o522n214O685j3751o894M652J7443
$$ plain form
2767 -13778 -14306 -19469 -27498 -26005 -39282 -41903 -41294 -9417 11656 4018 -3514 -9255 -8762 -13037 -13456
2752 -13456 -25272 -30503 -25607 -18084 -3153 520 691 1826 12706 16204 -6731 -30201 -19259
2739 -19259 -14266 -6438 3955 21590 19355 17931 7967 -9809 -34756 -48671 -44754 -28005 -18367
2726 -18367 -2724 19634 27487 10546 -5708 -13867 -23973 -28326 -42910 -39721 -39360 -28062 -19479
2713 -19479 -10287 -8041 4880 14002 6396 -2878 6740 10314 26609 51341 48237 31095 11317
2700 11317 3942 -3089 -2297 4491 11989 8663 -8087 -21390 -22441 -23021 -29130 -19165 -6198 -1836
2686 -1836 4340 1693 -6320 -14743 -13134 7146 12062 -14697 -28438 -27023 -16846 -21347 -15094 -2680
2672 -2680 -9494 -22830 -8594 6040 6169 14039 13774 7252 2038 8723 -5028 -11922 -7270 10173
2658A0173K724q630m58j3527R946j3188n276j18O618L3928Q916j5225k1112j3352
2644a8581P536J6569P750P070N150j6927p739o116K809j3803K393J3798p66j2611
2630a3468l734J2842j4840l558N466j7370j74K3282K2270L373n852j4924p957
2617a4644j812k2882p616J3388J6449O151l22r502q757K1279n974J2801J1500
2604A0059L083p76K141n805n434Q027n948j7246J472J4320J8506J1353k1569k6104
2590a3921j734J3700J0731l33k514O329j4438j3431J4100K1725m139r121P84j0328
2576b590j5087J2371J3294j662j5417Q671j2348J6238J691l729n72Q710j8747
2563i177Q041R946J6946k445j5363j1716q269K682O444P199l683k1030K619L058
$$ plain form
2658 10173 12897 4267 3809 -9718 228 -12960 -18236 -18354 -11736 22192 31108 15883 -5229 -18581
2644 -18581 -11045 5524 13274 20344 25494 8567 828 -5288 -2479 -16282 -13889 -91 -857 -13468
2630 -13468 -17202 -4360 -19200 -22758 -17292 -34662 -34836 -11554 10716 14089 8237 -6687 -14644
2617 -14644 -16456 -39338 -46954 -33566 -17117 -10966 -11288 -20790 -29547 -8268 -14242 -1441 10059
2604 10059 13142 12366 14507 8702 3268 11295 5347 -11899 -10427 3893 22399 33752 12183 -13921
2590 -13921 -15655 -1955 8776 8443 5929 12258 -2180 -15611 -1511 20214 16075 6954 7738 -2590
2576 -2590 -17677 -5306 7988 6326 -9091 -420 -12768 3470 5161 1432 860 9570 -9177
2563 -9177 -1136 8810 25756 23311 7948 -3768 -12037 -9355 -2911 4288 605 -20425 -17806 -14748
2549a4748l2n199N863L607j4767J4453J0744n245p286j47j5376r26R278K7142
2535G361J5150m29j8101k0656K759J4372k890k3085p333O235R344Q57L175M907
2521h334L58J5206J9096j2104l3964k239J4465R172l877P069J3724K38M868l649
2507B0029k1989m873k146j9522l698n918p167L798M237q226R092K1257M888k762
2493a3000p167j0566J3629J3792N739l765J4147l301N71j7539j6906K897K3480
2480B011P123R440l966j2476m307j6230n720j2109K1918P864p649q400P017J8177
2466B693K6902O385m5l621n517N637k594k693P057j1252q880M05r616k261P356
2451I956l514o536J0016k4633q097n198o282K0775m704k202M741r065r532K3633
$$ plain form
2549 -14748 -14780 -19979 -14116 -10509 -25276 -10823 -79 -5324 -12610 -12757 -28133 -29059 -19781 7361
2535 7361 22511 22082 3981 -16675 -13916 456 -2434 -25519 -32852 -26617 -17273 -16416 -13241 -8334
2521 -8334 -7976 7230 26326 14222 -19742 -21981 -7516 1656 -2221 4848 18572 18810 23678 20029
2507 20029 -1960 -6833 -8979 -28501 -32199 -38117 -45284 -41486 -37249 -45475 -36383 -15126 -10238 -13000
2493 -13000 -20167 -30733 -17104 -3312 2427 -1338 12809 9508 10079 -7460 -24366 -21469 2011
2480 2011 9134 18574 14608 2132 -2175 -18405 -24125 -36234 -14316 -6452 -14101 -22501 -15484 2693
2466 2693 29595 35980 35935 32314 26797 32434 29840 27147 34204 22952 14072 14477 4861 2600 9956
2451 9956 6442 -94 9922 -14711 -22808 -28006 -34288 -13513 -18217 -20419 -15678 -24743 -34275 -10642
2437a0642o4j5989n558J5346Q447M23r375K7389R187p322j36n379N422R160k4006
2422c097o460K006n814l18J0335n124J0914M056K71j878k11R448j7856k198J9549
2407A3623j520o579J4512l063j3483J886J6136L270j1519q028J681J0525K449
2394A9890O785j8992j1222R239J1826l572r064j3092o180J8635l616k3683L774
2381a9272K7631J6401M560n958P68L350j0554N407j2840j2390J937K45J4364j684
2367A1965j3715m263j8275J075L974K299K8237P671O704k367J1013j0333k0289
2354C696j259k428p218M211N994N909j9960j0002r048L543J4008n681k694j5305
2340c6234J6959J7080K045r385n8K503j511R911J0286N76J6687j294j6431m915
$$ plain form
2437 -10642 -10706 -26695 -32253 -16907 -8460 -8037 -17412 9977 19164 11842 11706 6327 11749 20909 -3097
2422 -3097 -9557 -7551 -13365 -13683 -3348 -8472 2442 6498 6769 4891 4680 14128 -3728 -5926 13623
2407 13623 12103 5524 20036 16973 3490 5376 21512 24782 13263 5235 6916 17441 19890
2394 19890 26675 7683 -3539 5700 17526 13954 4890 -8202 -14382 4253 637 -23046 -19272
2381 -19272 8359 24760 29320 23362 24130 27480 16926 22333 9493 -2897 -960 -715 13649 11965
2367 11965 -1750 -6013 -24288 -23213 -19239 -16940 11297 18968 25672 23305 34318 23985 3696
2354 3696 2437 9 -7209 -2998 2996 8905 -11055 -21057 -30105 -26562 -12554 -18235 -20929 -36234
2340 -36234 -19275 -2195 -150 -9535 -9593 -7090 -8601 1310 11596 12172 28859 27565 11134 6219
2326F219j234J125j4860j4045O217n123N407J2351J3266l547m588r868o344p547
2312b2571J6364K76j3130j423J2223k1530k0281J0895K0842R663M237O344n817
2299c908p829J2823J5495L489j589j2533J0442L37l498o652j2877J4151J1397
2286A9248J4649j538m850N364r543j759j0497j1071j087n988J8451M905J188L299
2272B0771j0167q488k427K1533J0751p278r999P307O78o311n319j4936Q422M266
2258H803j318j7307p9O621l549O209M884K266j7056J5918N627k071l238n478p400
2243g168j082Q131J2888J3181j2188k1609j6541P165J9682K4546L142j043q402
2230B0702J372p443o909l716P652J1984k024j418q492N27o258Q287O031M173o155
$$ plain form
2326 6219 4985 6110 -8750 -22795 -16578 -21701 -16294 -3943 9323 5776 1188 -8680 -15024 -22571
2312 -22571 -6207 -5931 -19061 -20484 -8261 -29791 -50072 -39177 -18335 -8672 -4435 1909 -3908
2299 -3908 -11737 1086 16581 20070 18481 5948 16390 16727 13229 6577 -6300 7851 19248
2286 19248 33897 32359 27509 32873 23330 21571 11074 3 -1084 -7072 11379 16284 17472 20771
2272 20771 10604 2116 -311 21222 31973 24695 14696 22003 22681 16370 11051 -3885 4537 8803
2258 8803 7485 -9822 -9901 -3280 -6829 -620 4264 6530 -10526 5392 11019 8948 5710 232 -7168
2243 -7168 -8250 -119 12769 25950 13762 -7847 -24388 -17223 2459 27005 30147 29104 20702
2230 20702 22074 14631 7722 4006 11658 23642 21618 20200 11708 12235 5977 14264 20295 24468 18313
$$ [...]
##END NTUPLES=NMR SPECTRUM
##END=
