##TITLE=Analysis number 319453
Compound Code ac 35909
Project Code adrs
Chemist Name frontier sci
##JCAMPDX= 6.0         $$ Bruker NMR JCAMP-DX V2.0
##DATA TYPE= NMR SPECTRUM
##DATA CLASS= NTUPLES
##ORIGIN= Bruker BioSpin GmbH
##OWNER= nmr
$$ XWIN-NMR		Version 3.5
$$ Tue May 16 09:20:52 2006 GMT Daylight Time (UT+1h)  MAYBRIDGE\nmr@NMR_250MHZ
##.OBSERVE FREQUENCY= 250.131544655141
##.OBSERVE NUCLEUS= ^1H
##.ACQUISITION MODE= SIMULTANEOUS (DQD)
##.ACQUISITION SCHEME= undefined
##.AVERAGES= 16
##.DIGITISER RES= 18
##SPECTROMETER/DATA SYSTEM= dpx250
##.PULSE SEQUENCE= zg30
##.SOLVENT NAME= DMSO
##.SHIFT REFERENCE= (INTERNAL, DMSO, 0, 16.5207)
##AUDIT TRAIL= $$ (NUMBER, WHEN, WHO, WHERE, WHAT)
$$ ##TITLE= Audit trail, XWIN-NMR		Version 3.5
$$ ##JCAMPDX= 5.01
$$ ##ORIGIN= Bruker BioSpin GmbH
$$ ##OWNER= nmr
$$ C:\u/data/dgb/nmr/ADRS/4360/pdata/1/auditp.txt
$$ ##AUDIT TRAIL=  $$ (NUMBER, WHEN, WHO, WHERE, WHAT)
(   1,<2006-05-16 09:20:30.05 +100>,<MAYBRIDGE\nmr>,<NMR_250MHZ>,
      <created by zg, POWCHK disabled, PULCHK disabled
       configuration hash MD5:
       84 BC 41 DB A1 6E 1D 46 DA 25 12 A5 C1 ED C5 3A
       data hash MD5: 64K
       8A 50 B9 EF EE 4B 87 3C B2 75 07 9E C9 49 02 9D>)
(   2,<2006-05-16 09:20:43.02 +100>,<MAYBRIDGE\nmr>,<NMR_250MHZ>,
      <Start of raw data processing
       ef LB = 0.3 FT_mod = 6 PKNL = 1 SI = 32K 
       data hash MD5: 32K
       E8 40 EC CA 0B B3 C5 55 D9 C8 99 77 F9 3F 20 62>)
(   3,<2006-05-16 09:20:44.72 +100>,<MAYBRIDGE\nmr>,<NMR_250MHZ>,
      <apk 
       data hash MD5: 32K
       1B E9 BF A0 4C F4 03 5A FE 5E E9 C2 54 D7 A2 8E>)
(   4,<2006-05-16 09:20:45.55 +100>,<MAYBRIDGE\nmr>,<NMR_250MHZ>,
      <abs ABSG = 5 
       data hash MD5: 32K
       96 6F 4F 3E 5D F3 5F 5F 15 11 46 81 1A 67 DF E9>)
$$ ##END=
$$ 
$$ hash MD5
$$ 6D CB 6F 0B 2D 71 DE 6D 1C 83 3B 51 BE 85 CC 9E
##$RELAX= 
##$RELAX= 
##$RELAX= 
##$RELAX= 
##$RELAX= 
##$RELAX= 
##$RELAX= 
$$ Bruker specific parameters
$$ --------------------------
##$DU= <C:\u>
##$EXPNO= 4360
##$NAME= <ADRS>
##$PROCNO= 1
##$TYPE= <nmr>
##$USER= <dgb>
##$AMP= (0..31)
100 100 100 100 100 100 100 100 100 100 100 100 100 100 100 100 100 100 
100 100 100 100 100 100 100 100 100 100 100 100 100 100 
##$AQSEQ= 0
##$AQ_mod= 3
##$AUNM= <au_zg>
##$AUTOPOS= <7 >
##$BF1= 250.13
##$BF2= 250.13
##$BF3= 250.13
##$BF4= 250.13
##$BF5= 500.13
##$BF6= 500.13
##$BF7= 500.13
##$BF8= 500.13
##$BYTORDA= 1
##$CFDGTYP= 0
##$CFRGTYP= 5
##$CHEMSTR= <none>
##$CNST= (0..31)
1 1 145 1 1 1 1 1 1 1 1 1 1 1 1 1 1 1 1 1 1 1 1 1 1 1 1 1 1 1 1 1 
##$CPDPRG= <>
##$CPDPRG1= <>
##$CPDPRG2= <>
##$CPDPRG3= <>
##$CPDPRG4= <mlev>
##$CPDPRG5= <mlev>
##$CPDPRG6= <mlev>
##$CPDPRG7= <mlev>
##$CPDPRG8= <mlev>
##$CPDPRGB= <>
##$CPDPRGT= <>
##$D= (0..31)
0 1 0 0 0 0 0 0 0 0.06 0 0 0 0 0 0 0.0002 0 0 0 0 0 0 0 0 0 0 0 0 0 0 
0 
##$DATE= 1147767629
##$DBL= (0..7)
120 120 120 120 120 120 120 120 
##$DBP= (0..7)
150 150 150 150 150 150 150 150 
##$DBP07= 0
##$DBPNAM0= <>
##$DBPNAM1= <>
##$DBPNAM2= <>
$$ [...]
##$SUBNAM7= <"">
##$SUBNAM8= <"">
##$SUBNAM9= <"">
##$SW= 20.6930455092707
##$SWIBOX= (0..15)
0 0 3 0 0 0 0 0 0 0 0 0 0 0 0 0 
##$SW_h= 5175.983436853
##$TD= 65536
##$TD0= 1
##$TE= 295.16
##$TE2= 300
##$TE3= 300
##$TEG= 300
##$TL= (0..7)
0 120 120 120 120 120 120 120 
##$TP= (0..7)
150 150 150 150 150 150 150 150 
##$TP07= 0
##$TPNAME0= <>
##$TPNAME1= <>
##$TPNAME2= <>
##$TPNAME3= <>
##$TPNAME4= <>
##$TPNAME5= <>
##$TPNAME6= <>
##$TPNAME7= <>
##$TPOAL= (0..7)
0.5 0.5 0.5 0.5 0.5 0.5 0.5 0.5 
##$TPOFFS= (0..7)
0 0 0 0 0 0 0 0 
##$TUNHIN= 0
##$TUNHOUT= 0
##$TUNXOUT= 0
##$USERA1= <user>
##$USERA2= <user>
##$USERA3= <user>
##$USERA4= <user>
##$USERA5= <user>
##$V9= 5
##$VALIST= <valist>
##$VCLIST= <CCCCCCCCCCCCCCC>
##$VD= 0
##$VDLIST= <DDDDDDDDDDDDDDD>
##$VPLIST= <PPPPPPPPPPPPPPP>
##$VTLIST= <TTTTTTTTTTTTTTT>
##$WBST= 1024
##$WBSW= 4
##$XGAIN= (0..3)
0 0 0 0 
##$XL= 0
##$YL= 0
##$YMAX_a= 335156
##$YMIN_a= -464438
##$ZGOPTNS= <>
##$ZL1= 120
##$ZL2= 120
##$ZL3= 120
##$ZL4= 120
##$ABSF1= 16.52072
##$ABSF2= -4.172453
##$ABSG= 5
##$ABSL= 3
##$ALPHA= 0
##$AQORDER= 0
##$ASSFAC= 0
##$ASSFACI= 0
##$ASSFACX= 0
##$ASSWID= 0
##$AUNMP= <proc_1d>
##$AZFE= 0.1
##$AZFW= 0.1
##$BCFW= 0
##$BC_mod= 0
##$BYTORDP= 0
##$COROFFS= 0
##$CY= 12.5
##$DATMOD= 1
##$DC= 0
##$DFILT= <>
##$DTYPP= 0
##$F1P= 14.0000005364418
##$F2P= -0.99999901652339
##$FCOR= 0.5
##$FTSIZE= 32768
##$FT_mod= 6
##$GAMMA= 0
##$GB= 0
##$INTBC= 1
##$INTSCL= 1
##$ISEN= 128
##$LB= 0.3
##$LEV0= 0
##$LPBIN= 0
##$MAXI= 10000
##$MC2= 0
##$MEAN= 0
##$ME_mod= 0
##$MI= 0
##$NCOEF= 0
##$NC_proc= -5
##$NLEV= 6
##$NOISF1= 0
##$NOISF2= 0
##$NSP= 0
##$NTH_PI= 0
##$NZP= 0
##$OFFSET= 16.52072
##$PC= 1
##$PHC0= 159.571
##$PHC1= 11.01002
##$PH_mod= 1
##$PKNL= yes
##$PPARMOD= 0
##$PSCAL= 4
##$PSIGN= 0
##$REVERSE= no
##$SF= 250.130000319351
##$SI= 32768
##$SIGF1= 0
##$SIGF2= 0
##$SINO= 400
##$SIOLD= 32768
##$SREGLST= <1H.DMSO>
##$SSB= 0
##$STSI= 32768
##$STSR= 0
##$SW_p= 5175.98343685301
##$SYMM= 0
##$S_DEV= 0
##$TDeff= 65536
##$TDoff= 0
##$TI= <Analysis number 999999
Compound Code 99
Book Reference 9
Project Code 9>
##$TILT= no
##$TM1= 0
##$TM2= 0
##$TOPLEV= 0
##$USERP1= <user>
##$USERP2= <user>
##$USERP3= <user>
##$USERP4= <user>
##$USERP5= <user>
##$WDW= 1
##$XDIM= 32768
##$YMAX_p= 356494265
##$YMIN_p= -1129592
$$ End of Bruker specific parameters
$$ ---------------------------------
##NTUPLES= NMR SPECTRUM
##VAR_NAME=  FREQUENCY,     SPECTRUM/REAL,   SPECTRUM/IMAG
##SYMBOL=    X,             R,               I
##VAR_TYPE=  INDEPENDENT,   DEPENDENT,       DEPENDENT
##VAR_FORM=  AFFN,          ASDF,            ASDF
##VAR_DIM=   32768,         32768,           32768
##UNITS=     HZ,            ARBITRARY UNITS, ARBITRARY UNITS
##FACTOR=    0.157963299565203, 1,           1
##FIRST=     4132.32758086413, 0,            0
##LAST=      -1043.65585598888, 0,           0
##MIN=       -1043.65585598888, -1129592,    0
##MAX=       4132.32758086413, 356494265,    0
$$ Real data points
##PAGE= N=1
##DATA TABLE= (X++(R..R)), XYDATA
$$ [...]
28225 86410 -57484 -26833 -20609 -91676 -184758 97818 247075 50230 19961 113539 49195
28214 49195 30304 194007 226891 154256 194857 148335 258921 137683 11366 61754 112099
28203 112099 280809 180331 6414 -76112 -90410 -50029 71895 -93647 -154327 -43837
28193 -43837 -153939 -71495 260346 382912 247393 51464 -8090 39886 202074 94998
28183 94998 -25340 90871 -109301 -163865 56524 346632 239187 151982 166095 149524
28173 149524 270790 378421 293605 14250 -37228 -198333 -298605 -149411 100490 8905
28163 8905 -127183 -195395 -147626 -318769 -145512 179533 464389 496168 506306 460190 295329
28152 295329 301218 350518 345997 363354 358248 472154 537775 461697 501741 318231 283127 353068
28140 353068 368712 406549 192157 128562 289096 358373 267675 91558 6660 91005 17433
28129 17433 -19540 -20792 -34615 -107452 -42023 88878 171530 293171 136999 291115 259105
28118 259105 381887 307404 221271 278962 341380 244448 163271 163423 -3993 -126815 -121719
28107 -121719 -48597 -67115 -334349 -487071 -408046 -338135 -353115 -136662 -53854 -63585 76877
28096 76877 186440 -5950 -37294 6688 -130930 41185 314311 227669 184814 116710 -57481
28085 -57481 -157958 -178630 -254662 -279105 -91631 -51438 4904 171379 159607 195848 136785
28074 136785 50190 119703 201313 -3470 -133429 -75656 -531 -85755 -213764 -284318 -353936
28063 -353936 -168929 130343 249310 347447 342150 44904 -39729 101298 153600 92864 34631
28052 34631 142631 191735 194884 34930 133862 55863 -85363 -16469 158669 103020 15891
28041 15891 164977 266443 318754 244473 137830 281071 170711 156623 174032 217144 258806
28030 258806 86311 49249 24034 89317 198876 416504 559066 304288 313729 348765 283773
28019 283773 196494 -13824 -296313 -292573 -73315 -27517 -241933 -276326 -215826 -118803 -135931
28008 -135931 -52320 32884 26846 2122 -191836 10102 -77757 48738 202754 252943 258174
27997 258174 202264 221362 157758 171750 237729 369314 343886 227737 139878 112488 349486
27986 349486 272240 112694 203860 125993 -83859 -259759 -102077 119537 186609 116916
27976 116916 128190 -35160 -38793 209133 423955 220110 64585 326535 353190 123452
27966 123452 -23497 -23457 55684 202231 164764 39336 -218798 -84312 61584 247411 138130
27955 138130 297144 188578 -69861 -90037 28841 -50137 -125236 -160992 -314770 13998
27945 13998 239165 186121 152643 185350 -67174 -304773 -347199 -301249 -253654 -172865 -45542
27934 -45542 -7538 60641 106831 181954 397794 496701 395980 455344 457626 431035 301051
27923 301051 143289 91586 14509 -156490 -93134 33143 -25673 -247068 -366347 -337126
27913 -337126 -136296 -92337 313339 294198 29795 122877 48152 181090 310327 411564
27903 411564 492910 422839 535318 461932 285679 112312 -226937 -108684 103607 3177
27893 3177 -98252 -85999 -175667 -59379 -260818 -311675 66987 217339 239753 115464 -66665
27882 -66665 -104839 -255766 -240005 -188608 -280405 -205107 -100245 -57446 12832 102111 116529
27871 116529 282870 171221 103919 122752 12230 -140154 -160984 -34857 214077 284749
27861 284749 292453 227636 328871 174302 7705 -36746 143267 108151 142842 249536 167614
27850 167614 -8041 -135000 -177510 -204143 -129312 -37496 -9129 164976 295125 408227
27840 408227 277245 324032 419556 473120 430018 400102 226114 225375 185416 -70267 -158123
27829 -158123 149733 501952 395442 62472 -131956 -279246 -269207 -18265 -2339 55536
27819 55536 215398 111728 191682 314058 233693 156373 200054 221012 136259 90337 3180
27808 3180 -152876 -221294 -130838 -30704 -68577 -185511 -309391 -263792 -46849 123016 181656
27797 181656 -122269 -21784 205230 48898 -157724 -149796 13418 -106831 -215698 -352864
27787 -352864 -295757 -236105 -14576 209106 83788 -7138 -63952 98742 -28671 -64184
27777 -64184 -336622 -383001 -275231 -142818 148030 109899 -139183 24298 281137 124217
27767 124217 42169 91784 59830 16150 75470 195616 150425 18039 -141471 -174356 -122964
27756 -122964 -114095 115448 199639 8784 -102687 -137186 -153234 -85716 2145 182341 300481
27745 300481 337849 245131 51622 5153 -65799 -19930 -20187 16994 131257 241522 239369
27734 239369 138049 81673 89072 95132 56215 93176 53980 49469 47505 157686 4839 99119
27722 99119 156847 96241 185796 215056 196137 58547 -22791 10195 -63902 -28892 -76956
27711 -76956 53966 179612 181339 21488 -125534 102580 189575 -61851 -320726 -236560
27701 -236560 24744 141534 81518 1579 -227762 -348141 -338356 -9903 168764 460812
27691 460812 377209 178309 181561 337161 170560 56994 20393 29685 83395 61619 102355
27680 102355 47418 203270 237136 -83731 -124888 -10556 351712 413350 97542 -74003
27670 -74003 12978 -37736 89361 -3908 -109353 -211293 -91901 7370 92096 109639 46752
27659 46752 -202294 -268777 -313816 -218800 -192047 -103190 -36361 -142404 -162567 -108154 -53202
27648 -53202 -55441 77460 116450 63366 15834 28827 -23866 -181379 -260822 -179305 -151492
27637 -151492 -194115 -142574 -174800 -116187 -116812 -184599 -161246 -172098 -270119 -158797 -182208 -202517
27625 -202517 -230357 -210044 -182440 -169760 -256238 -128749 94111 113934 20193 -21046 101648
27614 101648 154373 79723 164248 -43711 -30569 -73004 61526 -7006 65746 83347 125124
27603 125124 -109038 -193679 -98990 -25685 146369 143521 110854 -93747 -137868 100490 256612
27592 256612 226284 11011 -80945 9989 -75845 -140267 -69985 -58233 -13252 57138 215861
27581 215861 310412 94109 -68678 81947 129553 -33270 26940 104275 230919 193486
27571 193486 102623 187271 80990 146786 -12137 9173 74181 26125 149530 335846 232289
27560 232289 167844 182584 223089 188981 149795 205021 372714 392398 308155 330015 251488
27549 251488 129303 36950 -1998 -177629 -195868 37161 124019 -62576 -13488 156687
27539 156687 157103 87982 64613 61588 23852 -15747 -168250 -81167 88805 259156 431508
27528 431508 267370 60089 291149 358884 187410 159475 131922 45478 72412 2754 -98954
27517 -98954 -78309 -59941 -360884 -435792 -404602 -216011 -59685 -60576 -77652 -12184 -2895 2736
27505 2736 -35181 28367 13414 -284102 -428760 -135036 33531 199230 176871 93360 26357
27494 26357 37886 -719 99568 189349 238040 274746 333848 192447 21948 79887 128031
27483 128031 194732 135036 181621 204124 -139498 -256123 -118528 -47938 -28066 125172 120822
27472 120822 1930 123412 -62627 33917 251977 234346 169598 -67108 -250653 -108532
27462 -108532 87379 124856 228769 313137 456844 262626 58031 28994 63708 107054
27452 107054 44476 -37651 -178423 70425 85521 62909 151095 77521 -41020 -180060 -141682
27441 -141682 -180481 -225641 -282034 -167759 110954 101558 -82049 -96931 65320 83860 -186515
27430 -186515 -234747 -143909 111060 85671 136791 451959 638361 627397 530021 298986 127739
27419 127739 -20911 78354 189295 134073 156369 240244 228728 126593 188605 200415 115616
27408 115616 53025 75854 155908 303595 302791 245118 381682 447277 435709 285327 257147
27397 257147 304370 360263 429667 333923 316279 165063 -113699 -81686 102357 223854 300734
27386 300734 217526 383097 387730 180701 44906 -164847 -260123 -251719 -253968 -191235 -115841
27375 -115841 -75998 -162319 -38233 -77150 -169982 -123302 -217322 -73996 -47690 -109680 -208639
27364 -208639 -149288 45994 23411 157168 204458 282610 133575 -86658 -77212 -82038 -112928
27353 -112928 93940 148094 96813 101320 147844 68736 61888 35958 36093 -56038 -3368 173622
27341 173622 197355 180842 77934 -21313 -7209 -109769 -60839 -83904 -221947 -162689 30798
27330 30798 95804 242518 268663 244926 351999 219802 115457 71984 -5911 205154 294213
27319 294213 63753 37568 123643 79507 23781 179481 210227 174436 84559 20116 55881
27308 55881 -118810 -333949 -435999 -249997 15334 198888 270058 246151 87181 -65583
27298 -65583 -216764 -250871 -170829 -253577 -291082 -43765 191170 268829 203483 -37313 -140961
27287 -140961 -176938 -67042 -12969 84955 49455 12900 55917 368797 310055 87370 -34057
27276 -34057 -130769 -57706 248872 159958 16462 -24142 70406 4711 176278 315804 397805
27265 397805 520142 372673 197851 140727 -82177 -143055 -287901 -242804 -111419 42675
27255 42675 46435 37646 -113945 -104084 18827 61811 -15902 -105657 -125187 -204803 -122674 -111553
27243 -111553 -58757 162130 192125 105326 117230 -3380 -47574 189124 169195 179709 94280
27232 94280 16712 234805 318136 194724 88661 100903 111352 59903 39983 89674 132229
27221 132229 175077 87809 140722 157842 360814 176919 147259 -77867 -159135 -35614 -34707
27210 -34707 -246763 -437304 -292219 -46854 -6632 207381 273422 95084 36553 -6090
27200 -6090 -96938 -254901 -392429 -368715 -328252 -425520 -268319 -226711 -328826 -222062 69406
27189 69406 9371 -115693 -157704 -158923 -224846 -458814 -465631 -235318 -48200 62662 187275
27178 187275 35122 162403 335142 468908 594754 442376 232022 257255 223723 192623
27168 192623 259782 301432 47827 -301033 -465090 -282995 -125125 24751 186173 139056
27158 139056 155097 -58755 -229059 -20084 -28827 -176959 -149252 -12719 -84476 -22215 168216
27147 168216 24905 61600 118151 15363 -155046 -130313 -222631 -134399 -105970 -179246 -302774
27136 -302774 -184126 -198357 -93653 -1950 -136125 -143944 -478615 -516667 -280684 -266480 -352200
27125 -352200 -186817 73940 221218 273218 225807 138706 111627 186813 259365 182735 72086
27114 72086 -108715 -90346 -76678 -12278 72820 114953 95371 -39520 -66383 60593 65716
27103 65716 140456 239844 264205 142780 121788 46711 -14303 50680 -135671 -393933 -507294
27092 -507294 -442232 -308461 -40731 325382 307734 89833 -78790 -272007 -351065 -269364
27082 -269364 97898 281233 205859 134965 193488 255323 169284 132214 233969 197115 78575
27071 78575 -20201 25525 68520 -121095 -400808 -307409 -338291 -208577 -13669 -50885 -23935
27060 -23935 179580 279066 61060 -32479 -87935 40055 153436 143275 167939 413604 344661
27049 344661 196387 85214 162687 150211 295205 351332 186551 80460 246869 185517
27039 185517 -10904 -44344 101114 115806 57386 3109 -48455 -34171 -41463 -19813 98621
27028 98621 69553 4622 -21374 129548 284712 116125 97289 194995 344875 341289 263071
27017 263071 166476 -75102 -270661 -277970 -112278 29816 24700 -45060 -197455 -211748 -213194
27006 -213194 -242421 -282128 -316874 -254093 -255969 -213373 28684 302210 534668 334123 68600
26995 68600 -32547 -10251 30388 -96418 -196664 -35268 152531 102705 58469 -10756 28982
26984 28982 -66986 -98853 33991 -4188 18259 123987 166433 -12707 5209 156995 208632
26973 208632 231500 304415 202996 105682 -64314 58454 116148 243975 358046 72750
26963 72750 -210022 -317433 -394957 -394417 -190870 82528 201817 153672 -176197 -343084 -182780
26952 -182780 -83262 4847 -118869 -57677 21005 123189 202209 188365 108809 74275 67128
26941 67128 29146 45938 39029 90139 171576 221518 77419 8582 97616 117664 339276
26930 339276 389240 246866 89851 153552 200834 74745 -16629 109025 132282 -58001
26920 -58001 -80269 -96028 -66326 -6890 -31395 166607 -20898 -339669 -264893 -248666 -119874
26909 -119874 -29122 -25085 -28038 59805 212515 174836 56957 -87299 107376 -68216 -298259
26898 -298259 -208325 -67031 112114 110230 206127 386825 253869 48490 13674 54442 56855
26887 56855 75715 3813 -148928 -92603 49662 -93547 -29054 12196 -46085 -217137 -264994
26876 -264994 -124552 -173802 -307666 -286197 -12677 236548 -88762 -173380 -24312 120514
26866 120514 52687 -77975 -20479 136003 138772 -153784 -190559 -25246 66312 114139 268165
26855 268165 424404 205051 -160632 -361806 -257456 -126897 -79295 47999 121525 101470
26845 101470 11442 -44721 -78368 -191188 -78838 -5931 -4849 42008 52381 -112356 -126028
26834 -126028 -65319 44618 15945 -75446 127667 316721 609892 500164 193189 -69250
26824 -69250 -117115 -238833 -190507 -76651 -225140 -248623 7221 253780 404445 259369
26814 259369 136978 -96441 -250020 -251477 34305 97193 189800 22488 9974 289409
26804 289409 355307 65147 -21702 -67706 -136870 -241757 -45571 163348 262243 199442 244939
26793 244939 79807 -167454 -193138 -213519 -227274 -47437 -29569 -15861 119078 101768 137668
26782 137668 379583 295574 216066 113791 5647 -96333 -154569 -287791 -347676 -330471
26772 -330471 -401524 -420176 -375399 -218869 -136519 -54979 -132614 -131480 -132403 -229170 -342278 -133269
26760 -133269 74276 157822 27652 -26450 -221394 -244795 -108840 -75868 -68623 -127549 -125941
26749 -125941 -86818 -181014 -103132 107013 97483 45347 15108 229157 102021 -178757 -75401
26738 -75401 92321 154418 213916 36657 -129568 -162877 63855 193883 343446 393458
26728 393458 246438 273234 355446 305026 39420 -107057 -110004 191451 293833 94875
26718 94875 72404 210865 171357 67921 -36250 -54505 79911 23259 -240268 -361488
26708 -361488 -392630 -386845 -341292 -419728 -187405 193072 -23126 -297098 -366649 -236361 -199071
26697 -199071 -162166 -214866 -28527 109177 182116 247102 115773 62436 -942 -27656 -101819
26686 -101819 -246057 -243388 -99797 -153563 -256373 -219855 -345228 -287349 -193410 -117977 247159
26675 247159 378540 195302 255627 210200 208181 279938 193833 -45233 -153154 -94774 8863
26664 8863 -113732 -160263 -121798 -60031 -20262 50737 81437 96607 89169 18787 38727 174433
26652 174433 -66914 -202371 -5772 73006 -86390 3022 -5034 -39665 -36051 -27647 -89724
26641 -89724 -425405 -392895 -495302 -554990 -327486 -455815 -328050 -331689 -399353 -552270 -276532
26630 -276532 37546 302138 78250 34455 33072 -126209 -278773 -181700 16099 61707
26620 61707 -45710 118206 198981 188920 199002 188389 -34773 -257219 -293506 -364146 -393398
26609 -393398 -290283 -206421 -169314 -36876 -47186 -172799 -321060 -255861 -195190 -246239 -199600
26598 -199600 -166109 -178384 -233483 -70165 42169 -9800 -27839 -291072 -305458 -27387 13874
26587 13874 25182 125699 190146 410730 434353 464835 440758 406939 437779 465887 341403
26576 341403 265909 298232 170320 217844 207739 181693 285208 403724 440454 260453 39351
26565 39351 5362 -49581 10533 234714 332209 264234 176082 339866 246174 125120 133191
26554 133191 73916 64493 91586 -83624 -195356 -192955 -69051 74338 122474 128374 -38799
26543 -38799 -78454 -29203 236825 371828 -18555 -288952 -235250 -110122 62392 20675
26533 20675 -46213 -11984 -34233 -170962 41865 369832 508369 421431 73740 -5292 87994
26522 87994 -60449 -146243 61438 42101 140585 -26208 -64691 -54125 -97063 -103893 -170431
26511 -170431 -308537 -377414 -466197 -200763 -173529 -146769 -211692 -89860 182743 203664 -113110
26500 -113110 -480576 -377729 -165334 14477 171229 234501 166215 105809 -34779 22807
26490 22807 191617 180552 63466 -10921 -32601 5609 -27259 -43083 -76614 14192 79828
26479 79828 36254 24024 6375 -101963 -3077 163816 178772 201616 248186 129119 128636
26468 128636 69616 8257 23997 -37071 -81649 -138696 7538 69121 27820 39010 -50037
26457 -50037 146320 104602 -70891 -152210 -114739 -26494 -127945 -92081 -64314 -76161 -4774
26446 -4774 8844 -41875 53028 -155720 -259262 -102464 27804 22436 131612 49873 63884
26435 63884 -118829 -330657 -327256 -286028 -288415 -82737 185475 425550 352355 77784 -9043
26424 -9043 73179 174517 143301 -5922 2187 38676 142872 125694 219516 248150 105227
26413 105227 68166 -116981 -363391 -563451 -572676 -395228 -120141 -193670 -355469 -510179
26403 -510179 -549584 -383127 -444228 -439249 -453870 -522340 -245081 -202152 -324773 -593360 -699490
26392 -699490 -651205 -502966 -107291 18881 -33403 -111917 -65401 95589 61315 -232990
26382 -232990 -236695 -17533 -39947 91129 78543 162643 338980 235017 16244 -155017
26372 -155017 -57625 194285 203409 177634 127583 260585 305336 234315 142109 1373 88308
26361 88308 156312 158797 131291 3772 -27556 26069 -90456 -87821 -239910 -283371 -37879
26350 -37879 -227193 -295834 -151337 -289882 -444866 -457419 -219146 -159072 -217793 -59424
26340 -59424 -68092 41528 81599 -20340 -124160 -42744 -102697 -110957 -121161 -98800 -41554
26329 -41554 -114421 -217091 -96862 -86182 -408720 -307021 -158523 -145910 -295479 -294386 -425838
26318 -425838 -422463 -159786 -136096 -146796 -197982 -88107 -140722 -14774 22945 -84503 -44572
26307 -44572 -44623 56147 116592 206781 271683 195296 59783 -19289 -109860 -149412 45578 233384
26295 233384 179900 40087 -2663 -22679 176358 236514 114558 141403 406951 224932
26285 224932 117641 150710 25191 5877 106282 94246 -29936 15685 43668 103481 -5648
26274 -5648 -93137 96615 315457 376753 330610 288838 424024 570125 374500 149971 -23894
26263 -23894 -36795 -68460 44906 -143591 -210266 -21225 63401 -63526 123600 315481
26253 315481 95811 -39930 -161759 -319654 -239757 -270452 -335540 -197394 -11762 -109273
26243 -109273 -295444 -320394 -154887 -91477 42147 -24318 -189273 -58828 27304 -78800
26233 -78800 48147 13595 162177 46225 83316 114536 129020 -59610 -108995 55307 241028
26222 241028 67065 -24747 -230667 -400684 -169983 -219288 -297336 -308940 -352913 -416043 -309640
26211 -309640 -197183 -72112 71749 47217 10540 110996 324490 364683 373351 321115 203967
26200 203967 313928 481756 536748 459543 384144 295940 25181 -211538 -305792 -242107 -115334
26189 -115334 -106761 -39175 24326 -101071 -271450 -390016 -483414 -395703 -275981 -319309 -330987
26178 -330987 -117746 167283 244974 172419 266388 196498 326754 492719 295498 160218
26168 160218 101450 198995 229138 336824 227912 33828 -108551 -133140 -2294 -4250 -157819
26157 -157819 -200614 -76942 6536 -66720 -179693 -299634 -198912 -228450 -379073 -311852
26147 -311852 -377777 -337063 -152398 -119843 -280526 -157204 -169551 28847 159445 430081
26137 430081 514107 312725 118490 -27759 5330 -85673 27314 204961 295121 80465
26127 80465 57890 117030 -18210 21717 104814 192536 12278 -244931 -163241 71038 200015
26116 200015 90807 -100053 -271603 -184741 -92322 28225 96246 132683 391798 390532 343442
26105 343442 367299 202529 147628 149660 192849 232800 214020 332319 154421 112113 91333
26094 91333 72162 131359 143765 113728 53532 -168807 -327665 -305088 -156479 -36437 87645
26083 87645 95686 1246 7118 -24101 154662 332964 249818 281965 396716 496400 573683
26072 573683 562534 453339 460708 416565 237714 7962 122671 186546 -17844 -179221
26062 -179221 -189124 -140297 -276648 -271027 -115958 -73715 -46525 60229 172523 25387 11698
26051 11698 -95796 -296614 -271374 -242325 -187769 -99142 67675 146326 -106793 -321054 -220716
26040 -220716 -210430 -256271 -309141 -256717 -123165 -70407 29532 -40937 -198024 -229419 -253296
26029 -253296 -119281 -197095 -42415 52577 -16142 -143688 221016 311596 104521 34327
26019 34327 277825 192283 389726 287303 212174 197251 247770 170734 51661 -41412 -79350
26008 -79350 -227413 -330524 -216122 72016 142534 208774 385254 392128 188124 99112 -30042
25997 -30042 -102158 -52828 24533 48301 -59742 -219802 -404374 -440575 -359957 -197311 -151726
25986 -151726 -205450 -254825 -350573 -331762 -232686 -132478 -92453 -169546 -178312 -331834 -375409
25975 -375409 -344541 -313591 -88689 274485 411127 261270 188934 304788 337019 63547
25965 63547 27212 -106146 -68242 -65905 -38890 125107 224450 130092 -11994 -28758 135179
25954 135179 144033 -146434 -272932 -237342 -152064 -163533 -203788 -213231 -89651 -28197 -29357
25943 -29357 -42981 -27692 -102516 -308331 -432528 -205937 -3340 37440 -104045 38997
25933 38997 80894 163334 316517 285587 297791 327243 459313 129751 -228176 -307725 -150316
25922 -150316 -198508 -223643 -273326 -174787 -123971 -89200 -53160 27813 70625 92547 83675 157020
25910 157020 181918 389438 434676 324544 293543 43820 -53934 31234 159053 246697 392798
25899 392798 627716 539516 400334 327696 84815 109569 95975 45872 249479 229645 109872
25888 109872 55618 73450 90095 1847 31561 10539 51882 143489 151156 259153 342551
25877 342551 207535 -30154 -27149 35848 152314 -15548 103738 184985 52596 185712
25867 185712 300388 392181 401438 225157 36299 -59968 -73511 -23378 150239 -41234 -307651
25856 -307651 -291426 -36807 52853 161212 -7892 -178040 8557 18789 -2912 81238
25846 81238 194613 58513 46581 160099 307068 245484 -43575 -166460 -150669 1351
25836 1351 106743 118933 127755 161352 158484 364912 263471 242623 324883 332616 174313 -136998
25824 -136998 -362928 -249420 -57355 35501 109508 -40744 28312 -49008 -97371 140234
25814 140234 284694 68851 -62644 -70718 -71291 85474 128412 -31336 -112880 131887 170952
25803 170952 -59002 -453862 -526962 -250250 -141407 -145770 -6111 -142538 -167876 -32339
25793 -32339 10355 178773 203685 -151621 -266014 -192219 -348074 -238197 -135099 -190467
25783 -190467 -286625 -220918 -130675 -21387 242874 63912 25606 -147086 -294013 -140534
25773 -140534 -33349 -92895 82698 269622 343947 429489 464953 198684 -38829 -112809
25763 -112809 123865 206528 4000 -16729 -59933 9025 151368 109162 -63910 -9209 133920
25752 133920 115580 -54199 -87288 18973 163761 127272 -210378 -222771 -60204 66147
25742 66147 197449 248995 244391 23842 -136448 -128972 -38480 -130014 -48443 65666 70386
25731 70386 -27912 -38677 138631 295110 220759 142723 134387 50583 -50043 -166911 -291507
25720 -291507 -396811 -351270 -301374 -37316 -16019 -71615 85811 75703 55887 88160 129724
25709 129724 239075 359905 296957 171569 -47518 -238066 -401226 -289430 -303889 -333513
25699 -333513 -144114 50718 182549 271000 306827 79061 -81749 -16541 57517 -148459
25689 -148459 -210571 -174901 -394496 -402693 -337017 -150347 13442 169894 46516 -174634
25679 -174634 -125489 93264 260765 215118 59532 55416 26560 190789 228043 62425 -33088
25668 -33088 21643 18902 296283 330349 145224 19184 84437 31883 76800 30205 -151268
25657 -151268 -183276 87255 187547 -53684 -437521 -456289 -276454 -66729 22673 -46527
25647 -46527 -104612 197265 490694 493011 380899 329022 219136 -32728 -140246 -5420
25637 -5420 57597 182798 106698 66695 139578 -21017 -147067 -192582 -393889 -414259 -258354
25626 -258354 -56930 156237 189010 11222 186453 415631 154700 159680 318026 323591
25616 323591 236511 413203 460225 401004 219011 136874 94046 162949 74258 234912 255462
25605 255462 208179 246753 230424 99682 -45333 -210154 -200257 -14814 -89956 -99012 110767
25594 110767 96036 149198 106530 219397 257354 118628 74593 81243 7810 -99924 -11725
25583 -11725 44284 -104997 -136668 -242488 -257978 -318029 -270373 -212963 -279634 -280697 -50288
25572 -50288 26251 96631 339468 267253 92489 164596 263233 300171 290792 296484 254960 253532
25560 253532 131878 82647 -37047 94283 -9069 -1107 248359 144129 -172163 -278298
25550 -278298 -160884 -172119 -146862 -48603 217149 194857 154943 283978 181564 172499 80542
25539 80542 8930 -91723 -25306 -117185 -217201 -527423 -524241 -479300 -425633 -196923 -31179
25528 -31179 -115183 -328554 -265000 -53317 -8667 5378 24364 -78739 -61358 31509 -80220
25517 -80220 -87607 -158893 28061 178521 421872 446090 280196 216558 82833 -104512 -377289
25506 -377289 -468025 -416206 -474591 -556016 -478855 -285230 -232411 -158496 -57303 131904 195059
25495 195059 110767 138168 316681 154868 128621 275400 286090 52116 -121424 -190539
25485 -190539 -294948 -233705 -78520 -78089 -198286 -371593 -231030 -88084 17166 307406
25475 307406 342440 243004 139353 213386 154434 224712 151588 151081 34354 93710 100377 90378
25463 90378 106768 84349 -103328 -291464 -342874 -195321 -160331 -347997 -365771 -219012 -11728
25452 -11728 -59649 -252186 -229891 -166406 -27931 167388 161949 272161 163702 48920 50146
25441 50146 257467 279061 43060 -124438 -186953 -236638 -300567 -427257 -372710 -447234 -308751
25430 -308751 -112351 60631 279065 319038 169294 -80669 -34584 120952 28663 -159835
25420 -159835 -96001 -95539 -84505 56410 57478 -24989 -75970 -333053 -375768 -271132 -74055
25409 -74055 -20647 159090 149362 -6596 -77069 31497 20637 43261 56603 47110 41362 -54642
25397 -54642 32146 -59708 -184460 -136811 -86630 -50936 -121444 -260130 -216195 -70873 -75473
25386 -75473 -118603 -145901 -123381 -181683 -18775 99828 204701 136267 61104 -92006 -237757
25375 -237757 -291301 -265121 -312706 -209113 -166417 -89178 -18133 170254 234285 264183 218955
25364 218955 195619 260544 269809 139057 87819 182815 349919 271844 111926 144255 38262
25353 38262 17379 102435 252666 258911 230977 238739 298912 481291 333015 283076 110461
25342 110461 155229 144510 29225 -82598 -26615 22384 -147152 -245391 -222162 -198212 -277362
25331 -277362 -257898 -61719 79422 64381 3042 221817 243168 212150 331658 296805 270291
25320 270291 231588 -25302 -20641 64481 -30561 -71993 -10470 -172748 -285254 -289086 25022
25309 25022 208627 247590 119780 -34416 -47729 -179642 -362300 -629747 -506167 -406068
25299 -406068 -199239 -127926 -28878 -43024 -59287 -23183 56095 -3362 12649 156509 100494
25288 100494 -67577 -159218 -52160 29837 -27591 8721 -10356 -72334 2684 8711 6484
25277 6484 108353 172369 106957 -41890 -164898 -237305 -76543 79977 1697 -24676 71954
25266 71954 134706 40774 9597 25110 133271 76249 29648 19344 25122 -186466 -228174
25255 -228174 -61209 -59346 -153206 35870 -32407 -83046 -34035 -161912 -150598 -225964 -208985
25244 -208985 -279294 -281263 -335028 -335065 -340422 -328759 -191251 -105950 -71855 -195787 -173734 86380
25232 86380 -39239 136009 416688 411610 293826 310493 306054 325682 157706 131744 78401
25221 78401 -24868 -40850 7548 58566 85377 33019 -93876 -234952 -67453 8159 44681
25210 44681 27053 190956 180530 35098 37950 -63215 -78866 -3112 -82437 -257398 -280896
25199 -280896 -49651 50239 13023 155061 234808 294266 130388 -58013 -302254 -362089
25189 -362089 -283429 -238080 -106494 -186855 -172351 -101169 55552 100029 -51147 -43518 786
25178 786 -28304 227384 273568 30360 -194361 -230310 -189406 -72737 11804 71519 22578
25167 22578 71865 164655 254679 -100825 -292370 -316959 -357598 -82538 201578 291099 100382
25156 100382 11845 -130739 -160236 -155883 -187068 -235206 -229986 -56125 95332 -111762 -97887
25145 -97887 -91902 -301182 -224371 -164912 -141913 -47201 -45686 197706 184801 -41014 -119063
25134 -119063 -67879 135788 8092 34730 158123 235477 218438 98508 3075 -456 41701
25123 41701 234105 427729 382202 240401 85752 8720 137429 -106790 -78700 63882
25113 63882 55285 49507 205655 32001 -83661 -88444 -120699 19410 64044 118249 179345
25102 179345 74646 22797 53996 -13125 -23076 -256636 -269579 -99320 15509 135828 4478
25091 4478 -134261 8717 161734 56957 -145111 -307827 -288192 -455173 -448793 -355136 -311019
25080 -311019 -186994 -41154 -21016 -100781 -1021 161700 -3042 -60661 -198773 -101895
25070 -101895 93948 149336 61980 30093 140849 206788 -40182 -232890 -296644 45069
25060 45069 88587 37289 162662 34497 -131097 -172135 34303 -33734 -134029 69628
25050 69628 316314 458626 87802 -43699 33402 50962 -208569 -486097 -597271 -572157
25040 -572157 -273517 -108225 -161963 -436107 -408460 -260665 -380236 -234303 67307 67887
25030 67887 -31060 52298 74889 44824 99223 153725 245319 153396 -55624 -67284 -6088
25019 -6088 194419 258644 103074 -27121 -139839 -132997 7607 21175 -57601 4617 -22024
25008 -22024 -250966 -329313 -159893 -29732 115106 -75005 -49084 -157842 -230168 -167583
24998 -167583 -125138 -69935 230 156091 26680 -86918 -159638 -10498 -22832 20981 -65381
24987 -65381 -35608 -17900 113885 65210 219849 210245 -69946 -125879 -182819 -115016 -138366
24976 -138366 -131479 -219857 -292034 -499709 -566891 -532737 -268397 -108442 -183163 -192053 -224614
24965 -224614 -290082 -296619 -375058 -397605 -345402 -415176 -521444 -496253 -473247 -495553 -402794
24954 -402794 -457049 -460169 -332664 -314619 -378385 -150484 -44447 -65390 -208285 -339145 -453083
24943 -453083 -567479 -616116 -269073 69313 76629 132634 43236 -3347 -13197 37422 139081
24932 139081 186665 147758 -7322 -144625 -149938 -271712 -335860 -245690 -276269 -136591 -154236
24921 -154236 -275814 -173582 -256552 -175379 -75089 63754 182815 137359 197882 218412
24911 218412 68930 40714 152648 15973 -211773 -93151 -21185 -9477 25476 -207013
24901 -207013 -116128 46296 105840 27871 -110171 -32450 366025 477461 307654 -28232
24891 -28232 -159209 -229399 -375631 -250434 -72468 -113939 -93006 33445 13568 89914 69066
24880 69066 118363 165948 -100068 -26433 123087 175506 197464 160950 -54032 -411734 -449000
24869 -449000 -382892 -320674 -125484 -40653 -183361 -241064 -123911 -155761 -160292 -154280 -70889
24858 -70889 30966 111649 -26118 8899 17852 -113794 -103495 49071 171641 7755 -108701
24847 -108701 8419 33926 83837 150013 61751 -29942 -138461 -324747 -293208 26167 274844
24836 274844 133865 -31604 -7247 -84525 -198718 -95044 -41314 -21450 -40173 43949 -5340
24825 -5340 -35863 26566 195152 323926 235647 74074 -4717 50955 21496 -264867 -241762
24814 -241762 -215137 -79207 57678 244196 198598 -60806 -106037 -174904 -125059 -243226
24804 -243226 -222617 -77410 6462 -98139 -94504 -95437 926 -3931 -50974 111483 241952
24793 241952 476807 406086 140493 -122971 -196857 -136089 78029 -27781 -105983 -206483
24783 -206483 -163556 -99390 -95848 -110114 -274121 -121132 61619 62363 -19411 -99988 -108360 113339
24771 113339 362663 346094 91997 35611 -148834 -289694 -214151 -18648 43698 -22898
24761 -22898 -159855 -57346 39775 -97055 -48549 -139637 33842 -15198 -79588 -244893 -129403
24750 -129403 115437 217822 275494 98102 95022 19663 106267 257867 148366 117635 86062
24739 86062 -194909 -263099 -210846 -231077 -183826 -161750 51731 143969 14501 -72832 10348
24728 10348 270592 347455 429399 349878 244299 -10061 -264863 -263334 -377952 -421823 -349010
24717 -349010 -339435 -210135 -78193 99103 -15055 -144584 -92582 -157678 -272392 -252419
24707 -252419 -6422 123640 19958 -140072 -256964 -333800 -296501 -176431 -299227 -515713
24697 -515713 -418538 -299077 -73460 -121855 -187761 -49170 -141615 -283274 -163282 -18229
24687 -18229 151832 237995 409301 250631 192729 194218 -68045 -87065 -169872 -105925 -84563
24676 -84563 -86686 -97785 108241 198716 230758 -43358 -63326 103625 110272 214724 143856
24665 143856 66487 -47904 -269506 -222839 -164929 -203353 -200770 43595 -57873 -200708 -224402
24654 -224402 -59212 -85571 -30727 -40738 28708 46693 21395 -18409 -133605 -34001 118075
24643 118075 86178 -7808 -30542 -39575 -87651 -227753 -231219 -330148 -361916 -329969 -134441
24632 -134441 39346 57339 -166610 -256473 -240482 -218211 -225192 -233493 -251116 -121484 97412
24621 97412 71453 -112243 -252975 -291332 -256504 -130969 -210004 -256683 -218875 -290996 -212005
24610 -212005 -175754 -201996 -39706 -73157 -84226 -159076 -38224 -1079 -52130 176589 194307
24599 194307 163662 110671 158090 103924 14583 44427 -34917 -14912 -165148 -118757 122816
24588 122816 220477 304107 259364 85409 33131 168492 295606 361799 403150 193644 -38919
24577 -38919 -245995 -250658 -282726 -188912 44847 168634 189529 155140 118218 116905 245826
24566 245826 282106 255291 147895 170794 74821 51884 61660 263915 218181 256727 148820
24555 148820 -56926 -16624 163336 93511 85896 53133 21933 81876 250444 65208 -18930
24544 -18930 -50586 68741 127905 -14984 -167463 -249481 -247062 -339628 -184875 43285 -114961
24533 -114961 -256176 -285546 -174743 61977 -32805 -117705 -81992 -99712 -136212 -93760 -40032
24522 -40032 125525 77159 -138193 -208710 -94184 -235001 -103007 -86961 -50774 -161616
24512 -161616 -265398 2747 -81028 -179482 -261272 -18784 -44911 -3858 145025 181773 158672
24501 158672 -52764 -133265 -147154 -114824 -19851 -98169 -178902 -168021 -47255 46179 110354
24490 110354 -76621 -237727 -251350 -324012 -335341 -217772 50951 318853 322453 251510 33423
24479 33423 108580 112001 195245 185396 -67923 -290370 -384251 -298751 -223335 -276914 -194171 -103873
24467 -103873 -39802 165937 148151 -36629 -115201 -82399 -84328 -237049 -276790 -75353 -1672
24456 -1672 -109626 -81738 92853 90904 74371 13223 45920 27930 -44432 -450223 -440839 -181997
24444 -181997 -52956 -137751 -51868 112318 69512 49953 88117 42496 36447 -54012 1050
24433 1050 219158 296839 130387 -173868 -20584 161681 218574 237394 94296 65185 899
24422 899 -255342 -473244 -518353 -459227 -364854 130211 266423 247218 389064 328379 183081
24411 183081 174766 84973 94411 61651 31498 21623 -12288 48919 -27440 -86453 -283535 -216231
24399 -216231 -74267 -24719 46081 -4784 -139776 -37234 85304 97236 -107461 -288302
24389 -288302 -198849 -221091 -136731 -141018 -270821 -139040 22256 -51215 -198467 -140649 -49780
24378 -49780 -104855 -17709 -30768 -175315 -18038 83986 42492 -68217 -24858 -145098 -151554
24367 -151554 8878 63406 32073 -97982 75239 129245 40399 45192 -38484 203619 237908
24356 237908 99304 -27368 -106919 -158455 -66556 -95609 -168040 -290613 -124580 76000
24346 76000 -25586 153954 144813 219174 53365 -31895 -38086 25024 -13526 -973 279055
24335 279055 389851 264480 263596 185558 23934 -68791 39514 -64230 -232339 -88900
24325 -88900 50183 41633 16249 -6395 -1627 -9402 -230935 -422406 -566638 -254941 -225234
24314 -225234 -166240 -84852 -131658 -163926 -56767 -177606 -167260 -100227 -183872 -30143 -63978
24303 -63978 -255043 -263413 -111790 -264117 -280166 -184584 -194538 -97253 -32351 -80083 32542
24292 32542 197252 -11253 -239485 -182024 -180296 -209658 -180531 -214642 -194525 -206588 -145533
24281 -145533 -185340 -192831 11653 -139517 -257645 -326584 -99603 -41583 52763 -60894 21223
24270 21223 56237 170128 229070 188733 47137 18645 17256 30371 111539 140987 278626
24259 278626 120495 -67542 -159330 -342926 -432602 -457661 -515441 -332120 -221124 13716
24249 13716 78233 -102617 -114571 -137711 -158746 -32524 -41671 80455 26369 -87146 -257454
24238 -257454 -266029 -137537 173685 212834 78930 -37224 83732 293208 392866 260713
24228 260713 103394 46769 95314 114822 70653 112920 98707 178615 178032 187516 154951 306703
24216 306703 186108 -147628 -168306 -31420 -102705 -201794 -26169 34999 29468 -191818 -343237
24205 -343237 -224766 -79482 -71838 -15224 101952 237868 176602 185609 -1061 -173695 -223180
24194 -223180 -187248 2085 -58769 -173156 -371600 -136825 -26709 -81214 -253937 97521
24184 97521 441624 254099 212464 162259 -41632 -66475 -64248 54153 -14746 -73304 -26040
24173 -26040 177776 48084 -83813 -11077 -88548 -102256 -80298 -128231 -51005 -169879 -243778
24162 -243778 -124921 -16830 102692 72991 -6439 -174670 -319355 -419469 -237680 -217729
24152 -217729 -186250 -15046 -37795 -151093 -227504 -215611 -136274 39688 72215 2159 95067
24141 95067 246661 110243 30208 -60265 -121109 -148949 -101027 54101 172726 370939 230467
24130 230467 -122030 -174387 -34646 -145781 -247307 -140424 -208764 9469 96290 176935
24120 176935 76156 -92183 99955 171671 86927 179714 156352 -30867 -55563 93759
24110 93759 212355 142573 62138 72544 136380 76639 -73673 -126726 -215790 -376703 -431290
24099 -431290 -187819 325125 446852 171978 -74077 10997 259880 262603 114814 -81836
24089 -81836 -78161 -89331 157876 143609 158163 273650 142939 24850 -70416 -84564 100894
24078 100894 74118 115221 126235 -15351 41030 62231 58021 19753 4285 -104784 -24169
24067 -24169 150050 44760 -114977 -382115 -261137 19317 145165 83623 -44751 159623
24057 159623 287277 242819 258037 165792 125373 46275 -111568 -116525 -79972 -38271 -7838
24046 -7838 -17906 -114396 -274041 -233500 -112420 -63059 47572 76439 -60293 7829 -23587
24035 -23587 221093 311178 163266 -29704 -207103 -396991 -443810 -315182 -204961 -202875
24025 -202875 -52019 308125 311714 118222 -52402 26021 -3263 -174337 -170567 -204657 -61376
24014 -61376 4794 -32041 50636 -43540 -67282 -164497 -239311 -354628 -413600 -339968 -243247
24003 -243247 -148377 -47720 -208275 -215465 -1161 67892 29245 201523 325437 284499 142214
23992 142214 25730 -111657 -132242 24906 39106 -121578 -93225 11263 -185291 -121085
23982 -121085 -107337 -81914 -19629 212964 400842 149389 43496 78445 63475 19953 40048
23971 40048 -48899 -52029 -202288 -305008 -155352 -39667 -27461 -107740 -273055 -196233 6826
23960 6826 -69154 -243801 -120975 -201711 -227129 -320416 -280581 -247962 -41228 124653 213836
23949 213836 216609 339712 168338 -61364 -209433 -36171 -42534 -150909 -48404 85377
23939 85377 208048 242359 295043 301832 184483 365166 659015 321297 96008 -141355
23929 -141355 -166415 -147694 -46843 -38386 65666 85889 158819 35984 -51123 2264 -118822
23918 -118822 -161373 -200972 -141161 -2460 67506 126123 89849 -88376 -54757 -65669 -76277
23907 -76277 -191740 -231905 -14601 -39564 -223541 -349019 -246854 -97337 -83694 84324
23897 84324 53251 23241 -15502 91866 122993 251439 123065 -42992 43583 -21252 -284273
23886 -284273 -516428 -599412 -464555 -334859 5810 102583 132923 90143 47042 -142893
23876 -142893 -24682 86258 64595 35656 -80945 -86312 -35730 -10228 -86774 -297361 -254444
23865 -254444 152348 247525 82597 153364 271431 297897 119300 -118814 -131578 -76348
23855 -76348 50899 108994 -48879 48100 94313 32010 -119745 -73287 -43463 -98877 -198503
23844 -198503 -348858 -404732 -147068 116917 220328 361405 342940 144024 -16601 -25383
23834 -25383 112860 124727 -14343 -17318 -66245 -175553 -103172 -55066 59435 -8107 -63239
23823 -63239 -104235 -240433 -301112 -203168 -156908 -215440 -288122 -335989 -178816 -161939 -283880
23812 -283880 -454974 -451695 -127848 -107998 -108501 -212641 -183854 -63737 -175222 -232222 -96393
23801 -96393 -34108 40071 -69917 -381932 -258043 -324363 -410111 -440924 -454553 -424386 -280892
23790 -280892 -269094 -83435 -105076 -70322 -108663 96792 304277 339896 202788 -25071
23780 -25071 -318834 -357446 -170016 -232138 -82936 -50835 -51276 119423 269869 106964 -95696
23769 -95696 -90718 62200 29417 103707 199986 14921 -9136 217968 310971 117634 -135322
23758 -135322 -92519 -43602 -136437 -140586 -176900 -93911 64020 -65312 -134196 -20689 190377
23747 190377 215460 54599 -102845 96985 181740 -14790 -166007 -306599 -312036 -375962
23737 -375962 -421941 -369040 -75267 -129712 -115065 -62426 -162449 -161231 -232624 -294418 -317080
23726 -317080 -242762 -116036 -119320 -327525 -340094 -289946 -72680 99829 138608 121110 146070
23715 146070 298530 111479 124182 143046 -39909 -98141 -93981 -228121 -240863 -368368 -292856
23704 -292856 -228731 -368865 38784 209816 52041 104016 158467 14578 159102 99351
23694 99351 31875 33033 32437 51051 -22973 -23488 12910 -89179 -135542 -53535 -252305 -328084
23682 -328084 -321608 -333516 -182892 -101244 67205 144272 221613 165393 46544 25997 -64646
23671 -64646 98312 4660 2403 153082 276138 264640 173977 208188 116355 -77195 20743
23660 20743 -10892 -17721 66689 -258991 -404312 -175695 -57996 -274767 -197876 -138667 -271972
23649 -271972 -200693 -407487 -460652 -388691 -237730 -14909 -160638 -169624 -160576 -295665 -298568
23638 -298568 -251071 -95056 2785 17752 22893 135753 110090 -38118 -68955 -216661 -297354
23627 -297354 -217033 -276487 -203753 -6248 -69189 -68905 -89885 -188992 -319645 -179045 -28661
23616 -28661 -40879 -106091 -55452 -34652 -23415 21786 -28328 -136965 -85617 -160240 -173645
23605 -173645 -241200 -202450 -121483 -120840 77996 122442 -20081 -112113 223578 142002 -220026
23594 -220026 -528600 -572380 -271696 54168 80680 -38147 -66531 -136266 -70395 32281
23584 32281 30744 -32440 9581 51481 220549 112696 -28654 -200060 -126967 15666 -24659
23573 -24659 82490 35928 -77303 -37901 -138860 -338264 -510186 -320369 -144280 -286683
23563 -286683 -165238 -28124 72087 -17752 -66220 88824 170747 27179 -189879 -336395
23553 -336395 -376838 -341321 15623 206484 228395 211595 162741 161573 19497 -102589 -205915
23542 -205915 -196239 -224284 -48973 128049 306849 215779 124426 -123858 -252699 -296382 -221806
23531 -221806 -138907 -319000 -326331 -201628 -37249 -32209 -50482 -163565 -155168 -221217 -200279
23520 -200279 -124964 485 -47963 -186304 -159152 -154383 -285423 -381049 -261005 -274253 -171646
23509 -171646 -117395 -83794 24133 85684 -98573 -32863 158152 259919 340159 381389 300958
23498 300958 107195 162831 311908 240651 94876 40999 1418 -73923 -22863 -90175 -3313
23487 -3313 100876 -59191 -155428 61275 343851 258076 -63524 -392961 -461230 -354929
23477 -354929 -299760 -320571 -368384 -350919 -281835 -211477 -116396 -35838 -138701 22472 221
23466 221 -107438 -10980 -52988 -124150 -171627 -177972 -202155 -102028 -82670 -10430 108510 -79558
23454 -79558 -231504 -336459 -411612 -508924 -366530 -298684 -231124 9686 97746 280754 204005
23443 204005 7297 175057 199634 203480 100617 205413 23410 73516 -28100 64403
23433 64403 102943 58992 212526 236746 -50610 -187390 -8014 -6854 33893 35599 11607
23422 11607 -126249 -100403 123100 43190 -45836 -147635 -198168 -474137 -357658 23802
23412 23802 245483 283845 354815 416659 450702 323372 171341 262382 309290 278135 294414
23401 294414 215483 152229 114052 -13245 -74446 -58332 148600 203627 260248 457271 541092
23390 541092 498135 172746 78214 235772 282391 262496 326847 307392 150040 247915 332415
23379 332415 153762 -199125 -245252 -230570 -169973 -154207 -137099 -5601 26043 13729 89075
23368 89075 59240 218800 153776 -69389 -90561 44424 -11015 92180 320438 286093 117096
23357 117096 195528 184774 64759 181880 335109 91744 -30098 -152695 -110060 -49352
23347 -49352 19293 106576 224756 309418 357231 283510 99280 -212380 -79240 -140275 -8863
23336 -8863 134132 134599 71886 304809 265870 17588 -107328 -240026 -287701 -226827 -110014
23325 -110014 -38863 166175 241884 162806 212011 291573 251668 331766 303836 11130 -192143
23314 -192143 -349800 -341302 -480462 -502423 -426898 -327443 -451784 -270036 -267572 -202279 -19426
23303 -19426 91448 116198 50155 22667 -123657 -181618 -297823 -203147 -74990 -52927 -232832
23292 -232832 -134759 -192226 -241596 -88396 -21584 -94164 -53747 -51373 -147133 -8356 -37673
23281 -37673 -76882 -10638 -118027 -90393 45384 25667 -133306 -120213 -40606 56437 223117
23270 223117 405193 157144 -38705 24645 167024 61728 128482 70664 120918 217149
23260 217149 247915 349249 156965 -64962 -114545 -89394 -26058 -79739 -19289 101205 34030
23249 34030 19410 -43894 -243013 -235867 -103051 -18392 -6787 -98009 -287901 -451141 -208846
23238 -208846 199331 210301 7238 -127625 -82256 -9413 5035 -150817 -85781 -210805
23228 -210805 -256629 -304291 -306027 -128884 -123946 -214193 -417434 -469285 -441368 -377389 -181791
23217 -181791 -268521 -528633 -335064 -192915 -255897 -420244 -298694 -227721 -93899 88481
23207 88481 106932 89516 167058 123396 -37363 -71411 -142908 -210097 -202727 -324458 -309403
23196 -309403 -225053 -30367 182917 104668 114987 145470 205450 164061 -37406 -26100 66913
23185 66913 161146 44140 62553 23698 -53600 -157554 -31408 -188734 -154922 1095 67394
23174 67394 38742 5226 105227 -37502 -338572 -448194 -370134 -105405 11851 71892
23164 71892 179642 -67152 -133478 24566 43362 47895 159384 -100572 -191358 -37677 -56514
23153 -56514 -83390 37799 -38011 -218469 -351345 -198668 -301020 -124655 10830 -64760
23143 -64760 -181503 -364194 -178517 -130979 -54718 50488 -97362 24429 -43552 -67031
23133 -67031 40149 -75672 -275072 -356201 -572651 -397346 -51038 -31752 -333517 -225618
23123 -225618 -139753 -30780 51654 -23511 -93285 -278823 -245111 -239782 -207910 -227376 -266234
23112 -266234 -176165 -315432 -322020 -122117 34810 15831 -23397 -71545 -85562 -41940 131866
23101 131866 125270 128634 47598 -16673 -134209 -119892 -181445 63422 191029 184306 241023
23090 241023 301199 220747 29717 100165 66838 -168961 -283736 -139373 -34458 85228
23080 85228 12799 -92012 -70855 66375 62091 -108304 -71563 -124496 -135850 -342123 -483232
23069 -483232 -218875 157700 -74761 -258109 -170764 -71882 -54537 -165127 -214835 -143193
23059 -143193 65112 97297 -86080 -101392 -112345 -413125 -496701 -266402 -88236 -159267
23049 -159267 -314612 -393494 -392328 -234748 -195979 -282453 -264018 -50228 14185 -279685 -301342
23038 -301342 -282083 -232387 -145838 38495 40808 -160970 -424201 -298844 -30717 11898 -32949
23027 -32949 49852 47932 141552 -129043 -163993 -128081 -174873 -69129 -49464 -187921 -144325
23016 -144325 46939 145762 324614 277806 483181 538090 285331 -56256 -211638 -209848
23006 -209848 -75473 -141395 -202163 -47999 18695 -20730 -125543 -285482 -326875 -155878
22996 -155878 58354 -14104 -33779 -131817 -121508 -123800 -123489 -310681 -415108 -407132 -434490 -402039
22984 -402039 -255931 -348929 -256856 -222612 -126045 -340326 -315522 -71849 105528 39077 -21756
22973 -21756 -85743 -202319 -145304 -147869 3144 -59084 -177654 -318354 -348636 -179217 -172028
22962 -172028 -137991 -85242 -121535 25567 -19391 -14846 -182596 -199130 -85059 -26771 24070
22951 24070 -142040 -199193 -279739 -213749 -297090 -140877 -79128 -200809 -59249 147545 143020
22940 143020 47586 -151171 -240333 -176039 -80031 -61451 -138099 9205 47217 144407 80267
22929 80267 -3728 -41761 6303 82908 141951 71541 186145 252566 173779 157557 124168
22918 124168 -120219 -63809 197571 211187 281004 66611 -35679 183564 44370 61512
22908 61512 134565 -145738 -246440 -177974 -186153 161293 88152 -135507 -122394 -47811 -8614
22897 -8614 -155055 -97527 -327761 -409826 -356749 -277081 -56567 -305617 -325310 -272991 -59084
22886 -59084 204591 93073 -75132 -84694 -45220 -12088 -90732 -59012 -129578 -147999 -85341
22875 -85341 -80370 119282 168387 -18447 -90360 35147 -85525 -81926 -65828 -20712 -28438
22864 -28438 -4759 -122506 -76695 -100038 -7151 48929 159607 185837 150098 -83945 -123293
22853 -123293 37583 152897 144733 288140 194514 56314 5849 -89561 -104869 -105900 -238325
22842 -238325 -215222 -110991 -133636 -318214 -327664 -126473 -303707 -497649 -425401 -436635 -490315
22831 -490315 -325084 -252963 -256132 -252073 -285547 -261164 -58663 -10320 -302251 -363487 -272001
22820 -272001 -244731 -171097 -2216 -1144 -182208 -304773 -75509 -184148 -331172 -150728
22810 -150728 -121684 -184563 -107688 24414 -28305 -55217 -188737 -336129 -391274 -377862 -429739
22799 -429739 -317219 -188502 -189632 -160803 -99478 -43740 -141895 -120079 4048 -210356 -275636
22788 -275636 -306512 -179260 -117881 -257371 -270303 -190112 -185527 -31549 19396 -60400 -135812
22777 -135812 -178940 -52040 -16093 -120092 -4153 81158 55386 126157 37623 -82852 -27239
22766 -27239 34022 251271 144368 200847 118999 -175827 -278764 -318407 -278365 -161328 69097
22755 69097 -75818 -375459 -355832 -232394 -102459 -129026 -312727 -407845 -412308 -156483 -39435
22744 -39435 47450 25080 1425 -129298 -103660 -317614 -464864 -540482 -358336 -184935 -105006
22733 -105006 -100502 -188889 -136150 -214504 -394941 -343629 -211914 -80382 2911 -66121 -264081
22722 -264081 -91672 100942 -19055 -252165 -210610 -210708 -339752 -363584 -381781 -324397 56634
22711 56634 178749 60780 -73705 -263620 -303908 -72103 219233 262966 54631 123668
22701 123668 168115 136232 150213 151744 24011 -11848 131531 134515 171677 180712 104851 186090
22689 186090 257505 114789 -46184 -78735 103506 189958 242366 101226 -49772 55210
22679 55210 170504 167413 234833 145534 207080 106223 68527 92820 153074 166451 87852
22668 87852 87445 -74609 -132556 -99076 3478 -62633 -110449 -5918 50234 239669 363726
22657 363726 379668 98321 -64479 -63419 -155417 -15074 229937 219394 194391 156310 77395
22646 77395 9179 63909 169139 485124 531854 433111 117285 -196040 6902 11060 31804
22635 31804 -74874 59437 215954 139205 114982 181845 280440 130110 34254 -36542 -82355
22624 -82355 11978 222488 91073 126369 -64793 -176112 -242785 -196448 -309600 -235401 -286566
22613 -286566 -327947 -423086 -417574 -294623 -17340 186116 143667 49498 -189813 -192867 -44471
22602 -44471 102451 326518 270859 17290 -287385 -341874 -211723 -17764 -62196 38587
22592 38587 58263 25037 48788 110245 102467 96202 210669 208927 246704 173752 43053 -84010
22580 -84010 -52281 91037 83817 -156928 -98795 -50639 -123946 -270749 -343097 -246714 -46531
22569 -46531 -145170 -3153 37696 21992 13766 7746 43500 101279 -92822 31155 145480
22558 145480 245907 178216 126272 154925 -107785 -176644 789 125747 -1094 -57237
22548 -57237 -19091 -57583 -71696 -143760 -104255 -15281 -75264 -2551 35549 210656 273958
22537 273958 172721 102277 75678 29575 -38679 14158 -10405 -105263 -102620 40291 -74397
22526 -74397 -30025 -146306 -214858 -197710 -196030 -197901 -344688 -324747 -316920 -473275 -454226 -162384
22514 -162384 -34975 -119006 -221720 -183968 -162130 -164293 -79426 -182303 -190592 -186180 -103805
22503 -103805 -42358 -103363 25648 159506 -2188 -166729 -309643 -151571 -117165 -280029
22493 -280029 -277145 -127600 -213611 -240753 -105612 -246798 -181933 -192243 -265735 -288838 -288391
22482 -288391 -174875 -10592 -140575 -306027 -433525 -679363 -689076 -698775 -532463 -317110
22472 -317110 -388161 -470293 -290467 -230052 -145792 -91405 -238375 -167776 -124341 -38683 -181062
22461 -181062 -315679 -257113 -250796 -448887 -555924 -298250 128239 244874 337650 180766
22451 180766 -44019 -878 35888 188860 235233 -71237 -199925 -101441 48195 136181
22441 136181 93058 -70536 -226956 -193397 -48397 -40182 52363 -3646 6755 120848 211020
22430 211020 103977 -125163 -198088 -174225 -237303 -235951 -191170 29245 239829 235346 130798
22419 130798 -25501 -211569 -206261 -203786 -150555 -116247 -138273 -240195 -36272 213166 210403
22408 210403 168136 271269 475792 285546 91897 -130413 27011 129423 60858 170131
22398 170131 380355 197979 -47391 -268555 -335298 -166462 -46778 -72383 31123 84570
22388 84570 198164 331567 332656 251331 126378 95928 2557 86798 260757 157235 -4266
22377 -4266 -110320 -207714 -85686 -148162 -262659 -323965 -329771 -336374 -248528 -73594 -189142
22366 -189142 -435412 -536877 -420195 -337256 -346744 -335886 -222639 27184 64393 -61712
22356 -61712 -238171 -343121 -186282 -273686 -223252 -158666 -96438 -68051 -165288 -270534 -253871
22345 -253871 -209941 -288947 -259351 -341059 -441412 -240254 -26825 157815 130250 -37727
22335 -37727 -147620 -190741 -287069 -378678 -338688 -139056 -47561 7512 -43520 -158387 -73036
22324 -73036 201797 101329 2701 146220 132037 199705 202516 299419 201086 186105 124154
22313 124154 -11529 -58540 35653 14313 -178937 -262344 -103539 135422 242879 202328
22303 202328 100557 121895 -55660 16492 137394 10644 -109839 -232916 -189558 -112086
22293 -112086 -19001 -69848 -79750 97112 104468 -67714 52791 -21030 17148 141388 81915
22282 81915 -61340 -102415 -236553 -249944 -281844 -303265 -403599 -335998 -315403 -249983 -165445
22271 -165445 -132958 -221681 -245681 -183215 -145738 -201520 -69544 143476 192992 21042 -186130
22260 -186130 -92922 -124414 -115850 73001 -108834 -287066 -268937 -242139 -134875 -158129 -372388
22249 -372388 -503252 -396628 -168765 75508 73984 41107 139641 108444 14083 -65129 -103727
22238 -103727 -338702 -496774 -530767 -410442 -351711 -358073 -389201 -13458 47512 40773 -203670
22227 -203670 -226051 -285994 -271274 -284891 -68760 143506 139190 -59808 -334956 -537591 -434953
22216 -434953 -257148 -141760 -110272 -266592 -294411 -387500 -576448 -525589 -186886 -116437
22206 -116437 51467 235560 266479 200648 -111754 -317044 -299411 -64156 42934 -128793
22196 -128793 -141067 -136754 -202097 8151 157722 137485 -32133 40575 95516 106935 59858
22185 59858 -96445 27240 56826 200513 193958 55823 -16306 -27430 -44914 -3844 -38181
22174 -38181 -150231 -60998 38186 3361 5051 20830 -29508 -143479 -298903 -313951 -465098
22163 -465098 -582274 -523485 -308688 -214855 -265282 -301474 -333065 3007 -32521 -48566 -25343
22152 -25343 10039 -50035 105635 93972 -76308 -177684 -223798 -237821 -130286 -61112 -154866
22141 -154866 -223430 -340857 -254464 22857 272715 171813 80498 133431 195713 301966
22131 301966 304274 231070 251424 118642 -129001 -361792 -289467 -270494 -165504 -31521 7722
22120 7722 -121771 -172061 -272121 -232848 -185052 -66030 -115878 -185779 -299177 -74490 -55640
22109 -55640 -77690 -29055 -38212 -52524 -77395 -211412 -217236 -246298 -336035 -487599 -430289 -309622
22097 -309622 -124908 83631 28042 -216747 -373143 -295243 -27097 305581 373321 357581
22087 357581 149143 48140 27554 -10886 72986 146192 -82685 -159579 -377409 -359843 -360098
22076 -360098 -110147 -106387 -128276 -104747 57142 104287 97750 -2187 -20624 19959 -18757
22065 -18757 -242482 -227748 -295681 -161843 53341 1214 -62440 -218508 -69594 98640
22055 98640 21557 -144941 42643 97881 31432 -144510 -300188 -232323 -179941 -79804 -430756
22044 -430756 -560541 -299194 -108223 -2488 -143446 -144711 69760 190765 85328 177970
22034 177970 185349 134757 -51050 -78575 157412 121842 107576 259065 303018 200663 -31901
22023 -31901 -154000 -65523 -32782 -139459 -63772 61694 42275 46075 280364 326787 228898
22012 228898 113774 -215644 -284106 -381339 -215502 13155 -28669 72995 48968 -43147
22002 -43147 121268 159441 94168 -39532 -97041 7357 324716 233847 256107 58386 100278
21991 100278 222628 441481 389355 473342 41263 -254847 -358661 -155225 -156108 -154058 -127526
21980 -127526 -196117 -121050 -103871 -152919 -153475 -112646 -61704 -162468 -161280 -105540 -71477 -99588
21968 -99588 -79286 42025 106243 66957 77737 231040 6702 -128769 -40518 137502 133910
21957 133910 16522 88321 167134 112395 24786 6673 -13773 -46721 46082 121510 125156
21946 125156 146131 -35111 -242260 -390965 -220870 121025 352999 257940 -29654 -33365
21936 -33365 -75266 82624 289512 492875 517593 440684 62677 -57994 33712 34841 -176918
21925 -176918 -358128 -128020 -46880 -60721 160928 222711 55653 218267 64423 18188
21915 18188 76150 46149 59710 80174 24553 -18452 -58944 74107 17387 -39750 148802
21904 148802 124335 88921 197517 15031 -265697 -176066 60666 128604 118275 38817 -176277
21893 -176277 -72370 181183 402473 276488 175104 78576 -53238 -104574 -149317 -151314
21883 -151314 -248004 -239511 -155454 -3244 67808 257397 271852 122328 -31766 62899 286023
21872 286023 343238 125676 -18172 61609 6657 -220789 -315673 -373473 -403423 -317889 -48366
21861 -48366 -49855 -108112 -92617 -102644 -61929 -126159 -28375 -52130 -40079 65846 -17627 -204467
21849 -204467 -367265 -379694 -357715 -190460 -161171 -438060 -275836 23313 210915 278093
21839 278093 157720 -5076 103352 122063 45496 -139734 -253665 -87649 -57006 -126385
21829 -126385 -186724 -59730 47628 184497 174100 27514 75899 45041 -44187 -139366 -205770
21818 -205770 39305 94878 -84348 -134930 -89239 62072 77183 -179414 -280988 -382425
21808 -382425 -208528 -84066 -7602 130039 104319 -137045 -356614 -484257 -512945 -260667
21798 -260667 -109070 -75705 -124820 -64916 -8400 3677 21123 39336 38693 15955 -88306
21787 -88306 -79108 63981 -467 -105914 -37510 -27919 172876 81769 -31323 -267023 -392375
21776 -392375 -462256 -388994 -579234 -578110 -413441 -93250 -35777 -37397 -158728 -209432 -203567
21765 -203567 37162 38926 129010 163144 133066 180020 215999 131043 13580 -80211 -145416
21754 -145416 -157047 -167256 -48381 17855 161446 7895 -65817 57150 -36062 -9573 47162
21743 47162 40900 -178795 -243416 -413006 -305662 -113505 -20275 110549 51180 72816 -41027
21732 -41027 -96902 -277570 -417397 -345280 -331380 -269562 -63405 62680 286938 281851 210349
21721 210349 61634 -1645 121309 77904 -141207 -325056 -210601 -7166 44671 9250
21711 9250 -159200 -71765 -71195 84331 -29961 -234312 -76647 -35625 33053 -69366 103305
21700 103305 137420 97807 61918 86990 -6246 -233974 -102515 67248 130030 110234 71158
21689 71158 40458 -81183 -218901 -386958 -376290 -234351 -168537 -57244 -137219 -223251 -93334
21678 -93334 19682 45989 -156428 20063 -24445 -174196 -161569 -189735 -93995 6096 -49628
21667 -49628 -11598 149456 206605 144634 72353 149102 42792 -145748 -142232 -19440 75717
21656 75717 48199 204600 220528 177182 64026 33971 -124858 -23276 70345 50491 323421
21645 323421 325517 17392 -100797 -179805 -262719 -187908 -286711 -283331 -198065 -90543 -66305
21634 -66305 -175670 -16995 79191 209771 200363 127414 28551 -192893 -338918 -215208 -153597
21623 -153597 -220474 -104140 -58685 -88148 66723 92646 -189273 -207037 51506 265617
21613 265617 284688 243814 103154 66270 31097 148719 25884 8146 25168 66134 23850
21602 23850 107928 -90669 -24283 -45952 -121808 -39122 -1662 26048 47001 103180 -19776
21591 -19776 -267230 -321798 -304814 -157358 -32311 -147774 -168142 -56837 -16102 -273567
21581 -273567 -399455 -277814 -29088 148807 288740 193958 102530 8094 -52768 -27417
21571 -27417 114364 -15046 17953 18842 -141133 -103899 23147 164485 322264 276040 262780
21560 262780 380429 351510 176508 12855 -107365 -207229 -13763 51688 13825 -111973
21550 -111973 -80825 63521 69664 115276 199285 89060 12396 -200242 -131145 69535 5715
21539 5715 171192 195643 6394 -167297 -323630 -227999 115773 290772 188350 231734
21529 231734 207847 94139 7818 87736 233847 117499 -6481 -71006 -190015 -185513 -120067
21518 -120067 -41331 -70561 15062 213623 124366 -43928 -400023 -408386 -221368 -147889 -35242
21507 -35242 10978 63691 -147262 -339280 -159909 17365 18634 -218449 -201356 -36851 109945
21496 109945 177999 281505 107555 -264044 -99697 -19692 234168 404905 129746 10258
21486 10258 -153179 -92408 -122653 -114112 -114933 95828 173620 82320 90215 145465 170217 191475
21474 191475 329321 168628 7926 -66781 -94884 -25794 305393 343723 257235 295387 99300
21463 99300 -30446 -98339 -8339 528 114787 258671 420842 78699 -29379 79073
21453 79073 9013 -3692 -37550 -13520 67686 165565 359154 440713 406970 273847 52884
21442 52884 -63930 -33103 136317 74904 -8963 -110898 -259910 -188931 -86965 142314
21432 142314 245483 383833 153025 -52110 170961 245347 90250 -85156 -155088 -42717
21422 -42717 121193 220326 190762 168507 -16829 81263 100554 154526 306737 327722 303939
21411 303939 272958 77300 -34807 804 5450 -140157 -52927 160851 332747 219021
21401 219021 251796 419909 465389 471388 530988 320911 86411 110035 -41555 -224457 -120328
21390 -120328 -134434 -174961 -303211 -252207 -134345 -201646 -4023 147031 -54783 -71972
21380 -71972 -54013 43516 8112 1644 219830 261236 54406 36921 -124239 -143466 -117878
21369 -117878 -115994 -215150 -192459 -100600 81434 66876 -32852 -65782 -129911 -143328 77485
21358 77485 323272 239603 -67089 -56706 -43221 -25583 58403 308649 245075 222377 171639
21347 171639 48620 -134134 -179348 -119169 -42736 -69133 -96019 -100467 -12728 156875 80544
21336 80544 191559 416600 241699 200560 176000 127205 109228 251286 215801 326000 415704
21325 415704 423859 473107 441557 403212 120213 28812 132959 134464 8873 -67725 -239784
21314 -239784 -174880 31362 83031 150174 339566 354704 308984 258569 260353 218804 206016
21303 206016 219551 181987 -18378 39351 119846 104749 33446 73712 146287 184699 163656
21292 163656 93383 63189 122453 -26916 -156643 -196460 34449 131716 -61823 -187735
21282 -187735 -158887 -1786 64154 222616 305490 160229 269782 327786 207622 -96479
21272 -96479 3497 167196 93638 -22597 95207 231588 251660 337820 250343 -138383 -425579
21261 -425579 -217788 -197349 -84241 -61351 21005 62285 43502 16195 159410 226721 234813
21250 234813 359541 554779 582070 174264 182207 9606 -275155 -267509 -49597 -11090 52797
21239 52797 76119 66447 93413 157128 200373 406325 503350 492963 363213 332810 251486
21228 251486 190210 183026 25302 -24055 96922 206872 334976 381916 206556 49442
21218 49442 139443 195348 155423 148508 88791 -12438 -18584 51985 215047 250394 260745 203160
21206 203160 197602 239461 230296 284775 284188 6970 98383 146295 83762 189900 372173 279632
21194 279632 -12793 -219963 -199462 -110132 -93209 -31267 149479 405766 436160 269982
21184 269982 310484 367545 230201 274653 6429 -210228 -79717 134517 293510 63247
21174 63247 133478 156055 121209 -45286 -217511 -112205 -86493 117611 162852 200413 164353
21163 164353 298911 210274 131881 205231 300699 326673 156192 125882 55525 -27086 -51172
21152 -51172 211802 267013 235130 212423 251314 287441 346920 261445 152775 65847 33286
21141 33286 95517 52124 34952 74073 59746 140828 244180 237737 274285 304939 429086
21130 429086 421940 182265 12147 95641 283099 372344 465827 503207 499458 339798 23755
21119 23755 76198 62125 -146794 -61023 210053 350450 411823 149601 7431 150883
21109 150883 270860 266858 305400 323788 148110 -106579 48680 241723 276771 281436 140328
21098 140328 174688 272409 240133 3064 -108992 -77824 -156810 -104002 101162 82482 84824
21087 84824 153035 156077 132167 -22713 61127 156873 382873 336983 69542 159615 233318
21076 233318 261912 445379 558426 776356 768944 536711 319313 137243 -101206 -29032
21066 -29032 17918 66141 106987 78765 134658 208992 324342 208804 65691 -40380 -48431
21055 -48431 -89382 11362 444715 530610 563796 596482 428967 161798 19068 11890 102347
21044 102347 190056 341307 296573 422022 431327 391940 498598 474453 469039 542889 449485
21033 449485 436842 456804 363713 304101 181392 -8240 75865 89303 103619 58072 368807
21022 368807 289880 222689 261763 542996 604338 532300 447728 346618 284833 536706 485992
21011 485992 595549 497503 292445 187649 130231 162580 406341 418408 474211 455470 544790
21000 544790 601066 473630 158019 -98450 7994 210463 342270 183020 127799 183255
20990 183255 397351 692535 821941 726570 758874 640898 332678 178400 214584 243790
20980 243790 374102 564023 624794 564563 533378 455084 383688 165470 25151 -19759 56124
20969 56124 113120 164985 139425 155276 128582 227237 333601 256782 247491 241107 221185 161924
20957 161924 79151 257004 364346 255671 291528 535459 452755 146719 304103 614284
20947 614284 727328 782387 719405 574956 535749 499904 601327 684095 503024 434015 553717
20936 553717 495182 520639 532109 503769 560595 428442 114819 222879 466197 431829 476410
20925 476410 634021 632845 685090 697488 578434 347163 488978 750093 665896 597184 582256
20914 582256 442107 422170 488449 554883 407457 440991 724024 710759 818612 766609 610811
20903 610811 388573 338378 263703 349531 395289 479889 366421 341920 432087 426459 176469
20892 176469 16620 152190 250758 178856 169432 274247 162600 33130 194842 266529
20882 266529 468824 445872 198778 56332 143640 340237 608560 514076 531645 500251
20872 500251 497577 606753 555490 431654 289189 264190 317031 267759 328959 359848 489633
20861 489633 499711 493378 548524 513598 455226 422761 393484 270951 263143 173609 79365 327156
20849 327156 565373 447914 354130 393678 400212 507864 581308 561193 497470 595530 842971
20838 842971 835107 697085 547835 583910 419656 382866 279277 177494 401356 572807
20828 572807 337528 280969 380047 411334 391285 484858 629058 747867 718057 626231 512508
20817 512508 511121 672135 755789 685757 445605 364932 312904 344718 346073 142834 222753
20806 222753 270427 320007 188976 79744 192204 441209 491068 486030 287333 163170
20796 163170 428188 328858 321240 476943 395319 316207 272688 213143 267194 582973 561559
20785 561559 451533 342636 386211 583711 681877 760213 628818 516527 438609 348316
20775 348316 370908 363912 633719 552366 399879 428361 544890 427443 592153 777574
20765 777574 741117 679490 609976 499718 660846 531334 574605 549198 363186 193065
20755 193065 215381 406153 312659 479004 674638 636460 558561 572266 696373 707013 739632
20744 739632 584611 523478 568276 577677 568699 341712 455778 517740 325592 26175 79459
20733 79459 362721 526126 510407 553328 501834 356693 392666 476268 543700 606670 558802
20722 558802 327614 314054 514144 600171 650914 583903 563588 740909 750142 949082 934994
20711 934994 833561 623531 518366 575100 750193 669997 754692 788961 592465 500260
20701 500260 599495 579791 654682 689168 662310 607956 679891 747010 632057 617797 748235
20690 748235 589765 603202 567864 379287 252831 310211 245754 221221 409931 559658
20680 559658 605857 641313 575321 644685 730497 856895 936963 993217 797759 445783 587790
20669 587790 656003 537164 512763 535228 620620 944044 1090218 762366 452296 726108
20659 726108 992836 883047 733883 896029 874159 901618 914558 905795 919681 830897 738401
20648 738401 959094 933219 970177 826041 582710 557008 540579 554894 752842 922087
20638 922087 1039855 800430 851904 935214 863345 794307 799746 730498 537182 448732 503213
20627 503213 416656 461427 745890 902706 1064758 1047149 889450 826005 829451 935256 848836
20616 848836 907655 1046111 1003061 830467 689568 702533 701139 671959 707094 673492 710175
20605 710175 688141 707190 673652 508398 378258 365629 360999 488202 733224 686526 533612
20594 533612 610292 788060 852574 820156 813370 790591 951658 1027028 1009725 1169985 989928
20583 989928 825097 843799 948740 917692 959393 1031078 1039538 1090903 1086334 792093 566888
20572 566888 712065 859938 814368 899437 857242 854057 911313 1066708 1387777 1447252 1283304
20561 1283304 1013350 973068 729233 746840 821718 877492 914287 830480 956179 1032754 869278
20550 869278 910921 912432 1034158 1100562 1186965 1139375 1155547 1333690 1408065 1274887 1169872
20539 1169872 1115969 962265 986761 951643 868860 848869 995536 995151 848581 934055 1199396
20528 1199396 1300489 1128809 1071787 830304 718040 941006 1211946 1354994 1377904 1319498
20518 1319498 1346054 1234467 1204801 1208217 1276581 1507944 1509983 1287077 1308048 1337252 1203504
20507 1203504 1234239 1378239 1321510 1401665 1367123 1268798 1205235 1146347 1416624 1543056 1437546
20496 1437546 1743788 1577275 1441411 1483238 1529817 1560066 1462187 1345139 1147485 977552
20486 977552 912355 1141257 1348840 1350658 1204860 1197659 1238540 1116554 1088132 1249989 1390428
20475 1390428 1275719 1211694 1269492 1462990 1676518 1431057 1416625 1441956 1349631 1296376
20465 1296376 1382633 1613549 1604159 1466102 1393461 1328690 1177008 1288749 1372320 1351263 1426319
20454 1426319 1554316 1711565 1737744 1534767 1328132 1356915 1492361 1637236 1651087 1514345
20444 1514345 1369502 1221514 1131542 1298110 1520494 1513611 1459467 1191376 1150598 1210361
20434 1210361 1321613 1379074 1329482 1153013 1043236 1205283 1344886 1146265 1005247 1254884
20424 1254884 1327466 1582116 1655365 1506193 1485497 1609450 1620733 1568272 1554587 1548466 1667789
20413 1667789 1596985 1621173 1687175 1668748 1645552 1740657 1599201 1473991 1392127 1580340 1828748
20402 1828748 1617486 1623724 1749348 2027322 2123055 2074637 2043907 1781067 1644681 1499673
20392 1499673 1505890 1468871 1624018 1762076 1888849 1776633 1793937 1752336 2014007 2134036
20382 2134036 2071524 2264214 2203691 2117377 2089614 2219878 2068912 1986850 1877212 1749372
20372 1749372 1758240 2021510 2153933 2106753 2194076 2106089 1967534 1953731 1950939 1882490 1953032
20361 1953032 1812467 1776118 1686168 1803928 1843952 1692490 1985880 2074037 2163619 2328824
20351 2328824 2452191 2356351 2178119 2204547 2312029 2326796 2137682 1934977 1862202 1801608
20341 1801608 1706008 1881946 2099078 2213361 2220268 2356270 2439855 2604520 2640289 2467013
20331 2467013 2234624 2227554 2165977 1929952 2007039 2337870 2584985 2557500 2358658 2350040 2521608
20320 2521608 2756446 2486995 2232653 2226467 2298154 2379545 2418558 2527976 2680183 2687815 2713797
20309 2713797 2736711 2788762 2660286 2704639 2926751 2968969 2961688 2892476 2670522 2654871 2647541
20298 2647541 2793957 2741406 2722561 2810859 2700495 2430393 2420202 2568415 2737860 2694188
20288 2694188 2870199 2938184 2750897 2616837 2895278 2974169 2669982 2673259 2879538 2855471
20278 2855471 2714431 2702087 2856819 2957145 3091460 2979318 2770586 2796601 2971698 3055965
20268 3055965 2790805 2879031 3148128 3300454 3048244 2833993 2913617 3066647 3119219 3149308
20258 3149308 3145110 2979020 3008564 3052487 3170882 3225400 3246822 3251365 3322177 3454494 3504075
20247 3504075 3592384 3703799 3647317 3654558 3883027 3815908 3694435 3757717 3730900 3837860 3803641
20236 3803641 3668335 3703252 3822738 3742216 3443027 3289106 3308109 3433172 3529415 3592396
20226 3592396 3465454 3353115 3470860 3655766 3681912 3693149 3710825 4107845 4201403 4209802
20216 4209802 4212567 4172541 4189359 4315925 4250845 4093262 3996880 3965275 4127969 4318741 4296132
20205 4296132 4411359 4524061 4148634 4279678 4377530 4310964 4570279 4727146 4500268 4293075
20195 4293075 4197257 4333589 4382026 4397740 4448175 4452796 4401426 4479331 4539420 4418096 4664135
20184 4664135 4623887 4590258 4524538 4519585 4733467 4864313 4863849 4961020 5046108 4830808 4642903
20173 4642903 4584543 4770192 4889541 5133411 5295870 5222852 5274989 5444577 5338011 5243862
20163 5243862 5114141 4922246 5130436 5526928 5684472 5598566 5363008 5399337 5596631 5786295
20153 5786295 6048765 6035587 5767295 5625438 5621345 5709042 5579208 5540835 5679291 5782222
20143 5782222 5778477 5668028 5689667 5942683 6078284 6221130 6301331 6150877 6209061 6466565
20133 6466565 6447257 6341046 6198837 6120118 6394656 6650842 6614454 6655310 6488780 6512917
20123 6512917 6719269 6880276 6692556 6617264 6410931 6525905 6678464 6904226 7000322 6957060
20113 6957060 6803984 6650319 6650427 6650011 6739217 6937561 7169192 7104596 7056360 7243285 7539666
20102 7539666 7595942 7604222 7687360 7801386 7902750 8107676 8430648 8287941 8233000 8250204
20092 8250204 8096118 7939425 7896683 7727071 7821041 7637658 7730399 7823662 8105565 8383578
20082 8383578 8572308 8563212 8713290 8716916 8715179 8721855 8834578 8903279 9080158 9039623 9244141
20071 9244141 9335084 9232071 9236203 9187762 9255327 9427441 9454004 9279498 9157045 9415779
20061 9415779 9493611 9723252 9816447 9685882 9866570 10027236 10032214 10320191 10345357 10262148
20051 10262148 10357476 10360638 10425048 10375759 10350399 10539164 10672502 10720998 10702264 10839805 11037763
20040 11037763 11028301 10972282 11087585 11089823 10810076 10792338 11075907 11302844 11403337 11542036
20030 11542036 11605295 11638871 11758029 12115340 12169578 12081077 12133019 12214549 12319156 12190010
20020 12190010 12208158 12313590 12493645 12479960 12542449 12824586 12970558 13237706 13489906 13522673
20010 13522673 13399957 13497786 13579251 13739349 13848207 13835180 13950644 13982653 13929680 14047400
20000 14047400 13944898 14132291 14376927 14562005 14571994 14638137 14554781 14473502 14527822 14713415
19990 14713415 14952752 15213799 15317944 15270716 15193169 15109210 15219163 15362933 15719622 16259119
19980 16259119 16349916 16258717 16231648 16474151 16667819 16711357 16656909 16544515 16513615 16775221
19970 16775221 17113060 17224285 17436506 17705001 17710262 17617196 17445210 17380116 17480119 17690783
19960 17690783 17954878 17844865 17719996 17935558 17957823 18001123 18271453 18439976 18526466 18464108
19950 18464108 18613245 18761751 19056720 19048956 19128672 19295642 19335594 19288851 19515837 19574278
19940 19574278 19532504 19681436 19981974 20112407 20115413 20008119 19922600 19973578 20108080 20321971
19930 20321971 20485422 20555560 20567329 20444976 20603248 20856438 20839201 21030244 21408492 21475845
19920 21475845 21265570 21120757 21151122 21425790 21694206 21784704 21881455 21872883 21799389 22010901
19910 22010901 22279087 22366520 22305594 22388249 22555201 22724513 22615943 22589128 22620913 22575930
19900 22575930 22647920 22591944 22516099 22373468 22370978 22410785 22399481 22630396 23007463 23174809
19890 23174809 23283084 23224439 22885349 22854252 22919767 22943965 23041942 23046522 23117623 23217743 23519077
19879 23519077 23511183 23529069 23536359 23691828 23839453 23645284 23278498 23055885 23250264 23464921
19869 23464921 23522616 23703970 23785266 23733265 23587588 23725315 23732503 23599590 23593934 23595961 23750797
19858 23750797 23884146 23805688 23597256 23597930 23578786 23663031 23710173 23647663 23416310 23175300 23165795
19847 23165795 23167775 23175798 23141049 23109542 23106789 23087976 22957105 22973561 23068485 23078072 22874489
19836 22874489 22865883 22852777 22875922 22696541 22536927 22513097 22547146 22530922 22643544 22611200 22426030
19825 22426030 22297735 22201035 22164686 22253434 22229284 22235843 22218332 22104000 21940256 21765429
19815 21765429 21516074 21561454 21679215 21601617 21141139 21006168 21051310 20920851 21031111 21331953
19805 21331953 21232154 21060226 21073205 20862925 20540761 20519826 20564537 20416323 20266622 20278532
19795 20278532 20208736 20043290 20049728 20059045 19979842 19980122 19894487 19877723 19772247 19685174 19517464
19784 19517464 19529060 19433796 19174686 18963318 18897454 18947321 18927712 19018055 18865889 18857492 18649143
19773 18649143 18482245 18318860 18221758 18030666 18103598 18277007 18101103 17772824 17706735 17645997
19763 17645997 17475869 17341277 17276269 17233911 17304565 17562448 17454472 17372909 17117789 16832561
19753 16832561 16698590 16479497 16225064 16191500 16401410 16517457 16447909 16461092 16632950 16916282
19743 16916282 16844650 16688386 16713869 16773196 16761865 16661387 16502258 16462031 16411631 16532607
19733 16532607 16481057 16495554 16402675 16286818 16240890 16179479 16133198 16003418 15945831 15758664
19723 15758664 15566759 15221573 15039764 14921619 14858910 14694326 14614307 14542196 14457978 14220635
19713 14220635 13905849 13872024 13853029 13860340 13768357 13607170 13510695 13447992 13224903 13030714
19703 13030714 13070116 13021898 12711550 12663855 12604710 12564910 12507964 12381220 12332639 12435704
19693 12435704 12453613 12463506 12328879 12135838 12025980 11841981 11623770 11508483 11421697 11418431
19683 11418431 11564047 11570901 11595199 11626269 11544939 11321587 11017371 10860996 11015932 10889387
19673 10889387 10949737 10982019 10908497 10844388 10701634 10660755 10788491 10583432 10530785 10622720
19663 10622720 10714046 10456063 10306483 10171358 10017670 10290274 10366538 10171485 10020770 9686448
19653 9686448 9530028 9488561 9652918 9736600 9546103 9400451 9417055 9409007 9311792 9157628
19643 9157628 9105166 9312899 9423028 9234077 9282049 9255555 9244368 9231881 9181202 8808411
19633 8808411 8610948 8464945 8326515 8387200 8513586 8619379 8565323 8500921 8618134 8584128
19623 8584128 8432691 8156844 8164552 8346909 8098081 8038291 8059402 7982470 7934686 7835655 7631517
19612 7631517 7552100 7593204 7557764 7342237 7263722 7143024 7153770 7147507 7225400 7159044 7137185
19601 7137185 7108723 7316497 7294538 7237353 7062535 6829379 6717740 6573763 6726018 6860909
19591 6860909 6744822 6649612 6618930 6698836 6502966 6302627 6497428 6704390 6841075 6690419
19581 6690419 6666332 6727684 6707908 6622428 6559518 6660970 6642516 6566895 6524085 6731801 6601767
19570 6601767 6515479 6367675 6119806 6166695 6308394 6398093 6406934 6219308 6103415 5861533
19560 5861533 5833612 5853401 5697547 5836546 5827637 5747846 5814749 5718550 5576811 5626926 5509783
19549 5509783 5539698 5755668 6002986 5968121 5664651 5476112 5193183 5127874 5223747 5359917
19539 5359917 5567319 5500003 5444733 5482422 5429747 5328328 5160015 5187839 5212648 5140548 5078120
19528 5078120 5095541 5009480 4937885 4985350 5036031 5102167 4976506 5167649 5278826 5304605 5266541
19517 5266541 5337667 5466381 5387336 5205335 5263203 5267130 5242997 5093868 5083131 5131466 4950520
19506 4950520 4794088 4619875 4490961 4568292 4839449 4920996 4816792 4737169 4691341 4568687
19496 4568687 4716714 4594041 4448149 4368998 4305865 4371361 4610783 4776981 4767327 4800537
19486 4800537 4985493 4895813 4533202 4321321 4400170 4378874 4296316 4302069 4478865 4651024
19476 4651024 4448025 4340782 4475761 4419986 4426779 4448954 4531274 4567935 4651123 4903319 4798514
19465 4798514 4835459 4772594 4619703 4611424 4482045 4333883 4312047 4228816 4171361 4182257 4282479
19454 4282479 4309934 4238234 4213956 4183608 4159208 4019248 3876126 3883220 4118501 4088271 3764107
19443 3764107 3941382 3944019 4027092 3927612 3668152 3500794 3534663 3586485 3598622 3644391 3690694
19432 3690694 3792949 3936441 3782729 3598044 3640992 3685123 3671719 3761579 3843511 3846210 3691312
19421 3691312 3669368 3642338 3627816 3532771 3590428 3482778 3250671 3222242 3452263 3568264
19411 3568264 3468965 3565263 3606741 3776728 4103922 3954687 3721289 3802565 3851608 3966167
19401 3966167 3951151 4148374 4259361 4693597 4832899 4659334 4751732 4860807 4867906 4701785
19391 4701785 4370141 4203970 4032871 4107888 4389639 4444067 4413380 4203043 4039564 4174812
19381 4174812 4102169 3915287 3922688 3745363 3514709 3460992 3685209 3776582 3936159 3737233
19371 3737233 3475499 3260425 3169124 3282540 3334356 3520843 3743222 3656502 3786514 4038391
19361 4038391 3955983 3909904 3736134 3716750 3758519 3705452 3657155 3931472 3827796 3743742 3691729
19350 3691729 3663765 3472038 3139969 3139160 3347148 3565328 3860894 3954846 3681492 3925228
19340 3925228 4184359 4234876 4122984 3991145 4097639 3933639 3825866 3962622 4138221 4221854
19330 4221854 4513693 4632343 4512297 4425270 4414648 4447085 4612813 4632100 4558410 4449480
19320 4449480 4073578 3734910 3820027 3796822 3644044 3417128 3475894 3695941 3944103 4021025
19310 4021025 4196805 4353819 4089619 4026048 3882805 3770002 3786896 3857612 3911287 3622164
19300 3622164 3543194 3591243 3322268 3181509 3350223 3259829 3147420 3247248 3261362 3308405
19290 3308405 3364949 3424640 3548098 3606537 3510183 3461938 3377467 3608160 3711642 3784145 3785476
19279 3785476 3644580 3736687 3667238 3663823 3689398 3823040 4076702 4207875 4183211 4241425 4348310
19268 4348310 4521894 4812507 4723495 4924193 5063382 5020374 5119183 5236586 5486679 5502142
19258 5502142 5661377 5564107 5693060 6103754 6159007 6143735 6138125 6539541 7000425 7454870
19248 7454870 7843152 8429751 8948501 9441100 9933383 10364129 10852541 11129573 11579633
19239 11579633 12289785 12925330 13635755 14632007 15879965 17069629 18313425 19680246 21157376
19230 21157376 23100508 25626200 28851862 32890037 38170102 45444634 55497044 69777177
19222 69777177 89959156 116644373 148058764 180491743 209413811 231428665 245289791
19215 245289791 251346470 251413416 250223803 255644683 271678558 295329856 320409798 341767680
19207 341767680 355068878 356494265 345417263 324724005 299400825 275306431 255995682
19200 255995682 242290487 232664476 224873537 217632417 209318922 199452708 188202671 175297725
19192 175297725 161608261 147693134 134569918 122473839 111712208 102336582 94445825
19185 94445825 87769819 82032991 77466606 73353675 69866641 66592342 63520205 61021670
19177 61021670 58900857 56749810 54685002 52550150 50754718 48981329 47560628 46479353
19169 46479353 45272256 43926863 42542560 41206424 39816176 38493156 37300415 35973831
19161 35973831 34778667 33763180 32667720 31701174 30798853 29877331 29223877 28596492 27916294
19152 27916294 27218774 26620271 26043952 25433533 24871820 24386397 23806032 23381544 23055115
19143 23055115 22595431 21994185 21427547 20961663 20570684 20236872 19833302 19360599 19135606
19134 19135606 18604984 18243091 17863524 17514025 17226431 16865826 16625186 16293474 15843621
19125 15843621 15521813 15425504 15118060 14836713 14630265 14251178 13783402 13434949 13390982 13430435
19115 13430435 13140814 12999492 12788271 12431508 12186292 12011311 11842277 11671375 11359912
19106 11359912 11109630 10905072 10812849 10482731 10181063 9998353 9784578 9511820 9555925 9642076
19096 9642076 9586183 9559733 9190431 8847355 8528648 8110972 7988080 8007893 7844939 7757139
19086 7757139 7665151 7560982 7569334 7470165 7444176 7538592 7596110 7453237 7346926 7302762 7375927
19075 7375927 7410528 7234327 7163861 7072856 7077567 6996831 6971763 6973546 6945289 6926331 6780411
19064 6780411 6557516 6483621 6345108 6226160 6198301 6086894 5971948 5960506 5899639 5893304
19054 5893304 6030852 5909744 5785467 5842199 5779781 5632936 5546645 5362217 5442727 5343295
19044 5343295 5269813 5358541 5410764 5456421 5348303 5366712 5314329 5277621 5371162 5454616 5491527
19033 5491527 5485454 5470978 5380106 5386558 5407570 5328258 5474299 5542666 5598994 5714948 5925936
19022 5925936 6130903 6000085 5977699 6162630 6370446 6714658 7096945 7446229 7975392 8580937
19012 8580937 9386235 10364181 11325291 12404854 13810284 15495347 17734615 20544149 24045507
19003 24045507 28231554 33030597 38122300 43275045 48140522 52113354 55386138 57521080
18995 57521080 58668777 59338991 59702809 60004327 60264740 60536513 60455446 59411615 57603474
18986 57603474 55156544 51580053 47750538 43772600 39870110 36512210 33457157 30898162
18978 30898162 28640242 26740541 25107748 23746191 22650974 21872075 21093084 20531829
18970 20531829 20113822 19826487 19496956 19239104 19489057 19758408 19857259 20304247 21148582
18961 21148582 22038306 23064282 24343827 26004689 28119944 30934742 34289322 38571249
18953 38571249 44104000 50541617 57408815 64597208 71124261 76961113 81651259 84757795
18945 84757795 87045310 88375281 89110892 90159343 91230725 91554948 91492352 90421810 87751658
18936 87751658 84009957 78983387 73202784 67007885 60833422 54914034 49727805 45319967
18928 45319967 41557584 38519268 36147967 33643903 31686109 30189692 28744832 27581908
18920 27581908 26602914 25786280 25100670 24334387 23776881 23081880 22406558 22111320 21895036
18911 21895036 21365129 21157725 20649226 20174696 19608059 19249597 19069837 19126033 19044609 18795827
18901 18795827 18646695 18498685 18226133 18303354 18008139 17925501 18150206 18609396 19100364 19850382
18891 19850382 20718451 21670385 23023553 25146511 28346432 32670223 39231613 49073577
18883 49073577 61838799 75480110 86861089 94359464 99164033 100401492 96159667 89072635
18875 89072635 83789919 83844233 88616521 94908205 98496566 99040524 97213816 91456903
18867 91456903 81142424 68720478 57701327 49349013 43289049 38691539 35389231 32972573
18859 32972573 31318191 30002242 29010306 28148836 27365866 26383724 25560999 25140787 24560016
18850 24560016 23965522 23570909 23252686 23396344 23899912 24443024 25050471 25749928 26668909
18841 26668909 27785508 29134747 31150477 34294312 38404219 44333375 52970780 65752871
18833 65752871 83949155 106429654 128063713 144127681 154606795 160334257 158553196
18826 158553196 149401477 139374679 135432411 140383246 150845384 160168468 164637582 164696542
18818 164696542 159366990 145422470 124497250 103028994 85497068 72644079 63246041
18811 63246041 56108160 50726764 46836586 43668256 40818556 38494863 36339015 34626419
18803 34626419 33397166 32166744 31075474 30057336 28915604 28091805 27431764 26789672
18795 26789672 26121810 25690952 25048713 24289124 23463274 22864652 22218051 21699280 21217195
18786 21217195 20733051 20345929 19968914 19439823 18943223 18477655 18077738 17744973 17496831
18777 17496831 17122181 16813632 16261359 15714072 15375590 15012252 14856133 14701683 14501714
18768 14501714 14329010 14351825 14156702 14096622 14148922 14166667 14012274 14022181 13934684 13942992 14074837
18757 14074837 14261750 14676923 14629189 14645157 14872391 15202053 15678222 16161525 16399799 16649484
18747 16649484 17109224 17733456 18274438 19027104 20293820 21827575 23619228 26007287 28767447
18738 28767447 32095914 36574692 42260803 49592427 58999573 70667612 83865440 97683857
18730 97683857 110549359 121001783 127615155 129483674 126623880 119468481 109186853 97656332
18722 97656332 86300389 76174688 67489132 60293705 54853935 50196631 46411532 43570771
18714 43570771 41468297 40159579 39157239 38349833 37374225 36478363 35711500 35103959 34629412
18705 34629412 34444287 34444912 34785294 35370581 36378269 37592776 39467315 42251429 45971864
18696 45971864 51245274 58984968 70270026 87145139 112876418 149429293 193776375
18689 193776375 237720030 273830060 297759788 306276135 298202821 275034581 242904701
18682 242904701 211969593 189392177 175492082 167144116 161191107 154818817 147015541
18675 147015541 137202169 126094547 114496133 102943407 92894114 84733360 77831375
18668 77831375 72307827 67905636 64199019 60961901 58360598 55874849 53470387 51463093
18660 51463093 49410129 47445536 45836600 44544911 43326412 42318176 41332914 40335801
18652 40335801 39726141 39609823 39396105 39374312 39798297 40869588 42757385 45507353 49762923
18643 49762923 56373337 67008688 83641116 106742947 132305392 155297109 172199807
18636 172199807 180439824 178395614 165451584 143705956 118221034 95267650 78005621
18629 78005621 66098836 57982229 52346510 48044661 44600632 41950865 39624356 37513181
18621 37513181 35835426 34521563 33244541 32189164 31210814 30351021 29600024 28791840 27965890
18612 27965890 27223429 26307526 25391370 24559265 23695440 22791226 22154632 21749425 21296570
18603 21296570 20717935 20052402 19579831 19217305 18793030 18277170 17818227 17213266 16832457
18594 16832457 16597002 16117479 15608720 15286220 14987474 14553894 14111516 13746776 13365765
18585 13365765 13042953 12783369 12460889 12005062 11888857 11796197 11527169 11522886 11512378 11364320
18575 11364320 11304542 11090413 10973206 10896282 10623655 10351235 10158308 10113843 10151917 9889956
18565 9889956 9372812 9001590 8720750 8342827 8110344 7765085 7469327 7391024 7520037 7691407
18555 7691407 7649310 7492593 7243602 7006026 6896601 6844899 6756526 6500802 6434248 6539984
18545 6539984 6324965 5980475 5832099 5673789 5630494 5644003 5666693 5361105 5094404 4969945
18535 4969945 5118575 5268189 5217220 5138833 5054435 4973787 4990669 4869607 4636841 4565542
18525 4565542 4576485 4551385 4609189 4397070 4287573 4420324 4293837 4067253 4012006 4087611
18515 4087611 4174853 4266756 4080594 3861131 3868328 3758135 3566479 3567079 3777928 3752944 3573385
18504 3573385 3206766 3094289 3047210 2953204 2943155 2912110 2746724 2654433 2611597 2633339 2606848
18493 2606848 2712714 2849521 2715575 2560855 2413646 2449299 2475587 2502266 2578012 2473541
18483 2473541 2439943 2434210 2654111 2728220 2726490 2520041 2334086 2486227 2568959 2503256 2523548
18472 2523548 2469776 2429535 2416706 2541394 2677320 2661210 2599547 2530668 2648290 2621645 2516296
18461 2516296 2428483 2306725 2325010 2479226 2672296 2518581 2418370 2192245 1986424 1993680
18451 1993680 1821041 1637360 1518641 1719426 1755169 1781157 1935590 2073731 1958495 1891988
18441 1891988 1866635 1835793 1967706 1894719 1865969 1963636 2029200 1958235 1806178 1816031 1869042
18430 1869042 2080244 2017132 1826199 1854983 1936734 1913028 1747192 1719109 1922290 1847669
18420 1847669 1753607 1864469 2157953 2349343 2289266 2243340 2296571 2225691 2004089 2171170
18410 2171170 2314522 2008185 1840862 1896390 1857354 1623713 1585418 1643535 1718336 1661083
18400 1661083 1500937 1459169 1507018 1670635 1640630 1554697 1275890 1154456 1329597 1516374
18390 1516374 1473788 1498619 1527686 1505923 1684828 1847949 1773231 1750860 1679964 1607723 1395589
18379 1395589 1400772 1281712 1224666 1320886 1479142 1467851 1379884 1471013 1410559 1168525 1102489
18368 1102489 1096835 1056393 1127918 1384225 1656724 1632393 1567631 1609985 1619552 1651866 1719099
18357 1719099 1820142 2008443 2199078 2621388 2520908 2316212 2500898 2712794 2538490
18348 2538490 2144202 1867415 1917191 1921407 1705506 1604201 1620191 1627206 1604177 1520685 1471827
18337 1471827 1400893 1419853 1499326 1496189 1518599 1430490 1190093 1268729 1207675 1188583 847539
18326 847539 792028 776286 817201 799368 684314 710007 937340 1094830 998835 890992 1070500
18315 1070500 1192341 1072502 997631 905448 948360 1287831 1253452 1166108 1391358 1395806 1353051
18304 1353051 1344815 1464451 1620171 1632448 1823679 1815463 2003786 2174247 2115589 2096856 2017913
18293 2017913 1841973 1405479 1214848 1159420 1028267 969668 1063398 1172286 1042999 1056099
18283 1056099 940280 917112 1096400 1027947 959780 1285410 1328233 927117 607022 679942
18273 679942 954952 924189 911391 1118190 953028 733988 544421 630080 817436 731479
18263 731479 458148 333734 462600 490956 477851 669932 778721 734183 834501 865186
18253 865186 754897 874987 843064 791214 981094 1079372 1067432 899251 756678 552225
18243 552225 644448 884145 1014067 929902 938120 995555 953861 809431 849582 985719 936291
18232 936291 825867 423744 289181 434236 580784 598738 649606 846079 910527 943915
18222 943915 920588 959473 923729 844018 720413 665239 548619 431096 549637 587728 574732
18211 574732 540400 366813 668470 823453 837027 762226 683648 615406 694939 928614 1042647
18200 1042647 1038641 1067532 1136780 1031291 1181107 1053999 820833 1010933 1056043 907511
18190 907511 794945 735361 823360 1060079 1166607 1253175 1147461 962975 1001022 896918
18180 896918 886973 1027138 959028 851838 1039825 1099375 1039452 1113323 957254 1060151 921599
18169 921599 771987 630742 833215 1337894 1392015 1008133 823482 1121892 1466773 1736485
18159 1736485 1793006 1883991 1985452 1977755 1963927 2171647 2182695 1990399 1737256 1497800
18149 1497800 1307603 1223111 1102581 1079202 933310 901890 854041 902454 1090021 985527
18139 985527 912672 733064 726465 853443 993950 1267588 1358461 1090357 819170 642686
18129 642686 740172 669659 644883 728499 627404 574865 541033 566785 587992 670110 550302
18118 550302 501663 629849 595398 551758 670955 706675 861477 749508 777483 981528
18108 981528 1435536 1625330 1639237 1709765 1732258 1498790 1026113 869386 952932 831693
18098 831693 777748 826225 618857 527247 755400 913911 807723 518047 350262 286625
18088 286625 232863 204798 278617 409332 212654 254141 391434 226688 122261 91654
18078 91654 220812 409598 442400 497220 490496 578367 680596 789758 662969 445313 418099
18067 418099 468022 734035 614725 563925 429551 376739 479572 475284 536805 427387 349406
18056 349406 235508 212545 256850 312264 453283 570270 487202 560692 515720 416501 318016
18045 318016 218615 214980 213548 314363 290853 307826 284240 196494 234860 261039 497213
18034 497213 611188 482825 375705 459987 552213 640688 391917 316118 284999 424857
18024 424857 617509 710066 724222 581558 596858 596376 482192 297407 286835 221093 230803
18013 230803 468592 608083 408424 232778 117120 42809 -9265 -30096 219059 600727
18003 600727 538826 381786 82193 11434 -21247 -204008 -31790 397054 361048 421284
17993 421284 462103 177018 -81245 -49898 106596 348915 486633 523702 458908 312091
17983 312091 231030 21318 -13508 210177 167634 205513 186800 335497 441631 292161
17973 292161 247536 376584 533458 507982 477243 548268 557376 460295 317573 373607 318513
17962 318513 284893 316975 352926 275940 315514 364572 302616 378025 284513 375807 462789
17951 462789 348784 186867 216015 348509 458778 356112 224685 249791 414290 536858
17941 536858 292900 365594 296528 303489 365292 348072 409955 337208 115653 15765 175045
17930 175045 -25301 -117225 197825 365543 441250 259251 100671 220649 221111 446447
17920 446447 696963 415976 239886 263206 131737 178893 281637 268493 337180 440720
17910 440720 430041 359779 435417 313395 151927 -92178 -177089 -74381 -155557 9232
17900 9232 118977 68681 205758 288262 172637 108119 -79787 20821 -55141 -27318 106373
17889 106373 127300 315568 458250 394339 290876 -21638 -59289 40467 80249 125605 201818
17878 201818 97642 -158176 43095 234178 260062 195665 172091 226910 109978 60059
17868 60059 91981 69949 -58097 -24425 62773 118771 130216 96440 425254 670371 462043
17857 462043 171005 137811 -71291 -211278 -188853 -232489 61372 331872 246081 144699
17847 144699 262712 276645 290070 257718 164968 259583 370179 521660 255032 104338
17837 104338 158938 334806 427703 359712 142330 3162 -73709 -1467 67487 196337 141310
17826 141310 164381 166005 101862 -16215 -42740 -63955 -79939 102939 214863 215364 120186
17815 120186 -30470 -58464 64203 -25806 -32042 136629 256116 204174 179665 196974 305894
17804 305894 372809 406261 418061 314788 424426 448513 358730 335388 329367 155457 307007
17793 307007 432985 278846 120369 -78407 -151962 31715 260044 236291 92563 18943
17783 18943 135966 50576 54299 45584 -413 -108186 -65948 5711 46581 -45592 -124020 -92851
17771 -92851 -64104 78901 67266 167298 255996 181812 57082 71143 37049 85410 204412
17760 204412 112761 150230 213176 316627 277758 226991 218443 -35961 -147848 -2491 113319
17749 113319 -14824 34318 123592 188464 120032 297013 496775 403436 190671 159036 -19546
17738 -19546 -71976 -100768 -117631 -13850 -11097 21126 144743 35302 29215 -195638 -248602
17727 -248602 -132726 -50563 82374 136345 76394 -98722 -299750 -250130 82756 -92922
17717 -92922 -328732 -241810 116474 299685 304713 164969 244117 142223 232376 258341 181580
17706 181580 6377 -119815 -260515 -135969 18318 122298 104325 109198 199485 291475
17696 291475 146150 7074 -165804 -204440 -220905 -161900 -170581 69682 169947 272369
17686 272369 192015 168772 297531 580948 580636 439764 408098 423632 610314 709573 573772
17675 573772 395000 519130 490885 329479 237507 269223 275296 228007 134307 -4980 42594
17664 42594 100730 233410 513112 514616 464757 598497 692298 885798 752756 471577 344037
17653 344037 302410 251768 366324 617200 568594 508601 502603 472446 317106 175635 161455
17642 161455 263802 176006 403 79897 141007 231410 257382 142522 -46889 123930
17632 123930 105965 200751 274268 327368 314635 413818 329690 225520 113728 23715 202766
17621 202766 492372 480635 151131 84432 104054 104884 380470 444745 418687 461148 297437
17610 297437 457139 566116 539367 393340 325264 285794 412293 442890 507000 473235 200929
17599 200929 37258 -40066 -286091 -26438 76348 140545 -9137 150012 445848 371015
17589 371015 132075 155138 151153 142254 114286 101892 1680 94665 118524 128142 158408 298412
17577 298412 352983 54373 -214233 -306888 -346101 -167982 -27814 -17645 -57630 133912
17567 133912 175598 235284 40277 -3137 -44295 -200355 -279600 -196760 51710 113503 10189
17556 10189 81058 89115 373415 455944 289744 240018 219186 352073 329052 340727 261178
17545 261178 400722 390156 373450 93652 -166181 -297055 -149208 94151 115471 -11616
17535 -11616 -154081 -53951 -22224 14503 -116608 -202265 7219 47272 92887 73482 87947
17524 87947 193226 257494 329329 342314 145907 279225 411347 465338 449437 437790 304319
17513 304319 129978 64560 111454 89885 -185208 -107768 94139 130582 12040 -211819
17503 -211819 -272627 -196933 -67610 -60413 139598 361308 272350 245468 269557 142897 67256
17492 67256 52244 105083 -5928 -147706 -29789 -100048 19872 116753 20616 -129310 -236304
17481 -236304 -237377 -142574 -15035 -29122 165761 236697 136620 57101 -83264 -49535 -13785
17470 -13785 132075 46778 -75704 -105408 93390 113254 63168 -21416 -199812 -235326 -178734
17459 -178734 -94760 -103368 -342541 -256086 -37463 33707 63211 -154686 -112001 173153 242953
17448 242953 258367 61237 91501 243752 428466 385383 70727 163803 393880 412783
17438 412783 305719 367436 310290 182234 137079 189773 264971 262374 210102 173535 -19873
17427 -19873 71665 234495 362569 306038 123533 152329 183118 275220 187336 24852 222855
17416 222855 272721 301743 383139 198387 106996 199366 314393 214768 -77006 -35334 74579
17405 74579 69818 229041 293441 162901 85325 363711 319101 64139 -39978 12374 -127061
17394 -127061 108178 124762 31248 -1326 -1762 234057 235503 258449 206845 260005 459134
17383 459134 592703 497853 83642 -36201 -91594 -98241 54732 397375 498994 306709
17373 306709 316093 352559 223539 167016 356142 353580 132256 165471 178764 76131 37077
17362 37077 108641 140179 79055 67216 5390 352076 474121 401704 268636 250725 207453
17351 207453 198500 57090 120713 24104 38949 112082 -101485 -331111 -157604 -41704 39912
17340 39912 79762 30389 -114454 -164193 -67839 4927 -83492 -51308 30355 7843 131509
17329 131509 249621 213297 225105 189676 374408 349251 642227 549437 319198 349273 475221
17318 475221 505797 453091 435146 514534 320184 256107 244092 328972 195666 200011 164518
17307 164518 121698 370950 300950 158685 22135 -4793 235794 325996 506748 534554
17297 534554 320504 163821 294406 49264 -129282 -136314 -53971 -22239 51626 -150912
17287 -150912 -268395 -180853 -112300 66314 111860 113631 47722 102687 276382 172220 165156
17276 165156 247425 186670 -18204 -44430 99642 273124 137753 190300 -11855 -89692
17266 -89692 -79080 -139533 -154716 -215292 -297220 -347463 -223086 -152931 -104509 -26430 -106819
17255 -106819 -92170 45504 72256 201940 495922 470942 434960 389404 148099 -107330
17245 -107330 -107710 -117440 46810 177420 77126 10172 51872 209354 218369 60934 -340976
17234 -340976 -378297 -23157 217145 141811 144917 95526 120302 400820 455551 467063 370035
17223 370035 276098 212851 249703 319062 302613 192870 136312 152328 -9269 158631 295941
17212 295941 300690 142146 218019 188388 36191 -77908 -114970 46584 170605 313206
17202 313206 326844 276115 371602 325086 72036 112214 127904 207071 156220 43769 177089
17191 177089 128570 -102400 -71101 -117735 45903 440135 583017 454411 402328 176822
17181 176822 41457 51644 -188828 -220450 -240802 -159740 -79435 -127804 -75701 -176892 -269432
17170 -269432 -166548 -9364 64030 -184943 -308138 -229554 -126499 -2509 -44269 -120176
17160 -120176 -102201 -83803 -23788 -43492 73466 130028 196941 91849 62942 105828 -71375
17149 -71375 -49777 27439 99556 61097 265182 137458 -26428 -60472 -7091 168605 213881
17138 213881 136196 102061 153132 -1600 -61211 -95354 -84543 -74762 -100677 -107940 -117786 -277119
17126 -277119 -425077 -272593 -43542 52539 165255 -35030 -176708 50968 110486 182241
17116 182241 192946 242484 136386 315014 366085 89484 -30425 63907 122156 140197 80499
17105 80499 302889 234466 -58617 -87748 -80638 -29726 -65396 -96048 -4243 97976 254978
17094 254978 399212 453343 344634 306325 204609 172921 -485 90059 337149 36220
17084 36220 -92723 -267858 -226926 -228891 -46491 12706 -7840 -25838 61889 87554 50551
17073 50551 -7798 123837 4264 9518 12578 -111052 -91024 -69011 -156676 -235503 -131896
17062 -131896 -311616 -392299 -251679 -251562 -195819 -90895 -87939 -60613 -87144 -223568 -364208
17051 -364208 -275573 -130309 -23573 -5527 -85074 126496 272268 228094 299911 402761
17041 402761 490740 175243 107668 -38366 -113986 19461 -58758 -228593 -232598 -100965 52867
17030 52867 139031 216404 70558 -242805 -266873 -143339 -7766 -53924 -82008 -63674 86919
17019 86919 142682 -80040 -85180 46047 -66225 38745 144470 164235 87789 102560 232400
17008 232400 233206 210287 -16277 54448 69764 107164 175478 188626 5002 -284520 -471087
16997 -471087 -358543 -8301 2928 -193271 -341101 -400446 -405344 -340102 -277807 -121245 44916
16986 44916 79599 7082 -58859 99500 189606 108151 192440 371157 482560 590919 532276
16975 532276 300408 164005 37086 14747 -32026 -98062 -66942 -68167 -177837 -312360 -366054
16964 -366054 -406983 -346155 -330878 -345479 -250223 -77858 21444 -197636 -436652 -333039 -244995
16953 -244995 -170861 -299330 -409974 -235890 -44967 94219 232588 223297 69690 299457
16943 299457 346802 478191 518025 141683 -59907 -39081 -12720 -83481 -47857 289542 407542
16932 407542 388874 282687 80173 -188888 -279700 -232030 -159078 -266641 -336404 -136750
16922 -136750 -131220 -161237 -99715 -145383 -191604 -99595 -79040 -71037 -132291 -354810 -441866 -381945
16910 -381945 -387342 -365349 -379250 -594576 -547636 -585546 -503580 -435277 -445214 -473219 -259423
16899 -259423 -90841 -143144 -229121 -86611 -4084 156502 -9394 -68734 -7077 -7724 121294
16888 121294 12055 -53012 -198692 -268745 -243554 -199390 -78128 -122696 -301882 -310409 -269515
16877 -269515 -283507 -168996 32427 224613 428805 342199 196091 21131 37297 69292
16867 69292 100314 -93104 -50023 48401 -36847 -302404 -215615 123687 104116 -149217 -102138
16856 -102138 -215790 -80341 -34646 -18249 40118 -113789 -143693 -115801 -248256 -57103
16846 -57103 -91255 -43067 158452 251211 268315 94421 124046 238432 224040 208100 291389
16835 291389 160585 -59650 -116803 7768 199183 210214 327657 255160 73467 41351
16825 41351 24556 101806 69419 -27776 -126845 -83677 53690 34087 229533 188576 92392
16814 92392 163974 70529 -142905 -177034 -136838 -106056 -84407 14647 -52827 -101021 -40820
16803 -40820 -150552 -156767 -132768 -29811 -99839 -88857 -41592 -51753 -299552 -361346 -313100
16792 -313100 -82223 84410 13843 -7594 -116096 -276673 -126014 -58380 -130161 138959
16782 138959 447421 377730 107119 -92095 -207317 -243891 -315500 -260715 78749 159380
16772 159380 21522 45179 -51723 -210289 -284497 -14778 117654 205548 143106 121161 107206
16761 107206 50088 -4106 -71171 48044 122232 65832 83273 1095 -62905 -101031 -20264
16750 -20264 -30410 -208825 -126436 50219 23616 -2363 81249 169622 157705 56840 -47287
16739 -47287 -168939 -116845 -253785 -252164 -140024 -201617 -95461 -25261 40306 -43027 -186886
16728 -186886 -140983 -275747 -364228 -358445 -226686 -8615 68929 -10599 -31116 -222994 -335018
16717 -335018 -230312 -226449 -292533 -258188 -353618 -251107 -150304 129053 151877 70015 102885
16706 102885 63489 -74246 -221048 -236396 -92696 44596 51740 15346 -56580 -260570 -335972
16695 -335972 -166745 -25997 -216007 -205725 -256594 -142281 -92256 39034 86866 105787
16685 105787 139110 48956 -21848 -46683 -127169 -92974 -228681 -221996 -165662 -117401 45356
16674 45356 174627 97626 65576 -27136 100996 55396 -49034 60552 32704 83608 -80324
16663 -80324 -179931 -59377 70551 271091 210846 150886 161445 154345 141080 211678 202745
16652 202745 45384 -73436 -299007 -374112 -361038 -331894 -66361 151331 190896 348197
16642 348197 338107 190528 -146429 -224637 -295748 -575488 -599162 -451571 -241994 -82657
16632 -82657 -95195 -104905 -26415 128090 -34726 -38795 -116774 -130491 -185679 -168703 -254779 -194737
16620 -194737 -232670 -290292 -189427 -173334 -268135 -250919 -316148 -291125 -303730 -323408 -343898
16609 -343898 -208699 -181058 -159748 -196367 -203586 -173152 -270318 -193022 -230903 -342869 -257187
16598 -257187 -68111 -32388 -119649 -137785 40104 134836 -26100 -66358 -39396 -31595 3489
16587 3489 47049 49785 118509 145022 291393 274581 266419 133124 23452 60776 84159 192673
16575 192673 85865 -95498 -207972 -286117 -92543 65004 33430 -212566 -366932 -425005
16565 -425005 -302221 -184017 -156218 -231061 -139657 -156908 -218055 -272180 -281526 -275509 -357277
16554 -357277 -286731 -134240 -194737 -210909 -184662 -211248 -231198 -268597 -220829 -177890 -103370
16543 -103370 -74396 -99742 -75295 -116887 -208946 -105202 -140563 -316147 -324342 -144536 -54539
16532 -54539 -139385 -158202 -110124 -155855 -205745 -174630 70475 106975 134024 2974 -175748
16521 -175748 -152645 -51518 2886 26092 -139979 -306259 -335803 -269640 -130860 -10100
16511 -10100 56708 139150 206228 62881 60510 164409 21193 -112699 71616 120349 60935
16500 60935 9457 -89913 -124774 -165569 -239289 -199180 -263004 -249897 -165544 -17535 90868
16489 90868 259632 97993 -57191 16748 230066 312349 208608 -33650 -35622 171212
16479 171212 218320 288606 46828 -269638 -237206 -138839 -149487 -49902 -5407 45913 74148
16468 74148 -28486 -106331 48138 -81185 -239891 -253096 -282704 -128398 -7088 16159
16458 16159 96000 -124986 -306547 -158981 -123102 -389213 -497066 -393371 -201450 -78520
16448 -78520 -38103 -48941 -95059 -130814 -84656 -51047 -108159 -230263 37736 278031 126524
16437 126524 -198329 -422002 -484419 -605318 -386845 -78571 -76292 -126954 985 118732
16427 118732 106930 20383 -2239 18418 8555 -15930 95474 52442 -103296 -185112 -94461
16416 -94461 -45093 52409 173242 202467 -24685 -97202 -144381 -54000 -51101 8880 50194
16405 50194 -91971 -58653 -259855 -331166 -261831 -303096 -179207 -181654 -151810 -226949 -340458
16394 -340458 -502761 -435094 -507965 -453738 -108713 13812 -53986 -43337 195102 328210
16384 328210 95148 173873 57974 -137233 -95710 -209516 -419456 -515409 -286241 -142371
16374 -142371 -266218 -278370 -502897 -461365 -432727 -342805 -358621 -203963 -122683 16387 26840
16363 26840 44835 188021 139864 -93288 -267832 -20281 27156 -35160 -95629 -226077 -225233
16352 -225233 -225172 -161584 -365214 -330628 -183210 -113550 33041 -40685 -143362 -132270 -145317
16341 -145317 -344520 -497678 -449350 -431596 -245841 -310674 -411255 -436719 -177868 211479
16331 211479 127217 39935 57228 -52576 -120753 56098 334713 448070 486992 446885 222193
16320 222193 -135697 -86842 -62182 -169733 -155190 -433900 -499912 -422602 -350489 -280018 -335954
16309 -335954 -455656 -559066 -644870 -515982 -377087 -312614 -199376 -173349 7690 19184
16299 19184 130011 132921 -58572 -173188 -258424 -171694 90921 -88748 -335657 -360103 -278121
16288 -278121 -215162 -291208 -301552 -288472 -339959 -318231 -100894 -40523 -35642 -39598 -111306 -42282
16276 -42282 -64611 -197137 -147373 -164421 -142022 -14713 114344 56258 -58458 -7685 -129488
16265 -129488 -150571 2856 -56812 -113927 -54983 7456 -46678 82716 17405 -254747 -216253
16254 -216253 -121017 -53954 -56044 -151116 -191691 -101399 -106183 -27030 -255114 -154977 61021
16243 61021 -114125 -261205 -209976 -21056 -192224 -365721 -491151 -465064 -380023 -203188
16233 -203188 -131766 -13710 74597 -1639 -31390 4495 61063 -23975 -136785 -50475 56775
16222 56775 117426 173645 -48455 1347 142706 66870 35397 61745 39672 -29461 37779
16211 37779 199327 80969 -177536 -182017 -234086 -48809 167345 283363 275841 175949 215661
16200 215661 160846 136903 -23640 -52010 -210391 -401607 -552720 -431611 -359118 -167150
16190 -167150 -83666 -164167 -49994 -161605 -190490 -132532 -125198 -199814 -198106 212 40865
16179 40865 -39589 -20604 -222599 -370363 -191889 -118287 -172124 -225877 -439144 -518807 -431688
16168 -431688 -91386 22278 -199871 -453240 -346968 -321748 -388412 -346503 -354441 -259847 -69478
16157 -69478 128333 59951 31856 -166890 -184850 -110774 -236294 -266605 -203555 -377640 -457765
16146 -457765 -393525 -234502 -39973 -104524 -51642 -1334 -89518 -303140 -277053 41203 -78050
16135 -78050 -156313 -241923 -459179 -382399 -272928 68285 196958 152169 56443 -81828 -188629
16124 -188629 -284889 -290027 -486945 -774289 -532490 -327673 -172880 -492202 -670056 -481476
16114 -481476 -350872 -473872 -501293 -362230 -208811 -303541 -510743 -486006 -296897 -129508
16104 -129508 -56178 36848 67462 32651 27498 -26144 -160870 -93837 -192619 -460388 -544942
16093 -544942 -298265 -102049 -76134 -494875 -646591 -397279 -284362 -165766 -239255 -408103
16083 -408103 -359702 -264900 -100344 -213162 -87209 80978 123525 86843 -28353 -167083
16073 -167083 -92762 -27119 -261549 -461507 -217784 -122133 -269482 -307105 -8320 97060
16063 97060 26712 -247409 -283425 -306823 -99150 119472 124436 -143745 -165429 -111897 -121175
16052 -121175 -207157 -211401 -222146 -226672 -239411 -421782 -461203 -451156 -581663 -588618 -263261
16041 -263261 -151324 -272867 -289896 -289006 -287402 -176995 669 75235 182154 289941 185973
16030 185973 97866 -74908 -166793 -272861 -323820 -355044 -402281 -379936 -446244 -237603 -82973
16019 -82973 202633 296413 346634 145460 -167251 -504290 -356699 -377556 -358129 -217141
16009 -217141 -142054 -133046 -81118 -100327 -140855 -100189 -92955 -203101 -109668 -208251 -272685 -168233
15997 -168233 -165403 -159287 -83042 -126931 -63070 -170648 -65196 218365 245996 448395 336136
15986 336136 382140 206141 -123060 -317944 -341554 -209785 69427 273296 235862 107306
15976 107306 101354 31257 151368 87330 -90072 -57457 -58767 -38133 -62289 -205734 -73513
15965 -73513 67526 209879 -65288 -142642 -34609 246763 246038 -32135 -53418 -83826 -255046
15954 -255046 -314527 10363 -17088 -147296 -187740 -77554 -265196 -590080 -384458 -429995
15944 -429995 -385356 -578997 -638258 -508406 -376254 -389220 -457583 -321082 14074 157047
15934 157047 215715 155713 -2916 137888 178600 129745 147831 131458 -99487 -62451 93229
15923 93229 3732 -91908 -156012 -238608 -234973 -25006 128567 108798 6908 -147995 -206606
15912 -206606 -436407 -411883 -315776 -231686 -92891 -152899 -122984 -67146 45903 73763 45023
15901 45023 15939 -2770 -103497 -103546 -330764 -444468 -382319 -318216 -284009 -254575 -165270 -111241
15889 -111241 -50006 -163649 -315722 -474364 -356897 -192042 -166775 -23639 64731 91016
15879 91016 257692 290697 261697 181997 -27779 -259637 -235404 -245733 -138965 -19235 4906
15868 4906 1449 42577 -84667 -94871 4880 159814 -3353 -7546 -44106 -14952 8986 78777
15856 78777 -12668 -77681 156864 135353 -131967 -52094 -77890 -21507 143153 309169 240696
15845 240696 111946 15171 74766 104789 73485 926 -235025 -38124 252291 128722
15835 128722 -34292 81577 -112077 -209294 -246366 -135599 118528 439316 387231 -19202
15825 -19202 -137816 -344050 -376720 -280951 -284748 -236457 -132233 11082 -29836 -158704 -214122
15814 -214122 -173080 -58429 -22585 85314 -150787 -171423 -139539 -146643 -120244 -313411 -303583
15803 -303583 -296412 -328632 -433723 -415272 -248451 -106742 10988 173467 107427 134003 220893
15792 220893 300277 138347 33524 107338 110129 42789 9395 15070 41848 14989 58135
15781 58135 178255 373412 479267 551970 245228 45223 -16303 -96598 -179119 -218536 -356581
15770 -356581 -107098 165504 164172 292083 81849 151850 -64241 -142075 -257587 -293541
15760 -293541 -334123 -389747 -555690 -483912 -520698 -542828 -465644 -424535 -297872 -227538 -116474
15749 -116474 -99017 29288 207478 361921 385448 299661 186765 93537 40449 290455
15739 290455 134834 -101095 -141683 -246257 -352832 -290826 -147491 -18915 67778 85820
15729 85820 131248 50690 252290 205233 88416 -5540 -103347 -89219 60668 -41310 -364202
15718 -364202 -483996 -401558 -313372 -268060 -373279 -332055 -306554 -162537 -133853 -118235 -181143
15707 -181143 -176815 -51790 98196 10761 -98297 -933 -77295 -1582 -43186 -183972 -148700
15696 -148700 -39401 -29205 -164048 -214066 -253715 -59779 -82625 -286562 -267952 -105159
15686 -105159 -133612 2222 -47127 -123160 -175693 -158929 -82387 -17624 105007 190515 164758
15675 164758 -137708 -279964 -209971 -54859 -3518 -2762 -173161 -277022 -247845 -151954 -15366
15664 -15366 -167108 -203746 -91045 -212267 -387409 -294179 -136340 -234240 -278442 -147230
15654 -147230 -49644 62605 -177036 -76427 -273688 -445838 -363016 -272811 -265626 -97037
15644 -97037 134663 -20719 -252114 -304152 -302248 -205262 -269232 -464730 -611207 -642604 -744871
15633 -744871 -659833 -508400 -206121 57415 222033 100629 -289556 -346334 -215829 -279091
15623 -279091 -332995 -337799 -262428 -370745 -417393 -527075 -615696 -470108 -373972 -336485 -302977
15612 -302977 -254352 -335068 -281352 -134358 -72848 -208350 -189352 -251343 -496489 -464846 -351647
15601 -351647 -189830 -55187 2620 18004 9587 113011 83039 -185806 -355189 -280360 -86144
15590 -86144 -33494 -36460 -50673 -151682 -337752 -563666 -443630 -251819 -136282 -151364 -108851
15579 -108851 -318499 -404787 -83574 55457 -192342 -63876 -119225 58566 -1090 -143801
15569 -143801 -314774 -396124 -179061 22467 84006 158881 134900 78983 212857 62623
15559 62623 -35334 -127587 -115541 -161936 -100069 -69595 20745 99462 -152562 -163599 -188651
15548 -188651 -126417 -156589 -186294 -171122 -10914 -88186 -12984 21914 -45767 -31958 120264
15537 120264 350021 171220 -119778 -218208 -186056 -140249 -84771 167702 129978 101948 192534
15526 192534 262234 40029 196873 369815 211393 -212703 -366075 -325783 -35945 167582
15516 167582 221963 138089 191502 292343 278380 -120117 -115553 -17568 -163130 -238896 -249062
15505 -249062 -281114 -524107 -681775 -607639 -333679 -336443 -229782 -111515 -427227 -571397
15495 -571397 -323953 -222542 -188222 -50774 66329 46359 -143693 -341292 -466708 -608086
15485 -608086 -340815 64658 35585 184663 284428 338074 195237 174665 20498 6387
15475 6387 -169999 -348635 -376951 -340060 -257726 -235589 -400786 -492147 -172387 88374 170303
15464 170303 213211 206384 5038 -86463 -57358 -79338 -211745 -270074 -228390 -209389 -203274
15453 -203274 -157266 -354482 -303840 -123546 -15043 -160392 -261320 -300587 -309920 -375004 -167830
15442 -167830 -55033 -86548 32572 297319 447672 399967 276073 183196 46519 99803
15432 99803 184922 133721 -103032 -178629 -199450 -193399 -327203 -380464 -390402 -359113 -237277
15421 -237277 -250895 -282570 -267005 -301052 -320593 -380844 -301063 -31159 25231 -32188 -288674
15410 -288674 -386025 -434776 -455351 -296316 -286672 -257301 -176569 -333436 -483719 -409398 -273525
15399 -273525 -166160 -264699 -274976 -147621 39165 95967 98351 -39847 -221574 -200946 -337324
15388 -337324 -183438 -81947 17865 -58857 -184283 -190528 -283915 -298892 -155672 29555 32862
15377 32862 -94394 -192984 -200824 -69228 -59004 -188104 -267221 -289134 -73853 31765 269266
15366 269266 581518 420816 284280 419011 313052 174719 225639 196061 66391 22729
15356 22729 -130169 -191230 -107423 -132221 -33764 50971 188166 390147 333576 158509 -28376
15345 -28376 -169218 -152529 -295385 -189541 -90230 -115293 -12991 624 133143 207392 101825
15334 101825 -40614 -81306 -116188 -256334 -294173 -167713 94438 230497 29154 -125176
15324 -125176 -133392 -172310 -114599 69099 32164 -218076 -275900 -185987 -226167 -256864 -108576
15313 -108576 -113149 -147797 -112983 32806 127865 140000 63104 -272712 -169378 76125 88402
15302 88402 -202822 -192347 -121239 -345153 -380132 -415532 -373880 -176721 49218 50967 -112993
15291 -112993 -286709 -411065 -501257 -501308 -320916 -280415 -214314 -212025 -249335 -196451 -140009 -129099
15279 -129099 -13902 145178 112817 219520 258317 32916 -33177 -80131 -81508 -24038 -162569
15268 -162569 -67756 -40954 -54044 -184126 -218014 -102048 -8723 26136 119809 112894 21039
15257 21039 1049 -295709 -382668 -353507 -451103 -223428 93489 230260 217124 71099 -91849
15246 -91849 -91757 -96825 -84420 20960 -38312 -151551 -167073 -12488 91059 223760 237108
15235 237108 -123917 -250672 -507218 -152606 68123 191206 414180 462279 311722 144176
15225 144176 85211 5712 -175944 -119336 -149968 -312043 -472216 -294146 -236020 -163392 -230456
15214 -230456 -205358 -295017 -316679 -218779 -133172 -21208 9913 61658 165647 99898 144381
15203 144381 264412 199643 297805 150326 119001 -177960 -408068 -260291 51513 108844
15193 108844 -86078 -307847 -313508 -264466 -184567 -90055 -94761 -58666 -52897 1986 87810 271805
15181 271805 179116 16172 -76457 -168160 -242274 -165422 -22068 -65368 -210211 -196145 -32555
15170 -32555 -132577 -237610 -97973 11335 41381 69565 201982 274073 340281 364746 173705
15159 173705 -86448 -241560 -550543 -665326 -474643 -355962 -24453 97320 25078 -90265
15149 -90265 -254971 -242480 -243691 -421755 -182043 -46051 124563 191922 -217961 -219727 27332
15138 27332 -48972 104842 -96357 -233332 -281200 -218223 29602 64337 201128 197726 280240
15127 280240 184001 162281 -59080 -499649 -618783 -583562 -668749 -519100 -186076 -2622
15117 -2622 98823 169755 72023 -40945 -123548 -147752 -106101 51632 142605 -27255 -76675
15106 -76675 36092 190016 188445 -89697 -323655 -158488 -74233 -210446 -233203 -190259 -222857
15095 -222857 -94545 -115902 -216067 -32356 129720 50407 -102867 -90123 30351 -167782
15085 -167782 -62038 -5081 -13025 75587 16556 12069 132413 157745 77607 -48827 50338
15074 50338 111051 78906 -83188 -188650 -137541 53117 148837 187013 161041 58118 2170
15063 2170 1412 189290 303953 403967 264300 -4020 -290714 -233652 -189611 -163848 -70262
15052 -70262 -77008 -59092 92203 140491 211220 117344 208396 145276 154505 119261 -37603 -153710
15040 -153710 -309487 -349512 -204643 -162316 -119066 -219822 -207572 -331002 -434163 -247907
15030 -247907 -220743 -157257 25828 4665 98981 -19243 5352 -153340 -107009 -124561 -392113
15019 -392113 -155219 44444 15385 -84716 -145785 -71084 -101918 -42899 -79201 -172113 -221557
15008 -221557 -70628 -76433 -4968 94487 -60369 647 137354 46537 -41924 196596 240731
14997 240731 232459 259490 116091 28413 -207121 -302097 -186829 -145078 -138899 -151922 -204901
14986 -204901 -168508 -4093 26797 21360 50274 238044 207129 166058 -60037 -190937 -181526
14975 -181526 -445543 -656570 -653691 -480150 -287520 -139573 -273085 -264723 -178874 -115480 25921
14964 25921 213471 227656 124192 124670 202648 343056 28169 -116034 -168935 -331413 -292720
14953 -292720 -125580 -34785 24798 10758 -132219 2115 -57711 -148450 -233170 -209256 -235533
14942 -235533 -216207 -282871 -132408 48764 77404 -161746 -334508 -303791 -122489 -143472
14932 -143472 -226429 -147042 -264319 -294059 -122451 -136606 -38996 122037 -25796 -39495 89113
14921 89113 124571 77038 -144481 -186489 -49034 -90510 -88348 -135143 109060 54459 -109039
14910 -109039 -105659 221800 128569 -65396 -71529 -171636 -327524 -296259 -307481 -361107 -281630
14899 -281630 -126765 -173843 -223457 -62679 -122583 -211996 -122160 199784 304639 383689 252191
14888 252191 111904 -21092 -265472 -382557 -258751 -98235 -143156 -92622 29975 139459
14878 139459 65355 6357 81085 -33013 -204707 -402090 -515220 -663747 -581930 -225794
14868 -225794 -182710 -88751 -43561 89033 -72408 -61825 -96662 -240558 -140143 -66941 -49978
14857 -49978 -21523 79561 208701 201929 109800 -45226 -113503 -158443 -7415 95708 26351
14846 26351 -165727 -404419 -420047 -90151 18781 -258213 -465428 -272886 20438 161218
14836 161218 242029 176665 89761 29612 -55391 -215360 -174788 -246435 -132877 -90589 -33485
14825 -33485 -46158 -100925 -86916 -229107 -287671 -262503 -253245 -274384 -184095 -124713 12787
14814 12787 -78935 -24019 139944 197501 147912 165596 185692 172632 179303 79751 -99835
14803 -99835 -57122 138232 96812 -26663 70452 118850 232100 300778 275045 158076 84546
14792 84546 -58008 -240750 -267252 -288443 -212170 -128905 -74145 -62368 4172 157179 150074
14781 150074 127667 -95915 -192872 -121179 -62190 -36753 -171237 -243591 -245016 -247605 -308332
14770 -308332 -113331 -302715 -407954 -393983 -406456 16152 192353 -9371 -129157 -313385
14760 -313385 -274951 -142894 -84750 -60107 13072 100550 198949 213629 86125 -221645 -214211
14749 -214211 -132029 25438 27230 -100685 44882 -28299 -76687 -139197 -37083 148101 204089
14738 204089 173429 116789 150521 126158 48138 -62080 -147379 15065 -46592 -215958 -306295
14727 -306295 -139582 20200 66870 21764 -106570 65570 104154 154619 290176 65469
14717 65469 150171 230021 216318 200172 191379 64792 -119275 -115726 -46816 -93555 -160544 -208807
14705 -208807 -142283 -204545 -176378 -190076 -95411 -73207 -219877 -270768 -477172 -462443 -52137
14694 -52137 118513 -119516 -129761 -27390 -106903 -27488 -6058 -4976 -16334 -8674 -5856 94840
14682 94840 -47888 -173625 -114822 -2132 4913 37883 47394 70792 106941 43428 -43462
14671 -43462 -67465 -180888 -251952 -275429 -270296 -202302 -163034 -146676 -228827 -309972 -89960
14660 -89960 107270 112818 148315 118908 154195 108157 40687 -8130 47414 189102 40671
14649 40671 -355507 -316372 -229363 -177172 23022 79450 -57648 -119128 -113181 29451 120636
14638 120636 197859 318253 316871 180745 161811 261309 178701 75260 121086 20369 -206693
14627 -206693 -192043 -257970 -265153 -209819 -74758 248027 250207 149275 113792 51927 -66577
14616 -66577 -109109 -39168 -183498 -251642 -230524 -184780 -132933 -5862 90801 45610 -16840
14605 -16840 -286020 -115695 -13598 161825 165845 246146 95924 -66535 -26051 -181682
14595 -181682 -287986 -166568 -200923 -300026 -503314 -663768 -781091 -610308 -261415 -111789
14585 -111789 -133487 -186670 -303571 -329365 -118148 -64862 -241113 -152859 -215629 -335149 -194791
14574 -194791 -184907 -142255 -144347 -7089 73743 161550 163946 59975 166237 286864 142698
14563 142698 20115 -64065 112006 222984 186822 82506 6607 -41770 29321 88398 97390
14552 97390 -40454 -118277 -165519 -186692 -202539 -8033 185937 39115 -139623 -279354
14542 -279354 -288352 -372734 -265191 -181139 -357230 -384602 -276255 -7243 103124 160197 -8499
14531 -8499 -139285 -32204 -98906 -33530 90744 -184682 -284194 -334529 -328931 -100030 -203877
14520 -203877 -330477 -353518 -307479 -128958 67413 42835 -126527 -125217 -149303 -22196 56699
14509 56699 -19399 -268542 -219943 -316272 -254904 -282435 -286203 -274775 -135930 -142361 -110740 -9596
14497 -9596 90418 79878 -43009 -99115 -36336 55031 123273 40569 -41253 -106811 -157843
14486 -157843 -80968 -36579 -157225 -219443 -159097 -229999 -249183 -253615 -155854 -143086 -150677 -32866
14474 -32866 49409 110382 366338 230828 116671 155188 284983 302028 297669 257193 85738
14463 85738 -37087 -140160 -154639 -294794 -376269 -439674 -343663 -175187 -90966 -72568 -160291
14452 -160291 -263022 -255888 -127091 -43068 89761 22667 -81112 -72543 -258008 -209269 -201061
14441 -201061 -202954 -106108 -61456 -275893 -105586 -67005 53868 126949 226064 126336 -44105
14430 -44105 -78702 -234559 -214755 -231706 -368026 -115182 -65520 -108526 -68426 168603 202599
14419 202599 14400 -19468 -14670 41324 117925 102871 182089 97944 82909 141635 91115
14408 91115 -19706 -201992 -75699 101929 137870 183358 69397 169920 147078 142181 -58812
14397 -58812 -153199 26113 8131 -9899 -121575 -401675 -447680 -242960 -76229 -145137 -261849
14386 -261849 -203274 -67427 -162839 36795 -19333 -58425 16328 -100781 -32475 158814 316073
14375 316073 272518 290233 77837 -228086 -272187 -219971 6613 105959 295248 267782 2481
14364 2481 -239207 -4331 202746 126131 -65639 -72540 95943 193348 33170 -115694 8883
14353 8883 26384 37053 25440 36842 69797 -56407 -205469 -543040 -596513 -389506 -342811
14342 -342811 -418936 -370844 -310659 -182309 -187461 -5609 182037 179729 271751 198038 141769
14331 141769 147628 120597 -88348 -134695 -196130 -209906 68598 -3662 -144170 -82910 50987
14320 50987 356039 153268 13841 -260 125191 265934 329590 366955 301119 230745 143194
14309 143194 171997 -5495 -266823 -223882 -173451 -53794 -132573 -233581 -136900 -79436 -91782
14298 -91782 -4769 -42431 36801 33151 22659 -65819 -166921 -273528 -298135 -364650 -286457
14287 -286457 -251418 -163060 40072 24060 39286 242893 42641 -78793 -92952 -175908 -117704
14276 -117704 46018 209590 256528 54462 -148009 -197995 -310071 -264929 -328454 -312777
14266 -312777 -160922 -291410 -296235 -119456 -31180 21360 171091 263545 259083 450962 383195
14255 383195 92793 79894 80571 -234781 -239097 21608 101916 114899 -76188 -214392 -252350
14244 -252350 -88934 54344 -29724 -5970 1551 -114301 -64244 7561 38293 85752 223290
14233 223290 137208 60330 -47267 -90884 21619 4089 -171872 -157170 -29522 -93155 -79059
14222 -79059 15421 253590 287555 108163 -48968 -115851 -17411 141523 265363 192748 7974
14211 7974 48630 -81044 -54103 -71112 52109 147169 126812 239752 458934 282808 -89535
14200 -89535 70888 175243 56611 60833 153038 240790 222086 253668 201261 344389 288587
14189 288587 238086 81099 -99854 -215290 -96289 103277 144420 85171 124469 102668
14179 102668 289319 243577 -24907 -249594 -75476 228312 34167 -97662 -71986 -214991
14169 -214991 -177993 -206494 -83402 33876 -133153 -72619 78481 88484 15197 83502 -14723
14158 -14723 -120326 -162563 -79415 10958 -15029 -158444 -214099 -110052 -100896 -189808 181965
14147 181965 449218 354682 220139 127081 95652 204040 147278 40773 -4573 56324 121120
14136 121120 -12428 -48516 -176713 -71195 -12722 11664 82365 238211 311283 384737 428944
14125 428944 219360 124496 28835 138781 243033 141453 -110268 -110769 174058 233017 103566
14114 103566 91666 280885 70412 -6649 -19650 44178 60149 50519 -48710 159760 154099
14103 154099 53619 -207770 -347796 -387075 -375357 -389268 -407727 -256262 -174170 -9377
14093 -9377 50362 159995 72669 249302 229702 220649 189219 -11858 -7322 -75682 24580
14082 24580 41948 -21575 77701 207325 42143 -137964 -134314 42240 156831 152903 76765
14071 76765 61983 211746 151160 92260 296993 214471 80739 -70029 55439 242262
14061 242262 161809 -122970 -248133 -156395 -34654 233556 191400 104168 189323 272833 171438
14050 171438 98986 104440 56023 -168850 -15198 131169 289233 222710 195315 180723 144274
14039 144274 345766 303252 349587 305615 194112 283713 247417 172705 165822 183115 228516
14028 228516 266399 234454 62040 118805 11948 -122361 -104448 89101 2499 -2703 -131418
14017 -131418 -46291 -133394 -88929 -159136 -119388 -47544 -112051 -241733 -159743 -72352 -5517
14006 -5517 57894 -93178 13389 105423 -42507 -115636 -140114 -46139 -115019 -37762 3903
13995 3903 -49999 21 26904 -110722 -35492 12050 177170 343931 127669 -102651 90973
13984 90973 223862 387495 358249 301794 105617 -51789 -265143 -142108 -66912 -119637
13974 -119637 -137435 -187168 -187474 -134876 -203091 -171671 -255777 -56156 87431 90978 107155 192978
13962 192978 52030 43399 222920 189593 226637 208232 190062 207892 169089 220724 232998
13951 232998 133598 146859 146562 149819 236372 276984 160594 168682 268855 -8437 1145 125492
13939 125492 262304 328757 282336 149270 108296 155115 85432 -13906 154550 48412 -24964
13928 -24964 -156389 -408838 -346477 -311560 -282595 -308400 -206276 -151359 -43205 -40488 -183544
13917 -183544 -264611 -174984 -267756 -181704 -243526 -415689 -280710 -48274 90497 160239 346430
13906 346430 186167 -107584 -125980 179209 345101 257497 152407 -186154 -285630 -193078
13896 -193078 -300780 -222597 -202976 -276771 -211131 -82541 5605 123217 31246 -38196 147073
13885 147073 252069 508206 592011 562814 312963 153289 256002 143806 82383 29555
13875 29555 221189 165405 -190456 -161842 -35308 -91362 115734 292713 329021 216652
13865 216652 164433 201591 170800 268498 139600 79452 -112586 -138203 -10672 -116233 -94722
13854 -94722 -52332 -49260 -99183 39193 164762 52127 50016 -52528 -64910 85115 -27191
13843 -27191 -35027 67243 55224 -144687 -180971 -162463 -78190 -93041 -145357 -87752 -28461
13832 -28461 3129 49201 -31684 -151830 -231287 -10229 -22976 -18805 -119842 -157330 76282
13821 76282 128891 139705 283215 115168 26428 103751 64775 -127449 -194112 -248853 -280545
13810 -280545 -145630 -3989 113127 204458 25987 -26107 -126945 -123161 -95083 73967
13800 73967 283528 266979 350094 468108 585892 330126 83422 -60619 -184280 -196108
13790 -196108 -113203 -162606 -344462 -420329 -284846 -12991 -5257 61135 71299 143091 262314
13779 262314 155722 140323 38850 5670 67943 74312 118166 184709 5410 -45617 -77730
13768 -77730 -135078 -189667 -248175 -223219 -63124 80985 89056 145110 44926 -99990 -28135
13757 -28135 253315 110310 -59166 -65303 -71482 165525 371437 392476 239309 91606 -7188
13746 -7188 29489 14353 -121896 -166406 -780 183018 219246 69717 144766 148122 -72059
13735 -72059 11018 31774 -141755 -83212 -139130 -61086 -23354 201396 273908 267827 231786
13724 231786 162405 167782 123193 90800 191114 -123530 -297709 -150027 55711 73168 -31180
13713 -31180 -91332 -119926 -63015 79120 -7858 51224 189573 123616 -8735 -24352 12720
13702 12720 -140927 -19961 192975 26908 19108 -98496 -243329 -165387 -60999 -69520 149681
13691 149681 349483 459398 466204 321512 384924 324655 284285 7383 -77924 21346 21139
13680 21139 190198 323602 362594 361428 144709 63850 115264 381890 374254 84943 -90530
13669 -90530 -155138 -419983 -155613 67570 -59340 52789 177870 78383 71932 -18440 -93896
13658 -93896 -156906 -130467 56500 143751 271517 284503 241764 122745 -230363 -189115 -95058
13647 -95058 14732 37806 246214 355040 86620 19220 -27154 117919 -7238 -23744
13637 -23744 -54716 48121 214971 323832 167488 43090 -32061 48213 180561 192240
13627 192240 311383 235864 111128 133861 186939 254937 410199 441887 350466 462206 578459
13616 578459 431243 308461 219822 -65656 19913 208999 107396 192885 115898 -73684
13606 -73684 36736 197631 261255 128833 -112250 -291464 -62170 234674 255024 177508
13596 177508 320830 235128 -35576 -155388 20216 285948 248986 145028 203690 228990
13586 228990 103249 74006 50810 64733 121738 198219 319483 292575 417278 427429 570437
13575 570437 414207 272396 262938 542122 590257 402239 232869 235759 174580 68593 170234
13564 170234 288613 341873 298310 118279 91927 90653 -20523 152592 238484 204588 45223
13553 45223 79613 274838 420312 568688 348383 407113 405896 244265 -22097 -48448 121028
13542 121028 239858 206237 137088 224073 356244 334516 386075 452432 367552 221345 74856
13531 74856 140534 295618 246301 105400 -3308 -61584 37383 35955 82965 279688 365185
13520 365185 260141 248047 245683 396558 508070 454358 360718 301682 508258 825057 678939
13509 678939 278491 141964 357833 179192 158789 363729 378036 319706 315728 113232
13499 113232 -70541 160183 279571 156944 159550 259614 -90860 -255597 26025 47828
13489 47828 71123 230777 166902 195198 119116 212937 61537 126495 160980 24830 12695
13478 12695 -66026 -62792 55506 165377 126930 -41100 210722 472490 595861 506672 569473
13467 569473 479801 367382 293057 217472 206749 247324 278880 297900 215454 208779 385865
13456 385865 426764 451443 373508 556561 602456 707694 517905 390407 207156 61406
13446 61406 161935 271094 169460 66385 -6852 -150358 -15295 81352 69945 75560 124914
13435 124914 103981 25866 -143727 -117400 -197743 -316241 -161659 86144 167829 397877
13425 397877 391690 225885 47757 -38649 236207 213301 274299 353585 233050 281971 389096
13414 389096 434441 398984 324915 352209 402789 485240 426980 419221 523398 521005 337218
13403 337218 370324 479905 160884 -54327 -62527 69893 225555 295216 193004 238901
13393 238901 252552 594855 700098 638331 600992 406880 391490 273947 231113 152343 273988
13382 273988 256022 189038 254887 426135 541461 430699 386123 185244 -13285 79511
13372 79511 191676 291567 233192 28726 -170542 -35180 -65247 188019 281311 111171
13362 111171 115988 141591 206031 305073 373464 426524 576656 487934 500176 445427 559439
13351 559439 561795 559436 605801 601397 565511 466128 340340 137528 -214107 -289883 -188550
13340 -188550 -26746 262400 260145 329902 264537 179253 200061 376693 536532 548793 662112
13329 662112 588130 398907 457765 405914 268087 342545 294122 393827 601416 442810 403663
13318 403663 471663 291014 105960 117710 313841 257842 234185 356978 411586 413467 516546
13307 516546 506869 569795 590512 410648 306199 190881 86092 84921 262291 528532 593576
13296 593576 552430 451006 369149 184990 138013 258131 355524 378665 125735 -31702
13286 -31702 5617 214142 400315 539015 397716 274475 483826 476454 254603 359065
13276 359065 581229 439480 363115 188901 221661 263709 255017 269411 182767 38734 13857
13265 13857 -25946 -68510 -30555 50400 252369 219876 214885 136924 117402 307615 402777
13254 402777 486368 421884 438992 557240 596285 362369 234840 293329 446240 278293
13244 278293 243314 344943 174620 -53386 -56603 -14763 39925 120924 180229 556726 603305
13233 603305 183867 -88007 183718 131272 206020 256359 204128 189921 158050 258882 303959
13222 303959 428801 401110 367762 245824 144733 197439 62308 139670 166498 183043 356773
13211 356773 469976 503309 583799 655331 634875 621447 588898 757774 837549 730649 601317
13200 601317 628293 504372 436137 409988 324037 461154 607746 546523 679307 655954 759146
13189 759146 801509 743213 451813 299078 196793 378138 535045 633789 613903 440876
13179 440876 361484 311221 608793 831178 730440 656463 667321 761126 810990 760118 736733
13168 736733 693453 519106 483257 457578 383407 370308 424492 528445 412711 270072 281908
13157 281908 185599 129587 49994 155926 185657 152168 229253 262777 122438 49440 522376
13146 522376 757431 488959 402757 558345 454664 420078 501299 476417 335586 299637
13136 299637 290214 80494 -43373 63459 400130 422573 451467 514139 538151 527322 652332
13125 652332 842488 843501 632011 502801 485890 414305 391139 362821 552636 564215 411224
13114 411224 301326 433355 531708 464895 404429 528261 579972 515137 475221 387224 459987
13103 459987 706516 705273 526173 641611 534809 595331 511497 435983 388522 480496 373264
13092 373264 378781 401113 351068 264154 276544 326858 260515 327407 542743 854244 965216
13081 965216 791021 510462 496915 676368 727563 745708 586462 759358 714702 474305
13071 474305 567384 581971 477085 451750 296917 167283 424570 482335 685304 628576
13061 628576 629450 406977 368683 407653 508506 634437 536044 539599 639807 611258 455988
13050 455988 505223 504815 401830 259195 164487 334552 537224 533058 554128 451924 500844
13039 500844 614786 564773 439710 458899 473902 365741 306913 305962 361744 296337 317343
13028 317343 414362 492552 692367 625857 579162 441179 507321 699152 969086 993559 983350
13017 983350 1095201 1132662 1041852 884293 880437 897896 785824 1025810 970320 835155 727683
13006 727683 619007 657242 720399 757736 706808 625529 617763 528293 410836 571747 682625
12995 682625 575011 615810 635205 494949 458112 595688 610312 532174 644836 861881
12985 861881 796491 539073 681981 695225 773697 969764 755423 669052 844016 940178
12975 940178 826267 875438 823899 841568 873621 699895 701386 676137 603247 404425 427317
12964 427317 310715 408724 590158 687719 786004 738510 632911 668052 895007 908103 742133
12953 742133 607372 744002 725484 732501 926236 807080 797221 849167 670497 570365 667355
12942 667355 720482 693288 665431 774100 849845 766328 698792 706239 621069 396469 359495
12931 359495 488669 613567 750551 660475 646301 609924 567538 421387 481104 570234 680489
12920 680489 1062827 1164556 1012239 833895 733090 793051 712080 646907 454918 562746
12910 562746 807187 889548 913830 911124 738002 547512 436948 601897 704788 617327
12900 617327 631698 674982 652039 635140 652712 605202 620291 659883 583911 526439 797984
12889 797984 1123489 1225007 1076974 752225 718861 683703 734037 714177 668720 748996 780955
12878 780955 921128 1099919 1284269 1152223 967323 1007006 1174346 1183623 956349 698759
12868 698759 729242 771792 856492 910553 1076825 994639 1165247 1237370 1422113 1304724 1091105
12857 1091105 1016209 764385 958941 1241129 1171098 1089541 1061104 965895 1084983 1083799 1097003
12846 1097003 1051117 1015410 861928 793779 834857 844082 644604 838822 1025238 1034338 910479
12835 910479 980055 1000836 1003480 1010699 824228 819205 1011289 960835 984134 980097 994549 1017885
12823 1017885 989904 993121 970460 889328 953875 1162152 1130425 1150450 994216 839731 1147728
12812 1147728 1351684 1154490 1108390 1173127 929241 985659 1092388 1091521 1123978 909634 778286
12801 778286 956357 1096049 1006601 1053141 1324680 1443664 1303180 1025217 937260 1052487
12791 1052487 1087296 1028113 1001884 900263 977809 1079397 1123064 1141693 1481407 1508557 1173162
12780 1173162 1250799 1472842 1622389 1426530 1362980 1286093 1343630 1355351 1467871 1531892
12770 1531892 1369704 1328868 1377533 1458413 1175090 1028076 1108125 1030751 1068358 1058933 1183119
12759 1183119 1100480 1233946 1531582 1662472 1654986 1450245 1349926 1333518 1171622 1059131
12749 1059131 1218842 1401234 1502662 1306377 1187335 1263198 1290469 1170640 1290290 1468524
12739 1468524 1418494 1462714 1650856 1592060 1588437 1613430 1548589 1581186 1665259 1618037 1462264
12728 1462264 1466326 1320371 1367101 1235133 1058066 866305 1006916 1220687 1439502 1419692
12718 1419692 1074543 1006290 1243435 1180104 1240220 1499895 1587965 1569736 1494652 1649737
12708 1649737 1602260 1389080 1173475 1233077 1251913 1433934 1452288 1412722 1598347 1678032
12698 1678032 1465007 1432330 1348305 986112 884577 901932 1127775 1210892 1059020 1216019
12688 1216019 1357598 1473875 1514062 1510030 1387292 1474837 1429340 1434676 1512117 1359930 1380145
12677 1380145 1550031 1403989 1447098 1424414 1459126 1406291 1384850 1393436 1119898 1076419 1179423
12666 1179423 1370838 1575217 1636793 1497820 1369074 1376481 1417473 1294643 1362462 1350035
12656 1350035 1635109 1634401 1424194 1382861 1384880 1468143 1611054 1546967 1507405 1836470 1739448
12645 1739448 1714965 1688228 1799483 1869936 1818735 1700980 1714790 1697341 1772002 1956852 1875045
12634 1875045 1871333 1902665 1811535 1660114 1630778 1740051 1703741 1634114 1826529 2081653 2083877
12623 2083877 1689056 1660294 1727822 1810895 1725378 1614783 1758142 1669787 1415715 1347162
12613 1347162 1626490 1728952 1651040 1736817 1657431 1535520 1541626 1552726 1682383 1768402 1821179
12602 1821179 1757724 1596821 1563426 1638124 1609074 1745902 1880742 1872260 1821611 1852776 1880946
12591 1880946 1886957 2057906 2140013 1987111 1969469 2038192 1903921 1651281 1575732 1529289 1428181
12580 1428181 1322860 1583101 1745102 1750620 1749525 1720840 1680979 1723805 1659781 1658549 1760286
12569 1760286 1817432 2009656 2112655 2072795 1991554 2002629 2093563 2214016 2134227 1972123
12559 1972123 2011896 1954927 1890497 2061108 2189284 2338599 2461929 2377730 2245322 2033699
12549 2033699 1801178 1685477 1622636 1623280 1929282 2167061 1924658 1883262 1754995 1810283
12539 1810283 1701391 1916849 2010603 2024827 2069207 2056838 2058261 2092795 2126378 2154083 2082121
12528 2082121 2046489 1909377 2040850 2089546 2256940 2093216 1957900 1868491 1922731 2034243
12518 2034243 2130393 2155112 2199467 2314725 2354755 2355381 2173751 2087428 1888796 2035745 2202629
12507 2202629 2224854 2292009 2372614 2265261 2112679 2192960 2325740 2369657 2387371 2139445
12497 2139445 2030117 2191838 2238133 2237366 2328734 2341874 2418520 2485683 2309993 2154014 2076551
12486 2076551 2233600 2410452 2445177 2359642 2209891 2136551 2193969 2371426 2397769 2490345
12476 2490345 2322823 2221246 2394340 2392889 2355190 2424600 2541155 2582312 2345432 2357981
12466 2357981 2247472 2163817 2131619 1968621 2170808 2203619 2437038 2388772 2305247 2351456
12456 2351456 2267136 2254944 2230359 2510831 2655455 2463874 2450382 2448641 2143240 2083187 2150278
12445 2150278 2218500 2302877 2381079 2391731 2377423 2367340 2525450 2801198 2889230 2639324 2306490
12434 2306490 2014722 2055256 2065783 2114147 2205686 2179440 1980653 2205720 2375713 2251685
12424 2251685 2238348 2215159 2373269 2546811 2421678 2370425 2401710 2380058 2397050 2362870 2396982
12413 2396982 2535856 2618116 2832906 2827103 2674428 2547175 2723838 2822963 2618349 2678250
12403 2678250 2478569 2351138 2390478 2641440 2626394 2568883 2406400 2363937 2460511 2398560
12393 2398560 2266482 2369200 2502887 2487860 2727429 2730018 2779028 2707649 2689202 2751317 2801491
12382 2801491 2859004 2760598 2674690 2826195 2861551 2757552 2820443 2913390 2961574 2857103 2825445
12371 2825445 2839767 2981380 3060423 2922625 2915574 3063076 3144052 3125675 3002066 2755040
12361 2755040 2708972 2991091 3095577 2866821 2898516 2988734 3062988 2967410 2862752 2872327 2932438
12350 2932438 2884129 2827828 2779799 2900449 2836245 2854911 2732044 2533797 2473815 2686010
12340 2686010 2581602 2618407 2900223 2923406 2920898 2944327 3049153 3020594 2959712 2842128 2815880
12329 2815880 3045706 3140628 3037667 2892986 2970963 2891568 2886169 2913790 3087259 3304761
12319 3304761 3501968 3590963 3412237 3120926 3214042 3265046 3173908 3139373 3016891 2970656
12309 2970656 3193738 3190751 2919726 2921675 3063406 3141614 3272055 3166693 3122647 3297257
12299 3297257 3168749 2944908 2968623 3067164 3228277 3202800 3255978 3064907 3034634 3006988
12289 3006988 2794959 2742131 2972493 3110819 3227505 3251790 2921783 2690525 2764090 2594330
12279 2594330 2650024 2830651 2969601 3111052 3048541 3094023 3273126 3176987 3136067 3263058
12269 3263058 3234334 2976919 3019841 3347205 3336795 3082508 3042956 3204679 3323637 3470579
12259 3470579 3496337 3394993 3284724 3224564 3136739 3163582 3297324 3374597 3097959 3091050 3071273
12248 3071273 2995180 2951047 2955049 3041055 3148548 3260418 3367083 3339076 3323223 3240797 3214972
12237 3214972 3270101 3292730 3140845 3246611 3299657 3527221 3433759 3264287 3029957 2937658
12227 2937658 3095678 3165904 3183787 3240702 3221305 3097860 3110462 3295717 3553496 3616811
12217 3616811 3473144 3385158 3533001 3430776 3257448 3430754 3548179 3461151 3145161 3189928
12207 3189928 3268990 3330266 3477155 3565716 3336331 3312525 3419011 3489167 3601488 3506405
12197 3506405 3392240 3397851 3273291 3215116 3145777 3274995 3325169 3446955 3548852 3438831
12187 3438831 3394677 3347139 3371260 3545766 3636911 3550455 3462668 3281380 3211943 3244309 3348191
12176 3348191 3319436 3364487 3438217 3376768 3381522 3548906 3495743 3352387 3456279 3517671 3512135
12165 3512135 3387576 3356178 3375279 3449597 3492130 3514089 3384831 3408020 3373067 3390409 3413306
12154 3413306 3441085 3359435 3397344 3403924 3361686 3314074 3446574 3390114 3337624 3399269 3423118
12143 3423118 3270885 3300346 3510411 3515452 3322397 3306009 3197905 3183197 3154381 3106338 3046122
12132 3046122 3188180 3418312 3506403 3469711 3279940 3267915 3396845 3398077 3169060 3186913
12122 3186913 3279308 3443266 3517248 3526106 3562582 3333567 3322323 3483559 3508156 3248296 3118051
12111 3118051 3095850 2974411 2907921 2603513 2505597 2782372 2999969 3050269 3056007 3128958 3147173
12100 3147173 3091001 3038763 3268868 3353537 3250709 3400071 3455452 3208862 2880395 2793958
12090 2793958 2958706 3210176 3293461 3499690 3435290 3257816 3076192 2979867 2941564 2998016
12080 2998016 2961530 2966007 3154298 3287963 3202776 3374831 3399884 3175865 2998206 3129890
12070 3129890 2975536 2773794 2815662 3009909 3005262 2928416 2865856 3197264 3302620 3041007
12060 3041007 3083891 3079039 3195460 3222506 3119813 3077395 3033007 3029492 3115800 3156207 3264114
12049 3264114 3085368 2979152 2985177 2841798 2996524 3152922 3224294 3320244 3179889 3149830
12039 3149830 2999615 3050366 3313219 3375827 3290455 3404657 3621811 3524088 3256016 3185566
12029 3185566 2962541 2972406 3100043 3205744 3055939 2967799 3091745 3132298 3115754 3081317
12019 3081317 3109773 3247262 3237637 3238798 3315342 3269633 3306139 3217571 3043411 2890414 2812772
12008 2812772 2930926 3068929 3058175 3060509 3039391 2830074 2720313 2759495 2853230 2996377
11998 2996377 2960656 2990081 2942060 2881968 3167606 3093458 3253298 3663850 4059034 4215317
11988 4215317 4288693 4228981 4267328 3925027 3527650 3371366 3169204 3019716 2786238 2879445
11978 2879445 3069774 3002876 2825958 2992027 3226079 3317794 3038474 2779989 2879890 2965792
11968 2965792 2939728 2974955 2894194 3072239 3100641 2982853 3071266 3186431 3209273 3071347
11958 3071347 2909396 2766187 3005419 3120903 2909559 2997708 2817157 2716718 2894539 2872738
11948 2872738 2939864 3225226 3441571 3737599 4042099 4168961 4147448 3911485 3604654 3397887
11938 3397887 3133616 2857608 2671072 2966536 3305144 3223027 2926609 2723281 2480232 2616334
11928 2616334 2863296 2970706 2984166 3066256 3017354 2831799 2736787 2603886 2442596 2399530
11918 2399530 2359762 2518239 2446801 2263814 2335687 2304995 2345684 2493967 2443648 2386962 2454050
11907 2454050 2573175 2599748 2488040 2435929 2279946 2524252 2771566 2924654 2957669 2899222
11897 2899222 2903202 2940559 2867783 2643562 2361427 2458266 2409623 2346506 2331493 2165127 2216516
11886 2216516 2284945 2400188 2443112 2162204 2061871 2151193 2314965 2407797 2514198 2514186 2447120
11875 2447120 2492977 2342852 2399843 2351513 2100938 1927551 2016921 1881932 1917932 2060231
11865 2060231 2073476 1976525 1904586 1849981 1796465 1925027 1904842 1841546 1939712 2077947 2166174
11854 2166174 2076684 1979846 1928870 1867655 1830751 1794273 2073737 1967365 2051616 2113174 2188048
11843 2188048 2338571 2136066 1924078 1753090 1647782 1797338 1859606 1794317 1833210 1896606
11833 1896606 1845064 1799623 1842482 1865882 1537588 1643923 1860295 1918456 1928281 1771427 1814703
11822 1814703 1917691 1904656 1732354 1672635 1671853 1764169 1848648 1759331 1754815 1558629 1406795
11811 1406795 1531070 1610259 1892510 1970490 1937136 1794987 1744807 1615087 1705675 1992761
11801 1992761 1913683 1755153 1805370 1754053 1642057 1733633 1860712 1781112 1767414 1853499 1831867
11790 1831867 1561127 1448238 1346471 1443076 1674163 1627979 1449998 1382179 1535820 1548058
11780 1548058 1447485 1416313 1300770 1183887 1288932 1386735 1337676 1689390 1772609 1743388
11770 1743388 1673979 1569416 1543061 1534780 1489281 1430879 1561094 1598913 1637889 1785304 1748886
11759 1748886 1654729 1594041 1641828 1621229 1646192 1719029 1499835 1303115 1278754 1278546 1392389
11748 1392389 1340971 1159659 1053426 1262651 1351860 1457431 1444952 1318552 1386786 1395049
11738 1395049 1377165 1194410 1095756 1250873 1426176 1410013 1346626 1299244 1293883 1372962 1264502
11727 1264502 1131091 1174415 1181029 1189468 1362084 1390250 1207683 1299510 1423724 1565756 1368983
11716 1368983 1273734 1161223 1208123 1451275 1301774 1332963 1609216 1619273 1421825 1380349
11706 1380349 1503403 1395531 1155877 1352507 1369433 1176824 1048770 1197460 1320382 1366657
11696 1366657 1273130 1070601 982545 1083559 1190671 1323949 1244447 1058203 1017635 1238876
11686 1238876 1486720 1421486 1376716 1095170 1048157 1174037 1069821 1005310 1177360 1452529
11676 1452529 1464866 1338162 1247545 1232599 1266230 1385664 1427433 1340395 1059165 1056007 1083916
11665 1083916 1040100 1142216 1150125 1163453 1131238 1305930 1411641 1527862 1493087 1307217
11655 1307217 1334428 1341928 1256322 1067091 966174 987253 991925 1045781 1129316 1196465 1131902
11644 1131902 901960 853974 986655 1099827 1256206 1340460 1225816 1112530 957657 939434
11634 939434 771263 800992 863948 885079 932630 859891 933268 952103 998838 1086927 1000005
11623 1000005 1003124 976394 1147863 1165121 1018969 813466 830038 803060 881946 849427 596939
11612 596939 483896 583036 673170 775891 805201 871914 1006891 892381 947411 1054720
11602 1054720 905652 974240 1033770 994816 986475 1035245 930321 859696 928763 965733 758125
11591 758125 622841 542542 482765 489925 632874 469352 413450 497700 804836 885461 1064129
11580 1064129 935997 813509 948006 963706 694125 593528 742011 919642 1008249 976474
11570 976474 976794 819844 771098 810907 804005 801876 814888 767500 709645 624789 528601 620783
11558 620783 605357 963742 968714 819603 1070357 945251 787628 754497 811838 559602
11548 559602 504991 516363 597541 591125 618598 604760 591005 702685 826633 892547 906917
11537 906917 775040 582889 563834 580518 838933 843888 974711 1101367 1027985 1122531 778350
11526 778350 399472 617663 760591 794683 653020 456375 610391 694303 590485 923765
11516 923765 995595 887338 907360 767740 738728 959436 986685 1019199 876971 603570
11506 603570 511864 429620 137337 188333 496280 722301 683961 509307 679636 800787
11496 800787 799628 654406 671249 481915 314053 312305 444749 595110 367124 247122
11486 247122 322070 468478 367312 194622 316695 431870 331021 383716 398264 628736
11476 628736 823381 593843 506556 535730 513001 513302 707796 415852 153540 281321 672564
11465 672564 802467 672373 699629 745276 846545 755940 582412 312488 320248 463669
11455 463669 520975 545765 538975 591647 771998 764415 757513 931013 904066 755666 630033
11444 630033 521564 624904 471252 405610 315608 495429 423192 502768 581711 505229 508105
11433 508105 527228 519109 522439 424338 421141 400107 196135 224778 382443 563432 763915
11422 763915 693603 480342 368750 203703 278869 440406 429554 459154 419725 373200 627076
11411 627076 763823 736613 644701 563289 610263 575243 496045 180905 142072 310441 170770
11400 170770 283393 337736 479173 331158 394607 417253 425941 493679 237322 261361 259840
11389 259840 285462 303860 360805 305501 410298 623033 672061 657898 355941 236746 394355
11378 394355 371624 392078 286848 360288 436392 408644 423776 495324 622471 408505 208278
11367 208278 199349 207965 289301 348356 266611 195183 238750 242152 360058 301577 385679 326860
11355 326860 301038 309926 250574 68243 184734 111976 -3212 -54306 -106070 -161608 -66169
11344 -66169 161772 20848 -66003 85643 260661 347951 413989 620812 635231 401085
11334 401085 317155 282028 375906 290098 336688 346913 206358 357591 374654 362860 429966
11323 429966 543694 616392 642203 505856 413718 147716 200593 294872 355836 406293 574062
11312 574062 451485 424216 463473 516992 503442 300583 -43529 20877 197880 65940
11302 65940 142800 199196 271885 342260 322419 123797 -70832 -106962 -8537 164768 -51229
11291 -51229 -274852 18721 55218 11796 317534 526691 382897 129920 137339 255652
11281 255652 374994 368639 197898 300629 418717 492748 420234 164528 239571 139996 190692
11270 190692 145872 79751 -61693 -5210 28750 -25187 186898 449347 475119 308258 275918
11259 275918 280241 31548 -118117 -40145 118583 -8669 218984 443634 492803 623967
11249 623967 720858 528633 479228 371259 511509 653426 326608 18602 25779 237085
11239 237085 28349 170126 298850 213227 191283 273071 264617 441208 252512 -17127
11229 -17127 -52872 122591 200905 251259 164858 153349 219794 179119 322869 453570 241121
11218 241121 276844 356806 365922 343966 354468 194781 319672 364032 320802 349196 267415
11207 267415 111515 171041 295276 229428 211157 342422 293361 323324 416120 332454 208538
11196 208538 145709 146833 231807 235904 165601 57844 85770 182722 169689 -44588 32982
11185 32982 293342 395911 175113 157502 332564 239275 262812 160626 265657 458268
11175 458268 354870 216691 124390 -60959 31798 217178 253960 193504 133919 168608 232410
11164 232410 240018 217846 272060 245627 103927 -153308 -280772 -313094 -167484 -79459 -12347
11153 -12347 87564 -116069 -87815 69594 179595 277829 253754 435844 493943 526444 400151
11142 400151 171449 87805 200157 240977 249984 189475 352828 421338 330716 337394 368709
11131 368709 299905 236115 320723 195243 63744 53660 91444 126209 -41649 88860 -72121
11120 -72121 -192100 -132484 -13379 203606 312584 280035 85907 168488 117617 -18324
11110 -18324 -56023 135779 196511 172747 271171 168031 -7784 205151 300662 123538 -1510
11099 -1510 -47145 -35481 -87574 9632 -8785 181190 558345 594484 563528 463385 254292
11088 254292 108794 163799 306876 152033 83193 80420 41633 42254 102663 -34646 -68283
11077 -68283 56396 82519 120217 160987 104333 25301 -76552 -208951 -162247 -2900 -134708
11066 -134708 -225662 1116 188451 106783 -226028 -342742 -244715 -397643 -207104 -261718
11056 -261718 -347074 -472980 -504129 -584648 -394513 -416238 -614435 -562687 -353093 -378013 -313603
11045 -313603 -96710 203426 362526 380880 344735 196117 284822 423020 362924 315764
11035 315764 355097 188312 73159 71296 121604 357008 593222 892902 1040676 1070522
11025 1070522 1091405 1075239 951602 918161 890058 678832 613204 760967 888865 816585
11015 816585 1028544 1429414 1457446 1275790 1099727 999457 978616 1002569 845155 682601
11005 682601 742260 1025193 1169775 814864 835539 908603 1016716 911085 800685 722626
10995 722626 656694 601469 703326 839140 825519 777082 614247 406888 149476 243038
10985 243038 290780 309898 271865 190128 194633 351482 270167 117838 106540 200324 372784
10974 372784 273188 100129 63863 73179 -98553 -34515 -107947 -127319 71102 75919 11921
10963 11921 146457 286869 204662 280883 372414 316928 111433 50437 -14025 -103378 -268135
10952 -268135 -261464 34140 70390 111677 129844 38851 26423 -42990 -31522 36221 73249
10941 73249 46667 42114 8510 35519 3289 10071 -77337 -37820 -130796 -183630 -60083 97111
10929 97111 56770 159049 158623 2152 -186971 -323621 -395073 -279029 -292979 -259005 -73861
10918 -73861 20627 -27595 62650 49505 -176460 -251858 -403464 -256786 -179105 -133660 -116369
10907 -116369 -118040 -309153 -415352 -354179 -276522 -292951 -404536 -487853 -460251 -516492 -439942
10896 -439942 -321944 -108128 -31458 -31810 -90847 -158195 -240619 -438088 -446895 -389952 -392630 -237260
10884 -237260 -213199 -112119 -58481 92911 218118 58693 -14751 -402546 -341185 -288290
10874 -288290 -273313 -139054 -91123 -317707 -443398 -284639 -124506 -225255 -89972 -37879
10864 -37879 -178655 -228128 -248183 -288660 -322359 -227442 36590 -17281 -134818 -42160 -113832
10853 -113832 -169252 -204238 -289093 -386340 -506767 -475662 -465637 -356427 -235033 -129534 -250896
10842 -250896 -314079 -237190 5162 -79931 45805 134654 88783 -150905 -245277 5712 129004
10831 129004 -88420 -183130 -337032 -180935 37160 -36124 -170426 108594 -46825 -320208
10821 -320208 -259108 -53216 -185189 -356596 -101861 -23280 -18021 32122 151615 80602 112299
10810 112299 -25367 -55010 -338395 -447937 -354531 -223907 -133492 -116901 -180285 -181934 -195237
10799 -195237 -155353 -220497 -172894 -173216 -31573 -61119 -4175 47883 -138773 -305181 -191800
10788 -191800 -74904 -60653 14031 138794 179704 202339 168267 61729 -78893 10029 -58156
10777 -58156 -78587 -138520 -32462 283008 528560 666965 599084 401425 77239 -20178
10767 -20178 -137043 -30771 11221 46965 321853 464971 380009 261734 54292 -17243
10757 -17243 5289 68995 185830 91655 -27783 11612 104503 105649 41441 90513 262413
10746 262413 133338 -54077 -108330 -255609 -493559 -431155 -422452 -465509 -358517 -104489
10736 -104489 16902 -52756 -252464 -255781 -258631 -272975 -159362 -111646 -185540 -213239 -380530
10725 -380530 -374862 -264577 -208862 -216167 -232274 -312948 -340971 -315150 -93899 39163 -33844
10714 -33844 -151693 -27055 143658 271435 411006 298117 154193 275253 389798 531764
10704 531764 408658 232813 319833 435660 348835 269191 220147 183341 152676 119058 -64830
10693 -64830 -14324 153028 132502 96779 227301 281696 129549 128719 81586 48342 4828
10682 4828 240184 99389 -9501 140374 88078 45539 -33679 27617 106898 11803 -108564
10671 -108564 -106782 -260580 -205556 -406854 -417775 -433441 -346035 -318937 -188165 -162152 -159765
10660 -159765 -201821 -41448 -220171 -337459 -243050 15389 117270 8859 -233276 -350317
10650 -350317 -336355 -370799 -400311 -172396 -51535 35756 -90962 -108931 -18922 39268 130421
10639 130421 222461 298586 217913 302783 575222 777287 922479 832929 927958 1136844 1178263
10628 1178263 1531076 1773923 2178857 2619324 2774911 2906811 3586314 4323794 5107526
10619 5107526 5992733 7153884 8787255 10932432 14017153 18152585 23818254 31535708
10611 31535708 41439091 52500736 63135312 72397504 79553445 83941376 85604999 85296715
10603 85296715 84944666 87140165 93845195 106361389 124390851 145011379 164270057 179272128
10595 179272128 189079662 192970623 189510989 180971377 172626710 169237758 174136304 188208173
10587 188208173 210168006 235252280 257172463 271864184 278313296 274915456 260292591
10580 260292591 238489634 216779334 200860764 193619570 195026963 202896086 213323269
10573 213323269 221850099 225258989 223197844 214489704 198905268 179361889 160692432
10566 160692432 146509796 137546092 133316319 132580380 132950446 132542908 130674839 126143229
10558 126143229 118721885 108828761 97512305 86347657 76896484 69102449 62966034 58273477
10550 58273477 54476052 51218517 48665073 46414566 44332600 42586017 41132378 39722219
10542 39722219 38312353 36833002 35384550 34181643 33245977 32071759 31076872 30205056
10534 30205056 29433199 28761972 28159403 27330910 26465808 25760511 25108008 24441682 23955355
10525 23955355 23373158 22825674 22216229 21657607 21200876 20718708 20205661 19815135 19253516
10516 19253516 18746711 18150653 17673191 17410207 17217755 16950982 16564823 16270507 15920713
10507 15920713 15579124 15265076 14969466 14466683 14077234 13652304 13409807 13169903 12721902
10498 12721902 12452590 12196915 11821240 11572420 11497564 11236874 11023772 10847288 10856677 10681826
10488 10681826 10207538 9801439 9523641 9285098 9181604 9218011 9168887 8770849 8404737 8250168
10478 8250168 8244108 8037270 7859675 7586175 7455911 7271474 7078771 6803480 6598549 6460087
10468 6460087 6345711 6268110 6156439 6045482 6096050 6042344 5992845 5952235 5801885 5569815
10458 5569815 5384438 5235973 5103952 5053382 4847215 4672127 4655910 4682971 4454457 4357293
10448 4357293 4294086 4452401 4564691 4473003 4397285 4269601 4138817 4300157 4345313 4184184
10438 4184184 4125582 3825626 3706277 3498722 3319271 3313016 3368871 3224504 3343768 3244324
10428 3244324 3106530 3103899 2928226 2819322 2967436 3053067 3000141 2759086 2492825 2540004
10418 2540004 2616949 2635974 2376583 2317782 2333328 2459597 2533530 2325339 2228825 2114146
10408 2114146 2061837 2117056 1961110 1921421 1884406 1862699 1802519 1724001 1758810 1753699 1740032
10397 1740032 1500916 1333386 1454666 1337601 1051740 808207 820632 870362 911231 925168
10387 925168 976483 906609 839611 935817 816964 802455 708369 536550 765443 831031 784573
10376 784573 820465 697571 832692 744144 826102 837523 901873 1074409 1117359 1304833 1177764
$$ [...]
##END NTUPLES=NMR SPECTRUM
##END=
