##TITLE=Analysis number 314981
Compound Code ac 35911
Project Code adrs
Chemist Name cuschem
##JCAMPDX= 6.0         $$ Bruker NMR JCAMP-DX V2.0
##DATA TYPE= NMR SPECTRUM
##DATA CLASS= NTUPLES
##ORIGIN= Bruker BioSpin GmbH
##OWNER= NMR
$$ XWIN-NMR		Version 3.5
$$ Tue Nov  1 14:04:47 2005 GMT Standard Time (UT+0h)  MAYBRIDGE\NMR@NMR_250MHZ
##.OBSERVE FREQUENCY= 250.131544655141
##.OBSERVE NUCLEUS= ^1H
##.ACQUISITION MODE= SIMULTANEOUS (DQD)
##.ACQUISITION SCHEME= undefined
##.AVERAGES= 16
##.DIGITISER RES= 18
##SPECTROMETER/DATA SYSTEM= dpx250
##.PULSE SEQUENCE= zg30
##.SOLVENT NAME= DMSO
##.SHIFT REFERENCE= (INTERNAL, DMSO, 0, 16.522)
##AUDIT TRAIL= $$ (NUMBER, WHEN, WHO, WHERE, WHAT)
$$ ##TITLE= Audit trail, XWIN-NMR		Version 3.5
$$ ##JCAMPDX= 5.01
$$ ##ORIGIN= Bruker BioSpin GmbH
$$ ##OWNER= NMR
$$ C:\u/data/dgb/nmr/ADRS/11750/pdata/1/auditp.txt
$$ ##AUDIT TRAIL=  $$ (NUMBER, WHEN, WHO, WHERE, WHAT)
(   1,<2005-11-01 14:04:13.80 +000>,<MAYBRIDGE\NMR>,<NMR_250MHZ>,
      <created by zg, POWCHK disabled, PULCHK disabled
       configuration hash MD5:
       62 19 C7 07 E1 42 D1 B7 37 6C 3D D0 77 39 F9 E6
       data hash MD5: 64K
       D9 87 C9 D9 C1 2E 37 3F 64 A3 20 9D E6 12 1C A6>)
(   2,<2005-11-01 14:04:29.52 +000>,<MAYBRIDGE\NMR>,<NMR_250MHZ>,
      <Start of raw data processing
       ef LB = 0.3 FT_mod = 6 PKNL = 1 SI = 32K 
       data hash MD5: 32K
       75 5F 53 DD 09 85 5F C5 02 3A 22 3E EF 19 1C 0E>)
(   3,<2005-11-01 14:04:34.99 +000>,<MAYBRIDGE\NMR>,<NMR_250MHZ>,
      <apk 
       data hash MD5: 32K
       0D 94 47 32 50 2B 66 1E BC A5 92 30 07 13 40 DD>)
(   4,<2005-11-01 14:04:36.49 +000>,<MAYBRIDGE\NMR>,<NMR_250MHZ>,
      <abs ABSG = 5 
       data hash MD5: 32K
       00 46 89 22 A8 9F 9E 13 B5 D3 B6 C5 A3 D8 09 97>)
$$ ##END=
$$ 
$$ hash MD5
$$ 61 2F 38 D8 7B A8 7A 65 FF 1A 76 5C 75 11 13 BB
##$RELAX= 
##$RELAX= 
##$RELAX= 
##$RELAX= 
##$RELAX= 
##$RELAX= 
##$RELAX= 
$$ Bruker specific parameters
$$ --------------------------
##$DU= <C:\u>
##$EXPNO= 11750
##$NAME= <ADRS>
##$PROCNO= 1
##$TYPE= <nmr>
##$USER= <dgb>
##$AMP= (0..31)
100 100 100 100 100 100 100 100 100 100 100 100 100 100 100 100 100 100 
100 100 100 100 100 100 100 100 100 100 100 100 100 100 
##$AQSEQ= 0
##$AQ_mod= 3
##$AUNM= <au_zg>
##$AUTOPOS= <17 >
##$BF1= 250.13
##$BF2= 250.13
##$BF3= 250.13
##$BF4= 250.13
##$BF5= 500.13
##$BF6= 500.13
##$BF7= 500.13
##$BF8= 500.13
##$BYTORDA= 1
##$CFDGTYP= 0
##$CFRGTYP= 5
##$CHEMSTR= <none>
##$CNST= (0..31)
1 1 145 1 1 1 1 1 1 1 1 1 1 1 1 1 1 1 1 1 1 1 1 1 1 1 1 1 1 1 1 1 
##$CPDPRG= <>
##$CPDPRG1= <>
##$CPDPRG2= <>
##$CPDPRG3= <>
##$CPDPRG4= <mlev>
##$CPDPRG5= <mlev>
##$CPDPRG6= <mlev>
##$CPDPRG7= <mlev>
##$CPDPRG8= <mlev>
##$CPDPRGB= <>
##$CPDPRGT= <>
##$D= (0..31)
0 1 0 0 0 0 0 0 0 0.06 0 0 0 0 0 0 0.0002 0 0 0 0 0 0 0 0 0 0 0 0 0 0 
0 
##$DATE= 1130853852
##$DBL= (0..7)
120 120 120 120 120 120 120 120 
##$DBP= (0..7)
150 150 150 150 150 150 150 150 
##$DBP07= 0
##$DBPNAM0= <>
##$DBPNAM1= <>
##$DBPNAM2= <>
$$ [...]
##$SUBNAM7= <"">
##$SUBNAM8= <"">
##$SUBNAM9= <"">
##$SW= 20.6930455092707
##$SWIBOX= (0..15)
0 0 3 0 0 0 0 0 0 0 0 0 0 0 0 0 
##$SW_h= 5175.983436853
##$TD= 65536
##$TD0= 1
##$TE= 296.16
##$TE2= 300
##$TE3= 300
##$TEG= 300
##$TL= (0..7)
0 120 120 120 120 120 120 120 
##$TP= (0..7)
150 150 150 150 150 150 150 150 
##$TP07= 0
##$TPNAME0= <>
##$TPNAME1= <>
##$TPNAME2= <>
##$TPNAME3= <>
##$TPNAME4= <>
##$TPNAME5= <>
##$TPNAME6= <>
##$TPNAME7= <>
##$TPOAL= (0..7)
0.5 0.5 0.5 0.5 0.5 0.5 0.5 0.5 
##$TPOFFS= (0..7)
0 0 0 0 0 0 0 0 
##$TUNHIN= 0
##$TUNHOUT= 0
##$TUNXOUT= 0
##$USERA1= <user>
##$USERA2= <user>
##$USERA3= <user>
##$USERA4= <user>
##$USERA5= <user>
##$V9= 5
##$VALIST= <valist>
##$VCLIST= <CCCCCCCCCCCCCCC>
##$VD= 0
##$VDLIST= <DDDDDDDDDDDDDDD>
##$VPLIST= <PPPPPPPPPPPPPPP>
##$VTLIST= <TTTTTTTTTTTTTTT>
##$WBST= 1024
##$WBSW= 4
##$XGAIN= (0..3)
0 0 0 0 
##$XL= 0
##$YL= 0
##$YMAX_a= 541146
##$YMIN_a= -473550
##$ZGOPTNS= <>
##$ZL1= 120
##$ZL2= 120
##$ZL3= 120
##$ZL4= 120
##$ABSF1= 16.522
##$ABSF2= -4.171173
##$ABSG= 5
##$ABSL= 3
##$ALPHA= 0
##$AQORDER= 0
##$ASSFAC= 0
##$ASSFACI= 0
##$ASSFACX= 0
##$ASSWID= 0
##$AUNMP= <proc_1d>
##$AZFE= 0.1
##$AZFW= 0.1
##$BCFW= 0
##$BC_mod= 0
##$BYTORDP= 0
##$COROFFS= 0
##$CY= 12.5
##$DATMOD= 1
##$DC= 0
##$DFILT= <>
##$DTYPP= 0
##$F1P= 14.0000005364418
##$F2P= -0.99999901652339
##$FCOR= 0.5
##$FTSIZE= 32768
##$FT_mod= 6
##$GAMMA= 0
##$GB= 0
##$INTBC= 1
##$INTSCL= 1
##$ISEN= 128
##$LB= 0.3
##$LEV0= 0
##$LPBIN= 0
##$MAXI= 10000
##$MC2= 0
##$MEAN= 0
##$ME_mod= 0
##$MI= 0
##$NCOEF= 0
##$NC_proc= -2
##$NLEV= 6
##$NOISF1= 0
##$NOISF2= 0
##$NSP= 0
##$NTH_PI= 0
##$NZP= 0
##$OFFSET= 16.522
##$PC= 1
##$PHC0= 70.39283
##$PHC1= 5.567639
##$PH_mod= 1
##$PKNL= yes
##$PPARMOD= 0
##$PSCAL= 4
##$PSIGN= 0
##$REVERSE= no
##$SF= 250.13
##$SI= 32768
##$SIGF1= 0
##$SIGF2= 0
##$SINO= 400
##$SIOLD= 32768
##$SREGLST= <1H.DMSO>
##$SSB= 0
##$STSI= 32768
##$STSR= 0
##$SW_p= 5175.98343685301
##$SYMM= 0
##$S_DEV= 0
##$TDeff= 65536
##$TDoff= 0
##$TI= <Analysis number 999999
Compound Code 99
Book Reference 9
Project Code 9>
##$TILT= no
##$TM1= 0
##$TM2= 0
##$TOPLEV= 0
##$USERP1= <user>
##$USERP2= <user>
##$USERP3= <user>
##$USERP4= <user>
##$USERP5= <user>
##$WDW= 1
##$XDIM= 32768
##$YMAX_p= 354581398
##$YMIN_p= -121030
$$ End of Bruker specific parameters
$$ ---------------------------------
##NTUPLES= NMR SPECTRUM
##VAR_NAME=  FREQUENCY,     SPECTRUM/REAL,   SPECTRUM/IMAG
##SYMBOL=    X,             R,               I
##VAR_TYPE=  INDEPENDENT,   DEPENDENT,       DEPENDENT
##VAR_FORM=  AFFN,          ASDF,            ASDF
##VAR_DIM=   32768,         32768,           32768
##UNITS=     HZ,            ARBITRARY UNITS, ARBITRARY UNITS
##FACTOR=    0.157963299565203, 1,           1
##FIRST=     4132.6476996994, 0,             0
##LAST=      -1043.33573715361, 0,           0
##MIN=       -1043.33573715361, -121030,     0
##MAX=       4132.6476996994, 354581398,     0
$$ Real data points
##PAGE= N=1
##DATA TABLE= (X++(R..R)), XYDATA
$$ [...]
24278A8064J746J7560j6333q977J2406l461j0214k6031j6093O988k3958L3332
$$ 18064 19810 37370 21037 12060 24466 21005 10791 -15240 -31333 -24345 -48303 -14971
24266a4971J7163n414j3823K532J1095j5582J0504J2479j9735j2088K316k1936
$$ -14971 2192 -3222 -17045 -14513 -3418 -19000 -8496 3983 -15752 -27840 -25524 -47460
24254d7460L861K5752j7323K2248J3998j1573l5250N854L0328j8781K8219J1331
$$ -47460 -43599 -17847 -35170 -12922 1076 -10497 -45747 -39893 -9565 -28346 -127 11204
24242A1204l303m888j2679j8547J2571j3652J5149j7850J1494K095j2182j1585
$$ 11204 7901 3013 -9666 -28213 -15642 -29294 -14145 -31995 -20501 -18406 -30588 -42173
24230d2173k0020J4789Q133J7599j684P2Q308M912R170M048L0140K657o271N843
$$ -42173 -62193 -47404 -39271 -21672 -23356 -23284 -14976 -10064 -894 3154 33294 35951 29680 35523
24216C5523L221k9500M649N061l0452q488M460j1102J6856L1937J1418o256j5592
$$ 35523 38744 9244 13893 18954 -11498 -19986 -15526 -26628 -9772 22165 33583 27327 11735
24203A1735j172n118k7134n131j0334j0554K1786L500L4094K5895r858J4134n005
$$ 11735 10563 5445 -21689 -26820 -37154 -47708 -25922 -22422 11672 37567 27709 41843 36838
24190C6838j7917o182k7541p167Q188L0118o985K70j3900K5r582K6941L5007m7639
$$ 36838 18921 12739 -14802 -21969 -13781 16337 9352 9622 -4278 -4253 -13835 13106 48113 474
24176D74k3290L0456j0071k9482O779K1746O501o504J4192J818m769j3075j6112
$$ 474 -22816 7640 -2431 -31913 -25134 -3388 3113 -3391 10801 12619 7850 -5225 -21337
24163b1337L7132J0968K00R041j8981j6669p498j4287J4309k9400k6917J5162
$$ -21337 15795 26763 26963 36004 17023 354 -7144 -21431 -7122 -36522 -63439 -48277
24151d8277L8681K1858j7620k7726j1399J1285Q500J6857j8775P175L0361O171
$$ -48277 -9596 12262 -5358 -33084 -44483 -33198 -24698 -7841 -26616 -19441 10920 17091
24139A7091j0402l292J058J089Q359j070k1915K465j378k6496J5539j0685L612
$$ 17091 6689 3397 4455 5544 13903 12833 -9082 -6617 -7995 -34491 -18952 -29637 -26025
24126b6025l311M878k833N200j2860j7817O416J1359r927k401L0577J3769O106
$$ -26025 -29336 -24458 -27291 -22091 -34951 -52768 -46352 -34993 -44920 -47321 -16744 -2975 3131
24113C131j3434j0369K2068K6129J747p927M238j4808j8975k4866K197K1765J2972
$$ 3131 -10303 -20672 1396 27525 29272 21345 25583 10775 -8200 -33066 -30869 -9104 3868
24100C868n044n936k6071l1080m376L6289L7046j3379O070L977o399j5230n022
$$ 3868 -1176 -7112 -33183 -64263 -68639 -32350 4696 -8683 -2613 1364 -5035 -20265 -25287
24087b5287K1635J4819J3575k1345P105K3218l3962j9035r631k0342o139j4775
$$ -25287 -3652 11167 24742 3397 10502 33720 -242 -19277 -28908 -49250 -55389 -70164
24075g0164K1515K0595K305n588L1119P752j5673j3535j4254l1802j08j439N424
$$ -70164 -48649 -28054 -25749 -31337 -218 7534 -8139 -21674 -35928 -67730 -67838 -69277 -63853
24062f3853K7473J8280K599R596j0108k2394q148N085J6021L5710J4093j4368
$$ -63853 -36380 -18100 -15501 -5905 -16013 -38407 -46555 -41470 -25449 10261 24354 9986
24050I986k483N812M759O416J3113j3086R278j761K550J2274k0860j8200k3867
$$ 9986 7503 13315 18074 24490 37603 24517 33795 32034 34584 46858 25998 7798 -16069
24037a6069l3399n819J9594J3350o76R976J3351k6290k3904j390j0215J8299j0185
$$ -16069 -49468 -55287 -35693 -22343 -23019 -13043 308 -25982 -49886 -51276 -61491 -43192 -53377
24024e3377J3932P284J2154M672O31j2981L8450J4866m580j92k7089k1394r121
$$ -53377 -39445 -32161 -20007 -15335 -14704 -27685 10765 25631 21051 20859 -6230 -27624 -36745
24011c6745M512J0730J8336j2697Q671K4679n715O692k2948p361m728L805K2675
$$ -36745 -32233 -21503 -3167 -15864 -7193 17486 11771 18463 -4485 -11846 -16574 -12769 9906
23998I906L536j1604J533k4749k2764n295R941Q248j1859K8106K7107j117j2322
$$ 9906 13442 1838 3371 -21378 -44142 -49437 -39496 -31248 -43107 -15001 12106 10989 -1333
23985a333p42r114k4134j8066L9396K6536R895r68j9255j6581l4642j385K4880
$$ -1333 -2075 -11189 -35323 -53389 -13993 12543 22438 21470 2215 -14366 -49008 -50393 -25513
23972b5513K1513J4753K7885k38j4030j8792k6091N790O664J9916J9743j6809
$$ -25513 -4000 10753 38638 38400 24370 5578 -20513 -14723 -8059 11857 31600 14791
23960A4791r762Q735j1204J2430J4995P50k5534j1980J3562K1489p892l9914L689
$$ 14791 5029 13764 2560 14990 29985 30735 5201 -6779 6783 28272 20380 -19534 -15845
23947a5845M817p954P930L0377j1171o0k4176Q337k6175k2182K2686K6458K2040
$$ -15845 -11028 -18982 -11052 19325 8154 8094 -16082 -7745 -33920 -56102 -33416 -6958 15082
23934A5082j3596q234l0584J3036K3746J3340J5462Q439k4862l1523k6402j6908
$$ 15082 1486 -6748 -37332 -24296 -550 12790 28252 36691 11829 -19694 -46096 -63004
23922f3004Q731L8512J2217J2595j1903j2860k1116q006J0234L0448r733k492
$$ -63004 -54273 -15761 -3544 9051 -2852 -15712 -36828 -44834 -34600 -4152 -13885 -16377
23910a6377K6461j362j3349L726m872k7040o183K991N437J368R502N734Q884j2285
$$ -16377 10084 8722 -4627 -901 -5773 -32813 -38996 -36005 -30568 -29200 -19698 -13964 -5080 -17365
23896a7365J5035J6398j2347j6595J7132J9991J8083n670J7889r402J5715J052
$$ -17365 -2330 14068 1721 -14874 2258 22249 40332 34662 52551 43149 58864 59916
23884E9916j5507l5483J908M1411K1926j2230k5610n9021o630J4239O241r066
$$ 59916 44409 8926 10834 52245 74171 61941 36331 -22690 -29320 -15081 -8840 -17906
23872a7906o937j5087j9762o796R182K5878P527j3443K030P6m985K7660K4328
$$ -17906 -24843 -39930 -59692 -66488 -57306 -31428 -23901 -37344 -35314 -35238 -40223 -12563 11765
23859A1765q377l106L983K1341J2476m4053p220p553k4263J4930J4863j0779j6360
$$ 11765 3388 282 4265 25606 38082 -5971 -13191 -20744 -45007 -30077 -15214 -25993 -42353
23846d2353K8200J9563J930J0847k724j6163Q316l24k979k0513q588K1626Q391
$$ -42353 -14153 5410 7340 18187 15463 -700 7616 7292 4313 -16200 -24788 -3162 5229
23833E229p639k4658K9336M3488m4605k8741L9402P763k8847l2628J4929K6927
$$ 5229 -2410 -27068 2268 45756 1151 -27590 11812 19575 -9272 -41900 -26971 -44
23821d4o695l2669K1431J0423r907j5262K3435j0962K789J2679l3630n525L7881
$$ -44 -6739 -39408 -17977 -7554 -17461 -32723 -9288 -20250 -17461 -4782 -38412 -43937 -6056
23808f056L3626j8098l2177P323K5166J9410Q443j2375o948O707p027j6011j2216
$$ -6056 27570 9472 -22705 -15382 9784 29194 37637 25262 18314 25021 17994 1983 -10233
23795a0233j8710m991K6255N214k114J5001q214j1512J0701J8740k0153L060J1246
$$ -10233 -28943 -33934 -7679 -2465 -4579 10422 2208 -9304 1397 20137 -16 3044 14290
23782A4290k6114l3182K4870R069k3487M314J7496j5141r581L5171n67o283j1283
$$ 14290 -11824 -45006 -20136 -11067 -34554 -30240 -12744 -27885 -37466 -2295 -2862 -9145 -20428
23769b0428L847J7689J0886J6625J0890M53j5714q177j7273J274j7843r410K1198
$$ -20428 -16581 1108 11994 28619 39509 39962 24248 16071 -1202 72 -17771 -27181 -5983
23756e983j7706k5275J4954M0870M059j0957J4460J5952j7487M565p589p333k383
$$ -5983 -23689 -48964 -34010 6860 10919 -38 14422 30374 12887 17452 9863 2530 147
23743A47L455p54j6766j2091K6867j2939k736N014j2021k2717K06M7478j3081
$$ 147 3602 2848 -13918 -26009 858 -12081 -14817 -9803 -21824 -44541 -44335 3143 -9938
23730i938J6851P405K2424N806k6929k4011k0264k0011N539j9602J6705L2045
$$ -9938 6913 14318 36742 42548 15619 -8392 -28656 -48667 -43128 -62730 -46025 -13980
23718a3980M3315l5658k4737K6623K3355k3835O357Q903J0191j9414m106l1261
$$ -13980 29335 -6323 -31060 -4437 18918 -4917 1440 10343 20534 1120 -2986 -34247
23706c4247l8683K0300M0739N0943K1039l9901l5019j0374O753j3260j3179k466
$$ -34247 -72930 -52630 -11891 39052 60091 20190 -14829 -25203 -18450 -31710 -44889 -47355
23694d7355M4822L7611K8547k9928j5686l2627M4704J1207k2832j213l868j3112
$$ -47355 -2533 35078 63625 33697 18011 -14616 30088 41295 18463 17250 13382 270
23682B70L5950J005l3718p581J0922l5882o609L1996n061q775L429O949M322p502
$$ 270 36220 37225 3507 -4074 6848 -29034 -35643 -3647 -8708 -17483 -14054 -7105 -2783 -10285
23668a0285m2303q43J6970L878R581l567P244j7402k1127k4515K6540K4472K3313
$$ -10285 -52588 -53431 -36461 -32583 -23002 -26569 -19325 -36727 -57854 -82369 -55829 -31357 -8044
23655h044j4281J6796M818o037l548k850N732k238j0080K509J3389J9294j7032
$$ -8044 -22325 -5529 -711 -6748 -10296 -13146 -7414 -9652 -19732 -17223 -3834 15460 -1572
23642a572j4056O244K7328J9384k0076n062K3636l970k6250l0432K3801n083p369
$$ -1572 -15628 -9384 17944 37328 17252 12190 35826 31856 5606 -24826 -1025 -6108 -13477
23629a3477r461J8141J2570j1307J6407Q281j5746k638j877K1572p616l6087j7164
$$ -13477 -22938 -4797 7773 -3534 12873 21154 5408 2770 893 22465 14849 -21238 -38402
23616c8402J0051K0031j1708P526R219J0167M326l5454N94K9956k106o998n106
$$ -38402 -28351 -8320 -20028 -12502 -3283 6884 11210 -24244 -23650 6306 4200 -2798 -7904
23603g904j3213M340q810O627L3215K7017p183j2639r415j6735l622L6975K3897
$$ -7904 -21117 -16777 -25587 -18960 14255 41272 34089 21450 12035 -4700 -8322 28653 52550
23590E2550p957k0734r005l7427m605K5448J9648K987J7032R27k3743J2766j3043
$$ 52550 44593 23859 14854 -22573 -27178 -1730 17918 20905 37937 38864 15121 27887 14844
23577A4844J4119n140N973K0785m485k5460o36j5114J657J1036k6045j59M009
$$ 14844 28963 23823 29796 50581 46096 20636 20000 4886 6543 17579 -8466 -8625 -4616
23564d616K227J0489m94n724K4979J129k6148l9290j1947M891o84K1760J6850
$$ -4616 -2389 8100 7606 1882 26861 27990 1842 -37448 -49395 -44504 -45188 -23428 -6578
23551f578O937j9201K3191j3247j8657k4300J5582L6504M9394J5123k2245k2429
$$ -6578 359 -18842 4349 -8898 -27555 -51855 -36273 231 49625 64748 42503 20074
23539B0074n877j1972l653Q606M567p204N305K4565j865M066j4825l4333j3374
$$ 20074 14197 2225 -1428 7178 11745 4541 9846 34411 32546 36612 21787 -12546 -25920
23526b5920Q611j84K4607L0684R487j3948k3050j4135n073p0j8660l0734K6445
$$ -25920 -17309 -17493 7114 37798 47285 33337 10287 -3848 -8921 -8991 -27651 -58385 -31940
23513c1940K5759K7961J2688m917j5719k2840j821M238J3392j4962j7246L2348
$$ -31940 -6181 21780 34468 29551 13832 -9008 -10829 -6591 6801 -8161 -25407 6941
23501F941L227Q56J7308o056q476j9888j7903R411L0467K645p240J3985R19j4530
$$ 6941 10168 11024 28332 22276 13800 -6088 -23991 -14580 15887 18532 11292 25277 26196 11666
23487A1666j5535J5962K8925l2663m3167p144J8129K87p232J6752J8079L687k1797
$$ 11666 -3869 12093 41018 8355 -34812 -41956 -23827 -23540 -30772 -14020 4059 7746 -14051
23474a4051K0243Q379j037o145m795j6157k2051j8785k5563J7602K7270J4501
$$ -14051 6192 14571 13534 7389 2594 -13563 -35614 -54399 -79962 -62360 -35090 -20589
23462b0589k1454j9031J3849N5807J394k262j2222Q756J242n006j3160j157j2355
$$ -20589 -42043 -61074 -47225 8582 9976 7714 -4508 4248 5490 484 -12676 -13833 -26188
23449b6188P67R764R043m802r901J7601o760k0614R688K3947j2240J4794o063
$$ -26188 -25421 -15657 -6614 -11416 -21317 -3716 -10476 -31090 -21402 2545 -9695 5099 -964
23436i64J7180j496k0363l988R00Q05N072K7482J7862l29J2151k0647j6988k8763
$$ -964 16216 14720 -5643 -9631 -8731 -7926 -2854 24628 42490 42161 54312 33665 16677 -12086
23422a2086n695r247J2179m266k1191n951J9064J0790R986J3854K526k2384j033
$$ -12086 -17781 -27028 -14849 -19115 -40306 -46257 -27193 -16403 -6417 7437 9963 -12421 -13454
23409a3454j0229J4381N840Q4L9850K0721q346O284k098j8017o818J73M295J2120
$$ -13454 -23683 -9302 -3462 -3378 36472 57193 48847 55131 53033 35016 28198 28371 32666 44786
23395D4786j5797j8245k8251P827L972J8263m670q781j1578M3669J9859J2568
$$ 44786 28989 10744 -17507 -9680 -5708 12555 7885 -896 -12474 31195 51054 63622
23383F3622Q218k1868r596j9370k6180k3978o458K4704K9788n242M343k345O510
$$ 63622 71840 49972 40376 21006 -5174 -29152 -35610 -10906 18882 13640 17983 15638 22148
23370B2148k0554j6552K4234L9008J6833r587r538N31l7233o521j428J9286N211
$$ 22148 1594 -14958 9276 48284 65117 55530 45992 46523 9290 2769 1341 20627 25838
23357B5838O395j510Q468J8098j3436m7885r148p383k3604J2980L9996K1723k7409
$$ 25838 32233 30723 39191 57289 43853 -4032 -13180 -20563 -44167 -31187 8809 30532 3123
23344C123j4497R066J0118k0501k9010j0806L2M067L2103q419J3103L7753j5545
$$ 3123 -11374 -2308 7810 -12691 -41701 -52507 -52475 -48408 -16305 -24724 -11621 26132 10587
23331A0587j1559j266J9530K3179J372k4596k4385j5467Q553Q169j507k348J2465
$$ 10587 -972 -2238 17292 40471 41843 17247 -7138 -22605 -14052 -5883 -7390 -9738 2727
23318B727j4220k8362j3272L4914M7199P412n932M953L703j4914n6213k4577K5969
$$ 2727 -11493 -39855 -53127 -18213 28986 36398 30466 35419 39122 24208 -32005 -56582 -30613
23305c0613J2993j8200J2992L3758R900j230K0206J6603p888l2056J5225M826
$$ -30613 -17620 -35820 -22828 10930 20830 19600 39806 56409 48521 16465 31690 36516
23293C6516J6018J6811J3296k8731j2738l3734r046j4820j352k247J3851K3974
$$ 36516 52534 69345 82641 53910 41172 7438 -1608 -16428 -17780 -20027 -6176 17798
23281A7798N146l6762j5540o694K2594K3688J847k1304J3363k096m5812j6410
$$ 17798 22944 -13818 -29358 -36052 -13458 10230 12077 -9227 4136 2040 -43772 -60182
23269f0182K3088J1220J3055K3618j4434l441k8679J3158L8852l4135L181k96
$$ -60182 -37094 -25874 -12819 10799 -3635 -7076 -35755 -22597 16255 -17880 -14699 -14995
23257a4995J4784R876j7638j2521L159P215j631J4770k9329j7828Q327j5584M1454
$$ -14995 -211 9665 -7973 -20494 -17335 -10120 -11751 3019 -26310 -44138 -35811 -51395 -9941
23244i941L5985J148p710L295P526j0852K006K8228J3286p99K954r045k5588k5518
$$ -9941 26044 27192 19482 22777 30303 19451 21457 49685 62971 62172 65126 56081 30493 4975
23230D975j8106j4195K756N165n966J7435l5982l918L980M040j2353j9154J7675
$$ 4975 -13131 -27326 -24570 -19405 -25371 -7936 -43918 -47836 -43856 -39816 -52169 -71323 -53648
23217e3648M2431J542j0450q177J7445J0295K6009N944r810j3639k7223l2747
$$ -53648 -11217 -9675 -20125 -28302 -10857 -562 25447 31391 21581 7942 -19281 -52028
23205e2028q645J8690J7867K1595J0713l7437k9595m795l82K9553L4775K1688
$$ -52028 -60673 -41983 -24116 -2521 8192 -29245 -58840 -63635 -64017 -34464 311 21999
23193B1999O164l1344l1292m006K7851M118J489J2863J5405j2638j8596j4542
$$ 21999 28163 -3181 -34473 -38479 -10628 -6510 -5021 7842 23247 10609 -7987 -22529
23181b2529O353J6747p49p553j1057k8181N538J0191J7379J5548r783n753j762
$$ -22529 -16176 571 -178 -7731 -18788 -46969 -41431 -31240 -13861 1687 -8096 -13849 -15611
23168a5611o459K4343J0840j4903M380Q684l838r321q44Q090m458k160J7693p654
$$ -15611 -22070 2273 13113 -1790 2590 11274 7436 -1885 -2729 5361 903 -1257 16436 8782
23154H782j9606j2573K960j7330J717L358Q548J4844k0260k912J650n665k582
$$ 8782 -10824 -23397 -20437 -37767 -36050 -32692 -24144 -9300 -29560 -32472 -30822 -36487 -39069
23141c9069K2093P043j8035J5503Q269j0881p997K4693j104j8939k0882J270P643
$$ -39069 -16976 -9933 -27968 -12465 -4196 -15077 -23074 1619 515 -18424 -39306 -38036 -30393
23128c0393O888L6802O848j4144k8996n3857p737K5756J4413M0547K2886L055
$$ -30393 -23505 13297 20145 6001 -22995 -76852 -84589 -58833 -44420 -3873 19013 22068
23116B2068p112j3059n761J6376K0841K1011k8754k6223j0248m945k0295j7372
$$ 22068 14956 1897 -3864 12512 33353 54364 25610 -613 -10861 -15806 -36101 -53473
23104e3473K4245L2442J3104j1764j9422k2585m078P939l131J8658R584J6185
$$ -53473 -29228 3214 16318 4554 -14868 -37453 -41531 -33592 -36723 -18065 -8481 7704
23092G704Q921K1182J2469k8222n1306k0294K3225K7577j739j2503K4460K5525
$$ 7704 16625 37807 50276 22054 -29252 -49546 -26321 1256 -483 -12986 11474 36999
23080C6999J9800l777l319k7162j9327j0742J5499J4108k4512n360K464k958K0588
$$ 36999 56799 53022 49703 22541 3214 -7528 7971 22079 -2433 -7793 -5329 -8287 12301
23067A2301K2514K0711k2643j6824j9902n277K4534J7807J5244k8348j9465j9399
$$ 12301 34815 55526 32883 16059 -3843 -9120 15414 33221 48465 20117 652 -18747
23055a8747N524K0465J0651j5195l2229j3997K611P928J6058J0781L5473J0105
$$ -18747 -13223 7242 17893 2698 -29531 -43528 -40917 -32989 -16931 -6150 29323 39428
23043C9428k2324q462j3867J9628j9972k850k4282k7016J0589J3858L0260K8167
$$ 39428 17104 8642 -5225 14403 -5569 -8419 -32701 -59717 -49128 -35270 -5010 23157
23031B3157J1318l1571K37J006k6537l0737q812J9211K0405k958L1811J3629n90
$$ 23157 34475 2904 3141 4147 -22390 -53127 -61939 -42728 -22323 -25281 6530 20159 19569
23018A9569M342j2874j0223P065J0376n137k137J6274J9305k580k5427o4042k2602
$$ 19569 23911 11037 814 7879 18255 13118 10981 27255 46560 43980 18553 -45489 -68091
23005f8091J0866L5851K7706j19j183L02j6112q966K714q319l543J3045J7211
$$ -68091 -57225 -21374 6332 6213 5030 5332 -10780 -19746 -17032 -25351 -28894 -15849 1362
22992A362j9777J1718P683p446n249L601J0350j670j7988k3501j0077p224J7098
$$ 1362 -18415 -6697 986 -6460 -11709 -8108 2242 572 -17416 -40917 -50994 -58218 -41120
22979d1120N4729j5491l4591l1885j0507o382J7419K5086L3849J9597L687j9100
$$ -41120 13609 -1882 -36473 -68358 -78865 -85247 -67828 -42742 -8893 10704 14391 -4709
22967d709k4701j6647J1239K1201l089K199J5447K723J0247k0543n9897j000n168
$$ -4709 -29410 -46057 -34818 -13617 -16706 -14507 940 3663 13910 -6633 -66530 -67530 -72698
22954g2698J2120K1326l834j7971Q309J6554K2902K0430o022n98r294o984r952
$$ -72698 -60578 -39252 -43086 -61057 -52748 -36194 -13292 7138 1116 518 -8776 -15760 -25712
22941b5712J1543L1750j1580J0198K0062j3421j1271N510l5410J4363L2382K649
$$ -25712 -14169 17581 6001 16199 36261 22840 11569 17079 -18331 -3968 28414 31063
22929C1063k1746m506j0326J9800K3399J5565k9274j4939l722p979Q087K721k7890
$$ 31063 9317 4811 -5515 14285 37684 53249 23975 9036 5314 -2665 5422 8143 -19747
22916a9747K5216K536j8341j1689j4852J8234J2036j0009m614K6487J290j4620
$$ -19747 5469 8005 -10336 -22025 -36877 -18643 -6607 -16616 -21230 5257 6547 -8073
22904h073K8755K111r298o282q534k4196j1900J4242K4397q137j7974p541l171
$$ -8073 20682 22793 13495 7213 -1321 -25517 -37417 -23175 1222 -6915 -24889 -32430 -35601
22891c5601r379q909k285K6790J6743j3597K7543j5794k4966L2203J2711l0697
$$ -35601 -44980 -53889 -56174 -29384 -12641 -26238 1305 -14489 -39455 -7252 5459 -25238
22879b5238p240J1983J4029J0996L935j4093j2007O944m0229q150M2971L608j4810
$$ -25238 -32478 -20495 -6466 4530 8465 -5628 -17635 -10691 -50920 -59070 -16099 -12491 -27301
22866b7301l669m1703L857O1893L4964k6249J3291R491o383Q449m465k3826l5779
$$ -27301 -30970 -72673 -68816 -6923 28041 1792 15083 24574 18191 26640 22175 -1651 -37430
22853c7430J3886L4444J3312L985p20R206j2315l3512j5042r196m593Q321M041
$$ -37430 -23544 10900 24212 28197 27477 36683 24368 -9144 -24186 -33382 -37975 -29654 -25613
22840b5613J1996j9168P624J9750j8194J6250R70k0999r873m372O252J6490j4725
$$ -25613 -13617 -32785 -25161 -5411 -23605 -7355 -6385 -27384 -37257 -41629 -35377 -18887 -33612
22827c3612J8338L4191J1016L313j1360K186L26k1272k742k6993O555L1041j217
$$ -33612 -15274 18917 29933 33246 21886 24072 24398 3126 384 -26609 -20054 10987 9770
22814I770k8982j4504K2512J047q789q456K8892J6046l378j5298p399m494J4284
$$ 9770 -19212 -33716 -11204 -10157 -18946 -27402 1490 17536 14158 -1140 -8539 -13033 1251
22801A251J6446j8142l137K3765r312k6286l113p953k9417R565J9192J3919R089
$$ 1251 17697 -445 -3582 20183 10871 -15415 -18528 -26481 -55898 -46333 -27141 -13222 -4133
22788d133n423j3779J674J6374J0776j323n181q129l9287r052o657K9306K0730
$$ -4133 -9556 -23335 -21661 -5287 5489 4166 -1015 -9144 -48431 -57483 -64140 -34834 -14104
22775a4104l900J737P517J2312j0883p456k653J3569j7725J51J7336j6253l6747
$$ -14104 -18004 -16267 -8750 3562 -7321 -14777 -17430 -3861 -21586 -21435 -4099 -20352 -57099
22762e7099J3123L2559J715j2129P227k9628j5451L5612K3520j1348L2336K0919
$$ -57099 -43976 -11417 -9702 -21831 -14604 -44232 -59683 -24071 -551 -11899 20437 41356
22750D1356r769k9038p502J0942j8986k1612K8488J8622K773j6121l201Q385J8706
$$ 41356 31587 2549 -4953 5989 -12997 -34609 -6121 12501 15274 -847 -4048 4337 23043
22737B3043j2410k9067l4593K4125L0538k904k3014L027m853j0104j5034N763
$$ 23043 10633 -18434 -53027 -28902 1636 -1268 -24282 -21255 -26108 -36212 -51246 -45483
22725d5483J4890K9530J4579k0024j4895n626R886L6204j587j0889N31j7751L841
$$ -45483 -30593 -1063 13516 -6508 -21403 -27029 -17143 19061 17474 6585 7116 -10635 -6794
22712f794J3857r517Q399J9151o111j0268m001j2085l5918j2971L2527P039J2581
$$ -6794 7063 -2454 5945 25096 18985 8717 4716 -7369 -43287 -56258 -23731 -16692 -4111
22699d111L352J1797M040J6640j9016o351R783K2038m532l3798j9979k0998N182
$$ -4111 -759 11038 15078 31718 12702 6351 16134 38172 33640 -158 -20137 -41135 -35953
22686c5953L6430j3573J925k323n84q634r255P570r047J0006M64k4614J9883k568
$$ -35953 477 -13096 -11171 -13494 -14078 -22712 -31967 -24397 -33444 -23438 -22974 -47588 -27705 -30273
22672c0273m19k1148K5759R377k4289M380L3012J6241L309n010j4806j0630O979
$$ -30273 -30692 -51840 -26081 -16704 -40993 -36613 -3601 12640 15949 10939 -3867 -14497 -7518
22659g518J3944l1877r858K743J2397J0151K7637J5989k3820j3078k389m114m169
$$ -7518 6426 -25451 -35309 -32566 -20169 -10018 17619 33608 9788 -3290 -5679 -9793 -13962
22646a3962l8007j9781K4561K9196M670l0975j5458R805J5546L654J4603J178
$$ -13962 -51969 -71750 -47189 -17993 -13323 -44298 -59756 -49951 -34405 -30751 -16148 -14970
22634a4970K2319J719K0216R71k4525j62p859R768M119j7174j3978j9673n859
$$ -14970 7349 9068 29284 30255 5730 5568 -2291 7477 11596 -5578 -19556 -39229 -45088
22621d5088L894j7450j0519L4187M2005J4331J2817l336q583k4709k1031l420
$$ -45088 -41194 -58644 -69163 -34976 7029 21360 34177 30841 22258 -2451 -23482 -26902
22609b6902K3426J1952l753j3411o806J4428l175K0313L956j0410j6709j1716
$$ -26902 -3476 8476 4723 -8688 -15494 -1066 -4241 16072 20028 9618 -7091 -18807
22597a8807k3977l0890j5628J1636M8190J7337K0034J831p102J6554k1203l940
$$ -18807 -42784 -73674 -89302 -77666 -29476 -12139 7895 9726 2624 19178 -2025 -5965
22585e965r080p418K4953J1073o005K365M461j2215R894J6720k1236j0952K1333
$$ -5965 -15045 -22463 2490 13563 7558 9923 14384 2169 12063 28783 7547 -3405 17928
22572A7928O775N807k133P653l889p853j5689R788q94j0971k5842r661p362K7558
$$ 17928 24703 30510 28377 36030 32141 24288 8599 18387 17493 6522 -19320 -28981 -36343 -8785
22558h785K0522k0992k2783O501r637l3028j3770K6560K9651J2843R983k375O39
$$ -8785 11737 -9255 -32038 -25537 -35174 -68202 -81972 -55412 -25761 -12918 -2935 -5310 -4671
22545d671m977k5164j3167K9662K4822j4679J4989L1402J3198j1626J3841j2720
$$ -4671 -9648 -34812 -47979 -18317 6505 -8174 6815 38217 51415 39789 53630 40910
22533D0910M804M485k3573n945k2730L906j0323l0236q349J1181j589J324J223
$$ 40910 45714 50199 26626 20681 -2049 1857 -8466 -38702 -47051 -35870 -37459 -36135 -34912
22520c4912J3459O62j321K072j5376m481J2015O414M677j5463J8J1244j1005J5600
$$ -34912 -21453 -20791 -22112 -20040 -35416 -39897 -27882 -21468 -16791 -32254 -32236 -20992 -31997 -16397
22506a6397J5544j1193Q599R25P051K3334k0783l1476l926L2075P651K513j6541
$$ -16397 -853 -12046 -3447 -2522 4529 27863 7080 -24396 -28322 3753 11404 13917 -2624
22493b624J3288N14j4644k5207l285M299K7660J9541N29K0634r186j1480L0253
$$ -2624 10664 11178 -3466 -28673 -31958 -27659 1 19542 20071 40705 31519 20039 50292
22480E0292N299m0838k1246k7837M824J8854p948K976K453l920l4314P687L6104
$$ 50292 55591 14753 -6493 -34330 -29506 -10652 -18600 -15624 -13171 -17091 -51405 -43718 -7614
22467g614j557P798k08J770k5977J7728J9414J72o418J0589K050j3146Q983J6016
$$ -7614 -9171 -1373 -1581 189 -25788 -8060 11354 11526 5108 15697 17747 4601 13584 29600
22453B9600R568k5900k0720j4269J0438J3812k0502k1368K1997K6485K0171r230
$$ 29600 39168 13268 -7452 -21721 -11283 2529 -17973 -39341 -17344 9141 29312 20082
22441B0082j9427K693j0338P219L1210L394k131m606J2092j2497k2708J2650J8378
$$ 20082 655 3348 -6990 229 31439 34833 32702 28096 40188 27691 4983 17633 36011
22428C6011j8025q331J4051J5536q87R712j9407n912k4171j2471K2375J8891j3323
$$ 36011 17986 9655 23706 39242 38355 48067 28660 22748 -1423 -13894 8481 27372 14049
22415A4049p814k9574r634J7425M615K082J6010L0195k5620k1875l869m206j1335
$$ 14049 6235 -23339 -32973 -15548 -10933 -8851 7159 37354 11734 -10141 -14010 -18216 -29551
22402b9551J3792K1807j6804L190K2635j2340l9484J4381K4475n028R821j0390
$$ -29551 -15759 6048 -10756 -7566 15069 2729 -36755 -22374 2101 -2927 6894 -3496
22390c496m606r252N427p276o482L0150k0504k2616J5325J1722J5045M538k2371
$$ -3496 -8102 -17354 -11927 -19203 -25685 4465 -16039 -38655 -23330 -11608 3437 7975 -14396
22377a4396k1627j743j6583J15k2988j2380M1853M3002j3373l1685J3507J8807
$$ -14396 -36023 -37766 -54349 -54234 -77222 -89602 -47749 -4747 -18120 -49805 -36298 -17491
22365a7491j3881j4305R936K3302j6534j4322J6476L3826n823r075K3096l72k4145
$$ -17491 -31372 -45677 -35741 -12439 -28973 -43295 -26819 7007 1184 -7891 15205 14833 -9312
22352i312j2350N798J2847J691K251l696j351j1600P562j2149r561k654J2770
$$ -9312 -21662 -15864 -3017 -1326 925 -2771 -4122 -15722 -8160 -20309 -29870 -32524 -19754
22339a9754J9095J228n463o700J4803K4786N031k0730k4382q17j2828K1150J5172
$$ -19754 -659 569 -4894 -11594 3209 27995 33026 12296 -12086 -12903 -25731 -4581 10591
22326A0591l2808J6895J9502M493J2115n365m568j8667j8729k3884K6526J7198
$$ 10591 -22217 -5322 14180 18673 30788 25423 20855 2188 -16541 -40425 -13899 3299
22314C299l5788r922K1994K3534J3476r655l3534j1450J25J8287M173m866q836
$$ 3299 -32489 -42411 -20417 3117 16593 6938 -26596 -38046 -37921 -19634 -15461 -20327 -29163
22301b9163j3460P595J2541L174k002R187k687j991J0769m311m452j0368m752
$$ -29163 -42623 -35028 -22487 -19313 -21315 -12128 -14815 -16806 -6037 -10348 -14800 -25168 -29920
22288b9920J4885K7652k3860q756j2923j4428J252J7567o853J395K9031q771k5671
$$ -29920 -15035 12617 -11243 -19999 -32922 -47350 -46098 -28531 -35384 -33989 -4958 -13729 -39400
22275c9400J8329J3425J2387J3695J0553j8517l3293p924L2711J445j5152j7682
$$ -39400 -21071 -7646 4741 18436 28989 10472 -22821 -30745 1966 3411 -11741 -29423
22263b9423k6473j4815J4971m756l965J5964J243M2719J7695P182r475j5341k436
$$ -29423 -55896 -70711 -55740 -60496 -64461 -48497 -47254 -4535 13160 20342 10867 -4474 -6910
22250f910J6722k3209k247j5619k3457K3549K1642j5084m287J0097J9336J5451
$$ -6910 9812 -13397 -15644 -31263 -54720 -31171 -9529 -24613 -28900 -18803 533 15984
22238A5984l0642l566L446k9639j4333J358M018L3728J8599J3165L3826j5613
$$ 15984 -14658 -18224 -14778 -44417 -58750 -57392 -53374 -19646 -1047 12118 45944 30331
22226C0331l1309j2162n848J3609j8221l158q348J3379j36q850R888M0116K8955
$$ 30331 -978 -13140 -18988 -5379 -23600 -26758 -35106 -21727 -21863 -30713 -20825 19291 48246
22213D8246J2298p746n1873l6359J8260K5497K5488K0552n415j4222j5702J4030
$$ 48246 60544 52798 925 -35434 -17174 8323 33811 54363 48948 34726 19024 33054
22201C3054K743p402L028k9078l2924K3632J286J1604j2422K6230K469p226p393
$$ 33054 35797 28395 31423 2345 -30579 -6947 -5661 5943 -6479 19751 22220 14994 7601
22188G601k9974N740J0656J5776l302k2820k7480M197N906J8474J6013k024J6593
$$ 7601 -22373 -16633 -5977 9799 6497 -16323 -43803 -39606 -33700 -15226 787 -1237 15356
22175A5356k0750j3894J6348n357l1654j350K7028N17k0924j6519J6577K5723
$$ 15356 -5394 -19288 -2940 -8297 -39951 -41301 -14273 -13756 -34680 -51199 -34622 -8899
22163h899j8415O008K4685j6388k557K3709l049j6273k7016J4312k603O30K362
$$ -8899 -27314 -21306 3379 -13009 -15566 8143 5094 -11179 -38195 -23883 -26486 -25856 -23494
22150b3494L2372L2012j4187k2251k2755m6052n189K8674j7778j7139K9153K5634
$$ -23494 8878 40890 26703 4452 -18303 -64355 -69544 -40870 -58648 -75787 -46634 -21000
22138b1000M087N903K4821r924j3329K7990P350j7256Q136J0250j5812j62q170
$$ -21000 -16913 -11010 13811 3887 -9442 18548 25898 8642 16778 27028 11216 11054 2884
22125B884O14Q784j4712q091j8060K4711M1102J0491j9599j8328j4014J7495L868
$$ 2884 3498 12282 -2430 -10521 -28581 -3870 37232 47723 28124 9796 -4218 13277 17145
22112A7145j0872j0684J4557O95J2471m434o098j1191J0887q835k6922j0618L216
$$ 17145 6273 -4411 10146 10841 23312 18878 12780 1589 12476 3641 -23281 -33899 -30683
22099c0683O280J8491k0126j6781K9069Q329q986q780j627J4345j0104j7310M032
$$ -30683 -24403 -5912 -26038 -42819 -13750 -5421 -14407 -23187 -24814 -10469 -20573 -37883 -33851
22086c3851j2270l0485O066J2648K0695k298P72K9613L0776P614J5827j2773k0740
$$ -33851 -46121 -76606 -70540 -57892 -37197 -39495 -38723 -9110 21666 29280 45107 32334 11594
22073A1594M38o803k4279j6057j1974q6J0118n106q712J0138L219K7242Q997Q897
$$ 11594 12032 5229 -19050 -35107 -47081 -47167 -37049 -42155 -50867 -40729 -37510 -10268 -1271 7626
22059G626L362R158j9948l0006k0596K2465J6824j7133L51J331q659M286j1822
$$ 7626 10988 20146 198 -29808 -50404 -27939 -11115 -28248 -27897 -26566 -35225 -30939 -42761
22046d2761O727J5838J2622r096p369J8502K2259k0115n8297J212J7111Q659j5173
$$ -42761 -36034 -20196 -7574 -16670 -24039 -5537 16722 -3393 -61690 -60478 -43367 -34708 -49881
22033d9881O099r913J3256K4793K381J1135o665j3277o409r73j993L7722p659
$$ -49881 -43782 -53695 -40439 -15646 -13265 -2130 -8795 -22072 -28481 -29454 -31447 6275 -1384
22020a384k116K2018m150r733k2984j4317j1006J0291Q827O780p796n46L9151
$$ -1384 -3500 18518 14368 4635 -18349 -32666 -43672 -33381 -24554 -17774 -25570 -26116 13035
22007A3035J8509m1206k1976K476l090J5435K5245P041P40k0403k9926j6575K7754
$$ 13035 31544 -9662 -31638 -29162 -32252 -16817 8428 15469 16209 -4194 -34120 -50695 -22941
21994b2941K3937L027j653k711J2637j0821j5512k1337L627K744k2578q301m779
$$ -22941 996 4023 2370 -341 12296 1475 -14037 -35374 -31747 -29003 -51581 -59882 -64661
21981f4661J880L7336J9611K1823J0557R539j9330k7083L81J325J0182P246j376
$$ -64661 -62781 -25445 -5834 15989 26546 36085 16755 -10328 -9947 -8622 1560 8806 7430
21968G430N234R81k6540k0518J9052n647L3402K0112K8006j923k1310O364r029
$$ 7430 12664 13645 -12895 -33413 -14361 -20008 13394 33506 61512 59589 38279 44643 35614
21955C5614j4582j6486n870J0706R651nl873J9384l10j784k4556j2265j1715L904
$$ 35614 21032 4546 -1324 9382 19033 19028 15155 34539 34229 32445 7889 -4376 -16091 -12187
21941a2187k0272j94J4048k40j8435r661P568J8086J8046J3496k41o212q586l2751
$$ -12187 -32459 -32653 -18605 -18845 -37280 -46941 -39373 -21287 -3241 10255 10014 3802 -4784 -37535
21927c7535m155L486J5620q665p07j1515J7264j6379j0996N351O557P150n562
$$ -37535 -41690 -38204 -22584 -31249 -31956 -43471 -26207 -42586 -53582 -48231 -41674 -34524 -40086
21914d0086K5050K9841j1314k775j661j7751L422j616n157K6938K5850k3200j5334
$$ -40086 -15036 14805 3491 716 -945 -18696 -15274 -16890 -22047 4891 30741 7541 -7793
21901g793l125J0310K5675j4564j0048N049K0116J7305o803m3869P913K4674k0981
$$ -7793 -10918 -608 25067 10503 455 5504 25620 42925 36122 -7747 166 24840 3859
21888C859K382j0891l274J2270R288j2474q525K3789J9681o946j7946j6784L664
$$ 3859 6241 -4650 -7924 4346 13634 1160 -7365 16424 36105 29159 11213 -5571 -1907
21875a907n371p298J6336K5130O552k8480k4400k5387J0351L5262r369o920r934
$$ -1907 -7278 -14576 1760 26890 33442 4962 -19438 -44825 -34474 788 -8581 -15501 -25435
21862b5435p459J1127L3093l439J757J0234j9824q34J5607l0093R021o583j237
$$ -25435 -32894 -21767 11326 7887 9644 19878 54 -780 14827 -15266 -6245 -12828 -14065
21849a4065p91J4670J919L50j3334j3614J2383K2337r105K1995J5709j8265J5059
$$ -14065 -14856 -186 1733 2083 -11251 -24865 -12482 9855 750 22745 38454 20189 35248
21836C5248K557r689j4009l2743k1800L817K6431q034k1950P112J0774L745J4293
$$ 35248 37805 28116 14107 -18636 -40436 -36619 -10188 -18222 -40172 -33060 -22286 -18541 -4248
21823d248K1096J6804j3252l9273j0389K8616p624P012L7891L149j5856n7341
$$ -4248 16848 33652 20400 -18873 -29262 -646 -8270 -1258 36633 39782 23926 -33415
21811c3415m505J5052R768O957J3022k3342Q561K272l0190q628J0901j346N933
$$ -33415 -37920 -22868 -13100 -6143 6879 -16463 -7902 -5630 -35820 -44448 -33547 -34893 -28960
21798b8960K8530j2873j644P505L531l882r181P862j4014m712q375K256K0722
$$ -28960 -430 -13303 -14947 -7442 -3911 -7793 -16974 -9112 -23126 -27838 -36213 -33957 -13235
21785a3235J5970j0572J1148k581m144j5511j4856J1852k2464m89J5759M14J5336
$$ -13235 2735 -7837 3311 730 -3414 -18925 -33781 -21929 -44393 -44882 -29123 -28709 -13373
21772a3373L5224n994q512j6344k4467R728n972j2641l3843P360K2798M7691L947
$$ -13373 21851 15857 7345 -8999 -33466 -23738 -29710 -42351 -76194 -68834 -46036 1655 5602
21759E602L285O552j7215l9829J2483J2433K5304M755j2080L1471K043j6896j439
$$ 5602 8887 15439 -1776 -41605 -29122 -16689 8615 13370 1290 32761 34804 17908 16469
21746A6469j5834j0220P833K7925j799n577j7751j1763l1991O547K3146q813P599
$$ 16469 635 -9585 -1752 26173 24374 18797 1046 -10717 -42708 -36161 -13015 -21828 -14229
21733a4229M1280M2647j8038m4770q292m220K7623j4975m623J0482j3140j4330
$$ -14229 27051 69698 51660 6890 -1402 -5622 22001 7026 2403 12885 -255 -14585
21721a4585L519j0538Q11K6222J1250K72J77J9867P682q701o508r922k0966R541
$$ -14585 -11066 -21604 -20793 5429 16679 16951 17128 36995 44677 35976 29468 19546 -1420 8121
21707H121J0853k3461j9698K4397K353l3437l2838L524J9773Q581n771j2998J8497
$$ 8121 18974 -4487 -24185 212 2565 -30872 -63710 -60186 -40413 -31832 -37603 -50601 -32104
21694c2104j7035K3453K8798j667p253j018l995K6264L143j9392n755l0614j4948
$$ -32104 -49139 -25686 3112 1445 -5808 -6826 -10821 15443 18586 -806 -6561 -37175 -52123
21681e2123J2741K3880K2595J2512l225j4566J027l879r242J4606K6897j2134
$$ -52123 -39382 -15502 7093 19605 16380 1814 2841 -1038 -10280 4326 31223 19089
21669A9089o209j250j8948n839k5844J7041Q758M362p063L9826K3348k4333J4352
$$ 19089 12880 11630 -7318 -13157 -39001 -21960 -13202 -8840 -15903 23923 47271 22938 37290
21656C7290J1174k7745l912o344l7792m44K0224K157Q6m765j5786K729R573L1413
$$ 37290 48464 20719 16807 10463 -27329 -27773 -7549 -5392 -5306 -10071 -25857 -23128 -13555 17858
21642A7858J1137k5705j5222j1802P500J5969K8506n264l6753K2900j2678j2324
$$ 17858 28995 3290 -11932 -23734 -16234 -265 28241 22977 -13776 9124 -3554 -15878
21630a5878k4033j9083R604J7832J7927J2449L0302j759j8460j5580j7783K1533
$$ -15878 -39911 -58994 -49390 -31558 -13631 -1182 29120 27361 8901 -6679 -24462 -2929
21618b929K6191J6842j3211l3253j4953m689k941J0511J2663L624J9629r9K73
$$ -2929 23262 40104 26893 -6360 -21313 -26002 -28943 -18432 -5769 -2145 17484 17385 17658
21605A7658M151p136K6151k2783l5328l141o61q294J615p873K7367K5688j4639
$$ 17658 21809 14673 40824 18041 -17287 -20428 -21089 -29383 -27768 -35641 -8274 17414 2775
21592B775n428Q147M323j6422r480M480K972n349j6408n327J8542O10J3208J5776
$$ 2775 -2653 5494 9817 -6605 -16085 -11605 -8633 -13982 -30390 -35717 -17175 -16565 -3357 12419
21578A2419j2446q478L8870K1651P62m449k395j8300q693m1907m8871n735L9690
$$ 12419 -27 -8505 30365 52016 52778 48329 45934 27634 18941 -22966 -71837 -77572 -37882
21565c7882Q308J340J3044K1812k637j2394K0836J4707j3547k3190j8762K7641
$$ -37882 -29574 -28234 -15190 6622 3985 -8409 12427 27134 13587 -9603 -28365 -724
21553g24K3262k5964J4964P897j6267k2713l3848O567K1117j0556R416R372j5774
$$ -724 22538 -3426 11538 19435 3168 -19545 -53393 -46826 -25709 -36265 -26849 -17477 -33251
21540c3251j0823J1164J0530J908K9064j811k6245j2156J7855J1934J5769K443
$$ -33251 -44074 -32910 -22380 -20472 8592 6781 -19464 -31620 -13765 -1831 13938 16381
21528A6381r852o557l065N639P706j8418j0927j2955J258J7698L560o600J8117
$$ 16381 6529 -28 -3093 2546 10252 -8166 -19093 -32048 -30790 -13092 -9532 -16132 1985
21515A985J2285K378m070j4318k0075j972J3977K0512j1011l504J2990k6524j7814
$$ 1985 14270 16648 12578 -1740 -21815 -23787 -9810 10702 -309 -3813 9177 -17347 -35161
21502c5161J7740J6229O277P861j0387k9727r9K0495j1807K70J4113O762n657
$$ -35161 -17421 -1192 5085 12946 2559 -27168 -27267 -6772 -18579 -18309 -4196 2566 -3091
21489c091L0840K0806K729m750l5638j6168J2133k5990j6491j964o44M923J9048
$$ -3091 27749 48555 51284 46534 10896 -5272 6861 -19129 -35620 -37584 -38228 -33305 -14257
21476a4257L462j3123R745p170l8393l4719M787M2588L0219J5317r605q391J5144
$$ -14257 -10795 -23918 -14173 -21343 -59736 -94455 -89668 -47080 -16861 -1544 -11149 -19540 -4396
21463d396l671Q214M949L5250J5859j4172J3147n237O892j2648j5265k5088R038
$$ -4396 -8067 147 5096 40346 56205 42033 55180 49943 56835 44187 28922 3834 12872
21450A2872K5030K2118j5004n7726k8676K4684J7263K0074l619k2366Q714J5714
$$ 12872 37902 60020 45016 -12710 -41386 -16702 561 20635 17016 -5350 3364 19078
21438A9078J2764j0268l2707j1739M6J4057M134K0456k8149Q538L7149k385l0972
$$ 19078 31842 21574 -11133 -22872 -22826 -8769 -4635 15821 -12328 -3790 33359 30974 2
21425Bl741o996j7999M731J7391R000J2372L539j2106l919j5776J0885L774j1360
$$ 2 -3739 -10735 -28734 -24003 -6612 2388 14760 18299 6193 2274 -13502 -2617 1157 -10203
21411a0203l127K107M083K156L1391J409m7644l0895L4480J1083P927j5951k6553
$$ -10203 -13330 -11223 -7140 -4984 26407 27816 -19828 -50723 -16243 -5160 2767 -13184 -39737
21398c9737k187M298J5667K2380j1675m0782L54K2116J261L595n419J3463P150
$$ -39737 -41924 -37626 -21959 421 -11254 -52036 -51682 -29566 -28305 -24710 -30129 -16666 -9516
21385i516K2545j1606j3457N73J9370J7687J2774j6546r581n901j4063k121q587
$$ -9516 13029 1423 -12034 -11461 7909 25596 38370 21824 12243 6342 -7721 -9842 -18429
21372a8429j8146L0758j0945j5148j7107J3641l851M278L4671R523k2828j025
$$ -18429 -36575 -5817 -16762 -31910 -49017 -35376 -39227 -34949 -278 9245 -13583 -14608
21360a4608O345J1139l4750j2732M262M3645R838J6071J6969J1502K7160J5806
$$ -14608 -8263 2876 -31874 -44606 -40344 3301 13139 29210 46179 57681 84841 100647
21348A00647k3109k0899J3208L947j203n2733k6738j0542J2845J2821j929J6907
$$ 100647 77538 56639 69847 73794 72591 19858 -6880 -17422 -4577 8244 6315 23222
21336B3222k7599J3137L253k229k839j6853l969J5129k600j6763Q023K4044J7587
$$ 23222 -4377 8760 12013 9784 6945 -9908 -13877 1252 -1348 -18111 -10088 13956 31543
21323C1543J4477l4198l6510j1979Q924J1519l260Q188j8268l923K6842J6671
$$ 31543 46020 11822 -24688 -36667 -27743 -16224 -19484 -11296 -29564 -33487 -6645 10026
21311A0026O47o388k5880k0332J4189J2023J8477R459j2308O214j6220R294L87
$$ 10026 10673 4285 -21595 -41927 -27738 -15715 2762 12221 -87 6127 -10093 -799 -412
21298d12n99p858K4416k600n512j107k5393j0131L046J2781K6878l365Q177j2671
$$ -412 -1011 -8869 15547 12947 7435 6328 -19065 -29196 -26150 -13369 13509 10144 18321 5650
21284E650k0029k4542L41J731L3168j5614l4068q095K4430J6458K1729J322k0291
$$ 5650 -14379 -38921 -38580 -36849 -3681 -19295 -53363 -61458 -37028 -20570 1159 2481 -17810
21271a7810k0976j1238j2149Q829L19K1677k958J1837J6210k5071l605L3824J4578
$$ -17810 -38786 -50024 -62173 -53344 -53025 -31348 -34306 -22469 -6259 -31330 -34935 -1111 13467
21258A3467k560R921n53j083j2229J3547n300j5779j9922Q40J889j2576j0299
$$ 13467 10907 20828 20275 19192 6963 20510 15210 -569 -20491 -19651 -17762 -30338 -40637
21245d0637l967J7353J7674P549o907m763j8234K4489K8050l453j3279l5403m271
$$ -40637 -44604 -27251 -9577 -2028 -8935 -13698 -31932 -7443 20607 17154 3875 -31528 -35799
21232c5799J1847J7257K0749j2668p447K3945q663P583J4572k8058O93J3072k8815
$$ -35799 -23952 -6695 14054 1386 -6061 17884 9221 16804 31376 3318 4011 17083 -11732
21219a1732j9197Q932k100L6190L567j6268k8247k395J714O184K8271K0356j1982
$$ -11732 -30929 -21997 -24097 12093 15660 -608 -28855 -31250 -29536 -23352 4919 25275 13293
21206A3293j0412J0007j5505p067j9726l961J5098K394L001L0279J189j4594m0647
$$ 13293 2881 12888 -2617 -9684 -29410 -33371 -18273 -15879 -12878 17401 18590 3996 -36651
21193c6651q566K1649L7687k5176M366J0905j4232J4208J6727J5897m774r993
$$ -36651 -45217 -23568 14119 -11057 -6691 4214 -10018 4190 20917 36814 32040 22047
21181B2047k874k1724j6621J137j1563j9968n870P022J9239N795j6987L225K556
$$ 22047 19173 -2551 -19172 -18035 -29598 -49566 -55436 -48414 -29175 -23380 -40367 -37142 -34586
21168c4586K5143k170j4053O353J6003J2891N482o861j670Q517l3404j6396o518
$$ -34586 -9443 -11613 -25666 -19313 -3310 9581 15063 8202 6532 15049 -18355 -34751 -41269
21155d1269j22J6539K0688J2680q89j1737L0733L7141q242n2699J1844O721L497
$$ -41269 -41391 -24852 -4164 8516 7627 -4110 26623 63764 55522 2823 14667 21388 24885
21142B4885k0643k8428k9000Q712L3918J3227K0585J2706n267k3815j8675K891
$$ 24885 4242 -24186 -53186 -44474 -10556 2671 23256 35962 30695 6880 -11795 -8904
21130h904J3186l321K7514J1226j9848j5887j9576k1069J739J9580K2581k2506
$$ -8904 4282 961 28475 39701 19853 3966 -15610 -36679 -34940 -15360 7221 -15285
21118a5285j2542j0982K3482N549J6787J794j4442Q365J4606j1109j3813J9173
$$ -15285 -27827 -38809 -15327 -9778 7009 8803 -5639 2726 17332 6223 -7590 11583
21106A1583J1924J1058J561L3627p765k6666l830k297J0861J970l534Q503q83
$$ 11583 23507 34565 36126 69753 61988 35322 31492 29195 40056 42026 38492 46995 46112
21093D6112l2258k5676k6221m013J734J4824k3785l075L360q356n09M5049J499
$$ 46112 13854 -11822 -38043 -42056 -40322 -25498 -49283 -52358 -48998 -57354 -57863 -12814 -11315
21080a1315r395k7460K1130J5541j6475o16O511L6320J7547N742p965l899l5663
$$ -11315 -20710 -48170 -27040 -11499 -27974 -28590 -22079 14241 31788 37530 29565 25666 -9997
21067i997j8377K2429Q13l9119J4501K7926m204j5995O355J0742j7074l1208Q045
$$ -9997 -28374 -5945 -5132 -44251 -29750 -1824 -6028 -22023 -15668 -4926 -22000 -53208 -45163
21054d5163n87Q452J4010J4967k5434K1416N7651Q809l3838j4761r369M365j0538
$$ -45163 -45750 -37298 -23288 -8321 -33755 -12339 45312 54121 20283 5522 -3847 518 -10020
21041a0020j0800K950j2959n651m7496k1307K0315j8085j7339K6474L5874M2006
$$ -10020 -20820 -17870 -30829 -36480 -83976 -105283 -84968 -103053 -120392 -93918 -58044 -16038
21029a6038K5302j5412l9316j3827K4024o155j6441P032o420J3868K5135j2332
$$ -16038 9264 -6148 -45464 -59291 -35267 -41422 -57863 -50831 -57251 -43383 -18248 -30580
21017c0580j915L2139K117J3846R878q436Q821j2660j8048O851O264j0768m654
$$ -30580 -32495 -356 1761 15607 25485 17049 25870 13210 -4838 2013 8277 -2491 -7145
21004g145O56k6426K2101J2921k1229r35J04j0156J0844p237J7949O76J6016L132
$$ -7145 -6489 -32915 -10814 2107 -19122 -20057 -19953 -30109 -19265 -26502 -8553 -7877 8139 11271
20990A1271J9251N003j9358r493r849K5087J2738k1732j8705k473M885Q31j6867
$$ 11271 30522 35525 16167 6674 -3175 21912 34650 12918 -5787 -8260 -3375 -2544 -19411
20977a9411n271p043R559L1190J6814O326J3477q957J663j3831J3052J4835j7982
$$ -19411 -24682 -31725 -22166 9024 25838 32164 45641 36684 38347 24516 37568 52403 34421
20964C4421n487K207l8684r687m396J7837j3412J1396J9258L0527n889j1161K632
$$ 34421 28934 31141 -7543 -17230 -21626 -3789 -17201 -5805 13453 43980 38091 26930 29562
20951B9562n420k0662j464n518j3676k80k4311k090R525J0057L1637R792p506
$$ 29562 24142 3480 2016 -3502 -17178 -17458 -41769 -43859 -34334 -24277 7360 17152 9646
20938I646m7005k3354R497L85q217K4394K8235K255r561J6726R781k0365j9329
$$ 9646 -37359 -60713 -51216 -50831 -59048 -34654 -6419 -4164 -13725 3001 12782 -7583 -26912
20925b6912j5945J579L0738J70o454q496K5154M789k1900k3397K0769K155k1564
$$ -26912 -42857 -41278 -10540 -10370 -16824 -25320 -166 4623 -17277 -40674 -19905 -17750 -39314
20912c9314J3757K478J9054J8503j3467j8842r609R473O748P042o53J2385K083
$$ -39314 -25557 -23079 -4025 14478 1011 -17831 -27440 -17967 -11219 -4177 -4830 7555 9638
20899I638Q032j7239k1781j7096J4218J4483o257j8607R602J2861Q21J4029M87
$$ 9638 17670 431 -21350 -38446 -24228 -9745 -16002 -34609 -25007 -12146 -11325 2704 3191
20886C191k8447l6272j9758K4290L0367K5459r674J2200J4320j1231K343j5440
$$ 3191 -25256 -61528 -81286 -56996 -26629 -1170 -10844 1356 15676 4445 6788 -8652
20874h652O303L5045P38k6805j5932r375J8064J4342J8506k809k6412N099J4763
$$ -8652 -2349 32696 33434 6629 -9303 -18678 -614 13728 32234 29425 3013 8112 22875
20861B2875n70j4398j1546M882J0473j9420r221K7653N152l9241k584K5317J7904
$$ 22875 22305 7907 -3639 1243 11716 -7704 -16925 10728 15880 -23361 -25945 -628 17276
20848A7276J4064M405j5214j7263m587J1741K34r508j2092O861j4133j6426J7171
$$ 17276 31340 35745 20531 3268 -1319 10422 10656 1148 -10944 -4083 -18216 -34642 -17471
20835a7471K721n4142k1271o641L8092J6255j4785K8381K7468K9955P973j2147
$$ -17471 -14750 -68892 -90163 -96804 -58712 -42457 -57242 -28861 -1393 28562 36535 24388
20823B4388k8137j6278K0727K0351l530p692j4538n307K7010K640j6059j0815
$$ 24388 -3749 -20027 700 21051 17521 9829 -4709 -10016 16994 19634 3575 -7240
20811g240r101K375J52L1548n58K5259R533L97m9154j7882K0379l475j2921N067
$$ -7240 -16341 -13966 -13814 17734 17176 42435 51968 52365 3211 -14671 5708 2233 -10688 -5621
20797e621p673O785M1965j4451k6359o028j3990q557J8318o120J4353J354j3447
$$ -5621 -13294 -6509 35456 21005 -5354 -11382 -25372 -33929 -15611 -21731 -7378 -6024 -19471
20784a9471j0584N24j225K7163K2045j3095j0785j0899J9902n081n470K580j31
$$ -19471 -30055 -29531 -30756 -3593 18452 5357 -5428 -16327 3575 -1506 -6976 -4396 -4527
20771d527Q994K2902K3178j9545j4885Q213j145k2296j7217K0971R900Q99l4424
$$ -4527 4467 27369 50547 31002 16117 24330 23185 889 -16328 4643 14543 15442 -18982
20758a8982k3708J1385R891j429N471J9245j8855j115j2408Q970R466p113m2586
$$ -18982 -42690 -31305 -21414 -22843 -17372 1873 -16982 -18097 -30505 -21535 -12069 -19182 -61768
20745f1768N361J2195k630J9207p896k4656k2893K4784J700J4158J3974j3601
$$ -61768 -56407 -44212 -46842 -27635 -35531 -60187 -83080 -58296 -56596 -42438 -28464 -42065
20733d2065N4N975k3093J1577L0845Q358l6002k5790K8073L3475M7691O556n776
$$ -42065 -42011 -36036 -59129 -47552 -16707 -8349 -44351 -70141 -42068 -8593 39098 45654 39878
20720C9878k7642m467O220j4707k829R175K7812J5633o688q786j2680r048k904
$$ 39878 12236 7769 13989 -718 -3547 5628 33440 49073 42385 33599 20919 11871 8967
20707H967k453R119q791J0073K3417L781k654q827j7241k8508L2281K0465n464
$$ 8967 6514 15633 6842 16915 40332 44113 41459 32632 15391 -13117 19164 39629 34165
20694C4165j10k4179m533o17L964J5110O564o995j6298o134j3403l692J4454K5044
$$ 34165 34055 9876 5343 4726 8690 23800 30364 23369 7071 937 -12466 -16158 -1704 23340
20680B3340L835m5348l546K240j1610p063J9868k355J5683Q427J734K018l7512
$$ 23340 27175 -18173 -21719 -19479 -31089 -38152 -18284 -20639 -4956 3471 5205 7223 -30289
20667c0289k1796Q006K8862J7989L2968J1381l0068k0248J1972J8362K2774j8425
$$ -30289 -52085 -44079 -15217 2772 35740 47121 17053 -3195 8777 27139 49913 31488
20655C1488l5954n70j1354R0K489j1979j5200P191P130M0196p61j2138J8115o71
$$ 31488 -4466 -5036 -16390 -16300 -13811 -25790 -40990 -33799 -26669 13527 12766 628 18743 18072
20641A8072j4654l948p501K994j8738k9026L1072L2652K0989Q848m693l0393k4781
$$ 18072 3418 -530 -8031 -5037 -23775 -52801 -21729 10923 31912 40760 36067 5674 -19107
20628a9107m911J9451L794j7785K0085L170q654m995l566l7620k616J3591J4572
$$ -19107 -24018 -4567 -773 -18558 1527 4697 -3957 -8952 -12518 -50138 -52754 -39163 -24591
20615b4591L7652M441j6275q986J0804K0883j4358j3346m796J5652J9139k2751
$$ -24591 13061 17502 1227 -7759 3045 23928 9570 -3776 -8572 7080 26219 3468
20603C468j43p899m0488L5795M3540j2630k0174k1008N348K2621R352J4764o717
$$ 3468 3325 -4574 -45062 -9267 34273 21643 1469 -19539 -14191 8430 17782 32546 25829
20590B5829o442j0790J4231K105j3557k2732r470K1595N285L13j6496j5253J0489
$$ 25829 19387 8597 22828 24933 11376 -11356 -20826 769 6054 6367 -10129 -25382 -14893
20577a4893j2360J2267K5127J5479j6390P206j6613Q727J985j0799Q523J2466
$$ -14893 -27253 -14986 10141 25620 9230 16436 -177 8550 10535 -264 8259 20725
20565B0725j6846M012l0691j2031j9628O695p919J6169K0940J6997j0225K8540
$$ 20725 3879 7891 -22800 -34831 -54459 -47764 -55683 -39514 -18574 -1577 -11802 16738
20553A6738J2214j4180k4454j0977j3095K1659Q945m151j6513j5719j0557M0775
$$ 16738 28952 14772 -9682 -20659 -33754 -12095 -3150 -7301 -23814 -39533 -50090 -9315
20541i315M6875l637J8298K4844o631k885k2665n4180k6344k7272j0475o562N0
$$ -9315 37560 33923 52221 77065 70434 67549 44884 -9296 -35640 -62912 -73387 -79949 -79899
20528g9899K4462J4853J3420K6287K177k0463K486p639L5426M73J518L650K8561
$$ -79899 -55437 -40584 -27164 -877 1300 -19163 -16677 -24316 11110 11583 13101 16751 45312
20515D5312J6677k6928o612J0350j0099P450j54q788P994J3174q566l4849j0472
$$ 45312 61989 35061 28449 38799 28700 36150 35996 27208 35202 48376 39810 4961 -5511
20502e511j8028r070j0036K8311L9063J1669m3982j9465o07J3672K5908L4144
$$ -5511 -23539 -32609 -42645 -14334 24729 36398 -7584 -27049 -27656 -13984 11924 46068
20490D6068k0840j7181N0188M9576K9576K4296J806N509L285j2776k4965j1978
$$ 46068 25228 8047 58235 107811 137387 161683 163489 168998 172283 159507 134542 122564
20478A22564k5139j9905k1140k0982j1471M183O813j016J0372J5693q023n712
$$ 122564 97425 77520 56380 35398 23927 28110 34923 33907 44279 59972 51949 46237
20466D6237K5945P57k4488l897k5682K302j5768l2597J7556M257K7984J2041l856
$$ 46237 72182 72939 48451 44554 18872 21174 5406 -27191 -9635 -5378 22606 34647 30791
20453C0791j6738o869K4650J1742k284r868k848J0502k529j8432l0111o809O752
$$ 30791 14053 7184 31834 43576 41292 31424 28576 39078 36549 18117 -11994 -18803 -12051
20440a2051P273O4L4333J2264j1825j0708L218o761j531j8780q189j5423j4568
$$ -12051 -4778 -4714 29619 41883 30058 19350 22568 15807 14276 -4504 -12693 -28116 -42684
20427d2684K0436K8316k1332K381J0774J5883l184j924j7324K5829N3943O074
$$ -42684 -22248 6068 -15264 -12883 -2109 13774 10590 8666 -8658 17171 71114 77188
20415G7188l3393l5561l7866L1520K5932Q079j5427k3137q623J1316K4828J5534
$$ 77188 43795 8234 -29632 1888 27820 35899 20472 -2665 -11288 28 24856 40390
20403D0390j0523j2545j7413J6764J4732J7870r428L244j824k4057o94J4820j6864
$$ 40390 29867 17322 -91 16673 31405 49275 39847 43091 41267 17210 16516 31336 14472
20390A4472j9199j4470k2090k5059l0784L64K3971N4114L2140J9516J6333j1179
$$ 14472 -4727 -19197 -41287 -66346 -97130 -96766 -72795 -18681 13459 32975 49308 38129
20378C8129L1940J5858J7993j7801P132P177j7128k2780Q773n315p031l890j8565
$$ 38129 70069 85927 103920 86119 93251 100428 83300 60520 69293 63978 56947 53057 34492
20365C4492j9561j3442J2918N729p516J7592J1438M6674Q2527O8275J8764r505
$$ 34492 14931 1489 14407 20136 12620 30212 41650 88324 170851 239126 257890 248385
20353B48385l9943k5564k3910j2638k7786l1713K3354M057j6421l3393l594M9498
$$ 248385 208442 182878 158968 146330 118544 86831 110185 114242 97821 64428 60834 110332
20341A10332L1697j469j0992R164J3482o023j7458o363L152L927q602j6282J3779
$$ 110332 142029 140560 129568 138732 152214 146191 128733 122370 125522 129449 120847 104565 118344
20328A18344M2649l082j5741J0095N291K807J2635j6245l2501Q141o313j0830
$$ 118344 160993 157911 142170 152265 157556 160363 172998 156753 124252 132393 126080 115250
20316A15250k0119R671L0375N8049L0251k2553j8800O495J6907o543K7376L8053
$$ 115250 95131 104802 135177 193226 223477 200924 182124 188619 205526 198983 226359 264412
20304B64412o052j5186k7676q590P189L085j1793k33J2778J4998L7104J5449J7314
$$ 264412 258360 243174 215498 206908 214097 217182 205389 205156 217934 232932 270036 285485 302799
20291C02799J5424M2904L7197M2095M5112j0653n3365k6275m337K0694L3824M0934
$$ 302799 318223 361127 398324 440419 485531 474878 421513 395238 390901 411595 445419 486353
20279D86353M0716N6663M9210N9918N0762M782K3588L8147L1293M3604L8211L6571
$$ 486353 527069 583732 632942 692860 743622 748404 771992 810139 841432 885036 923247 959818
20267I59818N4667J2727J7725P6974J01183P8072J13070J37152J19198J59735
$$ 959818 1014485 1027212 1044937 1121911 1223094 1301166 1414236 1551388 1670586 1830321
20257A830321J51099K00075K82043L79797M74015N62234M85006L73308K68339
$$ 1830321 1981420 2181495 2463538 2843335 3317350 3879584 4364590 4737898 5006237
20248E006237K35484K84155L69151M87215O30251Q47255J093050J399347J913459
$$ 5006237 5241721 5525876 5895027 6382242 7012493 7859748 8952798 10352145 12265604
20239A2265604K591186L359165M393962N867737Q402652J2941887K1307180L7101135
$$ 12265604 14856790 18215955 22609917 28477654 36880306 49822193 71129373 108230508
20231A08230508O3781039R0611395P8431529J3526927m5899454o9364383p0209990
$$ 108230508 172011547 262622942 341054471 354581398 308681944 239317561 169107571
20224A69107571n4857533l5428383k1953037j4102390r458948o688338n018322
$$ 169107571 114250038 78821655 56868618 42766228 33307280 26618942 21600620
20217B1600620l874510l032584k413902j890738j492334j220432r90192p98696
$$ 21600620 17726110 14693526 12279624 10388886 8896552 7676120 6685928 5887232
20209E887232o01539m84821l95177l27196l11074k42490k26050k19640j94200
$$ 5887232 5285693 4800872 4405695 4078499 3767425 3524935 3298885 3079245 2885045
20200B885045k12307j68211j56464j09278j24291j48507j29894j04941q0610r7158
$$ 2885045 2672738 2504527 2348063 2238785 2114494 1965987 1836093 1731152 1650542 1553384
20190A553384p8453n6976m4483n5703p4593n2980n5347o8977o3976q3555n6820
$$ 1553384 1474931 1417955 1373472 1317769 1243176 1190196 1134849 1065872 1001896 918341 861521
20179H61521k7155J5705M116J8438j1615k0109j7303n6427o0996p3635k0886R829
$$ 861521 834366 850071 854187 872625 861010 840901 823598 767171 706175 632540 611654 621483
20167F21483j7219k1999O509p348j4441J0291r825k7295k0737R975k4006Q426
$$ 621483 604264 582265 588774 581426 566985 577276 567451 540156 519419 529394 505388 513814
20155E13814K5540n5338k7085l1858k3368k8196k9000n085L2733q225k5313k1313
$$ 513814 539354 484016 456931 425073 401705 373509 344509 339424 372157 363932 338619 317306
20143C17306k2516l342K6165j3675m052Q2j3632j5187l044K3264J5338p786j9904
$$ 317306 294790 291448 317613 303938 299886 299968 286336 271149 268105 291369 306707 298921 279017
20130B79017j1261j2258J1551J2837j6625k4296k0080k7771J6237j3821R262L073
$$ 279017 267756 255498 267049 279886 263261 238965 218885 191114 207351 193530 202792 205865
20118B05865j7722J6288M147j3370k1097K1587P55j4416k0849L833J7441J7549
$$ 205865 188143 204431 208578 195208 174111 195698 196453 182037 161188 165021 182462 200011
20106B00011O454J052j4816K039j2085k6092l3245j7219J8029P253K2897j8170
$$ 200011 206465 207517 192701 194740 182655 156563 123318 106099 124128 131381 154278 136108
20094A36108N484J3532L2102P048j6759k2439j8547k245k0792j4963k1983r774
$$ 136108 141592 155124 187226 194274 177515 155076 136529 134284 113492 98529 76546 66772
20082F6772M443N781j1361K2919K3165J1965J300R31M6047J1667L408K5147J2527
$$ 66772 71215 76996 65635 88554 111719 123684 124984 125915 171962 183629 187037 212184 224711
20069B24711J551l255k4018k2656j7116K380j1728k4975l2683l7637K7720R614
$$ 224711 226262 223007 198989 176333 159217 161597 149869 124894 92211 54574 82294 91908
20057I1908J4032Q261J170m378l872K4479j0790l0614j8313J625p976o431K3333
$$ 91908 105940 114201 115371 110993 107121 131600 120810 90196 71883 73508 65532 59101 82434
20044H2434k901r871k0850J779l0250J3408M0902L9427p08j2914p651K355k9431
$$ 82434 79533 69662 48812 50591 20341 33749 74651 114078 113370 100456 92805 95160 65729
20031F5729N102K3061j42p951k1399J2848o990j8711J0162N400j2954k5478n142
$$ 65729 70831 93892 93750 85799 64400 77248 70258 51547 61709 67109 54155 28677 23535
20018B3535J6101j9184p490K55Q962K958R196O198L157K3138j421L4836J2709
$$ 23535 39636 20452 12962 13217 22179 25137 34333 40531 43688 66826 65405 100241 112950
20005A12950n832l1520l237J9203M51k0363j7248k8679k9880K406J3417k4045
$$ 112950 107118 75598 72361 91564 92015 71652 54404 25725 -4155 -1749 11668 -12377
19993a2377L4872O246r822L0535K4818J8633j1675q795J1637j3979j3343J1584
$$ -12377 22495 28741 18919 49454 74272 92905 81230 72435 84072 70093 56750 68334
19981F8334K5736k237j4692k211K4692J2797j0015l2426J207k2597l2101j7815
$$ 68334 94070 91833 77141 74930 99622 112419 102404 69978 71185 48588 16487 -1328
19969a328l456K4397M0233q454j1224K637j6649k4272L0142K5298K5537j2506
$$ -1328 -4784 19613 59846 51392 40168 42805 26156 1884 32026 57324 82861 70355
19957G0355l2526j8365J8775J4483J1915n135j4254k6767j0482K1138J9799l934
$$ 70355 37829 19464 38239 52722 64637 59502 45248 18481 7999 29137 48936 45002
19945D5002k8563K811L1005M865Q826j4428j0267N792j4779O12n358P526l21K598
$$ 45002 16439 19250 50255 55120 63946 49518 39251 45043 30264 30876 25518 33044 32723 35321
19931C5321J7254J6865J1845O550r148M699j9385j2691J0883n3775q6445m3003
$$ 35321 52575 69440 81285 87835 78687 83386 64001 51310 62193 8418 -78027 -121030
19919a21030M2314K2089k06K5852L6247l949M350K684k7251P047J7129J5992n138
$$ -121030 -78716 -56627 -56833 -30981 5266 1317 5667 8351 -18900 -11853 5276 21268 16130
19906A6130J1799j5747J1283K8187K6582j267j9246l8285k3541J4105J8702q279
$$ 16130 27929 12182 23465 51652 78234 76967 57721 19436 -4105 10000 28702 20423
19894B0423q745O818K4789n857J56J6004P076j1217j3255j4830J5351L949o571
$$ 20423 11678 18496 43285 37428 37584 53588 60664 49447 36192 21362 36713 40662 34091
19881C4091R694K4724l907l368o726r518l8174l9006j5040k589M0739K5153L189
$$ 34091 43785 68509 64602 61234 54508 44990 6816 -32190 -47230 -49819 -9080 16073 19262
19868A9262R063j5654n1030r895K2207J7486j8864L2452L5457k108j6475k7923
$$ 19262 28325 12671 -38359 -48254 -26047 -8561 -27425 5027 40484 38376 21901 -6022
19856f022p863K94K0368J1057J1234M3814K9978k4151n2027l2212K1505j886r446
$$ -6022 -13885 -13591 6777 17834 29068 72882 102860 78709 26682 -5530 15975 14089 4643
19843D643k3519j9981M6916J5544m558j304K3462o025M701k4607j4569K2906K2621
$$ 4643 -18876 -38857 8059 23603 19045 17741 41203 35178 39879 15272 703 23609 46230
19830D6230j1016m746k2929n142M456K6312j0213m842J4426n128j4850q256j0733
$$ 46230 35214 30468 7539 2397 6853 33165 22952 18110 32536 27408 12558 4302 -6431
19817f431M157J1618l1047l3106o636J2038M0949L5206j262j9008j0860l936J3645
$$ -6431 -2274 9344 -21703 -54809 -61445 -49407 -8458 26748 25486 6478 -4382 -8318 5327
19804E327Q470o566K193N492J1114j9388n706k8949k0314Q781j5102j5847J4701
$$ 5327 13797 7231 9424 14916 26030 6642 936 -28013 -48327 -39546 -54648 -70495 -55794
19791e5794L1075J1255J107j9346n808j7939J7533J8909j9908M3067M749L218
$$ -55794 -24719 -13464 -12357 -31703 -37511 -55450 -37917 -19008 -38916 4151 8900 12118
19779A2118J5684J1170m335J9448k0382j1591l1356Q860O632K4445J2368R806
$$ 12118 27802 38972 34637 54085 33703 22112 -9244 -384 6248 30693 43061 52867
19767E2867j3357q101k8392j2950o294k1044j1299K3876J6690K7329K7880J400
$$ 52867 39510 31409 3017 -9933 -16227 -37271 -48570 -24694 -8004 19325 47205 48605
19755D8605l2207O584K2462j6201k8827l431n606J0761J8801j6860J5196K1161
$$ 48605 16398 22982 45444 29243 416 -3015 -8621 2140 20941 4081 19277 40438
19743D0438L424k3730j8653N913P908L312k757P243J8652J174j455k5250k0359
$$ 40438 43862 20132 1479 7392 15300 18612 15855 23098 41750 42924 41469 16219 -4140
19730d140J7896L1582K6575j4691j4928j525j2233j0158j0231j3876l304J5633
$$ -4140 13756 45338 71913 57222 42294 40769 28536 18378 8147 -5729 -9033 6600
19718F600J8437J0260r572J313K2130p093j9811j7054J4150j1243J137J6371o752
$$ 6600 25037 35297 25725 27038 49168 42075 22264 5210 19360 8117 9254 25625 18873
19705A8873o120l2209l2487j1708J8075L5328J7752N841R14k0232K219J3019M485
$$ 18873 12753 -19456 -51943 -63651 -45576 -10248 7504 13345 14259 -5973 -3754 9265 13750
19692A3750K2344R35j2330O087j1267j3229j0370j9546l2803o551N941J5559l337
$$ 13750 36094 37029 24699 30786 19519 6290 -4080 -23626 -56429 -62980 -57039 -41480 -44817
19679d4817m787k571K3422M5957K8706o120j4130Q605N668K876k9767J973n3140
$$ -44817 -49604 -52175 -28753 17204 45910 39790 25660 34265 39933 42809 13042 15015 -38125
19666c8125l7260J6469M3676K1215j5556j8530j3539J4716K8007k344k024j1504
$$ -38125 -75385 -58916 -15240 5975 -9581 -28111 -41650 -26934 1073 -1271 -3295 -14799
19654a4799J7500K5070M542j8141r071j0321o614J4142j717K1090l082m603J4396
$$ -14799 2701 27771 32313 14172 5101 -5220 -11834 2308 591 21681 18599 13996 28392
19641B8392J319P967J3069j5999k7306P739j8733j1493k0624p390L831M7925J3239
$$ 28392 29711 37678 50747 34748 7442 15181 -3552 -15045 -35669 -43059 -39228 8697 21936
19628B1936P249n8731l2078K2701K0052M6359m916k4134J1221M967k1120J3566
$$ 21936 29185 -29546 -61624 -38923 -18871 27488 22572 -1562 9659 14626 -6494 7072
19616G072J4725j6165j7140P649Q256J3628N340k0842j8893o440P392k935m406
$$ 7072 21797 5632 -11508 -3859 4397 18025 23365 2523 -16370 -22810 -15418 -18353 -22759
19603b2759q021L0250J011l677o725R212q010J348k662J7076M844l4603J920J1864
$$ -22759 -30780 -530 481 -3196 -9921 -709 -8719 -7371 -10033 7043 11887 -22716 -20796 -8932
19589h932M85P271L84j0039j9955q268l6O375J7994J6013K2241R125K916N314
$$ -8932 -8447 -1176 -792 -10831 -30786 -39054 -39090 -32715 -14721 1292 23533 32658 35574 40888
19575D0888j2566n7627k5854K3550J4912J5453L1228J1263j2112L477n646P105
$$ 40888 28322 -29305 -55159 -31609 -16697 -1244 29984 41247 29135 32612 26966 34071
19563C4071L884M816Q002j9444k1964j6727M608P481Q570O733k2306R709q177
$$ 34071 37955 42771 50773 31329 9365 -7362 -2754 4727 13297 20030 -2276 7433 -744
19550g44j8935M604q991p696M281j0765L1830J586j2552K1953K7345j3141k0736
$$ -744 -19679 -15075 -24066 -31762 -27481 -38246 -6416 -4830 -17382 4571 31916 18775 -1961
19537a961n620O041K2480m343Q756K1696J9970n0437j9447L3254L1520p130j6882
$$ -1961 -7581 -1540 20940 16597 25353 47049 67019 16582 -2865 30389 61909 54779 37897
19524C7897Q088k992k0665J0892Q729j5566m427K798m73j8987j9178j3430J9602
$$ 37897 45985 42993 22328 33220 41949 26383 21956 24754 24281 5294 -13884 -27314 -7712
19511g712K6354r520k1703R36J5113k279l278R740L0175K7563k5938p307J0860
$$ -7712 18642 9122 -12581 -11645 3468 1189 -2089 7651 37826 65389 39451 32144 43004
19498D3004j1043m1910j6433N221R132J6350J5251j6989P400j100J1216O27l1125
$$ 43004 31961 -9949 -26382 -21161 -12029 4321 19572 2583 9983 8883 20099 20726 -10399
19485a0399o267N818J6515J7481R562j0765l372k2192Q804L2896M4501J7204j155
$$ -10399 -16666 -10848 5667 23148 32710 21945 18573 -3619 5185 38081 82582 99786 98631
19472I8631k0311k7701j4749J3217j6812k7851j6980l6342Q356K562k7614L0993
$$ 98631 78320 50619 35870 49087 32275 4424 -12556 -48898 -40542 -37980 -65594 -34601
19460c4601L3269K2912m533K4411K6690m976l1125l558M124Q328k4091k0679j6971
$$ -34601 -1332 21580 17047 41458 68148 63172 32047 28489 32613 40941 16850 -3829 -20800
19447b0800Q876p010Q559L8183J09j4498j9028n51L2210J5605P527J438j4973
$$ -20800 -11924 -18934 -10375 27808 27917 13419 -5609 -6160 26050 41655 49182 50620 35647
19434C5647r643J1183j3257j6280J400j1060J5736k5907k338J0845O355n946p439
$$ 35647 26004 37187 23930 7650 9050 -2010 13726 -12181 -14519 -3674 2681 -3265 -10704
19421a0704J3550J2207k4007k0186P392J4387j0805l431J1345j4234M552J8071
$$ -10704 2846 15053 -8954 -29140 -21748 -7361 -18166 -21597 -10252 -24486 -19934 -1863
19409a863k4450j5969j4270l388J8662Q114k9093J8700K508J915l1137l085K6878
$$ -1863 -26313 -42282 -56552 -59940 -41278 -33164 -62257 -43557 -41049 -39134 -70271 -73356 -46478
19396d6478J4846J7139K2764K3139Q369K1232j9575j1067M062j1713k4379J1374
$$ -46478 -31632 -14493 8271 31410 39779 61011 41436 30369 34431 22718 -1661 9713
19384I713J357j6558k344J998K546P911K4829k1347k3917M1475P204j1651l6072
$$ 9713 11070 -5488 -7832 -5834 -3288 4623 29452 8105 -15812 25663 32867 21216 -14856
19371a4856j4233j116j0028K3311J0142j1147J1347R178k0187k9618j7818q289
$$ -14856 -29089 -30205 -40233 -16922 -6780 -17927 -6580 2598 -17589 -47207 -65025 -73314
19359g3314J981N630J8490L4513K4744j840K2071J9452J0824j8117r552j0587
$$ -73314 -71333 -65703 -47213 -12700 12044 10204 32275 51727 62551 44434 34882 24295
19347B4295p679j421l0297J124L1321K465j0269j0453M183q134K102K642j6955
$$ 24295 16616 15195 -15102 -13978 17343 19808 9539 -914 3269 -4865 -2763 -121 -17076
19334a7076j2701L6311J6330j1259R438M935o59k061k905j2350N772m73j4824
$$ -17076 -29777 6534 22864 11605 21043 25978 25319 23258 20353 8003 13775 13302 -1522
19321a522M75Q057J149R083J9373j4023k4465m830m3379j6065K481k99K3248J1726
$$ -1522 -1047 7010 8159 17242 36615 22592 -1873 -6703 -50082 -66147 -63666 -63965 -40717 -28991
19307b8991J7940K669j1117J2056L2727r183k6335P160m709k4764J4924J1291
$$ -28991 -11051 -8382 -19499 -7443 25284 16101 -10234 -3074 -7783 -32547 -17623 -6332
19295f332K169j1321J402k8261K775K7180K3474k1013n770J5787n805J985J1018
$$ -6332 -4163 -15484 -14082 -42343 -39568 -12388 11086 -9927 -15697 90 -5715 -3730 7288
19282G288K4650R618P318J0756Q56k0276j6116j6058n593j929Q937J785L54J5543
$$ 7288 31938 41556 48874 59630 60486 40210 24094 8036 2443 514 9451 11236 11590 27133
19268B7133J3180k0822j3085l488J8862J2772L6488Q307m366o179k0536L592j5604
$$ 27133 40313 19491 6406 2918 21780 34552 71040 79347 74981 68802 48266 51858 36254
19255C6254j9621N266j9082n810n836N135R666j9477m631j8822J410P637J3207
$$ 36254 16633 21899 2817 -2993 -8829 -3694 5972 -13505 -18136 -36958 -35548 -27911 -14704
19242a4704L2985K821j1733j8101k7006K7076n979r360R870j898k322J9059k6677
$$ -14704 18281 21102 9369 -8732 -35738 -8662 -14641 -24001 -14131 -16029 -18351 708 -25969
19229b5969j9450L8964L2810l569K814K3025j4799m3372k5216j3819K160K7987
$$ -25969 -45419 -6455 26355 22786 25600 48625 33826 -9546 -34762 -48581 -46421 -18434
19217a8434K2129J1965J5555J709J7030M06l1514j8645k611J1654J063k8417L998
$$ -18434 3695 15660 31215 32924 49954 50360 18846 201 -2410 9244 10307 -18110 -14112
19204a4112q236O486m34j7613K2328J4440j5280k413O77J7938L7097j0353k2286
$$ -14112 -22348 -15862 -16296 -33909 -11581 2859 -12421 -14834 -14157 3781 40878 30525 8239
19191H239j5374M553q081j8777P707o267J1427j0667k8007n418J7782Q914J602
$$ 8239 -7135 -2582 -10663 -29440 -21733 -28000 -16573 -27240 -55247 -60665 -42883 -33969 -32367
19178c2367K8638L4260j2067j5586O850J74M550j5556k1537P204k645R039K3098
$$ -32367 -3729 30531 18464 2878 9728 9902 14452 -1104 -22641 -15437 -18082 -9043 14055
19165A4055J8694M194K269k5723r204n501J8948L287k8126j697p462k1451k6797
$$ 14055 32749 36943 39212 13489 4285 -1216 17732 21019 -7107 -8804 -16266 -37717 -64514
19152f4514L1536j4208j4005m073L8615K5279k319j1490j4543j927L8963j1054
$$ -64514 -32978 -47186 -61191 -65264 -26649 -1370 -3689 -15179 -29722 -31649 7314 -3740
19140c740K6231K0158m0195r200k0497m39n5o3J0196N758l698k5097j0940J5049
$$ -3740 22491 42649 2454 -6746 -27243 -27682 -27737 -27800 -17604 -11846 -15544 -40641 -51581 -36532
19126c6532J8084K0054J8389r756k3012r684J7394L261J2342k0188k1347J934
$$ -36532 -18448 1606 19995 10239 -12773 -22457 -5063 -1802 10540 -9648 -30995 -29061
19114b9061O945L686j9162r627K8771R583P499K5540L572p313K005p086R695j051
$$ -29061 -22116 -18430 -37592 -47219 -18448 -8865 -1366 24174 27746 20433 22438 15352 25047 23996
19100B3996J1693j5205m417R59l2886p353j3273J2401K0004J5812J1637m114P025
$$ 23996 35689 20484 16067 17026 -15860 -23213 -36486 -24085 -4081 11731 23368 19254 26279
19087B6279Q83J1544j0360J2436j1510k9536m818o513L019J8850K551J3904J961
$$ 26279 27162 38706 28346 40782 29272 -264 -5082 -11595 -8576 10274 12825 26729 28690
19074B8690K7207k3381p4q224j42k4304o706j878J1313Q625q758k710k7642m1700
$$ 28690 55897 32516 32442 24218 24076 -228 -6934 -8812 2501 11126 2368 -342 -27984 -69684
19060f9684P638K9565K1579J8M481j46L2022K8456j0533k0911k3993P847p600
$$ -69684 -62046 -32481 -10902 -10884 -6403 -6549 25473 53929 43396 22485 -1508 6339 -1261
19047a261j6958k1277j9361M7511L3373k199N866J7952k0173O28l463j4907K0697
$$ -1261 -18219 -39496 -58857 -11346 22027 19828 25694 43646 23473 24101 20638 5731 26428
19034B6428J018O69r716j6517J378K368L136K2164L706J9595k1217m1308j8630
$$ 26428 27446 28115 18399 1882 3260 5628 8764 30928 34634 54229 33012 -8296 -26926
19021b6926J1091J4965J2726J578j3303k3130j798J3169J9125p257p526K6649
$$ -26926 -15835 -870 11856 13434 131 -22999 -24797 -11628 7497 240 -7286 19363
19009A9363j1651m115P509q284J740k9635r607K6243M662o734K8167o655m2606
$$ 19363 7712 3597 11106 2822 4562 -25073 -34680 -8437 -3775 -10509 17658 11003 -31603
18996c1603k1840K8987J6077Q348p632L073l553n38J982R621K488O222j4179K570
$$ -31603 -53443 -24456 -8379 -31 -7663 -4590 -8143 -8681 -6699 2922 5410 11632 -2547 23
18982B3K4215J202P290l4550k0578p925M21J2108J0455j8771J345K2146K2558
$$ 23 24238 25440 32730 -1820 -22398 -30323 -29902 -17794 -7339 -26110 -24765 -2619 19939
18969A9939o583m910j1496p781O031P899K494n442n620j4222N719K5672l098J497
$$ 19939 13356 8446 -3050 -10831 -4800 3099 5593 151 -5469 -19691 -13972 11700 8602 10099
18955A0099m070O159k3291j7008J7853K850M887J677J646k058K076P311P969j4704
$$ 10099 6029 12188 -11103 -28111 -10258 -7408 -2521 -844 802 -1256 820 8131 16100 1396
18941A396o640j7144j3245L0751J6058R869J5011P569O821j807n1031m045J4331
$$ 1396 -5244 -22388 -35633 -4882 11176 21045 36056 43625 50446 48639 -2392 -6437 7894
18928G894m528j7271J9204M2783J508k2936m3125j4818K4509k968l1658L1528
$$ 7894 3366 -13905 5299 48082 49590 26654 -16471 -31289 -6780 -9748 -41406 -9878
18916i878j2083j9639J8210L7704O92k865r216q830J0471L0463M131m4343j2620
$$ -9878 -21961 -41600 -23390 14314 15006 12141 2925 -5905 4566 35029 39160 -5183 -17803
18903a7803r74K7293N456m0419k2595J3338L32J383K7025k9627J1108K411p307
$$ -17803 -18777 8516 13972 -26447 -49042 -35704 -35372 -33989 -6964 -36591 -25483 -23072 -30379
18890c0379J770j8518j5707J7779L0279K7432K017j1855J499j3140j375R179L3150
$$ -30379 -28609 -47127 -62834 -45055 -14776 12656 14673 2818 4317 -8823 -10198 -1019 32131
18877C2131r047k6012o773k1056J6490P143K0285o114J0861q166k4688r017j2449
$$ 32131 23084 -2928 -9701 -30757 -14267 -7124 13161 7047 17908 9742 -14946 -23963 -36412
18864c6412m771K0310J9798K1477j0978J1002j4187l750Q285J6031K957M776L6955
$$ -36412 -41183 -20873 -1075 20402 9424 20426 6239 2489 10774 26805 29762 34538 71493
18851G1493j4761j8600l979M49k3527j5875L775J6378r900n469j9118J8882L6568
$$ 71493 56732 38132 34153 34602 11075 -4800 -1025 15353 5453 -16 -19134 -252 36316
18838C6316j693k3804l4732J2657J8202k3311j4458O183J0243L5727L2932k3622
$$ 36316 34623 10819 -23913 -11256 6946 -16365 -30823 -24640 -14397 21330 54262 30640
18826C0640k6705R44M8153M1393O1716M5724M6121N5216L9588j9423m5569o5227
$$ 30640 3935 4879 53032 94425 156141 201865 247986 303202 342790 323367 277798 212571
18814B12571k0572k066k6438k0067n600O0155Q9519P9334K7580q372j6727l4495
$$ 212571 191999 189933 163495 143428 137828 197983 287502 366836 394416 386044 369317 334822
18802C34822m5868j1696l546o0123n9507k0942k2933j5584k4155j3551j757j8090
$$ 334822 288954 277258 273712 213589 154082 133140 110207 94623 70468 56917 55160 37070
18790C7070l720j2987K6638J5612j7519K7109p991j5213m750K9779K8891K9584
$$ 37070 33350 20363 47001 62613 45094 72203 64212 48999 44249 74028 102919 132503
18778A32503N1212M8183M2825O1969O4296J5899P36m3632m1680m5844l8687J8530
$$ 132503 183715 231898 274723 336692 400988 416887 417623 373991 332311 286467 247780 266310
18766B66310M139M5843P5443Q2686N0388n122n0678o2075q5348o6254l4634K7563
$$ 266310 270449 316292 391735 474421 524809 519687 469009 406934 321586 255332 220698 248261
18754B48261o263L82k16Q121L766j1200n860m798j3949j7970j3001k4544j6256
$$ 248261 241998 242380 242164 250285 254051 242851 236991 232193 218244 200274 187273 162729 146473
18741A46473l6725k1577o146m6782l666J0053J0113n37p714n746k8041k0790J9362
$$ 146473 109748 88171 82025 35243 31577 41630 51743 51206 43492 37746 9705 -11085 8277
18728H277M0931K746j0731k7092j4777J3860J0966J3409j7886j4025L2352K4935
$$ 8277 49208 51954 41223 14131 -646 13214 24180 37589 19703 5678 38030 62965
18716F2965K5607o815k5835R720K5440l0693J8722L974L712n50l779l987j218
$$ 62965 88572 81757 55922 65642 91082 60389 79111 83085 86797 86247 82468 78481 77263
18703G7263K5578K4903N0095M3085M438m7218k6258l7655o4856m9089q369K6836
$$ 77263 102841 127744 177839 220924 225362 178144 151886 114231 49375 286 -8083 18753
18691A8753L9859j9535k063L0114O056k2009j800n552p488k7366J4628n578k0926
$$ 18753 58612 39077 37014 67128 73184 51175 49375 43823 36335 8969 23597 18019 -2907
18678b907M458j070j4286N459N462k4158j6362J9785K8640J6869r479j8724q808
$$ -2907 1551 481 -13805 -8346 -2884 -27042 -43404 -23619 5021 21890 12411 -6313 -15121
18665a5121K6820J6939j4502J8505k5062k9297j860k183K276K598m985J0474M904
$$ -15121 11699 28638 14136 32641 7579 -21718 -23578 -25761 -23485 -20887 -25872 -15398 -10494
18652a0494r70N709j3374r458L7571K9884j331N940j788k7905J4660M0048J3887
$$ -10494 -11464 -5755 -19129 -28587 8984 38868 37537 43477 41689 13784 28444 68492 82379
18639H2379k0873k9120k3547J3478K8265q29j1716m953m280j7240j4516J203k943
$$ 82379 61506 32386 8839 22317 50582 49753 38037 33084 28804 11564 -2952 -1749 -4692
18626d692L7J1335l668J2197J6698k237j1785k2671r056K3790K3096p432J0305
$$ -4692 -4655 6680 3012 15209 31907 29670 17885 -4786 -13842 9948 33044 25612 35917
18613C5917J1893p748j4799J5097N216o447J0197r728j8631r659q151k6504J819
$$ 35917 47810 40062 25263 40360 45576 39129 49326 39598 20967 11308 3157 -23347 -21528
18600b1528J8548j4741O37J4257J4231J2830K1250J6288j1905k0500k0106l447
$$ -21528 -2980 -17721 -17084 -2827 11404 24234 45484 61772 49867 29367 9261 5814
18588E814P207L9380l705p321j0178N727J0101K7081k0538n1093j0179M6562J4194
$$ 5814 13021 52401 48696 41375 31197 36924 47025 74106 53568 2475 -7704 38858 53052
18575E3052o253k828q777k067m798n60N219J0018K6930O483j1553k6085J2420
$$ 53052 46799 43971 35194 33127 28329 27769 32988 43006 69936 76419 64866 38781 51201
18562E1201L770k0371m663K8191K5476k1679p853j0330j3054J3975r341l3912
$$ 51201 54971 34600 29937 58128 83604 61925 54072 43742 30688 44663 35322 1410
18550A410j5119q531q79m394m342K1393M6143L2750l220l815j6390L951J2938
$$ 1410 -13709 -22240 -23119 -27513 -31855 -10462 35681 68431 65211 61396 45006 48957 61895
18537F1895k6754k860k0707m883j2113l935K1274J6509o611k5927j5811K1957
$$ 61895 35141 32281 11574 6691 -5422 -9357 11917 28426 21815 -4112 -19923 2034
18525B034L7926p662j8550j4400J6534j9885l2160K3828N986J2269L2705K2266
$$ 2034 39960 32298 13748 -652 15882 -4003 -36163 -12335 -6349 5920 38625 60891
18513F0891P145J2197J7013L0457J6916P701L5544N014L811m167j1143J5976L7448
$$ 60891 68036 80233 97246 127703 144619 152320 187864 192878 196689 192522 181379 197355 234803
18500B34803n00k7647m7078l3647n079m6509n4886j1216L2516O989L5110j6867
$$ 234803 234303 206656 159578 125931 120852 74343 19457 8241 40757 47746 82856 65989
18488F5989j4224J0607N19j7471j8779l1707j8860L3859L1535O133j6118N492
$$ 65989 51765 62372 62891 45420 26641 -5066 -23926 9933 41468 47601 31483 36975
18476C6975l714R558k247j764j4971J2080L2519p662l4168j1658k183j0352j2097
$$ 36975 33261 42819 40572 38808 23837 35917 68436 60774 26606 14948 12765 2413 -9684
18463i684P830R149J1566n407K9035J2734j9639j2538j3203j3195J7073K1517
$$ -9684 -1854 7295 18861 13454 42489 55223 35584 23046 9843 -3352 13721 35238
18451C5238o550o995N160n600J2346K3485Q069J877l4197k2167L2827M2340J0914
$$ 35238 28688 21693 26853 21253 33599 57084 65153 67030 32833 10666 43493 85833 96747
18438I6747l3494m2804k731K1010K8404L951M374l262l332K0245j017l0822m034
$$ 96747 63253 20449 17718 38728 67132 71083 75457 72195 68863 89108 88091 57269 53235
18425E3235M366K0316P940R666m1757j5735N383j6983l648J6717l192K8553R107
$$ 53235 57601 77917 85857 95523 53766 38031 43414 26431 22783 39500 36308 64861 73968
18412G3968j826j1320j2848k2698q796J2746K2128J3546K7408J0697J324j4683
$$ 73968 72142 60822 47974 25276 16480 29226 51354 64900 92308 103005 104329 89646
18400H9646K9501K6302J6706J9489K3090k7802k8318O035p703l8055o0937J5151
$$ 89646 119147 145449 162155 181644 204734 176932 148614 154649 146946 108891 47954 63105
18388F3105J9220j857k322j8668j995O746N9710N9590M6470M1550M2399K1047
$$ 63105 82325 80468 78146 59478 57483 64229 123939 183529 229999 271549 313948 334995
18376C34995k5732k6944k565N644j6688l5741m4983l2195j0524k2141K2754J2721
$$ 334995 309263 282319 279754 285398 268710 232969 187986 155791 145267 123126 145880 158601
18364A58601J8733J9699n987j0859j0524J518P429N9263J8584J7342l293k8837
$$ 158601 177334 197033 191046 180187 169663 171181 178610 237873 256457 273799 270506 241669
18352B41669J0853K4318j9381K4603M7904O9129J16372K02331J35517m1140j14006
$$ 241669 252522 276840 257459 282062 329966 399095 515467 717798 853315 812175 698169
18341F98169j09732n7609m9124n1163j6936R472K506j9220K1353M9488K8336K5994
$$ 698169 588437 530828 481704 430541 413605 423077 425583 406363 427716 477204 505540 531534
18329E31534L3431O5600J11614J10373J05860K00234L32298O45401J263455K208192
$$ 531534 564965 630565 742179 852552 958412 1158646 1490944 2136345 3399800 5607992
18319E607992K110712n9392j236019j385216j457987j066900n56596k42700j30087
$$ 5607992 7718704 7659312 6423293 5038077 3580090 2513190 1956594 1713894 1583807
18310A583807j52785j54318j37140j22760o6647n0934P947L1891J4545J3853L5075
$$ 1583807 1431022 1276704 1139564 1016804 950157 899223 907170 939061 953606 967459 1002534
18299A002534O0840R2530J07915J20075J38965J03812J08386J28580J94921K88903
$$ 1002534 1063374 1155904 1263819 1383894 1522859 1626671 1735057 1863637 2058558 2347461
18289B347461L26187L93136N36531N36945K44372M6720l3256p4164M2710K73986
$$ 2347461 2673648 3066784 3603315 4140260 4384632 4431352 4398096 4323932 4366642 4640628
18279D640628N58020Q86755J416088K220965L712578P018873J3521914J8836534
$$ 4640628 5198648 6085403 7501491 9722456 13435034 20453907 33975821 52812355
18271E2812355O433668p852515r870814j0539589q398398m314479j798578m21881
$$ 52812355 59246023 51393508 41522694 30983105 22584707 18270228 16471650 16049769
18263A6049769L51922J218304K329238L701340N368021O959526R848195J6727738
$$ 16049769 16401691 17619995 19949233 23650573 29018594 35978120 45826315 62554053
18255F2554053L0618660N3811282P2537617O2052723L2275780j3525731l7359098
$$ 62554053 93172713 146983995 219521612 281574335 313850115 300324384 262965286
18248B62965286k8700834j3675603j7607841l4082666l6754862l4357661k9112055
$$ 262965286 234264452 220588849 202981008 168898342 132143480 97785819 68673764
18241F8673764j9868404j2542006q142968n467356l626442k374514j465475p67632
$$ 68673764 48805360 36263354 28120386 22653030 19026588 16652074 15186599 14418967
18233A4418967p2825Q43680K443697N612002J1063402J4634433M772771o690271
$$ 14418967 14346142 15189822 17633519 23245521 34308923 48943356 53716127 47025856
18225D7025856r168180r787542q092319m820340k952567k251418j790264j386712
$$ 47025856 37857676 28070134 19977815 15157475 12204908 9953490 8163226 6776514
18217F776514j049045p83908n60222m12431l01625j94917j39802j87728k29663
$$ 6776514 5727469 4943561 4383339 3970908 3669283 3474366 3334564 3146836 2917173
18208B917173k54486k35375k23510j96894j62296r7178p0699j04141p2599k7705
$$ 2917173 2662687 2427312 2203802 2006908 1844612 1747434 1676735 1572594 1499995 1472290
18198A472290o5240n7360j9275m7508k2527j9827l0375j109J05771J53468M8974
$$ 1472290 1407050 1349690 1330415 1282907 1260380 1240553 1210178 1209069 1314840 1468308 1517282
18187A517282o8960o8069l6515K336N0802J57833L36688P02133J077710P34156
$$ 1517282 1448322 1380253 1343738 1346074 1396876 1554709 1891397 2593530 3671240 4405396
18177D405396k38761o63497p61021p07100m56925k37093j22173n8839p2224r6980
$$ 4405396 4166635 3503138 2742117 2035017 1578092 1340999 1218826 1159987 1087763 990783
18167I90783n1686J0363M7280J56393L10333N67210J104036J565596O80804o10901
$$ 990783 939097 949460 996740 1153133 1463466 2030676 3134712 4700308 5381112 4770211
18157D770211r27339j018010q70251n43336l15713j85957j22230p5716q2048o0110
$$ 4770211 3842872 2824862 1954611 1411275 1095562 909605 787375 711659 629611 569501
18147E69501l5914o328k7103k3990k9755j3443n286j3596J7846j0797k0181K527
$$ 569501 533587 527259 500156 476166 446411 432968 427682 414086 431932 421135 400954 403481
18135D03481l228k1261j3263n905J985K8168P827J9206K0286P118R758k0395o4270
$$ 403481 400253 378992 365729 359824 361809 389977 397804 417010 437296 444414 454172 433777 369507
18122C69507n9697k1877n784j8148J2583m267O636M1045K3254m2436l203M4188
$$ 369507 309810 287933 282149 264001 276584 272317 278953 319998 343252 300816 297613 341801
18110C41801j0532l4667k4758j5518r465p632l3621Q194m6566l4260j307p688
$$ 341801 331269 296602 271844 256326 246861 239229 205608 213802 167236 132976 131669 123981
18098A23981J4618J8667J5443L1529J5331J9011J1078j9752l7603L550J3474O605
$$ 123981 138599 157266 172709 204238 219569 238580 249658 229906 192303 195853 209327 215932
18086B15932j3893l9762l6625j6346J9075K1233P931J6618k0507m1163k0773K9030
$$ 215932 202039 162277 125652 109306 128381 149614 157545 174163 153656 112493 91720 120750
18074A20750K17M668K815j6483J5193m266k4304j6026j9341n092L6633J1100q802
$$ 120750 120967 125635 128450 111967 127160 122894 98590 82564 63223 58131 94764 105864 97062
18061I7062j1178J7474K2599L981r573O246K9548M815j123k1452J1442j2117l1421
$$ 97062 85884 103358 125957 129938 120365 126611 156159 160974 159851 138399 149841 137724 106303
18048A06303L056J4039l721J8004Q084Q726l1749k0311l000j6596k6920K6606
$$ 106303 109359 123398 119677 137681 145765 154491 122742 102431 99431 82835 55915 82521
18036H2521Q182J4944L3854L064m573p307j5260j8637M508j4869J2607Q495j7578
$$ 82521 90703 105647 139501 142565 137992 130685 115425 96788 101296 86427 99034 107529 89951
18023H9951J2716K3331j0918j9416j7785j3674N066K6527k0449m1631Q068J4863
$$ 89951 102667 125998 115080 95664 77879 64205 69271 95798 75349 33718 41786 56649
18011E6649K9874J6755k9840J690K6922O726j6211M242J5764m5705j4053k3498
$$ 56649 86523 103278 73438 75128 102050 108776 92565 96807 112571 66866 52813 29315
17999B9315o027K952K7886j0591k2647K2735K6408J0861Q911K5454j4737j9160
$$ 29315 23288 26240 54126 43535 20888 43623 70031 80892 89803 115257 100520 81360
17987H1360k4328J3938L2211J6078j6780J142q234j0870p877K5802K4091k536
$$ 81360 57032 70970 103181 119259 102479 103621 95387 84517 76640 102442 126533 123997
17975A23997k6818p19r542j2289j2476l7563j9247Q739L5187J0705P306j1135
$$ 123997 97179 96460 86918 74629 62153 24590 5343 14082 49269 59974 67280 56145
17963E6145m0349M706K6331q82O536J7968K7809J7386K0571l5271l2948l0209
$$ 56145 15796 20502 46833 45951 52487 70455 98264 115650 136221 100950 68002 37793
17951C7793n719J9689p007L0093K835n129l3724l7824k5398r492Q533K1446j0586
$$ 37793 32074 51763 44756 74849 77684 72555 38831 1007 -24391 -33883 -25350 -3904 -14490
17938a4490k4686K736K5291K9149k401l7501j335J6613K1469J5715J9688K8831
$$ -14490 -39176 -36440 -11149 18000 15599 -21902 -23237 -6624 14845 30560 50248 79079
17926G9079o201k3840K300J485N363P964L503k0344j0935J3040M1172N726m3466
$$ 79079 72878 49038 51338 52823 58186 66150 69653 49309 38374 51414 92586 98312 54846
17913E4846j4201k7413K2461J3431J7638N203k9436J209K2388l750l0046j4930
$$ 54846 40645 13232 35693 49124 66762 71965 42529 43738 66126 62376 32330 17400
17901A7400J2641P613M8548J6205j5159k311K299q33J1761n1351r085j3285K0965
$$ 17400 30041 37654 86202 102407 87248 84937 87236 86403 98164 46813 37728 24443 45408
17888D5408K7976J253k4277r126R662K7200J0933n540k5371L383K531J5027j4788
$$ 45408 73384 74637 50360 41234 50896 78096 89029 83489 58118 61501 64032 79059 64271
17875F4271k2504k2927P151K8941M466j4695l9941j2615J461J0426J1648K744
$$ 64271 41767 18840 25991 54932 59398 44703 4762 -7853 -6392 4034 15682 18426
17863A8426n881j1237L074L1857K2119J2391k865q815j2507j9703Q298q126K9448
$$ 18426 12545 1308 4382 36239 58358 70749 67884 59069 46562 26859 35157 27031 56479
17850E6479R356j751k7876m772J6672j8177o506K822M127K7279m788j4821M2253
$$ 56479 65835 64084 36208 31436 48108 29931 23425 26247 30374 57653 52865 38044 80297
17837H0297j782l2308l8437k2115K4340K3205O063L1597K0699P392j5528j7382
$$ 80297 78515 46207 7770 -14345 9995 33200 39263 70860 91559 98951 83423 66041
17825F6041j8260p327j7353j4977j0963Q352R198k4857j4477O548J6643J8918
$$ 66041 47781 40454 23101 8124 -2839 5513 14711 -10146 -24623 -18075 -1432 17486
17813A7486J999M4378n494k5545N114j4178J0191L1810J9259N21j3255m75j773
$$ 17486 19485 63863 58369 32824 37938 23760 33951 65761 85020 85541 72286 71811 70038
17800G0038k9070o956K823j1879O185k977K814j7472R796J6493J7738L813r434
$$ 70038 40968 34012 36835 24956 31141 28164 30978 13506 23302 39795 57533 61346 51912
17787E1912N028Q501O023L0939j8975J1661K9002l8346n4580J1249J2255m049
$$ 51912 56940 65441 71464 102403 83428 95089 124091 85745 31165 42414 54669 50620
17775E0620J0786l087j4358J7012L0899k542q503k3457J0012R168J0947j1936
$$ 50620 61406 58319 43961 60973 91872 89330 80827 57370 67382 76550 87497 75561
17763G5561J5722j0896P067N6077M8630L4066M8061P6640P4231P4827R650m7247
$$ 75561 91283 80387 87454 143531 192161 226227 274288 350928 425159 499986 509636 462389
17751D62389j931k5804l3386p3898n9386l6686l3169n1546l6651k7320j5258n039
$$ 462389 460458 434654 401268 327370 267984 231298 198129 146583 109932 82612 67354 62315
17739F2315N996L3016Q790K0445M8958O9037O9175Q5609J7895k2708l6225o4252
$$ 62315 68311 101327 110117 130562 179520 248557 317732 403341 421236 398528 362303 298051
17727B98051l4002l2463m100J1914J4778K8936J7620K5313q94k9069n2523k6779
$$ 298051 264049 231586 227486 239400 254178 283114 300734 326047 325153 296084 243561 216782
17715B16782k9589j9353r006O794l3397J20K0546j7061n763J1942J1437L3471
$$ 216782 187193 167840 158834 165628 132231 132351 152897 135836 130073 142015 153452 186923
17703A86923N5929P8211J08138P6275P5877L7141j952m3719q2015j22581q2914
$$ 186923 242852 321063 429201 505476 581353 618494 616542 572823 490808 368227 285313
17692B85313o9839k7375j8078l0693p161L5833k121k6227l0388j0878j8735k9224
$$ 285313 215474 188099 170021 139328 132167 168000 165879 139652 109264 98386 79651 50427
17680E0427p037q375j700p046r217J8543N574L2176L3535q860k8503j0519J2989
$$ 50427 43390 35015 33315 26269 17052 35595 41169 73345 106880 98020 69517 58998 71987
17667G1987Q751P229k8091l29J0826K5373j7131K9507K4478j0992J1039p737r586
$$ 71987 80738 87967 59876 59547 70373 95746 78615 108122 132600 121608 132647 124910 115324
17654A15324k2481m809K834J5938O322K2766J7115K6512q234k4112l0637m0053
$$ 115324 92843 88034 90868 106806 113128 135894 153009 179521 171287 147175 116538 76485
17642G6485k47O529j1265k3965J4824j9928j2977J0285L366l2839l0153M22J0108
$$ 76485 76238 82767 71502 47537 62361 42433 29456 39741 43107 10268 -19885 -19463 -9355
17629i355j7346J4437K0171M0999J2269K30j6922j0482n5154p7J247L065J5078
$$ -9355 -26701 -12264 7907 48906 61175 61405 44483 34001 -21153 -21230 -19983 -16918 -1840
17616a840J9314K5326k1559k7453J2691M6243J775m7462l1151J3265R478j3668
$$ -1840 17474 42800 21241 -6212 6479 52722 54497 7035 -24116 -10851 -1373 -15041
17604a5041P834J1242R722M050J4130k5634j6529l6160r109j1356J7515K690N923
$$ -15041 -7207 4035 13757 17807 31937 6303 -10226 -46386 -55495 -66851 -49336 -46646 -40723
17591d0723P497J4362J8455K2859l950q463L130j6970J3314l6602p643J6235l905
$$ -40723 -33226 -18864 -409 22450 18500 10037 13167 -3803 9511 -27091 -34734 -18499 -22404
17578b2404j3866J8230J9410m173O069J6934P292J1950j4354o279P28j0327k4408
$$ -22404 -36270 -18040 1370 -2803 3266 20200 27492 39442 25088 18809 19537 9210 -15198
17565a5198j9707J0789K6674o55N065m460j844K1112M346R128q425j7937K4623
$$ -15198 -34905 -24116 2558 1903 6968 2508 664 21776 26122 35250 26825 8888 33511
17552C3511K6627k1452l3779N438P309j3047k3330k47j6371m773L5188Q461K5109
$$ 33511 60138 38686 4907 10345 17654 4607 -18723 -18970 -35341 -40114 -4926 3535 28644
17539B8644q675k1597J3536K6546p602j8215K1343l32k2415M226k3202m067o735
$$ 28644 19969 -1628 11908 38454 30852 12637 33980 33648 11233 15459 -7743 -11810 -18545
17526a8545J0755J6809P649P274L4172j4728k1215M487m648o483k1990j3749P862
$$ -18545 -7790 9019 16668 23942 58114 43386 22171 26658 22010 15527 -6463 -20212 -12350
17513a2350L771K2856J2080m060J1293M529n814J2002J4531j3783k1200l6102
$$ -12350 -8579 14277 26357 22297 33590 38119 32305 44307 58838 45055 23855 -12247
17501a2247J0721J5127n574l113J2950L3592p879m1182k504L4485J0771j6709
$$ -12247 -1526 13601 8027 4914 17864 51456 43577 2395 -109 34376 45147 28438
17489B8438J7186P454j0622j882k4518l1986n470J6386M9613n665J1665L793j2811
$$ 28438 45624 53078 42456 40574 16056 -15930 -21400 -5014 44599 38934 50599 54392 41581
17476D1581j9379j7019r100J6955q286l9755J2223K1165K190J7224j089p024q238
$$ 41581 22202 5183 -3917 13038 4752 -35003 -22780 -1615 575 17799 16710 9686 1448
17463A448m420j5575J7424J3335K648j3971j9294J422o343q91j1694K9705p286
$$ 1448 -2972 -18547 -1123 12212 14860 889 -18405 -16983 -23326 -24217 -35911 -6206 -13492
17450a3492r359L5198j3541m929M922j6119j2982J4702P367J0108J9632J7091
$$ -13492 -22851 12347 -1194 -6123 -1201 -17320 -30302 -15600 -8233 1875 21507 38598
17438C8598l503n309o552l1822M096J5600J8618K8520M245j9062l1033j1316K1877
$$ 38598 35095 29786 23234 -8588 -4492 11108 29726 58246 62491 43429 12396 1080 22957
17425B2957p150k0436K724l566M815k1278p074R197L181j995J5733J370M863j3115
$$ 22957 15807 -4629 -1905 -5471 -656 -21934 -29008 -19811 -16630 -18625 -2892 -1522 3341 -9774
17411i774K1032K1175l295j538l1616L1264k750k5447J2331J2185k9365j7945
$$ -9774 11258 32433 29138 27600 -4016 27248 24498 -949 11382 23567 -5798 -23743
17399b3743R117J6422J1147R81K3590J706j2030J0266j3036L4409Q869j1368k5373
$$ -23743 -14626 1796 12943 13924 37514 39220 27190 37456 24420 58829 67698 56330 30957
17386C0957j9813j415j8323j7481m634P610M792r004q858N593r260j0656J7975
$$ 30957 11144 9729 -8594 -26075 -30709 -23099 -18307 -27311 -36169 -30576 -39836 -50492 -32517
17373c2517J4705m228J8721j9128p896J4079n025J1004L9678N240k5643k7061
$$ -32517 -17812 -22040 -3319 -22447 -30343 -16264 -21289 -10285 29393 34633 8990 -18071
17361a8071Q746K6496k8198L1694K4028q679J5331o404k0828j4994o695N470o375
$$ -18071 -9325 17171 -11027 20667 44695 36016 51347 44943 24115 9121 2426 7896 1521
17348A521j5075J8370J9322k1394j9275j415o835R055L6845q392k6508j3890l090
$$ 1521 -13554 4816 24138 2744 -16531 -17946 -24781 -15726 21119 12727 -13781 -27671 -30761
17335c0761m745K9744K7868K5490q103j4125j9181l132j1845j4459J9328O12J6344
$$ -30761 -35506 -5762 22106 47596 39493 25368 6187 3055 -8790 -23249 -3921 -3309 13035
17322A3035j0829K3164L7400j5966n2913j6961j5183K9279J13j9850n16O961K299
$$ 13035 2206 25370 62770 46804 -6109 -23070 -38253 -8974 -8861 -28711 -29227 -22266 -19967
17309a9967k1960K4762L9156P581l841L1735q353l4818j8566j659j0278l62r934
$$ -19967 -41927 -17165 21991 29572 25731 57466 49113 14295 -4271 -5930 -16208 -16570 -26504
17296b6504j2841N513m837K529L2715K0561j0840m404p70o027J751l11m076K678
$$ -26504 -39345 -33832 -38669 -36140 -3425 17136 6296 1892 1122 -4905 -3154 -3465 -7541 -4863
17282d863J6448m037k6195J7936Q004r036p069q164k0243K8912N3559k3344j8640
$$ -4863 11585 7548 -18647 -711 7293 -1743 -8812 -16976 -37219 -8307 45252 21908 3268
17269C268k8756K1141J2713k4201j4190j5625M15L623N263L524J1037j4193O985
$$ 3268 -25488 -4347 8366 -15835 -30025 -45650 -45235 -41612 -36349 -32825 -21788 -35981 -28996
17256b8996J0462J9632J2760n070J0572l887j339R940K928r117n18J4014p855
$$ -28996 -18534 1098 13858 8788 19360 15473 14134 24074 27002 17885 17367 31381 23526
17243B3526K8501K6571R48k2818o718k3805k2488k0262l165k117J3595L1246j8627
$$ 23526 52027 78598 79546 56728 50010 26205 3717 -16545 -19710 -21827 -8232 23014 4387
17230D387k7816j9819M69P901J1888o631R283K7233J4375J028j6619O555J8795
$$ 4387 -23429 -43248 -42779 -34878 -22990 -29621 -20338 6895 21270 22298 5679 12234 31029
17217C1029J4813j1978k7727J164k090k469p139j3040J1452J2472M5930J2334
$$ 31029 45842 33864 6137 7301 5211 2742 -4397 -17437 -5985 6487 52417 64751
17205F4751k2193l4628o0078k2941J7316J8723P568J8905L1156J1512k4682j7576
$$ 64751 42558 7930 -52148 -75089 -57773 -39050 -31482 -12577 18579 30091 5409 -12167
17193a2167K0391j3599P356J0836r960K529J6745n183N584J182m742k0726O388
$$ -12167 8224 -5375 1981 12817 2857 5386 22131 16948 22532 23714 18972 -1754 4634
17180D634L2426l216j9531k6287J5409J7407J3522j4570l5897K7016l017M141
$$ 4634 37060 33844 14313 -11974 3435 20842 34364 19794 -16103 10913 7896 12037
17168A2037j0934l1346O098K0552N15j1044J9339N0201K5842k6047n394k3028
$$ 12037 1103 -30243 -24145 -3593 -3078 -14122 5217 55418 81260 55213 49819 26791
17156B6791k0985k8429J1843L9422K1067k6497j1667L718l0360O312L6684k7098
$$ 26791 5806 -22623 -10780 28642 49709 23212 11545 15263 -15097 -8785 27899 801
17144H01o141R290j396K37l3372j1516K0336j0597m044L6189M909j629j2920j9251
$$ 801 -5340 3950 2554 2791 -30581 -42097 -21761 -32358 -36402 -213 4696 3067 -9853 -29104
17130b9104N348J6062K5461J779l487q187j0272q219k3558J3959J2577Q705J614
$$ -29104 -23756 -7694 17767 19546 16059 7872 -2400 -10619 -34177 -20218 -7641 1064 2678
17117B678n252J2645j3043K740K6649j7963l5292Q481J9611k8977j9421K5082
$$ 2678 -2574 10071 -2972 -232 26417 8454 -26838 -18357 1254 -27723 -47144 -22062
17105b2062K4009J8843p170k5650n850J8189n278j9025J4814J2276O072J5463
$$ -22062 1947 20790 13620 -12030 -17880 309 -4969 -23994 -9180 3096 9168 24631
17093B4631j6604r146K7645j78l0804P419J397m034q178o844r134o125M183N949
$$ 24631 8027 -1119 26526 26348 -4456 2963 4360 326 -7852 -14696 -23830 -29955 -25772 -19823
17079a9823K187j1818K0644J1300L4961p282j7979j1203J1295p509J4145K2082
$$ -19823 -17636 -29454 -8810 2490 37451 30169 12190 987 12282 4773 18918 41000
17067D1000j2130j2085K0039j239J0650j5742J1531K012j5292q678k0792j038
$$ 41000 28870 16785 36824 35585 46235 30493 42024 44036 28744 20066 -726 -1764
17055a764j0895k3718o709k028j7526M23L5078J48L350K7135N30p283j90k0100
$$ -1764 -12659 -36377 -43086 -45114 -62640 -62217 -27139 -26991 -23641 3494 4024 -3259 -3449 -23549
17041b3549j7495n65M459O379l93K6076m293j1824K4373k3p138L4593J4136M477
$$ -23549 -41044 -41609 -37150 -30771 -31164 -5088 -9381 -21205 3168 3145 -3993 30600 44736 49213
17027D9213k5762j3312P274j5546j6148J1720r490p182l455K5914N824k516P629
$$ 49213 23451 10139 17413 1867 -14281 -2561 -12051 -19233 -22688 3226 9050 6534 14163
17014A4163n385J9522k308J6787J9126j7920j6143j7109j906J7708J5965k6856
$$ 14163 8778 28300 25992 42779 61905 43985 27842 10733 8827 26535 42500 15644
17002A5644j2193l8900J7659J678m173K7433J5419l989k8596r420K5621L0518
$$ 15644 3451 -35449 -17790 -16112 -20285 7148 22567 18578 -10018 -19438 6183 36701
16990C6701M1250O8392J07224J39227K07410J66759R9655m7242j55123j84572
$$ 36701 77951 146343 253567 392794 600204 766963 866618 819376 664253 479681
16980D79681j90142j23350m7096l5278k1937j5879k9553R617j586K0665J6900
$$ 479681 289539 166189 119093 83815 61878 45999 16446 26063 24477 45142 62042
16969F2042k1033r650l7664j2760P942n271j6778K7856P079M300k6030J647M551
$$ 62042 41009 31359 -6305 -19065 -11123 -16394 -33172 -5316 1763 6063 -19967 -18320 -13769
16956a3769j9466k556J4010J0638J0438k402M702L2462M184n58j568J3830K417
$$ -13769 -33235 -35791 -21781 -11143 -705 -3107 1595 34057 38241 37683 36115 49945 52362
16943E2362j765J3268J1296l2682n755j8078r096j1740J8428K3153q384M738p138
$$ 52362 50597 63865 75161 42479 36724 18646 9550 -2190 16238 39391 31007 35745 28607
16930B8607m889l30j1629k150J4396L2568k4768j7016R992k6413J3751J681n740
$$ 28607 23718 23388 11759 9609 24005 56573 31805 14789 24781 -1632 12119 13800 8060
16917H060j4036k6679o827K0465J2982M363J6811J4009P234J9819l9603j6457
$$ 8060 -5976 -32655 -39482 -19017 -6035 -1672 15139 29148 36382 56201 16598 141
16905A41m096J2354K0639n468J933J1607j2939l7767n0745J5440L6797j223N389
$$ 141 -3955 8399 29038 23570 25503 37110 24171 -13596 -64341 -48901 -12104 -13327 -7938
16892g938k3613J3813J7104R31Q8J6109m79n630K580P348j6047M531K5585j0756
$$ -7938 -31551 -17738 -634 297 385 16494 16015 10385 12965 20313 4266 8797 34382 23626
16878B3626l1349L517q740q354R820n161J001J0706M109j1878R98P380J6243J8102
$$ 23626 -7723 -4206 -12946 -21300 -11480 -16641 -15640 -4934 -825 -12703 -11705 -4325 11918 30020
16864C0020P050k0187k9722r048K4042l16J1921K4542N176j6483N960m746k2420
$$ 30020 37070 16883 -12839 -21887 2155 1839 13760 38302 43478 26995 32955 28209 5789
16851E789l5407l4292K7576N463L3100K67j4312K5875K5270j4362k9567o1l630
$$ 5789 -29618 -63910 -36334 -30871 2229 2496 -11816 14059 39329 24967 -4600 -4661 -8291
16838h291K377K5596J8813l2194m841J7405q160k2237k8839q348K6594J8409J2665
$$ -8291 -5914 19682 38495 6301 1460 18865 10705 -11532 -40371 -48719 -22125 -3716 8949
16825H949M446l4475k423J0040k2181K0456J3179j0597J2340K7134p462K6903
$$ 8949 13395 -21080 -23503 -13463 -35644 -15188 -2009 -12606 -266 26868 19406 46309
16813D6309k7733k3490J2321J7125O22r986K5226O115K6774j4637k0964l889l963
$$ 46309 18576 -4914 7407 24532 25154 15168 40394 46509 73283 58646 37682 33793 29830
16800B9830m3755j5223K1714L7786j1564n3498j3949K5655L482o683K2217q996
$$ 29830 -13925 -29148 -7434 30352 18788 -34710 -48659 -23004 -19522 -26205 -3988 -12984
16788a2984j3959K3378P579L461K8611K0311j4031k1584L812q906k2656j2525
$$ -12984 -26943 -3565 4014 7475 36086 56397 42366 20782 24594 15688 -6968 -19493
16776a9493j0069k2594j0268K043p075L0769J9041M213L1257L3473N236j9411
$$ -19493 -29562 -52156 -62424 -60381 -67456 -36687 -17646 -13433 17824 51297 56533 37122
16764C7122l8640r820M532K5981J5057K5308l7727j1021N809j4375o20k9934j883
$$ 37122 -1518 -11338 -6806 19175 34232 59540 21813 10792 16601 2226 1606 -28328 -30211
16751c0211R508O42l8108j1037K9007K1819J2807L8025J7159j3814m6008K90J2865
$$ -30211 -20703 -20061 -58169 -69206 -40199 -18380 -5573 32452 49611 35797 -10211 -9921 2944
16738B944L2238n892j6852k6077j2066J1597N9048k0749m243p287j5689K3990
$$ 2944 35182 29290 12438 -13639 -25705 -14108 44940 24191 19948 12661 -3028 20962
16726B0962J4045j4138j8849k095K5228k0800j5469J1106K0141j341J2668K3644
$$ 20962 35007 20869 2020 -75 25153 4353 -11116 -10 20131 18790 31458 55102
16714E5102o448k677j3210j8845N355Q342M620l033j866j4250j2790L835l610
$$ 55102 48654 45977 32767 13922 19277 27619 32239 29206 27340 13090 300 4135 525
16701E25l119n463J7746P75l590k0823K4634J3136L98l805j4576M367J2283J2052
$$ 525 -2594 -8057 9689 10464 6874 -13949 10685 23821 24219 20414 5838 10205 22488 34540
16687C4540M936k4838l5169N551L1999K2964l454j6158j3893J0388J7691k3343
$$ 34540 39476 14638 -20531 -14980 17019 39983 36529 20371 6478 16866 34557 11214
16675A1214j0972J0978K2371P751q325k1667j4301J233k09L546M6112L239k9028
$$ 11214 242 11220 33591 41342 33017 11350 -2951 -1718 -1927 1619 47731 50970 21942
16662B1942m608j0509k1061K6014J3379k9327o570K0536j8866N825J6518J2144
$$ 21942 17334 6825 -14236 11778 25157 -4170 -10740 9796 -9070 -3245 13273 25417
16650B5417k4578r619J8411j7580j593K0543O28j8906o093K9052K7001K9604l2408
$$ 25417 839 -8780 9631 -7949 -9542 11001 11629 -7277 -13370 15682 42683 72287 39879
16637C9879j2285J5560M700N03j646k8845r161l7054j735J9599M836j565k009
$$ 39879 27594 43154 47854 48357 46711 17866 8705 -28349 -30084 -10485 -5649 -7214 -9223
16624i223K1368J8564r19j9828k5589j2996j2407J1185J7001J8906N727k620j738
$$ -9223 12145 30709 29790 9962 -15627 -28623 -41030 -29845 -12844 6062 11789 9169 7431
16611G431j9254l905J8645q37k6045J525j0172K368J1052j7835k2394L4631Q277
$$ 7431 -11823 -15728 2917 2080 -23965 -22440 -32612 -30244 -19192 -37027 -59421 -24790 -16513
16598a6513R366J3686r927J0914j4081K3532J462j074R483J6159l2707o365J4706
$$ -16513 -7147 6539 -3388 7526 -6555 16977 18439 17365 26848 43007 10300 3935 18641
16585A8641R519j9996j6843J4716L2781J7100J3581l3198j3860K9606l067p173
$$ 18641 28160 8164 -8679 6037 38818 55918 69499 36301 22441 52047 48980 41807
16573D1807l7503j3127r194M307j6504j5635M1654J0743l813K2K151L234J0147
$$ 41807 4304 -8823 -18017 -13710 -30214 -45849 -4195 6548 2735 2757 4908 8142 18289
16560A8289k417M747k0923k795L5278N070j9192Q954K9812R142k2315j992j6213
$$ 18289 15872 20619 -304 -3099 32179 37249 18057 27011 56823 65965 43650 41658 25445
16547B5445k6762l5521r553n934J5830j548M784k22J7319J8035j0969R729l457
$$ 25445 -1317 -36838 -46391 -52325 -36495 -38043 -33259 -33481 -16162 1873 -9096 633 -2824
16534b824L4808J3358k2318l1401j4994J4666k276K4127k053r775j8898j2394
$$ -2824 31984 45342 23024 -8377 -23371 -8705 -10981 13146 11093 1318 -17580 -29974
16522b9974M2L7091QK5244j1282n4895M026J2558P010J4467Q386j7151m570O497
$$ -29974 -29932 7159 7167 32411 21129 -33766 -29740 -17182 -10172 4295 12681 -4470 -9040 -2543
16508b543K290o641J4380j7067m796l02o675J5886K0116j2610l200o389J9378
$$ -2543 -253 -6894 7486 -9581 -14377 -14679 -21354 -5468 14648 2038 -1162 -7551 11827
16495A1827K512K1110k5465o924p974q416J0819q22k3760M388L2964L3863p14
$$ 11827 14339 35449 9984 3060 -4914 -13330 -2511 -3333 -27093 -22705 10259 44122 43408
16482D3408k7687j6830m434L7188o011k5045K923j0141q499j5701J4524K9297
$$ 43408 15721 -1109 -5543 31645 25634 589 3512 -6629 -15128 -30829 -16305 12992
16470A2992J3764J0487K143l938R41j6561l2206J5339O1046o630l3419k1970k9985
$$ 12992 26756 37243 39386 35448 36389 19828 -12378 2961 64007 57377 23958 1988 -27997
16457b7997J0544J6562J4427l826j134o63J099J867l441L662j5078K1651j0266
$$ -27997 -17453 -891 13536 9710 8576 7913 9012 10879 7438 11100 -3978 17673 7407
16444G407l5192O13l028J780L384K2850P674j6160L0055j4476j3947K5923K3479
$$ 7407 -27785 -27172 -30200 -28420 -25036 -2186 5488 -10672 19383 4907 -9040 16883 40362
16431D0362J5200p309j3500r874j1927k2559n075K8772O930l0800j3739j4561
$$ 40362 55562 48253 34753 24879 12952 -9607 -14682 14090 21020 -9780 -23519 -38080
16419c8080P58K1868M351l920J7345L66k317K5824O361j7555N474J0967j1097
$$ -38080 -37322 -15454 -11103 -15023 2322 2688 371 26195 32556 15001 20475 31442 20345
16406B0345r282p957j69L744k9329l6291k3929J1067K7916L1548j5398j2183P910
$$ 20345 11063 3106 2937 6681 -22648 -58939 -82868 -71801 -43885 -12337 -27735 -39918 -32008
16393c2008O625K2466R692K721j0897j6851j3740R671k0017o026p373O428N3288
$$ -32008 -25383 -2917 6775 9496 -1401 -18252 -31992 -22321 -42338 -48364 -55737 -49309 3979
16380C979J9539j5889m021k2746k7236j4664J5532N8634L2800l9325k5458j1641
$$ 3979 23518 7629 3608 -19138 -46374 -61038 -45506 13128 45928 6603 -18855 -30496
16368c0496l256p937M719K6606K6038j4390J2521j2987j6646p10P403k1428o61
$$ -30496 -33752 -41689 -36970 -10364 15674 1284 13805 818 -15828 -16538 -9135 -30563 -31224
16355c1224M727J6529N132J7631K6456j8640k9600J1662O465L4722Q105r661j6458
$$ -31224 -26497 -9968 -4836 12795 39251 20611 -8989 2673 9138 43860 51965 42304 25846
16342B5846J2654j2377l462j7009l922O634K0228K315j6900J5251K848j010K2490
$$ 25846 38500 26123 22661 5652 1730 8364 28592 30907 14007 29258 32106 31096 53586
16329E3586R521j3944J423k9679q25J5747L153j832Q73r219k5049O936k5165q255
$$ 53586 63107 49163 50586 20907 20082 35829 38982 37150 38023 28804 3755 10691 -14474 -22729
16315b2729J2369k607j9792j1607J3260L7695P72l7102j8418j3175L3788M2249
$$ -22729 -10360 -12967 -32759 -44366 -31106 6589 7361 -29741 -48159 -61334 -27546 14703
16303A4703r945M515L6729K4097k4079j9093M21M247J2591j7801k5138k4795K2533
$$ 14703 4758 9273 46002 70099 46020 26927 27348 31595 44186 26385 1247 -23548 -1015
16290a015J2423j9884k0162k0686l868J4343o619j290J5702J9040L860o242P729
$$ -1015 11408 -8476 -28638 -49324 -53192 -38849 -45468 -46758 -31056 -12016 -8156 -14398 -6669
16277f669L6271N063m93N092m774j9715p27P406q832o138j0033J7813L0405P586
$$ -6669 29602 34665 34172 39264 34490 14775 14048 21454 12622 6484 -3549 14264 44669 52255
16263E2255p477k6169p831o467N202M277j8037q493J9399J3672m033q855k406
$$ 52255 44778 18609 10778 4311 9513 13790 -4247 -12740 6659 20331 16298 7443 5037
16250E037J9923K045j7848j8781j0212J7660K7221j2484o228l1324j1088o088
$$ 5037 24960 27005 9157 -9624 -19836 -2176 25045 12561 6333 -24991 -36079 -42167
16238d2167r109j5842J0562K3128K4493J9967j4532j0672Q298q975K5921K0239
$$ -42167 -51276 -67118 -56556 -33428 -8935 11032 -3500 -14172 -5874 -14849 11072 31311
16226C1311o422O575l2684q512J7891m587P289j8998j0983L736k0184p110Q085
$$ 31311 24889 31464 -1220 -9732 8159 3572 10861 -8137 -19120 -15384 -35568 -42678 -34593
16213c4593Q632k706l957m205J7773L7026J6968k2716j7835l055l4020k248L4951
$$ -34593 -25961 -28667 -32624 -36829 -19056 17970 34938 12222 -5613 -8668 -42688 -44936 -9985
16200i985J2908P508n414M539n547q68K0371J240j5787Q368O228l0045l6066n922
$$ -9985 2923 10431 5017 9556 4009 3141 23512 24752 8965 17333 23561 -6484 -42550 -48472
16186d8472j2516K3422M722L7502N515m016m730K2647k573R66Q797n04k8938k4019
$$ -48472 -60988 -37566 -32844 4658 10173 6157 1427 24074 21501 22467 31264 30760 1822 -22197
16172b2197j3446j857J6172J0354M711J5524J5733m044l7102J6614J7744n261
$$ -22197 -35643 -37500 -21328 -10974 -6263 9261 24994 20950 -16152 462 18206 12945
16160A2945J2295q804J9343p170K3334r243k8589j4300P075M74l611o103n33J5005
$$ 12945 25240 16436 35779 28609 51943 42700 14111 -189 6886 7360 3749 -2354 -2887 12118
16146A2118M247j0979m311J0072O392o083m867k6860Q850N721J4869n982j5583
$$ 12118 16365 5386 1075 11147 17539 11456 6589 -20271 -11421 -5700 9169 3187 -12396
16133a2396J3781J128j8818K4604r737P36J7100k1057p238J2490J3651K8223N345
$$ -12396 1385 2513 -16305 8299 -1438 -702 16398 -4659 -11897 593 14244 42467 47812
16120D7812j9043j1859J4135k9116l3509R749J3246J5585l0724K1973J5295j3463
$$ 47812 28769 16910 31045 1929 -31580 -21831 -8585 7000 -23724 -1751 13544 81
16108H1j2331K287j446j9575p836M33J7861M0242J8676k960j8226L982K4483k993
$$ 81 -12250 -9963 -11409 -30984 -38820 -38387 -20526 19716 38392 35432 17206 21188 45671 42678
16094D2678j6493l7387m700J0708J2845R092O73J2789k8444k1568L2277J6738
$$ 42678 26185 -11202 -15902 -5194 7651 16743 17416 30205 1761 -19807 12470 29208
16082B9208l2050l0040P691K7301j4574k1708P031M8634q741j8050K1870O499
$$ 29208 -2842 -32882 -25191 2110 -12464 -34172 -27141 21493 12752 -5298 16572 23071
16070B3071r984J5514K514l1215K803O969k8617n777J8747P735j1680L54L4117
$$ 23071 13087 28601 31115 -100 2703 9672 -18945 -24722 -5975 1760 -9920 -9566 24551
16057B4551Q665q242L550o435l2060m358j5116K4189L3875J6519N89p041k0596
$$ 24551 33216 24974 28524 22089 -9971 -14329 -29445 -5256 28619 45138 45727 38686 18090
16044A8090o988l5322l2274J4139J6558k64m224J2219L1235N617k4865M169K2720
$$ 18090 11102 -24220 -56494 -42355 -25797 -26061 -30285 -18066 13169 18786 -6079 -1910 20810
16031B0810j3785k753p116j6948J5875P666P463k3267Q40R81j1123j2892O90o220
$$ 20810 7025 4272 -2844 -19792 -3917 3749 11212 -12055 -11215 -10234 -21357 -34249 -33559 -39779
16017c9779m483m780o097K1690q432K5311N0653J5126k0567J8376j0045k5068
$$ -39779 -44262 -49042 -55139 -33449 -41881 -16570 34083 49209 28642 47018 36973 11905
16005A1905K557J1867o086L329k6632k6546j827J8084L6767L6612K362l9859k3736
$$ 11905 14462 26329 20243 23572 -3060 -29606 -31433 -13349 23418 60030 62392 22533 -1203
15992a203k03k6512j9318L341j6662j8129J1315K6689L6221j4832m1480q56O6320
$$ -1203 -1406 -27918 -47236 -43895 -60557 -78686 -67371 -40682 -4461 -19293 -60773 -61629 4691
15979D691o937j8072J9798P046J2563k2120M748j2255J6964L462r544L187N493
$$ 4691 -2246 -20318 -520 6526 19089 -3031 1717 -10538 6426 9888 344 3531 9024
15966I024L043J2921j8164j8288j1331Q8J5821Q591K0627K6915N743j2877K898
$$ 9024 12067 24988 6824 -11464 -22795 -22707 -6886 1705 22332 49247 54990 42113 45011
15953D5011q222J0265j8915k1962n0110J0191M2934J0520P707P860j5314K627
$$ 45011 36789 47054 28139 6177 -43933 -33742 9192 19712 27419 35279 19965 22592
15941B2592k604j1719j7922K8618J3963p194j2554J0514j1354j8275l2290l7736
$$ 22592 19988 8269 -9653 18965 32928 25734 13180 23694 12340 -5935 -38225 -75961
15929g5961J2831M3454K2715m19j4558p876K2893k0269J6007M3567L5448m2596
$$ -75961 -63130 -19676 3039 2620 -11938 -19814 3079 -17190 -1183 42384 77832 35236
15917C5236l2026n917J5692Q416J0833l8421l5280j208J1447J9585l267j0312
$$ 35236 3210 -2707 12985 21401 32234 -6187 -41467 -42675 -31228 -11643 -14910 -25222
15905b5222J6276M477k7446N369K2259J3748J4516K367m640o048l5601k762n437
$$ -25222 -8946 -4469 -31915 -26546 -4287 9461 23977 26344 21704 15656 -19945 -22707 -28144
15892b8144J4223R286j5610M599J42J6439K1734r529k9827k3476K571J2319o460
$$ -28144 -13921 -4635 -20245 -15646 -15504 935 22669 13140 -16687 -40163 -37592 -25273 -31733
15879c1733k3873Q908L000R728K0315K3950L4485l3212l7921O043P689j0823k2688
$$ -31733 -55606 -46698 -43698 -33970 -13655 10295 44780 11568 -26353 -20310 -12621 -23444 -46132
15866d6132j3915P026K6367n543k367K3658R753Q818P690k4688J639J1923J3879
$$ -46132 -60047 -53021 -26654 -32197 -34564 -10906 -1153 7665 15355 -9333 -7694 4229 18108
15853A8108J6043j2278j5897q701K129L2435L043l5592l7269l3872J2778J0160
$$ 18108 34151 21873 5976 -2725 -596 31839 34882 -710 -37979 -71851 -59073 -48913
15841d8913q319J1220J5296j023K7237n572k655j0200K0767M1734R661K532o1875
$$ -48913 -57232 -46012 -30716 -31739 -4502 -10074 -12729 -22929 -2162 39572 49233 51765 -10110
15828a0110j0903N877L600L7625P559j9919K6670R080l8608k0949p11q56P443
$$ -10110 -21013 -15136 -11536 26089 33648 13729 40399 49479 10871 -10078 -10789 -11645 -4202
15815d202L6558J0641j9474j8410J0102J3489k4591L60J1047J1513k1950k5195
$$ -4202 32356 42997 23523 5113 15215 28704 4113 4473 15520 27033 5083 -20112
15803b0112q618r164P648P146J5794J4740J0031N894P790K8525O689l1850k5405
$$ -20112 -28730 -37894 -30246 -23100 -7306 7434 17465 23359 31149 59674 66363 34513 9108
15790I108j8010M317k788K738j2184p669K4632J5822n191J2322k3772j8878j5161
$$ 9108 -8902 -4585 -7373 -4635 -16819 -24488 144 15966 10775 23097 -675 -19553 -34714
15777c4714L1431K7261N926l9335l2579m040L2678L5454k7767k336Q244m568N206
$$ -34714 -3283 23978 29904 -9431 -42010 -46050 -13372 22082 -5685 -8021 223 -4345 861
15764H61M498L5992R386j113k7637l2713j9160J2303O187p166m818J9003p958
$$ 861 5359 41351 50737 49624 21987 -10726 -29886 -17583 -11396 -18562 -23380 -4377 -12335
15751a2335J3903K2111L178K65k620k0210J0272j0345l4170K5311R631j8228R667
$$ -12335 1568 23679 26857 27122 24502 4292 14564 4219 -29951 -4640 4991 -13237 -3570
15738c570j388k1291J5072J8224J9506l825L016q823j1471L5502K7182j4520k0551
$$ -3570 -4958 -26249 -11177 7047 26553 22728 25744 16921 5450 40952 68134 53614 33063
15725C3063j8250m406K2466M285l699j4081j8461O918K9155l2066j2679l79J3025
$$ 33063 14813 10407 32873 37158 33459 19378 917 7835 36990 4924 -7755 -8134 4891
15712D891k128O400Q489m793j9583j7566k1478m265K8102L2621J3813m4235k0814
$$ 4891 2763 9163 17652 12859 -6724 -24290 -45768 -50033 -21931 10690 24503 -19732 -40546
15699d0546L4186Q940j8917q700K0212J182M082j236K158j5731k7600n806p236
$$ -40546 -6360 2580 -16337 -25037 -4825 -3643 439 -797 1361 -14370 -41970 -47776 -55012
15686e5012K8251K2813j1855K314J1214J0266M4045j3891l1217Q725K4827J6513
$$ -55012 -26761 -3948 -15803 -13489 -2275 7991 52036 38145 6928 15653 40480 56993
15674E6993K150l0435j3234l323N375k1314J0033r738j2256j503L2779q569m0722
$$ 56993 59143 28708 15474 12151 17526 -3788 6245 -3493 -15749 -17252 15527 6958 -33764
15661c3764m3734J0650J7234K5488q501j5816Q825k524k7262P748O4596L417l0317
$$ -33764 -77498 -66848 -49614 -24126 -32627 -48443 -39618 -42142 -69404 -61656 2940 6357 -23960
15648b3960O477L935j3369q190J114K7817J2248q180j5114M048J4233m277k1606
$$ -23960 -17483 -13548 -26917 -35107 -33993 -6176 6072 -2108 -17222 -13174 1059 -3218 -24824
15635b4824J1980J3757K634M749P661L1340k6566k1332n83n924j2637K62J3521
$$ -24824 -12844 913 3547 8296 15957 47297 20731 -601 -1184 -7108 -19745 -19483 -5962
15622e962j2168m891M0918K3724O894P475k4017j2021j4573k9580Q886J6232K0490
$$ -5962 -18130 -23021 17897 41621 48515 55990 31973 19952 5379 -24201 -15315 917 21407
15609B1407J5544O737k1513r35k147k4225L5817L0989n274p916k6779M797M498
$$ 21407 36951 43688 22175 21240 19093 -5132 30685 61674 56400 48484 21705 26502 31000
15596C1000j5601j7026p518J5054Q94j1969M959R687j1549Q105j025j5874q281
$$ 31000 15399 -1627 -9145 5909 6803 -5166 -207 9480 -2069 6036 5011 -10863 -19144
15583a9144j2051Q319K0883Q742K1529n677j5065R853K7701P053J720j8557p746
$$ -19144 -31195 -22876 -1993 6749 28278 22601 7536 17389 45090 52143 53863 35306 27560
15570B7560k947p599l8472j0455J753Q419O726j9878K6188L1429N387j745k656
$$ 27560 24613 17014 -21458 -31913 -30160 -21741 -15015 -34893 -8705 22724 28111 26366 23710
15557B3710j4969r86J7423J6332J2360l6143Q368J0795J6423j113j2236j7387
$$ 23710 8741 7755 25178 41510 53870 17727 26095 36890 53313 52200 39964 22577
15545B2577r170o845p603j3928n472o772K5009M1777j8872l6307k5964K480q544
$$ 22577 13407 6562 -1041 -14969 -20441 -27213 -2204 39573 20701 -15606 -41570 -39090 -47634
15532d7634j0837K5024L5651Q656k1917j9901N760K4273J1655k8210K8720J8271
$$ -47634 -58471 -33447 2204 10860 -11057 -30958 -25198 -925 10730 -17480 11240 29511
15520B9511l2959m7580M648J9603J0702R247O396K510Q482p796o616P371P743
$$ 29511 -3448 -51028 -46380 -26777 -16075 -6828 -432 2078 10560 2764 -3852 3519 11262
15507A1262j6711j8027Q587K7996r403j8383j844K2123n550L3820O932p165j0579
$$ 11262 -5449 -23476 -14889 13107 3704 -14679 -16523 5600 50 33870 40802 33637 23058
15494B3058j7355j6803j6391q619M4068J7580k78Q384r309j0499n516l820r298
$$ 23058 5703 -11100 -27491 -36110 7958 25538 25260 33644 24335 13836 8320 4500 -4798
15481d798m1342K5029O842k3131P36n98J8762j322j5875L221k0910K2157K1920
$$ -4798 -46140 -21111 -14269 -37400 -36664 -37262 -18500 -19822 -35697 -32476 -53386 -31229 -9309
15468i309J3928N1393N917j5401j5834k0745o590J4154k4635j5202j4601K5884
$$ -9309 4619 56012 61929 46528 30694 9949 3359 17513 -7122 -22324 -36925 -11041
15456a1041J7291j5427l499p805j0073J0612O434o320j63J9335L620J4562j3235
$$ -11041 6250 -9177 -12676 -20481 -30554 -19942 -13508 -19828 -19991 -656 2964 17526 4291
15443D291o493J596J3877M1222j0984m5494r983j8375j6424K0314L1143J3227
$$ 4291 -2202 -606 13271 54493 43509 -1985 -11968 -30343 -46767 -26453 4690 17917
15431A7917J768k5140k9673k5869M643L505K3852J8252n459r671j143R51j1788
$$ 17917 19685 -5455 -35128 -60997 -56354 -52849 -28997 -10745 -16204 -25875 -27018 -26067 -37855
15418c7855J3951j6058L851K5866j548k6385J8768j686o75M06O094m109o102Q023
$$ -37855 -23904 -39962 -36111 -10245 -11793 -38178 -19410 -21096 -21771 -21365 -15271 -19380 -25482 -17459
15404a7459j8715q586K6558L560O926O663j6790o870K0332P283J3138l484k4994
$$ -17459 -36174 -44760 -18202 -14642 -7716 -1053 -17843 -24713 -4381 2902 16040 12556 -12438
15391a2438l4819K209K4502N922K0955k036j8027P60p054j8362R482K0860J5416
$$ -12438 -47257 -45048 -20546 -14624 6331 4295 -13732 -12972 -20026 -38388 -28906 -8046 7370
15378G370L809j9548j3522j0774l165R990J9218r373J684J6815m0446j1416j3287
$$ 7370 11179 -8369 -21891 -32665 -35830 -25840 -6622 -15995 -14311 2504 -37942 -49358 -62645
15365f2645j2648K6422L5207L1442j8487q137k2731j8795K3137p764j4901J6607
$$ -62645 -75293 -48871 -13664 17778 -709 -8846 -31577 -50372 -27235 -34999 -49900 -33293
15353c3293P356j8861j6869J3318L8266K2754o750J4661k0989m1008n619L7144
$$ -33293 -25937 -44798 -61667 -48349 -10083 12671 5921 20582 -407 -41415 -47034 -9890
15341i890J8914L250o503k4313M153P932k988N912k7866j5639M194O029Q46K3314
$$ -9890 9024 12274 5771 -18542 -14389 -6457 -9445 -3533 -31399 -47038 -42844 -36815 -35969 -12655
15327a2655N080N939J4938l05L492l1980L449J4525k5061P417P950l493Q780K0415
$$ -12655 -7575 -1636 13302 12997 16489 -15491 -12042 2483 -22578 -15161 -7211 -10704 -1924 18491
15313A8491R201r513j6456J6973N759q526k5332k2972j8575J0429p304j2009n450
$$ 18491 27692 18179 1723 18696 24455 15929 -9403 -32375 -50950 -40521 -47825 -59834 -65284
15300f5284j1679L0172J6278J1816J1231Q576J0441K236k0755R989j6438l1458
$$ -65284 -76963 -46791 -30513 -18697 -7466 1110 11551 13787 -6968 3021 -13417 -44875
15288d4875m964J4076K6678K9903o690J3284n94j2467j1825n329K0305K1817k0556
$$ -44875 -49839 -35763 -9085 20818 14128 27412 26818 14351 2526 -2803 17502 39319 18763
15275A8763l642K2199n5n1968n03J5236J180N729j4674j2111k5611K0564o35Q845
$$ 18763 15121 37320 37265 -14703 -15206 30 1210 6939 -7735 -19846 -45457 -24893 -25528 -16683
15261a6683K4487n116J7526j6889r801m091P999Q576p01o426k6619N077j5771
$$ -16683 7804 2688 20214 3325 -6476 -10567 -2568 6008 5307 -1119 -27738 -22661 -38432
15248c8432j5120j0691P527L122N997J4979J4909N412M1090p852l0653q774n698
$$ -38432 -53552 -64243 -56716 -53594 -47597 -32618 -17709 -12297 28793 20941 -9712 -18486 -24184
15235b4184n55Q620K7862o922l7805o776L9894K1275j6090J7289J3700o375J3058
$$ -24184 -24739 -16119 11743 4821 -32984 -39760 134 21409 5319 22608 36308 29933 42991
15222D2991q045l0277O924J6132k4692l5839L6260K0690j5579p385l5357l7326
$$ 42991 34946 4669 11593 27725 3033 -32806 3454 24144 8565 1180 -34177 -71503
15210g1503M3157r84j6300J3957K2899J2194k5384j0610J4670R924n992m903j3312
$$ -71503 -28346 -29330 -45630 -31673 -8774 3420 -21964 -32574 -17904 -7980 -13972 -18875 -32187
15197c2187K500J9322j4005K5673O33j0474J963L813j3509j5021o542k2175R855
$$ -32187 -29687 -10365 -24370 1303 1936 -8538 -6575 -2762 -16271 -31292 -37834 -60009 -50154
15184e0154O060K1587J3278K5595J484o070J6728k0404j5429j6276j1707q246
$$ -50154 -44094 -22507 -9229 16366 17850 11780 28508 8104 -7325 -23601 -35308 -43554
15172d3554L5044K6312J8709j8665m363o281K026L978j0460k8615Q80N412k061
$$ -43554 -8510 17802 36511 17846 13483 7202 9228 13206 2746 -25869 -24989 -19577 -21638
15159b1638J0050J3619k3132l720j4677k489K1591J1741L4968m710q523l763k7903
$$ -21638 -11588 2031 -21101 -24821 -39498 -41987 -20396 -8655 26313 21603 13080 9317 -18586
15146a8586j3299k11P749l876n56L0955M832j9112l3410J6100J7372J510m7399
$$ -18586 -31885 -32096 -24347 -28223 -28779 2176 7008 -12104 -45514 -29414 -12042 -10532 -57931
15133e7931J4539N9075J7892j2319j9723j8091j5230K2134L211K577o458j6686
$$ -57931 -43392 15683 33575 21256 1533 -16558 -31788 -9654 -6443 -3866 -10324 -27010
15121b7010k5909M0067J8901m32l4618K8421J6257k7033K235L341J404q108Q42
$$ -27010 -52919 -12852 6049 5617 -29001 -580 15677 -11356 -9121 -5780 -4376 -12484 -11642
15108a1642m329R895n441l4257j569K7602l913j7297k708J1454J5156J7887m2233
$$ -11642 -15971 -6076 -11517 -45774 -47343 -19741 -23654 -40951 -43659 -32205 -17049 838 -41395
15095d1395k9478J3859N8882M2872J2584m427k2553R67L691k1357j13k465k150
$$ -41395 -70873 -57014 1868 44740 57324 52897 30344 31311 35002 13645 13532 11067 8917
15082H917k3111l8589K6117M2139J9072O070o614k6692m3442m274K6608N026m804
$$ 8917 -14194 -52783 -26666 15473 34545 40615 34001 7309 -36133 -40407 -13799 -8773 -13577
15069a3577j2361j0216J7659J4235P720j559J8204K804l0594p455J0528k89j9747
$$ -13577 -25938 -36154 -18495 -4260 3460 1901 20105 22909 -7685 -15140 -4612 -4901 -24648
15056b4648k663K4303k741r987J0868J2174R123k8588k9158J4551k866J490j0234
$$ -24648 -27311 -3008 -5749 -15736 -4868 7306 16429 -12159 -41317 -26766 -29632 -28142 -38376
15043c8376j2704J7991K6272p070R235P48N050K723r508J330j4638k039m781M2922
$$ -38376 -51080 -33089 -6817 -13887 -4652 -3904 1146 3869 -5639 -4309 -18947 -20986 -25767 17155
15029A7155P408q116o554P930J4675L0278L842k0628o548j2706n2465j2623J4418
$$ 17155 24563 16447 9893 17823 32498 62776 66618 45990 39442 26736 -25729 -38352 -23934
15016b3934J768j0968k877K5237J0148j0159J6672L893j6527l317O712N142k1563
$$ -23934 -22166 -33134 -36011 -10774 -626 -10785 5887 9780 -6747 -10064 -3352 1790 -19773
15003a9773L488J3542P720p406k5927m424R980O867k468N517K7109j5672j3954
$$ -19773 -16285 -2743 4977 -2429 -28356 -32780 -22800 -15933 -18401 -12884 14225 -1447 -15401
14990a5401K1421N756J3755l5350j1277Q110J8197j4559k3193j0085L0486M91
$$ -15401 6020 11776 25531 -9819 -21096 -12986 5211 -9348 -32541 -42626 -12140 -11649
14978a1649j2922j2530j0955l067J6591O1536K7162m364l4665k2093J4878q609
$$ -11649 -24571 -37101 -48056 -51123 -34532 27004 54166 49802 15137 -6956 7922 -687
14966f87j4501K157Q778j2419j2606j3203J362K4835L1124L90J1152m788j4822
$$ -687 -15188 -13031 -4253 -16672 -29278 -42481 -41119 -16284 14840 15230 26382 21594 6772
14953F772j7900L9130Q065k8633k5626J094J5040n034r77k4648N021m169l9958
$$ 6772 -11128 28002 36067 7434 -18192 -17098 -2058 -7092 -8069 -32717 -27696 -31865 -71823
14940g1823P007J4791K5125K7508J096K3794L1267k1492m8244j5155j4143K364
$$ -71823 -64816 -50025 -24900 2608 3704 27498 58765 37273 -10971 -26126 -40269 -37905
14928c7905K2277K2066l506k669N417j5133p315j4786J8816J4020j9684N280K7501
$$ -37905 -15628 6438 2932 263 5680 -9453 -16768 -31554 -12738 1282 -18402 -13122 14379
14915A4379J9340l915j3780j2395l4404Q621J5234J1241j1445j9584K6612J6504
$$ 14379 33719 29804 16024 3629 -30775 -22154 -6920 4321 -7124 -26708 -96 16408
14903A6408q59J981R115l523Q783j9195Q422R044o2458k5628K6356O033j7808
$$ 16408 15549 17530 26645 23122 31905 12710 21132 30176 -32282 -57910 -31554 -25521 -43329
14890d3329N60J5817J0718L431o48j890K096r865j0831K36j1723J4332K069J0154
$$ -43329 -42769 -26952 -16234 -12803 -13451 -15341 -13245 -23110 -33941 -33705 -45428 -31096 -29027 -18873
14876a8873j4314n882J4570O44M278J960K2913M580J0408j7857l1296L0565J9594
$$ -18873 -33187 -39069 -24499 -23855 -19577 -17617 5296 9876 20284 2427 -28869 1696 21290
14863B1290K0156j5427k1135l8751K4987p118P25K5491L2195J0478J111J2121
$$ 21290 41446 26019 4884 -33867 -8880 -15998 -15273 10218 42413 52891 54002 66123
14851F6123J6563k9281k5324L894m5909p256J111K6658K2086K837l9497j9591
$$ 66123 82686 53405 28081 31975 -13934 -21190 -20079 6579 28665 31502 -7995 -27586
14839b7586k4016k1940K6745J8050L8473J6843k7319k2029j0455k1939p821r71
$$ -27586 -51602 -73542 -46797 -28747 9726 26569 -750 -22779 -33234 -55173 -62994 -63965
14827f3965K9918L764j6367K111J0931J2745N112l454j3577M708j729j209l665
$$ -63965 -34047 -30283 -46650 -44539 -33608 -20863 -15751 -19205 -32782 -28074 -29803 -31012 -34677
14814c4677R442P548q195P358j5792J4203M4233L745p133K6993l9989l41o688
$$ -34677 -25235 -17687 -25882 -18524 -34316 -20113 24120 27865 20732 47725 7736 7395 707
14801G07J5557l944k204M302j9973j4336o80r139j133k622j0864M6535J2709p714
$$ 707 16264 12320 10116 14418 -5555 -19891 -20571 -29710 -30843 -33465 -44329 2206 14915 7201
14787G201K3998J830j9872k0561k5683q121J8766K0976k7358p571J3204P23J3906
$$ 7201 31199 33029 13157 -7404 -33087 -41208 -22442 -1466 -28824 -36395 -23191 -22468 -8562
14774h562L9675J0505k5192k7566J3753M3771K470k2045j1242j2754L244J6415
$$ -8562 31113 41618 16426 -11140 2613 46384 48854 26809 15567 2813 6057 22472
14762B2472j9882k0764k066K3876m245K6325P720k209j2243j4022L888J0555O160
$$ 22472 2590 -18174 -20240 3636 -609 25716 33436 31227 18984 4962 8850 19405 25565
14749B5565m313l9188n541m298j2487J8302K1032J5673M394j8295j0996K802J4299
$$ 25565 21252 -17936 -23477 -27775 -40262 -21960 -928 14745 19139 844 -10152 -7350 6949
14736F949P614j3541K2788k947j8118j9632K0285m660j1079L1023j0558J0081
$$ 6949 14563 1022 23810 20863 2745 -16887 3398 -1262 -12341 18682 8124 18205
14724A8205k454P700o229k6290J1330q413j2855K7843m369l2908J481L757K8450
$$ 18205 15751 23451 17222 -9068 2262 -6151 -19006 8837 4468 -28440 -26959 -23202 5248
14711E248K389k0576J8994J1519j657l63k1059j5497j1763P321J5945O672n207
$$ 5248 7637 -12939 6055 17574 15917 15554 -5505 -21002 -32765 -25444 -9499 -2827 -8034
14698h034J5027M0409N785k1002J4084J8603k4768l8252k7667J1797J0019P255
$$ -8034 6993 47402 53187 32185 46269 64872 40104 1852 -25815 -14018 -3999 3256
14686C256l7490J7585J6607J1019J0580K9282j8304K92k2826J743j2686M045j782
$$ 3256 -34234 -16649 -42 10977 21557 50839 32535 32827 10001 11744 -942 3103 1321
14673A321j7525j199J861J7442J700N47k165p170k2226J2905J8607k6157l2970
$$ 1321 -16204 -17403 -15542 1900 3600 4147 1982 -5188 -27414 -14509 4098 -22059 -55029
14660e5029R721J3802J7737J2654n629N766J9859j9867l7808Q699K9655J1063
$$ -55029 -45308 -31506 -13769 -1115 -6744 -978 18881 -986 -38794 -30095 -440 10623
14648A0623j7928j6441O397J440j7710j1141J2297J0900N927J0884K433J821r438
$$ 10623 -7305 -23746 -17349 -15909 -33619 -44760 -32463 -21563 -15636 -4752 -2319 -498 -9936
14635i936j5231n592M523J3080r758P690J7109J5405o579r821j1153j4879O351
$$ -9936 -25167 -30759 -26236 -13156 -22914 -15224 1885 17290 10711 890 -10263 -25142 -18791
14622a8791J9781J2167J1808q477q915k8601k3605L463L3353R622K9526j7285
$$ -18791 990 13157 24965 16488 7573 -21028 -44633 -41170 -7817 1805 31331 14046
14610A4046J2931L2154k2850n4351n5J4811L4455j1818j9823l660k425p247L399
$$ 14046 26977 59131 36281 -18070 -18125 -3314 31141 19323 -500 -4160 -6585 -13832 -10433
14597a0433J3166J2619j0039o603l492l6044j236J8299k3656p88J3942l99K4182
$$ -10433 2733 15352 5313 -1290 -4782 -40826 -42062 -23763 -47419 -48207 -34265 -34664 -10482
14584a0482q109r723k586L383J0527k4312j1036L8409K845k2442j2670K9178K2059
$$ -10482 -18591 -28314 -30900 -27517 -16990 -41302 -52338 -13929 -11084 -33526 -46196 -17018 5041
14571E041J9003j1192j5511j0071j3706r671N664o067J2820K5540l578N393m71
$$ 5041 24044 12852 -2659 -12730 -26436 -36107 -30443 -36510 -23690 1850 -1728 3665 3194
14558C194J6940L2076O332l2977k0206J1184n568k2975l123j146K0567j8924N722
$$ 3194 20134 52210 58542 25565 5359 16543 10975 -12000 -15123 -16269 4298 -14626 -8904
14545h904P416N232j7640k2671j1137j6772O262J7035J6946K0707Q84J3690M014
$$ -8904 -1488 3744 -13896 -36567 -47704 -64476 -58214 -41179 -24233 -3526 -2642 11048 15062
14532A5062k697k3178k8005Q489m288R705m291J531j8194J1695J0633J3234l210
$$ 15062 12365 -10813 -38818 -30329 -34617 -24912 -29203 -27672 -45866 -34171 -23538 -10304 -13514
14519a3514L304j9754j4453p362R703K1880j0525L1990L744l3407J4584L2860
$$ -13514 -10210 -29964 -44417 -51779 -42076 -20196 -30721 1269 5013 -28394 -13810 19050
14507A9050J1767j6306P989J3290j8219o799N365Q97j4698j2153k353M542r067
$$ 19050 30817 14511 22500 35790 17571 10772 16137 17034 2336 -9817 -12170 -7628 -16695
14494a6695l225K3420j2797Q037M961k3322L320L0537N899l3290j2840j990k4689
$$ -16695 -19920 3500 -9297 -1260 3701 -19621 -16301 14236 20135 -13155 -25995 -27985 -52674
14481e2674j9705K2068K3048R107r172j4690j1572J3957k541J8591J6169j3664
$$ -52674 -72379 -50311 -27263 -18156 -27328 -42018 -53590 -39633 -42174 -23583 -7414 -21078
14469b1078n224k5482J7967K4790l881j6528M556R759J9592L0954j7959j8801
$$ -21078 -26302 -51784 -33817 -9027 -12908 -29436 -24880 -15121 4471 35425 17466 -1335
14457a335j6155k2299j9635K9947K5147r752m176k995J0882R916J1062l1108n2915
$$ -1335 -17490 -39789 -59424 -29477 -4330 -14082 -18258 -21253 -10371 -455 10607 -20501 -73416
14444g3416m129K6716M360L088O047l908J3608J3632J0979J6783j2847j8160N124
$$ -73416 -77545 -50829 -46469 -43381 -37334 -41242 -27634 -14002 -3023 13760 913 -17247 -12123
14431a2123o29L473j3967R706L3727J6074m4003j9362K6249Q957J4069J391k2973
$$ -12123 -12752 -9279 -23246 -13540 20187 36261 -7742 -27104 -855 8102 22171 23562 589
14418E89K422j1319k6223P599J657Q569n038j6859K2263j446j2564K522N923L6851
$$ 589 3011 -8308 -34531 -26932 -25275 -16706 -21744 -38603 -16340 -17786 -30350 -27828 -21905 14946
14404A4946L8296k7561m5317J8916K52m6416n0074q738N9264J5256P119Q668M460
$$ 14946 53242 25681 -19636 -720 -468 -46884 -96958 -105696 -46432 -31176 -24057 -15389 -10929
14391a0929K1649J7325k7952k130K33R445M3311J6058j9590k8815j8109L701k064
$$ -10929 10720 28045 93 -2037 -1804 7641 50952 67010 47420 18605 496 4197 2133
14378B133m536j8634k0389L1333M6526K5845j3501m3841m8325J3541J3618K4895
$$ 2133 -2403 -21037 -41426 -10093 36433 62278 48777 4936 -43389 -29848 -16230 8665
14366H665J3890J423l5526q72j0788n482j4191M024L4355J7557k8115k8583J1567
$$ 8665 22555 23978 -11548 -12420 -23208 -28690 -42881 -38857 -4502 13055 -15060 -43643 -32076
14353c2076P40n680J8317K497R889J3805j828J2642j5846O359O350L49j1841O984
$$ -32076 -31336 -37016 -18699 -16202 -6313 7492 5664 18306 2460 8819 15169 15518 3677 10661
14339A0661M090R681j746k923K6768r20l1823M280M16k0490o931J0780j2342j4930
$$ 10661 14751 24432 22686 19763 46531 45611 13788 18068 18484 -2006 -8937 1843 -10499 -25429
14325b5429J2072Q192K102L108j4618L165J3496k334l3775k3420J5810K4780J826
$$ -25429 -13357 -5165 -3063 45 -14573 -11408 2088 -246 -34021 -57441 -41631 -16851 -15025
14312a5025J6782k5313l527K2824O544L892r52J572k2444j7318K9775L6092J3750
$$ -15025 1757 -23556 -27083 -4259 2285 6177 5225 6797 -15647 -32965 -3190 32902 46652
14299D6652K573P092l1302k6683j8495r410N506k701J5614J5124J4693J6555J3418
$$ 46652 49225 56317 25015 -1668 -20163 -29573 -24067 -26768 -11154 3970 18663 35218 48636
14286D8636k5144L269j1317j0827k611R459j8040K406P332p400j278l3999p460
$$ 48636 23492 26761 15444 4617 2006 11465 -6575 -4169 3163 -4237 -5515 -39514 -46974
14273d6974K9918K480j0726J6674k196K8879q156K8886R603k3651k5337j9116
$$ -46974 -17056 -14576 -25302 -8628 -10824 18055 9899 38785 48388 24737 -600 -19716
14261a9716k0698l2811m24j6837p268J5807L7036M7802J8041j9552j3831P002
$$ -19716 -40414 -73225 -73649 -90486 -97754 -81947 -44911 2891 20932 1380 -12451 -5449
14249e449J3001j4210l4023k1794M259L9012L4650o797k790r599M840J891j3056
$$ -5449 7552 -6658 -40681 -62475 -58216 -19204 15446 8649 5859 -3740 1100 2991 -10065
14236a0065R648q917l252p092J6043q200N976J5348p942j2999J5850l582K3043
$$ -10065 -417 -9334 -12586 -19678 -3635 -11835 -5859 9489 1547 -11452 4398 816 23859
14223B3859Q582k7065J453l687O822K8455j5366k3222K1054k3743l137j3644K7074
$$ 23859 32441 5376 6829 3142 9964 38419 23053 -169 20885 -2858 -5995 -19639 7435
14210G435l22k3573J6942K9656L6601j0006M01j7608J4077M855o921k8082j869
$$ 7435 7113 -16460 482 30138 66739 56733 57134 39526 53603 58458 51537 23455 21586
14197B1586k012k5113j426K4397j2758k1777N245j7747k989m631j0746J997J3604
$$ 21586 19574 -5539 -6965 17432 4674 -17103 -11858 -29605 -32594 -37225 -47971 -45974 -32370
14184c2370J485J7465N390j549J5184M830J5420J7810l6993m367n434K0953j2220
$$ -32370 -30885 -13420 -8030 -9579 5605 10435 25855 43665 6672 2305 -3129 17824 5604
14171E604m730M484j1531m154k061k7253k0401P77J6136o040J3310K3043L1929
$$ 5604 874 5358 -6173 -10327 -12388 -39641 -60042 -59265 -43129 -49169 -35859 -12816 19113
14158A9113j8733k4664j4728j3222L7032J9712J3355L295J941p500m4995p982
$$ 19113 380 -24284 -39012 -52234 -15202 4510 17865 21160 23101 15601 -29394 -37376
14146c7376K5185M2101l585j6848k4332J0476R431j5835k774K1740j6366n274
$$ -37376 -12191 29910 26325 9477 -14855 -4379 5052 -10783 -13557 8183 -8183 -13457
14134a3457J2977L772k2785k77J1524J735K4k864J0475J5193j6141R5q983J2477
$$ -13457 -480 3292 -19493 -19770 -8246 -6511 -6487 -9351 1124 16317 176 271 -8712 3765
14120C765M234k5728K2765n141m5027k2574J0709r883K5606K1866j7130k3752
$$ 3765 7999 -17729 5036 -105 -45132 -67706 -56997 -66880 -41274 -19408 -36538 -60290
14108f0290K4280J0865j078O642j4763j4622J1769J4157K3239m176J095J0793
$$ -60290 -36010 -25145 -26223 -19581 -34344 -48966 -37197 -23040 199 -3977 -2882 7911
14096G911Q777k3311j0208O809J9589o646j9068k3530k5278O040J2189O934K6562
$$ 7911 16688 -6623 -16831 -10022 9567 2921 -16147 -39677 -64955 -58915 -46726 -39792 -13230
14083a3230m60k2886k1596K0118L0319k645M732k1474K3574J4555k2876n954K020
$$ -13230 -13690 -36576 -58172 -38054 -7735 -10380 -5648 -27122 -3548 11007 -11869 -17823 -15803
14070a5803j7164L589J0933J3691k00k1337k1346M229J1918L1151J6854j4864
$$ -15803 -32967 -29378 -18445 -4754 -4954 -26291 -47637 -43408 -31490 -339 16515 1651
14058A651J4661l537l7476K092J1279J0545k390k9453k4614o445K6738K8184j4785
$$ 1651 16312 12775 -24701 -22609 -11330 -785 -3175 -32628 -57242 -63687 -36949 -8765 -23550
14045b3550J4606J543K860K2581O627J284J0746o018M926K97K750l748N778k019
$$ -23550 -8944 -7401 -4541 18040 24667 25951 36697 30679 35605 35902 38652 34904 40682 38663
14031C8663j612j6939k5048l617O539o58j1428q516J602J8555J8937j9142m2631
$$ 38663 37051 20112 -4936 -8553 -2014 -2672 -14100 -22616 -21014 -2459 16478 -2664 -45295
14018d5295k719L2206Q115j2022k9407O503P109L494J9902j0117Q556J3230l1918
$$ -45295 -48014 -15808 -7693 -19715 -49122 -42619 -35510 -32016 -12114 -22231 -13675 -445 -32363
14005c2363J7271J0081n047j0119K5586P126o75j7775K5080k236l3766k733L092
$$ -32363 -15092 -5011 -10058 -20177 5409 12535 11860 -5915 19165 16929 -16837 -19570 -16478
13992a6478p159K1460J2797M289M0602J376k4229j3681j8728j8896j4065J0479
$$ -16478 -23637 -2177 10620 14909 55511 56887 32658 18977 249 -18647 -32712 -22233
13980b2233J0214J0049m109J1267q37p836j0439p580o984r378J6436J083p114
$$ -22233 -12019 -1970 -6079 5188 4351 -3485 -13924 -21504 -28488 -37866 -21430 -20347 -27461
13967b7461r864J962N095K4582L4140q760k1732k740o122j5504j710K1511k813
$$ -27461 -37325 -35363 -30268 -5686 28454 19694 -2038 -4778 -10900 -26404 -28114 -6603 -9416
13954i416j9464m938J8235J1490k0166m226J9884j4819P269o31J5685N441M193
$$ -9416 -28880 -33818 -15583 -4093 -24259 -28485 -8601 -23420 -16151 -16782 -1097 4344 8537
13941H537l0456r357l4830n699M4059L3532O833j7984O36M006M06P414k693j2520
$$ 8537 -21919 -31276 -66106 -71805 -27746 5786 12619 -5365 -4729 -723 -317 7097 4404 -8116
13927h116K3107J1025j9082m3074L251J5519j9800J7472K0753M003K022O980J7746
$$ -8116 14991 26016 6934 -36140 -32889 -17370 -37170 -19698 1055 5058 7080 14060 31806
13914C1806j9526j3785j933R423J876l7608R892Q248K946j1892m2995j3965M3085
$$ 31806 12280 -1505 -3438 5985 7861 -29747 -19855 -11607 -8661 -20553 -63548 -77513 -34428
13901c4428L7958K0940J4360J1891j7076j1240k3584k1729k7312J8369K3404K6506
$$ -34428 3530 24470 38830 50721 33645 22405 -1179 -22908 -50220 -31851 -8447 18059
13889A8059n356J2744P001r67k7604j5410k1695j6635J5256n068M098J7641K296
$$ 18059 12703 25447 32448 31481 3877 -11533 -33228 -49863 -34607 -39675 -35577 -17936 -15640
13876a5640L5783K4274r191l7434k5760K7159J0133J999J2653J185j9158j0888
$$ -15640 20143 44417 35226 -2208 -27968 -809 9324 11323 23976 25161 6003 -4885
13864d885P033N969n854l956P929j7607j1522k1463j3182Q885K139P009L5853
$$ -4885 2148 8117 2263 -1693 6236 -11371 -22893 -44356 -57538 -48653 -46514 -39505 -3652
13851c652K5712J235o661J5984k128l4414m1860O757J5284J7656j3654j8330K3818
$$ -3652 22060 23295 16634 32618 30490 -3924 -45784 -39027 -23743 -6087 -19741 -38071 -14253
13838a4253K6779j248n796j3844j4494j4901n012K1303J7145O107j2164j8417
$$ -14253 12526 11278 5482 -8362 -22856 -37757 -42769 -21466 -4321 1786 -10378 -28795
13826b8795P496M4574J1634Q253j2544j9610j2354J0516n921m500N793r07r695
$$ -28795 -21299 23275 34909 43162 30618 11008 -1346 9170 3249 -1251 4542 3635 -6060
13813f060O980j3745p343K923J9794J7183k4204p426p757j9882J8031J4654J0779
$$ -6060 920 -12825 -20168 -17245 2549 19732 -4472 -11898 -19655 -39537 -21506 -6852 3927
13800C927j927j0252q262j9331k4892P924K4281J4199m307O531J8385N503J8456
$$ 3927 2000 -8252 -16514 -35845 -60737 -52813 -28532 -14333 -18640 -12109 6276 11779 30235
13787C0235l929j3014k2588K181m685l151j3555l570r506k6498J0439N0458L3495
$$ 30235 26306 13292 -9296 -7115 -11800 -14951 -28506 -32076 -41582 -68080 -57641 -7183 26312
13774B6312o497r02K2953P916j4601l1880n5402n872L6206J5914n166R355q334
$$ 26312 19815 18913 41866 49782 35181 3301 -52101 -57973 -21767 -5853 -11019 -1664 -9998
13761i998K5123o171J4247J5049k1967k0217l979L2069j872k2528q85J0198J0831
$$ -9998 15125 8954 23201 38250 16283 -3934 -7913 24156 22284 -244 -1129 9069 19900
13748A9900K2054j6950k9926l5952K0168K1296j071k1859J8791K4786R336j0614
$$ 19900 41954 25004 -4922 -40874 -20706 590 -481 -22340 -3549 21237 30573 19959
13736A9959k135q288k1148J9918K2103n165q706L583K2510m167k5831M190J1225
$$ 19959 17824 9536 -11612 8306 30409 25244 16538 20121 42631 38464 12633 16823 28048
13723B8048k392j3735j3916J0747K5253j6103n843K1914J7376j3784k3020J1697
$$ 28048 25656 11921 -1995 8752 34005 17902 12059 33973 51349 37565 14545 26242
13711B6242k6110m2363k0136L3689M0324R42j6006j3660Q468K849N625N108n425
$$ 26242 132 -42231 -62367 -28678 11646 12588 -3418 -17078 -8610 -5761 -136 4972 -453
13698d53r425J2227M714N825O080o302j0226j7746j3791j2817J8616K7854n7l290
$$ -453 -9878 2349 7063 12888 18968 12666 2440 -15306 -29097 -41914 -23298 4556 4499 1209
13684A209k820K37k707q847j0488J4690P890P76j5727j5278O429q228K5625J0691
$$ 1209 -1611 -1374 -4081 -12928 -23416 -8726 -836 -60 -15787 -31065 -24636 -32864 -7239 3452
13670C452j7420L74Q857k2351J7060P160j2170k4467K5451K3404K210J11p294
$$ 3452 -13968 -13594 -4737 -27088 -10028 -2868 -15038 -39505 -14054 9350 11560 11671 4377
13657D377k0371l896L1816j3871N72r714k2828J6602K0119J6157o334n1939j7670
$$ 4377 -15994 -19890 11926 -1945 -1373 -11087 -33915 -17313 2806 18963 12629 -39310 -56980
13644e6980K341J5712O682n372L1979Q969J0142K7434j934k7725k7677j2103J0063
$$ -56980 -54639 -38927 -32245 -37617 -5638 3331 13473 40907 38973 11248 -16429 -28532 -18469
13631a8469P546L63M4234R155p623j6427K0299m679k4179m1419M802K1744J1797
$$ -18469 -10923 -10560 33674 42829 35206 18779 39078 34399 10220 -31199 -26397 -4653 7144
13618G144K0775j9439n1259n868J6761J3832K8944j1439l0487j6207k0224L172
$$ 7144 27919 8480 -42779 -48647 -31886 -18054 10890 -549 -31036 -47243 -67467 -64295
13606f4295J1046M6413p025m423R686L4373K0416k2240j652J3619r723r415p554
$$ -64295 -53249 -6836 -13861 -18284 -8598 25775 46191 23951 22299 35918 26195 16780 9226
13593I226j4884P013M760J45m478N940o920J6156R634J47m0518k1540j2661j0467
$$ 9226 -5658 1355 6115 6260 1782 7722 802 16958 26592 26739 -13779 -35319 -47980 -58447
13579e8447K5369L915j4811P332J8412J1819q002m155k899o792m483k3353k671
$$ -58447 -33078 -29163 -43974 -36642 -18230 -6411 -14413 -18568 -21467 -28259 -32742 -56095 -58766
13566e8766J6500K6057O67Q77r20J6536j3622J2221J0206K6286o263m093R403
$$ -58766 -42266 -16209 -15542 -14665 -15585 951 -12671 -450 9756 36042 29779 25686 35089
13553C5089M259l7490l5296l940o096k138K4111j0875K6140k4239k9798J6178
$$ 35089 39348 1858 -33438 -37378 -43474 -45612 -21501 -32376 -6236 -30475 -60273 -44095
13541d4095J7120O235k04J7985j8249J0684j216M373J359p615j1275r125J9974
$$ -44095 -26975 -20740 -20944 -2959 -21208 -10524 -11740 -7367 -6008 -13623 -24898 -34023 -14049
13528a4049J0052R332K27k941J6974K1984o350R955l8310m0597l085M3827j4727
$$ -14049 -3997 5335 5562 2621 19595 41579 35229 45184 6874 -33723 -36808 7019 -7708
13515g708n520o819J1575j0655M073L2350o044l568J4673J8259R089O165r68l162
$$ -7708 -13228 -20047 -8472 -19127 -15054 17296 11252 7684 22357 40616 49705 55870 54902 51740
13501E1740M347q619J529j9657k4155k1737j7508l0691K4541K6038J774P472m143
$$ 51740 56087 47468 48997 29340 5185 -16552 -34060 -64751 -40210 -14172 -12398 -4926 -9069
13488i069Q340k075j7715k5905k6690j6127J5362J9705M2116L9874k754k0422
$$ -9069 -729 -2804 -20519 -46424 -73114 -89241 -73879 -54174 -12058 27816 25062 4640
13476D640k2412J9919M742o926o591J2500k5655j1605J0332J347J6027Q29j7240
$$ 4640 -17772 2147 6889 -37 -6628 5872 -19783 -31388 -21056 -19709 -3682 -2853 -20093
13463b0093K255j2824o374J314O534q25K938J6845K4278k257K680P734K2407J3181
$$ -20093 -17838 -30662 -37036 -35722 -29188 -30013 -27075 -10230 14048 11791 14471 22205 44612 57793
13449E7793j4200l1370j3781m86k4278j6716J0468L6050Q572J8768R907n240q145
$$ 57793 43593 12223 -1558 -2044 -26322 -43038 -32570 3480 12052 30820 40727 35487 27342
13436B7342o450k0029k1020j4854m5004j8945L2541M7229M6474J2192L713l940
$$ 27342 20892 863 -20157 -35011 -80015 -98960 -66419 -19190 27284 39476 43189 39249
13424C9249m2115k1520m22J6516k5282P713N626n797O139j05p334R984N265K4187
$$ 39249 -2866 -24386 -24808 -8292 -33574 -25861 -20235 -26032 -19893 -19998 -27332 -17348 -12083 12104
13410A2104k865k8620j6333K766o589j2822O090q602L523K3583N332n468J0163
$$ 12104 9239 -19381 -35714 -32948 -39537 -52359 -46269 -54871 -51348 -27765 -22433 -27901 -17738
13397a7738M711j836J323j1108R938j643l914j7745P610j0159m948J0569K2467
$$ -17738 -13027 -14863 -13540 -24648 -14710 -16353 -20267 -38012 -30402 -40561 -45509 -34940 -12473
13384a2473m864J9794J557K5124J3603K2622j4911k6891j5710J8617j1298l35
$$ -12473 -17337 2457 4014 29138 42741 65363 50452 23561 7851 26468 15170 14835
13372A4835l80R259o261k1042j876J2810R731J2661m384k1527l9722K1658J614
$$ 14835 14455 23714 17453 -3589 -5465 7345 17076 29737 25353 3826 -35896 -14238 -12624
13359a2624J2509L8761K2807M631K9100k6857k4564K0497J5394J547J1967k5581
$$ -12624 -115 38646 61453 66084 95184 68327 43763 64260 79654 81201 93168 67587
13347F7587k8868J253m037k462L461k5489k2200r842j5080J8605J6457j832j145
$$ 67587 38719 39972 35935 33473 36934 11445 -10755 -20597 -35677 -17072 -615 -2447 -3592
13334c592r87N994j4023j5276r464j1100J0697Q523K2355K625k0261L929L5772
$$ -3592 -4579 1415 -12608 -27884 -37348 -48448 -37751 -29228 -6873 -4248 -24509 -20580 15192
13321A5192K031j6143J9092j599R227j1818k5711J5881L3196j342j7246o795j5158
$$ 15192 17223 1080 20172 18573 27800 15982 -9729 6152 39348 38006 20760 13965 -1193
13308a193j3603j4761o161P109l118P231J1682K560j5203J3434o669R738J8017
$$ -1193 -14796 -29557 -35718 -28609 -31727 -24496 -12814 -10254 -25457 -12023 -18692 -8954 9063
13295I063N147k3049p719j9725M512K0177Q986J1545k4082M84j0854q311l012
$$ 9063 14210 -8839 -16558 -36283 -31771 -11594 -2608 8937 -15145 -14661 -25515 -33826 -36838
13282c6838K5212K8771p900q690j1331q754J4396O690p756M610J0473j5281J82
$$ -36838 -11626 17145 9245 555 -10776 -19530 -5134 1556 -6200 -1590 8883 -6398 -6216
13269f216J8320k531k1011J4106J9920K137m6287q807J6943K7146r925n695L050
$$ -6216 12104 9573 -11438 2668 22588 24725 -21562 -30369 -13426 13720 3795 -1900 1150
13256A150l4430j6931J7249L3965K2049j8388k487K3190j7433n0116o779K398
$$ 1150 -33280 -50211 -32962 1003 23052 4664 2177 25367 7934 -42182 -48961 -46563
13244d6563L0773K3667j1670j2469k0067J3696k5245J2141J9074q468R958L1587
$$ -46563 -15790 7877 -3793 -16262 -36329 -22633 -47878 -35737 -16663 -25131 -15173 16414
13232A6414O472p843j6092k0662L8930k376j8304k2626M3616J652n6144k3909
$$ 16414 22886 15043 -1049 -21711 17219 14843 -3461 -26087 17529 19181 -36963 -60872
13220f0872L3871P459K0160J346j2170L0119o045j4137l997J3242r74k6888K1805
$$ -60872 -27001 -19542 618 1964 -10206 19913 13868 -269 -4266 8976 8002 -18886 2919
13207B919O32J0668N513j6019p535j6232O266K5685J6369j0537p936L200j7754
$$ 2919 3551 14219 19732 3713 -3822 -20054 -13788 11897 28266 17729 9793 12993 -4761
13194d761k9284j271J4951J3200j0620J3617J7792O704j9350j4084J0160j4332
$$ -4761 -34045 -35316 -20365 -7165 -17785 -4168 13624 20328 978 -13106 -2946 -17278
13182a7278n387L3602j1447M16L367L468P270O492k5133j3993L247J3648j833
$$ -17278 -22665 10937 -510 -94 3273 6741 14011 20503 -4630 -18623 -15376 -1728 -3561
13169c561j5095k0857o412L5248K1955m755n111O233p417M234O729J8404k5450
$$ -3561 -18656 -39513 -45925 -10677 11278 6523 1412 7645 228 4462 11191 29595 4145
13156D145j7550K0720K4863j3647P426L931k1072n1053k4553L0789K6265q61m339
$$ 4145 -13405 7315 32178 18531 25957 29888 8816 -42237 -66790 -36001 -9736 -10597 -14936
13143a4936k713J4155K4521K989l634p371L823j5088J0379M093J018j4430r953
$$ -14936 -17649 -3494 21027 24016 20382 13011 16834 1746 12125 16218 17236 2806 -7147
13130g147J4963K2742k149k3015j1751J0153J1949k2871m446K1097J2771j6558
$$ -7147 7816 30558 28409 5394 -6357 3796 15745 -7126 -11572 9525 22296 5738
13118E738j1429J6948j4035J2883K9970q610n2000k2094J2530K4182k29J136k84
$$ 5738 -5691 11257 -2778 10105 40075 31465 -20535 -42629 -30099 -5917 -6146 -5010 -5294
13105e294J4035k3072m060j5474J2719J9244J1610k729j8651j9156J2154J121
$$ -5294 8741 -14331 -18391 -33865 -21146 -1902 9708 6979 -11672 -30828 -18674 -17553
13093a7553p631J1945K17l081N241L76J3223M849l300L100J3171o741J871J460
$$ -17553 -25184 -13239 -13022 -16103 -10862 -10486 2737 7586 4286 7386 20557 13816 15687 17147
13079A7147R764j5053r735r592J5983L006k7546j3924J5140l623J7218O816p530
$$ 17147 26911 11858 2123 -7469 8514 11520 -16026 -29950 -14810 -18433 -1215 5601 -1929
13066a929J0309k2093R589K9456N435Q59k7067l429K335J2471P221J0214j46m3729
$$ -1929 8380 -13713 -4124 25332 30767 31626 4559 1130 3465 15936 23157 33371 33225 -10504
13052a0504k7561j311M243J6184J0112l643k3693M154o748K1085R409j0748Q180
$$ -10504 -38065 -39376 -35133 -18949 -8837 -12480 -36173 -32019 -38767 -17682 -8273 -19021 -10841
13039a0841K1450J079K562j9132p060K4812j2790j4274k804n128J0850J3231k954
$$ -10841 10609 11688 14250 -4882 -11942 12870 80 -14194 -16998 -22126 -11276 1955 -999
13026i99O137k0080j912K5568j5050m0664K9821l862k005k207n616O461j3814
$$ -999 5138 -14942 -16854 8714 -6336 -47000 -17179 -21041 -23046 -25253 -30869 -24408 -38222
13013c8222K7641K3992k6204j4452J0906J6952j1728r921K3357J533j5564q187
$$ -38222 -10581 13411 -12793 -27245 -16339 613 -11115 -21036 2321 3854 -11710 -19897
13001a9897K305J5737P076K692j2116K925R669p924r430P220M082j1843j180M2233
$$ -19897 -17592 -1855 5221 7913 -4203 -1278 8391 467 -8963 -1743 2339 -9504 -10684 31549
12987C1549q076k6870N603q432K1433J6005r181K891L2184j8160k4107Q134K252
$$ 31549 23473 -3397 2206 -6226 15207 31212 22031 24922 57106 38946 14839 22973 25225
12974B5225Q959n740K46m858r924k7457n901N998P023O723K5467K4154k5280j4089
$$ 25225 34184 28444 28690 23832 13908 -13549 -19450 -13452 -6429 294 25761 49915 24635 10546
12960A0546J6815K1728l048K908j79j7128M835j9929j9843J9798Q672r946j1712
$$ 10546 27361 49089 46041 48949 48770 31642 36477 16548 -3295 16503 25175 15229 3517
12947C517J5522J357m6778M480J7982O474Q581R079R975j3127j400j8406k5750
$$ 3517 19039 20396 -26382 -21902 -3920 2554 11135 20214 30189 17062 15662 -2744 -28494
12934b8494q698J4806M0247L1059p656l5545r484R655N115n382j9400j6495L047
$$ -28494 -37192 -22386 17861 48920 41264 5719 -3765 5890 11005 5623 -13777 -30272 -27225
12921b7225K407K5685J0201M965M52O594J0823j362N702J2649j3111j7448m4873
$$ -27225 -24818 867 11068 16033 16485 23079 33902 32540 38242 50891 37780 20332 -24541
12908b4541j5231K1579L2900J4553M279J5124K0008j0445l3476k1112K0954K982
$$ -24541 -39772 -18193 14707 29260 33539 48663 68671 58226 24750 3638 24592 27574
12896B7574j2530J5981J4157r989j5259L328P804l8206l0696j4480J8594K7449
$$ 27574 15044 31025 45182 35193 19934 23262 31066 -7140 -37836 -52316 -33722 -6273
12884f273K1765J2953N54j9603J8507o841j659l294j3097R460J5007k6698j1558
$$ -6273 15492 28445 28999 9396 27903 21062 19403 16109 3012 12472 27479 781 -10777
12871a0777j0716p519p865j7197K9381r21p508J0695L1416k0722j397J5506L6124
$$ -10777 -21493 -29012 -36877 -54074 -24693 -25614 -33122 -22427 8989 -11733 -13130 2376 38500
12858C8500r225l6322k261k226M613L6701K0416p913j0868M485J2481k7980L729
$$ 38500 29275 -7047 -9308 -11534 -6921 29780 50196 42283 31415 35900 48381 20401 24130
12845B4130K0684m675n552l1390j0613n583j1189K4030j7461l0667J8276K3745
$$ 24130 44814 40139 34587 3197 -7416 -12999 -24188 -158 -17619 -48286 -30010 -6265
12833f265J6615K518j3015n565j6358J3731K0846k0324j7545L1205K4429n461
$$ -6265 10350 12868 -147 -5712 -22070 -8339 12507 -7817 -25362 5843 30272 24811
12821B4811l0126p119P988q419q734K4803n653N301R547j3570L1779j0965k3917
$$ 24811 -5315 -12434 -4446 -12865 -21599 3204 -2449 2852 12399 -1171 30608 19643 -4274
12808d274N580K6039Q475n352j0301o220j3841k9971j8343J4776K5092K1009R73
$$ -4274 1306 27345 35820 30468 20167 13947 106 -29865 -48208 -33432 -8340 12669 13642
12795A3642r791N126N145k3418j9287R991k164p440J9017L819J6504J3003j4648
$$ 13642 3851 8977 14122 -9296 -28583 -18592 -20756 -28196 -9179 -5360 11144 24147 9499
12782I499m954o834L496M544L7759j8157k0239J2260j0596k3070J184L1386j3263
$$ 9499 4545 -2289 1207 5751 43510 25353 5114 17374 6778 -16292 -15108 16278 3015
12769C015l5972O632Q271J9423k9912j3132n472O242L4738J3964J11j6879J3276
$$ 3015 -32957 -26325 -18054 1369 -28543 -41675 -47147 -40905 -6167 7797 7908 -8971 4305
12756D305M6416L749k4106k8104p55k6166o154j138r645K4623J5640k089j4243
$$ 4305 50721 54470 30364 2260 1505 -24661 -30815 -31953 -41598 -16975 -1335 -3424 -17667
12743a7667K4683r564j2576J4081K9229J9462j1483n77j7306Q953r391p412J2166
$$ -17667 7016 -2548 -15124 -1043 28186 47648 36165 35588 18282 27235 17844 10432 22598
12730B2598M571p552l8728o417L0011J1564j0748m832J2134j0730j1047M815J3330
$$ 22598 27169 19617 -19111 -25528 4483 16047 5299 467 12601 1871 -9176 -4361 8969
12717H969r217P556J6212j8732j385r841K1302K8437p303l416k1587j7093m585
$$ 8969 -248 7308 23520 4788 3403 -6438 14864 43301 35998 32582 10995 -6098 -10683
12704a0683J1232m4564O414M5557Q41J2429j194J397J1634L6926J1652j5325M625
$$ -10683 549 -44015 -37601 7956 8797 21226 20032 21429 33063 69989 81641 66316 70941
12691G0941k3277j6416l072J0306J0490o862k9734J0003J6256l5380J2600O908
$$ 70941 47664 31248 28176 38482 48972 42110 12376 22379 38635 3255 15855 22763
12679B2763m324P153J1318j6658j6477o438N238J9859O45j8565j4651J7992J3548
$$ 22763 18439 25592 36910 20252 3775 -2663 2575 22434 23079 4514 -10137 7855 21403
12666B1403J7758r960j1026J3427j0039R437k151k2675K596Q139l4093j2249O052
$$ 21403 39161 29201 18175 31602 21563 31000 28849 6174 8770 16909 -17184 -29433 -23381
12653b3381J2616M2205L0092K3432M025K862O300k9497j2554k2543j7260l3654
$$ -23381 -10765 31440 61532 84964 88989 91851 98151 68654 56100 33557 16297 -17357
12641a7357J577k229M0759J3951r393j987J8455p654j0790j2622k7K3591l275
$$ -17357 -15780 -18009 22750 36701 27308 25321 43776 36122 25332 12710 12683 36274 32999
12628C2999m2402k3861J6359M403P660M378k8909m965J134K2612M93p800J3375
$$ 32999 -9403 -33264 -16905 -12502 -4842 -464 -29373 -34338 -33204 -10592 -10099 -17899 -4524
12615d524M131j9557k1554J6112J9557K6850r541j9833K0990K4890J9660k274
$$ -4524 -393 -19950 -41504 -25392 -5835 21015 11474 -8359 12631 37521 57181 54907
12603E4907j1893j7110k6831k4255J2039R631p573q943j465q114k0228K0602J2842
$$ 54907 43014 25904 -927 -25182 -13143 -3512 -11085 -20028 -21493 -29607 -49835 -29233 -16391
12590a6391J3474M4004n850m4229n980K7127J262K0778K7665M2575J1047k3631
$$ -16391 -2917 41087 35237 -8992 -14972 12155 13417 34195 61860 104435 115482 91851
12578I1851o596p560j3626o0855P264J6675n414j8001l2248N219j0305l432L2815
$$ 91851 85255 77695 64069 3214 10478 27153 21739 3738 -28510 -23291 -33596 -37028 -4213
12565d213L8019k243J3456j1112r188j844J2211K5271K8363l1021l5187L324j1584
$$ -4213 33806 31563 45019 33907 24719 22875 35086 60357 88720 57699 22512 25836 14252
12552A4252J1216J7072q851J1560o163q449k408l2697o302j336J3561k0833L436
$$ 14252 25468 42540 33689 45249 39086 30637 28229 -4468 -10770 -12106 1455 -19378 -15942
12539a5942j6196R423K1572j2974j8283L4072J3914j8822p977q388L188N817K9052
$$ -15942 -32138 -22715 -1143 -14117 -32400 1672 15586 -3236 -11213 -19601 -16413 -10596 18456
12526A8456N16O844P72p019j495J5585r729j0314o079j6706o846K7586o057J1397
$$ 18456 18972 25816 26588 19569 18074 33659 23930 13616 7537 -9169 -16015 11571 5514 16911
12512A6911M739n455J8267o855j2904j2144J7557K4575Q460l349M296p441J737
$$ 16911 21650 16195 34462 27607 14703 2559 20116 44691 53151 49802 54098 46657 48394
12499D8394o06k3044l3838j7187M099r018J2068R772p889j9872J9612J6300n944
$$ 48394 47788 24744 -9094 -26281 -22182 -31200 -19132 -9360 -17249 -37121 -17509 -1209 -7153
12486g153k8623j9523K5381K8533j0780P897J8505l47O245k422k8322N529J4098
$$ -7153 -35776 -55299 -29918 -1385 -12165 -4268 14237 13890 20135 17713 -10609 -5080 9018
12473I018k9631m463m155j1709J4723M867j3192Q906J4308l973J4897J7808J2108
$$ 9018 -20613 -25076 -29231 -40940 -26217 -21350 -34542 -25636 -11328 -15301 -404 17404 29512
12460B9512j703k4452j1814M2346O81l0524q454m327k3676o478L9408J9650l063
$$ 29512 27809 3357 -8457 33889 34570 4046 -4408 -8735 -32411 -38889 519 20169 17106
12447A7106j1186k1058P150K0694j2801m4562j1471N143j4505J8309J6944J9261
$$ 17106 5920 -15138 -7988 12706 -95 -44657 -56128 -50985 -65490 -47181 -30237 -10976
12435a0976K6538R801o074L1967j6959l5542q590k97N9181j208k4825J799L212
$$ -10976 15562 25363 19289 51256 34297 -1245 -9835 -10132 49049 47841 23016 24815 28027
12422B8027j1739j4821l0131R591N494K9664k139R313R328k0720j2492J1964L444
$$ 28027 16288 1467 -28664 -19073 -13579 16085 13946 23259 32587 11867 -625 11339 14783
12409A4783L5808k1615K782j4115m5595J0659J6208nl5727O536L2501L265r572
$$ 14783 50591 28976 31758 17643 -27952 -17293 -1085 -1090 -36817 -30281 2220 5485 -4087
12396d087j8256J5195j1721J5248R575k2075J5943O1866j1686k8692m43R514l5759
$$ -4087 -22343 -7148 -18869 -3621 5954 -16121 -178 61688 50002 21310 20867 30381 -5378
12383e378k8108Q204L5259l893j5878O136j847j030J0307P121J4345p222K0581
$$ -5378 -33486 -25282 9977 6084 -9794 -3658 -5505 -6535 3772 10893 25238 18016 38597
12370C8597n918l4013j7903j9145m707P539o985P64J6174L1204P680j3585k2678
$$ 38597 32679 -1334 -19237 -38382 -43089 -35550 -42535 -41771 -25597 5607 13287 -298 -22976
12357b2976J8390J8065M759J5023J2510l3493k7584J2733K5247m4515j6532O912
$$ -22976 -4586 13479 18238 33261 45771 12278 -15306 -2573 22674 -21841 -38373 -31461
12345c1461k4204J2460K7505J1339J9313J2962k2377k2040j8984K662K1407Q056
$$ -31461 -55665 -43205 -15700 -4361 14952 27914 5537 -16503 -35487 -32825 -11418 -3362
12333c362M08j6226J403O325J4143J5935k6459l266K757J631j7639K5885J5379
$$ -3362 -2954 -19180 -17777 -11452 2691 18626 -7833 -11099 -8342 -6711 -24350 1535 16914
12320A6914j5389j3252K6197K1118m8620m2377L578j270J0014J3288K7797L2436
$$ 16914 1525 -11727 14470 35588 -13032 -55409 -51831 -53101 -43087 -29799 -2002 30434
12308C0434j6769L784J4500m609p381k4785l958K2824L621j0205k1896k5695j4898
$$ 30434 13665 17449 31949 27340 19959 -4826 -8784 14040 17661 7456 -14440 -40135 -55033
12295e5033O85K1126K2030m629l4786Q026K639j1688J8155J4569N364k7211k834
$$ -55033 -54348 -33222 -11192 -15821 -50607 -42581 -39942 -51630 -33475 -18906 -13542 -40753 -43587
12282d3587K2811K6828j114j3467K553J6163L250j557p883j9380K8025O878P712
$$ -43587 -20776 6052 4938 -8529 -5976 10187 13437 11880 3997 -15383 12642 19520 27232
12269B7232m1689k6064J4149K8733J7757R030l1993R416j9324j4451J2710O077
$$ 27232 -14457 -40521 -26372 2361 20118 29148 -2845 6571 -12753 -27204 -14494 -8417
12257h417K6961k4185m8268J612K1700j233J9003O19J2912j6376q662J7753K8765
$$ -8417 18544 -5641 -53909 -52297 -30597 -31830 -12827 -12208 704 -15672 -24334 -6581 22184
12244B2184P84l0458J9786j549k7540l9607J0966l20K223J9985K9570J4862l8623
$$ 22184 22968 -7490 12296 10747 -16793 -56400 -45434 -45754 -43531 -23546 6024 20886 -17737
12231a7737Q418K8856p434Q12k7494j6723O550K3412J0271J1219L324p331J2339
$$ -17737 -9319 19537 12103 12915 -14579 -31302 -24752 -1340 8931 20150 23474 16143 28482
12218B8482K0498J376l4814k7307K1075o295M706j5926l8122l847K1711R120J5220
$$ 28482 48980 50356 15542 -11765 9310 3015 7721 -8205 -46327 -50174 -28463 -19343 -4123
12205d123J9634o518n68k0809K543J8754j1067j2826K3243k0282r637J1420j4120
$$ -4123 15511 8993 8425 -12384 -9841 8913 -2154 -14980 8263 -12019 -21656 -10236 -24356
12192b4356J8057j097J2693Q698J43l0497R546q139j8917J6316K5526K7624J9972
$$ -24356 -6299 -7396 5297 13995 14138 -16359 -6813 -14952 -33869 -17553 7973 35597 55569
12179E5569l2271k5225l917k639J8949J0915k147J5113J5034q57J3770o125j8910
$$ 55569 23298 -1927 -5844 -8483 10466 21381 19234 34347 49381 48524 62294 56169 37259
12166C7259J733j0627J2677J9631j4088r562j6335j2684k0961j8697J2621J9341
$$ 37259 38992 28365 41042 60673 46585 37023 20688 8004 -12957 -31654 -19033 308
$$ [...]
##END NTUPLES=NMR SPECTRUM
##END=
