##TITLE=Analysis number 316154
Compound Code ac 35951
Project Code adrs
Chemist Name frontier sci
##JCAMPDX= 6.0         $$ Bruker NMR JCAMP-DX V2.0
##DATA TYPE= NMR SPECTRUM
##DATA CLASS= NTUPLES
##ORIGIN= Bruker BioSpin GmbH
##OWNER= nmr
$$ XWIN-NMR		Version 3.5
$$ Wed Dec 21 10:05:20 2005 GMT Standard Time (UT+0h)  MAYBRIDGE\nmr@NMR_250MHZ
##.OBSERVE FREQUENCY= 250.131544655141
##.OBSERVE NUCLEUS= ^1H
##.ACQUISITION MODE= SIMULTANEOUS (DQD)
##.ACQUISITION SCHEME= undefined
##.AVERAGES= 16
##.DIGITISER RES= 18
##SPECTROMETER/DATA SYSTEM= dpx250
##.PULSE SEQUENCE= zg30
##.SOLVENT NAME= DMSO
##.SHIFT REFERENCE= (INTERNAL, DMSO, 0, 16.522)
##AUDIT TRAIL= $$ (NUMBER, WHEN, WHO, WHERE, WHAT)
$$ ##TITLE= Audit trail, XWIN-NMR		Version 3.5
$$ ##JCAMPDX= 5.01
$$ ##ORIGIN= Bruker BioSpin GmbH
$$ ##OWNER= nmr
$$ C:\u/data/dgb/nmr/ADRS/14040/pdata/1/auditp.txt
$$ ##AUDIT TRAIL=  $$ (NUMBER, WHEN, WHO, WHERE, WHAT)
(   1,<2005-12-21 10:04:37.34 +000>,<MAYBRIDGE\nmr>,<NMR_250MHZ>,
      <created by zg, POWCHK disabled, PULCHK disabled
       configuration hash MD5:
       62 19 C7 07 E1 42 D1 B7 37 6C 3D D0 77 39 F9 E6
       data hash MD5: 64K
       62 4C B7 4D 1F 92 60 79 79 B9 05 39 2A DE E0 1C>)
(   2,<2005-12-21 10:04:57.33 +000>,<MAYBRIDGE\nmr>,<NMR_250MHZ>,
      <Start of raw data processing
       ef LB = 0.3 FT_mod = 6 PKNL = 1 SI = 32K 
       data hash MD5: 32K
       62 31 A8 D2 E6 33 2F 01 F7 02 FD 73 A4 EC CC 4F>)
(   3,<2005-12-21 10:05:01.84 +000>,<MAYBRIDGE\nmr>,<NMR_250MHZ>,
      <apk 
       data hash MD5: 32K
       11 08 73 6D F5 EC 98 C6 2C 5B 56 FC 2D 0B D5 F5>)
(   4,<2005-12-21 10:05:03.04 +000>,<MAYBRIDGE\nmr>,<NMR_250MHZ>,
      <abs ABSG = 5 
       data hash MD5: 32K
       E5 1F 07 CF F3 AA DF 4B 6D AD 01 DC 00 27 98 08>)
$$ ##END=
$$ 
$$ hash MD5
$$ A1 EA B8 F2 63 44 36 7F 86 A2 74 2A D6 05 1E C7
##$RELAX= 
##$RELAX= 
##$RELAX= 
##$RELAX= 
##$RELAX= 
##$RELAX= 
##$RELAX= 
$$ Bruker specific parameters
$$ --------------------------
##$DU= <C:\u>
##$EXPNO= 14040
##$NAME= <ADRS>
##$PROCNO= 1
##$TYPE= <nmr>
##$USER= <dgb>
##$AMP= (0..31)
100 100 100 100 100 100 100 100 100 100 100 100 100 100 100 100 100 100 
100 100 100 100 100 100 100 100 100 100 100 100 100 100 
##$AQSEQ= 0
##$AQ_mod= 3
##$AUNM= <au_zg>
##$AUTOPOS= <4 >
##$BF1= 250.13
##$BF2= 250.13
##$BF3= 250.13
##$BF4= 250.13
##$BF5= 500.13
##$BF6= 500.13
##$BF7= 500.13
##$BF8= 500.13
##$BYTORDA= 1
##$CFDGTYP= 0
##$CFRGTYP= 5
##$CHEMSTR= <none>
##$CNST= (0..31)
1 1 145 1 1 1 1 1 1 1 1 1 1 1 1 1 1 1 1 1 1 1 1 1 1 1 1 1 1 1 1 1 
##$CPDPRG= <>
##$CPDPRG1= <>
##$CPDPRG2= <>
##$CPDPRG3= <>
##$CPDPRG4= <mlev>
##$CPDPRG5= <mlev>
##$CPDPRG6= <mlev>
##$CPDPRG7= <mlev>
##$CPDPRG8= <mlev>
##$CPDPRGB= <>
##$CPDPRGT= <>
##$D= (0..31)
0 1 0 0 0 0 0 0 0 0.06 0 0 0 0 0 0 0.0002 0 0 0 0 0 0 0 0 0 0 0 0 0 0 
0 
##$DATE= 1135159475
##$DBL= (0..7)
120 120 120 120 120 120 120 120 
##$DBP= (0..7)
150 150 150 150 150 150 150 150 
##$DBP07= 0
##$DBPNAM0= <>
##$DBPNAM1= <>
##$DBPNAM2= <>
$$ [...]
##$SUBNAM7= <"">
##$SUBNAM8= <"">
##$SUBNAM9= <"">
##$SW= 20.6930455092707
##$SWIBOX= (0..15)
0 0 3 0 0 0 0 0 0 0 0 0 0 0 0 0 
##$SW_h= 5175.983436853
##$TD= 65536
##$TD0= 1
##$TE= 293.16
##$TE2= 300
##$TE3= 300
##$TEG= 300
##$TL= (0..7)
0 120 120 120 120 120 120 120 
##$TP= (0..7)
150 150 150 150 150 150 150 150 
##$TP07= 0
##$TPNAME0= <>
##$TPNAME1= <>
##$TPNAME2= <>
##$TPNAME3= <>
##$TPNAME4= <>
##$TPNAME5= <>
##$TPNAME6= <>
##$TPNAME7= <>
##$TPOAL= (0..7)
0.5 0.5 0.5 0.5 0.5 0.5 0.5 0.5 
##$TPOFFS= (0..7)
0 0 0 0 0 0 0 0 
##$TUNHIN= 0
##$TUNHOUT= 0
##$TUNXOUT= 0
##$USERA1= <user>
##$USERA2= <user>
##$USERA3= <user>
##$USERA4= <user>
##$USERA5= <user>
##$V9= 5
##$VALIST= <valist>
##$VCLIST= <CCCCCCCCCCCCCCC>
##$VD= 0
##$VDLIST= <DDDDDDDDDDDDDDD>
##$VPLIST= <PPPPPPPPPPPPPPP>
##$VTLIST= <TTTTTTTTTTTTTTT>
##$WBST= 1024
##$WBSW= 4
##$XGAIN= (0..3)
0 0 0 0 
##$XL= 0
##$YL= 0
##$YMAX_a= 478048
##$YMIN_a= -476079
##$ZGOPTNS= <>
##$ZL1= 120
##$ZL2= 120
##$ZL3= 120
##$ZL4= 120
##$ABSF1= 16.522
##$ABSF2= -4.171173
##$ABSG= 5
##$ABSL= 3
##$ALPHA= 0
##$AQORDER= 0
##$ASSFAC= 0
##$ASSFACI= 0
##$ASSFACX= 0
##$ASSWID= 0
##$AUNMP= <proc_1d>
##$AZFE= 0.1
##$AZFW= 0.1
##$BCFW= 0
##$BC_mod= 0
##$BYTORDP= 0
##$COROFFS= 0
##$CY= 12.5
##$DATMOD= 1
##$DC= 0
##$DFILT= <>
##$DTYPP= 0
##$F1P= 14.0000005364418
##$F2P= -0.99999901652339
##$FCOR= 0.5
##$FTSIZE= 32768
##$FT_mod= 6
##$GAMMA= 0
##$GB= 0
##$INTBC= 1
##$INTSCL= 1
##$ISEN= 128
##$LB= 0.3
##$LEV0= 0
##$LPBIN= 0
##$MAXI= 10000
##$MC2= 0
##$MEAN= 0
##$ME_mod= 0
##$MI= 0
##$NCOEF= 0
##$NC_proc= -3
##$NLEV= 6
##$NOISF1= 0
##$NOISF2= 0
##$NSP= 0
##$NTH_PI= 0
##$NZP= 0
##$OFFSET= 16.522
##$PC= 1
##$PHC0= 78.79857
##$PHC1= 7.739738
##$PH_mod= 1
##$PKNL= yes
##$PPARMOD= 0
##$PSCAL= 4
##$PSIGN= 0
##$REVERSE= no
##$SF= 250.13
##$SI= 32768
##$SIGF1= 0
##$SIGF2= 0
##$SINO= 400
##$SIOLD= 32768
##$SREGLST= <1H.DMSO>
##$SSB= 0
##$STSI= 32768
##$STSR= 0
##$SW_p= 5175.98343685301
##$SYMM= 0
##$S_DEV= 0
##$TDeff= 65536
##$TDoff= 0
##$TI= <Analysis number 999999
Compound Code 99
Book Reference 9
Project Code 9>
##$TILT= no
##$TM1= 0
##$TM2= 0
##$TOPLEV= 0
##$USERP1= <user>
##$USERP2= <user>
##$USERP3= <user>
##$USERP4= <user>
##$USERP5= <user>
##$WDW= 1
##$XDIM= 32768
##$YMAX_p= 373797493
##$YMIN_p= -149954
$$ End of Bruker specific parameters
$$ ---------------------------------
##NTUPLES= NMR SPECTRUM
##VAR_NAME=  FREQUENCY,     SPECTRUM/REAL,   SPECTRUM/IMAG
##SYMBOL=    X,             R,               I
##VAR_TYPE=  INDEPENDENT,   DEPENDENT,       DEPENDENT
##VAR_FORM=  AFFN,          ASDF,            ASDF
##VAR_DIM=   32768,         32768,           32768
##UNITS=     HZ,            ARBITRARY UNITS, ARBITRARY UNITS
##FACTOR=    0.157963299565203, 1,           1
##FIRST=     4132.6476996994, 0,             0
##LAST=      -1043.33573715361, 0,           0
##MIN=       -1043.33573715361, -149954,     0
##MAX=       4132.6476996994, 373797493,     0
$$ Real data points
##PAGE= N=1
##DATA TABLE= (X++(R..R)), XYDATA
$$ [...]
17579F6569k4229l1905Q690k8397j666M647l252p494j4025L7083L4451l467k2106
17566A4899K2558k7076K8990N751k6427K9022J0551K1707P737m3755q741l7853
17554b637k5838M751Q491L5359k2357n356N836q144r374j6084r075J7542K9219
17541B333K4571O420m3346J354J7186l760m6860k1588O175m582J6191m158m812
17528e4876L1975L1472J7510M513K5313j8105r326k4975j0228j1051L64o282j6361
17515d0057K4366J3072J6292J500l0480k7482M8939Q1055O86l136j2799k3471
17503D8485l9939p919M5975J4589k4098l5142K6035N5837J3709l8913m4490J5301
17491B9430L7865j1541k3660K5073m810j0475j8589O051n23J1252p042j0572m2067
$$ y = [66569, 42340, 10435, 19125, -9272, -10938, -6291, -9543, -17037, -31062, 6021, 40472, 37005, 14899, 37457, 10381, 39371, 45122, 18695, 47717, 58268, 79975, 87712, 43957, 35216, -2637, -28475, -23724, -15233, 20126, -2231, -7587, -1751, -9895, -19269, -35353, -44428, -26886, 2333, 26904, 33324, -10022, -8668, 8518, 4758, -42102, -63690, -57515, -62097, -45906, -50064, -54876, -22901, 8571, 26081, 30594, 55907, 37802, 28476, 3501, -6727, -17778, -17414, -23696, -40057, -15691, -2619, 13673, 15173, -15307, -42789, 6150, 87205, 87891, 84755, 71956, 48485, 8546, 627, 46602, 61191, 37093, 1951, 27986, 83823, 97532, 58619, 14129, 29430, 67295, 55754, 32094, 57167, 52357, 41882, 23293, 29344, 28821, 40073, 33031, 22459, -19608]
17478a9608M132L2131J4478k29M359j4670k6751m565j55o623r943J3267L9405
17465B5228J4512k4680R194j4491k4914j8447P652Q024K7469m605J321j8112k4238
17452c6087j5326k9069O1310N6803j2762j8725j5931n902n262L390j1153K1184
17440g530O439R451j6229o558p093J6059p673k2837K8733J3184l458j7867L8669
17427B3290L7282m1700o6470K0738K0536m567J2763n708M8341J7004k2279k2900
17415A6330m1085n170P189m826j7270j8048J5898N3606K6250L942j2177K7167
17403E1806j2342n8604r277M4578J5356j8376K039m978n5514n1369M4201N105
17391d7375K8771N7931K7846l151K1035J1858n3621k8333k2395O812K6116J234
$$ y = [-19608, -15476, 16655, 31133, 30904, 35263, 20593, -6158, -10723, -10878, -17501, -27444, -14177, 25228, 39740, 15060, 24254, 9763, -15151, -33598, -25946, -17922, 9547, 4942, 6263, -11849, -36087, -51413, -80482, -19172, 37631, 24869, 6144, -9787, -15689, -20951, -17561, -28714, -7530, -1091, 8360, -7869, -14427, -21520, -5461, -13134, -35971, -7238, 5946, 2488, -15379, 23290, 60572, 18872, -47598, -26860, -6324, -10891, 1872, -3836, 44505, 61509, 39230, 16330, -24755, -29925, -22736, -27562, -44832, -62880, -46982, 6624, 32874, 36816, 24639, 51806, 39464, -19140, -28417, 16161, 31517, 13141, 15180, 10202, -45312, -96681, -52480, -47375, -18604, 39327, 67173, 64022, 85057, 96915, 43294, 14961, -7434, -622, 25494, 26728]
17379B6728p406l7119j9835N1016L550P03L9197k853m2493q091K3672j663k1515
17366C891j3378M385L7542k328l0006K5929m9549L268J3501M0353K2053J4223
17354F9884k4269o7448j2083K5515L4227j850l2815r556L741R223Q837L3554J3771
17341E0731k6076j698j3232k4694k0339L0660M0285L8437j6462o0085m4344k184
17329d9001M151M614L512L1852J6747m1017k1247J5260K3145M4088J7425J1858
17317F1387L3100j9933l7246j02J9988p4439l9892N783L7459j0297k3677j6273
17305f4142j2374J9628K2507L7582p123k8429J2360J5475L985K214k3178k8663
17293e0158k6417M3116J0030L2018q827m058L4822k1348j6964K6243M0754J904
$$ y = [26728, 19322, -17797, -37632, 13384, 16934, 17637, 56834, 53981, 11488, 3397, 27069, 25406, 3891, -9487, -5102, 32440, 30112, 106, 26035, -23514, -20246, -6745, 33608, 55661, 69884, 45615, -21833, -33916, -8401, 25826, 23976, -8839, -18395, -14654, -5431, 3406, 36960, 50731, 24655, 22957, 9725, -14969, -35308, -4648, 35637, 74074, 57612, -2473, -46817, -49001, -44850, -40236, -36724, -4872, 11875, -29142, -50389, -35129, -11984, 32104, 49529, 61387, 94487, 74554, 37308, 37206, 57194, -17245, -57137, -51354, -13895, -24192, -47869, -64142, -76516, -56888, -34381, 3201, -3922, -32351, -19991, -4516, -531, 1683, -21495, -50158, -76575, -33459, -23429, 8589, -238, -4296, 30526, 9178, -7786, 18457, 59211, 61115]
17281F1115j347m509j4860m692O385k8733l4854j5942J9812K4388k7658n3873
17269g4768J7518K6954K0465N778J1179J4933j2233m784n1062K793O9026j5264
17257A0535K424k7527K3082J4004r821J0977j3419k3274O125J1175j3286l3612
17245d2617M5575K2071J5416O308j1545k8157O410j0097j9145k1649k3356K1482
17233c9304O497M187j2481k2834j8192Q266L3512P5977M9427m68N799K4694q463
17220A06617q3508k4435j6554K632K2376J5373j5331m550q106K791K445L323J0441
17207A3514K2275m7741k3211K5745L2991J1472K4254J5196m2803k3826J0083j7633
17195C16m62J1413J4070j7603q068j6658j1888K6994P870L7001K3893j6488k6072
$$ y = [61115, 59768, 55259, 40399, 35707, 42092, 13359, -21495, -37437, -17625, 6763, -20895, -74768, -57250, -30296, -9831, -4053, 7126, 22059, 9826, 5042, -46020, -43227, 25799, 10535, 12959, -14568, 8514, 22518, 12697, 23674, 10255, -13019, -6894, 4281, -9005, -42617, 2958, 25029, 40445, 46753, 35208, 7051, 13461, 3364, -15781, -37430, -60786, -39304, -32807, -28620, -41101, -63935, -82127, -73861, -40349, 35628, 85055, 84587, 90386, 115080, 106617, 23109, -1326, -17880, -15248, 7128, 22501, 7170, 2620, -5486, -2695, -250, 3073, 13514, 35789, -11952, -35163, -9418, 23573, 35045, 59299, 74495, 31692, 7866, 17949, 316, -146, 11267, 25337, 7734, -334, -16992, -28880, -1886, 5984, 42985, 66878, 50390, 24318]
17182B4318J398L1727j7646n1825J3015M6154L2684l9584l5323k0118K7524J8874
17170C1198k5564j9232P151L531R370J9592M1329j683o854m386l9385j0098J2583
17157A7552J4574l4979k0615P718L4690j8653m834n836O080Q652O479J4205o0974
17144c5941l9651K2334O645j2256r857K3904M0733K5513j5965l0872j1134j108
17132c7655k0245j9166J8457K8502J7442K267m076J2731l3409n3396l215K0603
17120g1160K2575K5790j1928J4602J9157J4511m9483k1641P511l1051j1403M840
17108h7680L6261M6089L9233m157q301l7526J6023n6542j8011J8232Q583o052
17096e3848L13L4633M6253k0113m3017p350M0440j4702l2997o033L1802J333J177
$$ y = [24318, 25716, 57443, 39797, -12028, 987, 47141, 79825, 40241, 4918, -15200, 12324, 31198, 5634, -13598, -6447, -2916, 6454, 26046, 67375, 65692, 58838, 54452, 15067, 4969, 17552, 32126, -2853, -23468, -15750, 18940, 287, -4547, -10383, -4303, 4349, 10828, 25033, -35941, -75592, -53258, -46613, -58869, -68726, -44822, -4089, 21424, 5459, -25413, -36547, -37655, -57900, -77066, -58609, -30107, -12665, -10398, -14474, -1743, -35152, -88548, -91763, -71160, -48585, -22795, -34723, -20121, -964, 13547, -35936, -57577, -50066, -81117, -92520, -87680, -51419, -5330, 33903, 29746, 21445, -16081, -58, -56600, -74611, -56379, -47796, -53848, -53535, -18902, 27351, 7238, -35779, -43129, -2689, -17391, -50388, -56421, -24619, -23286, -22109]
17083b2109k1689J0355R965q062K2202J8173j0304O465J6156j8420L8235J8262
17071E9229m0487K60j9446K3236M7992j4877l0947j0975K5935r572r941N154k987
17058B2574j8270r497K7772J2738p533Q237L6937J1955k7240j4632J2288j2490
17046D2839p132l6981M636J6346J2900R955m0786M448L0621j0879l4251m3565
17034e1849m0765L0605O0510M1857k7862l4796J0517J0166L1060J2050l1109j0673
17022b89J6352j7910m9363k232N665Q678m1471N186O3277K9880J2045K625k5427
17009G016q967k2273M4997p702p545K4444k0471m2221m504J799J7174J8018k3680
16996b3915O173N7547N6227l0976o0250m2771L447L3052L9588M545j2870k3024
$$ y = [-22109, -43798, -33443, -23478, -31540, -9338, 8835, -1469, 4996, 21152, 2732, 40967, 59229, 18742, 19002, -444, 22792, 70784, 55907, 24960, 13985, 39920, 30348, 20407, 25561, 22574, 4304, -5193, 22579, 35317, 27784, 36021, 72958, 84913, 57673, 43041, 55329, 42839, 35707, -1274, 3362, 19708, 32608, 42563, 1777, 6225, 36846, 25967, -8284, -51849, -92614, -62009, -1499, 40358, 12496, -22300, -11783, -1617, 29443, 41493, 10384, -289, 16063, -1847, -51210, -53442, -47777, -39099, -80570, -75384, -12107, 17773, 29818, 32443, 7016, -1951, -24224, 20773, 13071, 5526, 29970, 9499, -32722, -37226, -35427, -18253, -235, -23915, -17742, 39805, 96032, 65056, 4806, -37965, -34518, -1466, 38122, 42667, 29797, 6773]
16984F773K9843K113q553l1874j2580M322p270M625J7918l0653k5530K0312J8081
16971a2473N0641J2081l4357m9582j2389L5663M8352K5276L749M994l5731q6625
16959e0401O664K1680M266M295r90p358k8011m4177J8975M2115L965N612N932
16946a7433J922N9966M5666n0782k1125p017l1712J7221J8111K1129j0020n1331
16934b5405l5700K1528J5683j9393J731Q015j5746J6714L8062O8936k8294m0549
16922E582J7511j1087l5639j1954j1478o159N190J175j2413q424k9724M8872Q1583
16909C3035m975j1572J1701L0757k4028r031k5974o039k720J6871L6179J1274
16897E5478r052j4572n4548m6641r452j6481P2622j310q286J7918J499j1375l663
$$ y = [6773, 36616, 38729, 30176, -1698, -14278, -9956, -17226, -12601, 5317, -25336, -50866, -30554, -12473, 38168, 50249, 15892, -33690, -46079, -10416, 37936, 63212, 66961, 71955, 36224, -50401, -43737, -22057, -17791, -13496, -14486, -21844, -49855, -94032, -75057, -32942, -28977, -23365, -17433, -15511, 44455, 90121, 39339, 18214, 11197, -20515, -3294, 14817, 35946, 25926, -25405, -61105, -39577, -23894, -43287, -41556, -33541, -49287, -32573, 5489, 74425, 46131, 5582, 23093, 12006, -23633, -35587, -47065, -53224, -48034, -46859, -59272, -67696, -97420, -48548, 33035, 28060, 16488, 28189, 58946, 34918, 25887, -87, -6126, -8846, 8025, 44204, 55478, 46426, 31854, -22694, -69335, -78787, -95268, -22646, -23956, -32242, -14324, -12825, -24200, -27863]
16884b7863J05J7222j9681k0623j0409k819q296J1580L9018J5248j047j3123J0956
16871i732M8050k0595n1815N056L435q551j0193M6807J8901J556J288q652l429
16858A2126k1436p601k8480k5693J5270N1941J1884R829J484j3346k0786M976
16846i832J2061j5507R11k8152J2361J8484j1882m2355M3600j76J1600j7584l2581
16833e9052r85J5429M4530P143N025l308q233J5307q369q591L6950K6701m7751
16820A4796k6852O100P220m7117k7466J2812m816K0600L0770K2156o597k3340
16808b1734l0441k3868J3714L6204K3238o655j8102K7151J7113O777l2608k6237
16796c5448p543M3418K0345l4029j6177M894J3854k781N367M667k6683k0726J6617
$$ y = [-27863, -27758, -10536, -30217, -50840, -61249, -64068, -72364, -60784, -21766, -6518, -7565, -20688, -9732, 38318, 17723, -34092, -29036, -25601, -34152, -44345, 2462, 21363, 22919, 24207, 15555, 12126, -9310, -16911, -45391, -71084, -55814, -3873, 8011, 17840, 19324, 5978, -14808, -9832, 2229, -13278, -12367, -40519, -28158, -9674, -21556, -63911, -20311, -20487, -8887, -26471, -59052, -60037, -44608, -78, 7065, 12090, 8782, 549, 15856, 7487, -1104, 35846, 62547, 14796, -12056, -5956, 1264, -45853, -73319, -60507, -65323, -44723, -13953, 8203, 1606, -21734, -52175, -76043, -62329, -26125, -2887, -9542, -27644, -493, 16620, 23397, -9211, -35448, -42991, 427, 20772, -13257, -29434, -24540, -10686, -13467, -8100, -3433, -30116, -50842, -34225]
16783c4225N873R161L4092J3061j9576R67q469m8920P496N195J6523J0401J3036
16770D615m2698P480L282O728J7912j6341k0108J4694l456J3158k6137K9842K2203
16757A1174J1487Q848n7004l8605K1732L5904j2765K6447J6078J2581k8024k7368
16745a9515m3707j0595m3070J8886O6827M7876K278m1462l9552N835L4688O198
16733a5313m8906k0809K1430l5722o579O9179K1197J9272K6525o10K1054J7342
16721F8060k2337j2290J9509r633m5999p715J3812J1305j6642K0080j763J831
16709A8218K3258j0560j5919K4991l7732o626J9598L14k1116m3545J8548O1000
16697C0429L6268j6443J2101k7734n5607r247l5716M2098K9906k3665j8633j2953
$$ y = [-34225, -28352, -19191, 14901, 27962, 8386, 9353, 884, -48036, -40540, -35345, -18822, -8421, 4615, -38083, -30603, -27321, -20593, -2681, -19022, -39130, -24436, -27892, -14734, -40871, -11029, 11174, 22661, 31509, -25495, -64100, -42368, -6464, -19229, 7218, 23296, 35877, 7853, -19515, -63222, -73817, -116887, -98001, -31174, 16702, 18980, -22482, -62034, -56199, -21511, -15313, -64219, -85028, -63598, -99320, -105899, -36720, -15523, 3749, 30274, 29664, 50718, 68060, 45723, 33433, 52942, 43309, -2690, -10405, 3407, 14712, -1930, 18150, 16387, 18218, 41476, 30916, 14997, 39988, 2256, -4370, 15228, 15542, -5574, -49119, -30571, 30429, 66697, 50254, 62355, 34621, -20986, -30233, -65949, -23851, 6055, -17610, -36243, -49196]
16685d9196J3332N979j587J8521j1543m2375J0906L3106K7692j5569q715J8617
16673h32L0097o454M113n561N590k5126k4611l7265j959j6662K4160K1236L0807
16660b467M1052K1716j7229j6507l1349l1071n896O8314L4855P116m995q1338
16648a7799k2436k5343K1685K1407J3229N6400K9581j5333k8651k9386J2077q191
16636G240J379M5642R812k7702l7021j6853M279M8138o822l6317N635K5324m2183
16623a9449n4790M39k221J8709M2713K1708j5031l3074k0927J0360K6409L4032
16611H878J7266r5j7338k4430l856J7558M3863j2398k5621J9183j0560N307j8454
16598f97M481J531m266j9630j8001J9617N4688k3276l926J717L258J5004j0300
$$ y = [-49196, -35864, -29885, -31472, -12951, -24494, -66869, -55963, -22857, 4835, -10734, -19449, -832, 29265, 22811, 26924, 21363, 26953, 1827, -22784, -60049, -62008, -78670, -54510, -33274, -2467, 38585, 60301, 43072, 26565, -4784, -35855, -41751, 26563, 61418, 68534, 63539, -17799, -40235, -65578, -43893, -22486, -9257, 47143, 76724, 61391, 32740, 3354, 15431, 7240, 8619, 54261, 64073, 36371, -650, -17503, -13224, 34914, 28092, -8225, -2590, 22734, -19449, -74239, -73800, -76021, -57312, -14599, 7109, -7922, -40996, -61923, -51563, -25154, 8878, 26144, 26049, 8711, -15719, -19575, -2017, 41846, 29448, 3827, 23010, 12450, 17757, -697, 3784, 5315, 1049, -18581, -36582, -16965, 37723, 14447, 10521, 12238, 15496, 30500, 20200]
16585B0200j5434n435j2966o142j0224k369O777L5399K3919k4237l9516l6387
16573f6415K1747K0883m6114J0475j9539L9652K3269q1704Q504K9257j8422m790
16561h3197K2727L6700k0810K5736M4106n319n0322j3163J4089L8971K9719j3698
16549B5539k0886m4725m960O051L0111J8990l4118j2196J8686j2236J7074L6749
16537B4079O875l6235k4144O70J493K9543l358n0406j4867J3203K7026J2535K6822
16524A3236m957j9958k118o627l526L741m3944l7282L8777P1742o325j4558Q188
16511c611K204n053m982K2920k3777j6155P979L145l9659O750N4771K7613o90
16498C1455k4703j163J1836l5663j4705K0529j76j040O833l195k6917j0987L8463
$$ y = [20200, 4766, -669, -13635, -19777, -30001, -32370, -25593, 9806, 33725, 9488, -30028, -66415, -44668, -23785, -69899, -59424, -78963, -39311, -16042, -97746, -89242, -59985, -78407, -83197, -60470, -23770, -44580, -18844, 25262, 19943, -30379, -43542, -29453, 9518, 39237, 25539, 4653, -40072, -45032, -38981, -8870, 10120, -23998, -36194, -17508, -29744, -12670, 24079, 30954, -5281, -29425, -28755, -27262, 2281, -1077, -51483, -66350, -53147, -26121, -13586, 13236, 8279, -11679, -13797, -20424, -23950, -20209, -64153, -101435, -62658, 9084, 2759, -11799, -3611, -1407, -6460, -11442, 11478, -12299, -28454, -20475, -17330, -56989, -50239, 4532, 32145, 31455, 6752, 5589, 17425, -18238, -32943, -12414, -12590, -13630, -6797, -9992, -36909, -47896, -9433]
16485i433K2912R08l62j4612n74J1403j6885l3983M8166K8150j1555j6211p97
16472G127o5225j2538L2997N5143K4732j72m6089j7315Q618K5140O377o45k4075
16459e925k317n0236j9360r6J6312J189K912N3457K750o965l674K6324J1364O883
16445C2618k0195n80N61k6631l4J2119K2610R22l1199l3836J3693J877j9069r332
16431e6476J6355K38K5009K7357J6296j3409L2616J274q149k2439K378j045o2172
16418d2167l5860K2491N3968M1577q471j5050j2470k0244L692m775k162L4376
16406A4905q451r838Q694j5168k1164j4149J4648j4238m1970j0684L9973J9337
16394c8105k254J3103l4070q957O777j5675l0908j0148j9257O3903O6235L4004
$$ y = [-9433, 13479, 14387, 14025, -587, -1161, 10242, -6643, -40626, 7540, 35690, 24135, 7924, 7127, -58098, -70636, -37639, 17504, 42236, 42064, -4025, -21340, -12722, 12418, 18795, 18150, -5925, -8242, -58478, -77838, -77934, -61622, -60433, -57521, -4064, -1314, -8279, -11953, 14371, 25735, 32618, 12423, 11843, 12404, -14227, -14261, -2142, 20468, 21390, -9809, -43645, -29952, -28075, -47144, -56476, -40121, -39883, -14874, 12483, 28779, 15370, 47986, 49260, 41111, 18672, 21050, 20005, -42167, -78027, -55536, -1568, 40009, 31538, 16488, 4018, -16226, -12534, -17309, -19471, 14905, 6454, -3384, 5310, -9858, -31022, -45171, -30523, -44761, -86731, -97415, -57442, -38105, -40359, -27256, -61326, -70283, -63506, -79181, -110089, -120237, -139494, -75591, -9356, 24648]
16382B4648j2560k5492P915J7519Q42N699P667l7421l7251j3680P88Q789K8628
16369b3909m4201k0577L0658L6221k81k0126j1966j55L5049J2591k6125j9056
16357e1877l5471K14M9666K4274j0473j8058k9746j1778M2264J8220J3661Q14
16345h290q889L075j690L0082M487n7513l6266r747R974O3142j1257M607K0223
16332A938j718n1884l995j3908j6253l0042J6000R616j9911j1873L5729J6620
16320f9681j5335L9625K7822J8054M7184K4999k7667m5500n0090k6653k863N0438
16308b9667k0548J4769K0008R912p722j9882j5360m3741r867J1446L3816q5k1312
16295g8233n350M0794L0934l6578k0479J5513J172J0694J8739l3393j210N164
$$ y = [24648, 12088, -13404, -5489, 12030, 12872, 18571, 26238, -11183, -48434, -62114, -61326, -52537, -23909, -68110, -88687, -58029, -21808, -22089, -42215, -54181, -54336, -19287, -6696, -32821, -51877, -87348, -87134, -37468, -13194, -23667, -41725, -71471, -83249, -40985, -22765, -9104, -8290, -17179, -14104, -15794, 14288, 18775, -38738, -75004, -84751, -74777, -11635, -22892, -18285, 1938, 220, -51664, -55659, -69567, -85820, -115862, -99862, -90246, -110157, -122030, -86301, -69681, -85016, -45391, -17569, 485, 47669, 72668, 45001, -499, -50589, -77242, -80105, -29667, -50215, -35446, -15438, -5526, -13248, -33130, -48490, -92231, -102098, -90652, -56836, -56921, -78233, -83583, -42789, -11855, -48433, -68912, -53399, -52227, -41533, -22794, -56187, -57397, -52233]
16283e2233J5745m888n569J1229J1884r650j3504l0205K5381N5610J5702j8547
16271I55l8323k4780M980L1736J5556J8781k4730o7628K119K8438N6867M7348
16259E1319q268K659j2658k7356N83M061M625m1434k0185k1247Q82J5050J8867
16246c3102l360m7669K358L9821L6936O5824j876l6985j7451K1934J1220k1020
16234A6630j7639o966k3829r688Q931l1270k8437J8762J1972K1345N293k0530
16222e5426J7396N8867L2226j1893l8362l9056m73L1942m6621k2810O0341k9631
16210d3500k0187O1387L0614j4082k693L735j7199K944L809L0709k5572j3968
16198d003k1286l2269J5857J4715k1668q20K2824p319J782j4680q590M6720j1175
$$ y = [-52233, -36488, -41376, -46945, -35716, -23832, -33482, -46986, -77191, -51810, 3800, 19502, 955, -37368, -62148, -57168, -25432, -9876, 8905, -15825, -83453, -81334, -52896, 3971, 51319, 43051, 45710, 33052, 5696, 6279, 10340, 14965, -26469, -46654, -67901, -67019, -51969, -33102, -36462, -84131, -81773, -41952, -5016, 60808, 58932, 21947, 4496, 26430, 37650, 16630, -1009, -7975, -31804, -41492, -32561, -63831, -92268, -73506, -61534, -40189, -34896, -55426, -38030, 20837, 53063, 41170, 2808, -36248, -36721, -4779, -51400, -74210, -13869, -43500, -63687, -2300, 28314, 14232, 11539, 15274, -1925, 1019, 4828, 35537, 9965, -4003, -25289, -57558, -41701, -26986, -48654, -49474, -26650, -33969, -32187, -46867, -55457, -8737, -19912]
16185a9912n0586K3612J5272l5657P191R150K6600N413J1914L679K1289l9841
16173b1876O957J8748R963k7114J9400l841Q212q086K0674L9148j877l4377J215
16160B7146j0823j3132m9408j651o548L1240J4253l9871n542o095j2908N196J6584
16147e1559J9931l615l422j4383J2863N756j6699J8085q97k8689M1721K2231K1103
16134B2426m847J378K1903k82j8729l8307j5185K2159J390p294m16k5219K6388
16121a4635K5501J5556Q127k234p2012q325l7504L1193N8894J7185j419m3063
16109b2736o7920K7566K1609J7805m499j8148j2679j6227K3502J9327J7550P272
16097g578k274P969k84P22j7431M484j8080L902j9169p356K9090L0071k1600j8818
$$ y = [-19912, -70498, -46886, -31614, -67271, -60080, -50930, -24330, -18917, -7003, -3324, 17965, -21876, -14919, 3829, 13792, -13322, 6078, 2237, 10449, 2363, 23037, 62185, 60308, 25931, 27146, 16323, 3191, -46217, -47868, -54416, -23176, -8923, -48794, -54336, -60431, -73339, -68143, -51559, -31628, -35243, -38665, -53048, -40185, -34429, -51128, -33043, -33940, -62629, -20908, 1323, 22426, 17579, 18957, 40860, 40578, 21849, -16458, -31643, -9484, -8094, -15388, -15804, -41023, -14635, 10866, 26422, 34549, 32315, -39697, -48022, -85526, -54333, 4561, 21746, 20327, -22736, -90656, -63090, -41481, -23676, -28175, -46323, -59002, -75229, -51727, -32400, -14850, -7578, -9852, -1883, -2167, -1445, -18876, -14392, -32472, -28570, -47739, -55095, -26005, 4066, -17534, -36352]
16083c6352k7693o53J5949J9377J8929j190k4449j3926L340J7572K8747r0o4978
16070f5417K4626J4754n5726J9119L1470N5094j796m6282j407M425l300j1717
16058c6157J0828n693j9553L354O667k0362j1967M28j6390N871J6204k2823k7441
16045a17034J295L9829K0809j3667L7781N7347L0717j7825m553l8058k9344k6080
16033e8783R748L8100J5852j9119k4569m868K4432L1710j3726l5780o189J6549
16021b6643L0878L9890n508j5309K7199l8793r271J6365J3420k3344J5154K781
16009B6819L508p604m8829j4244O913L683J2215J4953K495n7036k6557k0519p546
15996a11749K8511M9445J6484Q930K897J8662n480J1252l109M459L4639q611l4818
$$ y = [-36352, -64045, -64698, -48749, -29372, -10443, -11633, -36082, -50008, -46668, -29096, -349, -439, -65417, -40791, -26037, -81763, -62644, -31174, 23920, 22124, -24158, -25565, -21140, -24440, -36157, -25329, -31022, -50575, -47221, -40554, -60916, -72883, -72455, -88845, -82974, -66770, -89593, -117034, -115739, -75910, -55101, -68768, -30987, 26360, 57077, 39252, 34699, -3359, -32703, -58783, -49035, -10935, 4917, -14202, -38771, -43639, -19207, 12503, -1223, -37003, -43192, -26643, 4235, 44125, 38617, 23308, 50507, 11714, 2443, 18808, 32228, 8884, 24038, 26819, 30327, 22723, -26106, -40350, -33437, -29754, -17539, -2586, -91, -57127, -83684, -104203, -111749, -83238, -33793, -17309, -8379, -5482, 13180, 7700, 18952, 15843, 20302, 54941, 46330, 11512]
15983A1512J6294L8958j5585j1170O305k8748l6619N149m6622j4408N1197K8175
15971D438j6170J7727R368J2042J8158k156Q157k0257o931K0734J4522k3471o2638
15958b6477l069j848j5678O192j0413j3671K2054J1350J2312J2641M182l1921
15946c4346p100l1412k1368L4474P7396J6082l3895k0848J7173K6388K417l2808
15934g847k3228m9541j7648L7666N2077L0237j602k310j2542n0986R305J7040
15922a9379K9426K2567k0660k0708r347l7824m569P360N2699J8819J5548q044
15910B5888j0469J3144l9703j1111J9829N4528k3700o0443j1502k679J4539J5256
15898a6423J5100k836J3062L8608K6782J682k3853l8129j9953L177K3981j0730
$$ y = [11512, 27806, 66764, 51179, 40009, 46314, 17566, -19053, -13904, -60526, -74934, -23737, 4438, -11732, 5995, 15363, 27405, 45563, 43407, 51564, 31307, 24376, 45110, 59632, 36161, -26477, -29546, -31394, -47072, -40880, -51293, -64964, -42910, -31560, -19248, -6607, -2425, -34346, -41446, -72858, -94226, -59752, 17644, 33726, -169, -21017, -3844, 22544, 24961, -7847, -31075, -80616, -98264, -60598, -8521, 21716, 20114, 17804, 5262, -45724, -36419, -19379, 10047, 32614, 11954, -8754, -18101, -55925, -60494, -53134, -435, 18384, 33932, 25888, 15419, 28563, -11140, -22251, -2422, 52106, 28406, -32037, -43539, -46218, -31679, -16423, -1323, -4159, 8903, 47511, 74293, 75975, 52122, 13993, -5960, -2783, 21198, 10468]
15886A0468l0663l1926j7775o935j9443J2025l1246L3589N8539j2334j8462Q10
15874e3353L5844q349l7266j0366J4694n441J6539j5627m160L7739j2695o114
15862d8555m079J2422J5473R588m0601L3624M3742o214O20l079m3979l8707J2925
15849e6820M8749k3877Q3J8532n85r465n0593j0144L2941j3932l138J2138K9003
15836b7108j9021K5747k0049l106J088j1820k7340L637j012M7613j5705K3676
15824b3400o89q163j0633l024l4844m6862L8252K2812M5528O574K1821j6229l637
15811a2494O594P144m950l3009j0772l0196O601L4303M2759O418l4541l2081r799
15798f4023N6477L3567L9035k300l2914J703K7492j26l0101j7427L676k3024R809
$$ y = [10468, -20195, -52121, -69896, -76831, -96274, -84249, -115495, -81906, -23367, -35701, -54163, -53353, -17509, -25858, -63124, -73490, -58796, -64237, -47698, -63325, -67485, -29746, -42441, -48555, -52634, -40212, -24739, -15151, -55752, -22128, 21614, 15400, 16020, 12941, -31038, -69745, -56820, -8071, -31948, -31865, -13333, -13918, -23383, -73976, -84120, -51179, -65111, -68249, -56111, -27108, -46129, -20382, -40431, -43537, -42449, -54269, -81609, -77972, -78984, -31371, -47076, -23400, -24089, -32252, -42885, -45909, -80753, -127615, -89363, -66551, -21023, -14449, 7372, -8857, -12494, -5900, 1244, -3706, -36715, -47487, -77683, -71082, -36779, 5980, 12398, -22143, -54224, -64023, -7546, 26021, 65056, 62756, 29842, 31545, 59037, 58911, 28810, 11383, 15059, -7965, 1844]
15785A844q763K1275J3934N616k0628K495K0919J0813k5367k4573r39J1750k3071
15772a4695L6859j0289k9791K1558J4795l1818K3755k796L082k100r908l1314
15760c2662l0718Q108K5672K2744J2163n6088J0664L4579J6517L412J4399M134
15748C2924J0800J9214k5802J5712l2725o592Q783l5147k1919L5521N182K6418
15736C2369j9595j1747K5093k5342M775M2020K1109l0437k4204k2687m370j3264
15724b6280K7229K1315j0359Q204O55l5195l0294n734K3624J58j8947M9330L8100
15711D1806O0849L8444k1299o7335m4645j0727J8209N77o910J5203J7292l5911
15699E553k1470J8188j9402k945l0283L4723P411k608N139k2654j1796L0220N5588
$$ y = [1844, -6919, 14356, 28290, 33906, 13278, 15773, 36692, 47505, 22138, -2435, -3374, 8376, -14695, 22164, 11875, -17916, 3642, 18437, -13381, 10374, 7578, 10660, 8560, -1348, -32662, -63380, -55272, -29600, -6856, 5307, -50781, -40117, -5538, 10979, 14391, 28790, 32924, 43724, 62938, 37136, 52848, 20123, 13531, 22314, -12833, -34752, 769, 5951, 32369, 12774, 1027, 26120, 778, 5553, 47573, 68682, 38245, 14041, -8646, -13016, -26280, 949, 22264, 11905, 20109, 20764, -14431, -44725, -50459, -26835, -26677, -45624, 3706, 41806, 102655, 141099, 119800, 52465, 7820, -2907, 15302, 15879, 8969, 24172, 41464, 5553, -15917, 2271, -17131, -20076, -50359, -15636, -8225, -10833, -5694, -28348, -40144, -9924, 45664]
15686D5664n528l5936J3J3490L9741j3960m076j123L810J4364m9924k3561K7106
15673A0080K8951k4905l8518J1136K3326o381K043k4944J718L0045l0054n3643
15661g1146m5123J533M7928N5481L0625k2994k7983J3971m607m058J418J2910
15649a2045l7974l2610M2425J7163l438m142M909K7445L1457j9399J3137K7814
15637E4742j8061j0807j1480j665l315P517J6200L640j9292l1128l2001Q41n2767
15624i7576Q222K0720P434M7879N9238K6726J0096m6314k1303R694J2221k7625
15612I412l6595Q548J8579R709k1303K2211n727q745j336k0310k6646K759K586
15599d6858M271J8600r409k0913K8643L3048L9405l9390k4366Q45k0465j6416
$$ y = [45664, 40136, 4200, 4213, 17703, 57444, 43484, 39408, 38285, 42095, 56459, 6535, -17026, 10080, 39031, 14126, -24392, -13256, 10070, 3689, 5732, -19212, -17494, 12551, -17503, -71146, -116269, -114736, -66808, -11327, 19298, -3696, -31679, -17708, -22315, -26373, -24955, -12045, -50019, -82629, -40204, -23041, -26479, -30621, -25712, 1733, 33190, 13791, 26928, 54742, 36681, 25874, 14394, 12729, 9414, 16931, 33131, 36771, 17479, -13649, -45650, -44809, -97576, -89354, -68634, -61200, -13321, 45917, 72643, 82739, 36425, 15122, 24816, 37037, 9412, -27183, -18635, -56, 9653, -11650, 10561, 4834, -3911, -5247, -25557, -52203, -49444, -46858, -42587, -23987, -33396, -54309, -25666, 7382, 46787, 7397, -16969, -16124, -36589, -53005]
15587e3005m867K1008L5159N0996R241J5160j6587m9907m2527k0123k5302q703
15575h9457L0446J6469K0056N250o318R769M286m2350k1569j6569K0792K0105
15563d9090J1751K8317J5586j1861J057l507r1n038l1260L1943P105K2401m978
15550A2335J1691J5384K8194J0381l4743m4020r320M294k9890j1419K3268L5753
15538A1908k9364M457R524m215o466L6097J9355l632l7619k3286p629J5006O50
15525a5214k7366R797K3570N7857K2473n1129o4780k348K4135J4698o292p772
15513b2371j4936m71m220M511K4328J2658j371j5410m5130k1481M3911L0613P477
15500a892J2138k8722m7422n186N0840P5656M672m8811n95r213J2031l608k6621
$$ y = [-53005, -57872, -36864, -1705, 49291, 58532, 73692, 57105, 7198, -35329, -55452, -80754, -89457, -59011, -42542, -22486, -17236, -23554, -13785, -9499, -51849, -73418, -89987, -69195, -49090, -37339, -9022, 6564, -5297, -4240, -7747, -7838, -12876, -44136, -12193, -5088, 17313, 12335, 24026, 39410, 67604, 77985, 43242, -778, -10098, -5804, -35694, -47113, -23845, 11908, -17456, -12999, -3475, -7690, -14156, 21941, 41296, 37664, 45, -23241, -30870, -15864, -15214, -42580, -32783, -9213, 48644, 71117, 19988, -44792, -47140, -23005, -8307, -14599, -22371, -37307, -37778, -41998, -37487, -13159, -501, -1872, -17282, -62412, -83893, -39982, -9369, -1892, 10246, -18476, -65898, -71084, -20244, 55412, 60084, 11273, 10678, 1465, 13496, 9888, -16733]
15487a6733m327K5958Q025l8558m001L1224K4379L469j9626k2596J2386j9384
15475a9784O343l2806j5135J5308J6166q002k2152n605N0046L3200j2078j5863
15463a0362l4917l2438l3612N704N3389N9474k9832k3487M389l263r566j7167
15451g1688m216M278O8070J7073q52j0708n1610J0984J2867o340K4382k9069k4740
15438f1569K7346J6238L1063K573J623M1215l981k5452j0069j0088m7036j605
15426c9742K1569j970L2365K0570l3785l3053K0774m280k7891J1284M0222J7318
15414B3381j2769J9569L2416O264M791l5114k6125k8056K5838p808p263k6630
15402c1506o537k4649l3536J8331P906l63J9312L0272k1616j2073K1516M8196
$$ y = [-16733, -21060, 4898, 12923, -25635, -29636, 1588, 25967, 29436, 9810, -12786, -400, -19784, -13441, -46247, -61382, -46074, -29908, -37910, -60062, -65667, -15621, 17579, 5501, -10362, -45279, -77717, -111329, -105625, -52236, 7238, -22594, -46081, -41692, -44955, -54521, -71688, -75904, -71626, -3556, 13517, 12665, 1957, -49653, -38669, -25802, -32142, -7760, -36829, -61569, -34223, -17985, 13078, 15651, 17274, 58489, 54508, 29056, 18987, 8899, -38137, -39742, -18173, -20143, 12222, 32792, -993, -34046, -13272, -17552, -45443, -34159, 6063, 23381, 10612, 30181, 62597, 68861, 73652, 38538, 12413, -15643, 10195, 2387, -4876, -31506, -38043, -62692, -96228, -77897, -69991, -70354, -51042, -20770, -42386, -54459, -32943, 15253]
15390A5253L006k4762j4610k896K8874N9503K5905n352l8585l6958j2168J3166
15378A0376m0409p4228L0902L2058L4815J2074Q394J0508o5475n9344j7987M1978
15366g6338L0481M4352j2023n5170N44R561p556K6321K9713K1094J1758n8437
15354c5700J0428K3435J2677J4549N573j4153r611k1138n948K1592p121j9271
15342b4688k0297L62N5011L7089N165r840k4429k0261k7551K1248L4783Q506N956
15329D1054N557j6561k2670j032k2854j585r71j8144q973L788Q740K2383J7159
15316E891O049j409p07j0140k5659l1170K4508j1943J3632K5744P339j4491p139
15303a9495J001j1879K5847J2318M919j4996J9666j3229J6098K0219j8452O248
$$ y = [15253, 18259, -6503, -21113, -24009, 4865, 64368, 90273, 84921, 46336, 9378, -2790, 10376, -30033, -104261, -73359, -41301, -6486, 5588, 13982, 24490, -40985, -100329, -118316, -76338, -45857, -1505, -13528, -68698, -68154, -58593, -66149, -39828, -10115, 10979, 22737, -35700, -25272, -1837, 10840, 25389, 30962, 16809, 7198, -13940, -19888, 1704, -5417, -24688, -44985, -44623, 10388, 47477, 52642, 42802, 18373, -1888, -29439, -8191, 26592, 35098, 41054, 46611, 30050, 7380, 6348, -16506, -18091, -19062, -37206, -46179, -42391, -33651, -11268, 5891, 11940, 10531, 9824, -316, -25975, -57145, -32637, -44580, -30948, -5204, 2135, -12356, -19495, -18494, -30373, -4526, 7792, 12711, -2285, 17381, 4152, 20250, 40469, 22017, 28265]
15291B8265l2783m7440k5171M3827o925l0653J5260k107N2683J6015m211l853
15279B907m5492Q837K5424J0675l706k5540m718k2527M865M5263L6880m704P549
15266C5713k1504K570k9406j8959L3229J8561J583J2900p045l3804J4294j7770
15254i638l7087M7251l903j4364p422j9346p286j2130K2100M0835j6032m3831
15242f0853J7752M4145k1674K781q426R487K5838m944n586k7204m4187j1277K5195
15229e8953K2713O779r264j0395q44k4987KM9355P183J3825Q90l10m0694M432
15215d0268R648n187K7654k894N763j2927j416N0134K3634n6026j3416M0971l791
15202B1879R537K8381j2969k4182K4640j8851n6185L250k88n694k8921r549M5779
$$ y = [28265, -4518, -51958, -77129, -33302, -40227, -70880, -55620, -57727, -5044, 10971, 6760, 2907, -42585, -33748, -8324, 2351, -1355, -26895, -31613, -54140, -49275, -4012, 32868, 28164, 35713, 14209, 16779, -12627, -31586, 1643, 20204, 21787, 34687, 27642, -6162, 8132, -9638, -46725, 526, -3377, -17741, -25163, -44509, -51795, -63925, -41825, -990, -17022, -60853, -43101, 1044, -20630, -17849, -26275, -16788, 9050, 4106, -1480, -28684, -72871, -84148, -58953, -36240, -29461, -38725, -49120, -49964, -74951, -74949, -25594, -18411, -4586, -3696, -4006, -44700, -40268, -30620, -35807, -8153, -11047, -5284, -18211, -19627, 30507, 54141, -1885, -15301, 25670, 21879, 31416, 59797, 46828, 22646, 47286, 28435, -27750, -24500, -24788, -30482, -59403, -68952, -23173]
15189b3173M1891j4790m6169J9535k4016j4502K5839p025j7105M102K6416k720
15177c1717k5901l6557J0445J7894K9782J4459k873K705k1784J3575L3471J5142
15165A8641j0017M4115J6121m2581q648n1423k6722j063M7874L0682R67k7897
15153i951J0365J0090L5152K1538m1991j4354k1597l6878Q030K1843N2115k9862
15141D500k467R865j1065K1599l0380J7484k4552n1671L6868M0040J2134J2211
15129C4566J7255r423L829o382Q311j1801l5208K3153R96j529l7488l3192l811
15116e0724r947J9908J6522j1936R091J9848Q440k8628J9335J5227k7446L677
15104a6633K830r350p524K0451j8312m3596k8945M3633M8278j8535P679M4018
$$ y = [-23173, 18718, 3928, -42241, -22706, -46722, -61224, -35385, -42410, -59515, -55413, -28997, -31717, -57618, -94175, -83730, -65836, -36054, -21595, -24468, -21763, -43547, -29972, 3499, 18641, 8624, 52739, 68860, 26279, 17631, -33792, -60514, -61577, -13703, 16979, 17946, -9951, 414, 10504, 45656, 67194, 25203, 10849, -10748, -47626, -39596, -17753, 34362, 4500, 2033, 11898, 833, 22432, -7948, 9536, -15016, -66687, -29819, 10221, 22355, 34566, 51821, 42398, 46227, 39845, 48156, 36355, 1147, 24300, 25296, 23767, -13721, -46913, -50724, -60671, -40763, -24241, -36177, -27086, -7238, 1202, -27426, -8091, 7136, -20310, -16633, -13803, -23153, -30677, -10226, -28538, -72134, -101079, -57446, -9168, -27703, -20024, 23994]
15092B3994L6305n492j6785j8957N200l2803j3481l1747K3952K4500l487k605
15080a1406J4829R351j6334q395j096j2187k8320j8695L3185l026l8177K3560
15068e6711M243K4613M2366L0828K9974j2923l9781q035r012q050M521k3482m0425
15055f1874m2507M611L7229N8097k0655k027M13k4274j1876N870L6796k920j6475
15042c9592q641J9699L0417j149p330J623n3989j6826J5480L349L0962K2337j7026
15029b0686l479J059m103K7179j498p31L265J8J4995L131j5067j6968k94m2631
15015e5810n447J3292L9183K2915M741m1605j4597N9261J3832l8757l5878k0514
15003e9384J143Q534P778Q769J8610J1171K6490N0609j2715k649J3932l0867k5686
$$ y = [23994, 60299, 54807, 38022, 19065, 24265, -8538, -22019, -53766, -29814, -5314, -8801, -11406, 3423, 12774, -3560, -11955, -13051, -25238, -53558, -72253, -39068, -42094, -80271, -56711, -52468, -27855, 14511, 45339, 75313, 62390, 22609, 14574, 5562, -2488, 2033, -21449, -61874, -104381, -99770, -62541, -4444, -25099, -27126, -26713, -50987, -62863, -56993, -20197, -23117, -39592, -48233, -28534, 1883, 734, -6596, -4973, -58962, -75788, -60308, -56959, -25997, -3660, -20686, -24165, -23106, -27209, -30, -1528, -2259, 1006, 1024, 16019, 19150, 4083, -12885, -13179, -55810, -61257, -47965, -8782, 14133, 18874, -22731, -37328, 21933, 35765, -2992, -38870, -59384, -58241, -49707, -41929, -33160, -14550, -3379, 23111, 73720, 61005, 58356, 72288, 41421, 15735]
14990A5735j991K3717n260p7043j1028j8442k204k1676M6210K7583J0426m6081
14978f0054j5168J2005J7304o347k6637M0256N7788K9742l6259q565N607p685
14966A987P596k6088j3545J6305k1063L97O577N19J8341j932M888m32o832j6230
14952b9512l943k8171J3321L5062k662J3862K9731R551J3662k7238k5685J0393
14940H371K856J2047J3376n304O618L288J7182m05m4508j2604R714J6286k3245
14927C672o040J2055K008l0310o84o049J2046j8598j3200j1312k1316M7406M0163
14914I841P935k4829j6434k7987K7060L7932L157p186k0087j3335m163r339j5975
14901e3410J538J1061J1384J9415p421k5359P733k078L164l7860k3691J4016J1984
$$ y = [15735, 13744, 37461, 32201, -44842, -55870, -74312, -76516, -98192, -51982, -24399, -13973, -60054, -75222, -63217, -45913, -52260, -78897, -38641, 19147, 48889, 12630, 4065, 9672, 1987, 9583, -16505, -30050, -13745, -34808, -34411, -27834, -27315, -8974, -10906, -6018, -6450, -13282, -29512, -33455, -61626, -48305, -13243, -15905, -2043, 27688, 37239, 50901, 23663, -2022, 8371, 11227, 23274, 36650, 31346, 37964, 41252, 58434, 58029, 13521, 917, 10631, 26917, 3672, -2368, 9687, 11695, -18615, -19299, -25348, -13302, -31900, -45100, -56412, -77728, -30322, 9841, 17776, -7053, -23487, -51474, -24414, 13518, 16675, 9489, -10598, -23933, -28096, -37435, -53410, -51872, -40811, -29427, -10012, -17433, -42792, -35059, -37137, -33973, -71833, -95524, -81508, -69524]
14888f9524j0319L9991J6672p511K7535p00m6649m4060j0163N8416K6457j4770
14876c4625k4442K2539R660J0434K0275L7313j7725j5439K2670k6329l1716K5222
14864b163k2598l36K93k0274J9342L1353K6862j5445K3077j005k5831l2823k5189
14851d4737K5239J7354K2445N926m9n818j4733m494k905l802J7161l2566K0180
14838g99N3533q073n5695k5751j5373K7422L7229P872K7580j8762n8191l7041
14826f6049K0988K4273j4894K282N8361L3573j5155l5923l3669j6780k493j4649
14814f0135j9208M9626K9420J3899k0687j7804l4895Q638Q1294L2146m7670j2162
14802B462l4442j7870J6054N9511M0834k8483m0415J4926j6009J3339j3021l7928
$$ y = [-69524, -79843, -39852, -23180, -30691, -3156, -3856, -50505, -94565, -104728, -46312, -19855, -34625, -59067, -36528, -26868, -16434, 3841, 41154, 23429, 7990, 30660, 4331, -27385, -2163, -24761, -25097, -24804, -45078, -25736, 5617, 32479, 17034, 40111, 39106, 13275, -19548, -44737, -19498, -2144, 20301, 26227, 26178, 20360, 5627, 1133, -1772, -5574, 11587, -20979, -799, 52734, 44661, -11034, -36785, -52158, -24736, 12493, 20365, 47945, 29183, -29008, -66049, -45061, -20788, -35682, -33400, 24961, 58534, 43379, 7456, -26213, -42993, -45486, -60135, -79343, -29717, -297, 13602, -7085, -24889, -59784, -51146, 30148, 62294, 14624, 2462, -31980, -49850, -33796, 25715, 66549, 38066, -2349, 12577, -3432, 9907, -3114, -41042]
14790d1042K7295J2932l3148j7563k12L3045J8697p356J6700k3568K347J4570
14778B697L628j0252p627j7803j1400n793N9388p49K9267N3382l6239k8932q716
14765B0851J5660o935k5350J7455O03R401J584j6249j6977k4454m221j625K949
14752b7308K121L4913L1909J2041Q088k9051k1427j5745l3136j498K7286J4806
14740B999J1758k004J2893j9422l2062n6845l893L9298L0728K9117K334j8830
14728c929k1263l803L3008l2710k5282L3013M2516L2566m3193l0445k8350n658
14716e3530n393J2060k573l005L9975L118q461l1104k0782K5173M5447N9843q928
14703E1840m7453J8151k1786q111L7827q689k4988j0037K5677L5578j4000k6590
$$ y = [-41042, -13747, -815, -33963, -51526, -51738, -18693, 4, -7352, 9348, -14220, -11873, 2697, 6325, -3927, -11554, -29357, -40757, -46550, 12838, 12089, 41356, 94738, 58499, 29567, 20851, 36511, 29576, 4226, 21681, 22284, 31685, 33269, 17020, 43, -24411, -28632, -30257, -27308, -25187, 9726, 41635, 53676, 61764, 32713, 11286, -4459, -37595, -39093, -11807, 2999, 14757, 12753, 25646, 6224, -25838, -82683, -86576, -47278, -16550, 12567, 14901, -3929, -25192, -28995, 4013, -28697, -53979, -20966, 21550, 54116, 10923, -19522, -47872, -53530, -58923, -46863, -49436, -52441, -12466, -9348, -17809, -48913, -69695, -44522, 925, 60768, 51840, 4387, 22538, 752, -7359, 30468, 21779, -3209, -13246, 12431, 48009, 34009, 7419]
14691G419n3231L0205K9340J4131K5857k6554k1970k4962L805O0324Q265N72j270
14678E1931n9809o9962j571K5538Q647n510K8533j6582L178K5942N957M0858N125
14665D2275k1403J022k2793j4928o851Q129k1041J0095K5952k2861l8644l667
14653f4715K6568L1944J0561l4535o267L360j134j4611l852J0172J1252J5326
14641a5931L6771r440J9644P508K5510k181l6180j2446K322P45J7718o5054m7929
14628g8943K4973P996j3856j0451m968k409r372L4996J671L8163M1059K4766l5523
14615A8102J2249J3937P251J9773j8932k747J8975P266l5647n6290K4147K9179
14603C7263j0769P219k9600J0081n872j7801l2026j0093K9283k559m408L1152
$$ y = [7419, -45812, -15607, 13733, 27864, 53721, 27167, 5197, -19765, -15960, 44364, 52629, 53201, 51931, -7878, -77840, -79411, -53873, -45226, -50736, -22203, -38785, -35607, -9665, -3708, 37150, 42275, 20872, 21894, -899, -15827, -22678, -14549, -35590, -25495, 457, -22404, -61048, -64715, -38147, -6203, 4358, -30177, -36444, -33084, -34218, -48829, -52681, -42509, -31257, -15931, 20840, 11400, 31044, 38552, 64062, 61881, 25701, 13255, 15577, 16322, 34040, -31014, -78943, -53970, -45974, -59830, -70281, -75249, -77658, -87030, -52034, -50363, -12200, 28859, 53625, 18102, 30351, 44288, 51539, 71312, 52380, 49633, 68608, 75874, 40227, -16063, 8084, 37263, 26494, 33713, 4113, 14194, 8322, -9479, -41505, -51598, -22315, -24874, -29282, 1870]
14591A870K6004k1080L8009R806l8770Q923r491n2366n2870k3265M0230m403M2543
14578c4860J8316o454l8698k9180O360L2774P3373J6775l8506k7610o313M6749
14566A2726l3626l7139j2783L668K0772K8543K0043m3607j8661O068L6401K1413
14554C818R486j0129j8650P149J4883M296R41j1184R307K6973J9979n1098l6259
14541c0488L5379J5602p022k0163p12l4047j3972K0386K6448M4255K5673m8084
14529A3255j8338P086J57k989K1710j611J3200j3043l763N846j4700n1530k0244
14516f4964N834L0473J4740J0355p682n4110l5496J2884K7234Q7599P774N327
14504C9968m2693M541Q830j9321k768j0894j099O2213J1780k3176Q193j8146l8802
$$ y = [1870, 27874, 6794, 44803, 54609, 15839, 24762, 15271, -37095, -89965, -113230, -73000, -77403, -34860, -16544, -22998, -61696, -90876, -84516, -51742, 21631, 38406, -100, -27710, -34023, 12726, -20900, -58039, -70822, -67154, -46382, -17839, 2204, -41403, -60064, -53996, -17595, 3818, 13304, 3175, -15475, -8326, 6557, 10853, 11794, 610, 9917, 36890, 56869, 5771, -30488, 4891, 20493, 13471, -6692, -7404, -41451, -55423, -35037, -8589, 35666, 61339, 13255, -5083, 2003, 2160, -829, 20881, 19270, 32470, 19427, 15664, 21510, 6810, -44720, -64964, -59130, -28657, -13917, -3562, -11244, -65354, -100850, -87966, -60732, 26867, 34641, 39968, -2725, 1816, 10646, -8675, -11443, -22337, -23436, 38777, 50557, 27381, 35574, 17428, -21374]
14491b1374j3127L7466j6101m7397L1991K2851J7687k1830k2596j812K2140L6746
14479B4644m2991k1859N8585M3953R751k0187m4883K602J9355N42q908k2864r85
14466c245M7281J1576L516m5679j9387k477j4705l402j1690K9r12j1820j6716
14453f7631Q829l760J3988j9295M1015J0139q523K7161P589J6360j3906k0025
14441h059m2386M141J0638k1899P176j3455K5438O699l6326J7946k6942L3967
14429d3062L3456k4723k6064o598O630O1714K3037l2163R343K3844l5269k3592
14417c3447j081J9096j0858n8280n12K2524m344K7975J5162j815K3142L8880K623
14404C9065k6964k9904M634j114j0610P988M1859k4918o028J9731L194j6145O966
$$ y = [-21374, -34501, 2965, -13136, -60533, -28542, -5691, 11996, -9834, -32430, -34242, -12102, 24644, -18347, -40206, 18379, 62332, 72083, 51896, 7013, 9615, 28970, 29512, 20604, -2260, -3245, 44036, 55612, 59128, 13449, -5938, -8415, -23120, -26522, -38212, -38183, -39095, -50915, -67631, -58802, -62562, -48574, -67869, -26854, -16715, -25238, 1923, 9512, 25872, 11966, -8059, -50445, -46304, -35666, -57565, -50389, -63844, -38406, -31707, -68033, -50087, -77029, -43062, -9606, -34329, -60393, -66991, -60361, 1353, 24390, -7773, 1570, 25414, -9855, -33447, -34528, -15432, -26290, -84570, -85082, -62558, -66902, -38927, -23765, -25580, -2438, 36442, 39065, 12101, -17803, -13169, -14283, -24893, -16905, 24954, 36, -5992, 13739, 16933, 788, 7754]
14391G754o126j9018l5562K9100l9507m7860K7486M2004M436K007M438K6025o840
14378a1663k8449j235J6683M1712q908k5546N941l6709M845N1008n1259k1986
14366f5566M2395J3560k6323J4193N4947r145l4242k8471J9501O1003K2855j9142
14354D5565k6368k8411o418K295R121k9151m19J4012j341m930j9315K6467M9103
14341C0210L0360k3023j3040k0364l4178j4566R205J595J054M0300J0922J5529
14329C4004j2922l4505k7073K914J0249N0961j9053J9279J2184j0088j2082j9750
14317e882J718K4990L8955O241j8807l7425K0718n038j1743j8187n737L5546J877
14304B7226J3282R621k7505k5429K2164n037j1957J501j4413J9386N1221M248
$$ y = [7754, 1628, -17390, -52952, -23852, -63359, -111219, -83733, -41729, -37293, -35286, -30848, -4823, -11663, -40112, -41347, -24664, 17048, 8140, -17406, -11465, -48174, -43329, 7679, -43580, -65566, -23171, -9611, -35934, -21741, 33206, 24061, -10181, -38652, -19151, 41852, 64707, 45565, 19197, -9214, -15632, -13337, -4216, -33367, -33786, -19774, -21115, -26045, -45360, -18893, 30210, 60570, 37547, 24507, 4143, -30035, -44601, -35396, -33801, -32747, 7553, 18475, 34004, 21082, -13423, -40496, -37582, -27333, 23628, 4575, 23854, 36038, 25950, 13868, -5882, -4164, 20826, 59781, 66022, 47215, 9790, 30508, 25470, 13727, -4460, -10197, 25349, 27226, 40508, 50129, 22624, -2805, 19359, 14322, 2365, 3866, -10547, 8839, 60060, 64308]
14292F4308o5443l5017k689K5957M588j9898K0779Q659K9381K239l1426l349j1658
14279a3569J9671J292j8670l7532J3139J0752L0363k5088J7859K0504J771M2013
14267F2505m9664k3127M608k4154l8293L0761l387Q345K182J0677L982K5614M92
14254A0541j8592r507N7677Q493n8107j3746l059R707L7948r567k833j5521K6792
14241B0226J1086r217l146j572o502n902K3562j1902k3182k0793j4497L0858j3804
14228b4785l2596J6493J4162R675L385J6521j3456J6367K1914K2218m9547k5808
14216b5457K3281P887o4382M827K9774L2824m1217n777L4815j7617k7684M687
14204d4039J7932k1186l9951k6091J4396K9101K9391L1851p248p686J4126J0959
$$ y = [64308, -1135, -36152, -38841, -12884, -8296, -28194, -7415, 1244, 30625, 32864, 1438, -1911, -13569, 6102, 7394, -11276, -48808, -35669, -24917, 5446, -19642, -1783, 18721, 20492, 62505, 12841, -10286, -5678, -29832, -68125, -37364, -40751, -32406, -30224, -19547, -15565, 10049, 10541, -8051, -17558, 40119, 48612, -9495, -23241, -26300, -16593, 21355, 11788, 8955, -6566, 20226, 31312, 22095, 18949, 17377, 10875, 4973, 28535, 16633, -6549, -27342, -41839, -10981, -24785, -57381, -40888, -26726, -17051, -13666, 2855, -10601, 5766, 27680, 49898, 351, -25457, -2176, 5711, -58671, -53844, -24070, 8754, -32463, -38240, -3425, -21042, -48726, -44039, -26107, -47293, -87244, -113335, -98939, -69838, -40447, -8596, -15844, -23530, -9404, 1555]
14192A555K022j5883l4436k9274J3560P850R096o89k689l6949J911M0173j3388
14179e7141j9244K6350L8345j906L496j0355J0243J719N2621N4018j7172n6794
14167B4180l6266J6905j1376L1682m590P196P780j0595K9474j9663k5477K9492
14155C8742k6931O037n209J1247J6302L3190p266q820J141m5352q873J783n729
14142B62k3244j8729J6365L793M181j1464l3022K5184J2572K737j07P966J3975
14129D69j4508k6941m259M1470L418k6614L1970P930K8750L1130j3181l7264J7042
14116C9412J5717j8008l6080m525k3839K1040k6773K002l789k9374k3647J04O282
14103h1478L0051J6882l0m854k0382K7823L2912k9684L0002j658m142l9294K2244
$$ y = [1555, 3577, -12306, -46742, -76016, -62456, -54606, -45510, -46199, -48888, -85837, -83926, -43753, -57141, -76385, -50035, -11690, -13596, -10100, -20455, -10212, -8493, 44128, 98146, 80974, 24180, -12086, 4819, -6557, 25125, 20535, 27731, 35511, 24916, 54390, 34727, 9250, 38742, 11811, 17848, 12639, 23886, 40188, 73378, 66112, 57292, 58433, 13081, 4208, 5991, 262, -22982, -41711, -25346, -21553, -17372, -28836, -61858, -36674, -24102, -21365, -21472, -13506, 469, -14039, -40980, -45239, -3769, -351, -26965, 5005, 12935, 41685, 72815, 59634, 22370, 39412, 55129, 37121, 1041, -3484, -27323, -6283, -33056, -31054, -34843, -64217, -87864, -87760, -81478, -51427, -34545, -34575, -39429, -59811, -31988, 924, -28760, 1242, -416, -4558, -43852, -21608]
14090b1608K1233P062K0090J0953J1666p003n816j9005J3834k275J2003k6648
14078A4486N5r574M050J2006L455K6396l3243k6175K3425K077j1143r124j2501
14065a5810K3365M5271K2784M759k8628k3691n1249J3615M2921R797p293n1775
14053a5934o866J4478j3403m836Q788K9290K3933K3830l9266n9307j8757m431
14041f2481L9042K4873k3535P212K8988M9054J0358m6627J4868j6812l8569l6108
14029d9737m430q090R86L8618O0217k2507n791J4839n130l936p117j3027n6566
14016f1671k0208J3191L5486n656j584Q204M654J307K1578j3323K467J4807J3947
14003A3199N011K771k035k8835j0388K7568R403j3107l7693M860p711j38j3229
$$ y = [-21608, -375, 6687, 26777, 37730, 49396, 42393, 36577, 17572, 31406, 29131, 41134, 14486, 14541, 4967, 9017, 21023, 24478, 50874, 17631, -8544, 14881, 16958, 5815, -3309, -15810, 7555, 52826, 75610, 80369, 51741, 28050, -23199, -9584, 33337, 43134, 35841, -15934, -22800, -8322, -21725, -26561, -17773, 11517, 35450, 59280, 20014, -39293, -58050, -62481, -23439, 1434, -22101, -14889, 14099, 63153, 73511, 26884, 41752, 24940, -13629, -49737, -54167, -62257, -61271, -22653, 37564, 15057, 9266, 24105, 18975, 15039, 7922, -5105, -61671, -81879, -68688, -33202, -38858, -40442, -32238, -27584, -26277, -4699, -18022, -15555, -748, 13199, 18210, 20981, 18946, -9889, -20277, 7291, 16694, 3587, -34106, -29246, -36957, -37095, -50324]
13990e0324L6070J7169l900J8435N698l728K5253n242L713J1787K1157o645l3639
13977C5804k8317j9558j0960K7305J8280k0999l6435l1153k548k0164j1817L8865
13965f1697O8267j6501L3912J0231j641j013j5765m979M9374k5378k12j6153o165
13952A2280j0595K1219j9164n370Q980r081m7065n144N83J4521j4310l1755k263
13939h7164K0717K2655J2079J0454O2627Q771q54j7234k0898L576K8104K6827
13927F9660J9427P122J7891l966p2456l8737j2122K2637k5487K5516K6249l4574
13915A160m6900J9822M2591K4308l2793k3444J1128J4565K6699N032n26k9226
13903A2416J466J7134k408j7120J4550J3927l6728J6455k8617K3616j4478m6136
$$ y = [-50324, -14254, 2915, -985, 17450, 23148, 19420, 44673, 39431, 43144, 54931, 76088, 69443, 35804, 7487, -12071, -23031, 4274, 22554, 1555, -34880, -66033, -68581, -88745, -100562, -61697, 6570, -9931, 23981, 34212, 32571, 31558, 15793, 10814, 60188, 34810, 34598, 18445, 12280, 1685, 22904, 3740, -1630, 7350, -1731, -48796, -53940, -53357, -38836, -53146, -84901, -87164, -66447, -43792, -31713, -21259, 41368, 50139, 49285, 32051, 11153, 14729, 42833, 69660, 89087, 96209, 114100, 110134, 37678, -1059, -13181, 9456, -16031, 9485, 35734, 1160, -45740, -25918, 16673, 40981, 8188, -15256, -4128, 10437, 37136, 42168, 41642, 12416, 13882, 31016, 28608, 11488, 26038, 39965, 3237, 19692, -8925, 14691, 213, -45923]
13891d5923k5924j8658J3226M7103J0157m182O157j3943r802J0082O6771J9689
13879E4753n8283n0066K6450N16j2461j7926J371n542j4623k2034p629L3623M0232
13866c1619J59l1939J2674j1223k5579m5013k989N7722K0014j4905L215L9389
13854c0094k622K8160k985k0733m5037k8035P674J7652N0774J2796L2651R171
13842B9372K7233R98O08K667J0046J216k9239j8504k8519k6032K1293j2294J3434
13829g721M913K5211O915r777k9520k2475K6716L3884P990K2384l4151k8635j7373
13816b1639j6635q710K3397k3796J2546M5370J7937j2601q907m0309j0721J9030
13804b5038k035p221M6205J8239J160j3981P722j6425J7691o3138n0320J3074
$$ y = [-45923, -71847, -90505, -77279, -30176, -20019, -24201, -18044, -31987, -41789, -31707, 35064, 54753, -3530, -53596, -27146, -26630, -39091, -57017, -55646, -61188, -75811, -97845, -105474, -71851, -31619, -31460, -63399, -50725, -61948, -87527, -132540, -135529, -77807, -57793, -72698, -69483, -30094, -32716, -4556, -7541, -28274, -73311, -101346, -93672, -76020, -25246, -12450, 20201, 29372, 56605, 57603, 58211, 60878, 70924, 72140, 42901, 24397, -4122, -30154, -8861, -21155, -7721, -2808, 22403, 29318, 19541, -9979, -32454, -5738, 28146, 36136, 58520, 24369, -4266, -21639, -38274, -46984, -23587, -47383, -34837, 10533, 28470, 15869, 6962, -33347, -44068, -25038, -27073, -34294, 11911, 30150, 31310, 17329, 25051, 8626, 26317, -36821, -87141, -74067]
13792g4067L1442O6731J3724j7711j3863p1518R318L3559K6498m612M077l6974
13780c3396J2186L3617J8081K0650J6150m5430l5164r650n071L5059L1466l2603
13768E895m6113K3671j3538j0247P729l5577p20L7110J6253L599l655l8498M5489
13755h602K467k5324j4607Q907J1485k6068K3426P70k1454K8486J5499p410r37
13742a3362j3527p472m499k908J9452J7271j117k9245K4158J0688K1428L6203
13730E7070j2165n7561M233J0721J0385K7164K304n6953r726m74Q576J5439J6067
13717A5080O13K3683K3103l8864j0964L8413O281n3166j8587l3740Q103N581k9683
13704f4147M8461N2639j9134l6304k386K868J4527j381J2199l5058k3154p80l4992
$$ y = [-74067, -42625, 24106, 37830, 20119, 6256, -65262, -55944, -22385, 4113, -499, 3578, -33396, -21210, 12407, 30488, 51138, 67288, 21858, -13306, -22956, -28027, 7032, 38498, 5895, -40218, -16547, -30085, -40332, -32603, -68180, -68900, -31790, -15537, -11938, -15593, -54091, -8602, -6135, -31459, -46066, -37159, -25674, -51742, -28316, -27546, -49000, -20514, -5015, -12425, -13362, -26889, -34361, -38860, -41768, -22316, -5045, -6162, -35407, -11249, -561, 20867, 57070, 44905, -12656, -8423, 2298, 12683, 39847, 42151, -14802, -24528, -25002, -16426, -987, 15080, 15693, 39376, 62479, 23615, 12651, 51064, 57345, 4179, -14408, -48148, -40045, -34464, -64147, -15686, 36953, 17819, -18485, -20871, -18003, -3476, -4857, 7342, -27716, -50870, -51650, -86642]
13691h6642P559O6275L4145K7467l8085l7330j8302M7719K6816K0411o181k1138
13679B2714k9648N393k7612k4431J7393r836J0528J0816J9448J2556J060K3080
13667C1461O98j2710q184k5676m557J2375J3541K668j8118l7853J1645K5259q031
13654a7482k07o726N6168n050m6960j3577K7802J5670L0722j0784r966R883j3294
13641A6199j7713M8391L1472m7683p800N893k1251N146l127K0869M650j5625j7281
13628B140n317J1052j5383k0667q907N1007r876j1071K7671R238o530L719j495
13615B5581L3012l7049o3019j9393n681K0100N2862P925L6191K3804j1832j8082
13603D4419m9546j5246k4205j9866J5502L1185m040L6397k828l9555J8076L9788
$$ y = [-86642, -79083, -12808, 21337, 48804, 10719, -26611, -44913, 2806, 29622, 50033, 43852, 22714, -6934, -1541, -29153, -53584, -36191, -46027, -35499, -24683, -5235, 7321, 8381, 31461, 32159, 19449, 11265, -14411, -18968, -6593, 6948, 9616, -8502, -46355, -34710, -9451, -17482, -17689, -24415, 31753, 26703, -20257, -33834, -6032, 9638, 40360, 29576, 19610, 29493, 16199, -1514, 46877, 78349, 30666, 22866, 28759, 7508, 12654, 9527, 30396, 35046, 19421, 2140, -3177, 7875, -7508, -28175, -37082, 13925, 4049, -7022, 20649, 29887, 23357, 27076, 25581, 58593, 21544, -41475, -60868, -66549, -46449, 6413, 14338, 50529, 74333, 62501, 44419, -5127, -20373, -44578, -64444, -48942, -17757, -21797, 14600, 11772, -27783, -9707, 30081]
13591C0081j0023k4879l0124r54k7648L0920r288K2944L4722L7355j3894j4175
13579B5037L38k1448j8312k8373K4405o541j4152L8635M0020L6196j694k8712
13567D5399k8608n4792J777k3693k1482L8315K6572k447j7770M385N1595r14O436
13554B4773o751k9758o725M2419O959K1087J179n50l3099j1488l739j1048j2224
13541a8965j6771j1579P519K927l309j9964r242K0340K2284j4987r222m875k6265
13528h2109J4436j1018J136R895o438J6346M8595k283j2109L742N0897N893j5524
13515B1459k3228M468k5709m5912J6773K6561k7501J7888K735l5395P83n569m407
13502g7054J1123O7240p30q725K6202m328k0775L1592O3596j4876j0255L893j9166
$$ y = [30081, 20058, -4821, -34945, -35899, -63547, -32627, -41915, -18971, 15751, 53106, 39212, 25037, 25375, 3927, -14385, -42758, -18353, -24894, -39046, -411, 39609, 75805, 74111, 45399, 16791, -38001, -36224, -59917, -81399, -43084, -16512, -18959, -36729, -32344, 19251, 18337, 24773, 18022, -11736, -18461, 23958, 30917, 52004, 53183, 52633, 19534, 8046, 4307, -6741, -18965, -35736, -47315, -39796, -36869, -40178, -60142, -69384, -49044, -26760, -41747, -50969, -55844, -82109, -67673, -78691, -77555, -67660, -74098, -57752, -9157, -11440, -23549, -19807, 31090, 36983, 21459, -1769, 2699, -23010, -68922, -52149, -25588, -53089, -35201, -32466, -67861, -67078, -72647, -77054, -65931, 1309, 579, -8146, 18056, 13728, -7047, 24545, 88141, 73265, 63010, 66903, 47737]
13489D7737j2549j5249k1785l0994J3304J0164q115l0408J0129p86K3762J1921
13477b869K6332N920l6645o725L4942j2451k5794j2920M1089J6496J9945K8110
13465G5430k8460j0070l0879j4251p646j4276J0263J9797J505j4610K185J3675
13453B663J4833m213q826m639j3511k1472K4469N1578m6702N382M4035m7324k9771
13440c3498J8458k3977J5842K0913K4230M642q191k0786K5615R725j4096j9744
13428h67l464m9049k4332K378M3267k2978p7J7065m6405o019M1027O7771L7639
13415E5956J2636l7947o8916l1605M4608M7760j7142j2535J7307K9056j0297p949
13403B0932l116K0107K3478L2927n1993r247M3125o747r079K5383R246l9776k6269
$$ y = [47737, 35188, 19939, -1846, -32840, -19536, -9372, -17487, -47895, -37766, -38552, -14790, -2869, 23463, 29383, -7262, -13987, 20955, 8504, -17290, -30210, 10879, 27375, 47320, 75430, 46970, 36900, 6021, -8230, -15876, -30152, -19889, -92, 1413, -13197, -11012, 2663, 17496, 13283, 4457, -182, -13693, -35165, -10696, 40882, -5820, -438, 43597, -3727, -33498, -15040, -39017, -23175, -2262, 21968, 26610, 18419, -2367, 23248, 32973, 18877, -867, -4331, -53380, -77712, -75334, -32067, -55045, -55122, -38057, -84462, -90481, -49454, 18317, 55956, 68592, 30645, -38271, -69876, -25268, 22492, 5350, -7185, 10122, 39178, 28881, 20932, 17816, 37923, 61401, 94328, 42335, 33088, 76213, 69466, 60387, 85770, 95016, 55240, 28971]
13390B8971J0658J2604L285J2229j5453R603j297l0836n2440k3308O293J3881
13378b5810L1621L5429K6467J4085k9543r529l851J4080j5984k2301j978m504
13366H182p814o614J3520K0784l573r187j9091k0241K0612N177L6818M5265l839
13353G9999q814J4750K4385m5808m6768n9566O077L8493N0104l654k0858J6042
13341D4382N8179k2119k80Q060k0891k0130o0635l3787k7539p374N0047M0116
13329H029j5776K0269j5108K0111M685J7476K8570j9012k7365r794K6992k6186
13317A2891n0297M0699L5731Q188k8633l0255m528q970L9627K183l9785J4106
13305i043k0118Q084L674J2728L8301J740q468R319k1756j3689N018n88N923K5500
$$ y = [28971, 39629, 52233, 55518, 67747, 52294, 61897, 60600, 29764, -22676, -45984, -39691, -25810, 5811, 41240, 67707, 81792, 52249, 42720, 38869, 52949, 36965, 14664, 12686, 8182, 368, -6246, 7274, 28058, 24485, 15298, -3793, -24034, -3422, 1755, 38573, 83838, 79999, 71185, 85935, 110320, 64512, 17744, -41822, -35745, 2748, 52852, 49198, 28340, 44382, 102561, 80442, 80162, 88222, 67331, 47201, -13434, -47221, -74760, -82134, -32087, 8029, -7747, 12522, -2586, 17525, 22210, 39686, 68256, 49244, 21879, 12085, 39077, 12891, -37406, 3293, 39024, 47212, 18579, -11676, -16204, -25174, 14453, 16636, -23149, -9043, -29161, -21077, -17403, -4675, 33626, 35366, 26898, 36217, 14461, 772, 5790, 5202, 11125, 36625]
13291C6625K2022j6976j8013l5007l9933R555N2084J26K7614k6726j9627M0448
13279C2192m88J423p319j3654J2410R8q674k338j3036k1248R939M2624j844k0493
13265I592k9543Q029k2791K0688p608J2714K812k857P5841J5170k3514k6847j0567
13252B1119p3937k7270P599P477J5573L0243k3883K6809L3268P565K6259J5386
13240F6208J520j0236m5777m6421P400j694N1803L8969p6001O302L4660L616p05
13227B9644L2754L0740J1266m4606K679N519J4602J2325j5124m7249j5535O442
13215B3457J4765M853k3510j670k1625k7417J3602J7323q119J5158L1093j0604
13203B7306n9689L093L7229J6566K7859n042m772l4470R232L615p91r934M880
$$ y = [36625, 58647, 41671, 23658, -11349, -51282, -41727, 10357, 10483, 38097, 11371, -8256, 32192, 31704, 33127, 25808, 12154, 24564, 24662, 15988, 13650, 614, -20634, -10695, 31929, 30085, 9592, -19951, -11922, -34713, -14025, -21633, -8919, -6107, -8964, 66877, 82047, 58533, 31686, 21119, -52818, -80088, -72489, -65012, -49439, -19196, -43079, -16270, 16998, 24563, 50822, 66208, 67728, 57492, 11715, -34706, -27306, -29000, 22803, 61772, -14229, -7927, 26733, 30349, 29644, 62398, 93138, 104404, 59798, 62477, 67996, 82598, 94923, 79799, 32550, 17015, 23457, 38222, 43075, 19565, 17895, -3730, -31147, -17545, -222, -8341, 6817, 37910, 27306, -32383, -29290, 7939, 24505, 52364, 47322, 42550, 8080, 17312, 20927, 20136, 10202, 15082]
13190A5082J8238J569M902P086Q766L0772k8299m6007K1644J705k2843k5192m582
13177a7159j650J9483j8729l6042K4993K094J4800J5236j7500N616K284k0504
13165b7078N207j3966J6039O376j2049j9079l3084K9628N8213j7288l1544J1190
13153b7435M4837N2485J9019l6279O212l7835j1929m9351j3489K2768l0975K1997
13141c9975N4452M626k2362P252p773l0878R912J2846k0584l4096m597L4885J3554
13128b2738J9381K6401K3621J2040k7989m3514R917L1486J2100l0265m8251k101
13116c9912J1575J6321j5492L2489L4858j2808q748M1141J7042m4594j5144L3020
13104D9748L5588l2042l8273k0769N2167j7446o7537j4515J3194L6905N8526L143
$$ y = [15082, 33320, 34889, 39791, 46877, 55643, 86415, 58116, 12109, 33753, 35458, 12615, -12577, -17159, -18809, 674, -18055, -54097, -29104, -27010, -12210, 3026, -14474, -8858, -6574, -27078, -21871, -35837, -19798, -13422, -25471, -44550, -77634, -48006, 10207, -7081, -38625, -27435, 17402, 69887, 88906, 52627, 58839, 21004, 9075, -40276, -53765, -30997, -61972, -39975, 14477, 19103, -3259, 3993, -3780, -34658, -24746, -11900, -32484, -66580, -71177, -36292, -22738, -3357, 23044, 46665, 58705, 30716, -12798, -2881, 28605, 40705, 10440, -37811, -39912, -28337, -12016, -27508, 4981, 39839, 27031, 18283, 59424, 76466, 31872, 16728, 49748, 85336, 53294, 15021, -5748, 46419, 28973, -38564, -53079, -39885, -2980, 55546, 58689]
13092E8689m5481J4179L741l1812J0028P234L0494P474k7695o8157j631K0719
13080b2218j190L3157P688L1190j2605o788P091J8828N3947K1262l0065k2681
13068G7616r109K1084J7790j2949k0314r835K5630l555j3313J7633L6949j1305
13056A16322n7219k5318Q236J0140n8348p90k1238o039J8328j4541k2692M234
13044d8925L0093J2373J0287j3890N761L9488n565P08K4732k0426k0093R533L216
13031B7292N546J6142N6668j364k7953k6048l293j5808n153k7619R167J8157K808
13018B8542k24n189K1487L1483Q293k2509q067j8776j2473K7929K4910M091n644
13005G3853n2654J7436N703k0627L1556j3821k1661J2241O63J3978O088q782L3807
$$ y = [58689, 13208, 27387, 31128, -684, 9344, 16578, 47072, 54546, 26851, -41306, -42937, -22218, -23408, 9749, 17437, 48627, 36022, 29234, 36325, 55153, 109100, 130362, 100297, 77616, 68507, 89591, 107381, 94432, 74118, 64283, 89913, 86358, 73045, 90678, 127627, 116322, 59103, 33785, 42021, 52161, -6187, -6977, -28215, -34254, -15926, -30467, -53159, -48925, -18832, -6459, 3828, -10062, -4301, 35187, 29622, 30330, 55062, 34636, 14543, 24076, 27292, 32838, 48980, 105648, 104284, 76331, 50283, 46990, 31182, 26029, -1590, 7577, 25734, 28542, 28318, 23129, 44616, 76099, 84392, 61883, 53816, 35040, 22567, 50496, 75406, 79497, 73853, 21199, 38635, 44338, 23711, 55267, 41446, 19785, 32026, 32689, 46667, 52755, 43973, 77780]
12992G7780L4921l4587n5327r523j2308J0613O9602O3061j8970k1689k0628m5318
12980C7627m420J3537m866m3110J0448J8201K2564K2547j7400N744k1580n9465
12968b0173J5244P324k8500j6303K9710J3561K6148J1923J192j2998p546J1596
12956C1178n456K479l6568K893J0556L8609o043m84J2022R715K8597M3902j2025
12943A19375n3301K413L338l4321k6608j9703J3582O021P6362J8741j4851k430
12931H8618O3763k317r625n5134n2494k207J6802O2664N1835k2382j2031j8868
12919A08624k5942n8248k5893K8754J8914J5998j5692J0438n019J8009r910k9194
12907C0839l4704P386N8036N3351k6051J0745k0013n8652j8615N6366K2679l4783
$$ y = [77780, 112701, 78114, 22787, 13264, 956, 11569, 81171, 144232, 125262, 103573, 82945, 37627, 33207, 46744, 41878, -1232, 9216, 27417, 49981, 72528, 55128, 60872, 39292, -20173, -4929, 2395, -26105, -42408, -12698, 863, 27011, 38934, 40126, 27128, 19582, 31178, 25722, 28201, -8367, -5474, 5082, 43691, 37648, 37164, 49186, 58901, 87498, 131400, 119375, 66074, 68487, 71825, 37504, 10896, -8807, 4775, 10796, 87158, 105899, 91048, 88618, 152381, 150064, 140439, 85305, 32811, 30604, 47406, 110070, 161905, 139523, 127492, 108624, 82682, 24434, -1459, 27295, 46209, 62207, 46515, 56953, 51934, 69943, 60033, 30839, -3865, 3521, 61557, 114908, 88857, 99602, 79589, 20937, 2322, 58688, 81367, 46584]
12895D6584k561j0965J8422J9417r911L6155l070j6536k9999j8849k5978j0492
12883g783K1378P885L4941J0749l2010m8379k3035j3089M5296K9498L6488K675
12871F4614M037n5645l8808j0379j312j4217n286O121p293L1214J3877K1997K253
12858A1173R166J8784j4929l8139J2657j436m7280J1083K827J8828M1160j3797
12846A0097j3136k4577j0118l822K9308R628J3252K2241k5439o229j9332j7721
12834c5848J2936k8073K1453J3190R82K0101O9197k0924n445K27L2283j8603l6581
12821B4895q123L0688o12k3420k7812q346M035K4063N7154L6562k652j7831k1352
12808F7249k998k0236j1930j1509j5089K4667N5490J1789K1121M4990N342q122
$$ y = [46584, 44023, 33058, 51480, 70897, 60986, 97141, 94071, 77535, 47536, 28687, 2709, -7783, 13595, 21480, 56421, 67170, 35160, -13219, -36254, -49343, -4047, 25451, 61939, 64614, 68651, 13006, -25802, -36181, -37493, -51710, -56996, -50875, -58168, -26954, -13077, 8920, 11173, 20339, 39123, 24194, -13945, -1288, -2724, -50004, -38921, -36094, -17266, 23894, 10097, -3039, -27616, -37734, -41556, -12248, -2620, 10632, 32873, 7434, 1205, -18127, -35848, -22912, -50985, -29532, -16342, -15360, 4741, 73938, 53014, 47569, 47796, 80079, 61476, 24895, 16772, 47460, 46848, 23428, -4384, -12730, -8695, 15368, 72522, 109084, 106432, 88601, 67249, 64251, 44015, 32085, 20576, 5487, 30154, 85644, 97433, 118554, 163544, 168886, 160764]
12796A60764l8752m7219l7414K3453K743l960q957k6829Q00l805K8793J8967j4921
12783E3663j9254J9070l624k4232l6247O868N526J4837M9033K2265J8279L230
12771A09414j0596l6254K3007M3598l4610L320n8472r170M3815r608l3932j9435
12759A1077K2128M0684k791L4796m4K2622K9332o0502m9283j4823J2223m727n49
12746D0143k9748Q885L2128J8514k1397P099M3291j1788k7679L0259k2994k4635
12734D2078K892J4040J2917l0753n685K9172L5161O691K9810L2573m5473m8016
12722G5407l865K8068Q090l959K1690j9553r229k0312j6769l220J9483j7723o145
12709E1963M107L08L752j688J1088M632J4768j270J3350J4237J3990R499R929
$$ y = [160764, 122012, 74793, 37379, 60832, 63575, 59615, 50658, 23829, 24629, 20824, 49617, 68584, 53663, 34409, 53479, 49855, 25623, -10624, -3756, 1770, 16607, 65640, 87905, 106184, 109414, 98818, 62564, 85571, 129169, 94559, 97879, 39407, 30237, 74052, 64444, 30512, 11077, 33205, 73889, 71098, 105894, 105850, 128472, 157804, 97302, 48019, 33196, 45419, 40692, 40143, 10395, 19280, 51408, 69922, 48525, 55624, 98915, 87127, 59448, 89707, 66713, 42078, 44970, 59010, 71927, 41174, 35489, 64661, 99822, 106513, 136323, 168896, 123423, 75407, 71542, 99610, 107700, 103741, 125431, 105878, 96649, 76337, 59568, 56348, 75831, 58108, 51963, 56070, 56378, 60130, 58442, 69530, 74162, 88930, 87660, 101010, 115247, 129237, 138736, 148665]
12696A48665k5236k4365j1441k7559k414m422P673J8915J2652j0650O663N8079
12684A46560Q855m5492j2142j3402k5923j5432o874j9082O3516N6797J8911k6127
12672A30165k4431p90j6766J9363M4619o936m4503l5779J8617l3111M1539M776
12660I6763k8799k1916k7094J9646L9057K1422q476l462J0005k027j3508O190
12648H7801M067l306P498L6248K0938q3681m6050K7310k097J5998L7138J94k133
12635I9925p320j3074l3137k3645J0574R742K6453j0679J2136m852P725j9852
12623E3996j8000L2018R361n9757p091j4603K6573j598O279K7480J4451K7906
12611I7015K0230M0658K2785r574o5105J6317K4300J8451l250n7755o624J6302
$$ y = [148665, 123429, 99064, 87623, 60064, 57650, 53228, 60901, 79816, 92468, 81818, 88481, 146560, 155415, 109923, 97781, 84379, 58456, 43024, 36150, 17068, 80584, 137381, 156292, 130165, 105734, 104944, 88178, 107541, 152160, 145224, 100721, 64942, 83559, 50448, 91987, 96763, 67964, 46048, 18954, 38600, 77657, 99079, 90603, 87141, 97146, 95119, 81611, 87801, 91868, 88562, 96060, 132308, 153246, 69565, 23515, 50825, 48728, 64726, 101864, 102058, 99925, 92605, 79531, 46394, 22749, 33323, 43065, 69518, 58839, 70975, 66123, 73848, 53996, 35996, 68014, 77375, 17618, 10527, -4076, 22497, 20899, 27178, 54658, 69109, 97015, 117245, 157903, 180688, 171114, 106009, 122326, 146626, 165077, 161827, 104072, 97448, 113750]
12599A13750l9047k5112p174o822L3768L1401J6099M82l2051k0722J0579M6808
12587A21959j2824k4830P850j226l159j9122K4889K2568J2609k8732J1132L3357
12575A44471k6282m4682k1387N6373R333j3124O671j3883K4362M276L3699M640
12563A64467J7677j3495n5941K5777P6754n943r885Q490n236k177j3073k5932
12551A61483J7361J767j1658n0355k1117k2410K452L2685M1448J9287m345o460
12539A60138k676k100O463l1206k4768J825L2497K3168P029p880m7636n038L0776
12526A40592L6826N4029j1812l5339p497K1382R669l7750n8780j5591N0252L6685
12514A82666M4931j0164m9951J812J1176j2842j0443L659l4713j7771K1581M598
$$ y = [113750, 74703, 49591, 42417, 35595, 69363, 100764, 116863, 117345, 85294, 64572, 75151, 121959, 109135, 84305, 92155, 90929, 87770, 68648, 93537, 116105, 128714, 99982, 111114, 144471, 118189, 73507, 52120, 108493, 117826, 104702, 111373, 97490, 121852, 126128, 159827, 164467, 182144, 168649, 112708, 138485, 215239, 209296, 199411, 207901, 202665, 200488, 187415, 161483, 178844, 180611, 168953, 118598, 97481, 75071, 77523, 110208, 151656, 170943, 166598, 160138, 157462, 155362, 161825, 130619, 105851, 107676, 140173, 163341, 170370, 162490, 114854, 109816, 140592, 177418, 231447, 219635, 184296, 176799, 198181, 207850, 170100, 111320, 95729, 145981, 182666, 227597, 217433, 167482, 169294, 180470, 167628, 157185, 160844, 126131, 108360, 129941, 134539]
12502A34539j4219Q394K025j5459j5166J6877L888N1546K9950k47K3189n072l4415
12489A85830L156M299j2531K2171j2174k8485J5126M6409J6139j7205j2531q495
12477B01709K1392L4247j7314J1410r399o2161K3255K570N208Q881N401N390j7283
12464B13306l0476J8931j1354M1663n142l0993L9509M1020j1112l3871j057o072
12452B24352K476l605k6954J0494J294J284J5652L6346R717m4302O03P5288K5267
12439C27912k5191j8763o3894l7607J2535K5137K4118L0384J5000j4123j412l104
12427B70992j9063n155l3261J4809J0574R73P345q580k487l112N644j150N211
12414B42740J5006r897K5349L0647n5364j7782K0794J9632K4005N51j6102j7842
$$ y = [134539, 120320, 128714, 130739, 115280, 100114, 116991, 120879, 172425, 202375, 202128, 225317, 220245, 185830, 188986, 193285, 180754, 202925, 190751, 162266, 177392, 223801, 239940, 222735, 210204, 201709, 223101, 257348, 240034, 251444, 242045, 179884, 203139, 205709, 210917, 219798, 225199, 230589, 213306, 182830, 201761, 190407, 232070, 226928, 195935, 235444, 276464, 265352, 231481, 230424, 224352, 226828, 223223, 196269, 206763, 208057, 209341, 224993, 261339, 271056, 226754, 227357, 302645, 327912, 302721, 283958, 220064, 182457, 194992, 220129, 244247, 274631, 289631, 275508, 274096, 270992, 251929, 246774, 213513, 228322, 238896, 239869, 247214, 238634, 236147, 233035, 238679, 237529, 242740, 257746, 247849, 273198, 303845, 248481, 230699, 251493, 271125, 295130, 295681, 279579, 261737]
12402B61737l236j88L4111J6466k2883q79K2463j7342j1313J6333J2637m8060
12390B59846j3951l980m207j6811m718j627L8420M7690n328J750l4409j9126M6284
12377B89833N0122k1866o306J2534Q938L347O968J4276J1776O570J2375o620N5034
12364D36981J9387k4723K4664K5374o524M6359M688k6271m0563J0603j8525p7198
12352C74252R637O0202J4149k5775k088J391P350M1651k50K2356M4839j6996k9740
12339E00978j1425K2403O397K6189K0044k5406M511K3881q581l218l1563R075
12327E33285K3837J7919j7088M3338L3931M5476Q1841M5118R1928N589l3243j6992
12315H54939p4311k3867j5226l3294l1905m3917k3029j428q065J5655J336M0401
$$ y = [261737, 258501, 258313, 292424, 308890, 286007, 285128, 307591, 290249, 278936, 295269, 307906, 259846, 245895, 241915, 237708, 220897, 216179, 214552, 252972, 300662, 295334, 297084, 262675, 243549, 289833, 339955, 318089, 311783, 324317, 333255, 336602, 343570, 357846, 369622, 376192, 388567, 381947, 436981, 456368, 431645, 456309, 481683, 475159, 521518, 526206, 499935, 459372, 469975, 451450, 374252, 383889, 444091, 458240, 432465, 430377, 431768, 439118, 480769, 480519, 502875, 547714, 530718, 500978, 489553, 511956, 518353, 544542, 564586, 539180, 543691, 567572, 558991, 555773, 524210, 533285, 557122, 575041, 557953, 601291, 635222, 680698, 762539, 807657, 899585, 905174, 871931, 854939, 780628, 756761, 741535, 708241, 676336, 632419, 609390, 607962, 599897, 615552, 616888, 657289]
12303F57289j0985k8444l2932j2563J4717K4264k0051l775L9427l477l3953M920
12291E94437J3675L9687k730m8985P080r78J0846J4956K4514L864k5760K1249
12279F51855Q65k7431J3056J8882M9030L5625j4076o5891l59j6082m0883J8991
12267F23582K4284k1084k0242J1682J1904l3156K1227K2731l51P93k6175J4533
12255F29728n436k2906O427N9263L3400m5717K721j7990L073n591l83N9892K3859
12242G20340M3349j7231p504J6174M179m611K3465r415j1544R940j2473j4580
12230G40089M3994l1605k1403l1978M587N0520J8799J3734M3807L98M2944J8650
12218H92536k4284n126m710j3804L7031M6585j7371l7274J496K0783L0789M53
$$ y = [657289, 646304, 617860, 584928, 572365, 587082, 611346, 591295, 587520, 626947, 623470, 589517, 594437, 608112, 647799, 645069, 596084, 603164, 602186, 613032, 627988, 652502, 656366, 630606, 651855, 652720, 625289, 638345, 657227, 706257, 741882, 727806, 661915, 661556, 645474, 604591, 623582, 647866, 626782, 606540, 618222, 630126, 596970, 618197, 640928, 640577, 641370, 615195, 629728, 624292, 601386, 607813, 667076, 700476, 654759, 657480, 639490, 642563, 636972, 636589, 696481, 720340, 763689, 746458, 738954, 755128, 759307, 754696, 778161, 768746, 757202, 767142, 754669, 740089, 784083, 752478, 731075, 699097, 703684, 754204, 773003, 786737, 830544, 830942, 873886, 892536, 868252, 863126, 858416, 844612, 881643, 928228, 910857, 873583, 875079, 895862, 926651, 927104]
12206I27104J1474J9313K690r17k6365j1711L1412L3428J2048j130R479L7421
12194A044246k5082J3264j3261j1999L518K002K6361L586j7644j668Q1318N5400
12182A160041l7660j6943J0930N0339K4826j179J3716L6179J674k1902M9679J5745
12170A285445O202N1150P425j6383r192m3695k0699R449N8714M8630k6569K1566
12158A372043L5652J436J7259M3707O4975O2126K9562R003J9459L8588N8821O4784
12146A817415J09058J39306J80444K05235K45358K65682K14065L1170m4325j06936
12136C056472j69839j62066j53009j37500p6523k4925o9046o4228n6564m3273
12126B099499L5001j9968l1139K5894J8014n5188j5234J1762L987M2872M0291
$$ y = [927104, 938578, 957891, 960581, 959664, 933299, 921588, 953000, 986428, 998476, 997346, 1006825, 1044246, 1019164, 1032428, 1019167, 1007168, 1010686, 1012688, 1039049, 1042635, 1024991, 1023323, 1104641, 1160041, 1122381, 1105438, 1116368, 1166707, 1191533, 1190354, 1204070, 1240249, 1241923, 1220021, 1269700, 1285445, 1291647, 1342797, 1350222, 1333839, 1324647, 1280952, 1260253, 1269702, 1328416, 1377046, 1350477, 1372043, 1407695, 1409131, 1426390, 1470097, 1535072, 1597198, 1626760, 1635763, 1655222, 1693810, 1752631, 1817415, 1926473, 2065779, 2246223, 2451458, 2696816, 2962498, 3176563, 3207733, 3163408, 3056472, 2886633, 2724567, 2571558, 2434058, 2357535, 2332610, 2263564, 2199336, 2142772, 2099499, 2134500, 2114532, 2083393, 2109287, 2127301, 2072113, 2056879, 2068641, 2072628, 2115500, 2155791]
12115B155791K0550o735L3916K4408j453Q730M5004L0495N7614Q5071K2211j3410
12103B462192L4335K6692N2992K7237J2296N1102M1149K6244P5082L8128K6792
12092B874241K4312J2902K1129J21219J41268R6758J5207l6858l8688J8144j2618
12081C237016o429L9619N1709N5912L6939L1741J8264L6903N5831M4910L6910
12070C639325M5928M6947N5814L8313O4850J47035J5576r290P0910J03653N7376
12059D276437K9139O3267N9755P3134N1789L1594M6098Q9144P5807J07939N7174
12048D961277R5057R9919J16013J53162J83094J00171K4776J055J2715L28M3304
12037E790871Q4045J02754R8369Q2745O6990N4261K7838O5489J13422J13617O3232
$$ y = [2155791, 2176341, 2169606, 2203522, 2227930, 2226477, 2235207, 2280211, 2310706, 2368320, 2453391, 2475602, 2462192, 2496527, 2523219, 2576211, 2603448, 2615744, 2666846, 2707995, 2734239, 2809321, 2847449, 2874241, 2898553, 2911455, 2932584, 3053803, 3195071, 3291829, 3307036, 3270178, 3231490, 3249634, 3237016, 3230587, 3270206, 3321915, 3377827, 3414766, 3446507, 3464771, 3501674, 3557505, 3602415, 3639325, 3685253, 3732200, 3788014, 3826327, 3891177, 4038212, 4053788, 4044498, 4115408, 4219061, 4276437, 4305576, 4368843, 4428598, 4501732, 4553521, 4585115, 4631213, 4720357, 4796164, 4904103, 4961277, 5056334, 5156253, 5272266, 5425428, 5608522, 5708693, 5733469, 5734524, 5747239, 5747567, 5790871, 5874916, 5977670, 6076039, 6158784, 6225774, 6280035, 6307873, 6373362, 6486784, 6600401, 6663633]
12026F663633Q7176P4591J52423J05560P9829J33583J11471O8926R5307L4509
12016G607008M9757R0997R4416O1862J17543J43405J27296R2979Q7552O3806J00898
12005H637519Q7184O9964M4940P2060J09621J21552J11545P5124K9556L1734N2524
11994I443323L5678N6988O9766J29375Q3197J3549K9842J386L561M5364K6804
11983I938833L5006N6571M9218K7463J8304m331N553J8996j5807k5937R380M583
11971A0117832l46j8139k6316r280m8439k8289J5184L069j7528l4630k0474n5547
11959I877097k8094j619n6965q6575o9997q8021o0531q7341j25197j04247n8892
11948I109618p3918p9222j05653j13370q4609n8890j06129j06034r0016j15131
$$ y = [6663633, 6750809, 6825400, 6977823, 7083383, 7163212, 7296795, 7408266, 7477192, 7572499, 7607008, 7656765, 7747762, 7842178, 7904040, 8021583, 8164988, 8292284, 8385263, 8472815, 8536621, 8637519, 8724703, 8794667, 8839607, 8911667, 9021288, 9142840, 9254385, 9329509, 9359065, 9390799, 9443323, 9479001, 9535989, 9605755, 9735130, 9818327, 9831876, 9861718, 9863104, 9866665, 9912029, 9938833, 9973839, 10030410, 10079628, 10107091, 10125395, 10121064, 10126617, 10145613, 10129806, 10103869, 10113249, 10117832, 10117486, 10099347, 10073031, 10063751, 10015312, 9987023, 10002207, 10005276, 9987748, 9953118, 9932644, 9877097, 9849003, 9847384, 9790419, 9703844, 9633847, 9545826, 9485295, 9397954, 9272757, 9168510, 9109618, 9035700, 8956478, 8850825, 8737455, 8652846, 8593956, 8487827, 8381793, 8291777, 8176646]
11938H176646j02384p6849j29039r5094j05627j15557o9669r0458o4386n4830
11928G272753q4499j22813o2685o2050j09411j02899o0540q4052n0235r8971j26880
11917F307718j46915p8116l7786n5971p7644q8381m3017q1794q6901p8000r1886
11906E441307q7633j30843p2831l8807l5691q9645o2746r2510j01668o2143l5534
11895D631256k4538p2250j3678l543m9092p0298l1779q2256r9849r2095l1261
11884D060617j5277r790n4337o4740m7403j1098o1040n4950n6497p9678k1417
11873C584390m358m3205r2981l5979K9573K1671n0737o9788k1340n1562l0879
11862C234805k1069p5596j23395j19473q3781o3909l9269q9027n1889j5717J3068
$$ y = [8176646, 8074262, 7997413, 7868374, 7773280, 7667653, 7552096, 7482427, 7391969, 7327583, 7272753, 7188254, 7065441, 7002756, 6940706, 6831295, 6728396, 6667856, 6583804, 6533569, 6434598, 6307718, 6160803, 6082687, 6044901, 5988930, 5911286, 5822905, 5779888, 5698094, 5611193, 5533193, 5441307, 5353674, 5222831, 5150000, 5111193, 5075502, 4985857, 4923111, 4830601, 4728933, 4666790, 4631256, 4606718, 4534468, 4520790, 4517247, 4468155, 4397857, 4366078, 4283822, 4183973, 4091878, 4060617, 4045340, 4035550, 3981213, 3916473, 3869070, 3857972, 3796932, 3741982, 3685485, 3605807, 3584390, 3580032, 3536827, 3443846, 3407867, 3437440, 3459111, 3408374, 3338586, 3317246, 3265684, 3234805, 3213736, 3138140, 3014745, 2895272, 2811491, 2747582, 2708313, 2619286, 2567397, 2551680, 2564748]
11851B564748k0722k8132m5879j1404m524k8228j0006J657J4363k864n2281m7959
11839B328769m5544l6789L5752L6382L8258O7478Q092j3257L4998L4284J3062
11828B501485n4423r1640j40420m4249j680q1768m4366J037M5505J8550j6801
11817B091230o3292l0778m8335k6975j0611J7132l7364l4711Q569J1125j7029
11806A858961N062n6380m6932K9790K6723n1561j7206p656j4992j1077M5399O57
11794A760788k2939o9133n0402k941K8121L6862M9386K496p5881l7722l4990O664
11782A590309K6152L6052j5177J4279L0447n630L8193J2991o334J1182R829J208
11770A743501J4119L9440L8186P000P5329R8743J4636j1693j3159K1148L9504
$$ y = [2564748, 2544026, 2515894, 2470015, 2458611, 2454087, 2425859, 2415853, 2417510, 2431873, 2429009, 2376728, 2328769, 2283225, 2246436, 2282188, 2318570, 2356828, 2424306, 2432398, 2419141, 2454139, 2488423, 2501485, 2447062, 2355422, 2215002, 2170753, 2169073, 2087305, 2042939, 2043976, 2089481, 2108031, 2091230, 2027938, 1997160, 1948825, 1921850, 1911239, 1928371, 1891007, 1856296, 1864865, 1875990, 1858961, 1864023, 1807643, 1760711, 1790501, 1817224, 1765663, 1748457, 1740801, 1725809, 1714732, 1760131, 1760788, 1737849, 1668716, 1618314, 1615373, 1643494, 1680356, 1729742, 1732238, 1656357, 1618635, 1583645, 1590309, 1616461, 1652513, 1637336, 1651615, 1682062, 1676432, 1714625, 1727616, 1721282, 1732464, 1742293, 1743501, 1757620, 1797060, 1835246, 1842246, 1917575, 2016318, 2030954, 2019261, 2006102, 2027250, 2066754]
11759B066754L8799k4822M9125R0788Q4599K2273j6732M3009O6571N1081R6078
11748B567523J14897N7453P6025Q7755J14127J22964Q9870J39172K00854K06826
11738C777466K50466K46991K29250K29567K92406L00884L47502M06195M70063
11729F550790N15293O14157O51291P66790Q69795R69130J170991J285092J507098
11720A4900427J800883K141191K610535L200956M034592N112321O571218Q719125
11712D9091248J1798995J6159647K2489089L1622703M4186779N8923988O8057640
11705C02330089N5602423J5864981k6145820m9904685n7935083n4047442m3009059
11698A42755404l1355004k2368316j6174363j2000791r108243p049532n608585
$$ y = [2066754, 2105553, 2080731, 2129856, 2220644, 2305243, 2327516, 2310784, 2353793, 2420364, 2471445, 2567523, 2682420, 2739873, 2815898, 2903653, 3017780, 3140744, 3230614, 3369786, 3570640, 3777466, 4027932, 4274923, 4504173, 4733740, 5026146, 5327030, 5674532, 6080727, 6550790, 7066083, 7680240, 8331531, 9098321, 9968116, 10937246, 12108237, 13393329, 14900427, 16701310, 18842501, 21453036, 24653992, 28688584, 33800905, 40372123, 49091248, 60890243, 77049890, 99538979, 131161682, 175348461, 234272449, 302330089, 357932512, 373797493, 347651673, 297746988, 239811905, 185764463, 142755404, 111400400, 89032084, 72857721, 60856930, 51748687, 44699155, 39090570]
11691C9090570m627123l857373l200319k801565k448824k054026j752200j479770
11683A6869370j285136j157425j039328r69737q52821p48646o52515o20966n98051
11674H944745n19364m15487l93110l50797l26833l15352k84314k68959k14778
11665E855751k63265k52623k32842j96194j80088j90526j74554j67939j55841
11656D041879j14147j33282j47426j14190j08616j40509r4391q3110j05136j18279
11646B882793j36774m1948m4809r3206r5703n0201o1721m4955m5381m6234j1280
11635B210581p504j3848m0131l8910n9760l9253M0705n164k1925m155k3829n5946
11623A940861n6943k3551k1394j2819J1764j2800k3333p5050l7196Q85k5080q1761
$$ y = [39090570, 34463447, 30606074, 27405755, 24604190, 22155366, 20101340, 18349140, 16869370, 15584234, 14426809, 13387481, 12417744, 11564923, 10816277, 10163762, 9542796, 8944745, 8425381, 8009894, 7616784, 7265987, 6939154, 6623802, 6339488, 6070529, 5855751, 5592486, 5339863, 5107021, 4910827, 4730739, 4540213, 4365659, 4197720, 4041879, 3927732, 3794450, 3647024, 3532834, 3424218, 3283709, 3189318, 3106208, 3001072, 2882793, 2746019, 2704071, 2659262, 2566056, 2470353, 2420152, 2358431, 2313476, 2268095, 2221861, 2210581, 2203077, 2189229, 2149098, 2110188, 2050428, 2011175, 2051880, 2046716, 2024791, 2020636, 1996807, 1940861, 1883918, 1860367, 1838973, 1826154, 1837918, 1825118, 1801785, 1726735, 1689539, 1690424, 1665344, 1583583]
11611A583583k8125L5435K5816K0501O9229P7643M4561J425k5820q9106l9516
11600A675626J7569k5224j06381p6208m1892m9780l2887l4513m9597q232j5218
11589A253263j3011k7839m2972j8638l4255l8875r375j3452k7126j2597j7446
11578I97677Q755n033L2438m983k4828k9216k6732k827n945k0299p022l0231k1385
11565H60369K1890J2256l256l6333P448M6291P3472P4820P4920L3631K2947K8183
11553A216638n9891o8679j12155q7666j27197j23232j9189n1113m5632k7535m0043
11542D54306k39L2812K0933J1644Q178P1199K895j3895k1233o049m867l3442k4501
11529D97741l078k2400l9193J7300M4221k8533l0874L4170Q889k5764k3751k3276
$$ y = [1583583, 1555458, 1590893, 1616709, 1637210, 1706439, 1784082, 1828643, 1830068, 1804248, 1715142, 1675626, 1693195, 1667971, 1561590, 1485382, 1443490, 1393710, 1360823, 1326310, 1276713, 1268481, 1253263, 1240252, 1212413, 1169441, 1150803, 1116548, 1077673, 1068298, 1054846, 1027720, 1015123, 997677, 1006432, 1001399, 1033837, 1028854, 1004026, 974810, 948078, 945251, 939306, 919007, 911985, 881754, 860369, 882259, 894515, 891259, 854926, 862374, 908665, 982137, 1056957, 1131877, 1165508, 1188455, 1216638, 1156747, 1088068, 975913, 888247, 761050, 637818, 618629, 567516, 521884, 494349, 454306, 454067, 486879, 507812, 519456, 527634, 598833, 601728, 587833, 566600, 560551, 555684, 522242, 497741, 494663, 472263, 433070, 450370, 494591, 466058, 435184, 469354, 478243, 452479, 428728, 405452]
11517D05452M9956L2062P35M4564O3425J8568q529j7630m2353m9340n9982n9211
11505C77717k7219n679J1586L1356Q677N5508j0401J1718J6313l8282k0600q373
11493D02321q423K8469j2515k7255k895p368j2631P155J9418K3564Q475l2433
11481C85882l7035L3159M0361N157j1962j5287l1715k8506m7402j1309J1915M1440
11469C34698L9057j8374j5426N026J6480M1710n375N734J2846l78k6638m0787
11457C48573m1801j7766K2573l007K3032L2826M327j1825l2619K9400M526k3546
11445C34693l8390p751p524J9994K1636L8294K2333L346p2034m0792j5432K6728
11433B85101P4820k2678o2108k7072Q408N410J0602O3565K0597l864n2021m0235
$$ y = [405452, 455408, 487470, 488205, 532769, 596194, 614762, 606233, 588603, 546250, 496910, 436928, 377717, 350498, 344819, 356405, 387761, 396438, 451946, 441545, 453263, 469576, 431294, 410694, 402321, 393898, 422367, 409852, 382597, 379702, 372334, 359703, 366858, 386276, 409840, 418315, 385882, 348847, 382006, 422367, 427524, 415562, 400275, 368560, 340054, 292652, 281343, 293258, 334698, 373755, 355381, 339955, 344981, 361461, 403171, 397796, 403530, 416376, 415998, 389360, 348573, 306772, 289006, 311579, 308572, 331604, 364430, 368757, 356932, 324313, 353713, 358239, 334693, 296303, 288552, 281028, 301022, 322658, 360952, 383285, 386631, 314597, 273805, 258373, 285101, 359921, 337243, 275135, 248063, 256471, 261881, 272483, 336048, 356645, 352781, 300760, 260525]
11421B60525j912l7632J5417J0432p010l4826J4941J4780L2986N3057k3455n193
11409B92110j5678q059O073J4978k900j0268k2831M579j1070r828r491R672k770
11396B34517J9163M1925p267j5428j6068k5699K3015K1814l559k3790q010k6657
11384B13956k6680k1325j0029L0860M7056M2117l7709k5421J3899N042P825j0485
11372B29106l615p972k2756P143K4867r797R577L9940k8792o2297J4148L6863
11360B26415L2176r103l0911k0418J4545M2168K7972k5282j4822j3331l2934k5169
11348A71306K6714J4001k5133j8038K8818K2379Q493K3223K9771Q171n0681j0889
11336B28135k2080o503O607M648j7692M798L2204r898m9043m9131l590J4328K1099
$$ y = [260525, 258613, 220981, 236398, 246830, 239820, 204994, 219935, 234715, 267701, 320758, 297303, 292110, 276432, 268373, 274446, 289424, 286524, 276256, 253425, 258004, 246934, 237106, 227615, 237287, 234517, 253680, 295605, 288338, 272910, 256842, 231143, 254158, 275972, 272413, 248623, 240613, 213956, 187276, 165951, 155922, 186782, 233838, 275955, 238246, 212825, 226724, 231766, 239591, 229106, 225491, 217519, 194763, 201906, 226773, 216976, 226553, 266493, 237701, 175404, 189552, 226415, 258591, 249488, 218577, 198159, 212704, 254872, 282844, 257562, 242740, 229409, 196475, 171306, 198020, 212021, 186888, 168850, 197668, 220047, 228540, 251763, 281534, 289705, 239024, 228135, 206055, 199552, 206159, 210807, 193115, 197913, 230117, 220219, 171176, 122045, 118455, 132783, 153882]
11323A53882J90L4840J9892j4682k8957J414M1429K2783k0745l2947N682J2113
11311A94894l8896k2776J9251l1786J7915K3207L1628l9886m2427K2732L1071
11300A64927O491L0017k4737p903l927j0320P2583K1690l4314l5934l2245M848
11288A51176J4881J9579M274r699J4603L1733m875j7831j7422l7296N6429M0668
11276B46220M5865K9937M982N3507O7061O5360J04751J05198J30771J75649K27968
11265A257269K61336J89004M1850m9217j43248k22403k64317j63248j32024j35953
11255F39049p8434m3904o3311o9994j0599J6654q44r853k5729m5694n0595j1076
11243B45670k832j2486q506K6745l5971l9405p989R734j4933Q598J7139J6707
$$ y = [153882, 154072, 188912, 208804, 194122, 165165, 166579, 208008, 230791, 210046, 177099, 182781, 194894, 155998, 133222, 152473, 120687, 138602, 161809, 193437, 153551, 111124, 133856, 164927, 171418, 201435, 176698, 168795, 164868, 154548, 227131, 248821, 214507, 178573, 146328, 151176, 166057, 185636, 189910, 180211, 194814, 226547, 221672, 203841, 186419, 149123, 205552, 246220, 292085, 322022, 327004, 380511, 447572, 512932, 617683, 722881, 853652, 1029301, 1257269, 1518605, 1707609, 1749459, 1700242, 1556994, 1334591, 1070274, 907026, 775002, 639049, 560615, 516711, 453400, 383406, 372807, 389461, 388617, 378764, 353035, 307341, 256746, 245670, 242838, 230352, 221846, 248591, 212620, 173215, 165226, 174960, 160027, 168625, 185764, 202471]
11231B02471J2105J7075m1534m5110k0860l0430j9751K4115O6903L5386k0837
11220A79533k8522R262j1294j0390m076J29q439M086j5350n332k7737j0875J5529
11207H6524l842J5298N382l2846l159J4699j092M8182J4517J3174j8106l3205
11195A05526L0313k2247m2341k0649K9613K5605K5981J8293k806J013q665m0142
11183I9494o283L2512L1013l151k3715K9463K3698J2233j7238l0095L192j3948
11171A37175m0209j5932Q89j1590n3349M1275M3756K3697k3926J5760k1412j7377
11159G8757J1972r858K8757K0395o120L2842m536m951J8295j9714K340l7206j7165
11146I3808Q574J0680k5565l855J3749j2986l7348J5025L1130N569l2698J7673
$$ y = [202471, 214576, 231651, 190117, 145007, 124147, 93717, 73966, 98081, 164984, 200370, 179533, 151011, 160273, 148979, 138589, 134513, 134642, 126203, 130289, 114939, 109607, 81870, 70995, 86524, 82682, 97980, 103362, 70516, 67357, 82056, 80964, 129146, 143663, 156837, 138731, 105526, 135839, 113592, 71251, 50602, 80215, 105820, 131801, 150094, 147288, 148301, 139636, 99494, 93211, 125723, 156736, 153585, 129870, 159333, 183031, 195264, 178026, 147931, 151123, 137175, 96966, 81034, 81923, 70333, 16984, 58259, 102015, 125712, 101786, 117546, 96134, 78757, 90729, 80871, 109628, 130023, 123903, 156745, 152209, 147258, 165553, 145839, 148179, 110973, 93808, 102382, 113062, 87497, 83642, 97391, 84405, 47057, 62082, 93212, 98781, 66083, 83756]
11134H3756j85l3015M5300L0653k4763j326K3032p83O039k5441k6120o224q793
11121F2130K1898Q700m2321J2826m377j4594K7995J1229J9415J8959J956j8534
11109A05282M1119k2794o3900k6770J2193r162J159L2221J178l8506J5257L9182
11097H6459j769p142l9933r59M4532J3229k1906Q961K6094K250k0734J04J4158
11084A03344k7172n3451q919M7032K5714M2887J4868l3821j3342L5611K3947l055
11072A53643m2003J4036p002l8502m7423K0271L0368L2313L033l2627n181J2832
11060I3758L1432l845k4215j6526j0462l0623J9757N3456p734N209L6168K2159
11048A68534k7074k0544n9363k9015o572M30L6669M1758M0418R082O986k5607
$$ y = [83756, 83571, 50556, 95856, 126509, 101746, 100420, 123452, 122669, 128708, 103267, 77147, 70923, 62130, 84028, 92728, 50407, 63233, 58856, 44262, 72257, 83486, 102901, 121860, 123816, 105282, 146401, 123607, 59707, 32937, 45130, 35968, 37127, 69348, 70526, 32020, 47277, 86459, 84690, 77548, 37615, 36656, 81188, 94417, 72511, 81472, 107566, 109816, 89082, 89186, 103344, 76172, 22721, 13802, 60834, 86548, 129435, 144303, 110482, 97140, 132751, 156698, 153643, 111640, 125676, 118674, 80172, 32749, 53020, 83388, 115701, 118734, 86107, 80926, 93758, 125190, 121345, 97130, 80604, 70142, 39519, 59276, 112732, 104998, 110207, 146375, 168534, 141460, 120916, 61553, 32538, 25966, 26396, 63065, 104823, 145241, 154323, 161309, 135702]
11036A35702L2666p205J4735k0422j2544j0167J7556L5997L1648K3632K4111J8863
11024B84572L019j8966M699N77j3359j4609K2109j3377N677K3830J8615N6154
11012C58941K6970j7638j6074m9063l2936p790R397k0313P352L0664j2709p716
11000B69085k7309j22N899K4546q820k8374r516k1044k9159J6085J5118l2826
10988A73563k1045l8996l1967J3715r639K5989K5191m049k6224j0714m002N268
10976I7090N2512L0532m2312l2606L762j926K595K843N159k2129l2084l2109k6166
10963E161j045M3069k555J7946L5089L503k7840k870m4132r845K2916j2804m6175
10950a9582J0271J8223P258J9674J93K1422L327k0951k185r072M7447j0576k6423
$$ y = [135702, 168368, 161163, 175898, 155476, 142932, 132765, 150321, 186318, 217966, 241598, 265709, 284572, 287591, 268625, 273324, 273901, 260542, 245933, 268042, 254665, 260342, 284172, 302787, 358941, 385911, 368273, 352199, 303136, 270200, 262410, 271807, 251494, 258846, 289510, 276801, 269085, 241776, 241654, 247553, 272099, 263279, 234905, 225389, 204345, 175186, 191271, 206389, 173563, 152518, 113522, 81555, 95270, 85631, 111620, 136811, 132762, 106538, 95824, 91822, 97090, 149602, 180134, 137822, 105216, 108978, 107052, 109647, 112490, 117649, 95520, 63436, 31327, 5161, 4116, 47185, 44630, 62576, 97665, 101168, 73328, 70458, 26326, 16481, 39397, 26593, -19582, -9311, 8912, 16170, 35844, 36037, 57459, 60786, 39835, 37650, 28578, 76025, 65449, 39026]
10937C9026J8297n0953K4210J0860J676N827K0594k4130j7734j2039o014M6242
10925E5862j5556k2354N3947L6722j5920k3076m6779q362K493k5765L639j1031
10913a6180K8843Q0721K0714j9103m5878p040K1284j1119L2533J3999j3210J6015
10901A01579K31m2629j2571L9927J7203n9959o4442k0507M0658M9225N67l0656
10889A8626k7492p454N226K4243K1423K8129j8068Q926N8168J0875k0514k1884
10877H0204l3237M500L6612K207j6069P812J9646Q234j6843m4358L0706L0826
10865A10240l864m4593j8122J0639r923k1218n913l8361l5755J0481J0025K508
10853c3856J8831J3608K6150L3299J281q991k5036K2594J7326m1175J7808o731
$$ y = [39026, 57323, 6370, 30580, 41440, 43116, 48943, 69537, 45407, 27673, 15634, 9620, 55862, 40306, 17952, 71899, 108621, 92701, 69625, 22846, 14484, 16977, -8788, -5149, -16180, 12663, 93384, 114098, 94995, 49117, 42077, 63361, 52242, 84775, 98774, 85564, 101579, 101810, 59181, 46610, 86537, 103740, 43781, -20661, -41168, -510, 48715, 49282, 18626, -8866, -16320, -11094, 13149, 34572, 62701, 44633, 53559, 111727, 122602, 102088, 80204, 46967, 51467, 88079, 90286, 74217, 82029, 101675, 109909, 93066, 48708, 79414, 110240, 106376, 61783, 43661, 54300, 44377, 23159, 17246, -21115, -56870, -46389, -36364, -33856, -15025, -1417, 24733, 58032, 59313, 50322, 25286, 47880, 65206, 24031, 41839, 35108]
10841C5108l0127M4069N0748N323l9636n3889L4337Q776M074j1261j8675n404
10829B3443k8582P530M1441M5678k2792o7828m1425Q53K5220J8531L4437l0835
10817E671j2406L0321L2968J1905o3617j9210M0211L7994k5349l4504M36j0274
10805e854K5621p684J5640J8104n386j9066N37J0707P280q195L370K0719k7104
10792B8689m1429N5526J1641k1715k7004n199l3679k1512M1929L6817k8161K5072
10780B0975K8102j8664Q437L4792j9848k3644j8187q300N5025L9049l2442J7585
10768H2880O4045j8340m2645J6169N5179o675o7781n1082j4451L9206J4806J6336
10756H7647m071K6654J7032m9434L8041N1511k6572j676n5648m8921l628K7107
$$ y = [35108, 4981, 49050, 99798, 105121, 65485, 11596, 45933, 54709, 58783, 47522, 28847, 23443, -5139, 2391, 43832, 89510, 66718, -1110, -42535, -41682, -16462, 2069, 36506, 5671, -6735, 23586, 56554, 68459, 4842, -14368, 25843, 63837, 38488, 3984, 4420, -5854, 19767, 12083, 27723, 45827, 40441, 21375, 21912, 32619, 39899, 31704, 35074, 55793, 28689, -12740, 42786, 54427, 32712, 5708, 509, -33170, -54682, -12753, 24064, -4097, 20975, 49077, 30413, 38850, 73642, 53794, 30150, 11963, 3663, 58688, 97737, 65295, 82880, 146925, 128585, 85940, 102109, 157288, 150613, 82832, 31750, 17299, 56505, 71311, 87647, 83576, 110230, 127262, 77828, 115869, 167380, 140808, 139132, 83484, 34563, 30935, 58042]
10744E8042j28J1252K7500n797k2383j0728J0693o0789j3067K5342q728j4775
10732c566K7775l395L968p873K307j3454m4029m3752l6732N3305N1187L7767K695
10719B6203M1955J4149N674l622k2145k2166j5086l2588K3244k836N251Q585j4124
10706A2494J677j8485J2014K3004m672K5995K7903J147j0070m0144j1065J3384
10694C3182J8400M1181R361n2499j6296M3283L2311k9360p472j3014j7289k023
10682C9765K7745r611n3086l1571K6003J7446m685K4569L4622J0196N649j0245
10670G6797k5700m889l352K7390j7247J1751J9207K774k0017l5885l3944N0475
10658D7360M1092k5179N667O0400k2062O691L6883L9519K8299J056K4271K828
$$ y = [58042, 57914, 69166, 96666, 90869, 68486, 57758, 68451, 7662, -5405, 19937, 11209, -3566, 24209, 20814, 24782, 16909, 19216, 5762, -38267, -82019, -118751, -65446, -14259, 23508, 26203, 68158, 82307, 87981, 84359, 62214, 40048, 24962, -7626, 15618, 12782, 18033, 26618, 12494, 14171, -4314, 7700, 30704, 26032, 52027, 79930, 81077, 71007, 30863, 19798, 33182, 51582, 92763, 102124, 49625, 33329, 76612, 108923, 79563, 72091, 59077, 41788, 39765, 67510, 57899, 4813, -26758, -755, 16691, 12006, 36575, 71197, 81393, 87042, 76797, 51097, 46208, 42856, 70246, 52999, 64750, 83957, 86731, 66714, 30829, -3115, 47360, 88452, 63273, 68940, 129340, 107278, 113969, 150852, 190371, 218670, 219726, 243997, 246825]
10646B46825p7185l6199N098R324K3568P2893L3498r862k5289l895K570R166K8150
10633B78662J6355L0240O3461M8513O4685P8988O7020Q1807Q7930Q7631N7702
10622I62994R1129R2567J37302J48818K27415L09862L44557L97250N89498Q29669
10612D131061J134133J553771K035757K570190K797582K363726J345764K78813
10604A8210797l93614o25512m13034K50228J174205K363588L771889N069317N602907
10595C5010771M332947J541241j145357k632999k979923k289334r04816Q33976
10587C1766506K800625M794788O543197O871680M468523J9676l737753n681339
10579D7845903n941681n010769l308626j339576M45580K133496L359372L362518
$$ y = [246825, 169640, 133441, 138539, 147863, 171431, 244324, 277822, 267960, 242671, 238776, 241346, 250512, 278662, 295017, 325257, 388718, 437231, 501916, 580904, 647924, 729731, 817661, 905292, 962994, 1054123, 1146690, 1283992, 1432810, 1660225, 1970087, 2314644, 2711894, 3301392, 4131061, 5265194, 6818965, 8854722, 11424912, 14222494, 16586220, 17931984, 18210797, 17817183, 17191671, 16778637, 17028865, 18203070, 20566658, 24338547, 29407864, 35010771, 39343718, 40884959, 39739602, 37106603, 34126680, 31837346, 30932530, 31766506, 34567131, 39361919, 45905116, 52776796, 57245319, 57264995, 53527242, 47845903, 41904222, 36893453, 33584827, 32245251, 32690831, 34824327, 38183699, 41546217]
10571D1546217J440296j542565l857496m900666m835979m040374k796483j535696
10563A9477254n13060K80575P28094O02266k30416j390839k225889k621500k561727
10554A1544758k217313j764703j315849r86103p36027n77432m66533l43992k58237
10545B878569k42678k50527k04049j81822j38892j16539j22124r8610j02248j23006
10535A298074r6183k5621o6762p4738n1501p2382k9284m4336o6372J178m7882
10524G24191p0716l0389J8600l0933K1730o556m1685m3366l042K4063l2672l0008
10512D99217n4440o885J541k357j6553m0939k7920K311j3963j1029l5283j1645
10500B82055K4841P519L9219j1707j7305l46K6831J318k9109o1003j1799J3512
$$ y = [41546217, 42986513, 41443948, 37586452, 32685786, 27849807, 23809433, 21012950, 19477254, 18964194, 19244769, 19972863, 20575129, 20344713, 18953874, 16727985, 14106485, 11544758, 9327445, 7562742, 6246893, 5260790, 4524763, 3947331, 3480798, 3136806, 2878569, 2635891, 2385364, 2181315, 1999493, 1860601, 1744062, 1621938, 1523328, 1421080, 1298074, 1201891, 1176270, 1109508, 1034770, 983269, 910887, 881603, 837267, 770895, 772073, 724191, 653475, 623086, 641686, 610753, 632483, 625927, 584242, 540876, 537834, 561897, 529225, 499217, 444777, 437892, 439433, 437076, 420523, 379584, 351664, 353975, 340012, 328983, 293700, 282055, 306896, 314415, 353634, 341927, 324622, 324276, 351107, 352425, 323316, 262313, 250514, 264026]
10488B64026Q891r5J4850K158q980m1741l7045J7170j6998j0030K8274J9697q644
10475B31533M963j7152n6490j7909O968M2678J5558K6820j6116l1447j2771K5202
10463B01837P737j9422m3191l11J7775M0775N374P090J6242k4197k3400P508J0017
10450B03834K8743M2119q788n1817r0O77L28Q736k242p672j0986j0458N703l1350
10436A66737l0792J0206j965j5163l72j0614K7131q336k6894K2598L1783J4157
10424A78476k7890l3776j1023J4196j0092j6600J3189J0732m3221J7762L0824
10413A22577k08l707j3466j9822L599m8851k7480J5557K1980J9537o997M1081
10401A03800n849K863m923q431j3548J4859L095m2206L7035k921k5867l406K3551
$$ y = [264026, 272917, 272822, 287672, 289830, 280850, 239109, 202064, 219234, 202236, 192206, 220480, 240177, 231533, 236496, 219344, 162854, 144945, 151913, 194591, 210149, 236969, 220853, 189406, 176635, 201837, 209574, 190152, 146961, 146650, 164425, 205200, 210574, 217664, 233906, 209709, 186309, 193817, 203834, 232577, 274696, 265908, 214091, 214001, 214678, 215006, 223742, 221500, 213828, 202842, 192384, 198087, 166737, 135945, 146151, 144186, 129023, 128651, 118037, 145168, 136832, 109938, 132536, 164319, 178476, 150586, 116810, 105787, 119983, 109891, 93291, 106480, 117212, 73991, 91753, 122577, 122369, 118662, 105196, 85374, 88973, 40122, 12642, 28199, 50179, 69716, 62719, 103800, 97951, 100814, 95891, 87460, 73912, 88771, 91866, 49660, 86695, 83774, 57907, 54501, 78052]
10388G8052K4550K6346J274m0022q710K3041K5927k8363j0474k4835k506K1762
10376H6042L3965k323j7756l7528o802M9022J1278J2629K3103k2917j1954n707
10364A11052L626l3904m4832j076N9077k1602Q634L3466r775J4368k3253k7548
10352F8233j5852j130J8904K3761N4594J7384m4776J9275j4731j4476k6696k241
10340H2249J1529k3927O499Q954J3735K0274J6473l5359l4521l2415J6611p636
10328D2466j5590R269K568k758J8225J1909k7248m038o797Q403P886L1090m527
10315G0858L4657r184m0493K6032M8027j2650l2971P517K3780M536l7445k8301
10303E4363K4737L9466k6428m0009j8792j7924k0384l673L5516J6867j6013O1578
$$ y = [78052, 102602, 128948, 130222, 90200, 81490, 104531, 130458, 102095, 91621, 66786, 64280, 86042, 120007, 117684, 99928, 62400, 55598, 104620, 115898, 128527, 151630, 128713, 116759, 111052, 114678, 80774, 35942, 34866, 93943, 72341, 80975, 114441, 104666, 119034, 95781, 68233, 52381, 51251, 70155, 93916, 148510, 165894, 121118, 140393, 125662, 111186, 84490, 82249, 93778, 69851, 76350, 85304, 99039, 119313, 135786, 100427, 65906, 33491, 50102, 42466, 26876, 36145, 38713, 35955, 54180, 66089, 38841, 34803, 28006, 36409, 44295, 75385, 70858, 105515, 96331, 55838, 81870, 129897, 117247, 84276, 91793, 115573, 120109, 82664, 54363, 79100, 118566, 92138, 52129, 33337, 15413, -4971, -8644, 26872, 43739, 27726, 89304]
10291H9304L4869j1897k6121M880j5280M031l0066j1048J9506n6822k5913m67
10279b5024L2491K7558K2935N198l9228o818J6611j8698k2736K2657J1737m528
10267B2155j1329r544N2920K9450j9799n0458k6846r484K7725O2268R434j8245
10255E8247k1727j4757o419K5980q607k3304L244L746l489k2134L1715j1088m101
10242G306q640m193J5362L0071p113j6746k5862k2296M6217O5069j4866l0948
10230C3361j8243O306N1291J3789l4048J1485p97L23l6512M447J5720j720P145
10217E2547R36k0996J4897k1737M460N6613j3045k0840l5455j4589M1499K1417
10205F5707k9421m3205k5659M1548R896R059j1650P424M4186K3126j5955l775
$$ y = [89304, 124173, 112276, 86155, 91035, 75755, 79786, 49720, 38672, 58178, 1356, -24557, -25024, 7467, 35025, 57960, 63158, 23930, 17112, 33723, 15025, -7711, 14946, 26683, 22155, 10826, 1282, 54202, 83652, 63853, 13395, -13451, -22935, 4790, 67058, 76492, 58247, 36520, 21763, 15344, 41324, 32717, 9413, 12657, 16403, 12914, -9220, 22495, 11407, 7306, -1334, -5527, 9835, 39906, 32793, 16047, -9815, -32111, 14106, 79175, 64309, 33361, 15118, 21424, 72715, 86504, 52456, 63941, 63144, 63467, 26955, 31402, 47122, 45402, 52547, 53483, 32487, 47384, 25647, 30107, 86720, 73675, 52835, 17380, 2791, 44290, 65707, 36286, -6919, -32578, 8970, 18866, 27925, 16275, 23699, 67885, 91011, 75056, 71281]
10193G1281r90P167n8819R948J7062L1279K3084J0300r141j843k086j8863l981
10180G4398K9470K1672J3229J94j6317l6841m3296j8353K1544R582M6053J7718
10168A19053j2699k367k2265j205M1793J4310j0111L4728L8556L1481M8264j2075
10156B67463q489l09N19k9919l7252J0441j3113K718N9731K0262K3610K4984j0560
10143C10086j6215k8786j7177L751L5156n0258k7704J2520K672Q985J2281j7660
10131B27651m770k9105J1122Q98p847k9781J4784j3992j5712k3046P287J1642
10119A49131n2852m4112j874L387J6889l5237j0035K6531Q945M7066L10n1545
10107E6604j6411P214k3710K9139j5477m3851k3937N026j4864L0710K6598M2219
$$ y = [71281, 70291, 77458, 18639, 28587, 45649, 76928, 100012, 110312, 101171, 99328, 97242, 78379, 74398, 103868, 125540, 138769, 138963, 122646, 85805, 42509, 24156, 45700, 55282, 101335, 119053, 106354, 103987, 81722, 80517, 122310, 136620, 126509, 161237, 199793, 231274, 279538, 267463, 258974, 258665, 259184, 229265, 192013, 202454, 189341, 192059, 251790, 272052, 295662, 320646, 310086, 293871, 265085, 247908, 251659, 286815, 236557, 208853, 221373, 224045, 233030, 245311, 227651, 222881, 193776, 204898, 205796, 197949, 168168, 182952, 168960, 153248, 130202, 137489, 149131, 96279, 52167, 50293, 53680, 70569, 35332, 25297, 51828, 60773, 107839, 108149, 56604, 40193, 47407, 23697, 52836, 37359, -6492, -30429, -25403, -40267, -9557, 17041, 59260]
10095E9260J8237J6797J5056K0689j7457l6127j4644k7082k220j2654K1859J3660
10083E5374J221l1590l4431K7936K4181M2444R991m7540K5729K059p461M0449
10071A08362J970k6255k2932L0655J1733j9959k7565j5376k5493j3m7362l7913
10059g0148J0490L9921M0231L4084k483K4315J8016k2976l3295j7908m4389k3133
10047d7275j95L1043M575J0003q575r908j5631L6964N107q198m834J1140K9043
10034C3259K0936p384j7382p004M471K7083M600k1512m3466k5124p776M1526J459
10021C686L364o73j1241M563K3486J6110J31k2199m401k38n5769l0731J6493M6502
10007a0917K9330l0256L1920r45q090L2136j2935j4030L2528J3971Q11J0315j8474
$$ y = [59260, 77497, 94294, 109350, 130039, 112582, 76455, 61811, 34729, 32509, 19855, 41714, 55374, 56595, 25005, -9426, 18510, 42691, 85135, 95126, 47586, 73315, 75374, 67913, 108362, 110332, 84077, 61145, 91800, 103533, 83574, 56009, 40633, 15140, 15127, -32235, -70148, -59658, -19737, 20494, 54578, 52095, 76410, 94426, 71450, 38155, 20247, -24142, -47275, -47470, -16427, -11852, -1849, -10424, -20332, -35963, 1001, 6108, -2090, -6924, 4216, 33259, 54195, 46811, 29429, 22425, 26896, 53979, 58579, 37067, -6399, -31523, -39299, 2227, 3686, 7050, 6377, -4864, -301, 23185, 39295, 39426, 17227, 12826, 12588, -43181, -73912, -57419, -10917, 18413, -11843, 20077, 19132, 11042, 43178, 30243, 16213, 48741, 62712, 63523, 73838, 55364]
9994E5364L6804j8775o7561j1091P498M3968L7072J9886l8187k1000J9664N579
9982F9221k7308m4305O3015L5714l0541J0185j8913l9351j7635j0431M200m3284
9970d9433J2812N1911M1438j4831k0695m528K6950j217n833j6519n511K7919j3281
9957B9182L450j6573M0662K6001O51n194m1194k8350M0492K7040m187j2330p2190
9944a2540m3516K8661L5157R977K9448j0754m2316j9799k1130k6700j0520J0300
9932g3732O61L3690o33k4115J8813J0609K0602K2295M006j7435J2246n406j8458
9919a6857k2838K1307J7300J3864K946K8499m012k9105k8193j7648K8136K5953
9907A9352L867j7843K9437q281j6525R75q986k5441K2873L713o878J5921K368
$$ y = [55364, 92168, 73393, 5832, -5259, 2239, 46207, 83279, 103165, 64978, 43978, 63642, 69221, 41913, -2392, 60623, 96337, 65796, 75981, 57068, 17717, 82, -10349, -6149, -49433, -36621, 15290, 56728, 41897, 21202, 16674, 43624, 42407, 36574, 20055, 14544, 42463, 29182, 32632, 16059, 56721, 82722, 83373, 78179, 36985, 8635, 49127, 76167, 71980, 59650, -12540, -56056, -27395, 7762, 17739, 47187, 36433, -5883, -25682, -46812, -73512, -84032, -73732, -73071, -39381, -40014, -64129, -45316, -34707, -14105, 8190, 12196, -5239, 7007, 1601, -16857, -39695, -18388, -1088, 12776, 15722, 44221, 40209, 11104, -17089, -34737, -6601, 19352, 23219, 5376, 34813, 26532, 10007, 10982, 1996, -23445, -572, 3141, -3737, 12184, 14552]
9894A4552j1187j1705K9365K4473j6778J1492K0194N023m981q026k5960J5502
9882D1964J6829k4029m5378J2256Q804j1594j837K1030j0903l5879Q960J580L4251
9869A6054J8142m1597P427O432L0034K069J7641l323J8207k2690j4630K145j2165
9856B3746p061O936J5925m1284l8836K8651N470j7892j2964J2266J9397L6779
9844C1133j0681J809J6026l6456k0092J9816j3346J4532k1718J7550J2792j0751
9832F14K4784L8517l3627o397m037p945K4218n805k602q332l0047R914J2287K8690
9818D0232Q883j2523m1454j6255k7074K6673j0263K415m894n7772L2346M4899
9806a4787J8104J3750J4897J302k4767o175M9816k4881m2780J5295j6569k5886
$$ y = [14552, 3365, -8340, 21025, 45498, 28720, 40212, 60406, 65429, 60448, 52422, 26462, 41964, 58793, 34764, -10614, 1642, 10446, -1148, -2985, 18045, 7142, -28737, -19777, -18197, 16054, 34196, -7401, 26, 6458, 36492, 38561, 56202, 52879, 71086, 48396, 33766, 35911, 23746, 16685, 23621, 39546, -1738, -40574, -11923, -6453, -24345, -37309, -25043, -5646, 31133, 20452, 22261, 38287, 1831, -18261, 1555, -11791, 2741, -18977, -1427, 11365, 614, 25398, 63915, 30288, 23891, 19854, 11909, 36127, 30322, 27720, 19388, -10659, -745, 11542, 40232, 49115, 36592, -4862, -21117, -48191, -21518, -31781, -29366, -34260, -92032, -59686, -14787, 3317, 17067, 31964, 33266, 8499, 2324, 52140, 27259, -15521, -226, -16795, -42681]
9794d2681N1068P593j9138k2639O544n354J1993L938k541K7420J8149j4967Q491
9781B7876J4533J8572j3548j1634O302K9387k6550k1489J4812j865m882R693K2796
9768F4003L1325l524j9292j1748L629K972j7693J407K0964J4376N666p675o602
9755G7808l2619K219k9790n5720J1491N7499K7061o7831r694L9686K5114K7618
9743G2842k1729k2308j1537m7337l781K2339L1487J2681m0201m613J8284N3173
9731E9300k0596p825j2033N130L2090l6835l3904L5436J2055N632J397k4404J1288
9718B6731j2601r684k1331K037q825k9276M894o323J589j0383K0198K9261R263
9705d450p325P017J2371m2774R731M6660m056l0994k2409N3107L8500l2977O2
$$ y = [-42681, 8387, 15980, -3158, -25797, -19253, -24607, -12614, -8676, -11217, 16203, 34352, 19385, 27876, 42409, 60981, 47433, 35799, 42101, 71488, 44938, 23449, 38261, 36396, 31514, 41207, 64003, 95328, 91804, 72512, 60764, 64393, 67365, 49672, 51079, 72043, 86419, 92085, 84410, 77808, 45189, 47408, 17618, -38102, -26611, 30888, 57949, -9882, -19576, 20110, 45224, 72842, 51113, 28805, 17268, -30069, -33850, -11511, 19976, 32657, -7544, -12157, 6127, 59300, 38704, 30879, 18846, 23976, 56066, 19231, -14673, 20763, 32818, 38450, 39847, 15443, 26731, 14130, 4446, -16885, -14848, -23673, -52949, -48055, -54378, -52789, -63172, -42974, -13713, -4450, -11775, -4758, 7613, -35161, -25430, 21230, 17174, -13820, -36229, 16878, 55378, 22401, 22463]
9692B2463j4123M0152J8755m324Q686k9344k989r027m3475l1410K542l300L6316
9679i078J7758j8735K210J5196K5652J3864L0488j7951j9169K6877j149l007n0232
9666A2724j3255m421L2402N577n9023j0124j1623J8829O164J2364N785N522P017
9653G938j5061R581K0257M136p323J8489j0998K2108P8815N2262R897k1898l6147
9640A32056m3830J4318R408m8741j7629j2697k234l0922l6018l803J5319M7278
9628B2505K8357Q784R313M6004j0029k7233m0490n4243J0874k253Q340K2514p085
9615A5358j3901R538L5150j8329k3299P270P77m260N620K690Q999K4247N657J5254
9601G0771K3046M196l4507p959n8303l5610K6923j5842k1082J5365K0936l4291
$$ y = [22463, 8340, 48492, 67247, 62923, 71609, 42265, 39276, 30249, -13226, -44636, -42094, -45394, -9078, 8680, -10055, -7845, 7351, 33003, 46867, 77355, 59404, 40235, 67112, 65963, 62956, 12724, -531, -4952, 27450, 33027, -25996, -36120, -47743, -28914, -22750, -10386, -4601, 921, 7938, -7123, 2458, 22715, 26851, 19528, 38017, 27019, 49127, 127942, 180204, 190101, 168203, 132056, 88226, 102544, 111952, 63211, 45582, 32885, 30651, -271, -36289, -40092, -24773, 22505, 50862, 59646, 68959, 114963, 104934, 77701, 37211, -17032, -6158, -8411, -71, 22443, 15358, 1457, 10995, 46145, 27816, 4517, 11787, 12564, 8304, 13924, 16614, 25613, 49860, 55517, 70771, 93817, 98013, 63506, 55547, -2756, -38366, -11443, -27285, -48367, -33002, -12066, -46357]
9589d6357K383k1471L4493M1078L1911l8528j6466r46m1129K653L2240L8321K0594
9576C8776J272l5139k9166l3598j381M6976o528l795J9427M0168k4730k0626J7659
9563I315K164N3205J260k3801K7004q847l2742j6165R380k785q187j060K171m1485
9549c0573M362k6893k8760K2224m5499j4427L7909M1720P140J590J7146J9312
9537E251j5285n577M9748k0271m1864N2385M6574l1760k9170l0541l2409j3932
9525f6851L2865K7500p311k6089j9905K5589L4011j5356m333L108N227J9062J0324
9512A7841j1803o9189k9894L5435K4402K1006J2901J1662L6696j9524J8679K8400
9500G6612L322j6684j5975m247K572k2966n897j0434K00r709k2405R072L779k9639
$$ y = [-46357, -43974, -65445, -30952, 10126, 42037, 3509, -12957, -13903, -55032, -52379, -20139, 18182, 38776, 40048, 4909, -24257, -57855, -59236, -12260, -18788, -22583, -3156, 37012, 12282, -8344, 9315, 11479, 64684, 65944, 42143, 69147, 60300, 27558, 11393, 20773, 17988, 9801, 8741, 10912, -30573, -26211, -53104, -81864, -59640, -105139, -119566, -81657, -39937, -32797, -31207, -14061, 5251, -10034, -15611, 34137, 13866, -27998, 24387, 70961, 39201, 10031, -20510, -52919, -66851, -33986, -6486, -13797, -39886, -59791, -34202, -191, -15547, -19880, -16772, -11545, 7517, 17841, 6038, -63151, -93045, -57610, -33208, -12202, 699, 12361, 49057, 29533, 48212, 76612, 79934, 63250, 47275, 43028, 45600, 22634, 16737, 6303, 6503, -3206, -25611, -16539, -12760, -42399]
9486d2399l5933J8134M8135K6812p0400j9605K5983L5820k67M1565R824q946q688
9473B0035q000k4798j2751L4105L6748o263n279K418K937O950k5504L5222M8474
9460A04294k4351j5965j6219m5597l1965P483o034J2431K9004O6467l4221K5416
9448G0743L8876q871J1498J6229L5758K2309l7589k6361L9663K7345n108j3690
9436A70802r0061m4044p61L6113j3330p199K8683M602L233J5187N0563O1894J1727
9423B27409J5686k1361l3316m1319k5562r103K6950q642j4291J5657K8977K1821
9411A82906k9831o4573j0156J8786N8900M5459K7084M5850J47705J57012R2703
9400F71845l4836r4345r2559j19678j18993m3822j1313M801j4364J4950K4228
$$ y = [-42399, -78332, -60198, -12063, 14749, -55651, -75256, -49273, -13453, -13720, 27845, 37669, 28723, 20035, 12035, -12763, -25514, 8591, 45339, 39076, 33797, 36215, 39152, 46102, 20598, 55820, 104294, 79943, 63978, 47759, 2162, -29803, -22320, -28354, -15923, 13081, 79548, 45327, 70743, 109619, 100748, 112246, 128475, 164233, 186542, 148953, 122592, 162255, 189600, 184492, 170802, 80741, 36697, 35936, 72049, 58719, 51520, 80203, 84805, 88038, 103225, 153788, 215682, 227409, 243095, 221734, 188418, 147099, 121537, 112434, 139384, 130742, 116451, 132108, 161085, 182906, 153075, 88502, 78346, 97132, 156032, 201491, 228575, 274425, 422130, 579142, 671845, 637009, 542664, 450105, 330427, 211434, 167612, 156299, 161100, 146736, 161686, 185914]
9389A85914L8160j1328q004k6705l048j2244J3308J5351J5068m616j1886j2452
9377A77518r160m517m7744l9456n704N8004K2925n4036l6517M7452O0418K1492
9365A90675k4818k5412J0292K567O0027J6306k8226j3294j1373l6825j6229P24
9353A24414j0296J4464j4531o1453m2575N6375K3558o523l8056l928K2264k837
9341F0876N393j2362k347j3313j4558j7301K3026k272j6894K319j5685k0417k1458
9328d4993K8709M0429j5818m8332J0168J6466M9992K0728k9353l5504n0168K8784
9316b8892L8326j872m7172k1034r756J8210Q834M6913N5118Q216k0001l4937q262
9303C691k7462q836L4868l1j5282J2263R080k232j8498M593L5449K4596k2494
$$ y = [185914, 224074, 212746, 204742, 178037, 174989, 162745, 176053, 191404, 206472, 201856, 189970, 177518, 168358, 163841, 116097, 76641, 70937, 128941, 151866, 97830, 61313, 108765, 169183, 190675, 165857, 140445, 150737, 153304, 213331, 229637, 201411, 188117, 176744, 139919, 123690, 124414, 114118, 128582, 114051, 52598, 10023, 66398, 89956, 83433, 45377, 41449, 63713, 60876, 66269, 53907, 51560, 38247, 23689, 6388, 29414, 27142, 10248, 12567, -3118, -23535, -44993, -16284, 24145, 8327, -40005, -29837, -13371, 36621, 57349, 27996, -7508, -57676, -28892, 9434, 7562, -39610, -60644, -70400, -52190, -43356, 3557, 58675, 66891, 46890, 11953, 3691, -23771, -32607, 2261, 2230, -13052, -789, 8291, 6059, -12439, -7846, 27603, 52199, 29705]
9290B9705J9358L3310L064l1558k0170n2657k687O069L783M1732J4841K9508j7448
9277E6850n3069k2K0124n90L0407l8745m6468j4604J6403M1564m327k4090l1278
9264d7845j101K8944R867M750M6247O481l5081k3963l1605J1672j0741j3629L012
9251e2992q67L371M424j8209k629K9254j7898p730m955J0410M4809j8824k5222
9238e7058J6773J2184J9228R33Q868N3203l9563l9421K9149P181k5830q045J8817
9225c581j516O592l1438N154p81K2330L2810L7048l0552m2316L0514K4k8661m2165
9211d6538m377J4184l355K8045K8367r238j9889l323J339j729o267J7438k7505
9198c2848j6144L8639j9474J7317K984j9707K6036R721l167m3369K858N3398l5237
$$ y = [29705, 49063, 82373, 85437, 53879, 33709, -18948, -21635, -15566, -11783, 29949, 44790, 74298, 56850, 3781, 3759, 23883, 23293, 53700, 14955, -31513, -46117, -29714, 11850, 7523, -16567, -47845, -48946, -20002, -10135, -5385, 40862, 47343, 12262, -11701, -43306, -31634, -42375, -56004, -52992, -53859, -50488, -46064, -64273, -66902, -37648, -55546, -63276, -68231, -57821, -13012, -31836, -57058, -40285, -28101, -8873, -7940, 928, 54131, 14568, -24853, 4296, 11477, -14353, -22398, -3581, -5097, 1495, -29943, -24789, -25570, -3240, 29570, 66618, 36066, -6250, 24264, 24288, -4373, -46538, -50915, -36731, -40086, -12041, 16326, 7088, -12801, -16124, -14785, -16514, -22781, -5343, -32848, -48992, -10353, -29827, -12510, -9526, -29233, -3197, 6524, 3357, -40012, -37154, 16244, -18993]
9185a8993k4922M3703j623J9753j9915l719r715j3081K004k5757K5113J0909J7512
9172A269L9518Q905o6623k3240J1987K7412K8032K2181O3716M479J28o1335n0435
9159E994J1692k2573l306j2516j7527n626J3880L4934J8111m246k0606p741K5978
9146A6448J565r682J5943J989J1185L8115K818l5206j3339j2852k8124k5728k91
9133c7159K77K4825J9850j2494j1892P667K7111P591k099J416k7204m2304k5047
9120f9462r54M0835M8977L9435j0552j8564j4968J0750m2545R356K0182j1920
9108E70K3572K2536J3162L3645O3018p1052p4524l7711m4365J7699O7664N3403
9096F7617R644k094m3656L9589K2528j0218J8303j5119o5029p0090q568j1806
$$ y = [-18993, -43915, -212, -1835, 17918, -1997, -5716, -15431, -28512, -26508, -52265, -27152, -16243, 1269, 40787, 49692, -16931, -40171, -28184, -772, 27260, 49441, 113157, 117636, 117764, 56429, 5994, 17686, -4887, -8193, -20709, -38236, -43862, -29982, 4952, 23063, 18817, -1789, -9530, 16448, 18013, 8331, 24274, 26263, 37448, 75563, 78381, 43175, 29836, 16984, -11140, -36868, -37159, -36882, -12057, 7793, -4701, -16593, -8926, 18185, 25776, 23677, 25093, -2111, -44415, -69462, -70416, -29581, 19396, 58831, 48279, 29715, 14747, 25497, -17048, -7692, 12490, 570, 24142, 46678, 59840, 93485, 156503, 85451, 10927, -26784, -71149, -53450, 14214, 67617, 77261, 75167, 31511, 71100, 93628, 83410, 101713, 86594, 21565, -48525, -57093, -68899]
9084f8899K5860K772r094K0229J4278J4734l035p806J611J1001M1673J6198k2125
9071C7397m8681n0134q166M6733N956r090J3882L6929K7288j6124O201J4577L6438
9058I3206m3429k1713k6129K3212L2537l9565l4566R176J5094P622m7167j627
9046c3349j8984l988L1013K6526K2344N3659k2069k2110j8958R615k7892k7205
9034c1398j4720k0120j3067j685k1395K9043N1372K4633P8292K0646l9204l6959
9022B5438p795L204n1018L0803J8975j8152J0610M1128R987L021k1173l8085r739
9009b796M4468p821Q725m1076n9424k1260K2109P0320P291Q375L0035j8607q240
8996C2099J6448j4606o3213j0641J2716J0187k893K346J518j4534j2895j556K145
$$ y = [-68899, -43039, -40267, -49361, -29132, -14854, -120, -3155, -10961, -9350, 1651, 43324, 59522, 37397, -11284, -61418, -69584, -22851, -16895, -25985, -12103, 24826, 52114, 35990, 42191, 56768, 93206, 49777, 28064, 1935, 25147, 57684, 18119, -16447, -7271, 7823, 15445, -31722, -33349, -52333, -56321, -25308, 1218, 23562, 77221, 55152, 33042, 14084, 23699, -4193, -31398, -46118, -66238, -79305, -80990, -102385, -73342, -21970, 2663, 80955, 101601, 62397, 25438, 17643, 20847, -30171, 632, 19607, 1455, 12065, 53193, 63180, 66201, 45028, 6943, -2796, 41672, 33851, 42576, 1500, -57924, -79184, -57075, 13245, 20536, 28911, 58946, 40339, 32099, 48547, 33941, -29272, -39913, -27197, -17010, -19903, -17557, -16039, -30573, -43468, -45024, -42879]
8983d2879j0150j3008j7049k1209j1695J5362P3181M0829j436k7378k5798K1251
8971a9979K3366J8376R526j7587m6065j750J2523J6987m225p419l1387J7435K2376
8958g823K7056M0496J6243k4254K3927q176k9782K4760n8186k1372J5784K8872
8946B7545Q871N908K4537m046m2238k5127k4069k614Q495k6520N272J0456J8416
8933a5114K9169j1060L5831l963j8300J8906j9730L671J851l6008l8045L3804
8921a8988M2740L2646k255k0689l1864j7052k415k019l8373K1395M7474M0247
8909E0847K4192q82k9581l6825k4970L0962J0822j8567k7123l0200M491J7164
8897b9670M8146q156J3213M631j4716k714J6240k6945j0980l8009l4789J7775
$$ y = [-42879, -53029, -66037, -83086, -104295, -115990, -100628, -27447, 13382, 11946, -15432, -41230, -19979, 3387, 21763, 31289, 13702, -32363, -34113, -21590, -4603, -8828, -16247, -47634, -30199, -7823, 19233, 59729, 75972, 51718, 75645, 67469, 37687, 62447, 4261, -17111, -1327, 27545, 36416, 42324, 66861, 62815, 20577, -4550, -28619, -31233, -22738, -49258, -43986, -33530, -15114, 14055, 2995, 38826, 34863, 16563, 35469, 15739, 19410, 21261, -14747, -52792, -18988, 23752, 56398, 54143, 33454, 1590, -15462, -17877, -19896, -58269, -36874, 10600, 50847, 75039, 74157, 44576, 7751, -17219, 13743, 24565, 5998, -21125, -51325, -46834, -29670, 18476, 10320, 23533, 28164, 13448, 10734, 26974, 29, -10951, -48960, -83749, -65974]
8885f5974L1081K8127J9342j3902R886N7q689J2035K423o526l357o8J6603j2806
8871H232L0689q49l8250K8230Q642J7963J7897l0674j2841j9848k8667l724j522
8858b4722K1675m4754j4044K3766N9505J100Q705k0522o07o878l6281K6318M7670
8845D0931J0889j9754l0591L051M3282j4951Q226N240k2832P500r325O293k2571
8832E388j5655J1744k220l2990Q755L6528O55k61k5127M715J40R888J3722j9663
8818d381k0521j8840l4398K2654K9269P274K4632K4397k902K3417k7157P061r629
8805B0876j1672L13j2178M1030n1258l3995K2855J657L2284j1322L732k1804l2973
8792e2455K2391K2749M8972L5056n315k4479k7102P184K6499L061n9887l2044
$$ y = [-65974, -34893, -6766, 12576, -1326, 8560, 8617, -72, 11963, 14386, 7860, 4503, 4435, 21038, 8232, 38921, 38072, -178, 28052, 36694, 54657, 72554, 41880, 29039, 9191, -19476, -23200, -24722, -3047, -47801, -61845, -38079, 21426, 22526, 31231, 10709, 10102, 3224, -33057, -6739, 40931, 51820, 32066, 1475, 4526, 47808, 32857, 41083, 46323, 23491, 30991, 21666, 27959, 5388, -10267, 1477, -743, -33733, -24978, 11550, 12205, 11944, -13183, -8468, -8328, 1560, 15282, -4381, -24902, -43742, -78140, -55486, -26217, -18943, 5689, 30086, 27184, 50601, 23444, 30505, 20876, 9204, 9517, -2661, 38369, -12889, -46884, -24029, -22372, 9912, -1410, 2322, -19482, -52455, -30064, -7315, 41657, 76713, 71398, 46919, 19817, 27001, 53500, 56561, -3326, -35370]
8780c5370L2J0487L489n246N5260K9847j1409R904L0096L4004M0663Q870O3055
8767B33682J18306J00609N8578J22246R5660K0631o2353j19808j42619r2955j03340
8756B28637o4138o1121l556p161o227p037k7134L123J4672J3223J706k1132j2765
8743E1090O721n2150Q699N253M409m3242J3482N555L4686q44l0730J1842K7741
8730D2512K2343K0911k8654o5086m5098N307K0874L9578R559N1211k636p3268
8718b447j8762R526l0102l4198L8999J0738L500J8454K6293J9822k4838L3233
8706E0218l6616j2900R87J1305j536j7701L1896J3181L2621l792k2643k1941l5955
8693a2876j1294L920K3276Q006j850r914j612J9818J4434L8092m421k1558j1695
$$ y = [-35370, -35338, -24851, -21362, -26608, 28652, 58499, 47090, 56994, 87090, 121094, 161757, 170627, 233682, 351988, 452597, 511175, 633421, 729081, 749712, 687359, 567551, 424932, 331977, 228637, 164499, 103378, 99822, 92661, 86434, 79397, 52263, 55386, 70058, 83281, 84987, 63855, 51090, 57811, 5661, 14360, 19613, 24022, -19220, -5738, -183, 34503, 33659, 2929, 14771, 42512, 64855, 85766, 57112, -7974, -53072, -47765, -26891, 12687, 22246, 73457, 70821, -2447, -21209, -11683, -41785, -75983, -36984, -26246, -22746, -4292, 22001, 41823, 16985, 50218, 13602, 702, 1689, 12994, 11458, -6243, 25653, 38834, 71455, 67663, 45020, 23079, -12876, -24170, -20250, 3026, 11032, 9182, -732, -2344, 17474, 31908, 70000, 65579, 44021, 32326]
8680C2326k9652K3108K1705l2439J4691J651K2434j601o790j8636l0983K0437
8668A6251M3139j4097m7974l0469Q971j0644k2322P071n37K0622J7049Q461J8173
8655A3694j3946J5687N939R513J8982j1032n6068k7150K4559L9218l8116J9946
8643A226J9447J4935K4272r075m847m980k5711N5203j1585l5364m3515J6402K1678
8630A8086j8772Q327J251K7956K2544j9971l2785j1611M7421k093j5859o176j4471
8617C847M7297L6175j9770l5468k3977K7918O5563M1422l493k206k7651l0242
8605G9415m2350p456J3048k2952p438k747j6884m836L5806L776K3140L652j9699
8592C4475j7010j1120L748k3748o019J7054M12J3329m101Q905J6447M0112j5243
$$ y = [32326, 2674, 25782, 47487, 15048, 29739, 31390, 53824, 52223, 45433, 26797, -4186, 16251, 59390, 45293, -2681, -33150, -24179, -34823, -57145, -50074, -50611, -29989, -12940, -4479, 13694, -252, 15435, 21374, 30887, 49869, 38837, -17231, -44381, -19822, 19396, -18720, 1226, 20673, 35608, 59880, 50805, 45958, 40978, 15267, 70470, 58885, 23521, -19994, -3592, 18086, -686, 7641, 8892, 36848, 59392, 39421, 6636, -4975, 42446, 40353, 24494, 18318, 3847, 51144, 87319, 67549, 32081, 8104, 36022, 101585, 143007, 139514, 137308, 109657, 79415, 37065, 29609, 42657, 19705, 12267, 9520, -7364, -12200, 23606, 27382, 50522, 54174, 34475, 17465, 6345, 10093, -13655, -19674, -2620, -2208, 11121, 7020, 15925, 32372, 72484, 57241]
8579E7241j0498l453j1228J6023L2023k781J1910m400r592J7939K3926J1027L1500
8566A59637J1546l1790k3531k568m1757r631K6173L3288k8906k8787q097l6701
8554A8876l5055P351L2857j4490K7746M2807L0688j3133j3172k0494o3J0355k7751
8541D6522o558K8080K271m1232r946o930L8005J534l5185j7002p899K1165J0389
8528B3214Q934M3141k6028J5605J3407m69N5234L5223k5018l4708l1769l8752
8516C8014m582J3301K5754r919l5978k4476q892K1279K1182n0j4366l0017L429
8503e321l983L3510J5687m6208J0166L1863k6000K512P475K7819K706o2021j2984
8490b4779K3830R06N8779L3667l2172k2458l6475k4146L272j784n457K0728M9185
$$ y = [57241, 46743, 43290, 32062, 48085, 80108, 77327, 89237, 84837, 75245, 93184, 117110, 128137, 159637, 171183, 139393, 115862, 113294, 71537, 61906, 88079, 121367, 92461, 63674, 55577, 18876, -16179, -8828, 24029, 9539, 37285, 80092, 110780, 97647, 84475, 63981, 63918, 74273, 46522, 39964, 68044, 70315, 29083, 19137, 12207, 50212, 51746, 16561, -441, -8340, 12825, 23214, 32148, 75289, 49261, 64866, 78273, 77804, 133038, 168261, 143243, 108535, 76766, 38014, 33432, 46733, 72487, 62568, 26590, 2114, -6778, 14501, 35683, 35633, 21267, -8750, -5321, -9304, 24206, 39893, -6315, 3851, 35714, 9714, 12226, 19701, 47520, 50226, -11795, -24779, -949, -43, 58736, 92403, 60231, 37773, 1298, -22848, -19576, -21360, -26817, -6089, 43096]
8477D3096K516N371N735L6350L826m7961j0389k3327p544K2876J9064j8057Q754
8464D0310K1052l0118l4306J7704K6478n374k1536J8097O712K7889k907j1777
8452E2224m632l0932n617K1685j7481j855J4205j1870l3764k7504l131k9325K1085
8439e6912O6602Q417n3105k2722K8272M4741K1602K2490l352j5029l0295J7975
8427B8684j5723k3440M250J473J4425P4823J9691p8882o8351k1943N507K0778
8415c8708O8090P0253l1636n6458k1839n2802K0312L9600O313K4961o515j2817
8403H754J5756J3182l375K018m3991m2985L0062M0845J762L0540J425l7556K1223
8390C7660l0380k204J1908j1508n3484j5574j8738K5561K2563m7356n3763J0276
$$ y = [43096, 45612, 50983, 56718, 93068, 96894, 48933, 38544, 15217, 7673, 30549, 49613, 31556, 40310, 61362, 31244, -3062, 14642, 41120, 35746, 14210, 32307, 39019, 66908, 64001, 52224, 47592, 16660, 11043, 32728, 15247, 13392, 27597, 15727, -18037, -45541, -48672, -77997, -56912, 9690, 18107, -34998, -57720, -29448, 15293, 36895, 59385, 56033, 41004, 10709, 28684, 12961, -10479, -6229, -4756, 9669, 84492, 104183, 25301, -43050, -64993, -59486, -38708, 29382, 99635, 67999, 11541, -10298, -63100, -42788, -3188, 3125, 28086, 21571, 8754, 24510, 37692, 34317, 36335, -7656, -50641, -20579, 20266, 22028, 52568, 53993, 16437, 37660, 7280, 5076, 16984, 5476, -48008, -63582, -82320, -56759, -34196, -81552, -135315, -125039]
8378a25039P8662M2901m127m4182L6343J1355L70j2075l5089j5882Q379j6252
8366g4636J4436j6432l6751P1073M3786L4220K9696j4480p0915k5048n623O5192
8354A4518J2911n0922K1411L6884J227j987K877J7332j5733l0185N9086L2n160
8341F2291j7161j5567l1203K3205L7359L8965L2331O2502R2576P039r5567r9246
8329I7524l9977K345j012L4843k4402r899j5644J0785J7546J6001K9516m7297
8317G0329k9557P529L6599K130n9971k2523j1166k5778J2788N64J6480J3714k1944
8304a0806J5714j961k462j1954O172L3610M3723L7756m9722m0619K3707J9345
8292F2503O0263J06476J63840J64851K5504q7682o8737q9202r8921m6847m0734
$$ y = [-125039, -46377, -3476, -7603, -51785, -15442, -4087, -3717, -15792, -50881, -66763, -58384, -74636, -60200, -76632, -113383, -42310, 1476, 35696, 65392, 50912, -20003, -45051, -50674, 14518, 27429, -23493, -2082, 34802, 36029, 34042, 36919, 54251, 38518, 8333, 67419, 67451, 62291, 45130, 29563, -1640, 21565, 58924, 97889, 130220, 192722, 285298, 292337, 196770, 97524, 57547, 59892, 58880, 93723, 69321, 59422, 43778, 54563, 72109, 88110, 117626, 70329, 40772, 48301, 84900, 87030, 27059, 4536, -6630, -32408, -19620, -19056, -2576, 11138, -10806, 4908, 2947, 485, -11469, -5297, 28313, 72036, 109792, 60070, 19451, 43158, 62503, 122766, 229242, 393082, 557933, 583437, 495755, 427018, 337816, 238895, 192048, 151314]
8281A51314m1121k3020M7252l1617k5327P989J0915l6987Q238O290k6769k2608
8269B4549k4088j9774L8537P677o345K9929j4935q597j6675k3205k7693j1216
8257e1836K4731L7019K6405r910k0836m497N364J0924R858o936K5159J4695R9558
8244A59698K7075r688R661n511J8621m8013m2018r840j3229l2115l0105k5824
8232a288L3951q155l1924j6974K9589K9570P382j7404j4481j1978j1967j26o836
8219b0641k9313K1366K1330O069m1540n784P932J4219K0407J3303j9158o980o331
8206b5121r527J453J3144K0151n864j079K2219r314m7312l9374L3910O0899k1134
8193f949p2552k4180N2237J7501k0591K312l5159J5455J7774M1069J7904j7974
$$ y = [151314, 110193, 87173, 134425, 102808, 77481, 85470, 96385, 59398, 67636, 73926, 47157, 24549, 461, -19313, 19224, 26901, 20556, 50485, 35550, 26953, 10278, -12927, -40620, -51836, -27105, 9914, 36319, 26409, 5573, 1076, 6440, 17364, 27222, 20286, 45445, 60140, 159698, 186773, 177085, 186746, 181235, 199856, 151843, 109825, 99985, 86756, 54641, 24536, -1288, 32663, 24508, -7416, -24390, 5199, 34769, 42151, 24747, 10266, -1712, -13679, -13805, -20641, -49954, -28588, -7258, -1189, -42729, -48513, -40581, -26362, -5955, 7348, -11810, -18790, -25121, -34648, -33195, -20051, 100, -5764, -6843, 15376, 6062, -41250, -80624, -46714, 14185, -6949, -79501, -103681, -51444, -33943, -54534, -52222, -87381, -71926, -54152, -13083, 4821, -13153]
8181a3153K1239k0456l0052P547M7827l4L1837K1541j505j1989J3586l6343l0385
8168c40k2837r381J0026L4921J0956J544k8892l4746k4105j1603K3716K4219K2940
8155c582J5142l9575q592K1166P01q552j2449K2943J4644j3566L775J2793K8049
8142C2897m2453m9745j4329J6431N9459J5239k5548j504k5331R699K304m27j7974
8129d1282m389N2204R701j9900P354j9523p42L727k4871j3697M3410O3853J2669
8116F8514j0119j9673m7209n8249J6999j7450O552J8741L7580J6723J2598k1867
8104C140l1850n141r503j698L2417L0854j2542N286O079m2433n482j0488q043
8091d9404M4591J1725k2037l8900O341K7670N310k3785L1529K357k5847j6106
$$ y = [-13153, 8086, -12370, -42422, -34875, 12952, 12918, 44755, 66296, 64791, 52802, 66388, 30045, -340, -23177, -32558, -22532, 12389, 23345, 24889, -4003, -38749, -62854, -74457, -50741, -26522, -3582, 11560, -28015, -36607, -15441, -14740, -23292, -35741, -12798, 1846, -11720, -7945, 4848, 32897, -9556, -59301, -73630, -57199, 2260, 17499, -8049, -9553, -34884, -25185, -22881, -23308, -41282, -45671, 6533, 16234, -3666, 3688, -15835, -16577, -12850, -37721, -51418, -8008, 55845, 68514, 58395, 38722, -8487, -66736, -49737, -67187, -60635, -41894, -4314, 12409, 25007, 3140, -28710, -33851, -43354, -45052, -12635, 18219, 5677, 10963, 17042, -25391, -30873, -41361, -49404, -4813, 6912, -15125, -54025, -47684, -20014, -14704, -38489, -6960, -4603, -30450, -46556]
8079d6556J7934L9516k8444q457N824M4191K8276k7726j3408q770M6138l530l3905
8066A1083o974l2296l1105J0511p484l1510J2769M2872J4153J5907J273J4354
8054A3553Q975k0963J2471M1300J4404j9868o069k1087k1837O757K5584j699R08
8041C2429j9784n835L0862Q882M397p671J0326j2742j8163J4838M861j2742l1762
8028b104j7359l3678l944Q4478K2992k3282j9746m1233k3487K1097K981M2042
8016H757p389L1414K6089k964j0602j8523k350l3645l1942J5056K2302N375J222
8003B800R293j5630k4892j3107L193N6870K1968Q109l4987j2926L8276j6991k1048
7990I28Q534M4155K7373l2173K644K0130j3882m1812j7799l8754l3341N510P6633
$$ y = [-46556, -28622, 10894, -17550, -26007, -20183, 24008, 52284, 24558, 11150, 2380, 48518, 44988, 11083, 4109, -28187, -59292, -48781, -56265, -87775, -75006, -32134, -17981, -2074, -801, 13553, 22528, 1565, 14036, 55336, 69740, 49872, 43803, 22716, 879, 7636, 33220, 31521, 32429, 12645, 6810, 37672, 46554, 50951, 43280, 53606, 40864, 22701, 37539, 42400, 29658, -2104, -19463, -53141, -57085, 27393, 50385, 27103, 7357, -33876, -57363, -36266, -33285, 8757, 1368, 32782, 58871, 55907, 45305, 26782, 24432, -9213, -41155, -26099, -3797, 1578, 2800, 12093, -3537, -28429, -41536, -38343, 18527, 40495, 48604, 13617, 691, 38967, 21976, 928, 9462, 53617, 80990, 48817, 51461, 71591, 57709, 15897, -1902, -40656, -73997, -68487, 8146]
7977H146M1162J6872K34n9838j6665K8136L7284J4992j2184K348m383J1709m559
7964F3254l0893r516j1382J7881J6472Q023j1801j2170l5781j9278j3394L2176
7952f409L0953l54l5091m6721J4490O750J3242K9796l4152q658k0234P147J3945
7939c5296k7602R624J0858L1571J7128l9737n522K0837R167Q788j9828J4566j1816
7926a7262n78k577M832p77K2237M3017M5995j0502P738n4070m6404K6402j147
7913A6904n2723n189j5359j0140M0458Q6785M8192j8946M470R64J4873k4009o6500
7900A9780l1746J9268J3131j3438J8242j6160K8942O214j4791o422L3723M889
7888F1632N58L0920K0556k6986m2284j2316n3117K1444K9222J4047j526l214J2603
$$ y = [8146, 49308, 66180, 66414, 6576, -10089, 18047, 55331, 70323, 58139, 60487, 56104, 67813, 63254, 32361, 22845, 11463, 29344, 45816, 53839, 42038, 29868, -5913, -25191, -38585, -6409, 24544, 24190, -10901, -57622, -43132, -36382, -23140, 6656, -27496, -36154, -56388, -49241, -35296, -62898, -53274, -42416, -10845, 6283, -33454, -38976, -18139, -8972, -184, -20012, -5446, -17262, -17840, -20417, -15585, -16362, 5875, 48892, 94887, 84385, 92123, 38053, -8351, 18051, 16904, -35819, -41008, -56367, -66507, -26049, 60736, 108928, 89982, 94452, 95416, 110289, 86280, 19780, -11966, 7302, 20433, 6995, 25237, 9077, 38019, 44233, 29442, 23020, 56743, 61632, 62190, 93110, 113666, 86680, 44396, 32080, -21037, 407, 29629, 43676, 42150, 38936, 51539]
7875E1539O686k3294N6390N672k3252k3681j9660L936l5453j7785n74K9472J8139
7862B8135o002l6859K8293J5738K0606K4200J9J3261o3039k8750k0652J0400M0190
7849B5540q960L656O445L4287J2774j1178l2055j4710M4030k3043o9289j0884
7837d3387N9191N6776j5253m162K1180%k3766r017j5673k9633j6152L3050N4117
7824F7271K05l3836n2956j5881N5952J2986j6199j7784M097m622o343n172q038
7811b0320j2532R867O1282O450L0332K1880p0724m8103K3990J0964l8082j0403
7799c5399N1051L0599J5123L9759m7222p346k5892K3683J9567l4165j2994o512
7787A0252n209J195J5805J809k6157j1785p248P685R062L46j4064J6819k1998
$$ y = [51539, 58225, 34931, 91321, 96993, 73741, 50060, 30400, 34336, -1117, -18902, -19476, 9996, 28135, 22133, -14726, 13567, 29305, 49911, 74111, 74130, 87391, 24352, -4398, -25050, -14650, 25540, 16580, 20236, 26681, 60968, 73742, 62564, 30509, 15799, 59829, 36786, -32503, -43387, 15804, 72580, 57327, 53165, 74345, 74345, 50579, 41562, 25889, -3744, -19896, 13154, 67271, 67476, 33640, -19316, -35197, 20755, 33741, 17542, -242, 3855, -767, -7110, -12282, -20320, -32852, -22985, 38297, 44747, 75079, 96959, 26235, -21868, 2122, 13086, -24996, -35399, 15652, 46251, 61374, 101133, 53911, 46565, 20673, 44356, 63923, 29758, 16764, 10252, 5043, 6238, 22043, 23852, -2305, -14090, -21338, -13653, -4591, -4245, -18309, -1490, -23488]
7774b3488j5507j966j7183K2646L2692o10m9285O034J9712K3018J8469J4612K668
7761C1812K0988k1215j4026k6666j8104J8507K1028K670k1616j4052L4718K6572
7749D0616m723R353J4617j2385R653m380m4831J6399P46j0083j8539J8161O1238
7736G5842J1478l9363p2043j3301o639j2234K7673j5689j8538M3713J351n2867
7724g0617K5974N282j9060L044K5788K977j562K6251K2209j4408L840k7541k6365
7711d4188o682J9984J2655j8619l6648L3707K2283L5955J0034l3589k1853P424
7699a9537K2668J3110j1439K9556J5024J7003k6696o3044l1907p591J0300O0768
7687H215l7159k4237K7626K8269n362K54J5581J7629l2045m6071n0067K4824L2929
$$ y = [-23488, -38995, -40961, -58144, -35498, -2806, -3416, -52701, -46667, -26955, -3937, 14532, 29144, 31812, 52800, 31585, 17559, -9107, -27211, -8704, 12324, 14994, -6622, -20674, 14044, 40616, 35893, 45246, 59863, 47478, 57131, 52751, 7920, 24319, 25065, 14982, -3557, 14604, 75842, 87320, 47957, -24086, -37387, -44026, -56260, -28587, -44276, -62814, -19101, -17750, -70617, -44643, -39361, -58421, -55377, -29589, -26612, -28174, -1923, 20286, 5878, 9718, -17823, -44188, -50870, -30886, -18231, -36850, -73498, -39791, -17508, 18447, 28481, -5108, -26961, -19537, 3131, 16241, 4802, 34358, 49382, 66385, 39689, -23355, -55262, -62853, -52553, 8215, -28944, -53181, -25555, 2714, -2648, -2394, 13187, 30816, -1229, -47300, -97367, -72543, -39614]
7674c9614n17M3495K9759k0425n4375k5162M8228K4793j0929K0068L2048j3668
7662C3701n1569k8756r276J7929k44J1179j5204J6950Q762l861L5120J0193K1468
7649D6392j1101N98j7518m9236j8254Q620j1429r010K0870L1573K8041L3558j9008
7636C4096p009m7986m0381J9628L0592J8944L763K2515L1141m2813k5818J834
7624a494K9385n0479o960K6088j3370M1317q941O160j6342j7588R342J5631l5884
7611b3135J3447j459o220J3962K5389O199j6699L9673J2464m2326j3021j3443
7599e169r973j1156J9894M5996o3823n2044J5388j3393Q486j169J7492J5546L054
7586c0871K7190l653J9425Q92l9082L9589J9013l4639k3167j356K1013j7141N708
$$ y = [-39614, -40131, 3364, 33123, 12698, -41677, -66839, -18611, 6182, -4747, 15321, 47369, 33701, -17868, -46624, -55900, -37971, -38215, -27036, -42240, -25290, -16528, -20389, 14731, 24924, 46392, 35291, 35889, 18371, -30865, -49119, -40499, -51928, -60938, -40068, -8495, 19546, 53104, 34096, 27087, -20899, -61280, -41652, -11060, 7884, 11647, 34162, 65303, 22490, -3328, -1494, 27891, -22588, -29548, -3460, -16830, 24487, 15546, 21706, 5364, -12224, -2882, 12749, -23135, -9688, -11147, -17367, -3405, 21984, 28183, 11484, 51157, 63621, 21295, 8274, -5169, -15142, -26298, -6404, 39592, -24231, -76275, -60887, -74280, -65794, -66963, -49471, -33925, -30871, -3681, -7334, 12091, 12983, -26099, 13490, 32503, -2136, -25303, -26659, -5646, -22787, -17079]
7573a7079L7569K6272M385m7130j491K3356j1252k5734K3874k55o97K5245Q942
7560D6005k1187K3445k9574R140j6245j1471j4648J4953K2404L4484j7044k0986
7548A9276O111j1868j7051m096N107L0106l2415l1138K0697K3798j0087k6958
7536b8518K4995Q483Q573j0455N184q829m0280J9355K3146K5935K6142k2552l5717
7523d538l2048L2967J0072j0174j2000j3989p751K0007l940m3986k170J6420L1530
7510a9600k0804N6230J6217k2964j5072k4975l3410M9951k0656N4957L1571k3691
7498B7754n2556j1500J9967L3332K1779j6013m5973R723J7157L403K0381J9329
7486D6783J9270j3982m516p09n048n3958m5272k316O9873J0899m73J071j8921
$$ y = [-17079, 20490, 46762, 51147, 4017, 2526, 25882, 14630, -11104, 12770, 12515, 11818, 37063, 46005, 24818, 48263, 18689, 27829, 11584, 113, -14535, 418, 22822, 57306, 40262, 19276, 25387, 13519, -3532, -7628, -2521, 27585, -4830, -35968, -15271, 8527, -1560, -28518, -3523, 4960, 13533, 3078, 8262, -567, -40847, -21492, 1654, 27589, 53731, 31179, -4538, -36586, -3619, 6453, -3721, -15721, -29710, -37461, -17454, -21394, -65380, -67550, -51130, -19600, -40404, 15826, 32043, 9079, -5993, -30968, -64378, -14427, -35083, 19874, 51445, 27754, -24802, -36302, -16335, 16997, 38776, 22763, -23210, -13487, 3670, 7073, 27454, 46783, 66053, 52071, 47555, 46846, 41798, -12160, -57432, -59748, 10125, 21024, 20551, 21622, 2701]
7473B701n401p635k4584K7255J3672j6700l277Q303j4983p233K0688J4067j9701
7460a2828j7609m0483k3651K5055L0567m3669P109L7825J7116j1261L029J5741
7448a3059M086k665K214l5382j2702j1574j0430Q3033J3555J4622K90K3801j1643
7435D4146kj9610n5667K7635N2175j0126n1153K420L8283k360j5537j3367k1889
7422b5052j0014M1776j108M151l228J1379l2540m122k3603r508j7771K2797R585
7409c7258J9154K0885L2622J1068j861l4259k277j8740L3867J6602M6963L867
7397I0633k7160j5031p3894m5616Q071L4507J0526n552L363N309m18j6112L8121
7384F747K3276m015j4104J8426L2028J2726L2282k5251j0042j3766Q886j0391
$$ y = [2701, -2700, -10335, -34919, -7664, 6008, -10692, -13969, -5666, -20649, -27882, -7194, 6873, -12828, -30437, -70920, -94571, -69516, -38949, -82618, -75509, -37684, -20568, -31829, -28800, -13059, -8973, -11638, -9424, -44806, -57508, -69082, -79512, 3521, 17076, 31698, 31988, 55789, 44146, 44144, 24534, -31133, -3498, 48677, 38551, -12602, -10182, 28101, 25741, 10204, -3163, -25052, -35066, 6710, 5602, 9753, 6525, 17904, -14636, -18758, -42361, -51869, -69640, -46843, -37258, -18104, 2781, 35403, 46471, 44610, 10351, 8074, -10666, 23201, 39803, 86766, 90633, 63473, 48442, -25452, -71068, -62997, -28490, -17964, -23516, -20153, -14844, -15262, -31374, 6747, 30023, 26008, 11904, 30330, 62358, 75084, 107366, 82115, 72073, 58307, 67193, 56802]
7372E6802k5116J8084K1991l7509n7178j682K0714N0979P788j9484o317l2180
7360c108n236O902j9257M8638K4069n7244k9580M3860P49n7K263l0119L069q374
7346b3425L1380O2j7860m531N044J4318J8974l421p830K0295j5979k1562l1637
7333c6172r418j7363l4K0312J5253K7058P143m2384m4415K3287J7352j5228K019
7320e2590J7022j1903p713Q0150O6072j9171l7842j2548L3J4146n1091l4433j5045
7307f4913K9065L3378j5997o814M892j9550k1970j7056M0484O756l9618p074M8529
7294b9888O8872J2416k064J0726k4519l4252K522L3409P453l2976k1766j4446
7282b4513O069J5976M9608J2625m4653l8980K8279K6930k1509l5923j019K289
$$ y = [56802, 31686, 49770, 71761, 34252, -22926, -24608, -3894, 47085, 54873, 35389, 29072, -3108, -8344, -1442, -20699, 27939, 52008, -5236, -34816, 9044, 9793, 9736, 11999, -18120, -15051, -23425, 7955, 8017, -9843, -14374, -9330, 4988, 23962, 20541, 12711, 33006, 17027, -4535, -36172, -45590, -62953, -62987, -42675, -27422, -364, 6779, -35605, -80020, -56733, -39381, -54609, -52590, -35568, -47471, -55184, 24966, 91038, 71867, 34025, 21477, 21510, 35656, -15435, -49868, -64913, -35848, -2470, -18467, -25281, -20389, -39939, -61909, -78965, -38481, -31725, -71343, -78417, -29888, 38984, 51400, 49336, 60062, 35543, 1291, 3813, 37222, 44675, 11699, -10067, -24513, -18444, -2468, 47140, 59765, 15112, -23868, 4411, 31341, 9832, -26091, -27110, -24821]
7270b4821K1686j3683L3480k359l9058K0921k418K0035j3800M234J9953l4429
7258a0259l0369m0751k599j761K9612M0928J5456J8884J5734k3195j3508J7460
7246A5632k6222j5445L627l2848K2307L9504K9084k6581K563M0571J4314m0567
7234B5939m4519K8371M569L2831J6780n4436M102M6027J2427o014l8827l2665
7222e415n014L8026N2541j7760m5893q5961j8809M2757L3063J5668m7036J6208
7210b7625K8024O397J1150M882m813l2557j3710j1912L83K0331m3836k6787j6475
7197a06548L3187j066k91O967L4434Q484j5431K1044L118k6767J0894M709K6874
7184c92r18l0598p05J8624j0746k1153k6933N4937j1833l0505R002N505j576q335
$$ y = [-24821, -3135, -16818, 16662, 14303, -24755, -3834, -6252, 13783, -17, 4217, 24170, -10259, -40628, -81379, -83978, -85739, -56127, -15199, 257, 19141, 34875, 11680, -1828, 15632, -10590, -26035, -22408, -55256, -32949, 6555, 35639, 9058, 11621, 52192, 66506, 25939, -18580, 9791, 14360, 47191, 63971, 9535, 13637, 59664, 72091, 66077, 27250, -5415, -10429, 27597, 80138, 62378, 16485, -69476, -88285, -45528, -12465, 3203, -43833, -27625, 399, 6796, 17946, 22828, 18015, -14542, -28252, -40164, -39781, -19450, -63286, -90073, -106548, -73361, -74427, -74718, -67751, -33317, -24833, -40264, -19220, -16102, -42869, -31975, -27266, -392, -1310, -31908, -32613, -13989, -24735, -45888, -72821, -17884, -29717, -60222, -51220, -45715, -47291, -55626]
7170e5626J351o781M763K3352j7882l0606J1169j0383J7264L9932j2221m4305
7158g9973K5485M9844L6955j3671j2272k8211j4408l5876n715N0590K8371n0464
7146d9345k4559K9824k634k442J864P231Q486J6951J1115J0629j262o104K7842
7133B7596Q978r834m0158k716j5285J8036J499M935j8068q591K4118j0090m0357
7120e9937k7117J1599L3470k0351k641R000L2144l565K8093j1238k6817J7464
7108a9896N2646Q987m4158j5195j7592P083J0113K4852j0945L773L1445j3159
7096A7954j85J1654j6515j4117K3514N05n6463q916J991N253j6399k4374J0279
7083f5819J1751L4748K771K0728m0526k6562M9663K1495o078j9402N2139k6857
$$ y = [-55626, -54275, -61056, -56293, -32941, -50823, -81429, -70260, -80643, -63379, -23447, -35668, -79973, -54488, -4644, 32311, 18640, 6368, -21843, -36251, -72127, -77842, -27252, 1119, -49345, -73904, -44080, -46714, -49156, -47292, -40061, -31575, -14624, -3509, 7120, 5858, -246, 27596, 36574, 26740, -13418, -16134, -31419, -13383, -11884, -6949, -25017, -33608, -9490, -19580, -59937, -87054, -75455, -41985, -62336, -64977, -55977, -23833, -27398, 695, -10543, -37360, -19896, 32750, 41737, -2421, -17616, -35208, -28125, -18012, 6840, -4105, -332, 31113, 17954, 17769, 29423, 12908, -1209, 22305, 22810, -33653, -42569, -40578, -35325, -51724, -76098, -65819, -54068, -19320, -16549, 4179, -36347, -62909, -13246, 8249, 2171, -17231, 34908, 8051]
7071H051P706J7660j6901q796l4844J2265K5862j1996J121m54P96J2097j6081
7058c514j1100K76M151L8558O405k8630l8477K4537J3590m9828J3086J6225k3511
7045c8232k1354K806O069j4795j7247K3581O1828K9045O630N066K485m4856j4300
7032a3274K6431L6953P401p61J0286r519j8469J0510j0215l7908o443K0481l3612
7019a8139j0046O229j3500R513p515n7094P306L8901J7310k2692m5231k6502J8087
7006a03373K7431N390o7l943J3636K4840m377K5299j3725k4325L708R787J0749
6993b8970J093k8454M305M1713L5959k6951l9914j9946K5778L3126J1269P100
6981A6108K1519o168l2176l3422J8042J3430n1641J4826k8740k2834K7993P333
$$ y = [8051, 15757, 33417, 16516, 7720, -27124, -14859, 11003, -993, 128, -326, 470, 12567, -3514, -14614, -14338, -10187, 28371, 34776, 6146, -32331, -7794, 5796, -44032, -30946, -14721, -38232, -59586, -56780, -50711, -65506, -82753, -59172, 2656, 31701, 38331, 43397, 45882, 1026, -13274, 13157, 50110, 57511, 56750, 67036, 57517, 39048, 49558, 39343, 1435, -5008, 15473, -18139, -28185, -21956, -35456, -25943, -33458, -90552, -83246, -44345, -27035, -49727, -94958, -121460, -103373, -75942, -70552, -70619, -74562, -60926, -36086, -40463, -15164, -28889, -53214, -49506, -39719, -28970, -27877, -56331, -52026, -10313, 25646, -1305, -41219, -61165, -35387, -2261, 9008, 16108, 37627, 31459, -717, -34139, -16097, -2667, -54308, -39482, -68222, -91056, -63063, -55730]
6969e5730M4014L9525n4191m1761K8496o533J2823O876k7072J9033O8438J2301
6957D6219k1909m965k3521j1890K4854J6218k6135L4976j3586m8829k0083m516
6945e3167L5180J5843M1002j6085l8266k7670l3308Q210L1687O8736k0166j8271
6933f275J5880L9079n727n586k8148Q133J6082k9150k41j4894o758J0213j3261
6920b0653J1753J693Q856J3366J7447k3143q056L0890j1835n0490l7039l4221
6908a01432L6991L8513p293k4333K94J4495L6273n2557k1286J3694N3912J4273
6896A544J0042k1194q658J1617n11n6R763j3154J3899m6662l7487K0885L9882
6883b0090j3130J5243N518k165J4597j2146n355p175J143J620M749l3010k4982
$$ y = [-55730, -11716, 27809, -26382, -68143, -39647, -46180, -33357, -26481, -53553, -34520, 33918, 46219, 24310, 19345, -4176, -16066, 8788, 25006, -1129, 33847, 20261, -28568, -48651, -53167, -17987, -2144, 38858, 22773, -15493, -43163, -76471, -68261, -36574, 32162, 11996, -6275, 9605, 48684, 42957, 37371, 9223, 17356, 33438, 4288, 4047, -10847, -17605, -7392, -20653, -8900, -7207, 1649, 15015, 32462, 9319, 1263, 32153, 20318, -30172, -67211, -101432, -64441, -25928, -33221, -57554, -57260, -42765, -6492, -59049, -80335, -66641, -12729, 1544, 11586, -9608, -18266, -6649, -7160, -7216, 2547, -10607, 3292, -43370, -80857, -59972, -20090, -33220, -17977, -12459, -14624, -27, -12173, -17528, -24703, -23560, -21940, -17191, -50201, -75183]
6870g5183J1761M1229M0310J1926j6233k7011J1826L0242j4761l0334m9639J8411
6858d7456N8549J2900p80K1540k9185j2084p183k8678n814j8976J7489O777M1012
6845H111J1161j1312l0136n1394O483j266J6921j5386k3185N8887J8656n561q550
6832b6571l014K8600l0660o588K7618K269J188q906k5159L513O168L1095M2151
6819D1704q162j5098R358j077K9824l4171m5951L3680L4878l3555k8085R960N0226
6806D3531L2500l2315l4392J663J6815m976o3536K368L9338k4221K627o054Q723
6793a7929L5089p602k5334K145j5306M4n251K1164n856j0306l0657j8389L1122
6780d7066J8472L0871L6164k2127m066k1089j5179m915n4656K8515M9369l2487
$$ y = [-75183, -63422, -22193, 18117, 30043, 13810, -13201, -1375, 28867, 14106, -16228, -65867, -47456, 11093, 23993, 23213, 44753, 15568, 3484, -3699, -32377, -38191, -57167, -39678, -32901, 8111, 19272, 7960, -22176, -73570, -67087, -68353, -51432, -66818, -90003, -31116, -12460, -18021, -26571, -29585, -985, -31645, -38233, -10615, -8346, -7158, -16064, -41223, -37710, -31542, -447, 41704, 33542, 18444, 27802, 26725, 56549, 22378, -23573, 10107, 44985, 11430, -16655, -6695, 43531, 76031, 43716, 9324, 10987, 27802, 22826, -40710, -38342, 996, -23225, -20598, -26652, -17929, 17160, 9558, -15776, -13631, -28937, -28893, -34144, -12980, -18836, -29142, -59799, -78188, -47066, -28594, 2277, 38441, 16314, 12248, -8841, -24020, -28935, -83591, -55076, -5707, -38194]
6768c8194j6498J0218L6306K7538l070l6543k1598q649J9014j3617j2224J055
6756e6262k1217j7630J9655L0747N6318j1987P381j5039r274l2474Q798N364J0444
6743b5176N4637J4123j7134J3737Q46k8479n9552M7193K8171o108k0732l7384
6731c5858k2488J7217K2704L9584K6818m8538M642l5345j9484L9382J1051o592
6719f907k1254L1667j6890l0980Q408K6603J3025j9638k8767L608L0745j4504
6707b4884l6910j0544O0393J7608O766m283q749j2576K6585k157j0473r432j7425
6694b6081j9095K5191L3334o548J8341L552o684j1213L6189m0726k4222k7006
6682d4968J1818M4507J851k6285p326k1335o627k9409O696L6797L5548J7038O190
$$ y = [-38194, -54692, -44474, -8168, 19370, 16300, -20243, -41841, -50490, -31476, -45093, -57317, -56262, -77479, -95109, -75454, -44707, 11611, -376, 7005, -8034, -17308, -49782, -40984, -35620, -25176, 29461, 43584, 26450, 40187, 41033, 12554, -46998, 195, 28366, 22258, 1526, -35858, -58346, -41129, -18425, 21159, 47977, -561, 4081, -31264, -50748, -11366, -315, -6907, -28161, 3506, -13384, -44364, -35956, -9353, 3672, -15966, -44733, -41125, -10380, -24884, -61794, -72338, -11945, 5663, 12429, 8146, -603, -13179, 13406, 11249, 776, -8656, -26081, -45176, -19985, 13349, 6801, 25142, 28694, 22010, 10797, 46986, 6260, -17962, -44968, -33150, 11357, 13208, -13077, -20403, -41738, -48365, -77774, -71078, -34281, 1267, 18305, 24495]
6669B4495k6926l2012M6896K8038N992j5541J6017l243k1105l7844m3399R656
6657d8976K7736L0048J3240j1414J5029Q11n9629j4469K0569K6870K8106l7451
6645i530k9997j5556K992K4472K0228j919j7728N9267k9986j1653J2839Q545k2588
6632a0614k2522k6829P6270M004J5454k1181j8729q884k5960P102j5555j9213
6620f6657K143M3613k825j2614J1708L383j5559J596K4612J5198k1950n923L687
6607a9588N569K325J9928K9887O160k4751l10k1651n491L1016J631K0847J0333
6594E5905l8749j9040k766l1661j9833l6803Q125M6765K4617N349l346J0847m789
6581e379j5264k2030R110J1374O604m0664k8579L2041K2617J8566q398m490P008
$$ y = [24495, -2431, -34443, 12453, 40491, 46483, 30942, 46959, 43716, 22611, -15233, -58632, -48976, -21240, 8808, 22048, 10634, 25663, 26474, -33155, -47624, -27055, -185, 27921, -9530, -39527, -55083, -52091, -27619, -7391, -9310, -27038, 32229, 2243, -9410, 3429, 11974, -10614, -33136, -59965, 16305, 20309, 35763, 14582, -4147, -13031, -38991, -31889, -47444, -66657, -64514, -20901, -23726, -36340, -24632, -21249, -36808, -35212, -10600, 4598, -17352, -23275, -19588, -14019, -11694, 8234, 38121, 44281, 19530, 19220, -2431, -7922, 23094, 24725, 45572, 55905, 17156, -1884, -4650, -36311, -56144, -92947, -84822, -38057, -13440, -8091, -11437, -590, -5379, -20643, -42673, -33563, -22189, -15585, -56249, -84828, -52787, -30170, -11604, -20002, -24492, -17484]
6568a7484j3755l1096J3209o062j8762J0238L798L5730J0479R220K8022k2818
6556G19j5910J247p563l2694j4521N9926k2838k5250J7654K227M8579q19K7782
6543C8539j015l0317j8127O21N1k4855M7615K0007j3681k4589l1035K4791j1036
6530b3031n471j6140j2618M8175R336R083l3251k2828l2801J2980L2340N135K95
6517b8796o178l6337K6812K8974j9842K4048K3269n64K5910j7184J4108j42J4459
6504D8537j4654p5848k8597L4176j3942M1P4754l37m914r582m0629J7221J8720
6491D946J2824j3515m4130M399N5251J3814k0487q365J0524k5061o213m229K6489
6478F247J1612K7206Q986K2783p6378m6540K134K1597J1430N219J5961j0899Q822
$$ y = [-17484, -31239, -62335, -49126, -55188, -73950, -63712, -59914, -24184, -13705, -4485, 23537, 719, -15191, -13944, -21507, -54201, -68722, -8796, -31634, -56884, -39230, -37003, 11576, 10757, 38539, 37524, 7207, -10920, -10299, -10248, -35103, 12512, 32519, 18838, -5751, -36786, -11995, -23031, -28502, -44642, -57260, -9085, 251, 9334, -23917, -46745, -79546, -66566, -34226, -29091, -28796, -34974, -71311, -44499, -15525, -35367, -11319, 11950, 11386, 37296, 20112, 34220, 34078, 48537, 33883, -41965, -70562, -36386, -50328, -50287, 24467, 24130, 19216, 9634, -30995, -13774, 4946, 17770, 4255, -39875, -35476, 19775, 33589, 13102, 4737, 15261, -9800, -16013, -20242, 6247, 17859, 45065, 54051, 76834, 456, -46084, -43950, -22353, -10923, -5704, 10257, -642, 8180]
6465H180k3766k5676j2821q7K0395K0021j1303j9024M1940L4531N615m3385k5579
6452c0959K9712P916J0242J8823l4610n402l0149J2244K056j2163J2973J3233
6440f084j5304k461M1079p175j9012J752P223l0766J8296L3136J1423o046Q880
6427C4941L302j4670n746K0193j6690j2449k7971p733j5494k127K783J0154k4094
6414e5601k522L6292j2329K5748L8022K2199k903k5796P502l7511k2145K2822
6402f222l4891K9621M4830k4174k974J6126m76L2428r771m3172l3561l2079L3074
6389c1241J5825j7808K4330J2806R435q388J1339q963L193k2513m495p471l1740
6376e5691Q160K3927Q744R245J750j3759l0461l1252J1202P2943P9409J6758k0055
$$ y = [8180, -15586, -41262, -54083, -54170, -33775, -13754, -25057, -44081, -2141, 32390, 38005, -5380, -30959, -1247, 6669, 16911, 35734, 1124, -4278, -34427, -22183, -20127, -32290, -19317, -6084, -21388, -23849, 17230, 10055, -8957, -7205, 18, -30748, -12452, 20684, 32107, 26061, 34941, 38243, 23573, 17827, 38020, 21330, 8881, -19090, -26823, -42317, -44444, -41661, -31507, -55601, -58123, -21831, -34160, -8412, 29610, 51809, 48906, 23110, 30612, -6899, -29044, -6222, -41113, -11492, 33338, 9164, 6190, 22316, 21840, 54268, 44497, 1325, -32236, -64315, -31241, -15416, -33224, -8894, 3912, 13347, 4959, 16298, 7335, 10528, -11985, -16480, -23951, -55691, -47531, -23604, -14860, -5615, -3865, -17624, -48085, -79337, -68135, 4808, 84217, 100975, 80920]
6363H0920m5095K0188l7211j201K0390k5174l443k4522M0670L5230l6096m4045
6351a9389j0943K1337K3934J8168o263J3211r103m0588p664j0626l3561l5640
6339i7127M6646K8145j313P781j2126j8018L0534k8080J754K6366k2222j5748
6327e3408j1858J8012J3236R050l427J9140j643J4166j4231K1562p207Q126N3064
6314F4582m9041q5949M1872P1649m377p541k2933k8111l842r183J9750J6990N796
6301I662j5116M664L2024j0421l0457k7908m5298j1461N0191N0131Q143n275l946
6288D933R837o153l3407j7635K9249L951j0785P579r046j6651j3010o156M8378
6275h916L847J4947P081K729J4752j9437l3696J0322r788m6976L5244M1894L7324
$$ y = [80920, 35825, 56013, 18802, 17601, 37991, 12817, 9374, -15148, 25522, 60752, 24656, -19389, -30332, -8995, 14939, 33107, 26844, 40055, 30952, -9636, -17300, -27926, -61487, -97127, -50481, -22336, -23649, -15868, -27994, -46012, -15478, -43558, -41804, -15438, -37660, -53408, -65266, -47254, -34018, -24968, -28395, -9255, -10898, 3268, -10963, 10599, 3392, 11518, 64582, 15541, -70408, -28536, 43113, 38736, 31195, 8262, -19849, -23691, -32874, -13124, 3866, 9662, -5454, -790, 31234, 20813, -9644, -37552, -82850, -94311, -44120, 6011, 14154, 8879, 4933, 14770, 8617, -24790, -42425, -13176, -9225, -20010, -12431, -21477, -38128, -51138, -57294, -8916, -5069, 9878, 16959, 19688, 34440, 15003, -18693, -8371, -18159, -65135, -29891, 12003, 49327]
6262D9327K355j7451J3496J6391o046k2483j3527p604K7917M770k7907l5886p728
6249b4376j0325n2881l0715O343N3222j0255P888J5592o749L0527Q031p5471J4942
6236g4227K1692k3415j2752J5770L6034K1673k0544M1425K1433k2679J7653Q89
6224B2952k6333m833J5465J1662k7769L1899K8961l2080k6733n6950L0697M8792
6212A5730k8529Q285J3463r089p615J9565J7174m0687l4836M2978K5799Q216L8599
6199F9053o117n791o729l7742l1676k6173N70M1892J8742K3856o963m2707J66
6186i619l282o837M627P4825K6959l1350l4389n089J0765j6463o941k304q060
6173g158k7482n674J7528K5682P03O815m4648j4879L5348j2439J2057J1542p289
$$ y = [49327, 51682, 34231, 47727, 64118, 58072, 35589, 22062, 14458, 42375, 47145, 19238, -16648, -24376, -34701, -87582, -118297, -111954, -58732, -68987, -61099, -45507, -52256, -21729, -13698, -89169, -74227, -52535, -75950, -88702, -72932, -36898, -15225, -35769, 5656, 27089, 4410, 22063, 22952, -3381, -8214, 7251, 18913, -8856, 23043, 52004, 19924, -6809, -63759, -33062, 15730, -12799, -4514, 8949, -140, -7755, 11810, 28984, -11703, -46539, -3561, 22238, 30454, 69053, 62936, 57145, 50416, 12674, -19002, -45175, -44605, -2713, 16029, 39885, 32922, -9785, -9619, -12901, -19738, -15111, 59714, 86673, 55323, 20934, 15845, 26610, 10147, 3206, 902, -7158, -34640, -40314, -22786, 2896, 3599, 10414, -34234, -49113, -13765, -26204, -14147, -2605, -9894]
6160i894Ok285j6933K5324k635M145L5250j046l9741O873J3838q503l675m982
6146d258J8330J7623l8177k5750J4239J4031l0146l5045j9150j9062L91K9327
6134g7647M0375J067K6603J5632j1785J1658L252M015k22l0766m3j5832J978M0035
6120H320L1278n34m791j5433Q77L3819J7062k9003K7945P376J9322j3708k8410
6107E4120k0378m4751j1761J2887j2208k1883J3595J0274L4069L6723k0115k1722
6095H850L062M5922j0390j5825k4851k1632K7461Q582K4546o923k5011l055l894
6082F842K7673j2954n344k8875j6339K6919j9992J4741M2364J3087k5530l1236
6070h644k0184K1557O8222K9307j1908j1254j1988O93O349j7922j0037j7189L6174
$$ y = [-9894, -9888, -12173, -29106, -3782, -6417, -2272, 32978, 31932, -7809, -936, 12902, 4399, 724, -4258, 14072, 31695, -6482, -32232, -17993, -3962, -34108, -69153, -88303, -107365, -106974, -77647, -37272, -36205, -9602, 6030, -5755, 5903, 9155, 13170, 12948, -17818, -17861, -33693, -31715, 8320, 39598, 39064, 34273, 18840, 19717, 53536, 70598, 41595, 69540, 76916, 96238, 82530, 54120, 33742, -11009, -22770, -9883, -22091, -43974, -30379, -20105, 13964, 50687, 30572, 8850, 11912, 57834, 47444, 31619, 6768, -14864, 12597, 21179, 45725, 38802, 13791, 10736, 6842, 34515, 21561, 16217, -12658, -28997, -2078, -22070, -7329, 35035, 48122, 22592, -8644, -28828, -7271, 60951, 90258, 78350, 67096, 55108, 55801, 62150, 44228, 34191, 17002, 53176]
6057E3176K1038k6554j4721l5763k3991k1715J499K649K278M6695K9857K4725
6045E9173J705l9712l4615l6756L676K8002P568M422k1929k6080n2285o60J9869
6032h7622M9385K0953j5529K1496j67J6143J9886l576q090j3720l835j2388p409
6019b4473K9629k6921m7993l8767L8528N6746L4286m0223l4545J5366K2304L2730
6007A6667J5599j174j5998k3425j7836p935J1816l2372L4308n426k5742j175K9654
5994b3039N9573k3741l9686K8174N5590l6505l5679p18k1497P570J0191L0742
5982A0975J9898n5810n0061K112l6157N3323L1622r775j3020M46L0570k9128j6322
5969f1327J2865K7127n178k593j3505j0642J4045O500K1844J1217J875k45M0589
$$ y = [53176, 74214, 47660, 32939, -2824, -26815, -48530, -47031, -44382, -42104, 4591, 34448, 59173, 60878, 21166, -13449, -50205, -46529, -18527, -10959, -6537, -28466, -54546, -106831, -107491, -87622, -38237, -17284, -32813, -11317, -11484, 4659, 24545, 20969, 12879, -841, -4676, -17064, -24473, 5156, -21765, -69758, -108525, -69997, -13251, 21035, -19188, -53733, -38367, -16063, 16667, 32266, 31092, 15094, -8331, -26167, -34102, -22286, -54658, -20350, -25776, -51518, -52693, -23039, 36534, 12793, -26893, 1281, 56871, 20366, -15313, -16031, -37528, -29958, -19767, 10975, 30873, -24937, -74998, -72886, -109043, -55720, -24098, -33873, -46893, -46447, -15877, -45005, -61327, -48462, -21335, -26513, -29106, -42611, -53253, -39208, -32708, -10864, 353, 2228, 1983, 42572]
5956D2572J912j9950k1204m5099k5633O7478L5994k1402l436K4089M735P684m3658
5943D082j2998N5179K8987k6978o7884L3599K4874N9302j7944l9522j4584k1209
5931D904L4331m261j2580L6268K1513n3054o8251O073R172J1435l461Q310k3683
5918c3284j0319J420K334M973M358L0866k7210n367K7872o20m5021J6252K2783
5905a0963O344j2417j528K6800k664l2392p125l48J7754K5397j2972k1335K0156
5892e293K4523J227R58r814J5069K609j4297J420k0056J5213j5086J3525O660
5879A6658l0111L72J6946o453m91j8710k5150R498k2756M466L1337m820l0129
5866e9343R661M8166R538m2523n143k600R160J1122Q418j0546k1660K9289K3486
$$ y = [42572, 44484, 24534, 3330, -41769, -67402, 76, 36070, 14668, 11232, 35321, 40056, 47740, 4082, -8916, 46263, 75250, 48272, -19612, 13987, 38861, 98163, 80219, 40697, 26113, 4904, 39235, 34974, 22394, 58662, 80175, 27121, -41130, -35057, -25885, -14450, -17911, -9601, -33284, -43603, -42183, -39849, -34876, -30518, 348, -26862, -32229, -4357, -4977, -49998, -33746, -10963, -4619, -17036, -18564, 8236, 5572, -26820, -33945, -34293, -16539, 8858, -4114, -25449, -5293, 19230, 20457, 21415, 11601, 26670, 29279, 14982, 16402, -3654, 11559, -3527, 9998, 16658, -13453, -13081, 3865, -2588, -3079, -21789, -46939, -37441, -60197, -55731, -24394, -29214, -59343, -49682, -1516, 8022, -34501, -39644, -42244, -33084, -21962, -13544, -24090, -45750, -16461, 7025]
5853G025J2961j2326l685o173L0375K9874J8265r297q9898o0584m3457J7365N7104
5840e2451J6403K4946K3178j1169k9648j4889P332O99K2386J3218m257o414l9004
5827d9670j6747j4139l03J2681K484L983J9841R581L0058o924P396l906j549l0521
5813c7735j8562J9261j9719L7848R762k7998j656J6432K65l5267K2299L1330J9778
5800A6038L3240o5418n7600K113O063L9890L823K6805K3352j5623k2640M066l8364
$$ y = [7025, 19986, 7660, 3975, -2198, 28177, 58051, 76316, 67019, -22879, -83463, -126920, -109555, -52451, -36048, -11102, 12076, 907, -28741, -43630, -36298, -35599, -13213, 5, -4252, -10666, -49670, -66417, -80556, -80859, -68178, -65694, -61711, -41870, -32289, -2231, -9155, -1759, -5665, -7214, -37735, -56297, -37036, -56755, -18907, -9145, -37143, -38799, -22367, -22102, -57369, -35070, -3740, 16038, 49278, -16140, -73740, -71627, -65564, -25674, -21851, 4954, 28306, 12683, -9957, -5891, -44255]
$$ [...]
##END NTUPLES=NMR SPECTRUM
##END=
