##TITLE=Analysis number 319050
Compound Code ac 35952
Project Code adrs
Chemist Name frontier sci
##JCAMPDX= 6.0         $$ Bruker NMR JCAMP-DX V2.0
##DATA TYPE= NMR SPECTRUM
##DATA CLASS= NTUPLES
##ORIGIN= Bruker BioSpin GmbH
##OWNER= nmr
$$ XWIN-NMR		Version 3.5
$$ Fri Apr 28 10:23:59 2006 GMT Daylight Time (UT+1h)  MAYBRIDGE\nmr@NMR_250MHZ
##.OBSERVE FREQUENCY= 250.131544655141
##.OBSERVE NUCLEUS= ^1H
##.ACQUISITION MODE= SIMULTANEOUS (DQD)
##.ACQUISITION SCHEME= undefined
##.AVERAGES= 16
##.DIGITISER RES= 18
##SPECTROMETER/DATA SYSTEM= dpx250
##.PULSE SEQUENCE= zg30
##.SOLVENT NAME= DMSO
##.SHIFT REFERENCE= (INTERNAL, DMSO, 0, 16.522)
##AUDIT TRAIL= $$ (NUMBER, WHEN, WHO, WHERE, WHAT)
$$ ##TITLE= Audit trail, XWIN-NMR		Version 3.5
$$ ##JCAMPDX= 5.01
$$ ##ORIGIN= Bruker BioSpin GmbH
$$ ##OWNER= nmr
$$ C:\u/data/dgb/nmr/ADRS/3320/pdata/1/auditp.txt
$$ ##AUDIT TRAIL=  $$ (NUMBER, WHEN, WHO, WHERE, WHAT)
(   1,<2006-04-28 10:23:33.97 +100>,<MAYBRIDGE\nmr>,<NMR_250MHZ>,
      <created by zg, POWCHK disabled, PULCHK disabled
       configuration hash MD5:
       84 BC 41 DB A1 6E 1D 46 DA 25 12 A5 C1 ED C5 3A
       data hash MD5: 64K
       23 50 0D 09 F2 A9 D5 0B 2E 2C B1 BB 40 69 63 4F>)
(   2,<2006-04-28 10:23:49.42 +100>,<MAYBRIDGE\nmr>,<NMR_250MHZ>,
      <Start of raw data processing
       ef LB = 0.3 FT_mod = 6 PKNL = 1 SI = 32K 
       data hash MD5: 32K
       E9 91 65 43 DB 22 E0 2E C5 E3 28 F4 D0 22 61 AE>)
(   3,<2006-04-28 10:23:51.05 +100>,<MAYBRIDGE\nmr>,<NMR_250MHZ>,
      <apk 
       data hash MD5: 32K
       96 33 ED 3D F8 DD A4 F4 8D CF F7 2F 6C E1 B5 D4>)
(   4,<2006-04-28 10:23:51.81 +100>,<MAYBRIDGE\nmr>,<NMR_250MHZ>,
      <abs ABSG = 5 
       data hash MD5: 32K
       FF 54 E1 24 40 D4 52 52 2A D0 CF 5B 5C 2F B1 68>)
$$ ##END=
$$ 
$$ hash MD5
$$ D2 22 72 58 D5 BB 16 E6 4F 94 A9 41 0F CE 53 F8
##$RELAX= 
##$RELAX= 
##$RELAX= 
##$RELAX= 
##$RELAX= 
##$RELAX= 
##$RELAX= 
$$ Bruker specific parameters
$$ --------------------------
##$DU= <C:\u>
##$EXPNO= 3320
##$NAME= <ADRS>
##$PROCNO= 1
##$TYPE= <nmr>
##$USER= <dgb>
##$AMP= (0..31)
100 100 100 100 100 100 100 100 100 100 100 100 100 100 100 100 100 100 
100 100 100 100 100 100 100 100 100 100 100 100 100 100 
##$AQSEQ= 0
##$AQ_mod= 3
##$AUNM= <au_zg>
##$AUTOPOS= <13 >
##$BF1= 250.13
##$BF2= 250.13
##$BF3= 250.13
##$BF4= 250.13
##$BF5= 500.13
##$BF6= 500.13
##$BF7= 500.13
##$BF8= 500.13
##$BYTORDA= 1
##$CFDGTYP= 0
##$CFRGTYP= 5
##$CHEMSTR= <none>
##$CNST= (0..31)
1 1 145 1 1 1 1 1 1 1 1 1 1 1 1 1 1 1 1 1 1 1 1 1 1 1 1 1 1 1 1 1 
##$CPDPRG= <>
##$CPDPRG1= <>
##$CPDPRG2= <>
##$CPDPRG3= <>
##$CPDPRG4= <mlev>
##$CPDPRG5= <mlev>
##$CPDPRG6= <mlev>
##$CPDPRG7= <mlev>
##$CPDPRG8= <mlev>
##$CPDPRGB= <>
##$CPDPRGT= <>
##$D= (0..31)
0 1 0 0 0 0 0 0 0 0.06 0 0 0 0 0 0 0.0002 0 0 0 0 0 0 0 0 0 0 0 0 0 0 
0 
##$DATE= 1146216212
##$DBL= (0..7)
120 120 120 120 120 120 120 120 
##$DBP= (0..7)
150 150 150 150 150 150 150 150 
##$DBP07= 0
##$DBPNAM0= <>
##$DBPNAM1= <>
##$DBPNAM2= <>
$$ [...]
##$SUBNAM7= <"">
##$SUBNAM8= <"">
##$SUBNAM9= <"">
##$SW= 20.6930455092707
##$SWIBOX= (0..15)
0 0 3 0 0 0 0 0 0 0 0 0 0 0 0 0 
##$SW_h= 5175.983436853
##$TD= 65536
##$TD0= 1
##$TE= 295.16
##$TE2= 300
##$TE3= 300
##$TEG= 300
##$TL= (0..7)
0 120 120 120 120 120 120 120 
##$TP= (0..7)
150 150 150 150 150 150 150 150 
##$TP07= 0
##$TPNAME0= <>
##$TPNAME1= <>
##$TPNAME2= <>
##$TPNAME3= <>
##$TPNAME4= <>
##$TPNAME5= <>
##$TPNAME6= <>
##$TPNAME7= <>
##$TPOAL= (0..7)
0.5 0.5 0.5 0.5 0.5 0.5 0.5 0.5 
##$TPOFFS= (0..7)
0 0 0 0 0 0 0 0 
##$TUNHIN= 0
##$TUNHOUT= 0
##$TUNXOUT= 0
##$USERA1= <user>
##$USERA2= <user>
##$USERA3= <user>
##$USERA4= <user>
##$USERA5= <user>
##$V9= 5
##$VALIST= <valist>
##$VCLIST= <CCCCCCCCCCCCCCC>
##$VD= 0
##$VDLIST= <DDDDDDDDDDDDDDD>
##$VPLIST= <PPPPPPPPPPPPPPP>
##$VTLIST= <TTTTTTTTTTTTTTT>
##$WBST= 1024
##$WBSW= 4
##$XGAIN= (0..3)
0 0 0 0 
##$XL= 0
##$YL= 0
##$YMAX_a= 312831
##$YMIN_a= -515482
##$ZGOPTNS= <>
##$ZL1= 120
##$ZL2= 120
##$ZL3= 120
##$ZL4= 120
##$ABSF1= 16.522
##$ABSF2= -4.171173
##$ABSG= 5
##$ABSL= 3
##$ALPHA= 0
##$AQORDER= 0
##$ASSFAC= 0
##$ASSFACI= 0
##$ASSFACX= 0
##$ASSWID= 0
##$AUNMP= <proc_1d>
##$AZFE= 0.1
##$AZFW= 0.1
##$BCFW= 0
##$BC_mod= 0
##$BYTORDP= 0
##$COROFFS= 0
##$CY= 12.5
##$DATMOD= 1
##$DC= 0
##$DFILT= <>
##$DTYPP= 0
##$F1P= 14.0000005364418
##$F2P= -0.99999901652339
##$FCOR= 0.5
##$FTSIZE= 32768
##$FT_mod= 6
##$GAMMA= 0
##$GB= 0
##$INTBC= 1
##$INTSCL= 1
##$ISEN= 128
##$LB= 0.3
##$LEV0= 0
##$LPBIN= 0
##$MAXI= 10000
##$MC2= 0
##$MEAN= 0
##$ME_mod= 0
##$MI= 0
##$NCOEF= 0
##$NC_proc= -4
##$NLEV= 6
##$NOISF1= 0
##$NOISF2= 0
##$NSP= 0
##$NTH_PI= 0
##$NZP= 0
##$OFFSET= 16.522
##$PC= 1
##$PHC0= 164.7544
##$PHC1= 4.773562
##$PH_mod= 1
##$PKNL= yes
##$PPARMOD= 0
##$PSCAL= 4
##$PSIGN= 0
##$REVERSE= no
##$SF= 250.13
##$SI= 32768
##$SIGF1= 0
##$SIGF2= 0
##$SINO= 400
##$SIOLD= 32768
##$SREGLST= <1H.DMSO>
##$SSB= 0
##$STSI= 32768
##$STSR= 0
##$SW_p= 5175.98343685301
##$SYMM= 0
##$S_DEV= 0
##$TDeff= 65536
##$TDoff= 0
##$TI= <Analysis number 999999
Compound Code 99
Book Reference 9
Project Code 9>
##$TILT= no
##$TM1= 0
##$TM2= 0
##$TOPLEV= 0
##$USERP1= <user>
##$USERP2= <user>
##$USERP3= <user>
##$USERP4= <user>
##$USERP5= <user>
##$WDW= 1
##$XDIM= 32768
##$YMAX_p= 378486154
##$YMIN_p= -488194
$$ End of Bruker specific parameters
$$ ---------------------------------
##NTUPLES= NMR SPECTRUM
##VAR_NAME=  FREQUENCY,     SPECTRUM/REAL,   SPECTRUM/IMAG
##SYMBOL=    X,             R,               I
##VAR_TYPE=  INDEPENDENT,   DEPENDENT,       DEPENDENT
##VAR_FORM=  AFFN,          ASDF,            ASDF
##VAR_DIM=   32768,         32768,           32768
##UNITS=     HZ,            ARBITRARY UNITS, ARBITRARY UNITS
##FACTOR=    0.157963299565203, 1,           1
##FIRST=     4132.6476996994, 0,             0
##LAST=      -1043.33573715361, 0,           0
##MIN=       -1043.33573715361, -488194,     0
##MAX=       4132.6476996994, 378486154,     0
$$ Real data points
##PAGE= N=1
##DATA TABLE= (X++(R..R)), XYDATA
$$ [...]
18016C1924580J873979P64359k294071n415000n643705m095930k481501j291720
18008A3340991n63851k2128P71349J740626K913681M072180M092096K709937J552332
17999C0607213J214214L51187k466224n404340n450662l863546k633179j763708
17991A0590955j221920p97717n36638n58883o33329m13710l47029l76786k63059
17982E441884j20231k02551j38055j84052j44578j83501k43737j07562j8846j46867
17972C951904j25674k0442j88039l20948o7019j52180q6883l1087p2576p6016
17962B811040p7026n8876P3784p0214j1028n6457k2541n537j73367j07057j5958
17951B286763l0647O6402P5656j4405p6138j60583p7148n9383M2750K4009J9516
$$ y = [31924580, 33798559, 34562918, 32268847, 26853847, 21210142, 17114212, 14632711, 13340991, 12777140, 12755012, 13526361, 15266987, 18180668, 22252848, 26344944, 29054881, 30607213, 31821427, 32172614, 29706390, 24302050, 18851388, 14987842, 12354663, 10590955, 9369035, 8571318, 8034680, 7475797, 6842468, 6428758, 6081729, 5704943, 5441884, 5321653, 5119102, 4981047, 4796995, 4652417, 4468916, 4225179, 4117617, 4098771, 3951904, 3826230, 3805788, 3617749, 3296801, 3229782, 3077602, 2990719, 2959632, 2887056, 2811040, 2734014, 2675138, 2748922, 2678708, 2667680, 2611223, 2588682, 2583145, 2409778, 2302721, 2286763, 2256116, 2322518, 2398174, 2383769, 2307631, 2147048, 2069900, 2010517, 2053267, 2077276, 2096792]
17940B096792p5865r4381m8333m6472R1003m0715l8721j6694q3810j9355L1887
17929A755336m6L3488m3379l0118r4020K9346L9344k5991n4315q7432p4368k907
17917A444938q6979n0301p1348j85753k8343J48409Q0811k2145o9870K4111M3547
17906A227077j08985j23030m0196m4849j2001l4635J9320n2799J19821N5556o2205
17895I43074j4500m8610k3395J09984J05696l9765R9832P7898J7086j15589j25454
17884I86257j94954r7481p6378o4591q577J46254J43904R4940K3050q86J3053
17873I64591L4050R806J830p1129j10246l9588k7029P8525p6914n5755L3510K9380
17861G71031K865m2946J3167j16393j32502o3239N1888J7970N8235N0941O0547
$$ y = [2096792, 2020927, 1926546, 1878213, 1831741, 1922744, 1882029, 1843308, 1826614, 1742804, 1723449, 1755336, 1755290, 1788778, 1745399, 1715281, 1621261, 1650607, 1689951, 1663960, 1609645, 1522213, 1447845, 1444938, 1357959, 1307658, 1236310, 1050557, 1022214, 1170623, 1251434, 1229289, 1159419, 1183530, 1227077, 1118092, 995062, 954866, 910017, 898016, 863381, 882701, 829902, 949723, 1005279, 943074, 928574, 879964, 856569, 966553, 1072249, 1032484, 1132316, 1210214, 1227300, 1111711, 986257, 791303, 693822, 617444, 552853, 544276, 690530, 834434, 929374, 952424, 951538, 964591, 998641, 1008447, 1010277, 939148, 828902, 789314, 762285, 840810, 763896, 708141, 741651, 771031, 773896, 730950, 744117, 627724, 495222, 431983, 483871, 501841, 560076, 611017, 671564]
17850F71564J081m2052l5261n0362M273J9806j7035J7627n0698p4160q0939J1782
17838C75626J14730q9961M8121N6632K5079j6923r2227l2148L147J06105K3537
17827E21718o2697K6692l9687m25j3066M5671N8256k1300o9182K2086K6702J09758
17815F04526N1143j14503l8629M2883K1661Q2079K0094L5271r2033Q080q4713
17804E35859m8173R3583J06716J04131N6592q2574P1613J30164Q7332J4067l8264
17793A031046q3049n4072m5920Q049p5952j28919m1271J31911M4322L7305j11137
17782G12313m4887J28723J2503r2952p8543q90K1734R4682J23061N511l9909J03981
17770I45327n1152o497P9088n133j0119O4066p5435q3039P5393k3195j4628k1403
$$ y = [671564, 672645, 630593, 595332, 544970, 549243, 569049, 552014, 569641, 518943, 444783, 363844, 375626, 490356, 400395, 448516, 505148, 530227, 513304, 421077, 388929, 392076, 498181, 521718, 459021, 485713, 446026, 445601, 432535, 478206, 536462, 515162, 445980, 468066, 494768, 604526, 655669, 541166, 502537, 545420, 567081, 649160, 669254, 704525, 612492, 620572, 535859, 487686, 581269, 687985, 792116, 848708, 766134, 837747, 967911, 1055243, 1069310, 1031046, 947997, 893925, 848005, 856054, 780102, 651183, 609912, 741823, 786145, 823450, 712313, 667426, 796149, 808652, 715700, 637157, 636267, 658001, 752683, 875744, 881255, 841346, 945327, 894175, 887678, 966766, 961633, 951514, 1015580, 940145, 857106, 932499, 909304, 894676, 873273]
17758H73273O2932N5069j6642q3141k0596O6123M5360m9911j08479P2160J20888
17747A017036Q239j01785L9084M8500j8602O7815J86184R1713j03470j0040q9739
17736A134935r224J03788l9878J26234K2564L6418N8991k2194L0324J52302R9696
17725A693956Q8286q9587p6753J28711J37618j0296L7096j7658j22893K0169R3559
17714A882208o5092j05534J5874J28245L8185m2892q3667L4185R2176J43773l9182
17703A998279m7562p018K5395l1112m3973j457J13452J19702M3147m0868N9011
17692B186996O7733m7259J3742j26235R7711k9693L8349j8889m127O4218J13335
17681B355881R2826l3939j49573L8702K9089K6923P5442N8778J32276J86595J30681
$$ y = [873273, 936205, 991274, 974632, 891491, 870895, 937018, 982378, 932467, 823988, 896148, 1017036, 1025275, 923490, 962574, 1011074, 992472, 1060287, 1246471, 1338184, 1234714, 1224674, 1134935, 1125711, 1229499, 1189621, 1315855, 1338419, 1374837, 1433828, 1411634, 1441958, 1594260, 1693956, 1782242, 1692655, 1615902, 1744613, 1882231, 1871935, 1909031, 1891373, 1768480, 1788649, 1882208, 1817116, 1711582, 1727456, 1855701, 1893886, 1850994, 1767327, 1801512, 1893688, 2037461, 1998279, 1950717, 1943699, 1969094, 1937982, 1894009, 1892552, 2006004, 2125706, 2168853, 2127985, 2186996, 2254729, 2207470, 2221212, 2094977, 2192688, 2162995, 2201344, 2182455, 2178328, 2242546, 2355881, 2448707, 2414768, 2265195, 2303897, 2332986, 2359909, 2435351, 2494129, 2626405, 2813000, 2943681]
17670B943681q2234M9370J78744Q7875O6974K26581N06625O27033O80478P91001
17660F076128P24459O31320N29874K35455j35029m00078n66627o95842m42807
17651E956853j4542L12986N98269Q60169J167858J147724R43187O42952J09144
17642A1724600m54876q53446j068819j336616j232863r60956o28959l00507l82674
17633D504884k93717j20206r8358k01027o1451o2065r0602p5886j4246K6890m0337
17622C473879j27304n9020J7061K6497N9718K1846l2153J20023J41666J87891
17612C830104K69652J75812J80133K65988M55742O06019N65249O92080J019413
17603H060192J372075J868914K460364K896049L251581L084088K729821K285738
$$ y = [2943681, 2861447, 2910817, 3089561, 3177436, 3244410, 3470991, 3977616, 4604649, 5285127, 6076128, 6800587, 7431907, 7961781, 8197236, 8062207, 7662129, 7095502, 6399660, 5956853, 5942311, 6255297, 6853566, 7713735, 8881593, 10029317, 10972504, 11615456, 11724600, 11269724, 10416278, 9347459, 8010843, 6777980, 5817024, 5188065, 4887558, 4504884, 4211167, 4090961, 3992603, 3791576, 3730125, 3668060, 3577458, 3501572, 3487326, 3514216, 3473879, 3346575, 3287555, 3304616, 3331113, 3390831, 3412677, 3380524, 3500547, 3642213, 3830104, 4099756, 4275568, 4455701, 4721689, 5177431, 5783450, 6348699, 7040779, 8060192, 9432267, 11301181, 13761545, 16657594, 19909175, 22993263, 25723084, 28008822]
17595B8008822J566133N00609o50254j525456k411556k685605k336844j998784
17587A8467065j942475j504213j201188r64361p61393o48765o05587p34031p43744
17578I361308p68993p23361n98016n49553n28034l97826l66610k50012l24887
17569D854016l10175l02502j29778k25722j55698n9154j62330p2678j71756r7842
17559C166381r9436j59098O583k5585j05785j39917M5340j48223j89640n6523
17549B294097j4396m3726p5439J2605m6081o2690m6579K2803J14450n6141l38
17538B098565j06543j10937k51l261L2861M1923k14557r0620o5691j63614j3988
17527A403887n0376M8463Q5438J862j62287n8387j1147L2091P8647M9063j46717
$$ y = [28008822, 29574955, 30075564, 29425310, 27899854, 25488298, 22802693, 20465849, 18467065, 16524590, 15020377, 13819189, 12854828, 12093435, 11444670, 10839083, 10105052, 9361308, 8592315, 7868954, 7270938, 6721385, 6193351, 5795525, 5428915, 5178903, 4854016, 4543841, 4241339, 4111561, 3885839, 3730141, 3670987, 3508657, 3435979, 3264223, 3166381, 3066945, 2907847, 2914430, 2888845, 2783060, 2643143, 2688483, 2540260, 2350620, 2294097, 2279701, 2235975, 2160536, 2173141, 2127060, 2064370, 2017791, 2040594, 2155044, 2098903, 2098565, 1992022, 1881085, 1880834, 1877573, 1910434, 1952357, 1737800, 1647180, 1581489, 1417875, 1403887, 1353511, 1401974, 1487412, 1489274, 1326987, 1268600, 1257453, 1289544, 1368191, 1417254, 1270537]
17516A270537j4284j450o3838M404l6031j14345j52202r7880N5440J06064n2191
17505I04224o0631P4072N1842p9371n8886p9690R9824k8884p7619K2747J18021
17494H85649M7014J5589p6565j04238J13046p933m3596N8723j67676p3892k7799
17483F18322j3475L6387o8475P4578R3231N719j33514K9662J57065K713N8642
17472H60855P1956n3715n8852P0752J06899p8743n8007l7046k9641J6838q9299
17461G21997j23048j13815r2242K6083R1564n3636l2791o8267K9969L0365P7288
17450D93467k1550L8988J07732M9585L2939j40301j68846r5918O53m8571L1232
17439B79410J6466O9191M4527L1297Q9579J21666n3060k11460Q0257L9981P4942
$$ y = [1270537, 1256253, 1254803, 1190965, 1195369, 1159338, 1044993, 892791, 794911, 850351, 956415, 904224, 843593, 917665, 969507, 890136, 831250, 751560, 851384, 822500, 744881, 767628, 885649, 932663, 948252, 871687, 767449, 880495, 872562, 828966, 887689, 720013, 646121, 618322, 604847, 641234, 572759, 647337, 740568, 746287, 612773, 642435, 799500, 802213, 860855, 932811, 879096, 820244, 890996, 997895, 919152, 861145, 824099, 794458, 811296, 721997, 598949, 485134, 392892, 418975, 510539, 456903, 424112, 355845, 385814, 416179, 493467, 471917, 510905, 618637, 668222, 701161, 560860, 392014, 296096, 296749, 248178, 279410, 295876, 365067, 409594, 440891, 530470, 652136, 599076, 387616, 467873, 507854, 582796]
17428E82796O0873p7429k51433j01763J35600P4397j1905N8356j47760j88654
17418A33078m9994J16069K3362J11435J43842K4513l7723j01318j26438j9790
17408B17036l5030n3630m5294k466L3437J0610r9930J78387J39807n1208j2566
17397B79153O2185R7707K9992l576p5517k04771m3740k7563l7887o8942l9165
17386c2124M8803O7319K26155R0526k63609j08570P1268N0227K4395N6237L8093
17375B68720r4323k2654K961l376m8107M6419N7098p7979j5386O0866K6792k782
17363A98249j14878j86010N059j7400J0097J56552J80466O384k2145J5655k3746
17352B08283q1500l4464N8083O345j3898l3204p4715L6227J61508P1106m8899
$$ y = [582796, 643669, 566240, 314807, 213044, 348644, 423041, 411136, 469492, 321732, 133078, 83084, 199153, 222515, 333950, 477792, 502305, 464582, 363264, 236826, 217036, 182006, 128376, 83082, 80616, 114053, 124663, 24733, 203120, 342927, 291719, 279153, 341338, 439045, 469037, 465461, 389944, 185173, 141433, 113870, 75983, 7041, -32124, 16679, 83998, 310153, 400679, 137070, 28500, 99768, 149995, 174390, 230627, 268720, 174397, 151743, 154704, 151328, 103221, 149640, 206738, 128759, 113373, 174239, 201031, 198249, 83371, -102639, -97580, -114980, -104883, 51669, 232135, 238519, 216374, 232029, 208283, 126783, 92319, 150402, 156747, 142849, 109645, 34930, 71157, 232665, 303771, 254872]
17341B54872k29388m2202J27713Q4548j78634j38019J7100L7122K8638J91885
17331A53635k256N906K5875q3752j9449q1244L5827M333j05599j13071M5012J54364
17319A9581K3803j161j1328n1820J62292Q2887m4255N7419j10672r8444o4760
17308c6458q6407O1892R0096j5946J7798J32492j52992k5230J51214j7284n2264
17297F6911M8489j26687o5596l8703J2032O2498Q8824l9579m3231n590J22063
17286H1431J55283Q9157j15032j53192k6236P8194k71Q6077l5536j64504m0007
17275d4636n993K7573n3483o2692L1203O6393L8354L7140M0431m916K1343q9065
17263A652J7860O4246j1459j10340P4139J05725M6174j09550K2793M3498J5823
$$ y = [254872, 25484, -16718, 110995, 195543, 16909, -121110, -104010, -66888, -38250, 153635, 151379, 157285, 183160, 99408, 79959, -1285, 34542, 38875, -66724, -179795, -134783, 19581, 43384, 42223, 30895, -20925, 141367, 224254, 179999, 237418, 126746, 28302, -36458, -122865, -60973, 29123, 13177, 30975, 163467, 10475, -14755, 136459, 119175, 66911, 115400, -11287, -76883, -115586, -103554, -41056, 47768, 8189, -35042, -40632, 81431, 236714, 325871, 210839, 57647, 31411, 109605, 109334, 195411, 159875, -4629, -44636, -50629, -23056, -76539, -139231, -108028, -41635, -3281, 33859, 74290, 69374, 90717, 1652, 19512, 83758, 72299, -38041, 36098, 141823, 187997, 78447, 101240, 144738, 160561]
17252A60561n9703l4259k4828o1855j14797m0090L0194l7787R4217J71474L6314
17241A19441m4038K3523m9313M2951K6470l7467l8504N1049j46963K4957N7299
17230B9405o580O1083L9306L2967j22691j1874N4455K6206j26684Q889O0734R422
17218E4638K1842j1082J00810m0331j78827r800Q4687O368O4800O4138p2739O5507
17206A50011J33022M1065j98306q2783j23671Q1544J94763o3304p7480j10513
17196e5652M4868J37093l423j19871l5926l0663M9116Q6064N317o0334k8358K5980
17184A4211l6731l6615l3975n0246N1295M2250j4526J01336N6486o6661J6956
17173D3780p344k1979L0114o630J7709O8620M7098j5235J3948o2554o4763p5549
$$ y = [160561, 100858, 66599, 41771, -20084, -134881, -174971, -144777, -182564, -88347, 83127, 119441, 75403, 98926, 49613, 92564, 119034, 81567, 43063, 94112, -52851, -27894, 29405, 22825, 83908, 123214, 156181, 33490, 21616, 76071, 102277, -24407, -15518, 45216, 54638, 76480, 65398, 166208, 125877, -52950, -62750, 21937, 28305, 93105, 157243, 84504, 150011, 283033, 324098, 125792, 43009, -80662, 882, 195645, 132341, 54861, -55652, -10784, 126309, 122886, 3015, -32911, -63574, -14458, 71606, 76923, 16589, -11769, 14211, -22520, -59135, -93110, -143356, -92061, -49811, -64337, 36999, 93485, 26824, 43780, 36436, 14457, 44571, 37941, 55650, 124270, 171368, 156133, 170081, 107527, 42764, -32785]
17161c2785l0884N5849K3802J13659r1083n8031N5389k6141j15157k8910J7954
17150a16338k6473p449O0997P0570J5718r532m7394k8246q7465j088K2332R2803
17138f1565j678l4528k3284k1456J24208r4799j1181L5073P624L5225K4355L094
17126a8912J07704k3822j15389p1546Q0216O2215j4049J4852p730o102k7149k2194
17114d1906q7098j4804J13292R1664Q9825k7555l2280m4442N9984j7362M3090
17103A32408j19800q797o7425l9526L8842M3618j16677k5537J8251K5128j9473
17092a38988J46599O8677r3505l6403R9283L9803k9432j3196J2283R706P120Q7733
17080A59680J9733r4544m9181o2711j0331p963J66099j9416O6558J15977n7322
$$ y = [-32785, -63669, -7820, 15982, 129641, 38558, -19473, 35916, 9775, -105382, -134292, -116338, -142811, -150260, -89263, -18693, -2975, -12507, -59901, -88147, -175612, -176700, -154368, -61565, -63243, -97771, -121055, -142511, -18303, -113102, -124283, -89210, -81586, -46361, -22006, -18912, 88792, 64970, -50419, -121965, -41749, 20466, 6417, 21269, 13539, 7437, -19712, -41906, -129004, -143808, -30516, 61148, 150973, 123418, 91138, 46696, 106680, 89318, 132408, 12608, 3811, -63614, -103140, -64298, -20680, -137357, -162894, -144643, -119515, -138988, 7611, 76288, -17217, -53620, 45663, 85466, 56034, 42838, 55121, 64827, 71947, 159680, 179413, 84869, 35688, -27023, -37354, -45317, 120782, 101366, 167924, 283901, 226579]
17069B26579j25050r4707k6007N8033p2762o7799M2458J75387O598p6709l3730
17058A2291q4926o2908R1003J7450O0888M2812N7038J14648r6170j61960K9401
17047A9567J7816J41587Q2582p5335O1836R790j21466k03593O86P4659J60449
17036A68578J4777j49045j04863p7826k20988Q9768M7034J02380J7794O7345J70385
17025A25339j42584j06010O0150J6148o594O3070j02848J2829P4832o5777N8910
17014a2535P051r8348J11276M263k2349J5045m9812O7036j955J6667n277p544
17002B3518m0306K940K863n555Q2895q3142j98081n2060J00316J38147J8605l9972
16990d9832o4613J6742m260N6127J36799O6629o9975o8013k7382M4426n7630n7272
$$ y = [226579, 101529, 6822, -19185, 38848, -33914, -101713, -59255, 116132, 122730, 46021, 12291, -72635, -135543, -44540, -27090, 33798, 76610, 133648, 248296, 152126, -9834, 19567, 37383, 178970, 261552, 186217, 248053, 257843, 136377, -67216, -66530, 8129, 168578, 183355, 34310, -70553, -148379, -369367, -279599, -232565, -130185, -112391, -45046, 125339, -17245, -123255, -63105, -46957, -53551, 9519, -93329, -80500, -5668, -71445, -12535, -5484, -103832, 7444, 11707, -10642, 4403, -45409, 21627, 19672, 36339, 31062, 23518, -16788, -13848, -10985, -16540, 66355, -16787, -214868, -266928, -166612, -28465, -9860, -49832, -114445, -97703, -101963, -45836, 90963, 157592, 87617, 19604, -7778, 36648, -20982, -78254]
16978g8254P0249n1280q3935J7952K0031J03492K0861M275k1399K8371l4305j20971
16966a24913p3914p0488J5159J38136J28572m675K5036m8751j05345j14927M0045
16955a96065n3289Q8016M5430M4951k7623K7200l0354O5724M6953Q2037l941k050
16943H6989P9096m8077k8241p7877j23809N896L3625J03245J6051l0695J8504
16932C4707P8957J03021o0660k2831m6132j84776K6047J20183q3969l9523J09341
16921C4365J22325n1689p2769m6526l4696l3698m5455K8325j6011K056j2703M4532
16909h1944J54472O4192k4816j9473O0093j14133j40616p035k4389l2857J0403
16898a56103P8710J25602J24756j27553j48172m029J1385J41475N4046m0795j11350
$$ y = [-78254, -8005, -59285, -143220, -125268, -105237, -1745, 19116, 23391, 1992, 30363, -3942, -124913, -198827, -269315, -254156, -116020, 12552, 7877, 32913, -15838, -121183, -236110, -196065, -249354, -161338, -115908, -70957, -98580, -71380, -101734, -36010, 10943, 92980, 89039, 86989, 166085, 118008, 89767, 11890, -111919, -106023, -72398, 30847, 46898, 16203, 34707, 113664, 216685, 156025, 133194, 87062, -97714, -71667, 48516, -35453, -74976, 34365, 156690, 105001, 32232, -14294, -48990, -82688, -128143, -99818, -115829, -113773, -126476, -81944, 72528, 136720, 111904, 92431, 152524, 38391, -102225, -109260, -133649, -166506, -156103, -77393, 48209, 172965, 45412, -102760, -106789, -95404, 46071, 100117, 59322, -52028]
16887e2028k7703n2777M0864Q908J8333m5722J48446O6091k3443j15336N1588
16876A7221J02672N675O2999j1492p6834k1762m06N9336q7642j31763M9698M9328
16864A7030l3208j809k7472j50690m6241m4156J49207Q2202J22115J03452q1745
16853H8685j70215m1693k5260Q3200k38J60192L9159k28029j0028O40N319j23669
16841b21937P6025N5670k8520O5350O7305K02438Q109j2952j1360j16983p6023
16830G122r2980j16373K0118L0867K1153n2277M1056K08299Q7278m7515j0679
16819I6069J5738j2299k9430k0637n4116N9578P4297o6644R630k8286J02097K0222
16807A66219q8079j8626p9292l5289K4043j10886k6817J31640J21650M6230o5146
$$ y = [-52028, -79731, -132508, -91644, -82736, -64403, -110125, 38321, 104412, 80969, -34367, 17221, 119893, 125568, 188567, 177075, 100241, 78479, 78073, 137409, 49767, -81996, -32298, 17030, -16178, -17987, -45459, -196149, -242390, -286546, -137339, -55137, 66978, 170430, 88685, -81530, -123223, -148483, -65283, -65521, 94671, 133830, -94199, -104227, -103587, -98268, -221937, -145912, -90242, -118762, -53412, 13893, 216331, 224440, 211488, 200128, 83145, 7122, -85858, -202231, -182113, -151246, -130093, -182370, -141314, 66985, 154263, 106748, 96069, 111807, 99508, 70078, 49441, -4675, 54903, 129200, 62556, 72186, 43900, 145997, 166219, 78140, 59514, -19778, -55067, -31024, -141910, -168727, -37087, 84563, 130793, 65647]
16796F5647K7953j8418l0644N6232l9458k6330k457m5763m3961p3312K5946J07876
16784C311J25526N9473r9905k9743J484j54M2218p2531n8727q6127N1936L4761
16772b8478m7606O1248J2456q2267J24979K1j494r9060j45245J15585L6243q6046
16760a39664N3310J2487J58036l6458j17485j2022J7879j03107O0879j7923O402
16749a17666M5787n4069R999P0562r4041l6637J13608O8599j3393q6322J58218
16738F4645L8993n2355j33323q765l4880j2585o0995P1958J61685o0394O5828
16727C9812P4129M1116o3777k652O8693l4468j35713J395O4758l6214j15721L7164
16715f1478K30018r0984j16692j27109O7605k2842n2170K1787K6814k84J32682
$$ y = [65647, 93600, 75182, 44538, 100770, 61312, 34982, 32525, -13238, -57199, -130511, -104565, 3311, 128837, 188310, 88405, 58662, 60146, 59992, 102210, 29679, -29048, -115175, -63239, -28478, -76084, -14836, -2380, -84647, 40332, 40353, 38859, -60201, -205446, -89861, -53618, -139664, -86354, -73867, 84169, 47711, -69774, -81796, -63917, -167024, -106145, -124068, -117666, -71879, -125948, -115949, -45387, -139428, -176065, -62457, 6142, -7251, -93573, 64645, 103638, 51283, -82040, -90805, -125685, -138270, -199265, -127307, 34378, -26016, 39812, 113941, 155057, 91280, 88628, 157321, 122853, -12860, -11465, 53293, 17079, -98642, -61478, 168540, 77556, -39136, -166245, -98640, -121482, -173652, -151865, -125051, -125335, 7347]
16704G347J11216m5727N1986P9620r0930m6526O3351q8914k5799j0746J14613
16693A19491k7558k73355m7375K4920J51127N5948j04535K288o5696L314l3121
16682a94552J45840J95814k5718m3208p0390k3192o0515l8869j29145k4448K9612
16671b38771L0991O9953p9845L5427M9770r812L4863J02804k2259R610R868K7560
16659B0159l3937p3884n7982K3707J9765L1877J2463l2158R7542J07478m5642
16648F9388o4907l1877q3069l3936K7292O0476k4478j13965K7395J88939N5728
16637G6986k4507j40259q7417j222o3033Q3491O6714N2763M3875q7434j03631
16626a83674J9944R109R7109j1793j02115n3449L5133N0596M1877P2791j12772
$$ y = [7347, 118563, 72836, 124822, 204442, 113512, 66986, 130337, 41423, 15624, 4878, 119491, 91933, -181422, -228797, -203877, -52750, 3198, -101337, -99049, -164745, -161431, -194552, -48712, 147102, 121384, 78176, 7786, -15406, -75921, -114790, -243935, -268383, -238771, -207780, -137827, -217672, -182245, -132475, -142287, -107424, -4620, -26879, -17269, -7401, 20159, -13778, -87662, -145644, -121937, -102172, -70295, -57832, -89990, 7552, 115030, 69388, 4481, -27396, -110465, -144401, -117109, -56633, -81111, -195076, -167681, 21258, 76986, 52479, -87780, -175197, -176419, -239452, -155961, -89247, -36484, 7391, -80043, -183674, -163730, -154621, -57512, -69305, -171420, -224869, -189736, -139140, -97263, -24472, -137244]
16615a37244k0111J02716j21921n6626O7038J42623K865o6118m2831j7891K7570
16604a19930K0650q358l240N9285P7869p1428R6943q7011o1511o2601L9323m5507
16592a65516p0613J07265j9832j6063L6270O6438r8205r990J69191L7524j58398
16581a21929r2317J2101J9127M2303N6232J7331j34904r1852Q72k5120L357N4424
16569b60375P6017l3654L8064P0447j4382M3488n3959J9129K16900O7126K3537
16558A92338l4565J02970k9272p8084n6075N1602j3001q6931L7k0150k0715n7372
16546d9218n4647j7444k29r3566l9383J28532J33777J8320k5040k6229M5905L6680
16534E7458O6405J13341j87958n8644K8959J199J5946O154L7492j8725o6126p0863
$$ y = [-137244, -157355, -54639, -176560, -233186, -166148, -23525, -20660, -86778, -129609, -147500, -119930, -99280, -107638, -110878, -51593, 26276, -45152, 51791, -35220, -96731, -159332, -120009, -165516, -236129, -128864, -148696, -164759, -128489, -62051, -160256, -170246, -1055, 36469, -121929, -214246, -202145, -183018, -140715, -84483, -67152, -202056, -293908, -293036, -318156, -314799, -260375, -184358, -218012, -179948, -109501, -123883, -80395, -134354, -115225, 101675, 168801, 192338, 157773, 260743, 231471, 153387, 97312, 148914, 135913, 48982, 49019, 28869, 8154, -49218, -103865, -121309, -121538, -215104, -254487, -125955, 7822, 26142, 1102, -25127, 20778, 57458, 123863, 237204, 49246, -9398, 19561, 20760, 36706, 42860, 80352, 61627, -4499, -75362]
16522g5362N3119O0322j0728R3970o388n2595L2429J21892j00574k9553m2574
16511D3958j9478p1093k7361j31395K4307L3147n4757o5410J23120J66094K33596
16500B54728P5448j70611n3968j0240M5996P8685P0189j13017j59010n4761l430
16489c9991K2937K8247l7547J9930M555m084O9865q8893l2966l0845K742R830
16477g6220J89817K7647l6435O6885l5508j40067m8722M800J2060M9689q443l3700
16465b8197q0525j0561N2881O6393j6047L3016M6871o6730k6140q1939j23648
16454b34626k164Q5652J13284O3833p1396R387O5905Q213j40382j1764J17957
16443C899K2681n8709J26633l6423N912k3057q8320j59269j39573P5987K20024
$$ y = [-75362, -22243, 38079, 27351, 121321, 114933, 62338, 94767, 216659, 116085, 86532, 43958, 24480, -46613, -73974, -205369, -181062, -147915, -202672, -268082, -144962, 21132, 254728, 330176, 159565, 105597, 95357, 141353, 220038, 290227, 177210, 18200, -36561, -39991, -17054, 11193, -26354, -6424, -1869, -5953, 63912, -24981, -57947, -88792, -86050, -76220, 113597, 141244, 104809, 171694, 136186, -3881, -52603, -47803, -35743, 13946, 5503, -28197, -108722, -119283, -66402, -9, -16056, 16960, 63831, -2899, -29039, -110978, -234626, -236790, -151138, -37854, 25979, -45417, -36030, 29875, 38088, -102294, -114058, 3899, 26580, -32129, 94504, 58081, 63993, 40936, -47384, -206653, -346226, -270239, -50215]
16432e0215n98P2596K0346m7678q6908o0031m5803J18255M0388N584K0740M9998
16420C6674k7735j8492j5337J3710r612j9821K4555M7813J32337N9377j62515
16409F0954j08417j9989R4024l7498l9208J9806r9111N1883O3778k713J31435
16398A14944R2659L4560j19330j42992k3309J20304J05629q2326j7194Q3072M6550
16387B12567k9380j55488J4778J05337L9902K5520j9206j32316m7032P4848J4879
16376A04409o4310j0534j02608j57059k3825K1893Q5044L6660n229J15798J56104
16365A56343k376j09002j15582n2373K2241R720l8663J03910J41436q9050r9317
16354g2713J18349J32131J65911k3534j06735r6358k2395J67413k0329n3927j7709
$$ y = [-50215, -50813, 21783, 42129, -5549, -92457, -152488, -198291, -80036, -39648, -34064, -13324, 36674, 8939, -9553, -24890, -11180, -20792, -40613, -16058, 31755, 164092, 223469, 60954, -47463, -67452, 26572, -10926, -50134, -30328, -129439, -77556, -13778, -16491, 114944, 207603, 242163, 122833, -20159, -43468, 76836, 182465, 100139, 82945, 166017, 212567, 183187, 27699, 42477, 147814, 187716, 213236, 194030, 61714, 14682, 89530, 104409, 40099, 29565, -73043, -230102, -253927, -232034, -146990, -110330, -115559, 239, 156343, 153967, 44965, -70617, -122990, -100749, -91029, -129692, -25782, 115654, 26604, -72713, 45636, 177767, 343678, 320144, 213409, 117051, 94656, 262069, 241740, 187813, 170104]
16343A70104m6594j77488q8218J33078R8948q113j9526M3022j7153J32011p677
16332B12394r4827j80929Q4485K41231J35428o7015m6047j0171j16379l8618P794
16321A27346L2405K9875N723K0785K6365J00730J51297Q0496Q7140M1177L5996
16310G39335j411M2832j21780j4053J15997J02186R6910L222J4825Q2762J31534
16299A192359J68731O7476N4508K00337J16187O2591J31521K53409J82157J97130
16289B626406J67796P2720R9606J17015K26098K11306K15445K71378K32117K08357
16279D448244K43868K20695L45225J60062K51735J80737R4451K54862K67053K60152
16269F727084J45206K9303J2218J28900J64355J89098P1338K5066K0957n4506
$$ y = [170104, 123510, -53978, -142196, -9118, 89830, 81717, 62191, 105213, 88060, 220071, 212394, 117567, -63362, 21123, 262354, 397782, 330767, 284720, 274549, 158170, 119552, 127346, 159751, 189626, 195349, 216134, 242499, 343229, 494526, 575022, 662162, 703339, 739335, 737924, 780756, 658976, 644923, 760920, 863106, 960016, 963238, 978063, 1060825, 1192359, 1361090, 1428566, 1483074, 1683411, 1799598, 1862189, 1993710, 2247119, 2429276, 2626406, 2794202, 2866922, 2966528, 3083543, 3309641, 3520947, 3736392, 4007770, 4239887, 4448244, 4692112, 4912807, 5258032, 5418094, 5669829, 5850566, 5945017, 6199879, 6466932, 6727084, 6872290, 6901593, 6913811, 7042711, 7207066, 7396164, 7467502, 7492568, 7513525, 7459019]
16259G459019j34086k07930j09733j04703j6267j09612j19417k12927k26300j69420
16249F048624k14383k32130j75623q7512j81875k46416k04243k28809k22224k19363
16239D036046j71807k19112j68876j73848k05165j61793j65236j02097j09334
16230B558778j32499j27555j33891k05829j72937l6764j25390K0090n0243n1407
16220A542353L7692j30508j27190J17057O1964p4081j54422j08823j02176Q631
16210A070497J0998p6638K4692J13433j679q0802o9520J7700r4093j8143O753
16199I03198J15126N9322j17481k53074j67796M0664P3158p0860O6906J7841k02352
16188D64652K4776o3127j03084o9854N096O2273J38014l1033N585m1261j38428
$$ y = [7459019, 7324933, 7117003, 7007270, 6902567, 6886300, 6776688, 6657271, 6444344, 6218044, 6048624, 5834241, 5602111, 5426488, 5338976, 5157101, 4910685, 4706442, 4477633, 4255409, 4036046, 3864239, 3645127, 3476251, 3302403, 3097238, 2935445, 2770209, 2668112, 2558778, 2426279, 2298724, 2164833, 1959004, 1786067, 1749303, 1623913, 1644003, 1593760, 1542353, 1580045, 1449537, 1322347, 1439404, 1501368, 1427287, 1272865, 1164042, 1061866, 1070497, 1081495, 1004857, 1029549, 1142982, 1141303, 1060501, 990981, 1008681, 914588, 896445, 903198, 1018324, 1077646, 960165, 707091, 539295, 579959, 653117, 582257, 649163, 667004, 464652, 489428, 426301, 323217, 253363, 258459, 320732, 458746, 427713, 433298, 392037, 253609]
16177B53609j1828O1327K5695J3795k4401M962j27992o1036N5020L5134R5076
16166C19361J7484R9814K5988j52604p3592l3959k4615O8778q5653q7024j5723
16155E8255R3061Q9734L1367K8992M9897j58263k2381J435k2652l8277m1464j51508
16143h1804J05357J93796n0199K6965m0435N774K2331J072L1604o1740Q3843R4385
16131C30949Q7475j03079L4909M9764K3933j07501q5568N6952R6791n084j20297
16120B59244n2194Q139L7101l3890M451P7589m047M6794q4575j50819j06957l2053
16108c1217R2633j53M378R4356j03263M6427N450j05313M5163N5515j64052q2422
16096a42498R3461R1723R9582R7118k5799j13647p6085n2635l612J3635J6116
$$ y = [253609, 241781, 303108, 328803, 342598, 318197, 323159, 195167, 134131, 189151, 224285, 319361, 336845, 436659, 462647, 310043, 236451, 202492, 177877, 246655, 161002, 73978, 58255, 151316, 241050, 272417, 301409, 351306, 193043, 170662, 172097, 149445, 111168, 69704, -81804, 23553, 217349, 167150, 194115, 153680, 159454, 181785, 182857, 214461, 152721, 236564, 330949, 418424, 315345, 350254, 400018, 423951, 316450, 230882, 287834, 384625, 379541, 259244, 207050, 215189, 252290, 218400, 222851, 300440, 296393, 343187, 258612, 107793, 836, -31217, 61416, 61263, 65641, 159997, 56734, 103161, 108611, 3298, 48461, 103976, -60076, -142498, -49037, 42686, 142268, 239386, 213587, 99940, 23855, -28780, -32392, -18757, -2641]
16085b641q395n422j39117J4416K7881K6962j05700o2350J82804Q0567J252q2892
16073g2635q6099m0550n2246J67099K7939O7190O3032p3020J13073N0126l6630
16062A27279L4060k6967n9166m1400Q7628m5954K5524j3840m6116J03785Q743
16051A53576l0485o6244K628o1614K5874j785M8666J04879q8047q1345n6912q273
16039e9082K1100j0082l7920K8727j19070L3324M4674R5119K3921j34621o4070
16028a77980O1568Q7599j777j34583p4918L1837J57203J09862M92j7293l3610
16017H400K0720J2613K5348K5536j7012K4245j03730q4284J06991K8530k5515
16006B1842N5287m6848p3334n2098R4689J0826j03098J04531J49156j90840j03373
$$ y = [-2641, -11036, -16458, -155575, -141159, -113278, -86316, -192016, -254366, -71562, 9005, 10257, -72635, -158734, -199284, -251530, -84431, -56492, 10698, 73730, 710, 113783, 163909, 127279, 161339, 134372, 75206, 33806, 121434, 75480, 101004, 87164, 41048, 144833, 153576, 123091, 56847, 59475, -2139, 23735, 21950, 70616, 175495, 87448, 6103, -50809, -59082, -37982, -48064, -85984, -57257, -176327, -143003, -98329, -3210, 20711, -113910, -177980, -116412, -28813, -30590, -165173, -240091, -208254, -51051, 58811, 59303, 42010, 8400, 29120, 41733, 67081, 92617, 75605, 99850, -3880, -88164, 18827, 47357, 21842, 77129, 30281, -43053, -95151, -462, 10364, -92734, 11797, 160953, -29887, -133260]
15995a33260Q3439Q7961p7782j7095q1816Q4858r384r6676J02867J64686k6509
15984H1289n8480n1632L0757N113j0445M3062J03585l161N0764P1192J341j52890
15972A10495j51693J0312J9797l530R9911M4623k8940j15587k6430P6305o6674
15961c1411q270J05535J06136j09920n2428M6104J17929m8663j00553q0571K4156
15950c1956m2191q6409j5336J24214N7765j05630p4774J03857J39088J72322n9766
15939A81184r2021q9173l3852K6154j19413o6191k7366L6034N411Q1048J28366
15928C0181L1573J0658l2013m5120m7475R0773L0124m8601J4006L1642J4214n5404
15916B4558m8316p1957l7955j3831R961Q7428O5093o1170K769K9508J02833O6810
$$ y = [-133260, -49821, 38140, -39642, -56737, -138553, -53695, -63079, -159755, -56888, 107798, 81289, 22809, -28823, 1934, 7047, -3398, 39664, 143249, 140088, 190852, 262044, 263385, 110495, -41198, -30886, -11089, -14619, 85292, 129915, 100975, -14612, -41042, 35263, -31411, -39681, 65854, 171990, 62070, 9642, 55746, 173675, 125012, 24459, -56112, -31956, -74147, -160556, -175892, -51678, 6087, -99543, -174317, -70460, 68628, 240950, 181184, 89163, -10, -33862, -7708, -127121, -193312, -220678, -184644, -179233, -98185, 30181, 61754, 72412, 40399, -4721, -52196, 38577, 68701, 20100, 34106, 65748, 79962, 24558, -23758, -95715, -133670, -147501, -137540, -50112, 14981, -46189, -43420, -13912, 88921, 155731]
15904A55731l8112k7314j86974N052j8257j74792l4359K40468R3208J0122n4193
15893b9420J16861P3781j17024r161l7972n2285k0651O7657j2327k374O8899J16302
15881A62286n7976j6981Q5814m095l5446j0301r4143J27702k2112j832j13994
15870A8922p7952j2426k1627k9935N9811K9218k7434p0159k4079P0474j8531k9024
15858a32742m321Q3046N1844K9282P8219j53562Q901J04817n3408r4454N4631
15847b7747l0271r799l6742J2213j08650m3422P1145O6104Q031M8741L059l4494
15835h1832K1770k9342Q3684p518J1911n4543q6504l5583R5500j0073R5211J3478
15823A6159r3291N9025Q86Q2256n6099l4509N9723K8840L6308j1059n198o6276
$$ y = [155731, 117619, 90305, -96669, -91617, -109874, -284666, -319025, -78557, 14651, 24773, -29420, 87441, 161222, 44198, 35037, -2935, -55220, -75871, -8214, -20541, -22915, 45984, 162286, 104310, 87329, 173143, 169048, 133602, 123301, 29158, 156860, 134748, 132916, 18922, -59030, -71456, -93083, -123018, -63207, -33989, -61423, -131582, -155661, -85187, -103718, -132742, -137063, -54017, -2173, 27109, 105328, -48234, -39333, 65484, 12076, -82378, -27747, -58018, -67817, -104559, -92346, -200996, -244418, -173273, -107169, -99138, -50397, -47338, -81832, -60062, -89404, -5720, -13238, -1327, -55870, -142374, -177957, -82457, -92530, 2681, 16159, -77132, -18107, -17221, 65035, 8936, -25573, 34150, 62990, 99298, 88239, 83041, 16765]
15811A6765m5922R7233o014j8835K2739K6795O8727O9323j0283j38823j59178
15800g7473n2296N8617K0340j5781L3259q884p2093m8886Q7284j0017k114j5447
15788a03491J3082N864N0152j1172l8407J5461P1256j5221j34059m8058J54143
15777d0450J07579p1031q7781O4967J11585N7880o4266j36625j2009m1017k2157
15766a33325O9206R6065M422k9548P756o4034n2940K0817O9242J05135J0076m5742
15754E7130j5519k2550K3676J53563O4268r6061k44529l3883L8841N3812J8516
15743b736q2549J801l0891R081l9009k7847P1966l2383K5526Q8594j0351n0043
15731g8841j7036j1958L8285R6245Q284N174J8555j4535p4277J22520J7555j39207
$$ y = [16765, -29157, 68076, 62062, 43227, 65966, 92761, 161488, 230811, 220528, 81705, -77473, -129769, -71152, -50812, -66593, -33334, -42218, -114311, -163197, -75913, -85930, -88044, -103491, -90409, -84545, -34393, -45565, -83972, -68511, 2745, -12476, -146535, -194593, -40450, 67129, -3902, -91683, -26716, 84869, 142749, 78483, -58142, -70151, -111168, -133325, -64119, 31946, 36368, 6820, 14576, -49458, -102398, -81581, -12339, 92796, 102872, 57130, 41611, 19061, 42737, 196300, 260568, 164507, -80022, -113905, -75064, -21252, -2736, -85285, -83484, -114375, -105294, -144303, -172150, -100184, -132567, -107041, -18447, -28798, -78841, -95877, -107835, -69550, 26695, 34979, 40153, 58708, 44173, -30104, 92416, 109971, -29236]
15719b9236o0861l987p503R8734J23324O72p8562Q5649P2387j86494j21232j15593
15707b22702j0752J36732N9565Q7122j04785j7462L7454R506q6654n464K1733
15696i5707P7312O3001o4775j11712L4686L8992N498m8459M0617K4539j2381R8808
15684E0419p8075r2892J1412L7795M1981j07107O5126O5911J05467L795p7807
15673B6025j12657Q9900p3270q0681j8876n1367k3057J08742J25909n2866k5290
15662h7488L2657l7738j38789N5798R8575J23287P363q8843N2366J20030k2713
15651A14505j15814J06147K6180j16667M3589R8009J0193l1324n8756j513R0767
15640A65316l3020p4686q7800p0542M7227L9263n839J6017K474n9603j9834P2341
$$ y = [-29236, -90097, -94084, -101587, -2853, 120471, 121143, 42581, 128230, 200617, 14123, -107109, -222702, -233454, -96722, -37157, 49965, -54820, -72282, -34828, -25322, -111976, -117440, -95707, -18395, 44606, -20169, -131881, -97195, -58203, -52705, -101164, -60547, -36008, -48389, 50419, -27656, -120548, -109136, -71341, -29360, -136467, -71341, -5430, 100037, 103832, 26025, -86632, 3268, -70002, -150683, -169559, -220926, -243983, -135241, -9332, -62198, -87488, -54831, -92569, -231358, -175560, -76985, 46302, 53665, -35178, 17188, 137218, 114505, -1309, 104838, 131018, 14351, 57940, 155949, 166142, 134818, 76062, 74549, 165316, 132296, 57610, -30190, -100732, -53505, -14242, -20081, -4064, -1590, -61193, -81027, -8686]
15628h686N9982k2200j00130K7143L8828J5211l1112l0734M6813M8835m6982r501
15616a2533Q688l9886n3506l0762K6085M1474O4066J193m7448p6061j9396M7393
15604i0693n5923j07935j012k8638J99765R6632L1893q7126j05587n1560n1470
15593b51654Q7718J47570m8189M358j1696N9870L8571n3186L0847O6905q7751
15582a6637J6968o610L3182m6594n5940m835m5635j64355k9564O9549m0336J13364
15570a77443L6872O0971J7279Q4456K3887K2402l08q3053j4112K789p088J02705
15558F9357K1107O2814J63098j22374o5784n5378j20229k5163O2941j47691k6092
15547a83394p7196P3304J7462Q6064J02528P1349Q2953P2866p5920j18418o019
$$ y = [-8686, 51296, 29096, -71034, -43891, -5063, 10148, -20964, -51698, -4885, 43950, -3032, -12533, -3845, -43731, -97237, -127999, -101914, -60440, 3626, 4819, -42629, -118690, -138086, -90693, -146616, -254551, -255563, -284201, -84436, 12196, 44089, -43037, -148624, -200184, -251654, -163936, -16366, -64555, -60197, -71893, -12023, 26548, -26638, 4209, 71114, -16637, 331, -6279, 26903, -19691, -75631, -80466, -126101, -290456, -320020, -250471, -290807, -177443, -140571, -79600, -62321, 22135, 46022, 68424, 68116, -14937, -29049, -26260, -33348, 69357, 90464, 153278, 316376, 194002, 128218, 72840, -47389, -72552, -9611, -157302, -183394, -260590, -187286, -169824, -83760, 18768, 90117, 173070, 245936, 170016, 51598, 45579]
15536D5579O026q5571r1126j28283Q8000k7188o515J25064J28559M7383n8398
15525D3530M7871m7119k3556j02830L3415l0727l6901m6294N3683J33631J06015
15514A30718Q5951j27367j03812l8151L7777R0625k9668j4412n015j61261m8161
15503a82776M4044o5065n2925j1688J5509L7178O7885J46335K9218p4090l2396
15492g8771L8943K559j4777N3872N2196o7821p4764m1212n651P729Q1057m0071
15480h6711o2045j0923J97550J03423m3437l0797m3852k6924o8091J6324R8119
15469D2636Q1311m5456j4663l7947O7529N2966n5665r5248l8149q2760q0337j4742
15457b20525L8268m7183N7433J34100J06763n5329N5931K8865p8090m328p6236
$$ y = [45579, 51605, -33966, -125092, -253375, -165375, -192563, -199078, -74014, 54545, 101928, 43530, 91401, 44282, 20726, -82104, -48689, -79416, -116317, -162611, -108928, 24703, 130718, 216669, 89302, -14510, -52661, -14884, 75741, 46073, 31661, 26646, -134615, -182776, -138732, -203797, -256722, -268410, -252901, -215723, -147838, -1503, 27715, -46375, -78771, -39828, -37269, -52046, 1826, 54022, -13799, -88563, -129775, -135426, -127697, -46640, -86711, -148756, -159679, 37871, 141294, 97857, 67060, 23208, -3716, -71807, -55483, 42636, 123947, 78491, 63828, 25881, 93410, 146376, 90711, -4537, -42686, -125446, -205783, -220525, -182257, -229440, -172007, -37907, 68856, 13527, 69458, 98323, 20233, 15905, -60331]
15446f0331j28502m8647M8130J2139L3435Q1339J4456m1072j2205N720J4355J9718
15434f1465L5129j18410Q5709J12155K4148j2415j14568m0704k6469J75933K6016
15423H5059j29232N5059j502p0990N7868m2595K4494r6022M4179j5490P230o8092
15411a50034j6310M5305L979R4281k9769q2432Q8235J7110l8109J5921J40927
15400H9104j43455o8857k6193l6842n9910O722R4505N1016J5524N6732J31610
15389A09956R6718j34560q2134J17534j45245n5506R39Q0288R8044j4719L5309
15378A06624j296o1788j54477p7145M8561n30r9371M5248J34765k733l6583q0751
15366a79476k4575J47355J58188l9687j9229Q8740Q0273k6723j96694l3243o0600
$$ y = [-60331, -188833, -237480, -189350, -177211, -143776, -62437, -47981, -89053, -101258, -95538, -81183, -61465, -26336, -144746, -59037, 53118, 77266, 64851, -49717, -90421, -116890, 59043, 85059, -44173, 10886, 9384, -61606, -3738, -46333, -21839, -117861, -73682, -89172, -81942, -150034, -166344, -121039, -117060, -22779, -52548, -134980, -46745, -29635, -67744, -51823, 89104, -54351, -123208, -149401, -186243, -246153, -239431, -144926, -93910, -78386, -21654, 109956, 206674, 72114, -10020, 107514, -37731, -93237, -92298, -12010, 86034, 71315, 106624, 105328, 43540, -110937, -188082, -139521, -140051, -239422, -194174, -59409, -62142, -98725, -179476, -204051, -56696, 101492, 61805, 42576, 131316, 211589, 184866, -11828, -45071, -105671]
15355a05671L6537L4497o0869l9037m1843J12869O2832J21793r907L8558j01906
15344D7853j85118P6000N8959j44239j5432J18251Q1689M2676l7872p3133P1744
15333D1378N1091L0419j8820r7361O817Q279N8456p8134j08522m7987k0106L3094
15321a41396J13500J13765l4032j27786j9783p4091n4137J4751m3430o4008J61140
15310a55507O6243m9929P639j5811L5163M8743L3220l6913M083j809o6129J2096
15298a18911J03135k623m4696N6251K2509N1598J02632J43560l5363j05439j92923
15287b0270j30213j56975J5149K22685N7545l0219M8375Q9663K3837K900q8639
15276C3838p6072K8692j15023L5118J64743N1832Q632N1041K6951n4149n9205
$$ y = [-105671, -69134, -34637, -95506, -134543, -176386, -63517, -685, 121108, 111201, 149759, 47853, -137265, -61265, -2306, -146545, -161977, -43726, 37963, 80639, 42767, -30366, 41378, 92469, 122888, 104068, 6707, 13524, 21803, 80259, 2125, -106397, -154384, -174490, -141396, -27896, 85869, 51837, -75949, -95732, -169823, -223960, -209209, -252639, -316647, -155507, -89264, -139193, -131554, -147365, -112202, -63459, -30239, -67152, -63069, -64878, -131007, -118911, -15776, -18399, -63095, -6844, 15665, 67263, 169895, 313455, 278092, 172653, -20270, -150483, -307458, -292309, -69624, -12079, -42298, 6077, 95740, 119577, 122477, 33838, -42234, -13542, -128565, -93447, 71296, 123128, 131760, 182801, 209752, 155603, 96398]
15265I6398o1891q7253r4356j47159P8266J51408Q0658J7867l6758P1757j18553
15254d9616n7189j0543O4403J00502P4364q8222j40196j678K5233r7431l56J51526
15242b9203P3184j54030m1340L2789P3424k0505k830M6382K2251L6015J6246k7373
15230B5010K3608j10589L0272n2951M4627J05667r1850j12328l4328J8381j3984
15219a68465O7068P1388Q601M2756K2043m9350j49336J1137m2723M77N8040l063
15207a31427O7034j5948o5774N4554J63380R0695J7564k1332J6426p1645q3977
15196A9550n9961r5804k0448N3318j265r832J6774J13622M8051p9742l8081r631
15184f3449J13328J18734m0014r8785j33484J1840n6584M7807J61050j3847j70277
$$ y = [96398, 34507, -52746, -147102, -294261, -215995, -64587, 16071, 33938, -2820, 68937, -49616, -106805, -117348, -52945, 47557, 121921, 33699, -106497, -108175, -82942, -180373, -180729, -29203, 43981, -110049, -151389, -118600, -45176, -65681, -68511, -22129, 122, 36137, 52383, 25010, 48618, -61971, -31699, -84650, -40023, 65644, -26206, -138534, -172862, -154481, -168465, -101397, -30009, -21408, 21348, 43391, -5959, -155295, -144158, -186881, -186404, -128364, -131427, -64393, -80341, -146115, -91561, 71819, 162514, 180078, 158746, 175172, 103527, 19550, -40411, -136215, -156663, -103345, -104610, -114442, -97668, 15954, 64005, -15737, -53818, -63449, 49879, 168613, 128599, 29814, -103670, -91830, -148414, -100607, 60443, 46596, -123681]
15173a23681m9155Q0025J00874Q6622r4067k15681r5063J60137J86858j5974j82171
15162a61276o0950J97268J0405M8062k1536P979O2786k2609n1894O7204p9033
15151c594r2497j9805J13771O7448k2537J37376k8287j39633j22712r84R2073
15140a9381o5305L892Q816J6151J9812L7252l1603j0341N4702r407l2601L7081
15128I068K5988j00602p9274J29002J88403m6126k644o1700l3771M4432J25919
15117A98695o8915n9566N5886o284k1772j98q7155l9446m1951K0755Q7398O8007
15105A05454O3765P2962j6625Q8561j8986m4987k00853j0663O0755l8690n1244
15094I449k9296o03o2840q7347N3607l7361K764N4632R7617p1769L1743J3467
$$ y = [-123681, -172836, -92811, 8063, 94685, 618, -215063, -310126, -149989, 36869, 20895, -161276, -222226, -24958, -14553, 33509, 11973, 19952, 82738, 60129, 8235, 75439, -3594, -96091, -115896, -2125, 65323, 42786, 180162, 151875, 12242, -110470, -111454, -19381, -84686, -80794, -71978, -55827, -36015, 1237, -30366, -40707, 13995, 4588, -28013, 9068, 35056, -65546, -144820, -15818, 172585, 126459, 123815, 62115, 28344, 72776, 198695, 129780, 70214, 126100, 119816, 98044, 97846, 10691, -28755, -70706, -49951, 37447, 105454, 169219, 242181, 225556, 314117, 295131, 250144, 49291, 38628, 99383, 60693, 9449, -19847, -20450, -83290, -170637, -117030, -154391, -151627, -96995, 622, -71147, -39404, -25937]
15082b5937r7948k7106J21463R9134p2612o1437L299l5047P964K0671L6937o4105
15070i4724K0492P3298l4908K7160j5216J8949m6302n979K4849K4903k2622J13906
15058H3806K5360j7427J403l986Q7013o0327j13610J3703M1501L5794q4j3280
15046G9866j18416L8166K521N2958P3670L366o788r6099k7657J9552j44145j6911
15034a39917J58707M590j19070k20179J782M3623K201O6168J17756J6751O2276
15023e312o2602o2261K927R9747J77304k5474r7563r3168j3276n1020m3450k0656
15011a94804L2463J52493J5900N5984L6738K6813K2190M3973p1790k1960J596
15000I9596N384q694j01210o3521q967j02742j6251O8778J2179j6733N1207K6344
$$ y = [-25937, -123885, -150991, -29528, 69606, -3006, -64443, -61144, -96191, -88227, -67556, -30619, -94724, -74232, -934, -35842, -8682, -23898, -4949, -51251, -57230, -32381, -7478, -30100, 83806, 109166, 91739, 93142, 89156, 176169, 115842, 2232, 15935, 57436, 93230, 93146, 79866, -38550, -384, 2137, 55095, 128765, 132131, 125343, 29244, 1587, 21139, -123006, -139917, 18790, 23380, -95690, -315869, -314087, -270464, -268263, -202095, -84339, -67588, -5312, -67914, -130175, -127248, -27501, 149803, 124329, 26766, -66402, -79678, -130698, -174148, -194804, -162341, -9848, 6052, 62036, 98774, 125587, 147777, 191750, 119960, 98000, 99596, 104980, 96286, -4924, -68445, -77412, -180154, -196405, -127627, -115448, -132181, -80974, -54630]
14988e4630k9308r2333J48202k0335j22970P7397J74879N7386L2786M2054r1941
14977A21187j0661m19l0442n5187K5141j11962m8554k0640O3622O6188J07049
14966A05322L107Q0699l1150j16778p345p843M2701n5175M8693k6781j12717K3546
14954e3721p3305n0166J491Q3626P5252p2995k5102N5423M4116K26r1972l1413
14942a38540N6414M535j7484r7735j6699J39800J21848J3017O575k8384q9330
14931d5983k5794N2552j7159l3078k8588j34016R3163L7653k6056M8235Q6246
14920G175R538m4525N9846p50j38443N814Q633r5320K8264K9904K661M3217R4441
14907A0455J2988k1831k7372k1679J126j68316o1070Q3865M2209M7327O0023q3740
$$ y = [-54630, -83938, -176271, -28069, -48404, -171374, -93977, 80902, 138288, 171074, 213128, 121187, 110526, 110107, 79665, 24478, 49619, -62343, -110897, -131537, -67915, -1727, 105322, 108429, 189128, 157978, 41200, 33855, 26012, 68713, 13538, 62231, 35450, -77267, -53721, -127026, -177192, -175701, -92075, -16823, -89818, -114920, -59497, -15381, -15155, -107127, -138540, -82126, -77591, -95075, -192810, -209509, -69709, 52139, 65156, 71731, 43347, -45983, -71777, -19225, -36384, -69462, -98050, -232066, -138903, -101250, -127306, -79071, 7175, 16713, -27812, 32034, 31284, -107159, -101345, -92712, -188032, -159768, -129864, -127203, -83986, 10455, 23443, 1612, -25760, -47439, -46313, -214629, -275699, -191834, -149625, -102298, -42275, -126015]
14895a26015J20714J0050N0605M7980J9313o3548n2040Q0190J8140j08221N1525
14884D8693N2046j05954M5493m2965o7832j3657M0899p9966P0114M4110P5689
14873F6670p8703j28534o7910M8011P5698k7979q9607M236O3970N103N2907j2199
14861h8337m6325m7126J18387M210k0511p276M1099Q3629l4309l0276n9334o8401
14849a54570J20474l1498j1995l8606k2165J3935O9719K6135j03315r8523J07283
14838a23126R1973l3368P2663P6139k9357K9238L7184m7646r536r5505J15221
14827H3880J12126n6930q6769p8231j73352J36770J0303o0114J96760R6908j03022
14816G8329j27474k7265j7491L5532O6478J16122j06081j21114m8070J19671O6428
$$ y = [-126015, -5301, 4749, 55354, 103334, 122647, 59099, 7059, 87249, 105389, -2832, 48693, 100739, -5215, 40278, -2687, -70519, -84176, -43277, -123243, -53129, -9019, 66670, -12033, -140567, -208477, -160466, -84768, -112747, -202354, -198118, -134148, -129045, -76138, -88337, -134662, -181788, -63401, -59191, -79702, -86978, -45879, 37750, 3441, -26835, -86169, -154570, -34096, -65594, -77589, -116195, -138360, -124425, -54706, -28571, -131886, -230409, -123126, -31153, -64521, 8142, 84281, 54924, 84162, 121346, 73700, 64164, -31341, 83880, 196006, 139076, 52307, -25924, -199276, -62506, -52203, -112317, 84443, 181351, 78329, -49145, -76410, -93901, -58369, 8109, 124231, 18150, -102964, -151034, -31363, 35065]
14805C5065m1394j9215M9288n2430L3886J943l1929n4431J4129k4561j17882n6826
14793b64357n7091N1797R9406q0158Q2679O0255K293N2759L9060q4330r4277j2938
14781b04902n3292j952M2674N101Q3755N7959P5218o7305m6556M9298O799m9488
14769a02691J05974L000j09242n7893J08665L6345j41524m2928j00276j6844Q0658
14758b36756M7047M1419k0638o1568N8966J87337K2148J5337q459l9272r4175
14747h8614J5593L7578M5380Q2122k5112j26054J1913l1609N2473J95599K1282
14736A90551m6041m6283l6702q2378q6473K349l0881q7570j0259J02480N9015
14725g2192P623q3269j53195K7974R6359Q8997P4258O5745l2563N7286j5476p8655
$$ y = [35065, -6329, -25544, 23744, -28686, 5200, 7143, -24786, -79217, -65088, -89649, -207531, -264357, -321448, -269651, -170245, -250403, -167724, -107469, -105176, -52417, -13357, -97687, -191964, -204902, -258194, -260146, -217472, -212371, -128616, -70657, 4561, -62744, -109300, -60002, -53203, -102691, 3283, 6283, -102959, -160852, -52187, -15842, -157366, -200294, -300570, -317414, -236756, -189709, -148290, -168928, -230496, -171530, 15807, 37955, 53292, 44833, 5561, -88614, -73021, -35443, 9937, 92059, 66947, -59107, -47194, -78803, -26330, 169269, 190551, 144510, 98227, 61525, -20853, -107326, -104977, -135858, -223428, -233687, -131207, -72192, -64569, -147838, -301033, -273059, -176700, -87703, -13445, 52300, 19737, 77023, 61547, -17108]
14713a7108o4652n3892j54258J26151J23115K2172R6877Q9957j10885j75921n5842
14702a74286Q9560p462K7253K31057j7389L6936J15115j0837j03682k1971J6065
14691A80359j9097j18307n4168O496R918O3718p7520n307L9130m7086k1104L6393
14679f575J94839r1919j47481j06713M5005m3660l7864L9137M4504N6011J08096
14668E3380Q3149j03371j72248r9932o3863J6760q6681q7971R2530L62Q3722P6095
14656b08068J07138N087j15287o1846L5474l3408J09205k4081Q6086O4013r7842
14645a33529K3914J9809M8254p2742j89627m0786L2454J54534J86203J42046m3027
14634A27503l7786p8748p2997J952Q3565K9490j02093j076n2960o8377P4844j0337
$$ y = [-17108, -81760, -135652, -289910, -163759, -40644, -18472, 78405, 168362, 57477, -118444, -174286, -84726, -92188, -64935, 166122, 148733, 185669, 300784, 289947, 186265, 164294, 180359, 161262, 42955, -11213, -4717, 5201, 68919, -8601, -13908, 25222, -21864, -42968, -6575, 188264, 96345, -51136, -157849, -112844, -156504, -194368, -155231, -110727, -54716, 53380, 136529, 33158, -139090, -239022, -302885, -286125, -372806, -460777, -368247, -367885, -284163, -208068, -100930, -95843, -211130, -272976, -237502, -270910, -161705, -185786, -99700, -35687, -133529, -109615, -89806, -41552, -114294, -303921, -344707, -312253, -157719, 28484, 170530, 127503, 89717, 10969, -62028, -60076, 23489, 52979, -49114, -50190, -103150, -171527, -96683, -107020]
14622a07020J43695K1118L6592K5581j42721N3012j3903j39047j48293q0186R5024
14611b56148K03350m993m5454n2426M1558j635j0502N4172N1528p0651m602O8621
14599b7182K4986o4263o4464R1092P9783r6849k6476q8211n00Q133J9786L6149
14587a08016M7965J04817L6803l914p4972n995p4392j8321l6605J4385J4335M4263
14575e9647K3696J7924m1193j1914O7274j8343l1218j5320M179O9653p6274P4289
14563C106O2722j1674l4295j49584k6633M7994M6507r433p5924R5609p265O1975
14551C105O6853j32278j3212p9975q3854M9095N4985l4923J04431M4148k8192
14540d9817J0793m7297J77789N4j03073k7261K4912Q0811j08220p4339J0360K6288
$$ y = [-107020, 36675, 57793, 94385, 119966, -22755, 30257, 16354, -122693, -270986, -351172, -256148, -52798, -57791, -103245, -155671, -114113, -115748, -126250, -72078, -20550, -91201, -95803, -27182, -2196, -66459, -130923, -39831, 39952, -56897, -83373, -171584, -172084, -163951, -144165, -108016, -60051, 44766, 81569, 77655, 2683, -3312, -77704, -96025, -132630, -118245, -103910, -59647, -35951, -18027, -59220, -71134, -3860, -22203, -53421, -68741, -64562, 5091, -71183, 3106, 65828, 54154, 19859, -129725, -156358, -108364, -61857, -71290, -147214, -51605, -58870, 3105, 69958, -62320, -75532, -155507, -239361, -190266, -135281, -170204, -65773, -21625, -49817, -39024, -86321, 91468, 91522, -11551, -38812, -13900, 66911, -41309, -115648, -105288, -79000]
14528g9000M1005Q6235p6791k5241O5705P318J3098L8507J17574j1009j0425m4496
14516A22480J7846K505j9599o5181J7657n3694l1144q1998j05090J4635P9514
14505a02069R8099k2621n3938P6955l57M3129M7598R144r732j3253O8859p358
14493A34456O253j13703K299k0365N6526L872p029l8089k8690k6954l5532M4073
14481b2883j14952k6726Q2122N9895o1024o1905L8885L1363J58111J81646j32862
14470A31670j58186J02891N8879q6820j17883n682J0965J64345P4669j03500n7658
14459A3690j7037o6773J9344L8399l340l4815K8494R8626L1355n3724n1748l711
14447a240L5900m4108K6063l7515p8114L5595M0559m5916P7375R0209N9477p2598
$$ y = [-79000, -37995, 48240, -28551, -53792, 11913, 19231, 32329, 70836, 188410, 177401, 166976, 122480, 140326, 142831, 123232, 58051, 75708, 22014, -9130, -91128, -196218, -181583, -102069, -3970, -26591, -80529, -3574, -3931, 39198, 86796, 95940, 86208, 72955, 141814, 134456, 140709, 27006, 29305, 8940, 65466, 69338, 62309, 24220, -4470, -31424, -66956, -22883, -137835, -164561, -82439, -22544, -83568, -145473, -106588, -75225, 82886, 264532, 131670, -26516, 76375, 135254, 48434, -69449, -75131, -64166, 100179, 174848, 71348, 13690, -3347, -70120, -50776, -12377, -15717, -50532, -22038, 76588, 107943, 54219, 2471, -1240, 34660, -9448, 16615, -20900, -99014, -63419, -22860, -68776, 8599, 98808, 158285, 85687]
14435H5687q1100l7304o2468n299m8132N0216p4808k1062j8090J11338J7215K8783
14423e5024P9612K3226m8380L84q9374n661L9262J9465O5137K6322p3347o15R2693
14410G3700n0779j74357K1067N4349P4557L7875J04624l8489p9593j38234R7217
14399a8063q0633j9237j9847m1419M6058J42192M0791l6816j28412j27859L2807
14388b10438R3876J9768O5003J2788j11j4473k5368N3772R3561o581J6116K6392
14376A24305j94155R2922O3710l844k923m1771m6078j80273o6770O9351L5724
14365a49802N5694J6483M8282o4895k9180j8385j8244J9321m5414k8274j18198
14354c32612q727J54283L2191q7628P2219K0995K6156o8178Q3409O4804J1326
$$ y = [85687, 4587, -32717, -95185, -100484, -148616, -98400, -173208, -194270, -212360, -101022, -83807, -55024, 24588, 47814, -566, -182, -89556, -95217, -55955, -36490, 28647, 54969, -18378, -18993, 73700, 22921, -151436, -130369, -76020, -1463, 36412, 141036, 102547, 22954, -115280, -18063, -98696, -117933, -137780, -179199, -133141, 9051, 49842, 13026, -115386, -243245, -210438, -116562, -96794, -31791, -19003, -19114, -33587, -58955, -5183, 88378, 81797, 97913, 124305, -69850, 23072, 86782, 82938, 80015, 38244, -7834, -188107, -254877, -185526, -149802, -94108, -77625, -29343, -94238, -123418, -141803, -160047, -140726, -186140, -214414, -332612, -341339, -187056, -154865, -242493, -170274, -149279, -123123, -191301, -107892, -43088, -31762]
14343c1762J49744K365r7452m0468j0831p6304N0357J04302M6677l4949l2618
14332B9061L3003J120j8082P8681n1872m8512j8361j72821o4397J48201J20561
14321C6582J3392j60711J714N5268L6668m5239r6258p7533p5007q482N510J20665
14309a93431Q5401J63810n3751n7980k6935Q4371M1776L0928k8650m6716l3388
14298c4565j0358O0702P1650k8605o8411K786r2102J03402R9651m4504O548p8478
14286a2284j4659o9393J4828J37065J0558J6482N6825o5716r2810N2485L283Q305
14274D4969K7295r0531j1758P8480K7188k2992n3650j4248k2339j379J5641J45383
14262A22059J22024j3688k2189l4178n8941p0090m2388r0049k2393O776J8275
$$ y = [-31762, 117982, 120347, 22895, -17573, -28404, -104708, -54351, 49951, 96628, 61679, 29061, 62064, 63184, 45102, 123783, 71911, 23399, 5038, -167783, -232180, -83979, 36582, 49974, -110737, -109023, -53755, -17087, -62326, -158584, -236117, -311124, -319606, -314096, -193431, -108030, 55780, 2029, -55951, -82886, 1485, 43261, 74189, 45539, -1177, -34565, -44923, 15779, 87429, 58824, -9587, -6801, -98903, 4499, 104150, 59646, 66194, -12284, -26943, -96336, -81508, 55557, 66115, 82597, 139422, 73706, -19104, 33381, 36664, 44969, 72264, -18267, -30025, 48455, 75643, 52651, -999, -15247, -37586, -38965, -23324, 122059, 244083, 230395, 208206, 174028, 115087, 44997, 2609, -87440, -109833, -103057, -84782]
14251h4782O7932o984L6414R0660p173Q9503n9475M2560j1601k9519J10311k0468
14239B17378m5584j42626k7992J51832J898p3979j03448L9832J8827j37524J6852
14228h4534Q3672K3077o626j4594p3477K1816p4793k28912K8677K64193J52353
14217I0852K7480N640k0876o7520L9376J30484J37276p5560m5398l3332q5568
14206A02854J6477o4576j06812M5773J17456r8823j62627R465J58330J56226j52724
14195B1019j98455p0340o916J16675m8751r3365K938J59706Q1589M6845J5313
14184B6258N7064M1948r4242n9284K9163K7736n7549L4853M4431j57942j01664
14173b09228J17245P0255K8681p0719N0746N3537L8786j62137j47060J75859R3214
$$ y = [-84782, -16850, -23834, 12580, 103240, 96067, 185570, 126095, 168655, 157054, 127535, 237846, 217378, 171794, 29168, 1176, 153008, 154906, 80927, -22521, 17311, 36138, -101386, -84534, -862, 22215, 15589, 995, -72482, -50666, -125459, -354371, -325694, -61501, 90852, 118332, 123972, 103096, 35576, 74952, 205436, 342712, 267152, 221754, 188422, 102854, 119331, 54755, -52057, -6284, 111172, 12349, -150278, -140813, 17517, 173743, 21019, -177436, -247776, -254692, -138017, -186768, -280133, -277195, -117489, -35900, 10945, 26258, 83322, 125270, 31028, -28256, 907, 28643, -28906, 5947, 50378, -107564, -209228, -91983, -21728, 6953, -63766, -13020, 40517, 79303, -82834, -229894, -54035, 39179]
14162C9179Q0883p8581n828l2342k7560O4226L7036r8329o895l6055j5035J7165
14150f2136M2139L5317O4532N6625j7014M173L8340o4802n5111L8956q4071r72
14138d024K0439k5703l9029R3568R7439N8621j74864r8704N4973o2502l0959N8275
14126e2470R3156O4403r3545p7612J11194N9280N4273o5181j92853J9662o044
14115h5737j17142N2942J33689L4856k0228j81632j47075J5782p48M8251P3082
14104a93960P8442K10855J04194k9883j08746m8977k5715q9623K7045N2400J43506
14093A19538p2495j13869k2628Q661n5519J30700M976O4460p127M0459j25603
14082b8447k4383O916k737K4972K4205M70j01147R3882m4782j25230K9775k8475
$$ y = [39179, 120062, 41481, 35653, 3311, -24249, 39977, 77013, -21316, -28211, -64266, -79301, -62136, -19997, 15320, 79852, 136477, 119463, 123636, 161976, 97174, 42063, 81019, -3052, -4024, 16415, -9288, -48317, 45251, 142690, 201311, 26447, -72257, -17284, -79786, -110745, -52470, 40686, 105089, 11544, -66068, 45126, 104406, 158679, 93498, -99355, -79693, -85737, -202879, -149937, -16248, 18608, -1620, -183252, -330327, -314545, -315293, -267042, -193960, -115518, 95337, 199531, 169648, 60902, 11925, -13790, -103413, -76368, -23968, 119538, 47043, -66826, -89454, -80793, -136312, -5612, -636, 63824, 56697, 97156, -28447, -52830, -45914, -48651, -23679, 526, 996, -100151, -6269, -51051, -176281, -146506, -174981]
14070a74981Q8425P2128K314J42113J7805j00760m6569j2968j2634k455j14399
14059a41981m0692l7022M5025R0685J68115m8845m6227j0546J56651O7887J172
14048B04222j28787j47139r1815Q5303K5576p3022o7621N0562L4739l2081m8232
14037a88295j22941l9392p000J34039J58833L3235L8290J656k0053J6375J5001
14026A9748m8381M8071J06670M8632j7830m5070J0398l5218l3134L3003m4738
14015D2151o1755j06444k3104K0985J7296N4823O6033o4936n6784p9076o7761
14004b58572P6498J16262P4426K02508N821j33257r0607J34281O5466p6074o9901
13993D6851J2864O3083n4771o9488N566l0862J05150M8651r4932j37860j8924
$$ y = [-174981, -86556, -14428, -12114, 129999, 147804, 47044, 475, -12493, -25127, -27582, -141981, -182673, -219695, -174670, -83985, 84130, 35285, -10942, -21488, 135163, 203050, 204222, 75435, -71704, -163519, -78216, -52640, -125662, -193283, -142721, -107982, -140063, -188295, -311236, -350628, -357628, -223589, -64756, -31521, 6769, 8425, -11628, 4747, 19748, -28633, 19438, 126108, 174740, 156910, 111840, 122238, 87020, 53886, 86889, 42151, -19604, -126048, -149152, -128167, -110871, -56048, 9985, -54951, -111735, -190811, -258572, -182074, -65812, 8614, 211122, 216943, 83686, -6921, 127360, 192826, 116752, 46851, 59715, 122798, 68027, -1461, 4105, -26757, 78393, 127044, 32112, -105748, -124672]
13982a24672J5588l2558j11672N0784J65133R8488l1544k9317q0314j19356R6831
13971a02609P0988K9396L4545n0062k9411j2633J551j03451k7532J19030K5527
13960d4661N4415O6471n5245n1529j74654P3070P4832l5065M7022j6580L2152
13949b9772k8190p8194R5290J9659L4347Q8049R012m9246n8745p9311p7599N2160
13937a02540l418J17909J76166k764q656J0117K6018k3229r1552m2181j45992
13926i0122o7398O9832R7238o0696l3944M9157j35117j17318j15728q4098J34983
13915c53211J62710Q5154K5107m477r1052M1745O4006J62056M8866j70664j7694
13904d7454M903M9688J06024k3649n168L2179J406j0986j19351M7337L6068j17632
$$ y = [-124672, -109084, -141642, -253314, -202530, -37397, 61091, 29547, 230, -80084, -199440, -102609, -31621, -2225, 32320, -17742, -47153, -59786, -58235, -161686, -189218, -70188, -44661, 9754, 76225, 20980, -30549, -205203, -132133, -57301, -92366, -45344, -61924, -29772, -57962, -136156, -40866, -21207, 13140, 101189, 110201, 60955, 2210, -77101, -154700, -102540, -105958, 11951, 188117, 185353, 176697, 186814, 212832, 189603, 98051, 55870, -90122, -157520, -87688, 9550, -51146, -85090, -35933, -171050, -288368, -404096, -488194, -353211, -190501, -105347, -80240, -84717, -175769, -134024, -70018, 92038, 140904, -29760, -47454, -42551, 7137, 113161, 89512, 84344, 116523, 117929, 106943, -12408, 34929, 70997, -46635]
13892d6635j30477N6662R9982N917l0232N1682K3991k1365p5492o5458m0044r91
13880a72460R2678M99J9306L6130q1461k0343N7518m8790l7117J53068J09557
13869A08585N4879l530o0665M621n0753m2278j04261O3766k9508l9082J08944
13858A0718M5426k5931p5110O0521m9670q1571P1512r231m5650J0253r0388K8093
13846a51028Q1325J58533O1693q1646n1423j5384l8010L4401J14565R2080J8256
13835B23362l7488R010p9350o5637J4095l7198J6959l5417q9337m2229J22995
13824b35R4872k0075r7011j1411r297L755n6901j52785m6419J58895J35623m0774
13812d1763Q417J11584o3937p5041p5758K0239J2222p5042k665l037r127q777
$$ y = [-46635, -177112, -120450, -20468, -14551, -44783, 6899, 30890, 9525, -65967, -131425, -171469, -172460, -79782, -79283, -59977, -23847, -105308, -125651, -68133, -116923, -154040, -972, 108585, 163464, 159934, 99269, 103890, 53137, 10859, -93402, -29636, -59144, -98226, 10718, 56144, 30213, -44897, 15624, -34046, -115617, -44105, -53336, -98986, -88733, -179121, -151028, -69703, 88830, 150523, 68877, 17454, 2070, -35940, -1539, 113026, 205106, 223362, 185874, 194884, 115534, 49897, 63992, 26794, 43753, 8336, -81001, -123230, -235, 94637, 74562, -22449, -33860, -43157, -39402, -96303, -249088, -295507, -136612, -989, -41763, -33346, 78238, 14301, -60740, -136498, -116259, -104037, -179079, -181744, -184781, -193908, -202685]
13800b02685K669L4471j0780J0000L1548J15997J79983O7685j64270r5790K4439
13789f733m589L7578r695m6585j21967K3211Q1612k510n4629Q466O8977L6062
13777I198l0230N7362K7009k9734j16297p040L687j02768r667Q5266K0816J0826
13765h1572O221Q623J10429L3841o4327r5579l2736M0848M7288j2408l8413j09486
13753a87271j12988m2884R8973P3043J20563q8778m388L994k4907K0724J59653
13742A5734J14690k038o679L5464J03877p1515r6721l394J7045j61215L4838J8538
13730a376m6542M4500O8835j51533p3554K3541J32056J52481m7010j15666J03677
13719H9409K9986j16105j22457N8788M0828J2333M5388R9716L9208m211p7843
$$ y = [-202685, -200016, -165545, -176325, -166325, -134777, -18780, 161203, 228888, 64618, -31172, -6733, -11322, 26256, 16561, -30024, -151991, -128780, -47168, -49678, -104307, -95841, -26864, 9198, -21032, 36330, 63339, 33605, -82692, -89732, -86045, -188813, -198480, -113214, -92398, -81572, -75351, -66728, 43701, 77542, 13215, -82364, -115100, -74252, -26964, -39372, -77785, -187271, -300259, -343143, -244170, -171127, -50564, -139342, -143730, -139736, -164643, -143919, 15734, 130424, 128386, 121707, 157171, 261048, 189533, 92812, 89418, 106463, -54752, -19914, -1376, -47918, -3418, 65417, -86116, -159670, -136129, -4073, 148408, 101398, -14268, 89409, 119395, 3290, -119167, -60379, -19551, -7218, 38170, 137886, 177094, 172883, 95040]
13708I5040q0831j71384N0942q7406m175k7280k3204Q4024J60318J77614n7691
13697A15967p5225K5148j27870o2516N3623K5704k4858Q5997l846o8040J9667
13686c6249P4531J47842l4831j29016o4056P2669K272o8484k7086R2424l8453
13675h437m1497O6834R0424Q7986L5707q2913l9281l2019K6235N6150j00729k414
13663E6046L2547M7139n297p7545J2810n0965n8977l3698k4381q5111q846j6811
13651b13089M6188L6748p1732J8825J52684J8368O9143L0534m9462n3512P4764
13640E9459j0725j70837L2684J80758j7844p9489q6144o8887N2619Q8933l8355
13629e7828r0801j41690R8046K58276J34957m1185j59361j48072o7066J91115
$$ y = [95040, 14209, -157175, -106233, -193639, -197814, -225094, -248298, -164274, -3956, 173658, 115967, 40742, 65890, -61980, -124496, -70873, -45169, -70027, 15970, 12124, -55916, -36249, 38282, 186124, 151293, 22277, -41779, 30890, 33162, -35322, -62408, 30016, -8437, -49934, 16900, 107324, 195310, 231017, 148104, 108823, 76804, 103039, 159189, 58460, 56046, 88593, 135732, 130435, 52890, 65700, 14735, -44242, -77940, -102321, -187432, -196278, -213089, -166901, -130153, -201885, -183060, -30376, -12008, 57135, 87669, 38207, -15305, 59459, 48734, -122103, -89419, 91339, 73495, -5994, -92138, -161025, -108406, -19473, -57828, -148629, -290319, -192273, 66003, 200960, 159775, 414, -147658, -214724, -23609]
13619b3609J01497k4431j55751q1333R1788p8665L6695L7527m8200l4773P9063
13608a00192n7221K3619N6382k2384J61734M7272l9662M7040L6513J1008j2735
13597A51374k3090l5694N3577k783o3671m2706M5604p4327j4535l9001K8446R012
13585g794q4253k8715O2492k5908l4162J09457Q2127p8894L5409k9360l2055O7320
13573C5664m6621N2624J30370O6954P1619n9193j5291r9928j38052j16603Q1249
13562c7208Q5569L9833p4543n1095j5273m1361k9873q722J03592O3832N5676j16279
13550b5852k8697l2085O642r7148k3578J26203Q3961j0234J7906J781Q9292J8491
13538A26682j8560M1607n4392n2072L6135N1126K2883o9132q7349L4753j44230
$$ y = [-23609, 77888, 53457, -102294, -183627, -91839, -170504, -133809, -96282, -144482, -179255, -100192, -157413, -133794, -77412, -99796, 61938, 109210, 69548, 116588, 153101, 164109, 151374, 128284, 92590, 146167, 143384, 79713, 37007, 82611, 8284, -6251, -45252, -16806, -7794, -92047, -120762, -58270, -84178, -118340, -8883, 73244, -5650, 29759, 399, -31656, 35664, -10957, 41667, 172037, 238991, 310610, 251417, 236126, 136198, -1854, -118457, -37208, 48361, 88194, 13651, -37444, -52717, -94078, -123951, -132673, -29081, 34751, 90427, -25852, -54549, -86634, -79992, -177140, -200718, -74515, 9446, -788, 17118, 18899, 108191, 126682, 108122, 149729, 95337, 43265, 79400, 130526, 153409, 84277, -3072, 31681, -112549]
13527a12549m8786q6349J01684R6975N7394K1737p7324j2283Q8584j110j4160
13516A3813O802l0221k2054n5671L0018J2106l0555j0668P5513k2311n4311k8937
13504a16476M8213M5750m1140r4585M766R4498K33718R0556j43275p9472N0895
13493I3448n4006m8414r8135N9095J22958q5149j71332k1110J47748n980l9535
13482a00412J55952k6628J4548J05297O334N9855j02862j37748M0287n757O7741
13471G6607q6375K069l605M6138J4768o3226q4216j8033M341L5876m8232n3276
13459a77164k8000J2591Q0384M4202O9701N9149Q4621Q8921k7442j06301m0531
13448F0131n8698J38405l9876p6924J3011R4173o1987j22173P2730P8386j19673
$$ y = [-112549, -161335, -247684, -146000, -49025, 8369, 30106, -47218, -59501, 29083, 27973, 13813, 20615, -9606, -31660, -87331, -57313, -45207, -75762, -86430, -10917, -33228, -87539, -116476, -68263, -22513, -63653, -158238, -153472, -58974, 174744, 265300, 122025, 42553, 93448, 39442, -8972, -107107, -48012, 74946, -10203, -181535, -202645, -54897, -60877, -100412, 55540, 28912, 43460, 148757, 155091, 214946, 112084, -25664, 14623, 8866, 76607, -9768, -7699, -11304, 34834, 49602, -13624, -97840, -115873, -111532, -75656, -123888, -177164, -205164, -192573, -112189, -67987, 1714, 60863, 145484, 234405, 206963, 100662, 60131, 1433, 139838, 99962, 23038, 36049, 130222, 68235, -53938, 18792, 97178, -22495]
13437b2495q2582K0414R5384O4215K4940p595k3868l6924n0491j19820k3421O4318
13425i7925J7035l0040o6299n8059K9729j3213J3851J5894M1254Q4376K7484n3988
13413h9901L6196K1273m5881O7751P9091p6715O5603Q0115J30268j23166m5200
13402I9434Q3691l9306k2462L0883L8259p772q2756j6187n6328l938n1968p4183
13390a02633P6863j3366N7302N8570n8141k2578r774j0602o5222o3864r1526Q4548
13378a60423m8375P5387M8400P8818Q1131p1436o3046K902P6937L7243k630Q9013
13366A43921K2217q7160J2179p504l6053R337m2068j40507N6319O0741O6817L1509
13354H9748k9410N4042j1681r9249J7782m9555j14085K5611O2094O1470N1089
$$ y = [-22495, -105077, -84663, 10721, 74936, 99876, 92281, 68413, 31489, -19002, -138822, -162243, -97925, -80890, -110930, -177229, -235288, -205559, -218772, -204921, -189027, -147773, -63397, -35913, -89901, -53705, -32432, -78313, -10562, 68529, -8186, 57417, 137532, 267800, 144634, 99434, 183125, 143819, 121357, 152240, 190499, 182727, 99971, 83784, 27456, 23518, -28450, -102633, -25770, -39136, 18166, 76736, 18595, -3983, -13757, -24359, -89581, -153445, -244971, -160423, -208798, -133411, -85011, -6193, 74938, 3502, -59544, -56642, 20295, 57538, 54908, 143921, 166138, 78978, 91157, 83653, 47600, 56937, 14869, -125638, -69319, -8578, 58239, 89748, 60338, 114380, 102699, 3450, 21232, -28323, -142408, -116797, -54703, 6767, 57856]
13343E7856k2292l8581r5443O5638j900K4121J08537N3942K1170j5311p3681p0660
13331A3396J43571N1971k8257j1650l2416L8537r5452j2135M8398M98O572Q5159
13319B08192j44338M1411J47188K0202J7745N3571p0762j95537o6797q2531j07070
13308a78726k3211M749J22721J32585K2127L7423J9010k1951P745M5315n4801
13297A12986J0215j9670m4804L2322j6961l3180j16156n4356M6415M8846J37802
13286A03459o5070n7279n6627o3938J07656J04745O2218o3025p2534N2391l1323
13275B0673m1577M0511O1264k3275q6653p1149N339n6917L5714m7180Q0105M8333
13263c4812J08056j2078K0951j41907O8910k2707K2051R9786j8074o098k0990
$$ y = [57856, 35564, -3017, -98460, -32822, -34722, -10601, 97936, 151878, 173048, 157737, 84056, 13396, 156967, 208938, 180681, 169031, 136615, 175152, 79700, 67565, 115963, 116461, 123033, 208192, 63854, 105265, 252453, 272655, 290400, 343971, 273209, 77672, 10875, -71656, -178726, -201937, -197188, -74467, 58118, 80245, 117668, 136678, 114727, 122472, 167787, 112986, 123201, 103531, 58727, 91049, 74088, 40908, -75248, -129604, -83189, -34343, 103459, 38389, -18890, -75517, -139455, -31799, 72946, 135164, 72139, -395, 51996, 20673, -20904, 19607, 80871, 57596, -29057, -100206, -94867, -151784, -116070, -163250, -83145, -34812, 73244, 61166, 82117, -59790, 9120, -13587, 8464, 108250, 90176, 84078, 63088]
13252F3088L0655j27194j36686Q6833J11362P9453J22859m0282j48708m8424m1817
13241d8861K0081O705R0700J19755P6438n6273j74758j4127K8988p3194M4084
13230A9538O1459o887O446L6832j3547o8239j62017o5619k9024K02091J78303
13219A59336Q8090p1429J1141K3125q6822M4981j60857p9471r1356q6989L9014
13208b11237N5630J56394o3623j26437M1402R2575L7194K723o521P6146K0803
13197G5049l734N0960j3755r711P6146n3390n8412J02542L8653j42151r6121j2755
13185d6679N8776o0998K3830J5697O9874k597m0171L164k4395P4893l2262K4328
13173F3460L9812O4127J66628J74628k19409j32175L9865M067J8450o4522j32762
$$ y = [63088, 93743, -33451, -170137, -83304, 28058, 107511, 230370, 190088, 41380, -7044, -48861, -28780, -22075, 68625, 188380, 264818, 208545, 33787, 19660, 48648, -24546, 19538, 80997, 74110, 80556, 117388, 103841, 35602, -126415, -192034, -221058, -18967, 159336, 247426, 175997, 187138, 210263, 123441, 168422, 7565, -71906, -163262, -250251, -211237, -155607, 787, -62836, -189273, -147871, -55296, -18102, -15379, -21900, 54246, 75049, 71315, 122275, 108520, 98809, 174955, 121565, 63153, 165695, 204348, 62197, -33924, -46679, 12097, -48901, -25071, -9374, 60500, 57903, 17732, 20896, -3499, 71394, 39132, 63460, 103272, 167399, 334027, 508655, 289246, 157071, 196936, 201003, 219453, 154931, 22169]
13162B2169l7855O2643Q6329p9140O997M9687J655j9067N7794l0059M1269J223
13150A63645J5735q031J8444R5319J02817m3392l084j3166J47920J64778L8842
13139F79827J83180L30396J85197K53122J64330O1199p4279n2829J9349l39681
13129A409811k99803k37940j18573j97453j7383o3447k31247p078Q1959l6891
13119B81955Q765K8023j10061k3661M8895J8653R488o8471j26882N109J8311P0212
13107A60336L4021k2896O958j2159m7398J0812J9724o1783L8901J21461n9408
13096A88569j06832M7594K1813J9278J06520Q8083J38325O8102M5910r7667q1402
13085D38293o4465N462J10687r6791r1229l7789J8907J9318M1795M2136n4516
$$ y = [22169, -15686, 46957, 133286, 54146, 61143, 110830, 112485, 93418, 151212, 121153, 162422, 163645, 179380, 171349, 189793, 285112, 387929, 344537, 341453, 328287, 476207, 640985, 679827, 863007, 1193403, 1378600, 1631722, 1796052, 1857251, 1782972, 1730143, 1749492, 1409811, 1110008, 872068, 753495, 556042, 538659, 475212, 243965, 236887, 318846, 281955, 290720, 318743, 208682, 185021, 233916, 252569, 262057, 193586, 66704, 71813, 90124, 160336, 194357, 171461, 178419, 166260, 118862, 129674, 149398, 87615, 126516, 247977, 188569, 81737, 129331, 151144, 170422, 276942, 365025, 503350, 571452, 617362, 519695, 438293, 373828, 379290, 489977, 393186, 301957, 264168, 283075, 302393, 344188, 386324, 331808]
13074C31808j4178l2452o7326l5538L6880j01198j51864J523J38140J37748J76090
13063D19633q1568j51254l4617J01725j0387j8280k102k7458o3680j44697J4673
13052A988O4751L1103n7405L2118m0362r7494n0842o963J24784J87548q8914j22584
13040b2272M0759J15501J46233J4418O9027m2752N6116p0850j77351j58375j4745
13029d4291J15601L6917K2676M2760j24267p075R6326J22409p9246m7437j6878
13018A17495L9231R7474N009q650l8120n6954l5170n0595J06403J64498L7063
13007C77684m1278r4737o2111n9937M0154M8764J1317p3933J5254J07220M8753
12996C17150J1955p8628J5298j21232r688q7782P700J308J8878L5197M0149J615
$$ y = [331808, 317630, 285178, 217852, 182314, 219194, 117996, -33868, -32345, 105795, 243543, 419633, 338065, 186811, 152194, 253919, 243532, 225252, 223150, 195692, 132012, -12685, 1988, 66739, 97842, 40437, 72555, 32193, -65301, -116143, -123106, 1678, 189226, 100312, -22272, 18487, 133988, 280221, 294639, 363666, 320914, 377030, 306180, 128829, -29546, -44291, 71310, 108227, 130903, 173663, 49396, 42321, 138647, 261056, 181810, 134373, 117495, 156726, 254200, 259209, 250559, 212439, 155485, 120315, 69720, 176123, 340621, 377684, 336406, 241669, 179558, 119621, 159775, 208539, 219856, 145923, 161177, 268397, 317150, 329105, 250477, 265775, 144543, 134855, 47073, 54773, 56081, 74959, 110156, 150305, 151920]
12984A51920n4306n5228n8288R01j1992J24084m2606n0983o3041k3319O1539j3314
12972c4633m01M2617J82975J2619j04161m0985M1185L7855l2028j03096J9130
12961B1077n771l6226J3747j518P9443k2769l7606M4545q1173l1935O0907P2195
12949G4916J7034m702J55117m463j26056N973K763O7901K3174N6738l606l3098
12937B31691o5279m5179L6864P0272p7309N0361O0846L8994R3038l1844j29739
12926B32716o0101k3239n7137l2284l8179p371N7697Q7353N8491j4277k8310N3313
12914B28672Q236N1116r6401L5846M9509k7905N627j12563j13334m0129l8857
12903e0183J8003P1379M7899o03M6118j87676q2591J46840J88258J01260n7147
$$ y = [151920, 97614, 42386, -15902, -15001, -26993, 97091, 54485, 3502, -59539, -82858, -21319, -34633, -35034, 7583, 190558, 203177, 99016, 58031, 99216, 137071, 105043, 1947, 21077, 15306, -20920, -7173, -8691, 70752, 47983, 10377, 54922, -26251, -58186, 2721, 74916, 91950, 87248, 242365, 237902, 111846, 117819, 120582, 188483, 211657, 268395, 264789, 231691, 166412, 121233, 158097, 228369, 151060, 201421, 262267, 301261, 394299, 362455, 232716, 172615, 149376, 92239, 59955, 21776, 14405, 72102, 159455, 217946, 203669, 175359, 228672, 236908, 288024, 191623, 227469, 276978, 249073, 254700, 142137, 28803, -11326, -50183, -32180, 39199, 87098, 86495, 132613, -55063, -137654, 9186, 197444, 298704, 241557]
12892B41557l111m5171o0893O1650L1734J39810K34055N1322p239n8776j77157
12881D07781k07098j5610J3254j05564j5393Q6122R7391J29237R2127J216J93771
12870F77234K76470J13520k3547m8587j4978j57932j51394O9919l5107o2912j06706
12859E35980j06508r2272M4237J46303k618p9578P1033P8681m6001p8807j37471
12848C32979L2480Q0922R2573n9097J3268P439n2820l0265L2052p9176o9245J693
12836C02803o050j6520M5146J08850P4854p3854J0871r4816l1699j2599J9680
12825C26666J19468J31483M527J67569J05684P193L4269l4473R9523P8963N676
12814A046548p385m3652K08573L29326L31076L43614L91589L55294M73953L06080
$$ y = [241557, 238446, 193275, 132382, 194032, 225766, 365576, 599631, 650953, 643714, 584938, 407781, 200683, 185073, 198327, 92763, 77370, 163492, 260883, 390120, 482247, 483463, 677234, 953704, 1067224, 1043677, 995090, 980112, 822180, 670786, 740705, 705598, 642686, 535980, 429472, 337200, 381437, 527740, 525122, 445544, 516577, 595258, 549257, 470450, 332979, 365459, 446381, 538954, 479857, 493125, 500564, 447744, 417479, 449531, 370355, 301110, 302803, 296753, 280233, 325379, 434229, 509083, 435229, 446100, 351284, 319585, 306986, 326666, 446134, 577617, 582144, 749713, 855397, 862590, 896859, 862386, 961909, 1040872, 1046548, 1039163, 995511, 1204084, 1533410, 1864486, 2208100, 2599689, 2954983, 3428936, 3735016]
12804C735016m8843m01572o03059m93582m61110k34108k09759l3381l5796j54432
12794A059374j51691j70996K1716J13067L555m1127R7293J47399p1669j37721
12784H69200n1716j26299R433Q9299K15845N1741o8446l4933p3511L1966N7897
12773I70476J26017K459o1391j05601m8824M8961L1889O7458R4035J000J03686
12762A230165J04226M7309l5411Q539J46605J64896k3953l4695O2048p3764m3771
12751A552194r236k2075J1443O791l9574k5883n9733p1031O3234n1481J996M3623
12739A400268L646J23502J13388P6552Q8793P8389L9276k9642P3933L0735J04019
12728B102859J30648J26108Q1385N3993J80197L08193J93628J24354J7032P7827
$$ y = [3735016, 3686173, 3284601, 2681542, 2187960, 1726850, 1492742, 1282983, 1249602, 1213806, 1059374, 907683, 736687, 758403, 871470, 875025, 833898, 931191, 1078590, 1006921, 869200, 817484, 691185, 700618, 789917, 1005762, 1057503, 989057, 954124, 880613, 912579, 970476, 1096493, 1098952, 1037561, 931960, 883136, 932097, 963986, 1031444, 1125479, 1126479, 1230165, 1334391, 1381700, 1346289, 1354828, 1501433, 1666329, 1642376, 1607681, 1669729, 1595965, 1552194, 1542958, 1520883, 1532326, 1539117, 1499543, 1473660, 1413927, 1342896, 1406130, 1354649, 1356645, 1400268, 1403914, 1527416, 1640804, 1717356, 1806149, 1884538, 1923814, 1894172, 1968105, 1998840, 2102859, 2233507, 2359615, 2441000, 2494993, 2675190, 2983383, 3177011, 3301365, 3318397, 3396224]
12718C396224J12815K16467J98272J825M5387K64819L14645L20283L54994N47058
12708E772789O09683O12825M61212P58853R30561J161341J512065J846818K308958
12699A5975105K828630L221156L625407L573695L036495K747125K578513K225990
12691C9812116K304919L007258M799737Q246658J3728174K2131087L5157129N1605934
12683A80793012O2338104N5660370L6894354K4514186J8286128k725593m3091899
12676C32668662p1013784o6395806m7296161l0852716k0339800j4050283j0197361
12669G2522751p502041n821576m452206l585955l120702k808664k456614k174783
12661D0600210j995688j878736j732237j598557j492018j381679j273899j126317
$$ y = [3396224, 3509039, 3725506, 3923778, 3925603, 3970990, 4235809, 4550454, 4870737, 5225731, 5772789, 6382472, 6995297, 7456509, 8215362, 9145923, 10307264, 11819329, 13666147, 15975105, 18803735, 22024891, 25650298, 29223993, 32260488, 35007613, 37586126, 39812116, 42117035, 45124293, 49924030, 58170688, 71898862, 94029949, 129187078, 180793012, 243131116, 298791486, 335685840, 360200026, 378486154, 375760561, 332668662, 261654878, 195259072, 147962911, 117110195, 96770395, 82720112, 72522751, 65020710, 59199134, 54746928, 51160973, 48040271, 45231607, 42774993, 40600210, 38604522, 36725786, 34993549, 33394992, 31902974, 30521295, 29247396, 28121079]
12653B8121079j059775r05389o72150o42163m35524l20612l26822j52293l6371
12644B3569980K192O7444L21591Q62529J336376J977874L100421M810502P374576
12635D3423485J0263103J2404623J1463912P961809N229516L184220j276635q569850
12627H4084183j3920857j3875257j0549929p218187m929817l644099k828688k153520
12619B4963829j663418j360983j133484j006589q68765q75555q31885p56347o07990
12610A5858813n60919n43225n26122n36655o57594n54960m93812l15911k74310
12601A1395305k29107j68924k22736l65824k13801k08551l52155l06543k57448
12592I070216j91189j94845k51746p451j03582k55075k24816j47136j70924q1435
$$ y = [28121079, 27061304, 26155915, 25483765, 24841602, 24406078, 24085466, 23758644, 23606351, 23569980, 23572172, 23639616, 23961207, 24823736, 26160112, 28137986, 31238407, 36048909, 43423485, 53686588, 66091211, 77555123, 85516932, 90746448, 93930668, 92654033, 84084183, 70163326, 56288069, 45738140, 38519953, 33590136, 29946037, 27117349, 24963829, 23300411, 21939428, 20805944, 19799355, 18930590, 18055035, 17223150, 16466803, 15858813, 15297894, 14754669, 14228547, 13691892, 13034298, 12479338, 11985526, 11669615, 11395305, 11166198, 10997274, 10774538, 10408714, 10194913, 9986362, 9634207, 9327664, 9070216, 8879027, 8684182, 8432436, 8424985, 8321403, 8066328, 7841512, 7694376, 7523452, 7442017]
12582G442017k54212k71988j26627o4564k26788j40089j04523j35592j07001j6573
12572E994060p6082j28751o0783J1030r8266q0071m5429j1400j33614p8127J700
12561E294267j6648J2092M1044J38684J93165K93636M53912L34965L63749L13165
12551G422031j29170m01595n92114n84310l39812j96037k73359k39774l08747
12542D357113k37584k12947j42196j04269j06814m3080j38709j21929m2618P7861
12532C284828m749j78847j36892l7149p0508m01o5679n9856l7031L3717l5405
12521B692028m6240m0298j34188o6617O4062N8316o0993j34699j2963R6480L5900
12510B450788l0863j04212l6995P8244L8456Q7186K26331Q7982j06093k42679
$$ y = [7442017, 7187805, 6915817, 6789190, 6724626, 6497838, 6357749, 6253226, 6117634, 6010633, 5994060, 5917978, 5789227, 5728444, 5739474, 5641208, 5561137, 5515708, 5504308, 5370694, 5292567, 5294267, 5277619, 5289711, 5330755, 5469439, 5662604, 5956240, 6410152, 6745117, 7108866, 7422031, 7292861, 6891266, 6299152, 5714842, 5375030, 5178993, 4905634, 4665860, 4357113, 4119529, 3906582, 3764386, 3660117, 3553303, 3510223, 3371514, 3249585, 3206967, 3284828, 3280079, 3101232, 2964340, 2927191, 2856683, 2856282, 2790603, 2730747, 2693716, 2727433, 2692028, 2645788, 2605490, 2471302, 2404685, 2468747, 2527063, 2466070, 2331371, 2318408, 2414888, 2450788, 2419925, 2315713, 2278718, 2356962, 2395418, 2482604, 2708935, 2796917, 2690824, 2448145]
12500B448145k15787j61127p8081o4035k63127k91076k38409k48986k07869j10213
12490E69435n0245J35360L30561K03509J49154J06275j73862j3940K5576L7475
12480A319298J0069l4468n9398L4058J61778k0087r7536n1381k3208M066n8680
12469A184511r0571R466O6799K4644m4427j36062r1903k1370J21934M5998n610
12458A063409n7526O3465N061L2220m0252j3044l0540J8731k2167r3155Q1769
12447A007971k4497N3476M3656q5069p2380o1985j09817l5807O3970J20772j19096
12436G81194j4264N0265n3115j0066k294O7706P8163J19445J00629j3837j2012
12425A091814j33568n8292J38011L4092p7603n4856q7984J7438O1976N6018M6023
$$ y = [2448145, 2232358, 2071231, 1993150, 1929115, 1665988, 1374912, 1136503, 887517, 679648, 569435, 519190, 654550, 985111, 1188620, 1337774, 1444049, 1270187, 1256247, 1281823, 1319298, 1329367, 1294899, 1235501, 1269559, 1431337, 1411250, 1313714, 1262333, 1239125, 1243191, 1184511, 1093940, 1103406, 1170205, 1194849, 1150422, 1014360, 922457, 901087, 1023021, 1069019, 1063409, 1005883, 1069348, 1074409, 1106629, 1066377, 1053333, 1022793, 1041524, 1019357, 926202, 1007971, 983474, 1036950, 1080606, 995537, 923157, 861172, 751355, 715548, 779518, 900290, 781194, 766930, 817195, 764080, 754014, 751720, 819426, 897589, 1017034, 1117663, 1103826, 1091814, 958246, 899954, 1037965, 1072057, 994454, 939598, 851614, 869052, 931028, 987046, 1033069]
12414A033069r9295o2202q4558Q216j4178J9115o9570q2323N3833J83700K1971
12403I07778m4584j17443p1831j69332K5047M6905J9846j6547J03467m7073k2848
12392F13385N404k1140j8126M0760m720R8108J68158m0049n928Q7000q8497j23934
12380G10421M0316P151j7131J00543j19290q2046N9446j12535N03O2824M209j55521
12368D98890j6172J5294Q4567j360K6310l6003J01255M2832m5672o3591j07766
12357D98584k6939J38518j4556j1854j1125m6679o0198Q647J52734j0178r4878
12346E22076J1237R714k041P953r6954j58640J35053J46933j22165m5632P0150
12335D77684J17412Q1140m5575o6584R7115m811m9941M8603j50908j14115O8485
$$ y = [1033069, 933774, 871572, 787014, 795230, 781052, 800167, 730597, 648274, 702107, 885807, 907778, 863194, 745751, 673920, 504588, 529635, 576540, 596386, 579839, 683306, 636233, 613385, 618789, 597649, 579523, 620283, 615563, 713671, 881829, 841780, 835852, 922852, 834355, 710421, 750737, 757888, 740757, 841300, 722010, 639964, 699410, 586875, 587378, 650202, 654411, 498890, 482718, 498012, 582579, 581219, 607529, 571526, 672781, 715613, 669941, 606350, 498584, 471645, 610163, 595607, 583753, 572628, 525949, 465751, 474398, 627132, 616954, 522076, 533313, 543027, 540986, 548939, 451985, 293345, 428398, 575331, 453166, 407534, 477684, 595096, 676236, 630661, 564077, 661192, 656381, 606440, 655043, 504135, 390020, 458505]
12324D58505o088l685K4939J38237N4744K5668N8355N9736m3871k51791j29352
12313C85397Q0739N5641N9935k338K14k9893j10509J1270M1429O3753m8881l5454
12301D71303J09182p72J10181o3206p1985j523M6078J05864p9882k5333L3581
12290F33488K3830o8597o0799m6675p8120p9000N4377j7358J68268K6755m8108
12279E08061l0022M6074N5720j4103m8173M5113M01l4555k7346j7754l0674M9068
12267E01810J7306Q912n2009j1856Q710m4622Q433J40337j2822Q455J52045P8312
12255H03011R9168p1255o5086q1376L0113K068j56578j25004L8400K0060N3603
12244E47124L3332N0650Q5158R4778J72286j5064j41736J0030J4719o714J0575
$$ y = [458505, 452417, 448732, 473671, 611908, 666652, 692320, 750675, 810411, 766540, 514749, 385397, 466136, 521777, 581712, 579374, 579588, 549695, 439186, 450456, 491885, 555638, 506757, 471303, 580485, 579713, 689894, 626688, 554703, 553180, 599258, 705122, 625240, 599907, 633488, 657318, 588721, 527922, 481247, 403127, 324127, 378504, 361146, 529414, 556169, 508061, 478039, 524113, 579833, 565730, 517557, 562670, 563071, 528516, 501170, 483416, 452742, 501810, 519116, 528028, 476019, 464163, 472873, 428251, 436684, 577021, 564199, 572654, 724699, 803011, 902179, 830924, 765838, 684462, 714575, 716643, 560065, 435061, 473461, 493521, 547124, 580456, 631106, 716264, 811042, 983328, 968264, 826528, 836558, 851277, 844563, 855138]
12233H55138N4658O3928m8851p3629j9741o7802L3676K27688J29815M3278P5574
12222A273732J70242K91867K39484K67841J37493K1099K1984k15571l39825k19291
12212A649055k34684r1891j18282n8970N6681m1066q1719m5119q9117J5263j8171
12201I41980q63L5588M3617n3948r4283J38729M1843K9024r4334m183l9814M6041
12189I89397N9746R574m061o059P2644k2583r3636l2699K5340M5782M5082o622
12177A081905O0692o5300l6814J41180K62550R3308J28477L610n5902q2076m5080
12166A486550J8600o8339j5199J2708J1971Q922k7846k3384r6228M7884R435o1891
12154A303183l0467J0952r077Q9470P0315L1665p4093j42182o3165J9528J02219
$$ y = [855138, 909796, 973724, 924873, 851244, 831503, 763701, 797377, 1025065, 1154880, 1198158, 1273732, 1443974, 1735841, 1975325, 2243166, 2380659, 2401758, 2423742, 2208171, 1868346, 1649055, 1414371, 1322480, 1204198, 1145228, 1201909, 1160843, 1079124, 1034005, 944888, 960151, 941980, 941117, 976705, 1020322, 966374, 872091, 1010820, 1052663, 1081687, 987353, 983170, 943356, 989397, 1049143, 1058717, 1054656, 1048597, 1121241, 1098658, 1005022, 972323, 997663, 1043445, 1088527, 1081905, 1142597, 1077297, 1040483, 1181663, 1444213, 1537521, 1665998, 1669608, 1613706, 1531630, 1486550, 1505150, 1436811, 1421612, 1434320, 1446291, 1455213, 1427367, 1403983, 1307755, 1355639, 1365074, 1303183, 1272716, 1283668, 1274591, 1364061, 1434376, 1466041, 1391948, 1249766, 1186601, 1206129, 1308348]
12143A308348M8581m2648o7707L1067J77272P5095l7440q2676r0471k4435l9243
12132A255743q977N9256J04350M7316n5530j21020m0440K5855K13457l3430L0065
12121A476645N1681p6040m1027J06332K625N1454K7715p0392n2954K51302J08033
12110A835374k4402J3452l3272j15941L7866O7K7319O4512K7336J5766k9901j05398
12098A712778m2748j21345J3218J10347P695O9546O2298K4906P2184P6869K4427
12087B010175j0090j4431M2029J12412K8786M5342J00724J14195R5731K0478q0711
12076B464640o3008l3619l0019m7357O2215J8620J10928L8932k5615J63833N9382
12065B718932r430j06746P7752J05059J67623O1426r9765O029J2440K4217M9616
$$ y = [1308348, 1356929, 1314281, 1246574, 1277641, 1454913, 1530008, 1492568, 1409892, 1319421, 1294986, 1255743, 1246766, 1306022, 1410372, 1457688, 1402158, 1281138, 1240698, 1266553, 1480010, 1446580, 1476645, 1528326, 1452286, 1411259, 1517591, 1520216, 1571670, 1599385, 1528993, 1476039, 1727341, 1835374, 1810972, 1824424, 1791152, 1675211, 1713077, 1713144, 1740463, 1804975, 1832311, 1848077, 1818176, 1712778, 1670030, 1548685, 1561903, 1672250, 1679945, 1749491, 1811789, 1836695, 1908879, 1985748, 2010175, 2000085, 1985654, 2027683, 2140095, 2168881, 2214223, 2314947, 2429142, 2524873, 2545351, 2464640, 2401632, 2368013, 2337994, 2290637, 2352852, 2371472, 2482400, 2521332, 2495717, 2659550, 2718932, 2709502, 2602756, 2680508, 2785567, 2953190, 3014616, 2914851, 2920880, 2933320, 2957537, 3007153]
12054C007153J48546O789j30747k9891J26033K2461L1014n1705J52419M8791L2712
12043C363575M5796j2856M2333m0192k0598K07333K03502J55389L2410r6146n7304
12032C823242J16035L2529J20788J53178P6883N7807K3306R3483O8728J04392
12022D670371Q2793P059J01165P0131P6383J5764J29052J49955M7989L9968J35802
12011E526432O1159N6426L5838J4055M5907J49499K07363J66406K42226K82170
12001F787481M4910P6890J00330P0874Q7048J15222J05032J54847K30449J82510
11991G955593K39234K91275J00383J18085K81485J56758K16474K93527K15486
11982I868300K57848J66333L4893J31413K69725K95728K04170J96589L28685L75538
$$ y = [3007153, 3155699, 3162488, 3031741, 3001850, 3127883, 3150344, 3181358, 3129653, 3282072, 3330863, 3363575, 3409371, 3396515, 3438848, 3398656, 3378058, 3585391, 3788893, 3944282, 3976692, 3880546, 3823242, 3939277, 3971806, 4092594, 4245772, 4322655, 4380462, 4403768, 4497251, 4565979, 4670371, 4753164, 4760223, 4861388, 4931519, 5007902, 5023666, 5152718, 5302673, 5350662, 5390630, 5526432, 5587591, 5644017, 5679855, 5693910, 5739817, 5889316, 6096679, 6263085, 6505311, 6787481, 6832391, 6909281, 7009611, 7080485, 7167533, 7282755, 7387787, 7542634, 7773083, 7955593, 8194827, 8486102, 8586485, 8704570, 8986055, 9142813, 9359287, 9652814, 9868300, 10126148, 10292481, 10327374, 10458787, 10728512, 11024240, 11228410, 11424999, 11753684, 12129222]
11972A2129222L61945L90610M01009L67337L23300L28722K68939K57090N18175
11963A5346349M23164M16075M63477L98232L09821L87655M78680N37937N43848
11954A9305238L67171K95468M72127N46861N19244N24982N19194L89982M22154
11945B3362421O26857M15098L27030L98536N11566N50991N31023L72200M02208
11936B7497930M26538L52069K27861K99187L20010K18235K97404J84506J91683
11927C0015423J53734R8667l1514j02683k2924n4373j39695p1037j46986l39097
11917B9359515j33948k39129k78594l90933l72672l47164k50639k94944l07197
11908B6744295l57444l19832n22804m51952m10009m87634n21188m52468m19547
$$ y = [12129222, 12491167, 12881777, 13282786, 13650123, 13973423, 14302145, 14571084, 14828174, 15346349, 15769513, 16185588, 16649065, 17047297, 17357118, 17744773, 18223453, 18761390, 19305238, 19672409, 19967877, 20440004, 20986865, 21506109, 22031091, 22550285, 22940267, 23362421, 23989278, 24404376, 24731406, 25129942, 25641508, 26192499, 26723522, 27095722, 27497930, 27924468, 28276537, 28504398, 28803585, 29123595, 29341830, 29639234, 29823740, 30015423, 30169157, 30267824, 30236310, 30133627, 30110703, 30056330, 29916635, 29845598, 29698612, 29359515, 29225567, 28986438, 28707844, 28316911, 27944239, 27597075, 27346436, 27051492, 26744295, 26386851, 26067019, 25544215, 25092263, 24682254, 24194620, 23673432, 23220964, 22801417]
11899B2801417l38753m05642n10819n18717m29424n71431k71520k95541l86643
11890A9072927m18885l91278l15634k90519l48179k68800l67226k50980j97568
11881A6223858m58310l21407k00669k58305l88730l10555k56619l94766l05547
11872A3328950o3193k22665m21474k50444k55905k95845k84082k50292j56219
11863A1128831j95300j61585j11706r2176l26108k08894j10638k36990j61626
11854I523808o9175j97229j76022k35653q3196j82151k22662j14455j09428j71908
11844G961929l7099j56736k69948j61354q4871Q933j7461j57113k19667j85649
11834F680964K0306K2437p8600j27244j03105j09351j71658j02947P5986j19117
$$ y = [22801417, 22462664, 22057022, 21546203, 21027486, 20598062, 20026631, 19755111, 19459570, 19072927, 18654042, 18262764, 17947130, 17656611, 17308432, 17039632, 16672406, 16421426, 16223858, 15765548, 15444141, 15243472, 14985167, 14596437, 14285882, 14029263, 13634497, 13328950, 13265757, 13043092, 12621618, 12371174, 12115269, 11819424, 11535342, 11285050, 11128831, 10933531, 10771946, 10660240, 10568064, 10241956, 10033062, 9922424, 9685434, 9523808, 9454633, 9257404, 9081382, 8845729, 8762533, 8580382, 8357720, 8243265, 8133837, 7961929, 7924830, 7768094, 7498146, 7336792, 7251921, 7260854, 7243393, 7086280, 6866613, 6680964, 6701270, 6723707, 6645107, 6517863, 6414758, 6305407, 6133749, 6030802, 6106788, 5987671]
11824E987671j90671j8407J6423q7824j58993j7865j16840j73295J183J13388
11814E354770j15012j18471k33598j43784L1211j53233j38320k31821K0641p2312
11804D200071L1424J60027N777q3704n5225j94265j46625N2055q2303K7521Q4933
11793C999686p4384N156k0765q1924j37685j5886M3668j08011R542j0888j40304
11782C468205r5518n4306q5420j7242j00694K404p3873j05432j21826N2165J6871
11771B885334J15814Q0680N6264O301j6902r7212q4862r6139j17004j87164o0954
11760B484156j4112O7899m7298j61227J3450J53746N382j09628j92166o862n103
11749B188237j02364K1158J8362j05624k6818p4039M4870O7622K698r4862k675
$$ y = [5987671, 5797000, 5778593, 5795016, 5707192, 5548199, 5530334, 5413494, 5240199, 5241382, 5354770, 5239758, 5121287, 4887689, 4743905, 4775116, 4621883, 4483563, 4251742, 4272383, 4200071, 4231495, 4391522, 4397299, 4313595, 4258370, 4064105, 3917480, 3969535, 3887232, 3914753, 3999686, 3925302, 3930458, 3909693, 3827769, 3690084, 3674198, 3717866, 3609855, 3619397, 3608509, 3468205, 3372687, 3318381, 3232961, 3215719, 3115025, 3117429, 3043556, 2938124, 2816298, 2868463, 2885334, 3001148, 3081828, 3138092, 3144393, 3127491, 3030279, 2945417, 2849278, 2732274, 2545110, 2484156, 2470044, 2537943, 2490645, 2329418, 2342868, 2496614, 2501996, 2392368, 2200202, 2193340, 2188237, 2085873, 2107031, 2125393, 2019769, 1992951, 1918912, 1963782, 2031404, 2034102, 1939240, 1936565]
11738A936565J04628N3338j24196j42168N3643M257o7560K1977J622j6709r9p1098
11726A754200N2705N8753q4532l6695n7684j41358n7262O0911L8027m7251q0794
11715A459020j97446j0156M1150L1988n7903m7780J19443l1891m4843j7356P9649
11704A323875R5257q0061J2727j8266N718L7290r2887q0992m7248Q3499M7151
11693A286063j13637j14613J07506M3252n1548J2909p0563J841K3109Q2545J05361
11682A312225p0460l0626N8536n0130J6672J44155k8717r7183n1542L642p6499
11671A130073J7411K2397o5337k4753l750j3864J9511J2871J0191r0580j24910
11660H89260m8207M2271k389k2252r7617K9580J25550k1788n9407l837o0523j25823
$$ y = [1936565, 2041193, 2094531, 1970335, 1828167, 1881810, 1886067, 1818507, 1840484, 1842106, 1825397, 1825298, 1754200, 1806905, 1865658, 1781126, 1744431, 1686747, 1545389, 1488127, 1549038, 1587065, 1539814, 1459020, 1261574, 1251418, 1292568, 1324556, 1266653, 1218873, 1338316, 1306425, 1261582, 1244226, 1323875, 1419132, 1339071, 1351798, 1333532, 1339250, 1376540, 1283653, 1202661, 1155413, 1238912, 1286063, 1172426, 1057813, 1165319, 1208571, 1157023, 1169932, 1099369, 1101210, 1124319, 1206864, 1312225, 1241765, 1211139, 1269675, 1219545, 1236217, 1380372, 1351655, 1254472, 1202930, 1206572, 1130073, 1147484, 1169881, 1104544, 1079791, 1076041, 1062177, 1081688, 1094559, 1104750, 1014170, 889260, 841053, 883324, 880935, 858683, 761066, 790646, 916196, 894408, 835001, 831164, 770641, 644818]
11648F44818J00906J80715K7425j65974q1711j52715p456Q1721J7054p3257j936
11637E69590O4452J3991K93j3987N6203l7859m6542l6495k2314L2693O8492q525
11625F39992o6026j1801P79p4359p0922L4849Q782R1105j2886k6470q8163J24755
11613E49635J13053N9456J11862r2236j95710j50906o5610O8579J6568L9091J27358
11602E81140R0282l5840p8741o8819o5100J2957M3656l5772K9098o2505p6390
11591C33966m1664M5241N0992n8254J57807k8546j21857P8628M7765P1767L0640
11580E66485k1090j3956m8682j4946j25028Q9332k6930q6430K4431k9041N297
11569C19442l8068o6046Q434L948O5831J14891k587J8965K7148K9385p022m2123
$$ y = [644818, 745724, 926439, 953864, 787890, 706179, 553464, 546008, 627729, 644783, 571526, 569590, 634042, 648033, 648326, 634339, 690542, 652683, 606141, 569646, 547332, 580025, 648517, 639992, 573966, 562165, 562944, 488585, 417663, 452512, 461294, 552399, 539513, 513043, 424880, 549635, 662688, 722144, 834006, 741770, 546060, 395154, 329544, 398123, 414691, 453782, 581140, 671422, 635582, 556841, 488022, 422922, 435879, 479535, 443763, 472861, 410356, 333966, 292302, 337543, 388535, 330281, 488088, 459542, 337685, 416313, 464078, 535845, 566485, 545395, 531439, 482757, 467811, 342783, 432115, 405185, 318755, 343186, 314145, 319442, 281374, 215328, 223762, 227710, 293541, 408432, 405845, 424810, 451958, 481343, 474321, 432198]
11557D32198R9551J9277l1654o8476q4939k0490N7246n8581J1284m670J8833l2174
11545C37405m786N6355n0506J9948J6541l6680L7714o808k9797M057O5445P1934
11533D80822J3243P340L010N0094m914q2461m3174L9324l0757J9689J09811L4196
11521E96223p2553j39314j61358p6456r256J47052J48045l4170P2345o5844q7620
11510C17094m0063p2196p7065O0747J6040Q4545J3476m1169M6001K7623k9548
11499C05485Q6542O9998L5215l0157r8939j44529n1641o2904N6135K628k0593
11488A47240j18159Q1740K17241q256j4965j0841m6421q4876L5181J17759R5666
11477D11309j8067p2569q1557j01511j28164l997J38774r0907q5346N5267R8362
$$ y = [432198, 531749, 551026, 519372, 450896, 365957, 345467, 402713, 344132, 355416, 350746, 369579, 337405, 332619, 388974, 338468, 358416, 374957, 338277, 375991, 369183, 339386, 343443, 408888, 480822, 494065, 501405, 504415, 554509, 549595, 467134, 423960, 463284, 432527, 452216, 562027, 596223, 523670, 384356, 222998, 146542, 137286, 284338, 432383, 398213, 470558, 404714, 317094, 277031, 204835, 127770, 188517, 204557, 289102, 302578, 261409, 307410, 335033, 305485, 392027, 462025, 497240, 467083, 368144, 223615, 171974, 109070, 165205, 167833, 147240, 29081, 110821, 328062, 319806, 304841, 294000, 247579, 162703, 197884, 315643, 411309, 393242, 320673, 239116, 137605, 9441, 5444, 144218, 53311, -32035, 23232, 121594]
11466A21594J10759k9536J35563P5412L5827j06231j01044q4876J42705J31630
11456D31803r1782o013K8672O2834n9421j92982j10320M4365J00757N1045q4734
11445A74224M0598J19859j3217p3258o1418k6076J15648J1737M6988j2345m8971
11434B73769n7175Q914J17332K807L0085J58j05306j41801j46286L9451J0279
11423C2227n0399J06941l011k6585L7043N2089k2055k6560O4339J5939P7595M560
11411B62123K2817j5973K8353l9098l1535R1909p3795q4762j14428j8297R3338
11400A20652m8579r6621p83J04593l3068k176J6940j7074Q2797P0843P7480n2476
11388B22528j64406j26047K9953J67781m4278J2457M9379M4879j11456R079Q6078
$$ y = [121594, 232353, 202817, 338380, 413792, 449619, 343388, 242344, 157468, 300173, 431803, 340021, 334008, 362680, 425514, 366093, 173111, 62791, 107156, 207913, 258958, 174224, 214822, 334681, 321464, 248206, 186788, 160712, 276360, 288097, 335085, 322740, 273769, 216594, 225508, 342840, 345647, 375732, 375890, 270584, 128783, -17503, 21948, 32227, -18172, 88769, 85758, 59173, 96216, 148305, 126250, 99690, 164029, 179968, 257563, 262123, 284940, 268967, 297320, 258222, 226687, 318596, 244801, 160039, 45611, 27314, 120652, 72073, -24548, -25331, 79262, 46194, 44018, 60958, 43884, 126681, 197524, 275004, 222528, 58122, -67925, -37972, 129809, 85531, 97988, 147367, 192246, 80790, 89869, 175947]
11377A75947J6045q1059p1935k201P3323p3714j20754R2574J72761r1018j7756
11366G2213M4475J76136Q5045p3403j52387j2184L2179P848L9164r6551j09683
11355A2852L0865K0175j03020j4352R8859R5484P7774m4487j24224m9854N9973
11344F0045n9314J08692N5943o5803j0910O3025N0374R1486j9328j5612r4988
11333A63610q8385J16924p4623J8094O6316o8372L12O8182n6106n6899j48j70340
11321h1435k7783J59221O8428j1437Q2854j8070j1723K8588M2850n3329n6397
11310A21767n3837K8051l4466J30168J9414j46067L1102J2114o3795Q023N8539
11299A11013j09265n5239Q1893P8917L6369o9917j265N4039Q3514j4574N2611
$$ y = [175947, 191992, 110933, 38998, 36797, 110120, 36406, -84348, 8226, 180987, 89969, 72213, 116688, 292824, 377869, 304466, 152079, 139895, 172074, 179922, 219086, 122535, 12852, 43717, 63892, -39128, -53480, 45379, 140863, 218637, 174150, 49926, 72, 60045, 731, 109423, 165366, 99563, 88653, 151678, 202052, 293538, 274210, 258598, 163610, 75225, 192149, 117526, 135620, 201936, 133564, 133876, 202058, 145952, 89053, 88905, -81435, -109218, 50003, 118431, 106994, 189848, 171778, 160055, 188643, 231493, 178164, 121767, 67930, 95981, 61515, 191683, 211097, 65030, 96132, 108246, 44451, 52474, 111013, 1748, -53491, 28402, 107319, 143688, 73771, 72506, 126545, 210059, 195485, 248096]
11288B48096n0895k3970O8144P8735m0654q0653o0244n1961L9328K346o7062l7775
11276B3435J43287M3564L6743K2504q9635L2999J6342J0752j63595Q669N0129
11265A35194j20811j06236r2907o7894M7801J27928R4258J70141j5235j31435
11255D0804J2967M9709r1832n4032O8856R1372J23047J27861Q302j11080L1727
11244B97701J10916k33024j79309J9536J14591R3616o4270j03143L3023N2431
11234A42068j43124m0041J07818L3248k4204K8249r09R6624Q4252m0819r2674
11223A50488o3104k6503L567n9111r4558P1136j4299K0512n3033P2908M927q0450
11211f7520o4285J32092J04347M6232P0882N866n5695L377o4589o0486q5196J6162
$$ y = [248096, 197201, 173231, 241375, 320110, 279456, 198803, 138559, 86598, 125926, 128272, 61210, 23435, 166722, 210286, 247029, 269533, 179898, 212897, 229239, 239991, 76396, 85065, 135194, 14383, -91853, -184760, -252654, -204853, -76925, 17333, 187474, 172239, 40804, 53771, 103480, 11648, -42384, 26472, 117844, 240891, 368752, 377054, 265974, 297701, 408617, 175593, -3716, 15820, 130411, 224027, 159757, 56614, 89637, 142068, -1056, -41097, 66721, 99969, 75765, 104014, 103105, 199729, 283981, 243162, 150488, 87384, 60881, 64448, 5337, -89221, -18085, -32384, -11872, -64905, 8003, 12930, -67520, -131805, 287, 104634, 150866, 221748, 227614, 171919, 175296, 110707, 50221, -34975, -18813]
11199a8813K7597m6631P9204R7629J41830q0375j27416k416L6664M861k8992o177
11187G6965m5795L2914o9346N7515J20218K7686l2991m0146m0373L5886m9619
11176G2914k0584r273M508Q2132J7612n430M8292k1080J6339p5438J463J41003
11164B52458J07858M118n7763j00184m0947Q1206Q9951k4297j45818J3889l6601
11153A43870n4714O1974O8943n9429l1299K8341r2096J22217J12723n9731l4048
11142B06751J0755j20748j36883J47202l4444k6275J45759n6082k9664l5344n2529
11131A8498J41824J46530J8686m9026p0660M067q6586j9824L5116J6854m3077
11120A12402k7830m2342o3164n3938j91K3310j7168L6360m0298n4306N9087M4295
$$ y = [-18813, 8784, -37847, 41357, 138986, 280816, 200441, 73025, 70609, 107273, 112134, 83142, 76965, 31170, 64084, -5262, 52253, 172471, 200157, 167166, 127020, 86647, 122533, 72914, 52330, 43057, 47565, 129697, 147309, 141879, 190171, 169091, 185430, 109992, 111455, 252458, 360316, 364434, 306671, 206487, 165540, 246746, 336697, 312400, 166582, 180471, 143870, 89156, 151130, 220073, 160644, 129345, 157686, 65590, 187807, 300530, 240799, 206751, 217506, 96758, -40125, 107077, 72633, 46358, 192117, 136035, 106371, 71027, 18498, 160322, 306852, 325538, 276512, 205852, 209919, 123333, 103509, 138625, 155479, 112402, 84572, 42230, -20934, -74872, -75063, -51753, -68921, -32561, -72859, -127165, -68078, -23783]
11108b3783L2480j2985j8102N6517o5904j3496J33660l0122Q7403O751n6023J5096
11096A11492Q2245J587r9093r8720j9664N6252M3323Q5854j1145j12468k9444
11085A0219Q5171m318K7071J2927o5359L1645l276n9357k8619L6526j5642K8295
11073E5283l5559j5818R7199N2677N9090k6150o5418M3694P7365l7802q8466n3058
11061F3037L5945k6926r0579J3313M9806L1497L321K639j13454L0979N8002J32604
11049A90184J9526r3025j39124k6570J42636J67232l4442k3760Q3122R2641O8027
11038D46447j7406K2689k2868n891j8008J7531J44436O0476m3793P2133N881O2973
11026G24600J30583M0563j07362p8583J2776l0664n6172K7996L6762J73718J44580
$$ y = [-23783, 8697, -4288, -22390, 34127, -31777, -45273, 88387, 58265, 145668, 152419, 96396, 111492, 193737, 195324, 96231, -2489, -22153, 34099, 77422, 163276, 152131, 39663, 10219, 95390, 91072, 118143, 131070, 65711, 97356, 94080, 34723, 6104, 42630, 26988, 55283, 19724, 3906, 101105, 153782, 212872, 186722, 121304, 164998, 242363, 204561, 116095, 63037, 98982, 72056, -18523, -5210, 44596, 76093, 79414, 82053, -31401, -422, 57580, 190184, 209710, 116685, -22439, -49009, 93627, 260859, 226417, 202657, 285779, 378420, 446447, 429041, 451730, 428862, 422971, 404963, 422494, 566930, 627406, 583613, 655746, 661627, 724600, 855183, 895746, 788384, 709801, 722577, 691913, 635741, 663737, 700499, 874217, 1018797]
11015A018797J78516P5573j9900l9973L0609j2836j70919j30221J3153N8560J5922
11004A017281K9653M6060O1767j11845p6303l5671j12331k26694j11584j107M5910
10993E25136n8270K1577l4150J5297N0174P6150j09456j47218N4958l2618O001
10982C67581P3695j34627p7333k0786k0235L2116O6721k0830N643m2550j06522
10971A22873r4678M3605O308K8223K4046o7779m3148j8668O4227R1205L7906q6526
10959A07594l3674P3422N3253m2976k5011K7007L3971n7375k8401j3391K557r3671
10947C305j4628l2917j8177J95363k1505j60318l2546Q1002K8898L5607K5160
10936H9244q6948l3484R2420p6385p1313l6365l5676O0503N5727M4440O6915p9781
$$ y = [1018797, 1197313, 1272886, 1252986, 1213013, 1243622, 1230786, 1059867, 929646, 942799, 1001359, 1017281, 1046934, 1092994, 1154761, 1042916, 966613, 930942, 818611, 591917, 480333, 479226, 525136, 466866, 488443, 454293, 469590, 519764, 595914, 486458, 339240, 394198, 361580, 367581, 441276, 306649, 229316, 208530, 188295, 220411, 287132, 266302, 271945, 229395, 122873, 28195, 71800, 78108, 106331, 130377, 62598, 19450, 782, 65009, 156214, 194120, 107594, 73920, 147342, 200595, 157619, 132608, 159615, 193586, 136211, 107810, 94419, 96976, 3305, -11323, -44240, -62417, 132946, 111441, -48877, -81423, -421, 28477, 64084, 89244, 2296, -31188, 61232, -15153, -86466, -122831, -158507, -98004, -42277, 2163, 69078, -10703]
10924a0703J9682J99133J9096q7494j31464J8881J29725J04911j3454j96796K7563
10913G9080O8379j7532j77278J17507Q5228m3455m7877N3844M5881o6095j27284
10902b9602L7894N3799J39957p6044r9850Q1560l0151k1064K8997J40557N2588
10891B78641o2736j41152r1489J5395O4760M733j1923j04089M7597J710l8806
10880c7359m0344r4078Q0180K335O1290J14347M4939l3011j20411r4129m1084
10869a57325P4215J23352J06809N2891m9390j11330K0995j1569j02129q1981N0572
10858h4890Q0508K1826l1082l2936O3932N7082l4046l0284K5156J6942L3916R4056
10846A80180K6315J5459j7841l24J2887O3603o8063p1668M3901J6859J53186M4423
$$ y = [-10703, 8979, 208112, 227208, 139714, 8250, 27131, 156856, 261767, 248313, 51517, 79080, 147459, 129927, -47351, 70156, 155384, 111929, 64052, 117896, 163777, 97682, -29602, 8292, 62091, 202048, 126004, 26154, 107714, 77563, 56499, 85496, 226053, 278641, 215905, 74753, -16736, -1341, 63419, 68152, 56229, -47860, -263, 1447, -37359, -77703, -171781, -91601, -89266, -27976, 86371, 131310, 98299, -22112, -116241, -157325, -83110, 40242, 147051, 199942, 150552, 39222, 60217, 48648, -53481, -135462, -84890, -4382, 17444, -13638, -46574, 17358, 74440, 40394, 10110, 35266, 52208, 86124, 180180, 206495, 221954, 204113, 203789, 216676, 280279, 212216, 140548, 184449, 201308, 354494, 398917]
10834C98917p9854k0369J7764l0222N6950J5137q8324o7136j4949k9251j04422
10823E4241P018K00552J202j87180N9742J14611N3015r5196p917N3920j9445m2103
10811A92460K8323K2985j40448J3243l8062N4534j15551M3160Q6837Q6645L0121
10800B64247j58342L023J86M0745M4215J28535J09669r2751o1632L3503n3996
10789B57402j29179J75803Q7948j25556j360Q3194m491l5689M9684P5783J8224
10778D51763n4090J56317J41569l8556l9014Q7928O5436J5878m7350j34272J01951
10767G07560J53589k1553j7764j18204o7045q2145j48220R5811J34256P0023l7592
10756F68716j70481M429L7524Q6172o9464n9300N1836M221K270Q2632L5746r3299
$$ y = [398917, 319063, 298694, 316458, 286236, 343186, 358323, 269999, 202863, 187914, 158663, 54241, 61259, 261811, 263013, 75833, 135575, 250186, 303201, 208005, 200088, 254008, 234563, 192460, 220783, 243768, 103320, 116563, 78501, 133035, 17484, 60644, 147481, 234126, 264247, 105905, 108928, 109114, 149859, 194074, 322609, 432278, 339527, 277895, 311398, 257402, 128223, 304026, 391974, 266418, 265058, 348252, 343761, 308072, 357756, 433539, 451763, 397673, 553990, 695559, 657003, 617989, 705917, 771353, 787231, 739881, 605609, 707560, 861149, 839596, 821832, 703628, 636583, 554438, 406218, 502029, 636285, 706308, 668716, 498235, 502664, 540188, 626360, 556896, 497596, 549432, 553653, 555923, 638555, 674301, 581002]
10744E81002n5259m9303p4031j21194Q8075K34144J41325O13L9126j23637r1171
10733E69690R7266K33359J15011M7701N6845M4148p853K8761R1306J35881N4970
10722A467085J35559L5933l5287J03868k083r2193l9884n1519m2246J45592J96297
10711A821122K54974J30959J04207k2338j95167q5942q0766j86024k00577k5484
10701A514964K7917l502J05492K4759o6131P3862k3063j78879j30956L6379K5334
10690A406176L0708j15405m5437O7643L4265O460j71276M7376p3204j12160j41369
10679I33777p7870O927P7142j4491o2834N498p5240k5311Q5649J7955p5953M7354
10667H42603N2121p841m6971j1374J1849R8383J438k0269k843L6267J07887K1652
$$ y = [581002, 525743, 476440, 402409, 281215, 369290, 603434, 744759, 745372, 784498, 660861, 569690, 666956, 900315, 1015326, 1063027, 1119872, 1164020, 1156167, 1184928, 1276234, 1412115, 1467085, 1602644, 1638577, 1603290, 1707158, 1705075, 1612882, 1572998, 1521479, 1479233, 1624825, 1821122, 2076096, 2207055, 2311262, 2288924, 2093757, 2007815, 1927049, 1741025, 1540448, 1514964, 1542881, 1539379, 1644871, 1669630, 1603499, 1677361, 1654298, 1475419, 1344463, 1380842, 1406176, 1436884, 1321479, 1276042, 1343685, 1377950, 1384410, 1213134, 1260510, 1187306, 1075146, 933777, 855907, 862834, 939976, 925485, 862651, 868149, 792909, 767598, 853247, 871202, 795249, 842603, 894724, 886883, 839912, 828538, 840387, 938770, 940208, 919939, 917096, 953363, 1061250, 1082902]
10655A082902J39759J11094n283k4869L2195O5964N2021J33553K43647J06976
10645A937959M8880J45310Q5811m5272n6379P4374J20800n2567r9569L0023Q6995
10634B276365P3689k3275N1007K62465L33273M83130O23252O01394N00631N55370
10624E737301N41993N30363O25640L72273L61654N67221R06300J135049J691711
10615A2469505K631303L548498M435416N798422P360450Q224465P811906O850666
10607E9130631N963029M730552K798507O14939m11429Q16271L960362Q161777
10599H5764639J2543417J4864532J3994358J1364221R109408O347373R63531n465237
10591A49486242q152067n406270J061511Q590348J4943628J7827730J5887869
$$ y = [1082902, 1222661, 1333755, 1328472, 1303603, 1335798, 1401762, 1453783, 1587336, 1830983, 1937959, 1986839, 2132149, 2217960, 2172688, 2116309, 2190683, 2311483, 2258916, 2159347, 2189370, 2276365, 2350054, 2326779, 2377786, 2640251, 2973524, 3456654, 4079906, 4681300, 5181931, 5737301, 6279294, 6809657, 7435297, 7807570, 8169224, 8736445, 9642745, 10777794, 12469505, 15100808, 18649306, 23084722, 28883144, 36243594, 44468059, 52279965, 59130631, 65093660, 69824212, 72622719, 73237658, 72826229, 73642500, 77602862, 85764639, 98308056, 113172588, 127166946, 138531167, 147640575, 153987948, 154951479, 149486242, 141334175, 135927905, 136989416, 145579764, 160523392, 178351122, 194238991]
10584A94238991J1836686P890237K918931n870715j5649839j9753816j6215674
10577A59394801q905115j517633M293972O938854N903762L296338P42747k873489
10569A67274237q781891j4824574j6613571j3805640q921842m519663j531662
10562I8275394n2571k43617j249129k537587m290181o542688q778626r397251
10554F5183744q252887o536157n046741l961165l132925k424512k050022j742236
10546C2037099j617202j331028j173022r81729r46776j105749r82769q10227p35584
10537B2353013o10169p45445o83240n66684o05992o20196n68934o04806m97551
10528A6849996l92276m78746m24453l21463l84694l44596l39917l49910l90001
$$ y = [194238991, 206075677, 213965914, 216884845, 211014130, 195364291, 175610475, 159394801, 150489686, 148972053, 153266025, 160204879, 166108641, 169404979, 170147726, 167274237, 158492346, 143667772, 127054201, 113248561, 104326719, 99807056, 98275394, 98222823, 97979206, 96730077, 94192490, 89902309, 83359621, 74580995, 65183744, 56930857, 50394700, 45347959, 41386794, 38253869, 35829357, 33779335, 32037099, 30419897, 29088869, 27915847, 26934118, 25987342, 24881593, 23898824, 23088597, 22353013, 21742844, 20997399, 20314159, 19747475, 19141483, 18521287, 17952353, 17347547, 16849996, 16457720, 15978974, 15554521, 15233058, 14848364, 14503768, 14163851, 13813941, 13423940]
10519A3423940k75079j62316l69427m01571k59740l95863l43990k67830k47414
10510A0700710k42613k10736k28070j80100l17455k20702j46532j68330k41891
10501H744281j58371j58558j37818j78050o9884j61024j92630k21827j66958o3061
10491G236100n4837j69014j24414k26831j45927j44971n8208l4447L4243Q6864
10481F398558p7180m1183K6594n073j60562j62427q9169K983r5338j23990p2438
10470E600775Q930J67756L6482m48l3186l1659j71106j47032k2320J5301N5352
10459E478845J326J80612R7446O6714M067j09722o9689o0350k72546k31603q6362
10448D998738j65556j15820R615J23455R362j65644j52504j44762k15097j87900
$$ y = [13423940, 13148861, 12986545, 12617118, 12215547, 11955807, 11559944, 11215954, 10948124, 10700710, 10458097, 10247361, 10019291, 9839191, 9521736, 9301034, 9154502, 8986172, 8744281, 8585910, 8427352, 8289534, 8111484, 8041600, 7880576, 7687946, 7466119, 7299161, 7236100, 7181263, 7012249, 6887835, 6661004, 6515077, 6370106, 6311898, 6277451, 6311694, 6398558, 6321378, 6280195, 6306789, 6301716, 6141154, 5978727, 5889558, 5892541, 5797203, 5673213, 5600775, 5609705, 5777461, 5813943, 5813495, 5780309, 5748650, 5577544, 5430512, 5408192, 5423493, 5478845, 5480171, 5660783, 5758229, 5824943, 5829010, 5719288, 5649599, 5589249, 5316703, 5085100, 4998738, 4833182, 4717362, 4726977, 4850432, 4859794, 4694150, 4541646, 4396884, 4181787, 3993887]
10438C993887o8035j74350j06821n6875M7030r6787j58230k02142j48535q5900
10428B943242j4876r597o0793j90457j98312P350o3989j68616j35939q0477m7756
10417A979780l1304n6048o1862r6790Q3580R0432K9209k31105j41780j30196r9017
10406A334899j10843n2073n8777j5493R8660R4846l9878q8010p0424k9871j69907
10395H93129j09738J8566J57703K33123M6819n9678L978q2023j28912L1267Q2883
10384A087117o0633r0016p8805p8527L2082Q8316J52649R1501j37940j55954j12774
10373G37016l4055p4013j05694J43236K346q73r38O9322N5102N0237k7369o8892
10361G45425l3748j0485j06995N04P704Q0080P0585O0340J19540K349j37866L3383
$$ y = [3993887, 3925852, 3751502, 3644681, 3587806, 3634836, 3538049, 3379819, 3177677, 3029142, 2943242, 2928366, 2918769, 2857976, 2667519, 2469207, 2476557, 2412568, 2243952, 2108013, 2027536, 1979780, 1948476, 1892428, 1830566, 1733776, 1817356, 1907788, 1936997, 1705892, 1564112, 1433916, 1334899, 1224056, 1171983, 1113206, 1097713, 1196373, 1291219, 1251341, 1163331, 1092907, 1063036, 893129, 783391, 801957, 959660, 1192783, 1239602, 1179924, 1183902, 1101879, 972967, 1004234, 1087117, 1026484, 936468, 857663, 779136, 811218, 899534, 1052183, 1143684, 1005744, 849790, 737016, 702961, 628948, 523254, 666490, 668836, 667963, 667025, 736347, 791449, 841686, 814317, 745425, 711677, 701192, 594197, 594701, 602405, 682485, 753070, 813410, 932950, 935299, 797433, 830816]
10349H30816P3166k8093j41068o4705k810K2100N190O0036m1508l0768n7465Q9791
10337G14682P1555N3435j37629j61567J04442J23366J34070P8579n3880j51089
10327G75964j1288k3351m1989l3149K3485K4990L171j25453Q752j0463l9964J04991
10315F55696J717n9332J5234N5675P775j0670j29293r0973L5458M364K1047n7251
10303D49447j17091J43560J46584q0798k7429L724O0423j5214j26537K924J18405
10292E57998j22991k15845j49952P0772O8152L1487P6816p077n6374j17962L3600
10281A68624J57914J83957j8142l0818p8036p4142p8931K399J13010k9025K7983
10270C44793q0715M7552q3228q8835K03P4207o7928k7526N2777K4606P5526Q5321
$$ y = [830816, 903982, 875889, 734821, 670116, 667306, 689406, 694596, 754632, 713124, 682356, 624891, 714682, 786237, 839672, 702043, 540476, 644918, 768284, 902354, 980933, 927053, 775964, 764676, 741325, 699336, 666187, 689672, 714662, 717833, 592380, 601132, 590669, 550705, 655696, 657413, 598081, 613315, 668990, 676765, 666095, 536802, 445829, 481287, 485651, 506698, 449447, 332356, 475916, 622500, 541702, 514273, 517997, 578420, 563206, 436669, 439593, 557998, 435007, 219162, 69210, 139982, 208134, 239621, 316437, 309360, 252986, 135024, 168624, 326538, 510495, 492353, 461535, 383499, 309357, 230426, 232825, 345835, 316810, 344793, 264078, 311630, 228402, 139567, 139770, 213977, 146049, 118523, 171300, 195906, 271432, 356753]
10258C56753j1061j09327q5140k4826J04421k9991j16603K3559J16928P3372j2015
10247B86070J07348k4333j5772Q3955r1579n4681k9480m590K8262q7434m9224
10236A48542N1285J39807k6472j14913j3192P9594m5481j47582n2406j5034O0415
10225F4563n9901J1659J05821L1099M2139n5425j07022P0893J07785J02794k4074
10214B90331j48671r8738J2349j2700o3291Q3578k7252q8014j19149P9751O5308
10203b6498O9153o7838k7609K10662J3475q3279J3997l1484R2035L8749j153L0097
10191B30307q7560r5664o939k8504J00669m13N4236j4423m8854O6525O0955M0148
10179B70483j28164j01425k80M4184J35503R5242j7585o2656O7132P9783J64107
$$ y = [356753, 345692, 236365, 151225, 126399, 230820, 200829, 84226, 107785, 224713, 298085, 286070, 393418, 369085, 353313, 437268, 345689, 291008, 261528, 256938, 285200, 197766, 148542, 199827, 339634, 313162, 198249, 185057, 264651, 219170, 71588, 19182, 4148, 64563, 4662, 16321, 122142, 153241, 195380, 139955, 32933, 103826, 211611, 314405, 290331, 141660, 42922, 55271, 42571, -20720, 62858, 35606, -52408, -171557, -91806, -26498, 42655, -25183, -52792, 157870, 171345, 88066, 102063, 70579, 162614, 201363, 200210, 230307, 142747, 47083, 40144, 11640, 112309, 111896, 166132, 151709, 102855, 169380, 230335, 270483, 142319, 40894, 40614, 84798, 220301, 315543, 297958, 235302, 302434, 382217, 546324]
10168E46324P9707P2160J8328M1737l3358Q6083M7821N7823k749L6103j1125M2053
10156I80907o7064m8252J1716o1460J13037P7891k6418J16127J74721R6671j24200
10145A243676n621j94q5413k0041j36205r5048O6321r1521j15064J48902J67820
10134A077612J676k4613o9556r9472n6257r2055n2969p8619m4509J5486j2131
10123E64593j3356r7853q544J15048l4409M1077O7900r1224j26664j40943n1536
10112B24089K3828j16760m4414J7465O782L8996M846K5002o8713j71296j08331
10101a68506J49823R9813o0706L6684K1338k5278l4559Q4629L5409J4186K0482
10090A73315j13918r5337l212m6303l2606j06792o8219K0779O4271J13936N5592
$$ y = [546324, 626031, 698191, 716519, 758256, 724898, 810981, 858802, 916625, 913876, 949979, 938854, 980907, 913843, 865591, 877307, 815847, 928884, 1006775, 980357, 1096484, 1271205, 1367876, 1243676, 1238055, 1237861, 1152448, 1132407, 996202, 901154, 967475, 875954, 760890, 909792, 1077612, 1079288, 1054675, 985119, 885647, 829390, 737335, 684366, 605747, 561238, 576724, 564593, 551237, 453384, 444840, 559888, 525479, 566556, 634456, 543232, 416568, 275625, 224089, 247917, 131157, 86743, 104208, 110990, 149986, 154832, 179834, 111121, -60175, -168506, -18683, 81130, 20424, 57108, 78446, 53168, 18609, 103238, 138647, 152833, 173315, 59397, -35940, -39152, -85455, -118061, -224853, -293072, -272293, -208022, -94086, -38494]
10079c8494L2353j9124J08620O0499N0677r7317r0031N6021N2027J00963L4037
10068B50231l9475j37504j46826k0262R1844K6761j8118p5374P2184j2075r8388
10057a07002R72J16341O613n22l220l653n5233n5146q0999k5228J12102k218k4117
10044a21310J15958Q1996p7693m333o6323p5042J17249J13036J9730o9402K6466
10033F0332L9293Q515L4149k6827l8047j46888j5715L1442M3087j42249j567J012
10021a53463R6172K19622J24398k2863J6652m9673o6937k34005j03408L8928J62583
10010B8006J20502P0623K9092L9823l1850J8212l9873n246J83190J7817j37677
9999B92619m8506j2072O5950j91647j89428Q8815J17428n1811j72922n7006K7101
$$ y = [-38494, -6141, -25265, 83355, 143854, 194531, 97214, 7183, 63204, 115231, 216194, 250231, 210756, 73252, -73574, -93836, -1992, 24769, 6651, -68723, 3461, -8614, -107002, -106030, 10311, 16924, 16402, 13182, 9529, -45704, -100850, -181849, -207077, -94975, -97193, -121310, -5352, 76644, -1049, -5382, -71705, -146747, -29498, 83538, 103268, 33866, 60332, 99625, 108140, 142289, 115462, 77415, -69473, -85188, -53746, -10659, -152908, -154475, -153463, -57291, 162331, 286729, 263866, 280518, 230845, 163908, -70097, -173505, -134577, 28006, 148508, 219131, 248223, 288046, 256196, 274408, 234535, 229289, 412479, 430296, 292619, 244113, 232041, 297991, 106344, -83084, 5731, 123159, 71348, -101574, -158580, -131479]
9988a31479R4314J19129m553j34277k9226J10344J03326k5448n826m4064J8678
9977G0918n0999n0698m8267j48189o7082L5777Q8243L3415j20931M2424O1042
9966a54347Q5836J272N0194K005m0485L3774k7507k4711k966Q447Q5405O0981
9954G7898J08835L553m6016j3529l685k9146r4665j02004j097J52111L3099n9327
9942B6027J10368Q3562j19427j16393J2113r3640p0918l6124n8439O5604l3305
9931b30572J6851N6873K6743L0425J615R573Q7216J29238p8168k1247r6892j39689
9919b08034R547J51527J58558m5005r7334n9967K3655J5034o683R6021J38251
9908A75570j11704p061J5968r2716l4632j2617L0342l0170P7966J88269L4565
$$ y = [-131479, -37165, 81964, 77411, -56866, -86092, 24252, 127578, 102130, 96304, 52240, 70918, 19919, -30779, -79046, -227235, -294317, -258540, -170297, -136882, -257813, -215389, -154347, -68511, -67239, -17045, -15040, -55525, -21751, -49258, -73969, -76935, -68488, 16917, 77898, 186733, 190286, 144270, 130741, 127056, 97910, 3245, -98759, -99856, 52255, 85354, 26027, 136395, 219957, 100530, -15863, -3750, -97390, -168308, -204432, -262871, -197267, -230572, -213721, -156848, -130105, -99680, -98065, -88492, -1276, 127962, 49794, 28547, -68345, -208034, -198487, -46960, 111598, 66593, -30741, -90708, -67053, -52019, -58702, 37319, 175570, 63866, 56805, 72773, -19943, -54575, -67192, -36850, -67020, 10946, 199215, 233780]
9897B33780J6429J7588o5129j30201j4942l2379j81190L2172J7202Q0128O0761
9886C4219P8459m0683j56663l0194P7891J22425R5260m8916n3025r5656j44314
9875a61197k586P8161J60792M4342J0240l8629J6240O6302n4693j41167L5583
9864A3388J35719q9795j02396m3433J14448J7303J2612R469q483j04753l805l542
9852e3268n3532N7772Q7940J09784k6327l3319l0968Q4573J0698p3923K1272m020
9840I6682j41534q1540m2711L8047j6949P5435J24817M3092j06006k8690J9786
9829a9571O9042R319J01825m6827m9597k6063l8160r428k9490l7951R204j4127
9817h1824O6399K2522K565n1584N4553m6759j05756O2256O1154m0805l5497m5986
$$ y = [233780, 250209, 267797, 202668, 72467, 57525, 25146, -156044, -123872, -106670, -26542, 34219, 112678, 71995, -84668, -114862, -36971, 85454, 180714, 131798, 78773, -16883, -161197, -163783, -85622, 75170, 119512, 129752, 91123, 107363, 173665, 118972, -22195, 13388, 149107, 59312, -43084, -86517, 27931, 45234, 57846, 67315, 58832, -45921, -49726, -53268, -106800, -49028, 38912, 148696, 122369, 89050, 58082, 142655, 153353, 79430, 100702, 96682, -44852, -126392, -169103, -131056, -148005, -72570, 52247, 95339, -10667, -39357, -19571, 49471, 58790, 160615, 113788, 64191, 38128, -32, -9460, -38950, -76901, -67697, -81824, -15425, 7097, 9662, -41922, 12631, -34128, -139884, -77628, -16474, -57279, -92776, -138762]
9805a38762m3958m598R5334P5270m072r3630o9039J15539R9150k9642P211L6942
9793D5745r5265n3768J29826J05581P4048j42695o9971J30252n690p1340L0480
9782G7203l2003P01n6608n6856j2768R5182N2934N6352n779n9528j24699q1287
9770a47156M7252J45311N6325R732J8345j7712n3273K6653K8762p6379J0667J347
9758D9874q8320J1670M4788r3583M9166M673N9742n2840n6169K3892J3907L0899
9746b301j06420l6122N2512L7078P5988q7211r6096k2501J921K5332J7296O8572
9734g1952l6060L5142K5585L7871J16781m0180p219J5017l7868J906O734o1253
9722a5496m5295O4386J01688P5895p6498N1409n7406j25673J02254L6660r7801
$$ y = [-138762, -182720, -187318, -91984, -16714, -20786, -114416, -183455, -67916, 31234, 1592, 8803, 45745, -49520, -103288, 26538, 132119, 206167, 63472, -6499, 123753, 118063, 46723, 77203, 45200, 45901, -10707, -67563, -80331, 14851, 67785, 124137, 118358, 58830, -65869, -147156, -99904, 45407, 101732, 111464, 129809, 112097, 58824, 85477, 114239, 37860, 48527, 49874, -38446, -26776, 18012, -75571, -26405, -21732, 38010, -14830, -70999, -47107, -33200, -2301, -108721, -144843, -92331, -55253, 20735, -66476, -162572, -185073, -183152, -157820, -140524, -71952, -108012, -72870, -47285, -9414, 107367, 67187, 59968, 74985, 37117, 39023, 45757, -15496, -60791, 3595, 105283, 181178, 104680, 156089, 98683, -26990, 75264, 111924, 14123]
9711A4123p8760K302J20621R3245p3311o519K1014j01041n21n2602J4810Q428
9699c8211M7124m6170r8063J3709n1602m5632J16456J21028J2556N2796q1760
9688B231J5191k970N5694q160R228M058j07727p0597j4561J9069p1720J9008R1613
9675e9643L6122l936K6333K17908N1600j19668k17838j06390l457L0678N8280
9664i0011K14889j9749p0450r2875r4517k9583q676L6240J32435j10265j39796
9653b72358J58038M4345n4005J672K01279J53442J08936k1839Q1323J96732L5650
9642F33215j40162j90713j79499p1432M1400J5658l4742n990N7846p9172o8140
9631b1731k0368o050j08762J02747K5450N164J21688Q071j05324j09347L7404
$$ y = [14123, -64637, -62335, 58286, 151531, 78220, 71701, 92715, -8326, -8847, -61449, -46639, -38211, 8913, -37257, -135320, -121611, -173213, -218845, -102389, 18639, 31195, 83991, 2231, 17422, 14452, 70146, 61986, 71214, 75272, -32455, -103052, -117613, -98544, -170264, -151256, -59643, -23521, -27457, -1124, 216784, 268384, 148716, -69122, -175512, -178969, -148291, -90011, 124878, 105129, 34679, -58196, -152713, -182296, -190972, -154732, -22297, -132562, -272358, -114320, -69975, -123980, -122308, 78971, 232413, 341349, 319510, 400833, 597565, 633215, 493053, 302340, 122841, 51409, 92809, 108467, 73725, 67735, 125581, 46409, -21731, -42099, -48149, -156911, -54164, -28714, -23550, 98138, 106209, 885, -108462, -71058]
9620g1058P4435J3696k7237l549J02838k4089k5989m1520K7313J05640L3623K4009
9608A88112o3592j28169l6911k9924M0964K8207N4221p5919j02950O9709J10830
9597E4578M9005P92r6001k843P7827P43P5336k2440j11459o9505R0301n3177p6251
9584h3094O0801N2312N3144j9146O3586q8848L254N1926n8413k0258n2758L9347
9572A853k896Q840o5446j4172k694M3782L3390M6244J9421p6870L0824M1954J9733
9559H3963M5409J02749l7693j39032o0005n3583o7150Q3509K2370R0988R8192
9548A69717j99096j57310L549L0557q023M0956J28048l0509n8824l0578o2638
9537a74151O4874L5747J8586M9801q3920m3977n6320j8177J6884M435Q639M5245
$$ y = [-71058, 3377, 17073, -10164, -13713, 89125, 65036, 39047, -2473, 24840, 130480, 164103, 188112, 124520, -3649, -40560, -70484, -29520, -1313, 52908, -23011, -125961, -56252, 54578, 103583, 104375, 8374, 5531, 83358, 84101, 159437, 136997, 25538, -43967, 46334, -6843, -83094, -22293, 30019, 83163, 64017, 127603, 38755, 42009, 93935, 35522, 15264, -37494, 1853, -1043, 7797, -57649, -71821, -74515, -30733, 2657, 48901, 68322, -8548, 22276, 64230, 83963, 129372, 232121, 194428, 55396, -4609, -58192, -125342, -41833, -19463, 71525, 169717, -29379, -186689, -183140, -152583, -160606, -119650, 8398, -22111, -80935, -111513, -174151, -109277, -73530, -54944, -5143, -89063, -133040, -189360, -207537, -190653, -186218, -177579, -132334]
9525a32334K7864j48410L3422J15402k282n3983m8445L6457J29491N1039r802
9514a581o4922j2887L8898p586q8699o7552p4252j40K9018J24831N4697O184k2159
9501h6150m932n3894L686R3658P1507p6216m040J22175k6980j49519K3663P4388
9489a2654R16r7538q7292N8212Q5428q188J5591n6289j5253l8856m7980R1996
9477a11907N2326O3692Q4763P954p2290l0446J4099j0215P687j3887K0218K2723
9465C4717r9998m5872m2198O9051J18051m8278j01334p907L747p5476M3746L6625
9453a15126J47593Q1752K6063r8873M312Q3223l8350l1091k6535n735J12241K9346
9441A68820l4043l0208m8870j7611r2936K8249n324n5922m633P7669L0726O3251
$$ y = [-132334, -104470, -252880, -219458, -104056, -106338, -160321, -208766, -172309, -42818, 8221, -1581, -66503, -79390, -40492, -48078, -136777, -204329, -278581, -278721, -249703, -124872, -70175, -63991, -86150, -91082, -144976, -141290, -47632, 23875, -52341, -56381, 65794, 38814, -110705, -87042, -12654, -11738, -109276, -196568, -138356, -52928, -61116, -45525, -101814, -117067, -155923, -203903, -111907, -59581, 4111, 88874, 96828, 24538, -5908, 8191, -2024, 5663, -8224, 11994, 34717, -65281, -111153, -153351, -84300, 33751, -14527, -115861, -123768, -120021, -195497, -151751, -115126, 32467, 114219, 140282, 41409, 45721, 128944, 90594, 59503, 32968, 27233, 139474, 168820, 134777, 104569, 55699, 38088, -54848, -26599, -31923, -87845, -92478, -14809, 15917, 79168]
9429G9168k2870m5055L455J07175M4396k9025o1878j02144n8790M9418k739j03256
9417a42145L6276J39529l2255M9346r131p59n8135k9029m2439k1173q658L3941
9405h4632J47670M4568q6829J6678j9290k3914O586L487R3898M2264p6762J5566
9393G9290Q5522j5930n9415j32439j3858O3529P1087o914r9562q5166R6697O9279
9381E2120P4802J4111j16643o8611Q1515P4158l7324k0282l1965j1420N2028j8781
9369D3708m993P1615K2243o7999L0454R5763J03825M8909q011o1454o9498j29299
9357G5263m1567l7262P8825L9881l4537k0541l742j0195J56849k0886j95681O9784
9345E6191N0905k11281l0811P5775J8446J20938R3103j2725L5439M8509q6776
$$ y = [79168, 56298, 11243, 14698, 121873, 166269, 137244, 75366, -26778, -85568, -36150, -38889, -142145, -105869, 33660, 1405, 50751, 41620, 40861, -17274, -46303, -88742, -109915, -118573, -84632, 63038, 107606, 20777, 37455, 18165, -5749, 837, 4324, 98222, 140486, 63724, 79290, 164812, 148882, 89467, -42972, -56830, 6699, 77786, 70872, -28690, -113856, -17159, 52120, 126922, 141033, 24390, -44221, 37294, 111452, 74128, 53846, 21881, 10461, 62489, 43708, 38715, 110330, 132573, 64574, 95028, 190791, 294616, 343525, 335514, 274060, 204562, 75263, 33696, -3566, 75259, 115140, 80603, 60062, 56320, 46125, 202974, 182088, -13593, 56191, 107096, -104185, -134996, -59221, -40775, 80163, 173266, 160541, 195980, 244489, 157713]
9334A57713L1597j23560p2600O2493L5786j17953n2270r239K8007p335j7045r796
9322i4202K4085J14464J9834k3971N0218l0991J791q6303j858L0416p1808L6604
9310c1721j5843j03857P6541J26957k893M7560J9397o9446q9096J5489J22312
9299I5400j6026j59309q1631P3098J58613M5991o0005j35300n5840j1966Q7462
9288e9513J39011J8284p7646j00456O0783J6425j2758p3962k7729n8043J72713
9277b891N2097o0815j34114K4472p134J04432l193o1123J8292L5464J7145j427
9265a8795p645m0235L0373K827o9047Q9078J429L6237J49335j09131k43420l2384
9253b11378N3925O7869l184Q792m0407k7403l6232J980J39377k3955J04727R154
$$ y = [157713, 189310, 65750, -6850, 55643, 91429, -26524, -78794, -88033, -60026, -67361, -84406, -94202, -70117, 44347, 64181, 40210, 90428, 59437, 61228, -25075, -26933, 3483, -68325, -31721, -47564, -151421, -74880, 52077, 49184, 96744, 116141, 46695, -42401, -26912, 95400, 79374, -79935, -161566, -88468, 70145, 116136, 56131, -79169, -135009, -146975, -59513, 79498, 97782, 20136, -80320, -19537, -3112, -15870, -89832, -117561, -175604, -2891, 49206, -11609, -145723, -121251, -128385, -23953, -27146, -88269, -69977, -34513, -17368, -18795, -26440, -66675, -36302, -33475, -102522, -13444, -12015, 24222, 173557, 64426, -178994, -211378, -157453, -89584, -92768, -83976, -124383, -151786, -188018, -186038, -46661, -70616, 34111, 43265]
9241D3265O93Q0982p7856l0118l781J891m7979O9797K788L2083l2525O0616q4475
9228A5381k7845J03534J9700n4531k4929p5013k2584J34467m9k2535J5223q1225
9216b0406p4039P160n497K4668l1909m1913J12127J06979j7386n1799q456L1290
9204C0819K6649m5128o1888j48950m3883N7015K24462J15709q0660q7504j3511
9193b6870R7789l1526j25293P0163K00339l761q4539j2011q0649L803O4499R43
9181G2887j00161r262p118q8572N7563P5572N0242n3197m7636L9973l1561r9907
9169a41177n512o3362K0130N3709J13893K1822q917j23631j08090j16209J72487
9158a84857J28409K2455k0699m4972J30293J46715n8110n9009K2001L1056L9372
$$ y = [43265, 43958, 124940, 47084, 16966, 13185, 15076, -32903, 36894, 39682, 71765, 39240, 99856, 15381, -12464, 91070, 110770, 56239, 31310, -43703, -66287, 68180, 68131, 45596, 60819, -20406, -94445, -87285, -92782, -68114, -100023, -141936, -29809, 77170, 59784, 7985, -471, 30819, 57468, 12340, -49548, -198498, -242381, -185366, 39096, 154805, 74145, -13359, -26870, 70919, 39393, -85900, -15737, 184602, 180841, 96302, 84291, 3642, 7445, 71944, 72887, -27274, -36536, -43654, -132226, -74663, 909, 51151, -2046, -49682, -9709, -41270, -141177, -146689, -210051, -189921, -136212, -22319, -497, -9414, -133045, -241135, -357344, -184857, -56448, -33993, -54692, -99664, 30629, 177344, 119234, 60225, 82226, 113282, 152654]
9147A52654k4974n522N5097R641p7663j10628l759m5404o4954R554M6171Q6118
9135B6331j3264q0865M8018L2705N8523J08177l475m9027j7219j06801M6708L4521
9123H4332O330m367o9613p7124l6712k4317j0213l715K177P9116l3573O9575J32022
9110A13918m0724j05039l1840J08060P9853n9500q5621j1747q7145K4040J68724
9099G2979R5632O1437m5160p4400k4414j22727l396M3811o718n2694q1598O2618
9087g4630R9424p2m2737p5600p5776O5550L4915p6036N975p4862q7712p8037N203
9074c74395J68650j1012M4888P0109m5263r9325j02223Q3309M1054L2926O3221
9063a28061J38221P897J3744n7898j60064r7600J15237J26041J32648J14234l7194
$$ y = [152654, 127680, 122158, 177255, 186896, 109233, -1395, -5154, -50558, -115512, -105958, -59787, 26331, 13067, -67798, -19780, 12925, 71448, 179625, 176150, 127123, 109904, 3103, 49811, 84332, 90662, 86295, 16682, -60442, -97154, -121471, -131684, -135399, -133222, -54106, -87679, -18104, 113918, 73194, -31845, -63685, 44375, 124228, 64728, -20893, -32640, -119785, -95745, 72979, 168611, 230048, 184888, 110488, 86074, -36653, -40049, 3762, -2956, -55650, -137248, -74630, 24794, 24722, -18015, -93615, -169391, -103841, -68926, -144962, -138987, -213849, -301561, -379598, -374395, -205745, -216757, -171869, -101760, -147023, -246348, -348571, -265262, -224208, -191282, -128061, 10160, 18057, 31801, -26097, -186161, -283761, -168524, -42483, 90165, 204399, 167205]
9052A67205l3374n6093L9464L4635r135j6831k01395p8543j0964K3808K13170
9041G1947m4457j26240l9699O4018k3815R6354m9200j24691L8832K3957j8218
9030a31212J17113k8132K2068j3753m0966K4795j02374j83304O1209J69775P3688
9019c1093o1721P5633m5039M3125P3235n9963k4226l802P2055J28957r0950r8830
9007b2619J0351M679j4373J29583k0449j02257l240m4870m5950M4192m0254j29624
8995b34831J2642K4563j2828L2986L7278N7211j7145M7120J6999l9570n9913n1494
8983a86982L0502L7660N2798k5264O4303J6108J5734K8194l3714q2703l323P1045
8971a5642J42774r9525p731L7280r1915p2399l1415o353J25692Q1232j90861o9120
$$ y = [167205, 133831, 77738, 117202, 151837, 142702, 125871, -75524, -154067, -165031, -141223, 71947, 27490, -98750, -138449, -74431, -98246, -1892, -51092, -175783, -136951, -112994, -131212, -14099, -42231, -20163, -33916, -74882, -50087, -152461, -335765, -274556, -104781, -31093, -92814, -17181, -62220, -19095, 54140, -5823, -30049, -33851, 38204, 167161, 76211, -22619, -12268, -7589, -21962, 107621, 87172, -15085, -18325, -63195, -109145, -64953, -105207, -234831, -222189, -197626, -210454, -177468, -140190, -82979, -100124, -53004, -36005, -75575, -135488, -186982, -156480, -118820, -66022, -91286, -26983, -10875, 4859, 33053, -661, -83364, -86687, -15642, 127132, 27607, 19876, 57156, -34759, -107158, -138573, -144926, -19234, 61998, -128863, -197983]
8959a97983K9944J2565O6727J6510M742j62028m8015J6512l263R207J24813R468
8947a20801N0054P0067O0904L0940n3843J04605j5165Q7132n7284j47770R6081
8936A04920J11999p7125m4712p1828q8321J45912J5187n4007j3152n0168P191
8925a4104L7745l1042m450J84300l123p5181Q2565L2748j18821m7145J77R713
8913E3382k005k5734J02824O2288j69722p1647K6546r697o2834J3467l6750L3353
8901h6529R1271M1492P5371k7400p2127k592o5520J7900N6234J55745K9313n5736
8889A57422j15115j05404k9843O8859n9004J3061Q4723J14365n6418R6093R8440
8878B67179r2663n0633n5817l4349M7835o8934L545m8294N1309J78138j1782j34654
$$ y = [-197983, -168039, -155474, -88747, -72237, -67495, -229523, -277538, -261026, -264289, -255082, -130269, -120801, -70747, -680, 60224, 91164, 37321, 141926, 126761, 213893, 156609, 8839, 104920, 216919, 139794, 95082, 23254, -65067, 80845, 96032, 42025, 28873, -21295, -14104, 23641, -7401, -11851, 172449, 169326, 94145, 176710, 209458, 90637, 43492, 43669, 53382, 51377, 25643, 128467, 190755, 21033, -50614, -24068, -33765, -96599, -83132, -119882, -86529, 4742, 46234, 121605, 94205, 22078, 19486, -46034, -28134, 28100, 183845, 213158, 157422, 42307, -63097, -92940, -24081, -83085, -70024, 14699, 129064, 72646, 168739, 267179, 174516, 123883, 68066, 33717, 81552, 12618, 16163, -32131, 19178, 197316, 185534, 50880]
8866E0880j13719j0309j397J53937K5011l4210m0034N7216j498m9666j08965l2452
8854a05206K8989m2379O27L7491M5168n76L2139j2880j06957J30070Q9988n7462
8842C9012q948R058n868M124J69K9581N707n1291o5513k1958P2985J18990J28863
8829B54911m6093n631j33110k6645J48358K7303j32888r6337L0253O3296m3021
8818D0396p0102J1228L6454K9016M4157J93027L6834j40349r9920j15370k10657
8807b45286j08606M4891J29457K9188K3207M1178j7511M1448l6583R2017L8983
8796C2383M0221q7579l9545L7760N9781R9260j33278n0615P458j04697l3039L3608
8784a38282J12671K35209j3744j68980o6150L9784J4931o3641k6174P149N2014
$$ y = [50880, -62839, -73148, -74545, 79392, 104403, 70193, 30159, 87375, 85877, 36211, -72754, -105206, -76217, -118596, -117969, -80478, -35310, -35886, -3747, -16627, -123584, 6486, 96474, 39012, 30064, 39122, 33254, 37378, 37547, 67128, 72835, 21544, -43969, -65927, 7058, 126048, 254911, 208818, 203187, 70077, 43432, 191790, 219093, 86205, -10132, 20121, 83417, 40396, -29706, -18478, 17976, 46992, 91149, 284176, 321010, 180661, 80741, -34629, -245286, -353892, -309001, -179544, -150356, -127149, -85971, -103482, -62034, -98617, -6600, 32383, 72604, -14975, -54520, -16760, 43021, 142281, 9003, -41612, -34154, -138851, -171890, -138282, -25611, 209598, 195854, 26874, -39276, 508, 15439, -48202, -74376, -67227, -15213]
8773a5213R7745l6532j53009j8350O0126j02828k442J36780M3427m7382N4838
8762A7160R841L9349O862N544J8598k7702j6929j19071j17777O6073L6333M6790
8750c4929R7948M5226p3826r6068j1811j3759O6513l0176M3500K5861J5989q396
8738B6072M4690m0433j10880q9453L9344O800K8082P5995r132k0192n791j75154
8726b30052q2059J15034R1087K3829Q6074m4156r6665k7033O8929R0173J29702
8715A24863K8050l4794n2079j11811k21981p0872N2714k5602J4674J14090O3223
8704a19525N6508J7842m3804j7033k1113j7198L8431l8890m644L4817J2221q667
8692a11055P5864l6823j05396M3338j425L9308P7391N3829P8611J6043j01392
$$ y = [-15213, 82532, 46000, -107009, -125359, -65233, -168061, -170503, -33723, 9704, -37678, 17160, 27001, 66350, 73212, 78756, 97354, 69652, 52723, -66348, -184125, -118052, -81719, -34929, 63019, 108245, 34419, -61649, -73460, -87219, -20706, -50882, -7382, 18479, 34468, 26072, 70762, 30329, -80551, -170004, -130660, -123860, -95778, -19783, -28915, -49107, -54898, -230052, -312111, -197077, -105990, -82161, 3913, -40243, -136908, -163941, -95012, -4839, 124863, 152913, 118119, 66040, -45771, -267752, -338624, -285910, -311512, -296838, -182748, -119525, -63017, -45175, -88979, -106012, -127125, -144323, -105892, -144782, -149426, -114609, -102388, -111055, -35191, -72014, -177410, -134072, -135497, -96189, -18798, 35031, 113642, 129685, 28293]
8681B8293p6645R1729J03877p8610m2491J0908K04395P001j06518j7774r5077
8670B9088m8990M2038k2889N0646j3329L7089j6591r7656p4457j246k0427L5009
8658a01715J32154J23953m6357q2689j09169N1006J70720M3055n0493p9888Q8578
8647A39155J56923l8888j77314p444m1836j22973q3292O6283l8754r3003J21104
8636a20039J26885J3505p1512o2718k1231Q9204J2238J04002M559q6264k1549
8625c2920m1848k1673J3302o363o5083n0601J47108P1899j204o611l1180m3797
8613f8971n851J19161K8356l5671M0731p4239j8052K1971m256l1291j26987j42361
8601b97460P6294J42893K5981p0950n3271q109O594J3630k0651l0629M8896P2857
$$ y = [28293, -48352, 43377, 147254, 68644, 26153, 37061, 241456, 248457, 141939, 124165, 29088, -19902, 22136, -753, 49893, 36564, 73653, 57062, -40594, -115051, -116297, -136724, -101715, 30439, 154392, 108035, 25346, -83823, -32817, 137903, 180958, 130465, 50577, 139155, 296078, 257190, 79876, 72432, 30596, -92377, -175669, -109386, -148140, -241143, -120039, 6846, 20351, -51161, -113879, -135110, -45906, -33668, 70334, 74893, -11371, -32920, -74768, -96441, -83139, -89502, -154585, -205186, -58078, 13821, 12617, 6006, -25174, -68971, -74822, 44339, 72695, 37024, 77755, 3516, -14536, 7435, 3179, -28112, -155099, -297460, -221166, -78273, -52292, -123242, -176513, -184622, -178028, -164398, -185049, -215678, -166782, -93925]
8589i3925J51247l0692n8564K7158Q9346Q8302l702j8151n8439P0065k1886m5916
8577I4843l9705M2410j9211Q8658L1015k9232q4145n0225n214J30945k9924O1290
8565A91505P7355J16712q6695j05830r9394j29173Q3189J14888L9477j5609k3339
8554A63086m0706j02883l4432P7847r94k4134Q8714Q6161j33203L6309Q4366m3115
8542A57016j39860j78013j03146J23343n8002l7094M5322J00095P7691J2599L9006
8531C8957J25895N9254R1787m1070p7579O6079j0438n4978n9498j54859L1407
8520A4957P0057J4627m9864M0772m9712N2949J2455O027k7049n0624n1428j15114
8508a31947J13309J15821p8897o0518P2576K4585R6325J0879L1455m3349K69P54
$$ y = [-93925, 57322, 26630, -31934, -4776, 84570, 172872, 169170, 151019, 92580, 162645, 140759, 94843, 55138, 97548, 78337, 166995, 198010, 168778, 84633, 34408, 29194, 160139, 130215, 191505, 268860, 385572, 298877, 193047, 93653, -35520, 47669, 162557, 202034, 186425, 163086, 122380, 19497, -14935, 62912, 61918, 37784, 126498, 212659, 79456, 115765, 200131, 157016, 17156, -160857, -264003, -140660, -198662, -235756, -190434, -90339, -12648, -49, 38957, 164852, 224106, 315893, 274823, 197244, 263323, 252885, 197907, 138409, -16450, 14957, 85014, 99641, 49777, 90549, 40837, 93786, 106241, 112268, 85219, 34595, -16833, -131947, -18638, 97183, 18286, -42232, 30344, 54929, 151254, 162133, 193588, 150239, 150508, 151262]
8496A51262n8273O2432J7368q95n7049r1409J07473J41777q6484k23239p618J07489
8484F2834J91800n5874j75441J05705K0416j07921K3026l5991K5092J8914K6161
8473I8721J30936J4893j96208K2188O889M1313k6203P402J5774k1389K7706l845
8461A18177J07453R5228p8805q3122P4323p418o1759K2020M6741Q239q1282j09859
8449D9936l460j06561K8955O093m8107k0711k3700O1808J10880J44046O9727j13402
8437A55504o8048P9117J9532K8162p8370K5925p9962k520l181N4839j6626k5322
8425H9050p5223j5624m7213R6884J4071j0714j26372l0734k0300K5917o4662M3234
8413a21686Q8589N6685R7374n372j17598j16307K0291k3539L8404M8422k5240
$$ y = [151262, 92989, 155421, 172789, 171894, 114845, 23436, 130909, 272686, 186202, -37037, -44655, 62834, 254634, 198760, 23319, 129024, 149440, 41519, 64545, 28554, 53646, 72560, 98721, 229657, 244550, 48342, 70530, 77419, 118732, 92529, 99931, 115705, 94316, 122022, 118177, 225630, 320858, 242053, 158931, 233254, 225836, 164077, 186097, 232838, 241077, 159795, 49936, 46476, -60085, -31130, -25037, -73144, -93855, -117555, -55747, 55133, 199179, 268906, 155504, 87456, 166573, 186105, 214267, 135897, 161822, 81860, 79340, 76159, 130998, 114372, 89050, 13827, -1797, -49010, 47874, 61945, 51231, -75141, -105875, -126175, -100258, -164920, -121686, -33097, 23588, 120962, 115590, -2008, -118315, -98024, -121563, -83159, -34737, -59977]
8402e9977R0344R6627k9049q9974J2828J5805J30203p7461q7682N1489J61758
8391B14911j07258j02702j8056J26330J32645j23655p4151p5172n2358k3527J23599
8380B0606P0920K7211q8036p6824o6402O6871j5500o2761L7841q097m257P9719
8368a8709J86791P1315j32760j50290N1879L7010r2101j08404j7809L7657o913
8357a42334L7402R9856J5183K5912L4712r780o6509p4724r9318q1674P4697M7993
8345a38584r2761q0547J24382P4467J1097J02886J31977M7685K0596k2083q209
8334A70906q8142p9948m906K4316P3554o1119j01494L3907n1084O4769O8138k2489
8322B6408k09144j9125M8527N2503M0365j16293N5964R1630M9016o513j18607
$$ y = [-59977, 30367, 126994, 97945, 7971, 20799, 36604, 166807, 89346, 1664, 53153, 214911, 107653, 4951, -13105, 113225, 245870, 122215, 48064, -27108, -79466, -102993, 20606, 91526, 118737, 30701, -46123, -112525, -45654, -61154, -123915, -86074, -94171, -98428, -18709, 168082, 239397, 106637, -43653, 8226, 45236, -46865, -155269, -173078, -135421, -142334, -104932, -5076, 10107, 36019, 70731, 60951, -5558, -80282, -179600, -261274, -186577, -138584, -231345, -311892, -187510, -113043, -101946, 940, 132917, 180602, 201198, 179115, 170906, 82764, 2816, -2090, 22226, 95780, 34661, -66833, -32926, -84010, -19241, 48897, 26408, -182736, -201861, -153334, -100831, -60466, -176759, -120795, -29165, 19851, 13338, -105269]
8311a05269m1908Q4743J71362r2549q8254J01369K1249q227K5848l3072k5946
8300I346k8768K1459l4475N4509K5628j1255j5433N4300r2259P1222k8874r6294
8288g0894o6895N6039Q9276R3067M9334n2992r1050N7096K6090j03393L0939Q3843
8276A00460M600p0526o6390l4673Q77k5340R6489p5580L4427P6970O8096l4244
8264G5166o1214K9851q9974j16960R1784J51984j8534j17691O685K1243j3322
8253d0982j7652m1092P3822K2373o9734m7911J29955L3661J4200L8266j11270
8242a6364j04031J8350j3633L2573J6284k8966m4599M1801J19117R3950k4832
8231H9650Q5860n560K5457p955j32354L512l5018L0253L3573l0257J5830M26Q5237
$$ y = [-105269, -147177, -62434, 108928, 16379, -71875, 29494, 50743, 42516, 68364, 35292, 9346, -19422, 2037, -32438, 22071, 47699, 36444, 21011, 75311, -16948, 54274, 25400, -70894, -137789, -81750, 7526, 100593, 149927, 96935, 5885, 62981, 89071, -14322, 16617, 100460, 105060, 34534, -31856, -66529, -65652, -90992, 5497, -70083, -35656, 41314, 109410, 75166, 13952, 43803, -46171, -163131, -71347, 80637, 62103, -55588, -48903, -27660, -40982, -58634, -99726, -25904, -3531, -73265, -121176, 8779, 42440, 56640, 94906, -16364, -120395, -102045, -115678, -83105, -66821, -95787, -140386, -98585, 20532, 114482, 89650, 175510, 169950, 195407, 187452, 55098, 58610, 23592, 53845, 87418, 57161, 72991, 73417, 158654]
8218A58654O038m4710n6411l8944r6499r8516J35142J16242J0460j54632j4742
8207g7918R5660j6222M554q2478j20286J1457k6594Q6432J87616J45510J241N1943
8195B60915l284n9943p7579q9270m0055q3914O1741O5965l4473j2963P9695R5039
8183A61874l8533n4448Q2176L5844o5330m9968k8118J5587m4759O221j00041K3154
8171e6341N667q4305J6349J78816J09863K6222j75028q5870j7557J467l8630m7593
8159a66940M3473l4731n3529Q6269J38468m0552r6239J10542p9497N4046P792
8148c0898o9629J05709N1937p5028j14928O8810n9656m8286K3931j4117l421N3789
8136a11787J80901L5253N049j90951l7014O9810M6098q2656j0968K7123j5238
$$ y = [158654, 164692, 119982, 63571, 24627, -71872, -170388, -35246, 80996, 91456, -63176, -77918, 17742, 1520, 6074, -76404, -196690, -185233, -211827, -125395, 62221, 207731, 208972, 260915, 257631, 197688, 120109, 30839, -9216, -93130, -31389, 34576, 103, -12860, 66835, 161874, 123341, 68893, 151069, 186913, 121583, 71615, 43497, 59084, 14325, 20546, -79495, -56341, -50674, -134979, -118630, 60186, 170049, 196271, 21243, -64627, -82184, -80717, -119347, -166940, -123467, -158198, -211727, -125458, 13010, -27542, -123781, -13239, -92736, -38690, -30898, -100527, 5182, 57119, -17909, -132837, -64027, -123683, -171969, -148038, -162155, -165576, -111787, 69114, 104367, 109416, -81535, -118549, -48739, -2641, -85297, -96265, -69142, -84380]
8125h4380R24j5245L2779J7290N6618r7590N9976J35686J0174k1575m9869M027
8113D8815M8758n3321o3958P820Q2263j39274m0588J2044N1329L9102N3153J8994
8101F5137q7345m0234p3058L9629m0646j6577J01870O8300N5390J2113j04781
8090b0202m6686n6716J38429P4054k3502Q691j070j9325j5815n7565N3564J2709
8078D6566k839P1502Q5014P8346m5411k14850m9511J19833O8844j02500j53537
8067i8543j12103Q0274J32877Q8293j5699N8592K4170n0531j0481r3061k6963
8056b3175O7156Q0209Q4070j04561p7678J493p8273o8226j459J3758p1089M3706
8044a34069P7975n7197j3264R1321P7087N9823j5386j4285k3046j6580j41132
$$ y = [-84380, -83456, -98701, -65922, -48632, 7986, -89604, -29628, 106058, 116232, 94657, 44788, 48815, 97573, 44252, -19706, -11886, 70377, -68897, -109485, -97441, -46112, -7010, 46143, 65137, -22208, -62442, -135500, -95871, -136517, -153094, -51224, 17076, 72466, 84579, -20202, -66888, -123604, 14825, 88879, 65377, 74068, 72998, 53673, 37858, -19707, 33857, 46566, 43727, 115229, 200243, 278589, 233178, 18328, -31183, 88650, 157494, 54994, -98543, -210646, -130372, 2505, 90798, 75099, 133691, 157861, 107330, 96849, 3788, -23175, 43981, 124190, 208260, 103699, 26021, 27514, -50759, -118985, -120444, -106686, -177775, -134069, -56094, -113291, -126555, -35234, 41853, 101676, 86290, 72005, 48959, 32379, -108753]
8033a08753k8470k1868p4431O4020M2032J03296P9848p945p3989N3267M4524L1470
8021A03001L7509k04366o8880l974N037K040M4576J40905n4874q2168j8842N8507
8009d1529J2245J49466O4037p6728O2211P2792j34092q6641p3301J6824K23n8040
7997i2533l3063k7636O5199M1253K0421Q3571o6102l7875L424n1628L3973k0022
7985h1018N955Q4439J2552L2215l3735Q511P8848l5465j37287J40074K8744j26946
7973b3113r4064J19817K6546J05581O0517l4236j9924K4l5291J28568l7383j28448
7961F8594p3651J4552L4674p3750M4257r406k4249p4772o9003m7265J28513J49362
7949F7856N3220p6888J2213P297N9605m8493l3279n2723P0268P8242n7945j8524
$$ y = [-108753, -137223, -159091, -233522, -169502, -127470, -24174, 55674, 47729, -26260, 27007, 71531, 103001, 140510, -63856, -132736, -136710, -131673, -129633, -85057, 55848, 974, -81194, -100036, -41529, -29284, 120182, 184219, 107491, 169702, 242494, 108402, 21761, -51540, -34716, -34493, -92533, -125596, -153232, -88033, -46780, -26359, 57212, -8890, -46765, -43341, -94969, -60996, -81018, -75063, 9376, 21928, 54143, 20408, 28919, 107767, 72302, -64985, 75089, 103833, -23113, -117177, 2640, 29186, 134767, 195284, 161048, 141124, 141148, 105857, 234425, 197042, 68594, -5057, 9495, 44169, -29581, 14676, 5270, -18979, -93751, -162754, -210019, -81506, 67856, 121076, 44188, 56401, 63698, 123303, 74810, 41531, -11192, 59076, 137318, 79373, 60849]
7937F0849q2909k517m725K6220P9365J14219L4854K6641j55394N6524P206j11913
7925D8420o6231m7152P5212M3765q1667j0121j6472P1845M6081K7576L0397O078
7913A27731J227M636j22618k2745O275M2143Q44m4828Q2362m9745L6142Q2255
7901A43679n4798K8442j3446o9069k9633M5828R3091l5873l5122R1915K4650k4718
7889A64946K1459K050j9139k7472j97691o2432N2970R1444k139o0665L8177O989
7877H497Q4501p3764l4074R0481J23575j4801n9596J9790N4372J11129q8138j34194
7865H7778m5700m3138J6556l1028q1078l6900J13649O9054O2570k0947j5056l1593
7853D4167l255K1295q0863Q4542k4146m1840Q5152o9814m9046j47087M4226m1038
$$ y = [60849, -22060, -24577, -29302, -3082, 76283, 190502, 225356, 251997, 96603, 153127, 160333, 48420, -17811, -64963, 10249, 54014, -27653, -37774, -54246, 17599, 63680, 91256, 121653, 127731, 128958, 133594, 10976, -11769, -5494, 36649, 37493, -7335, 75027, 25282, 61424, 143679, 88881, 117323, 103877, 34808, 5175, 51003, 144094, 108221, 73099, 165014, 189664, 164946, 186405, 188455, 169316, 141844, -55847, -118279, -65309, 26135, 23996, -36669, 1508, 8497, 92998, 19234, -14840, 75641, 199216, 184415, 124819, 144609, 198981, 310110, 221972, 87778, 42078, -1060, 15496, -15532, -96610, -133510, -19861, 49193, 111763, 90816, 75760, 44167, 40912, 62207, -18656, 65886, 41740, -100, 85052, 15238, -33808, -180895, -136669, -177707]
7841a77707o1607M5579O1422M5115N7091m9612o6407P0801k4328N0557Q232q4639
7829a25503O5447O0234J1348J10870K6518o360O681L3274m1423j47821j0138L0738
7817A3865l853n1088r2777M4123l9005L9639J80672M7057K1694O3466l9757j10281
7805G3755k7543P2566q596l9909k3964J580J0173r3063O471M1152P2063r349j22826
7792d7490J8416O337k9998o0438p2044P7595q6016M8648J60484m092k926j13219
7780a04743k18392N1192K19758R9194r0448j07174L5450n4037L7615J04328J38221
7769A10964p8417l3423J5294R5321R7614r9389j39775o3755O8612N0685P0922
7758I4653m2936k894l4632o1827o6580J03687J09848o5605m4131p6090n801m1280
$$ y = [-177707, -239314, -193735, -132313, -87198, -30107, -79719, -146126, -75325, -99653, -49096, -40864, -125503, -60056, 178, 11526, 122396, 148914, 142554, 149235, 182509, 141086, -6735, -16873, 13865, 10012, -41076, -133853, -89730, -128735, -89096, 91576, 138633, 160327, 223793, 184036, 73755, 46212, 118778, 110182, 70273, 46309, 47889, 58062, -35001, -28530, 12622, 84685, 75336, -47490, -29074, -22737, -52735, -113173, -185217, -107622, -193638, -144990, 15494, 11402, 8476, -104743, -323135, -271943, -52185, 47009, -43439, -150613, -115163, -169200, -131585, -27257, 110964, 32547, -876, 14418, 109739, 207353, 107964, -31811, -95566, -26954, 23731, 94653, 51717, 48823, 14191, -47636, -114216, -10529, 99319, 33714, -10417, -86507, -92308, -133588]
7746a33588L0310J04662o2540p2812m5752j7662j2788J2208J08335L1695P8181
7735B0249R5359M215K0231l112J7007K5981j02258p5235K2601O6862q3591r5086
7723h6777J5371K0302j08231r3534J9735L0784P8467l1243p7511J20276j7371
7712a29732J2326p1510Q1933J09851O8989M8211l3174j2727m636K286j09338q5398
7700a22919L6971L8492r043r4637k800R2911n5555N2829N1659K8710l0173o9598
7688h3153K8774p231K1535L1641N1522J274j08509K6353j3559j33523l8314J13154
7676a10036j2943J4010O4396p378N8021K0395M7266M6705q7879m7755k5620k7913
7664f8731L0314N5281j4681m2482o8613p9425Q346l8963N631J18702O3064k9819
$$ y = [-133588, -103278, 1384, -61156, -133968, -179720, -197382, -210170, -197962, -89627, -57932, 20249, 115608, 119823, 140054, 136942, 153949, 179930, 77672, 2437, 25038, 91900, 8309, -86777, -71406, -51104, -159335, -252869, -233134, -202350, -123883, -155126, -232637, -112361, -129732, -117406, -188916, -106983, 2868, 71857, 120068, 86894, 74167, 69531, 71817, -37521, -122919, -85948, -47456, -56499, -151136, -153936, -61025, -116580, -63751, -12092, 16618, -13555, -83153, -54379, -61610, -40075, -8434, 43088, 44362, -64147, -37794, -51353, -184876, -223190, -110036, -122979, -108969, -44573, -51951, 6070, 26465, 73731, 120436, 32557, -15198, -40818, -68731, -38417, 16864, 2183, -40299, -108912, -188337, -179991, -218954, -213323, -94621, -31557, -61376]
7652f1376P7549L8233j09425L6276J10498P48k9857m9435M9964k6127j00223l8416
7640a01591n2174O0561J674Q618m2531J62102P3842M758l0990q1475K2932l0036
7628d310l0464j1008n1666O8066l2900l0081M8465j6843O7114J16569l5109p9184
7616H649l3611k2197N8001j2647P0591k3173r5884n8568J04209J78689o1524j13038
7604e03L9627k3198q2897r2811J02120J33545m7854m0412k0448k2920o1825K3940
7592i3636O0123q3468r8816J6647P3727M4289N6822N0301j15362l7762P282Q3250
7580c6603j3560K138l8970n5710j1323O1388J0075j4882O9925P4969m5970L677
7568E154J16920j34472k9162O632l7861o0870L2142J16010K6153O4276P9174K4437
$$ y = [-61376, 16173, 54406, -55019, -18743, 91755, 92503, 62646, 13211, 63175, 37048, -63175, -101591, -153765, -93204, -91530, -82912, -125443, 36659, 110501, 115259, 84269, 2794, 25726, -4310, -34774, -45782, -97448, -29382, -62282, -92363, -43898, -60741, 6373, 122942, 87833, 8649, -24962, -47159, 10842, -1805, 68786, 45613, -50271, -108839, -4630, 174059, 112535, -503, 39124, 15926, -66971, -159782, -57662, 75883, 28029, -12383, -32831, -55751, -117576, -93636, -33513, -116981, -215797, -199150, -125423, -81134, -24312, 25989, -89373, -127135, -119853, -36603, -50163, -48025, -86995, -142705, -154028, -92640, -82565, -97447, -27522, 47447, 1477, 5154, 122074, -12398, -41560, -34928, -72789, -133659, -101517, 14493, 40646, 104922, 184096, 208533]
7556B08533j07349m2516l864l4384L568J9272k6773j9035O7074m1113O3292O1393
7544A48098O00n0740j2822q8540N5698K6413j49536p0326r3537O2584K9697q6980
7532b29391l6641L4849P0958J63117J01495K0188o5714j52929P965J49163L5711
7521I8771k16567M6063O0956j4184p4413K5432M0605K6009J1183m5672J00434
7510E8617n2464p7929n5751L6454J14831K0410q7279Q5845J5672j61757q5575
7499a88926L863Q8513N4834o6314L0255m1533o8740J485J33715j107O0638J05640
7487A12323J7808Q6271n092n3478k8931J7235k2107j05483k8662L409J06072p6810
7475B2555o2065j15057P3810Q6128N260p8760p4496M0214l596r3046N762N3235
$$ y = [208533, 101184, 58668, 54804, 20420, 23988, 43260, 16487, -2548, 64526, 23413, 86705, 148098, 148698, 97958, 85136, -3404, 52294, 78707, -70829, -141155, -234692, -172108, -142411, -229391, -266032, -231183, -160225, 2892, 104387, 124575, 58861, -94068, -86103, 63060, 98771, -117796, -71733, -10777, -24961, -99374, -73942, -33337, -7328, 3855, -41817, 58617, 6153, -71776, -127527, -91073, 23758, 44168, -43111, 42734, 58406, -103351, -188926, -185063, -96550, -41716, -108030, -77775, -119308, -188048, -186563, -52848, -53955, 6683, 112323, 130131, 216402, 211310, 157832, 128901, 146136, 124029, 18546, -10116, -6707, 99365, 22555, -39510, -154567, -80757, 5371, 10631, -68129, -142625, -102411, -106007, -199053, -193291, -140056]
7463a40056M1980N5812Q5640k4683O0628P9903o3615q1964k0474j4210j24591
7452a45630n542O7060P20J65414J1398K6509q588q5334o1696k1337K6487r315
7440c9854L2370L8052j8539J0310N4652p68o4928r120j9798J58543J36145L4071
7428C11136j12218p4108J5563l2456n3752K105j2987k9407j8659o8613K9828L4466
7416i102N061k7445J48107N31j93865o4334J08837P0084j10932R2306P4850j22615
7404b8517j32594j03986O0853J35408l994m5550M3022J7995m249J6750K2260N4397
7392C1795N2709n7478j30396j1828k8117R9258P2549j6638K4248m3071l7578o3271
7380a07818m1420P7986J20909j18794o8215P611p612M1625L9958l649O4136K7662
$$ y = [-140056, -98076, -42264, 43376, 18693, 79321, 159224, 95609, 13645, -6829, -21039, -145630, -151172, -84112, -83392, 82022, 93420, 119929, 111341, 26007, -35689, -57026, -30539, -39854, -7484, 30568, 12029, 22339, 76991, 76223, 11295, 2175, -17623, 140920, 277065, 311136, 198918, 124810, 140373, 107917, 54165, 56270, 43283, 13876, -4783, -73396, -43568, -9102, -4041, -31486, 116621, 117152, -76713, -141047, -32210, 37874, -73058, 19248, 94098, -28517, -161111, -265097, -204244, -68836, -72830, -118380, -75358, -57363, -61612, -44862, -22602, 31795, 84504, 27026, -103370, -115198, -143315, -44057, 28492, 11854, 36102, -6969, -44547, -107818, -149238, -71252, 49657, -69137, -137352, -129741, -137353, -95728, -55770, -59419, 4717, 32379]
7368C2379J776m8592p4344p5648j34822l1966M8961J4949k1770M8900P6272p5580
7356b39485R1578j0073N1205l2118j14900J2446K5226J37977j3271l8816r764
7345a39995J19649L1503k1543n1565K5963M5704N1225O2863J06041L840j13341
7334A20344K131L8126q3871j02103l884m4094p4589o802j179N6908M9220M7708
$$ y = [32379, 34155, -14437, -88781, -164429, -299251, -331217, -282256, -267307, -289077, -240177, -163905, -239485, -147907, -157980, -106775, -138893, -253793, -241347, -216121, -78144, -91415, -130231, -139995, -20346, 11157, -10386, -61951, -35988, 9716, 60941, 123804, 229845, 233685, 120344, 122475, 160601, 76730, -25373, -29257, -73351, -147940, -154742, -155921, -99013, -49793, -2085]
$$ [...]
##END NTUPLES=NMR SPECTRUM
##END=
