##TITLE=Analysis number 319054
Compound Code ac 35963
Project Code adrs
Chemist Name frontier sci
##JCAMPDX= 6.0         $$ Bruker NMR JCAMP-DX V2.0
##DATA TYPE= NMR SPECTRUM
##DATA CLASS= NTUPLES
##ORIGIN= Bruker BioSpin GmbH
##OWNER= nmr
$$ XWIN-NMR		Version 3.5
$$ Fri Apr 28 10:55:27 2006 GMT Daylight Time (UT+1h)  MAYBRIDGE\nmr@NMR_250MHZ
##.OBSERVE FREQUENCY= 250.131544655141
##.OBSERVE NUCLEUS= ^1H
##.ACQUISITION MODE= SIMULTANEOUS (DQD)
##.ACQUISITION SCHEME= undefined
##.AVERAGES= 16
##.DIGITISER RES= 18
##SPECTROMETER/DATA SYSTEM= dpx250
##.PULSE SEQUENCE= zg30
##.SOLVENT NAME= DMSO
##.SHIFT REFERENCE= (INTERNAL, DMSO, 0, 16.522)
##AUDIT TRAIL= $$ (NUMBER, WHEN, WHO, WHERE, WHAT)
$$ ##TITLE= Audit trail, XWIN-NMR		Version 3.5
$$ ##JCAMPDX= 5.01
$$ ##ORIGIN= Bruker BioSpin GmbH
$$ ##OWNER= nmr
$$ C:\u/data/dgb/nmr/ADRS/3360/pdata/1/auditp.txt
$$ ##AUDIT TRAIL=  $$ (NUMBER, WHEN, WHO, WHERE, WHAT)
(   1,<2006-04-28 10:55:01.60 +100>,<MAYBRIDGE\nmr>,<NMR_250MHZ>,
      <created by zg, POWCHK disabled, PULCHK disabled
       configuration hash MD5:
       84 BC 41 DB A1 6E 1D 46 DA 25 12 A5 C1 ED C5 3A
       data hash MD5: 64K
       D7 52 4F DA 3E 24 F9 8A 52 29 41 1E DD 2D 1C 83>)
(   2,<2006-04-28 10:55:17.55 +100>,<MAYBRIDGE\nmr>,<NMR_250MHZ>,
      <Start of raw data processing
       ef LB = 0.3 FT_mod = 6 PKNL = 1 SI = 32K 
       data hash MD5: 32K
       BD 13 A4 CC 91 76 CF EF 3A D3 E7 19 96 F0 91 00>)
(   3,<2006-04-28 10:55:19.24 +100>,<MAYBRIDGE\nmr>,<NMR_250MHZ>,
      <apk 
       data hash MD5: 32K
       BE 8F 87 20 55 76 A1 6B 58 56 9C FD 98 16 06 ED>)
(   4,<2006-04-28 10:55:20.02 +100>,<MAYBRIDGE\nmr>,<NMR_250MHZ>,
      <abs ABSG = 5 
       data hash MD5: 32K
       12 FE E2 E7 12 E3 C3 C4 5D 2E FF A3 DF 3D 0E 60>)
$$ ##END=
$$ 
$$ hash MD5
$$ B2 4A 86 61 F7 D7 90 72 18 63 7F 9B 66 63 C1 EC
##$RELAX= 
##$RELAX= 
##$RELAX= 
##$RELAX= 
##$RELAX= 
##$RELAX= 
##$RELAX= 
$$ Bruker specific parameters
$$ --------------------------
##$DU= <C:\u>
##$EXPNO= 3360
##$NAME= <ADRS>
##$PROCNO= 1
##$TYPE= <nmr>
##$USER= <dgb>
##$AMP= (0..31)
100 100 100 100 100 100 100 100 100 100 100 100 100 100 100 100 100 100 
100 100 100 100 100 100 100 100 100 100 100 100 100 100 
##$AQSEQ= 0
##$AQ_mod= 3
##$AUNM= <au_zg>
##$AUTOPOS= <17 >
##$BF1= 250.13
##$BF2= 250.13
##$BF3= 250.13
##$BF4= 250.13
##$BF5= 500.13
##$BF6= 500.13
##$BF7= 500.13
##$BF8= 500.13
##$BYTORDA= 1
##$CFDGTYP= 0
##$CFRGTYP= 5
##$CHEMSTR= <none>
##$CNST= (0..31)
1 1 145 1 1 1 1 1 1 1 1 1 1 1 1 1 1 1 1 1 1 1 1 1 1 1 1 1 1 1 1 1 
##$CPDPRG= <>
##$CPDPRG1= <>
##$CPDPRG2= <>
##$CPDPRG3= <>
##$CPDPRG4= <mlev>
##$CPDPRG5= <mlev>
##$CPDPRG6= <mlev>
##$CPDPRG7= <mlev>
##$CPDPRG8= <mlev>
##$CPDPRGB= <>
##$CPDPRGT= <>
##$D= (0..31)
0 1 0 0 0 0 0 0 0 0.06 0 0 0 0 0 0 0.0002 0 0 0 0 0 0 0 0 0 0 0 0 0 0 
0 
##$DATE= 1146218100
##$DBL= (0..7)
120 120 120 120 120 120 120 120 
##$DBP= (0..7)
150 150 150 150 150 150 150 150 
##$DBP07= 0
##$DBPNAM0= <>
##$DBPNAM1= <>
##$DBPNAM2= <>
$$ [...]
##$SUBNAM7= <"">
##$SUBNAM8= <"">
##$SUBNAM9= <"">
##$SW= 20.6930455092707
##$SWIBOX= (0..15)
0 0 3 0 0 0 0 0 0 0 0 0 0 0 0 0 
##$SW_h= 5175.983436853
##$TD= 65536
##$TD0= 1
##$TE= 295.16
##$TE2= 300
##$TE3= 300
##$TEG= 300
##$TL= (0..7)
0 120 120 120 120 120 120 120 
##$TP= (0..7)
150 150 150 150 150 150 150 150 
##$TP07= 0
##$TPNAME0= <>
##$TPNAME1= <>
##$TPNAME2= <>
##$TPNAME3= <>
##$TPNAME4= <>
##$TPNAME5= <>
##$TPNAME6= <>
##$TPNAME7= <>
##$TPOAL= (0..7)
0.5 0.5 0.5 0.5 0.5 0.5 0.5 0.5 
##$TPOFFS= (0..7)
0 0 0 0 0 0 0 0 
##$TUNHIN= 0
##$TUNHOUT= 0
##$TUNXOUT= 0
##$USERA1= <user>
##$USERA2= <user>
##$USERA3= <user>
##$USERA4= <user>
##$USERA5= <user>
##$V9= 5
##$VALIST= <valist>
##$VCLIST= <CCCCCCCCCCCCCCC>
##$VD= 0
##$VDLIST= <DDDDDDDDDDDDDDD>
##$VPLIST= <PPPPPPPPPPPPPPP>
##$VTLIST= <TTTTTTTTTTTTTTT>
##$WBST= 1024
##$WBSW= 4
##$XGAIN= (0..3)
0 0 0 0 
##$XL= 0
##$YL= 0
##$YMAX_a= 321043
##$YMIN_a= -545247
##$ZGOPTNS= <>
##$ZL1= 120
##$ZL2= 120
##$ZL3= 120
##$ZL4= 120
##$ABSF1= 16.522
##$ABSF2= -4.171173
##$ABSG= 5
##$ABSL= 3
##$ALPHA= 0
##$AQORDER= 0
##$ASSFAC= 0
##$ASSFACI= 0
##$ASSFACX= 0
##$ASSWID= 0
##$AUNMP= <proc_1d>
##$AZFE= 0.1
##$AZFW= 0.1
##$BCFW= 0
##$BC_mod= 0
##$BYTORDP= 0
##$COROFFS= 0
##$CY= 12.5
##$DATMOD= 1
##$DC= 0
##$DFILT= <>
##$DTYPP= 0
##$F1P= 14.0000005364418
##$F2P= -0.99999901652339
##$FCOR= 0.5
##$FTSIZE= 32768
##$FT_mod= 6
##$GAMMA= 0
##$GB= 0
##$INTBC= 1
##$INTSCL= 1
##$ISEN= 128
##$LB= 0.3
##$LEV0= 0
##$LPBIN= 0
##$MAXI= 10000
##$MC2= 0
##$MEAN= 0
##$ME_mod= 0
##$MI= 0
##$NCOEF= 0
##$NC_proc= -5
##$NLEV= 6
##$NOISF1= 0
##$NOISF2= 0
##$NSP= 0
##$NTH_PI= 0
##$NZP= 0
##$OFFSET= 16.522
##$PC= 1
##$PHC0= 161.1479
##$PHC1= 12.14806
##$PH_mod= 1
##$PKNL= yes
##$PPARMOD= 0
##$PSCAL= 4
##$PSIGN= 0
##$REVERSE= no
##$SF= 250.13
##$SI= 32768
##$SIGF1= 0
##$SIGF2= 0
##$SINO= 400
##$SIOLD= 32768
##$SREGLST= <1H.DMSO>
##$SSB= 0
##$STSI= 32768
##$STSR= 0
##$SW_p= 5175.98343685301
##$SYMM= 0
##$S_DEV= 0
##$TDeff= 65536
##$TDoff= 0
##$TI= <Analysis number 999999
Compound Code 99
Book Reference 9
Project Code 9>
##$TILT= no
##$TM1= 0
##$TM2= 0
##$TOPLEV= 0
##$USERP1= <user>
##$USERP2= <user>
##$USERP3= <user>
##$USERP4= <user>
##$USERP5= <user>
##$WDW= 1
##$XDIM= 32768
##$YMAX_p= 396256946
##$YMIN_p= -992872
$$ End of Bruker specific parameters
$$ ---------------------------------
##NTUPLES= NMR SPECTRUM
##VAR_NAME=  FREQUENCY,     SPECTRUM/REAL,   SPECTRUM/IMAG
##SYMBOL=    X,             R,               I
##VAR_TYPE=  INDEPENDENT,   DEPENDENT,       DEPENDENT
##VAR_FORM=  AFFN,          ASDF,            ASDF
##VAR_DIM=   32768,         32768,           32768
##UNITS=     HZ,            ARBITRARY UNITS, ARBITRARY UNITS
##FACTOR=    0.157963299565203, 1,           1
##FIRST=     4132.6476996994, 0,             0
##LAST=      -1043.33573715361, 0,           0
##MIN=       -1043.33573715361, -992872,     0
##MAX=       4132.6476996994, 396256946,     0
$$ Real data points
##PAGE= N=1
##DATA TABLE= (X++(R..R)), XYDATA
$$ [...]
19394 1450091 1632062 1802951 1718884 1533933 1495602 1276250 1339514 1404793 1315393 1228879
19384 1228879 1265417 1264911 1356393 1352596 1166037 1544716 1566117 1451374 1359048 1450860 1234283
19373 1234283 820434 924368 926480 917958 1060969 859032 665659 621639 693234 676423 874679
19362 874679 893370 850249 882667 685506 393684 394657 735783 953639 970156 895358 1023222
19351 1023222 1026306 950583 902138 865194 822121 949688 958362 1019230 1220085 984642 921606
19340 921606 1075840 1045989 772136 467448 449508 593185 517316 460490 478523 380095 505427
19329 505427 677634 813368 842831 1114189 975273 854750 912395 889736 893228 747840
19319 747840 510350 543566 479659 867398 1254726 1108248 945996 711690 658994 806402
19309 806402 841998 932937 700651 811041 887502 850512 672217 521921 319181 204915
19299 204915 39180 41200 262943 100002 123244 419408 488341 645898 966739 958729 878510
19288 878510 719988 329431 396411 529708 384480 318449 436617 494659 395721 214093
19278 214093 312585 314153 189335 47799 15311 -103994 461314 731157 725225 634475 629283
19267 629283 660510 641546 426530 289529 239326 375412 500115 429988 142261 -23639
19257 -23639 -137076 -19327 46191 167919 268538 165354 89678 26332 -47814 -166047
19247 -166047 108928 216475 100820 253286 300650 382446 381537 357809 558186 450755 436181
19236 436181 524780 491617 454518 454960 351348 87702 1255 363663 529371 555331 356396
19225 356396 478514 512189 563935 583418 471266 124583 -183203 -60165 314367 513442
19215 513442 418941 127573 87742 -56324 7898 200495 188098 104833 146767 305058 402506
19204 402506 490240 573621 318164 59692 95858 241116 448496 674690 558954 316727
19194 316727 235301 197863 97200 -118784 -52237 249139 591647 681506 419461 189938
19184 189938 333882 346401 367159 405141 364854 278691 215837 49872 67947 -69945 -155640
19173 -155640 -167911 -93386 -133342 -122827 174332 274867 319148 366502 296966 346299 574843
19162 574843 499433 248822 229452 377431 173229 576 -48062 -163056 -174553 26656
19152 26656 141237 329225 572691 301438 -6451 -123018 -113019 58167 315638 181685
19142 181685 126338 254221 -58089 -57720 307834 334024 326957 183045 77333 131675 183819
19131 183819 376620 532243 284542 57469 352173 392020 317954 250294 -50535 -213031
19121 -213031 -139797 193391 417418 362065 323022 143322 59885 351147 426095 175019
19111 175019 243004 368863 333049 91827 118430 270165 261677 38063 -68659 -207342
19101 -207342 -149415 177242 512502 566423 306434 -45191 -85519 110026 169071 174098 171567
19090 171567 48547 134383 288027 123798 196276 270114 180767 142808 218757 282681 367509
19079 367509 381787 -72843 -171512 125044 185251 175104 180001 202623 334029 304555 402476
19068 402476 397505 377734 402445 635608 549920 335925 162613 311117 492259 353642
19058 353642 506043 614749 266306 30036 97813 77984 95092 258670 217613 96914
19048 96914 -16804 63492 -2844 -114911 95949 143184 65011 86987 35162 66038 30357
19037 30357 87064 354028 165706 78658 -10155 -151176 125016 209003 91880 185331 307194
19026 307194 401487 317610 455710 579042 443057 387594 525655 376344 400407 496686
19016 496686 527134 504704 512671 559882 512978 549311 592704 431796 342166 204093 114215
19005 114215 -77669 -9750 89195 62547 212252 454698 532650 511897 441039 189932 203169
18994 203169 454803 493821 531951 299779 156758 22700 21873 191317 415371 591198
18984 591198 303198 338048 452030 474236 428257 448178 404261 389918 473429 492694 114256
18973 114256 -194123 -118102 117926 470550 497879 497043 561869 552707 564548 651560 674117
18962 674117 588658 742890 611316 543924 353406 176176 16044 -20842 160938 309276
18952 309276 498752 285075 154705 120321 205825 262232 276415 151885 -306829 -312023 2601
18941 2601 111161 7978 186024 365306 463543 341038 244118 144562 255487 325817 329119
18930 329119 196165 414137 596576 458040 202292 129596 89511 154288 117304 308893
18920 308893 333156 550430 596803 481113 281290 228218 358332 310351 501582 466464
18910 466464 160160 335570 395194 585437 555565 649487 805924 732457 429824 383453
18900 383453 469865 519268 504164 780810 839558 691302 589831 612153 734384 542939
18890 542939 637920 795797 880429 816660 649189 469089 307634 533716 876244 720565
18880 720565 486015 500817 505189 554009 580312 556249 472262 499843 555318 496140 377178
18869 377178 575619 586807 556033 597187 454407 660941 746337 840942 817501 672991 831242
18858 831242 848625 896350 1051940 1042930 1004555 1097000 1109847 1210693 1467215 1822875 2285825
18847 2285825 2774451 3275796 3809053 3958049 4226908 4661268 5057377 5047685 4963012 4864549
18837 4864549 4660764 4674688 4795185 4997088 5141914 5219199 5498160 5391212 5283588 4955193
18827 4955193 4634570 4118440 3647517 3189337 2989113 2763946 2626006 2584179 2397162 2186046
18817 2186046 2031019 2006935 1943344 1797860 1917114 2042488 2091876 2116051 2032373 2141104
18807 2141104 2144743 2344212 2460326 2699829 2870013 3185416 3615305 3820973 4114103 4574456
18797 4574456 5022770 5418159 5386268 5490271 5490287 5259400 5194373 5333025 5408064 5310784 5623805
18786 5623805 5767152 5894374 5951082 5866802 5489963 5307917 4842706 4531874 4105194 3770816
18776 3770816 3546489 3358391 3006641 2361668 2046245 2110673 1872247 1636279 1686799 1674148
18766 1674148 1766050 1717357 1815796 1688423 1534709 1577071 1655741 1861326 1823909 1570123
18756 1570123 1359835 1209704 1173062 1582408 1556009 1521293 1295113 1230019 1343262 1310777
18746 1310777 1195440 965889 828588 753314 749313 930769 1128612 1145659 911578 862400
18736 862400 875394 1076105 952455 1102909 1189339 1046236 1023857 1209744 1133436 980519
18726 980519 751299 537463 858993 941069 1188328 1202442 940536 988709 1099682 1200673
18716 1200673 1176947 1127943 1107605 750821 789467 710068 638390 538239 790210 913650
18706 913650 895018 911359 889323 885590 941921 1022953 852165 888997 797822 845582 1165776
18695 1165776 1091328 1064187 1130569 905740 756081 890189 1119414 1279072 961255 789231
18685 789231 874450 1112988 1144514 953229 770757 585775 585867 446784 443390 533278 779131
18674 779131 939545 802731 566824 770204 836797 932724 814884 724379 1134251 1211380
18664 1211380 968526 811042 773721 723867 835084 955421 850271 807887 1283581 1612818
18654 1612818 1845580 1498372 1210168 1314524 1339755 1242850 1176318 1021854 939797 943600
18644 943600 829470 977393 991673 1377028 1616505 1465835 1204844 1213121 995182 1012635
18634 1012635 822621 693243 807127 634037 619652 854223 854071 896749 892184 729212 635321
18623 635321 536129 438484 555459 559260 769690 857162 1015068 912288 947568 1106864 1028566
18612 1028566 752255 782953 926956 877698 814580 575263 516928 804380 852778 979063
18602 979063 1078337 1180843 1326347 1219953 1269518 1317341 1253519 1407014 1244264 1184565
18592 1184565 1343624 1538674 1547200 1541970 1403408 1285185 1204552 1219364 1036816 827661
18582 827661 806521 732009 662266 684418 948069 1145535 927167 737312 642312 745052
18572 745052 766057 760423 703295 732834 808978 1031926 974271 830182 738242 653019 598393
18561 598393 550882 748975 824796 752309 720728 707452 764005 837697 817913 703301 841503
18550 841503 913475 891548 855968 996979 850474 832352 734656 741218 835963 785441 743848
18539 743848 578835 629453 771865 750392 765160 615632 753512 947982 756821 621760
18529 621760 792119 772735 797375 661776 773422 1184210 1503025 1723009 1796909 1736895
18519 1736895 1922553 1943094 1794614 1843089 1695740 1598274 1520967 1312924 1504070 1576515
18509 1576515 1836604 2124891 2233327 2318492 2260816 1950636 1647331 1737173 1561829 1137869
18499 1137869 853312 802277 944512 1131031 1045047 1364875 1591541 1548677 1418468 1184783
18489 1184783 954206 929740 1036100 1010995 1016169 751038 710192 823510 987154 919656
18479 919656 1074115 1267146 1251599 1460602 1722990 1703974 1650359 1909933 1962847 1943435
18469 1943435 1733065 1823611 2108861 2099433 2125620 2100488 1984422 2148935 2366172 2321018
18459 2321018 2034016 2033664 1839534 1591606 1317417 1185247 1142983 954165 898788 1191951
18449 1191951 1021561 910961 916659 945606 1016696 1319834 1190574 930126 1015422 1305328
18439 1305328 1339552 1117997 1033724 892640 927226 1077810 974515 921077 1165204 1337279
18429 1337279 1116420 1245777 1533435 1421456 1264761 1172420 727034 556979 590221 665365
18419 665365 673346 813009 1099926 1051182 1029548 901790 840956 703201 674807 795160 836804
18408 836804 644564 850687 972277 907313 1127489 1412771 1641637 1400835 1574732 1522883
18398 1522883 1307440 1147858 1369321 1386733 1204953 1246554 1353900 1360108 1300233 1250716
18388 1250716 1176040 1461832 1444133 1187709 1331430 1553285 1492350 1450825 1491429 1363738
18378 1363738 1337833 1287287 1344395 1431640 1528976 1542453 1549095 1653302 1655697 1589046 1485674
18367 1485674 1559572 1596484 1607393 1641531 1449468 1331473 1305947 1250151 1471343 1502365 1441161
18356 1441161 1362188 1259171 1260219 1329653 1105992 1278871 1236296 1205525 1060313 1453301
18346 1453301 1489277 1255060 1298676 1372168 1515512 1664047 1866765 1720156 1584575 1717310
18336 1717310 1833472 1844002 1888243 1948531 1933035 1898185 1898292 2277544 2664119 2675220 2588772
18325 2588772 2775472 2951718 2860750 2788996 2703918 2968177 2628851 2243138 2008588 1966564
18315 1966564 1819072 1661044 1899878 2178126 2219262 2227724 2292123 2288539 2275861 2157306 2114350
18304 2114350 1987920 2110345 2077315 2223870 2388002 2434704 2574532 2635253 2385329 2242305
18294 2242305 2813897 3094489 2994444 2875855 2946474 2751601 2858435 3128197 3375135 3659516
18284 3659516 3674167 3664526 3971286 4119568 3947068 3945688 4137495 4218496 4041973 4075782 4255431
18273 4255431 4276166 4413984 4408988 4159947 4204757 4524693 4603156 4759519 4635091 4501238
18263 4501238 4482516 4346759 4199890 4211417 4299867 4344695 4406176 4558599 4626953 4606164 4888347
18252 4888347 4991906 4769984 4722866 4638010 4680599 4866699 4917877 5023177 5121850 5154029
18242 5154029 5066984 4977386 4661683 4743189 5263476 5554351 5676190 5563955 5435864 5607741
18232 5607741 5809293 5877796 5892400 5953246 6223924 6373069 6498647 6721794 7179292 7529600
18222 7529600 7815806 8128926 8632125 9055581 9254923 9503386 9649957 9946997 10391443
18213 10391443 10929412 11607514 12115898 12997305 13918657 14920844 16151979 17673264 19403707
18204 19403707 21015461 23228506 26006837 29490035 34558871 40929783 48385777 55691298
18196 55691298 60935456 64302761 66038004 65755917 62849647 58965267 57260331 58892483
18188 58892483 63801056 70962006 77489745 81076371 82307245 81211130 76448733 67488564
18180 67488564 57398089 49065144 43076527 38970754 36168570 33924307 32442190 31460864
18172 31460864 30808525 30604905 30243935 30235832 30527704 30896215 31854110 33287878 34694200
18163 34694200 36399298 38546479 41374456 45262140 50079519 56558016 65066239 75616510
18155 75616510 88182102 102117175 116643352 129750854 138331965 142503604 143895394
18148 143895394 143717438 142260138 142094503 146321232 155648870 170406596 188955319 206912859
18140 206912859 219761575 225092947 223478786 214359528 198250058 177727015 155767615
18133 155767615 136841079 124304132 119179848 120584224 126640979 132694240 135324384 135247013
18125 135247013 133237047 127192848 114981110 100869075 90174720 83780914 80769030
18118 80769030 80081851 80341069 79981050 79720809 79695198 79379349 78633290 78601210 80863756
18109 80863756 85279991 90631808 96834766 103442507 108386285 110892032 111876070 112871752
18101 112871752 114216261 116583675 122119037 130724851 139957692 149695114 160043031 168950586
18093 168950586 174394190 179130080 186081283 190752428 188966283 184290717 179395476 172183078
18085 172183078 159846253 147231481 141804075 145362529 156585655 171249624 183577411
18078 183577411 190575367 192202048 188200542 175985946 156318770 135896709 119764254
18071 119764254 109114821 103660486 101987669 102114256 102368738 101249806 98342168 93741725
18063 93741725 87759358 80102415 72233488 65604218 60444601 56570088 53594327 51284694
18055 51284694 49574887 48328788 47033393 45825134 44668413 43356354 42241939 41347481
18047 41347481 40541170 39877153 39623133 39446491 39217112 38939866 38640843 38593294 39117494
18038 39117494 40250792 41632926 43708710 46616104 51064782 57775747 65961154 74144997
18030 74144997 80240827 83501706 84353765 82878935 77693265 69789272 63017745 59428893
18022 59428893 58833888 60720025 63276761 65253388 65318899 64366494 62161670 57517789 50652790
18013 50652790 44095713 39175765 35420794 32585741 30392856 28725398 27269197 25876752
18005 25876752 24835923 23752810 22809909 22159808 21771547 21094469 20711899 20479967 19949420
17996 19949420 19598944 19222654 18798992 18522382 18406067 18209331 17882653 17432441 16986821
17987 16986821 16753342 16553322 16448889 16460171 16238433 15934249 15552519 15331537 15101443
17978 15101443 14630390 14253201 13925734 13875384 13904099 13827835 13587294 13261713 12922870 12479835
17968 12479835 12570968 12725956 12508922 12035697 11867814 11980077 11850625 11679726 11696307 11535728
17958 11535728 11184078 10833189 10884533 11090946 11208355 10975294 10789180 10793239 10965717 11392659
17948 11392659 11543619 11400647 11539784 11693542 11781495 11758259 11857873 11969541 12300181 12698591
17938 12698591 12976766 13068866 13312859 13716720 14236546 15031348 15815615 16602264 17023368
17929 17023368 17438069 17737871 18112365 18624719 18782780 18995641 19454797 20211373 21635836
17920 21635836 23640216 26667479 30882504 36162497 42843177 49478396 54580406 58475537
17912 58475537 61199196 62174379 60961970 59063937 59211131 62417607 67657686 71767543
17904 71767543 73150865 72735261 70409258 64730861 55937566 47217768 40302753 35570372
17896 35570372 32584633 30704211 29235862 28036763 27274354 26851180 26582197 26277352 26083521
17887 26083521 26319143 26775480 27862178 29086048 30406703 31243082 31932636 32522045 32684550
17878 32684550 32696765 32621445 32635550 33070238 34168740 36024267 39155173 43969233 50420962
17869 50420962 58641596 67999166 76861673 83789569 88853227 92363433 94799853 96192757
17861 96192757 99554828 108297564 122465897 139335187 155350855 166128607 169930354
17854 169930354 166493461 155156484 136810940 114221584 93246116 77616681 66388984
17847 66388984 58348821 52565242 48552615 45515625 42947403 41115277 39706430 38626163
17839 38626163 37779558 37215749 37331937 37522228 37567823 37562459 37240882 36830062 36368282 35838430
17829 35838430 35260446 34788745 34792093 35052059 35841773 37207255 39411358 42581831 46946055
17820 46946055 51828008 56076445 59835952 63685103 68197305 73204799 79762478 90272528
17812 90272528 105254061 121466762 135261432 147310101 157241693 160014704 152445786
17805 152445786 138661033 124231417 109667320 93634799 79654904 69083229 61754958
17798 61754958 56620092 52954611 50834126 49390631 48992879 49332493 51149201 54117952
17790 54117952 58233515 64492435 73318171 83822530 94728741 104795716 113014089 117573166
17782 117573166 118074762 115622845 111789067 107545675 104451174 103281515 103362261 104356762
17774 104356762 104690052 101935247 96120864 89180724 82001431 74604776 67999514 63904999
17766 63904999 62904491 64856285 69199860 75322062 80584530 82849233 83258528 82093659
17758 82093659 77828579 69428296 60063184 52538448 47340207 43707156 41188921 39273285
17750 39273285 37859783 36809557 36089866 35534462 35340504 35336269 35649959 36454856 38064576
17741 38064576 40503511 43869482 48576029 54953723 62690159 70395336 77817284 84506047
17733 84506047 89251767 91214192 90635759 89551006 88397776 86426380 84838207 84437001
17725 84437001 84558607 82775081 78573762 72599644 66349124 59783151 52861407 46843933
17717 46843933 42615051 39392409 37292993 35925793 34730181 33928150 33591937 33419491
17709 33419491 33320333 33008052 32553335 32085391 31739646 31359380 31022004 30863141 30643357
17700 30643357 30500320 30633415 31040720 31150992 31209301 31123558 30976118 30952094 30957179 30661058
17690 30661058 30264861 29719086 29093814 28494708 27798673 26764292 25702399 24803990 23786324
17681 23786324 22223612 20829008 19952712 19135574 18302822 17395225 16644421 15959200 15781316
17672 15781316 15736901 15434493 15061806 14945564 14809054 14605974 14141915 13519218 13127861
17663 13127861 12797465 12540497 12265698 12117501 11689836 11512980 11083730 10880967 10697088
17654 10697088 10385094 10026237 9920754 9944392 10042840 9872360 9402218 9133735 8841987 8599989
17644 8599989 8510018 8572551 8535190 8328068 8104715 7904589 7985034 7965908 7724571 7798189
17634 7798189 7609634 7335166 7198128 6883774 6494063 6403154 6546729 6539095 6517307 6473186
17624 6473186 6605524 6644943 6562819 6113823 5950340 6002257 6225164 6193247 6107687 6052415
17614 6052415 5953072 6143874 6048942 5993562 5855116 5626731 5366783 5429881 5619458 5522047
17604 5522047 5522399 5462639 5314177 5141951 5109160 5060529 4656803 4466120 4433241 4470933 4320485
17593 4320485 4037960 4018009 3917340 3853821 3949178 3929714 3577405 3330452 3192134 3127278
17583 3127278 3143292 3052524 3104502 3345962 3347639 3400345 3344849 3292944 3056429 3120346 3116838
17572 3116838 3060011 3011425 2947873 2870642 2988090 2994909 2949723 2805448 2927477 3035741 3049710
17561 3049710 2748879 2680418 2608304 2458099 2555568 2644447 2531758 2379772 2534976 2513325
17551 2513325 2595050 2563228 2531691 2363339 2191809 2132747 2160521 2149971 2331323 2151630
17541 2151630 2374381 2618661 2457430 2237441 2043046 2038517 1990396 1792474 1657262 1500543
17531 1500543 1594423 1723150 1716826 1874633 1786630 1596779 1549997 1543475 1513366 1539192 1415661
17520 1415661 1155419 1099662 1351118 1246106 1033741 1012283 1082880 1061037 973293 1004509
17510 1004509 1141605 1331189 1318090 1044706 1047301 1204281 1266844 1330066 1397736 1296537
17500 1296537 1125626 979562 971140 1097729 1474646 1468924 1160309 1221296 1081188 1026912
17490 1026912 1016347 1178634 1111214 866711 858492 737069 638687 768521 896330 559439
17480 559439 560582 665507 814831 666903 681626 821713 876775 732752 892712 931817
17470 931817 797428 833965 811090 707846 715562 688900 432410 319725 530330 797011
17460 797011 1089691 971007 759436 929590 749585 528154 552004 487289 637840 645074
17450 645074 681202 563327 363621 333545 412451 758507 651692 526458 507492 526704
17440 526704 655311 944576 955193 1027518 892880 598473 542310 472086 358874 474582
17430 474582 627911 698875 723896 786909 882992 994858 822833 467276 386488 344071 257785
17419 257785 206853 112123 244757 330675 432011 459114 418899 509967 526006 703161 532276
17408 532276 474047 528515 513223 574853 412519 469878 456397 511761 455546 414800 747346
17397 747346 808933 791025 600959 533597 706179 630545 659515 691755 827218 992591 915444
17386 915444 711760 673542 615026 611621 713645 780468 661390 767372 644126 246730
17376 246730 152934 204955 338309 280762 216368 330127 665800 435315 261591 -20015
17366 -20015 -8131 -88989 39628 -43291 -10737 -101324 -229651 -274128 93742 395510 497129
17355 497129 287005 253973 571216 633708 406978 326773 261857 130488 243283 564439
17345 564439 566283 660207 808821 850704 432576 521206 895199 1157468 1083619 890013 857601
17334 857601 750985 624110 488643 479034 468073 549023 755234 752078 689630 679308 742546
17323 742546 632922 704814 684842 591846 571861 530501 341754 371042 85792 16520 364946
17312 364946 687207 653672 673148 756977 550061 469855 407114 571159 682899 657428 459639
17301 459639 544836 689674 675032 592338 648077 671305 499566 648426 549337 464340 615405
17290 615405 589863 538971 756501 924878 795022 506182 406233 356930 696577 459770
17280 459770 453281 322251 295619 458623 429183 537130 788075 682849 690209 536501 628312
17269 628312 750583 864117 920494 1021065 1058050 908632 845240 743506 683681 709653
17259 709653 722170 796840 988068 1020233 919941 874356 485413 303486 592520 771957
17249 771957 770415 710296 741265 631266 435838 353525 437534 442581 374734 409343 447967
17238 447967 235269 140829 214206 186325 281412 300269 194847 172283 300978 260513 321533
17227 321533 496787 575056 537249 691546 561236 314708 147861 279698 692009 962410
17217 962410 1021304 1007621 928510 666749 690424 795768 750295 765534 661009 634909 650483
17206 650483 689425 866820 1153968 1070295 550170 285970 25467 135065 330912 329708
17196 329708 289243 231086 163775 203876 -80459 57075 149477 305330 134369 237102
17186 237102 299387 190606 411058 502893 237182 157786 333877 603027 610158 387069
17176 387069 71399 15169 -96578 -266289 -170414 -115174 -12292 240401 494040 536236
17166 536236 291451 480892 710281 390750 486034 384856 336602 324918 251013 115738
17156 115738 61126 -55302 -88052 52092 59354 234459 306548 202294 154345 80888 127964
17145 127964 148480 364091 486185 442770 555893 409282 477040 431135 51852 117991
17135 117991 262694 429409 322810 214661 104881 115575 44126 -2217 -84357 -224814
17125 -224814 -101588 -76999 66865 336983 291235 59581 -77443 -146858 -70900 -110361
17115 -110361 -169924 -131123 -89219 -46080 -143897 -15307 -12788 -62232 -151403 -186843 -147434
17104 -147434 -97184 -71979 -37879 -43264 2730 -8907 -79574 -108424 88383 158366 72162
17093 72162 30494 -140668 -94760 211876 323763 22488 102886 184040 -55896 108869
17083 108869 57792 317164 385613 363872 67329 -126213 -68962 83883 171977 111192 -531
17072 -531 -61330 -199956 -109572 -23226 33985 -42113 -38179 147402 8295 -12827 -8212 215465
17060 215465 176334 33896 4774 207485 235272 -57747 241475 495019 325164 -14787
17050 -14787 -244247 -261895 -142620 -183100 -64391 210721 371503 209206 -117504 -251804
17040 -251804 -50765 -114651 -109236 -68103 105520 278074 191618 66818 -118847 -112996 129220
17029 129220 288367 -18151 136261 273309 219367 354205 282095 129556 116440 -17986
17019 -17986 -146306 -188141 12115 222251 22072 68582 196423 230892 358987 261580
17009 261580 132676 332954 399257 294307 214835 169721 258771 111140 100225 330074
16999 330074 738078 545583 168994 -131844 -87308 52383 307334 409568 528070 438819
16989 438819 317019 271167 510696 525157 310832 166828 20938 111984 398165 366928
16979 366928 350294 287232 333400 258919 236739 469452 636192 708100 679539 242672 108758
16968 108758 248024 209998 98547 298712 320986 315134 143632 77500 127249 213366 45823
16957 45823 -71751 -11042 57172 35214 112663 238740 120504 111606 188800 -22180 -140913
16946 -140913 -229650 -224803 -4454 -45306 -24698 64226 121786 95896 198986 75793 -26613
16935 -26613 -98811 -57777 113306 12977 -68826 -103877 87961 118877 -163028 -216933 -272565
16924 -272565 -186160 84517 44001 186925 278752 281025 266404 275428 329448 129949 -120014
16913 -120014 -27834 -39959 -281596 -327214 -137666 -139814 -136938 -117836 -292522 -292016 -224271 -283699
16901 -283699 -232927 -188416 -51825 158549 178340 -114841 -75606 -90991 -8832 -111712 -144352
16890 -144352 -179739 -110246 101868 303780 139667 58048 -31763 5140 137934 112389 103698
16879 103698 252115 182898 -57739 -236969 -273540 -292615 -486432 -388575 -159992 -91338
16869 -91338 -236980 -233458 -12271 85493 -29537 -59304 -214324 -321457 -347292 -282427 40520
16858 40520 215641 248545 318710 215899 186645 15109 -318448 -458449 -330496 -333292 -354683
16847 -354683 -432592 -526816 -371482 -223469 -115431 37986 293638 330899 175326 173161
16837 173161 107832 105446 79073 -35733 -149805 -231323 -278689 -27359 451752 370582 307955
16826 307955 242110 18265 89629 216372 320895 235359 61574 -53095 -58248 -107577 -137681
16815 -137681 -129961 -312125 -231449 -308809 -254439 -229481 -164415 -64920 -356081 -415852 -138399
16804 -138399 -30760 8039 96932 237867 133471 117540 106888 47883 -102712 -119550 92148
16793 92148 103675 116457 138405 211247 375171 377263 549563 473786 136987 -226155 -19644
16782 -19644 291745 367675 236876 413672 420997 71566 -183914 -174768 -50972 -55075 160251
16771 160251 239649 -19206 -27326 -82252 43418 103283 174509 267478 269125 132348 -247843
16760 -247843 -376522 -190746 -113252 -77080 -123898 -294115 -160827 251276 113989 -215607
16750 -215607 -215390 -169917 -93225 -97087 -60640 -352139 -360659 -272347 -146875 -95720 -117234 -232018
16738 -232018 -209916 -172667 -350087 -510839 -605993 -472433 -305520 -501112 -588219 -463020
16728 -463020 -570269 -605667 -603850 -446495 -275750 -224632 -156398 -200198 -114579 -157035 -356802
16717 -356802 -414569 -313657 -220676 -376721 -303832 -143660 -103326 -348570 -464935 -274828
16707 -274828 -21361 148890 268716 -168695 -278263 -227142 -306328 -189581 -96303 225546
16697 225546 335425 82436 -19725 -30272 -2298 10711 72327 124929 -55861 -139568 -128102
16686 -128102 -506661 -653698 -513640 -329602 -43603 -18675 -184665 -220265 -157489 -145982
16676 -145982 -215239 -230691 -89119 75417 5691 -216269 -233252 -200038 -177624 -292490 -448387
16665 -448387 -406297 -591617 -394940 -264866 -298221 -210813 58946 35082 -113408 -22763
16655 -22763 -63676 -272274 -252680 -228706 -140307 70325 337957 480999 288263 209989 33475
16644 33475 44918 138006 24474 -151189 46925 230194 137872 243804 273226 156709
16634 156709 60528 -80379 -41064 233443 259249 152986 177264 236609 254344 245378 199101
16623 199101 182132 96522 -246436 -258989 -159501 -266163 -304435 -290701 -186118 152430 179507
16612 179507 42786 -35899 -54797 -131465 -28505 211127 353287 414668 288274 288362 323820
16601 323820 121382 -77638 40877 -217212 -307638 -309708 -192761 -43981 -254265 -260242
16591 -260242 145740 293295 284275 207096 79343 116313 -123054 -240883 -54947 36673
16581 36673 172494 319535 426521 259962 206040 260176 351711 423699 267236 -62424
16571 -62424 -117176 76747 134461 -49340 9118 181456 -14307 -102252 107505 146275 81662
16560 81662 116865 199397 468305 462596 307412 400260 291454 172791 11185 -222113 16395
16549 16395 183495 -6575 -195679 -375964 -379454 -80865 -104596 -108025 -269538 -128291 103889
16538 103889 62682 -5585 -126010 -182788 -165696 -342704 -431340 -295809 -395381 -459293 -302986
16527 -302986 -317010 -90596 -25126 -57487 -31380 -43196 60236 24488 -103057 -184079 -262396
16516 -262396 -304074 -73128 232472 322620 388895 203988 279388 254131 266177 140741 -208400
16505 -208400 -374978 -396238 -30764 70804 -173854 -340640 -313613 -297103 -379678 -366475
16495 -366475 -389730 -447930 -354894 -418394 -407288 -310208 -193176 -46609 -210867 -257987 -42297
16484 -42297 176949 412310 351469 170023 38294 4672 -225723 -336085 -241589 -280437
16474 -280437 -198325 -31563 138477 -8272 -233607 -327248 -329604 -152920 -127401 -38150 280267
16463 280267 411182 269592 224377 11892 -42756 -17988 75562 -18303 -55876 -159224 -129227
16452 -129227 -36520 -148363 -308852 -180522 -255280 -311354 -1826 35906 1726 21466 -12592
16441 -12592 -34053 -14048 163982 391918 499666 427633 124859 -57815 -26459 94 135428
16430 135428 2244 -168076 -175737 -124671 -56217 -105991 -136379 -42346 -156856 -356755 -389363
16419 -389363 -460450 -224070 -274088 -306153 -391853 -485047 -429242 -106739 -60804 81298 53459
16408 53459 -194929 -421818 -224812 -52607 -151749 -297551 -425849 -474939 -497257 -428857
16398 -428857 -91862 -19638 -180822 -401989 -459237 -489330 -394448 -200406 -136344 -60364 -116381
16387 -116381 -134965 -110916 -227034 -110220 -29357 202314 109169 163833 226490 165813 43988
16376 43988 -245812 -252836 -193172 -355149 -66282 102048 -145059 -258316 -181203 -111926 -253468
16365 -253468 -284231 -168994 -98310 -4662 29076 -36158 50072 -85424 -226564 -422339 -465232
16354 -465232 -288991 -235235 -216223 -23442 -1888 -276538 -311127 -104660 111121 214942
16344 214942 307849 179471 331804 435331 232699 40577 139552 97344 297716 302924
16334 302924 44271 -73103 -404758 -565114 -550788 -218083 -15269 -16252 36485 -165973
16324 -165973 -74301 -63822 -124860 -62705 16012 14175 -54639 125030 290218 119012 -145199
16313 -145199 -7079 204786 274754 451177 263301 -98576 -238142 -214122 -249295 -190527
16303 -190527 -314800 -446966 -415275 -190810 97570 163613 -32248 -178662 -256039 -363652
16293 -363652 -268119 -163303 -61222 -431785 -487091 -189388 -126108 -277241 -125057 -147628
16283 -147628 -139983 -244804 -381409 -312726 -267859 -192641 -62787 -17308 -52865 -118208 77276
16272 77276 58108 -19155 -27201 -333730 -694582 -616184 -334590 -415310 -347882 -18216 112113
16261 112113 -120343 -70061 -201633 -163665 -108913 -232500 -62277 -91290 17931 140616
16251 140616 143660 52328 -87999 -158609 -156323 -96547 -202441 -155605 -81200 -45418 -36995 -114732
16239 -114732 -19148 80371 -16428 -1757 -122984 -294334 -411383 -329367 -144972 -348005
16229 -348005 -212928 -34648 82612 108894 -255224 -322747 -80881 141883 132843 -219767
16219 -219767 -183736 -67548 -12827 -166861 -204522 -74833 -156436 -415484 -488160 -430093 -308848
16208 -308848 -262375 -301558 -353843 -338059 -196339 3248 30863 27776 19921 92223 49239
16197 49239 -308699 -369543 -196739 -84824 -138458 -287322 -88619 112253 -35362 -200481
16187 -200481 -333165 -388197 -23003 19558 143934 247646 275859 155789 211507 145075
16177 145075 30235 -293770 -525294 -174166 97931 92707 177638 126308 -23267 -63696
16167 -63696 -80973 -141266 -18254 136728 493661 356273 -38018 -230168 -195400 -169964
16157 -169964 -232122 -328251 -181512 -25093 171572 312201 345876 476734 491835 489250 273125
16146 273125 231820 178977 143709 349276 99599 -109751 -26399 101791 153267 356
16136 356 236255 280451 218329 100925 82977 29572 67299 166869 238454 236249 130533 12202
16124 12202 -53109 105642 -8767 -21138 -14273 -238900 -352617 -313706 -250537 -136255 -409822
16113 -409822 -590928 -355090 -24835 23219 -7651 44197 -215355 -481920 -498827 -528032
16103 -528032 -487973 -239768 -172879 -7514 -119849 -101248 40930 -1703 -127639 33328
16093 33328 109312 50760 -17946 -144026 -214120 -102531 -101754 -194113 -283651 -141894 -184450
16082 -184450 -159825 -41426 -309319 -219054 -131189 -36869 -38170 -47746 384 -35384 -220259
16071 -220259 -164087 18952 -104327 -187933 -76923 92396 208285 43718 -116394 50496
16061 50496 213041 -37723 -168754 -311431 -409206 -349621 -115666 141849 228291 327087
16051 327087 220483 270512 149981 85262 194846 192284 213282 134206 -87600 -121926 9630
16040 9630 214247 90664 -50356 -30641 -98375 -259299 -284367 -89116 -217109 -327802
16030 -327802 -304125 -226547 -352098 -686881 -581108 -304850 -354539 -240394 -111838 -37044
16020 -37044 -259388 -338414 -227267 -250068 -291425 -327955 -35919 260150 321272 -87130 -205466
16009 -205466 -261951 -76813 227757 94905 -462230 -412093 -138250 -167820 -220752 -302660
15999 -302660 -257017 -118175 -202883 -102895 6961 -33134 -37006 64403 109676 159205 114504
15988 114504 168236 412924 387673 259383 79723 -16202 -48190 -53979 -62957 -156203 -194146
15977 -194146 -323503 -363062 -158467 -215911 -305542 -153015 -78294 -40816 -68692 -14631 156904
15966 156904 244093 173644 -145549 -441280 -238333 -93839 37182 -60660 111243 122207
15956 122207 144322 259698 249592 118551 -81468 -69396 11417 -144424 -311252 -336725
15946 -336725 -275657 -73943 -44399 -60426 -185664 -174754 -228531 -308579 -410067 -345431 -185217
15935 -185217 -94362 -76965 -264882 -347288 -136022 -297144 -144233 -8634 -76226 -11497
15925 -11497 83151 417276 505679 421319 299962 255953 406228 246016 -185974 -599327
15915 -599327 -462530 -373904 -330809 -265247 -122401 19511 272308 542162 411665 257523
15905 257523 -17441 30050 390276 459714 463273 365213 356004 47192 -51884 -31626 -5263
15894 -5263 133551 207708 93543 12481 133583 -9045 50752 117692 -65823 -234956 -193636
15883 -193636 -262033 -471495 -346463 -256186 -174827 -237940 -212619 -224149 -350398 -253603 -42667
15872 -42667 150399 74657 31428 -283436 -454220 -447154 -498542 -449644 -185032 -3785 6533
15861 6533 91141 -6658 -71605 -314502 -560545 -561914 -327552 -98419 143763 173403 -25426
15850 -25426 -87467 -166471 -87452 -110744 -147746 -118181 14749 92662 -6066 -74313 -146669
15839 -146669 -31559 16463 -148399 -122814 -261379 -359367 -493894 -468846 -235228 28632
15829 28632 -23422 -52827 131209 164601 85927 -36345 39157 153037 73576 178272 218790
15818 218790 186973 225827 181621 140430 179935 245124 222621 44802 12577 -145725 -321279
15807 -321279 -301524 15588 -22333 -48743 -187907 -125120 -327240 -472995 -286873 -189647
15797 -189647 -60792 -9226 166848 236615 -25698 -136230 -283965 -269137 -415092 -278155
15787 -278155 -235206 -338601 -331099 -240469 -234682 -300945 -368789 -483113 -383415 -72386 -136474
15776 -136474 -275697 -353062 -126494 -30003 280505 147763 108711 51992 -16564 -61600 -302410
15765 -302410 -297269 -199071 -189011 -395185 -336205 -300330 -371611 -330145 -292905 -487453 -513173
15754 -513173 -427899 -489339 -402607 -288822 -215859 -71778 -189902 -107808 48602 187088
15744 187088 211004 180643 31706 -162583 -239077 -148498 -7263 -131421 -144322 -50469 -255492
15733 -255492 -303074 -134684 9825 -4721 -136256 -83858 143614 29379 134828 272952
15723 272952 -31144 -233820 -224426 -73446 -118434 -51062 -120374 -160582 196382 128349 80710
15712 80710 239992 241239 -109563 -460476 -394660 -298381 -110977 -231082 -366074 -662090
15702 -662090 -992872 -950383 -392181 -209994 -119993 28313 -45014 -358825 -225157 -49060
15692 -49060 -303851 -398666 -257849 -234725 -346257 -238361 177444 205635 296875 353114 369275
15681 369275 389226 458439 348444 207355 166232 85927 236078 603297 536399 262722
15671 262722 -15596 144791 23359 -109527 -64103 -197539 -428384 -454859 -483849 -174132
15661 -174132 -463 51340 -399537 -432038 -464569 -393911 -171279 61461 153183 -25182
15651 -25182 -69100 22092 -3779 52076 136635 -19240 -323674 -319616 -14938 141268 367068
15640 367068 569088 266275 -153074 -259792 -313056 -310493 -305721 -582982 -600296 -451947 -417353
15629 -417353 -320742 -438119 -428586 -331570 -154862 -275236 -268644 -94906 123393 145127 46004
15618 46004 -69765 -177017 -157791 -310820 -217914 -50133 -70145 -108073 -193283 -413397 -290262
15607 -290262 -17424 -147880 -330175 -99871 211907 169795 -83923 -77873 160065 250983
15597 250983 202027 123062 5846 133719 158781 -60013 -110377 -176454 -16889 -75952 -102156
15586 -102156 -321655 -391559 -22717 49503 135410 471453 471217 217766 46132 151806 -146738
15575 -146738 -249344 -190771 -488626 -461885 -200424 -80765 -139986 -163750 -371602 -369290 -308031
15564 -308031 -259733 -35925 223635 42330 40 -34401 128110 444245 537445 296380
15554 296380 18110 -42776 -103450 -35308 -12214 -151151 -32867 -36887 -254766 -414392 -233283
15543 -233283 -43611 79661 48238 -59793 -39057 -69366 -7647 81186 68252 51058 -185714
15532 -185714 -373921 -149862 -4194 -288221 -342267 -257815 -286286 -331456 -198028 -50460
15522 -50460 254408 292357 326220 359283 350515 170073 94593 -165824 -129386 -187876 -169127
15511 -169127 -198537 -18589 -204295 -410333 -255269 -12694 32118 24329 21675 7770 103830
15500 103830 -128939 -123854 -143232 -370366 -314269 -12372 259985 305600 166526 5160
15490 5160 -150990 -288614 -335719 -289127 -147052 -324111 -352241 -319912 -374350 -207077 -132687
15479 -132687 -187047 -37416 129804 334596 113533 -112484 131521 179563 -49667 -84401
15469 -84401 -127366 -301187 -145053 263656 452417 365311 376520 278405 239684 272500 202936
15458 202936 310401 291704 158645 3383 -112245 -240181 -334417 -347542 -194954 -15209
15448 -15209 128431 177681 372956 490465 235241 176706 251482 219132 424543 231266
15438 231266 260818 277306 317243 344673 318922 33812 -61973 -6388 46545 306863 184953
15427 184953 -141754 48129 -229855 -347032 -249630 -221193 -267212 -150275 -26830 3754
15417 3754 -125079 -280960 -166261 -128208 -44603 -68653 -82534 -45629 65245 80688 -23370
15406 -23370 -98639 -54115 117055 182103 -34325 -401626 -449863 -171019 -112242 -98441 -177709
15395 -177709 -80835 -68181 -76527 -130762 -208156 -372245 -286469 -173413 -260874 -257578 -228608
15384 -228608 -115310 -45253 -55636 -71106 -107584 -237562 -329962 -206893 -117209 -157670 44820
15373 44820 -163190 -375726 -606173 -508085 -163537 57251 216957 35020 -207528 -222651
15363 -222651 -307235 -378060 -438584 -374052 -315052 -298503 -261154 -219374 -355311 -512731 -521461
15352 -521461 -419093 -124991 -98815 -316930 -524573 -523612 -215809 -29396 184787 241345
15342 241345 242318 -5086 -360117 -595751 -475837 -464896 -381293 -212041 -107906 -281341
15332 -281341 -223455 -318127 -258817 -244566 -291265 -60137 11593 -135500 -96465 -147250 -305883
15321 -305883 -366364 -357228 -84763 108770 152188 183538 64317 114128 110694 35484 197230
15310 197230 143675 11343 -90883 -147333 -249313 -324696 -192563 -233639 -26492 -69355
15300 -69355 -115890 -87198 -79340 -875 -154715 -269654 -139516 -53972 -151773 -86292 -298850
15289 -298850 -387176 -121213 -19191 -195691 -101854 -61082 -260900 -196463 -16697 -108216
15279 -108216 -140080 -95597 21847 62713 237270 125890 -118066 -42237 86950 234237
15269 234237 178408 5359 69341 202157 88031 -168882 -289587 -160817 -104584 -55576
15259 -55576 -43715 -234401 -188845 -244296 -239140 -76297 69606 52130 97079 13620 124894
15248 124894 177263 -161727 -266848 -80940 35475 118827 166236 263055 109129 -45774
15238 -45774 -30086 -31274 -36992 -264427 -227284 -290717 -266396 -390799 -522609 -452193 -319373
15227 -319373 -219789 -150397 35824 83951 196694 139277 -67339 -191325 -179763 34764
15217 34764 196112 -192465 -453892 -397493 -299154 -242886 -278147 -115839 -35185 -160629 -104012
15206 -104012 47667 93768 -54483 -337624 -228892 -43285 -154500 -163298 -299196 -288749
15196 -288749 -320009 -366422 -374170 -35254 -12827 190687 99959 38727 222443 195034 147821
15185 147821 63482 261411 36503 -132551 -84533 -116674 -144001 -252064 -210755 -98838
15175 -98838 -268369 -296654 -192755 -483872 -543438 -598906 -562654 -445575 -447636 -327160 -174671
15164 -174671 -263133 -366138 -256562 -150342 -59087 -58518 -88639 -71528 -222609 -153805 -308828
15153 -308828 -361114 -304715 -230841 -327418 -301860 -158458 -132087 -43743 24921 39828 103990
15142 103990 39918 -238498 -457839 -579789 -408209 -198564 -26460 26127 119857 17558
15132 17558 -120224 -55712 103393 227723 72603 -172502 -214161 -10162 -97783 -229303
15122 -229303 -25452 34459 34156 98813 234898 160687 154893 26873 -130524 -334561 -244509
15111 -244509 -211740 -286932 -223964 -86253 94470 159342 316438 252964 178571 136691 24642
15100 24642 -485 344167 439048 122602 83755 92377 -50007 -91229 3020 89315 23448
15089 23448 -18374 -34397 -188340 -203855 -139882 -6982 330431 310871 264511 163686 35702
15078 35702 163524 263181 33364 -60180 -185127 -549834 -476538 -478458 -571863 -663123 -632589
15067 -632589 -280605 -53216 -87280 -153388 -218504 -293344 -289948 -257237 -135576 -260831 -229198
15056 -229198 -438025 -401190 -251076 67980 141800 12159 -93384 33026 -28953 -115286
15046 -115286 -100647 22520 15937 -82011 -116909 -18192 58674 -4880 27993 -133091 -148166
15035 -148166 108843 434518 414870 342354 204877 153548 22463 -38853 -124195 484
15025 484 88770 56484 62979 104925 138508 82529 -63151 47555 -8954 126856 56686 -45330
15013 -45330 -161424 -98421 -81723 -59826 -33113 66043 46924 -107478 -59472 27832 -119067
15002 -119067 -166919 -120579 -388733 -334913 -103867 -277622 -58040 -169429 -211576 -286743
14992 -286743 -138850 -269063 -46647 -103090 -11608 45218 99438 -68520 -256808 -256642 -9093
14981 -9093 200003 277915 319395 411022 28498 -24325 -207152 -234398 -266614 44947 206311
14970 206311 139583 226623 178651 -57231 -231982 -131453 52377 -26916 10799 -99080
14960 -99080 -345216 -169193 177875 200097 -162727 -405657 -343331 -297408 -171426 -63720
14950 -63720 -108830 -73605 208004 158979 28775 130623 303537 602843 699732 383916
14940 383916 153292 107752 191687 233977 99773 170117 167139 -59219 -144731 6307 173680
14929 173680 206726 157405 123099 192596 32220 52384 241922 187646 53552 -187867 -193202
14918 -193202 58740 285275 142655 -20862 -378969 -328083 -217921 -32309 -81367 -258729
14908 -258729 -433223 -563176 -472528 -102270 60271 72302 157249 343945 232207 3111
14898 3111 -168496 -134109 50328 34981 61516 47744 116172 -80899 -237568 -17643 218933
14887 218933 186902 61130 -182712 -479017 -173828 142469 124235 -174714 -405604 -166936
14877 -166936 -188507 -112425 16055 206675 205295 213711 208152 64246 -96705 10909 162245
14866 162245 111652 110827 -88447 -153 -75371 -19997 80327 -212120 -443532 -353576 -185019
14855 -185019 -71587 76713 25397 6197 -187772 -57179 -45599 52424 25810 215237
14845 215237 100717 -43476 -32881 -138224 -129212 -133275 -87572 -284961 -245320 -14558 30432
14834 30432 163700 -13265 44206 91114 -24330 -265269 -170623 26726 -276199 -366142
14824 -366142 -153345 -290165 -186725 8752 -49796 -146169 -338407 -426847 -351226 -476656
14814 -476656 -165430 -169294 -444152 -385270 -138743 -147106 -412493 -460886 -599692 -732301 -693602
14803 -693602 -615725 -539366 -630073 -601347 -401441 -128769 -213583 -297175 -222858 -147882 -80536
14792 -80536 -53098 90269 192167 204337 251430 81547 84924 210805 159396 24725 -159897
14781 -159897 -241490 -26162 86802 64066 -191717 -168237 45090 253334 225520 87458
14771 87458 -93694 -453204 -650503 -754822 -651952 -163084 64695 -90415 -84520 -78463
14761 -78463 12006 -31996 182143 326669 377873 122036 -4736 106043 107087 268206 227287
14750 227287 -8338 -284638 -262862 -148296 -190818 -110655 -108731 -125859 -30246 -217606 -631220
14739 -631220 -822190 -335268 98523 94368 -38291 -161000 18209 44408 140838 270474
14729 270474 356939 435339 65506 -142677 33577 -121522 -239328 -205612 -189114 -116959
14719 -116959 -38420 -90944 -41335 90361 54446 -162400 -208472 59141 -74308 -192118
14709 -192118 -135781 -290127 -191505 -87284 -18148 -185103 -221193 -40793 25609 -231807
14699 -231807 -220830 -19654 118834 92586 34078 214434 122726 12492 -3298 114875
14689 114875 34049 162861 393910 282556 156945 143657 -74342 -49354 291483 341155
14679 341155 345895 252137 396032 354138 60675 -116119 -86489 -150007 -199053 -633206 -849174
14668 -849174 -772391 -587100 -633968 -534702 -180880 -160175 -204063 -130351 20302 63054 70738
14657 70738 -127269 -210312 -70202 34180 -120452 117092 281472 251163 95694 86334
14647 86334 9849 -1844 -88414 -16880 -16821 99327 235851 30340 -150899 -323273 -45745
14636 -45745 -108857 -319964 -183857 117133 180034 -100114 -255934 -273746 -426462 -256498
14626 -256498 -51814 62334 -342818 -554412 -545640 -270212 -56480 -51254 -24451 27895 -98764
14615 -98764 -492822 -706812 -628943 -379364 -236068 -294045 -462879 -649856 -561707 -247037
14605 -247037 -42182 105633 204939 138311 251260 104647 58931 83874 102867 83452 44953
14594 44953 159510 113309 -60434 -96261 -164036 -5797 263322 230849 170645 182437 181719
14583 181719 -27044 -176870 -101492 -64247 136537 175978 -76560 -242379 -210739 -201420 -239864
14572 -239864 -265088 -152522 -23105 -53296 -43214 -62768 -15589 2348 -144591 -200961 -325440
14561 -325440 -495992 -377891 -235241 -31825 245833 153505 213727 131175 -3194 -28615
14551 -28615 -115902 4827 57426 269343 99907 -13274 142846 144594 -59520 -16114 -181567
14540 -181567 107132 76157 -31648 172984 574769 423187 404678 126675 -1694 231226
14530 231226 480339 176338 74096 180700 81931 -147734 -260150 -199876 -56157 5602
14520 5602 -40406 -54659 -227996 -63937 214899 338135 361995 138530 23013 -85063
14510 -85063 -241702 -285221 -286641 -401858 -311402 -152171 45904 -89077 -304057 -447939
14500 -447939 -311194 -325674 -400056 -189550 -227605 -133147 57102 261397 357949 200837
14490 200837 261822 -157285 -219052 102435 -11861 -23243 24050 -142658 -173667 24569
14480 24569 119277 122225 -138007 -242675 -65331 225069 242945 153054 -3110 -188259 -207220
14469 -207220 -210554 -191741 -54646 38932 -83271 -269483 -119360 27866 24552 -11436 151585
14458 151585 86447 12322 67722 -21062 -45335 196421 225660 148344 -69838 -249178 -369074
14447 -369074 -533914 -255371 62402 275114 74915 -58779 -122109 -260806 -126321 201774
14437 201774 162315 90380 78137 101567 65253 190849 101116 -53493 -165015 -217168 -382900
14426 -382900 -211452 -108005 -95009 -3334 71123 79116 -72495 -348159 -482123 -511005 -451015
14415 -451015 -348932 -352789 -212009 -391153 -461389 -479832 -508537 -616051 -406634 -283208
14405 -283208 -431353 -555334 -538422 -441990 -364504 -205115 -267978 -271965 -77267 -63618 -27347
14394 -27347 188915 -88127 -279059 -98396 -49259 24194 -42 -189047 -336523 -222252
14384 -222252 -135796 -31212 -87068 26408 117889 21156 -64304 -125578 17436 240501 327074
14373 327074 223248 66267 -74657 -169859 -244058 -138915 -396831 -326075 -224286 -271702
14363 -271702 -369701 -284668 -144754 -156174 -218922 -117642 -330660 -565786 -406025 -301962
14353 -301962 -354121 -166417 -211498 -297673 -370815 -420238 -183835 3610 -70780 -20558 114494
14342 114494 106774 253511 200102 -96147 -45539 -60054 -107189 217565 82141 -15237 164009
14331 164009 -5762 -112943 88868 357759 313853 104739 -83506 9987 99584 -89564
14321 -89564 -102696 -156856 26631 83489 87520 166180 286326 75847 -143073 -21794 -229356
14310 -229356 -343361 -145985 -54902 73838 -4492 31194 -26494 -123652 89126 162639 129649
14299 129649 58966 -293461 -370970 -341899 -572330 -373389 -259067 -379545 -279878 -61245
14289 -61245 -21810 -193653 -89898 18275 -96916 -109742 -189521 -33808 101770 -6240
14279 -6240 -74067 -82334 -142490 -229295 -292582 -299740 -176321 -95604 -67798 -162891 -67373 -31665
14267 -31665 -122033 -209616 -506828 -473380 -407431 -358613 -339457 -465840 -277746 -90546 -16245
14256 -16245 25706 76130 128113 7932 37464 -114082 -262745 -199332 -16314 169164 578745
14245 578745 767010 520515 297397 92679 108519 104603 -153860 -359702 -101987 14750
14235 14750 -165030 -389456 -683964 -673031 -590788 -729881 -711512 -295253 -119612 -124571 -94862
14224 -94862 -7193 -53645 -322483 -328355 -150146 -19252 -168373 -51579 120492 39946 52315
14213 52315 -61521 -407054 -358547 -261161 -57375 -146467 -319140 -347063 -268824 -369260 -585169
14202 -585169 -580315 -136098 196647 284637 36938 23008 286097 129552 46609 102343 146082
14191 146082 34737 16222 148270 220675 78632 128726 -95762 -152358 -134946 -99700 -49622
14180 -49622 -161701 -290913 -257823 -211643 -371011 -258582 -170767 -293319 -138048 -213742
14170 -213742 -383472 -509265 -383261 -194759 -300120 -509396 -631506 -462143 -112859 48982
14160 48982 -110714 -304569 -266011 -291067 -484510 -318993 -49309 149888 200733 214646
14150 214646 208142 75392 22997 -151988 -229341 -148378 -32665 -17696 -52763 -20725 271137
14139 271137 156379 127443 136263 211362 191857 12485 -185752 -319393 -419004 -201464 13509
14128 13509 170275 385808 301413 267704 236216 204293 271854 300477 282562 218140 216933
14117 216933 161302 376638 147597 132117 158317 52865 -48242 -173969 -228053 -178594
14107 -178594 30306 176583 330814 131444 20381 -231276 -261054 -226483 -354535 -218347
14097 -218347 -252084 -374066 -365287 -201263 -104600 54299 -71272 -154290 -270317 -286849 24259
14086 24259 122935 39435 -58290 68826 136020 135077 -11222 -129311 32234 40682 106397
14075 106397 55126 -9966 -236548 -231935 -187369 -61557 -21594 -145733 99195 149124 -18414
14064 -18414 -13087 -119703 -245615 20543 364064 565047 463426 279188 25190 -254940
14054 -254940 -281486 -331060 -309585 -259830 13576 73844 301882 214766 72208 -321 -171131
14043 -171131 -180929 -275388 -440203 -244264 -44612 -247035 -401005 -467985 -356411 73410
14033 73410 237927 288541 255488 10292 -120520 -200336 -220508 -138246 -248568 -380557 -396743
14022 -396743 -167971 -255142 -392834 -344738 -79193 106784 -34095 -278159 -153469 205483
14012 205483 190181 69795 -49275 -416877 -298599 -55906 110864 25756 126277 256300
14002 256300 206241 145435 -92427 -403494 -588796 -455847 -612947 -248413 63442 -60686
13992 -60686 -120288 -37047 -178954 -215494 -204408 -437513 -446127 -174207 37890 -49120 -162517
13981 -162517 -240487 -154536 -57773 -82850 -158902 -390716 -316699 -68647 118099 -87852 -164689
13970 -164689 -87837 -66510 171909 195649 -74391 -411220 -457193 -222751 -45742 186848
13960 186848 222308 278159 167100 -185867 -424086 -348293 -205036 -242159 -341292 -336148 -439599
13949 -439599 -581581 -592198 -316268 -178398 -204655 -397360 -548687 -440593 -301910 -316728
13939 -316728 -164026 -176209 -48650 -68390 -104222 -109857 -91829 -67183 -58299 -190355 -273979
13928 -273979 -494521 -540645 -287199 -290042 -403919 -288999 -183986 -317911 -445498 -239488
13918 -239488 -163332 -49940 -105222 -146181 -148718 -28143 -86801 -238852 -295703 -284037 -160035
13907 -160035 -245463 -259771 -199092 -32220 34969 65377 -60750 -125186 -64220 178835 189200
13896 189200 36876 422503 693918 527016 541767 556531 277930 43221 -6121 -184178
13886 -184178 124531 424477 427605 189448 118115 -96462 -334337 -146368 100043 75991
13876 75991 17786 81566 135763 257743 254667 172848 114751 55671 148948 269052 156510
13865 156510 -43414 -157681 -19210 33754 67205 66616 -63813 -81727 16619 -25220 97126
13854 97126 -28044 -146813 -64032 -156137 -383230 -436279 -363338 -520352 -763956 -723073 -591230
13843 -591230 -499183 -516187 -274018 91360 -74593 -182758 -168273 -33845 -84007 -52736
13833 -52736 117634 205981 27472 -187094 -235806 -128272 -192114 -4491 149377 290676
13823 290676 298478 337770 326347 129601 70525 60539 51685 185751 437456 647057 558725
13812 558725 141092 -80820 15523 3878 -75300 -123464 -69841 -63054 -46598 -108522 -77772
13801 -77772 -16873 -120837 -264094 -434901 -281586 -263007 -426174 -402856 -219501 -112859
13791 -112859 -196292 -219199 -39075 46779 84303 142517 118439 -43570 -65654 64187 248073
13780 248073 329558 191014 121951 107020 83484 69681 59671 -39949 -31975 91028 187840
13769 187840 33246 -112792 -233168 -117903 131897 269055 476443 335739 208336 -65089
13759 -65089 -91454 -371283 -685055 -580773 -545141 -672937 -658285 -301898 -42552 66419
13749 66419 98959 -234252 -400283 -528761 -423731 -295943 -301817 -286702 -234070 -170619 70086
13738 70086 -150930 -346077 -494722 -508441 -442931 -471013 -748703 -531657 -228853 -262943
13728 -262943 -144575 29414 -251849 -245950 -137081 -109623 -318205 -314292 -173966 -115674 -26105
13717 -26105 143441 253157 191126 83725 108217 158904 276512 176197 226616 143615 -97526
13706 -97526 -92337 100176 67895 -82308 -258540 -210910 4223 2195 4613 -284251 -270809
13695 -270809 -144254 -147543 -21417 16438 20956 103084 117513 -49675 -182176 -69301 62947
13684 62947 -22798 -141038 23934 200818 229793 377268 326649 346488 445985 393189 139696
13673 139696 -66797 -174613 -186236 -140685 -209844 -298726 -359365 -296378 -252733 -291588 -364038
13662 -364038 -455941 -276711 -177538 -276732 -330154 -115054 -26880 104855 8335 -749 114347
13651 114347 184483 10441 -112414 -93819 -177678 -126896 -136131 -80871 -170960 -219789 -401072
13640 -401072 -478171 -281263 -168520 -140652 -14394 -160079 -248730 -169648 -404013 -613704
13630 -613704 -305421 -165295 -108019 -209307 141981 137250 -92737 -89506 -31232 91578 -42980
13619 -42980 -9100 8079 -26778 222220 296672 252717 240735 482997 358715 -16912 -41120
13608 -41120 143621 194449 139904 256931 408958 329569 363792 105929 44681 169203 -24015
13597 -24015 -263372 -345952 -409790 -299772 -166022 -39248 92066 234814 -176193 -414778
13587 -414778 -398024 -286836 -396404 -404639 -224852 -22411 134434 -48474 -57323 -106526 -104489
13576 -104489 99194 73717 -115490 -411962 -494236 -29209 61721 -26329 -252073 -213978
13566 -213978 -204363 -101246 -145401 -175530 -144181 33213 133278 -16856 -115600 34888 195461
13555 195461 40951 109330 277881 361408 141686 -72399 9250 -20139 -60956 -95685 -175267
13544 -175267 -59440 138271 316446 182870 20099 295666 329957 74502 119814 234502
13534 234502 210125 60047 46863 149069 -36429 35292 204596 243821 316613 45987
13524 45987 9358 246215 319582 285835 118447 -29877 -32808 298920 541052 365405 179509
13513 179509 48597 -61804 -238572 -241668 -18799 -189411 -310415 -217914 -143077 156585
13503 156585 244577 380848 361416 70674 -246251 -41473 136644 37748 -169109 -222828
13493 -222828 -76568 -6202 201189 147909 80424 252130 392152 414400 60696 68804 278915
13482 278915 200253 65059 -10928 117039 203365 44530 -24152 49877 249105 71271
13472 71271 -252576 -456537 -451270 -209360 -339104 -264185 -189631 -247676 -67274 120615 91580
13461 91580 137439 95557 45850 218110 407858 445523 577787 574135 379317 374314 221419
13450 221419 -30478 178760 370344 243953 182949 290973 460830 458407 30709 -143720
13440 -143720 -117867 -17817 204331 298681 205545 -25305 18064 70743 115066 127948 -25178
13429 -25178 164999 375521 167715 -189386 -280137 -390694 -235246 -172677 -293020 -227989
13419 -227989 -51168 130045 153804 -30286 -172439 -546738 -581371 -368455 -376811 -498224
13409 -498224 -471025 -107393 -59402 -62090 -174345 -368074 -355469 -263831 -553245 -524577 -555895
13398 -555895 -610291 -342803 -12197 120150 -46308 -302306 -279971 -81486 -110406 163122
13388 163122 82295 37009 -48529 54371 149558 -2868 -46539 5665 44002 208985 233858
13377 233858 409895 472091 316935 313294 308734 506045 477200 244638 -46680 84878 50837
13366 50837 -106429 -162419 -200812 -89704 23319 309278 212576 271936 44722 -125607
13356 -125607 -87927 -8716 16263 -178515 -321832 -449001 -425344 -349753 -299787 -111653 -139025
13345 -139025 14873 56667 37782 209509 143963 -145125 -3058 106336 63966 21642
13335 21642 207217 508331 556506 600661 583067 204091 54688 237938 16309 -136656
13325 -136656 -100063 181289 287558 322548 270593 290580 195621 86418 -4129 87311 -70932
13314 -70932 -265457 -254638 -211070 -367164 -173175 -65293 -21835 -339735 -329275 -392581 -344159
13303 -344159 -272956 -164319 -149213 -423004 -355456 -317455 -342977 -321919 -226687 -242118 -102990
13292 -102990 -199984 -402106 -81759 139554 247469 197427 -27349 -169661 -127293 -115519
13282 -115519 -284766 -350244 -431551 -334351 -373596 -222670 -155148 -112550 262329 433372 346691
13271 346691 328237 65252 58514 93388 180706 58209 128921 34459 -239197 -28607 -87678
13260 -87678 -241486 -160664 -77293 -130274 -106039 -18216 -36319 -154863 -467843 -218649 7587
13249 7587 -51075 -156756 68758 244977 116102 -95030 -94820 -197354 -316391 -122596 -62455
13238 -62455 -23913 140848 211691 130032 77797 -94213 -54990 194893 277813 100832 112576
13227 112576 -9450 -90806 124949 41121 -15602 203640 234446 44166 -272579 -436973
13217 -436973 -547016 -306161 4282 -127234 -26466 227420 326567 234457 165732 63413
13207 63413 82027 -101220 -123972 42713 -69667 -114955 52794 467364 305212 161994
13197 161994 26076 -160975 15054 233719 29344 -52802 -32732 -207593 -178596 -28823
13187 -28823 237369 120408 187858 73972 -120914 -154287 -144093 -354060 -406904 -182746
13177 -182746 -78797 -182533 -291859 -127791 -147843 -63682 -475228 -596004 -512374 -572122
13167 -572122 -328632 -330256 -399465 -286665 113418 288420 187496 346681 308030 -64133
13157 -64133 -244247 -261885 -187562 -68 20826 133656 54376 163329 242015 -21361 -384295
13146 -384295 -339668 -276720 -181623 -33655 -16338 59863 -87400 -94510 -100156 -30687 5319
13135 5319 -10915 267955 203032 -66703 -118039 -113559 -272231 -423607 -167888 -147609 -60868
13124 -60868 -382886 -562479 -578343 -637702 -299325 11486 137345 233511 231717 67858 -41675
13113 -41675 -161262 -128720 -15680 -276765 -172598 -181408 -135897 -301266 -300204 -177091 -180213
13102 -180213 -42577 28637 109202 186979 149602 47053 121491 4517 -164928 -352517
13092 -352517 -385287 -193188 43278 90763 -39685 40251 154612 214171 47100 -12557
13082 -12557 -9212 -34924 -138221 -116595 -126722 -127484 -141837 71676 38823 -127848 -182034 -28585
13070 -28585 146656 284967 193670 -185420 -273255 -225903 -190157 -230900 -33139 199880 201283
13059 201283 148120 285566 96682 -115757 -211182 -203426 -202841 -230247 -122341 106924 123640
13048 123640 50249 -100672 64375 -84309 -161581 -86976 -227461 -132393 75830 169787
13038 169787 -63998 -174888 159331 298585 374436 223658 -112823 98052 246307 37256
13028 37256 28163 140633 -59272 -346930 -203505 -62500 -213636 -377338 -313112 -143748
13018 -143748 137918 156361 -17769 -367647 -522817 -465433 -61959 5593 71170 27706
13008 27706 41442 111044 190739 381356 457345 546431 351168 263011 368962 261047 -10798
12997 -10798 -40138 91334 -173130 -297121 -157088 5839 -2244 191095 332277 311859
12987 311859 218511 -1068 -13850 114310 251140 182892 -67467 -232897 -287058 -346190
12977 -346190 -293421 -227934 -119905 -146218 45743 57212 112884 -247510 -501292 -323661
12967 -323661 -159199 -126607 -303785 -480835 -409552 -57884 51286 -236595 -231675 -265480
12957 -265480 -360428 -298738 -463928 -639472 -450890 -167185 -284953 -246632 -314638 -340214
12947 -340214 -277743 -173557 -137116 -94589 -53484 -230774 -233025 -92807 37334 236962 218445
12936 218445 142720 -210310 -303218 -268209 -72017 -110552 -126759 -154944 -104725 -185986 -288430
12925 -288430 -211832 -102756 -94793 -90720 -158263 -80784 38945 6495 22494 -180183 -171031
12914 -171031 -173209 -25445 -144776 61748 83514 -43750 40075 287273 89639 19391
12904 19391 199414 141939 60191 -95539 -199847 -252237 -283468 -354230 -116041 98274 91132
12893 91132 -368667 -351147 -388101 -278733 -131565 -793 147803 316435 197712 -12071
12883 -12071 -276231 -226562 40739 70959 -131226 -206315 -221710 -247687 -224074 -162601 -79478
12872 -79478 -194929 -83058 24915 326963 178249 -41642 -9293 -84728 -161749 -281279
12862 -281279 -244163 -382620 -425509 -407023 -318236 -154546 -200438 -304950 -300919 -129639 75464
12851 75464 136082 -35409 -74179 83587 78237 -30710 6115 135517 -35383 170574 205557
12840 205557 51308 22318 129785 98242 -76541 -136142 -92418 181082 149079 259747
12830 259747 205253 219 -89110 56600 212809 139149 240555 193064 -14139 -60444
12820 -60444 39045 111841 -94210 -301232 -225907 -386577 -308978 -93126 15273 52822 19338
12809 19338 127655 212267 378104 316366 137806 -28618 -48630 204864 447299 769347
12799 769347 683226 572074 497718 328666 321384 473985 359536 169759 -29503 -56992
12789 -56992 57750 38245 234282 347056 196268 220195 331118 478659 260809 233644
12779 233644 324057 9634 -67330 -289518 -133305 269957 224100 147740 287048 207495
12769 207495 212352 8015 123132 199147 68235 135683 -111543 -60700 71052 69268 31299
12758 31299 35714 -41341 96232 187421 -116036 -189952 -33548 538 -186728 -386483 -291542
12747 -291542 -104971 -2797 62669 -124703 222389 480873 343649 160328 1364 -27907
12737 -27907 -19800 -59105 27341 139349 242801 -184265 -284951 -252022 -57935 -120439 -51549
12726 -51549 123849 -30542 -150176 -135289 -44730 -14016 71734 65419 294924 575503 219175
12715 219175 -182390 -21731 233425 401143 256789 256774 66844 -139661 -177600 -93645 102946
12704 102946 224796 92439 -40872 -52877 329638 530437 418934 367951 138821 278235
12694 278235 419029 304808 -29421 -340015 -334574 -102232 16929 -129379 -215738 -74582
12684 -74582 -296300 -472131 -166621 -97148 -69352 -39636 -125119 21782 188862 253317 238767
12673 238767 251905 124403 106603 308060 209392 76980 75005 55835 70360 295938 369637
12662 369637 96390 -53655 -53235 620 50907 307034 458132 352804 178410 -121023
12652 -121023 -149375 30173 254521 192635 88512 121666 20429 221215 308778 152467
12642 152467 94232 177196 386641 615984 584772 612738 501963 483810 371460 460868 548464
12631 548464 509504 442848 505433 486814 659806 743230 611732 551638 491137 340603 414146
12620 414146 521149 219445 452977 662992 477640 453720 316720 111176 -84482 -84623
12610 -84623 135849 170930 109442 183349 52855 -184991 -65543 38831 179146 333295
12600 333295 403985 406034 569487 646667 649375 678043 713384 701221 765623 892808 903416
12589 903416 1036815 794823 475497 277399 101026 135235 118757 118645 123961 117669 205783
12578 205783 302618 266649 137416 271253 334045 426910 474327 460814 278815 335699 409666
12567 409666 420417 270042 113021 92169 316996 502261 421931 147837 -127640 -167388
12557 -167388 24153 330299 412929 458250 675599 927848 795925 822835 640560 254448
12547 254448 178490 249681 144262 195106 288801 310904 526193 789521 749240 567183 559999
12536 559999 517694 515368 330425 323706 234357 127063 218451 230916 456749 602955 638306
12525 638306 751448 464519 538546 385269 255445 402038 347388 182132 83002 -42197
12515 -42197 42151 -57986 -70199 -27436 118075 27892 -84264 -129788 -62244 225979 51299
12504 51299 156661 61798 7412 22314 -5622 25129 133407 98289 249291 240638 147084
12493 147084 -141241 -146225 -66733 -7698 -36496 -143003 20354 152912 102748 -97205 -325757
12482 -325757 -372644 -107537 15964 173956 344845 345089 274524 78704 274314 443022
12472 443022 574614 419707 243855 211770 -4260 -207070 -529326 -386607 -351906 -436117
12462 -436117 -117999 10289 -77117 40683 190783 149115 -24374 -239740 -137116 -135316
12452 -135316 -319720 -402596 -359917 -255683 -253279 -175169 -208756 41254 280006 264430 255540
12441 255540 170546 47781 156134 165227 201220 85950 222733 193584 -97036 23473
12431 23473 217234 239641 52566 125680 310832 138769 4862 36361 -163303 -371040
12421 -371040 -368737 -71343 172786 21967 -137764 95225 266624 34972 -116350 -173942
12411 -173942 -187930 174720 172113 144493 12272 -240839 14291 275240 361533 109917
12401 109917 -18028 64373 208708 312070 186324 38620 -75457 -76353 -15979 19284 -62509
12390 -62509 -429889 -406784 -199094 -74341 -99526 -319889 -245355 -56289 -25936 105909
12380 105909 293370 374242 130159 102853 148966 219782 81494 29262 77734 60111 -18368
12369 -18368 -111414 -123575 90180 25197 126326 93267 -21036 -120844 -61303 1884 97186
12358 97186 49328 123134 348020 300801 71925 -314589 -464890 -251676 -174817 -213394 -178979
12347 -178979 -15493 -119936 -282196 -295464 -103025 -80097 138558 330145 116473 -21949
12337 -21949 -171456 -184502 -45736 -6300 -261673 -253711 -68558 3611 81422 74829 76101
12326 76101 64361 -5654 -110921 -154206 -35345 -116920 -256076 -250913 19390 222243 249850
12315 249850 361330 205166 114812 78900 -86653 -20546 241429 173649 214157 162809 63505
12304 63505 29055 62868 100457 124091 79543 74695 27009 36101 -98587 74765 373776
12293 373776 272359 161841 193656 3830 -93757 -32118 -16577 -70183 -241574 -405321
12283 -405321 -310481 -3112 185383 50245 37447 98177 68432 242864 350477 232611
12273 232611 171092 204918 270502 359334 294245 284982 11882 -134860 -35343 133960 200762
12262 200762 144872 78837 -162370 -175608 -151709 -238022 -162189 -65328 -80847 137577 362775
12251 362775 315141 348260 368541 281466 226993 317811 609420 604310 215219 -141360 -196712
12240 -196712 -218428 -210591 -140524 -84142 60716 -76732 -136189 -104378 -103331 -8477 -14628 105914
12228 105914 64413 -80626 -47116 -119393 -62324 -84211 -171700 -239067 -176797 16468 -47796
12217 -47796 113977 220432 191282 106433 -70128 -99189 19995 189587 298047 377390
12207 377390 414139 466921 762648 943461 771526 652257 656287 582087 469476 395110 297266
12196 297266 307440 384830 303414 381083 502679 254700 422555 701558 666678 703879 864025
12185 864025 773987 645069 610608 463525 460103 611221 488390 181405 279055 344881 622724
12174 622724 693880 595356 762376 787472 825028 876828 605663 408367 381482 487798 552846
12163 552846 457599 561302 538173 534961 416157 605970 642800 244717 114428 326320
12153 326320 504100 320992 374841 611453 577778 476831 617903 904194 622482 597498
12143 597498 764884 632715 515277 711391 726056 776378 860632 826436 1021943 1122041
12133 1122041 952497 887850 883196 855419 806809 738805 702399 672039 515063 456562 524438
12122 524438 801989 759790 776971 591225 513003 621731 576625 528595 522026 664171 722278
12111 722278 783007 793469 608988 655258 770612 833854 1050565 1090892 1084210 1196359 1164182
12100 1164182 1243909 1203455 1395038 1505858 1603424 1391591 1280786 1370196 1340649 1176748
12090 1176748 1064292 1184177 1252583 1304647 1262187 1137984 1152216 1345121 1690969 1897176
12080 1897176 1791300 1619775 1523943 1658497 1662879 1668575 1766827 1904441 1972685 1856749 1741189
12069 1741189 1562218 1616663 1828968 1956375 2089244 2022847 2111516 2243447 2171690 1966344
12059 1966344 1846699 2085635 2409400 2541175 2297235 2423384 2519257 2761140 2763847 2804521
12049 2804521 2865989 2986891 3015973 2982919 3059705 3020315 3171936 3304684 3537122 3475780
12039 3475780 3678525 3677418 3594937 3837482 3853803 3677041 3670879 3573693 3664406 3661465 3437986
12028 3437986 3271791 3244329 3285471 3528724 3752224 3934098 3888429 4009145 4152632 4120257
12018 4120257 3907062 3667543 3811825 3974544 4187459 4298823 4252561 4130014 3990223 4092869
12008 4092869 4148888 4391667 4462661 4512175 4220136 4212927 4408231 4404004 4433082 4895624 5390867
11997 5390867 5762263 5785663 5876341 5971694 5843879 5947646 6255494 6326093 6404376 6674186
11987 6674186 6827334 7006925 7192047 7118150 7267627 7706359 7902596 8012507 8247725 8300931
11977 8300931 8121047 8167871 8682414 9217721 9616679 10070599 10533239 10640858 10633589 10919821
11967 10919821 11436888 12118309 12553112 13040705 13758310 13960197 14156773 14932212 15604820
11958 15604820 16435121 17509501 18391474 19122207 19973830 20844026 21776319 22725101 23734008
11949 23734008 24602941 25505997 27162424 28865692 30356386 31943671 33802606 35982831
11941 35982831 38184379 40595666 43034050 45770417 48562188 51687981 55154717 58858584
11933 58858584 62758691 66972413 71733861 76701100 81973491 87559530 93508369 99839873
11925 99839873 106211394 112480476 119019913 125077871 130631668 135832902 140118940 143637866
11917 143637866 146259296 147506788 147514758 146525443 144254032 141145696 137470571 132784282
11909 132784282 127627146 122377339 116979945 111484325 106087147 101020815 96242646 91361282
11901 91361282 86785861 82809319 78990830 74790455 71201300 68023834 65334458 62297405
11893 62297405 59490252 57052772 54707132 52212559 50055692 48090438 46239585 44552089
11885 44552089 43040627 41540928 40137681 38886953 37760783 36650133 35521091 34068951
11877 34068951 32927638 32102741 31395397 30651702 29761674 29027641 28550590 27882047 26983368
11868 26983368 26096454 25487950 24657552 23941878 23557186 23026905 22188407 21512891 21013138
11859 21013138 20588277 20102225 19526295 18895969 17851607 17555514 17513649 17199709 16582495
11850 16582495 16254066 15843787 15610603 15376468 15054813 14803800 14739650 14424277 13819223
11841 13819223 13295654 13025106 12663240 12451317 12224503 11967974 11850126 11532201 11232865
11832 11232865 11160675 11159553 10939126 10530563 10259964 9970168 9685515 9585775 9629094 9448605
11822 9448605 9243493 9144687 8872847 8842430 9061057 9015105 8770978 8582912 8539806 8525285
11812 8525285 8280379 8051646 7864851 7851209 7778918 7665328 7748054 7524771 7466885 7493470
11802 7493470 7357499 7300615 7383485 7355000 7062805 6968866 7115415 7198161 7112905 7157940 7141516
11791 7141516 7093418 6759939 6543181 6384238 6211643 6105543 6017358 6009240 5976729 5728764
11781 5728764 5478652 5620908 5666246 5394349 5302925 5319083 5169312 5022627 5136485 5078403
11771 5078403 5088970 5050974 4607667 4511791 4464189 4070907 4093966 3805524 3847973 3918921 3810544
11760 3810544 3490896 3221704 3661226 3791897 3657195 3562924 3522948 3556415 3384364 3155692
11750 3155692 3039671 2864576 3002616 3178164 3113300 3063361 3007568 2734595 2784017 2723481
11740 2723481 2645252 2435167 2355371 2425178 2416458 2267978 2118424 2148053 2123732 2208484 2095407
11729 2095407 2022568 2163972 2303560 2192258 2027274 1832069 1963514 1926695 1808207 1936949
11719 1936949 1849864 1766776 1583225 1689149 1957300 1996339 1685586 1687983 1781682 1673799
11709 1673799 1642385 1749560 1741647 1855203 1736731 1680677 1749761 1653111 1627099 1648117 1861037
11698 1861037 1918186 1892959 1736168 1608655 1539874 1629247 1817281 1961735 1915890 1675010
11688 1675010 1480905 1538401 1677978 1633147 1606591 1734379 1623453 1520303 1497090 1342169
11678 1342169 1207581 1482400 1540887 1476964 1459351 1306851 1270295 1282901 1376185 1666299
11668 1666299 1659295 1485689 1256698 1406195 1226606 812313 733842 861365 1107543 1275477
11658 1275477 1439341 1580805 1525624 1473052 1264260 1091563 1174720 1063133 1101717 1198307
11648 1198307 1158329 1188224 942061 834989 783365 825394 880682 895020 703565 530626
11638 530626 778537 1186597 1159424 892767 917358 984799 768146 752389 895315 842679
11628 842679 748639 900482 1103615 1026204 997214 1059438 1068755 1067660 1007644 816490 508825
11617 508825 432364 465754 593319 325297 312242 583015 524182 443452 441014 524235 661766
11606 661766 583731 482436 721184 773464 895975 839149 948763 926712 1052789 841544
11596 841544 901437 867619 757535 681581 717120 572544 459132 468563 390629 454861 489546
11585 489546 521478 561655 595075 391232 331050 381358 748100 801823 850232 792762 725155
11574 725155 694956 542185 678223 683738 521298 279111 340194 510735 541587 575008 474808
11563 474808 459453 339704 344949 451837 443332 519839 635350 732287 626978 390778 162391
11552 162391 219218 335264 296192 398238 433168 399070 271406 144783 83038 27270 213167
11541 213167 74585 -90638 -95828 -90275 -138268 277721 538180 493797 427015 437504 326401
11530 326401 85350 -120389 -206523 118807 327389 384671 448740 527896 368392 378996
11520 378996 400436 517378 408546 153061 260023 30335 134592 365858 276464 272344
11510 272344 393739 243356 256293 234353 389265 373046 348435 199167 242807 -90389
11500 -90389 225927 426981 536316 430436 191449 -25940 129442 367837 415175 242804
11490 242804 298979 366078 114798 -19870 259554 307099 192281 114888 27177 -59241 297134
11479 297134 291651 140546 259539 126298 262268 336016 325874 223378 183272 -140330
11469 -140330 -191443 -141622 -156348 -195795 -6330 176852 106207 -38969 -150351 -231750 -272835
11458 -272835 -278217 6479 16933 27004 -70076 -36866 -199697 -294530 -53721 266506 482949
11447 482949 629458 791417 682446 489440 337373 310242 255386 107001 123922 360781
11437 360781 538728 368658 109799 184241 71387 13663 -31311 147815 957 -45975
11427 -45975 -24119 -42944 -141654 -363529 -314460 -277982 -131284 -91653 -93763 130730 487513
11416 487513 381042 366954 265622 231180 254403 225387 56832 -61519 -264472 -166366
11406 -166366 65772 17778 -250234 -153002 -152520 -132934 147678 365331 445169 438739 575677
11395 575677 518785 318077 -52251 -217614 -311908 -189834 136983 332611 160704 124404
11385 124404 110816 213220 452549 600952 389138 234330 315151 330385 47606 47724 245605
11374 245605 246003 131595 60094 203970 213962 -145239 -29341 172406 349630 456916 389670
11363 389670 271129 154277 176907 317148 309624 346658 297624 235407 117148 105503 384872
11352 384872 441289 159430 114010 263070 221703 200532 185097 452989 594660 440508
11342 440508 309846 327264 331515 424823 532235 570008 343887 145021 119610 254085 70025
11331 70025 -24454 -37502 194045 197948 55425 -32242 54143 307823 165027 183700 87866
11320 87866 127961 164904 283782 322982 359597 456787 94269 1952 138902 165354 330527
11309 330527 454948 371057 438336 411413 345374 346574 51211 -113782 -76215 -57039 -108071
11298 -108071 -281194 -161565 -37317 37498 -89205 7673 67205 40341 65822 -7168 -122600
11287 -122600 -101789 201207 72668 16932 -19030 -208897 -378732 -342733 -356439 -292803 -147973
11276 -147973 85422 121632 105501 274709 307288 265813 46158 -202129 -161341 -160482 -56398
11265 -56398 10350 117975 155111 50401 52463 169540 361936 193840 63209 76735 118090
11254 118090 -44464 -36550 85350 183230 197803 147256 156953 232957 243345 493001 536203
11243 536203 283370 86924 85726 166644 254727 126165 13790 125101 348714 437585
11233 437585 168557 -272776 -335975 -303887 -145679 18158 100608 3780 -32283 265488
11223 265488 443884 475814 371552 329518 188856 357708 211538 323820 380041 160525
11213 160525 145536 230334 47176 -32820 136606 176554 -197484 -389241 -145021 -74753
11203 -74753 -105960 174881 332049 318414 545790 649406 412566 521327 368777 90812
11193 90812 16088 -2857 -11570 9501 196942 227885 95720 375261 358124 164811 -43755
11182 -43755 -41907 -182973 -85774 39371 64602 -16486 40182 -91574 112351 230756 217519
11171 217519 255460 502355 522577 120399 190898 247204 233214 302 126036 176839 79938
11160 79938 124369 169989 41968 6277 -23073 206478 303547 133940 -143256 -286330 -97786
11149 -97786 165400 157204 -179525 -120372 -83180 -120040 -165401 -8272 204813 344164 247499
11138 247499 250841 -122676 -180162 39452 -34477 -151247 -14120 -40620 -233796 -214489 -385772
11127 -385772 -476433 -360127 -167167 -77971 27176 191442 15532 72734 165899 42136
11117 42136 -9745 254035 444767 399255 130457 53401 154346 25144 -232735 -522307
11107 -522307 -522821 -475129 -327881 -384989 -246047 -217068 -262802 -297351 -383695 -317966 -349458
11096 -349458 -317163 -245811 -156073 -164732 -430649 -420264 -207121 -188789 -395921 -189165 -159800
11085 -159800 -58362 -41325 121224 82632 244601 259373 260068 316533 214288 114155 74363
11074 74363 -72604 -196707 -278946 -31008 122519 46299 -178866 -400814 -489692 -531263
11064 -531263 -452676 -265434 -84902 -12864 -8014 -61316 -132298 -156282 -248381 -350440 -98265
11053 -98265 -226862 -388957 -47138 112577 307743 315418 361111 276736 67632 226780
11043 226780 200354 62645 58301 207717 508002 758377 714966 613566 851470 1052941
11033 1052941 1234983 1121183 885970 1023442 1208597 1145963 1299604 1378410 1562203 1872391
11023 1872391 2093687 2198849 1993420 1575031 1312175 1278917 1391884 1783227 2004917 2122927
11013 2122927 2181986 2354533 2277439 1932862 1656460 1498339 1594521 1740419 1641973 1984415
11003 1984415 1899905 1430320 1356261 1457827 1347197 1222512 1357404 1281777 1140888 950027
10993 950027 935575 845600 694916 364759 534597 775055 965666 1110804 992878 813275
10983 813275 537812 524768 545093 261555 -21510 156017 166003 143074 281156 227930 246102
10972 246102 354236 511962 456211 397511 424900 250346 302491 170547 134269 115459 -5120
10961 -5120 -136098 -139564 -240969 -70670 47325 -73466 104786 144036 199946 312506 150854
10950 150854 -282539 -158120 -310632 -453696 -346920 -301770 -164703 -177889 -224220 38802
10940 38802 289996 443138 487047 388496 280316 146206 194700 81520 14901 99559 -79330
10929 -79330 -180270 -133218 -162400 -260912 -175240 -225609 -287052 -336527 -304111 -275480 -65554
10918 -65554 17209 288096 82124 -142466 -30551 152751 63750 -84721 -176828 -115821
10908 -115821 -118388 -125233 67185 154328 101869 -6221 185827 276371 379572 107859 -244168
10897 -244168 -220131 -49848 -18309 50633 -152685 57971 -72800 -100014 -97950 -199267 -370027
10886 -370027 -242903 -210802 -229221 -95224 69327 35009 39632 45018 171930 231579 316945
10875 316945 244251 236354 171499 109934 232183 86336 -27674 -87385 22406 97434 194628
10864 194628 189195 -137877 -265270 -302104 -434251 -452933 -468820 -367132 -167520 91269
10854 91269 263980 161071 -91927 -4162 -684 -172251 -260772 -251062 -292703 -459481 -172861
10843 -172861 -102424 -111807 -85002 -58173 -204123 -123369 -21802 1159 153008 495 116385
10832 116385 344131 389269 350135 88341 161910 329540 169371 42805 183101 525261
10822 525261 516393 476066 365222 341044 186645 103273 97648 -102526 -363483 -443389 -222714
10811 -222714 -56455 119005 -37904 -241048 -121052 -185059 -190903 36900 149784 -160864
10801 -160864 -433009 -603305 -526581 -571367 -684673 -551886 -329168 -143140 -115028 -55638
10791 -55638 -64171 -178940 -364337 -481486 -441506 -405706 -476483 -328719 -175866 79236 50377
10780 50377 117388 287456 288561 216056 277135 241910 38960 135881 434783 437452 280489
10769 280489 318805 331479 461263 560207 607620 684993 694683 841252 1012473 940762 920050
10758 920050 867447 629041 672842 722420 687763 759948 754164 615030 723367 856571 927047
10747 927047 847601 821140 1059120 1113224 1191912 1154231 1366030 1406520 1305551 1198894 1435613
10736 1435613 1607186 1636924 1615923 2015188 2356167 2038525 1906502 1990797 2044177 1921142
10726 1921142 1987336 2487187 2641609 2710105 2784551 2912498 3089673 3163946 3074443 3345855
10716 3345855 3498200 3280955 3136437 3266821 3407679 3429047 3454194 3655427 3965310 4247914
10706 4247914 4109642 4188576 4333611 4237325 4009067 3657798 3646170 3461853 3214603 3084281
10696 3084281 3010175 3046033 3294682 3563768 3438171 3174486 2793752 2494982 2459600 2534928
10686 2534928 2744334 2926003 2854503 2690302 2598872 2435373 2498750 2578886 2596231 2529812
10676 2529812 2450650 2345254 2194293 2114739 2003055 2213333 2334807 2216897 1925223 2076698
10666 2076698 2308383 2133570 2187144 2271965 2417894 2631471 2808345 2929085 3183401 3267776
10656 3267776 3325313 3376205 3260170 3310008 3632772 3863362 4004609 4114401 4322794 4501123
10646 4501123 4677856 4971709 5558743 5965820 6319795 6534146 6749561 6784760 6860418 7036877
10636 7036877 7234745 7400675 7672657 8162121 8565486 9016949 9683089 10408602 11209361
10627 11209361 12702111 14025752 15635720 17057665 18393905 19685463 20786704 21887725
10619 21887725 23356007 25162160 27472836 30716304 34993225 40440728 47089848 55291071
10611 55291071 65350973 77313818 91181826 105347388 118085278 129025460 137848911
10604 137848911 143975815 147582166 150384774 154920555 163153143 176340109 195303234 218437953
10596 218437953 242368892 263360764 279015417 288445737 291197959 287292143 280117626
10589 280117626 275163460 277195527 288708436 309632809 336401562 362967850 383338981
10582 383338981 394850886 396256946 386373857 366477738 341222912 318398544 303248265
10575 303248265 297441006 300151906 308345085 316702068 320958344 319578953 311674167 296307540
10567 296307540 274877436 251012878 229214668 213028611 202746906 197310379 194608351
10560 194608351 192242538 188671604 182651073 173718063 162165846 148181535 133350249
10553 133350249 119601085 107810866 98198173 90239993 83721669 78826728 74322473 70420887
10545 70420887 67159920 64051351 61437432 59037685 56881424 54880219 53146754 51416147
10537 51416147 49678130 47987101 46628147 45338521 44062064 42743802 41567030 40409327
10529 40409327 39459799 38479270 37656052 36622691 35651601 34911544 34043135 33049689 32315602
10520 32315602 31275200 30407585 29692868 29155236 28638776 27968389 27325083 26619873 26040162
10511 26040162 25476429 24825120 24056592 23710294 23201362 22495258 21871549 21525006 20891929
10502 20891929 20300524 19675821 19515861 19344038 18882766 18454371 17892483 17482025 17285011
10493 17285011 16915124 16731679 16513756 16400261 16008315 15823292 15563947 15349898 15233813
10484 15233813 15167215 14947448 14617043 14456025 14347650 14309063 14292953 14395557 14079404 14044685
10474 14044685 14009017 13867536 13896948 13700809 13127169 12986951 13169797 13131874 13182723 13099605
10464 13099605 13021955 12613162 12605178 12616409 12484305 12380556 12470954 12487723 12431347 12454275 12380477
10453 12380477 12111682 11846372 11520284 11100268 10808014 10504830 10508210 10400448 10445112 10411265
10443 10411265 10171319 9930648 9846676 9567968 9399343 9120749 8869342 8804885 8540642 7969733
10433 7969733 7834840 7671064 7468802 7250367 6808975 6722320 6804579 6514604 6523013 6234438
10423 6234438 5825402 5191428 4902644 5101441 5088601 4837658 4751555 4850025 4759671 4662813
10413 4662813 4548430 4675905 4663908 4291518 4141634 3924966 3727323 3785597 3885917 3779454
10403 3779454 3665437 3573614 3383583 3321712 3400231 3527440 3671833 3579740 3508278 3496842
10393 3496842 3373983 3642903 3707342 3666747 3711174 3609394 3134422 3268374 3381324 3239867
10383 3239867 3189589 3192286 3218273 3214043 3177427 3014932 3200935 3323802 3257920 3169984 3151426
10372 3151426 3186763 3387708 3512511 3366154 3072631 3109337 3264831 3324519 3334125 3178772
10362 3178772 2965325 2797430 2668616 2727459 2729647 2680837 2578325 2521839 2486726 2320811
10352 2320811 2178367 2324797 2532923 2825107 2712169 2433214 2343920 2465033 2544162 2412372
10342 2412372 2368254 2251131 2316760 2314682 2320863 2222211 2417805 2490340 2461625 2355660 2134367
10331 2134367 1833748 1909792 1861395 1795961 1770246 1740230 1728642 2069608 2104420 2058931 1780024
10320 1780024 1802226 2016444 2268869 2114151 1874393 1854494 1974036 2079771 2102361 2063458
10310 2063458 2026194 2004650 1864946 1714107 1559850 1457964 1807410 2024441 1905152 1587810
10300 1587810 1547697 1527075 1544490 1550452 1600956 1656055 1768239 1556106 1302950 1036091 1159182
10289 1159182 1310325 1501603 1638647 1576697 1443356 1462262 1260770 1198782 1262971 1402770
10279 1402770 1330375 1480488 1451334 1310988 1064869 949122 870069 896985 1051647 1052135 949177
10268 949177 710502 758493 1081844 1175669 930995 967794 908753 846816 1038960 1353086
10258 1353086 1104156 854348 789679 790498 893434 838590 662829 581610 672140 950049 966854
10247 966854 817930 550343 455683 622084 332544 269062 589254 902113 952146 862594
10237 862594 888551 1009412 976203 1012668 1044747 906536 719392 581019 607159 615847 615167
10226 615167 769662 659607 715720 640582 580950 427873 171428 127543 362900 446020
10216 446020 122632 414921 813603 917508 760957 530683 554832 884054 647552 392479
10206 392479 375703 629928 605974 274287 27108 -4561 214658 342358 227333 288974
10196 288974 577893 820133 982789 813633 497948 303648 184065 208406 406393 490882
10186 490882 443471 321447 431188 456854 249143 172346 330949 541592 604445 783890
10176 783890 1037585 1014780 1303097 1292277 1328200 1470093 1537330 1611118 1577715 1549454 1493199
10165 1493199 1391094 1415283 1439863 1347704 1122040 1383026 1824349 2182812 2301691 2318561
10155 2318561 2293138 2309440 2274488 2095668 1997444 2305194 2580154 2654014 2457337 2562451
10145 2562451 2706486 2654098 2494006 2372007 2261161 2507826 2787585 2673068 2433572 2410354
10135 2410354 2335551 2245534 2406598 2697433 2567705 2223330 1748617 1691893 1703058 1449283
10125 1449283 1380280 1507122 1542692 1378353 1405256 1302505 1209433 904361 924699 1154347
10115 1154347 1277804 1351068 1263919 1130349 1036624 1038510 1025868 727144 668188 728269 913942
10104 913942 933189 709190 582647 497814 542932 625173 662563 669275 902831 782698 496920
10093 496920 185681 258844 331177 560382 923766 1154148 674950 329055 330139 497258
10083 497258 310015 440629 759345 892472 931229 773682 701203 766712 626912 622145
10073 622145 781374 508722 230265 310225 103195 199191 221374 160215 166522 295894 355486
10062 355486 635195 290450 174885 236246 357502 711823 908323 1002265 932382 720336
10052 720336 721047 838807 907739 592193 429124 537282 731529 528353 233823 210827
10042 210827 94702 59176 321886 237750 241975 52157 91448 280167 279023 173257 157947
10031 157947 129736 415150 769243 902952 618610 503697 581803 513156 636312 401193
10021 401193 460797 503048 316298 270710 234501 148629 67148 114878 251335 302024 388378
10010 388378 682328 481331 155805 159177 264595 441033 668482 422894 194263 235931
10000 235931 301252 333666 226192 349529 558420 486639 464267 177685 -229344 -174879
9990 -174879 87879 121297 203478 100524 96789 325173 293567 216735 228652 282406 390964
9979 390964 246477 388024 626265 567780 473768 142045 425908 526734 370678 377317
9969 377317 -33612 -106402 120390 188631 211652 217931 12245 -57448 178060 335837 454582
9958 454582 570432 578777 869660 880330 1059803 976004 858718 923295 954798 839746 719938
9947 719938 735452 959666 1108033 1123049 1128309 1215254 1339703 1384274 1448724 1621258 1643221
9936 1643221 1770714 2216812 2477930 2909609 3667136 4976895 6685983 8560930 12183520
9927 12183520 17827610 24486558 29597313 31644954 32619694 33049411 30736959 23922444
9919 23922444 17048208 12542599 9959519 8408243 7057355 6018851 5187313 4694390
9911 4694390 4411201 4022840 3709015 3325102 3223877 3375066 3213357 3075396 2860574 2729280
9901 2729280 2733470 2529185 2300605 2182444 1998238 1976226 1801100 1915181 1966404 1928210
9891 1928210 1862835 1792315 1726349 1779643 1832350 1593167 1304651 1414840 1521073 1360929
9881 1360929 1418638 1344782 1238694 1115510 1087760 1191491 1322736 1279103 1424088 1502850
9871 1502850 1517739 1506942 1473365 1757500 1702182 1209234 1039862 1364116 1196071 1013747
9861 1013747 889525 1176235 1366343 1075583 656956 780566 868342 839581 954414 859360
9851 859360 985620 1214371 1195819 1123604 956329 874666 822837 894197 920134 948935 961075
9840 961075 1079693 935775 786390 699968 619198 546628 396804 385220 569771 928954
9830 928954 1182647 1014031 844232 917845 843194 682076 570218 716445 813933 942357
9820 942357 797126 865446 485683 474595 713749 729783 665129 348084 290638 456358 308063
9809 308063 190801 261078 549645 559589 496874 389068 283561 360846 384266 356224 305746
9798 305746 393935 530481 819446 955307 861536 735020 679644 625719 709299 532847 421555
9787 421555 326880 320773 388933 459455 460355 362731 122599 128656 290793 657206 702760 434104
9775 434104 466783 478301 314138 180858 191346 322917 454444 472454 517348 436407 262431
9764 262431 205527 63856 168644 246645 196507 164727 237652 458045 294941 -15764 62300
9753 62300 184672 168083 180082 231513 428060 444609 342329 298235 127173 128802 108670
9742 108670 112886 309151 250865 246758 105553 173413 579988 623416 382598 235427 52363
9731 52363 21383 82801 183080 133836 33482 346909 289155 271529 237771 122246 172942
9720 172942 171983 206954 40690 162183 260423 475648 502625 265474 312520 371892 495330
9709 495330 569236 339099 306303 357835 483520 412310 300663 304685 267550 440552 438033
9698 438033 269112 114257 -33947 -40876 48227 132297 334561 195746 74185 151663 152322
9687 152322 335317 396104 187537 -58149 37608 218541 244786 401541 293193 76636
9677 76636 132615 181489 378959 762705 738457 558238 377542 118440 -2592 -65768 -265495
9666 -265495 11907 471763 608178 348671 327315 265930 189611 150961 315377 308359 409650
9655 409650 345434 521338 587461 568010 520656 736246 940856 1098033 1030019 1000373 1103435
9644 1103435 1176897 941575 809959 694628 643177 372973 289836 22361 76614 310916
9634 310916 536292 316201 190842 474686 557400 268543 316888 474805 355090 287971
9624 287971 288656 303036 285487 312756 306203 256399 186211 -24421 -96930 -3645 -165944 -281627
9612 -281627 -260471 -133480 295888 560581 349895 101860 -39117 28003 35183 128635 125298
9601 125298 16141 -30675 -227485 -257539 -119128 58050 262721 146630 63642 106637
9591 106637 -25164 129510 313779 271001 122666 -81564 -40147 67837 163752 232410
9581 232410 256592 83587 -655 181566 172603 188822 260432 277302 276938 374125 454500 98612
9569 98612 50285 304895 191416 34739 127019 -12528 -829 180442 145293 110464 75788
9558 75788 147709 25841 182607 -77363 -46945 223440 281276 198025 179492 398593 252172
9547 252172 158713 324205 482253 534529 462111 442453 407632 103828 110147 186741 421833
9536 421833 596600 391758 65314 10491 22897 17391 144387 467362 582054 467561
9526 467561 462555 428131 227923 1488 139712 277240 291810 134264 -103511 -284400
9516 -284400 -311640 -349397 -287895 -206004 -102579 70901 295759 211519 66229 41623 21032
9505 21032 -77140 -255693 -158134 -66981 102594 295531 159584 151512 114443 85666 101064
9494 101064 -56246 -161803 -298554 -245678 -249363 -106762 90288 87690 -11975 -188931 -92321
9483 -92321 -10487 -153143 -352611 -191144 72220 57409 -153672 -358532 -337006 -294308 -69692
9472 -69692 251406 305458 499972 432196 376473 131122 16204 77353 -20080 49087 102123
9461 102123 128784 -43016 -115330 3869 3202 62472 -119977 -102990 -12473 -59005 -18163
9450 -18163 -14246 -84523 22697 -39967 20115 274984 361314 301133 95099 45373 116319
9439 116319 306354 345792 379272 257159 -37351 -121469 -252834 -279329 -138571 -148091 -333255
9428 -333255 -352626 -246165 -125991 -100285 -179128 -340775 -437317 -437059 -104010 61966 -8420
9417 -8420 53865 7066 32051 106190 15934 -197356 -35200 203506 206283 183100 204268 14646
9405 14646 -130780 -207772 -256359 -24360 -62096 -134053 -110274 -160235 -201368 -159494 -308103
9394 -308103 -331493 -453594 -311562 -104833 -229204 -171799 20701 -17447 201833 284719
9384 284719 142351 44596 24737 34503 22605 81890 144456 -58905 -186131 -285911 -70586
9373 -70586 132040 81364 -79095 118318 240347 279812 181940 406139 572726 432640
9363 432640 224920 171695 271619 196249 282581 468971 269006 147659 67781 -97071 -176698
9352 -176698 64598 183295 72831 -42812 93741 205044 176918 79175 -35505 -42999
9342 -42999 -67350 54725 26551 -199862 -419629 -400966 -222805 181689 273921 353848 -75552
9331 -75552 -228804 -204323 -97927 -54053 -267826 -52542 121535 55489 105209 128673 79185
9320 79185 58325 315188 283714 -5064 76685 182824 97184 -85943 -273338 -440119 -200933
9309 -200933 -32630 91233 -148379 -192640 -258731 -253965 -88329 77608 187126 216854 135186
9298 135186 -4320 20834 294708 480737 175600 -40580 -104498 -38169 -222698 -475836
9288 -475836 -513813 -198469 -40640 -37515 -101469 -74366 -76236 53581 45656 102725 72041 135294
9276 135294 327661 413002 322136 556024 523825 441564 481016 601866 677513 481277 233922
9265 233922 289641 169417 -61173 -85591 -28197 -35869 -75525 1039 11368 12855 -29985 48701
9253 48701 185992 325671 209661 84872 25077 -4037 46303 168452 197415 153354 45187
9242 45187 -136975 -56112 113077 115824 199111 201460 202471 40964 16814 17822 176794 364755
9230 364755 121557 43499 253191 289420 404772 308264 195938 232861 203972 509 87632
9219 87632 227573 406008 230533 90880 195462 75589 -98773 -187855 -333324 -270155
9209 -270155 -432206 -634353 -320020 -144322 -147773 -152832 -103760 -145455 -205161 -186919 64815
9198 64815 182927 296535 487365 600166 228434 252242 310699 336971 108521 -150106
9188 -150106 91106 115528 56376 88238 146413 68833 18242 189714 339994 475441 278781
9177 278781 111994 60940 42652 80275 220060 225209 328997 192116 176023 332458 265919
9166 265919 276638 212651 151944 139147 158037 2510 -160891 -133416 -16498 12930 -134015
9155 -134015 -8776 337271 244769 35876 -143053 -148967 -108103 152791 136782 183037 22029
9144 22029 -111162 -118468 31110 -41685 73138 156819 63519 -19543 -1146 13405 242312
9133 242312 598760 462348 487624 570258 300767 179119 72502 56837 48842 311558 233882
9122 233882 -58556 -126758 55536 34044 -6738 -100285 -151070 -220023 -99596 -231945 -410609
9111 -410609 -374727 -77605 80190 -138799 -300249 -106784 19736 87610 113784 116094 86237
9100 86237 -183852 -355361 -202411 -29747 -96875 44683 123735 213365 81145 38202 83378
9089 83378 43523 134545 135510 -44264 -188809 -90989 185091 533535 504973 365704 304354
9078 304354 148394 76421 175880 108416 32185 190704 171507 243559 301378 259028 247128
9067 247128 128207 67763 44911 17109 140346 51832 38788 -7232 84807 82414 127860
9056 127860 56448 17199 -64690 -216381 -69390 345005 340191 147936 28875 -16321 -750
9045 -750 -146731 -224627 -103685 -21997 25522 105285 198690 290096 373858 393355 386472 203713
9033 203713 139064 180738 304986 325082 198375 -81990 -54830 -97468 -129033 85998 143076
9022 143076 -10265 -69672 -72241 29298 -10805 -38003 73213 30050 84542 147833 185812
9011 185812 -2990 81516 98573 -44663 -63576 -370102 -469421 -336734 -346127 -549580 -502899
9000 -502899 -379555 -135551 -128484 -83309 -164735 -35673 -2728 -30567 33192 283901 22311
8989 22311 -58260 228196 454173 460918 312710 220195 175022 131954 56838 13068 -64237
8978 -64237 67344 102353 -51253 -81593 -53143 40483 199294 286232 270577 167221 141082
8967 141082 293610 164076 354460 631589 570153 261189 114985 51369 -8193 -41361
8957 -41361 -90457 29730 129400 30442 -358593 -306157 -254061 -102662 163062 65743 68429
8946 68429 425609 525784 400880 460454 407775 311787 109932 -54404 -142172 -57573 -200256
8935 -200256 -314400 -37428 150458 245012 98741 -56886 90601 61553 140239 254096
8925 254096 251985 168408 237106 271165 243018 243148 191195 84658 -33423 -106692 -40603 -101159
8913 -101159 -77469 100897 78789 214558 344035 237118 167418 149449 210981 298316 -31944
8902 -31944 -147366 126921 239464 155129 412857 525948 280571 -22148 -6055 67299
8892 67299 103497 -45016 -64446 43443 -87746 -272083 -228722 -158856 31727 133483 179915
8881 179915 230386 316734 211729 -105554 -171492 17746 45318 -240144 -46074 76774
8871 76774 -43337 -124710 -43820 -120803 -131988 -62067 21024 143240 222150 36383 77619
8860 77619 55109 -5541 -55200 -38761 165144 441319 484015 308372 239020 203078 -53376
8849 -53376 -111673 67247 113820 233849 43680 67323 185987 16683 -56581 -116573 139643
8838 139643 362001 579813 347967 73799 112111 214510 216507 120381 -37668 208563
8828 208563 235718 481335 567191 527008 283809 305467 325191 372052 360020 3748 -252075
8817 -252075 -88961 -139765 -218455 -215171 -197635 -243030 -31336 348637 332061 214783 147370
8806 147370 188421 89212 -223155 -44871 -19358 -242890 -405215 -204850 192265 209175
8796 209175 163407 245245 267170 290552 136751 -150820 -162690 -194369 -156210 30043 313773
8785 313773 129593 -156193 -144429 -207229 -264179 -401141 -292274 8781 43960 -41632 15940
8774 15940 299254 267462 218810 476974 491666 439114 228962 197158 145258 62484 -36577
8763 -36577 -273355 -191892 45103 128402 -7175 98705 249144 215594 -132506 -354046
8753 -354046 -130371 58292 226225 186535 275958 272863 282060 180354 50870 494324 682065
8742 682065 577531 273007 -67059 -121984 -516816 -604260 -525799 -292254 -189144 -5394
8732 -5394 -81578 165120 105928 -176781 -345273 35060 -16538 -234098 -140755 -209882 -320474
8721 -320474 -351092 -351383 -492555 -354235 -58668 -61579 -19652 188287 258117 -182679 -345965
8710 -345965 -220921 -104289 33763 57817 25477 -188056 -212045 -144876 -81450 -127139 -219296
8699 -219296 -91404 124235 53030 -80413 -4381 -96276 -39800 -51893 -225089 -183085 58329
8688 58329 124999 187891 123759 87062 201942 215922 183317 262409 233399 212174 -7057
8677 -7057 78555 397016 477932 272202 327704 333314 177755 50981 -108165 122549 103992
8666 103992 147358 108035 29124 12326 -163141 -329892 -122568 -109497 -10964 128584 243815
8655 243815 68775 -83356 211456 305758 290023 108806 -98033 -218914 -283147 3328
8645 3328 220299 -39589 -195475 -227586 37981 141969 133843 29356 121196 161286 29077
8634 29077 106549 -115640 -301662 -216429 -127670 -101515 -162275 -17034 350348 196073 -61070
8623 -61070 80255 270273 367998 475541 523561 429932 230362 177239 -115038 -378445 -265338
8612 -265338 -92096 -50880 -164375 -284061 -336610 -235762 -131087 -17329 79463 57646
8602 57646 193878 72392 -157593 -276272 -191713 -268370 -342129 -16013 224798 196795 80383
8591 80383 98540 330733 360338 429841 607353 598522 286290 241064 408533 484447 253863
8580 253863 50343 -12268 149140 277028 260726 208584 269549 270426 222347 180752 77367
8569 77367 89534 287071 482091 391309 627618 991445 1370746 1398175 1373949 1345949 1215232
8558 1215232 1153660 1121886 1067420 801851 614653 362328 137859 256057 317151 -1625
8548 -1625 -63903 -40579 79121 148936 29693 -236659 -330776 -60601 55034 357420 767565
8537 767565 869598 804967 683457 710845 619238 310073 -92163 -88201 210432 550982 688535
8526 688535 977804 913695 708166 777633 1064962 1190849 1253429 1029804 941486 981542 720225
8515 720225 648039 799259 741806 463116 369386 454279 303768 110042 -1299 22698 235284
8504 235284 457783 435221 290881 238901 361074 319358 449936 348447 266321 152396
8494 152396 -9958 72110 -23806 -226603 -201423 -190908 -134087 -233876 -307120 -341558 -252552
8483 -252552 -165548 -262429 -243453 -138658 157391 204768 69834 427823 750601 652890 605171
8472 605171 530922 319330 243842 327642 489762 311457 257356 272342 289608 112076 14097
8461 14097 -7783 18134 218355 291034 146205 226928 327738 343498 149229 231522 241819
8450 241819 60906 35900 -52071 -176024 -241688 -327066 -253290 51703 123098 147041 235784
8439 235784 303762 296230 167044 104722 187211 285909 420519 195682 71235 184293 43840
8428 43840 -144345 -80382 -8439 -47986 -120452 -137592 -215808 -123283 -120269 52132 133430 29007
8416 29007 -117529 116433 100328 -84927 75918 287118 368541 278348 314587 393779 97827
8405 97827 -81033 -127168 -4621 132462 128593 430755 339164 193284 -117227 -408806 -515905
8394 -515905 -419086 -226185 -97707 29534 304140 405896 350677 363110 -128282 -269215
8384 -269215 -130813 -112283 101350 18538 -103500 14668 -104621 -238865 44317 89330
8374 89330 9444 -48111 -4999 184606 320486 280016 218668 464476 620191 515222 345292
8363 345292 180095 14934 -13029 201475 433822 235144 25773 -204248 -289045 -132668
8353 -132668 35903 92842 124350 150494 30717 77573 330136 330286 -100399 -231025 -285144
8342 -285144 -216861 58665 193571 185595 58636 129674 92127 256562 554143 578435 504244
8331 504244 328057 191279 89787 72419 28798 178710 306608 220659 70160 -101623
8321 -101623 -15395 -72243 -47260 -46809 -257145 -266981 25511 53127 65370 367428 535891
8310 535891 282143 187295 61423 -249481 -105732 -25690 -5241 167396 122288 211672 452098
8299 452098 495784 565281 786266 656840 453325 583839 760580 673927 862295 1245133
8289 1245133 1687532 1992839 2560037 3397400 4829505 6512692 7481791 7946346 8309026
8280 8309026 8375348 7429108 5876034 4381753 3306628 2694334 2460576 2213330 1782171
8271 1782171 1517408 1414954 1067807 887533 1027833 1067770 1060812 1098852 1005923 1210819
8261 1210819 1065276 873194 926525 1027875 1055023 1290106 1302628 1100313 1043711 1024761
8251 1024761 1317686 1896880 2219609 2944191 4297077 5641707 6789953 7476334 7831266
8242 7831266 8015263 7663686 6277489 4704377 3542267 2942424 2653617 2112614 1723868
8233 1723868 1684649 1834696 1935701 1735625 1430004 1303159 1321541 1364119 1347556 1294712
8223 1294712 1129473 903495 936554 787786 773971 701372 735431 632646 512345 539125
8213 539125 450334 443121 588737 495637 443960 423645 469378 490687 518111 591489 727590
8202 727590 610276 617491 807508 663264 579002 439323 232003 -64258 -171755 75658
8192 75658 330852 463396 520866 571619 673527 682731 625174 668180 709189 487960 260238
8181 260238 139223 222204 229708 103227 141223 56721 61068 95169 557279 481223 414956
8170 414956 536399 302797 309225 472907 369150 321892 337457 446072 743947 634787
8160 634787 273129 312669 247417 144821 124143 227768 327922 302075 328598 679219 822351
8149 822351 664804 533687 267832 -123594 -337473 -414918 -281531 -257629 -148679 61200
8139 61200 -48849 -84261 -94423 -122178 -22915 285627 334108 383151 544094 485854 290407
8128 290407 -15353 49510 57432 36460 4397 80648 191631 121379 220459 198666 106859
8117 106859 -69714 -20500 129217 97906 229492 203430 63734 172129 161715 43881
8107 43881 -53780 43747 146009 175886 -13962 -119173 -173447 -82789 262529 132555 -189689
8096 -189689 -277189 -50921 -23858 -9646 -23351 12115 8343 185378 182380 -4952 17083
8085 17083 155253 98352 79891 66714 80904 270453 376819 197496 74248 354112 167015
8074 167015 73924 212449 226762 33922 -116067 -96533 -13956 -41037 16362 195018 351722
8063 351722 431551 340781 178887 -134405 -61095 -20156 106076 331321 260604 78061 225415
8052 225415 400590 387606 76100 -77751 6187 327339 331468 232976 309766 305189 -58527
8041 -58527 -73879 -192527 -141892 -117303 -117796 -135088 -228912 -212816 -326590 -433268 -237109
8030 -237109 -28200 9517 217721 195532 183502 58446 -101305 -313796 -257623 -143566
8020 -143566 -281056 -173832 31966 83141 170931 280883 345629 619481 592150 380161
8010 380161 471007 447257 338347 289526 198626 151511 307723 511419 381198 506748 481489
7999 481489 211587 50664 136644 345197 236895 211518 343838 436338 448497 386188 267164
7988 267164 298386 356354 391045 515749 433268 413144 452257 312200 224824 250599 91742
7977 91742 -53473 -64053 -72067 -42447 -238730 -238985 -77606 303491 624008 418169 460822
7966 460822 422359 264593 328562 103115 85009 91225 114656 337766 460766 549590 582785
7955 582785 516622 361647 262414 281645 369742 415449 197948 153855 188071 267543 161862
7944 161862 168603 -18715 -382783 -307396 29031 165953 -106488 -293133 -235170 -194636 -138666
7933 -138666 -163413 -70975 32406 42673 62474 192267 207143 176153 284679 491873 587827
7922 587827 314351 135776 187861 254943 187808 97116 -25775 -276383 -73871 41226
7912 41226 -26926 6813 99367 61327 88768 -30247 -213679 -83765 -180454 -82863 202734
7901 202734 177439 135318 217638 324472 161716 -233723 -399279 -253920 -238004 -328169 -83304
7890 -83304 174473 272756 316362 178511 49371 -205269 -283749 -297864 -287160 -228702 208640
7879 208640 172616 77399 42794 -26081 -168871 -177468 -29885 -65814 -10764 88054 326986
7868 326986 452497 262169 -50728 -155020 -182741 -432621 -570361 -520567 -147865 31364
7858 31364 -57158 -108970 -286580 -425468 -202058 -202373 -232291 -304116 -555516 -561523 -351795
7847 -351795 -97097 -243373 -162835 -172800 -259713 -152461 -50658 -54368 -188789 -266453 -266921
7836 -266921 -249677 -27441 -157978 -510673 -407071 -284814 -324178 -279827 57242 -56388
7826 -56388 -445015 -591150 -385244 -206319 -194247 -319469 -336422 -257467 -77680 -35105 -26710
7815 -26710 35551 266271 113645 -80465 -296142 -87260 131472 372846 577813 438068
7805 438068 207097 176656 202037 209813 81130 -36386 133496 139300 150940 175525 252649
7794 252649 247916 120408 -26006 -86845 -128130 111378 -15418 -199987 -98139 165222
7784 165222 529926 592976 434227 407976 392334 -37992 27878 34502 90954 47296 -10636
7773 -10636 -146028 -354914 -397828 -317538 -9058 2364 -78494 -100713 -95732 276668 233872
7762 233872 281857 407136 508098 488147 488078 342498 267569 360165 241454 -166857 -315608
7751 -315608 -139957 64386 138695 183118 241521 48737 66964 311750 436391 355706 255374
7740 255374 46476 36614 176945 25644 -251850 -286721 -137997 36726 110718 143067 -8070
7729 -8070 -177691 -283897 -268896 -428292 -418659 -246553 -64283 -15003 221773 501156 438479
7718 438479 267036 310741 175680 316900 293848 232084 366338 218450 195902 150572 280464
7707 280464 275408 33802 -153915 -25707 127099 -51759 96342 170669 21711 -93546
7697 -93546 -32326 -29151 -74283 -352204 -337160 -103823 98623 252891 -42267 -517323 -714118
7686 -714118 -470645 -458147 -430228 -211597 -243024 -421724 -397015 -300899 -142706 -168834 -89080
7675 -89080 1611 -87270 -179465 -124314 -167082 -265943 -338615 -430894 70638 271948 177456
7664 177456 173403 4568 -60212 5702 184159 318442 215517 115461 55473 27050 -279802
7653 -279802 -301698 -242030 -202068 -332893 -602488 -249592 26176 157855 137758 278979
7643 278979 147967 -69193 -114820 118743 99911 -166226 -127279 109583 178432 163419 7998
7632 7998 110252 165290 92510 -248697 -329921 22042 152757 -22053 -172357 -355976 -411264
7621 -411264 -243249 -185095 -199551 -111952 13447 9016 -53445 18879 51556 86173 37603
7610 37603 -24169 -87594 -128124 -42194 53761 85641 -58308 -87569 69880 7158 -18493
7599 -18493 -255402 -231771 -101369 107010 86710 -139710 -234200 7556 112842 2535
7589 2535 88123 212751 28338 -5928 45033 22993 -173761 -563017 -510680 -236416 -28185
7578 -28185 -42369 270418 457494 406398 191613 87878 -5539 209536 339139 296572 145241
7567 145241 152313 350644 302211 105572 -53985 -67264 -15363 -28929 -167321 -342104 -519711
7556 -519711 -422678 -332076 -163828 -118444 -216418 -261821 -262896 -294794 -332082 -334181 -428301 -582248
7544 -582248 -238948 84109 152829 60492 85349 266710 226433 121728 -41260 -355358
7534 -355358 -472728 -505854 -328818 -72022 46658 29441 74798 -218171 -81031 111604
7524 111604 -64872 -60679 -15948 69895 -36034 -78266 -213115 -182588 -29279 56582 217163
7513 217163 88404 -20831 49141 -88981 -67385 87746 161130 97980 4785 175031 385610
7502 385610 272973 78339 319703 408061 174055 64980 174973 151856 -46816 29491
7492 29491 128581 153441 150176 76107 275514 340025 113160 -31364 -78999 -180486 -249707
7481 -249707 -32648 157441 38970 -202803 -337279 -186604 -267465 -335929 -185838 -243731
7471 -243731 -218422 92933 222922 128187 143813 331102 364280 325374 133842 90541 -349111
7460 -349111 -506878 -357272 -363671 -356521 -263631 -102726 28610 147324 356 -155191 -199828
7449 -199828 -206363 -85328 15284 -274436 -453919 -152868 -76121 47705 117634 253292
7439 253292 104304 124081 9656 53913 261260 299022 281318 231407 247913 204466 125836
7428 125836 84808 104683 123461 119691 246473 261044 -9970 -186106 -77212 -22219 101836
7417 101836 109029 22332 144167 -9725 -18508 -146170 -218019 -185689 -197301 -144499 -145360 -27940
7405 -27940 99545 215648 89611 120497 82515 -114822 -92218 80157 60606 -196781 -195294
7394 -195294 -267980 -396306 -281172 -184134 -154281 -54862 -96810 -57036 191696 -37486 -165368
7383 -165368 -248439 -466089 -266096 240978 149540 25607 -23670 24285 60430 127089 18251
7372 18251 -17934 -272094 -293206 -113568 56053 101011 -81789 -95120 -16687 117589 202220
7361 202220 91141 -105335 -44161 11460 -21594 100989 55203 -74728 -128582 61200 63925
7350 63925 15427 22242 -96609 -58210 113652 285520 89857 -205298 -371331 -346371 -282010
7339 -282010 -316900 -398253 -545533 -673272 -473890 -208290 82420 88795 122043 326645 298645
7328 298645 582177 436764 -3485 -19841 134435 76918 -76397 29051 246600 168572
7318 168572 188372 233741 274742 182439 21480 -212711 -226552 -94067 -128448 -235941 -205036
7307 -205036 -124165 -382216 -572285 -410704 -137341 -24837 31997 -13031 -44012 -343142
7297 -343142 -313336 -60196 -86324 -66915 134514 192896 198488 301721 382730 464802 425565
7286 425565 286648 391207 260096 245410 157769 101355 169975 138519 32089 131120 97020
7275 97020 -158106 8312 179039 235866 231719 -51219 -292852 -299741 -286088 -409313 -389051
7264 -389051 -156394 -90921 -62234 -68526 -66224 -84342 -108607 -39726 -36389 -209467 -226508 -181941
7252 -181941 -154296 -145006 -294651 -353564 -141132 -22044 -155152 -120145 176152 625069 752575
7241 752575 771509 662698 492711 388751 473187 431702 243248 23902 79991 167620 23960
7230 23960 192905 312272 397701 224450 133532 146922 264438 400161 325278 274945 268002
7219 268002 244978 178151 9783 244262 13084 -193287 -241111 -173832 -218529 72919 107534
7208 107534 113620 -107992 -22252 -198570 -574634 -699801 -425058 -313024 -356125 -179735
7198 -179735 -117673 -96264 -66559 -9157 135042 18514 -142549 -203629 -210396 -93927 -249634
7187 -249634 -267309 -96681 -156328 -167335 -210672 -160612 -65397 -124971 83729 235777 280111
7176 280111 46084 60759 -145391 -246440 -378257 -545700 -390244 -106567 -105066 162394
7166 162394 229794 93380 -71126 25960 24192 -139385 -45605 -53245 -20341 14601 -72691
7155 -72691 -176827 -139590 -55579 -66268 -345306 -311396 -408637 -473634 -307327 -152913 -278146
7144 -278146 -191573 -112093 -25024 217760 145162 -53304 -94751 -432632 -459766 -194597 -42971
7133 -42971 69576 28409 -82738 -284071 -189333 161616 189166 80284 168129 76460 -184772
7122 -184772 -248800 -50723 -82585 -126741 -339210 -236992 -79890 -52179 -229447 -474504
7112 -474504 -395848 -277813 -121809 -7689 23557 -48056 -264418 -314042 -22639 239013
7102 239013 322838 222706 110059 327349 174098 153294 190653 36762 -66258 -59941 -33917
7091 -33917 -159673 -257044 -252940 -77549 40853 50422 156992 259661 117304 -50524 -42595
7080 -42595 149526 27670 -50061 -40750 64823 70016 148545 171020 -70338 123883 276178
7069 276178 445396 307913 186594 138129 44937 189812 190132 29429 -51646 189068 327817
7058 327817 383002 464849 252797 128817 229941 284809 -218781 -328501 -30008 14930
7048 14930 -28661 -20277 -137050 -122996 -262496 -119428 169291 325813 182081 101805 -20600
7037 -20600 95473 91399 -1642 71549 -48329 -60215 -73469 -197586 -323732 -335297 -281351
7026 -281351 12417 141733 -93504 -35100 -246887 -221676 -355356 -229757 -10893 139184
7016 139184 2971 142874 264100 399269 493519 217972 -55058 -104262 -87078 -35183
7006 -35183 -257199 -107357 447 150899 443519 448357 178618 150067 -77985 -203379
6996 -203379 -161926 -333743 -256783 12260 160423 -72674 24827 141522 220929 307784 156477
6985 156477 68628 234630 241166 192762 213478 111222 72648 421397 561579 272761 98960
6974 98960 344027 311875 383437 342497 313226 237454 244482 202496 172040 141335 -60535 -127243
6962 -127243 -62910 161558 -56838 -96468 -81209 -328832 -207088 -160685 -316174 -418825
6952 -418825 -383403 -453121 -306051 -263992 -200785 -172694 -105690 -312840 -503180 -512077 -406016
6941 -406016 -269117 -140123 -41312 -40453 -441271 -729159 -488558 -254749 -316010 -234910 -106214
6930 -106214 -53232 -291288 -307951 -250511 -534981 -284704 -124863 19683 321333 99499
6920 99499 -28865 249722 327029 303244 208070 54390 -9507 22201 176828 212033 -119869
6909 -119869 -323964 -197463 -153303 -30942 189679 249049 213747 269509 208623 -141294 -90829
6898 -90829 38246 63680 -141604 -240444 -174896 132876 -150419 -330587 -593239 -578205 -384244
6887 -384244 -453898 -258420 -90174 -78333 -130769 155131 375165 293590 191807 79365
6877 79365 97320 276341 301175 29552 -285866 -143240 162327 101886 -79110 50176
6867 50176 60377 123749 149738 40101 233672 367863 249459 206161 145074 307798 380975
6856 380975 264595 -35912 -128505 2223 64086 -47763 -81440 1471 -137105 -82473 1658
6845 1658 59147 61562 -77197 -79947 -85008 -24447 133722 180224 323376 336837 373561 364374
6833 364374 313446 374911 43618 18988 -45285 -119876 -102666 -244212 -358072 -145927 29158
6822 29158 53349 119886 -21585 -194287 -10939 21605 123695 -40099 -263901 -78609
6812 -78609 391612 262892 145420 4086 66295 169610 109045 125529 228682 368035
6802 368035 305842 374914 541970 501551 323610 318686 16428 -287972 -430960 -204438 -129134
6791 -129134 -91634 109336 230437 149316 43961 -59266 -76557 -72563 31812 248719 186135
6780 186135 284563 409878 367324 382765 290631 346519 196919 58205 -7983 -142333 -266046
6769 -266046 -257813 -189453 -375398 -415861 -55545 24146 -139600 -22186 -47072 -181798 -247945
6758 -247945 -239134 -73131 -173634 -193729 81296 99096 -10133 -142639 -213096 -393026 -262298
6747 -262298 149117 43532 -187368 -7660 -48339 -30097 91166 24079 -216394 -297035
6737 -297035 -59257 10917 159934 -38753 -294355 -264416 -68940 -112608 -165459 -228215 -232609
6726 -232609 -36707 -4308 -162928 -320781 -59416 157336 250558 293420 225756 132342 211525
6715 211525 -5831 -207038 -53686 172915 120412 43516 -180259 -12968 204459 1163
6705 1163 -177777 -135538 -821 -125976 -115835 -96815 -1255 -1152 -93073 -234312 -534435
6694 -534435 -662054 -462073 -326007 -120822 -55469 125112 26894 55763 -4577 136355
6684 136355 276867 68751 -167527 -363168 -309783 -125263 -190853 -127244 -74033 -19764 -139074
6673 -139074 -253252 -186754 -73965 -216729 -35571 -54322 42924 -37177 33674 -33571 -39917
6662 -39917 -80751 -364128 -211289 -164734 -164697 -144023 -117204 -286957 -422985 -560957 -361351
6651 -361351 -171193 -8475 -38222 -292132 -316502 -15773 -69074 139144 382798 307665
6641 307665 8824 -44901 129827 60505 137950 141986 37766 -22749 97808 184792 -37823
6630 -37823 23303 116311 22917 47278 143812 7556 10839 252706 32369 -113728 -280248
6619 -280248 -39100 59063 -93424 72645 42875 -250552 -292982 -94930 -182289 -219092 -352315
6608 -352315 -485055 -513651 -312397 -105043 -158061 -274476 -503370 -400871 -346782 -303555
6598 -303555 -163216 -145743 -167634 -205535 -224621 -48315 9085 183284 319771 260758 -55498
6587 -55498 -81735 149685 334070 282528 115114 -54352 -223098 -70557 67026 129075
6577 129075 33286 90400 6128 -320487 -145375 -117109 -446465 -719710 -617444 -457316
6567 -457316 -430096 -278906 -234266 -249125 -135732 -107800 115307 58454 51475 18802 -72538
6556 -72538 -369850 -375657 -423530 -311915 -241247 -61023 -2437 -190874 10495 106421 108846
6545 108846 -85358 -230141 -198959 -59281 -87554 -221097 -359094 -212315 -135353 -153862
6535 -153862 -291193 -226565 -19425 -59677 -38341 -113917 -17942 -124009 -240228 -271316 -252285
6524 -252285 -49495 8890 110011 207805 21907 90523 151422 119061 204184 127950 -25592
6513 -25592 -73554 -106668 164639 419567 323077 -42725 -177615 -207454 208189 573081 538622
6502 538622 457050 128129 -49000 -103775 -265110 -338737 -373819 -513834 -386701 -135486
6492 -135486 24001 126836 161782 73838 84870 243731 156982 -21489 -137766 -239211
6482 -239211 -140127 -29528 -131070 -26129 252241 247811 -29337 -68831 -264524 -317558 -431738
6471 -431738 -483011 -278625 102636 233175 38378 86924 271460 403041 316638 170100
6461 170100 128567 107007 51677 -51174 -143809 -108134 -109021 -278092 -346092 -211572 -156990
6450 -156990 -99320 80674 253069 380215 522655 374021 377701 374299 208562 190673 201567
6439 201567 279373 197447 61437 51331 -153991 -98705 171613 -80640 -453569 -398724 -191383
6428 -191383 -170454 -127326 -248897 -217921 -159748 -79299 43384 70840 68365 164831 346374
6417 346374 440375 342135 126959 65311 -16227 -93303 -39003 18655 -27670 -5009 -115312
6406 -115312 -255512 -374565 -182896 210462 391770 216678 35660 -26557 -90144 1897
6396 1897 -30558 -287635 -156160 -134413 -18300 -6815 250919 271869 241505 330584 326261
6385 326261 169901 136802 -70474 -220364 -34558 116099 142860 -30568 -90785 -131448
6375 -131448 -26249 215042 265104 257930 173308 238287 412633 348084 242778 204051 67576
6364 67576 -187799 -139445 -169672 -47785 -207903 -93646 39888 56217 83708 136148 56483
6353 56483 -17565 -38976 -87335 -113168 -107137 170927 307162 186985 -44095 -245006 -103889
6342 -103889 30387 -235550 -338495 -188949 -212782 -209324 -232720 -157376 -62326 38965 80788
6331 80788 85719 74869 105452 63754 226888 244522 278534 223305 178650 128581 -60705 -326984
6319 -326984 -434243 -143122 -23003 -139906 -21739 228717 185015 -214314 -282381 119760
6309 119760 229463 62744 23198 230966 227567 -39411 -130639 -44734 82600 154619 201540
6298 201540 102674 -73186 -254902 -95857 -16633 -146477 -119623 -2706 -226649 -231484 140109
6287 140109 357301 313954 210680 139998 -12882 -134033 -169144 -48389 268998 188409
6277 188409 117037 93619 306688 249643 316123 453574 540741 322876 155532 165544 81176
6266 81176 -71945 -164494 -176078 -280745 -349976 -423272 -465912 -118597 226715 96340 -42710
6255 -42710 -156575 -307014 -253841 -20692 27 182140 273619 253764 150279 134551 138651
6244 138651 260326 232189 60636 -23578 4564 5193 -164759 -38252 28910 -168719 -390225
6233 -390225 -346015 -276020 -285349 -395108 -114099 -37862 -239588 -257762 57935 303024 275838
6222 275838 61111 -89773 -143217 130534 58183 -199536 -392228 -322072 -189230 -85790
6212 -85790 -166753 -271077 -316877 -98380 -81774 -251905 -334131 -343262 -447531 -463833 -319729
6201 -319729 -85096 -19858 40985 154780 -73966 -60393 -57169 -4999 -122320 -506430 -220300
6190 -220300 -81201 -97806 96130 72710 -45852 -187846 -105720 -271518 -231789 -344535
6180 -344535 -380437 -385313 -512748 -488066 -475611 -248086 -218062 -390649 -347661 -209019 -213785
6169 -213785 -268486 -295761 -365961 -460943 -330570 -266807 -263805 29789 40270 -29585 -126567
6158 -126567 -149811 -43952 47894 -51266 -30194 -36781 47163 -53225 -173028 -219240 -145229
6147 -145229 -79630 -208339 -413428 -314708 38384 -38053 -337770 -209966 -80646 -18329
6137 -18329 83700 202107 293646 272851 188006 295644 185031 63341 -129381 -237857
6127 -237857 -187717 -215963 -138360 -97759 -213947 -450886 -423440 -277835 -176541 -201744 -241236
6116 -241236 -214036 -41426 127980 15488 59659 31826 29982 -25020 -333779 -240712 87432
6105 87432 305376 263955 -47953 -418748 -316189 -55262 79298 147408 399832 499740
6095 499740 340241 182634 118179 3771 4347 -12524 133348 292482 268061 121554 104950
6084 104950 57762 -128130 -220183 -278348 -205632 -221422 -144660 -178542 -241477 -326463 -337841
6073 -337841 -58542 98991 48078 -115250 -344569 -228098 -150687 -35022 -63043 -62631 199594
6062 199594 86943 133312 75455 -123121 -146827 -55956 -207763 -75130 -26952 -105624 -218389
6051 -218389 -86494 -82519 -235997 -78547 -82873 -170947 -91037 81082 87642 -26712 -41407
6040 -41407 152721 -30417 -188179 -172732 -11561 4862 -262633 -491953 -672896 -484349
6030 -484349 -284134 -131176 -54612 155078 -107777 -182690 97114 144688 184126 -30993
6020 -30993 -67437 -78422 -128846 -131800 -104603 -246670 -201597 -264630 -231501 -186523 -189101 -149915
6008 -149915 162829 255552 225055 250818 203308 247265 246528 113525 13429 -119464 -151278
5997 -151278 -140914 -113488 23759 139775 40119 -107214 1369 332883 375017 108928
5987 108928 68638 134662 21945 -237087 -199327 -204800 -105321 -267183 -325318 -237007 -148476
5976 -148476 -22975 -46794 -111219 50518 242437 193136 206834 226522 350154 379814 426376
5965 426376 161977 66437 60254 199389 24900 -77616 -104669 -191621 174397 442147 282090
5954 282090 89622 167251 75102 -172439 -307452 -119346 -92143 -134636 -171336 -158321 16122
5943 16122 -81537 25807 -85105 -298011 -213006 -154690 -191278 -90205 132437 151945 107368
5932 107368 134997 319476 146019 -37428 -276551 -155699 192322 241733 334617 213328
5922 213328 107333 38264 106768 227284 275772 24220 -16720 26816 88458 275981 375887
5911 375887 99139 153719 138268 172537 143571 -414050 -471888 -345380 -320696 -150425 5660
5900 5660 -106802 -111634 54624 255637 367765 346368 324629 138851 27252 33279 -79137
5889 -79137 42074 -1403 34089 60074 105044 310791 309310 106168 -39568 49205 -5114
5878 -5114 -143880 -179474 -224034 -37179 143224 19399 376 158096 93493 173219 263458
5867 263458 177762 321244 159611 93661 180051 187606 201356 248555 121006 160515 350800
5856 350800 113489 -76559 94711 32768 -59351 -66106 79385 -53650 -60892 86732 47708
5845 47708 26771 87037 -107834 -408897 -549686 -624737 -330801 -193602 -44247 -91181 -216375
5834 -216375 -344765 -296403 -237274 -281086 -275490 -249964 -266982 -507630 -510624 -453786 -503305 -493205
5822 -493205 -107291 -142462 -239868 -319936 -297073 -166274 85005 58902 48186 155662 47774
5811 47774 51269 -27537 -37242 -114131 -264618 -73185 85992 33503 -105682 -426212 -474831
5800 -474831 -214890 -84972 113977 115035 59784 33232 123590 24286 43205 88342 92074
5789 92074 -43446 -180272 -235767 -216270 -170111 55798 34867 -141305 -125307 -32443 -177765
5778 -177765 -209026 -76317 -65110 -68762 22375 39802 -38671 -201327 -110726 4388 13228
5767 13228 8640 -189269 -228549 -134895 -36709 -25537 -62428 22882 195583 192983 103380 -19789
5755 -19789 -283950 -434252 -407155 -249787 45770 93799 -9207 58631 85846 33901 -135874
5744 -135874 -45475 -77586 75961 112930 148242 21531 141525 -39704 -132001 -80893 -153641
5733 -153641 -172412 -180843 24621 -55552 -140279 173006 203395 81180 90527 85328 -13630 -1086
5721 -1086 -176934 -204541 -3399 -48876 12706 218541 106922 -8157 2279 -156036 -60538
5710 -60538 262568 267862 157329 -23766 9996 -195629 -532421 -541648 -412783 -308034 -55190
5699 -55190 -155668 -266683 -370050 -247741 -296474 -529266 -317051 -382771 -429566 -435376 -437182
5688 -437182 -371061 -80069 189602 288104 154711 172144 -39887 -255559 -153497 -67419
5678 -67419 152385 147340 219278 175470 139046 62967 -149254 -496306 -706392 -684753 -533873
5667 -533873 -289623 3144 -19687 -56307 -293486 -179685 15954 -76564 -215407 -125697
5657 -125697 -79984 225315 543800 564405 330770 204402 49660 62605 55500 73379 -5326
5646 -5326 -61698 126178 52572 -129159 20152 239684 182936 346724 241855 70077 346477
5635 346477 89580 115132 106943 206691 183031 196462 194990 19503 -10920 44594 156310
5624 156310 7880 -249796 -523765 -486908 -289690 -234545 -22333 25090 -153231 -217129
5614 -217129 -219070 -153512 178264 295412 172982 -85410 -145472 -294445 -458097 -430458 -346275
5603 -346275 -111566 348368 318730 227672 278480 422339 28883 -24577 -116252 -228565 -216648
5592 -216648 34391 93251 -129630 -321799 -113199 26223 -99497 -79489 14488 -23167
5582 -23167 -128249 -136548 164257 156332 -1133 -308817 -241015 -200986 -1872 150160 93547
5571 93547 -111279 -56828 -182303 -10394 124090 -12382 -392688 -111666 -9750 -9414 -206925
5560 -206925 -114934 -29881 138041 136987 66347 137479 94301 -96523 -134310 -269329 -331350
5549 -331350 -68174 -162634 -107745 -98930 -117665 -306279 -419625 -318995 -148093 -128844 -246766
5538 -246766 -32197 58012 -58043 -189396 -30079 226865 34052 -109177 -209387 -207834
5528 -207834 -209700 -276988 -93781 51157 184242 155430 24123 -272728 -211493 -81196 -141151
5517 -141151 -145165 -338001 -135494 -119547 -138494 -38007 192399 22756 -197313 -261839 -57609
5506 -57609 -140487 -201440 -129872 108864 240429 374967 250589 150540 36791 -136417
5496 -136417 -194349 -192221 -174352 47650 5494 -310250 -215453 -321158 -290391 42997 247518
5485 247518 143788 -169586 -271400 -109331 30142 116920 249631 245652 121863 220934
5475 220934 55273 -11802 3127 -286213 -268196 22973 156047 179815 147804 -202917 -255676
5464 -255676 -288974 -176689 -196314 -59341 -170784 -262874 -298398 -239690 -66895 -104576 -126456
5453 -126456 71813 -80720 -255489 -278632 -263405 -372275 -622074 -634241 -518899 -410733
5443 -410733 -190981 -19147 -4378 -236465 -172045 -149622 -320801 -122990 125826 44223
5433 44223 109869 310835 199083 -94905 -313575 -174649 192843 395506 337737 125572
5423 125572 29016 74122 121768 249337 156910 -11259 -104521 -182478 -67722 -49720 10306
5412 10306 -66543 35018 194382 159984 88586 192646 128316 337944 453123 362346 -94118
5401 -94118 -321112 -263860 -116668 -96454 -172667 -159466 -68641 -39489 -178745 -206255 -201877
5390 -201877 -110722 -76624 -181619 -174805 -10774 169253 126200 105273 -118419 -19831 161265
5379 161265 23170 -190427 -315774 -209618 -252704 -431563 -377051 -263813 -332658 -326952 -306272
5368 -306272 -195456 -124978 -214348 -267227 -308383 -271477 -190609 58009 -103113 -291898 -434892
5357 -434892 -495293 -221608 -270105 -343840 -105771 268106 361206 128522 -241798 -221845 -104276
5346 -104276 -41427 -38905 -192035 -83570 12970 -55185 -40021 -153227 -5489 122385 77702
5335 77702 -16912 -13064 -6507 -54523 -107240 -158773 -51432 -105186 4199 -63118 -243758 -322555
5323 -322555 -328287 -423314 -474130 -324414 -375688 -372538 -227159 -325066 -63719 -180841 -375874
5312 -375874 -207548 -38681 -110987 -166806 -236577 -6965 129969 132200 -236792 -445863 -554082
5301 -554082 -692401 -369519 -301184 -400796 -353803 -140507 7668 79712 108236 -151275 -192087
5290 -192087 -160411 -68925 194913 340798 298538 -15038 -112338 -212021 -238338 -125311 -167463
5279 -167463 -36292 -996 -162161 -53914 -118986 -187811 -194777 -131896 -221879 -241539 42884
5268 42884 29624 -130792 -209949 -254512 -166718 -151264 -221956 -265496 -65325 69468 18037
5257 18037 -45031 -213815 -230914 -118651 -194448 -180284 -92257 61603 119387 61130 3126
5246 3126 -124701 -274616 -250126 -14323 219024 109354 -89348 -61006 61556 117009 -57187
5235 -57187 30690 -25637 -47576 96085 50122 165083 -7548 -45996 -95809 -35454 293899
5224 293899 335802 241737 195362 94661 220871 262862 213232 415829 312531 148414 -13294
5213 -13294 -126045 -222773 -89794 238877 156917 84807 122718 -47035 -271599 -299989 -247621
5202 -247621 -238791 -148972 -217106 -370309 -431976 -445739 -225951 60168 85654 168321 265999
5191 265999 310976 256977 368994 243153 132426 276483 155077 326109 164708 28918
5181 28918 -145515 -99793 65729 -63392 12579 44015 -11230 -56442 -185851 -344990 -303483
5170 -303483 -160650 14437 132436 99197 123579 284920 152247 286502 329855 182564
5160 182564 -223950 -261026 -5956 117513 91467 70997 -171142 -169602 142590 352536 262670
5149 262670 466965 606283 354761 96283 -59914 -22544 64143 99750 -44527 -81804
5139 -81804 21447 28765 97958 6314 -106606 -112785 21210 264674 211407 -23324 -1491
5128 -1491 44849 35843 -98347 -53311 -77191 -116305 -206136 -324632 -250911 -171657 23928 72700
5116 72700 85146 -60285 -438022 -592066 -286078 3249 182603 308412 94155 -74539
5106 -74539 210749 258628 36635 -109279 -136305 -43106 -150080 -133281 -202192 40703 155676
5095 155676 60216 -21516 31703 96424 282477 66908 -224859 -142295 -17224 -174252 -223057
5084 -223057 -133943 -91599 28088 55688 75510 1021 -55085 -197187 -368557 -137769 -136413
5073 -136413 -230075 -237064 -296886 -250009 -55457 9614 -58990 -90798 -150503 51631 154669
5062 154669 21652 -219568 -514016 -549558 -260626 -140338 -242607 -176875 53526 53023 -98141
5051 -98141 -257881 -8796 173905 259355 320284 191975 18485 -88638 -148341 -173493 -86072
5040 -86072 204996 234595 168117 56336 263103 173292 153164 -18080 -200867 -48461 215961
5029 215961 272733 101590 -87914 -174456 -236862 -126817 -5206 21714 82875 151273 69779
5018 69779 64273 66683 15942 -42864 -134828 -201979 -369099 -348359 -271365 -332785 -399480 -227302
5006 -227302 -335207 -380295 -88494 310922 399371 286659 140361 74601 -160325 -381270
4996 -381270 -411522 -449508 -451411 -535596 -583875 -520400 -568141 -504655 -217108 -40865 -57871
4985 -57871 -148602 45016 66258 163463 172900 182770 101185 90415 66445 106085 8495 16784
4973 16784 129916 -94 -12593 -25589 -93950 -130088 -78007 -297357 -516449 -531927 -456361
4962 -456361 -294778 -183916 60393 -27998 -57362 -93391 -149221 -174503 -239375 62394 185558
4951 185558 88386 71205 263409 355587 241706 343752 328827 -15787 -98463 -9763 -39921
4940 -39921 305505 16723 -33297 -115079 -68672 9914 52314 173919 293167 474532 417460
4929 417460 118198 130298 235914 406951 427433 341952 68219 -232069 -364775 -433108
4919 -433108 -366836 -275323 -244153 -322869 -442239 -553880 -519838 -408623 -341575 -351562 -59918
4908 -59918 80645 -46835 -69580 -142082 -373992 -387285 -366682 -204172 -108097 72540 215121
4897 215121 119790 171199 -118246 -265812 -313844 -85062 -101052 10758 77869 144550 255313
4886 255313 398283 202424 156468 130334 72007 -110953 -40607 -30723 292668 97469 -218558
4875 -218558 -194765 -202939 -91479 -176518 -536758 -388070 -21751 106827 -43949 -151147
4865 -151147 -41830 -10698 160811 72344 -38010 -124443 -321236 -212047 1124 34724
4855 34724 -185159 -213294 -275891 -490796 -465187 -347588 -222259 -166012 -133864 94958 266761
4844 266761 396920 235782 -35487 -204650 -377730 -218882 -137570 -229215 -303931 -77094
4834 -77094 -8124 -165662 -282951 -77793 151359 431092 322880 38738 188302 212077
4824 212077 179141 147953 103842 34281 -6118 166884 493349 442222 139771 10680 335619
4813 335619 563985 421743 180403 -112314 -111710 -202058 -469664 -629332 -345275 -148549
4803 -148549 137798 144034 80006 132758 130161 147291 134359 -265008 -423864 -272872 -91742
4792 -91742 -46993 -38280 -108043 -11572 78828 232218 222117 133707 -84389 -54733 -176957
4781 -176957 -312558 -362124 -192995 144257 118022 145694 218490 135128 -101359 -209969 6706
4770 6706 147011 16061 -317395 -348857 -606065 -626937 -396420 -93393 190197 233942 167153
4759 167153 -61563 -128173 77638 307796 322732 208979 191053 158302 99859 113631 88338
4748 88338 130045 -12168 -162004 -93689 -28403 -9336 169149 282486 133102 47606 -50811
4737 -50811 8188 122234 30626 -16134 -125642 -184840 133840 -37840 -134018 -122558 155843
4726 155843 330299 303257 125659 118736 106726 -99254 -177322 -174367 -320885 -206990 89164
4715 89164 102627 132191 257769 203478 11202 34359 104414 217672 268586 156275 163185
4704 163185 174631 89798 125947 284116 175871 241676 230928 -30075 -143971 -88618 -263842
4693 -263842 -206417 -238618 -244835 -104961 -7134 -135808 -209103 -450352 -214974 -55338 -113364
4682 -113364 -104165 47620 54889 -149737 18271 85811 -108485 -293332 -282966 -34246 179980
4671 179980 -35999 -77070 -124417 -213896 -292363 -254849 -126264 -46544 92176 9219 -83905
4660 -83905 -279516 -357684 -309056 -224243 -149095 -301964 -329144 -96764 189720 285730 186913
4649 186913 364460 277825 93119 -113595 23959 43206 -176011 -419598 -274098 48249
4639 48249 -102685 -183332 18685 -19488 -27589 -84940 -34654 -243857 -55022 -23282 41195
4628 41195 76226 -80373 -50453 -154778 -317959 -424054 -453234 -465089 -299382 -135341 -244822
4617 -244822 -184893 -79936 -161064 -267522 -374808 -384154 -412388 -218496 -161352 -14373 -9768
4606 -9768 -54580 -197771 -143282 -33833 289963 203156 -60949 96547 148454 -130907 -341137
4595 -341137 -41349 62269 283645 358896 415983 433809 284691 -178109 -189108 -187759 -194024
4584 -194024 -295803 -429245 -587128 -745293 -633454 -410678 -275914 -97323 75353 208147
4574 208147 -27193 -103318 -3444 38698 132426 131425 231965 166065 153060 46567 -24959
4563 -24959 -260884 -408509 -325305 -49323 -83295 -309708 -390449 -309039 -12377 228066 183500
4552 183500 -7814 -7750 -146913 -164097 -204408 -257903 -307422 -379360 -239169 -246833 -129723 -7222
4540 -7222 104631 365172 705933 482425 207505 147259 285720 337786 242016 168718 224799
4529 224799 255106 393097 443383 194857 -65292 -119311 -84744 -98040 -169092 -246510 -419748
4518 -419748 -202511 -167156 -191688 -52343 -38594 -293749 -484838 -442952 -390570 -184111 75497
4507 75497 187765 134747 149905 181594 83738 -294609 -253107 -122415 -21484 160422 127826
4496 127826 -30695 177894 146746 -42373 -266045 -197359 -305199 -358564 -469240 -409768
4486 -409768 -118174 -43760 100113 104785 226257 212209 120470 -59920 -152184 -220270 -74371
4475 -74371 -81390 120071 332413 316250 80392 52529 -87860 -213953 -187929 117977 250628
4464 250628 137510 -107827 -81079 20957 -44853 -116811 -265692 -219138 -212160 -485760 -558609
4453 -558609 -453618 -308451 2649 241259 74993 2799 -208634 -216683 -337832 -523735
4443 -523735 -162230 176395 49850 -130997 -182430 -40073 134092 218805 48485 -31668
4433 -31668 -296611 -357623 -449697 -452366 -347511 -203543 -170908 -188478 23670 -89349 -448803
4422 -448803 -576894 -444401 -241657 178946 182368 -197483 -364159 -255371 -167395 -60423
4412 -60423 -67427 -18579 -78670 -151940 -140372 56562 -92259 178463 565746 696545 680603
4401 680603 620877 499543 288770 253506 342699 470104 181708 156334 123293 94724 -27652
4390 -27652 29144 -25802 -12392 84968 29262 -51843 -212947 -339721 -270406 -303131 -474592
4379 -474592 -321973 -144911 -37810 -108994 -150140 -293291 -456889 -487245 -266942 -145010
4369 -145010 66066 142532 198167 187466 -33862 -91890 108117 37589 281058 250441 216808
4358 216808 72042 34319 15913 -138918 -252576 -340999 -245364 -5920 210316 379226
4348 379226 227820 -17714 123732 369071 268759 18486 -419677 -592598 -532530 -244390
4338 -244390 -85468 -69328 -34250 -120248 -374300 -462783 -319887 -285617 -341362 -272843 -452530
4327 -452530 -565397 -519612 -241449 -83887 26851 232298 379644 286303 -547 -88950
4317 -88950 -183068 -250461 -189309 -39329 -106815 -153335 84260 354606 255295 -83574 -167172
4306 -167172 -287795 -265550 -283281 -403277 -210028 -124598 43584 -78197 -423890 -647338
4296 -647338 -612857 -521881 -316066 -248364 -318759 -297922 -124434 -159841 -137355 -164725 -396411
4285 -396411 -232268 -321502 -405547 -463209 -525468 -521392 -364699 -202203 -175600 -287352 -350997
4274 -350997 -568167 -585158 -311794 -332055 -150290 -17948 -24214 62464 183732 266509 368537
4263 368537 283276 17539 -29476 -224308 -57914 3500 78727 263921 290015 254084 147126
4252 147126 -60566 61075 18659 -318100 -130763 171915 196939 -58183 -152179 -293058
4242 -293058 -377111 -175537 -54857 -201364 -57573 -183558 -330132 -286087 -243819 -6447
4232 -6447 -151169 -266772 -144302 -67205 12645 -61508 -46543 -325937 -405406 -258092 -9982
4221 -9982 163946 212945 98785 -7627 19639 121501 61971 29300 6218 -50116 -220713
4210 -220713 19234 163103 210455 49858 -108090 -128235 -40026 -116318 -76941 78182 128537
4199 128537 12846 101697 74717 35707 103461 -78759 23486 324800 295579 97108 180774
4188 180774 -56720 48661 373908 354857 14304 -222511 -151585 -294680 -438302 -647234
4178 -647234 -682115 -457585 -300528 -501877 -535316 -239050 -422314 -389217 -204091 -107663
4168 -107663 -11323 141119 84548 1633 -5523 6194 96995 40683 69388 108642 27840 -61256
4156 -61256 -79950 44570 -143462 -217077 41368 74172 -89794 -378414 -535491 -496219 -512275
4145 -512275 -638434 -637037 -560804 -343756 -173542 -280835 -204575 -271640 -344805 -408610 -349094
4134 -349094 -149481 -15488 -77038 -16586 -229337 -410897 -261945 -88218 88747 159288
4124 159288 112488 42424 -63818 32033 467954 678559 390278 227649 58337 150747
4114 150747 250857 97414 78102 11285 -141513 -49912 163068 54895 -179187 -310797
4104 -310797 -186283 -102550 32427 166664 -635 85644 184705 153634 225937 49158 218214
4093 218214 264360 126095 73074 197068 306485 301085 332669 346385 288711 74843 -51989
4082 -51989 -48359 192359 45531 -25269 -44909 -256543 -441172 -367029 -306843 -190554 -35356
4071 -35356 288654 207540 -63906 -139549 -64989 -74197 73511 -34105 -147466 -83974 -251556
4060 -251556 -322146 -254310 -222049 -82833 -45923 -37847 160615 179746 -6235 -218801 -152552
4049 -152552 -223847 -292247 -164326 -97166 12727 70219 -41314 -36356 78469 10994 -97579
4038 -97579 -172860 -285138 -133389 77471 -38270 2615 -204023 -149861 86921 254800
4028 254800 479130 525168 329805 -14594 -212875 -293733 -247983 -387256 -300551 -69482
4018 -69482 -127081 -189387 -207297 -162203 -20928 101448 169099 68673 -65673 -141411 -343409
4007 -343409 -549184 -676533 -693248 -513015 -406372 -247140 77914 141336 100926 119384
3997 119384 8488 -350616 -65134 337002 276517 190325 -60674 -136666 -117050 5433
3987 5433 -1080 18042 -43532 -357582 -358777 -183891 -25712 166194 203945 173977 103658 3195
3975 3195 -31273 -15578 -37130 -739 49668 161781 42531 -33956 61900 106371 -142750
3964 -142750 -380696 -353394 -251191 -215664 -91241 303 -83063 12732 110863 38340 -156040
3953 -156040 -100213 -49145 132460 196603 237578 26374 -323555 -235024 -166350 -163519 -153879
3942 -153879 -155507 -35192 74437 72322 -31808 -194097 -127750 -259967 -249926 -72095 5266
3931 5266 189660 127090 16925 -77670 -25786 169035 113634 125422 -16765 88448 -18199
3920 -18199 150072 272107 328496 -146689 -314634 -229353 -272616 -363861 -232482 -44933 -64257
3909 -64257 -228639 -337129 -392479 -145731 -6418 -86638 -174662 -108264 -26402 340941 497226
3898 497226 637275 763322 526440 105300 -189699 -13787 240841 197152 158038 115881
3888 115881 99544 163026 56996 -105570 -5518 -164095 10386 82279 114004 234118
3878 234118 260285 233341 72779 -136498 -442068 -530969 -420370 -366786 -312232 -208963 -185223
3867 -185223 -144213 -72227 -156930 -335439 -427758 -430030 -393859 -379018 -255361 26141 -186033
3856 -186033 -263544 -255552 -85135 23353 15116 -155658 -136328 -231403 -187054 -188136 -102004 -267282
3844 -267282 -416550 -368353 -326778 -262364 -291178 -273324 -215747 -152185 11902 52093 174536
3833 174536 359237 135497 113767 24049 53187 103231 72870 39919 61187 149751 -55219
3822 -55219 272341 446550 366871 322315 229374 9651 -64256 -81622 74378 9180 -83007
3811 -83007 -230736 -251796 -462801 -316780 -182456 -227865 -468881 -451796 -112777 -19442 -117390
3800 -117390 -1691 -70484 -190201 -40785 123305 114070 167146 215548 -50254 -75211 96977
3789 96977 227780 268217 113346 87173 280086 526579 475786 211923 62093 47708 -44148
3778 -44148 -84046 -162337 -77180 16590 55281 -49620 -107497 -41708 -54666 -331205 -434922
3767 -434922 74181 312889 397433 209836 244108 202332 278936 343614 217742 202565 -130570
3756 -130570 -157699 -20625 257624 201725 -44387 -145176 -32792 -45928 -68792 70167
3746 70167 231764 406934 96412 -303004 -200918 -42677 -52585 -168001 -174717 85220 -67413
3735 -67413 94535 209151 105312 116245 2167 -112763 -87346 -140664 -346777 -503367
3725 -503367 -528171 -250970 -170725 -217130 -151969 -139279 -152021 -35660 169233 29515 190492
3714 190492 228561 -44221 -62488 -84669 -226757 -55780 31660 267054 306238 174023 91138
3703 91138 -64939 -141095 -208661 -36534 48738 -26421 -113050 -137935 -99919 -28956 132141
3692 132141 93124 90692 -7696 -39273 -199938 -133045 -158151 -72522 12710 -185873 -206147
3681 -206147 -393776 -179381 -36780 74356 -13678 131355 142940 76710 87294 331772
3671 331772 411114 249362 105706 5365 -72437 -156026 -268782 -365498 -290378 61076 -6718
3660 -6718 -152798 -321408 -365488 -330531 -398519 -315038 13489 153279 196348 458 19
3649 19 46025 -151560 -277512 -380649 -270249 -333527 -407315 -319036 -303461 -308582 -40159 64948
3637 64948 27745 21999 -38357 -37401 -63652 92154 92801 73461 -230021 -265842 -59517 -82294
3625 -82294 105609 7261 -262074 -58207 -31249 13687 147936 381390 295413 214173 -42193
3614 -42193 -59249 -41740 12902 146495 202591 313531 170525 205688 305154 86142 10145
3603 10145 291308 531338 487213 298502 105427 153243 159490 247729 338315 -5472 -112604
3592 -112604 -80395 179389 189551 -78957 145770 149554 40110 89195 251927 257478 296925
3581 296925 219062 294296 328495 158982 -113152 -296274 -529928 -397246 -229598 -277670
3571 -277670 -448129 -260198 -25432 38637 -33339 -103747 120768 83941 -129913 -158631 -296373
3560 -296373 -440203 -299500 -92054 -38306 -123272 36971 107331 63192 37751 -113307 57177
3549 57177 251613 190666 -66712 52 188771 219947 301553 165347 69149 -119690 -136973
3538 -136973 19874 79414 -23322 -127177 -236180 -240144 -193093 -145303 -93734 -198858 27679
3527 27679 156399 61705 -144992 -163389 -264363 -332265 -365520 -266018 -211305 -274863 -528455
3516 -528455 -504680 -400805 -172313 -114118 -48642 -59604 -93964 18763 -256746 -174256 -18372
3505 -18372 58361 -130373 -184369 -208685 -62956 289756 330207 93391 46960 -286055 -413972
3494 -413972 -322641 -52182 -295239 -231277 136120 250773 -38540 -229264 -231940 -169586 -68722
3483 -68722 -68660 -154444 -260154 -98573 -139236 -150392 -176865 -71607 -107829 -148013 -52697 31393
3471 31393 -42703 -97326 -178634 -147215 4984 -32494 -94391 -160742 -177993 -285108 -211676
3460 -211676 -201159 -160272 -53406 63516 -29830 -178892 -373349 -214640 281 91172
3450 91172 345631 359643 291828 425812 565052 226866 -30944 -114707 -55625 115496 130184
3439 130184 242010 433158 283693 293888 442111 414854 218397 10178 -230668 -45822
3429 -45822 125466 60285 -184154 -208970 -402803 -390328 -137374 40656 182169 342758
3419 342758 139793 -121662 -90623 -15633 1310 190399 301926 198546 572 -52786
3409 -52786 -298408 -391971 -205880 57960 171196 -52902 -39175 144454 327291 475592
3399 475592 543504 408672 275338 150424 138912 177522 313458 221403 32131 -137175
3389 -137175 28059 100191 75196 18407 93037 337540 236618 -106629 -399612 -236430
3379 -236430 -111854 -26801 -195020 -137013 -2549 -36934 53918 216087 198806 36848 261804
3368 261804 406401 521131 526034 390207 244796 245190 28422 -232761 -139216 -159250 -150955
3357 -150955 -68950 -11120 45103 133150 277002 312785 343384 157619 -41138 -283241 -173541
3346 -173541 -119589 -111013 107750 104839 141400 104501 216367 198915 -78857 -237464 97091
3335 97091 353573 290234 15951 -85640 -205557 -284774 -492369 -270998 -88033 -195798
3325 -195798 -329603 -404880 -409061 -362268 -349835 -216135 -244183 -204299 -266725 -77872 -112169
3314 -112169 -419997 -553478 -466054 -387070 -318940 -263879 -197063 -165425 -212943 -128756 -202315
3303 -202315 -130052 -149982 -99755 -96877 121129 235205 86833 -42751 -12648 138107 285411
3292 285411 306792 202361 195895 81026 -104920 -168945 -329986 -212115 -302077 -299784 11999
3281 11999 63527 122523 -27268 -111094 -240938 -243786 -42766 39949 167258 284835 172021
3270 172021 224682 268189 45043 30850 85458 173057 214171 54962 50032 56197 10776 -242739
3258 -242739 -114135 258927 266120 221706 253942 145034 232113 306087 131637 -6983 -116345
3247 -116345 -221355 -232593 -244516 -173487 -56645 -9778 41542 -202902 -38469 -45535 -49276
3236 -49276 15041 136414 123617 -129659 -257912 -199440 -271522 -215926 -16305 90672 40431
3225 40431 -136331 -244807 -263988 -212068 -26773 60000 53311 -355278 -328783 -315372 -346435
3214 -346435 -22898 80882 197510 219538 71875 213880 264933 180418 11928 -219698
3204 -219698 -379783 35944 210884 -15861 -463473 -626710 -552671 -537727 -600495 -621452
3194 -621452 -362427 -309025 -296863 -94217 -245272 -312439 -290479 -70287 94995 117641 -128234
3183 -128234 -80482 -64105 -12173 92335 209779 121139 -51522 -14619 -55808 -38760 74686
3172 74686 217641 105809 4447 101901 128764 31037 190999 115503 77599 116022 82305
3161 82305 -56915 -52441 27527 119813 90027 -44580 -90897 -110535 -94181 -191735 -129674 -167900
3149 -167900 -376257 -396249 -174171 -189850 -389075 -384472 -121464 -35798 26432 -23869 -226361
3138 -226361 -240679 -243704 -78640 46264 175759 190374 332919 287931 351484 322779 209115
3127 209115 112781 387230 221370 157099 190477 57997 247887 285419 296732 323480 216881
3116 216881 14501 -118766 1704 139932 271520 49685 -149135 -135991 -43750 88220
3106 88220 170290 377744 406508 534930 503593 405943 122432 -40683 206985 295896 214181
3095 214181 50878 -3773 164780 286844 303340 331398 234665 157437 174741 171769 104816
3084 104816 106788 204476 116799 8345 -154618 -332007 -72210 179378 141605 203278 157964
3073 157964 -20157 14584 -125439 -96664 -141003 -92458 -55379 225451 262799 87696 267891
3062 267891 261504 110858 74283 277789 535123 335444 303455 554646 618922 450744 129136
3051 129136 243500 319300 442439 304126 51916 -60450 -178609 -169410 -117641 -23696 -63603
3040 -63603 218103 383678 272998 104236 -25226 -179114 -201272 -117616 -198991 -5977
3030 -5977 1966 -112467 -64823 -59299 -85539 -9158 59766 -15574 -196915 -165144 -80482 719
3018 719 136352 -68471 -85022 22791 -88716 -98540 -90873 -7376 190594 170947 43898
3007 43898 -124194 -285414 -201537 -87524 -79146 -45835 -173038 -187313 -229678 -320718 -443341
2996 -443341 -394994 -169037 -123247 -171295 -350370 -244986 26875 134779 209868 71320
2986 71320 -236121 -360316 -381090 -293208 20758 -202087 -378865 -259517 -23718 135636
2976 135636 79740 79788 40312 -127881 -209140 -86146 69121 191221 170372 -10780 -64221
2965 -64221 -147904 -61458 -184459 -396778 -306170 -123181 10135 421623 484928 245505 220705
2954 220705 151536 73403 -36838 -283772 -338946 -273555 -271908 -210706 -17324 -83568 -137899
2943 -137899 -178727 -81214 179936 155157 -48609 -209586 -61691 -107931 -150804 -30138 49125
2932 49125 -13889 -141528 74820 89895 -320305 -468878 -464508 -684333 -847387 -785840 -565344
2921 -565344 -329412 -77681 324223 320728 57686 30940 -73914 -269967 -171959 -309463
2911 -309463 -264835 6322 -10394 -14490 -46477 -229855 -247373 -132680 -62677 -100031 -196952
2900 -196952 64372 349186 449518 484546 264003 -2535 -202906 -263962 -288914 -357741
2890 -357741 -321623 -116409 80869 120549 164014 325451 234896 -53815 -249910 -142952
2880 -142952 -385876 -516166 -350551 -130740 -219177 -295255 -197521 -64681 -245101 -378499
2870 -378499 -285280 -226668 -82926 -46013 -24167 7399 -152590 -187003 -45483 25269 3694
2859 3694 6838 241587 169955 66090 49046 228855 317162 81441 24013 -43972 -97790
2848 -97790 -77965 119750 219419 275710 161569 -115128 -261481 -82602 62330 274210
2838 274210 397019 292937 13979 -83696 219445 336372 369454 189224 -139337 -319262
2828 -319262 -235022 -107887 -42422 44105 65698 206786 190991 -155830 -240270 -216856 -27231
2817 -27231 42083 -24178 256760 423992 303172 259816 113570 -136160 -328247 -399390 -213093
2806 -213093 -66201 187251 173946 187821 206640 205034 147193 -83028 -181425 -42760 145566
2795 145566 130684 305176 160561 208459 307597 -74412 -334558 -439713 -281362 -66165
2785 -66165 -25824 -103187 -262073 -207723 34075 -79096 3441 -11863 -105393 -173764 156602
2774 156602 405564 482928 289809 196362 90585 147265 224253 62062 -170238 -140211 119409
2763 119409 37730 220273 379969 159969 -86125 80963 360942 275542 361475 218319
2753 218319 -163192 -364045 -338258 -234240 -188736 -81868 -37271 161177 147955 114942 87792
2742 87792 3085 8526 -186119 -162346 -2398 180370 -135479 -336693 -330320 126676 346012
2731 346012 614661 481716 488195 343467 1999 -267109 -310418 -20333 -2393 -221572
2721 -221572 -87995 -132201 -215220 -112830 -137680 -242542 -286282 -149020 106650 171909 128078
2710 128078 225698 212983 -96958 -139774 -54572 132880 196124 468 -449352 -678990 -269622
2699 -269622 -88180 -76578 149293 201733 54316 -25824 -210925 -259704 -270126 -95352 63661
2688 63661 74139 -88621 -82960 55949 18218 -27992 -109477 -103133 46557 57345 -86616
2677 -86616 -136349 -141945 -121530 -231498 -222927 -102682 44280 194926 167955 154923 83305
2666 83305 80237 205080 526868 510953 254030 57076 -113923 -280426 -402809 -397836 -185434
2655 -185434 -116082 -213265 -227993 -232046 -187564 -88196 -170138 -209951 -35442 -87604 -145440 76505
2643 76505 178658 244341 50253 -147011 -49710 15186 70814 122681 142407 -73098 -94523
2632 -94523 -2536 36324 50981 -105326 -59122 117097 47294 -7917 52603 30490 26929 255601
2620 255601 362055 269147 424208 320364 44195 151228 228166 181495 117664 -89901
2610 -89901 -125598 15438 -220329 -234358 -291031 -182411 -134434 -75825 47322 -114012 -364631
2599 -364631 -179674 36289 162519 241679 -44514 -270060 -169753 -220536 -4616 -72340
2589 -72340 -83154 -35068 -105020 -121721 -116714 -2780 -155503 -99944 -93807 -254970 -131162
2578 -131162 -186794 -227144 -308586 -269842 39732 276317 35580 -82969 -82860 -74909 -281963
2567 -281963 -423287 -418844 -394896 -239909 -284933 -316404 -480532 -168537 -156555 -205832 -260680
2556 -260680 -330520 -346588 -320068 103797 92392 59824 222596 170738 83784 56516 -13434
2545 -13434 66477 44210 -246710 -299533 -217252 -229649 -23253 31661 217506 284714 135675
2534 135675 -259330 -155850 -50610 -31623 -88336 -186893 -351434 -487543 -446042 -211499
2524 -211499 -159450 -242519 -227178 -136302 -79341 -15504 75233 225255 450349 361630 336105
2513 336105 240660 167666 19060 1083 132284 390459 424596 414417 404570 157687 -106915
2502 -106915 -405119 -278076 -290521 -387536 -262734 -109473 -153922 196737 379763 441730
2492 441730 482450 206776 148061 164701 16832 -118907 -90094 126318 485593 506388 386291
2481 386291 298678 320171 330659 379343 316596 172388 27498 166357 412784 375490 314860
2470 314860 352610 380098 223897 -74080 -76013 -130344 -264393 -424608 -260629 -164456 -128073
2459 -128073 -116598 -151286 -77364 144216 170315 84322 93509 274856 293765 354676 385980
2448 385980 333043 110182 -41655 104675 -140773 -87383 -16365 -69145 -122580 -262575 -428443
2437 -428443 -279251 -211775 -19870 132221 12069 205629 388539 231021 -87158 -245181
2427 -245181 -183439 -253887 -411227 -270271 85009 125363 66097 146994 -10323 122681 390226
2416 390226 358696 197447 317545 442701 448120 375208 279267 157077 43941 -42926 -313293
2405 -313293 -343465 -82415 -256716 -200150 59045 484908 410594 225722 -93616 -358597
2395 -358597 -445035 -158213 29267 77395 180581 232724 347686 183545 62281 -150348
2385 -150348 -162048 116072 169648 142993 352106 214152 195860 368153 184812 -39283
2375 -39283 6950 87430 -125929 -138377 -66586 -12757 141785 -54176 -61707 -451 8145 -259767
2363 -259767 -398693 -164042 5955 -48643 -12555 78504 79362 -162371 -245922 -148099 -161273
2352 -161273 44542 130982 62573 79681 -82681 -113896 -16391 220122 104553 -134463 -36955
2341 -36955 -165848 -560067 -486203 63104 410511 298376 226303 395449 85174 -74518
2331 -74518 -100012 -168020 -290769 -253703 -219826 -80547 70153 137180 238951 346906 124350
2320 124350 -223545 -229190 -93965 26672 -819 -167017 106883 298395 442175 400704
2310 400704 319610 276803 346313 222212 199161 143467 171630 249939 121102 -77763 -116748
2299 -116748 -37092 209580 573938 672771 576629 467360 619323 439833 305080 439051
2289 439051 420696 329423 270826 42063 63834 154321 300804 141081 -13111 7885 20569
2278 20569 -171680 -215610 -180373 -110266 -101580 -217841 -299942 -61603 125533 16683 132082
2267 132082 272266 163245 974 -106721 -232504 -318821 -239308 -285251 -347277 -351327 -430859
2256 -430859 -237629 -176494 40262 -34497 48611 132824 197949 52184 6149 64043 164085
2245 164085 137852 -263453 -269791 46003 18731 -128929 136207 205707 221095 78075 69447
2234 69447 -24734 67969 165399 -112963 -275062 -36283 -28290 -394863 -449656 -339290 -182833
2223 -182833 -281948 -512518 -540511 -360665 -235779 -77994 101054 68164 -88238 21915
2213 21915 180079 196354 224057 318227 269142 157186 214106 199526 -171525 -264363 -303251
2202 -303251 -354173 -394733 -385831 -397073 -45306 201019 149811 -162126 -334920 -289581 96804
2191 96804 254524 -32078 -327005 -180920 22088 -145483 -191977 9722 420291 279134
2181 279134 -65020 -245276 -261645 -125886 135725 202173 -41881 -172147 -137947 -130027 -78109
2170 -78109 -69851 -330740 -221185 -63620 123207 223804 -45966 -115787 154496 220766 83541
2159 83541 -150389 -228402 -146545 -119322 142785 265537 319135 368166 327722 447366 38690
2148 38690 -55501 -164372 -164000 129226 207988 33555 -266808 -152849 71800 56022 62193
2137 62193 154963 -71943 -132953 -334094 -389548 -318146 -232309 -237660 -133702 -28755 -40688
2126 -40688 -91737 -210744 -395520 -414502 -357898 -115770 -38000 91765 206680 202634 125277
2115 125277 162220 44321 8067 22598 151045 394867 330316 166014 281416 246623 132347
2104 132347 118853 90590 73168 48524 -31012 22278 -61210 118339 31908 -274725 -444659
2093 -444659 -338462 66177 213035 266133 114700 -110226 -122217 -2434 12249 -158772
2083 -158772 -232495 -140998 133729 97243 236591 198196 71722 -1706 -56495 -117973 11171
2072 11171 149851 -214248 -379792 -258588 -21010 26819 -67739 -6912 112712 244510
2062 244510 288526 486940 471253 93463 30141 251119 490976 547719 391007 77664
2052 77664 -79786 -108528 97787 186185 314179 391795 481223 208084 -11301 -172087 -234887
2041 -234887 -192343 80352 206290 318433 219745 259514 7893 -114487 -292689 -227988
2031 -227988 -33703 158362 109148 82385 -87876 -191142 -148484 62489 24939 -87964
2021 -87964 -322645 -225973 -142549 26036 205304 369243 365642 1875 -33245 -10501 163178
2010 163178 72350 -200875 -243718 -91202 -24309 -65998 -11944 -114980 -154057 -22568 -122785
1999 -122785 -18878 77251 18927 -86086 -98957 202618 232477 170113 78494 -38943 139249
1988 139249 148870 141228 140517 316115 360944 477582 342392 189841 236623 65089 -24691
1977 -24691 191956 220061 172821 74655 -41102 -14849 -59216 -141364 -7387 -234653 -35857
1966 -35857 -36372 -189786 -491406 -499590 -210351 -16411 138444 196516 332889 373073 190984
1955 190984 191570 217581 -28212 -247207 79779 232164 -117995 -267488 -301802 -418815 -58514
1944 -58514 -174095 -335565 -358200 -119731 -155804 -110613 6177 146088 212124 92454 183786
1933 183786 283297 388313 252171 -57276 -20305 42402 151784 217901 150381 253389 108401
1922 108401 14005 -19566 -118181 -65273 -100071 -163446 -364481 -380691 -304159 -133868 -43383
1911 -43383 -8363 -68129 -249400 52239 242354 283250 273293 -41183 -307068 -252640 -327676
1900 -327676 -364527 -199953 -64181 86756 206066 276242 284629 106110 -117836 -196380 100574
1889 100574 -6229 -107752 86604 -13395 -3011 -87181 -80492 -71021 -107182 95922 379045
1878 379045 362285 161247 -854 -106271 -28721 -71185 -296834 -75555 3571 -64488 -346390
1867 -346390 -262751 -379414 -283653 -161666 -103520 -166528 -119526 77968 -10404 -150086 -257878
1856 -257878 -377847 -441853 -425387 -440712 -308269 -317151 -239696 -82759 -164285 -142572 -41682
1845 -41682 -112348 -56378 195342 115882 -110683 -299330 -276418 -397423 -227658 -14862 -162975
1834 -162975 -343677 -171448 -55522 251742 54042 -294924 -258058 -115960 -114309 -78179
1824 -78179 -190591 -411286 -339562 -27084 36198 38782 245010 230964 122820 129427 176480
1813 176480 351781 260353 121025 176722 -74713 15904 86750 247032 328879 151679 118690
1802 118690 71671 108571 311571 192743 314034 328231 146630 -53153 -81559 -159585 -158684
1791 -158684 23335 186505 -8743 -254948 -351182 -233121 -119815 -331482 -418364 -149492
1781 -149492 34610 112147 268749 231972 246149 232845 194514 157508 -87737 -13876 138456
1770 138456 219871 239063 -107567 -165798 -259139 -438215 -318146 -438503 -384374 -146765 -21514
1759 -21514 -148497 -131331 -31829 61598 147870 229778 246408 181865 101275 129112 198585 174579
1747 174579 148628 48574 -28810 -284469 -412096 -460805 -277010 -156476 -235816 -270881 -128821
1736 -128821 -131561 -193753 -290047 -320618 -323038 -315029 -256762 -199841 -132204 183189 100400 139536
1724 139536 149742 245269 279442 169423 255539 406428 271347 157061 9791 152192
1714 152192 42888 -76800 73465 14634 37271 204171 308960 206602 24427 160479
1704 160479 59999 -124885 -231834 -224521 -43045 52672 152778 88139 -60099 -109754 -160848
1693 -160848 -29091 26010 188798 265130 1375 -200189 -497790 -336875 -149046 145572
1683 145572 346957 300996 -28027 -153844 -53013 381825 347763 122045 102657 96844 200726
1672 200726 247700 -6611 -183397 -149709 -48580 -44880 1774 -179630 -314079 -74114 179524
1661 179524 309192 260953 224452 243891 466839 468075 461570 244516 236201 184187 414733
1650 414733 388023 195592 30690 1213 -22766 -122325 -225298 -339269 -151717 -196614 -257349
1639 -257349 -279350 -193429 -21244 135476 67401 -5821 62928 105695 146504 145767 191566 169343
1627 169343 169326 144345 116788 -6279 137669 145191 191895 119487 87613 60017 -126097 8496
1615 8496 38026 13981 -5163 13336 53891 15982 -123203 -96001 116617 285687 268673
1604 268673 112765 -70116 -160279 91428 319239 405420 344951 -16452 -77676 30099
1594 30099 149074 282018 249976 14116 62319 99347 126959 231219 202924 182793 242166
1583 242166 198755 25876 -111793 -325623 -370202 -294605 -51511 71625 231630 291768
1573 291768 236488 53656 -195549 -237454 -153012 49375 285823 127775 163911 254594 324377
1562 324377 22527 -210703 -69438 116898 182085 422489 474030 228656 103336 228648
1552 228648 158920 93611 202116 236579 204853 -63497 -109451 -167115 -105247 -135594 -84038
1541 -84038 -118688 -130398 -142094 -318128 -344117 -358253 -461900 -452977 -386224 -167582 -97392
1530 -97392 -96458 -80014 -42418 42858 -44539 60371 152410 181660 90273 54937 152759 62137
1518 62137 263417 299010 79758 -140056 87483 -33017 -102064 -195311 -142379 16499 -268520
1507 -268520 -162500 -15934 -172941 -185157 -181738 -176424 -108444 -277998 -364324 -449594 -321076
1496 -321076 -80904 -400431 -666858 -588019 -513141 -505387 -320486 -85259 -99919 -127774 -61560
1485 -61560 -1022 190284 260297 63111 -48738 -23792 81633 223951 319775 201415 168486
1474 168486 -8125 -268807 -538854 -411513 -110832 -41433 -187732 -178498 -171791 -344194 -466565
1463 -466565 -387148 -236320 -6452 131833 58886 145051 105988 75801 -8510 73382 321556
1452 321556 507474 545334 457834 349462 377202 227853 256614 355654 516897 366829 202451
1441 202451 20471 -74964 -184025 20447 130569 208884 273436 125697 -25283 -109378
1431 -109378 -50125 294942 469882 405655 48975 -67895 193819 118577 -248501 -223903
1421 -223903 -183691 -105174 -107443 -146784 -318861 -250588 -144736 -88501 29948 -5517 -171166
1410 -171166 119245 568600 747215 512782 90308 3542 84138 193740 410895 419735
1400 419735 193410 -44508 108221 260233 202221 56125 16498 285970 235202 240541 283472
1389 283472 318750 236041 -9995 -92977 21827 67446 52973 -30668 -80898 102724 131223
$$ [...]
##END NTUPLES=NMR SPECTRUM
##END=
