##TITLE=Analysis number 318180
Compound Code ac 35967
Project Code adrs
Chemist Name frontier sci
+D2O
##JCAMPDX= 6.0         $$ Bruker NMR JCAMP-DX V2.0
##DATA TYPE= NMR SPECTRUM
##DATA CLASS= NTUPLES
##ORIGIN= Bruker BioSpin GmbH
##OWNER= nmr
$$ XWIN-NMR		Version 3.5
$$ Mon Mar 20 08:35:53 2006 GMT Standard Time (UT+0h)  MAYBRIDGE\nmr@NMR_250MHZ
##.OBSERVE FREQUENCY= 250.131544655141
##.OBSERVE NUCLEUS= ^1H
##.ACQUISITION MODE= SIMULTANEOUS (DQD)
##.ACQUISITION SCHEME= undefined
##.AVERAGES= 16
##.DIGITISER RES= 18
##SPECTROMETER/DATA SYSTEM= dpx250
##.PULSE SEQUENCE= zg30
##.SOLVENT NAME= DMSO
##.SHIFT REFERENCE= (INTERNAL, DMSO, 0, 16.522)
##AUDIT TRAIL= $$ (NUMBER, WHEN, WHO, WHERE, WHAT)
$$ ##TITLE= Audit trail, XWIN-NMR		Version 3.5
$$ ##JCAMPDX= 5.01
$$ ##ORIGIN= Bruker BioSpin GmbH
$$ ##OWNER= nmr
$$ C:\u/data/dgb/nmr/ADRS/951/pdata/1/auditp.txt
$$ ##AUDIT TRAIL=  $$ (NUMBER, WHEN, WHO, WHERE, WHAT)
(   1,<2006-03-20 08:35:28.23 +000>,<MAYBRIDGE\nmr>,<NMR_250MHZ>,
      <created by zg, POWCHK disabled, PULCHK disabled
       configuration hash MD5:
       84 BC 41 DB A1 6E 1D 46 DA 25 12 A5 C1 ED C5 3A
       data hash MD5: 64K
       67 22 F6 C0 D9 68 E4 63 3E 17 DE DC FA 3B 76 2D>)
(   2,<2006-03-20 08:35:42.98 +000>,<MAYBRIDGE\nmr>,<NMR_250MHZ>,
      <Start of raw data processing
       ef LB = 0.3 FT_mod = 6 PKNL = 1 SI = 32K 
       data hash MD5: 32K
       55 BD A6 CB 23 B1 A4 44 ED B5 91 A6 3E F1 24 98>)
(   3,<2006-03-20 08:35:44.54 +000>,<MAYBRIDGE\nmr>,<NMR_250MHZ>,
      <apk 
       data hash MD5: 32K
       3C 1C F8 5A 40 88 80 EF E4 BB 77 4F 12 88 2B A6>)
(   4,<2006-03-20 08:35:45.37 +000>,<MAYBRIDGE\nmr>,<NMR_250MHZ>,
      <abs ABSG = 5 
       data hash MD5: 32K
       1D C8 A6 46 F4 04 BA 34 E4 44 31 CD 2D 97 38 A4>)
$$ ##END=
$$ 
$$ hash MD5
$$ 10 8E 3D A9 5C 40 E1 46 FE 97 0C 25 54 C1 EB E2
##$RELAX= 
##$RELAX= 
##$RELAX= 
##$RELAX= 
##$RELAX= 
##$RELAX= 
##$RELAX= 
$$ Bruker specific parameters
$$ --------------------------
##$DU= <C:\u>
##$EXPNO= 951
##$NAME= <ADRS>
##$PROCNO= 1
##$TYPE= <nmr>
##$USER= <dgb>
##$AMP= (0..31)
100 100 100 100 100 100 100 100 100 100 100 100 100 100 100 100 100 100 
100 100 100 100 100 100 100 100 100 100 100 100 100 100 
##$AQSEQ= 0
##$AQ_mod= 3
##$AUNM= <au_zg>
##$AUTOPOS= <1 >
##$BF1= 250.13
##$BF2= 250.13
##$BF3= 250.13
##$BF4= 250.13
##$BF5= 500.13
##$BF6= 500.13
##$BF7= 500.13
##$BF8= 500.13
##$BYTORDA= 1
##$CFDGTYP= 0
##$CFRGTYP= 5
##$CHEMSTR= <none>
##$CNST= (0..31)
1 1 145 1 1 1 1 1 1 1 1 1 1 1 1 1 1 1 1 1 1 1 1 1 1 1 1 1 1 1 1 1 
##$CPDPRG= <>
##$CPDPRG1= <>
##$CPDPRG2= <>
##$CPDPRG3= <>
##$CPDPRG4= <mlev>
##$CPDPRG5= <mlev>
##$CPDPRG6= <mlev>
##$CPDPRG7= <mlev>
##$CPDPRG8= <mlev>
##$CPDPRGB= <>
##$CPDPRGT= <>
##$D= (0..31)
0 1 0 0 0 0 0 0 0 0.06 0 0 0 0 0 0 0.0002 0 0 0 0 0 0 0 0 0 0 0 0 0 0 
0 
##$DATE= 1142843726
##$DBL= (0..7)
120 120 120 120 120 120 120 120 
##$DBP= (0..7)
150 150 150 150 150 150 150 150 
##$DBP07= 0
##$DBPNAM0= <>
##$DBPNAM1= <>
##$DBPNAM2= <>
$$ [...]
##$SUBNAM7= <"">
##$SUBNAM8= <"">
##$SUBNAM9= <"">
##$SW= 20.6930455092707
##$SWIBOX= (0..15)
0 0 3 0 0 0 0 0 0 0 0 0 0 0 0 0 
##$SW_h= 5175.983436853
##$TD= 65536
##$TD0= 1
##$TE= 294.16
##$TE2= 300
##$TE3= 300
##$TEG= 300
##$TL= (0..7)
0 120 120 120 120 120 120 120 
##$TP= (0..7)
150 150 150 150 150 150 150 150 
##$TP07= 0
##$TPNAME0= <>
##$TPNAME1= <>
##$TPNAME2= <>
##$TPNAME3= <>
##$TPNAME4= <>
##$TPNAME5= <>
##$TPNAME6= <>
##$TPNAME7= <>
##$TPOAL= (0..7)
0.5 0.5 0.5 0.5 0.5 0.5 0.5 0.5 
##$TPOFFS= (0..7)
0 0 0 0 0 0 0 0 
##$TUNHIN= 0
##$TUNHOUT= 0
##$TUNXOUT= 0
##$USERA1= <user>
##$USERA2= <user>
##$USERA3= <user>
##$USERA4= <user>
##$USERA5= <user>
##$V9= 5
##$VALIST= <valist>
##$VCLIST= <CCCCCCCCCCCCCCC>
##$VD= 0
##$VDLIST= <DDDDDDDDDDDDDDD>
##$VPLIST= <PPPPPPPPPPPPPPP>
##$VTLIST= <TTTTTTTTTTTTTTT>
##$WBST= 1024
##$WBSW= 4
##$XGAIN= (0..3)
0 0 0 0 
##$XL= 0
##$YL= 0
##$YMAX_a= 412950
##$YMIN_a= -464676
##$ZGOPTNS= <>
##$ZL1= 120
##$ZL2= 120
##$ZL3= 120
##$ZL4= 120
##$ABSF1= 16.522
##$ABSF2= -4.171173
##$ABSG= 5
##$ABSL= 3
##$ALPHA= 0
##$AQORDER= 0
##$ASSFAC= 0
##$ASSFACI= 0
##$ASSFACX= 0
##$ASSWID= 0
##$AUNMP= <proc_1d>
##$AZFE= 0.1
##$AZFW= 0.1
##$BCFW= 0
##$BC_mod= 0
##$BYTORDP= 0
##$COROFFS= 0
##$CY= 12.5
##$DATMOD= 1
##$DC= 0
##$DFILT= <>
##$DTYPP= 0
##$F1P= 14.0000005364418
##$F2P= -0.99999901652339
##$FCOR= 0.5
##$FTSIZE= 32768
##$FT_mod= 6
##$GAMMA= 0
##$GB= 0
##$INTBC= 1
##$INTSCL= 1
##$ISEN= 128
##$LB= 0.3
##$LEV0= 0
##$LPBIN= 0
##$MAXI= 10000
##$MC2= 0
##$MEAN= 0
##$ME_mod= 0
##$MI= 0
##$NCOEF= 0
##$NC_proc= -4
##$NLEV= 6
##$NOISF1= 0
##$NOISF2= 0
##$NSP= 0
##$NTH_PI= 0
##$NZP= 0
##$OFFSET= 16.522
##$PC= 1
##$PHC0= 172.7531
##$PHC1= 0.7957093
##$PH_mod= 1
##$PKNL= yes
##$PPARMOD= 0
##$PSCAL= 4
##$PSIGN= 0
##$REVERSE= no
##$SF= 250.13
##$SI= 32768
##$SIGF1= 0
##$SIGF2= 0
##$SINO= 400
##$SIOLD= 32768
##$SREGLST= <1H.DMSO>
##$SSB= 0
##$STSI= 32768
##$STSR= 0
##$SW_p= 5175.98343685301
##$SYMM= 0
##$S_DEV= 0
##$TDeff= 65536
##$TDoff= 0
##$TI= <Analysis number 999999
Compound Code 99
Book Reference 9
Project Code 9>
##$TILT= no
##$TM1= 0
##$TM2= 0
##$TOPLEV= 0
##$USERP1= <user>
##$USERP2= <user>
##$USERP3= <user>
##$USERP4= <user>
##$USERP5= <user>
##$WDW= 1
##$XDIM= 32768
##$YMAX_p= 512830691
##$YMIN_p= -429503
$$ End of Bruker specific parameters
$$ ---------------------------------
##NTUPLES= NMR SPECTRUM
##VAR_NAME=  FREQUENCY,     SPECTRUM/REAL,   SPECTRUM/IMAG
##SYMBOL=    X,             R,               I
##VAR_TYPE=  INDEPENDENT,   DEPENDENT,       DEPENDENT
##VAR_FORM=  AFFN,          ASDF,            ASDF
##VAR_DIM=   32768,         32768,           32768
##UNITS=     HZ,            ARBITRARY UNITS, ARBITRARY UNITS
##FACTOR=    0.157963299565203, 1,           1
##FIRST=     4132.6476996994, 0,             0
##LAST=      -1043.33573715361, 0,           0
##MIN=       -1043.33573715361, -429503,     0
##MAX=       4132.6476996994, 512830691,     0
$$ Real data points
##PAGE= N=1
##DATA TABLE= (X++(R..R)), XYDATA
$$ [...]
$$ plain form
17960 -25195 -12939 3446 -16596 -31632 -14695 -33048 59109 128328 91213 110503 147730 69957
17948 69957 88791 147125 165120 122646 83720 -47652 -81162 -39569 5397 38720 23578
17937 23578 52582 91402 164647 121771 136603 149468 246165 211556 167586 211726 240925 181649
17925 181649 149559 154326 70930 52615 207828 172359 56387 23221 -43615 19553 40155
17914 40155 9308 -69788 -61138 -78399 -39106 -18309 -29405 -18430 83178 114255 143804 243802
17902 243802 210187 121698 166130 230342 227194 262066 151210 170114 194098 169016 162007 136065
17890 136065 135254 32465 91743 153478 72394 -15263 -64383 22166 123009 195799 158264
17879 158264 139717 170140 46708 -72083 -26923 60229 124639 152641 56531 133923 177614
$$ packed form
17960b5195J2256J6385k0042j5036J6937j8353R2157O9219l7115J9290L7227p7773
17948F9957J8834N8334J7995m2474l8926j31372l3510M1593M4966L3323j5142
17937B3578K9004L8820P3245m2876J4832J2865R6697l4609m3970M4140K9199n9276
17925A81649l2090M767q3396j8315J55213l5469j15972l3166o6836O3168K0602
17914D0155l0847p9096Q650j7261L9293K0797j1096J0975J01608L1077K9549R9998
17902B43802l3615q8489M4432O4212l148L4872j10856J8904K3984k5082p009k5942
17890A36065q11j02789N9278O1735q1084q7657m9120Q6549J00843P2790l7535
17879A58264j8547L0423j23432j18791M5160Q7152O4410K8002r6110P7392M3691
$$ plain form
17868 177614 64970 -24277 -7366 -34573 -15278 -9835 -48302 -67995 -73488 -71223 35631 54303
17856 54303 94071 35118 34473 127053 125732 42981 25991 68995 48848 39368 20803 -53134
17844 -53134 7686 5896 62487 78427 72968 78025 62180 136268 234311 135928 61962 12721
17832 12721 84635 100857 94654 75607 62610 -65252 -61995 -33533 -1132 11974 14237 41832
17820 41832 40115 26046 18566 14638 -19833 -30498 -91257 -170801 -206881 -150125 -102242 -67569
17808 -67569 7831 30508 20695 97659 78798 25507 -10254 -25022 -25656 -77574 -62797 4651
17796 4651 26965 -13872 -3379 48481 70030 121983 56167 5074 71930 86563 18840 -211
17784 -211 61161 93697 80735 41176 6418 69283 65691 18603 35358 16275 -67196 -93965
$$ packed form
17868A77614j12644q9247J6911k7207J9295N443l8467j9693n493K265J06854J8672
17856E4303L9768n8953o45R2580j321q2751j6990M3004k0147r480j8565p3937
17844e3134O0820j790N6591J5940n459N057j5845P4088R8043r8383p3966m9241
17832A2721P1914J6222o203j9047j2997j27862L257K8462L2401J3106K263K7595
17820D1832j717j4069p480l928l4471j0665o0759p9544l6080N6756M7883L4673
17808f7569P5400K2677r813P6964j8861n3291l5761j4768o34n1918J4777O7448
17796D651K2314m0837J0493N1860K1549N1953o5816n1093O6856J4633o7723j9051
17784b11O1372L2536j2962l9559l4758O2865l592m7088J6755j9083q3471k6769
$$ plain form
17772 -93965 -55472 -51296 17013 5116 -6928 -73081 -53742 -39799 16754 41247 -45731 -133294
17760 -133294 -91875 -80701 -89393 -119180 -107776 -133250 -109048 -59632 -77438 -87146 -33199 15587
17748 15587 -9838 -11229 -41727 -122908 -175541 -145596 -71562 -25564 -19710 14963 -5792 -49409
17736 -49409 -71150 -48321 -83 -27241 -23884 43925 20945 -20729 -22922 -83857 -85382 -4686
17724 -4686 -13736 30707 -1342 65801 40326 84105 174674 186164 96731 161692 254529 189395
17712 189395 149823 106937 71195 54300 112466 75402 -6289 -72812 -26407 61284 51703 -17510
17700 -17510 2912 -41653 -88280 -100439 -92474 -75039 -6723 -5528 -8955 782 -2223 122225
17688 122225 159080 99388 112546 57480 -23208 78422 131422 118896 74554 23290 -10578
$$ packed form
17772i3965L8493M176O8309j1897j2044o6153J9339J3943N6553K4493q6978q7563
17760a33294M1419J1174q692k9787J1404k5474K4202M9416j7806r708N3947M8786
17748A5587k5425j391l0498q1181n2633K9945P4034M5998N854L4673k0755m3617
17736d9409k1741K2829M8238k7158L357O7809k2980m1674k193o0935j525Q0696
17724d686r050M4443l2049O7143k5475M3779R0569J1490q9433O4961R2837o5134
17712A89395l9572m2886l5742j6895N8166l7064q1691o6523M6405Q7691r581o9213
17700a7510K0422m4565m6627j2159P965J7435O8316J195l427R737l005J24448
17688A22225L6855n9692J3158n5066q0688J01630N3000j2526m4342n1264l3868
$$ plain form
17677 -10578 49492 9449 -90853 -128725 -103059 -105851 -105454 -145421 -120588 -58116 15758 63891
17665 63891 -12426 -81776 -40960 25187 62115 69163 83114 63740 -4273 14552 -20048 56171
17653 56171 15223 9404 76200 81492 39765 -44795 63329 197825 120972 96667 141096 133702
17641 133702 112698 83083 65141 115186 87177 49472 12882 33939 53804 47952 -13882 -21894
17629 -21894 7786 -29980 -78827 -13523 -14962 -34451 -83443 -98929 -99223 -15935 38842 32101
17617 32101 -8889 -56325 1363 33019 56769 41251 41128 40397 94233 111491 153281 72776
17605 72776 14083 -19699 -50939 -46167 49108 64710 2606 -13288 62193 24564 22429 107748
17593 107748 93893 119792 167510 70609 20625 24538 1291 28118 89066 126948 88752 35522
$$ packed form
17677a0578O0070m0043j00302l7872K5666k792L97l9967K4833O2472P3874M8133
17665F3891p6317o9350M0816O6147L6928P048J3951j9374o8013J8825l4600P6219
17653E6171m0948n819O6796N292m1727q4560J08124J34496p6853k4305M4429p394
17641A33702k1004k9615j7942N0045k8009l7705l6590K1057J9865n852o1834q012
17629b1894K9680l7766m8847O5304j439j9489m8992j5486k94Q3288N4777o741
17617C2101m0990m7436N7688L1656K3750j5518j23p31N3836J7258M1790q0505
17605G2776n8693l3782l1240M772R5275J5602o2104j5894P5481l7629k135Q5319
17593A07748j3855K5899M7718r6901m9984L913k3247K6827O0948L7882l8196n3230
$$ plain form
17581 35522 114902 142866 69287 -40330 9604 50247 105561 3419 4723 40816 50383 89331
17569 89331 79822 109239 104739 69564 72471 96894 113641 68846 51334 -25088 -56472 -134826
17557 -134826 -113207 -19269 13084 -16510 -67178 -77724 -11335 -66159 -69455 -5444 47683 11048
17545 11048 48432 18206 -27353 14605 33079 18780 39983 1513 -25283 -38348 -81677 -105289
17533 -105289 -84985 -33677 -38679 -46101 -30854 -27592 -27128 -15274 72738 151062 168077 88236
17521 88236 82050 66264 21962 28386 -16147 -12389 -37486 -55597 -86379 -6700 67293 60616
17509 60616 72323 26657 -14616 -33148 -12961 -48648 -57290 -79263 -51535 4462 131347 44123
17497 44123 -35487 -123896 -147258 -63129 -102572 -92175 -40899 1765 77477 74436 65846 64587
$$ packed form
17581C5522P9380K7964p3579j09617M9934M0643N5314j02142J304L6093R567L8948
17569H9331r509K9417m500l5175K907K4423J6747m4795j7512p6422l1384p8354
17557a34826K1619R3938L2353k9594n0668j0546O6389n4824l296O4011N3127l6635
17545A1048L7384l0226m5559M1958J8474j4299K1203l8470k6796j3065m3329k3612
17533a05289K0304N1308n002p422J5247L262M64J1854Q8012P8324J7015p9841
17521H8236o186j5786m4302O424m4533L758k5097j8111l0782P9679P3993o677
17509F0616J1707m5666m1273j8532K0187l5687q642k1973K7728N5997J26885q7224
17497D4123p9610q8409k3362Q4129l9443J0397N1276M2664P5712l041q590j259
$$ plain form
17485 64587 22958 45975 -25370 -52314 -116708 -90365 -38111 -93132 -100913 -35999 -24507 7498
17473 7498 -61541 -81076 3732 -16452 30233 24397 56784 15765 -43774 -32809 -27232 6187
17461 6187 21868 83239 50956 -17629 -57688 -41642 -68964 -80328 1713 128355 120058 76946
17449 76946 45049 40386 -17270 -4497 59188 40933 -2224 -23865 -60461 23882 36323 41280
17437 41280 -7126 -11081 14748 27438 17069 60289 102257 76911 48186 70135 115105 49303
17425 49303 36471 48640 -23076 -39660 -110800 10550 124212 195010 160209 91174 126340
17414 126340 152088 163009 194946 119663 37099 73561 93315 57623 30602 107693 123266
17403 123266 39379 16731 16676 -15388 -2754 -35599 35415 111005 201940 213576 136844 108126
$$ packed form
17485F4587m1629K3017p1345k6944o4394K6343N2254n5021p781O4914J1492L2005
17473G498o9039j9535Q4808k0184M6685n836L2387m1019n9539J0965N577L3419
17461F187J5681O1371l2283o8585m0059J6046k7322j1364Q2041J26642q297m3112
17449G6946l1897m663n7656J2773O3685j8255m3157k1641l6596Q4343J2441M957
17437D1280m8406l955K5829J2690j0369M3220M1968k5346k8725K1949M4970o5802
17425D9303j2832J2169p1716j6584p1140J21350J13662P0798l4801o9035L5166
17414A26340K5748J0921L1937p5283q2564L6462J9754l5692k7021P7091J5573
17403A23266q3887k2648n5l2064J2634l2845P1014P5590R0935J1636p6732k8718
$$ plain form
17391 108126 74536 48452 33134 -35883 -9911 57284 31054 -63916 -58366 -62493 -21970 29452
17379 29452 10855 -55492 16941 -5400 22679 46367 77872 106544 33002 48693 84454 -39703
17367 -39703 -122658 -81720 -100315 -119418 -127407 -139902 -152779 -49122 18433 -24962 -37665 21118
17355 21118 90561 99211 -19515 -89041 -121537 -96546 -780 83899 66270 20778 65863 83645
17343 83645 106672 125191 114184 64740 11774 -50502 -56297 -35749 -15027 16470 84082 19915
17331 19915 -73716 -136571 -158430 -171682 -184331 -101422 -50619 62451 42913 -2254 41655
17320 41655 30955 -34729 -74244 -14669 48999 7881 -41950 -67342 -65534 25889 25358 15003
17308 15003 13338 -10490 -33757 -51410 -25809 79177 164814 138480 43172 -92828 -50636
$$ packed form
17391A08126l3590k6084j5318o9017K5972O7195k6230r4970N550m127M0523N1422
17379B9452j8597o6347P2433k2341K8079K3688L1505K8672p3542J5691L5761j24157
17367c9703q2955M0938j8595j9103p989j2495j2877J03657O7555m3395j2703N8783
17355B1118O9443Q650j18726o9526l2496K4991R5766Q4679j7629m5492M5085J7782
17343H3645K3027J8519j1007m9444n2966o2276n795K0548K0722L1497O7612o4167
17331A9915r3631o2855k1859j3252j2649Q2909N0803J13070j9538m5167M3909
17320D1655j0700o5684l9515N9575O3668m1118m9831k5392J808R1423n31j0355
17308A5003j665k3828k3267j7653K5601J04986Q5637k6334r5308j36000M2192
$$ plain form
17297 -50636 73307 36910 -22453 -14025 -7096 -37785 -92026 -78264 32019 44290 74732 125253
17285 125253 84985 40219 -9358 41586 31525 -33678 -25614 14196 37533 86706 166357 182038
17273 182038 181672 143102 74410 -53121 -10366 16728 72419 118087 131124 91676 30819 -56866
17261 -56866 -78610 -106893 -58056 -20909 -30732 2839 -11295 -74347 -76417 -56154 -7927 -10
17249 -10 35971 69214 11855 21929 40773 3959 -26732 -54240 -108432 -94001 -43682 -32669
17237 -32669 -43813 -66969 -29692 84414 65766 46008 21706 2516 -51178 -46109 40223 147466
17225 147466 170191 76917 6191 21682 -5521 -28972 14384 53589 35207 33990 12887 -17325
17213 -17325 -32402 -4847 19653 -6340 -41506 -33970 9160 9098 -14637 -30010 17952 23403 -9268
$$ packed form
17297e0636J23943l6397n9363Q428O929l0689n4241J3762J10283J2271L0442N0521
17285A25253m0268m4766m9577N0944j0061o5203Q064L9810K3337M9173P9651J5681
17273A82038l66l8570o8692j27531M2755K7094N5691M5668J3037l9448o0857q7685
17261e6866k1744k8283M8837L7147r823L3571j4134o3052k070K0263M8227P917
17249a0L5981L3243n7359J0074J8844l6814l0691k7508n4192J4431N0319J1013
17237c2669j1144k3156L7277J14106j8648j9758k4302j9190n3694N069Q6332J07243
17225A47466K2725r3274p0726J5491k7203k3451M3356L9205j8382j217k1103l0212
17213a7325j5077K7555K4500k5993l5166P536M3130o2k3735j5373M7962N451l2671
$$ plain form
17200 -9268 -24813 -8599 -8785 69713 117964 11143 -122332 -112763 11764 58888 10376 20281
17188 20281 71540 107481 125682 155705 50400 16977 -20985 -80388 -61433 -7206 52930
17177 52930 62861 123279 131760 90240 67476 87191 96070 75012 103673 104832 71017 52168
17165 52168 15046 -66636 -83120 -129757 -167198 -111054 -71154 -102112 -54205 -30155 -31395 24210
17153 24210 45945 13860 2398 18247 82994 68487 94388 144812 85197 -19482 -8840
17142 -8840 -56344 -61365 -70317 -8172 9335 25029 -42609 -13918 -24561 20421 74250 142182
17130 142182 139694 129482 79542 -86685 -102557 -76273 -11773 11060 49248 -8508 -75364
17119 -75364 -34699 -74944 -85018 -23284 40044 -17877 108756 150693 113825 50007 29774
$$ packed form
17200i268j5545J6214j86P8498M8251j06821j33475R569J24527M7124m8512R905
17188B0281N1259L5941J8201L0023j05305l3423l7962n9403J8955N4227O0136
17177E2930R931O0418Q481m1520k2764J9715Q879k1058K8661J159l3815j8849
17165E2168l7122q1682j6484m6637l7441N6144L9900l0958M7907K4050j240N5605
17153B4210K1735l2085j1462J5849O4747j4507K5901N0424n9615j04679J0642
17142h840m7504n021q952O2145J7507J5694o7638K8691j0643M4982N3829O7932
17130A42182k488j0212m9940j66227j5872K6284O4500K2833L8188n7756o6856
17119g5364M0665m0245j0074O1734O3328n7921J26633M1937l6868o3818k0233
$$ plain form
17108 29774 52794 -51183 -43427 -31035 42085 -19226 595 85430 159907 158210 88299 54693
17096 54693 19504 36400 34747 -63508 -154696 -140999 -63847 59343 17634 52571 13348 -10239
17084 -10239 -2462 15320 31691 -47312 -73560 -10955 -1436 -15686 -69386 -31724 82926 56260
17072 56260 2475 -21318 6669 38649 61397 75073 104092 85067 -41947 -115165 49514
17061 49514 156939 141974 117480 98678 135247 128981 136424 137473 142674 91310 60880 14016
17049 14016 -9626 44689 60124 59509 -40765 -70657 -75655 -73786 25047 27044 -49381 -84764
17037 -84764 -97138 -119450 -60039 -5582 -27051 -118268 -145923 -74969 60937 102509 106226 -5480
17025 -5480 -57251 -51689 -7177 34168 -3630 -10258 -67662 -79446 -32676 -39164 -8088 51065
$$ packed form
17108B9774K3020j03977P756J2392P3120o1311J9821Q4835P4477j697o9911l3606
17096E4693l5189J6896j653r8255r1188J3697P7152J23190m1709L4937l9223k3587
17084a0239P777J7782J6371p9003k6248O2605R519j4250n3700L7662J14650k6666
17072E6260n3785k3793K7987L1980K2748J3676K9019j9025j27014p3218J64679
17061D9514J07425j4965k4494j8802L6569o266P443J049N201n1364l0430m6864
17049A4016k3642N4315J5435o15j00274k9892m998J869R8833J997p6425l5383
17037h4764j2374k2312N9411N4457k1469r1217k7655P0954J35906M1572L717j11706
17025e480n1771N562M4512M1345l7798o628n7404j1784M6770o488L1076N9153
$$ plain form
17013 51065 -18322 -80125 -76932 -65933 -81485 -80167 15297 58798 67665 115098 85011 15561
17001 15561 -2172 -37752 -43361 14043 11960 30212 69382 86518 87797 132890 100647 135225
16989 135225 122143 50488 37581 -14785 16403 -32580 -50281 -63756 -58801 -45354 25847 116568
16977 116568 90337 111227 60967 17846 -8892 -49960 -45443 19766 2806 -94358 -124041 -31578
16965 -31578 78720 133499 143321 27601 -16033 -25605 -23020 -42878 -73234 -49476 7686 16420
16953 16420 -39757 -75065 6474 35685 41627 57911 4451 30714 12533 -55905 -88662 -43327
16941 -43327 21060 -54250 -57402 18202 -3608 -32911 -52443 -16923 95188 33725 -25355 2879
16929 2879 -5400 38769 82323 73047 34671 -20189 -96729 -144820 -134306 -134153 -97075 -44044 -12327
$$ packed form
17013E1065o9387o1803L193J0999j5552J318R5464M3501Q867M7433l0087o9450
17001A5561j7733l5580n609N7404k083J8252L9170J7136J279M5093l2243L4578
16989A35225j3082p1655j2907n2366L1188m8983j7701j3475M955J3447P1201R0721
16977A16568k6231K0890n0260m3121k6738m1068M517O5209j6960r7164k9683R2463
16965c1578J10298N4779R822j15720m3634r572K585j9858l0356K3758N7162Q734
16953A6420n6177l5308Q1539K9211N942J6284n3460K6263j8181o8438l2757M5335
16941d3327O4387p5310l152P5604k1810k9303j9532L5520J12111o1463n9080K8234
16929B879q279M4169M3554r276l8376n4860p6540m8091J0514J53L7078N3031L1717
$$ plain form
16916 -12327 -12087 36391 32712 102178 49647 -97704 -155606 -145472 -99939 -126757 -106513 -103845
16904 -103845 -90214 -132614 -117719 -45682 65131 -4617 -118472 -119169 -28486 -9940 39714
16893 39714 102240 154174 87208 56141 91663 64875 17197 90944 135433 139684 25627 2162
16881 2162 68147 125636 61448 -41747 -39680 21510 -15181 -98962 -30996 2973 -93 36904
16869 36904 77487 82404 17865 35467 -35652 -74532 -113749 -184763 -206605 -200261 -96078 -97817
16857 -97817 -202791 -135565 -13397 -29680 -67984 -111621 -111737 -54427 4126 21263 -35703 286
16845 286 2428 -86439 -146390 -147923 -55998 -22556 24264 11877 -35146 -52364 -41422 -72490
16833 -72490 -151825 -105537 -85086 -77147 -31044 15729 37429 84425 110214 96983 97481 138114
$$ packed form
16916a2327K40M8478l679O9466n2531j47351n7902J0134M5533k6818K0244K668
16904a03845J3631m2400J4895P2037J10813o9748j13855o97R0683J8546M9654
16893C9714O2526N1934o6966l1067L5522k6788m7678P3747M4489M251j14057k3465
16881B162O5985N7489o4188j03195K067O1190l6691q3781O7966L3969l066L6997
16869C6904M0583M917o4539J7602p1119l8880l9217p1014k1842O344J04183j739
16857i7817j04974O7226J22168j6283l8304m3637j16N7310N8553J7137n6966L5989
16845B86K142q8867n9951j533R1925L3442M6820j2387m7023j7218J0942l1068
16833g2490p9335M6288K0451P939M6103M6773K1700M6996K5789j3231M98M0633
$$ plain form
16821 138114 -34479 -64007 -43606 -69741 23536 84369 -17321 -67398 -59456 -23039 31647
16810 31647 110692 107089 106105 151910 188460 129981 124922 156573 92295 54678 81388 133726
16798 133726 123235 79709 28716 -33349 -11233 -20517 -5199 1005 27044 100040 140535 100589
16786 100589 34430 -831 -37580 -72135 -114579 -100687 -34874 43983 -26424 -98422 -44154
16775 -44154 14093 74033 53644 17827 33645 57970 72598 40612 -117411 -134366 -8555
16764 -8555 15191 -11351 -12338 54159 115239 151665 99319 5575 85526 69580 -22616 -81128
16752 -81128 -138571 -85469 -20954 -48555 -124456 -143764 -154213 -101290 -83928 -69614 -57251 -61879
16740 -61879 -106319 -75150 -17706 -40509 -44365 -18018 -59370 -22381 390 24148 83692 74273
$$ packed form
16821A38114j72593k9528K0401k6135R3277O0833j01690n0077P942L6417N4686
16810C1647P9045l603r84M5805L6550n8479n059L1651o4278l7617K6710N2338
16798A33726j0491m3526n0993o2065K2116r284J5318O204K6039P2996M0495l9946
16786A00589o6159l5261l6749l4555m2444J3892O5813P8857p0407p1998N4268
16775d4154N8247N9940k0389l5817J5818K4325J4628l1986j58023j6955J25811
16764h555K3746k6542r87O6497O1080L6426n2346r3744P9951j5946r2196n8512
16752h1128n7443N3102O4515k7601p5901j9308j0449N2923J7362J4314J2363m628
16740f1879m4440L1169N7444k2803l856K6347m1352L6989K2771K3758N9544r419
$$ plain form
16728 74273 10084 -51870 5874 -15226 -5454 9577 -763 -88351 -65976 87451 103965 33692
16716 33692 58228 63185 25467 5008 44124 59008 -15715 -113862 -119611 -105895 -120694 -4958
16704 -4958 29443 -17910 -83742 -82917 20114 39779 141126 103850 -14343 27919 82814 72629
16692 72629 -10982 -98596 -20278 148785 124656 64165 78082 41939 36148 4463 -6378 -13640
16680 -13640 -63228 -39077 -36510 -5972 -11378 -15637 44316 181686 206106 237854 108400 16777
16668 16777 31019 89926 75562 19861 3886 20491 -57921 -30619 -44869 -44356 -43783 -65746
16656 -65746 -51806 -28003 -49297 -96746 -92729 -148917 -162830 -148315 -9847 33921 7090 57148
16644 57148 192431 138637 81153 146176 87561 -41296 -145431 -88866 -35039 -31463 -38041
$$ packed form
16728G4273o4189o1954N7744k1100R772J5031j0340q7588K2375J53427J6514p0273
16716C3692K4536M957l7718k0459L9116J4884p4723r8147n749J3716j4799J15736
16704d958L4401m7353o5832Q25J03031J9665J01347l7276j18193M2262N4895j0185
16692G2629q3611q7614P8318J69063k4129o0491J3917l6143n791l1685j0841p262
16680a3640m9588K4151K567L0538n406m259N9953J37370K4420L1748j29454r1623
16668A6777J4242N8907j4364n5701j5975J6605p8412K7302j4250N13N73k1963
16656f5746J3940K3803k1294m7449M017n6188j3913J4515J38468M3768k6831N0058
16644E7148J35283n3794n7484O5023n8615j28857j04135N6565N3827L576o578
$$ plain form
16633 -38041 -139308 -153754 -136410 -115063 -72348 -55085 -11365 18793 43012 42466 47144 64991
16621 64991 47850 -66484 -157519 -126915 -95250 -103383 -50162 -18469 -57662 -64125 -59090 -38262
16609 -38262 -81263 -50048 53391 80573 71579 43676 -50150 -62902 -35681 -83027 -132689 -110418
16597 -110418 -73675 -18929 17944 56061 76697 61554 9834 -39332 -97129 -49907 45582
16586 45582 36825 -43538 -81474 -78509 -55497 10397 68449 88822 56244 15622 -66707 -85122
16574 -85122 -61414 6320 51430 12442 45245 64913 67078 90710 82491 -56532 -89676 -151643
16562 -151643 -125791 -11607 -56306 -138429 -123444 -98138 -36726 -14526 9467 -40700 -37690
16551 -37690 13683 -11300 -4386 2010 -52441 -36828 -73146 -149124 -165001 -113698 -23830 4914
$$ packed form
16633c8041j01267j4446J7344K1347M2715J7263M3720L0158K4219n46M678J7847
16621F4991j7141j14334r1035L0604L1665q133N3221L1693l9193o463N035K0828
16609c8262m3001L1215J03439K7182q994k7903r3826j2752K7221m7346m9662K2271
16597a10418L6743N4746L6873L8117K0636j5143n1720m9166n7797M7222R5489
16586D5582q757q0363l7936K965K3012O5894N8052K0373l2578m0622q2329j8415
16574h5122K3708O7734M5110l8988L2803J9668K165K3632q219j39023l3144o1967
16562a51643K5852J14184m4699q2123J4985K5306O1412K2200K3993n0167L010
16551c7690N1373k4983O914O396n4451J5613l6318p5978j5877N1303Q9868K8744
$$ plain form
16539 4914 27960 -86977 -93384 -154598 -175331 -126869 -134195 -90711 -30551 10340 -16981 -48232
16527 -48232 28630 43010 40114 5404 -2821 -2882 25345 54183 16213 7037 -14907 -70313 -19676
16514 -19676 -36642 -80012 -78338 -4221 28487 -26740 -53380 -57485 -110622 -173381 -107398 -63954
16502 -63954 -161020 -267686 -226370 -150482 -94772 -1237 -14270 -10541 -31884 -61701 -85376 -162059
16490 -162059 -191793 -209352 -159681 -125671 -40627 -66273 -24774 33912 10537 66320 62351 43990
16478 43990 20663 3349 61260 87301 65806 -74170 -208217 -233039 -170882 -68756 763
16467 763 41097 22150 39335 -531 15953 23805 13837 -3251 -6722 63826 68229 2338 -109110
16454 -109110 -105488 -74132 7812 49888 -19124 -5676 54258 -2087 -100043 -70796 -46219 -36906
$$ packed form
16539D914K3046j14937o407o1214k0733M8462p326M3484O0160M0891k7321l1251
16527d8232P6862J4380k896l4710q225o1K8227K8838l7970r176k1944n5406N0637
16514a9676j6966m3370J674P4117L2708n5227k6640m105n3137o2759O5983M3444
16502f3954r7066j06666M1316P5888N5710R3535j3033L729k1343k9817k3675p6683
16490a62059k9734j7559M9671L4010Q5044k5646M1499N8686k3375N5783l969j8361
16478D3990k3327j7314N7911K6041k1495j39976j34047k4822O2157J02126O9519
16467G63M0334j8947J7185l9866J6484P852r968j7088l471P0548M403o5891j11448
16454a09110L622L1356Q1944M2076o9012J3448N9934n6345r7956K9247K4577R313
$$ plain form
16442 -36906 -1930 -11372 24998 72840 71956 63830 77357 -57644 -105462 -59410 91116 99520
16430 99520 57468 42867 67088 88225 130830 93057 -17968 -14164 -24328 -18109 -97298 -81775
16418 -81775 -78690 -57620 -46448 -39228 -46382 30855 106748 145812 7255 -65074 -88023 -107331
16406 -107331 -61158 36919 78977 -50036 -107675 -141004 -71848 -24907 -46167 -190653 -250625
16395 -250625 -122357 -50467 -14036 49564 167050 173413 134694 45291 -29364 -10300 41580
16384 41580 -63667 -115655 -126073 -93063 -38433 -6594 -22422 -31108 31968 76578 84132 68661
16372 68661 35348 56165 14655 27733 97972 38938 57465 86388 81977 92378 132890 106949
16360 106949 36710 37844 -8114 -16479 31758 49519 -13784 -57152 -18879 104339 151840 101882
$$ packed form
16442c6906L4976r442L6370M7842q84q126J3527j35001m7818M6052J50526Q404
16430I9520m2052j4601K4221K1137M2605l7773j11025L804j0164O219p9189J5523
16418h1775L085K1070J1172P220p154P7237P5893L9064j38557p2329k2949j9308
16406a07331M6173R8077M2058j29013n7639l3329O9156M6941k1260j44486n9972
16395b50625J28268P1890L6431O3600J17486O363l8719q9403p4655J9064N1880
16384D1580j05247n1988j0418L3010N4630L1839j5828q686O3076M4610P554j5471
16372F8661l3313K0817m1510J3078P0239n9034J8527K8923m411J0401M0512k5941
16360A06949p0239J134m5958q365M8237J7761o3303m3368L8273J23218M7501m9958
$$ plain form
16348 101882 61186 77025 81677 80979 -31349 -102140 -59033 -44236 -72349 -81237 -46802 -27704
16336 -27704 -63616 -70820 -115268 -109583 -45316 -42745 -75027 10570 -46322 -97580 -17767 -15504
16324 -15504 -31376 -56035 -14046 74435 51508 45604 53500 13468 -39945 -31999 -19113 -21705
16312 -21705 5822 -34374 -29553 -3292 32640 35019 107995 66658 61595 91760 113454 116264
16300 116264 45746 54803 -11146 -36867 -36918 15271 119677 36048 65397 103158 89943 129984
16288 129984 122423 107595 103494 41900 -5517 -57017 -31548 22841 77289 152351 107153 116431
16276 116431 3790 -126537 -87839 11372 5714 5610 -67458 -3078 57598 -6856 -84369 -121761
16264 -121761 -105822 15238 52781 61312 41344 58757 51190 23564 -17065 -22125 -75399 -163420
$$ packed form
16348A01882m0696J5839M652o98j12328p0791M3107J4797k8113q888L4435J9098
16336b7704l5912p204m4448N685O4267K571l2282Q5597n6892n1258P9813K263
16324a5504j5872k4659M1989Q8481k2927n904P896m0032n3413P946J2886k592
16312b1705K7527m0196M821K6261L5932K379P2976m1337n063L0165K1694K810
16300A16264p0518R057o5949k5721n1N2189J04406q3629K9349L7761j3215M0041
16288A29984p561j4828m101o1594m7417n1500K5469N4389N4448P5062m5198R278
16276A16431j12641j30327L8698R9211n658j04p3068O4380O0676o4454p7513l7392
16264a21761J5939J21060L7543Q531j9968J7413p567k7626m0629n060n3274q8021
$$ plain form
16252 -163420 -196806 -95755 -54979 -39168 -60084 -56948 -109651 -222999 -215875 -140789 -77798
16241 -77798 -68867 -58555 -30809 11938 20350 20993 69118 -20789 -43286 -34708 -13253 2918 -5041
16228 -5041 -50018 -114199 -141844 -112597 -8159 56924 18232 -33326 -22813 -18028 49140 96161
16216 96161 84267 57316 85852 68129 -8827 -5369 -31828 -77303 14801 -35563 -60815 55483
16204 55483 72829 33612 21418 65547 27793 -28543 -55511 -40070 75531 82533 -27098
16193 -27098 -133056 -49399 139 -26485 32640 24689 40949 -15267 -27014 -51548 -81968 -119993
16181 -119993 -120801 -163282 -199906 -131216 -154196 -151904 -61555 -20747 27186 117773 105706 88993
16169 88993 122619 19082 -49612 -79694 -119964 -61574 -119310 -108273 -54843 -30603 -42191
$$ packed form
16252a63420l3386J01051M0776J5811k0916L136n2703j13348P124P5086O2991
16241g7798Q931J0312K7746M2747Q412O43M8125q9907k2497Q578K1455J6171p959
16228e041m4977o4181k7645K9247J04438O5083l8692n1558J0513M785O7168M7021
16216I6161j1894k6951K8536j7723p6956L458k6459m5475R2104n0364k5252J16298
16204E5483J7346l9217j2194M4129l7754n6336k6968J5441J15601P002j09631
16193b7098j05958Q3657M9538k6624N9125p951J6260n6216j1747k4534l0420l8025
16181a19993q08m2481l6624O8690k2980K292R0349M0808M7933R0587j2067j6713
16169H8993L3626j03537o8694l0082m0270N8390n7736J1037N3430K4240j1588
$$ plain form
16158 -42191 -90014 -42798 -31376 -85860 -43954 22444 -1441 -3142 -122502 -68694 31313
16147 31313 103878 83170 70698 167457 101281 33834 -65260 -121591 -115971 -77890 -31546 -55420
16135 -55420 20714 98019 84278 -23253 -12346 -100932 -124247 -36952 -71440 -33548 -63440
16124 -63440 -122746 -163966 -111761 16611 9848 -11725 -35129 -120453 -178687 -223551 -205774 -121746
16112 -121746 -24785 -60961 -16820 -77094 -102280 -90926 -82659 -80791 901 94858 96385 82654
16100 82654 67456 38909 -75580 -164607 -135210 -38592 7035 -26785 -35881 -8210 10986 -13166
16088 -13166 -26149 -59679 -90302 -91180 -72679 -17953 -44593 -26829 18654 8804 -16355 -29617
16076 -29617 -57580 -44941 -28158 34641 93587 13558 -18070 -78530 -98935 -58698 17478 64061
$$ packed form
16158d2191m7823M7216J1422n4484M1906O6398k3885j701j19360N3808J00007
16147C1313P2565k0708j2472R6759o6176o7447r9094n6331N620L8081M6344k3874
16135e5420P6134P7305j3741j07531J0907q8586k3315Q7295l4488L7892k9892
16124f3440n9306m1220N2205J28372o763k1573k3404q5324n8234m4864J7777Q4028
16112a21746R6961l6176M4141o0274k5186J1354Q267J868Q1692R3957J527j3731
16100H2654j5198k8547j14489q9027K9397R6618M5627l3820r096K7671J9196k4152
16088a3166j2983l3530l0623q78J8501N4726k6640J7764M5483r850k5159j3262
16076b9617k7963J2639J6783O2799N8946q0029l1628o0460k0405M0237P6176M6583
$$ plain form
16064 64061 31490 -15540 -47278 -19340 -55992 -17931 98446 190270 215444 139029 107624
16053 107624 100780 -60924 -49192 -69330 -76894 -44544 74256 67114 52945 22569 108840 180033
16041 180033 124043 41574 -13731 -1665 -18697 5488 -22416 -39253 -82599 -103232 -72930
16030 -72930 -56351 -38839 -36388 -20978 -29508 -57055 30098 67300 71236 61322 -34030 -71843
16018 -71843 -97150 -140249 -121805 -55097 -8180 29123 20344 -66660 -100003 -138811 -137591 -150906
16006 -150906 -73398 50340 45989 59351 96019 121427 154718 133449 83543 92034 64674 26518
15994 26518 -10433 -44398 -14887 -52059 -34372 -23983 15796 52291 -39361 -118916 -150947 -122422
15982 -122422 -68226 -51635 -110435 -53549 57265 77686 -45030 -32471 -7452 -24682 63835
$$ packed form
16064F4061l2571m7030l1738K7938l6652L8061J16377R1824K5174p6415l1405
16053A07624o844j61704J1732k0138p564L2350J18800p142j4169l0376Q6271P1193
16041A80033n5990q2469n5305J2066j7032K4185k7904j6837m3346k0633L0302
16030g2930J6579J7512K451J5410q530k7547Q7153L7202L936r914r5352l7813
16018g1843k5307m3099J8444O6708M6917L7303q779q7004l3343l8808J220j3315
16006a50906P7508J23738m351J3362L6668K5408L3291k1269m9906Q491k7360l8156
15994B6518l6951l3965K9511l7172J7687J0389L9779L6495r1652p9555l2031K8525
15982a22422N4196J6591n8800N6886J10814K0421j22716J2559K5019j7230Q8517
$$ plain form
15971 63835 121656 84543 46843 -26016 -4952 29156 47752 31568 88842 52104 -9784 33776
15959 33776 46206 121124 85747 -40778 -188245 -184227 -112615 -34146 40029 41276 91767 132574
15947 132574 7601 -91138 -58210 -18926 43561 27881 37096 47033 3451 13428 68825 101735
15935 101735 94627 114261 45098 -106190 -81052 -23739 -79890 -138168 -82456 -41739 -45890 -12424
15923 -12424 -28721 -29665 -98566 -89830 28957 51200 41307 64845 109279 102582 71074 47346
15911 47346 10437 -25094 -12536 44979 145888 121062 47368 25283 -11681 -27311 -43815
15900 -43815 -8343 27876 4536 60630 73813 78320 17695 -36590 -21315 -32184 29618 -202
15888 -202 -31626 36424 61519 35966 62786 22201 -58946 -60180 14438 5575 -55386 -40867
$$ packed form
15971F3835N7821l7113l7700p2859K1064L4108J8596j6184N7274l6738o1888M3560
15959C3776J2430P4918l5377j26525j47467M018P1612P8469P4175J247N0491M0807
15947A32574j24973r8739L2928L9284O2487j5680R215R937m3582R977N5397L2910
15935A01735p108J9634o9163j51288K5138N7313n6151n8278N5712M0717m151L3466
15923a2424j6297r44o8901Q736J18787K2243r893K3538M4434o697l1508k3728
15911D7346l6909l5531J2558N7515J00909k4826p3694k2085l6964j5630j6504
15900d3815L5472L6219k3340N6094J3183M507o0625n4285J5275j0869O1802k9820
15888b02l1424O8050K5095k5553K6820m0585q1147j234P4618q863o0961J4519
$$ plain form
15876 -40867 -106873 -135173 -40039 31049 27062 44112 66142 85663 66869 37351 11975 -8528
15864 -8528 -19088 -36761 -51070 -4008 -40967 -111116 -121066 -112046 -15811 -28794 -38655 -63249
15852 -63249 -100631 -110962 -29031 19037 2367 546 34164 30041 -17790 -96246 -224463 -192067
15840 -192067 -47442 3768 5280 -100433 -80306 -14039 14052 -8726 14273 68697 51111
15829 51111 27435 -15814 -60084 -87763 -48192 -29506 41622 92991 -14336 -19339 -10513 -44082
15817 -44082 10814 31109 74808 73486 21081 -3623 -115439 -70899 -38288 -30266 26282 23201
15805 23201 -65099 -93520 -107597 -118032 -151551 -185910 -184596 -166916 -167252 -38232 31461 33674
15793 33674 -41934 -150671 -131835 -103163 -58882 -62278 -90093 -64908 8835 94641 144645 126115
$$ packed form
15876d0867o6006k8300R5134P1088l987J7050K2030J9521j8794k9518k5376k0503
15864h528j0560j7673j4309M7062l6959p0149r950R020R6235j2983r861k4594
15852f3249l7382j0331Q1931M8068j6670j821L3618m123m7831p8456j28217L2396
15840a92067J44625N1210J512j05713K0127O6267K8091k2778K2999N4424j7586
15829E1111k3676m3249m4270k7679L9571J8686P1128N1369j07327n003Q826l3569
15817d4082N4896K0295M3699j322n2405k4704j11816M4540L2611Q022N6548l081
15805B3201q8300k8421j4077j0435l3519l4359J314J7680l36J29020O9693K213
15793C3674p5608j08737J8836K8672M4281l396k7815K5185P3743Q5806N0004j8530
$$ plain form
15781 126115 64624 6114 -25991 -51578 -108334 -74852 -42172 -84830 -81432 -74337 -59556 -54323
15769 -54323 -102278 -71168 -19901 -62239 -100491 -125175 -22876 -117237 -145183 -107294 -21066
15758 -21066 31161 -7416 -65097 -162041 -175588 -99616 -54206 -56067 -44709 11002 32898 82982
15746 82982 78962 41822 2520 -37419 -80785 -62140 -81670 -148141 -154088 -100620 -49210 11420
15734 11420 18096 -862 46704 394 -58833 -56718 1280 -34480 8119 34329 20918 -21581
15722 -21581 -22920 -73419 -96604 -157833 -215335 -193213 -212447 -94945 7156 18056 2337
15711 2337 -111340 -139080 -163482 -105730 -36076 -4629 75512 -34142 -88939 -38108 -83915
15700 -83915 -107884 -97784 -162422 -141592 -110355 -76658 -74315 -84476 -105809 -193479 -141904 -121284
$$ packed form
15781A26115o1491n8510l2105k5587n6756L3482L2680m2658L398P095J4781N233
15769e4323m7955L1110N1267m2338l8252k4684J02299r4361k7946L7889Q6228
15758b1066N2227l8577n7681r6944j3547P5972M5410j861J1358N5711K1896N0084
15746H2982m020l7140l9302l9939m3366J8645j9530o6471n947N3468N1410O0630
15734A1420O676j8958M7566m6310n9227K115N7998l5760M2599K6210j3411m2499
15722b1581j339n0499k3185o1229n7502K2122j9234J17502J02101J0900j5719
15711B337j13677k7740k4402N7752O9654L1447Q0141j09654n4797N0831m5807
15700h3915k3969J0100o4638K0830L1237L3697K343j0161k1333q7670N1575K0620
$$ plain form
15688 -121284 -71612 48418 23643 -74971 -162543 -106104 -124339 -64506 -38136 -79692 -119954
15677 -119954 -70099 -100394 -112579 -42258 27991 53125 115827 76539 -57692 -92056 -10818
15666 -10818 30298 65113 128243 57784 583 -18368 -13143 -27532 -123686 -129697 -156586 -121639
15654 -121639 -84187 -92776 -114522 -66338 9281 -9038 -27347 -65099 -65842 -6202 -10660 23325
15642 23325 131579 147143 126782 80407 55174 30021 3798 7890 -24365 -120496 -54566 -40458
15630 -40458 14977 -9445 5117 -73795 -54302 45949 22480 -19205 -80417 -74023 -58051 -63880
15618 -63880 14190 89403 133586 124597 93226 69496 2088 -58634 -77325 21725 78363 9749
15606 9749 -20627 65347 43573 37497 54307 82044 62237 38929 45691 -4555 16034 66252
$$ packed form
15688a21284M9672J20030k4775r8614q7572N6439j8235N9833K6370m1556m0262
15677a19954M9855l0295j2185P0321P0249K5134O2702l9288j34231l4364Q1238
15666a0818M1116L4815O3130p0459n7201j8951N225j4389r6154o011k6889L4947
15654a21639L7452q589k1746M8184P5619j8319j8309l7752p43N9640m458L3985
15642B3325J08254J5564k0361m6375k5233k5153k6223M092l2255r6131O5930J4108
15630d0458N5435k4422J4562p8912J9493J00251k3469m1685o1212O394J5972n829
15618f3880P8070P5213M4183q989l1371k3730o7408o0722j8691R9050N6638o8614
15606I749l0376Q5974k1774o076J6810K7737j9807k3308O762n0246K0589N0218
$$ plain form
15594 66252 27526 27579 25771 -15963 -59973 -36647 4879 60241 -23160 -129947 -118802 -138851
15582 -138851 -97414 -78874 -117463 -158160 -99785 10620 -41267 -85662 -45566 -13347 -64201
15571 -64201 -119420 -101650 -94948 -58528 -64983 -59976 -114013 -99458 -88793 -115123 -129939 -103609
15559 -103609 -148051 -168943 -123345 -122620 -39664 51490 28271 -19468 20788 25122 76220 44876
15547 44876 -28241 -40037 25343 -35644 -50019 -80818 -30028 -39787 -80189 -84127 -138098 -112705
15535 -112705 -100989 -73785 -19430 19856 -62634 -112092 -103284 -56172 -77374 -118243 -90843 -76991
15523 -76991 -123312 -80837 38696 -9397 -123338 -75734 49913 95427 36833 -5360 5781
15512 5781 -8987 -12041 24984 17027 -64475 -85412 -22928 40640 77895 31884 69677 64183
$$ packed form
15594F6252l8726N3j808m1734m4010K3326M1526N5362q3401j06787J1145k0049
15582a38851M1437J8540l8589m0697N8375J10405n1887m4395M0096L2219n0854
15571f4201n5219J7770O702L6420o455N007n4037J4555J0665k6330j4816K6330
15559a03609m4442k0892M5598P25Q2956R1154k3219m7739M0256M334N1098l1344
15547D4876p3117j1796O5380o0987j4375l0799N0790r759m0402l938n3971K5393
15535a12705J1716K7204N4355L9286q2490m9458Q808M7112k1202m0869K7400J3852
15523g6991m6321M2475J19533m8093j13941M7604J25647M5514n8594m2193J1141
15512E781j4768l054L7025p957q1502k0937O2484O3568L7255m6011L7793n494
$$ plain form
15500 64183 2652 -17331 -13638 -32649 -148405 -223390 -123280 -64368 -15841 23248 58379
15489 58379 80044 39782 -54453 -66411 -96804 -40487 -3200 48564 72274 58463 -42975
15478 -42975 -76587 -115140 -89945 -98324 -139002 -212633 -229009 -52666 -13404 -35935 -122705 -198347
15466 -198347 -176693 -109260 2352 39247 49212 -106 -27037 -78211 -87882 -93445 -97450 -73903
15454 -73903 -110884 -116370 -32711 5473 -49045 -78220 -50596 -36575 18790 -19245 -25691 -3738
15442 -3738 -43275 -69507 -80752 -104095 -47527 1356 14021 32064 23052 -916 26630 -132
15430 -132 84633 60778 -15504 -62509 -33098 60236 79823 52207 -82891 -197947 -217780 -145898
15418 -145898 -115622 -94875 -38426 -44111 -30385 -25305 -53163 -148604 -188144 -73087 -14839 -60971
$$ packed form
15500F4183o1531j9983L693j9011j15756p4985J00110N8912M8527L9089L5131
15489E8379K1665m0262r4235j1958l0393N6317L7287N1764K3710j3811j01438
15478d2975l3612l8553K5195q379m0678p3631j6376J76343L9262k2531q6770p5642
15466a98347K1654O7433J11612L6895R965m9318k6931n1174r671n563m005K3547
15454g3903l6981n486Q3659L8184n4518k9175K7624J4021N5365l8035o446K1953
15442c738l9537k6232j1245k3343N6568M8883J2665J8043r012k3968K7546k6762
15430a32Q4765k3855p6282m7005K9411R3334J9587k7616j35098j15056j9833P1882
15418a45898L0276K0747N6449n685J3726N080k7858r5441l9540J15057N8248m6132
$$ plain form
15406 -60971 -81225 -57501 -39921 -38692 -72885 -52980 -16204 -45102 -27587 -10125 34762 41253
15394 41253 16449 72795 1866 -75190 -53521 -23031 24987 32514 30463 22776 748 23888
15382 23888 29193 31749 131347 80316 86486 161633 101933 24827 -56241 -36225 -33357 70207
15370 70207 83349 37684 -44990 -113604 -172637 -152724 -124266 -94720 -120189 -53969 -23914 -39755
15358 -39755 -119127 -111544 -88765 -42241 11609 -11107 -33539 -57679 -101785 -39776 44510 33122
15346 33122 -42350 -102159 -101159 -86645 -29844 8069 42940 39741 -71304 -80450 -55374 -108461
15334 -108461 -135389 -80969 -9236 21382 88275 68067 -22830 -20373 -55657 -37914 59028 -38113
15322 -38113 -109562 -107054 -94806 -8743 26098 26488 62385 49353 -24918 -31578 40504 110656
$$ packed form
15406f0971k0254K3724J7580J229l4193J9905L6776k8898J7515J7462M4887O491
15394D1253k4804N6346p0929p7056K1669L0490M8018P527k051p687k2028K3140
15382B3888N305K556R9598n1031O170P5147n9700p7106q1068K0016K868J03564
15370G0207J3142m5665q2674o8614n9033J9913K8458K9546k5469O6220L0055j5841
15358c9755p9372P583K2779M6524N3850k2716k2432k4140m4106O2009Q4286j1388
15346C3122p5472n9809J000J4514N6801L7913L4871l199j11045r146K5076n3087
15334a08461k6928N4420P1733L0618O6893k0208r0897K457l5284J7743R6942r7141
15322c8113p1449K508J2248Q6063L4841L90L5897j3032p4271o660P2082P0152
$$ plain form
15310 110656 93527 47625 -34822 -99444 -142411 -194655 -273024 -260612 -208721 -162528 -105011
15299 -105011 -75629 -47338 -38719 -30577 -18715 -68022 -40818 -107232 -58097 -43818 -48857 -41446
15287 -41446 -60601 -61943 -30358 9763 8551 19467 26904 74515 141454 103340 52930 -13683
15275 -13683 -49752 -93285 -54527 -2873 -76039 -69236 -25943 -18973 -21415 43119 -10455 -108265
15263 -108265 -48140 30022 -2887 -9432 30163 12412 1143 28008 72494 100385 35607 -20173
15251 -20173 -43436 30863 44730 7282 -127203 -174132 -62550 80426 67107 3638 55420
15240 55420 43529 -80240 -115700 -115883 -163386 -158132 -85135 -48330 -100977 -92783 5463 139042
15228 139042 102263 800 -32221 -1769 112631 73519 -74474 -99651 -38942 -13435 36976
$$ packed form
15310A10656j7129m5902q2447o4622m2967n2244p8369J2412N1891M6193N7517
15299a05011K9382K8291Q619Q142J1862m9307K7204o6414M9135J4279n039P411
15287d1446j9155j342L1585M0121j212J0916P437M7611O6939l8114n0410o6613
15275a3683l6069m3533L8758N1654p3166O803M3293O970k442O4534n3574r7810
15263a08265O0125P8162l2909o545L9595j7751j1269K6865M4486K7891o4778n5780
15251b0173k3263P4299J3867l7448j34485m6929J11582J42976j3319o3469N1782
15240E5420j1891j23769l5460j83m7503N254P2997L6805n2647Q194R8246J33579
15228A39042l6779j01463l3021L0452J14400l9112j47993k5177O0709K5507N0411
$$ plain form
15217 36976 68330 74223 -3329 -21994 -29481 -51326 -36308 -43425 -83099 -19889 -27169 -95959
15205 -95959 -107910 -17562 -103744 -100203 -15506 -7188 52548 118715 84043 108188 157018 95443
15193 95443 15195 59763 42178 -15944 -35858 -38965 -42503 -37569 -56002 -95618 -61906 -67831
15181 -67831 -48715 20256 5610 -49745 13013 30342 75967 4801 -71724 -86463 -109282 -119416
15169 -119416 -70697 -17326 -105966 -233337 -155302 -43087 2126 -21020 -32054 -7640 15233
15158 15233 -36943 -93915 -75382 9321 44730 -4736 -4633 8029 45729 19283 16173 35624
15146 35624 -47488 -105989 -104985 -85853 -29178 20767 -21134 -90104 -54336 88547 215518
15135 215518 220073 128772 121467 14829 -38136 -73775 -73822 -82349 -70294 -64787 36087 87157
$$ packed form
15217C6976L1354N893p7552j8665p487k1845J5018p117l9674O3210p280o8790
15205i5959j1951R0348q6182L541Q4697Q318N9736O6167l4672K4145M8830o1575
15193I5443q0248M4568j7585n8122j9914l107l538M934j8433l9616L3712n925
15181f7831J9116O8971j4646n5355O2758J7329M5625p1166p6525j4739k2819j0134
15169a19416M8719N3371q8640j27371P8035J12215M5213k3146j1034K4414K2873
15158A5233n2176n6972J8533Q4703L5409m9466J03J2662L7700k6446l110J9451
15146C5624q3112n8501J004J9132N6675M9945m1901o8970L5768J42883J26971
15135B15518M555r1301p305j06638n2965l5639m7q527J2055N507J00874N1070
$$ plain form
15123 87157 -9428 -42272 15496 45353 -15103 -102607 -75574 -20695 -11154 15671 69692 93141
15111 93141 59419 25824 3629 27975 53160 100951 82522 29390 5991 -33302 -39346 -78987
15099 -78987 -59421 -61515 55931 114308 124045 -30949 -90237 -100328 -98748 -81995 -27534 26702
15087 26702 31086 -6900 -52707 -36482 -56587 -161924 -152197 -187254 -185354 -143359 -99843 -38707
15075 -38707 -17865 -30472 -51137 1354 -45107 -69934 -68851 -112313 -171900 -163584 -121150 -53056
15063 -53056 33114 70188 26881 1460 -57392 105223 235492 175124 126009 10741 33488
15052 33488 59456 42385 -51608 20266 31870 28500 -24458 -51964 -65194 -34034 44629 -35659
15040 -35659 -33945 -26783 23153 82855 111544 53183 45419 -15722 -26468 -71199 -105697 -73489
$$ packed form
15123H7157r6585l2844N7768K9857o0456q7504K7033N4879R541K6825N4021K3449
15111I3141l3722l3595k2195K4346K5185M7791j8429n3132k3399l9293o044l9641
15099g8987J9566k094J17446N8377R737j54994n9288j0091J580J6753N4461N4236
15087B6702M384l7986m5807J6225k0105j05337R727l5057J900M1995M3516O1136
15075c8707K0842j2607k0665N2491m6461k4827J083m3462n9587Q316M2434O8094
15063e3056Q6170L7074m3307k5421n8852J62615J30269o0368m9115j15268K2747
15052C3488K5968j7071r3993P1874J1604l370n2958k7506j3230L1160P8663q0288
15040c5659J714P162M9936N9702K8689n8361p764o1141j0746m4731l4498L2208
$$ plain form
15028 -73489 11758 66090 70306 36014 24943 34756 53753 2531 6179 -23137 -43221 -10
15016 -10 -29947 -48129 -69799 -54693 -91381 -68378 -58344 -38264 -44329 -57909 2448 -17045
15004 -17045 23631 55667 122607 120621 134707 186373 137516 28124 -58432 -39542 -45490 -52736
14992 -52736 -8382 13186 32540 11840 43327 21937 -50381 -128654 -211333 -171868 -113096 -140060
14980 -140060 -77210 -31511 19336 52623 51397 66285 313 -61216 -51929 -84881 -94619 -81526
14968 -81526 -80638 -92192 -89752 -52954 -50483 -62619 -26165 -6161 -68622 -162383 -171638 -141729 -77585
14955 -77585 -11868 103044 170572 139001 122499 107062 153202 153221 79287 37842 4645 12557
14943 12557 62548 168424 143936 96333 69903 87326 138875 144137 82814 74783 105646 74244
$$ packed form
15028g3489Q5247N4332M216l4292j1071R813J8997n1222L648k9316k0084M3211
15016a0k9937j8182k1670J5106l6688K3003J0034K0080o065j3580O0357j9493
15004a7045M0676L2036O6940j986J4086N1666m8857j09392q6556J8890n948p246
14992e2736M4354K1568J9354k0700L1487k1390p2318p8273q2679L9465N8772k6964
14980a40060O2850M5699N0847L3287j226J4888o5972o1529R287l2952r738J3093
14968h1526Q88j1554K440L6798K471j2136L6454K0004o2461r3761r255K9909O4144
14955g7585O5717J14912O7528l1571j6502j5437M6140J9p3934m1445l3197P912
14943A2557M9991J05876k4488m7603k6430J7423N1549N262o1323q031L0863l1402
$$ plain form
14931 74244 74970 88900 153 3782 64461 65213 36207 9506 3901 -48903 -39199 -33331 -118733
14918 -118733 -132784 -12927 37614 -52568 -99210 -51736 -105902 -103882 -119337 -133244 -127826 -144708
14906 -144708 -113595 -133164 -93407 -76939 -87721 -16141 2786 -44462 -112164 -114154 -58653 -144687
14894 -144687 -138321 -77470 -98280 -105162 -92807 -40839 23926 11053 -105851 -224909 -243773
14883 -243773 -150045 -166978 -215714 -217422 -182403 -136884 -162969 -194202 -173719 -189779 -158733 -179311
14871 -179311 -137459 -48865 -94129 -123901 -34742 36230 -80887 -109170 -76311 -92805 -91211
14860 -91211 -115833 -188680 -223968 -218959 -164794 -101421 -39696 32541 45449 43313 24303 -22
14848 -22 58342 28672 -91815 -171212 -177517 -160075 -186661 -152911 -52568 46919 42418 -68466
$$ packed form
14931G4244P26J3930q8747L629O0679P52k9006k6701n605n2804R704N868q5402
14918a18733j4051J19857N0541r0182m6642M7474n4166K020j5455j3907N418j6882
14906a44708L1113j9569L9757J6468j0782P1580J8927m7248o7702j990N5501q6034
14894a44687O366O0851k0810o882J2355N1968O4765j2873j16904j19058j8864
14883b43773R3728j6933m8736j708L5019M5519k6085l1233K0483j6060L1046k0578
14871a79311M1852Q8594m5264k9772Q9159P0972j17117k8283L2859j6494J594
14860i1211k4622p2847l5288N009N4165O3373O1725P2237J2908k136j9010k4325
14848b2N8364k9670j20487p9397o305J7442k6586L3750J00343R9487m501j10884
$$ plain form
14836 -68466 -104383 -134385 -152574 -167490 -73580 -40268 -71896 -68006 -35681 -90704 -136820 -46330
14824 -46330 -6529 -26238 -82665 -61824 -23535 2442 62542 58958 -15664 -63023 -66391 -86020
14812 -86020 -86052 -3840 32769 7959 -48867 -152664 -175628 -143150 -129480 -79882 -51374 6865
14800 6865 -26235 -49314 -1814 6979 51393 354 -25184 38006 109462 111008 36679 -45765
14788 -45765 35346 -54778 -70256 -52245 -40794 4776 -13020 -50336 -61121 -63276 -79404 -63062
14776 -63062 -50496 -51843 -30065 -18481 -61477 -23178 -24724 16619 28937 64932 34883 74748
14764 74748 145562 122747 -58124 -156564 -140608 -141627 5061 -23025 -116806 -78742 -60919
14753 -60919 -102803 -9276 101453 4660 -105182 -26583 -8491 44617 51188 104153 121109
$$ packed form
14836f8466l5917l0002j8189j4916R3910L3312l1628L890L2325n5023m6116R0490
14824d6330L9801j9709n6427K0841L8289K5977O0100l584p4622m7359l368j9629
14812h6020l2Q2212L6609k4810n6826j03797k2964L2478J3670M9598K8508N8239
14800F865l3100k3079M7500Q793M4414n1039k5538O3190P1456J546p4329q2444
14788d5765Q1111r0124j5478J8011J1451M5570j7796l7316j0785k155j6128J6342
14776f3062J2566j347K1778J1584m2996L8299j546M1343J2318L5995l0049L9865
14764G4748P0814k2815j80871r8440J5956j019J46688k8086r3781L8064J7823
14753f0919m1884R3527J10729r6793j09842P8599J8092N3108O571N2965J6956
$$ plain form
14742 121109 142165 99381 47406 40417 58831 -994 4034 24776 23636 66551 18649 -53672
14730 -53672 8105 -12963 -21631 -18540 -6510 -58949 -89302 -118409 -98862 -73663 -84597 -95439
14718 -95439 -120106 -82500 -53595 -915 127651 80819 -98644 -140522 -121487 -33943 -30893
14707 -30893 5060 -124035 -151042 -154554 -195252 -132121 -60647 35016 96913 163702 129784 114929
14695 114929 6096 -51210 -121399 -179086 -122981 -87889 -38112 -7885 -35390 -75056 -155054
14684 -155054 -223674 -182243 -128884 -92259 -109992 -117604 -115109 -120740 -120392 -23600 65422 57757 64906
14671 64906 2156 -23336 -47802 -73529 34306 85538 22323 -70674 -138642 -125946 -16016
14660 -16016 -16088 -50818 -9259 23483 88344 -20418 -123899 -178904 -84703 13856 19407 1895
$$ packed form
14742A21109K1056m2784n1975o989J8414n9825N028K0742j140M2915m7902p2321
14730e3672O1777k1068q668L091J2030n2439l0353k9107J9547K5199j0934j0842
14718i5439k4667L7606K8905N2680J28566m6832j79463m1878J9035Q7544L050
14707c0893L5953j29095k7007l512m0698O3131P1474R5663O1897O6789l3918j4855
14695A14929j08833n7306p0189n7687N6105L5092M9777L0227k7505l9666p9998
14684a55054o8620M1431N3359L6625j7733p612K495n631L48R6792Q9022p665P149
14671F4906o2750k5492k4466k5727J07835N1232o3215r2997o7968J2696J09930
14660a6016p2l4730M1559L2742O4861j08762j03481n5005R4201R8559N551j7512
$$ plain form
14648 1895 -31715 -23947 -81766 -104515 -127277 -111532 -104972 -19065 59352 58720 43157 23710 -7108
14635 -7108 -65760 -50346 102310 65527 -4128 -11689 -38693 -52902 -58201 -59862 -41637 31639
14623 31639 -31376 -41497 1590 -44504 -87027 -169769 -187281 -134297 -129199 -112780 -104264 -116871
14611 -116871 -164940 -221170 -147276 -38794 39188 -44403 -55505 -41915 -52814 -31848 -46741
14600 -46741 -93143 -83916 -74030 -70555 2468 22703 -89292 -173677 -172150 -128265 -23575 8620
14588 8620 90909 33021 -15008 -21581 46125 23330 -41511 -58679 -51873 23655 18578 -45373
14576 -45373 -77449 -19575 -27848 -46019 -81493 10078 68129 48653 29755 -43057 3936 118714
14564 118714 116320 117843 104720 80380 -3139 -46319 -84541 -131051 -73227 -6983 -19191 5064
$$ packed form
14648A895l3610P768n7819k2749k2762J5745O560Q5907P8417o32j5563j9447l0818
14635g108n8652J5414J52656l6783o9655p561k7004j4209n299j661J8225P3276
14623C1639o3015j0121M3087m6094m2523q2742j7512N2984N098J6419Q516j2607
14611a16871m8069n6230P3894J08482P7982q3591j1102J3590j0899K0966j4893
14600d6741m6402R227R886L475P3023K0235j11995q4385J527M3885J04690L2195
14588H620Q2289n7888m8029o573O7706k2795o4841j7168O806P5528n077o3951
14576d5373l2076N7874q273j8171l5474R1571N8051j9476j8898p2812M6993J14778
14564A18714k394J523j3123k4340q3519m3180l8222m6510N7824O6244j2208K4255
$$ plain form
14552 5064 -22459 -96870 -137639 -137934 -194094 -197881 -76342 -36263 -93283 -113032 -143733 -120241
14540 -120241 -88772 -50245 -53797 -81956 -91924 -51977 -20839 -43014 56805 90334 -36575 -83359
14528 -83359 -8179 12678 -24756 -53862 -38388 -80165 -74472 -69045 -142983 -124618 -148840 -71368
14516 -71368 -74729 -63448 -35278 -56788 -117144 -44856 -75447 -178325 -175179 -166959 -126632 -31613
14504 -31613 29275 -22428 -136484 -187213 -69625 -23635 18591 12864 33386 71125 12258
14493 12258 -66987 -41604 28373 81278 117417 42503 -22639 14641 -7015 -64542 -99380 -85961
14481 -85961 -134892 -166449 -77218 3999 40352 49123 17721 -68776 -159185 -166183 -87951 -109610
14469 -109610 -101033 -132030 -151615 -145127 -108133 -54126 -50810 -9010 -36583 31958 85621 76360
$$ packed form
14552E064k7523p4411m0769k95n6160l787J21539M0079n7020j9749l0701K3492
14540a20241L1469L8527l552k8159r968L9947L1138k2175R9819L3529j26909m6784
14528h3359P5180K0857l7434k9106J5474m1777N693N427p3938J8365k4222P7472
14516g1368l361J1281K8170k1510o0356P2288l0591j02878L146Q220M0327R5019
14504c1613O0888n1703j14056n0729J17588M5990M2226n727K0522L7739n8867
14493A2258p9245K5383O9977N2905L6139p4914o5142L7280k1656n7527l4838J3419
14481h5961m8931l1557Q9231Q1217L6353Q771l1402q6497r0409o998P8232k1659
14469a09610Q577l0997j9585O488L6994N4007L316M1800k7573O8541N3663r261
$$ plain form
14457 76360 43964 107493 17661 -7163 1677 -30856 -25141 -57635 -40503 -117152 -102120 -88310
14445 -88310 -5470 104033 72880 -1383 11195 97505 116692 20533 -63120 682 1761 -39912
14433 -39912 -20670 -29613 50939 109373 58306 58467 -13521 -113627 -158651 -104458 -20020 -11240
14421 -11240 -2992 -482 -48271 -78926 -49916 -30625 -40296 -122235 -154194 -156201 -162043 -119278 -80920
14408 -80920 -77725 -75250 -55096 -83919 -44264 57914 -49477 -115485 -28083 -77328 -90447 -150763
14396 -150763 -137806 -37279 54688 -16814 -34685 -41292 47222 28062 -60395 -94077 -42884
14385 -42884 18621 6866 -12274 -677 -11878 -20613 -16510 63310 57062 23793 79571 117569
14373 117569 6418 -22843 -54775 -29646 31161 88170 975 57730 76538 -37296 -63544
$$ packed form
14457G6360l2396O3529q9832k4824Q840l2533N715l2494J7132p6649J5032J3810
14445h8310Q2840J09503l1153p4263J2578Q6310J9187r6159q3653O3802J079m1673
14433c9912J9242q943Q0552N8434n1067J61p1988j00106m5024N4193Q4438Q780
14421a1240Q248K510m7789l0655K9010J9291r671q1939l1959k007n842M2765L8358
14408h0920L195K475K0154k8823L9655J02178j07391o6008Q7402m9245j3119o0316
14396a50763J2957J00527R1967p1502j7871o607Q8514j9160q8457l3682N1193
14385d2884O1505j1755j9140J1597j1201q735M103P9820o248l3269N5778L7998
14373A17569j11151k9261l1932K5129O0807N7009q7195N6755J8808j13834k6248
$$ plain form
14362 -63544 -65173 -98209 -131964 -94811 -94647 -130758 -52940 -22495 -78813 -14822 32910 -34551
14350 -34551 -120685 -73727 -49498 -17316 68288 107563 15667 -25600 -66951 -173274 -158196
14339 -158196 -83570 -2719 39509 92185 65765 -14911 -42772 -75147 -157876 -218325 -194370
14328 -194370 -126392 -87053 -8058 73860 81729 142893 212804 144599 92628 55998 23880 65486
14316 65486 -7666 -53803 -74167 -47672 -108723 -74263 -65337 -47358 -13530 28651 25678 -27178
14304 -27178 -77343 -49496 -32758 37625 52939 86203 96597 83637 76469 53864 -200 -24568
14292 -24568 -8519 128205 138105 119505 138809 146688 41542 -85969 -119442 -157546 -190849
14281 -190849 -194212 -115833 -85314 -21333 18798 6694 -7717 -63353 -131341 -207418 -143918 -125881
$$ packed form
14362f3544j629l3036l3755L7153J64l6111P7818L0445n6318O3991M7732o7461
14350c4551q6134M6958K4229L2182Q5604L9275r1896m1267m1351j06323J5078
14339a58196P4626Q0851M2228N2676k6420q0676k7861l2375q2729o0449K3955
14328a94370O7978L9339P8995Q1918P869O1164O9911o8205n1971l6630l2118M1606
14316F5486p3152m6137k0364K6495o1051L4460Q926J7979L3828M2181k973n2856
14304b7178n0165K7847J6738P0383J5314L3264J0394j2960p168k2605n4064k4368
14292b4568J6049J36724R900j8600J9304P879j05146j27511l3473l8104l3303
14281a90849l363P8379L0519O3981M0131j2104j4411n5636o7988p6077O3500J8037
$$ plain form
14269 -125881 -129366 -215528 -226232 -162919 -126257 -32462 54514 14633 -61218 -58300 -61350 -121821
14257 -121821 -151502 -153715 -104333 -125808 -106394 -68501 -106391 -137346 -103857 -130257 -152499 -130141
14245 -130141 -105539 -124390 -156923 -101222 -5006 91866 49313 32411 111898 25912 -59020
14234 -59020 -48390 77513 126656 121999 143768 117900 91016 57006 17976 -29143 -38475 -8776
14222 -8776 -26944 -63735 -37765 53498 -46548 -89192 -87425 -47728 -3221 49203 38470 -39337
14210 -39337 -43565 -23812 -93195 -98327 -31519 -20088 28160 58666 -15909 -100907 -94094 -28403
14198 -28403 59104 124522 75241 -75514 -156035 -159568 -58683 -54165 -120458 -140947 -195409 -166804
14186 -166804 -91927 -27996 24242 28085 76081 95242 13790 -76710 -104002 -159887 -159381 -69172
$$ packed form
14269a25881l485q6162j0704O3313L6662R3795Q6976l9881p5851K918l050o0471
14257a21821k9681k213M9382k1475J9414L7893l7890l0955L3489k6400k2242K2358
14245a30141K4602j8851l2533N5701R6216R6872m2553j6902P9487q5986q4932
14234e9020J0630J25903M9143m657K1769k5868k6884l4010l9030m7119r332K9699
14222h776j8168l6791K5970R1263j00046m2644J767L9697M4507N2424j0733p7807
14210c9337m228J9753o9383n132O6808J1431M8248L0506p4575q4998O813O5691
14198b8403Q7507O5418m9281j50755q0521l533J00885M518o6293k0489n4462K8605
14186a66804P4877O3931N2238L843M7996J9161q1452r0500k7292n5885N06R0209
$$ plain form
14174 -69172 -97782 -167299 -182715 -165222 -91903 -39685 -120086 -198222 -282549 -242229 -107655
14163 -107655 -96109 -115272 -68307 -38481 -25938 -21043 -80691 -83793 -34515 -1872 -3466 -25918
14151 -25918 12576 -9718 -56390 -85098 -58794 -52042 -75965 -56115 -42001 -83673 -54467 11997
14139 11997 106553 83133 -42263 -128350 -24701 76016 37169 33827 83220 67980 -52184
14128 -52184 -136374 -77629 34338 78161 45511 -22509 -108311 -42184 12541 -12516 -19388 -72135
14116 -72135 -79981 -66193 -11841 -62261 -59838 -28469 60413 77091 59381 98752 119748 58434
14104 58434 -36425 -23457 39513 49376 65034 39416 22132 77101 67232 71673 78310 45750
14092 45750 6473 665 -16349 -84887 -100561 -118872 -57399 -100853 751 8027 21223 27949
$$ packed form
14174f9172k8610o9517j5416J7493P3319N2218q0401p8136q4327M0320J34574
14163a07655J1546j9163M6965K9826J2543M895n9648l102M9278L2643j594k2452
14151b5918L8494k2294m6672k8708K6304O752k3923J9850J4114m1672K9206O6464
14139A1997R4556k3420j25396q6087J03649J00717l8847l342M9393j5240j20164
14128e2184q4190N8745J11967M3823l2650o8020q5802O6127N4725k5057o872n2747
14116g2135p846J3788N4352n0420K423L1369Q8882J6678j7710L9371K0996o1314
14104E8434r4859J2968O2970R863J5658k5618j7284N4969r869M441O637l2560
14092D5750l9277n808j7014o8538j5674j8311O1473m3454J01604P276J3196O726
$$ plain form
14080 27949 -18856 -19504 -50237 -143583 -144869 -117720 -17008 113126 121710 108375 101950 120957
14068 120957 125230 84108 -74305 -107059 -96703 -179755 -158370 -58725 -64091 -53776 -34982 32030
14056 32030 47879 57757 21025 -5419 25883 -13862 -53300 -109618 -75020 -74629 -3598 -5441
14044 -5441 -121278 -177164 -79188 -56620 -35681 19735 -8731 -89168 -116082 -154385 -198682 -55605
14032 -55605 51962 34636 -72622 -161504 -147306 -88094 -134709 -41084 -3120 -59678 -78330
14021 -78330 -96209 -113123 -34200 -53565 -119544 -56576 1113 -74392 -137761 -149569 -51245 -2193
14009 -2193 -52115 -114805 -93817 -23256 36181 -24017 -37819 -21743 -31687 -80816 -78191 -101792
13997 -101792 -149451 -181858 -165438 -151895 -97648 -25824 -12684 -6953 -78671 -115320 -85470 -66879
$$ packed form
14080B7949m6805o48l0733r3346j286K7149J00712J30134Q584j3335o425J9007
14068A20957M273m1122j58413l2754J0356q3052K1385R9645n366J0315J8794O7012
14056C2030J5849R878l6732k6444L1302l9745l9438n6318L4598L91P1031j843
14044e441j15837n5886R7976K2568K0939N5416k8466q0437k6914l8303m4297J43077
14032e5605J07567j7326j07258q8882J4198N9212m6615R3625L7964n6558j8652
14021g8330j7879j6914P8923j9365o5979O2968N7689p5505o3369j1808R8324M9052
14009b193m9922o2690K0988P0561N9437o0198j3802J6076r944m9129K625k3601
13997a01792m7659l2407J6420J3543N4247P1824J3140N731p1718l6649K9850J8591
$$ plain form
13985 -66879 -3422 11682 -12772 -40246 -13938 -17030 -95389 -185381 -221699 -174995 -131232 -99002
13973 -99002 -186327 -239124 -178026 -142958 -168749 -107554 -103981 -104555 -100906 -89490 -74658 -111991
13961 -111991 -108802 -115518 -111446 27842 102957 21141 -30859 -43977 -47902 -53970 -14151 39550
13949 39550 30423 -66409 -82545 -82013 -16905 -37687 -37925 98080 98436 33665 38717 72742 -93869
13936 -93869 -153432 -88162 31479 73802 120546 168192 47052 -102538 -89358 -95016 -59196
13925 -59196 -117059 -67103 -32630 -38262 -92047 -53566 -22545 27662 17452 -15567 -16887 -19192
13913 -19192 -63935 -6290 56860 39363 26852 80283 -27525 -78209 -66914 -33626 -13579
13902 -13579 -52488 -107179 -143236 -142530 -177396 -131570 -38888 -34714 -1064 28066 65157 -44285
$$ packed form
13985f6879O3457J5104k4454k7474K6308l092p8359q9992l6318M6704M3763L2230
13973i9002q7325n2797O1098L5068k5791O1195L573n74L649J1416J4832l7333
13961a11991L189o716M072J39288P5115q1816n2000j3118l925o068L9819N3701
13949C9550r127r6832j6136N32O5108k0782k38J36005L56o4771N052L4025j66611
13936i3869n9563O5270J19641M2323M6744M7646j21140j49590J3180n658L5820
13925e9196n7863M9956L4473n632n3785L8481L1021N0207j0210l3019j320k305
13913a9192m4743N7645O3150j7497j2511N3431j07808n0684J1295L3288K0047
13902a3579l8909n4691l6057P06l4866M5826R2682M174L3650K9130L7091j09442
$$ plain form
13890 -44285 -80834 9937 87193 31556 -52110 -36934 12956 5791 -33393 81831 89654 41502
13878 41502 61079 -623 -47233 -44274 -193560 -195946 -226020 -234151 -221615 -151629 -128177 -57320
13866 -57320 15084 51903 -2784 -80158 -127780 -146622 -116611 -78559 42876 78417 43491
13855 43491 40173 67895 1489 -19593 20586 96754 18909 12583 -16362 -30344 9490 101285
13843 101285 28519 -61122 -44130 -56568 -102047 -27154 26014 -10530 -51488 -63708 -26677
13832 -26677 -101653 -93174 -52120 -9857 26460 -43157 -49479 -33717 -6820 67130 36057 -60771
13820 -60771 -909 7203 -84026 -128147 -154900 -77209 8029 26096 -21673 -92072 -122373 -125796
13808 -125796 -139463 -126802 -54911 -16882 -17969 11260 43680 59573 33298 -20611 2096 -6317
$$ packed form
13890d4285l6549R0771P7256n5637q3666J5176M9890p165l9184J15224P823m8152
13878D1502J9577o1702m6610K959j49286k386l0074q131J2536O9986K3452P0857
13866e7320P2404L6819n4687p7374m7622j8842L0011L8052J21435L5541l4926
13855D3491l318K7722o6406k1082M0179P6168p7845o326k8945j3982L9834R1795
13843A01285p2766q9641J6992j2438m5479P4893N3168l6544m0958j2220L7031
13832b6677p4976Q479M1054M2263L6317o9617o322J5762K6897P3950l1073r6828
13820f0771N9862Q112r1229m4121k6753P7691Q5238J8067m7769p0399l0301l423
13808a25796j3667J2661P1891L8029j087K9229L2420J5893k6275n3909K2707q413
$$ plain form
13796 -6317 -43762 -76637 -72343 -94851 -109221 -117416 -73640 -145548 -122689 -78846 -38213 -52925
13784 -52925 -41251 81813 143484 118037 -21922 -9579 37827 34212 -12410 -54297 -61751 -51274
13772 -51274 -1512 -4270 31221 -27348 -3921 20899 1597 61427 -1866 -28442 -39142 -34960
13760 -34960 26648 55175 -12060 -67578 -9191 141942 175657 88020 83853 43881 -30257 -57376
13748 -57376 -94899 -46359 42916 58060 -15321 -34895 -15258 38374 72549 83787 79436 96448
13736 96448 89954 147064 109855 71803 -64223 -73342 -40327 -5477 -7388 -39493 40575 72385
13724 72385 47752 55701 85348 62076 93615 120151 85212 -42155 -143988 -219724 -110867
13713 -110867 -18375 3769 45972 -2713 -51438 -36151 -50873 -74138 -103113 -83183 -26408
$$ packed form
13796f317l7445l2875M294k2508j4370q195M3776p1908K2859M3843M0633j4712
13784e2925J1674J23064O1671k5447j39959J2343M7406l615m6622m1887p454J0477
13772e1274M9762k758L5491n8569K3427K4820j9302N9830o3293k6576j0700M182
13760c4960O1608K8527o7235n5518N8387J51133L3715q7637m167l9972p4138k7119
13748e7376l7523M8540Q9275J5144p3381j9574J9637N3632L4175J1238m351J7012
13736I6448o494N7110l7209l8052j36026r119L3015L4850j911l2105Q0068L1810
13724G2385k4633P949K9647k3272L1539K6536l4939j27367j01833p5736J08857
13713a10867R2492K2144M2203m8685m8725J5287j4722k3265k8975J9930N6775
$$ plain form
13702 -26408 -36249 -23795 -10320 -45528 -102276 -74615 -75906 -14635 2906 -28703 -20536 -35997
13690 -35997 -46995 142 35226 -19806 11700 1311 672 -14168 -113091 -124760 -70186 -77783
13678 -77783 14675 5559 33633 13052 2921 -68484 -185451 -124869 -39393 24556 17425 -37963
13666 -37963 -62884 -32327 38530 34951 9030 -7348 -21288 -53250 2445 23246 -27411 -72484
13654 -72484 -107101 -62422 -3716 -25333 38323 86534 121171 27838 -94231 -85851 -143665 -94200
13642 -94200 -57073 -110787 -147437 -164106 -260315 -351795 -304597 -241294 -140393 -36039 -72754
13631 -72754 -54550 -77969 -128326 -130374 -154417 -106904 -88056 -75783 -75846 -27117 55586 88350
13619 88350 6695 -15167 -39002 -37039 -34856 15314 58441 31316 -68158 -75257 -123082 -81655
$$ packed form
13702b6408r841J2454J3475l5208n6748K7661j291O1271J7541l1609Q167j5461
13690c5997j0998M7137L5084n5032L1506j0389o39j4840r8923j1669N4574p597
13678g7783R2458r116K8074k0581j0131p1405j16967O0582Q5476O3949p131n5388
13666c7963k4921L0557P0857l579k5921j6378j3940l1962N5695K0801n0657m5073
13654g2484l4617M4679N8706k1617O3656M8211L4637r3333j22069Q380n7814M9465
13642i4200L7127n3714l6650j6669r6209r1480M7198O3303J00901J04354l6715
13631g2754J8204k3419n0357k048k4043M7513J8848J2273o3M8729Q2703L2764
13619H8350q1655k1862k3835J963K183N0170M3127k7125r9474p099m7825M1427
$$ plain form
13607 -81655 18202 114804 136975 58972 23395 87906 121673 88387 -27662 -70011 -38479
13596 -38479 5374 95106 152163 113723 56201 47538 145088 135915 32183 2413 -23497 -71202
13584 -71202 5642 90874 51980 -65925 -166300 -130090 -106203 -89082 -143484 -113803 -70153
13573 -70153 5143 64094 -11037 36608 93682 112907 97730 23003 35078 60340 57049 -35385
13561 -35385 -94659 -155056 -178220 -126750 -42173 -60810 -22069 1964 -59431 -85351 -191057
13550 -191057 -264143 -155255 -79093 -69158 -41666 -73314 -85395 -77408 -49347 -68574 -156047 -141546
13538 -141546 -6481 11610 10386 35533 7204 13206 9770 -41453 -85217 -215495 -223185 -145219
13526 -145219 -2525 43158 79701 175323 147567 158549 176205 224107 148157 35402 -12552
$$ packed form
13607h1655R9857R6602K2171p8003l5577O4511L3767l3286j16049m2349L1532
13596c8479M3853Q9732N7057l8440n7522q663R7550r173j03732k9770k5910m7705
13584g1202P6844Q5232l8894j17905j00375L6210K3887J7121n4402K9681M3650
13573g0153P5296N8951p5131M7645N7074J9225j5177p4727J2075K5262l291r2434
13561c5385n9274o0397k3164N1470Q4577j8637L8741K4033o1395k5920j05706
13550a91057p3086J08888P6162R935K7492l1648j2081P987K8061j9227q7473J4501
13538a41546J35065J8091j224K5147k8329O002l436n1223m3764j30278p690P7966
13526a45219J42694M5683L6543R5622k7756J0982J7656M7902p5950j12755m7954
$$ plain form
13515 -12552 41794 33737 -14382 13181 49130 38606 11503 8338 14876 28861 -112803 -203588
13503 -203588 -179528 -203727 -126359 -142870 -59515 -89401 -117893 -126231 -77216 -52578 -63814 -67491
13491 -67491 -70600 -57990 -56730 37026 110227 91599 90312 52815 30633 -72510 -98638 -80680
13479 -80680 -6497 6283 -113324 -225074 -181445 -112293 -49850 14709 38641 35333 27322 -48168
13467 -48168 -64474 41603 49124 34984 40689 26713 -31842 45567 140274 115219 95080 94730
13455 94730 138744 107006 121609 96189 78787 61102 106505 104078 14203 -109098 -168344 -196064
13443 -196064 -71213 -54512 -107919 -117789 -76894 -80792 -37834 27440 -2650 16804 118885
13432 118885 146232 53281 11120 -59492 -25699 51473 39639 65638 14377 -82928 -36522
$$ packed form
13515a2552N4346q057m8119K7563L5949j0524k7103l165O538J3985j41664r0785
13503b03588K4060k4199P7368j6511Q3355k9886k8492q338M9015K4638j1236l677
13491f7491l109J2610J260R3756P3201j8628j287l7497k2182j03143k6128J7958
13479h0680P4183J2780j19607j11750M3629O9152O2443O4559K3932l308q011p5490
13467d8168j6306J06077P521j4140N705j3976n8555P7409R4707k5055k0139l50
13455I4730M4014l1738J4603k5420j7402j7685M5403k427q9875j23301n9246k7720
13443a96064J24851J6701n3407r870M0895l898M2958O5274l0090J9454J02081
13432A18885K7347r2951m2161p0612L3793P7172j1834K5999n1261r7305M6406
$$ plain form
13421 -36522 104543 102318 38893 -5506 -970 -50555 -14620 -73181 -83435 324 4039 -7932
13409 -7932 20505 19586 -25285 -55519 -46101 -61305 -99103 -58142 69067 114780 434 -91984
13397 -91984 -79237 -29708 8593 30683 89380 157130 83859 33853 86517 113757 55027 -2116
13385 -2116 72175 24085 -71345 -46974 -34327 12356 1892 -53019 -63996 1864 68088 67088
13373 67088 90084 136399 108742 -33446 -52044 -129534 -108099 -39553 -49619 -41376 -8992 44404
13361 44404 64838 8003 15164 58351 55748 -37359 -75958 -59166 -57355 -84097 -83811 -58322 -124362
13348 -124362 -90706 -44495 -17320 -4666 -66711 -87977 -35554 -37944 29739 -94984 -156800
13337 -156800 -131226 -53770 18479 116279 21102 -18214 -24098 21987 36074 -7085 -65609 -22335
$$ packed form
13421c6522J41065k225o3425m4399M536m9585L5935n8561j0254Q3759L715j1971
13409g932K8437r19m4871l0234R418j5204l7798M0961J27209M5713j14346r2418
13397i1984J2747M9529L8301K2090N8697O7750p3271n0006N2664K7240n8730n7143
13385b116P4291m8090r5430K4371J2647M6683j0464n4911j0977O5860O6224j000
13373F7088K2996M6315k7657j42188j8598p7490K1435O8546j0066Q243L2384N3396
13361D4404K0434n6835P161M3187k603r3107l8599J6792J811k6742K86K5489o6040
13348a24362L3656M6211K7175J2654o2045k1266N2423k390O7683j24723o1816
13337a56800K5574P7456P2249R7800r5177l9316n884M6085J4087m3159n8524M3274
$$ plain form
13325 -22335 62628 126756 98414 41874 21658 -58460 -109631 -104711 -28215 -9632 -119749 -75695
13313 -75695 -92989 -52146 -55335 -26667 -69686 -116074 -141146 -211386 -198973 -172879 -201995 -146924
13301 -146924 -95954 27784 83353 -22864 -18607 -36790 -45363 -10008 -28243 -70993 -64356 -83336
13289 -83336 -109509 -135204 -95554 -64327 -65329 -132236 -118756 718 17835 -13111 8335 3475
13277 3475 -29528 -133609 -141295 -66290 -39860 -133706 -132608 -155316 -128391 -104754 -16288 55964
13265 55964 16678 -15704 -75150 -111132 -27889 -53569 -90813 -98563 -46205 -13016 -1834 -26379
13253 -26379 -39026 -12268 20363 39705 29425 -84266 -46575 -31324 -85232 -66488 61216
13242 61216 135943 112266 81320 31113 5690 47231 57316 8072 27005 49883 68798 4262
$$ packed form
13325b2335Q4963O4128k8342n6540k0216q0118n1171M920P6496J8583j10117M4054
13313g5695j7294M0843l189K8668m3019m6388k5072p0240J2413K6094k9116N5071
13301a46924N0970J23738N5569j06217M257j8183q573L5355j8235m2750O637j8980
13289h3336k6173k5695L9650L1227j002o6907J3480J19474J7117l0946K1446m860
13277C475l3003j04081p686P5005K6430r3846J098k2708K6925K3637Q8466P2252
13265E5964l9286l2382n9446l5982Q3243k5680l7244p750N2358L3189J1182k4545
13253b6379j2647K6758L2631J9342j0280j13691L7691J5251n3908J8744J27704
13242F1216P4727k3677l0946n0207k5423M1541J0085m9244J8933K2878J8915o4536
$$ plain form
13230 4262 -42966 -7987 8407 -18979 -20243 45642 -16993 36398 123347 82855 4354 -88508
13218 -88508 -126812 -34631 73087 37500 -38389 -37532 -14331 -89901 -125638 -150458 -152137 -155457
13206 -155457 -140503 -113648 -69299 -111501 -147599 -186677 -93739 32943 66338 -33489 -12415
13195 -12415 -5576 22642 61391 75826 21581 -73162 -122517 -85528 37383 87145 36989 -28688
13183 -28688 -2485 36602 26992 -89833 -87621 -19204 -63953 -76876 -82036 -70382 -60262 1452
13171 1452 16768 -44836 -28675 -9532 2860 -36424 -110697 -89204 -98026 -51137 -76566 1037
13159 1037 102904 103097 6538 -83763 -131514 -70637 21289 -13429 -4525 -36547 -93529 -69431
13147 -69431 -79650 -107142 -68408 -16441 -71178 -97892 -95923 -78791 9981 70813 77550 43226
$$ packed form
13230D262m7228L4979J6394k7386j264O5885o2635N3391Q6949m0492p8501r2862
13218h8508l8304R2181J07718l5587p5889Q57K3201p5570l5737k4820j679l320
13206a55457J4954K6855M4349m2202l6098l9078R2938J26682L3395r9827K1074
13195a2415O839K8218L8749J4435n4245r4743m9355L6989J22911M9762n0156o5677
13183b8688K6203L9087r610j16825K212O8417m4749j2923n160J1654J0120O1714
13171A452J5316o1604J6161J9143J2392l9284p4273K1493q822M6889k5429P7603
13159A037J01867J93r6559r0301m7751O0877R1926l4718Q904l2022n6982K4098
13147f9431j0219k7492L8734N1967n4737k6714J969J7132Q8772O0832O737l4324
$$ plain form
13135 43226 -8894 -30766 -44311 56347 89815 -29821 -15714 6220 4338 95123 109288
13124 109288 123156 144148 113709 86753 19715 -21200 -17416 -109490 -109158 -32000 69000 30527
13112 30527 -29515 -19849 59944 67301 -46845 -88499 9850 67380 85153 160441 156238 133257
13100 133257 65977 22954 11115 20595 60108 48968 -4308 4007 -41373 -26856 -26060 -144442
13088 -144442 -207843 -139646 -25951 -59095 -131081 -196199 -116450 -10968 6537 64484 99098
13077 99098 95537 144393 100865 27069 4504 -115106 -152582 -127455 -25191 66030 60709 71800
13065 71800 102065 44304 -41693 22840 159351 169168 191941 231049 178033 170868 133775 96916
13053 96916 10661 -56856 -67965 -70695 -16648 -18713 21367 72296 22841 32402 30566 95623
$$ packed form
13135D3226n2120k1872j3545J00658L3468j19636J4107K1934j882R0785J4165
13124A09288J3868K0992l0439k6956o7038m0915L784r2074L32P7158J01000l8473
13112C0527o0042R666P9793P357j14146m1654R8349N7530J7773P5288m203k2981
13100A33257o7280m3023j1839R480L9513j1140n3276Q315m5380J4517P96j18382
13088a44442o3401O8197J13695l3144p1986o5118P9749J05482J7505N7947L4614
13077I9098l561M8856m3528p3796k2565j19610l7476K5127J02264R1221n321J1091
13065G1800L0265n7761q5997O4533J36511R817K2773L9108n3016p165l7093l6859
13053I6916q6255o7517j1109k730N4047k065M0080N0929m9455R561j836O5057
$$ plain form
13041 95623 92558 79190 18373 34935 -53902 -61713 -12531 -5744 -33060 8652 50005 106154
13029 106154 35780 30834 38600 -41086 -27897 -3295 -25828 -12806 45392 110674 16870 53198
13017 53198 111680 115945 107923 66755 103548 93966 80907 -3822 98844 142949 101789 127161
13005 127161 127623 173879 259677 146449 19670 20888 33124 54984 50121 106394 154363 150077
12993 150077 107311 94187 81924 39844 -42440 -38053 48516 45148 57600 -15652 -18146 3204
12981 3204 20872 -52978 -110655 -98745 -117784 -104346 -53296 -5031 -38010 -64842 -44050 -68802
12969 -68802 -92680 -19902 -6400 -84355 -4408 28517 -13673 -13597 -26702 -84615 -90572 -17850
12957 -17850 27767 11758 -42213 -32643 76570 74711 68574 66982 37589 44304 43202 27995 29691
$$ packed form
13041I5623l065j3368o0817J6562q8837p811M9182O787k7316M1712M1353N6149
13029A06154p0374m946P766p9686J3189K4602k2533J3022N8198O5282r3804L6328
13017E3198N8482M265q022m1168L6793r582j3059q4729J02666M4105m1160K5372
13005A27161M62M6256Q5798j13228j26779J218J2236K1860m863N6273M7969m286
12993A50077m2766j3124j2263m2080q2284M387Q6569l368J2452p3252k494K1350
12981C204J7668p3850n7677J1910j9039J3438N1050M8265l2979k6832K0792k4752
12969f8802k3878P2778J3502p7955P9947L2925m2190P6j3105n7913n957P2722
12957a7850M5617j6009n3971R570J09213j859o137j592k9393O715j102j5207J696
$$ plain form
12944 29691 -9041 19240 24783 77985 142215 110392 -4747 -40011 5023 -31967 -22580 75649
12932 75649 37029 591 81113 76333 6290 32048 154618 304869 284484 109629 3775
12921 3775 65983 115126 152473 204661 204668 207338 143694 -7417 -52401 -57717 -58793 -88068 -123680
12908 -123680 -65767 -7276 -102677 -186270 -111998 -19762 -50573 22135 67373 62994 66886 77082
12896 77082 73379 56912 49353 62655 31424 79730 42191 92058 113821 135342 162215 88739
12884 88739 105848 188737 185988 44142 22137 30495 -31420 -48158 -44204 35092 81712 131230
12872 131230 136646 50579 13370 -26988 -53228 -7416 54057 93327 30071 -52478 25624 107942
12860 107942 129557 96937 50894 20514 91716 142331 150286 109700 106678 135954 143267 154696
$$ packed form
12944B9691l8732K8281N543N3202O4230l1823j15139l5264M5034l6990R387R8229
12932G5649l8620l6438Q0522m780p0043K5758J22570J50251k0385j74855j05854
12921C775O2208M9143L7347N2188PK670o3644j51111m4984n316j076k9275l5612
12908a23680N7913N8491r5401q3593P4272R2236l0811P2708M5238m379L892J0196
12896G7082l703j6467p559J3302l1231M8306l7539M9867K1763K1521K6873p3476
12884H8739J7109Q2889k749j41846k2005Q358o1915j6738L954P9296M6620M9518
12872A31230N416q6067l7209m0358k6240M5812O1473L9270o3256q2549P8102Q2318
12860A07942K1615l2620m6043l0380P1202N0615P955m0586l022K9276P313J1429
$$ plain form
12848 154696 212369 195577 210026 184533 120912 131241 195597 192156 147459 166098 146963 130719
12836 130719 67028 64806 100477 189104 240220 125555 141734 166329 84563 17239 -32293
12825 -32293 -72523 -132005 -74863 -12350 24580 -4290 -35234 1052 -52725 -40655 -38729 -76384
12813 -76384 -20111 -20302 -34141 4970 -8098 -102559 -169868 -129132 -79183 -50835 -11649 43176
12801 43176 35539 32128 -13648 -23223 -7331 -5731 -53069 -44529 -7150 -6304 -41437 22839 144928
12788 144928 169921 157944 222754 198709 211825 184755 105643 111908 100126 34758 60704 142706
12776 142706 182827 160129 119296 181700 186947 144728 110075 105132 146136 213324 142141 59242
12764 59242 89155 92621 75669 68945 115261 127894 89678 140824 146331 20169 -33028 11977
$$ packed form
12848A54696N7673j6792J4449k5493o3621J0329O4356l441m4697J8639j9135j6244
12836A30719o3691k222L5671Q8627N1116j14665J6179K4595q1766o7324m9532
12825c2293m0230n9482N7142O2513L6930k8870l0944L6286n3777J2070J926l7655
12813g6384N6273j91j3839L9111j3068r4461o7309M0736M9949K8348L9186N4825
12801D3176p637l411m5776r575J5892J600m7338Q540L7379Q46l5133O4276J22089
12788A44928K4993j1977O4810k4045J3116k7070p9112O265j1782o5368K5946Q2002
12776A42706M0121k2698m0833O2404N247m2219l4653m943M1004O7188p1183q2899
12764E9242K9913L466j6952o724M6316J2633l8216N1146N507j26162n3197M5005
$$ plain form
12752 11977 -3163 66235 199286 304657 217806 95119 85251 103543 101683 128484 139674
12741 139674 103375 65744 110426 93688 64030 87636 146633 163642 135261 121762 96905
12730 96905 151539 102318 81335 65129 1993 -2753 32769 53675 153638 213128 194656 141293
12718 141293 66298 116820 146773 193125 211526 218731 209494 143078 141999 131276 135710 186614
12706 186614 164395 235665 222962 200510 259917 213906 167973 177640 243965 235844 224539 227377
12694 227377 244944 199330 168826 250897 250991 240484 224781 178343 221985 153879 84576 102925
12682 102925 110698 77870 131164 194772 172777 143504 137563 168319 153917 113216 139862 60747
12670 60747 9233 44780 67423 138140 72769 -28789 -102634 -122188 -42378 39739 103524
$$ packed form
12752A1977j5140O9398J33051J05371q6851j22687r868J8292j860K6801J1190
12741A39674l6299l7631M4682j6738k9658K3606N8997J7009k8381j3499k4857
12730I6905N4634m9221k0983j6206o3136m746L5522K0906R9963N9490j8472n3363
12718A41293p4995N0522K9953M6352J8401P205r237o6416j079j0723M434N0904
12706A86614k2219P1270j2703k2452N9407m6011m5933R667O6325q121j1305K838
12694B27377J7567m5614l0504Q2071R4j0507j5703m6438M3642o8106o9303J8349
12682A02925P773l2828N3294O3608k1995k9273n941L0756j4402m0701K6646p9115
12670F0747n1514L5547K2643P0717o5371j01558p3845j9554P9810Q2117O3785
$$ plain form
12659 103524 136057 126970 108049 153086 145490 47703 18731 91435 69361 118992 226848 263681
12647 263681 257036 309655 337912 336127 335972 324775 273743 226835 241308 383434 438546 484592
12635 484592 518208 540947 541578 481673 437264 395064 418965 495225 460225 439364 362422 327662
12623 327662 292387 347336 471561 540756 531652 401646 489470 633962 545783 586279 654735
12612 654735 650937 691716 667398 702714 776789 799621 827885 797081 803563 863970 889593 866623
12600 866623 843298 819983 815439 730399 714563 814420 818163 744898 740767 731813 690473 658905
12588 658905 630664 566007 513645 545773 599829 669808 619885 530998 467325 528432 666884
12577 666884 708443 731376 630702 548110 540999 621558 595500 523164 459714 477306 508228
$$ packed form
12659A03524L2533r087j8921M5037p596r7787k8972P2704k2074M9631J07856L6833
12647B63681o645N2619K8257j785j55j1197n1032m6908J4473J42126N5112M6046
12635D84592L3616K2739O31n9905m4409m2200K3901P6260l5000k0861p6942l4760
12623C27662l5275N4949J24225O9195r104j30006Q7824J44492q8179M0496O8456
12612F54735l798M0779k4318L5316P4075K2832K8264l0804O482O0407K5623k2970
12600H66623k3325k3315m544q5040j5836R9857L743p3265m131q954m1340l1568
12588F58905k8241o4657n2362L2128N4056O9979m9923q8887o3673O1107J38452
12577F66884M1559K2933j00674q2592p111Q0559k6058p2336o3450J7592L0922
$$ plain form
12566 508228 571579 614196 488530 554820 565245 543182 594537 578424 573917 582676 599080 720624
12554 720624 830500 773093 752713 643531 681066 669478 687846 664206 762872 841686 871698
12543 871698 826315 826819 830187 786380 763156 834863 915887 1033849 1057228 1068006 1077713 1100384
12531 1100384 1122949 1213125 1289603 1266825 1171049 1149545 1165992 1240099 1299286 1353301 1372975
12520 1372975 1386607 1476477 1487180 1491208 1540738 1525998 1512848 1611482 1766920 1973247 2150236
12509 2150236 2258150 2181986 2264498 2348014 2340014 2371934 2287851 2193323 2070834 1948928 1835035
12498 1835035 1705084 1665764 1655463 1684689 1719056 1713731 1650387 1642757 1736278 1760104 1780459
12487 1780459 1776007 1808711 1850007 1877981 1939933 1979355 2077859 2157154 2306156 2416396 2483592
$$ packed form
12566E08228O3351M2617j25666O6290J0425k2063N1355j6113m507Q759J6404J21544
12554G20624J09876n7407k0380j09182L7535j1588J8368k3640R8666P8814L0012
12543H71698m5383N04L368m3807k3224P1707Q1024J17962K3379J0778R707K2671
12531A100384K2565R0176P6478k2778r5776k1504J6447P4107N9187N4015J9674
12520A372975J3632Q9870J0703M028M9530j4740j3150R8634J55438K06327J76989
12509B150236J07914p6164Q2512Q3516q000L1920q4083r4528j22489j21906j13893
12498A835035j29951l9320j0301K9226L4367n325o3344p630R3521K3826K0355
12487A780459m452L2704M1296K7974O1952L9422R8504P9295J49002J10240O7196
$$ plain form
12476 2483592 2545365 2589302 2620232 2628961 2533763 2373572 2250891 2247886 2261399 2251945 2138261
12465 2138261 2180300 2188475 2194486 2183376 2193084 2274622 2153372 2163863 2218954 2360544 2489982
12454 2489982 2498650 2571366 2586051 2581375 2518657 2504571 2564631 2664022 2813245 2957937 3006135
12443 3006135 3076546 3123253 3157619 3252415 3250881 3297667 3377104 3424170 3473217 3629923 3761938
12432 3761938 3908724 3948764 3882852 3980397 4120568 4331540 4518066 4656971 4802543 4941260
12422 4941260 5052591 5206993 5315879 5436595 5565084 5746503 5955848 6166265 6366730
12413 6366730 6580297 6738939 6921876 7194589 7458863 7700621 7943368 8210840 8494274
12404 8494274 8766067 9094073 9480351 9894625 10311429 10712967 11100090 11585239 12143928
$$ packed form
12476B483592O1773M3937L0930Q729r5198j60191j22681l005J3513r454j13684
12465B138261M2039Q175O011j1110R708Q1538j21250J0491N5091J41590J29438
12454B489982Q668P2716J4685m676o2718j4086O0060R9391J49223J44692M8198
12443C006135P0411M6707L4366R4796j534M6786P9437M7066M9047J56706J32015
12432C761938J46786M0040o5912R7545J40171K10972J86526J38905J45572J38717
12422D941260J11331J54402J08886J20716J28489J81419K09345K10417K00465
12413F366730K13567J58642J82937K72713K64274K41758K42747K67472K83434
12404H494274K71793L28006L86278M14274M16804M01538L87123M85149N58689
$$ plain form
12395 12143928 12638165 13121921 13714115 14482050 15163206 15826590 16648438 17430098 18238423
12386 18238423 19335728 20510903 21710534 22993836 24316463 25770636 27436627 29193109
12378 29193109 31070273 33213073 35590100 38251726 41076326 44249412 47774691 51655792
12370 51655792 56080244 61115185 66749151 73141602 80518215 88794638 98345141 109270192
12362 109270192 121839927 136433817 153355907 172913996 195619169 221920906 252146631
12355 252146631 286333944 324290451 364849858 406177134 445495853 478919201 502437824
12348 502437824 512830691 508784282 490982253 462081955 425857214 386097743 346144996
12341 346144996 308272233 273764267 243043449 216070909 192501851 172089395 154386569
$$ packed form
12395A2143928M94237M83756N92194P67935O81156O63384Q21848P81660Q08325
12386A8238423J097305J175175J199631J283302J322627J454173J665991J756482
12378B9193109J877164K142800K377027K661626K824600L173086L525279L881101
12370E1655792M424452N034941N633966O392451P376613Q276423R550503J0925051
12362A09270192J2569735J4593890J6922090J9558089K2705173K6301737L0225725
12355B52146631L4187313L7956507M0559407M1327276L9318719L3423348K3518623
12348E02437824J0392867m046409j7802029k8900298l6224741l9759471l9952747
12341C46144996l7872763l4507966l0720818k6972540k3569058k0412456j7702826
$$ plain form
12334 154386569 139067380 125762969 114184221 104094597 95256667 87512005 80652732
12327 80652732 74580796 69152046 64288643 59845060 55891979 52344201 48979964 45900779
12319 45900779 43126488 40565748 38288674 36145818 34253929 32496534 30808976 29256321
12311 29256321 27861200 26579691 25333338 24162735 23154033 22177824 21147960 20291208
12303 20291208 19450479 18610847 17888150 17150700 16464793 15820274 15267697 14783865 14278768
12294 14278768 13760474 13254300 12734519 12274202 11858439 11439329 11061501 10745297 10277712
12285 10277712 9845460 9600039 9360019 9041012 8709417 8480524 8325323 8130062 7873258
12276 7873258 7610483 7316031 7055725 6950110 6799041 6597702 6409887 6278542 6103009
$$ packed form
12334A54386569j5319189j3304411j1578748j0089624q837930p744662o859273
12327H0652732o071936n428750m863403m443583l953081l547778l364237l079185
12319D5900779k774291k560740k277074k142856j891889j757395j687558j552655
12311B9256321j395121j281509j246353j170603j008702r76209j029864q56752
12303B0291208q40729q39632p22697p37450o85907o44519n52577m83832n05097
12294A4278768n18294n06174n19781m60317m15763m19110l77828l16204m67585
12285A0277712m32252k45421k40020l19007l31595k28893j55201j95261k56804
12276G873258k62775k94452k60306j05615j51069k01339j87815j31345j75533
$$ plain form
12267 6103009 5984710 5817934 5640816 5450275 5313474 5241692 5076201 4858493 4743404 4710154
12257 4710154 4726946 4538135 4412890 4270695 4174594 4041779 3960774 3940745 3897556 3954790
12247 3954790 3843740 3838097 3922917 3852423 3671211 3475918 3359040 3347239 3381623 3297443 3276332
12236 3276332 3308268 3286345 3234526 3155069 2989887 2889070 2870864 2779257 2634517 2530515
12226 2530515 2323489 2120672 1969479 1848785 1685219 1617890 1545975 1512597 1563186 1599148
12216 1599148 1506864 1400160 1399887 1370342 1424717 1572374 1651233 1690662 1635649 1554075 1520105
12205 1520105 1357596 1343002 1349294 1333438 1342084 1268282 1228830 1187131 1125771 992682 848821
12194 848821 759737 572245 340762 242974 232083 223670 247459 370008 410031 509493 561857
$$ packed form
12267F103009j18299j66776j77118j90541j36801p1782j65491k17708j15089l3250
12257D710154J6792j88811j25245j42195r6101j32815q1005k0029m3189N7234
12247C954790j11050n643Q4820p0494j81212j95293j16878j1801L4384q4180k1111
12236C276332L1936k1923n1819p9457j65182j00817j8206r1607j44740j04002
12226B530515k07026k02817j51193j20694j63566o7329p1915l3378N0589L5962
12216A599148r2284j06704k73k9545N4375J47657P8859L9429n5013q1574l3970
12205A520105j62509j4594O292j5856Q646p3802l9452m1699o1360j33089j43861
12194H48821q9084j87492k31483r7788j0891q413K3789J22549M0023R9462N2364
$$ plain form
12183 561857 667616 787359 844765 796500 834099 850545 765600 693112 631166 710329 780838
12172 780838 800693 747257 741784 720100 731824 692335 754965 790103 800499 801881 862252 983333
12160 983333 983588 934158 944302 989499 1004572 979085 910954 852979 934055 986686 926309 916644
12148 916644 950440 864377 834378 905320 931443 851903 769918 794812 823276 830257 809890 851953
12136 851953 841720 684190 570674 586061 744586 750040 736908 777140 842803 842278 827970
12125 827970 870363 888284 844375 838437 819615 784940 766672 748160 652114 585407 688989
12114 688989 744064 766823 728752 611267 654294 688188 718179 657093 609586 578619 611723
12103 611723 648381 604379 624589 642506 663476 728317 673459 512612 454517 488778 445465
$$ packed form
12183E61857J05759J19743N7406m8265L7599J6446q4945p2488o1946P9163P0509
12172G80838J9855n3436n473k1684J1724l9489O2630L5138J0396J382O0371J21081
12160I83333K55m9430J0144M5197J5073k5487o8131n7975Q1076N2631o0377r665
12148I16644L3796q6063k9999P0942K6123p9540q1985K4894K8464O981k0367M2063
12136H51953j0233j57530j13516J5387J58525N454j3132M0232O5663n25j4308
12125H27970M2393J7921m3909n938j8822l4675j8268j8512r6046o6707J03582
12114F88989N5075K2759l8071j17485M3027L3894K9991o1086m7507l0967L3104
12103F11723L6658m4002K0210J7917K0970O4841n4858j60847n8095L4261m3313
$$ plain form
12092 445465 436363 527048 609830 561845 581268 585458 610306 588940 583569 526223 476367 529704
12080 529704 528844 498464 435771 463604 497145 563156 540028 469694 369355 328986 472508
12069 472508 562501 503802 420219 365503 389899 437567 511269 557069 544807 496250 492437 411149
12057 411149 407986 429781 354414 349757 387063 290063 321914 405372 476393 486608 539235 575278
12045 575278 572301 558344 525534 560738 596171 637067 631922 654208 681832 681063 689798 755127
12033 755127 755373 771187 722512 649805 598071 604476 554111 617507 637299 549951 481883 447639
12021 447639 432192 418989 465703 552302 692095 617589 551416 575247 566630 605973 664886
12010 664886 571669 461760 332280 360594 383738 393207 397117 303280 299470 396441 373476 352491
$$ packed form
12092D45465r102R0685Q2782m7985J9423M190K4848k1366n371n7346m9856N3337
12080E29704q60l0380o2693K7833L3541O6011k3128p0334j00339m0369J43522
12069D72508Q9993n8699q3583n4716K4396M7668P3702M5800j2262m8557l813q1288
12057D11149l163K1795p5367m657L7306r7000L1851Q3458P1021J0215N2627L6043
12045E75278k977j3957l2810L5204L5433M0896n145K2286K7624p69Q735O5329
12033G55127K46J5814m8675p2707n1734O405n0365O3396J9792q7348o8068l4244
12021D47639j5447j3203M6714Q6599J39793p4506o6173K3831q617L9343N8913
12010F64886r3217j09909j29480K8314K3144R469L910r3837l810R6971k2965k0985
$$ plain form
11998 352491 360685 340198 315979 345318 302762 253365 298985 290419 271592 321481 359408 373160
11986 373160 341564 405511 471421 410345 380831 435403 429863 406395 319909 376906 442888 585765
11974 585765 708182 839128 848962 901756 937187 777701 569511 468562 428559 448642 459003
11963 459003 472473 478779 410486 413610 366789 356093 381595 392680 373435 295589 234900 270868
11951 270868 276744 264228 204817 222439 215407 243236 206960 171597 233953 310181 340929 396781
11939 396781 362046 377681 365687 332605 308638 342185 384432 475285 654687 801977 960611
11928 960611 1033866 964000 773158 644658 574463 498051 442147 263388 123944 97439 176962
11917 176962 166938 128192 164864 198971 252429 312816 253930 270305 260811 199546 228242 142839
$$ packed form
11998C52491Q194k0487k4219K9339m2556m9397M5620q566j8827M9889L7927J3752
11986C73160l1596O3947O5910o1076k9514N4572n540k3468q6486N6997O5982J42877
11974E85765J22417J30946R834N2794L5431j59486k08190j00949m0003K0083J0361
11963D59003J3470O306o8293L124m6821j0696K5502J1085j9245p7846o0689L5968
11951B70868N876j2516n9411J7622p032K7829l6276l5363O2356P6228L0748N5852
11939C96781l4735J5635j1994l3082k3967L3547M2247R0853J79402J47290J58634
11928I60611P3255o9866j90842j28500p0195p6412n5904j78759j39444k6505P9523
11917A76962j0024l8746L6672L4107N3458O0387n8886J6375r494o1265K8696q5403
$$ plain form
11905 142839 140345 230919 228364 233061 242081 206832 140484 145312 128574 122722 127374 112219 158955
11892 158955 255029 274835 257290 269642 229135 319965 387733 442654 426439 479430 532532
11881 532532 410686 277885 259432 359546 386263 294296 212388 188402 163534 268666 346011
11870 346011 360201 272730 203258 166958 152278 112196 106336 113405 133318 206484 135513 13973
11858 13973 38373 115285 67291 83292 88974 -5704 -15518 66009 115973 45698 130894 104867
11846 104867 80566 134754 128134 89073 138986 137393 50734 -6162 -9768 48945 59831 125091
11834 125091 123759 106770 31065 41343 129598 129794 61605 70126 149819 104585 48533 20334
11822 20334 67701 46863 -32868 42584 52178 8882 -113459 -46048 93537 116303 76878
$$ packed form
11905A42839k494R0574k555M697R020l5249o6348M828j6738n852M652j5155M6736
11892A58955R6074J9806j7545J2352m0507R0830O7768N4921j6215N2991N3102
11881E32532j21846j32801j8453J00114K6717r1967q1908k3986k4868J05132P7345
11870C46011J4190q7471o9472l6300j4680m0082n860P069J9913P3166p0971j21540
11858A3973K4400P6912m7994J6001N682r4678r814Q1527M9964p0275Q5196k6027
11846A04867k4301N4188o620l9061M9913j593q6659n6896l606N8713J0886O5260
11834A25091j332j6989p5705J0278Q8255J96o8189Q521P9693m5234n6052k8199
11822B0334M7367k0838p9731P5452R594m3296j22341O7411J39585K2766l9425
$$ plain form
11811 76878 49442 42026 6587 72878 27620 -7658 41481 70925 47119 26625 67033 70843
11799 70843 47378 54638 100262 108815 124692 150033 224650 221958 73613 117653 224385 142370
11787 142370 95794 127024 152473 121559 82044 180906 189678 168678 126915 149209 143273 76815
11775 76815 45264 -14957 18458 88702 141406 129295 80370 60464 96948 138687 130951 127076
11763 127076 86153 118068 179541 106932 24218 39292 21711 23522 35370 64805 107095 40112
11751 40112 39397 88743 137899 234384 219871 190976 92638 168265 278311 224621 207783 248053
11739 248053 134652 40192 9707 7215 20776 -46247 -62106 -20512 39399 20704 19266 52611
11727 52611 83398 101966 96113 37412 -111180 7824 124129 165270 208723 162715 100645
$$ packed form
11811G6878k7436p416l5439O6291m5258l5278M9139K9444k3806k0494M0408L810
11799G0843k3465P260M5624Q553J5877K5341P4617k692j48345M4040J06732q2015
11787A42370m6576L1230K5449l0914l9515R8862Q772k1000m1763K2294n936o6458
11775G6815l1551o0221L3415P0244N2704j2111m8925j9906L6484M1739p736l875
11763A27076m0923L1915O1473p2609q2714J5074j7581J811J1848K9435M2290o6983
11751D0112p15M9346M9156R6485j4513k8895r8338P5627J10046n3690j6838M0270
11739B48053j13401r4460l0485k492J3561o7023j5859M1594N9911j8695j438L3345
11727E2611L0787J8568n853n8701j48592J19004J16305M1141M3453m6008o2070
$$ plain form
11716 100645 64340 41705 23495 -14695 3997 44919 -42253 10583 43951 47674 63067 66564
11704 66564 89863 58629 60206 7782 -21084 47866 85053 133674 161298 151875 135416 -2623
11692 -2623 -33891 -22748 -5386 -21847 -45531 -112701 -48733 34304 43899 3707 69627 -48453
11680 -48453 -102844 -52337 65234 86985 85492 74548 98051 37084 51845 103977 12680 87988
11668 87988 173412 163402 190939 143209 55763 29263 50888 92779 99546 24817 78551 64929
11656 64929 -14525 -25103 -31965 14200 19668 75868 130512 166073 166320 149133 123683 105355
11644 105355 9888 -78773 8081 2715 -48142 -30435 45884 3063 6929 -77458 -128842 -107406
11632 -107406 -69966 -59098 31689 31014 66219 84721 24036 3363 35970 100122 160767 148142
$$ packed form
11716A00645l6305k2635j8210l8190J8692M0922q7172N2836L3368L723J5393L497
11704F6564K3299l1234J577n2424k8866O8950L7187M8621K7624r423j6459j38039
11692b623l1268J1143J7362j6461k3684o7170O3968Q3037R595m0192O5920j18080
11680d8453n4391N0507J17571K1751j493j0944K3503o0967J4761N2132r1297P5308
11668H7988Q5424j0010K7537m7730q7446k6500K1625M1891O767p4729N3734j3622
11656F4929p9454j0578o862M6165N468N6200N4644L5561K47j7187k5450j8328
11644A05355r5467q8661Q6854n366n0857J7707P6319m2821L866q4387n1384K1436
11632a07406L7440J0868R0787o75L5205J8502o0685k0673L2607O4152O0645j2625
$$ plain form
11620 148142 50818 47977 18695 48437 2160 9617 93124 109725 177631 202484 78471 7945
11608 7945 -31416 -26577 17780 -85535 -121381 36236 73212 -14148 63105 106567 19581 6277
11596 6277 95748 116415 49553 14570 21285 57211 5686 11321 12904 -57184 -56179 -120071 -167998
11583 -167998 -149761 -95528 14280 65933 75267 62228 16815 -74128 -78731 -31776 -64310 -56974
11571 -56974 -7057 103412 67370 34293 38131 55350 68393 51516 36322 26336 55396 134539
11559 134539 30306 -37231 38570 41494 62091 -1906 -2152 9665 5449 -3456 15917 7739
11547 7739 -50104 -22883 71604 141810 181024 171342 121114 4223 -65080 28630 97404 136174
11535 136174 181313 148455 145919 174670 209866 192212 149691 76419 -45878 14692 119888
$$ packed form
11620A48142r7324k841k9282K9742m6277P457Q3507J6601O7906K4853j24013p0526
11608G945l9361M839M4357j03315l5846J57617L6976q7360P7253M3462q6986j3304
11596F277Q9471K0667o6862l4983O715L5926n1525N635J583p0088J005o3892m7927
11583a67998J8237N4233J09808N1653R334j3039m5413r0943m603M6955l2534P336
11571e6974M9917J10469l6042l3077L838J7219J3043j6877j5194r986K9060P9143
11559A34539j04233o7537P5801K924K0597o3997k46J1817m216q905J9373q178
11547G739n7843K7221R4487P0206L9214r682n0228j16891o9303R3710O8774L8770
11535A36174M5139l2858k536K8751L5196j7654m2521p3272j22297O0570J05196
$$ plain form
11524 119888 67408 1636 -27847 -14877 5240 60935 101370 88838 93279 51705 -48296
11513 -48296 -115962 -101925 -127592 -87864 -40146 -40093 -70565 731 13407 -74852 -60841 14920
11501 14920 79787 68146 33842 -51784 -54000 891 45509 56385 34311 -41616 15804 29917
11489 29917 -1396 39257 89719 89328 -33449 -54643 17716 34782 63240 73580 70733 88820
11477 88820 158869 171848 200575 186872 150694 179639 186470 204752 151141 130207 168391 244267
11465 244267 299045 219818 108321 70353 104089 79210 23298 49398 39650 29057 46837
11454 46837 11540 -28627 -78547 -121337 -80708 -9758 42027 57926 24702 -81709 -63434
11443 -63434 74003 29573 -6679 23435 -898 30246 93386 46410 -60149 -109673 -66020
$$ packed form
11524A19888n2480o5772k9483J2970K0117N5695M0435j2532M441m1574j00001
11513d8296o7666J4037k5667L9728M7718N3l0472P1296J2676q8259J4011P5761
11501A4920O4867j1641l4304q5626k216N4891M4618J0876k2074p5927N7420J4113
11489B9917l1313M0653N0462l91j22777k1194P2359J7066K8458J0340k847J8087
11477H8820P0049J2979K8727j3703l6178K8945O831J8282n3611k0934L8184P5876
11465B44267N4778p9227j11497l7968L3736k4879n5912K6100r748j0593J7780
11454D6837l5297m0167m9920m2790M0629P0950N1785J5899l3224j06411J8275
11443f3434J37437m4430l6252L0114k4333L1144O3140m6976j06559m9524M3653
$$ plain form
11432 -66020 84776 175599 148806 58703 -43912 -84008 -108350 -139051 -194917 -84692 13883
11421 13883 21729 5463 -26198 -45910 -30891 -25755 42161 59625 -5402 7804 119639 91996
11409 91996 27480 48221 64312 52629 51856 -3101 -19846 -22906 -17638 213 -21493 7031
11397 7031 33967 -42205 -39759 38147 45798 8357 -25126 -51540 -51083 -29968 -23947 54567 69571
11384 69571 64255 119501 64402 42279 118755 107647 -15037 -29304 47097 92085 168482 184798
11372 184798 190716 109896 38642 69996 122685 94991 87152 42865 -23263 -43946 -65108 -47045
11360 -47045 -51653 -90066 -62387 -43275 -93742 -61302 2593 29300 -4102 -115607 -53255 61294
11348 61294 59486 114070 123584 39596 1609 53186 -52686 -128221 -99125 -51020 -3104 65214
$$ packed form
11432f6020J50796R0823k6793r0103j02615m0096k4342l0701n5866J10225R8575
11421A3883P846j6266l1661j9712J5019N136O7916J7464o5027J3206J11835k7643
11409I1996o4516K0741J6091j1683p73n4957j6745l060N268J7851k1706K8524
11397G031K6936p6172K446P7906P651l7441l3483k6414M57K1115O021P8514J5004
11384F9571n316N5246n5099k2123P6476j1108j22684j4267P6401M4988P6397J6316
11372A84798N918q0820p1254L1354N2689k7694p839m4287o6128k0683k1162J8063
11360d7045m608l8413K7679J9112n0467L2440O3895K6707l3402j11505O2352J14549
11348F1294j808N4584R514q3988l7987N1577j05872p5535K9096M8105M7916O8318
$$ plain form
11336 65214 96085 48145 42610 54155 82428 129994 61229 -63416 -144903 -150547 -73228 -79194
11324 -79194 -67725 -46098 -26803 6043 -6202 -26741 12693 -28780 -86417 -73384 -69280 61711
11312 61711 130086 134035 132449 91222 79388 110567 90197 94921 55661 86658 118467 115262
11300 115262 113641 116668 102176 150637 229123 210443 111904 58156 673 -36681 -47390 33505
11288 33505 98440 70015 50070 85374 117736 47447 -11755 65629 72146 50362 90764 54597
11276 54597 -9441 109907 114145 34750 65068 71744 107336 73737 7707 111607 145654 115275
11264 115275 72051 117768 93670 108273 40362 6610 5095 13064 5919 58277 29085 18600
11252 18600 -20003 -38583 100977 58470 -44764 16857 30262 -40934 12533 50833 150763
$$ packed form
11336F5214L0871m7940n535J1545K8273M7566o8765j24645q1487n644P7319n966
11324g9194J1469K1627J9295L2846j2245k0539L9434m1473n7637J3033M104J30991
11312F1711O8375L949j586m1227j1834L1179k0370M724l9260L0997L1809l205
11300A15262j621L027j4492M8461P8486j8680r8539n3748n7483l7354j0709Q0895
11288C3505O4935k8425j9945L5304L2362p0289n9202P7384O517k1784M0402l6167
11276E4597o4038J19348M238p9395L0318O676L5592l3599o6030J03900L4047l0379
11264A15275m3224M5717k4098J4603o7911l3752j515P969p145N2358k9192j0485
11252A8600l8603j8580J39560m2507j03234O1621J3405p1196N3467L8300R9930
$$ plain form
11241 150763 183347 100122 84180 26479 28418 -17613 -21959 -48041 -53841 -16600 56886 91769
11229 91769 -19869 17854 87921 2503 12450 4987 5917 78881 125448 79231 16453 -9572
11217 -9572 -23683 -61627 -53113 19373 25549 116607 191846 167318 59829 5897 60187 131380
11205 131380 92533 26274 50168 125389 44219 -4702 -25295 29529 53664 28977 10780
11194 10780 33459 101765 85302 -75 6204 -8073 -4366 70083 78134 67207 151029 131519
11182 131519 153902 129786 132206 111379 119878 -8094 -58078 -28791 -85238 -52870 12033 26052
11170 26052 -29276 -7542 62537 66036 -31802 -55519 -74534 -3452 -6231 -17716 -63958 -62661
11158 -62661 -12507 -27479 -64128 -109028 -163386 -71263 55932 21025 -35791 -65150 -114198
$$ packed form
11241A50763L2584q3225j5942n7701J939m6031m346k6082n800L7241P3486L4883
11229I1769j11638L7723P0067q5418R947p463R30P2964M6567m6217o2778k6025
11217i572j4111l7944Q514P2486O176R1058P5239k4528j07489n3932N4290P1193
11205A31380l8847o6259K3894P5221q1170m8921k0593N4824K4135k4687j8197
11194A0780K2679O8306j6463q5377O279j4277L707P4449Q051j0927Q3822j9510
11182A31519K2383k4116K420k0827Q499j27972m9984K9287n6447L2368O4903J4019
11170B6052n5328K1734P0079L499r7838k3717j9015P1082k779j1485m6242J297
11158f2661N0154j4972l6649m4900n4358R2123J27195l4907n6816k9359m9048
$$ plain form
11147 -114198 -93295 -6590 8897 -1343 -17613 -75898 -132487 -187074 -197605 -147392 -74354
11136 -74354 -27760 27506 63206 110216 74123 3747 5137 38909 114290 109910 59218 38199
11124 38199 63384 50163 17357 46018 121827 142389 166981 169861 94133 -3140 32744 14395
11112 14395 -109231 -103339 -177141 -187736 -71160 -5357 43692 124957 299421 329085 298441
11101 298441 249205 202998 207996 101087 149661 234367 286714 222154 70900 -28596 -125471
11090 -125471 -144650 -120103 -23260 30805 -46703 -48344 -22112 23538 57824 154572 201456 123608
11078 123608 19147 29239 18570 75170 36726 8564 -82867 -85061 -100936 -108296 -120841 -53544
11066 -53544 29869 9430 -74277 -126321 -136899 -81181 -79814 -44640 -91405 -80990 -16960 43106
$$ packed form
11147a14198K0903Q6705J5487j0240j6270n8285n6589n4587j0531N0213P3038
11136g4354M6594N5266L5700M7010l6093p0376J390L3772P5381m380n0692k1019
11124C8199K5185j3221l2806K8661P5809K0562K4592K880p5728r7273L5884j8349
11112A4395j23626N892p3802j0595J16576O5803M9049Q1265J74464K9664l0644
11101B98441m9236m6207M998j06909M8574Q4706N2347o4560j51254r9496r6875
11090a25471j9179K4547R6843N4065p7508j641K6232M5650L4286R6748M6884p7848
11078A23608j04461J0092j0669N6600l8444k8162r1431k194j5875p360j2545O7297
11066e3544Q3413k0439q3707n2044j0578N5718J367L5174m6765J0415O4030O0066
$$ plain form
11054 43106 57294 164717 235423 170305 132685 151039 135906 174042 260331 315789 268631
11043 268631 356707 382892 273375 286061 375646 435670 532696 638145 659399 716189 782950
11032 782950 802751 739796 753735 757650 781191 873317 1028722 1097213 1128110 1173495 1106733
11021 1106733 901650 796779 752847 591291 486517 440702 560123 690729 791135 850605
11011 850605 748553 695728 709629 560873 384930 313842 276772 314593 321411 383518 400142
11000 400142 362455 304028 317392 308686 262425 249956 274682 256014 180365 149889 102782 73831
10988 73831 117477 104270 30490 84611 101580 13141 82951 150407 179387 118404 89680 38633
10976 38633 3639 43739 61021 19231 -6734 48493 73240 -15702 -49833 27759 53727 6483
$$ packed form
11054D3106J4188J07423P0706o5118l7620J8354j5133L8136Q6289N5458m7158
11043B68631Q8076K6185j09517J2686Q9585O0024R7026J05449K1254N6790O6761
11032G82950J9801o2955J3939L915K3541R2126J55405O8491L0897M5385o6762
11021A106733k05083j04871m3932j61556j04774m5815J19421J30606J00406N9470
11011H50605j02052n2825J3901j48756j75943p1088l7070L7821O818O2107J6624
11000D00142l7687n8427J3364q706m6261j2469K4726j8668p5649l0476m7107k8951
10988G3831M3646j3207p3780N4121J6969q8439O9810O7456K8980o0983k8724n1047
10976C8633l4994M0100J7282m1790k5965N5227K4747q8942l4131P7592K5968m7244
$$ plain form
10964 6483 83742 233007 197634 126535 39612 45209 76282 99789 151875 81565 15936 -39414
10952 -39414 -10276 -22431 -69297 -9290 50261 30399 52686 81957 25079 813 7450 32206
10940 32206 70055 66151 33289 -57434 -96225 -138840 -87444 21047 18037 -50036 -54274 -100477
10928 -100477 -95609 -2175 21761 -2318 36499 17941 -23982 -36845 -57692 35896 28070 -86933
10916 -86933 -176134 -170020 -95631 -45822 -82611 -137001 -130899 -75232 -3236 -38094 -46861 -41627
10904 -41627 -76804 -67860 -73120 -67263 -80394 -77135 -136592 -212193 -84563 915 -11174 24417
10892 24417 35092 26434 -28436 -105241 -116448 -115203 -52612 -66934 -86988 -27359 196 21340
10880 21340 32425 -13803 43329 106726 83859 113398 -7435 -70766 -56354 -37047 57525
$$ packed form
10964F483P7259J49265l5373p1099q6923N597L1073K3507N2086p0310o5629n5350
10952c9414K9138j2155m6866O0007N9551j9862K2287K9271n6878k4266O637K4756
10940C2206L7849l904l2862r0723l8791m2615N1396J08491l010o8073m238m6203
10928a00477M868R3434K3936k4079L8817j8558m1923j2863k0847R3588p826j15003
10916h6933q9201O114P4389M9809l6789n4390O102N5667P1996l4858q767N234
10904d1627l5177Q944n260N857j3131L259n9457p5601J27630Q5478j2089L5591
10892B4417J0675q658n4870p6805j1207J245O2591j4322k0054N9629K7555K1144
10880B1340J1085m6228N7132O3397k2867K9539j20833o3331J4412J9307R4572
$$ plain form
10869 57525 127284 176544 208248 255579 208927 114560 109340 122772 93601 61245 113625 176953
10857 176953 141690 132352 117253 154040 198682 201314 204656 192767 135110 145079 98114 143460
10845 143460 161023 164133 98448 127514 71208 27463 144945 240631 276329 310945 324453
10834 324453 297801 231497 107844 99618 164426 159827 23108 739 133646 257019 294697
10823 294697 242255 165623 97419 158143 178586 159828 91641 86195 72352 122251 94718 47769
10811 47769 55779 50340 48316 28580 9900 20345 78282 119653 126234 50336 -87501 -130940
10799 -130940 -52479 29668 104089 103941 98654 83403 51971 87722 164608 176218 165105 39876
10787 39876 1283 48443 73350 136693 127875 132709 168397 235435 373274 410070 326540 290106
$$ packed form
10869E7525O9759M9260L1704M7331m6652r4367n220J3432k9171l2356N2380O3328
10857A76953l5263r338j5099L6787M4642K632L342j1889n7657R969m6965M5346
10845A43460J7563L110o5685K9066n6306m3745J17482R5686L5698L4616J3508
10834C24453k6652o6304j23653q226O4808m599j36719k2369J32907J23373L7678
10823B94697n2442p6632o8204O0724K0443j8758o8187n446j3843M9899k7533m6949
10811D7769Q010n439k024j9736j8680J0445N7937M1371O581p5898j37837m3439
10799a30940P8461Q2147P4421j48n287j5251l1432L5751P6886J1610j1113j25229
10787C9876l8593M7160K4907O3343q818M834L5688O7038J37839L6796q3530l6434
$$ plain form
10775 290106 373725 407720 377832 350702 302516 251940 235887 280313 274277 316275 350923 383909
10763 383909 388052 414340 527091 594788 627693 541418 482939 407970 379661 347180 353561 414133
10751 414133 465605 527788 547679 522665 450142 436303 404274 365995 329330 383228 388174 360485
10739 360485 395321 384714 448331 406597 486384 560904 563146 509119 415021 408303 407544 366613
10727 366613 352652 320518 285951 297406 285837 344571 454412 494533 498810 366220 227318
10716 227318 191300 167546 143595 140727 156033 219681 217812 209893 277542 226084 178175 231305
10704 231305 367680 306410 250711 209166 162152 145252 181392 169779 122663 132185 190738
10693 190738 187902 145311 90048 61755 51014 105423 76973 57216 157625 230904 255119
$$ packed form
10775B90106Q3619L3995k9888k7130m8186n0576j6053M4426o036M1998L4648L2986
10763C83909M143K6288J12751O7697L2905q6275n8479p4969k8309l2481O381O0572
10751D14133N1472O2183J9891k5014p2523j3839l2029l8279l6665N3898M946k7689
10739C60485L4836j0607O3617m1734P9787P4520K242n4027r4098o718p59m0931
10727C66613j3961l2134l4567J1455j1569N8734J09841M0121M277j32590j38902
10716B27318l6018k3754k3951k868J5306O3648j869p919O7649n1458m7909N3130
10704B31305J36375o1270n5699m1545m7014j6900L6140j1613m7116R522N8553
10693A90738k836m2591n5263k8293j0741N4409k8450j9757J00409P3279K4215
$$ plain form
10682 255119 188720 150110 127066 144839 211030 236602 219662 172787 242169 326231 335999 364794
10670 364794 370299 335173 336563 390430 478315 543473 513360 483603 495277 507641 603598 580265
10658 580265 683528 759542 817860 901906 959607 1166781 1427772 1603657 1757834 1931670
10648 1931670 1952260 1929432 1946595 1812214 1723461 1682260 1731924 1909962 2153409 2389804
10638 2389804 2614410 2954403 3466079 4013754 4655477 5340583 6039901 6564015 6951846
10629 6951846 7287682 7694127 8386161 9463460 10904721 12835336 15471761 18927614 23459245
10620 23459245 29179633 36091322 43867277 51250948 57256556 61008432 62355228 61950200
10612 61950200 61080996 61332741 63893718 69368596 78244135 90647573 105478118 119657754
$$ packed form
10682B55119o6399l8610k3044J7773O6191K5572j6940m6875O9382Q4062R768K8795
10670C64794N505l5126J390N3867Q7885O5158l0113k9757J1674J2364R5957k3333
10658E80265J03263P6014N8318Q4046N7701K07174K60991J75885J54177J73836
10648A931670K0590k2828J7163j34381q8753m1201M9664J78038K43447K36395
10638B389804K24606L39993N11676N47675O41723O85106O99318N24114L87831
10629F951846L35836M06445O92034J077299J441261J930615K636425L455853M531631
10620B3459245N720388O911689P775955P383671O005608L751876J346796m05028
10612F1950200q69204K51745K560977N474878Q875539J2403438J4830545J4179636
$$ plain form
10604 119657754 129954859 133980731 131561181 124427604 116259091 110723030 109713462 113978799
10596 113978799 123903939 139091276 157141169 173443768 182881587 182444551 172302282
10589 172302282 155650069 137879666 123623533 114747596 111488910 113417149 119553804
10582 119553804 127773477 134534001 136256481 131305974 120119693 105273217 90514658
10575 90514658 78631255 70496574 65852757 64055466 64265393 65174815 65413421 63666709
10567 63666709 59304498 52618991 44775321 36944311 30136250 24692392 20599534 17528108
10559 17528108 15149229 13277852 11747150 10478986 9559529 8671349 7954670 7354882 6781065
10550 6781065 6314844 5847945 5312859 4965186 4583859 4205994 3993277 3902384 3797376 3664502
$$ packed form
10604A19657754J0297105M025872k419550p133577q168513n536061j009568M265337
10596A13978799R925140J5187337J8049893J6302599R437819m37036j0142269
10589A72302282j6652213j7770403j4256133q875937l258686J928239O136655
10582A19553804Q219673O760524J722480m950507j1186281j4846476j4758559
10575I0514658j1883403q134681m643817j797291K09927R09422K38606j746712
10567F3666709m362211o685507p843670p831010o808061n443858m092858l071426
10559A7528108k378879j871377j530702j268164r19457q88180p16679n99788n73817
10550F781065m66221m66899n35086l47673l81327l77865k12717r0893j05008j32874
$$ plain form
10540 3664502 3476024 3233480 3083563 3015199 2875960 2688312 2577424 2442065 2256572 2138529
10530 2138529 2152094 2094529 1939654 1802422 1759106 1678637 1624382 1539958 1466656 1496575 1530509
10519 1530509 1421517 1251237 1170353 1093561 1030662 977102 1004164 1017916 1046693 952856 806731
10508 806731 793333 866539 774058 754289 800154 717474 717153 790516 786271 739289 765758 725238
10496 725238 664520 555212 473866 499952 551314 559815 597767 663368 590959 475393 366425
10485 366425 351996 348157 371804 376625 344448 378383 281025 226042 286021 429103 411730 332041
10473 332041 308701 370863 379712 380395 278257 180857 131370 105029 54138 47854 -82144 -124223
10461 -124223 -113460 -69083 -59240 -39963 106955 89178 33082 17912 -55384 -21076 -65592
$$ packed form
10540C664502j88478k42544j49917o8364j39239j87648j10888j35359j85493j18043
10530B138529J3565n7565j54875j37232m3316q0469n4255q4424p3302K9919L3934
10519A530509j08992j70280q0884p6792o2899n3560K7062J3752K8777r3837j46125
10508H06731j3398P3206r2481j9769M5865q2680l21P3363m245m6982K6469m0520
10496G25238o0718j09308q1346K6086N1362Q501L7952O5601p2409j15566j08968
10485C66425j4429l839K3647M821l2177L3935r7358n4983N9979J43082j7373p9689
10473C32041k3340O2162Q849O83j02138r7400m9487k6341n0891o284j29998m2079
10461a24223J0763M4377R843J9277J46918j7777n6096j5170p3296L4308m4516
$$ plain form
10450 -65592 -39231 -104400 -156856 -145233 -113722 -141439 -108690 -64445 -113208 -149375 -155950 -254034
10438 -254034 -308913 -334830 -350966 -429503 -408862 -280079 -305361 -295934 -207434 -232207 -265450
10427 -265450 -260175 -316070 -322251 -263938 -241678 -261040 -242022 -224255 -256775 -259295 -187970 -159390
10415 -159390 -163972 -169061 -249292 -242825 -171818 -172537 -71167 65620 105242 67478 47230 139334
10403 139334 178863 140531 175563 103472 16193 82741 68408 22778 93162 152622 150275 97369
10391 97369 78959 93970 59048 86704 104172 97717 79109 12266 -44948 23057 137361 116380
10379 116380 103167 109543 85911 34148 77401 147903 114679 50695 94975 176360 144224 57520
10367 57520 -49754 -80133 -17465 41156 75269 146528 141481 52569 79674 134202 142144 133554
$$ packed form
10450f5592K6361o5169n2456J1623L1511k7717L2749M4245m8763l6167o575r8084
10438b54034n4879k5917j6136p8537K0641J28783k5282R427Q8500k4773l3243
10427b65450N275n5895o181N8313K2260j9362J9018J7767l2520k520P1325K8580
10415a59390m582n089q0231O467P1007p19J01370J36787L9622l7764k0248R2104
10403A39334L9529l8332L5032p2091q7279O6548j4333m5630P0384N9460k347n2906
10391I7369j8410J5011l4922K7656J7468o455j8608o6843n7214O8005J14304k0981
10379A16380j3213O376k3632n1763M3253P0502l3224o3984M4280Q1385l2136q6704
10367E7520j07274l0379O2668N8621L4113P1259n047q8912K7105N4528P942q590
$$ plain form
10355 133554 120851 76103 -15698 4431 -12188 51743 127719 197088 171231 170049 167093 171174
10343 171174 196161 116209 94979 98858 102301 114584 41409 -42210 -9783 64285 70431 23290
10331 23290 117470 81119 118326 161303 107372 105329 50425 40547 83211 62218 -28927 -81847
10319 -81847 -26388 11869 -22536 90532 166067 182118 142816 61568 76820 144789 187133
10308 187133 141039 167599 239848 220556 217835 169187 48843 38043 33035 3416 57876 43607
10296 43607 38160 52784 154911 198083 116302 125130 112846 89606 173722 209420 174494 150613
10284 150613 132221 94386 131921 205843 217142 236759 147805 66885 86222 83858 125586 115658
10272 115658 204837 155340 80317 116848 176735 157876 128294 262496 251133 185356 174847
$$ packed form
10355A33554j2703m4748r1801K0129j6619O3931P5976O9369k5857j182k956M081
10343A71174K4987p9952k1230L879L443J2283p3175q3619L2427P4068O146m7141
10331B3290R4180l6351L7207M2977n3931k043n4904r878M2664k0993r1145n2920
10319h1847N5459L8257l4405J13068P5535J6051l9302q1248J5252O7969M2344
10308A87133m6094K6560P2249j9292k721m8648j20344j0800n008k9619N4460j4269
10296D3607n447J4624J02127M3172q1781Q828j2284k3240Q4116L5698l4926k3881
10284A50613j8392l7835L7535P3922J1299J9617q8954q0920J9337k364M1728r928
10272A15658Q9179m9497p5023L6531N9887j8859k9582J34202j1363o5777j0509
$$ plain form
10261 174847 90968 15605 81699 147897 35229 -29512 54354 26004 -52560 -20201 -14688
10250 -14688 -45185 -12256 -39747 -118043 -76880 23507 98488 67997 27928 -19275 -10052 -18183
10238 -18183 53601 128477 119285 65623 6168 32790 70747 43321 -79713 -67355 -25072 -5434
10226 -5434 -24467 2954 26057 -25652 -69871 -86201 -65902 -93004 -195414 -223402 -197511 -119013
10214 -119013 -59481 -31252 -96520 -78033 72773 88072 77536 134002 219594 223535 159322
10203 159322 91084 92734 103178 202580 107993 53575 17671 -6678 -6781 24250 33171 95934
10191 95934 137330 125656 177372 255669 174741 54405 50765 8915 -23723 -12424 123228
10180 123228 221356 243964 274902 288701 321830 271941 235756 157984 205231 304887 326382
$$ packed form
10261A74847q3879p5363O6094O6198j12668o4741Q3866k8350p8564L2359N513
10250a4688l0497L2929k7491p8296M1163J00387P4981l0491m0069m7203R223q131
10238a8183P1784P4876r192n3662n9455K6622L7957k7426j23034J2358M2283J9638
10226e434j9033K7421K3103n1709m4219j6330K0299k7102j02410k7988K5891P8498
10214a19013N9532K8229o5268J8487J50806J5299j0536N6466Q5592L941o4213
10203A59322o8238J650J0444R9402r4587n4418l5904k4349j03L1031Q921O2763
10191I5934M1396j1674N1716P8297q0928j20336l640m1850l2638J1299J35652
10180A23228R8128K2608L0938J3799L3129m9889l6185p7772M7247R9656K1495
$$ plain form
10169 326382 394876 526873 643174 786828 776842 725879 702182 673177 697466 685636 617725
10158 617725 717779 876165 970860 968064 988472 1057494 1012473 880502 888638 844735 730739
10147 730739 738680 869182 868053 888044 866372 712612 633206 594976 596840 504338 442794 336194
10135 336194 339655 353425 371775 412874 320209 184007 182499 260455 213959 216495 179547 154426
10123 154426 106645 49635 168856 268155 227162 151968 214469 252563 192586 186553 133981
10112 133981 113511 70841 38187 10134 -41903 -69928 -13468 9058 69556 128585 27963
10101 27963 -90511 -59997 2776 -29060 -108440 -156414 -95787 -79208 -47236 17917 104733
10090 104733 178605 176645 111488 77749 80725 97684 80605 72949 1726 -17121 -57121 -109000
$$ packed form
10169C26382O8494J31997J16301J43654r986n0963k3697k9005K4289j1830o7911
10158F17725J00054J58386R4695k796K0408O9022m5021j31971Q136m3903j13996
10147G30739P941J30502j129J9991k1672j53760p9406l8230J864r2502o1544j06600
10135C36194L461J3770J8350M1099r2665j36202j508P7956m6496K536l6948k5121
10123A54426m7781n7010J19221R9299m0993p5194O2501L8094n9977o033n2572
10112A33981k0470m2670l2654k8053n2037k8025N6460K2526O0498N9029j00622
10101B7963j18474L0514O2773l1836p9380m7974O0627J6579L1972O5153Q6816
10090A04733P3872j960o5157l3739K976J6959j7079p656p1223j8847m0000n1879
$$ plain form
10078 -109000 -19745 -65558 -88224 -14935 25424 143827 213325 186189 157879 85450 65773
10067 65773 114704 105984 53681 22043 31187 -4828 11815 13923 -60700 -137158 -117155 -8158
10055 -8158 73957 152697 192314 111950 91643 60122 13716 -2129 -19143 14985 -48998 -58972
10043 -58972 -43491 -52347 -84020 -122521 -96542 -60421 -10549 22139 -44133 -82068 -25923 13530
10031 13530 -37676 -20899 -19070 71372 38429 -8771 9007 -104200 -142013 21915 68887
10020 68887 -45260 -49510 -65917 -61938 98778 164423 124342 158800 167494 119634 2004 -85375
10008 -85375 6549 104607 144094 122636 56691 -20006 -71292 -93886 -145435 -177133 -58163
9997 -58163 -63401 -21588 34761 60443 -12209 -81918 -83878 -57268 1403 6805 32997 41616 28134
$$ packed form
10078a09000Q9255m5813k2666P3289M0359J18403O9498k7136k8310p2429j9677
10067F5773M8931q720n2303l1638R144l6015J6643K108p4623p6458K0003J08997
10055h158Q2115P8740L9617q0364k0307l1521m6406j5845j7014L4128o3983r974
10043e8972J5481q856l1673l8501K5979L6121M9872L2688o6272l7935N6145L9453
10031A3530n1206J6777J829R0442l2943m7200J7778j13207l7813J63928M6972
10020F8887j14147m250j6407L979J60716O5645m0081L4458Q694m7860j17630q7379
10008h5375R1924R8058L9487k1458o5945p6697n1286k2594n1549l1698J18970
9997e8163n238M1813N6349K5682p2652o9709j960K6610N8671N402K6192Q619j3482
$$ plain form
9984 28134 -20861 8967 -48185 -16083 22682 51262 26320 52916 46949 20211 -35064 -62354
9972 -62354 -33751 -16418 -71056 -117745 -131522 -185453 -155171 -149167 -169231 -121518 -120659 -138729
9960 -138729 -114887 -64562 9988 77698 128648 84926 -106985 -109408 5721 47421 1008
9949 1008 -86891 -71555 -58548 -29498 -49749 -134364 -164942 -140793 -67570 -40375 -36772 -95277
9937 -95277 -94208 -91359 -96084 -65813 -73161 -499 -28424 -51049 -41792 -68830 -113134 -85847 6738
9924 6738 -26410 -101959 -93712 -21242 57405 34472 1458 41320 21560 -29999 -59283 -53509
9912 -53509 -15186 35959 13118 437 13819 28113 5879 56580 110071 62091 66850 -13214
9900 -13214 826 66582 90384 90083 117082 54636 -33653 -108614 -151399 -109666 -135900 -90883
$$ packed form
9984B8134m8995K9828n7152L2102L8765K8580k4942K6596n967k6738n5275k7290
9972f2354K8603J7333n4638m6689j3777n3931L0282O004k0064M7713Q59j8070
9960a38729K3842N0325P4550O7710N0950m3722j91911k423J15129M1700m6413
9949A008q7899J5336J3007K9050k0251q4615l0578K4149P3223K7195L603n8505
9937i5277J069K849m725L0271p348P2662k7925k2625R257k7038m4304K7287R2585
9924F738l3148p5549Q247P2470P8647k2933l3014L9862j9760n1559k9284N774
9912e3509L8323N1145k2841j2681J3382J4294k2234N0701N3491m7980M759q0064
9900a3214J4040O5756K3802l01K6999o2446q8289p4961m2785M1733k6234M5017
$$ plain form
9888 -90883 -85097 -143110 -167467 -149073 -121678 -108533 -115735 -85762 -51515 -82797 -74512 3963
9876 3963 -35394 -62599 7365 -11233 -103678 -54014 -23206 13589 90419 148119 150828 118684
9864 118684 109223 134653 67142 52191 -10955 -91537 18710 99343 6814 -26700 61364 104041
9852 104041 136644 135373 116201 88541 10573 -45976 -79250 -64288 3211 59889 43914 46946
9840 46946 66679 93401 78289 -32356 -130569 -169449 -130827 -67990 -110046 -113298 -42017 40453
9828 40453 40536 64663 -2528 -32325 -28515 9469 20949 -35859 -86320 -92511 33792 61488 80570
9815 80570 113194 96425 65942 72715 37864 -21691 -7227 41081 63540 38979 -13585 -7632
9803 -7632 -36003 -4043 -5905 13797 79874 37934 -32481 -1015 -48299 -18905 5617 18171
$$ packed form
9888i0883N786n8013k4357J8394K7395J3145p202K9973L4247l1282Q285P8475
9876C963l9357k7205O9964j8598r2445M9664L0808L6795P6830N7700K709l2144
9864A18684r461K5430o7511j4951o3146q0582J10247Q0633r2529l3514Q8064M2677
9852A04041L2603j271j9172k7660p7968n6549l3274J4962O7499N6678j5975L032
9840D6946J9733K6722j5112j10645r8213l8880L8622O2837m2056l252P1281Q2470
9828D0453Q3K4127o7191k9797L810L7984J1480n6808n0461o191J26303K7696J9082
9815H0570L2624j6769l0483O773l4851n9555J4464M8308K2459k4561n2564N953
9803g632k8371L1960j862J9702O6077m1940p0415L1466m7284K9394K4522J2554
$$ plain form
9791 18171 32549 -9436 -26043 -127328 -116060 -75427 19800 5352 -1374 35600 119532 81770
9779 81770 91502 38169 8249 23 64652 76767 -26182 -137340 -165171 -78165 -27546 -42915
9767 -42915 -93457 -97371 -163419 -196671 -93762 6637 -17693 26890 42157 -4070 1269 94803
9755 94803 16054 -51371 -126311 -99985 -48579 -113720 -195659 -137579 -96103 -55657 -807 -42150
9743 -42150 -46475 12098 26618 14742 26132 13178 25201 99286 82734 23384 34427 7753
9731 7753 -58866 -124742 -116699 -77560 32389 117444 118776 99347 80917 6966 7166 36421 61293
9718 61293 42975 51168 12880 -46102 -145901 -120127 -79182 -126889 -54160 -23002 50390 16020
9706 16020 -19985 -56462 -31557 15136 3992 10041 -28414 -58763 -127408 -140217 -58447 -20161
$$ packed form
9791A8171J4378m1985j6607j01285J1268M0633R5227j4448o726L6974Q3932l7762
9779H1770R732n3333k9920q226O4629J2115j02949j11158k7831Q7006N0619j5369
9767d2915n0542l914o6048l3252J02909J00399k4330M4583J5267m6227N339R3534
9755I4803p8749o7425p4940K6326N1406o5141q1939N8080M1476M0446N4850m1343
9743d2150m325N8573J4520j1876J1390j2954J2023P4085j6552n9350J1043k6674
9731G753o6619o5876Q043L9139J09949Q5055J332j9429j8430p3951K00K9255K4872
9718F1293j8318Q193l8288n8982r9799K5774M0945m7707P2729L1158P3392l4370
9706A6020l6005l6477K4905M6693j1144O049l8455l0349o8645j2809Q1770L8286
$$ plain form
9694 -20161 -2203 -52744 -111282 -154005 -93507 7901 -5153 -54672 -117026 -162144 -76393 -75351
9682 -75351 -124962 -68570 6221 -15462 -21516 -15781 -51493 -83765 -80059 -16886 24009 -25755
9670 -25755 -115724 -158817 -126413 -119668 -189240 -141104 -12217 -3789 -57991 -136261 -109184 -8965
9658 -8965 59876 63079 46788 56336 30963 30170 44244 92509 59685 -17357 97002 313963
9646 313963 533765 695494 807703 898765 760956 589840 360187 313935 257599 172529
9636 172529 136906 125970 173023 125109 76047 79342 75444 80694 32278 -21106 -15542 4470
9624 4470 11869 39334 31280 41243 -11771 -23649 44299 50523 44524 -16478 -54774 -36823 -63032
9611 -63032 -114227 -88726 -32058 -25824 -21470 -50291 22412 -26020 -56652 -18210 3738 -45157
$$ packed form
9694b0161J7958n0541n8538m2723O0498J01408j3054m9519o2354m5118Q5751J042
9682g5351m9611N6392P4791k1683o054N735l5712l2272L706O3173M0895m9764
9670b5755q9969m3093L2404O745o9572M8136J28887Q428n4202p8270K7077J00219
9658h965O8841L203j6291R548k5373p93J4074M8265l2824p7042J14359K16961
9646C13963K19802J61729J12209R1062j37809j71116k29653m6252n6336q5070
9636A72529l5623j0936M7053m7914m9062L295l898N250m8416n3384N564K0012
9624D470P399K7465q054R963n3014j1878O7948O224n999o1002l8296J7951k6209
9611f3032n1195K5501N6668O234M354k8821P2703m8432l0632L8442K1948m8895
$$ plain form
9599 -45157 -99953 -104557 -82209 25725 155168 119987 27892 31850 -26556 -68344 -87510 -103537
9587 -103537 -66095 -120735 -144734 -125352 -66511 -66222 -43811 -1595 21897 53890 30897 10347
9575 10347 -19785 -61670 -78660 -87994 -96643 -74667 -193540 -218596 -223593 -104532 10061 -17395
9563 -17395 38123 80881 -7342 -84863 25393 108857 199950 226839 111729 17275 22328 -12684
9551 -12684 -78050 -75151 60755 128150 71340 16960 -28784 -23920 -44808 -51267 33411 55378
9539 55378 62975 17356 -26686 32125 111805 24245 -18276 16617 54051 116573 155697 129063
9527 129063 98673 102706 -38877 -134983 -138956 -105192 -110097 -131877 -177643 -183771 -62013 4851
9515 4851 26024 13540 95653 60853 -64025 -28586 95045 74826 -33797 -2185 -29456
$$ packed form
9599d5157n4796m604K2348J07934J29443l5181r2095L958n8406m1788j9166j6027
9587a03537L7442n4640k3999J9382N8841K89K2411M2216K3492L1993k2993k0550
9575A0347l0132m1885j6990r334q649K1976j18873k5056m997J19061J14593k7456
9563a7395N5518M2758q8223p7521J10256Q3464R1093K6889j15110r4454N053l5012
9551a2684o5366K899J35906O7395n6810n4380m5744M864k0888o459Q4678K1967
9539E5378P597m5619m4042N8811P9680q7560m2521L4893L7434O2522L9124k6634
9527A29063l0390M033j41583r6106l973L3764m905k1780m5766o128J21758O6864
9515D851K1173j2484Q2113l4800j24878L5439J23631k0219j08623L1612k7271
$$ plain form
9504 -29456 -66376 -5372 -13403 -92247 -1614 -9941 -74619 -90168 -128142 -57489 -21196 -39617
9492 -39617 -87706 -65309 -52842 -77851 -20079 25434 -30065 -44494 -3459 -18258 11990 10969
9480 10969 14043 -40190 -138219 -142638 -91709 -100598 -135958 -164371 -149489 -118444 -8969 -5453
9468 -5453 -11481 -12208 74386 152814 166929 78085 -61323 -55738 -32254 -94071 -139189 -39962 -49888
9455 -49888 -85247 -47358 -10099 -87392 -41010 31186 62431 156080 103574 61849 46082 -826
9443 -826 -31440 -84032 -36891 -27424 -1289 38586 -6399 17569 67271 86235 40109 42033 60512
9430 60512 60003 63070 84774 73391 84083 41864 -76295 -87059 -37967 18720 10148 -149862
9418 -149862 -176856 -214630 -143655 -29533 47351 36132 16610 22082 36077 91463 20984 -22882
$$ packed form
9504b9456l6920O1004q031p8844R0633q327o4678j5549l7974P0653L6293j8421
9492c9617m8089K2397J2467k5009N7772M5513n5499j4429M1035j4799L0248j021
9480A0969L074n4233r8029m419N0929q889l5360k8413J4882L1045J09475L516
9468e453o028p27Q6594P8428J4115q8844j39408N585K3484o1817m5118R9227r926
9455d9888l5359L7889L7259p7293M6382P2196L1245R3649n2506m1725j5767m6908
9443h26l0614n2592M7141R467K6135L9875m4985K3968M9702J8964m6126J924J8479
9430F0512n09L067K1704j1383J0692m2219j18159j0764M9092N6687q572j60010
9418a49862k6994l7774P0975J14122P6884j1219j9522N472J3995N5386p0479m3866
$$ plain form
9406 -22882 -44780 -6063 -8387 96526 119595 22288 -58821 -51417 -124102 -149414 -88582 -25953
9394 -25953 45753 40341 33762 56551 65211 -2461 -6219 -47257 -2157 -12664 -88110 -77822 -1219
9381 -1219 61377 65171 68098 51674 -82958 -84449 -90043 -69769 -42276 -30093 1988 14909 57269
9368 57269 102130 45251 35616 -19228 -42315 -105567 -125532 -118085 -104595 -53832 -90126 -168173
9356 -168173 -131588 -19845 -43512 9877 2160 -26602 -11139 -101504 -70520 33532 11733
9345 11733 24123 87036 83030 30588 9630 -15209 -77952 -86993 -91809 -52403 18725 38516
9333 38516 152042 23440 33486 52366 -18289 -48091 -81504 -79318 -89114 -69719 -78000 -14862
9321 -14862 31007 20036 57400 105268 57701 -66453 -143564 -187057 -115963 -87951 -104082 -127299
$$ packed form
9406b2882k1898L8717k324J04913K3069r7307q1109P404p2685k5312O0832O2629
9394b5953P1706n412o579K2789Q660o7672l758m1038M5100j0507p5446J0288P6603
9381a219O2596L794K927j6424j34632j491n594K0274K7493J2183L2081J2921M2360
9368E7269M4861n6879r635n4844k3087o3252j9965P447J3490N0763l6294p8047
9356a68173L6585J11743k3667N3389p717k8762J5463r0365L0984J04052k1799
9345A1733J2390O2913m006n2442k0958k4839o2743r041m816L9406P1128J9791
9333C8516J13526j28602J0046J8880p0655k9802l3413K186r796J9395q281O3138
9321a4862M5869j0971L7364M7868m7567j24154p7111m3493P1094K8012j6131k3217
$$ plain form
9309 -127299 -56526 14352 94125 22436 40154 108821 77902 58114 67555 78479 67464 91423
9297 91423 81619 -12082 -16709 56848 63427 51635 60551 64079 60201 -18387 -106522 -111571 -94944
9284 -94944 -108123 -80749 -67261 -64800 -74044 -102949 -73654 -44090 -13808 -8368 15258 -5905
9272 -5905 65178 145596 151154 114659 43995 -14163 -109396 -89645 -18001 13792 89630 -7070
9260 -7070 -67598 -53040 -21843 78693 110769 113182 82637 72038 67836 -7705 24828 794
9248 794 -66118 -86483 -88900 -89060 -57267 -81269 -64923 -88265 -94439 -20777 68447 19821 -21952
9235 -21952 -5209 -10448 -37211 51649 63619 29902 -29320 -3488 31512 7062 12899 26105
9223 26105 132821 127466 57945 12357 -1795 21373 9708 -72341 -131251 -127313 -76310 -64111
$$ packed form
9309a27299P0773P0878P9773p1689J7718O8667l0919j9788R441J0924j1015K3959
9297I1423r804r3701m627P3557O579j1792Q916L528l878p8588q8135n049J6627
9284i4944j3179K7374J3488K461r244k8905K9295K9564L0282N440K3626k1163
9272e905P1083Q0418N558l6495p0664n8158r5233J9751P1644L1793P5838r6700
9260g070o0528J4558L1197J00536L2076K413l0545j0599m202p5541L2533k4034
9248G94o6912k0365k417j60L1793k4002J6346k3342o174P3662Q9224m8626m1773
9235b1952J6743n239k6763Q8860J1970l3717n9222K5832L5000k4450N837J3206
9223B6105J06716n355o9521m5588j4152K3168j1665q2049n8910L938N1003J2199
$$ plain form
9211 -64111 -3493 84932 -15519 -119346 -160016 -207983 -163659 -114843 -95464 -53824 1713
9200 1713 30866 2114 -8697 -24605 -58953 -29682 13992 58258 26021 -84754 -105463 -102507
9188 -102507 -7102 8659 52513 57497 10727 -1391 12620 76991 104752 81539 15655 55000
9176 55000 -27383 -136110 -47910 91241 120723 42224 -72386 -102671 -66572 -7259 63276
9165 63276 104887 85724 97650 134945 128933 94873 115351 88421 -19890 -26999 46479 25416
9153 25416 8568 45843 2065 -114905 -137244 -86440 -22806 6301 12232 89792 72567 33501
9141 33501 41842 29628 -24923 -72588 -97521 -88739 -143816 -102252 -59955 -4190 121819 81736
9129 81736 124118 111734 109525 60684 -5738 3156 39862 14118 11285 17868 42566 63135 103802
$$ packed form
9211f4111O0618Q8425j00451j03827m0670m7967M4324M8816J9379M1640N5537
9200A713K9153k8752j0811j5908l4348K9271M3674M4266l2237j10775k0709K956
9188a02507R5405J5761M3854M984m6770j2118J4011O4371K7761k3213o5884L9345
9176E5000q2383j08727Q8200J39151K9482p8499j14610l0285L6099N9313P0535
9165F3276M1611j9163J1926L7295o012l4060K0478k6930j08311p109P3478k1063
9153B5416j6848L7275m3778j16970k2339N0804O3634K9107N931P7560j7225l9066
9141C3501Q341j2214n4551m7665k4933Q782n5077M1564M2297N5765J26009m0083
9129H1736M2382j2384k209m8841o6422Q894L6706k5744k833O583K4698K0569M0667
$$ plain form
9116 103802 116923 134982 99492 82508 44417 -6868 -7437 -37009 -50736 -65051 -84767 -30095
9104 -30095 -31540 88947 122562 140834 41483 -38462 16472 6110 82680 213030 146259 27409
9092 27409 9313 1637 -40212 -5224 6731 -14856 44189 26865 -53539 -71009 -71669 -48594
9080 -48594 -55419 -61739 -109287 -111599 -76948 -48053 19251 -40 8147 25614 9709 -44492 -39862
9067 -39862 61872 108104 74432 17435 -50962 33042 120355 48160 19917 -6815 -96926 -141433
9055 -141433 -105261 115006 171144 122024 136892 73508 55470 31072 -39158 -69832 -37396
9044 -37396 -1235 37664 46396 8470 4802 16058 7797 -82485 -150013 -99515 24386 -6011
9032 -6011 -54998 -37742 -24137 6169 60577 38321 -54622 -35669 2783 -6256 -55042 -76875
$$ packed form
9116A03802J3121J8059l5490j6984l8091n1285n69k9572j3727j4315j9716N4672
9104c0095j445J20487L3615J8272r9351p9945N4934j0362P6570J30350o6771j18850
9092B7409j8096p676m1849L4988J1955k1587N9045j7324q0404j7470o60K3075
9080d8594o825o320m7548k312L4651K8895O7304j9291Q187J7467j5905n4201M630
9067c9862J01734M6232l3672n6997o8397Q4004Q7313p2195k8243k6732r0111m4507
9055a41433L6172K20267N6138m9120J4868o3384j8038k4398p0230l0674L2436
9044c7396L6161L8899Q732l7926l668J1256q261r0282o7528N0498J23901l0397
9032f011m8987J7256J3605L0306N4408k2256r2943J8953L8452r039m8786k1833
$$ plain form
9020 -76875 -88758 -59539 -42864 -101767 -51327 32303 41110 -5898 -50411 -53912 -17598 3429
9008 3429 -38010 -146445 -57016 -16526 -10532 28968 95696 23012 20724 60855 51317 -32367
8996 -32367 18045 34577 57817 33396 9533 -41412 26445 58916 97420 122211 111548 146750
8984 146750 111393 128802 80156 50613 104687 58570 -32881 -32123 -33104 -79059 -77458 12058 -25422
8971 -25422 -144660 -183280 -123369 -85179 -40137 -82134 -132876 -34097 11767 2031 4127 22870
8959 22870 14799 -77067 -154184 -110961 -68348 -74820 -93810 -72953 -67448 -111386 -66578 -36760
8947 -36760 16695 55416 127092 117431 15005 2391 73447 35349 -4336 44575 16292 11459
8935 11459 113333 136485 134659 91268 164344 155160 166319 138367 130256 107948 54734 -4225
$$ packed form
9020g6875j1883K9219J6675n8903N0440Q3630Q807m7008m4513l501L6314K1027
9008C429m1439j08435Q9429M0490N994L9500O6728p2684k288M0131r538q3684
8996c2367N0412J6532K3240k4421k3863n0945O7857L2471L8504K4791j0663L5202
8984A46750l5357J7409m8646k9543N4074m6117r1451P58r81m5955J601Q9516l7480
8971b5422j19238l8620N9911L8190M5042m1997n0742R8779M5864r736K096J8743
8959B2870q071r1866p7117M3223M2613o472j8990K0857N505m3938M4808K9818
8947c6760N3455L8721P1676r661j02426j2614P1056l8098l9685M8911k8283m833
8935A1459J01874K3152j826m3391P3076r184J1159k7952q111k2308n3214n8959
$$ plain form
8923 -4225 -88810 -55890 -37263 27616 71809 58935 9014 12477 14246 19262 15411 -71467 -70386
8910 -70386 34381 80345 35533 79418 114213 79234 2065 -2461 102689 132122 80291 32080
8898 32080 56942 118938 148476 34394 -54778 -27225 -787 24269 4323 68687 40341 69857
8886 69857 166702 139076 194742 135271 134988 136165 113435 179679 173234 107714 44237 -28761 -63404
8873 -63404 14413 112477 141314 142798 76337 -9022 17788 65387 113171 171526 212419 222015
8861 222015 160736 63517 94254 54976 245 16103 50833 199933 300452 190141 189157
8850 189157 180861 136197 66279 -38896 -58590 -30374 -47481 -16545 71227 83143 90143 105418
8838 105418 84458 69583 98640 181791 247783 191202 134520 127085 64735 98698 107098 123504
$$ packed form
8923d225q4585L2920J8627O4879M4193j2874m9921L463J769N016l851q6878J081
8910g0386J04767M5964m4812M3885L4795l4979p7169m526J05150K9433n1831m8211
8898C2080K4862O1996K9538j14082q9172K7553K6438K5056j9946O4364k8346K9516
8886F9857R6845k7626N5666n9471k83J177k2730O6244o445o5520o3477p2998l4643
8873f3404P7817R8064K8837J484o6461q5359K6810M7599M7784N8355M0893R596
8861B22015o1279r7219L0737l9278n4731J5858L4730J49100J00519j10311r84
8850A89157q296m4664o9918j05175j9694K8216j7107L0936Q7772J1916P000J5275
8838A05418k0960j4875K9057Q3151O5992n6581n6682p435o2350L3963Q400J6406
$$ plain form
8826 123504 111887 128637 147554 131453 104704 176671 215008 188895 194599 138152 166476 193763
8814 193763 166569 150766 211311 133904 38421 -7202 -31396 -4142 46702 143622 179199 186101
8802 186101 186260 157311 119522 162948 129735 -8465 -2015 119478 219618 205283 197907 138042
8790 138042 139998 98047 93232 51302 79240 151539 131055 144724 68239 104959 120593 95468
8778 95468 98255 34820 -7457 39350 95933 84157 139266 282279 288410 241247 157859 65224
8766 65224 75780 39632 -5092 23141 98899 186576 125352 109332 184965 185932 227359 184125
8754 184125 232185 253568 216206 159754 167057 170857 179697 128780 80282 75327 100828 181849
8742 181849 240144 210373 136645 111752 150079 242117 328741 271094 246056 257094 156723
$$ packed form
8826A23504j1617J6750J8917j6101k6749P1967L8337k6113N704n6447K8324K7287
8814A93763k7194j5803O0545p7407r5483m5623k4194K7254N0844R6920L5577O902
8802A86101J59k8949l7789M3426l3213j38200O450J21493J00140j4335p376n9865
8790A38042J956m1951m815m1930K7938P2299k0484J3669p6485L6720J5634k5125
8778I5468K787o3435m2277M6807N6583j1776N5109J43013O131m7163q3388r2635
8766F5224J0556l6148m4724K8233P5758Q7677o1224j6020P5633R67M1427m3234
8754A84125M8060K1383l7362n6452P303L800Q840n0917m8498m955K5501Q1021
8742A81849N8295k9771p3728k4893L8327R2038Q6624n7647k5038J1038j00371
$$ plain form
8731 156723 74781 11423 32733 92431 133253 211232 122930 89102 24375 39402 106788 191919
8719 191919 222909 239847 147766 142989 174837 210395 191544 118973 185404 262848 205917 158020
8707 158020 173910 213239 192369 78871 73928 123918 37792 39914 160193 191015 63689
8696 63689 55638 132463 184708 199127 144631 126752 176101 80073 17038 10037 119918 95388
8684 95388 44411 100079 118675 234851 326984 273171 192823 127709 120634 210685 278069 238415
8672 238415 261059 280414 243642 155184 112921 173562 272979 213408 186288 325028 374089
8661 374089 300411 302858 348463 300353 271894 248506 259258 301526 275404 240636 141073 126988
8649 126988 106210 129530 118685 145055 111844 42615 20124 70428 101350 82409 21917 51068
$$ packed form
8731A56723q1942o3358K1310N9698M0822P7979q8302l3828o4727J5027O7386Q5131
8719A91919L0990J6938r2081m777L1848L5558j8851p2571O6431P7444n6931m7897
8707A58020J5890L9329k0870j13498m943M9990q6126K122J20279L0822j27326
8696F3689q051P6825N2245J4419n4496j7879M9349r6028o3035p001J09881k4530
8684I5388n0977N5668J8596J16176R2133n3813q0348o5114p075R0051O7384l9654
8672B38415K2644J9355l6772q8458m2263O0641R9417n9571k7120J38740M9061
8661C74089p3678K447M5605m8110k8459k3388J0752M2268k6122l4768r9563j4085
8649A26988k0778K3320j0845K6370l3211o9229k2491N0304L0922j8941o0492K9151
$$ plain form
8637 51068 90564 148361 190993 171432 117608 111188 85540 50527 33330 80358 94830 93211
8625 93211 136005 66855 104611 205146 236882 173438 129374 179894 75191 20364 8667
8614 8667 8206 81574 32054 59486 152237 219545 203041 127718 41159 136400 135238 28812
8602 28812 2476 -19712 52772 156154 161394 144647 196693 123831 127170 145009 61272 -25801
8590 -25801 -54294 11687 86060 92618 125212 197436 293472 261349 218026 207107 194998 230705
8578 230705 163775 99618 77559 61028 45697 60792 50941 13678 -29840 -80466 -22071 64848
8566 64848 135527 126854 181161 173226 127944 117236 175205 214962 198640 131184 97933 105865
8554 105865 160005 81116 90991 102096 106581 46311 10739 -4807 11035 108431 178273 196183
$$ packed form
8637E1068L9496N7797M2632j9561n3824o420k5648l5013j7197M7028J4472j619
8625I3211M2794o9150L7756J00535L1736o3444m4064N0520j04703n4827j1697
8614H667m61P3368m9520K7432R2751O7308j6504p5323q6559R5241j162j06426
8602B8812k6336k2188P2484J03382N240j6747N2046p2862L339J7839q3737q7073
8590b5801k8493O5981P4373O558L2594P2224R6036l2123m3323j0919j2109L5707
8578B30705o6930o4157k2059j6531j5331J5095r851l7263m3518n0626N8395Q6919
8566F4848P0679q673N4307p935m5282j0708N7969L9757j6322o7456l3251P932
8554A05865N4140p8889R875J1105M485o0270l5572j5546J5842R7396O9842J7910
$$ plain form
8542 196183 123768 -1158 52942 34776 -9050 -15432 -70953 -88404 -51391 7940 1389 -13146
8530 -13146 54329 59184 61331 143139 212956 210882 154044 23092 -90221 1039 145381 271942
8518 271942 199443 159595 207296 184862 152382 6479 -41798 -72895 -22757 58130 104962
8507 104962 44564 17958 38434 56644 69674 39372 85751 122916 80295 20780 -96307
8496 -96307 -28216 64080 46904 33330 41441 85533 32760 22502 -9607 28564 13955 -48941
8484 -48941 -77921 2879 137477 123980 46037 73153 85958 49702 55738 -15949 -34509 -19584
8472 -19584 -28922 46647 80855 12877 41698 80367 101826 127623 170323 197899 265550 216929
8460 216929 154611 164130 240177 142310 112550 143411 117721 121000 116715 179444 203663 84684
$$ packed form
8542A96183p2415j24926N4100j8166m3826o382n5521j7451L7013N9331o551j4535
8530a3146O7475M855K147Q1808O9817k074n6838j30952j13313R1260J44342J26561
8518B71942p2499l9848M7701k2434l2480j45903m8277l1097N0138Q0887M6832
8507A04962o0398k6606K0476J8210J3030l0302M6379L7165m2621n9515j17087
8496i6307O8091R2296j7176j3574Q111M4092n2773j0258l2109L8171j4609o2896
8484d8941k8980Q0800J34598j3497p7943K7116J2805l6256O036p1687j8560J4925
8472a9584r338P5569L4208o7978K8821L8669K1459K5797M2700K7576O7651m8621
8460B16929o2318R519P6047r7867k9760L0861k5690L279m285O2729K4219j18979
$$ plain form
8448 84684 52675 98945 107882 207427 287085 279885 201733 144191 131589 60572 12894 48146
8436 48146 61529 26807 42340 32273 -45043 -51822 35413 21752 124898 231212 247798 96571
8424 96571 73217 61620 69969 70954 110654 77138 9695 11990 29518 94928 71051 -2329 1634
8411 1634 83152 128980 74378 46221 76987 37094 -94715 -178985 -132379 -21979 55217 -28836
8399 -28836 -55214 -64551 -72938 -35074 -15162 80972 134457 187047 64864 21862 76541 84048
8387 84048 99672 49448 -27468 -77487 -11249 67150 120832 173345 169994 109737 29833 -21472
8375 -21472 86567 184592 138291 137777 220330 159282 154860 194560 260604 344954 473729 692198
8363 692198 823161 935366 859406 731821 545153 344865 257491 248141 209090 149548 51496
$$ packed form
8448H4684l2009M6270Q937R9545P9658p200p8152n7542j2602p1017m7678L5252
8436D8146J3383l4722J5533j0067p7316o779Q7235j3661J03146J06314J6586j51227
8424I6571k3354j1597Q349R85L9700l3516o7443K295J7528O5410k3877p3380L963
8411A634Q1518M5828n4602k8157L0766l9893j31809q4270M6606J10400P7196q4053
8399b8836k6378r337q387L7864J9912R6134N3485N2590j22183m3002N4679P507
8387H4048J5624n0224p6916n0019O6238P8399N3682N2513l351o0257p9904n1305
8375b1472J08039R8025m6301n14Q2553o1048m422L9700O6044Q4350J28775K18469
8363F92198J30963J12205p5960j27585j86668k00288q7374r350l9051n9542r8052
$$ plain form
8352 51496 25471 -3769 12226 19829 44217 10293 -30857 27259 25130 15969 -47036 -124364
8340 -124364 -68995 71771 116756 68922 1433 26153 63673 25551 -33889 -48620 42390
8329 42390 78615 142942 156083 222172 208659 275746 346831 474387 776938 1149877 1396879
8318 1396879 1504861 1439518 1177691 747408 372828 178269 174056 120386 111213 167759 112597
8307 112597 90556 59675 34714 70443 119421 39842 6976 4825 41256 -26643 -26012 -19672
8295 -19672 78380 17256 -117213 -122217 -123055 -131928 -47145 106405 111118 35400 -39555 -118899
8283 -118899 -83490 55243 79358 97952 165689 289854 452608 613147 744524 836721 753358
8272 753358 687289 606853 496490 393058 360488 384764 299524 75548 -39337 -35507 -40216
$$ packed form
8352E1496k6025k9240J5995P603K4388l3924m1150N8116k129r161o3005p7328
8340a24364N5369J40766M4985m7834o7489K4720L7520l8122n9440j4731R1010
8329D2390L6225O4327J3141O6089j3513O7087P1085J27556L02551L72939K47002
8318A396879J07982o5343k61827m30283l74580j94559m213n3670r173N6546n5162
8307A12597k2041l0881k4961L5729M8978p9579l2866k151L6431o7899O31O340
8295a9672R8052o1124j34469n004q38q873Q4783J53550M713p5718p4955p9344
8283a18899L5409J38733K4115J8594O7737J24165J62754J60539J31377R2197q3363
8272G53358o6069q0436j10363j03432l2570K4276q5240k23976j14885L830m709
$$ plain form
8261 -40216 -128 56945 126204 102163 61875 45673 47845 -16845 -4856 23843 6003 11533
8249 11533 71379 120188 219234 218911 206204 160572 159039 99710 80778 -10044 -1184 81585 124504
8236 124504 -18814 -87067 -102869 -123346 -36992 78319 133127 182926 144147 126613 129274
8225 129274 124552 24193 21876 24978 12930 -39079 -85474 -17967 38541 23076 8550 -14834
8213 -14834 -54126 36751 26105 28864 91261 34271 -12781 -40674 37001 18637 -7269 -22723
8201 -22723 -51578 -129729 -87570 -43280 -44826 11579 1827 63513 -57327 -149969 -28138 73735
8189 73735 13656 51150 45211 49592 48251 8938 21194 39719 150353 173979 85403 23202
8177 23202 35614 -89073 -141845 -106458 -58682 15359 22115 42909 18370 -20103 -26568 -124492
$$ packed form
8261d0216M0088N7073O9259k4041m0288j6202K172o4690J1989K8699j7840N530
8249A1533N9846M8809R9046l23j2707m5632j533n9329j8932r0822Q860Q2769M2919
8236A24504j43318o8253j5802k0477Q6354J15311N4808M9799l8779j7534K661
8225A29274m722j00359k317L102j2048n2009m6395O7507N6508j5465j4526k3384
8213a4834l9292R0877j0646K759O2397n6990m7052k7893P7675j8364k5906j5454
8201b2723k8855p8151M2159M4290j546N6405r752O1686j20840r2642J21831J01873
8189G3735o0079L7494n939M381j341l9313J2256J8525J10634K3626q8576o2201
8177B3202J2412j24687n2772L5387M7776P4041O756K0794k4539l8473o465r7924
$$ plain form
8165 -124492 -107758 -21085 3226 -943 35463 110800 113736 98071 99639 35111 -30370 -40361
8153 -40361 -40323 -61949 -71862 -38015 32749 78984 46984 15092 6644 51650 39788 -44794 -112181
8140 -112181 -49568 -32461 -44423 -195146 -274477 -221341 -131373 -92245 4164 30744 120573
8129 120573 115225 32824 -34015 -84868 -112667 -67864 -59284 -75842 -47480 24308 -45300 -81404
8117 -81404 -53907 -41970 -38176 -64789 9535 11194 -3637 29343 -8485 9135 92063 202395
8105 202395 190629 87456 69011 -19539 -94881 -92618 -104070 -117337 -122004 -67586 -90656 -64588
8093 -64588 4052 -41764 -68616 -57914 -138484 -175180 -105054 -93159 -92202 -771 79173 99722
8081 99722 57845 130970 60149 -12551 -8378 -48137 -78012 -65549 10862 43591 12786 13426
$$ packed form
8165a24492J6734Q6673K4311m169L6406P5337K936j5665J568o4528o5481r991
8153d0361L8k1626r913L3847P0764M6235l2000l1892q448M5006j1862q4582o7387
8140a12181O2613J7107j1962j50723p9331N3136Q9968L9128R6409K6580Q9829
8129A20573n348q2401o6839n0853k7799M4803Q580j6558K8362P1788o9608l6104
8117h1404K7497J1937L794k6613P4324J659j4831L2980l7828J7620Q2928J10332
8105B02395j1766j03173j8445q8550p5342K263j1452j3267m667N4418k3070K6068
8093f4588O8640m5816k6852J0702q0570l6696P0126J1895R57R1431P9944K0549
8081I9722m1877P3125p0821p2700M173l9759k9875J2463P6411L2729l0805O40
$$ plain form
8069 13426 107275 147787 149524 122027 147190 157890 217275 191828 102093 89288 145619 164249
8057 164249 184219 123016 66550 82754 15424 -47726 -24111 13493 128193 244355 242061
8046 242061 167965 141074 5851 -81542 -113299 -52834 10999 13846 13043 -38768 24617 80598
8034 80598 140177 138636 162180 154972 123579 60786 -8613 -45881 -20997 -29675 32465 129011
8022 129011 160227 167814 252390 302421 209923 187149 120513 171391 233631 332829 400089 479975
8010 479975 410051 376282 371138 411318 405491 429984 304170 180822 179483 144041 176051 180270
7998 180270 168387 183709 235451 283581 248471 193872 99005 4132 76445 72973 103279 112232
7986 112232 160718 272358 289076 278066 267910 320615 270291 265465 234226 154096 169818 253001
$$ packed form
8069A3426R3849M0512J737k7497K5163J0700N9385k5447q9735j2805N6331J8630
8057A64249J9970o1203n6466J6204o7330o3150K3615L7604J14700J16162k294
8046B42061p4096k6891j35223q7393l1757O0465O3833K847q03n1811O3385N5981
8034H0598N9579j541K3544p208l1393o2793o9399l7268K4884q678O2140R6546
8022A29011L1216P587Q4576N0031r2498k2774o6636N0878O2240R9198O7260P9886
8010D79975o9924l3769n144M0180n827K4493j25814j23348j339l5442L2010M219
7998A80270j1883J5322N1742M8130l5110n4599r4867r4873P2313l472L0306Q953
7986A12232M8486J11640J6718j1010j0156N2705n0324m826l1239q0130J5722Q3183
$$ plain form
7974 253001 189823 236172 329900 339885 393372 441705 446833 461922 400269 358804 317884 244346
7962 244346 239589 309707 302024 292696 253300 220502 231276 246186 174272 72930 -21592 38759
7950 38759 13261 50492 147706 170831 191301 261553 226917 134497 128705 115629 91897 78651
7938 78651 44775 92537 50034 30553 8473 81154 122855 11884 -8306 81626 176150 244816
7926 244816 271861 181429 115486 173416 207539 210749 189309 142344 17458 -12742 79682 209023
7914 209023 160919 94881 19073 876 46284 132675 -329 -72398 -136936 -151263 -81824
7903 -81824 -64312 34011 29741 14971 3940 -9365 15923 56608 76033 74795 21678 -34518
7891 -34518 -47308 -63828 -49665 -1359 24290 60143 8266 -17649 24834 17080 -69644 -51948
$$ packed form
7974B53001o3178M6349R3728R985N3487M8333N128J5089o1653m1465m0920p3538
7962B44346m757P0118p683r328l9396l2798J0774J4910p1914j01342r4522O0351
7950C8759k5498L7231R7214K3125K0470P0252l4636r2420n792j3076k3732j3246
7938G8651l3876M7762m2503j9481k2080P2681M1701j10971k0190Q9932R4524O8666
7926B44816K7045r0432o5943N7930L4123L210k1440m6965j24886l0200R2424J29341
7914B09023m8104o6038p5808j8197M5408Q6391j33004p2069o4538j4327O9439
7903h1824J7512R8323m270j4770j1031j3305K5288M0685J9425j238n3117n6196
7891c4518j2790j6520J4163M8306K5649L5853n1877k5915M2483p754q6724J7696
$$ plain form
7879 -51948 51222 75116 87624 61123 64237 83246 75360 90193 52402 46904 115796 138154
7867 138154 58418 -20624 -47341 26454 3353 35224 -22629 -82228 -110764 -102332 -41975 -1443
7855 -1443 9371 15357 -8325 -84399 -26973 -1026 109256 195223 215051 160673 22904 -118783
7843 -118783 -97841 34747 158359 86433 30616 -27205 33467 108147 136754 144301 115327
7832 115327 76391 129733 124628 79797 72914 12395 2821 89752 157250 101803 54873 -71053
7820 -71053 -63433 30691 45321 -46504 -30934 56116 69766 70951 17201 -87759 -154878 -97835
7808 -97835 25352 68682 -12038 -92615 -111108 -128892 -15521 78979 66171 -18075 -6115
7797 -6115 -606 12084 12509 216 17059 22469 -58700 -114027 -119961 -84514 27406 31999 109020
$$ packed form
7879e1948J03170K3894J2508k6501L114J9009p886J4833l7791n498O8892K2358
7867A38154p9736p9042k6717P3795k3101L1871n7853n9599k8536Q432O0357M0532
7855a443J0814N986k3682p6074N7426K5947J10282Q5967J9828n4378j37769j41687
7843a18783K0942J32588J23612p1926n5817n7821O0672P4680K8607P547k8974
7832A15327l8936N3342n105m4831o883o0519r574Q6931O7498n5447m6930j25926
7820g1053P620R4124J4630r1825J5570Q7050J3650J185n3750j04960o7119N7043
7808i7835J23187M3330q0720q0577j8493j7784J13371R4500j2808q4246J1960
7797f115N509J2690M25j2293J6843N410q1169n5327n934L5447J11920M593P7021
$$ plain form
7784 109020 142877 97707 54079 -8601 -47590 -12629 49129 22565 -28420 -8679 -38242 2089
7772 2089 -36509 -84810 -85232 -25062 34018 69073 111359 90598 64821 -16239 -18533 70491 3073
7759 3073 -7269 21221 104537 120698 130650 141846 122986 86502 140128 83894 13084 -44309
7747 -44309 -92548 -123998 -111588 -46973 42949 96185 70402 -66326 -40208 -77914 17039 116061
7735 116061 69199 17916 -28851 -22154 -79191 -135590 -39928 -7926 -5655 -28083 11921 102050
7723 102050 142144 99845 7926 -44928 -66176 -96099 -89703 -108175 -106904 -38118 -25528 55444
7711 55444 -3987 -138007 -230862 -258822 -199356 -111568 -44081 -23269 -39867 -86744 -117071 -66454
7699 -66454 -56547 -23688 -44083 -61048 -21298 5489 -90473 -42136 6473 -28991 36772 97920
$$ packed form
7784A09020L3857m5170m3628o2680l8989L4961O1758k6564n0985J9741k9563M0331
7772B089l8598m8301m22O0170N9080L5055M2286k0761k5777q1060k294Q9024o7418
7759C073j0342K8490Q3316J6161R952J1196j8860l6484N3626n6234p0810n7393
7747d4309m8239l1450J2410O4615Q9922N3236k5783j36728K6118l7706R4953R9022
7735A16061m6862n1283m6767O697n7037n6399R5662L2002K271k2428M0004R0129
7723A02050M0094m2299r1919n2854k1248k9923O396j8472J271O8786J2590Q0972
7711E5444n9431j34020r2855k7960N9466Q7788O7487K0812j6598m6877l0327N0617
7699f6454R907L2859k0395j6965L9750K6787r5962M8337M8609l5464O5763O1148
$$ plain form
7687 97920 21664 -113941 -175178 -100417 59268 213875 264897 220008 191001 195420 184564
7676 184564 236187 172312 82951 -25788 -89172 -126383 -71849 -54792 -4712 65230 118939
7665 118939 69325 -13176 86482 176336 90715 -49943 -85486 -124038 -185390 -180057 -58070
7654 -58070 -11310 28108 74363 7106 -16151 49135 32060 49230 110869 138227 117923 122397
7642 122397 65540 18017 -22364 -22380 23117 37088 -1965 35345 79977 36175 51249 -67104
7630 -67104 -202283 -226481 -155621 -76033 -3850 -94880 -84067 -101287 -95567 -82500 -75555 -66225
7618 -66225 -27620 14934 -7017 -41881 -26891 -8124 -38301 -31195 -29593 -50245 -108158 -107305 -26548
7605 -26548 -44238 -41557 22147 -29818 -153923 -189329 -296928 -239418 -137636 -72001 -145312
$$ packed form
7687I7920p6256j35605o1237P4761J59685J54607N1022m4889k9007M419j0856
7676A84564N1623o3875q9361j08739o3384l7211N4534J7057N0080O9942N3709
7665A18939m9614q2501R9658Q9854q5621j40658l5543l8552o1352N333J21987
7654e8070M6760L9418M6255o7257k3257O5286j7075J7170O1639K7358k0304M474
7642A22397n6857m7523m0381j6M5497J3971l9053L7310M4632m3802J5074j18353
7630f7104j35179k4198P0860P9588P2183r1030J0813j7220N720J3067O945R330
7618f6225L8605M2554k1951l4864J4990J8767l0177P106J602k0652n7913Q53Q0757
7605b6548j7690K681O3704n1965j24105l5406j07599N7510J01782O5635p3311
$$ plain form
7594 -145312 -182235 -179122 -175861 -89347 -90562 -34573 30008 81156 76058 42190 -39517 -86710
7582 -86710 -108025 -129140 -72269 39859 60920 51568 63018 58045 165306 134234 99073 -11351
7570 -11351 -115881 -76495 8237 -9437 13149 41144 21356 -10543 -19829 -15651 -38475 15311
7558 15311 -75358 -151098 -159601 -40271 43108 42269 -2551 8181 -9949 -89724 -191797 -253899
7546 -253899 -169112 -149601 -91354 39434 58019 -14367 -14471 -12741 -24788 5306 80527 -22158
7534 -22158 -126317 -199099 -138106 -87120 -95827 -96216 -70349 -69459 -30014 5357 -88286 -114246 -123581
7521 -123581 -80359 -61060 21081 15609 -24873 -28738 -28095 -31702 -27825 -88501 -68414 -125732 -163386
7508 -163386 -63938 -96884 -81450 -84196 -127430 -22599 85229 99550 86285 69498 20380
$$ packed form
7594a45312l6923L113L261Q6514j215N5989O4581N1148n098l3868q1707m7193
7582h6710k1315k1115N6871J12128K1061r352J1450m973J07261l1072l5161j10424
7570a1351j04530L9386Q4732j7674K2586K7995j9788l1899r286M178k2824N3786
7558A5311r0669p5740q503J19330Q3379q39m4820J0732j8130p9775j02073o2102
7546b53899Q4787J9511N8247J30788J8585p2386j04J730j2047L0094P5221j02685
7534b2158j04159p2782O0993N0986q707l89K5867Q90L9445L5371r3643k5960r335
7521a23581M3222J9299Q2141n472m0482l865O43l607L877o0676K0087n7318l7654
7508a63386R9448l2946J5434k746m3234J04831J07828J4321j3265j6787m9118
$$ plain form
7497 20380 20156 6564 86681 208528 280513 205518 90746 53604 92692 229357 173516 125126
7485 125126 84755 4602 18255 -79027 -89730 -97801 -110831 -120898 -68188 -19565 -21748 -31689
7473 -31689 -4087 23323 77552 61780 11014 -39441 -44646 -20643 23857 -61786 -91073 -20073
7461 -20073 -40379 -78934 -30895 -30930 43524 66359 84893 52664 32467 15834 -25378 -51299
7449 -51299 -27124 -106759 -108371 -25857 -18514 -43670 41815 112436 137318 69741 23472 -38874
7437 -38874 -83020 -66774 -45923 -23960 -83038 -17996 -40702 -75617 -133748 -128479 -19232 2194
7425 2194 -27009 -87201 -119321 -15054 41789 70677 97107 59320 -1949 -90340 -54325 -79399
7413 -79399 -71327 -109454 -161991 -136574 -91093 -78851 -69779 -45195 -58110 -66825 29876 199878
$$ packed form
7497B0380k24j3592Q0117J21847P1985p4995j14772l7142L9088J36665n5841m8390
7485A25126m0371q0153J3653r7282j0703q071j3030j0067N2710M8623k183r941
7473c1689K7602K7410N4229j5772n0766n0455n205K4003M4500q5643k9287P1000
7461b0073k0306l8555M8039l5P4454K2835J8534l2229k0197j6633m1212k5921
7449e1299K4175p9635j612Q2514P343k5156Q5485P0621K4882o7577m6269o2346
7437c8874m4146J6246K0851K1963n9078O5042k2706l4915n8131N269J09247K1426
7425B194k9203o0192l2120J04267N6843K8888K6430l7787o1269q8391L6015k5074
7413g9399Q072l8127n2537K5417M5481J2242R072K4584j2915q715R6701J70002
$$ plain form
7401 199878 233463 175268 143332 99482 51810 9138 -24001 -21465 -40078 14439 9383 6532
7389 6532 -54454 -89948 -72034 12887 54798 138375 91107 -76557 -218344 -241163 -149090 -80623
7377 -80623 -106915 -132266 -4042 55755 3936 41141 158196 186602 175936 133182 114290
7366 114290 107222 32558 2722 75724 56294 28697 68874 52807 15364 123058 157591 118296
7354 118296 121106 62566 -45537 -39399 -1887 87 -21289 -34402 18939 31701 -13344 -3733
7342 -3733 16224 -27725 -72188 -29560 -13843 -37489 -13298 24331 79957 100271 105263 46480
7330 46480 85682 12199 29258 73918 48179 4053 -19395 -52073 -123724 -130129 -110064 -127200
7318 -127200 -103279 -42648 32049 113919 -6830 -28808 -39930 -121639 -73980 -16222 -77868
$$ packed form
7401A99878L3585n8195l1936m3850m7672m2672l3139K536j8613N4517n056k851
7389F532o0986l5494J7914Q4921M1911Q3577m7268j67664j41787k2819R2073O8467
7377h0623k6292k5351J28224N9797n1819L7205J17055K8406j0666m2754j8892
7366A14290p068p4664k9836P3002j9430k7597M0177j6067l7443J07694L4533l9295
7354A18296K810n8540j08103O138L7512J974k1376j3113N3341J2762m5045R611
7342c733J9957m3949m4463M2628J5717k3646K4191L7629N5626K0314M992n8783
7330D6480L9202p3483J7059M4660k5739m4126k3448l2678p1651o405K0065j7136
7318a27200K3921O0631P4697Q1870j20749k1978j1122q1709M7659N7758o1646
$$ plain form
7307 -77868 -105403 -71945 -103637 -94408 -14388 16126 478 36968 27489 26459 36309 21362 -70484
7294 -70484 -111900 -78804 2351 -87412 -70721 -20464 -56067 -26645 41904 56777 49325 5031
7282 5031 9336 55956 107177 91960 84434 174481 135115 86111 59585 8229 72742 105492
7270 105492 11345 37813 1456 -63049 -80872 -129282 -86723 -78632 -128826 -150162 -73688 -1998
7258 -1998 -99846 -134692 -163401 -59328 -44245 -47791 -92190 -79979 -73825 -104035 -11358 -15965
7246 -15965 -34650 -160322 -169132 -40233 79935 143678 79697 47699 -30944 -111479 -151919
7235 -151919 -105264 8367 91623 144303 116379 67595 57048 67438 61873 78958 123693 102351
7223 102351 64396 31718 37860 -13691 -120613 -126152 -106783 -29627 -29131 30773 127853 170295
$$ packed form
7307g7868k7535L3458l1692R229Q0020L0514j5648L6490r479j030R850j4947r1846
7294g0484m1416L3096Q1155q9763J6691N0257l5603K9422O8549J4873p452m4294
7282E031M305M6620N1221j5217p526R0047l9366m9004k6526n1356O4513L2750
7270A05492r4147K6468l6357o4505j7823m8410M2559Q091n0194k1336P6474P1690
7258a998r7848l4846k8709J04073J5083l546m4399J2211O154l0210R2677m607
7246a5965j8685j25672q810J28899J20168O3743o3981l1998p8643q0535m0440
7235a51919M6655J13631Q3256N2680k7924m8784j0547J0390n565J7085M4735k1342
7223A02351l7955l2678O142n1551j06922n539J9369P7156M96N9904R7080M2442
$$ plain form
7211 170295 205610 177335 100117 27279 -80739 -106359 -83704 -27955 -26333 -56942 -29772 40485
7199 40485 39468 38936 8053 -28229 -33584 -6600 37603 62476 53676 29628 -39640 -43209 -59907
7186 -59907 -75642 -115919 -63900 45468 7905 15490 24441 26740 66409 87041 9123 -33563
7174 -33563 -67274 -63285 40566 82145 10309 -17420 45041 48368 -11919 -9024 50958 -31797
7162 -31797 -63587 -81578 -110120 -84076 -17897 -9182 -38539 -65846 -29157 -93430 -136782 -58696
7150 -58696 25487 81158 91179 37389 -4236 -38599 -104694 -79833 -13115 13904 -94658 -117040
7138 -117040 -48591 -70079 -117835 -181051 -144966 -114551 -25535 10704 -53969 -59705 -24554 67604
7126 67604 87735 -42654 -150494 -181527 -202208 -139207 -42966 -19543 15459 -42109 -32197 37394
$$ packed form
7211A70295L5315k8275p7218p2838j08018k5620K2655N5749J622l0609K7170P0257
7199D0485j017n32l0883l6282n355K6984M4203K4873q800k4048o9268l569j6698
7186e9907j5735m0277N2019J09368l7563P585Q951K299L9669K0632p7918m2686
7174c3563l3711L989J03851M1579p1836k7729O2461L327o0287K895N9982q2755
7162c1797l1790j7991k8542K6044O6179Q715k9357k7307L6689o4273m3352P8086
7150e8696Q4183N5671J0021n3790m1625l4363o6095K4861O6718K7019j08562k2382
7138a17040O8449k1488m7756o3216L6085L0415Q9016L6239o4673n736L5151R2158
7126F7604K0131j30389j07840l1033k0681O3001R6241K3423L5002n7568R912O9591
$$ plain form
7114 37394 131532 146227 122260 142568 74608 -70218 -224571 -214194 -173816 -107622 -60199
7103 -60199 -54683 -6467 -34545 23376 138402 147770 120003 119820 79308 24009 -95628 -136202
7091 -136202 -19016 91854 24767 -56364 -67895 9373 92055 59545 -11853 -20484 -3140
7080 -3140 18481 20040 103739 63501 43185 88713 -22172 -114074 -189487 -255858 -193618 -40361
7068 -40361 29184 95520 140206 94952 103308 44081 30193 68345 18012 -73195 -111379 -171098
7056 -171098 -201185 -138928 -64982 -64643 -103654 -17810 11548 -4523 2451 -48434 21430 31443
7044 31443 -7784 215 -7467 -3842 -77320 -38991 20925 -63027 -215615 -171125 -23322 34566
7032 34566 -16883 85243 127370 132908 158401 118825 96253 72985 122556 91431 70030 40709
$$ packed form
7114C7394R4138J4695k3967K0308o7960j44826j54353J0377M0378O6194M7423
7103f0199N516M8216k8078N7921J15026R368k7767j83m0512n5299j19637m0574
7091a36202J17186J10870o7087q1131j1531P7268Q2682l2510p1398q631J7344
7080c140K1621J559Q3699m0238k0316M5528j10885r1902p5413o6371O2240J53257
7068d0361O9545O6336M4686m5254Q356n9227j3888L8152n0333r1207l8184n9719
7056a71098l0087O2257P3946L39l9011Q5844K9358j6071O974n0885O9864J0013
7044C1443l9227P999p682L625p3478L8329N9916q3952j52588M4490J47803N7888
7032C4566n1449J02126M2127N538K5493l9576k2572k3268M9571l1125k1401k9321
$$ plain form
7020 40709 -5489 -58253 -71109 -113349 -131831 -82923 22770 58582 -39133 -50701 23465 -1108
7008 -1108 -33436 -39217 -39068 12894 -12427 -56585 -114474 -159188 -111152 37613 94318 -22568
6996 -22568 -95678 -94533 -91630 -106756 -8944 24890 28120 28269 -80261 -131726 -110845 -148442 -180338
6983 -180338 -253095 -184696 -63093 -40132 -36008 -49487 -178217 -241855 -210500 -150866 -51052
6972 -51052 -21402 51695 111312 134698 7862 -24229 93326 127576 93093 62867 -47400
6961 -47400 -7150 -15503 -13809 -70219 -103749 -95843 15627 40945 48409 123999 122961 96530 77105
6948 77105 84091 48185 -11316 -91246 -72893 -60921 -3992 -16898 -59869 -57955 -38953 24283
6936 24283 12099 -68087 -70181 -35915 -42955 -58419 -73883 -81150 -133613 -148935 -37888 5720
$$ packed form
7020D0709m6198n2764j2856m2240j8482M8908J05693L5812r7715j1568P4166k4573
7008a108l2328n781J49N1962k5321m4158n7889m4714M8036J48765N6705j16886
6996b2568p3110J145K903j5126R7812L3834L230J49j08530n1465K0881l7597l1896
6983a80338p2757O8399J21603K2961M124j3479j28730o3638L1355N9634R9814
6972e1052K9650P3097N9617K3386j26836l2091J17555L4250l4483l0226j10267
6961d7400M0250q353J694n6410l3530P906J11470K5318P464P5590j038k6431j9425
6948G7105O986l5906n9501p9930J8353J1972N6929j2906m2971J914J9002O3236
6936B4283j2184q0186k094L4266p040j5464j5464p267n2463j5322J11047M3608
$$ plain form
6924 5720 42439 25757 -44331 -60182 -46600 -33110 -33569 -14521 49212 28846 15282 57427
6912 57427 93715 125670 81627 -63589 -167992 -85762 -53124 -45775 -83797 -45369 -24434 -13396
6900 -13396 1962 37440 5119 32323 -5181 -27007 -46808 55703 79839 82981 50477 -34796
6888 -34796 -74425 -67014 -64965 -16754 49225 71274 20518 -10898 -6531 -50563 -124941 -57256
6876 -57256 -76403 -27726 -61810 -85848 -124087 -102198 -106655 -29100 -6271 -119152 -48064 -10792
6864 -10792 -48111 -80358 -57423 -6202 71230 48172 104368 135372 110090 86386 5350 -31904
6852 -31904 -51475 -47990 -2770 67956 5697 38133 -55447 -115671 -120277 -109901 -109482 -77107 25054
6839 25054 93303 83045 7527 1433 -49245 -108129 -108828 -122052 -90512 16877 39585 83714
$$ packed form
6924E720L6719j6682p0088j5851J3582J3490m59J9048O3733k0366j3564M2145
6912E7427L6288L1955m4043j45216j04403Q2230L2638P349l8022L8428K0935J1038
6900a3396J5358L5478l2321K7204l7504k1826j9801J02511K4136L142l2504q5273
6888c4796l9629P411K049M8211O5979K2049n0756l1416M367m4032p4378O7685
6876e7256j9147M8677l4084k4038l8239K1889m457P7555K2829j12881P1088L7272
6864a0792l7319l2247K2935N1221P7432k3058N6196L1004k5282k3704q1036l7254
6852c1904j9571L485M5220P0726o2259L2436r3580o0224m606J0376M19L2375J02161
6839B5054O8249j0258p5518o094n0678n8884o99j3224L1540J07389K2708M4129
$$ plain form
6827 83714 16031 -20 11509 22788 65045 56062 3227 -6133 -56463 -72309 -55483 -11115
6815 -11115 14795 41698 44916 57379 43454 -132 -102818 -19853 71985 36443 46955 52577
6803 52577 198 -22057 -64041 -102774 -69852 -27181 75449 165425 129795 156269 155498 126123
6791 126123 115788 48662 61895 125848 62518 -68726 -167845 -137167 -79852 -40579 -49554 -117055
6779 -117055 -88352 -84811 -119773 -84166 -256 -9578 -49585 -104697 -99115 -39613 -50232 -32370
6767 -32370 -21838 28635 -14370 -20238 -25436 -56408 -85048 -83555 -59783 -66138 -52003 -27923 -33186
$$ packed form
6827H3714o7683j6051J1529J1279M2257q983n2835r360n0330j5846J6826M4368
6815a1115K5910K6903L218J2463j3925m3586j02686Q2965R1838l5542J0512N622
6803E2577n2379k2255m1984l8733L2922M2671J02630Q9976l5630K6474p71k9375
6791A26123j0335o7126J3233O3953o3330j31244r9119L0678N7315L9273q975o7501
6779a17055K8703L541l4962L5607Q3910r322m0007n5112N582N9502j0619J7862
6767c2370J0532N0473m3005n868n198l0972k8640J493K3772o355J4135K4080n263
$$ [...]
##END NTUPLES=NMR SPECTRUM
##END=
