##TITLE=Analysis number 318037
Compound Code ac 35970
Project Code adrs
Chemist Name frontier
##JCAMPDX= 6.0         $$ Bruker NMR JCAMP-DX V2.0
##DATA TYPE= NMR SPECTRUM
##DATA CLASS= NTUPLES
##ORIGIN= Bruker BioSpin GmbH
##OWNER= nmr
$$ XWIN-NMR		Version 3.5
$$ Mon Mar 13 13:59:47 2006 GMT Standard Time (UT+0h)  MAYBRIDGE\nmr@NMR_250MHZ
##.OBSERVE FREQUENCY= 250.131544655141
##.OBSERVE NUCLEUS= ^1H
##.ACQUISITION MODE= SIMULTANEOUS (DQD)
##.ACQUISITION SCHEME= undefined
##.AVERAGES= 16
##.DIGITISER RES= 18
##SPECTROMETER/DATA SYSTEM= dpx250
##.PULSE SEQUENCE= zg30
##.SOLVENT NAME= DMSO
##.SHIFT REFERENCE= (INTERNAL, DMSO, 0, 16.522)
##AUDIT TRAIL= $$ (NUMBER, WHEN, WHO, WHERE, WHAT)
$$ ##TITLE= Audit trail, XWIN-NMR		Version 3.5
$$ ##JCAMPDX= 5.01
$$ ##ORIGIN= Bruker BioSpin GmbH
$$ ##OWNER= nmr
$$ C:\u/data/dgb/nmr/ADRS/590/pdata/1/auditp.txt
$$ ##AUDIT TRAIL=  $$ (NUMBER, WHEN, WHO, WHERE, WHAT)
(   1,<2006-03-13 13:59:28.02 +000>,<MAYBRIDGE\nmr>,<NMR_250MHZ>,
      <created by zg, POWCHK disabled, PULCHK disabled
       configuration hash MD5:
       84 BC 41 DB A1 6E 1D 46 DA 25 12 A5 C1 ED C5 3A
       data hash MD5: 64K
       D9 36 A2 83 5F 20 A3 AC ED DC FF 07 BE 93 0D D3>)
(   2,<2006-03-13 13:59:39.18 +000>,<MAYBRIDGE\nmr>,<NMR_250MHZ>,
      <Start of raw data processing
       ef LB = 0.3 FT_mod = 6 PKNL = 1 SI = 32K 
       data hash MD5: 32K
       B8 C7 07 26 58 C8 03 F0 23 A3 FB 82 4F 07 36 D5>)
(   3,<2006-03-13 13:59:40.87 +000>,<MAYBRIDGE\nmr>,<NMR_250MHZ>,
      <apk 
       data hash MD5: 32K
       BE 8F 16 05 6D 59 04 9D 0C 75 CD FC A5 FD F1 F3>)
(   4,<2006-03-13 13:59:41.73 +000>,<MAYBRIDGE\nmr>,<NMR_250MHZ>,
      <abs ABSG = 5 
       data hash MD5: 32K
       0C 36 2F CC E5 96 57 99 29 0F 9C C4 3B 88 CC 62>)
$$ ##END=
$$ 
$$ hash MD5
$$ E1 70 7B 38 99 D4 2B B2 80 B7 89 EE AE 78 E5 27
##$RELAX= 
##$RELAX= 
##$RELAX= 
##$RELAX= 
##$RELAX= 
##$RELAX= 
##$RELAX= 
$$ Bruker specific parameters
$$ --------------------------
##$DU= <C:\u>
##$EXPNO= 590
##$NAME= <ADRS>
##$PROCNO= 1
##$TYPE= <nmr>
##$USER= <dgb>
##$AMP= (0..31)
100 100 100 100 100 100 100 100 100 100 100 100 100 100 100 100 100 100 
100 100 100 100 100 100 100 100 100 100 100 100 100 100 
##$AQSEQ= 0
##$AQ_mod= 3
##$AUNM= <au_zg>
##$AUTOPOS= <39 >
##$BF1= 250.13
##$BF2= 250.13
##$BF3= 250.13
##$BF4= 250.13
##$BF5= 500.13
##$BF6= 500.13
##$BF7= 500.13
##$BF8= 500.13
##$BYTORDA= 1
##$CFDGTYP= 0
##$CFRGTYP= 5
##$CHEMSTR= <none>
##$CNST= (0..31)
1 1 145 1 1 1 1 1 1 1 1 1 1 1 1 1 1 1 1 1 1 1 1 1 1 1 1 1 1 1 1 1 
##$CPDPRG= <>
##$CPDPRG1= <>
##$CPDPRG2= <>
##$CPDPRG3= <>
##$CPDPRG4= <mlev>
##$CPDPRG5= <mlev>
##$CPDPRG6= <mlev>
##$CPDPRG7= <mlev>
##$CPDPRG8= <mlev>
##$CPDPRGB= <>
##$CPDPRGT= <>
##$D= (0..31)
0 1 0 0 0 0 0 0 0 0.06 0 0 0 0 0 0 0.0002 0 0 0 0 0 0 0 0 0 0 0 0 0 0 
0 
##$DATE= 1142258367
##$DBL= (0..7)
120 120 120 120 120 120 120 120 
##$DBP= (0..7)
150 150 150 150 150 150 150 150 
##$DBP07= 0
##$DBPNAM0= <>
##$DBPNAM1= <>
##$DBPNAM2= <>
##$DBPNAM3= <>
$$ [...]
##$SUBNAM6= <"">
##$SUBNAM7= <"">
##$SUBNAM8= <"">
##$SUBNAM9= <"">
##$SW= 20.6930455092707
##$SWIBOX= (0..15)
0 0 3 0 0 0 0 0 0 0 0 0 0 0 0 0 
##$SW_h= 5175.983436853
##$TD= 65536
##$TD0= 1
##$TE= 294.16
##$TE2= 300
##$TE3= 300
##$TEG= 300
##$TL= (0..7)
0 120 120 120 120 120 120 120 
##$TP= (0..7)
150 150 150 150 150 150 150 150 
##$TP07= 0
##$TPNAME0= <>
##$TPNAME1= <>
##$TPNAME2= <>
##$TPNAME3= <>
##$TPNAME4= <>
##$TPNAME5= <>
##$TPNAME6= <>
##$TPNAME7= <>
##$TPOAL= (0..7)
0.5 0.5 0.5 0.5 0.5 0.5 0.5 0.5 
##$TPOFFS= (0..7)
0 0 0 0 0 0 0 0 
##$TUNHIN= 0
##$TUNHOUT= 0
##$TUNXOUT= 0
##$USERA1= <user>
##$USERA2= <user>
##$USERA3= <user>
##$USERA4= <user>
##$USERA5= <user>
##$V9= 5
##$VALIST= <valist>
##$VCLIST= <CCCCCCCCCCCCCCC>
##$VD= 0
##$VDLIST= <DDDDDDDDDDDDDDD>
##$VPLIST= <PPPPPPPPPPPPPPP>
##$VTLIST= <TTTTTTTTTTTTTTT>
##$WBST= 1024
##$WBSW= 4
##$XGAIN= (0..3)
0 0 0 0 
##$XL= 0
##$YL= 0
##$YMAX_a= 415925
##$YMIN_a= -509042
##$ZGOPTNS= <>
##$ZL1= 120
##$ZL2= 120
##$ZL3= 120
##$ZL4= 120
##$ABSF1= 16.522
##$ABSF2= -4.171173
##$ABSG= 5
##$ABSL= 3
##$ALPHA= 0
##$AQORDER= 0
##$ASSFAC= 0
##$ASSFACI= 0
##$ASSFACX= 0
##$ASSWID= 0
##$AUNMP= <proc_1d>
##$AZFE= 0.1
##$AZFW= 0.1
##$BCFW= 0
##$BC_mod= 0
##$BYTORDP= 0
##$COROFFS= 0
##$CY= 12.5
##$DATMOD= 1
##$DC= 0
##$DFILT= <>
##$DTYPP= 0
##$F1P= 14.0000005364418
##$F2P= -0.99999901652339
##$FCOR= 0.5
##$FTSIZE= 32768
##$FT_mod= 6
##$GAMMA= 0
##$GB= 0
##$INTBC= 1
##$INTSCL= 1
##$ISEN= 128
##$LB= 0.3
##$LEV0= 0
##$LPBIN= 0
##$MAXI= 10000
##$MC2= 0
##$MEAN= 0
##$ME_mod= 0
##$MI= 0
##$NCOEF= 0
##$NC_proc= -3
##$NLEV= 6
##$NOISF1= 0
##$NOISF2= 0
##$NSP= 0
##$NTH_PI= 0
##$NZP= 0
##$OFFSET= 16.522
##$PC= 1
##$PHC0= 162.984
##$PHC1= 5.751531
##$PH_mod= 1
##$PKNL= yes
##$PPARMOD= 0
##$PSCAL= 4
##$PSIGN= 0
##$REVERSE= no
##$SF= 250.13
##$SI= 32768
##$SIGF1= 0
##$SIGF2= 0
##$SINO= 400
##$SIOLD= 32768
##$SREGLST= <1H.DMSO>
##$SSB= 0
##$STSI= 32768
##$STSR= 0
##$SW_p= 5175.98343685301
##$SYMM= 0
##$S_DEV= 0
##$TDeff= 65536
##$TDoff= 0
##$TI= <Analysis number 999999
Compound Code 99
Book Reference 9
Project Code 9>
##$TILT= no
##$TM1= 0
##$TM2= 0
##$TOPLEV= 0
##$USERP1= <user>
##$USERP2= <user>
##$USERP3= <user>
##$USERP4= <user>
##$USERP5= <user>
##$WDW= 1
##$XDIM= 32768
##$YMAX_p= 487132586
##$YMIN_p= -453689
$$ End of Bruker specific parameters
$$ ---------------------------------
##NTUPLES= NMR SPECTRUM
##VAR_NAME=  FREQUENCY,     SPECTRUM/REAL,   SPECTRUM/IMAG
##SYMBOL=    X,             R,               I
##VAR_TYPE=  INDEPENDENT,   DEPENDENT,       DEPENDENT
##VAR_FORM=  AFFN,          ASDF,            ASDF
##VAR_DIM=   32768,         32768,           32768
##UNITS=     HZ,            ARBITRARY UNITS, ARBITRARY UNITS
##FACTOR=    0.157963299565203, 1,           1
##FIRST=     4132.6476996994, 0,             0
##LAST=      -1043.33573715361, 0,           0
##MIN=       -1043.33573715361, -453689,     0
##MAX=       4132.6476996994, 487132586,     0
$$ Real data points
##PAGE= N=1
##DATA TABLE= (X++(R..R)), XYDATA
$$ [...]
16427c7201j39l4404R541M6211P425j842l6571J76J1790J903O833p780K5800n9900
16413f8158j5970P735J3305Q536J661K5885K3254N1510N653l810m3680o324j1626
16400a2029j6743J7860K5713J0874J7909j7367k1487J4605J6899l119R822n5142
16388a2205l5140J3406N20J147j1077r172L1558K5639j3856m197j8306j3951J6284
16375b9350n071k4983L3432L3504K278q595J4651K967n743j6643p793K0235J1965
16362B0854n037l526j8034l7952J9443N0335J1762r251J7524l574j58k298k3389
16349A6699J309n589j7043K2201M23l8758o193o496r115m5144R246N3965L7592
16336A3097M097j638K1361m8585j5614K3917M203Q96j9769k0432j9493J664J1771
$$ plain form
16427 -37201 -37340 -71744 -62203 -15992 -8567 -10409 -46980 -46804 -35014 -33111 -26278 -34058 -8258 -68158
16413 -68158 -84128 -76393 -63088 -54552 -52891 -27006 -3752 47758 53411 49601 5921 -403 -12029
16400 -12029 -28772 -10912 14801 25675 43584 26217 4730 19335 36234 33115 42937 -12205
16388 -12205 -47345 -33939 -33419 -32272 -43349 -52521 -20963 4676 -9180 -13377 -31683 -45634 -29350
16375 -29350 -34421 -59404 -25972 7532 9810 1215 15866 18833 13090 -3553 -11346 8889 20854
16362 20854 15817 12291 -5743 -43695 -24252 26083 37845 28594 46118 42544 42386 40088 16699
16349 16699 18008 12419 -4624 17577 18000 -20758 -26951 -33447 -42562 -87706 -78460 -24495 13097
16336 13097 17194 15556 36917 -11668 -27282 -3365 838 1734 -18035 -38467 -57960 -56296 -44525
16323d4525j0936J7039J6880M0053J2025k7084R166J291j4230j2911K2718o98
16311H788r585K5011l0379p200j865R97p133J6353n655l843J4905L648k2393K900
16297a5451K7652l785l306n876l7266q382J9352J6959M2347K5157K1921j2587
16285F6735j8531p562q058o980K6104j1141l4894L108k7873j4575L2427j3037
16273a4277J9530j6225l2013p618K6737K131K461J6793q571J7988j6130j1080
16261b0274M9226K5526n4604n6107J8862J0547R160L0620K8551Q176n933o183
16249C7567Q788J1327k4666l3017K3552L3309l4555q000j7669j3878j6104m715
16237c8061o230J1749n99J5094J8188P766O813K714J0541L9658j5415l3520m351
$$ plain form
16323 -44525 -55461 -38422 -21542 18511 30536 3452 12618 13909 -321 -13232 9486 8788
16311 8788 -797 24214 -6165 -13365 -15230 -14233 -21366 -5013 -10668 -14511 394 4042 -18351 -15451
16297 -15451 12201 8416 5110 -766 -38032 -46414 -27062 -10103 32244 57401 79322 66735
16285 66735 48204 40642 32584 25604 51708 40567 5673 8781 -19092 -33667 -1240 -14277
16273 -14277 5253 -10972 -42985 -50603 -23866 -21735 -19274 -2481 -11052 6936 -9194 -20274
16261 -20274 28952 54478 -126 -56233 -37371 -26824 -17664 12956 41507 49683 43750 37567
16249 37567 46355 57682 33016 -1 23551 56860 22305 14305 -3364 -17242 -33346 -38061
16237 -38061 -44291 -32542 -33141 -18047 141 7907 14720 17434 27975 67633 52218 18698 14347
16224A4347r399q540k265l339j3290o642J1905J0801J7559J4973j2959l7236j2280
16211c6365K9762J3714j9745n1455l2099J7816P0069J2227k8613J3182q887k1311
16199d1705K7496K4506q838m1763J442P659K1898P56l697J2761n958o374K269
16186i548J533J6063J1008j3439N850k8078k4612j080J5149K3227L3818l6703
16174f812m6795j1033N496k324M424L3763N3800m5273n8984J6768M1490L830J1500
16161a50J8458n282j783P919n441K1290j6077n2095m7588k7142k979M5042N1782
16148a4046J7506j1425l734j2342j0445J3961R897R053j2577j8699k80J5057J4715
16135c359K6967l1198j9291j0774N939R488K018l404k3138K6565K5355K717l0889
$$ plain form
16224 14347 4948 -3592 -5857 -9196 -22486 -29128 -17223 -6422 11137 26110 13151 -24085 -36365
16211 -36365 -6603 7111 -12634 -64089 -96188 -78372 -8303 3924 -24689 -11507 -20394 -41705
16199 -41705 -14209 10297 1459 -40304 -38862 -31203 -9305 -8549 -12246 515 -5443 -11817 -9548
16186 -9548 -8015 8048 19056 5617 11467 -16611 -41223 -42303 -27154 -3927 29891 -6812
16174 -6812 -53607 -64640 -59144 -61468 -57044 -23281 30519 -14754 -73738 -56970 -15480 -11650 -150
16161 -150 18308 13026 11243 19162 13721 35011 18934 -33161 -80749 -107891 -110870 -65828 -14046
16148 -14046 3460 -7965 -11699 -24041 -34486 -20525 -10628 -1575 -14152 -32851 -33131 -18074 -3359
16135 -3359 23608 -7590 -26881 -37655 -31716 -22228 -20210 -23614 -46752 -20187 5168 7885 -23004
16122b3004K3651J0336l5988J0304L0210q568l1723n4348J9792M7324L218K2287
16110A3491M3388o254j4554l1106k2997k0060J0194L859O008N62q00k3104O068
16097c5305n05K7156q168J1277J5475L4478J9720N770J0509J9686j3000n0834
16085C6259k3662L2832j1940n6707J1744J9453J1358K9851q174j7582j5147k609
16073E676J092n923Q092n075j0943j6758J7443j368j1131L0108L107j5792n780
16060g252k852J1588J0147J2437P430j5457M303j1481k8824j6363K7754q009k5534
16047d2113P979o99j5129J583J6630K6395L6786n20j290K5452j5727m5669k9075
16034c5397o611J7591K7757m3578j1053K6825j3225q649J0959K3767L713K0554
$$ plain form
16122 -23004 647 10983 -25005 -14701 15509 6941 -24782 -79130 -59338 -12014 -8796 13491
16110 13491 56879 50625 36071 4965 -18032 -38092 -27898 -24039 -18031 -17469 -18269 -41373 -35305
16097 -35305 -35810 -8654 -16822 -5545 9930 44408 64128 69898 80407 100093 87093 36259
16085 36259 12597 45429 33489 -23218 -11474 7979 19337 49188 41014 23432 8285 5676
16073 5676 6768 845 8937 3862 -7081 -23839 -6396 -7764 -18895 11213 14320 -1472 -7252
16060 -7252 -10104 1484 11631 24068 31498 16041 20344 8863 -19961 -36324 -8570 -16579 -42113
16047 -42113 -34134 -34833 -49962 -48379 -31749 -5354 31432 30912 29622 55074 39347 -6322 -35397
16034 -35397 -42008 -24417 3340 -40238 -51291 -24466 -37691 -46340 -35381 -11614 -7901 12653
16022A2653j8279j335j3575k6593q26K8005J4200K3859K2061k1189j5944J5751
16010A8788j0804J4393Q510j8217j489J8932J6443p333r025o372K479J676J0900
15997C8881M100O515J1321O3j2890k2079l2841n701K4563O72j8245M288l392j3835
15983a8580l4965K140J4304J5368J7971M899l8060j7282L500j776K6682N4647
15971B8848n784j7586j5340K3472j0708J3730L1554L285j6539q450J5426j9163
15959B2745J2060j2649m533j8996M451j026K2064r639j897k8081k641K4817L9558
15946D6233j1486k9657k7192j1747K4293K470j85k1484k6278N79M1847J6500O605
15933A0498j1226k0311m635K4624m295l1742n107J2386q695k3900K2782K0884
$$ plain form
16022 12653 -5626 -6961 -20536 -47129 -47955 -19950 -5750 18109 40170 18981 3037 18788
16010 18788 7984 22377 30887 12670 11181 30113 46556 39223 30198 23826 26305 27981 38881
15997 38881 42981 49496 60817 60880 47990 25911 -6930 -12631 11932 12604 -5641 -1353 -4745 -18580
15983 -18580 -53545 -51405 -37101 -21733 -3762 1137 -36923 -54205 -50705 -52481 -25799 28848
15971 28848 23064 5478 -9862 13610 2902 16632 48186 51471 34932 26482 41908 22745
15959 22745 34805 22156 17623 -1373 3078 2052 24116 14477 12580 -15501 -18142 6675 46233
15946 46233 34747 5090 -22102 -33849 -9556 -7086 -7271 -28755 -55033 -54454 -12607 3893 10498
15933 10498 -728 -21039 -25674 -1050 -5345 -37087 -42194 -29808 -38503 -62403 -39621 -18737
15921a8737J0256Q670J2199r260l340j0227J863j601k1543k762j1644k574l585
15908e2285J9705M3567K0312j6731n636k335J5470K2K0930p515k4100Q929j039
15895A9294J369O207P65m8221n116K2567r431P431q542m619R712J8775n144p200
15881b153K7545k5414k0842K0703j7413L86q416J276M874j7322J0533K2796M772
15868A325L9935K881N436j3951m838j9866j1682q63l3526k9507j0656p069J990
15855h0391L3179L0204J9109K741l927k1477k3870k2400J3876L4692Q831j8083
15843b7516p488L2553R708j7051M3091L8549j6467k1460m0747j3228J3M4958k874
15830B2041j5877j2075m0668K784K1818J4201j2153n362l8333j9551J9038J6115
$$ plain form
15921 -18737 -8481 189 12388 3128 -212 -10439 -8576 -10177 -31720 -34482 -46126 -48700 -52285
15908 -52285 -32580 10987 31299 14568 8932 6597 22067 22089 43019 35504 11404 20333 19294
15895 19294 20663 26870 27635 -20586 -25702 -3135 -12566 -5135 -13677 -18296 -8584 10191 5047 -2153
15881 -2153 25392 -22 -20864 -161 -17574 -17188 -25604 -24328 -19454 -36776 -26243 -3447 1325
15868 1325 41260 44141 49577 35626 30788 10922 -760 -1623 -35149 -64656 -75312 -82381 -80391
15855 -80391 -47212 -17008 2101 4842 915 -20562 -44432 -66832 -52956 -18264 -9433 -27516
15843 -27516 -35004 -2451 7257 -9794 33297 71846 55379 33919 -6828 -20056 -20043 24915 22041
15830 22041 6164 -5911 -46579 -43795 -21977 -7776 -19929 -25291 -63624 -83175 -64137 -48022
15818d8022J1606J8929K1032K4586j6671l0820j1478k337l926K1093K3854r304
15806a458K518J4117J4319l4620k6447K7482N320J05j1317l0184m0749J75L3844
15793d6895M5523L944M870k6143j9880M2122K7430k0251l3210m0523K7244O9594
15781C3825P529r650j8961J1898j4376m293l254R150M638k2930K4162j9644L289
15768A383k088j8759J1628j7402k0138l055J9622J0564K4175j0908r0J3173Q202
15755A6307L1097L743R96m2442k1120K3447p33P212l562Q140j6348J3769k864
15742A7642O81O736j0770o813J2083O275K2123K0138k0627j8436n808j1400j1205
15729F19R734M73N771K4783j0654k959k250l0403j5724j9984j7657K9506o293
$$ plain form
15818 -48022 -36416 -17487 3545 28131 11460 -19360 -30838 -33175 -37101 -16008 7846 -1458
15806 -1458 1060 15177 29496 -5124 -31571 -4089 1231 1336 -9981 -40165 -80914 -80739 -46895
15793 -46895 -1372 2572 7442 -18701 -38581 3541 30971 10720 -22490 -63013 -35769 33825
15781 33825 41354 31704 12743 24641 10265 5972 2718 11868 16506 -6424 17738 -1906 1383
15768 1383 -705 -19464 -7836 -25238 -45376 -48431 -28809 -18245 5930 -4978 -5068 8105 16307
15755 16307 47404 51147 52143 9701 -11419 12028 11295 18507 14945 23085 6737 20506 17642
15742 17642 18323 25059 14289 7476 19559 25834 47957 68095 47468 29032 23224 11824 619
15729 619 10353 10826 16597 41380 30726 27767 25517 -4886 -20610 -40594 -58251 -28745 -35038
15716c5038j1060J4636O793J8296M580l691K2054L7374P453m1826r250K7337k1441
15703A6217r855k2220j6966K1011j7714O101J6557J1489k1883l0009M0021N9626
15691E2375q014j6943L1315j6063n92j6496J6993L1735l188l5652j7540j891j3840
15678B199K819K5298r195n7399r141j3409n0761N0926L8822R861K7414J2384l2414
15665b596k6820j966M7687O5559n204l891l6873j6372k1513k0736K2140L7567
15653C6982J0055m535J3578j5662k9312k9478K1893K8625Q176m5054j4822n829
15641b5383J621K82N503J4112J1169q021J751o817L3835K8965k9195m9302k4575
15628d6055O564K8830J6335j2641j2866m179q064j1104K2660J6290K5596J4695
$$ plain form
15716 -35038 -46098 -31462 -24669 -6373 -1793 -5484 16570 53944 61397 19571 10321 37658 16217
15703 16217 6362 -15858 -32824 -11813 -29527 -23426 -6869 4620 -17263 -47272 -7251 52375
15691 52375 44361 27418 58733 42670 42078 25582 42575 74310 71122 35470 17930 16039 2199
15678 2199 5018 30316 21121 -36278 -45419 -58828 -109589 -58663 -19841 -9980 17434 29818 -2596
15665 -2596 -29416 -31382 16305 81864 76660 72769 35896 19524 -1989 -22725 -585 36982
15653 36982 47037 42502 56080 40418 11106 -18372 3521 32146 40322 -4732 -19554 -25383
15641 -25383 -23762 -23480 -17977 -3865 7304 -717 1034 -5783 28052 57017 27822 -21480 -46055
15628 -46055 -39491 -10661 5674 -6967 -19833 -24012 -32076 -43180 -20520 -4230 21366 36061
15616C6061j5243J4810k7155k177J3907j5979J043J6577Q533q584O158o316k2614
15603i79j2956J7710N294j2970k1697J1972J5200O158l6589k0165L7337J1817
15591A32M637o374l7522j4128J5113J0722k6162j1424M0211M452l017L2482M1810
15578E0932j0827q744r766J337k870J9841J3224q676K5654M4469j9580l7531n91
15565E6872K0694j9636l1370k5482k9932j6929K9380K575N580j1666m953j7948
15553d2815n64O562J5411Q063J8163K2070j5543M818j2738q307q722j5435j356
15540c0393j6319K6522J8694N3009p211j9172j2397J0598M357j2507K73j2243
15528C211j9675P926J2133l653l3123N515J6542K9967J088m5150J3317j1347q10
$$ plain form
15616 36061 20818 35628 8473 6296 20203 4224 5267 21844 30377 21793 27951 21635 -979
15603 -979 -13935 3775 9069 -3901 -25598 -13626 1574 7732 -28857 -49022 -11685 132
15591 132 4769 -1605 -39127 -53255 -38142 -27420 -53582 -65006 -24795 -20343 -23360 9122 50932
15578 50932 40105 31361 21595 22932 20062 39903 53127 44451 70105 114574 94994 57463 56872
15565 56872 77566 57930 26560 1078 -28854 -45783 -16403 -13828 -8248 -19914 -24867 -42815
15553 -42815 -43379 -36817 -21406 -13343 4820 26890 11347 16165 3427 -4880 -13602 -29037 -30393
15540 -30393 -46712 -20190 -1496 51513 44302 25130 12733 23331 27688 15181 15454 3211
15528 3211 -16464 -8538 3595 -58 -33181 -27666 -11124 18843 19931 -25219 -11902 -23249 -24059
15515b4059K3208n8645l1295J2249L7836J6119r213K2414Q657J967L7666J9521
15503E6425k8165l330k6011J1603R837m396j5477K801q101n0305k597J6429J5712
15490b5575j5885q291M1759J796l236q139l7672Q218M7518J3055l3108k2983N0504
15477G961N0394m0058m6890K4345q367J7969N488J202L858L0843k0624j6400q277
15464A444J5819J435l4203j0263n229J6806J5861j707K5015j1550j9030k6856
15452c2458j8881j8191r956j3617M1283J7790J7365M3910J6222R714l3863j3719
15440E599j5658l2642k7693J1174K8521L215R860M6608R427l1800m5304O891N773
15427b6029k921J4625k0735n6562m5617J2873N2544K3631J0561K3089O884M0833
$$ plain form
15515 -24059 -851 -59496 -90791 -78542 -40706 -24587 -33800 -11386 -2729 -762 36904 56425
15503 56425 28260 24930 -1081 10522 20359 15963 486 3287 -4814 -55119 -57716 -41287 -25575
15490 -25575 -41460 -49751 -7992 -6196 -9432 -17571 -55243 -47025 493 13548 -19560 -42543 7961
15477 7961 58355 18297 -28593 -4248 -12615 5354 10842 12044 15902 46745 26121 9721 1444
15464 1444 17263 18698 -15505 -25768 -30997 -14191 1670 -37 24978 13428 -5602 -32458
15452 -32458 -51339 -69530 -79486 -93103 -51820 -34030 -16665 27245 43467 53181 19318 5599
15440 5599 -10059 -42701 -70394 -59220 -30699 -27484 -17624 28984 38411 6611 -38693 -31802 -26029
15427 -26029 -28950 -14325 -35060 -91622 -137239 -124366 -71822 -48191 -37630 -14541 -7657 33176
15415C3176J9605k5496j4336j2823n870n846j9340M267P218J9883J3325j7000
15403c237N153l421J4283K2374j1000k9828m222J0525J1253k95j8830k8202K0819
15390a4628n436k2689j8244l50K0770M6709l500R197J7801j4377l5851J7779P511
15377D692k9m857k0938k4074K5819n23k4638J6577L288j7994m483J2778j187J5521
15363b0048J7172m682J1510R972k5702j5339R067j126j4670k314l307N722R93
15350c2752k706M3881j3746P217J1806j701k7817J7270J2414J5804j1793K631
15338B0508K206J2957n031j3853J9466q16R767m580l4815P323Q03j0431k9032
15325b5528j1779j719J1192k99O804m973k8087J2254m253n460K2796M4441J5992
$$ plain form
15415 33176 52781 27285 12949 126 -5744 -11590 -30930 -26663 -19445 438 13763 -3237
15403 -3237 1916 -1505 12778 35152 24152 -5676 -9898 627 11880 11585 -7245 -35447 -14628
15390 -14628 -20064 -42753 -60997 -61347 -40577 6132 2632 11829 29630 15253 -20598 -2819 4692
15377 4692 4663 -194 -21132 -45206 -19387 -19910 -44548 -27971 -24683 -42677 -47160 -34382 -35569 -20048
15363 -20048 -2876 -7558 3952 13924 -11778 -27117 -18050 -19176 -33846 -36160 -39467 -33745 -32752
15350 -32752 -35458 8423 -5323 1894 13700 11999 -15818 1452 13866 29670 17877 20508
15338 20508 22714 35671 30640 16787 36253 35437 45204 40624 5809 13132 13935 3504 -25528
15325 -25528 -37307 -39026 -27834 -28133 -21329 -26302 -54389 -42135 -46388 -51848 -29052 15389 31381
15312C1381j7280n8274m523J1507N1945J269n0331j2093K0061k432J0452J9982
15300A664L508r821l4321L057L2278L5265k0873m1841j9772j4942q883k622K2127
15287e5176J2239j2713J181K58j2613J2451J3729K6900k771n7751j5534J8209
15275g1591L4032N5262l870l4664k5832L257M0926L9922j9715j2362k4411j3117
15263c2163R277K4687J9335m457n0978j0889O310J8117L6460L686m184j9197J2222
15250H226K931n220L422J9302r814k3549P856K3769j7301l4842l3382P246N1126
15237b30K322J8249j4151l168r493k0079j4466K0553M304r78K143P070K8651m1438
15223b0711k3871J8153J6415p957k2629m0105k447m077J3541L8304L3813r382
$$ plain form
15312 31381 14101 -44173 -48696 -37189 14756 16025 -34306 -46399 -26338 -28770 -18318 1664
15300 1664 5172 -4649 -38970 -35913 -3635 31630 10757 -31084 -50856 -65798 -74681 -77303 -55176
15287 -55176 -42937 -55650 -54469 -54211 -66824 -54373 -40644 -13744 -16515 -74266 -89800 -71591
15275 -71591 -37559 17703 13833 -20831 -46663 -43406 -2480 37442 17727 5365 -19046 -32163
15263 -32163 -22886 1801 21136 16679 -34299 -45188 -38878 -20761 15699 19385 15201 -3996 8226
15250 8226 11157 5937 9359 28661 18847 -4702 3154 26923 9622 -25220 -58602 -51356 -230
15237 -230 2092 20341 6190 3022 -6471 -26550 -41016 -20463 -16159 -17137 -14994 -7924 20727 -20711
15223 -20711 -44582 -26429 -10014 -17971 -40600 -80705 -83152 -87229 -73688 -35384 -1571 -10953
15211a0953J0553O427J978j4647J871k3776j1753K5063J0398K3001o457j2062
15199c57N725J2111j4608j7562k0702k9555k644j2248L4765L2576J3700l7104
15187c5903j3549j3444R475P1742R578l5618m1662J2306K3799o910J2275P129
15175g82k7227L1870K6868k7987k0762j4718o575M67j303k1917L7902K5043J498
15162B377K1378L549p697K270r393k2563q162M602l022j4939n791K3545K4378
15149A0532j9761J4276M938k5817j3629l1986k2887n625J5172M2602j68j5418
15137d7771L6461Q463L680J9132j1019l1339r18K6758q678l5244k3134J9036L5450
15124i123L3236j6814j2654r060k11O961j2147P596M5246o992m5009l1541j4630
$$ plain form
15211 -10953 -400 6027 8005 -6642 -4771 -28547 -40300 -15237 -4839 18162 11705 -357
15199 -357 5368 17479 2871 -14691 -35393 -64948 -67592 -79840 -45075 -12499 1201 -35903
15187 -35903 -49452 -62896 -53421 18321 27899 -7719 -49381 -37075 -13276 -20186 -7911 -782
15175 -782 -28009 3861 30729 2742 -18020 -32738 -39313 -38846 -40149 -62066 -24164 879 2377
15162 2377 23755 27304 19607 21877 12484 -10079 -18241 -13639 -16661 -31600 -37391 -13846 10532
15149 10532 -9229 5047 9985 -15832 -29461 -61447 -84334 -89959 -74787 -32185 -32353 -47771
15137 -47771 -11310 -2847 833 19965 8946 -22393 -23311 3447 -5231 -40475 -63609 -44573 -9123
15124 -9123 24113 7299 -5355 -14415 -14626 -7665 -19812 -12216 33030 26038 -18971 -50512 -65142
15111f5142L9156J0632l9510k0707M5148M5515r282j2015J345R818J6293j9335
15099A916j1082o628J9806K4j9053l41j6584k6840j2526L2783K4192L488j7681
15086b8526J5811k732l401m1835J5991J8321j7969L789J4996N245j0640o66J8273
15073a3343P105K0993J2388j6853j3180Q499J7532k4357L486q516J2461o239n097
15060e121l190k3982J9787K7427k3047l2246O340K5812J4879l706J0031K5999
15048C8983k9325l6134j1948L5777O31k9831J8910J6246O966J902J0927Q813J1906
15035D3823j2699r996K496M1777n604K591n405m4677j0424j0803j5246j2720L645
15022c3242l044K547M2879R433j8716J3132l9981J3138M2512L905m0744p145p33
$$ plain form
15111 -65142 -25986 -15354 -54864 -75571 -30423 15092 5810 -6205 -4860 4958 21251 1916
15099 1916 -9166 -15794 4012 4036 -15017 -15358 -31942 -58782 -71308 -38525 -14333 -10845 -28526
15086 -28526 -12715 -15447 -18848 -60683 -44692 -26371 -44340 -40551 -25555 -20310 -30950 -31616 -13343
15073 -13343 -6238 14755 27143 10290 -2890 5609 23141 -1216 2270 -6246 6215 -24 -5121
15060 -5121 -8311 -32293 -12506 14921 -8126 -40372 -34032 -8220 6659 2953 12984 38983
15048 38983 9658 -26476 -38424 -2647 -2016 -31847 -12937 3309 10275 12177 23104 31917 43823
15035 43823 31124 21128 23624 65401 59797 62388 56983 12306 1882 -8921 -24167 -36887 -33242
15022 -33242 -36286 -33739 9140 18573 -143 12989 -26992 -13854 28658 32563 -8181 -15326 -16059
15009a6059k9636o7393K6335O8121L8201K8398m107o409m3078m1356J6735P546
14997b2702J3367J8188K8167k7035k7189J8309K597r937j3236J1826J3422l3286
14985b7509K8721M3587K0378k3120k5809j5715P282L0377J2656J5572l9946k5032
14973A442R982P693N369j6230j3922n973Q53p465p506J7835j327k5687J9390K9946
14959A4400K0185N396l2819k8168J952J8481J4873r624k4174j1742J8253J5974
14947B987k0819J1550L8752j980l8710k549k3594J943K7943Q706J4912m52k2118
14934c429j150J8507k2136r875O354L6066J4820O213m0079l5066l702K731k3056
14921e3802r439L4236L3466J8254j6113o434j8487l652n626J889M8826J7518J770
$$ plain form
15009 -16059 -45695 -113088 -86753 -18632 19569 47967 43860 37451 -5627 -46983 -30248 -22702
14997 -22702 -9335 8853 37020 9985 -17204 1105 3702 -6235 -19471 -7645 5777 -27509
14985 -27509 1212 44799 65177 42057 16248 533 7815 38192 50848 66420 26474 1442
14973 1442 11424 19117 24486 8256 -5666 -11639 -10786 -18251 -25757 -7922 -9249 -34936 -15546 14400
14959 14400 34585 39981 7162 -21006 -19054 -573 14300 4676 -19498 -31240 -12987 2987
14947 2987 -17832 -6282 32470 30490 -8220 -10769 -34363 -32420 -4477 4229 19141 18689 -3429
14934 -3429 -4579 13928 -8208 -18083 -11729 24337 39157 45370 5291 -29775 -33477 -30746 -53802
14921 -53802 -63241 -29005 4461 22715 6602 168 -18319 -21971 -27597 -25708 23118 40636 42406
14908D2406M527m9800k5821l264O290k08j3480j4608K6625M813K8179O07j7161
14895a0895J8134j9369N570m010J9567o438j7611m4722p4K0773K708M2245L2172
14882C8050L564K6166n756j6069p430l5140k2701k1663L2277L6338j7986j0090
14870d40j2465l4781l1290N9225J2939j0124l4693j0361N1645O103K5578j3995
14858G341k5034K179m197j6955L6001K2200l4603j8438M989J0935M298P355L448
14845d81Q496K9204m256n3506o125k2684o711L6871J3196k1219p521M2549J0113
14832A7926k5685J2941J3414P392N206k8083k7179J1635k954j412k1473K9148
14820i124L8537M4061r760o0090L665j4167l5747k170M2587j5833j804J7354O751
$$ plain form
14908 42406 46933 -2867 -28688 -31952 -25662 -25870 -39350 -53958 -27333 -22520 5659 6266 -10895
14895 -10895 7239 -12130 -6560 -10570 8997 2559 -15052 -59774 -59848 -39075 -36367 5878 38050
14882 38050 41614 67780 62024 45955 38525 3385 -19316 -40979 -8702 27636 9650 -440
14870 -440 -12905 -47686 -78976 -19751 -6812 -16936 -51629 -61990 -10345 -4242 21336 7341
14858 7341 -17693 -15514 -19711 -36666 -665 21535 -13068 -31506 -26517 -15582 -11284 -3929 -481
14845 -481 8015 37219 32963 -20543 -26668 -49352 -56063 -19192 -5996 -27215 -34736 7813 17926
14832 17926 -7759 5182 18596 25988 31194 3111 -24068 -12433 -15387 -16799 -38272 -9124
14820 -9124 29413 73474 63714 3624 7289 -6878 -42625 -44795 -2208 -18041 -19845 -2491 4260
14807D260o11l0411m4462J2462K2546J7925j0490K7092o209J0589L1435K8824
14795F2950M249l046j3826k9018j2934j3248L715P554L403q056M486P810o357
14782G682J4293k5257k9739L3511K0525k3099O392j6860k1867j1721L1438J1042
14770c660K0330J9877m317k0249l5974j6191k8286j4172L0514L5187J9156P65
14758B980k1919M195m6647j1754K8110K4300K9098J9401k2367m512n385k7983
14746c2483j722J7359m0539k0758L8240K5238K290m927J204J219L606M104K0501
14733A3332K2960j4946m5321j0176n424Q370l677r486J5750J8604L621m4512k2024
14720g2929L465O1912J714k0190J167L1144k085j2147q946K6670J0610j1184j962
$$ plain form
14807 4260 3649 -26762 -71224 -58762 -36216 -18291 -28781 -1689 -7898 2691 34126 62950
14795 62950 67199 64153 50327 21309 8375 -4873 -1158 6396 9799 1743 6229 14039 7682
14782 7682 21975 -3282 -33021 490 21015 -2084 4308 -12552 -34419 -46140 -14702 -3660
14770 -3660 16670 36547 32230 11981 -23993 -40184 -68470 -82642 -52128 -16941 2215 2980
14758 2980 -18939 -14744 -61391 -73145 -45035 -20735 8363 27764 5397 885 -4500 -32483
14746 -32483 -34205 -16846 -57385 -78143 -39903 -14665 -12375 -17302 -16098 -14879 -11273 -7169 13332
14733 13332 36292 21346 -23975 -34151 -39575 -31205 -34882 -44368 -28618 -10014 -6393 -50905 -72929
14720 -72929 -69464 -7552 -5838 -26028 -24861 6283 4198 -7949 -16895 9775 20385 9201 7239
14707G239J2503J0985l766K5606m803o0863j2318j7878J0209L2905Q915j6148
14695g414r440J636q994K9152j3266J1553Q841l9665j1396J740J4301K2080J335
14682D63j3437k1823QL3878j1182j0154K0240L620l0222r103K0835K6799r718
14669B04r566n199L0415K8114j4275O347j6227m8213K1321M705L652k1544J503
14656a8763j9444R399J4734p879o238j987j6025L0209M5648J9670l5092j4052
14644A80O71p7m816N21Q577j9016p240q411n838J1545j3084q959J8453n974K3160
14629a0308M8686q707P384l7536q227J77J2788j77j6707o385j9572N875J9048
14616a3661k4807j0553J7169K237j2159J3148k0184M656Q267r818J8175R731J3334
$$ plain form
14707 7239 19742 30727 26961 52567 47764 -13099 -25417 -43295 -33086 -181 8734 -7414
14695 -7414 -16854 -15218 -24212 4940 -8326 3227 12068 -27597 -38993 -37253 -22952 -872 463
14682 463 -12974 -34797 -34789 -911 -12093 -22247 -2007 1613 -28609 -37712 -16877 9922 204
14669 204 -9362 -14561 15854 43968 29693 36040 19813 -28400 -7079 -2374 1278 -20266 -18763
14656 -18763 -38207 -28808 -14074 -21953 -28191 -30178 -46203 -15994 29654 49324 14232 180
14644 180 851 774 -4042 -3521 5056 -13960 -21200 -29611 -35449 -23904 -36988 -45947 -27494 -33468 -10308
14629 -10308 38378 29671 37055 -481 -8708 -8531 4257 4080 -12627 -19012 -38584 -32709 -13661
14616 -13661 -38468 -49021 -31852 -29615 -41774 -28626 -48810 -44154 -35887 -45705 -27530 -17799 -4465
14603d465j8213j7416j700K8813q660L465L1627l9343k9682J5915J9711K233J7169
14590e46n0463N89L8362O872J0653J8173l9485m1365N4296K0939k6857l4028Q316
14577c4544L1017k2079k796J7767q226l1162O781K9194L3739q572l4285N000K555
14564a5611J1227L3385k878k2759J021o946j1072Q86Q099J0796r564j5997L8602
14551A9189J2365m333r27j305q048k2302J1448j9845Q165L0676j857l523k2938
14538c235k5686J5288r132j5645J0273j7766K3831J1187j8437P406O017K2417
14526F518j1413J7585K9162J1711k0681j6846j2441k6379j9087J1727j0995k7675
14514f8814K6858J1328j3305l5541P88L1615J2467K0402O65m7k711K4157R887
$$ plain form
14603 -4465 -22678 -40094 -41794 -12981 -21641 -18176 13451 -25892 -55574 -39659 -19948 -17715 -546
14590 -546 -51009 -50420 -12058 -5186 5467 23640 -15845 -57210 -2914 18025 -8832 -42860 -34544
14577 -34544 -3527 -25606 -28402 -10635 -18861 -50023 -43242 -14048 19691 11119 -23166 -18166 -15611
14564 -15611 -4384 29001 26123 3364 4385 -2561 -13633 -12747 -4648 6148 -3416 -19413 19189
14551 19189 31554 27221 26294 24989 16941 -5361 6087 -13758 -5593 25083 23226 19703 -3235
14538 -3235 -28921 -13633 -22765 -38410 -28137 -45903 -22072 -10885 -29322 -21916 -15899 6518
14526 6518 -4895 12690 41852 53563 32882 16036 3595 -22784 -41871 -30144 -41139 -68814
14514 -68814 -41956 -30628 -43933 -79474 -78686 -47071 -34604 -14202 -13537 -13584 -16295 7862 17749
14501A7749J8092J029j4061o690q540j1399j9423l5293k4922q829K3440P7919
14489I072J0545l9237k593N633k3965k1420K6198J3183J7354M2467J3466l9679
14477A1024l6069m0036J5967J6989R715K4993K1883r314k5295J467r179L0153
14465A2298p096r749J7825K0684j6676K5372K4035l2669k0668O608J073R84j1069
14452A0952j6321j2922O913j8754j9850K9793M1069J4555P725r855k3328j5043
14440e066M277M18N963J4072n017l9724p624J0680M6821j5088M834m0669r376
14427c5499K3631L2892L4409j8859k7076m2460j8728Q921O891K3036K353K2754
14415A2265k4279l0133j5192K1899J7092M008J2749k653P613K6193m602j3799
$$ plain form
14501 17749 35841 36870 22809 16119 7579 -3820 -23243 -58536 -83458 -92287 -68847 9072
14489 9072 19617 -19620 -22213 -16580 -40545 -61965 -35767 -22584 -5230 37237 50703 11024
14477 11024 -25045 -65081 -49114 -32125 -22410 2583 24466 15152 -10143 -8676 -17855 12298
14465 12298 5202 -4547 13278 33962 17286 42658 66693 34024 13356 19964 21037 22021 10952
14452 10952 -5369 -18291 -11378 -30132 -49982 -20189 20880 35435 43160 33305 9977 -5066
14440 -5066 -789 -371 5592 19664 14647 -25077 -32701 -22021 24800 9712 14546 -26123 -35499
14427 -35499 -11868 21024 55433 36574 9498 -32962 -51690 -42769 -35878 -12842 -10489 12265
14415 12265 -12014 -42147 -57339 -35440 -18348 -14340 -1591 -4244 3369 29562 24960 11161
14403A1161l9932m8423l157K5058o733k0131Q376M3522J3759k7028L546J5135
14391b4847j2369l027R176j4548O318O335J6009k4727K295Q771o544r66L3976
14378d148M428j6866j6469J258K1998K1144j0990j1544L0328j553j9288k5839
14366b7541k3961J4861L111N962N296K789Q80K7700n883k8267Q848K0315L1976
14353C6086j4075M918K322Q870J3908J7086j5255m1317m9928M592K1992P959J3178
14340A0336l832M549l4061k6212j3000K1425j470R947K0988J1741r785o410J0373
14327e411p153j0585j4885m904R977J160m635p134J855j9734R440J22j2055K0944
14313d2998J8450J7166k727j8K5067j3517k1120k4491J3539J4071K6285o536k6385
$$ plain form
14403 11161 -28771 -77194 -80351 -55293 -62026 -82157 -73781 -30259 -16500 -43528 -39982 -24847
14391 -24847 -37216 -40243 -31067 -45615 -39297 -32962 -16953 -41680 -39385 -30614 -37158 -38124 -4148
14378 -4148 280 -16586 -33055 -31797 -9799 11345 355 -11189 19139 17586 -1702 -27541
14366 -27541 -51502 -36641 -33530 -27568 -22272 -19483 -18603 9097 3214 -25053 -16205 4110 36086
14353 36086 22011 26929 29251 38121 52029 69115 53860 12543 -37385 -32793 -10801 -2842 10336
14340 10336 6504 11053 -23008 -49220 -62220 -40795 -42265 -32318 -11330 411 -9374 -15784 -5411
14327 -5411 -12564 -23149 -38034 -42938 -32961 -31801 -36436 -43570 -41715 -61449 -52009 -51887 -63942 -42998
14313 -42998 -24548 -7382 -10109 -10127 14940 1423 -19697 -44188 -30649 -16578 9707 3171 -23214
14300b3214J5051L6447J3449j0705Q242j766k4535L310j8853K345j5424k3404
14288c9057k8393j5918N3220q205o028L5739M7906j5167o1057k0139k105L747
14276e5457R426K0669k1755k6327J3659P1272M2113l1023l5748M0494N261k8730
14264C854k0143J3080J3679k3928j4809J0774L9907O418k2560k4709K8791K1142
14252C1496j4619k1060j1711P191k3255l605K4021J327j1291Q013K4580R006k939
14239A7154j5418j3539N347J7936m269q250k1644J8285j5700O769K5207k439j3029
14226c590l6322J6494j1599J559P294K1545j0796N673l6992k0603K6950q700J3346
14213c5741M4349r039k4227P88K3566l7753m0222L4709K9026k8437L0621J3685
$$ plain form
14300 -23214 -8163 28284 41733 31028 39270 37504 12969 16279 -2574 -229 -15653 -39057
14288 -39057 -67450 -83368 -30148 -38353 -44381 -8642 39264 24097 -36960 -57099 -59204 -55457
14276 -55457 -46031 -25362 -47117 -73444 -59785 11487 53600 22577 -13171 27323 32584 3854
14264 3854 -16289 -3209 10470 -13458 -28267 -17493 22414 28832 6272 -18437 10354 31496
14252 31496 16877 -4183 -15894 -8703 -31958 -35563 -11542 -10215 -21506 -13493 11087 20093 17154
14239 17154 1736 -11803 -6456 11480 7211 -1039 -22683 -4398 -20098 -13329 11878 9439 -3590
14226 -3590 -39912 -23418 -35017 -33458 -26164 -4619 -15415 -9742 -46734 -67337 -40387 -49087 -35741
14213 -35741 8608 -431 -24658 -23870 -304 -38057 -78279 -43570 -14544 -42981 -12360 1325
14201A325l3151n528n050J8487R065J4942J4263R110j911m078k26j0899k4014
14188a7665k1385j4006M1588N0607M322j190K993j8806J4012L125k9650j6096
14176b151j4518J336J6797q142j2954l3973l5903K6865J1459m110j1254j739L0522
14163c7765M2972j5372j0595L4177Q65j6445O529K3026k1412J382K8629j215J3591
14150D8367k2513j2950k2785j12j565k886p580j6122M376M2106J0074j7454q026
14137g070K5481j1128k5979J7293j5311m7679k3064n059M1445M4052K1668R784
14125B4433r765j3779k294J4476K0924k8057k6660R762J6882j2281j3717J1022
14113i054J2545K0469K1009k810k6741k1446p217l1134J7542M470M4152K3105
$$ plain form
14201 1325 -31826 -37354 -42404 -23917 -14852 90 14353 23463 21552 17474 17248 6349 -17665
14188 -17665 -39050 -53056 -11468 39139 43461 42271 45264 26458 40470 43595 13945 -2151
14176 -2151 -16669 -15333 1464 -6678 -19632 -53605 -89508 -62643 -51184 -55294 -66548 -68287 -37765
14163 -37765 5207 -10165 -20760 13417 14282 -2163 4366 27392 5980 7362 35991 34776 48367
14150 48367 25854 12904 -9881 -9993 -11558 -14444 -22024 -38146 -33770 8336 18410 956 -7070
14137 -7070 18411 7283 -18696 -1403 -16714 -64393 -87457 -92516 -51071 -7019 14649 24433
14125 24433 14668 889 -1405 13071 33995 5938 -20722 -10960 5922 -6359 -20076 -9054
14113 -9054 3491 23960 44969 42159 15418 -6028 -13245 -44379 -26837 -22367 21785 44890
14101D4890j3740j0703N037j7660p693J575N1925K6463k9430k7330M1526l408
14089F1452j4849K0591o754L435L57k5380o916j5757m1699O950K6828L0484M520
14076D3262l9132l2335k3349J903J8388J0079j0126k8661J981j6287K6718m845
14064e2404J3667L1294l426m1149O956J3760K5853L7123K1103k4556j9512J7120
14052B5829l950k0853j9636L996Q320L812m6734L811K1266J5901j0763j3447k198
14039c4646J2897J8592j9238j6443l0349m0054J3678O1361O893L938K0989l766
14027f148j9447P218p483J4703J7284l5672j8363K3517J6640L8135O275k8487
14015H172j3567r501K288O715q021K455j6002j5271K9787k3990k7368j9895j5762
$$ plain form
14101 44890 31150 20447 25484 7824 131 1706 53631 80094 50664 23334 64860 61452
14089 61452 46603 67194 60440 63875 64232 38852 31936 16179 -25520 -18570 8258 38742 43262
14076 43262 4130 -28205 -51554 -49651 -31263 -21184 -31310 -59971 -57990 -74277 -47559 -52404
14064 -52404 -38737 -7443 -10869 -52018 -45062 -31302 -5449 31674 52777 28221 8709 25829
14052 25829 21879 1026 -18610 -14614 -6294 -2482 -49216 -45405 -24139 -8238 -19001 -32448 -34646
14039 -34646 -21749 -3157 -22395 -38838 -69187 -109241 -95563 -34202 -27309 -23371 -2382 -6148
14027 -6148 -25595 -18377 -25860 -11157 6127 -29545 -47908 -24391 -7751 30384 36659 8172
14015 8172 -5395 -14896 -12608 -5893 -13914 -11459 -27461 -42732 -12945 -36935 -64303 -84198 -99960
14002i9960K2577L9654n11L196L4668J4690j5095l2758J4489K9274j0363k4624
13990b4763J506j451p199N142L3456K0065o111l1264l846K1890K2286P235Q017
13977D4963l2769j1851J6370j5820N428n641j6101j3756L1843j608j0612K8713
13965A9159L0985n632m2855j6576P076N401j784j3860r228L6662N3391l6837l1314
13952e412M0314J4804l3288J5326j5254l7187P385m873K0572J8936j8995K1602
13940B3930p404k472M682n306j4914j6299O249J2685K0963q297l1043K1755K5257
13927B9786m3603l4783L2533R579M930K2863Q906J902l373M201J6584j0916J166
13914C9775j3225J0750R532k0505j1815K2469M669l8288L4396j279r446j1997
$$ plain form
14002 -99960 -77383 -37729 -38240 -35044 -376 14314 -781 -33539 -19050 10224 -139 -24763
13990 -24763 -23257 -24708 -31907 -26765 6691 26756 20645 -10619 -14465 7425 29711 36946 44963
13977 44963 12194 343 16713 893 6321 680 -15421 -29177 2666 1058 -9554 19159
13965 19159 50144 44512 1657 -14919 -7843 -2442 -4226 -18086 -27314 9348 62739 25902 -5412
13952 -5412 34902 49706 16418 31744 16490 -20697 -13312 -18185 2387 21323 2328 23930
13940 23930 16526 14054 18736 13430 -1484 -17783 -11534 1151 22114 13817 -17226 4529 29786
13927 29786 -13817 -48600 -16067 -6488 -1558 21305 30211 32113 28740 32941 49525 38609 39775
13914 39775 26550 37300 46832 26327 14512 36981 41650 3362 37758 36479 27033 15036
13902A5036r542p084j9173J370Q941j4518j2149J4330k161J6330M067j2677j6840
13889c4070L472m3900k1480L3076M4972O473J8049J5023J683K2429l1860m3173
13877b9306m963L5442K8947j8310K5063l8195n9054J2911j2976k2898j6692P276
13865i2755Q461q690L8072K3867k5354J6557L8444K1532R385k9719L4873J3846
13853D8519m450k2563j3483o34P046J5632P353k5308k3836k7412n200L3234N1200
13840D0098l1819n7070j6193M8506J6985J5048L1786l611k4125j8098m5633q152
13828e2278O951K1119L7195L2932m8752n1890Q434J3199L1755J7827j0001R111
13816A5602J463o784k1558j7364j8256o820J0290K6900j424k2326l0887L1319
$$ plain form
13902 15036 5494 -1590 -20763 -19393 -10452 -24970 -37119 -22789 -24950 -8620 -4553 -17230 -34070
13889 -34070 -30598 -74498 -95978 -62902 -17930 -11457 6592 21615 23298 45727 13867 -29306
13877 -29306 -34269 1173 30120 11810 36873 -1322 -60376 -47465 -60441 -83339 -100031 -92755
13865 -92755 -84294 -92984 -54912 -31045 -56399 -39842 -1398 20134 29519 -200 34673 48519
13853 48519 44069 21506 8023 7389 14435 30067 37420 12112 -11724 -39136 -44336 -11102 40098
13840 40098 8279 -48791 -64984 -16478 507 15555 47341 43730 19605 1507 -44126 -52278
13828 -52278 -45327 -24208 12987 45919 -2833 -54723 -46289 -33090 -1335 16492 6491 15602
13816 15602 17065 10281 -11277 -28641 -46897 -53717 -43427 -16527 -17951 -40277 -71164 -39845
13804c9845J0358j6464j0318K7311j492q039K2581O828k7273l61K3316L5397L917
13791B5916J8059m7525j9999M2152j6751k2479k2401J5584J0488K218j5236J486
13779b8488J6572j2080j1290p882K7483J9681j6216k2577r081K2454R409J3683
13767A668Q799J3504L3717J6022m690k0438p983J857o607j556j8583J1472J09
13754B7291l1667j4128Q947k1829k1907K26J6794Q987j09J08L8492K453Q419k3
13740B2054j4637j0042M112K9220J4597J9210o529k4439j2405j2768r096M328
13728C605k4831K409r596k2326M539J5630P816j0051n648J2920L808K113M680
13715a4932L1500N8837J1096n2404m8020O701Q176L6986o363o3883q320K7360
$$ plain form
13804 -39845 -29487 -45951 -56269 -28958 -30450 -38489 -15908 -9080 -36353 -36714 -13398 21999 25916
13791 25916 43975 -3550 -23549 18603 1852 -20627 -43028 -27444 -16956 -14738 -29974 -28488
13779 -28488 -11916 -23996 -35286 -43168 -15685 3996 -12220 -34797 -43878 -21424 -12015 1668
13767 1668 10467 23971 57688 73710 69020 48582 40599 42456 35849 34293 15710 27182 27291
13754 27291 -4376 -18504 -9557 -31386 -53293 -53067 -36273 -27286 -27395 -27287 11205 13658 22077 22054
13740 22054 7417 -2625 1487 30707 45304 64514 57985 33546 21141 8373 -723 3605
13728 3605 -21226 -18817 -28413 -50739 -46200 -30570 -22754 -32805 -38453 -25533 -21725 -19612 -14932
13715 -14932 16568 75405 86501 34097 -13923 -7222 954 37940 31577 -32306 -40626 -13266
13703a3266L8468J6494j5393l8463k0376J1154q445J5797n502j3729O881L432
13691b2948K4762j3031k1241J0862j3640n609J7344L1303J7558L08l9931j2917
13679b7180K3509m2571l8858J6077K3190Q656K1836p877l711J7078L2852J8063
13667D1064l514n031p093j4239r530J0758J5438k4024k8474q315j4366p323K4794
13654b9855m395J488J2796j457L373N537J4223K4464k3540K5401k802m1616J789
13641a4594J5548K3848m4576k6616K267n893J681J9066j4687K3673J6576J3753
13629A0046J8873J0077j6275k4138K017K1161j4519j3062m9523q129J7075K4330
13617b2067j0589k8956k1515L3125K7270L7677M936q798j4816k782K2142J0180
$$ plain form
13703 -13266 25202 41696 26303 -12160 -32536 -21382 -29827 -14030 -19532 -33261 -26380 -22948
13691 -22948 1814 -11217 -32458 -21596 -35236 -40845 -23501 7802 25360 25668 -14263 -27180
13679 -27180 -3671 -46242 -85100 -69023 -45833 -37177 -15341 -23218 -26929 -9851 23001 41064
13667 41064 37550 32519 25426 11187 1657 12415 27853 3829 -24645 -32960 -47326 -54649 -29855
13654 -29855 -34250 -32762 -19966 -21423 -18050 -12513 1710 26174 2634 28035 25233 -16383 -14594
13641 -14594 954 24802 -19774 -46390 -44123 -50016 -48335 -29269 -43956 -20283 -3707 10046
13629 10046 28919 38996 22721 -1417 600 21761 7242 -5820 -55343 -63472 -46397 -22067
13617 -22067 -32656 -61612 -83127 -50002 -22732 14945 19881 11083 -3733 -6515 15627 25807
13605B5807M818P140K0227l165m7323k168l780j7228j9267L0856J6618l660M068
13592A2943m677J1984K78L636J1127m902k8388n9797l1489q069K2733l816J7212
13579f1225L5598R146J0980j5908j0251K3648J121N541J050k0229j2423M481J7234
13566a1237L3713L0169J2024M587p004k2148o874L3150J9857p957J896N725j173
13553H4728j6840k7829r346j294M873j051K7795K8807M97k3924m8168k3335K4394
13540A9307r88j0292m214l1327o23J884K2674J5577J1293J2123m584K5324k5618
13527C0536l8230k2921J1645Q229J801k6089j9732L484N520J9228N263J5270J6712
13514A0716l670j4149K6927J4556j8864l018M305J3013O049k5337l1201k0135
$$ plain form
13605 25807 30625 37765 57992 54827 7504 5336 1556 -15672 -34939 -4083 12535 8875 12943
13592 12943 8266 20250 20528 24164 35291 30389 2001 -57796 -89285 -97354 -74621 -78437 -61225
13579 -61225 -25627 -16481 -5501 -21409 -31660 -8012 -6891 -1350 -300 -20529 -32952 -28471 -11237
13566 -11237 22476 52645 64669 69256 62252 40104 33230 66380 86237 78280 80176 85901 84728
13553 84728 67888 40059 30713 29419 34292 33241 61036 89843 90340 66416 18248 -5087 19307
13540 19307 18319 8027 3813 -27514 -28137 -26253 -3579 11998 23291 35414 30830 56154 30536
13527 30536 -7694 -30615 -18970 -10741 -8940 -35029 -54761 -51277 -45757 -26529 -21266 -5996 10716
13514 10716 7046 -7103 19824 34380 15516 12498 16803 29816 35865 10528 -20673 -40808
13502d0808m664M4165J6155j6574m2296K1354J1537Q930K232M432J5481k9841
13490i897R865P089k7349l276o749J2996p509J2903k3656R391P641K0921r690
13477g320J957j2456J4503J350l3335k6390K7607J9687K9527K1498j8478l3784
13465a5634j045K5830K3747k105K2837M804k2235j6964M071k4596k0484J1923
13453i851j4465j6067j4768m119j2669J5916K8441M838j1217n204L4997K7000
13441B2832j3932r503j1993j6542l0982j7756J1759L2363K95Q523K4318q705n165
13428a4488l4904n858K7448N160q268k280J4316O586o163K9317l2052Q46K4543
13415D203N903K643O547q714N088N907p383P000J3866o736j7698r849k919l06
$$ plain form
13502 -40808 -45472 -1307 14848 -1726 -44022 -22668 -11131 -2201 31 4463 19944 -9897
13490 -9897 -32 7057 -20292 -23568 -30317 -17321 -24830 -11927 -35583 -26192 -18551 2370 -7320
13477 -7320 -5363 -17819 -3316 -1966 -35301 -61691 -34084 -14397 15130 36628 18150 -15634
13465 -15634 -16679 9151 32898 30793 53630 58434 36199 19235 23306 -1290 -21774 -9851
13453 -9851 -24316 -40383 -55151 -59270 -71939 -56023 -27582 -22744 -33961 -39165 -4168 22832
13441 22832 8900 -603 -12596 -29138 -60120 -77876 -66117 -33754 -33459 -24936 -618 -9323 -14488
13428 -14488 -49392 -55250 -27802 -22642 -30910 -33190 -18874 -12288 -18451 10866 -21186 -20340 4203
13415 4203 10106 12749 19296 10582 15670 21577 14194 21194 35060 28324 10626 777 -2142 -2448
13401b448J0833M617O417K2551j7979m7161m109j7483l9104K0472P6409r747l0051
13388b6783K689J8869J5455R179k6664M401K2567O66n939k2013P766J6990m671
13375A2512j8842R015p468J400k7756j93K0212L952J4959j106j5225L868l709
13362h381J3510l216r3K3213k380k6174P011K9515j264P237q880j0423k5133j5903
13348b1361p511k4137l258j6866K0942P606L5147M586J7740l5875k1269j8304
13336f2560L2253L7626M022q087J8177M515k1076k0454O696l390J422r632j3996
13323c4484Q934l315j7550j5309L2806K8148K6751J3072j5078j356j509K694N57
13310B4361k3308j4984L0954n220M302K0732J1064n267l1646n6991n052K6497
$$ plain form
13401 -2448 8385 13002 19419 41970 23991 -23170 -27279 -44762 -83866 -63394 13015 3268 -26783
13388 -26783 -24094 -5225 10230 19409 -7255 -2854 19713 20379 14440 -7573 193 17183 12512
13375 12512 -6330 2685 -4783 -3383 -31139 -31332 -11120 -7168 7791 6685 -8540 -4672 -8381
13362 -8381 5129 1913 1820 25033 22653 -3521 3490 33005 31741 38978 30098 19675 -5458 -21361
13348 -21361 -28872 -53009 -56267 -73133 -52191 -44585 -9438 -4852 12888 -22987 -44256 -62560
13336 -62560 -30307 7319 11341 3254 21431 25946 4870 -15584 -8888 -12278 -10856 -20488 -34484
13323 -34484 -25550 -28865 -46415 -61724 -28918 -770 25981 39053 23975 22619 21110 23804 24361
13310 24361 1053 -13931 17023 11803 16105 36837 47901 42634 10988 -46003 -51055 -24558
13298b4558J1329O723K664L576N5167L0332j8808j3315J6734O554m1300m5433
13286a0335l0671j9782m923J6433J9051J8976J3412n887K4633k2287k4199M039
13274b1540j2382J9902O3141j8535m2645J0399j1514l6756L6528K7738k4180k6559
13262c6403L7031J5898P610K3072l0943l5079j7653J025K8284k22l8415j4962
13250f0757k42K5244J0916r112L4127P416p530n543j3564k3118L7752K5369J0626
13237C1584l1693n682J5662p632l1330n388K8289K7952k2569k2451q806K2977
13225i087l971J6872o042j3420L2757K112J4630r165M904K2281k3683l8115l2580
13212d2507P824O453n052M190K0670L4972L309m782k9741l5193R031K7357M825
$$ plain form
13298 -24558 -13229 -6506 -3842 -266 54901 85233 66425 53110 69844 76398 35098 -10335
13286 -10335 -41006 -60788 -65711 -49278 -30227 -11251 2161 -3726 20907 -1380 -25579 -21540
13274 -21540 -33922 -14020 49121 30586 -12059 -1660 -13174 -49930 -13402 14336 -9844 -36403
13262 -36403 628 16526 24136 47208 16265 -18814 -36467 -35442 -7158 -7380 -45795 -60757
13250 -60757 -60999 -35755 -24839 -33951 176 7592 62 -5481 -19045 -42163 -4411 20958 31584
13237 31584 -109 -5791 9871 2239 -29091 -34479 -6190 21762 -807 -23258 -32064 -9087
13225 -9087 -13058 3814 -2228 -15648 17109 19221 33851 24686 29590 51871 28188 -9927 -42507
13212 -42507 -34683 -28230 -33282 -29092 -8422 26550 29859 25077 -4664 -39857 -30826 -3469 1356
13199A356j8908j6384L9085K4669l4472j2793J3794p08j6271O892L727k189K943
13186i259J4466l630k3039j3516K2243j2792L162J9707K4744J6565o634K7145
13174E9162K693j1350k6533m3029m3137L3677K5831J4195j020Q358j0741o664
13162A442N890j991K3940J2947j0951j9269k0217K664M5613O393j6658k5045k5932
13149b1174J3330n240J644k3078N840M986r515m368J4422m907O905K0808q75J2267
13135A1045J3115l2383m439K8922J352Q216n3609n0340P525K6816k0667O879M2523
13122a5045J1487K1423J5366j1212j471k3226J8988K9677p693p7080l8470J7395
13110e9861J5067R590N735j3268q951L247r078K180L0279k1718K59N7363J3394
$$ plain form
13199 1356 -17552 -33936 5149 29818 -4654 -17447 -3653 -4361 -20632 -13740 -10013 -12202 -9259
13186 -9259 5207 1577 -21462 -34978 -12735 -25527 -22365 -2658 22086 38651 32017 59162
13174 59162 61855 50505 23972 -19057 -62194 -28517 -2686 11509 10489 18847 8106 1442
13162 1442 7332 5341 29281 42228 31277 12008 -8209 -5545 40068 46461 29803 4758 -21174
13149 -21174 -7844 -13084 -11440 -34518 -28678 -23692 -33207 -37575 -23153 -28060 -21155 -347 -1222 11045
13135 11045 24160 -8223 -12662 16260 17612 25828 -27781 -78121 -70596 -43780 -64447 -57568 -15045
13122 -15045 -3558 17865 33231 22019 20548 -2678 16310 45987 38294 -38786 -77256 -59861
13110 -59861 -44794 -35204 -29469 -42737 -51688 -48441 -57519 -55339 -25060 -46778 -46519 10844 24238
13097B4238k6103m0010K7829M7519M46j4221O619L7783o161o8933o5184K0073
13085e6105P3120K2756j0295k9160l30J2766R69J2615q737m4806K726K9225m608
13072A36j9564J717j4597K6950K6526j5384l2162K9018N7924j6698n863l625o570
13059B7808m952J0468K284p968k6147m7699L437J2539k5045J6566L9409R746J752
13046A2198r869K2898J261k8581K702o925l2502J7767K1003P376r340j82K2141
13033A9947J9688l3474l7716K1770p42J109L4758n924q664j3244J9494L0654l8169
13020I487j8126K7473K481j0827J2557M464l058K287o227p018k2778l3885J116
13007d2054k443j3766K6703L7650J6599k314j2371j6765m324J4920L7947J95l8392
$$ plain form
13097 24238 -1865 -41875 -14046 33473 33919 19698 26317 64100 57939 -10994 -76178 -56105
13085 -56105 17015 39771 29476 316 -14 12752 13721 26336 17599 -27207 -24481 4744 136
13072 136 -19428 -17711 -32308 -5358 21168 5784 -26378 2640 60564 43866 38003 34378 27808
13059 27808 22856 33324 35608 27640 1493 -46206 -42769 -30230 -55275 -38709 700 10446 12198
13046 12198 2329 25227 26488 -2093 609 -6316 -38818 -21051 -48 7328 -2012 -2194 19947
13033 19947 39635 6161 -31555 -9785 -10527 -9418 25340 19416 10752 -2492 17002 47656 9487
13020 9487 -8639 18834 21315 10488 23045 27509 24451 26738 20511 13493 -9285 -43170 -42054
13007 -42054 -44497 -58263 -31560 6090 22689 20375 8004 -8761 -13085 1835 39782 39977 1585
12994A585Q492j2269q419J1879j9993j4896J6113J7015j0416N869Q277j9169J9729
12981C797L125p503K919k536j6508j2318p593K5720Q090N030J1542N139j3675
12968E229L753k1515k5124J4406O3445J5078j7869r578j0071j8190K1581k42j6265
12955D638j815O053L2004J2910j5207K0226l3204k1079L4173J3746k2690j3134
12943A6621J0284N038K6556J4000J0771L062l1600j5937N261j6125k1040l1895
12931b5004P748K7618R926l278q804K5392J3124j7029Q837j6105k1176q807P438
12918a20M465j2116m344J3963K0112k4954k7487J013L4361K8797L7421L87k3641
12905D7857L418q261M3P496k3159j2456J1800Q632j1971p017J9884j572J0792
$$ plain form
12994 1585 10077 -2192 -10611 1268 -18725 -33621 -17508 -493 -10909 -5040 3237 -15932 3797
12981 3797 6922 -581 2338 -198 -16706 -29024 -36617 -10897 -2807 2223 13765 18904 5229
12968 5229 8982 -12533 -37657 -23251 40194 55272 37403 27825 17754 -436 21145 20903 4638
12955 4638 2823 8876 40880 53790 38583 58809 25605 4526 38699 52445 29755 16621
12943 16621 26905 31943 58499 72499 83270 86332 54732 38795 44056 27931 6891 -25004
12931 -25004 -17256 10362 20288 17010 8206 33598 46722 29693 38530 22425 1249 -7558 -120
12918 -120 4345 -7771 -12115 1848 21960 -2994 -30481 -29468 4893 33690 71111 71498 47857
12905 47857 51275 43014 43057 50553 27394 14938 26738 35370 23399 16382 36266 34694 45486
12892D5486K1623k2904k3727J006k1948k1679K0429l1517m9812M0565L5664J3822
12880G008N509j741j6332L686j7551N749K4423N7963L343j5025k7774o0800j3554
12867d5096j9472K259K2271J6327P332K3993m964k2698l3974n167L2025L9477
12855A2313j1634k4792R39j265K1325L4041k7731k8720L8802K4243R066j690j5477
12842B9420J1827n441n2642k7487J3012L0676M7410j7841k7049J826j2755l275
12830a2319j1023O338j2608p095R138P783J5548J5413R84j9319K2044L9473r85
12817E3372j8308J2324j0128l3050l6004J060M7675J3278r164k5284k0271J2957
12805a1543K0106k6120o776N6125K9240m835l3098k7666J359j0520j091o4366
$$ plain form
12892 45486 67109 44205 20478 21484 -464 -22143 -1714 -33231 -83043 -42478 -6814 7008
12880 7008 12517 10776 -5556 -1870 -19421 -13672 10751 68714 72057 57032 29258 -31542 -45096
12867 -45096 -64568 -62309 -40038 -23711 -16379 7614 2650 -20048 -54022 -59189 -27164 12313
12855 12313 679 -24113 -23174 -24439 -3114 30927 3196 -25524 13278 37521 46587 44897 29420
12842 29420 41247 35806 -16836 -44323 -31311 -635 46775 28934 1885 3711 -9044 -12319
12830 -12319 -23342 -17004 -29612 -36707 -27569 -19786 -4238 11175 12159 -7160 14884 54357 53372
12817 53372 35064 47388 37260 4210 -31794 -30734 16941 30219 21055 -4229 -24500 -11543
12805 -11543 8563 -17557 -24333 31792 61032 56197 23099 -4567 -3208 -13728 -14819 -79185
12793g9185k360J2481j670L683L9235J6377K1372m944N529J8450J0377k4282j3105
12780A958l1560J7323K7142j8712l4734j1907J8323L3588L964k5941j5636k7314
12768f3506j8423J4797J3962K4960L0366j6176k5568j7037Q73n30L7779J2482
12756f021j308K0817r227j0553k4055P488K6079l3462k3000K2283L7205k1563
12744a5317j1840J3585J9490j1879N520O918J4461k0030m053J4043J0062K7927
12732D8887k6167j0216l552m1801k235K5946J6287q423k0710l3346J1188K7294
12720a6848J3404l320R080q154j103J5206m32Q125O346k1879m1376p5R938m1805
12706g2893j7157K3010L4434M2999J6930l4296k1731J8706j6361j0579K7972l294
$$ plain form
12793 -79185 -81545 -69064 -70734 -67051 -27816 -11439 9933 4989 10518 28968 39345 15063 1958
12780 1958 -29602 -12279 14863 -3849 -38583 -50490 -32167 1421 5385 -20556 -36192 -63506
12768 -63506 -81929 -67132 -53170 -28210 2156 -14020 -39588 -56625 -55752 -56282 -18503 -6021
12756 -6021 -7329 13488 4261 -6292 -30347 -22859 3220 -30242 -53242 -30959 6246 -15317
12744 -15317 -27157 -13572 5918 -5961 -441 6477 20938 908 -3145 10898 20960 48887
12732 48887 22720 12504 8952 -32849 -35084 -9138 7149 -1274 -21984 -55330 -44142 -16848
12720 -16848 -3444 -6764 2316 -5838 -6941 8265 7833 15958 22304 425 -40951 -41026 -31088 -72893
12706 -72893 -90050 -67040 -32606 10393 27323 -6973 -28704 -9998 -26359 -36938 -8966 -12260
12694a2260L833J8879O470J4221j1796L816l338k0043j2660m538l8018P236M7682
12681e16l836j0379l148K4451M0225N547o555P78l5071l5844j1856j1075K4393
12668b2886N2295m587K406K5433j4351j220K5368k68k3971m5563P315J10j1996
12655a1915J4547k0758j7054P086O020N2340P31k220q77k9709L3542L4553m970
12642F1316l8447q193J7084o869J3523K2844M757k2790K5363m501q147j6762o350
12629C2828k3503r814J1706L3621K630l6841k1543L712j4493r714N3609M4164
12617F6362N021J6538l4987J2912L5833R271m4495o835j570J5118n0825j137O143
12604B7349l6618k132p345j6366L2053N3299J2424p533k0540j209L4879K3361
$$ plain form
12694 -12260 -8427 10452 16922 31143 19347 23163 19825 -218 -12878 -17416 -55434 -48198 -516
12681 -516 -4352 -14731 -17879 6572 46797 52344 45789 46567 11496 -24348 -36204 -47279 -22886
12668 -22886 29409 24822 27228 52661 38310 37090 62458 62190 38219 -7344 -29 81 -11915
12655 -11915 2632 -18126 -35180 -28094 -22074 30266 30997 28777 27900 -1809 31733 66286 61316
12642 61316 22869 14676 31760 24891 38414 61258 66015 43225 68588 64087 55940 39178 32828
12629 32828 9325 -489 11217 44838 47468 10627 -10916 -7204 -21697 -31411 22198 66362
12617 66362 71383 87921 52934 65846 101679 110950 66455 59620 58050 73168 22343 21206 27349
12604 27349 -9269 -11401 -18746 -35112 -3059 50240 62664 55131 34591 33382 68261 91622
12592I1622r519m3442l2008k2158J3642L0851J7182M929o548L038k3993K135K4691
12579E0422L967j7398j9786J5895q453j6063K0735J9112J6780m894j0619j714
12567D7984K4950l5594m6684j2767m836M1267L5896L0416n593m5796K1441K8613
12555G9297L0047q697k3109p624j5081l2749L9705j0624j1706j5671J6572j0535
12543B9825J9919m187M504K1187m3717k2697o230j2391K999L9652J9062J5177
12531F3103m2855k6438L24J0895M339J2805J1825K3851J8996K082l3862K5933
12519G0998L2088k3395j9900j4953O276M291j7908K3052K2618q567r728l6155
12507B8717Q148K2286R622j2612q211j4440j766j0792J5621p662k922m12j9760
$$ plain form
12592 91622 82103 38661 6653 -15505 -1863 28988 46170 51099 44551 47589 23596 25731 50422
12579 50422 54389 36991 17205 33100 24647 8584 29319 48431 65211 60317 49698 47984
12567 47984 72934 37340 -9344 -22111 -26947 14320 50216 80632 75039 29243 50684 79297
12555 79297 109344 100647 77538 69914 54833 22084 61789 51165 39459 23788 40360 29825
12543 29825 49744 45557 50061 71248 27531 4834 -1396 -13787 -10788 28864 47926 63103
12531 63103 20248 -6190 -5866 5029 9368 22173 33998 57849 76845 78927 45065 70998
12519 70998 103086 79691 59791 44838 51114 55405 37497 60549 83167 74600 64872 28717
12507 28717 36865 59151 68773 56161 47950 33510 31744 20952 36573 28911 25989 25577 5817
12494E817j6198j9533M09L3060L6619J3783j0884m620J4024j5299K471L2391L2887
12481A04927p46l1805o113j31J3457J6010j5335j844n691k0377J8146K0392k3515
12468F7375k8036m3608k0578k697r23R439K8336L2460O375m893L0841j5566n3873
12455D652m951K6025K382l1552L9713K2072k690n751N18j2695Q738M2656J3592
12442A02709m0871k1429j3927j9029n771K2327K4409j8053M550K3846k6100p837
12430B4824K206J7147L686J7222l028m2972J7050k5289k0930K8073n384K991K7833
12417D3429l933Q397Q274q426j3799K2980J7755R912j827j4324k8823J984J6816
12404E8415J8818n2876r814K1247K2740P486r646J9699k1556m286J4613K8565
$$ plain form
12494 5817 -10381 -29914 -29505 3555 40174 53957 43073 38453 52477 37178 39649 72040 104927
12481 104927 104181 72376 66263 66132 79589 95599 80264 78420 72729 52352 70498 90890 67375
12468 67375 39339 -4269 -24847 -27544 -28467 -19028 9308 41768 48143 43250 74091 58525 4652
12455 4652 -299 25726 28108 -3444 36269 58341 55651 49900 50418 37723 46461 89117 102709
12442 102709 61838 40409 26482 7453 1682 24009 48418 30365 34915 58761 32661 24824
12430 24824 27030 44177 47863 65085 62057 19085 36135 10846 -10084 17989 12605 15596 43429
12417 43429 39496 47893 56167 47741 33942 56922 74677 84589 82762 68438 39615 41599 58415
12404 58415 77233 24357 14543 35790 58530 66016 56370 76069 54513 50227 64840 93405
12392I3405J3727m9048j5749K722l0402j4481L0476M2624r591P657J5098N482
12380I1920o608k2148o615L4522k37k4816L069r731m216N0265K139j0644j9341
12367G7559k2818o203r417M9746M4442J7330K8540J6154k2948m1265K6282L6790
12355A94192K0233l1010j5467l355j1723n0069o1557P043j2337N0700P6905K2689
12343A86244j1620L1772p298k4839L870K8140l1445q87n227J1137p444l6362n2395
12330H3646L6903L1461Q535o8J026j2887L3841m660K0195N6532M0898N4768J9880
12317C70070l7977n3597k5699R822l674j7393m1826Q617Q526l3045l2875n05K9197
12304A79641K4906J2689K553j3597O836q530J035K4468l0598r457n097n8891j5464
$$ plain form
12392 93405 107132 58084 42335 45057 14655 174 30650 73274 63683 71340 86438 91920
12380 91920 85312 63164 56549 91071 90834 66018 69087 59356 55140 105405 107544 96900 77559
12367 77559 54741 48538 39121 88867 133309 150639 179179 195333 172385 131120 157402 194192
12355 194192 214425 183415 167948 164593 152870 102801 41244 48287 35950 86650 163555 186244
12343 186244 174624 206396 199098 174259 178129 206269 174824 173937 168710 179847 172403 136041 83646
12330 83646 120549 152010 160545 160477 161503 148616 182457 177797 197992 254524 295422 350190 370070
12317 370070 332093 278496 252797 262619 258945 241552 199726 208343 216869 183824 150949 150444 179641
12304 179641 204547 217236 219789 206192 213028 204498 205533 230001 199403 189946 184849 125958 110494
12291A10494N1093j1487l7176l0138O673K9100L9981J8670l820J6794N255m2833
12279A52606k9151J5763N220N060J9380j0132k9883j3053k9205k1419J5479L4540
12267A15205L1070K8685j6151K537j8101K1586J4820l7224j7592O522M4883J1932
12255A88172k2493j3488m7065J027L1977K1685P855j1499q990K978j2294j8370
12243A19495J8316J4140j8163m1572J2041J5212j3035L8747M3919j632j3958q472
12231A65038j5424j5754P765N157J4078L252J433j782K8018n75N272j154J1057
12218B06381Q88J0529m414k3582m9235j5436J3505K4334L1740L0116L5364k4550
12206B35640r009O932k3109l1446L6004j5657k6444q812J336L2671l203n430J6219
$$ plain form
12291 110494 161587 150100 112924 82786 89459 118559 158540 177210 173390 190184 195439 152606
12279 152606 123455 139218 144438 149498 168878 158746 128863 115810 86605 65186 80665 115205
12267 115205 146275 174960 158809 161346 143245 164831 179651 142427 124835 131357 176240 188172
12255 188172 165679 152191 105126 106153 138130 159815 167670 156171 147181 150159 137865 119495
12243 119495 137811 151951 133788 92216 104257 119469 106434 145181 189100 187468 173510 165038
12231 165038 149614 133860 141625 146782 160860 164112 165545 163763 191781 191206 196478 195324 206381
12218 206381 207269 217798 213384 189802 140567 125131 138636 162970 194710 224826 260190 235640
12206 235640 226631 233563 210454 179008 215012 199355 172911 164099 165435 198106 194903 189473 205692
12193B05692r95K8406k1470k4823k2758j7603l255J4835M7395J1099P390P684
12181B31597j3274j1673K7314N9383q281q945K5487k746l2342r66r594M729m260
12168B56429N508l5583j055L0478L2622r275K7941l0434k4682k0996J8717L1130
12156B80800K3781J2993j6163p751l494j1137O804R229J5481M5326K4611k3141
12144C57339k6258l4392l3868K1572K8415l04K0672j5450o657K8587K016M92l2170
12131C09994K2037K6995K2308o047k0860p43q070p968K4649L9927N320J8101L2768
12118D58411J3543j2666L315J2404O836k9174k4548O629K2563O205J8868P637
12106D90023M4526K2685K267J8727j1632p655k2618R711j5749R774j5649k663
$$ plain form
12193 205692 204697 233103 211633 186810 164052 146449 143194 158029 205424 216523 223913 231597
12181 231597 218323 206650 233964 293347 285066 276121 301608 298862 266520 265554 255960 260689 256429
12168 256429 261937 226354 225299 255777 288399 279124 307065 276631 251949 230953 249670 280800
12156 280800 304581 317574 301411 293660 290166 279029 285833 295062 310543 355869 380480 357339
12144 357339 331081 296689 262821 284393 312808 312504 333176 317726 311069 339656 341672 342164 309994
12131 309994 332031 359026 381334 375287 354427 353684 345614 337646 362295 402222 407542 425643 458411
12118 458411 471954 459288 462603 475007 481843 452669 428121 434750 457313 463518 482386 490023
12106 490023 534549 557234 559501 578228 566596 558941 536323 546034 530285 540059 524410 521747
12094E21747L1643L3690j0163k9724j1728n894o539N2135J8150K0029L393J2522
12082F29261J5411R854J6359n771J5089K0784M712K4008J9614J6688N19p909J6058
12069G74677O644Q706K7021K7537J7366n602m0380l3735K3104N4059J2750J6878
12057H89025K9105L9855J3600L4346J8220J8763q346J5703J7657K1304O0838N63
12045A150633l461M5243K9604j3108o635K8373M5090L0713M7744M6627O8822L2291
12033A501936p371O413L3943L7456K4415L0865L8751L7103J5099K2557N6473O5845
12021A863485M6961N5459N4514M5805N1964L9847N1676L7788N1309Q2549Q3085
12010B464442N4470M8737N6751P2348O4308M9206M8101N8439J20108J10603Q5250
$$ plain form
12094 521747 553390 587080 576917 547193 535465 529571 523032 575167 593317 613346 616739 629261
12082 629261 644672 654526 670885 665114 680203 700987 705699 729707 749321 766009 766528 758619 774677
12069 774677 781321 790027 817048 844585 861951 856349 815969 782234 805338 859397 872147 889025
12057 889025 918130 957985 971585 1005931 1024151 1042914 1034568 1050271 1067928 1089232 1150070 1150633
12045 1150633 1147172 1192415 1222019 1208911 1202276 1230649 1275739 1306452 1354196 1400823 1469645 1501936
12033 1501936 1494565 1500978 1534921 1572377 1596792 1627657 1666408 1703511 1718610 1741167 1797640 1863485
12021 1863485 1910446 1965905 2020419 2066224 2118188 2158035 2209711 2247499 2298808 2381357 2464442
12010 2464442 2518912 2567649 2624400 2696748 2761056 2810262 2858363 2916802 3036910 3147513 3232763
11999C232763R9197J09632R0698J12598R2930J02570J25603J22712J17806J13459
11989D319968R9480J28859J30018J38571J17798J50372J72225J22641J27900J72042
11979E679874J98920K06671J73072J57728J90634J95582K07898J43632J37106
11970G291117J53538K11409K20399K14261K10405K04933J36209J25408J61604
11961H929283J91488J75926J60172J07600J32329J32475J12612J00689O8378M1035
11951A0151987J8630J5052J6535r918l2748m7467n2847r2433j35415j60784j40138
11940I530454r5239j19799j49328j65271j62331j54897k11510j88348k21853k18927
11930G842951j87989j75731j73604j70322j86939j84868j76539j92996j68811
$$ plain form
11999 3232763 3331960 3441592 3532290 3644888 3737818 3840388 3965991 4088703 4206509 4319968
11989 4319968 4419448 4548307 4678325 4816896 4934694 5085066 5257291 5379932 5507832 5679874
11979 5679874 5878794 6085465 6258537 6416265 6606899 6802481 7010379 7154011 7291117
11970 7291117 7444655 7656064 7876463 8090724 8301129 8506062 8642271 8767679 8929283
11961 8929283 9120771 9296697 9456869 9564469 9696798 9829273 9941885 10042574 10110952 10151987
11951 10151987 10170617 10185669 10202204 10192286 10159538 10112071 10059224 9966791 9831376 9670592 9530454
11940 9530454 9435215 9315416 9166088 9000817 8838486 8683589 8472079 8283731 8061878 7842951
11930 7842951 7654962 7479231 7305627 7135305 6948366 6763498 6586959 6393963 6225152
11921F225152j64208j69358j70322j65565j06682j55971j78648j70113j32732
11912D811553j55533r0140r6906j01857j51765j53801j22655p9289r0700j06820
11902C662087q9522r7904j09521o7357p9931q0333r8837j01878o4454q2114o1870
11891B728366p5912o0479o4400o3811l9733j02357m2997J0434m5209q6566p9574
11880B077762n7839m0619o1240m8380m6957k1457k7424j7055m3894n7912l4211
11869A620774m3946m7304k7903k475n1l3097m7603l1037j5770o0009K1326R35
11857A333840l1142j5792m6578m8009j2456j7635l2219m5770m4538J3794r215
11846A044280O688j4953n3373k1319m067J4408J981j2075m7803q968k7985j8566
$$ plain form
11921 6225152 6060944 5891586 5721264 5555699 5449017 5293046 5114398 4944285 4811553
11912 4811553 4656020 4565880 4468974 4367117 4215352 4061551 3938896 3859607 3768907 3662087
11902 3662087 3572565 3474661 3365140 3297783 3217852 3137519 3038682 2936804 2872350 2790236 2728366
11891 2728366 2652454 2591975 2527575 2463764 2424031 2321674 2278677 2289111 2243902 2157336 2077762
11880 2077762 2019923 1979304 1918064 1869684 1822727 1801270 1773846 1756791 1712897 1654985 1620774
11869 1620774 1576828 1529524 1501621 1499146 1499095 1465998 1418395 1387358 1371588 1311579 1332905 1333840
11857 1333840 1302698 1286906 1240328 1192319 1179863 1162228 1130009 1084239 1039701 1053495 1044280
11846 1044280 1050968 1036015 982642 961323 957256 971664 973645 961570 913767 904799 876814 858248
11834H58248l7182j8721K816K0984l8081m0311o579j5192O620L9109J6028k6826
11822G60913k4089l705r054k5927J250O63m4926l5317j0221j486k0743k1849l435
11809E62074k6597p391N1836K2764K066k1524k2611n157k3425r825J7470j4679
11797E25001m2861o9383j2875j1146L9164K2209q739m6652J9613j8228k3350Q497
11785C81250q186O929M3863j4717k3448J52m2101J4988K3549j0367M424K581L2741
11772D11658J7109l8702p6394k2857J0444q705R485q100j728j5927r563O6396
11760C33116O658k6779M97J2152j0569m986J3554j4425j0362J5211K1920j9310
11748C16677M509J5576k5921M545O897k0548j6678m6569K5790J4196j5939l2448
$$ plain form
11834 858248 821066 802345 805161 826145 788064 747753 741174 725982 732602 771711 787739 760913
11822 760913 736824 733119 724065 698138 699388 700051 655125 619808 609587 608101 587358 565509 562074
11809 562074 535477 528086 579922 602686 604752 583228 560617 555460 532035 522210 539680 525001
11797 525001 482140 412757 399882 388736 427900 450109 441370 394718 414331 396103 372753 381250
11785 381250 373064 379993 423856 409139 385691 385843 343742 358730 382279 371912 376336 378917 411658
11772 411658 428767 390065 313671 290814 301258 292553 302038 293938 292210 276283 266720 333116
11760 333116 339774 312995 313492 325644 315075 310089 323643 309218 298856 314067 335987 316677
11748 316677 321186 336762 310841 315386 322283 301735 285057 238488 264278 278474 262535 230087
11736B30087n041J6253l515j715r75J835K820L251j1763J4960j1808k1750m0963
11723A71676M833L2629J9870l9039m969n268J2371o084j2272L7469K432r044k4299
11710A80305k4539J0355J0856m693q525N327M326m6535j7756K2577q516O521R583
11697A39286L6616j547K308k448L694O613m0091k1833l8295J796j2494K4812K0451
11684A18868K7556K2023j0112J5542L8346k4998n4379j586l911j515J2594J0750
11672A49178K2992J2648l2633r122k096k5198J4435M7756J2715l1221k0506p912
11660A31036L1636o186o4169n7711J6548K4768l5654J6040K6073N1399j5763P352
11648A25369k535L9002Q391j3326O718j1468j0548q045j2230J9649l669k0470
$$ plain form
11736 230087 225046 241299 237784 236069 235094 236929 239749 243000 231237 246197 234389 212639 171676
11723 171676 176509 209138 229008 189969 185000 179732 192103 186019 173747 211216 213648 204604 180305
11710 180305 155766 166121 176977 172284 163759 169086 173412 126877 109121 131698 123182 129703 139286
11697 139286 175902 174355 176663 174215 177909 184522 144431 122598 84303 86099 73605 98417 118868
11684 118868 146424 168447 158335 173877 212223 187225 132846 131260 127349 125834 138428 149178
11672 149178 172170 184818 152185 143063 140967 115769 130204 177960 190675 159454 138948 131036
11660 131036 162672 156486 92317 34606 51154 75922 40268 56308 82381 133780 118017 125369
11648 125369 122834 161836 170227 156901 163619 152151 141603 133558 121328 140977 137308 116838
11636A16838O636J7923r212Q192k2763m437j0809o264O565K4923J1296j6365k8552
11623I3971m4870O710j1533m87K3914L889q417J1844r607J801J5264p893R85J075
11609G6646K6376j9149M093l234l1171j8891Q267M0514j7496J3337K3749K5311
11597A28352J1328j5567j4873k1945J5762p260o042K0767J596k426L600J8497
11585A31789j9016L097K3224j3997l4848k6397j2523M752J5901j0325j7966L9265
11573H2956O02j1991j852k6199P996K8792L6214K6149j1919J7637J666m41j8672
11560A30938m7134l4199k696N700k1710J2733j049j5790K3416n625M1734K8848
11548A15166j9817n7377k1453J3978J3285j3989j695K4723M781k5115N653J4275
$$ plain form
11636 116838 123474 141397 132185 140377 117614 113177 102368 96104 102669 127592 138888 122523 93971
11623 93971 49101 55811 44278 43791 67705 71594 63177 75021 65414 67215 82479 74586 75571 76646
11609 76646 103022 83873 87966 84732 53561 34670 42937 83451 65955 79292 103041 128352
11597 128352 139680 124113 109240 87295 103057 95797 89755 110522 112118 109692 113292 131789
11585 131789 112773 115870 139094 125097 90249 63852 51329 56081 71982 61657 43691 82956
11573 82956 83558 71567 69715 43516 51512 80304 116518 142667 130748 148385 150051 149610 130938
11560 130938 83804 49605 46909 52609 30899 43632 42583 26793 50209 44584 86318 115166
11548 115166 95349 37972 16519 30497 43782 29793 28098 52821 57602 32487 38140 52415
11536E2415l2594q72J7209o388K0907j3898j7249R247M3224j1127j5996j9190
11524B5688j9970N747L4501K8955J4687p911K3293k2330k0452j8101m015p398
11512C2694j2165l4831K828L0944N449K4092m922K722J7404J7489J286j9654q585
11499E4751K5158P720k3339r251N142O143k315k7323k397J8279l4854n566m42
11486A1706P628K5818r21l0386J9955K6435J0235o871l428L272Q135l1654o94
11473C9230m657K570P850n24L3641K6029n433l8683j3473l4j0106k8470K5813
11460C3753J2562K0442k4983k4850L3347K8905L047j1487j0131l5561k6228J5029
11448A3845K204M0928L5333r080l5564j2705M13l6054l5613K1635L6545m356r730
$$ plain form
11536 52415 19821 18949 36158 29770 50677 36779 19530 28777 72001 60874 44878 25688
11524 25688 5718 11465 45966 74921 89608 81697 104990 82660 62208 44107 40092 32694
11512 32694 20529 -14302 -11474 19470 24919 49011 44089 46811 64215 81704 82990 63336 54751
11499 54751 79909 87629 64290 55039 60181 66324 64009 36686 34289 52568 17714 12148 11706
11486 11706 19334 45152 44231 13845 33800 60235 70470 63599 60171 63443 71578 39924 39230
11473 39230 34573 37143 44993 44469 78110 104139 98706 60023 46550 46516 36410 7940 33753
11460 33753 46315 66757 41774 16924 50271 79176 82223 70736 60605 25044 -1184 13845
11448 13845 16049 56977 92310 83230 47666 34961 35374 -680 -36293 -14658 21887 17531 7801
11435G801K8828o582j5204n766m1336j9087P311L8356K4503L1050L340l3605j6879
11422B730Q678R349m74J9241J1945J9051l6873k3838K844J2005K88j259R535M624
11408C7846l6153l4109J6477L486K513K3145J492l9414J1338k12j7480l0644K0327
11395d1388L1178L7321l4502j1640K4126R463k1917j3949J2420J4498j437J6036
11383B0209J7365l8693K963Q312k3387K0944M778J475R746L3703R229l5310k5094
11370F240M861K6778j250q519J684Q763n969N750K9528N681j1756r938m6179k0046
11356a4372P707J7379K6412R033j3693J1433j0369J7734j6277j8838k2886p603
11344a4340K0773p170r819J7208P461O102k611k6253J5639K0240p078J878l2949
$$ plain form
11435 7801 36629 30047 14843 9077 -32259 -51346 -44035 -5679 18824 49874 53214 19609 2730
11422 2730 11408 20757 20283 39524 51469 70520 33647 9809 12653 24658 24946 23687 33222 37846
11408 37846 1693 -32416 -15939 -12453 -9940 13205 14697 -24717 -13379 -13591 -31071 -61715 -41388
11395 -41388 -10210 27111 -7391 -19031 5095 14558 -7359 -21308 -8888 5610 4173 20209
11383 20209 37574 -1119 1844 10156 -13231 7713 12491 13966 23712 57415 66644 31334 6240
11370 6240 11101 37879 36629 28110 29794 38557 32588 38338 67866 73547 61791 51853 5674 -14372
11356 -14372 -6665 10714 37126 46159 32466 43899 33530 51264 34987 16149 -6737 -14340
11344 -14340 6433 -737 -10556 6652 14113 20215 17604 -8649 6990 27230 20152 22030 -10919
11331a0919L8291J9263P502R417o940j4627L9187M884k1003k5723l3937j4828
11319i433L3282j246J6277J6989m9516m0546k8724J6832N6149K7098J2948k1913
11307B8197j0446j1566Q169m342k5103k4688J6168K0921J698k0366J6646J9489
11295A4777k3612M3739K3527m2825j3667J0641J4312j881j4226l442k770K79J391
11282F243r13j4063K9664N537j6333j1701K0640j405P79j5888q084k6417k1131
11269e3072p812R94J7494P473J6522L4785J8693K6224p007l4044j620l3787J5224
11256F7L7552J5169J5711J3031l6035p399k3800N515m336p180j9552J5784P663
11243A2190j8307j0956k009k1315j8338M5664L7676l133n969j0107n893R313j1985
$$ plain form
11331 -10919 27372 46635 54137 63554 56614 41987 81174 86058 65055 39332 5395 -9433
11319 -9433 23849 22603 38880 55869 6353 -34193 -62917 -46085 10064 37162 50110 28197
11307 28197 17751 6185 14354 10012 -15091 -39779 -23611 -2690 -992 -21358 -4712 14777
11295 14777 -8835 34904 58431 15606 1939 12580 26892 25011 10785 7343 4573 4852 6243
11282 6243 5330 -8733 20931 26468 10135 -1566 19074 17669 18448 2560 -5524 -31941 -53072
11269 -53072 -60884 -59890 -42396 -34923 -18401 16384 35077 61301 54294 20250 18630 -15157 67
11256 67 37619 52788 68499 81530 45495 38096 14296 19811 15475 8295 -11257 4527 12190
11243 12190 -6117 -17073 -19082 -40397 -58735 -13071 24605 21472 15503 5396 -497 8816 -3169
11230c169M177J6900L0524k0255k2727k9262m133J8542m947K3103K9694j9819
11218A8628r383N728j7565p893R625r077p106j2673q291J3886J4910K3769j3701
11205H57k1229K3166N892l1163j5550K1295J7959j5879m4308J7807L1224J7336
11193G407k556O284K8092P796l0810l6971l4465j3063M2414m204r060J3100K010
11180b4026J6374J5455J8033J4057m3445P689k1170k6942K8010K9331J7854J2459
11168D3679j1321k1252q990J2617L4520O998l5468K707o865n346q541l106K123
11155A755P266K6746o123k2607k7362k010M3180K7061q917j4553J9671M46J1886
11142E6439k2590q461P970J1399m562p007j4960m523L3775m555j7516J57l5468
$$ plain form
11230 -3169 1008 17908 48432 28177 5450 -23812 -27945 -9403 -14350 8753 38447 18628
11218 18628 9245 14973 -2592 -10485 -860 -9937 -17043 -29716 -38007 -24121 -9211 14558 857
11205 857 -20372 2794 8686 -22477 -38027 -16732 1227 -14652 -58960 -41153 -9929 7407
11193 7407 4851 11135 39227 47023 16213 -20758 -55223 -68286 -25872 -30076 -39136 -26036 -24026
11180 -24026 -7652 7803 25836 39893 -3552 4137 -17033 -43975 -15965 13366 31220 43679
11168 43679 32358 11106 2116 14733 49253 56251 20783 23490 16625 11279 2738 -368 1755
11155 1755 9021 35767 29644 7037 -20325 -22335 20845 47906 38989 24436 44107 44553 56439
11142 56439 33849 25388 33358 44757 40195 33188 18228 13705 47480 42925 25409 25566 -9902
11129i902P684k2746m382Q25l2738J3078M0528J7727J6331l1388M925N081l239
11116A784j0121J5763J4988J6503r275j8404R245k4382P406J1814L63O894j439
11103B1139M931j7383J9413j0558n255J9250k802K1754r796k0725J7869L6824
11091G4661k5101P605O769l1104j0095p894K4012L7932l236l7727m9219J2476
11079i21L0159o785n86K9388K1606l1738o919N678k5322l8489J0443N736K7307
11066A9557N0216K3890J0544j1298k7471k5768m5461k1416K2969K4902P242j1320
11054A6586o17N317R293L2975J86l2008j9735m0761J5636J403l0962R599K3333
11041i755M1329J4261K5033K7518K3790J8794j0980j2685K3493M336j8954P272
$$ plain form
11129 -9902 -2218 -24964 -29346 -28521 -61259 -48181 -7653 10074 26405 -4983 -58 5023 1784
11116 1784 -8337 7426 22414 38917 29642 11238 20483 -3899 3507 15321 15684 22578 21139
11103 21139 26070 8687 28100 17542 12287 31537 28735 50489 40693 19968 37837 74661
11091 74661 49560 57165 63934 32830 22735 14841 38853 76785 73549 35822 -13397 -921
11079 -921 29238 22453 21867 51255 72861 41123 34204 39882 14560 -23929 -13486 -7750 19557
11066 19557 69773 93663 104207 92909 65438 39670 -5791 -27207 -4238 20664 27906 16586
11054 16586 15969 21286 30579 63554 63740 31732 11997 -28764 -13128 -11725 -42687 -33088 -9755
11041 -9755 31574 45835 70868 98386 122176 140970 129990 117305 140798 145134 126180 133452
11029A33452L7890J5229K6813J4804j2236J3642N1981J6385j2361l2116K814O019
11017B62316M2282L7670K6473O4193Q9445O2262O921k4509o3496o8781p0333m0075
11005C24368j8212K38k2077m694K6219J6752j5946j4687l0745o3265j0651O023
10993A93323k6541n342j7172L3684L4901j6127j9653k7523j2220R555J3150J8715
10981A78750j5429k9257j3547L9290j5333J1810K9883j5984L8974J00298J39009
10970D48464J68782K63476M14192N20902M49958K09400n3137l06574m89367m84848
10960A141248l48421k04325j11368r7861q5748k4272j3697m0309j4415J3332o171
10949B07993m5787k1425J4107K4909k5954k796m954O494k1498l7441j6504N295
$$ plain form
11029 133452 171342 186571 213384 228188 215952 229594 281575 297960 285599 253483 256297 262316
11017 262316 304598 342268 368741 432934 522379 584641 591562 567053 503557 434776 364443 324368
11005 324368 306156 306394 284317 279623 305842 322594 306648 291961 261216 197951 187300 193323
10993 193323 166782 161440 144268 177952 212853 196726 177073 149550 137330 146885 160035 178750
10981 178750 163321 134064 120517 159807 144474 156284 186167 170183 209157 309455 448464
10970 448464 617246 880722 1294914 1815816 2265774 2475174 2422037 2115463 1626096 1141248
10960 1141248 792827 588502 477134 379273 293525 269253 255556 215247 200832 214164 207993
10949 207993 162206 140781 154888 179797 153843 151047 146093 152587 131089 93648 77144 82439
10937H2439K0013N559j9809P517j0135J3101K299k1474k475j4303q668J9043M1427
10924A14534M038q374l844j7483j1136n320j2707J7321K197j4122P366J075J1160
10911H4705q141R156k4016l1394J6549J3794K5440j4535P731j4787l6151J188
10899B9539K9252j4077k1776J3718K824J0499l3220m412p301j1106J8841L1459
10887D4240J9435j7888k2407j8828l0931j5882k7553m084L5313K3798l651k563
10875b1001j8069p913L389K6263J5030M932o702R09M358p774p971K7324J8003
10862C0778J2045K2505j2482K00k2618j4082P698j2959o904J5622K0686j174m526
10849C4789K1614L414N608K4544J1353P458L4662J0881k7951l0974l2918q4850
$$ plain form
10937 82439 102452 108011 88202 95719 85584 98685 100984 79510 77035 62732 54064 73107 114534
10924 114534 118572 110198 106354 88871 77735 72415 59708 77029 79226 65104 72470 73545 84705
10911 84705 76564 85720 61704 30310 46859 60653 86093 71558 79289 64502 28351 29539
10899 29539 58791 44714 22938 36656 39480 49979 16759 12347 5046 -6060 12781 44240
10887 44240 63675 45787 23380 4552 -26379 -42261 -69814 -73898 -38585 -14787 -18438 -21001
10875 -21001 -39070 -46983 -43594 -17331 -2301 2631 -4071 -3162 1196 -6578 -14549 12775 30778
10862 30778 42823 65328 52846 53046 30428 16346 24044 11085 4181 19803 40489 39315 34789
10849 34789 56403 59817 65425 89969 101322 108780 143442 154323 126372 95398 62480 -22370
10837b2370n5645m459k263L0975N3205O2581j3285l3862m211L3878M1382K6051
10825A11977J4124K326k907m658j6642k8230j2167m4042l306j2192L1747K320
10813C8350K71K1782J9048L492K9824k5029m0865R900J9422j8372O341J6707j584
10800G9287J2393n037k9637j5637J2396n287M112o957M5430Q635l171j2380n780
10787G8367R410K1531M6188O3702N9931J9150j7594l8182K1730P4205O241l3935
10775C10744l5249j4345L0290k378O488k7650m3944k2506k3443L1251m427j7927
10763A86904n358j0459j530n029k6556k6847n952j427J3500K4834K5143l5925
10751A31298k4013j2607j6982L098m609K4025J8922J0759O96k0000O127K4066
$$ plain form
10837 -22370 -78015 -82474 -84737 -53762 -557 62024 48739 14877 10666 44544 85926 111977
10825 111977 126101 128427 125520 120862 104220 75990 63823 19781 16475 4283 36030 38350
10813 38350 38621 60403 79451 82943 112767 87738 46873 56773 76195 57823 64164 80871 79287
10800 79287 91680 86643 57006 41369 53765 48478 52590 45633 91063 99698 96527 84147 78367
10787 78367 87777 109308 155496 219198 279129 298279 280685 242503 264233 338438 344679 310744
10775 310744 275495 261150 291440 289062 295550 267900 223956 201450 178007 209258 204831 186904
10763 186904 181546 171087 169557 164528 137972 111125 105173 103746 117246 142080 167223 131298
10751 131298 107285 94678 77696 80794 76185 100210 119132 129891 130587 110587 116714 140780
10739A40780M1318j5607m8207j6210J1334k3355j1539k7484r175L4101M7632J3330
10727A36918N051L716n6264r094M0642J7642j9978K0069J8761j4386k4686k8710
10715H9681n552o304J2376j5522j1882k8548j5938L673J6320j7402K7484J1566
10703E9952k4391j2963l3682l290j0854k8557j1776M2445K6606j9967M3016J8425
10691D4964j2196K4209L5097L7314L1835K1671L570L4332O3809N2592n443o6740
10679B65014p2060k7040k1801m588O397j0639R448K4858J3426m26j0628L0098
10667B02059J5199L6496K4668m516k3491n8358m244l690m3028k1919l5941j08461
10655b5226j37667j24634r7067o9095J9296J22877J34052J39969J32021J14977
$$ plain form
10739 140780 182098 166491 118284 102074 113408 90053 78514 51030 41855 75956 123588 136918
10727 136918 141969 145685 89421 80327 120969 138611 118633 138702 157463 143077 118391 89681
10715 89681 84129 77825 90201 74679 62797 34249 18311 21984 38304 20902 48386 59952
10703 59952 35561 22598 -11084 -14374 -25228 -53785 -65561 -23116 3490 -16477 26539 44964
10691 44964 32768 56977 92074 129388 161223 182894 186464 220796 284605 337197 331754 265014
10679 265014 192954 165914 144113 139525 145922 135283 144731 169589 183015 182589 171961 202059
10667 202059 217258 253754 278422 273906 250415 192057 187813 184123 141095 119176 83235 -25226
10655 -25226 -162893 -287527 -384594 -453689 -434393 -311516 -177464 -37495 94526 209503
10645B09503Q9449Q0313M0442J9571K0648L8315J6092n764N950m4049j3110j611
10633D55749N559P7623M7321P6760J03928O6488Q2569R3861J17470J32779J42615
10622A402722J48680J21263Q1891J34006J88430K83071L78695M24347N72863Q03026
10612D538994J115353J531229K091821K612753L018725K884745K191827J183967
10604B1169414J27358n63374p32460k29883O97728J921260L487937N044161O011249
10595C6933390N576392L672823J045574j478581l129814l239187k033886n8088
10587C7288623K203219M696385O916225P992686O971477L888420N2779l220822
10579F6788992m964687m234379j501516K224015O240195R681550J1164331R470301
$$ plain form
10645 209503 298952 379265 419707 439278 459926 498241 514333 508569 514519 470470 457360 455749
10633 455749 461308 538931 586252 663012 766940 833428 915997 1009858 1127328 1260107 1402722
10622 1402722 1551402 1672665 1754556 1888562 2076992 2360063 2738758 3163105 3735968 4538994
10612 4538994 5654347 7185576 9277397 11890150 14908875 17793620 19985447 21169414
10604 21169414 21296772 20733398 20000938 19771055 20468783 22390043 25877980 30922141 36933390
10595 36933390 42509782 46182605 47228179 45749598 42619784 39380597 37346711 37288623
10587 37288623 39491842 44188227 51104452 59097138 66068615 69957035 70009814 66788992
10579 66788992 61824305 57589926 56088410 58312425 64552620 74234170 85398501 94868802
10571I4868802M525998k087942q284497j2293424j3269514j1648895q847857o058604
10563C6904067l719912j956563p83182k70844m76091j202303k189507k953716
10555B3351949l221573k989675k433156j761167j217472p94847m74643k12844
10547A0246572j4434R8236K00922M03637O30812R18998J382629J812228K225385
10538A7904985K386692K687688L279508M237509N965986Q819337J3439101K1287117
10530H0007923L5313809N9220844R1187300J09396523Q4528506K7477681k7472256
10523D59660330p6460006j03770252q9676918n9794895l6708861k2924089j4958832
10516E5366477j0165843p112478n134955l975580l346696k954817k733576k496844
$$ plain form
10571 94868802 99394800 97306858 89022361 76728937 63459423 51810528 42962671 36904067
10563 36904067 33184155 31227592 30444410 30173566 29697475 28495172 26305665 23351949
10555 23351949 20130376 17140701 14707545 12946378 11728906 10934059 10459416 10246572
10547 10246572 10232138 10330374 10531296 10934933 11565745 12484743 13867372 15679600 17904985
10538 17904985 20291677 22979365 26258873 30496382 36462368 45281705 58720806 80007923
10530 80007923 115321732 174542576 265729876 375126399 459654905 487132586 459660330
10523 459660330 383200324 279430072 189753154 129958259 93249398 70325309 55366477
10516 55366477 45200634 38088156 32953201 28977621 25630925 22676108 19942532 17445688
10508A7445688k135463j743350j413115j212133j029127q54498o91769n97869
10500G768364n19390m44824m16243l92665l68561k74601k18434j78573k03535
10491D751538k50156k24648j83053j70142j36658p8994M4747J34239J34579Q1565
10481D103017j01108k70839l81604l73632l55326k74096j86860j59037j25648
10472A874867r4829j14752j40564r9552m5442l2513n8936k9657m9414m2899k099
10461A164210J6690j3273j2823k5686k5095R404q43M798l1697q1589l5405J1357
10449I80048j6155m4332m777L0644l7944o4641k4088k7605m2191k7105r41j7235
10437G03678m6639o7452j0104J7327l982j2304l2965k9995p122j4523n7567J6320
$$ plain form
10508 17445688 15310225 13566875 12153760 10941627 9912500 9058002 8366233 7768364
10500 7768364 7248974 6804150 6387907 5995242 5626681 5352080 5133646 4955073 4751538
10491 4751538 4501382 4276734 4093681 3923539 3786881 3707887 3752634 3886873 4021452 4103017
10481 4103017 4001909 3731070 3349466 2975834 2620508 2346412 2159552 2000515 1874867
10472 1874867 1780038 1665286 1524722 1425170 1379728 1347215 1288279 1258622 1209208 1166309 1164210
10461 1164210 1180900 1167627 1154804 1129118 1104023 1113427 1112584 1117382 1085685 1004096 968691 980048
10449 980048 963893 919561 914784 945428 907484 842843 818755 791150 748959 721854 720913 703678
10437 703678 657039 589587 579483 596810 592828 580524 547559 517564 510442 495919 438352 454672
10425D54672J3725j7697l637p435l6092j5571M98J5216P437l8947L102m4657l0364
10412C00250k2519K2130K3846l2902J0073K2536J0930M7552P7507M3708J12751
10401F15862J59386J66048J19564J02451J736j56483j82936j69512j24435q3628
10391D48053l8959k3194j5688l7697l9480n1428j9006k5698j3686K8258J1769
10380B23244L289j5753k1232l0849K6105L9096Q581m0303K2022J9540n2846m5380
10368A35514m0931j0139M7115M5292K7975k2799j7341J4575o064l2426j2212J7808
10356A46367L197L6402l960q410Q931p538J1499j4200l91r847k2950L397k2666
10343A19831R503j5160j9342M319m5974m0892L4024O1165M5588J9245l6309p4940
$$ plain form
10425 454672 468397 450700 447063 439628 403536 387965 388463 403679 411116 372169 375271 330614 300250
10412 300250 277731 299861 323707 290805 300878 323414 334344 381896 459403 503111 615862
10401 615862 775248 941296 1060860 1163311 1165047 1008564 825628 656116 531681 448053
10391 448053 409094 385900 370212 332515 293035 241607 222601 196903 183217 211475 223244
10380 223244 226533 210780 189548 158699 184804 223900 232481 192178 214200 233740 180894 135514
10368 135514 94583 84444 131559 176851 204826 182027 164686 179261 173197 140771 128559 146367
10356 146367 149564 185966 182006 173596 182527 174989 186488 172288 171897 162050 139100 142497 119831
10343 119831 129334 114174 94832 99151 53177 12285 46309 107474 153062 172307 135998 61058
10331F1058k1858K6311j1143L520K7456R006K6621k4849N71N8884J3751l2894
10319A36434l6314l0079j0563M8044K5390k2963k3238l1291l323L0333K438k939
10307H1929M2854K6398m662o880k4876l6681l934L3773M1003j7903j1185J0467
10295A30303J2243J3814L575m1119j8897M805J3941k3566l1680k0066L55K6412
10283G0120J2202m7166j3752J5626K9837J8379N936j4596K4396K0716m244l3489
10271H3965o907K9063J3758k4618k4764J0081L2192m886j1170L6055L859Q482
10259A45110o732j9750l6157Q957K598j5227k1149K258m656M385j7704Q290N8842
10246A09065J2792M870l1734r33M5878J6792k2376l0313K1545Q977k540q618p903
$$ plain form
10331 61058 39200 65511 54368 57888 85344 94350 120971 96122 96693 155577 169328 136434
10319 136434 100120 70041 59478 107522 132912 109949 86711 55420 52097 82430 84868 81929
10307 81929 124783 151181 146519 139639 114763 78082 74148 107921 148924 131021 119836 130303
10295 130303 142546 156360 159935 118816 99919 104724 118665 95099 63419 43353 43708 70120
10283 70120 82322 35156 21404 37030 66867 85246 91182 76586 100982 121698 117454 83965
10271 83965 77058 106121 119879 95261 70497 80578 112770 107884 96714 132769 136628 145110
10259 145110 138378 118628 82471 91428 94026 78799 57650 59908 55252 59637 41933 50223 109065
10246 109065 121857 126727 94993 94060 139938 156730 134354 104041 125586 134563 132023 123405 115502
10233A15502k8445J2441P217J1125Q939k3239j2971K3483k2131j2894K5674j2054
10221I2647L8209L1757k1844k8565M43K4795J746K7301k4210k1962m7011j7317
10209E5989k2425p058j2378K9042L0652n944l305K142o670J8609M043k5302l219
10196E4176J7380J4346M375J2439R739j3790j4701l831J3593m532o2778j8292
10184H124M771n479R386O652O050r277L1403K2480J7374l260J6321p251L6936
10171A34230L6639K1271j7414O169L164n4359R305j0921k7966j380N4227N2934
10159B05899K0821R6887K1816k1363n4399o4740n658M255o104K1411P0072N7995
10147C46892Q1567J7997k2418p8399m1618k1154j887p321K0459P963o789l328
$$ plain form
10233 115502 87057 99498 106715 117840 126779 103540 90569 114052 91921 79027 104701 92647
10221 92647 130856 162613 140769 112204 112647 137442 139188 166489 142279 120317 73306 55989
10209 55989 33564 26506 14128 43170 73822 67878 64573 66715 60045 78654 82697 57395 54176
10196 54176 71556 85902 90277 102716 112455 98665 83964 80133 93726 89194 26416 8124
10184 8124 12895 7416 16802 23454 29504 20227 51630 74110 91484 88224 104545 97294 134230
10171 134230 170869 192140 174726 180895 184059 129700 139005 128084 100118 98738 152965 205899
10159 205899 226720 323607 345423 324060 269661 204921 199263 203518 197414 218825 288897 346892
10147 346892 428459 446456 424038 345639 304021 282867 280980 273659 294118 302081 295292 291964
10135B91964L1232J9063J5551J9484J9715k3326l9170L0816L8591J7708k1245
10124D00383k5884J5587Q382m7033n8998n2165l5378k6398l5834k9157l1223j5816
10112F6466R973L332Q330J9752l2607q06L4024M0351l0827j7542k1811L095K5080
10099A06810k0031j9518Q071J6128p408L5531J2648J117J0488r984J5945M7086
10087A96883M7783P4565J26639J84815L13200M33618N09060L99923J66989n7080
10077B396395l32135m96929m70275l08819j88978r9879r4054j01103o8361o1705
10067A74157j4198K4662l6091k2333k4035l6234K576k1121l6883o07Q005N2848
10055G0746j5377J64Q419L302P494m235k9320k6362K0120L1536J6995l7911R969
$$ plain form
10135 291964 323196 342259 357810 377294 397009 373683 334513 365329 403920 421628 400383
10124 400383 374499 390086 398468 351435 292437 240272 204894 178496 142662 113505 82282 66466
10112 66466 76439 79771 88101 107853 75246 74440 108464 148815 117988 100446 78635 81730 106810
10099 106810 86779 67261 75332 91460 84052 119583 132231 133348 143836 133852 149797 196883
10087 196883 244666 319231 445870 630685 943885 1377503 1886563 2286486 2453475 2396395
10077 2396395 2064260 1567331 1097056 788237 599259 499380 405326 304223 235862 174157
10067 174157 159959 184621 148530 126197 102162 65928 68504 47383 10500 9893 17898 70746
10055 70746 55369 55533 63952 67254 74748 70513 41193 14831 34951 66487 83482 45571 55540
10042E5540k2781n4268J5766M7903M502M782L6240n987l1396J7997R303n784M0947
10029A12764J326k7917k8453J0832k0763P500K134j0203j1532L2504L128k9305
10017D2015j9311k4159q494k1418J2996K159N1366O948k1306n0548J9828K5200
10005A5276K2483K8416m2764j1054j4060q014J1805k0260P303J7257j2749l1755
9993c8116r654k1777j148K5255L8026J4539o449J8543L0988K1494L699q872J4335
9980H0863J9572k0054m3164j8491k3199P939J466k4294N43j8902k5131L9578L4934
9967A1660N756j7110J3847L6084O155l0760K4910R811j9839k35k4029p842j6454
9954h046r953J8449m634l76K9958j8545j5624N06J4446l1382K4011N275J6000
$$ plain form
10042 55540 32759 -21509 -5743 42160 46662 51444 87684 81697 50301 68298 77601 71817 112764
10029 112764 114090 86173 57720 68552 47789 55289 57423 47220 35688 68192 71320 42015
10017 42015 22704 -1455 -9949 -31367 -18371 -16212 35154 42102 20796 -29752 -9924 15276
10005 15276 37759 66175 23411 12357 -1703 -9717 2088 -18172 -10869 6388 -6361 -38116
9993 -38116 -47770 -69547 -70695 -45440 -7414 7125 676 19219 50207 71701 75400 66528 80863
9980 80863 100435 80381 37217 18726 -4473 3466 4932 -19362 -18819 -37721 -62852 -23274 11660
9967 11660 17416 306 14153 50237 56392 25632 50542 60353 40514 40279 16250 8408 -8046
9954 -8046 -17999 450 -4184 -4560 25398 6853 -8771 -8265 6181 -25201 -1190 4085 20085
9941B0085J5225J9262L2044m9503j5723L4244N837j4593k9996l0946j9053j6393
9929d9510R603M1368J5150O455k9549K982q47J384J6094K460N379J0320J3584
9916D4873n718m2856j4317L0922j1140K756R791j5526k9346j6655J7142O694k3425
9903d6805J978J5715k5443L9369L959J6432K5738k591l1986K200J2545K2061o596
9890B6576J9473L3551j6016r451M188n6199o430k8727l2260m397J4648K1200L9792
9877E948J6257k3811K7019k370O621L4013j9174k1096k2179l3636k5288Q917K2839
9864b5940L8626J9754j7L544J087J4834k4611k5667k9211l4152P799K413Q011
9851d3530K8449O916K50L468k902j1993k532k0103L79M1144L9112m2m0394k672
$$ plain form
9941 20085 35310 54572 86616 37113 21390 55634 61471 46878 16882 -14064 -33117 -49510
9929 -49510 -39907 1461 16611 23066 -6483 -3501 -4348 -2964 13130 15590 20969 31289 44873
9916 44873 39155 -3701 -18018 12904 1764 4520 14311 -1215 -30561 -47216 -30074 -23380 -46805
9903 -46805 -44827 -29112 -54555 -15186 -11227 5205 30943 28352 -3634 -1434 11111 33172 26576
9890 26576 46049 79600 63584 54133 58321 2122 -4308 -33035 -65295 -69692 -55044 -33844 5948
9877 5948 22205 -1606 25413 23043 29664 63677 44503 23407 1228 -32408 -57696 -48779 -25940
9864 -25940 12686 32440 32423 35967 37054 51888 27277 1610 -27601 -61753 -53954 -51541 -43530
9851 -43530 -15081 -8165 -7915 -4447 -7349 -19342 -21874 -41977 -41598 -454 38658 38616 -1778 -4450
9837d450o343m416J5618l7734o1939l264K8989J0895Q564M9829K2410o679Q24
9824A2304K9409P776P481l0894Q738Q288O59J3024j4219q007j3553k429Q031l2161
9810e553j037j667k6799n4060k0441N3114L1078m169J7757L0693L4294j1127r967
9797C2116n267Q675J1856m167k0275k6917M636J9979O388J1242p376r389m149
9784A7352J290J4559j9351J3255J3702k0686k3491n954K5803k798k1482M511L0908
9771B7618P882m0293l9697N83L2074j1155J9361L661j1837J597Q288J8503j563
9758A5022O636p790P359J7261J2806j4017O501J0434k5310q272J2119K0612k4992
9745B8369q378k3538r470j1444k1514l8152K1551J3011J7590N775l0708p51Q213
$$ plain form
9837 -4450 -10793 -15209 409 -37325 -99264 -102528 -73539 -62644 -54080 -4251 18159 11480 12304
9824 12304 41713 49489 56970 26076 34814 43102 43761 56785 42566 34559 21006 18577 26608 -5553
9810 -5553 -6590 -8257 -35056 -89116 -109557 -56443 -25365 -29534 -11777 18916 53210 42083 32116
9797 32116 26849 35524 47380 43213 22938 -3979 657 20636 27024 38266 30890 21501 17352
9784 17352 18642 33201 13850 27105 40807 20121 -3370 -9324 16479 13681 -7801 -3290 27618
9771 27618 35500 -4793 -44490 -43907 -11833 -22988 -3627 34 -11803 -10206 -1918 16585 15022
9758 15022 21658 13868 21227 38488 51294 37277 43778 54212 28902 20630 32749 53361 28369
9745 28369 19991 -3547 -13017 -24461 -45975 -84127 -62576 -49565 -31975 -26200 -56908 -57659 -49446
9732d9446M4906M8458q634k6209q185m357j4717M983n320j5083K3765J6538p927
9719a228M8067J7222m2974j4822J4124o551k435K9597R208k0179j5176J4278J216
9706C0347k989m1999k7650j6682K1933K0635M0776J1481j5737R249K7877j8831
9694C8410k0707m030K543l6010j0079O771J2918j414K1480m35m050m0914J3957
9681b1560L268M601J3464L9116K5085j1177l9644l9886j7002K469N3002K3458
9669C5194j5294j1396k1104j5346J6319j5824J9626j0390j5130L6378O636j1022
9657a353P653n881m716L9223J5802l7249p908J9923K9407K2345J0638M4345K5752
9644A57981M7077k8594q4181m3699l2352J1870q650m972L200j3173J3623Q512
$$ plain form
9732 -49446 -4540 43918 35284 9075 890 -3467 -18184 -13201 -18521 -33604 -9839 6699 -1228
9719 -1228 46839 64061 21087 6265 20389 13838 11403 41000 50208 30029 14853 29131 30347
9706 30347 27358 -14641 -42291 -58973 -37040 -16405 24371 35852 20115 29364 57241 38410
9694 38410 17703 13673 16216 -19794 -29873 -23102 -10184 -11598 9882 9447 5397 -35517 -21560
9681 -21560 -18292 -13691 -227 38889 63974 52797 13153 -26733 -43735 -41266 11736 35194
9669 35194 19900 8504 -12600 -27946 -11627 -27451 -7825 -18215 -33345 3033 9669 -1353
9657 -1353 6300 419 -4297 34926 50728 13479 5571 25494 54901 77246 87884 132229 157981
9644 157981 205058 176464 92283 48584 16232 28102 19452 14480 17680 4507 18130 26642
9632B6642j1152Q719r138l9734j9902r210K7544K0897K2011j2948l1438j5876
9620d3585M657K0K2163l33J5153L512J6326J1376j2624k7665N814k1487j3720
9607d0393Q468M299j2634M6907N2790k2710j1374J6883j3012k5521m657L4312
9595C3358O501J6703j1871n741r557k2046k055k1299j9847j674L447o043J5807
9582b4317K2886P54r919K2749p227k4462k0554K7433J8265j5498N362r402P964
9569e966j738L138l502J1047j9463j0955m097m0768J1103M4887r745k5986N537
9556d6508P533O725k5982M840j8956o800J342J0906K6459L9803J5376k1172K150
9543d284L7804K5876j2749n148j7905M914O34q684j6729K6513R631l1212k3448
$$ plain form
9632 26642 15490 24209 15071 -24663 -44565 -53775 -26231 -5334 16677 3729 -27709 -43585
9620 -43585 -38928 -38908 -16745 -17078 -1925 1587 17913 29289 16665 -11000 -5186 -26673 -40393
9607 -40393 -31925 -27626 -40260 6647 59437 36727 25353 42236 29224 3703 -954 33358
9595 33358 39859 56562 44691 38950 29393 7347 5292 -16007 -35854 -37528 -34081 -40124 -24317
9582 -24317 -1431 -677 -10596 12153 4926 -19536 -40090 -12657 5608 -9890 -4528 -13930 -5966
9569 -5966 -7704 -4566 -8068 2979 -16484 -27439 -31536 -72304 -61201 -16314 -26059 -52045 -46508
9556 -46508 -38975 -32250 -58232 -53392 -72348 -79148 -77806 -66900 -40441 -638 14738 -6434 -4284
9543 -4284 33520 59396 46647 41499 23594 28508 29142 20458 3729 30242 39873 8661 -14787
9530a4787J0709K6975J0440L2768r938k8067j0412K2897q275l0181l9649K2168
9518a5352R548k1963l0093q654K1359L4115K2851O505j5028k6369k3025j2146
9506e8252J395K3717K0816K0395O889l5527J9059j9317o743K1255J9252m245J2434
9493B1128Q084J1427l3170l4379k7408J6603K772L6539J8150J6488j8923n198
9481A2113k0812K018J0671j8270q462Q455J468K1470J5119k4782k5367L1684K6411
9468C1716n348k2884m9110j8956L786K9379L0177J5318R699K969l606M5259k2284
9455D6115l5696q077O866N940J8154m186k2721k978n231J2474K7475J6644K3738
9442G8517O1554k3902k1791J6103M75k7458l0181k6507j263l579m4952o411K6234
$$ plain form
9530 -14787 -4078 22897 33337 66105 56167 28100 17688 40585 32310 2129 -37520 -15352
9518 -15352 -5804 -27767 -57860 -66514 -45155 -11040 11811 18316 3288 -23081 -46106 -58252
9506 -58252 -56857 -33140 -12324 8071 14960 -20567 -1508 -20825 -27568 -6313 12939 8694 21128
9493 21128 29212 40639 7469 -26910 -54318 -37715 -34943 1596 19746 36234 17311 12113
9481 12113 -8699 -6681 3990 -14280 -22742 -14287 -12819 8651 23770 -1012 -26379 5305 31716
9468 31716 26368 3484 -45626 -64582 -60796 -31417 -1240 14078 23777 26746 23140 68399 46115
9455 46115 10419 2342 9208 15148 33302 29116 6395 3417 -1814 10660 38135 54779 78517
9442 78517 140071 116169 94378 110481 110956 83498 53317 26810 25547 21968 -22984 -29395 -3161
9429c161K400P440K9858j6501J3423N6447j173k286N798o953l516j2351j7264
9416E2161q267q092r040p957K988K1718K2839J869J4366J7084N048L234k0995
9403H6956J1367R3252M6182J1774q511l2202l2222m9473k9259j0212J0001k1409
9391G6244j9216m163P935M931k0399J3330Q839k159m938K1301p958j0398j2548
9378E0801M5198K649O69j0562n134J1991k4464l4347k6582J265J1048m0867J5251
9365c084M0771J7131Q723j5782J2561k0691p218J9991N9521R556k1101k4279j8226
9352E7873j1288J0774N212j8819l6379k3963J4297M7639o332k7239l0077j3472
9340c1774R790J8115J3588j6503o726r829L515l84p216K9905K8396j0627J2674
$$ plain form
9429 -3161 -761 6679 36537 20036 33459 89906 88733 86447 92245 85292 81776 69425 52161
9416 52161 43894 35802 26762 18805 21793 43511 66350 68219 82585 99669 104717 107951 86956
9403 86956 98323 191575 237757 249531 241020 208818 176596 127123 97864 87652 97653 76244
9391 76244 57028 52865 60800 65731 45332 58662 67501 65342 60404 81705 73747 63349 50801
9378 50801 95999 98648 99317 88755 83621 95612 71148 36801 10219 11484 22532 -18335 -3084
9365 -3084 37687 54818 63541 47759 60320 39629 32411 52402 111923 121479 100378 76099 57873
9352 57873 46585 57359 62571 43752 7373 -16590 -2293 45346 39014 11775 -18302 -31774
9340 -31774 -21984 -3869 9719 -6784 -13510 -23339 -19824 -20208 -27424 2481 30877 20250 32924
9327C2924J3095K844O274k1459j3421J2900k576n022l796j9255J3841J3283N515
9314C5147J8810j2494O781j8415j7057J0032P600P449j8611k7425o398L6229J270
9301B2918K1533L786k060m089r919L599o665J908l3913j3963p700K0423K7985
9288B3843K6106l0706k5258m607j8383K059P269J8125K4958j9439l7145L319O354
9275b3505p482l1072n490p694J4093n8986n047O1734K2985J3239n013J5074J1781
9262e383j0756l9132J6341K2000k2244n210m930L2214k419r393L1520K4919j1116
9249A6411N399k4223k1695R60J6110K5353j686k1372n2639l9076N5948N6935J1469
9236B7894n904j5785J0316K353r020k6871k5558r936Q767L1889J1518j4211j4299
$$ plain form
9327 32924 46019 48863 55137 33678 20257 33157 30581 25559 21763 2508 16349 29632 35147
9314 35147 53957 41463 48244 29829 12772 22804 30404 37853 19242 -8183 -14581 21648 22918
9301 22918 44451 48237 46177 42088 32169 35768 29103 31011 -2902 -16865 -24565 -4142 23843
9288 23843 49949 19243 -6015 -10622 -29005 -26946 -19677 -1552 23406 3967 -33178 -29859 -23505
9275 -23505 -30987 -62059 -67549 -75243 -61150 -120136 -125183 -63449 -40464 -27225 -32238 -17164 -5383
9262 -5383 -16139 -55271 -38930 -16930 -39174 -44384 -49314 -17100 -19519 -28912 2608 27527 16411
9249 16411 21810 -2413 -24108 -23148 -7038 18315 16629 -4743 -57382 -96458 -40510 16425 27894
9236 27894 21990 6205 16521 18874 9854 -17017 -42575 -52511 -43744 -11855 -337 -14548 -28847
9223b8847L446j7K4351Q164P144j4398l3103k2881j5757P67J7361J454k7763J0102
9209f9977J3210K1162J6559K6861j0181j8929q569P825k126J3190K3410k2801
9197a0366K3378P24j1235k1733J273L0641m360j9977K4084j0041k4654K790O947
9184a2529l8578k0460K7182L0056N568k4893o448k4584j7639K3685M1672J6449
9172e19l508P190l509m473J425J2377K0776L0228j5360l6340k0535j9079J3548
9159a7779K1326p74Q851n671K0891M746K949r333k1036K938K6481o583k5040j790
9145A76Q299m385j5930J1860M9816J6802n7761j7096M2840J1555K3155j6783j6791
9132C5757N842k048j4525L724J4847j65m477k0270j4180j0216J4569J8250J6736
$$ plain form
9223 -28847 -25401 -25418 -1067 7097 14241 -157 -33260 -56141 -71898 -71131 -53770 -52316 -80079 -69977
9209 -69977 -56767 -35605 -19046 7815 -2366 -21295 -29864 -22039 -24165 -10975 12435 -10366
9197 -10366 13012 13736 2501 -19232 -17959 12682 8322 -11655 12429 2388 -22266 -19476 -12529
9184 -12529 -51107 -71567 -44385 -14329 -8761 -33654 -40102 -64686 -82325 -58640 -16968 -519
9172 -519 -4027 3163 -346 -4819 -3394 8983 29759 59987 44627 8287 -12248 -31327 -17779
9159 -17779 3547 2773 11624 5953 26844 31590 34539 25206 4170 7108 33589 27006 1966 176
9145 176 8475 4090 -11840 20 49836 66638 8877 -8219 34621 46176 69331 52548 35757
9132 35757 41599 39551 25026 28750 43597 43432 38955 18685 4505 -5711 8858 27108 43844
9119D3844K5855k9912k7870M766j8602N437N605k473j7133J20J4775K507j8035
9106a1116l7816J2813N0923J1541j5778j2032K2368L3603r03j7900K153j6136
9094B1720L942J541L4909j2652m6425j3708r588j471k003O861M6208K0369J3828
9081F3531j879o311k1582l4472J7188j7615j2382R000L4610M0020l4144m7309
9069a1345M44Q488J3856j0641j2722K7373K8357k7669q514l4956P317L0768L031
9056A3787P300k2667L5879K5835j0212r871r256l6424j7236P122l225J1602M9513
9043D2147J6205l7094m0936M4607R939j9273j1065j7065l6653K9592J9481O701
9031F586l4415m324q847R091K8230K665J3431K501j3574R860K3937K629n7067
$$ plain form
9119 43844 69699 39787 11917 16683 -1919 3518 9123 6650 -10483 -10363 4412 6919 -11116
9106 -11116 -48932 -36119 14804 26345 10567 -1465 20903 54506 53603 35703 37856 21720
9094 21720 25662 27203 62112 49460 3035 -10673 -20261 -21732 -23735 -16874 29334 49703 63531
9081 63531 61652 55341 33759 -713 16475 -1140 -13522 -4522 30088 70108 35964 -11345
9069 -11345 -10901 -2413 11443 802 -11920 15453 43810 16141 7627 -27329 -20012 10756 13787
9056 13787 21087 -1580 34299 60134 49922 40051 30795 -5629 -22865 -15743 -18968 -7366 42147
9043 42147 58352 21258 -19678 24929 34868 15595 4530 -12535 -49188 -19596 -115 6586
9031 6586 -27829 -32153 -41000 -31909 -3679 -1014 12417 14918 1344 11204 35141 37770 -19297
9018a9297k5384K0597M4248J090j3860m029j89L2967J7741o0390l2171K844j2050
9005d7883J0458M0611k56l00o140P148K3790l7142k9393R897N062J787o429j0349
8991c9139J0171M1125N916m8428k4949K5190L0623J2503L613p019j7075O574Q901
8978H006L0067J9055l9525j8327J288J7374n837M461l052q384l0479k0280K668
8965d2965N063K423j161L7429N881k4519j8436q393l41M0335J8403k3310k5164
8952c4755L2204K27m0956L032M0153K5169Q648l406L540j2156p107j2368k1796
8939a9571j2986r335R690K9639J9249n86k4448o267M1526j215j1384P514r48K3821
8925D4699r99J6419j8814j655j9450J0241K3519j3011k4243j7770J9917L6373
$$ plain form
9018 -19297 -44681 -24084 20164 21254 7394 3365 3176 36143 53884 -6506 -38677 -35833 -47883
9005 -47883 -37425 3186 2930 2630 -3510 3638 27428 -9714 -39107 -29210 -24148 -22361 -28790 -39139
8991 -39139 -28968 12157 18073 -30355 -55304 -30114 509 13012 16625 9606 -7469 -895 8006
8978 8006 38073 57128 17603 -724 564 17938 12101 16562 13510 5126 -25353 -45633 -42965
8965 -42965 -37902 -35479 -36640 789 6670 -17849 -36285 -44678 -45019 -4684 13719 -9591 -34755
8952 -34755 -2551 -2324 -43280 -40248 -95 25074 33722 30316 33856 21700 14593 2225 -19571
8939 -19571 -32557 -41892 -32202 -2563 16686 16100 -8348 -14615 26911 25696 14312 21826 20878 44699
8925 44699 43700 60119 41305 39650 20200 30441 53960 40949 16706 -1064 18853 55226
8913E5226p088k6297m660j7162o357j9287o155q991K692K3519J8508j739K432
8900D641p148j1962l2889r885K90r31J8545J0755l335r546L5440o107j5505k0829
8886d8466o438k244n943N3881M1666l0378P685M0164O354k9909k9482j4004k6942
8873d4056j0244J9211j214n444j4681j9688L6732M8530R769j8381M7050j6466
8861C1118k4388J9954j3281r187o590O309k3324L096K6640L993K263m834N684
8848A7453j0705K6029K5044n7606k7283j1952J2807O016n7031l4508L7013K6274
8836d8449j2327J5439R218K8951k2617J7935K67K2898J510J7671J7056j2698k5124
8823I730k5762N320l090J9966j3560k2518J7983J9085K601o906M070P648j5482
$$ plain form
8913 55226 48138 21841 17181 19 -6338 -25625 -31780 -40771 -38079 -14560 3948 2209 4641
8900 4641 -2507 -14469 -47358 -57243 -56953 -57884 -39339 -28584 -31919 -41465 -6025 -12132 -27637 -48466
8886 -48466 -54904 -57148 -63091 -9210 32456 2078 9763 49927 56281 26372 -3110 -17114 -44056
8873 -44056 -54300 -35089 -36303 -41747 -56428 -76116 -39384 9146 18915 534 47584 31118
8861 31118 6730 26684 13403 4216 -2374 3935 -19389 -16293 10347 14340 16603 11769 17453
8848 17453 6748 32777 57821 215 -27068 -39020 -26213 -20197 -77228 -111736 -74723 -48449
8836 -48449 -60776 -45337 -36119 -7168 -29785 -11850 -11583 11315 12825 30496 47552 34854 9730
8823 9730 -16032 -10712 -13802 6164 -7396 -29914 -11931 7154 9755 2849 6919 14567 -915
8810i15q122K8416q709J157k0133l465j8350q7M7142K5399l1436j3233J9619K6106
8796D3389k44O649M234Q875J659r307j6514l1779k0359J4911j7127J465P256o140
8782a3032q806j6095J4131N0965k7452n0531k7321K4397K2746k7947q630J5724
8770e1851L9515L0166J6998J0646j3101r19J800l4032j3241M4837K9090O671k7328
8757C9251m9860k971l863M446r994m883M482Q032J3195K2072J2308N823j3242
8744B4796j9488o093Q859K6545L285n5841l2238M9743J2078j7652Q170K942O68
8731E774M802J7691l0960k9922J6553K119j12J4710l56n233O871k0910m992O9621
8717D5656m514j5050k8646J26Q601P41K1229K087L5998p421m1998k2101r264p884
$$ plain form
8810 -915 -9037 19379 10670 11827 -8306 -11771 -30121 -30208 16934 42333 10897 -2336 17283 43389
8796 43389 43145 49794 54028 62903 64562 55255 38741 6962 -13397 1514 -15613 -14148 -6892 -13032
8782 -13032 -21838 -37933 -23802 27163 -289 -50820 -78141 -53744 -30998 -58945 -67575 -51851
8770 -51851 -12336 17830 34828 45474 32373 31454 33254 -778 -14019 30818 59908 66579 39251
8757 39251 -10609 -13580 -17443 -12997 -22991 -27874 -23392 -15360 -2165 19907 32215 38038 24796
8744 24796 5308 -785 8074 34619 37904 -17937 -50175 -432 11646 -6006 2164 5106 5774
8731 5774 10576 28267 -2693 -32615 -16062 -13943 -14055 655 299 -4934 1937 -18973 -23965 45656
8717 45656 41142 26092 -2554 -2428 6173 6914 28143 30230 66228 58807 16809 -5292 -14556 -22440
8703b2440o710J2429K1260J5991L2062j1264k7924L2199M8888J9728j3072m6724
8691E4423j6122J2791O83J1573J6970j0122l2286k3860J0779J4549Q682r990k511
8678C5559o914Q248M1384J8138M767m740J5988M3841k7060m7049K0995J5640J8351
8665A37148r310k8385J30K7964L4405l1023M701P305J6596j1797l736l1352K4637
8652A37283n039j3136j3340L0949Q417k1361m6856J5352K8750L1130p716j0494
8640A33939K2567L755K0374O670m5193o831J7492P497R049K712r58k7596L922
8627A47399K4926j4969j4438J175k522O035L9271J2555l8712l1260J605m513j8931
8614A07621J5191J4447L8588L1828r684L2277J3128k3382r294o1377l3090R128
$$ plain form
8703 -22440 -29150 -16721 4539 20530 52592 41328 13404 45603 94491 114219 101147 54423
8691 54423 38301 51092 51775 63348 80318 70196 37910 14050 24829 39378 48060 38070 35559
8678 35559 28645 36893 78277 96415 101182 96442 112430 156271 129211 82162 103157 118797 137148
8665 137148 127838 99453 99583 127547 161952 130929 135630 142935 159531 147734 143998 112646 137283
8652 137283 132244 119108 105768 136717 145134 123773 76917 92269 121019 152149 144433 133939
8640 133939 156506 160261 180635 187305 142112 135281 152773 160270 169319 172031 171073 143477 147399
8627 147399 172325 157356 142918 144093 141571 147606 186877 199432 160720 129460 131065 126552 107621
8614 107621 122812 137259 175847 207675 197991 230268 243396 220014 210720 149343 116253 125381
8602A25381J8443J0732k6415o967K9324L6651j776l0921j226R562L9878J3333
8590B15999j2667P845N347J5045M1673K4434n6436m3024j26r780J81N618j6886
8577A77223P476N184l0397q39J7678k8751m0469J2147P562n58k0773j2713j7455
8564G5315p635O208J7939l852j5304R71K7936R913l6263k2731N373J2639J2969
8551H3478M5576K5736q849l1218l8636j661k0810j6967J5327M6766M1525Q175
8539A48442j3109J1078J3332K0329N6943j8938m605k4003j9192m1008q177o610
8527A14482j4785R630k336j0422n0944j2725K5503j4621q638J3559N97k1993N021
8514C2328j8754k0365J4078M185K9765J3166o16n509J506j7446K2478L4589M691
$$ plain form
8602 125381 143824 154556 128141 121174 150498 187149 185373 154452 153226 162788 202666 215999
8590 215999 203332 211177 216524 231569 273242 297676 241240 198216 198090 188310 188491 194109 177223
8577 177223 184699 189883 159486 158647 176325 147574 107105 119252 126814 126256 105483 92770 75315
8564 75315 67680 73888 91827 87975 72671 73642 101578 111491 75228 52497 57870 70509 83478
8551 83478 129054 154790 145941 114723 76087 74426 53616 36649 51976 98742 140267 148442
8539 148442 135333 146411 159743 180072 237015 218077 213472 189469 170277 129269 121092 114482
8527 114482 99697 109327 106991 96569 45625 32900 58403 43782 35144 48703 49300 27307 32328
8514 32328 13574 -6791 7287 11472 41237 54403 53787 48278 49784 32338 54816 89405 94096
8501I4096m020l784L9196J1626M3411K3647j2257l3930l6165m3305k2288M2498
8489I8725k9846m2767m109P1K1469N324O851L4413j9945l557k0799m0712k7986
8476b2868J3218j8124k4641K4658L0392M1785r75k3514q778m970K5861n43j1757
8463A9744j4546n1708M515M0598K9086r882l5116k9826N035p03J2995M3923M427
8450A8542K1135K0822o783J1974J2051l3766J61L4696O81j9328j4700k5262k6984
8437f761J8073M8372j252j668M219k7382J3299J2064j1018k909Q634k7530j9775
8424F366k7470k153L8573J6854K2590j4809J9761J2600n1533k9290l7280k4896
8412g0687K792j8876K8786Q175L1230p104j954K966L8863K1070j6051J3857J966
$$ plain form
8501 94096 90076 86292 125488 137114 180525 204172 191915 157985 121820 78515 56227 98725
8489 98725 68879 26112 22003 22074 43543 48867 55718 90131 70186 66629 45830 5118 -22868
8476 -22868 -9650 -27774 -52415 -27757 2635 44420 43445 19931 11153 6183 32044 31501 19744
8463 19744 5198 -46510 -41995 -1397 27689 17807 -17309 -47135 -42100 -42803 -29808 14115 18542
8450 18542 39677 60499 53716 65690 77741 43975 44136 78832 79513 60185 45485 20223 -6761
8437 -6761 11312 59684 58432 56764 60983 33601 46900 58964 47946 45037 53671 26141 6366
8424 6366 -21104 -23257 15316 32170 54760 39951 59712 72312 20779 -8511 -45791 -70687
8412 -70687 -67895 -86771 -57985 -49810 -18580 -25684 -27638 -24672 14191 35261 19210 33067 35033
8399C5033m497k5593l9339j2329J2881J9694J5997N2403n857l8031m241K1069
8387B7190J8455l3432m6039m4335O036r995J3146K5171j9311j9704J9939M7022
8375a5857J3663L6972J766l4947l5571J4568K2597Q010L704Q775R021j2320J688
8362B2069O222p894K980Q995r98o101j6693m2456m0857N944L6965K5741M67j3905
8348a9521M028J7600J3199R316M220m733j312p881k6233J6439M6425o933J979
8335D6593l447l1335k7191j5849K4859L7648k3493k9382R81K5713L4927l3132
8323F892k5913K7221P924N831k7870l271K1684j1551k411K0902N2020n218o2507
8310C733k6287L964j9879K2836J3783J5858l638k3674k3846j1031K4725K7686
$$ plain form
8399 35033 30536 4943 -34396 -46725 -33844 -14150 1847 54250 48393 10362 6121 27190
8387 27190 45645 12213 -33826 -78161 -72125 -82120 -68974 -43803 -63114 -82818 -62879 -15857
8375 -15857 -2194 34778 36544 1597 -33974 -19406 3191 11201 14905 23680 32701 20381 22069
8362 22069 28291 20397 23377 32372 31374 25273 8580 -33876 -74733 -68789 -31824 -6083 -5616 -19521
8348 -19521 -15493 2107 15306 24622 28842 24109 22797 14916 -11317 5122 51547 44614 46593
8335 46593 43146 11811 -15380 -31229 -6370 31278 7785 -21597 -20616 5097 40024 6892
8323 6892 -19021 8200 16124 21955 -5915 -9186 12498 947 -1464 19438 71458 66240 3733
8310 3733 -22554 -18590 -38469 -15633 -1850 14008 10370 -13304 -37150 -48181 -23456 4230
8298D230O317l3879j6068J387r09K8552M1646M6564J1634J1643k9496k0315J7993
8285F9299L9524J07149J52003K10134J14760j2257o6256j75132j69919r9833m8842
8274A20630l2680j9892k4251j1056O796N94k6387J4498J9383k7399k2238N461
8262C459K7052N893l597J964J0435j0832k2331K0682J2640O541l3556O456J3553
8249C8359p843J5856K8585Q0257J16262J92764J86615O2376p177p5424j58038
8238D72592j47585j14344n5959m4211l8807J1794j2554j2031j1708r072j4689
8227B3426O525K4404r628l489j9131k8628J5535J6422Q254l3080l2508j5248l216
8214e0362M2956K4378l92r419k960m36K456n422j6915k1110K9135K3957k2656
$$ plain form
8298 4230 10547 -23332 -39400 -38013 -38922 -10370 31276 77840 89474 101117 71621 51306 69299
8285 69299 108823 215972 367975 578109 692869 680612 614356 439224 269305 169472 120630
8274 120630 87950 68058 43807 32751 39547 40141 13754 28252 47635 20236 -2002 3459
8262 3459 30511 36404 32807 34771 45206 34374 12043 32725 45365 51906 18350 24806 38359
8249 38359 30516 46372 74957 155214 271476 464240 650855 713231 706054 630630 472592
8238 472592 325007 210663 154704 110493 71686 83480 70926 58895 47187 38115 23426
8227 23426 29951 54355 44727 41238 22107 -6521 9014 25436 33690 610 -31898 -47146 -50362
8214 -50362 -7406 16972 16580 7161 4201 3765 6221 799 -16116 -37226 -8091 15866 -6790
8201f790j6604p396J5983k0490K5354J1899j2399l633K6715K5391J3116p311l1743
8188A2092m4191j9904K3857K1786K8811n495j1085J4307J6864j2867j4265J7327
8176B7237J952q077K8700J1783q177j7899k3753r31j0183P601K1485j7796o2536
8163e0594j6771K5114J7743k5855j8493j213Q927N872M6172M1049l8834J1000
8151D117J8652m064j8404K724k5276j421J2959k6809M190k7545j17L7368P897
8138a5729K0049J8667L1494k5351l9204k6578Q25J1433P624l263K427k9985r327
8125e6918J5520K9255J9993k7920l7397l502L6452M8092K0029k1820l3301j9057
8113c0574J31J6007r773j216l221K755N717q328O502J8254J0967j8260p686K5554
$$ plain form
8201 -6790 -23394 -30790 -14807 -35297 -9943 1956 -10443 -14076 12639 38030 51146 43835 12092
8188 12092 -32099 -52003 -28146 -6360 22451 16956 5871 20178 37042 24175 9910 27237
8176 27237 29189 21112 49812 61595 53418 35519 11766 10835 652 8253 29738 11942 -50594
8163 -50594 -67365 -42251 -24508 -50363 -68856 -70069 -61142 -55270 -9098 31951 -6883 4117
8151 4117 22769 18705 301 3025 -22251 -23672 -10713 -37522 -33332 -60877 -60994 -23626 -15729
8138 -15729 4320 22987 54481 29130 -10074 -36652 -35827 -24394 -16770 -20033 -17606 -47591 -56918
8125 -56918 -41398 -12143 7850 -20070 -57467 -60969 -24517 23575 43604 21784 -11517 -30574
8113 -30574 -30443 -14436 -24209 -25425 -28646 -25891 -20174 -28502 -22000 -3746 7221 -11039 -18725 6829
8099F829L3283L1309k6884k1532k0166l798j4177j5891L6362J2435K1341K404
8087D1515o898p068l3255p09J2130J4941Q326j4671j4097N777j4007l4482r768
8074e2266O072N859K4648M620K6866J0240P3m8805k2480k7774J2896J9688P921
8061c2442m0142N200M5313L2963L741j7450j7655j091K275p959k622K836K6552
8048d81K6108j3727k4841R126n4077l8563K2442N6336N2640j4766j0163M2604
8036E2638k167j5493j1332k8108k4810J5644L5820j8385N7487J6572m3280j5665
8024A8921q730P774J8853M1271J9245n284l9188N28L196N37J7863J7372L8933
8011A31291Q60k0131k7278k7520o683l126R557j1629j8163M06L3338K6385j4946
$$ plain form
8099 6829 40112 71421 44537 23005 2839 -959 -15136 -31027 5335 17770 39111 41515
8087 41515 34617 27549 -5706 -6415 5715 20656 28982 14311 214 5991 -8016 -42498 -52266
8074 -52266 -46194 -40335 -15687 -11067 15799 26039 26112 -22693 -45173 -72947 -60051 -40363 -32442
8061 -32442 -72584 -67384 -22071 10892 14633 -2817 -20472 -21563 -19288 -27247 -29869 -27033 -481
8048 -481 25627 11900 -12941 -3815 -57892 -96455 -74013 -17677 34963 20197 10034 52638
8036 52638 50471 34978 23646 -4462 -29272 -13628 22192 3807 61294 77866 34586 18921
8024 18921 10191 17965 36818 78089 97334 92050 52862 53390 56586 57123 74986 92358 131291
8011 131291 132151 112020 84742 57222 50539 47413 56970 45341 27178 27584 60922 87307 72361
7998G2361J374L8541P0395M9808L2427M7686L6696N9128k716p2620l4351J9642
7986C18371j5864k7244j8960k5230p575k7905k4263J6339K1312J6530k2746j9789
7974A82976k1105p0646l5557J6421K4740P6673n12J3368k295j565j3772k0502
7962A48224l7569R82K7297J0184J1587n986j3502j8713Q926P1540N8333Q1959
7950C43262J19108J16138L8286m2712l0178n3970p7959o5077l5248p19q104l023
7938B99804J6062k7224k8318m495k6357q669k9971J3322K719j8212m7287o147
7926A35227j7429k474J0620k626m5955k2858K033k0451J6551J8543J1635J1696
7914I4512p763j5893J8063K1474K0759j5627j8358m69K7070O3048L4841R260j739
$$ plain form
7998 72361 73735 112276 182671 232479 264906 312592 349288 408416 405700 333080 298729 318371
7986 318371 302507 275263 256303 231073 223498 195593 171330 187669 208981 225511 202765 182976
7974 182976 161871 91225 55668 72089 96829 173502 172990 186358 184063 182498 168726 148224
7962 148224 110655 111637 138934 149118 160705 154719 141217 122504 131430 202970 261303 343262
7950 343262 462370 578508 616794 574082 543904 489934 411975 346898 311650 310931 302827 299804
7938 299804 315866 288642 260324 255829 229472 220803 190832 204154 206873 188661 141374 135227
7926 135227 117798 115324 125944 123318 77363 54505 56538 36087 52638 71181 82816 94512
7914 94512 86749 70856 88919 110393 131152 115525 97167 96698 123768 186816 221657 230917 229178
7901B29178l9365n8919m3812Q025K9269k3057l1002J8780j6323Q19k6691k57l1482
7888A5163K3653N756j4977q246k2841K2867M405p313K8847J3224j3623r406n1368
7875a3859r349j6749j3511K0029M3086M568J0542N678p736k1514j810J9156P367
7862B5898J1111J3839J4694j2511m676l1635J3406m495J9713K8126K2722k6745
7850F9447o0372J287K1053K1457M582k4968J4070P192j5596j1488J8935k6763
7838A8836O565K3546K7896j6980l571m5618j0637k782p928o939Q702o60r964O586
7824a2948j7642j8038J8978J0188n357J1713K3160J631m7658K953K6370n180j2347
7811b4177O563L6380J7385K9999o895j6125M80j4246l9162J2953j273J1444j4540
$$ plain form
7901 229178 189813 130894 87082 95107 124376 101319 70317 89097 72774 73593 46902 46645 15163
7888 15163 38816 44572 29595 21349 -1492 21375 25780 18467 47314 60538 46915 37509 -13859
7875 -13859 -23208 -39957 -53468 -33439 9647 14215 24757 30435 22699 1185 -625 18531 25898
7862 25898 37009 50848 65542 53031 48355 16720 30126 25631 45344 73470 96192 69447
7850 69447 9075 10362 31415 52872 57454 32486 46556 53748 38152 26664 45599 18836
7838 18836 25401 48947 76843 59863 56292 10674 37 -2745 -10673 -17612 -8910 -9570 -19534 -12948
7824 -12948 -30590 -48628 -29650 -19462 -24819 -13106 10054 11685 -35973 -33020 -6650 -11830 -24177
7811 -24177 -17614 18766 36151 66150 59255 43130 43610 29364 -9798 3155 1882 13326 -1214
7798a214l7141J963P782j9329k9254r341K7424M7525K4307j8282J8176K0231j9582
7785A3265m6471j9051N2359L1724q588j5776O428J7606M0210j6032j6821K3387
7773F2240J831m2771l8894Q34L1405q459p288o59p553k0205q913K7171J8573R963
7759A7275J5811j9283k7765J7627J7131j7195j9289K0568M0515k256k3549k8999
7747i409L2893L5352j5378m2248l6881K5857N450p736J0212j1288J2015l185R933
7734E587j6856k6778L4046J6934P592J8210P787k1739k2450q783J354L4745L4608
7721F4257K0600k457l1332l2850m045j1106k1781K8749K0266J0377Q916J6027
7709F5621j2871l0222l0892l0075j8009M93J4078p706j1384R925L5982m070l8475
$$ plain form
7798 -1214 -38355 -36392 -28610 -47939 -77193 -86534 -59110 -11585 12722 -5560 12616 32847 13265
7785 13265 -33206 -52257 102 31826 23238 7462 13890 31496 71706 55674 38853 62240
7773 62240 64071 21300 -17594 -16760 14645 6186 -1102 -1761 -9314 -29519 -38432 -11261 7312 17275
7759 17275 33086 13803 -13962 3665 20796 3601 -15688 4880 45395 43139 19590 -9409
7747 -9409 23484 58836 43458 1210 -35671 -9814 -4364 -12100 -1888 -13176 -1161 -4346 5587
7734 5587 -11269 -38047 -4001 12933 20525 38735 46522 24783 2333 -6450 -5096 29649 64257
7721 64257 84857 82400 51068 18218 14173 3067 -18714 10035 30301 40678 49594 65621
7709 65621 52750 22528 -8364 -38439 -56448 -55955 -41877 -49583 -60967 -51042 -15060 -19130 -57605
7696e7605j6650K8959K2379q030J8361r58J6091p284k1451k3874K8406M3232L2497
7683E4073j45n1966J4603j9389k426K1852j3399k0243J5893R814K9048k6378k0665
7670i328j6046J3173k1876l962J3590L5980K3128k0890J806M3702j2527l6060
7658A0690k0770K0884L3003r409m6339j6932k0231K4205M4478l4760k1194M5446
7646I071J2041m0839k0473K317k9970K1779Q951K6086l748j2377J6491P873r847
7633a2645J8974L878j4734n556p129L430J1963r185l470o362l283P53J4449j1724
7619b0641j7355J7997j4082j4459J1299N2161m315k9673Q104K45m08Q185k2920
7606b5862P476J7155k0155p147p609N6218N6446P164l5595j7794j7239L849K5005
$$ plain form
7696 -57605 -74255 -45296 -22917 -30947 -12586 -13544 2547 -4737 -26188 -50062 -21656 21576 54073
7683 54073 53928 1962 16565 -2824 -5250 16602 3203 -17040 -1147 8667 37715 11337 -9328
7670 -9328 -25374 -12201 -34077 -38039 -24449 11531 34659 13769 15575 59277 46750 10690
7658 10690 -10080 10804 43807 34398 -11941 -28873 -49104 -24899 19579 -15181 -36375 9071
7646 9071 21112 -19727 -40200 -37883 -67853 -46074 -37123 -11037 -14785 -27162 -10671 -2798 -12645
7633 -12645 6329 10207 -4527 -10083 -17212 -13782 -1819 -11004 -14474 -20836 -24119 -23366 -8917 -20641
7619 -20641 -37996 -19999 -34081 -48540 -37241 14920 10605 -19068 -10964 -10719 -11127 -2942 -25862
7606 -25862 -18386 -1231 -21386 -28533 -36142 20076 76522 83686 48091 30297 13058 16907 41912
7593D1912k3694j0179K459q502K637j5809K2350K1334N752j1768r568p936k8257
7580a9269K3608M2531m896J5916L8335P422l7024l0197K4430K646K7069J782p517
7567H4836K2794r980k5473M1679j1254j4268j223O619l2589j6263l5161l751K366
7554H332o836q52K1384J3624o905m2024J7418K5939O510k1239L0533L0022J4881
7541I0787N369l9848l1210j4844J9566L5864J2073K9334k684K598n919M4954K3183
7528A69223l5863K0198K1944j9235j4075L7285L9293l895K0014j4371n1058k4627
7516A44833j6161K7452k7727l0858P049L1218l9825m0897j2155m3771L2922K500
7504C4580k0641L2870R044N809k5867M41j6755j4314J6806M436k0679L405q020
$$ plain form
7593 41912 18218 8039 10498 1996 4633 -11176 11174 32508 38260 26492 16924 8988 -19269
7580 -19269 4339 46870 41974 57890 96225 103647 66623 36426 60856 63502 90571 92353 84836
7567 84836 107630 97650 72177 113856 102602 88334 87111 93730 61141 44878 9717 5966 8332
7554 8332 1496 644 22028 35652 28747 -13277 4141 30080 36590 15351 45884 75906 90787
7541 90787 96156 56308 25098 10254 29820 65684 77757 107091 104407 107005 101086 146040 169223
7528 169223 133360 153558 175502 156267 142192 179477 218770 214875 234889 220518 169460 144833
7516 144833 128672 156124 128397 97539 104588 135806 95981 55084 42929 -842 32080 34580
7504 34580 13939 46809 55853 61662 35795 36236 19481 5167 21973 26409 5730 9135 1115
7491A115j0056J108O251l670n981K7796N0004J9609k1053l2444K1212J6030K1117
7478I1038K4513M928P046J3891j462k1947q169p967l3627p805n107j1975k3507
7465A9850l6007J0412o551j5704M41J2619J6892r427M327K4890k36J4662J6226
7452E2394j5278l7253J8166L525l78L601K4385m099k4354j2041q006l0221M1396
7439A1837J3294o889J5794R821j3461k0179l0889K5026M3122O746l2495j9892
7427A835Q859j6813k7890j5316l2761K0328k153P537J7644N3180L8513j4960k4258
7414A3745r67J640k0077k5936O426L8322j2017j5697k0455Q636J5377K5882j9677
7401d798j5995M4485j9311l0129j4923M0110K3209L724L5636j8532l7671l2693
$$ plain form
7491 1115 -8941 -7833 -1582 -5252 -11233 16563 66567 86176 65123 32679 53891 69921 91038
7478 91038 115551 120479 127525 141416 139954 118007 109838 101871 68244 60439 55332 43357 19850
7465 19850 -16157 -5745 -12296 -28000 -27559 -14940 1952 -7475 -3148 21742 21506 36168 52394
7452 52394 37116 -137 18029 21554 21176 24777 49162 45063 20709 8668 662 -29559 11837
7439 11837 25131 18242 34036 43857 30396 10217 -20672 4354 47476 54222 21727 1835
7427 1835 10694 -6119 -34009 -49325 -82086 -61758 -63911 -56374 -38730 14450 52963 38003 13745
7414 13745 12778 14418 -5659 -31595 -25169 13153 1136 -14561 -35016 -26380 -11003 14879 -4798
7401 -4798 -20793 23692 4381 -25748 -40671 -561 22648 26372 62008 43476 5805 -26888
7389b6888M000o851K4855J1174r061K827O841j984j994K1117J0424r489k7420
7376b449j9923j1901L0196K509J0993p011m0820k4788j472L4935L1827N845m0845
7363c2904p170K9717J8411J7053O170l113k8682r145L596J0902J5356o919o399
7350F873k5241K30K2478K5616j269p312k5891M371K3478O894q387j2727L824k3618
7336a0681M808K7472M4721o010j507o831k5896o223L602L82k6878M185j1098K546
7322g408K4482r022K98K0200j969j773k491l7312P398K9937J2297j6198m07l569
7308A4463J520j7982Q772K3049J0001l713k405L460j7504k4196J5581j5047m1644
7295d5645j5072M69J3907J1293q603K7948L0274K0462j1613j1235K5642J6302
$$ plain form
7389 -26888 -22888 -29739 -4884 6290 -2771 56 6897 4913 2919 24036 34460 24971 -2449
7376 -2449 -22372 -34273 -4077 -1568 9425 2414 -38406 -63194 -64666 -29731 2096 7941 -32904
7363 -32904 -40074 -10357 8054 25107 31277 28164 -518 -9663 -6067 4835 20191 13272 6873
7350 6873 -18368 -18138 4340 29956 28687 21375 -4516 -145 23333 30227 21840 9113 12937 -10681
7336 -10681 -5873 21599 66320 60310 58803 51972 26076 19853 23455 23837 -3041 1144 -9954 -7408
7322 -7408 17074 8052 8350 28550 26581 24808 22317 -14995 -7597 22340 34637 18439 18032 14463
7308 14463 15983 -1999 6773 29822 39823 36110 33705 37165 19661 -4535 11046 -4001 -45645
7295 -45645 -60717 -60248 -46341 -35048 -43651 -15703 14571 35033 23420 12185 37827 54129
7283E4129k4992J735m103M369J1362o744J0487k6467k0128O424j2679p664K81
7270a3990m924J4178J8332J4363o38l1422L532R353j1472J8193J5571J350j9927
7257A2499j0984N118j193R563J8910j9795o62J4011J9257k1004l5874k1641j5398
7244d7193j793p05j115r497l4850M1799L8006N573k9967m4754q26K7493K8257
7231b9572m885k8815l2518J0743L5977k2511k518J2863M973L509R620K2925K6674
7218F465J2248j7747N148J5105j9149j2952j6594L1797j3191m186L532P912l485
7205e097j7032N324P031J6167K845l3471k4977K4694K4879K4652J4169p241k5373
7192F570j4267J0640k9472k4632l163M4920K6391J0625j0053M1016l591q322Q02
$$ plain form
7283 54129 29137 30872 26769 31138 42500 35756 46243 19776 -352 6072 -6607 -14271 -13990
7270 -13990 -18914 -4736 13596 27959 27321 -4101 -569 8784 -2688 15505 31076 32426 12499
7257 12499 1515 6633 5440 15003 33913 14118 13456 27467 46724 25720 -10154 -31795 -47193
7244 -47193 -48986 -49691 -50806 -60303 -95153 -53354 -15348 -9775 -39742 -84496 -85322 -57829 -29572
7231 -29572 -34457 -63272 -95790 -85047 -49070 -71581 -74099 -61236 -56263 -52754 -43134 -20209 6465
7218 6465 18713 966 6114 21219 2070 -10882 -27476 4321 -8870 -13056 -9524 -1612 -5097
7205 -5097 -22129 -16805 -9774 6393 9238 -24233 -49210 -24516 363 25015 39184 31943 6570
7192 6570 -7697 2943 -26529 -51161 -54324 -9404 16987 27612 17559 58575 54984 46662 47464
7179D7464j5653k9993l6509j2135L6123P183k2504j7708L6066M701q973j0379
7167b2317k6028L1040K4932l3896l5794J6663K2584J3289m6618j6654K7682J0375
7155c4742R70P748J2999q930Q86M586J0927j3821M0957P996k9216j3601L60K1511
7141H630J8785j0924m5027R547K6182O637l0616q554j4014N1114k407k0822O5778
7128E4309K8052m2566K334k9142l0718P292k5444n095K9599j2224J5894K1367
7116A3658j9378R297M106J4582J88m5899J5179J2953l320N844R968n558q06q482
7102B332j4546J4737K3531j5352j6454L5698J1775l964R236j2445n246r915m4194
7089b4807j786O150l046K9496j2304K2025J2724L384K8154j326O031j619l705
$$ plain form
7179 47464 31811 1818 -34691 -46826 -10703 -3520 -26024 -43732 -7666 -2965 -11938 -22317
7167 -22317 -48345 -17305 7627 -26269 -62063 -45400 -22816 -9527 -56145 -72799 -45117 -34742
7155 -34742 -33772 -26024 -13025 -21955 -21069 -16483 -5556 -19377 21580 29576 360 -13241 -12881 8630
7141 8630 27415 16491 -28536 -18989 7193 13830 -16786 -25340 -39354 11760 9353 -11469 54309
7128 54309 82361 39795 42129 12987 -17731 -10439 -35883 -40978 -11379 -23603 -7709 13658
7116 13658 -5720 3577 7683 22265 22453 -23446 -8267 4686 1366 7210 17178 11620 10814 2332
7102 2332 -12214 2523 26054 10702 -5752 29946 41721 37757 46993 34548 29302 19387 -24807
7089 -24807 -26593 -20443 -23489 6007 -6297 15728 28452 31836 59990 58664 64695 63076 59371
7076E9371o1005j440M0452K15k5024j6372p379l9381K8386L7621j0868j7207L0963
7063A8332R03l709j2928J4758p633l2706J4722M1179k2702l7466J5788p840R135
7050a0167J996K1943l3661j811L7863L5239n3236j2601J1134R889J1773l129J4776
7037C0008n238l3749J453O751l306O038j4694j6898l661L2156J6897P729k4150
7024f64R50Q693l2214j9341K9729J9431m2308l352K4717k6796K098P163J0151
7011b1743Q112L4982K103m0118q924P15j4210m2975j6756J6907M734J7979K1455
6998c7739k26J451k0302p122N870N5223j934j4900k5763R67k330K2919K1134J9436
6984A6684j8900J1014J1259j0601j7405j676q421j942M8121K0879k8596l9091
$$ plain form
7076 59371 -1634 -3074 37378 37593 12569 -3803 -11182 -50563 -22177 15444 4576 -12631 18332
7063 18332 19235 15526 2598 17356 9723 -22983 -8261 32918 10216 -27250 -11462 -19302 -10167
7050 -10167 -8171 13772 -19889 -21700 16163 51402 -1834 -14435 -3301 6588 18361 15232 30008
7037 30008 24770 -8979 -7526 -775 -4081 1957 -12737 -29635 -33296 -1140 15757 23486 -664
7024 -664 286 8979 -23235 -42576 -12847 6584 -35724 -39076 -14359 -41155 -39057 -31894 -21743
7011 -21743 -13631 21351 23454 -16664 -25588 -24873 -39083 -82058 -98814 -81907 -77173 -59194 -37739
6998 -37739 -37965 -36514 -56816 -63938 -58068 -2845 -4779 -19679 -45442 -44475 -46805 -23886 -2752 16684
6984 16684 -2216 8798 20057 9456 -7949 -9625 -18046 -19988 28133 49012 20416 -18675
6972a8675j8014m632N500L2437M9150M268k7418k7378j9687J8027J2375J5629
6960B1582o498J5086J7360o848P101L2736J1217k4375m1634K3634m4835n3463
6948d8937J3507p255j6213K9713J6294k5130j1448L2618l7625j6441L769J5303
6936e1845K3648n304k9585O376K3648j830L7646K1632j8237k9295K5301J901K9230
6923C3286K8877p431l2727m3020k2084J9751l7584M270k0174K3867L7496R832
6911e641P511J726P532j9507j1150p201J7104J6964m9062n427l912J9483R033
6898b2547J9546J8571L0603J4638l6823l9287j3183K102J3504M945O885J1205
6886A0159k0734J0319L2576m2957l5358J089Q704O4j4608O962o235K3262L3673
$$ plain form
6972 -18675 -36689 -41321 -35821 -3384 45766 50034 22616 -4762 -24449 -6422 5953 21582
6960 21582 15084 30170 47530 40682 47783 80519 91736 67361 25727 49361 4526 -48937
6948 -48937 -35430 -42685 -58898 -29185 -12891 -38021 -49469 -16851 -54476 -70917 -67148 -51845
6936 -51845 -28197 -33501 -63086 -56710 -33062 -34892 2754 24386 6149 -23146 2155 4056 33286
6923 33286 62163 54732 22005 -21015 -43099 -23348 -60932 -56662 -76836 -52969 -15473 -5641
6911 -5641 1870 3596 11128 -8379 -19529 -26730 -9626 7338 -41724 -47151 -51063 -31580 -22547
6898 -22547 -3001 15570 46173 60811 23988 -15299 -28482 -26380 -12876 -7931 -1046 10159
6886 10159 -10575 -256 32320 -10637 -45995 -44906 -36202 -36138 -50746 -43784 -50019 -26757 6916
6873F916K1016j4337J7362n287q833l496J062J8388K1l4748n3245k1602K6078
6860e0705L3569R170K2578L4061j2345m0222Q108q670j7211k7126K8942J5518
6848d333J3402K990l692p564j3435L384L896P975J8413N324N161j0434J5905p147
6834B9845k2892j4676K94O236l8310m578p552j8049K9693J8828k7337J171J9186
6821b8141Q599j6228L986j059O507R104l6971L293K7647k5398l1128J6113k1633
6808h5309K5935K0519k222q172M1950Q376k743q558l115n006M500k4171m8574
6795h6590J0536O9243N0996J1351m2462l2842J5958J9336k2102M426K9677q869
6783A8658J0183j7235m4604J7373J2035J7132L970j2107k427J7170k3548q861
$$ plain form
6873 6916 27932 13595 30957 25670 16837 13341 14403 32791 32812 -1936 -55181 -76783 -50705
6860 -50705 -17136 -7966 14612 48673 36328 -3894 4214 -4456 -21667 -48793 -19851 -4333
6848 -4333 9069 12059 8367 803 -12632 -9248 -5352 2623 21036 26360 31521 21087 36992 29845
6834 29845 6953 -7723 -7429 -1193 -39503 -44081 -51633 -69682 -39989 -21161 -48498 -47327 -28141
6821 -28141 -19542 -35770 -31784 -32843 -26336 -17232 -54203 -50910 -23263 -48661 -79789 -63676 -85309
6808 -85309 -59374 -38855 -41077 -49249 -7299 1077 -1666 -10224 -13339 -18345 -13845 -38016 -86590
6795 -86590 -76054 -6811 44185 55536 13074 -19768 -3810 15526 -6576 -2150 27527 18658
6783 18658 28841 11606 -32998 -15625 -3590 13542 17512 5405 2978 20148 -3400 -12261
6771a2261j7755k2503K4255K3504M4998r366l3666k9709K4659K1819K8529j3567
6759B8937l2912k1600K5342P724l0622k1224O842M126L4670K0224R623r274q855
6746A3001q724p834J0090j515J0201N834k3519N49K0980k0358j6818K0167M7501
6733D9555j1764k1336j6794R641q861N13k3444K5752L0051P947j8808j9858l468
6720h74j2399R311q267O435J6919K2106j3022k9945N147J5205j5810j8152n3392
6707g6738K2413L4241L1439L6302Q237n7115m7913J9172j9256N094J2279n997
6695c7842J3591L5309j3880j3362j320J6795R249K329N943Q29r097L079j954l3334
6681b3665m047K8775N227k9432n104J9390K5772m0815m844k1938k9842J5324K1192
$$ plain form
6771 -12261 -30016 -52519 -28264 -4760 40238 30872 -2794 -32503 -7844 13975 42504 28937
6759 28937 -3975 -25575 -233 7491 -23131 -44355 -37513 -33387 1283 21507 31130 21856 13001
6746 13001 4277 -3557 6533 5018 15219 21053 -2466 -1917 19063 -1295 -18113 2054 49555
6733 49555 37791 16455 -339 9302 441 954 -22490 3262 33313 41260 22452 2594 -874
6720 -874 -13273 -3962 -12229 -5794 11125 33231 20209 -9736 -4589 10616 -5194 -23346 -76738
6707 -76738 -54325 -20084 11355 47657 55894 -1221 -49134 -29962 -49218 -44124 -31845 -37842
6695 -37842 -24251 11058 -2822 -16184 -17504 -709 8540 10869 16812 17641 8544 11623 9669 -23665
6681 -23665 -27712 1063 6290 -23142 -28246 -8856 16916 -23899 -28743 -50681 -80523 -65199 -44007
6668d4007l741J4382Q802K8128l466n287J5275r842j4465K229P252J4241j4056
6655d555j5235M696n0451m614q850N9691L0651j5344m205k8528J210M4949Q855
6642A8270l8940p891k6056N031O8351P173n4972J593J6473J7828j3231J924J5384
6629A0937j8192m6614k9367O306L2477K1787j0251j3633P500J314L2309p524j5608
6616b8559K2880J1532K1167L113p534j24j3948j1145J8622K6848j9922M003k0136
6603F797k1573k6091k478M9379N7877L6891m0098l4929j14J4905r23q328K004
6590C3319l0795J046j9383K1090k4625j0244J2579K0518L2096L3126j1592j0698
6578D6437k0070K2272P826j1094k7936q635k610J934o219j737J7154J3569k6958
$$ plain form
6668 -44007 -47748 -33366 -24564 3564 98 -5189 10086 244 -14221 -11992 -4740 9501 -4555
6655 -4555 -19790 -15094 -65545 -70159 -79009 -19318 11333 -4011 -8216 -36744 -35534 9415 18270
6642 18270 -20670 -28561 -54617 -49586 18765 25938 -29034 -27441 -10968 6860 -6371 -4447 10937
6629 10937 -7255 -53869 -83236 -76930 -44453 -22666 -32917 -46550 -39050 -37736 -5427 -12951 -28559
6616 -28559 -5679 5853 27020 30133 22599 22475 8527 -2618 16004 42852 22930 26933 6797
6603 6797 -14776 -40867 -43345 6034 63911 100802 60704 25775 25661 40566 39643 31315 33319
6590 33319 2524 3570 -15813 5277 -19348 -29592 -17013 3505 35601 68727 57135 46437
6578 46437 26367 48639 56465 45371 17435 8800 6190 8124 1905 168 17322 30891 3933
6565C933j4404q360J5643J6879P421o770J2824N989j1629l8176k7766K972J1042
6552c0402K2566L032J4011L2271M004l2301r705j3761l2517J853o715j0385K2641
6539c5408J6652K0008J7415j2708J0008l2244K3370J8492q015j5874k1943N868
6527a4379J6169j0587j4243J1380L2896O141K931J207l1129j6852q771K8093m371
6514a515J9613n3163l0988L9361J5572J2925j4622j9078L7072J9916j711J8758
6502D2140j0336J6338K9840q764o1644k1665J423k7754L67l292J463L7549j6642
6489b0977k2309K9611N091o017l5250l0621j2312j1538M5219K8108L0130L1097
6477C0232l3545j1245j3179k1097L9249j4253j856L3182K9102j8341l8084R995
$$ plain form
6565 3933 -10471 -18831 -3188 13691 21112 14342 27166 33155 21526 -16650 -44416 -41444 -30402
6552 -30402 -7836 -4804 9207 41478 45482 13181 3476 -10285 -42802 -40949 -47664 -58049 -35408
6539 -35408 -18756 1252 18667 5959 15967 -16277 7093 25585 17570 1696 -20247 -14379
6527 -14379 1790 -8797 -23040 -11660 21236 27377 30308 31515 386 -16466 -25237 2856 -1515
6514 -1515 18098 -35065 -66053 -26692 -11120 1805 -12817 -31895 5177 25093 23382 42140
6502 42140 31804 48142 77982 69218 7574 -14091 -12668 -40422 -40055 -43347 -41884 -4335 -20977
6489 -20977 -43286 -13675 -8584 -14601 -49851 -80472 -92784 -104322 -59103 -30995 -865 30232
6477 30232 -3313 -14558 -27737 -48834 -9585 -23838 -25694 7488 36590 18249 -19835 -9840
6465i840p973K192R869J7380n539K404j0422Q002N023r042O519j9992k4160K7887
6451g692K769O127K1877j5261J8767p810p137L1566j1840J8322n214j5035j7917
6438A1522M780k367k2733k0327J5931J1521J0115k8178k0640J2111n775L6945
6426B905Q467j7741o828o750J8363K2935p998K5035J1615k5260l637N913k8077
6413a058j2564L2775J1750l2446k5141K3785L6108n2171o515K7359J0428k9613
6401a7303k3679r706j7204K5142L6232n190k3317j1409K3506J4542j3316l633
6389b5335K562J2956O8290K729l3544J0061j1939l1527j0941p238K2795k0664
6377b1795j5475k1528j3068M3781R968J4334K2963O930k0633j160K5056J1120
$$ plain form
6465 -9840 -17813 -15621 -5752 11628 6089 8493 -1929 6073 11096 2054 8573 -11419 -35579 -7692
6451 -7692 -4923 1204 23081 7820 26587 18777 11640 43206 31366 49688 44474 29439 11522
6438 11522 16302 13935 -8798 -29125 -13194 -1673 8442 -19736 -40376 -28265 -34040 2905
6426 2905 11372 -6369 -13197 -19947 -1584 21351 13353 38388 50003 24743 21106 27019 -1058
6413 -1058 -13622 19153 30903 -1543 -26684 -2899 33209 -18962 -25477 1882 12310 -17303
6401 -17303 -40982 -50688 -67892 -42750 -6518 -11708 -35025 -46434 -22928 -8386 -21702 -25335
6389 -25335 -22773 -9817 58473 61202 27658 37719 25780 -5747 -16688 -23926 -1131 -21795
6377 -21795 -37270 -58798 -71866 -28085 -18117 -3783 19180 26110 5477 4317 29373 40493
6365D0493k7537n134R973o64J248k2208k4261P288L451R27R620j8775j698M1644
6351A4367K2615q237r226o620M317M1j9030o1954P802J1271K0042N5085P042J2478
6337D9993m5040n1809j531K3066K5073J4567p943l1205J8978L9512j7726o4426
6325d8491K6257L3748j9772L6675N5215k706r2389m6353o321J1748J0791L994
6313c7604L0360j886K4369K2065l7328k0161k6838j2041N190R088K196k595j0106
6300e5291q885j9235Q849L4269P141m587J4099k038J5870M992k8063m6262j2366
6287i1507M0097L0508J3381K3352O934m617m0668j1898J2579L948k1018j5125
6275e4034r786L0163M1000L3501K689p437K241p93k7784l7072k0061m640M2015
$$ plain form
6365 40493 12956 7822 17795 17131 18379 -3829 -28090 -20802 -17351 -16424 -6804 -25579 -27277 14367
6351 14367 36982 28745 19519 12899 17216 17257 -1773 -63727 -55925 -44654 -24612 30473 37515 49993
6337 49993 4953 -46856 -48387 -25321 -248 14319 6376 -24829 -5851 33661 15935 -48491
6325 -48491 -22234 11514 -8258 28417 83632 80926 -11463 -57816 -64137 -52389 -41598 -37604
6313 -37604 -7244 -9130 15239 37304 -24 -20185 -47023 -59064 -53874 -44786 -42590 -45185 -55291
6300 -55291 -64176 -83411 -74562 -40293 -33152 -37739 -23640 -25678 -9808 -4816 -32879 -79141 -91507
6287 -91507 -51410 -20902 -7521 15831 22765 18148 -22520 -34418 -21839 -17891 -38909 -54034
6275 -54034 -63820 -33657 7343 40844 43533 36096 38337 37544 9760 -27312 -47373 -52013 -9998
6262i998j4596j0082j7959j241J0912O417Q932k1357P372J5191K595k3206J1756
6249c5264l08J7360j075o4l0804R849K5720L5752L3842J5175l6990k0299q470
6236D424k7670j8183L3770J0751J6943J7258k0277l5635J5693j3718j2794o011
6224c5449J0663n318o536J4352n908J1267L8014Kj8852J9979K8564j6697k3007
6211A1074n3574N229J1882J5672m136j2660n199K0194k7161J355K9516K7190j7680
6198A702j3323J903J4981J945J6749j3867J2400j9214O765l7435l1964L5026K6512
6185B180j2516q233K8489K889o756J1591j4485K557P921j8677J724K7091k5524
6172a749J2407j5739j2807J3282j6993L851j1329n899Q418j0775K832J7021M640
$$ plain form
6262 -9998 -24594 -34676 -52635 -53876 -42964 -36547 -27615 -48972 -41600 -26409 -23814 -47020 -35264
6249 -35264 -35572 -18212 -19287 -19351 -50155 -40306 -14586 21166 55008 70183 33193 12894 4424
6236 4424 -23246 -41429 -7659 3092 20035 37293 17016 -18619 -2926 -16644 -29438 -35449
6224 -35449 -24786 -30104 -36640 -22288 -28196 -16929 21085 21087 2235 22214 50778 34081 11074
6211 11074 -42500 -37271 -25389 -9717 -13853 -26513 -31712 -11518 -38679 -37324 -7808 19382 1702
6198 1702 -11621 -9718 5263 7208 23957 10090 22490 3276 10041 -27394 -59358 -24332 2180
6185 2180 -10336 -18569 9920 12809 6053 17644 3159 5716 13637 -5040 -3316 23775 -1749
6172 -1749 10658 -5081 -17888 -4606 -21599 -17748 -29077 -34976 -26558 -37333 -34501 -17480 -12840
6159a2840K4341q14j9809M610J831k1549J3322R212L9781L2673J426m1623j2235
6146A8326p350j2658J4860J913p151P311L835k9408K218o118K972J8265J3005
6133B0020P096l7810J1961j628l3133M0405K5367l1723k730k6157j1876M338M380
6120c1490L3167K757k4173L1503M4612m1307k0111K8504L2835J5878J1567k7021
6108E6721K272M998N32l5870j6477j259p893J4217j1378J6418p939k753J2819
6095B4408O53K3968o70q422j2183l7819r746J5587J7226K502l643l2064j9468
6082c9671K970K24K7967L0103j3761l5049n262j988o085m0172K896L2557J1782
6069c3489K667L057J6749J9122J1435n156j4126m2270K1462O2331o975j2529O925
$$ plain form
6159 -12840 11501 10687 -9122 -4512 -2681 -24230 -10908 -1696 38085 70758 72184 30561 18326
6146 18326 10976 -1682 13178 15091 7940 15251 19086 -10322 -8104 -14222 -11250 7015 20020
6133 20020 27116 -10694 1267 -361 -33494 6911 32278 555 -2175 -28332 -40208 -35870 -31490
6120 -31490 1677 4434 -19739 11764 56376 15069 -5042 23462 56297 72175 83742 56721
6108 56721 58993 63991 64523 28653 12176 10917 3024 17241 5863 22281 14342 11589 24408
6095 24408 25061 49029 48359 39937 27754 -10065 -19811 -4224 13002 15504 11861 -20203 -39671
6082 -39671 -36701 -36477 -8510 21593 7832 -27217 -32479 -34467 -40552 -80724 -77828 -45271 -33489
6069 -33489 -30822 -27765 -11016 8106 19541 14385 259 -42011 -20549 41782 34807 22278 29203
6056B9203p272m110N425p439J7579L4444Q194j1210p379k2785j8042k867K3476
6043C7217p824l7646j9971J5140J8724K9862l3102n9639P019K4502P267J7244
6031a207J7366o2854R804K0107j6621j2005M8002P729J6051Q699O649l798m0684
6018b762J110L2519O900j0307k6276l4469j97m010r926M207J1243K3904J0958
6005B894J0062n899j2283k975M7412O01j8311r985k096j5748J216l2785L2980
5992d917K7309l0411l8675m3396Q978L7799k260J9769K3481r280J2965l1116k387
5979c2141K0175L9323J0863m662J090j6698n933J6447l298j0039l7329q381L1162
5966E79n147m7776j6955L0719p921J4266j1891M614L5623j8261O743K1823J7247
$$ plain form
6056 29203 21931 17821 23246 15807 33386 67830 76024 64814 57435 34650 16608 13741 37217
6043 37217 29393 -8253 -28224 -13084 5640 35502 2400 -57239 -50220 -25718 -18451 -1207
6031 -1207 16159 -46695 -36891 -16784 -33405 -45410 2592 10321 26372 35071 41720 37922 -2762
6018 -2762 -1652 30867 37767 27460 1184 -33285 -33482 -37492 -47418 -43211 -31968 -8064 2894
6005 2894 12956 7057 -5226 -8201 39211 39812 21501 11516 9420 -6328 -5112 -37897 -4917
5992 -4917 22392 -8019 -46694 -90090 -81112 -43313 -45573 -25804 -2323 -11603 1362 -29754 -32141
5979 -32141 -11966 27357 38220 33558 34648 17950 12017 28464 25166 15127 -22202 -30583 579
5966 579 -4568 -52344 -69299 -38580 -46501 -32235 -44126 -39512 -3889 -22150 -15407 6416 23663
5953B3663o573J4484R052j4606k7768J772R390J673K268k0272J2555J6506j5967
5940F177l4400J7268j0411n1988P571O3059M587l3549K3803L8444o51j6937Q941
5927B1914k7785r477K5096L5095N205P79k9299j4464n144J6001J0489l243k7487
5914b320k7954j0768k4657j0433k4297K1774K5541N1652m056N027K2112r646k4129
5901a2154J5845Q83j129Q300l2193j8504K4201M214r973J4492K3305j7977o325
5888g015l9196J1758Q018p604j1048j4676k1058M2787K3425K9463Q678m4288k1102
5875d1858k247J5377k630J462J7369r182k9469K0726j478K5242P996L0571J6091
5862D7970k9780O383L922P71N482n930O096l5875J7626M3268j5070j8888j5685
$$ plain form
5953 23663 17090 31574 40626 26020 -1748 24 9414 11087 13355 -6917 5638 22144 6177
5940 6177 -28223 -10955 -21366 -73354 -65783 -2724 1863 -31686 -7883 30561 29910 12973 21914
5927 21914 -5871 -15348 9748 44843 50048 50827 21528 7064 1920 17921 28410 25167 -2320
5914 -2320 -30274 -41042 -65699 -76132 -100429 -78655 -53114 -1462 -5518 -491 21621 11975 -12154
5901 -12154 3691 4574 3445 11745 -20448 -38952 -14751 -10537 -20510 -6018 17287 -690 -7015
5888 -7015 -46211 -34453 -26435 -34039 -45087 -59763 -80821 -38034 -14609 14854 23532 -20756 -41858
5875 -41858 -44105 -28728 -31358 -29896 -12527 -21709 -51178 -30452 -31930 -6688 1308 31879 47970
5862 47970 18190 24573 28495 29266 34748 28818 34914 -961 16665 59933 44863 25975 10290
5849A0290k4690J5393L4339j6419l6758Q985K6487k1045l1805J8812j3275M779
5837b4907P8k2825J7232J2O362J7640K8632q895L143M2189k3187j1736j1831j4664
5823b757J5621J7588j6989m009j4425j7139q091L5509j0730l505J1571l091n709
5810f156r633k2433k2122J9987n53J7952P255Q577K6701J6655l2186l2247l1807
5797f0010K1847N5608K6117j2144j5110k0522l3008k4799J3290K9513J3364R675
5785C821k3958j2244r14q697r218q484J946L4118M6621J9439k2409j0815n006
5772D200p110J692J2603m6511p498J8233J5802M0J435j3240n842q337k072K005
5758c4600J5251l770O1789j7402j1385n4548k1796K4575J6461k4412R625K6550
$$ plain form
5849 10290 -14400 993 35332 18913 -17845 -8860 17627 -3418 -35223 -16411 -29686 -24907
5837 -24907 -24829 -47654 -30422 -30410 -24048 -6408 22224 13329 16472 58661 35474 23738 11907 -2757
5823 -2757 12864 30452 13463 9454 -4971 -22110 -30201 5308 -5422 -8927 2644 -447 -6156
5810 -6156 -15789 -38222 -60344 -40357 -40910 -22958 -15703 -7126 19575 36230 4044 -28203 -60010
5797 -60010 -38163 17445 43562 31418 16308 -4214 -37222 -62021 -48731 -19218 -5854 3821
5785 3821 -20137 -32381 -33295 -41992 -51210 -59694 -57748 -23630 22991 42430 20021 9206 4200
5772 4200 -2910 -1218 11385 -35126 -42624 -24391 -8589 -8549 -7114 -20354 -26196 -34533 -36605 -34600
5758 -34600 -19349 -23119 38670 21268 9883 -44665 -66461 -41886 -25425 -49837 -40212 -13662
5746a3662J6499k446K409j5317l1473k505J078J2777K8906K9834k5264j5565j1640
5733b6369J341j2104j4716j6507L1358K4945k4550J428L3432j244l9037P191J8601
5720a6231P522J2149j201j2771J1781J7213N675k9321J8106j9799j5061J7266
5708d672K783j2878J4244l5779l0219K192J1832M1617l026j2951P121R492j2882
5695b3126J3032J0198J3440j1123P450K3001j1829k3630J3776k396P457j467r087
5682E696O341R257j074l2332j6701L3102L2322j9933l3732m2527k1141J6470J7491
5669d6761J7096k1186j1248J3327n985j37L2179K0377N463j2014k9531r809J8121
5656c0108L189J176j2131p485j5637P656j2571K6256J3109j0291Q932R922J0034
$$ plain form
5746 -13662 2837 391 2800 -12517 -43990 -46495 -45417 -32640 -3734 26100 836 -14729 -26369
5733 -26369 -25028 -37132 -51848 -68355 -36997 -12052 -36602 -35174 -1742 -2986 -42023 -34832 -16231
5720 -16231 -8709 3440 2239 -10532 1249 18462 24137 -5184 12922 -6877 -21938 -4672
5708 -4672 -1889 -14767 -523 -36302 -66521 -64329 -52497 -10880 -13906 -26857 -19736 -10244 -23126
5695 -23126 -10094 104 13544 2421 9871 32872 21043 -2587 11189 8793 16250 14783 5696
5682 5696 12037 21294 20220 -12112 -28813 4289 36611 16678 -17054 -59581 -80722 -64252 -46761
5669 -46761 -29665 -50851 -62099 -48772 -54757 -54894 -22715 -2338 3125 -8889 -38420 -48229 -30108
5656 -30108 -26919 -25743 -37874 -45359 -60996 -53340 -65911 -39655 -26546 -36837 -27905 -17983 -7949
5643g949k679L13J7640m0952J1740L0536J3038j94o828N950r765l511j2796l4492
5629c9949l9484K9534K7391K9739j9340k1342O386M707k9068J1886O466K5245
5617g829k4515r455kM148j8947K2652K6350L1734l2458l0885k1940O13j6290k1342
5603i8166K8123N7233K1988J8288k4118O273J7351J3096N603J599o168l9697k3701
5590b2296k3515l922Q181K7042K265p297l4054K8423K6259k2469j4207L1636o396
5577a0350j402K8531m211m4332m6663j3401K1371M0318K1197N2743J4077j4833
5565D3045l4336k9541n121L3899l1543Q799K5712j7345l1637J2058J3802j3426
5553b5634j9011P518M339l254j6981k8995o968J7707J9380J1865M1119j5712K5277
$$ plain form
5643 -7949 -10628 -10315 7325 -33627 -21887 8649 21687 21493 14665 20615 10850 7339 -5457 -39949
5629 -39949 -79433 -49899 -22508 7231 -12109 -33451 -27065 -22358 -51426 -39540 -33074 -7829
5617 -7829 -32344 -41799 -41801 -37653 -56600 -33948 -7598 24136 -8322 -39207 -61147 -60534 -76824 -98166
5603 -98166 -70043 -12810 9178 27466 3348 9621 26972 40068 45671 47270 41102 1405 -22296
5590 -22296 -45811 -49733 -41552 -14510 -12245 -19542 -53596 -25173 1086 -21383 -35590 -3954 -10350
5577 -10350 -11752 16779 12568 -31764 -78427 -91828 -70457 -30139 -8942 43801 57878 43045
5565 43045 8709 -20832 -25953 7946 -23597 -14798 10914 -6431 -38068 -26010 -12208 -25634
5553 -25634 -44645 -37127 -32788 -36042 -53023 -82018 -88986 -71279 -51899 -40034 1085 -14627 10650
5540A0650m4171j2220q574J094j3277K7711L9752k6373k0549k7140l423j5627
5528i2147M655M5975J3110j1903l4521L2811K7630J0571J5878o201j548k6187
5516b1877P409L2332k920J2657M958l5256j3623j999L3107N4731K2605J0955k8221
5503G4858j0372K2428p715l3180k2611k3224l491R14j0604M834k0770j2802K9506
5490a2229J7943K4644j9477M328j0829m1778L865J1449j6917j0847L5510M1683
5478B7345l415O097r225j3251j1272L4069l072K3381n327m1713p403L9532K9058
5465F4804j3370k1870K8772l627k1909K752l8405m0431R989K0518q659j0203J6570
5452a5069j821k9141P393J752k0648K0953N488n99L3607M106j4745M1569M714
$$ plain form
5540 10650 -33521 -45741 -54315 -53221 -66498 -38787 965 -25408 -45957 -73097 -76520 -92147
5528 -92147 -87492 -41517 -28407 -40310 -74831 -42020 -14390 -3819 12059 5858 4310 -21877
5516 -21877 -14468 17864 14944 27601 32559 -2697 -16320 -18319 14788 69519 92124 103079 74858
5503 74858 64486 86914 79199 46019 23408 184 -3307 -2393 -12997 -8163 -28933 -41735 -12229
5490 -12229 5714 30358 10881 15209 4380 -37398 -33533 -22084 -39001 -49848 -14338 27345
5478 27345 23930 30027 20802 7551 -3721 30348 27276 50657 45330 3617 -3786 35746 64804
5465 64804 51434 29564 58336 54709 32800 35552 -2853 -43284 -33295 -12777 -21436 -31639 -15069
5452 -15069 -16890 -46031 -38638 -36886 -57534 -36581 -31093 -31692 1915 6021 -8724 32845 37559
5439C7559j1175p982O591j5591n352j569k3857K9017j1569K2822K160k2694QR423
5425G791q620m8698j4952j695p36O091K8253L5582J096J1186J5165j0358j539
5412A8566K2216K0194l7150P174k6322k3182K1276P0031l1919k9643m0864r683
5400c9306K6289J4581J8330j5416j0511j5350N05p552K2074K0496j3885j0584
5388a0329Q229n382k9762k4108J3132L5294j007J6236r307J62J4868k4141j2286
5375b8401L9167l1356k4262J3062j8176l572J1672l174J6388k3870j1961J1332
5363e3151N465Q417J0690J652O524j6685k0626P663N859L4069K9241J1594k1014
5350I698j1346j3606k9687J4998M391N269J5705J0854r906J4668k2982J3760K2696
$$ plain form
5439 37559 26384 18402 24993 9402 4050 2481 -21376 7641 -3928 18894 21054 -1640 -1632 7791
5425 7791 -829 -49527 -64479 -66174 -66910 -60819 -32566 3016 4112 15298 30463 20105 18566
5412 18566 40782 60976 23826 31000 4678 -18504 2772 72803 40884 11241 -29623 -39306
5400 -39306 -13017 1564 19894 4478 -6033 -21383 -20878 -28430 -6356 14140 255 -10329
5388 -10329 -2100 -7482 -37244 -61352 -48220 -12926 -13933 2303 -7004 -6842 8026 -16115 -28401
5375 -28401 10766 -20590 -44852 -31790 -49966 -53538 -41866 -45040 -28652 -52522 -64483 -53151
5363 -53151 -47686 -39269 -28579 -26927 -20403 -37088 -57714 -50051 -44192 -10123 19118 30712 9698
5350 9698 -1648 -15254 -44941 -29943 -25552 -20283 -4578 6276 -3630 11038 -11944 1816 24512
5337B4512k3948o062J0257J920J844M7201j3138k9080n9327l6575q830R799R232
5324g2195K1730j985Q218J3377O90K47J1040p036J5515k5920K4005K1805q198
5311A293l6538l5880J5692K619l1643K6010L4265M7946M499k9660j1062K3594
5299A1135j7410j5952L8304L1673K6761K0626m8866n2618k7389r311q788r569
5287f1404J5344J697J184q414J5639r40q821o322L853m110P181O862m907K1167
5273b1991K4922N364o277J0104L2037j3143l5275Q276o182m4016j3701O363K4291
5260b9228R560J6228R873p427m613L774j4498j0272J7428l910L6350J4814o8294
5247c0215L397L83j9450L799J7953N5826K3129Q795o567q79K071k2738P616J2982
$$ plain form
5337 24512 564 -5498 4759 6679 8523 55724 42586 13506 -45821 -82396 -91226 -81427 -72195
5324 -72195 -50465 -52450 -44232 -30855 -30165 -29918 -18878 -25914 -10399 -36319 -12314 9491 1293
5311 1293 -35245 -71125 -55433 -52814 -84457 -58447 -24182 23764 28263 -1397 -12459 11135
5299 11135 -6275 -22227 16077 47750 74511 95137 46271 -6347 -33736 -43047 -51835 -61404
5287 -61404 -46060 -44363 -43179 -51593 -35954 -36894 -45715 -52037 -48184 -52294 -45113 -38251 -43158 -21991
5273 -21991 2931 8295 2018 12122 44159 31016 -4259 4017 -2165 -46181 -59882 -53519 -29228
5260 -29228 -19668 -3440 6433 -994 -5607 -1833 -16331 -26603 -9175 -13085 23265 38079 -30215
5247 -30215 -26818 -26435 -45885 -42086 -24133 31693 54822 63617 57050 56171 58242 35504 43120 56102
5233E6102N31k7499N45J4556r705j4654l9347j5050k1013M898J2260O429K4910
5220g037j309O235j912L1694K792j4530o219K3197Q003k789m1909l5577J9509
5207a9852M386M732J6731J9361l0491K3978n28p205L0199K8375m434l8130j9576
5194G546J5088j0504j2493k9399m0135J7303K9139K7985L8460l653l1402J2289
5182B0224J8740o237k5795k826J8459l4168l2564J4969j0218J2009K4564O207
5170C364Q460k7552p298J4035p996j6936j4972J7412M7372j4293L4406N876J3017
5157E4895J470j9142k4750l5358J612J1781L5955p042r483k72J1002J9046Q007
5144D7721j8352l933k2409l6480L7923K9150q428L466o067K204k7003k1456j3043
$$ plain form
5233 56102 56633 29134 29679 44235 34530 19876 -19471 -34521 -55534 -50636 -38376 -31947 -7037
5220 -7037 -8346 -2111 -4023 27671 30463 15933 9714 32911 40914 38125 -3784 -39361 -19852
5207 -19852 -15466 -10734 5997 25358 -5133 18845 18317 11112 41311 69686 65252 27122 7546
5194 7546 22634 12130 -363 -29762 -69897 -52594 -23455 4530 42990 39337 7935 20224
5182 20224 38964 32727 6932 4106 22565 -11603 -44167 -29198 -39416 -27407 -2843 3364
5170 3364 11824 -15728 -23026 -8991 -16987 -33923 -48895 -31483 15889 1596 36002 41878 54895
5157 54895 56365 37223 12473 -22885 -21273 -9492 26463 19421 9938 9666 20668 39714 47721
5144 47721 29369 25436 3027 -33453 4470 33620 25192 28658 22591 24795 -2208 -23664 -36707
5131c6707K21J8277R353k0366Q06j7486K1666M731Q345L885O580q897j2039k4508
5117d6139q830o397m4271P688N4064K0344K0428K1308k5348K6080O1437j0936
5105F9428n2439k9835j8487R648j1244l952K4051J7829K908k2555J4025J0396
5093I773J4667l015k9000j8542J0740k5014J5569N6408K6738j6537k8451m394
5081H942j889m2113j7561j773J3134J3112K0483K032l4770l2284L010K2255L8442
5068h980L208L3302O874K894K1117l5418k6913J6167j3336j1471K7142R717K2931
5055D7234K1900r175n1440l4147m0795k8572q121L0226L0424n045j468K8289n970
5042b6660L620K4810O209o459k183J6658j244k9786j4114j3946Q754o638K8219
$$ plain form
5131 -36707 -36486 -18209 -8856 -29222 -28416 -45902 -24236 -19505 -11160 -7275 -695 -9592 -21631 -46139
5117 -46139 -54969 -61366 -105637 -97949 -43885 -23541 -3113 18195 -7153 18927 80364 69428
5105 69428 16989 -12846 -31333 -21685 -32929 -36881 -12830 4999 7907 -14648 -623 9773
5093 9773 24440 21425 -7575 -26117 -15377 -40391 -24822 31586 58324 41787 13336 8942
5081 8942 7053 -35060 -52621 -54394 -41260 -28148 -7665 -5633 -40403 -72687 -69677 -47422 -8980
5068 -8980 -5772 27530 34404 37298 58415 22997 -3916 12251 -1085 -12556 14586 24303 47234
5055 47234 69134 59959 8519 -25628 -66423 -94995 -103116 -72890 -42466 -47511 -48979 -20690 -26660
5042 -26660 -23040 1770 7979 1520 -663 15995 14751 -15035 -29149 -43095 -34341 -40979 -12760
5029a2760N2658J3747j9560K7559q5o6942k0606J1109j6924L009J8430m652K1010
5016E993J8514j0239r059P845o386k8731r459M300J5127p931J5525j0186L800
5003a0887K304m7931l056L3449n405O128J4682K5262r840n94J5587l2703r802
4990b2806k8209R125L9399M3480k941j9470k8154j535K5425L2456k3143J1103
4978C4730j0815j9617p842L5636q558P812N358q863j1088l3287l0641p328k1876
4965g6379m424M16J4832k954N2147J423J2518K8819j741k7320J2266J3433J7868
4952D0904q371k4439j7058j047M75m722N283Q083j5616l9534R523L0668q198l3452
4938e7501K250K6824l283j7987j293P76n196l881K5033J8049p727R252M936J8001
$$ plain form
5029 -12760 39898 53645 34085 61644 61559 -5383 -25989 -14880 -31804 -28795 -10365 -15017 5993
5016 5993 24507 14268 5209 13054 6668 -22063 -31522 -27222 -12095 -20026 -4501 -14687 -10887
5003 -10887 -8583 -56514 -59570 -26121 -31526 -25398 -10716 14546 4706 4112 19699 -13004 -22806
4990 -22806 -51015 -41890 -2491 40989 38048 18578 -9576 -11111 14314 46770 23627 34730
4978 34730 23915 4298 -3544 32092 23534 31346 36704 27841 16753 -16534 -47175 -54503 -76379
4965 -76379 -80803 -80387 -65555 -68509 -16362 -14939 -2421 26398 24657 -2663 9603 23036 40904
4952 40904 32533 8094 -8964 -10011 -9536 -14258 -8975 -892 -16508 -56042 -46519 -15851 -24049 -57501
4938 -57501 -55251 -28427 -31710 -49697 -50990 -50214 -55410 -59291 -34258 -16209 -23936 -14684 -9748 8253
4924H253j0066k287L7596N848j2994k1306j5918M0738K0154k0826j4990o993J0701
4911A7910K730K5984J7437j8119l6229q991p343O623j6469l3604K3242K4211j470
4898d088j0240L1131k391m5244k0579P510L683q461k637j4345M6735R950j6019
4885b4995K7695K816o373j8303J153J3135j7879k1308P83J4192Q815j1932o01
4872c2802L889J6288N3764k3189k605J1831k2446l515J7211K690j5010k1876k2652
4859c8422J7218K0021m7319l0161J4414K5185l8885J2057L1857J9292Q265K4269
4847A7791L034K2847J255m4511J0240J0097K8630j2551n9352l1377K4405M885
4835b4607J460L0487J2484j1075M233J678j408j5568j4340K4536J7640k4216n4135
$$ plain form
4924 8253 -1813 -4100 33496 39344 26350 5044 -10874 29864 50018 29192 14202 7209 17910
4911 17910 20640 46624 64061 45942 9713 722 -6621 2 -16467 -50071 -26829 -2618 -4088
4898 -4088 -14328 16803 14412 -30832 -51411 -43901 -40218 -48679 -51316 -65661 -18926 -8976 -24995
4885 -24995 2700 5516 -857 -19160 -18007 -4872 -22751 -44059 -43276 -29084 -20269 -32201 -32802
4872 -32802 -28913 -12625 41139 17950 15345 27176 4730 1215 18426 21116 6106 -15770 -38422
4859 -38422 -21204 -1183 -48502 -78663 -64249 -39064 -77949 -65892 -34035 -14743 -6478 17791
4847 17791 20825 43672 44927 416 10656 20753 49383 36832 -22520 -53897 -29492 -24607
4835 -24607 -23147 7340 19824 8749 12982 14660 13252 -2316 -16656 7880 25520 1304 -52831
4822e2831j2381K2956K5206J79J2030J0307j1945k7947J0280M716K7602p29k462
4809D981M301j7139o759K0647j4292m9974K126J8614L6119R555l8311P82J3581
4796a5769J2462K4805r640k3731n034M806m245k744j1385J062K2357J7239Q531
4783A8714l3363j4102j0240k1116P091J0719P838Q180K810L7852M7189K6894k9445
4770E9021k9823j3664j2681j1872J6445r11R099L06K22m2414j169K857K989k3669
4756d5264M25K8740j9326j1372J167k050J0601J8769L2177L3j4984K0682K0717
4743D0315j7332k8488P816K7719J0617j0473l4442R788L6549j5204r263k2978
4731e376j8476J233K0286k694k6652j5525M8602M4555K0483j5381P838k1591l6991
$$ plain form
4822 -52831 -65212 -42256 -17050 -16871 -4841 5466 -6479 -34426 -24146 -19430 8172 7443 4981
4809 4981 9282 -7857 -14616 6031 -8261 -58235 -56109 -37495 -1376 8179 -30132 -29350 -15769
4796 -15769 -3307 21498 11858 -11873 -16907 -12101 -16346 -19090 -30475 -29413 -7056 10183 18714
4783 18714 -14649 -28751 -38991 -60107 -53016 -42297 -34459 -26279 -23469 14383 61572 88466 59021
4770 59021 29198 15534 2853 -9019 7426 6515 15614 15920 16142 -26272 -27441 -24584 -21595 -45264
4756 -45264 -44839 -16099 -35425 -46797 -45630 -47680 -37079 -18310 13867 13900 -1084 19598 40315
4743 40315 22983 -5505 2311 30030 40647 30174 -4268 5520 42069 26865 17602 -5376
4731 -5376 -23852 -22619 -2333 -5027 -31679 -47204 1398 45953 66436 51055 58893 37302 311
4718C11j1099Q220k438P24J0611N202j4672k2947N861J6842K3925j8282m1670
4705c9412N973M1755K7664Q789l3861k6017K965R303k1191j5782Q350J4358j3795
4692c0901j8775O45J0137M2L1855M168M201Q052k2367J5229N453l641l180p732
4678f814Q714k2530j5467p481Q025k1658K50J7445j3522N74J7480Q538k7632M510
4664d9568J2168q860M3764M7467m216j7467k8969J4444q918Q805J253k2110j6668
4651b8875R684J0737k1943j272L4551j253K8216O898J3433r211P967m814k6643
4638A7475L389J015l0616j7265J5805J998J1868j1921j4962J3846J232n0305l591
4625f2032J6698J9069p148k8976j8142M5038J2483k0107J4163j6594r213j2627
$$ plain form
4718 311 -10788 -2568 -5006 -4282 6329 11531 -3141 -26088 -20227 -3385 20540 2258 -39412
4705 -39412 -33439 8316 35980 44769 10908 -15109 -12144 -2841 -24032 -39814 -31464 -17106 -30901
4692 -30901 -49676 -49031 -38894 -38852 -6997 -2829 1372 9424 -12943 2286 7739 4098 918 -6814
4678 -6814 1900 -20630 -36097 -43578 -35553 -57211 -56961 -39516 -53038 -52464 -34984 -26446 -54078 -49568
4664 -49568 -37400 -46260 -2496 44971 40755 23288 -5681 8763 -155 8650 9903 -12207 -28875
4651 -28875 -19191 -8454 -30397 -31669 2882 1629 29845 36743 50176 40965 48932 44118 17475
4638 17475 20864 21879 -8737 -26002 -10197 -8199 3669 -8252 -23214 -9368 -8136 -58441 -62032
4625 -62032 -45334 -26265 -33413 -62389 -80531 -35493 -23010 -43117 -28954 -45548 -54761 -67388
4613f7388l608Q0402J9306j4804O236L4938M587l3570k4305q510j7403L310J0808
4600a0001K281J3964K4953K4670R883K3853l2927m8400J9819j2478k941k4446
4588a1770j2368J3663O777K0555J0147J2176j8694j8970Q910Q371J0720j6787
4576A2730J9420L0062J1794r469n5351k5528J6367Q662O563M484K114Q744J6509
4563D7101J3882n8003m7936K9877R216J4266K3935k7307J0582K6261q336m1762
4551h224L248J96j4497k7854p408k1355j8600L0262L0113K3434n693j827K1108
4538B903m8080M093K9930M580K9284L8330j021j3290l7678j5407k2111J0391J0549
4525g527q054r977J2633l0270K1653J1699j4476k1272O977j861J2330O1439K5420
$$ plain form
4613 -67388 -70996 9406 28712 13908 20144 55082 59669 26099 1794 -6716 -24119 -20809 -10001
4600 -10001 -7720 6244 31197 55867 65750 89603 56676 8276 28095 15617 12676 -11770
4588 -11770 -24138 -10475 -3698 16857 27004 39180 20486 1516 10426 18797 29517 12730
4576 12730 32150 62212 74006 64537 9186 -16342 25 8687 15250 19734 21848 30592 47101
4563 47101 60983 2980 -44956 -15079 -5863 8403 32338 5031 15613 41874 33538 -8224
4551 -8224 -4976 -4780 -19277 -47131 -54539 -75894 -94494 -64232 -34119 -10685 -16378 -18205 2903
4538 2903 -45177 -41084 -11154 -6574 22710 61040 60019 46729 9051 -6356 -28467 -18076 -7527
4525 -7527 -15581 -25558 -12925 -43195 -21542 -9843 -24319 -45591 -38614 -40475 -28145 33294 58714
4512E8714l5359j6299j6362K3630J4242j7059J8560N911N680l9253k1393L774
4500a5214p400p909J3434j0984J852L1570j9187k1077o682J20K0566L8895K3242
4487D1226k1733q876J7531L685j3746J7639K6644j1127K264J1565J6691l3876
4475D7887o1122m3880K6368M6130k8112j9005J8793J8753J4833R092j3590k4362
4463h215n7011k2851L5994K0947L9600K2717n3113m0729n514K6523o842j073Q00
4450d8767j1273K2422j1150Q876L2533j3350K10j7280J1118M082K8492J2830r523
$$ plain form
4512 58714 23355 7056 -9306 14324 28566 11507 30067 35978 41658 2405 -18988 -15214
4500 -15214 -22614 -30523 -17089 -28073 -26221 5349 -13838 -34915 -41597 -41477 -20911 17984 41226
4487 41226 19493 10617 28148 31833 18087 35726 62370 51243 53507 65072 81763 47887
4475 47887 -13235 -57115 -30747 15383 -12729 -31734 -12941 5812 20645 29737 16147 -8215
4463 -8215 -65226 -88077 -52083 -31136 8464 31181 -21932 -62661 -68175 -41652 -48494 -49567 -48767
4450 -48767 -60040 -37618 -48768 -39892 -7359 -20709 -20499 -37779 -26661 -22579 5913 18743 9220
$$ [...]
##END NTUPLES=NMR SPECTRUM
##END=
