##TITLE=Analysis number 318931
Compound Code ac 35972
Project Code adrs
Chemist Name fudan
##JCAMPDX= 6.0         $$ Bruker NMR JCAMP-DX V2.0
##DATA TYPE= NMR SPECTRUM
##DATA CLASS= NTUPLES
##ORIGIN= Bruker BioSpin GmbH
##OWNER= nmr
$$ XWIN-NMR		Version 3.5
$$ Tue Apr 25 11:30:24 2006 GMT Daylight Time (UT+1h)  MAYBRIDGE\nmr@NMR_250MHZ
##.OBSERVE FREQUENCY= 250.131544655141
##.OBSERVE NUCLEUS= ^1H
##.ACQUISITION MODE= SIMULTANEOUS (DQD)
##.ACQUISITION SCHEME= undefined
##.AVERAGES= 16
##.DIGITISER RES= 18
##SPECTROMETER/DATA SYSTEM= dpx250
##.PULSE SEQUENCE= zg30
##.SOLVENT NAME= DMSO
##.SHIFT REFERENCE= (INTERNAL, DMSO, 0, 16.522)
##AUDIT TRAIL= $$ (NUMBER, WHEN, WHO, WHERE, WHAT)
$$ ##TITLE= Audit trail, XWIN-NMR		Version 3.5
$$ ##JCAMPDX= 5.01
$$ ##ORIGIN= Bruker BioSpin GmbH
$$ ##OWNER= nmr
$$ C:\u/data/dgb/nmr/ADRS/2940/pdata/1/auditp.txt
$$ ##AUDIT TRAIL=  $$ (NUMBER, WHEN, WHO, WHERE, WHAT)
(   1,<2006-04-25 11:29:59.86 +100>,<MAYBRIDGE\nmr>,<NMR_250MHZ>,
      <created by zg, POWCHK disabled, PULCHK disabled
       configuration hash MD5:
       84 BC 41 DB A1 6E 1D 46 DA 25 12 A5 C1 ED C5 3A
       data hash MD5: 64K
       1D E6 C0 46 EE 05 89 F0 39 7E 1A 8B DE 4A B2 F6>)
(   2,<2006-04-25 11:30:15.06 +100>,<MAYBRIDGE\nmr>,<NMR_250MHZ>,
      <Start of raw data processing
       ef LB = 0.3 FT_mod = 6 PKNL = 1 SI = 32K 
       data hash MD5: 32K
       D0 7A FA C0 7B EA 11 52 9F 66 BE CF DE 77 31 C4>)
(   3,<2006-04-25 11:30:16.89 +100>,<MAYBRIDGE\nmr>,<NMR_250MHZ>,
      <apk 
       data hash MD5: 32K
       E9 90 25 A1 D4 DF E5 93 B4 D1 E3 36 D3 FC CB 4D>)
(   4,<2006-04-25 11:30:17.67 +100>,<MAYBRIDGE\nmr>,<NMR_250MHZ>,
      <abs ABSG = 5 
       data hash MD5: 32K
       F6 13 CB AD 35 AC F8 01 50 D7 E7 F0 01 77 FD 40>)
$$ ##END=
$$ 
$$ hash MD5
$$ 49 F4 12 72 AB B5 1E 1E DA 94 A8 7A 2D 20 A2 99
##$RELAX= 
##$RELAX= 
##$RELAX= 
##$RELAX= 
##$RELAX= 
##$RELAX= 
##$RELAX= 
$$ Bruker specific parameters
$$ --------------------------
##$DU= <C:\u>
##$EXPNO= 2940
##$NAME= <ADRS>
##$PROCNO= 1
##$TYPE= <nmr>
##$USER= <dgb>
##$AMP= (0..31)
100 100 100 100 100 100 100 100 100 100 100 100 100 100 100 100 100 100 
100 100 100 100 100 100 100 100 100 100 100 100 100 100 
##$AQSEQ= 0
##$AQ_mod= 3
##$AUNM= <au_zg>
##$AUTOPOS= <22 >
##$BF1= 250.13
##$BF2= 250.13
##$BF3= 250.13
##$BF4= 250.13
##$BF5= 500.13
##$BF6= 500.13
##$BF7= 500.13
##$BF8= 500.13
##$BYTORDA= 1
##$CFDGTYP= 0
##$CFRGTYP= 5
##$CHEMSTR= <none>
##$CNST= (0..31)
1 1 145 1 1 1 1 1 1 1 1 1 1 1 1 1 1 1 1 1 1 1 1 1 1 1 1 1 1 1 1 1 
##$CPDPRG= <>
##$CPDPRG1= <>
##$CPDPRG2= <>
##$CPDPRG3= <>
##$CPDPRG4= <mlev>
##$CPDPRG5= <mlev>
##$CPDPRG6= <mlev>
##$CPDPRG7= <mlev>
##$CPDPRG8= <mlev>
##$CPDPRGB= <>
##$CPDPRGT= <>
##$D= (0..31)
0 1 0 0 0 0 0 0 0 0.06 0 0 0 0 0 0 0.0002 0 0 0 0 0 0 0 0 0 0 0 0 0 0 
0 
##$DATE= 1145960998
##$DBL= (0..7)
120 120 120 120 120 120 120 120 
##$DBP= (0..7)
150 150 150 150 150 150 150 150 
##$DBP07= 0
##$DBPNAM0= <>
##$DBPNAM1= <>
##$DBPNAM2= <>
##$DBPNAM3= <>
$$ [...]
##$SUBNAM7= <"">
##$SUBNAM8= <"">
##$SUBNAM9= <"">
##$SW= 20.6930455092707
##$SWIBOX= (0..15)
0 0 3 0 0 0 0 0 0 0 0 0 0 0 0 0 
##$SW_h= 5175.983436853
##$TD= 65536
##$TD0= 1
##$TE= 296.16
##$TE2= 300
##$TE3= 300
##$TEG= 300
##$TL= (0..7)
0 120 120 120 120 120 120 120 
##$TP= (0..7)
150 150 150 150 150 150 150 150 
##$TP07= 0
##$TPNAME0= <>
##$TPNAME1= <>
##$TPNAME2= <>
##$TPNAME3= <>
##$TPNAME4= <>
##$TPNAME5= <>
##$TPNAME6= <>
##$TPNAME7= <>
##$TPOAL= (0..7)
0.5 0.5 0.5 0.5 0.5 0.5 0.5 0.5 
##$TPOFFS= (0..7)
0 0 0 0 0 0 0 0 
##$TUNHIN= 0
##$TUNHOUT= 0
##$TUNXOUT= 0
##$USERA1= <user>
##$USERA2= <user>
##$USERA3= <user>
##$USERA4= <user>
##$USERA5= <user>
##$V9= 5
##$VALIST= <valist>
##$VCLIST= <CCCCCCCCCCCCCCC>
##$VD= 0
##$VDLIST= <DDDDDDDDDDDDDDD>
##$VPLIST= <PPPPPPPPPPPPPPP>
##$VTLIST= <TTTTTTTTTTTTTTT>
##$WBST= 1024
##$WBSW= 4
##$XGAIN= (0..3)
0 0 0 0 
##$XL= 0
##$YL= 0
##$YMAX_a= 259105
##$YMIN_a= -491655
##$ZGOPTNS= <>
##$ZL1= 120
##$ZL2= 120
##$ZL3= 120
##$ZL4= 120
##$ABSF1= 16.522
##$ABSF2= -4.171173
##$ABSG= 5
##$ABSL= 3
##$ALPHA= 0
##$AQORDER= 0
##$ASSFAC= 0
##$ASSFACI= 0
##$ASSFACX= 0
##$ASSWID= 0
##$AUNMP= <proc_1d>
##$AZFE= 0.1
##$AZFW= 0.1
##$BCFW= 0
##$BC_mod= 0
##$BYTORDP= 0
##$COROFFS= 0
##$CY= 12.5
##$DATMOD= 1
##$DC= 0
##$DFILT= <>
##$DTYPP= 0
##$F1P= 14.0000005364418
##$F2P= -0.99999901652339
##$FCOR= 0.5
##$FTSIZE= 32768
##$FT_mod= 6
##$GAMMA= 0
##$GB= 0
##$INTBC= 1
##$INTSCL= 1
##$ISEN= 128
##$LB= 0.3
##$LEV0= 0
##$LPBIN= 0
##$MAXI= 10000
##$MC2= 0
##$MEAN= 0
##$ME_mod= 0
##$MI= 0
##$NCOEF= 0
##$NC_proc= -6
##$NLEV= 6
##$NOISF1= 0
##$NOISF2= 0
##$NSP= 0
##$NTH_PI= 0
##$NZP= 0
##$OFFSET= 16.522
##$PC= 1
##$PHC0= 151.8917
##$PHC1= 15.8693
##$PH_mod= 1
##$PKNL= yes
##$PPARMOD= 0
##$PSCAL= 4
##$PSIGN= 0
##$REVERSE= no
##$SF= 250.13
##$SI= 32768
##$SIGF1= 0
##$SIGF2= 0
##$SINO= 400
##$SIOLD= 32768
##$SREGLST= <1H.DMSO>
##$SSB= 0
##$STSI= 32768
##$STSR= 0
##$SW_p= 5175.98343685301
##$SYMM= 0
##$S_DEV= 0
##$TDeff= 65536
##$TDoff= 0
##$TI= <Analysis number 999999
Compound Code 99
Book Reference 9
Project Code 9>
##$TILT= no
##$TM1= 0
##$TM2= 0
##$TOPLEV= 0
##$USERP1= <user>
##$USERP2= <user>
##$USERP3= <user>
##$USERP4= <user>
##$USERP5= <user>
##$WDW= 1
##$XDIM= 32768
##$YMAX_p= 468891881
##$YMIN_p= -1395737
$$ End of Bruker specific parameters
$$ ---------------------------------
##NTUPLES= NMR SPECTRUM
##VAR_NAME=  FREQUENCY,     SPECTRUM/REAL,   SPECTRUM/IMAG
##SYMBOL=    X,             R,               I
##VAR_TYPE=  INDEPENDENT,   DEPENDENT,       DEPENDENT
##VAR_FORM=  AFFN,          ASDF,            ASDF
##VAR_DIM=   32768,         32768,           32768
##UNITS=     HZ,            ARBITRARY UNITS, ARBITRARY UNITS
##FACTOR=    0.157963299565203, 1,           1
##FIRST=     4132.6476996994, 0,             0
##LAST=      -1043.33573715361, 0,           0
##MIN=       -1043.33573715361, -1395737,    0
##MAX=       4132.6476996994, 468891881,     0
$$ Real data points
##PAGE= N=1
##DATA TABLE= (X++(R..R)), XYDATA
$$ [...]
15531a61522N6718M9925R6823k6364l05986j39954l11396O2819J62715J85225
15521c30997K85815M9665j14042J13461P6918K8542l2873j78748r0966k04770
15511c97995M1446J70524K27524L3491j0067n030k46296N7239P1167J48574J35247
15500B25824P2841j04374l9695q2463N4183L85159P8o7546k70154j91461q8336
15489a05944j11990M0885J34986P0327k19871K40840j92417k21814J82706J96377
15479A4085Q5262n7334J83813j80740p7797J40741N5403R9890J4521q4299l42757
15468a49212j50087n0581J45114J9511L7627K11942K44465J3161m04020k61703
15458c43783k18281j94165l22P3276N5532K30730J70771Q0286j39753N9233K81136
$$ plain form
15531 -161522 -104804 -54879 41944 15580 -290406 -430360 -741756 -678937 -516222 -330997
15521 -330997 -45182 4483 -109559 3902 80820 109362 76489 -102259 -193225 -397995
15511 -397995 -356549 -186025 41499 74990 64923 59893 -186403 -129164 -57997 90577 225824
15500 225824 298665 194291 154596 72133 126316 511475 511553 444007 173853 -17608 -105944
15489 -105944 -217934 -177049 -42063 28264 -191607 49233 -143184 -364998 -182292 14085
15479 14085 99347 42013 225826 45086 -32711 108030 163433 263323 277844 193545 -149212
15468 -149212 -299299 -349880 -204766 -185255 -147628 64314 308779 321940 -82080 -343783
15458 -343783 -562064 -756229 -756551 -683275 -627743 -397013 -226242 -145956 -285709 -226476 54660
15447E4660Q6767j09587r9248k26517j70487k24829J40560k70804J34417J66940
15437e18128L31130l5682P8729j56528j04094j58434J00979L43670J34628K3929
15427D0199J07196J48855J18157m63072k41699J572M02504K13882j5525Q2476
15417C94545j32641M2792j24054j71365q541L01157M9991k23792j19994k9597
15407b1499j87064J6377J41771J11128j53744n8118P5847J01259n0862q3761J34959
15396B6293R1060n5895k00420j27499j82166j1506L37623k6414P5719K78582K10692
15385D16069k07315k25226n8959J01068L3323l16702q3233l8083J96128L42284
15375A59354j16902L6260j8441o1720O7339j2919m3776j33653J55718j99593j11806
$$ plain form
15447 54660 141427 31840 -67408 -293925 -464412 -689241 -548681 -819485 -685068 -518128
15437 -518128 -186998 -222680 -143951 -300479 -404573 -563007 -462028 -118358 16270 40199
15427 40199 147395 296250 414407 -48665 -290364 -288792 113712 327594 312069 394545
15417 394545 261904 304696 180642 9277 736 301893 351884 128092 8098 -21499
15407 -21499 -208563 -192186 -50415 60713 -93031 -151149 -75302 25957 -24905 -108666 26293
15396 26293 117353 61458 -138962 -266461 -448627 -460133 -122510 -148924 -73205 205377 416069
15385 416069 208754 -16472 -75431 25637 58960 -257742 -340975 -379058 -182930 159354
15375 159354 42452 78712 60271 -1449 65890 52971 9195 -124458 31260 -168333 -280139
15364b80139j9156P4424m0913j26688m6175l9916j47875O02399J60785o3468J7133
15353I0411m0377m4877J59523j02572r005J78263L23290j95044l95065O1183q1583
15342e5853q8256k52688N1935L83697J69555l9982K5789k01522j95742L7485P5707
15331h9875j58200j46703O258r1982J50391L36943J52218p4220K94462k67291
15321A12001k0544P868k28773o1349M5442N3457j09651j12054j8342J85952L26907
15310A80914K4766l36205l66694L08577L49947K02262j62945m22375k00305J91176
15300b30882J97115J36623j57215l9077K922O1309P0397k24977j7264O1303J09552
15289c0194j17889J58358M3535J02550O1438N0052J5691k32829k99369J19850
$$ plain form
15364 -280139 -299295 -224871 -265784 -392472 -438647 -478563 -626438 -24039 136746 73278 90411
15353 90411 50034 5157 164680 62108 53103 231366 554656 359612 -35453 25730 -55853
15342 -55853 -144109 -396797 -344862 38835 208390 168408 194197 -7325 -203067 -165582 -89875
15331 -89875 -248075 -394778 -388520 -480502 -330111 6832 159050 84830 379292 112001
15321 112001 91457 99325 -129448 -190797 -145355 -91898 -201549 -313603 -331945 -145993 180914
15310 180914 205680 -130525 -497219 -188642 161305 363567 200622 -221753 -422058 -230882
15300 -230882 -33767 102856 -54359 -93436 -90514 -29205 41192 -183785 -201049 -139746 -30194
15289 -30194 -148083 10275 53810 156360 217798 267850 283541 50712 -248657 -128807
15279a28807K55494j6234K71698l6641j63978o3594n2440j34105k43499N603m2169
15268c48672O471K62566J87429k7571l4087o5929l4119j86359j07427J38674M26395
15257B17371O7785r3169m4907j39694j2441j42524l22385n0480J70558K63711
15247h6175J8942p8934q0035K46250K5515k12298m4921J97413J08660J81834p5011
15236B01240q4579m1056j76313m1400j8145J46659j18547M2771k7468J24173P2950
15225H0285j1634k36590r0559j34603J40189P4168J2987Q1488k6218k06425l4496
15214c51408M0171j35603p6276K24008J19399m8578j256P0272J31116k5174l780
15203e7109j20259j45767M852L8569Q0912q2390j66847q0953Q1084L48943Q1357
$$ plain form
15279 -128807 126687 110453 382151 345510 181532 117938 65498 -68607 -312106 -306503 -348672
15268 -348672 -342201 -79635 107794 80223 46136 -19793 -53912 -240271 -347698 -209024 217371
15257 217371 285156 191987 147080 7386 -5055 -147579 -469964 -520444 -349886 -86175
15247 -86175 -67233 -146167 -226202 20048 45563 -166735 -211656 -14243 94417 276251 201240
15236 201240 116661 75605 -100708 -142108 -160253 -13594 -132141 -89370 -116838 7335 80285
15225 80285 68651 -167939 -258498 -393101 -252912 -178744 -165757 -84269 -110487 -316912 -351408
15214 -351408 -311237 -446840 -523116 -299108 -179709 -228287 -229543 -159271 -28155 -53329 -57109
15203 -57109 -177368 -323135 -318283 -279714 -198802 -281192 -448039 -528992 -447908 -98965 -17608
15192a7608j53388J98973L0464q1391n3075j38732J25523Q1446k79462j11645
15182c98895k99366M9326K15649K92705p0970M1856K6421L11395J1317k87125
15172a07687k02418r7537j74218K27400J76662j5620j3800J15623m6903o4681
15162b03179Q4804l2028j98776R7433q1028R072L75301J01183j79449l00179m2159
15151c69005K92051M5539k06j64822m577J59940p0850m5858k03919j35797k62563
15140g60067N0323J74420N7540K33353J02187j8813r3474P258J47724J72738J33395
15129B06584J23347J89358k70963Q6765j58366l64083J30559L65456n258j04053
15119A99346M6094q5189j90420k23701j25705R5664J48634N5813j03202J52760
$$ plain form
15192 -17608 -170996 27977 58441 -22950 -76025 -214757 -89234 -7788 -287250 -398895
15182 -398895 -698261 -648935 -433286 -140581 -211551 -169695 -143274 168121 179438 -107687
15172 -107687 -310105 -407642 -581860 -354460 -177798 -193418 -207218 -91595 -138498 -203179
15162 -203179 -118375 -150403 -349179 -251746 -332774 -323702 51599 152782 -26667 -326846 -369005
15151 -369005 -76954 -31415 -31621 -196443 -201020 -41080 -111930 -157788 -361707 -497504 -760067
15140 -760067 -709744 -535324 -477784 -244431 -142244 -161057 -254531 -247273 -99549 73189 206584
15129 206584 329931 519289 248326 335091 176725 -187358 -56799 308657 303399 199346
15119 199346 245440 160251 -30169 -253870 -379575 -283911 -135277 -79464 -182666 -29906
15109b9906p2637J65223J54462o9683j53716J183K09166j07074m28597M2604N4212
15098b34763J3425k82277J17681J45219r2177k8917R1959J84658k0390N071R7358
15087c153J42565j65205N7731J95642k35475j4973n2864j06929R145J38033j68
15076c5651J28031J53724R9784k25658k52579k88767l8712N9025O0234j2819J46767
15065b06621K31431l8933o807k5209J86240J09629j08819j37519j49153N1998
15055i3763k6060r0896j64595M3091L64546J42693j30947J98906j80817j71685
15045a09527j92746J40297K8532K92022J73219Q5770k03887j64831K13838o3785
15035A98902L5800k4071j32998q822l4832m8675Q1558q9555p9839N6089J28855
$$ plain form
15109 -29906 -102543 62680 217142 147459 -6257 -5074 204092 97018 -331579 -288975 -234763
15098 -234763 -221338 -503615 -385934 -240715 -332892 -361809 -269850 -85192 -105582 -100511 -3153
15087 -3153 139412 -25793 31938 227580 -7895 -22868 -75732 -182661 -173516 -35483 -35651
15076 -35651 92380 246104 345888 120230 -132349 -421116 -459828 -400803 -340569 -353388 -206621
15065 -206621 24810 -14123 -20930 -46139 140101 249730 140911 3392 -145761 -93763
15055 -93763 -119823 -210719 -375314 -332223 32323 175016 44069 242975 62158 -109527
15045 -109527 -302273 -161976 -133444 158578 331797 417567 213680 48849 262687 198902
15035 198902 234702 210631 77633 68811 33979 -14696 66862 -22693 -102532 -46443 82412
15024H2412P3218n3712k14036J4208M36209K22388k4730j65707l19506k52903
15014b02159q5587J27741m9502l29050j88599K05153L11898J71448j7792j23839
15004a80288j18646P3334j19498K40451R4953J91741j73753k27036k73421N3076
14994d39087O6256j8913K22306L73992M61544j98069k34782k50895k34565q2043
14984c34256j12213k1973J03575P0383O0322J90605m699n9150j44236k42782J17099
14973c77325K11729M8192l99274J9127M76276J44829J08267l47902j72315Q4395
14963b04001N8186p685q5506m5012n2213p9431p8911J05236J9305M2972j60011
14952d87071j83922J64127K63482P5308J84071K25247J63827M1007j48209k05433
$$ plain form
15024 82412 155630 101918 -112118 -97910 338299 560687 535957 370250 50744 -202159
15014 -202159 -287746 -160005 -209507 -538557 -727156 -522003 -210105 -38657 -56449 -180288
15004 -180288 -298934 -225600 -345098 -104647 -9694 182047 8294 -218742 -492163 -439087
14994 -439087 -372831 -391744 -169438 204554 666098 468029 233247 -17648 -252213 -334256
14984 -334256 -446469 -468442 -364867 -294484 -234162 -43557 -48256 -107406 -251642 -494424 -377325
14973 -377325 -165596 -117404 -516678 -497551 -21275 123554 231821 -116081 -288396 -204001
14963 -204001 -145815 -153500 -239006 -284018 -336231 -415662 -494573 -389337 -370032 -327060 -487071
14952 -487071 -670993 -506866 -243384 -168076 15995 241242 405069 446076 297867 92434
14942I2434k03172m1769j6093N1836L17904k80061l35856J10057K60946L3440
14932a0334Q3177l3740j6537j79045J14931K2000N2122J39705k95870p9901J18446
14921h5046K9078o7228r8662m222M17741J10351J9662r2523k09346K19687J87735
14910D27227r9754k10779j2209m17327k18775J97620L19380J82429n7548k46898
14900a36634J14930K5372q3919q3596J67460j0435R3026M13977k00464k41087
14890E8630K29652J17982k15861Q1755L3177Q45k34620l22420J75088N4550O300
14879a4922j93003k16566J45546M0646k0970K1997P5192j74545j47385J54535
14869c29475K27061p0634j53934P38L14383q080o9565m2949k24331j38378J88624
$$ plain form
14942 92434 -110738 -152507 -168600 -116764 201140 -78921 -414777 -304720 -43774 -10334
14932 -10334 72843 39103 22566 -156479 -41548 -19548 32574 172279 -123591 -203492 -85046
14921 -85046 -55968 -123196 -221858 -226080 191661 302012 321674 229151 19805 239492 427227
14910 427227 327473 116694 104485 -312842 -531617 -333997 -14617 167812 110264 -136634
14900 -136634 -21704 3668 -80251 -163847 3613 -6822 86204 500181 299717 58630
14890 58630 288282 406264 190403 272158 305335 306180 71560 -250860 -75772 -21222 -14922
14879 -14922 -207925 -424491 -278945 -238299 -259269 -237272 -162080 -336625 -484010 -329475
14869 -329475 -102414 -173048 -326982 -326244 -11861 -19941 -89506 -132455 -356786 -495164 -306540
14858c06540P9182n0131k4460l7915K03167J50397J93991K0338k51362o0270k8208
14847a11811j30942M2808J76242J09869j31403j57530J70875m4634k86850R5082
14837b68294R1442n9517J12823M5087J43660K77676j63057l81341Q1831k3196
14827a42886m1710J60831K27949J96924n1476k79193k38493L01659O9223J41545
14817C44373j94189k6353J27381j25943k61800j20820J6050J66897M86084m9251
14807C62429r8704K3775j70629j72404k44568J78248L53152j94674q2608P9273
14797C3290J29447J72512j06236k57284n53594j35737J29573K36995j68706p8216
14787e97956J75845J13956k143j93622K34614J75173j72196m3813n7947k13668
$$ plain form
14858 -306540 -227358 -277489 -301949 -339864 -136697 13700 207691 228029 -23333 -83603 -111811
14847 -111811 -242753 -199945 -23703 86166 -45237 -202767 -31892 -76526 -363376 -268294
14837 -268294 -176852 -236369 -123546 -78459 65201 342877 179820 -201521 -119690 -142886
14827 -142886 -184596 -23765 204184 401108 349632 70439 -168054 133605 202828 344373
14817 344373 150184 123831 251212 125269 -136531 -257351 -241301 -74404 411680 362429
14807 362429 263725 287500 116871 -55533 -300101 -121853 231299 36625 -45983 33290
14797 33290 162737 335249 229013 -28271 -581865 -717602 -588029 -351034 -519740 -597956
14787 -597956 -422111 -308155 -310298 -503920 -269306 -94133 -266329 -310142 -368089 -581757
14777e81757j67566K83106K68500L82733P6385l36790j72983J86713J21010J59073
14767B18424j58243m9204j75658P0826K17603K24197k81424k93898J25804J24322
14757B2749o4099j86929J33651j39601R1075J35771j3820q2173J52471P6984P3646
14746A99725O6080J65572k38918l58659L1054K7421K88949k0633q0770m844o3433
14735A1544l87718M8219j01964L143L70833j04791l45862J8508J97355n1360p8144
14724d20237p9096J26564J18054L28358P8676k25923k5505j16564n9915M67676
14714A92088L51991k41423j76281N6400K35721l5555k62583l2557o408j88979
14704a07586m2274j76861k77409J93768K22987J4110k22661k74667K55232J95333
$$ plain form
14777 -581757 -749323 -466217 -197717 185016 261401 -75389 -248372 -61659 59351 218424
14767 218424 60181 10977 -164681 -93855 123748 347945 66521 -227377 -101573 22749
14757 22749 -41350 -228279 -94628 -234229 -143154 -7383 -21203 -103376 49095 126079 199725
14746 199725 265805 431377 192459 -166200 -135146 -107725 181224 160591 79821 74977 11544
14735 11544 -376174 -327955 -429919 -426776 -55943 -160734 -506596 -488088 -290733 -342093 -420237
14724 -420237 -499333 -372769 -254715 73643 152319 -73604 -99109 -215673 -275588 192088
14714 192088 544079 302656 126375 182775 418496 382941 120358 87801 81393 -107586
14704 -107586 -149860 -326721 -604130 -410362 -187375 -173265 -395926 -670593 -415361 -220028
14694b20028P5062k8715k77828l22726J99783L38362j27869k4595M62697K80164
14684C54307j94062l61995P1157P2900r9085k72672n0180J77288O3705m139p4825
14673c17601L34844N8922Q8115j91079k05807l6781J80085n5017j094l80545k70391
14662g96349L44185J99530K43379K81886R6964J36331k91654q6217r553j66280
14652d7778R9036q754j5236j54918j64650j73391q4200K55373K29429R082k54917
14641c10924K2469R6249k32274k88373J66292L80359o6333K16963J88141k28134
14631e5565k32384j28196J31988r9535P0027J80996J38153j50827r0395m7041
14621b82779k7518K13413Q539O4802K15371j0049m6706k42193j1327j12033m756
$$ plain form
14694 -220028 -144966 -173681 -451509 -774235 -574452 -236090 -363959 -388554 74143 354307
14684 354307 160245 -201750 -130593 -57693 -156778 -429450 -479630 -302342 -238637 -242776 -317601
14673 -317601 17243 76165 164280 -26799 -232606 -269387 -89302 -144319 -145413 -525958 -796349
14662 -796349 -452164 -252634 -9255 272631 369595 505926 214272 128055 118502 -47778
14652 -47778 51258 42504 27268 -127650 -292300 -465691 -549891 -294518 -65089 -56007 -310924
14641 -310924 -288455 -192206 -424480 -712853 -546561 -166202 -232535 -15572 172569 -55565
14631 -55565 -287949 -416145 -284157 -383692 -313665 -132669 5484 -145343 -235738 -282779
14621 -282779 -310297 -96884 -88345 -23543 191828 181779 135073 -107120 -118447 -230480 -235236
14610b35236L03666K5163k89072R996K49142L20392J22858p6547l00789l91468
14600b61895k87693L3960K03405j929p1588j07985O0719j59091L13075L15977
14590C6955O70o8120k9891L2885k5169K67861o0766k99855l02346J5618J77012
14579b55146J1776j76112k3951K32407J20148J57849J16046J81942J72658k39747
14569B97870l12460k29338M2014k7121k36269m3926J45104K92136Q6843O9721
14559H4574K43866j97916m10208k49625K20523J56333J38678j83720P8653J60266
14549D1424M7405J31392k7871j77958j59015j1872J19075J2754K2474K62188j0559
14538B49437j34280l5360j50725k0612j49069j11135j32821J84950L2799J46997
$$ plain form
14610 -235236 68430 93593 -195479 -185483 63659 384051 506909 430362 129573 -261895
14600 -261895 -549588 -515628 -312223 -314152 -385740 -493725 -433006 -592097 -279022 36955
14590 36955 37625 -30495 -60386 -27501 -52670 215191 154425 -145430 -447776 -432158 -255146
14579 -255146 -243370 -419482 -443433 -211026 -90878 66971 183017 364959 537617 297870
14569 297870 -14590 -243928 -201914 -229035 -465304 -509230 -364126 -71990 14853 84574
14559 84574 328440 130524 -279684 -529309 -308786 -152453 -13775 -197495 -118842 41424
14549 41424 88829 220221 192350 14392 -144623 -156495 -37420 -24666 -2192 259996 249437
14538 249437 115157 79797 -70928 -91540 -240609 -351744 -484565 -299615 -266816 -119819
14528a19819P3270j20815m6127K4075J18891Q9384j20801P1232J58400j0214K27362
14517C44838K5880j24378l27586J9327j40821J35755K98499J22447K85728J8869
14507F58558r7182m2547j17163l36573K9728M5049j28474r2789n6565k19458R2654
14496b64762J38399J62826r4968n042j88100L2014j84306J46058K74285j23151
14486a06747R1184r5603j48398L11204J29022k53250j91848j11906M0265J06304
14476b29773J00418J06970L6871M0432k5474R8647j26111m2391J37175j13231
14466a6467k49126j75357Q9773J78211P0405M9081p816n0713q954J62278O2071
14455A03386k19414k10100p0990O6511R5898Q4076J06366p1685J36942n2146j3553
$$ plain form
14528 -119819 -46549 -167364 -213491 -189416 -70525 18859 -101942 -30710 127690 117476 344838
14517 344838 370718 246340 -81246 -61919 -202740 -66985 231514 353961 639689 658558
14507 658558 561376 518829 401666 65093 94821 139870 11396 -81393 -137958 -357416 -264762
14496 -264762 -126363 36463 -58505 -63547 -251647 -219633 -403939 -257881 16404 -106747
14486 -106747 -15563 -111166 -259564 51640 180662 -72588 -264436 -376342 -336077 -229773
14476 -229773 -129355 -22385 14486 54918 29444 128091 1980 -40411 96764 -16467
14466 -16467 -265593 -440950 -351177 -172966 -102561 -53480 -61296 -112009 -120963 41315 103386
14455 103386 -116028 -326128 -397118 -330607 -234709 -150633 -44267 -115952 20990 -31156 -44709
14444d4709j27994r3313N0860J43272O8245J50617k24820r8275J4723k30863j53672
14433e45929m9983M0832J73227K41961J62919j9793j85587O2325K04528j11174
14423b6674k09948j74194o3522J5650k0610J02511K11385J6004r7340r999J75857
14412h0880J87867k7467k89996N3341L43822J0639r4081K5450k80208k04755R3723
14401b62545J05225j03449L3853J70139j499j24319j99856Q9712J00598J87454
14391d687k3443j47400m1521J28181K2912J35857P7099j6089n6327K45011k68828
14380E0765k24417m5358L1385Q6023R3909J74414J01599k7594n908k92270K4844
14369c2608J72643j64682j88445p4250O7890K90400R9329K14533j02085k63355
$$ plain form
14444 -44709 -172703 -266016 -215156 -71884 -3639 146978 -77842 -176117 -161394 -392257 -545929
14433 -545929 -595912 -555080 -381853 -139892 23027 3234 -182353 -120028 84500 -26674
14423 -26674 -236622 -410816 -474338 -458688 -479298 -376787 -165402 -149398 -246738 -256737 -80880
14412 -80880 106987 79520 -210476 -157135 186687 197326 103245 128695 -151513 -356268 -262545
14401 -262545 -157320 -260769 -226916 -56777 -58276 -182595 -382451 -292739 -192141 -4687
14391 -4687 -28130 -175530 -217051 -88870 -65958 69899 146998 130909 74582 319593 50765
14380 50765 -173652 -219010 -187625 -101602 -7693 166721 268320 240726 234818 -57452 -32608
14369 -32608 140035 -24647 -213092 -287342 -219452 70948 170277 384810 282725 19370
14359A9370K1832j50449J11636j12070q9084j13600l2206O1546K24896P4636J69606
14348A86113J5940k31499m07083j33146L84323L08981K1626r8773M2519r7834
14338h833l562J69572J16800K18052m87639o0706J66424L44465J23712J18771
14328F97056n7802m13660k86806J8494K22521j36077n016j94636O2870J7549J18676
14317D3169P587r9112o3343L569k3436R0287l36154j03738K44311K61834L7338
14306F2312J97940R4343k49833k38136j23263k3717j23836O1030K55282J04916
14296A7038J95078l8174j08288K45181J18290k04653k71652K3713m410j73236
14286b01113o3979K0887J29629K13908J93798j40468j83529j63687L8157J82852
$$ plain form
14359 19370 41202 -109247 2389 -109681 -198765 -312365 -344571 -283025 -58129 16507 186113
14348 186113 202053 -29446 -436529 -569675 -185352 123629 145255 46482 89001 -8833
14338 -8833 -12395 157177 273977 492029 4390 -56316 110108 454573 578285 697056
14328 697056 639254 225594 -61212 -42718 179803 43726 38710 -155926 -93056 -75507 43169
14317 43169 50756 -48356 -111699 -108130 -131566 -41279 -377433 -481171 -236860 24974 62312
14306 62312 260252 354595 104762 -133374 -256637 -280354 -404190 -343160 -87878 17038
14296 17038 212116 173942 65654 310835 429125 224472 -47180 -23467 -27877 -201113
14286 -201113 -265092 -244205 -114576 99332 293130 152662 -30867 -194554 -156397 26455
14276B6455J2943J08343j06483O3369L32300k04537j21275K11100j8948r663r3915
14265A99689J47724R2279j68277l61085j42779r9756K6396J56887j15817P7471
14255a87268J84355K48785J89970K42965r9504k83131j93288l72400l6521J6205
14245b89832J08978J55137J87298j04411j59001K05793J21846o393P5262K2298
14235C16975l49741J0783L34480J70311j82079k33223j3573R5786k62530k08016
14225c20827N8817J59601n8532j36771K14239J65096p9443k06072K63450m3146
14215A6412r5439J0237J2545k52519Q2299M44695J62520l3210l85701j25439J12464
14204e1136J10858j04483j28952M6335K04814r6100J15501p4943k38513K76773
$$ plain form
14276 26455 39398 147741 41258 104627 436927 232390 111115 322215 303267 293604 199689
14265 199689 347413 439692 271415 -89670 -232449 -332205 -305809 -148922 -264739 -187268
14255 -187268 -2913 245872 435842 678807 579303 296172 102884 -269516 -306037 -289832
14245 -289832 -180854 -25717 161581 57170 -101831 103962 225808 219415 294677 316975
14235 316975 -32766 -21983 312497 482808 300729 67506 53933 149719 -112811 -320827
14225 -320827 -262010 -102409 -160941 -297712 -83473 81623 2180 -203892 59558 16412
14215 16412 -79027 -68790 -56245 -308764 -226465 218230 380750 347540 -38161 -163600 -51136
14204 -51136 59722 -44761 -173713 -127378 77436 -18664 96837 21894 -216619 60154
14194F0154J36325J0510k56705k46528j01223N6433J20781J65135K98345P8402
14184C21629j38077n6405q2584M0729J04719K0983r7365k45957Q3758J53041K02712
14173C07183J10377j61336O3630j03149j11039j07252J5346p8206K55886j45411
14163D6029j85948O3514J15168K1728J0716P3855K7298q7699j36736J67680M1710
14152A57315m7355J61788J46288k3185j29276N0648j80506q6969L489P462r3997
14141c4298j10085l38181j28404K21311L25583K09216n6115m67769J48769q1780
14131c11753K05919M22831j41111k02478j31974j42688J71167M74899J6397q1978
14121B79231P0082Q2595r7486j69108l04428o1435K58654N746K1654J93401j4673
$$ plain form
14194 60154 196479 206989 -49716 -296244 -397467 -341034 -220253 -55118 243227 321629
14184 321629 183552 127147 44563 85292 190011 210994 113629 -132328 -48570 104471 307183
14173 307183 417560 256224 319854 216705 105666 -1586 13760 -64446 191440 46029
14163 46029 -139919 -76405 38763 60491 71207 145062 172360 84661 -52075 115605 157315
14152 157315 109960 271748 418036 394851 265575 316223 135717 48748 52237 59699 -34298
14141 -34298 -144383 -482564 -610968 -389657 -64074 145142 89027 -378742 -229973 -311753
14131 -311753 -105834 316997 175886 -26592 -158566 -301254 -130087 344812 361209 279231
14121 279231 349313 431908 334422 165314 -139114 -200549 58105 63851 85505 278906 264233
14110B64233l29806M482o5961m1813K52126Q693k43704j88338Q0652J86583j22719
14099a95572q0436K11201o5839K1034j47976Q9530K44122M48619K16676m19806
14089C21553P018n8197m10202M1219J5839J98184J72864l95602p3482J41464j52287
14078a91629m7724j03262L54314K85950p6130n7144L25362p941m88746l07904
14068c14854N3921K1839K04167K72154k03220j90961l30672j68783L1180K39078
14058c86151J07004M9251j17686K66640J56502J3297K13498N4732J65159K22503
14048G44749l01091l27136k3169j81407K2768M9202O1462J07656j48788l1403
14038b7157k6242J35136O9961q8699m7098J26099L9397o9114j20124m2871O0312
$$ plain form
14110 264233 -65573 -61091 -127052 -168865 83261 91954 -151750 -340088 -259436 -72853 -195572
14099 -195572 -276008 -64807 -130646 -109612 -257588 -168058 76064 524683 741359 321553
14089 321553 328571 270374 -139828 -98609 -82770 115414 288278 -107324 -180806 -39342 -191629
14078 -191629 -239353 -342615 11699 297649 221519 164375 489737 481796 -6950 -314854
14068 -314854 -260933 -239094 -34927 237227 34007 -156954 -487626 -656409 -625229 -386151
14058 -386151 -279147 -229896 -347582 -80942 75560 88857 302355 357087 522246 744749
14048 744749 443658 116522 93353 -88054 -65286 -16084 45378 153034 4246 -27157
14038 -27157 -53399 81737 151698 62999 15901 142000 181397 112283 -7841 -50712 9600
14027I600q652J07916k41561P6336J46655J71176J74584l27434o5374J33908r4002
14016H3152m8846K04811p3132k13250j25096l942K55008O067k16871j23860J79821
14005g6138J32384k26196l46728J69689K34054K28760j92060j43130m3889K28144
13995c5110l7924k25086J59719J34343L464M2261r6778N523R4787J58868P8781
13984B82848M4937j36285N8142q308o012k25367p2685j31250j25976K56127P1264
13973G435k28633J18845J40389j09665j49924j10028J35593K58792r0164k3393
13963e0753p6840p4923J97852K46380J17755m5755k54572K5747J032j25702R3912
13952E4133K530P4019m6883P4209j51299L4689O8415j5474j55085j46851P0834
$$ plain form
14027 9600 948 108864 -132697 -56361 90294 261470 436054 108620 43246 177154 83152
14016 83152 34306 239117 165985 -47265 -172361 -176303 78705 84772 -132099 -255959 -76138
14005 -76138 56246 -169950 -516678 -346989 -112935 115825 -76235 -219365 -263254 -35110
13995 -35110 -73034 -298120 -138401 -4058 -594 41667 -55111 -49588 45199 204067 282848
13984 282848 327785 191500 249642 241334 235322 9955 -62730 -193980 -319956 -63829 7435
13973 7435 -221198 -102353 38036 -71629 -221553 -331581 -195988 62804 -27360 -50753
13963 -50753 -127593 -202516 -4664 241716 359471 313716 59144 84891 85923 -39779 54133
13952 54133 56663 130682 83799 158008 6709 41398 109813 94339 -60746 -207597 -136763
13941a36763J93718J0896k60778j14396p9592j24870J4458N4760K2884J74961
13931b44722K275P3015J52693l40955P562L31833L02616n0066j8308p9901M0284
13920A76326j98008k52346O9718r7535j0464J23170r9159k28252N4596M6529R2658
13909c22767J14226J11327J30348J3337O8651l3012J04131k49700J83738P2999
13899A93278l49358j26209J98159M43045J01640l22528q7831J92281k5302J86232
13889D03407k44767j55764K5935K7672J81920K25717J35871k4942k18061p4178
13879B82810K19955k1295k80698j39141J31056k40632k40233L8906L5355O2418
13869a51499j77720m5052q6995K42082M782N7495k4692P2473O5029J55368R0338
$$ plain form
13941 -136763 56955 67851 -192927 -307323 -386915 -511785 -497327 -442567 -419683 -244722
13931 -244722 -242447 -169432 -16739 -357694 -350132 -18299 284317 234251 215943 136042 176326
13920 176326 -21682 -274028 -204310 -301845 -312309 -189139 -288298 -516550 -461954 -415425 -322767
13909 -322767 -208541 -97214 33134 46471 115122 82110 186241 -63459 120279 193278
13899 193278 -156080 -282289 -84130 358915 460555 138027 50196 242477 217175 403407
13889 403407 158640 2876 28811 56483 238403 464120 599991 575049 356988 282810
13879 282810 502765 481470 200772 61631 192687 -47945 -288178 -249272 -213917 -151499
13869 -151499 -329219 -374271 -461266 -219184 -214402 -156907 -181599 -109126 -44097 111271 201609
13858B01609k9209j83157j1468M62683j45282j49733N0801r6504J04604K34614
13848D38958J91192j97804k14794k43240K25783K24071N9771q9720k50164j26943
13838A7110J38587K66491k2920Q2629k16881m9686N3551j1170l0498m682K5179
13827B47710q0472l94779J14941L65451J87506j24550n18116N1712j0458J94517
13817C3462L28831J9543j67967K23372k40658k00344L0626K07651J09728r7906
13807B46338p3286k61262j8012K94728J43331n3196J62790n6030J31083j57547
13797C58937j44366j3481j49340o0000J39646j7832j93825p1963k3571J18292
13787e7503K7352J16866k0574j23644O5355K46798K84954L04018k69291k68585
$$ plain form
13858 201609 172400 -10757 -22225 440458 295176 145443 196244 99740 204344 438958
13848 438958 630150 432346 217552 -25688 200095 424166 483937 394217 144053 17110
13838 17110 155697 422188 399268 481897 265016 215330 268881 257711 227213 222531 247710
13827 247710 167238 -227541 -112600 252851 440357 315807 -202309 -150597 -161055 33462
13817 33462 362293 381836 213869 437241 196583 -3761 26865 234516 344244 246338
13807 246338 173052 -88210 -106222 188506 331837 278641 441431 385401 516484 358937
13797 358937 214571 201090 51750 -8250 131396 113564 -80261 -152224 -175795 -57503
13787 -57503 -30151 86715 66141 -57503 7852 254650 539604 843622 574331 305746
13777C05746j41247j7283Q1779R2754m9661R255j85192P1571J8170p3201K9165
13766A41856l0937j60171k8405J23373j78839k84740p2883L45691K69606j86514
13756f1963o4731J25448P0092J11807j16287N9957k5302j01316j53614J62391
13746F482K40607K40060K08656j17156P9271r6270l61555L3610k4165j22602J5336
13735A02274R4461n0771o5145q5675J71934N8037k61173j25669J18537l7706l0229
13724a11125O6963P3629P860p4538k130K61938J56443Q6193j58835m87586p2675
13713b53863J5635K6063P0847J78347J93736j29502j71147j33909K24102L20418
13703C40727q3562j47944K74605K82181k63772m07308j56544L02298L13216J2288
$$ plain form
13777 305746 164499 147216 228995 321749 272088 281343 96151 167722 185892 112691 141856
13766 141856 110919 -49252 -77657 45716 -133123 -417863 -490746 -145055 124551 -61963
13756 -61963 -126694 -1246 68846 180653 64366 124323 99021 -2295 -155909 6482
13746 6482 247089 487149 695805 578649 657920 561650 200095 233705 209540 86938 102274
13735 102274 196735 145964 80819 -4856 167078 225115 -36058 -161727 -43190 -80896 -111125
13724 -111125 -44162 29467 37327 -37211 -39341 222597 379040 465233 306398 -181188 -253863
13713 -253863 -238228 -212165 -141318 37029 230765 101263 -69884 -203793 20309 340727
13703 340727 257165 109221 383826 666007 402235 -5073 -161617 140681 453897 466185
13693D66185m3306l44088l02079J74901K88230j42980j04181Q5536J8247K3999
13683A20464k98702m614J14379m3784J94384r8542K6207j9255l1422o5243J49060
13672D2932J50663K26615K02918j63147p1982l20039j24585k06578j65145K0810
13662d07538J59065K30836K04377r7498j40704J89308J34361J27018K651k09993
13652A91883J2329J51172P2675k54304j23407R4508L0092L38825L5348k24048
13642C25073j23487n1976l9869J35706O1970L1791j42797j10976q5383k06398
13632b06346p2019R3761K22553j73081n7021K16173K55806J90964J70017N9429
13622G00236N4270q1673p9330m312n4484k36491r2774M2916l43131k83987Q1040
$$ plain form
13693 466185 422879 78791 -223288 -48387 239843 96863 -7318 78218 96465 120464
13683 120464 -178238 -182852 -68473 -112257 82127 -16415 9792 -9463 -40885 -106128 42932
13672 42932 193595 420210 623128 459981 387999 67960 -56625 -263203 -428348 -407538
13662 -407538 -248473 -17637 186740 89242 -51462 137846 272207 399225 401876 191883
13652 191883 204212 355384 428059 173755 50348 144856 174948 513773 549121 325073
13642 325073 201586 149610 109741 245447 307417 339208 196411 85435 52 -206346
13632 -206346 -278365 -184604 37949 -135132 -192153 24020 279826 470790 640807 700236
13622 700236 754506 672833 593503 589191 534707 298216 205442 248358 -94773 -378760 -297720
13611b97720L88135N39812j82601k01090K01501n2352j52614M2162k3808k63244
13601a819j11782J12436L9883m7891J2289J67448O7943j32683q9488R1019R1882
13590A99237Q3981P6885o4739r8335J89967J42890L7856N8867k45816k08391l1978
13579A40424K10671J65629J3581q6206n11016j97852j74792M991L85212p3988
13569a23346R4078q971j91389K9309L1332k5693P5289O3152J54947J09851P7574
13558B86133J10011j27811j66782k28103j23850m7666Q2458J52787K75190Q4060
13548B96427J94672L9175k89982m35113p726K09725J27181O44r8224J51896m3331
13537A45344j0090K38903J89776k59738l56295N4002m9911j38562k47695l0502
$$ plain form
13611 -297720 90415 630227 447626 246536 448037 395685 243071 285233 261425 -1819
13601 -1819 -113601 -1165 38718 -9173 3116 170564 238507 105824 16336 107355 199237
13590 199237 283218 360103 295364 197029 386996 529886 567742 626609 380793 172402 140424
13579 140424 351095 516724 530305 444099 -66917 -264769 -439561 -434570 -49358 -123346
13569 -123346 -29268 -38239 -229628 -200319 -168987 -194680 -119391 -56239 98708 208559 286133
13558 286133 396144 268333 101551 -126552 -250402 -298068 -215610 -62823 212367 296427
13548 296427 491099 530274 240292 -194821 -202547 7178 134359 135003 36779 188675 145344
13537 145344 135254 374157 563933 304195 -52100 1902 -48009 -186571 -434266 -464768
13527d64768J00600K97492K14857j6763l5440j84543K58879Q3592j53342j10055
13517i491p113J64391J31015k20023K573K02959J983j97334J64158n0185j00083
13506H2850j80621L3410P8138K74534Q152k07663K87116q3677n3347j8257j22446
13495I8189j31860O3732J71623R6969m6046n5509j4924K00878K02097N6672q086
13484F33735p4962q4948m8968l02591o2965L13129N4441p605r524o866l251Q4283
13472D83908k0088j77923J80635O8273k09510J0588P0760j05154k553j77155K6681
13461A48462J63367K29846k22084R6289J67412j50659j01858p3587J68353K77576
13451G03117J50389j81101j53322j41289j23068L90812j01601k83888J215K04225
$$ plain form
13527 -464768 -364168 -66676 148181 131418 95978 -88565 170314 253906 100564 -9491
13517 -9491 -16604 147787 278802 58779 61352 264311 266294 68960 233118 182933 82850
13506 82850 -97771 -64361 13777 288311 296463 88800 375916 292239 238892 220635 98189
13495 98189 -33671 30061 201684 298653 252607 197098 182174 383052 585149 641821 633735
13484 633735 558773 473825 424857 122266 59301 372430 426871 419266 409742 402876 399625 483908
13472 483908 463820 285897 466532 534805 325295 335883 406643 301489 298936 121781 148462
13461 148462 311829 541675 319591 415880 583292 432633 330775 257188 425541 703117
13451 703117 853506 672405 519083 377794 254726 645538 543937 260049 261264 465489
13441D65489p9449R4618K70591N293n20851k72527p025P8887P1441J92123J39523
13430D38113J69327r2051k05571m29933j1453K83222J20046J6621k03233j89244
13420a04156J63449M08875R0251J61481k1740p5669l23080m3685R3313J21103
13410D70142J9132j19892K21323r3780k86501k66184K5873J09370J39044k28368
13400i841o8353j97635k65989L1388K20893Q1928M7907K10985R6403j47704j64297
13389a64315p2979K22407n7939j23572j4994J97310K10027M0434P8782J00228
13379D15389j73668j39768J63145M8724j11890l1478j36779k53315L06467L51617
13369D38444j6285j15025k66753k12200M8636K98123K42167J48529k13278r6025
$$ plain form
13441 465489 386040 480658 751249 756542 235691 -36836 -43861 35026 106467 298590 438113
13430 438113 607440 515389 309818 -120115 -131568 151654 271700 288321 85088 -104156
13420 -104156 59293 468168 558419 719900 698160 622491 299411 255726 349039 470142
13410 470142 489274 369382 590705 496925 210424 -55760 -29887 79483 218527 -9841
13400 -9841 -78194 -275829 -541818 -510430 -289537 -207609 -159702 51283 147686 -18 -164315
13389 -164315 -237294 -14887 -72826 -196398 -211392 -14082 195945 236379 315161 415389
13379 415389 241721 101953 265098 313822 201932 170454 33675 -219640 86827 438444
13369 438444 422159 307134 40381 -171819 -123183 174940 417107 565636 352358 256333
13359B56333J4179J06272L2682J80510n1854j40828L5632j13388m178J72317o0144
13348D27533j28429j42108k5334K61107J92669q2751j61142l5542K0120j53884
13338A72239J98699K633l6226k38712j28126n4426J50920J30534R5802K01176
13328D94513P2554j70439O0203j37265l1015K589o1435j34317n8683M9765J11425
13317A97895K770J29264j12910k8594K15660J16504k8720j76316j74956K80882
13307D21479L01531j91820k08078P9015j3922k83588j79854j4408j94343k856
13297b86844K7394J21341J25257j59110K16127L85034P3896m1249k31360K27281
13287D57767j77810p4680J32916J58590K2173J16931j09735j50172j97252q641
$$ plain form
13359 256333 270512 376784 409466 589976 538122 397294 432926 319538 315360 487677 427533
13348 427533 299104 156996 131662 392769 585438 502687 341545 306003 326123 172239
13338 172239 370938 373571 337345 98633 -29493 -83919 67001 197535 293337 494513
13328 494513 567067 396628 456831 319566 288551 291140 229705 95388 36705 86470 197895
13317 197895 200665 329929 217019 188425 404085 520589 491869 315553 140597 421479
13307 421479 723010 531190 323112 402127 388205 104617 -75237 -89645 -283988 -286844
13297 -286844 -259450 -138109 -12852 -171962 44165 429199 503095 461846 230486 457767
13287 457767 279957 205277 338193 496783 518956 635887 526152 375980 178728 170087
13277A70087J57972N0959N2643J26639j35949j42514K81169L8128j95232j78046
13267B25856K16716k29561m46224J05448L31550K39983K92410L21771q6549k26265
13257G45135j59645j85408k86436M6064K62908l01396j1440J54390K63354J03572
13247F31098k79402J87830J19986N9015j16961j04272k36212k75611l38880j62481
13237e15890L74332M04393o6900J1041J52281P4598j26701l70803L626K6771K2766
13226a0486J01263O5311l5609K67295j41464N7096N8810K30599J54064L1478m4031
13215G34326J39207j71818o9888m5110j43898n8621O5440j12806J1405k1214N0449
13204C77472j24302k50681R4985n1340Q9477k59266K40724J63341K84191K31771
$$ plain form
13277 170087 328059 379018 431661 558300 422351 279837 561006 599134 403902 225856
13267 225856 442572 213011 -233213 -127765 203785 443768 736178 1057949 971400 745135
13257 745135 585490 400082 113646 159710 422618 121222 109782 264172 527526 631098
13247 631098 351696 539526 659512 718527 601566 497294 261082 -14529 -353409 -515890
13237 -515890 -141558 262835 195935 206976 359257 433855 307154 -63649 -60023 -33252 -10486
13226 -10486 90777 156088 120479 387774 246310 303406 362216 592815 746879 778357 734326
13215 734326 873533 701715 631827 586717 442819 384198 449638 336832 348237 327023 377472
13204 377472 253170 2489 97474 46134 135611 -123655 117069 280410 564601 796372
13194G96372j17808j9850k12438m4828K0368j65192r0068N6122J51806K21593
13184E96077P6864n5505l6865l2555j4753J43352j87322P0057K35719K32647j00053
13173I27663r9487q2578k4420n7625m7809j75424j96408p9167M06102K05071k53059
13162E22859K45J85368k3309p089K27365L9849R3494J11383k04365l35743m89514
13151A20543n0880J89388K08390N7311P8669j78148j45249j84688K52928J67441
13141E15705p5389k24088n4038J64444N6300J34322K34781K37189p5694j09396
13131H04136k29581j62420q4796R9157k4269j85478J20186J68659q4028R1790
13121E13356k10640K5623K33402J14234m5725J50615M1361q6583J89546J65690
$$ plain form
13194 796372 678564 658714 446276 401448 421816 256624 166556 222678 374484 596077
13184 596077 672941 617436 580571 548016 533263 676615 489293 559350 795069 1027716 927663
13173 927663 828176 745598 721178 663553 615744 440320 243912 164745 570847 775918 522859
13162 522859 523104 708472 685163 678074 905439 945288 1038782 1150165 945800 610057 120543
13151 120543 69663 259051 467441 524752 603421 425273 280024 95336 348264 515705
13141 515705 440316 216228 162190 326634 382934 517256 752037 989226 913532 804136
13131 804136 574555 412135 327339 426496 402227 216749 336935 505594 421566 513356
13121 513356 302716 328339 561741 675975 630250 780865 822226 735643 925189 1090879
13111A090879k00794j13778m2984j941J41265k65112k11751k05947q9418J54130
13101B54549J99585K07656M24040J22574k08457j62030j01047l14382k7901Q1649
13091D76236R7883l2674k54741O5641M00796j52012J16954J97982J47213j66684
13081H96594L5915J5458p4362m2921j78613m23086j19625R9800L375n1940L72650
13070E33245r9848n7154l5819k03615N7683K40434o6997L3598J46195p4058P8084
13059E51748N22229l8834l25860m2635k5569k86204q9389J24832K70504J64337
13049H25159o8890k13276l2444J61426o6584j80143p5421P2387J45177K45563
13039H12954L6782k13853p7831j9083J10850J5360J48806J36637o9146m18413
$$ plain form
13111 1090879 890085 776307 733323 731382 872647 607535 395784 189837 100419 254549
13101 254549 454134 661790 1085830 1208404 999947 837917 736870 422488 394587 476236
13091 476236 574119 541445 286704 352345 753141 601129 718083 916065 1063278 896594
13081 896594 932509 947967 873605 830684 652071 228985 109360 209160 212535 160595 533245
13070 533245 433397 376243 340424 136809 194492 434926 367929 401527 547722 473664 551748
13059 551748 1073977 1035143 709283 666648 641079 354875 265486 390318 660822 825159
13049 825159 756269 542993 510549 671975 605391 425248 349827 422214 567391 812954
13039 812954 849736 635883 558052 538969 649819 665179 813985 950622 881476 463063
13029D63063K8863j25566p600j53431j0976K37526K66872P4213j64182q1760J5875
13018E42897K21672K2267k6707K8149K69823J60343o8188j03407j06963J1644
13008I51530j32056j18953j26861o6688j54864J64093J69955m8885q6336K01266
12998G52201N8860o1871m5790k02914M1288l1847O3190J61946K50718J32652j75366
12987I43067p820Q864O8328J64314m0299j60401k18192n4150J2052r9288o4413
12976E52062J93773L62755L8240k69762J49491J40910l47619k69106L83360J77720
12966A111824m66665j14307R0667K5601n4358L8615J15721J87319J29441J76909
12956A240767m9783k54812N5241K6456M7826K64351J94268L3225k52836J42944
$$ plain form
13029 463063 491926 366360 358760 205329 194353 431879 698751 772964 608782 527022 542897
13018 542897 764569 786836 760129 788278 1058101 1218444 1150256 1046849 939886 951530
13008 951530 819474 700521 573660 506972 352108 516201 686156 637271 550935 752201
12998 752201 811061 749190 703400 500486 541774 509927 573117 735063 985781 1118433 943067
12987 943067 935247 944111 1012439 1176753 1136454 976053 757861 703711 715763 616475 552062
12976 552062 745835 1108590 1146830 877068 1026559 1167469 819850 550744 934104 1111824
12966 1111824 645159 530852 621519 647120 592762 631377 747098 934417 1063858 1240767
12956 1240767 1190984 936172 991413 1017869 1065695 1330046 1524314 1557539 1304703 1447647
12946A447647k88214l50200N1258K1055J89943m2758m55515j76734J51054o2287
12936D85249M2542Q6720n246J43139j05468J48720K02673o1435j45421l0128j49814
12925F11531l0424M03553J59543L3689J32470p2808m9883R7216j86425r9992l2749
12914I65721K801N6492N5500p6008k4257l9336j64182o7128N3349J56510J49748
12903A069210l6525o8584L0558K22894p8634l1632J00403j18621l63981k51594
12893D73494j49040K87138N7067O5161L04419N2460J34008m9811j57803J20173
12883A137266R1714k27614J22695Q7608J54136r0338k54587n3101J22733J1331
12873A101843L06545j25621j19530j33726M3742J50670j09311K23782K16040K4632
$$ plain form
12946 1447647 1159433 809233 860491 881546 1071489 1028731 573216 396482 547536 485249
12936 485249 527791 614511 609265 752404 646936 795656 998329 936894 791473 761345 611531
12925 611531 581107 984660 1144203 1177892 1310362 1237554 1187671 1284887 1098462 998470 965721
12914 965721 968522 1025014 1080514 1004506 980249 940913 776731 709603 762952 919462 1069210
12903 1069210 1032685 964101 994659 1217553 1138919 1107287 1207690 1089069 725088 473494
12893 473494 324454 611592 668659 733820 1038239 1090699 1224707 1174896 1017093 1137266
12883 1137266 1228980 1001366 1124061 1211669 1365805 1275467 1020880 967779 1090512 1101843
12873 1101843 1408388 1282767 1163237 1029511 1073253 1223923 1114612 1338394 1554434 1579066
12863A579066l5878j56121k32430j71609J38315P0116j27830n0017j40353L34678
12853A207937L36909j81593l19197O6984k21422j02410L27501O3393K5379K24386
12843A427867o7716k41250L3217j8039q7787j21108J0620n6522r2728o5303M5297
12832G66548Q9879J23932M55451m6126m28524M2748l2702k7808K21883J02043
12822A267324j13534m3842J76094O1815j0463j73215K27926K7230n1453Q9416
12812A457298m7265L6353q8310J7823p3267l7903j4972m8411M9729m9160j32417
12801A069498q0450o7510J2223J23659Q1220J85560j05981j48641K98029K03533
12791A571140j07055k26851m00974J05007J29406O9935J79148k9826k8630O5215
$$ plain form
12863 1579066 1543188 1387067 1154637 983028 1121343 1191459 1063629 1013612 873259 1207937
12853 1207937 1544846 1363253 1044056 1111040 889618 787208 1114709 1178102 1203481 1427867
12843 1427867 1360151 1118901 1152118 1134079 1046292 925184 935804 879282 786554 721251 766548
12832 766548 856427 980359 1435810 1389684 961160 1003908 971206 943398 1165281 1267324
12822 1267324 1153790 1109948 1286042 1347857 1337394 1164179 1392105 1419335 1367882 1457298
12812 1457298 1410033 1446386 1358076 1375899 1302632 1264729 1249757 1201346 1251075 1201915 1069498
12801 1069498 989048 921538 933761 1057420 1138640 1324200 1218219 1069578 1367607 1571140
12791 1571140 1464085 1237234 836260 941267 1070673 1140608 1319756 1289930 1261300 1326515
12781A326515N4627l8432J20512K82313j47208j22529J84574j09211l57490Q212
12771A201883j12918N1039J79055l0662R8273Q4999J5164j25379k9150K03029
12761A535333j10370j52313K65615K8024l71325J06683q2100J40479J96186K05685
12751A761897j0204j63367J34420k5580l2859n0j81248O8009J52212k3547k95343
12740A384340k60394K44750J64078k42155k92676J18277L61700K76170O3698L7120
12730A854908k92649l29054O1067K5370K27584m8031N5711L38700L59647o6995
12720B186258j05699j72588K8565O882j4861m5182j31670j04141N015o7175O0687
12709A646091Q4760N5878J46006J56957P1339j03912J73385o4154j69229N752
$$ plain form
12781 1326515 1381142 1342710 1463222 1745535 1598327 1475798 1660372 1551161 1193671 1201883
12771 1201883 1088965 1140004 1319059 1288397 1386670 1471669 1486833 1361454 1332304 1535333
12761 1535333 1424963 1272650 1538265 1566289 1194964 1301647 1219547 1360026 1556212 1761897
12751 1761897 1751693 1588326 1722746 1697166 1664307 1664257 1483009 1551018 1703230 1679683 1384340
12740 1384340 1123946 1368696 1532774 1290619 997943 1116220 1477920 1754090 1817788 1854908
12730 1854908 1562259 1233205 1294272 1319642 1547226 1499195 1554906 1893606 2253253 2186258
12720 2186258 2080559 1907971 1936536 1943418 1928557 1883375 1751705 1647564 1652579 1585404 1646091
12709 1646091 1730851 1786729 1932735 2089692 2161031 2057119 2230504 2166350 1997121 2002873
12699B002873K253j84520k1801K90092j89555k23877j24982j73504J62286K26584
12689A765849Q2599n1761r8122R286k1486p2437J8909K16157R2772L2087m00447
12678A573406j15811J06970o8985q9125J50385J89781Q9412j25928k48946r6797
12668A364362J95586L38811P2206J97780k3342k56494m8245q9168M1269k4166
12658A768599R5778m6722K7354J53467P6449P9108J78654j57709o34068n7421
12648A483489J59773m7210K27762l7601m2146j95966j10791O3796L40281m86j18391
12637A722510k32346J985K28160L37663J26203K70639M4131j79200O4575k23089
12627B161231l08658J51930J28286J1689k9211J0322j1234j37560j34653j8243
$$ plain form
12699 2002873 2005126 1820606 1798805 2088897 1899342 1675465 1550483 1376979 1539265 1765849
12689 1765849 1848448 1796687 1698565 1707851 1686365 1613928 1632837 1848994 1941766 1973853 1573406
12678 1573406 1457595 1564565 1495580 1406455 1556840 1746621 1836033 1710105 1461159 1364362
12668 1364362 1559948 1898759 1970965 2168745 2145403 1888909 1840664 1751496 1792765 1768599
12658 1768599 1864377 1817655 1845009 1998476 2074925 2154033 2332687 2174978 1540910 1483489
12648 1483489 1643262 1596052 1823814 1786213 1744067 1548101 1437310 1501106 1841387 1840901 1722510
12637 1722510 1490164 1492149 1720309 2057972 2184175 2454814 2498945 2319745 2384320 2161231
12627 2161231 1852573 2004503 2132789 2144478 2115267 2125589 2114355 1976795 1842142 1823899
12617A823899J42962J85509O674l2563P013J48071R7199J90719j51498k4099J39250
12606B533136k25612m06286J07351k9724P7084N19544j25669k45939K7649J03342
12596B334876o2171J31678r9946N3202J80374J9569k08227k23816N0811M9755
12586B226105n5571L43217p3832l20031j22487Q0318J28325j41152j7068L85935
12576B433759J77795j35456r8596J63p4399q7074J28233L13295K16639j96162
12566B678197m57649j02765k0109q4732J47092J43662J95376O0786q4204J17951
12556B593605K84627l0925k07786j20457k8595K84456o3977k6709J0569n83k67057
12545B427168l6065J31742K16904Q9685j03698j01198k1933L7507K561K05616
$$ plain form
12617 1823899 1966861 2152370 2159044 2126481 2133494 2281565 2378764 2569483 2417985 2393886 2533136
12606 2533136 2307524 1901238 2008589 1978865 2055949 2575493 2449824 2203885 2231534 2334876
12596 2334876 2272705 2404383 2304437 2357639 2538013 2557582 2349355 2125539 2176350 2226105
12586 2226105 2170534 2513751 2439919 2119888 1997401 2077719 2206044 2064892 2047824 2433759
12576 2433759 2611554 2476098 2377502 2377665 2303266 2216192 2344425 2657720 2874359 2678197
12566 2678197 2220548 2117783 2097674 2012942 2160034 2303696 2499072 2559858 2475654 2593605
12556 2593605 2878232 2847307 2639521 2519064 2490469 2774925 2710948 2684239 2694808 2694225 2427168
12545 2427168 2391103 2522845 2739749 2829434 2725736 2624538 2602605 2640112 2642673 2848289
12535B848289J31466k49039q6012J70467j25642r3041P6362J16142K63397J13495
12525C165884r725k01399p0684j21571K37281K24225M1030K19424j43578l64740
12515B976147j36042J83337J61797O4341J08739j8152k4734j65628n6614N378
12505C098569l5017k47639J35261J84239J23103L156O0451K64521n2053k06963
12495C327628J07232K79787K01699k04088m6663K63331J70318j99487k56348j30975
12485C512434M9782n867M4264K23552J14018j04630j98804J81319p9390n0104
12475C686574R1483o4039j80694l02844Q6010K24900p707k07098k18151k7384
12465C081050K24397P4478K10346N7540o7926J74153J81662K54096J1015j53456
$$ plain form
12535 2848289 2979755 2730716 2644704 2815171 2689529 2596488 2672850 2788992 3052389 3165884
12525 3165884 3156159 2954760 2884076 2762505 2999786 3224011 3265041 3484465 3340887 2976147
12515 2976147 2840105 3023442 3185239 3249580 3358319 3340167 3315433 3149805 3093191 3098569
12505 3098569 3063552 2815913 2951174 3135413 3258516 3261672 3322123 3586644 3534591 3327628
12495 3327628 3434860 3714647 3916346 3712258 3665595 3928926 4099244 3899757 3643409 3512434
12485 3512434 3562216 3556349 3600613 3824165 3938183 3833553 3634749 3816068 3736678 3686574
12475 3686574 3778057 3714018 3533324 3230480 3316490 3541390 3533683 3326585 3108434 3081050
12465 3081050 3305447 3379925 3590271 3647811 3579885 3754038 3935700 4189796 4200811 4047355
12455D047355J12174n124O572l5824n21875r8761K42413J26633L3196J21594k39938
12444C788415l3536J05085j05898J55929O178K25125o6705q1378K393j5509k18261
12433C761838K07585J62776q4894M6366N0797K51971r2103j93486j18207j56104
12423C836539J75522J60839k2430k5884N020J2313P3938L61166J00236j45024
12413D532235J41971p1453J74558L4050o2579j48297J28614J49899P6421K21937
12403E177356Q293j14277m4193O6899j53614j58187k39092j98221O4567J42056
12393D551587K74406K07241j6075J83512O3295j80029k20103L09406K93381J63249
12383E629870j99522l07980k90881j06556N7461k32092M90K35995M58185j2293
$$ plain form
12455 4047355 4159529 4154405 4160977 4125153 3603278 3504517 3746930 3873563 3906759 4028353 3788415
12444 3788415 3754879 3859964 3754066 3909995 3916173 4141298 4074593 3993215 3995608 3980099 3761838
12433 3761838 3969423 4132199 4047305 4093671 4144468 4396439 4304336 4110850 3992643 3836539
12423 3836539 4012061 4172900 4150470 4124586 4129606 4141919 4215857 4577023 4677259 4532235
12413 4532235 4674206 4602753 4777311 4811361 4748782 4600485 4729099 4878998 4955419 5177356
12403 5177356 5185649 5071372 5027179 5094078 4940464 4782277 4543185 4344964 4409531 4551587
12393 4551587 4825993 5033234 5017159 5200671 5263966 5083937 4863834 5173240 5466621 5629870
12383 5629870 5430348 5122368 4831487 4724931 4782392 4550300 4550790 4786785 5244970 5232677
12373E232677j62761j91535J50672K43078n9451R6246J20054K54487L44148k05770
12363E821845j04701J7745J2205j50742j06795j33433J18863p9465p5249L1037
12353E351310j07239K9214R2421K95926J74857J97229J52909r7393k70611q5973
12343E732650J41429K25921J93135J26950p1346M2213K79623l25629l99518l8824
12333E906604K22909j10902m00617k77474J70672L67115K10667k62252j3756N92394
12323F405360L41650j15477j67283R1373K49725k15759l73842k5058L25838L05534
12313F822061q7083k28212L5293j0463K80982k87121o6238K01764L72118J6617
12303G049718Q1534L38690j41831k80972r0312j22629J07859K3308J97540J07835
$$ plain form
12373 5232677 5069916 4878381 5029053 5272131 5212680 5308926 5428980 5683467 6027615 5821845
12363 5821845 5717144 5734889 5747094 5596352 5489557 5356124 5474987 5395522 5320273 5351310
12353 5351310 5244071 5273285 5365706 5661632 5836489 6033718 6186627 6089234 5818623 5732650
12343 5732650 5874079 6100000 6293135 6420085 6348739 6390952 6670575 6344946 5945428 5906604
12333 5906604 6129513 6018611 5617994 5340520 5511192 5878307 6088974 5826722 5812966 6405360
12323 6405360 6747010 6631533 6464250 6555623 6805348 6589589 6215747 6190689 6516527 6822061
12313 6822061 6734978 6506766 6542059 6531596 6812578 6525457 6459219 6660983 7033101 7049718
12303 7049718 7131252 7469942 7328111 7047139 6956827 6834198 6942057 6965365 7162905 7270740
12293G270740K47419J13149J90773J52334m9703Q7016j43133J38781o6305j49262
12283G791809l1250R0684R3303k15222J6306L07249K5948j14214n9910l0565R5676
12272G969814q4421r9298L6424j40422q3513K54873K51751R4451o2011j99320
12262G938328J00112L01478K04028J12544P1593l6792k93824m6911r6591J52819
12252H406784l6763J07816J79176J30224p7790p8114j2830J65437M7261n8294
12242H772907J25913K03128Q5679k9782J82804k5432q6261K3233J68470l05543
12232I115116J03480J10665J25611K8835J57130k49013j2983R5063J61956q902
12222I626958k12007O3107J03709J65204O0746J45492K40390j1592r9540j67396
$$ plain form
12293 7270740 7518159 7631308 7822081 7974415 7924712 8011728 7868595 8007376 7941071 7791809
12283 7791809 7760559 7851243 7944546 7729324 7745630 8052879 8078827 7964613 7904703 7874138 7969814
12272 7969814 7885393 7786095 7822519 7682097 7598584 7853457 8105208 8199659 8137648 7938328
12262 7938328 8038440 8339918 8543946 8656490 8728083 8691291 8397467 8350556 8253965 8406784
12252 8406784 8370021 8477837 8657013 8787237 8709447 8631333 8618503 8783940 8831201 8772907
12242 8772907 8898820 9101948 9187627 9157845 9340649 9315217 9228956 9252189 9420659 9115116
12232 9115116 9218596 9329261 9454872 9483707 9640837 9391824 9378841 9473904 9635860 9626958
12222 9626958 9414951 9478058 9581767 9746971 9807717 9953209 10193599 10182007 10082467 9915071
12212I915071k08916K97686J36716J70870J24091N4287N3459J4325L3530J8669
12202A0609788lM20379J72208k56623J0712R7081l4205J02100K42497J99745j22070
12191A1441609r5191m641K17864K22664Q2270N0765j53850L5738j51126R2320
12181A1738422N5421J42248o7302o9981J83133J69763j19584J14944J55900O489
12171A2309453P2772J06202k0942J30799J74197Q7844j76071k90757k7168J33422
12161A2499751K22654J76173P6657j74369j61327J29972K57355r7004k30219L85375
12151A3085018L45644O3529l2226m4030M0588j12958q2574K69568K76949J35733
12141A3945241j08188l7358j94652K5046J14686K03851K35554J23849k46633K04783
$$ plain form
12212 9915071 9706155 10003841 10140557 10311427 10435518 10489805 10543264 10557589 10591119 10609788
12202 10609788 10609785 11030164 11202372 10945749 10956461 11053542 11019337 11121437 11363934 11563679 11441609
12191 11441609 11346418 11341777 11559641 11782305 11864575 11915340 11761490 11797228 11646102 11738422
12181 11738422 11793843 11936091 11868789 11798808 11981941 12151704 12032120 12147064 12302964 12309453
12171 12309453 12382225 12488427 12467485 12598284 12772481 12860325 12684254 12393497 12366329 12499751
12161 12499751 12722405 12898578 12975235 12800866 12639539 12769511 13026866 12929862 12699643 13085018
12151 13085018 13430662 13494191 13461965 13417935 13458523 13345565 13262991 13532559 13809508 13945241
12141 13945241 13837053 13799695 13605043 13630089 13744775 13948626 14184180 14308029 14061396 14266179
12131A4266179K19584n873P1646J96888Q1365M690n4274J7634n9011Q3801O3240
12120A4885869O9568M439K4808j12097J07310L54165P4053j75927K5212q6596
12110A5170804O4578J33400K87476r5968J54755K19303j27997q1783Q2396M04505
12100A6211469J82792o1419j06267j61261j59975J63726O1074N6736J35895l06279
12090A6016491J43633K27079k9499n0006O6018K42137N8804Q0901O7785j5238
12080A6808105j61411R8552R7993n2036k45420J13218J09070m1320n9293R428
12070A6676886Q1099Q2264K41710L943k1462N0501L32769R8480Q1619M6308m21668
12059A7252449m04619j1435o7604K05921J79481j7413o916J10054K19344p6176
$$ plain form
12131 14266179 14485763 14479890 14551536 14748424 14829789 14834479 14780205 14797839 14738828 14822629 14885869
12120 14885869 14955437 14959876 14984684 14872587 14979897 15334062 15408115 15232188 15257400 15170804
12110 15170804 15235382 15368782 15656258 15560290 15715045 15934348 15806351 15724568 15806964 16211469
12100 16211469 16394261 16332842 16226575 16065314 15905339 16069065 16130139 16186875 16322770 16016491
12090 16016491 16160124 16387203 16357704 16307698 16373716 16615853 16674657 16755558 16823343 16808105
12080 16808105 16646694 16745246 16843239 16791203 16545783 16659001 16768071 16726751 16667458 16676886
12070 16676886 16757985 16840249 17081959 17085902 17064440 17114941 17447710 17546190 17627809 17674117 17252449
12059 17252449 16847830 16836395 16768791 16974712 17154193 17136780 17129864 17239918 17459262 17383086
12049A7383086L0855Q8735O8211K03360K58247Q6756J17370J51312j11832j22035
12039A8154065j46706l7412L43354m7641j2113j75383J79928k697k59051J57844
12029A8154188J35636p0872M9948K07181k1590P5425k08438j70382q0042K45778
12019A8316832r7643r7741j02919M3304J56695J8461N7206R7622O735K91151j33986
12008A8555717j97205r0332q4008j87531J28886J56005l4931L54004j71418k58899
11998A8170288Q4631K67181J78575k24559o6275j26263j15349m9150K30097j25516
11988A8223660J34431R2234P3692J3651k4812l0400M465j38968j53380j07331
11978A8087242k15532k02487q8551L2471J70451K4635M0428k1688l77449j83742
$$ plain form
12049 17383086 17413941 17502676 17570887 17774247 18032494 18119250 18236620 18387932 18276100 18154065
12039 18154065 18007359 17969947 18313301 18265660 18253547 18078164 18258092 18255395 17996344 18154188
12029 18154188 18289824 18218952 18268900 18476081 18454491 18529916 18321478 18151096 18071054 18316832
12019 18316832 18219189 18121448 18018529 18061833 18218528 18236989 18294195 18391817 18398552 18689703 18555717
12008 18555717 18358512 18268180 18184172 17996641 18125527 18281532 18246601 18600605 18429187 18170288
11998 18170288 18254919 18522100 18700675 18476116 18409841 18283578 18168229 18119079 18349176 18223660
11988 18223660 18358091 18450325 18524017 18537668 18512856 18482456 18486921 18347953 18194573 18087242
11978 18087242 17871710 17669223 17580672 17613143 17783594 17808229 17848657 17826969 17449520 17265778
11968A7265778P9913J97191M8542O5607j04810j91063o9359K90022K85015J72092
11958A8038928K33261r1131l69780o2587j49001L6850j68234l18964k01569L49456
11948A7297229J53707p0996P717j30480J25510K13516j96839n60265k48232K88005
11938A6878872m7137n5239L30747K036l74789l13467q71K56972j2448J9676J18531
11927A6802883K85857k11533j95248k63573n5057l88625k10464j82138Q0144K34059
11917A5896305M122J11923L3630j89604l01106m8638R2735K8914j18270k93319
11907A5216692j47360q3139M4883P472J59819K36252Q9429k75555j84743j5990
11897A5047760K01548K06316j68176j06877j04672J91486k46950m97854j41362
$$ plain form
11968 17265778 17345691 17542882 17591424 17657031 17552221 17361158 17291799 17581821 17866836 18038928
11958 18038928 18272189 18181058 17811278 17748691 17599690 17636540 17468306 17149342 16947773 17297229
11948 17297229 17450936 17379940 17387657 17257177 17382687 17596203 17399364 16839099 16590867 16878872
11938 16878872 16831735 16776496 17107243 17109279 16734490 16421023 16420152 16677124 16664676 16684352 16802883
11927 16802883 17088740 16877207 16681959 16418386 16363329 15974704 15764240 15582102 15662246 15896305
11917 15896305 15900427 16012350 16045980 15856376 15555270 15506632 15599367 15628281 15510011 15216692
11907 15216692 15069332 14986193 15031076 15038548 15198367 15434619 15524048 15248493 15063750 15047760
11897 15047760 15249308 15455624 15287448 15180571 15075899 15267385 15020435 14522581 14381219
11888A4381219J30338m8196J83092j76984k48982j74710l09836M06275K32634
11879A4374850l07552J78874K15548J49326j4154k63167j4372l42322n29187j09829
11869A3338015J31838K72062O2666l01383l30963J09657j97602j94970o126K5705
11859A2908899J44471r5716k24335N8452J76882k34469k51417Q7150J36977j08004
11849A2598890j58632R2563K52818j23094j68931k67440k09077J12903j00444
11840A2029556K7430j10007J0365J2277o2310k45555l53693J71144K78781n8745
11830A1699243m08184j61918j24583K47300L06586j6889j20325j39756j91272
11821A1090202j52835j45228k01879K52040M2528R2838N7544k77080j51389j14209
$$ plain form
11888 14381219 14511557 14463361 14646453 14469469 14220487 14045777 13735941 14142216 14374850
11879 14374850 14067298 14246172 14461720 14611046 14596892 14333725 14319353 13977031 13447844 13338015
11869 13338015 13469853 13741915 13804581 13503198 13172235 13281892 13084290 12889320 12883194 12908899
11859 12908899 13053370 12957654 12733319 12791771 12968653 12734184 12482767 12569917 12706894 12598890
11849 12598890 12440258 12532821 12785639 12662545 12493614 12226174 12017097 12130000 12029556
11840 12029556 12056986 11946979 11957344 11969621 11907311 11661756 11308063 11479207 11757988 11699243
11830 11699243 11291059 11129141 11004558 11251858 11558444 11541555 11421230 11281474 11090202
11821 11090202 10937367 10792139 10590260 10842300 10884828 10977666 11035210 10758130 10606741 10492532
11811A0492532j02952K26j33309k64683j98623j22782J28838J32622O2579J83426
11801A0177874K45724k28253J40722n6764j58732j89482j79378J86830K05854
11792A0144395n7654M3697j84020J44768J3174k66354k67408m16647j3401J71292
11782I311842J57065j27442L1416O8150n4095j8939k45775J25131r7725J08372
11772I258000M0453j46452j07244j20376P4476j20049j18933j27788j03978r344
11762H518765j42960k91260k166l5633n7078j45978N4516L16729o1345q6497J74045
11751H241138J1872j22377L2476R1478j73008j44736j97822K8565K46793J70140
11741H184519j69805j17398J10657k30106J28674J9738R7875l56547n85690J43109
$$ plain form
11811 10492532 10389580 10389806 10256497 9991814 9793191 9670409 9799247 9931869 9994448 10177874
11801 10177874 10423598 10195345 10336067 10279303 10120571 9931089 9751711 9938541 10144395
11792 10144395 10086741 10130438 9946418 10091186 10104360 9838006 9570598 9153951 9140550 9311842
11782 9311842 9468907 9341465 9372881 9441031 9386936 9367997 9122222 9247353 9149628 9258000
11772 9258000 9298453 9152001 9044757 8924381 8998857 8878808 8759875 8632087 8528109 8518765
11762 8518765 8375805 8084545 8082379 8046746 7989668 7843690 7898206 8214935 8153590 8067093 8241138
11751 8241138 8253010 8130633 8163109 8254587 8081579 7936843 7739021 7767586 8014379 8184519
11741 8184519 8014714 7897316 8007973 7777867 7906541 7926279 8024154 7667607 7081917 7225026
11731G225026N8298K21407j12003n01118O2415N7066J12415j65497l8575M9635
11721F969069n3814J06025j67000j00487j6430K30991j3867k89951k70582K44027
11711F637981r2474j32561K11799K26146K32066j70664n3359J00654o0724k12670
11701F686194l48160J59743K45052M0926p7611k58278k85842K41762N16268K01121
11691G121175l71529l56717j87164o9094j20607J24859j7788k3516j46124o1021
11681E892474l15994k34639J26805J85366k98187j30631K14306O5811O1053R316
11671E575680j7895O3704Q3861j38244K74339K33519o3768k95533k09544N5684
11661E561803r2285k26363r6804L9528M2556K2267j3902k98657j30725r065q4800
$$ plain form
11731 7225026 7283324 7504731 7392728 6891610 6954025 7011091 7123506 6958009 6919434 6969069
11721 6969069 6915255 7021280 6854280 6753793 6737363 6968354 6954487 6664536 6393954 6637981
11711 6637981 6545507 6412946 6624745 6850891 7082957 6912293 6858934 6959588 6898864 6686194
11701 6686194 6338034 6497777 6742829 6783755 6706144 6447866 6162024 6403786 6920054 7121175
11691 7121175 6749646 6392929 6205765 6136671 6016064 6140923 6123135 6099619 5953495 5892474
11681 5892474 5576480 5341841 5468646 5654012 5355825 5225194 5439500 5505311 5566364 5575680
11671 5575680 5557785 5621489 5705350 5567106 5841445 6074964 6011196 5715663 5506119 5561803
11661 5561803 5469518 5243155 5146351 5185879 5228435 5250702 5236800 4938143 4807418 4798353 4713553
11650D713553J83342L9489j29370P6594J22695J61732L55334L332n00699K61165
11640E287167J984l3182j10388k16646l00458m2700n0630M3797J65287r9695J4378
11629D658914P8431k10320K26848K36339J65203j95977l42317j29146J17611j54295
11619D451291l6460r7438p0827o8481j38153P8293R8015k85263k73973J91498
11609C848502M14933K86683J9926l5245j96334l48314J94730J3518j01941j47852
11599C948606L7958J17103J61587J1691J02424j40692K5528J1074j48611j90613
11589C936055j23915k36314J37871K62347J94281p9786j25680k10958j5152o9140
11579C669609m0651r8355M9554J46671J0711J60583J65592j64925k78041K8746
$$ plain form
11650 4713553 4896895 4936384 4807014 4883608 5006303 5168035 5523369 5526701 5026002 5287167
11640 5287167 5289151 5255969 5145581 4928935 4628477 4585777 4535147 4578944 4744231 4644536 4658914
11629 4658914 4737345 4527025 4753873 4990212 5155415 4959438 4617121 4487975 4605586 4451291
11619 4451291 4414831 4317393 4246566 4178085 4039932 4118225 4216240 3930977 3657004 3848502
11609 3848502 4263435 4550118 4570044 4534799 4338465 3990151 4184881 4198399 4096458 3948606
11599 3948606 3986564 4103667 4265254 4276945 4379369 4238677 4264205 4275279 4126668 3936055
11589 3936055 3812140 3575826 3713697 3976044 4170325 4090539 3964859 3753901 3738749 3669609
11579 3669609 3628958 3530603 3580157 3726828 3737539 3898122 4063714 3898789 3620748 3649494
11569C649494p0510R4485J99751n924Q8734J3665q4062L8868j74229k10402j67316
11558C372554J33510M45880Q2360l05223n24706k67203j20072K42810K66805J52400
11548C479115j8032j28091j14479J88161Q3083k7628n9717k12920J93373R0223
11538C473088Q1840J9643l12246j63715K7852q815k9446L8317l54981j9093J68480
11527B920924Q607K18501M2248K8151j0093l50397j78233J0241J19041m2477J36772
11516B903285K004j80948k0409K15818L20957o1865j52439Q635k06851l29534
11506B498653J67828n2114R7031P7069k11161j00303R4922O4957J45439O6159
11496B848480l4795j1992j80771j42813J00731p4277j91631q5360K04575J60859
$$ plain form
11569 3649494 3578984 3673469 3873220 3867296 3956030 3969695 3885633 3924501 3750272 3539870 3372554
11558 3372554 3506064 3951944 4034304 3729081 3204375 2937172 2817100 3059910 3326715 3479115
11548 3479115 3461083 3332992 3218513 3406674 3489757 3462129 3402412 3189492 3382865 3473088
11538 3473088 3554928 3574571 3262325 3098610 3126462 3117647 3088201 3126518 2771537 2752444 2920924
11527 2920924 2929531 3148032 3190280 3218431 3208338 2857941 2679708 2689949 2808990 2766513 2903285
11516 2903285 2905289 2724341 2703932 2919750 3240707 3178842 3026403 3035038 2828187 2498653
11506 2498653 2666481 2614367 2711398 2788467 2577306 2477003 2571925 2636882 2782321 2848480
11496 2848480 2813685 2801693 2620922 2478109 2578840 2504563 2312932 2227572 2432147 2593006
11486B593006K25319k91732Q8225l4661k32983l00486k6655J63368Q0025j7535
11476B245891N6451J58701J26910k24335j9052k29739L703q49Q6579P8020l11736
11465A970544J25991N0252K23106K39916J13224m992l919k4397l81930j91560
11455B116235j62920K19978J07363q1328l2932l1443Q01k48225l75137j76879
11445A335513J95135M64444M06864j4279n2889j77588o9284J28647M1545Q9104
11435B347212L880p5549k16138l42832J01276L00338J78069N1448K2030k95395
11425B074339J1166K38440j51304q9073J55009p0361n5731L8233q9085p2577j10796
11414A878260J14652J61778j54366k06546K78470j26444k71525j29813j49204
$$ plain form
11486 2593006 2818325 2526593 2614818 2580157 2347174 2046688 2020033 2183401 2263426 2245891
11476 2245891 2302342 2461043 2587953 2363618 2344566 2114827 2118530 2117681 2204260 2282280 1970544
11465 1970544 2096535 2146787 2369893 2609809 2723033 2718041 2714122 2689725 2307795 2116235
11455 2116235 1953315 2173293 2280656 2199328 2166396 2134953 2135754 1887529 1512392 1335513
11445 1335513 1530648 1995092 2401956 2387677 2334788 2157200 2087916 2216563 2258108 2347212
11435 2347212 2351092 2275543 2059405 1716573 1817849 2118187 2296256 2347704 2369734 2074339
11425 2074339 2085505 2323945 2172641 2083568 2238577 2168216 2112485 2150718 2061633 1989056 1878260
11414 1878260 1992912 2154690 2000324 1793778 2072248 1945804 1674279 1544466 1395262
11405A395262P5182M57783M8522j30841k39825o0707m7179L20345P1913J2125
11395A902580p1632J24268O192j04164j5261k1862q8445J8998O7851o1546p7348
11384A679631K9173K4465q0830Q9011K48101p7621o75848k61162L38282M64710
11374A777912m7242L2281J9414Q4403L37251j29302o4713k35975j14550j7461
11364A642018L44430R8509j16575j34033j92212O4701P0492o8414k81092k75344
11354A152480j44494L30525M0815j35028M07632M1006l7732K82145J12787j0709
11344B039427j76381k31665n33340p6547K99296R0735j46353j34975J57331K54219
11334A541747K55673O1409m05082j55733J13340J17253k22992N0849k66844j81173
$$ plain form
11405 1395262 1470444 1928227 1976749 1845908 1606083 1545376 1498197 1818542 1890455 1902580
11395 1902580 1830948 1955216 1961408 1857244 1841983 1820121 1731676 1750674 1818525 1756979 1679631
11384 1679631 1708804 1733269 1652439 1741450 1989551 1911930 1236082 974920 1313202 1777912
11374 1777912 1730670 1762951 1782365 1866768 2204019 2074717 2010004 1774029 1659479 1642018
11364 1642018 1986448 2084957 1968382 1834349 1642137 1706838 1777330 1708916 1427824 1152480
11354 1152480 1007986 1338511 1379326 1244298 1651930 1692936 1655204 1937349 2050136 2039427
11344 2039427 1863046 1631381 1098041 1021494 1320790 1411525 1265172 1130197 1287528 1541747
11334 1541747 1797420 1858829 1453747 1298014 1411354 1528607 1305615 1356464 1089620 908447
11324I08447l3167J96084L96883J69107l71683O6381j03442q3960q9207J17833
11314A173276j65377j31802k0512L19866K9083R2930K68573K02121m49862l09592
11304A008704j60984J56820L94573j675k87473q863J84651j53312j93599p3912
11294H64930J21923Q2010j71432k21637O0969J87223L20548J43806K3189j93028
11284A218501j59287j74057k12018J03179J17848j16979j41217Q3577P1451J33307
11274I24305J9656k12696j71448R2526K76190K65051k31889j2563M2932j1495
11264I80569q8634m0610O3410L02729J45738o1858O5260j80890K6165l89189k0232
11253H02458L56215j55292n8097J55565K03915J01199j34942k69460K40725J76377
$$ plain form
11324 908447 875280 1071364 1468247 1637354 1265671 1332052 1228610 1144650 1055443 1173276
11314 1173276 1007899 876097 855585 1175451 1204534 1297464 1566037 1768158 1318296 1008704
11304 1008704 847720 1004540 1399113 1397438 1109965 1101102 1285753 1132441 938842 864930
11294 864930 986853 1068863 897431 675794 736763 923986 1244534 1388340 1411529 1218501
11284 1218501 1059214 885157 673139 776318 894166 777187 635970 719547 790998 924305
11274 924305 943961 731265 559817 652343 928533 1193584 961695 949132 992064 980569
11264 980569 891935 851325 914735 1217464 1363202 1301344 1366604 1185714 1211879 822690 802458
11253 802458 1158673 1003381 945284 1100849 1304764 1405963 1271021 1001561 1242286 1418663
11243A418663j29780k91150j34803J21665N7737Q3661l0931o6113k58059j88171
11233E82719K09288J09893l241k76043p94l9337K50075J60487Q0115L4757j44810
11222I63109j25605L36545J12308J13825o6831o2927L5413j20737n5313j98145
11212I31642l26515j79673k73201Q5640J36806J46340J30751J98973j86505O8604
11202G32862k56256j21189P7784J88881R0423P9007J721q2834N8852J11972Q2824
11191I64047O6472k45970k32127m0618p435j13167K16174L88787j25754j89832
11181F80577k03566l1341J55124j03667j95075r0370O357J3070Q8497O480j83182
11170A42904K21631N1928L3693K09308K41420j72598k40518J05899J88015j68809
$$ plain form
11243 1418663 1288883 997733 862930 984595 1042332 1125993 1095062 1028949 770890 582719
11233 582719 792007 901900 898659 622616 621822 582485 832560 993047 1073162 1107919 963109
11222 963109 837504 1174049 1286357 1400182 1333351 1270424 1305837 1185100 1129787 931642
11212 931642 605127 425454 152253 237893 374699 521039 651790 850763 664258 732862
11202 732862 476606 355417 433201 622082 712505 791512 793233 710399 769251 881223 964047
11191 964047 1030519 784549 552422 511804 504369 391202 607376 996163 870409 680577
11181 680577 477011 445670 600794 497127 302052 211682 218039 231109 319606 326086 142904
11170 142904 364535 416463 450156 659464 900884 728286 487768 593667 781682 612873
11160F12873P010J49298k8899k26734J12263K49515J83106k28312j85193k13594
11150D31333N9393L2126O9782j7534q5254J33428M0817p140m60072k4270K51066
11139D23675J51079J98033o9540P1302r3381p6020L2459j26886J87586l7892j28508
11128E31907K47446K14629l01487j53709J507l35292k89632K03581K03960K28504
11118E51414L31327N8565k01383j63262m5245L5223q2794r8978J05504J21638
11108F12009j50453l06712J48590K2633o1078p7497J4076L6433m5499N7958j14231
11097A36229j31910J0014J19876L83518L06016j30341l43760k61148j98533p8360
11087a88399L0431L30791J28822J63986k66405m2241K34003J69371j79871N8156
$$ plain form
11160 612873 619883 769181 740282 513548 625811 875326 1058432 830120 644927 431333
11150 431333 490726 522852 592634 575100 489846 623274 664091 656951 196879 172609 423675
11139 423675 574754 772787 703247 774549 681168 605148 637607 510721 698307 660415 531907
11128 531907 779353 993982 692495 538786 540293 205001 -84631 118950 322910 551414
11118 551414 882741 941306 739923 576661 531416 566639 483845 384867 490371 612009
11108 612009 461556 154844 303434 326067 264989 187492 201568 238001 192502 250460 136229
11097 136229 4319 14333 134209 517727 823743 693402 349642 88494 -110039 -188399
11087 -188399 -157968 172823 301645 465631 199226 156985 390988 560359 380488 438644
11077D38644O1019k8090j80108J39068m0345j24827j22859j83450J25204M58242
11067E42498J05604j38766j68967q8346q994J63891L43118L8768k55476K6109
11057E59439m6631k73283k16916j22031J46858K82987J44840j49689J00754n2568
11047C73760J01962M014J29103j8622K57934j51526r5888J28440j03755J71423
11037G96845M7100k06547J73029N02598M60209n1560q6660j71674m4570m8403
11027A370367J32090J51491L41050j21624J18194J56831j57456j62258j56306
11018A672379O5049L80630M44595J18994l3188k95772p9762J29091j43284j51921
11008B106811m77730l17493K94716L85755J18435O6607l03408O4288J4481k78612
$$ plain form
11077 438644 499663 471573 291465 430533 390188 265361 142502 -40948 84256 542498
11067 542498 648102 509336 340369 252023 243029 406920 750038 788806 533330 559439
11057 559439 512808 239525 22609 -99422 47436 330423 475263 325574 426328 373760
11047 373760 475722 479736 608839 590217 848151 696625 600737 729177 625422 796845
11037 796845 843945 637398 810427 1313025 1773234 1721674 1635014 1463340 1418770 1370367
11027 1370367 1502457 1653948 1994998 1873374 1991568 2148399 1990943 1828685 1672379
11018 1672379 1737428 2118058 2562653 2681647 2648459 2352687 2272925 2402016 2258732 2106811
11008 2106811 1629081 1311588 1606304 1992059 2110494 2177101 1873693 1937981 1952462 1673850
10998A673850r4519M1673k99933l18804l6656K88093J83343J92818J5971J38880
10988A784716k02204l56466k48486k12127j66169L621J26256j46517j48477N3422
10978D87569L99893O5928P3138l4480k74301m61950k63885R7520J99028K25054
10968E13514o0768j80471P8586o9555K44717j52063l26954J40874J47942J84819
10958E20641j23393l10749r5251J06890L27010P061j83345j04822j12444L4661
10948F6259j8603o4156j35699j63240q2325J05207K02363K12965K54449K13051
10938E90271r6101k24323j375j46498k70461J40196k3846J85576J37346l14032
10928b3247l61771K51943J70165K68833R9157o0949K6918K7207L5033P6954l29993
$$ plain form
10998 1673850 1579331 1621004 1321071 1002267 965611 1253704 1437047 1629865 1645836 1784716
10988 1784716 1582512 1226046 977560 765433 599264 602885 729141 582624 434147 487569
10978 487569 887462 953390 1026528 992048 717747 255797 -8088 89432 288460 513514
10968 513514 452746 272275 350861 281306 526023 373960 47006 187880 335822 520641
10958 520641 397248 86499 -8752 98138 425148 432209 248864 144042 31598 66259
10948 66259 47656 -16500 -152199 -315439 -397764 -292557 -90194 122771 377220 590271
10938 590271 494170 269847 268472 121974 -148487 -8291 -32137 153439 290785 -23247
10928 -23247 -385018 -133075 37090 305923 405080 344131 371049 398256 433289 510243 180250
10917A80250k19925j13112m2495M4057l9277m6989j7483K4817K80484j7252M6129
10906G9204J56598l823j55769k9252p8227O2998k01589q0741K66455p0975L8372
10895a6749j82918k723N4115K14599J77789j17363r3897M7587o2944k19955l6855
10884b39314K62708J8456j11892n01858k06060K25388p4243L3680K66825O807
10874c19503j72737J98221K2792q0891p781p3663J17372q4229J29808J14547J18145
10863c7919J72857j14980l40335j72382j6424J2890N5131j36527l8335j9001l19534
10852i54559n013K95572K56148j98031k69669j8091N5582J7632J4470m819J15002
10841f95776P8373K63999J36684j72556o3935L50297K95450l88229l38476j3425
$$ plain form
10917 180250 -39675 -152787 -195282 -151225 -190502 -237491 -254974 -230157 50327 33075 79204
10906 79204 235802 231979 76210 46958 -31269 31729 -169860 -250601 15854 -55121 -16749
10895 -16749 -199667 -202390 -148275 66324 244113 126750 32853 80440 17496 -202459 -239314
10884 -239314 23394 41850 -70042 -571900 -777960 -552572 -626815 -593135 -326310 -319503
10874 -319503 -492240 -294019 -271227 -352118 -359899 -433562 -316190 -400419 -270611 -156064 -37919
10863 -37919 134938 19958 -320377 -492759 -509183 -496293 -441162 -577689 -616024 -635025 -954559
10852 -954559 -959572 -664000 -407852 -605883 -875552 -893643 -838061 -820429 -805959 -810778 -695776
10841 -695776 -617403 -353404 -216720 -389276 -453211 -102914 192536 -195693 -534169 -547594
10831e47594M2754K33131L93709j42601M2365J9870K5224R4033l80426k16674
10821d36209k95162j01891L89959O219n4625j2904p4966q5166j55306k83135J62243
10810i40943J75102J60157R5466k42658J06422j90805L6615J81838m5676O6203
10800e98279J04819P6910K1994j59307J31631J09905j47664j59917j44205l6988
10790h01101k4659j06798L17624N537J7526J072j05318j51039l69928J65409J89048
10779h62627J08773o1644J51631O4798k45099j38305R157J88458J14604j1786
10769f82040r4368J1111j9621l1229j00864L9167J59483J20231o9433l73230r9236
10758a140029K20870J59548Q8170l3161J43983M9449j99934r8576N4573Q2103
$$ plain form
10831 -547594 -504840 -271709 122000 -20601 21764 41634 66858 160891 -219535 -436209
10821 -436209 -731371 -833262 -443303 -437084 -491709 -504613 -579579 -664745 -820051 -1103186 -940943
10810 -940943 -765841 -605684 -510218 -752876 -646454 -837259 -800644 -618806 -664482 -598279
10800 -598279 -493460 -416550 -394556 -553863 -422232 -312327 -459991 -619908 -764113 -801101
10790 -801101 -825760 -932558 -614934 -609397 -591871 -590799 -696117 -847156 -1217084 -1051675 -862627
10779 -862627 -753854 -815498 -663867 -599069 -844168 -982473 -973316 -784858 -670254 -682040
10769 -682040 -776408 -765297 -784918 -816147 -917011 -877844 -718361 -598130 -667563 -1040793 -1140029
10758 -1140029 -919159 -759611 -671441 -704602 -560619 -511170 -711104 -809680 -755107 -673004
10748f73004J6382j66998k62637p9774j93966l5740J51572J31086J64601K40283
10738g08195J16529q559J07430k7444J94239J86079P542j55802J96490K59725
10728A68034J20006p5275r9351J71989J09891l6637J21062Q7186m3132R501j09517
10717D23757K24938K73251K76001M6839k09871j22768K52526J40325J65983M1245
10707A512226J5690O2999p8213j34956n1177k63389j03973L9196j07499n2327
10697H38577J19231l2708k41136o3695k23313j49200Q9899K07001L3196Q9468
10687F67320l7120j266j73756k98272p7474N7233p9845k09707J02215j34225j13758
10676b98655L5070J73257o2189J3883r1662q7345r12Q7615j14061m09495k58350
$$ plain form
10748 -673004 -656622 -823620 -1086257 -1166031 -1359997 -1395737 -1244165 -1113079 -948478 -708195
10738 -708195 -591666 -600225 -492795 -520239 -326000 -139921 -132379 -288181 -91691 168034
10728 168034 288040 212765 113414 285403 395294 358657 479719 566905 523773 533274 423757
10717 423757 648695 921946 1197947 1244786 1034915 912147 1164673 1304998 1470981 1512226
10707 1512226 1527916 1590915 1512702 1377746 1326569 1063180 959207 998403 890904 838577
10697 838577 957808 925100 683964 620269 396956 247756 337655 544656 577852 667320
10687 667320 630200 628934 455178 156906 79432 136665 56820 -152887 -50672 -184897 -298655
10676 -298655 -263585 -90328 -152517 -138634 -230296 -317641 -318553 -230938 -344999 -754494 -1012844
10665a012844P6983j3700K3355K76883n9726j00145J9482K40146J78069q1387
10655d52884P1733k54249m69779p6418J15940J26469K83531M12957O5593L12692
10645A35585L56089L37096J62653J61279j5265K67611J34661k16413k12724l82251
10635G28321j45736N7648K880m5827O50008P46227P55821Q02032J014024J200008
10625E765406J249329J012261Q51507N69739O76503P00804R95063J567952K565029
10616A5953593M031610N830516P227333R647978J3071764J6120263J7498883J6741055
10608A06122995J5146090J2884861R616838M849617N10484o14087K722256R632205
10600A60871259J8871315K7658609L2364099L0812286K6291042K0321897J0952534
$$ plain form
10665 -1012844 -935861 -949561 -926206 -649323 -709049 -809194 -789712 -549566 -371497 -452884
10655 -452884 -381151 -635400 -1105179 -1181597 -1065657 -939188 -655657 -242700 -177107 135585
10645 135585 491674 828770 991423 1152702 1137437 1405048 1539709 1323296 1110572 728321
10635 728321 582585 640233 643113 597286 1247294 1993521 2749342 3551374 4565398 5765406
10625 5765406 7014735 8026996 8878503 9448242 10124745 10825549 11820612 13388564 15953593
10616 15953593 19985203 25815719 33043052 42691030 55762794 71883057 89381940 106122995
10608 106122995 121269085 134153946 143770784 148620401 149130885 148516798 151239054 160871259
10600 160871259 179742574 207401183 239765282 270577568 296868610 317190507 328143041
10593C28143041j856767j3019980j6137565r236545M536444K0186275L3166460
10586C45781363L9157954L6255562K7945947J7273608K477447j7196004l4996990
10579D16698887l9427800l0962759j6791763j615564R919443J5375054J3949589
10572C67145087Q441879R73866r409129k1984713l2040353l3787793k7498411
10565B51840433j7906883r259927l019224k053k76970k448892n862963j0405084
10557B02658437j5665410j9237058j9876931j7147028j4127989j1161203q513869
10550I6928949o671333n411334m635764l977795l277917k840346k824618k642362
10542F4647480k209129k186146k245320k243213j951117j508150j174166j251375
$$ plain form
10593 328143041 326286274 313266294 297128729 287892184 292428628 312614903 345781363
10586 345781363 384939317 421194879 449140826 466414434 468891881 451695877 416698887
10579 416698887 377271087 346308328 329516565 327901001 337820444 353195498 367145087
10572 367145087 375586966 376560832 367151703 345166990 313126637 279338844 251840433
10565 251840433 233933550 224673623 221654399 221652346 221375376 218926484 213063521 202658437
10557 202658437 186993027 167755969 147879038 130732010 116604021 105442818 96928949
10550 96928949 90257616 84846282 80210518 76232723 72954806 70114460 67289842 64647480
10542 64647480 62438351 60252205 58006885 55763672 53812555 52304405 51130239 49878864
10534D9878864j407071j269532j265455j391673j251239j015825q55571r72434
10526D0450064j075599j060192q03495r24769q29172n46018q80689q28239o48325
10517C2853566p54620r02076p46882o11273m19907l71097o00374q22433q34644
10508B6790260m47674l77841m79413m70659n93185q09132m21014m46390o76610
10499B2068342m97069m70388j18486j02709l58170m14607m38256o70967l50278
10490A8647412l70609J16810O032k05974l21134k59303k35252k46383j64819j48136
10480A6818644m10328k48717j32298k453L44534P2103j55294q9197J1482j18120
10470A6090356l66595l75656q8583j85097n4972J50400K01787J37686J52241N4793
$$ plain form
10534 49878864 48471793 47202261 45936806 44545133 43293894 42278069 41422498 40450064
10526 40450064 39374465 38314273 37510778 36586009 35756837 35210819 34330130 33501891 32853566
10517 32853566 32098946 31196870 30449988 29838715 29418808 29047711 28447337 27624904 26790260
10508 26790260 26342586 25964745 25485332 25014673 24421488 23612356 23191342 22744952 22068342
10499 22068342 21571273 21100885 20982399 20879690 20521520 20106913 19668657 18997690 18647412
10490 18647412 18276803 18393613 18399645 18193671 17872537 17613234 17377982 17131599 16966780 16818644
10480 16818644 16408316 16159599 16027301 16024848 16369382 16441485 16286191 16196994 16208476 16090356
10470 16090356 15723761 15348105 15259522 15074425 15019453 15169853 15371640 15509326 15661567 15716360
10460A5716360j65800k4324j5800j99572n74798k58844o1690j26377k02178q9343
10450A3997634K02962j34552l32830O2092p0149k47012k55461j54421k50511M9794
10440A2867546l45884m91852l02325r1459j29083j96823k4358J40636l09645m94863
10430A0621890l11071l59911j81993p2119L4559l06134M4990o6110m77131k84781
10420H642189j46380o1001r9479l05439p2711O209j51136l4694j06939l47028
10410G323591l7312J0280l98929l4481j12098l3391j50603k24005j60789j18134
10400F064129J81742O9895j40673J31882j3548r2386m7425j89385k69924m10992
10390E283315m9929l1303O922N76n7994P7152l5375j92426j94435q9476k28397
$$ plain form
10460 15716360 15550560 15526236 15510436 15310864 14736066 14477222 14415532 14289155 14086977 13997634
10450 13997634 14200596 14066044 13733214 13795306 13725157 13478145 13222684 13068263 12817752 12867546
10440 12867546 12521662 12029810 11727485 11636026 11506943 11310120 11285762 11426398 11116753 10621890
10430 10621890 10310819 9950908 9768915 9696796 9731355 9425221 9470211 9404101 8926970 8642189
10420 8642189 8495809 8434808 8335329 8029890 7957179 7963388 7812252 7777558 7670619 7323591
10410 7323591 7286279 7296559 6897630 6863149 6751051 6717660 6567057 6343052 6182263 6064129
10400 6064129 6245871 6315766 6175093 6306975 6293427 6201041 6153616 5964231 5694307 5283315
10390 5283315 5233386 5202083 5209005 5209581 5151587 5228739 5193364 5000938 4806503 4717027 4488630
10379D488630J38945J06676j55312j04888r2212j43135k67354M5608l2642l0937
10369C953379k8282L6547O2225r9988k75752j02002K30689Q9411j30385j49905
10359C585937J3154j61j6720Q900k0257L0816o7509j32311N4390Q3875o9257o7299
10347C403558J05414M246m8780J23006n4739J8022k8480j15911q8618J65826o0184
10336C423360j46244o9142j47813l2123O408M0647J26141N6983j05616l2937K16587
10325C336251J24792j09588Q5121P1581j82484l30194l63058l96844K76530M03145
10315B915252j5961j33346j28054L8902K52636n4930l40855j7730j39119j65375
10305B211420J96243l8425P6260k4375k68842r9468j9404J91312j2599P6436j73479
$$ plain form
10379 4488630 4627575 4734251 4578939 4474051 4381839 4238704 3971350 4016958 3984316 3953379
10369 3953379 3925097 3961644 4023869 3923881 3648129 3546127 3776816 3866227 3735842 3585937
10359 3585937 3599091 3598930 3582210 3591110 3570853 3601669 3534160 3401849 3456239 3540114 3470857 3403558
10347 3403558 3508972 3513218 3464438 3587444 3532705 3550727 3522247 3406336 3317718 3483544 3423360
10336 3423360 3277116 3207974 3060161 3028038 3034446 3075093 3201234 3258217 3152601 3119664 3336251
10325 3336251 3461043 3351455 3436576 3508157 3325673 2995479 2632421 2235577 2512107 2915252
10315 2915252 2899291 2765945 2637891 2676793 2929429 2874499 2533644 2515914 2376795 2211420
10305 2211420 2407663 2369238 2445498 2421123 2152281 2052813 2033409 2224721 2212122 2288558 2115079
10294B115079k3282K57271J46882k5932N557K32793j62776m32512l14788J84208
10284A982500J7032k41845O125K55435j4746J6319m3814M0741Q7126O1517l79046
10273A787344k41446K4414m8286k2297J01493J23967J72966l08087l8700J29938
10263A681306m731j8795l3470k296K52989L4955R5830l8217r1131p6521r4571
10252A705348m7542j86204J31974j27777l03154N3375J7709p3186o3946M01278
10242A507875j25318j09632j71084L8664J45866P3687j51320M2790J11770p97
10232A362501k78779l00747K11403l4062J48261K90730N5890O1854k0278n8844
10222A437929j20187k2893J36014j56405k8715P9774K08437K19620k29086l35979
$$ plain form
10294 2115079 2091797 2349068 2495950 2470018 2475575 2708368 2545592 2113080 1798292 1982500
10284 1982500 1999532 1757687 1763812 2019247 2004501 2020820 1977006 2017747 2104873 2166390 1787344
10273 1787344 1545898 1570312 1522026 1499729 1601222 1725189 1898155 1590068 1551368 1681306
10263 1681306 1676575 1657780 1624310 1622014 1875003 1909958 2005788 1967571 1876440 1799919 1705348
10252 1705348 1657806 1471602 1603576 1475799 1172645 1226020 1243729 1170543 1106597 1507875
10242 1507875 1382557 1272925 1101841 1140505 1286371 1360058 1208738 1251528 1363298 1362501
10232 1362501 1083722 782975 994378 960316 1108577 1399307 1455197 1517051 1496773 1437929
10222 1437929 1317742 1294849 1430863 1274458 1245743 1325517 1533954 1753574 1524488 1188509
10212A188509j92880o5480K28604J17129j41163n4694o0077J27510j20058j61303
10202H66097j89145p4900J37271K19955j4475n0662J67985J95857J06649J05472
10192A470104k04363k18713K3208K63876M9283k79970j56774j3126R1962K62480
10182A287967J24234M7188o3516k46908L1326l6973J14995J68520k38771M830
10172A192892Q7017M64597M67335J29014l16193k69591o070k5215p6689J49940
10162A797037K46387M0109J11675L53644J8261K8776L34058J62278m4108p4298
10152B973819k48965k00353l477K56286L25109Q3076J1881j9898l1076k21283
10142B925119k62103k36627k9048J29007L24163M7297K08125p170j24037l01165
$$ plain form
10212 1188509 995629 930149 1158753 1275882 1134719 1080025 1019948 1147458 1027400 866097
10202 866097 676952 602052 739323 959278 944803 894141 1062126 1257983 1364632 1470104
10192 1470104 1265741 1047028 1070236 1334112 1383395 1103425 946651 933525 1025487 1287967
10182 1287967 1412201 1459389 1395873 1148965 1180291 1143318 1258313 1426833 1188062 1192892
10172 1192892 1279909 1744506 2211841 2340855 2024662 1755071 1749001 1723786 1647097 1797037
10162 1797037 2043424 2083533 2195208 2548852 2567113 2595889 2929947 3092225 3048117 2973819
10152 2973819 2724854 2524501 2521024 2777310 3102419 3185495 3197376 3177478 3146402 2925119
10142 2925119 2663016 2426389 2397341 2526348 2850511 2897808 3105933 3098763 2974726 2673561
10132B673561m07351j3093J23419j54069j57781j2784J44653L5734j02625k66970
10122A862694l26571R7295K35946j96480j33822Q9770o4105Q951Q4221j22926
10112A534973j04534L8617P1016R9765j7522m76597n11611J37175J40505J29671
10102A041458k7239J84951J51794l53828q0385k518J8669j96191O5891K29710
10092A032312J19848j05551j15088m9772k14386j14412L54027J52848k56622K42294
10082A045498N1706M4140n2231L641P2286k06822j0591p6451N8516q9655j54340
10071F85697j66096P3959J59131j2794K75879K29183k62490q8766j04747l8298
10061G50658K2591J42870q7712l29743r3434J54747K51523k6999j55076J80422
$$ plain form
10132 2673561 2266210 2253117 2376536 2222467 2064686 2051902 2196555 2232289 2129664 1862694
10122 1862694 1536123 1633418 1869364 1672884 1539062 1628832 1564727 1573678 1657899 1534973
10112 1534973 1430439 1469056 1540072 1639837 1622315 1145718 634107 771282 911787 1041458
10102 1041458 1014219 1199170 1350964 997136 916751 914233 932902 736711 802602 1032312
10092 1032312 1152160 1046609 931521 881749 667363 552951 906978 1059826 803204 1045498
10082 1045498 1097204 1141344 1089113 1092754 1165040 958218 947627 871176 929692 840037 685697
10071 685697 519601 593560 752691 739897 1015776 1244959 982469 893703 788956 750658
10061 750658 773249 916119 828407 498664 405230 559977 811500 784501 629425 809847
10051H09847j62863l15619k03578R2130R9944K37988K36029L224q4896j05511
10041F06695o3105J24674K57679J90865J2652k72037j70340M05K46601O3202j8073
10030I79218o2544L4975k9775j7495k209j48884J62509o4205r1965k52446j61601
10019C45578k8223M70395N1179k0824J64393m8004L3822j14671n9469j92843J1743
10008F13076j850M4020N0766J19570Q5619j98775j17879j25997k43534K9953J16366
9997C71335m7074j19640L2923n887r2859K82810K75579L6146m3476J83580j14634
9986G58803k4670J31996r7070k7878p8030j52186k0649K15879J56331q177L2878
9975H87227J5828j63395k60736j83361J3805r0140r6031p7134K32036m2413l9716
$$ plain form
10051 809847 646984 331365 127787 219917 319861 557849 793878 797102 712206 606695
10041 606695 543590 668264 925943 1116808 1129460 857423 687083 687488 934089 997291 979218
10030 979218 916674 951649 921874 904379 902170 753286 915795 851590 759625 507179 345578
10019 345578 317355 787750 838929 818105 982498 934494 968316 853645 794176 601333 613076
10008 613076 611226 655246 706012 825582 911201 712426 594547 468550 225016 254969 371335
9997 371335 324261 204621 237544 231657 138798 421608 697187 733333 689857 873437 758803
9986 758803 734133 866129 769059 741181 663151 510965 490316 706195 862526 854349 887227
9975 887227 903055 739660 478924 295563 309368 219228 123197 46063 278099 235686 195970
9964A95970N0266J82178k89130j64134J77683K43512J90596J40275j65118k08452
9954C53646K89406O2155l32660J20014J58278J25316N7388j14791j56269j28595
9944D33888q7457N9765J79096J9518r5550l29658o8936K05515j24293j59437k904
9933B9547M5523J16157l68423J28123J12819K48524p923K9752l8691j5288J98722
9922D78842K46015j33208k59043q9249j8563K73657n1336q5975K0407K1170k42529
9911A60188k21200J77551J02859K09462J9287k37635k9428P6259K03894J92207
9901F53444M8386R24j09599Q2454O9018j18543l64436P7861Q8689m11403m49234
9890d32439j95060L25506L69818L85514J75085o3674j57960p6672j58017j96665
$$ plain form
9964 195970 246236 428414 139284 -24850 152833 396345 586941 727216 562098 353646
9954 353646 643052 705207 372547 492561 650839 776155 833543 718752 562483 433888
9944 433888 346431 406196 585292 604810 509260 179602 110666 316181 191888 32451 29547
9933 29547 75070 191227 -177196 -49073 63746 312270 304347 334099 295408 280120 478842
9922 478842 724857 591649 332606 243357 224794 498451 447115 361140 381547 402717 160188
9911 160188 -61012 116539 219398 428860 448147 210512 181084 257343 461237 653444
9901 653444 701830 702754 593155 675609 744627 626084 261648 339509 428198 16795 -432439
9890 -432439 -627499 -301993 67825 453339 628424 564750 406790 330118 172101 -24564
9880b4564K44392M14536R3512k32222j77695K40505J87097Q9965l8061N702k58814
9869E44353P530J14015l5257N7350n0229j62497N6714K27662M4802k53041m56044
9858I5358j69354J7527M5581j01414J60970J67354j85318Q2412J06109L0860o8642
9847A81443m8224p7125j51515R9628P7574L44725M1029l7896j48308p3883r9840
9836A07608r5852K31693J12745J66409J50945k48442j07542K50027m6895O4758
9826E85454j96385k13154L14346J21309M122l44203J8481J82232J57635J30763
9816G60600j53177k15259j27248j78979j63685J49382j03668J46798J88939J69247
9806D72950J84425r2881n4600O1519R724n4670j35550k11413j59066J67017J22426
$$ plain form
9880 -24564 219828 634364 727876 495654 317959 558464 745561 835526 797465 803167 544353
9869 544353 551883 665898 630641 687991 637762 475265 531979 759641 804443 551402 95358
9858 95358 -73996 -56469 -10888 -112302 48668 216022 30704 113116 219225 250085 181443
9847 181443 133219 56094 -95421 4207 81781 426506 467535 429639 281331 207448 107608
9836 107608 11756 243449 356194 522603 673548 425106 317564 567591 520696 585454
9826 585454 389069 175915 490261 611570 615692 271489 289970 472202 629837 760600
9816 760600 607423 392164 264916 85937 -77748 71634 -32034 114764 303703 472950
9806 472950 657375 564494 509894 571413 581137 526467 390917 179504 20438 187455 309881
9795C09881k4351J30460O6496q1412P8339k8600q6160l73761n9677O5781L0153
9784B7149o5179o9105J58656J52587q100j99224q9507o7196k37498J81033M02639
9773A86255J93856K48022l0211k00353m0527j23515M34190q571k40881j35366
9763B82899r4651J11923j2899J633K31772J59798k08087J3373l350J24158M1262
9752F47831j62771L04K48123k7383k05385k7497j41882J12786p539k57735j36382
9741D2470K23919K6913J92526K43000j492j49432j34637N1471K24067j70p2911
9730F45724k3420l6610k40718l42627j9697K80178p1909j93917M6705J82675J61711
9719C88095k25395j91992r8961L8469J60657j30162n7870K33687q7768m4784J81580
$$ plain form
9795 309881 285530 415990 482486 401074 479413 450813 364653 -9108 -68785 -3004 27149
9784 27149 -38030 -107135 51521 204108 196008 -3216 -92723 -159919 -397417 -216384 186255
9773 186255 380111 628133 597922 397569 357042 233527 667717 659146 418265 282899
9763 282899 188248 300171 287272 288905 520677 680475 472388 485761 482411 606569 647831
9752 647831 485060 485364 733487 706104 500719 473222 331340 444126 436587 178852 42470
9741 42470 266389 293302 485828 728828 727336 577904 443267 494738 718805 718635 645724
9730 645724 622304 585694 344976 2349 -17348 262830 190921 -2996 43709 226384 388095
9719 388095 162700 -29292 -128253 -89784 70873 -59289 -117159 116528 28760 -16024 165556
9708A65556K15048n6056l8511p3047k43059K9367M514m1679J66377J22751k8181
9697B23080n4748K49691k34639l0980m1175N332O5099K51993K93759N8989m50705
9686C35696K9618L16256J500p0374k83393l1239O8615j24068r5373J5035K61186
9675D23459L0752j23732p916n6278J9205K47240j06525n0141j60330k49061M9704
9664A6377K90712K09921k2166m758L2561K8602k34964l21729J78213L65293j16129
9653D21933j40584J50907Q7693n1138K4910L62518K54268R2367p36l00744P2607
9642I74001M17858M7196j87437k95523j66397j71454p9692j40864N8160K32308
9632F88156L32180J41152m51779k41489J07552p8401J3997R5441j75259O789R9728
$$ plain form
9708 165556 380604 324548 286037 212990 -30069 -702 3812 -37867 128510 251261 223080
9697 223080 168332 418023 183384 152404 111229 116561 181660 433653 727412 786401 335696
9686 335696 365314 681570 683070 612696 329303 298064 366679 242611 147238 162273 423459
9675 423459 454211 330479 322563 266285 285490 532730 426205 376064 215734 -33327 16377
9664 16377 307089 517010 494844 490086 522647 551249 316285 -5444 172769 538062 421933
9653 421933 281349 432256 519949 468811 493721 856239 1110507 1202874 1202138 901394 974001
9642 974001 1391859 1439055 1251618 956095 789698 618244 538552 397688 455848 688156
9632 688156 1020336 1161488 709709 468220 575772 497371 511368 606809 431550 438339 538067
9621E38067O7087R6177k40397k04262j08417R9332J29052O3970l5975J71668J0321
9610E86623j65605m97506j80044K66022M02818O7734o9770m1826j84563j97154
9600a3271q3952q4551J52176R3985L7193K05600R8684r9880o9183K22569j6653
9589D42717j59650k41379J8999J21846J83006J99177j61556p7356Q2317Q1934
9579D90055J19553M842M0123l5775k5510M1127k24754j55461j74685K1032j17477
9568a6930k3729J4082k92730M0183o1949j21901M2964K89209K25086o7188Q3218
9557A10315N7761N7097J04686K0497j30783n2504N3045j71093O8423J3862J63976
9546B95282J1807J11705j37500j29213k30740l64971n6202O10886J29600N7840
$$ plain form
9621 538067 605154 701331 460934 256672 148255 247587 376639 440609 404634 576302 586623
9610 586623 421018 -76488 -256532 9490 412308 480042 410272 368446 183883 -13271
9600 -13271 -97223 -181774 -29598 64387 101580 307180 405864 305984 236801 459370 442717
9589 442717 283067 41688 60687 182533 365539 564716 403160 325804 408121 490055
9579 490055 609608 614450 654573 618798 593288 634415 409661 254200 79515 100547 -16930
9568 -16930 -40659 -26577 -319307 -279124 -341073 -462974 -420010 -130801 94285 27097 110315
9557 110315 168076 225173 329859 350356 219573 167069 220114 49021 117444 131306 295282
9546 295282 307089 418794 281294 152081 -78659 -443630 -499832 111054 240654 298494
9536B98494o7052j11458J9667M9254j70384k6470L57599o4959j32223j50856j70665
9525a69053M98578J48081J11110J18982q2050L0608L5031k15652j47301j90695
9515A37639r4036Q4992K87256Q5215O6070k91460k24076j46950M1074J39090k8699
9504E6115M7324J50344Q9389Q7991J13584R4675j70764n2937k3325m16209j25239
9493a49052K79546J10668j47647l5353j33512J58992M18048R9430j03527M1465
9483E39058l00438k37311N9170J7022L71927L15986k57767k15439j30933J56329
9473C17604J02580O3555j27184j30884l99865K5044L27380K57829k63733k92020
9463a19694Q3541L80437p9890k08420k1178J10165J80023j8299k68309k49144
$$ plain form
9536 298494 231442 119984 139651 188905 18521 -7949 349650 284691 152468 1612 -169053
9525 -169053 329525 477606 588716 707698 625648 656256 691287 475635 328334 137639
9515 137639 43603 128595 415851 501066 567136 275676 51600 -95350 -54276 84814 56115
9504 56115 103439 253783 343172 431163 544747 639422 468658 415721 392396 -23813 -149052
9493 -149052 130494 241162 93515 58162 -75350 83642 501690 601120 497593 539058
9483 539058 238620 1309 60479 77501 449428 765414 507647 292208 161275 317604
9473 317604 420184 483739 356555 225671 -174194 -149150 178230 436059 172326 -119694
9463 -119694 -36153 344284 264394 55974 34796 144961 324984 306685 38376 -210768
9453b10768R9650k2852R4166M7449L39314M6146k24360o5091j40881L50400K58203
9442E71376J1049k17584k86892p6349J85969N4042k48495K60882N71810P9275
9432I05083l08426k93803p3851m3465N0250j52886n001R7300j10582r7634J79076
9421A46061Q2835K14885j27120k21238r9369k70793J77110n9459n27J49680j34460
9410a42395j3480J68575M3273q9252J85632j39584K16155N0102j1182J8127n4498
9399B31473j9046M0596k86950J35734L02351N5485r4151j26800q1292k8614q7669
9388D1117o0006N0085J3440J85328r1979j58019k5959L9780R8947K03080J41266
9377D37080j26354j63259R4412J46469J4140l04044j37547L40199J57572j19658
$$ plain form
9453 -210768 -111118 -133970 -39804 7645 346959 393105 168745 103654 -37227 313173 571376
9442 571376 582425 364841 77949 1600 187569 241611 -6884 253998 825808 905083
9432 905083 596657 302854 229003 185538 235788 82902 77901 175201 64619 -33015 146061
9421 146061 228896 443781 316661 95423 -3946 -274739 -97629 -157088 -157615 -7935 -142395
9410 -142395 -155875 12700 55973 -33279 152353 12769 228924 279026 267844 285971 231473
9399 231473 212427 253023 -33927 101807 404158 459643 365492 238692 157400 128786 41117
9388 41117 -18889 31196 44636 229964 137985 -20034 -45993 -6213 92734 295814 437080
9377 437080 310726 147467 241879 388348 402488 98444 -39103 301096 458668 339010
9367C39010j0631j14399j14070j49638L40478J01908m55315k1373J44553m5202
9357A5321k29784M4283J65036J34818J19427j13431j75294k05932j8831n975k31163
9346e01525R4907K42057Q4230J42635K08230m1311N1100j19366j79738J53177
9336A34396p1473p9118J3313j9466J4667n519M181K91316N8443R9827j22252K48167
9324E66482M9134j76518K6145R9689j3543m1291k89282l86820n4689J51675O3506
9313e512J91983k00179o379K33548J04669q564k8900P822m0794J56328J66711
9302E70733j82084q061J92297j05698k09558n0360K00911o4640l9786P8639K10998
9291E93391J79059j69387j11124j44847M2386j1472j58881L8634L07427l8680
$$ plain form
9367 339010 328379 213980 99910 -49728 290750 392658 -62657 -84030 60523 15321
9357 15321 -214463 -170180 -5144 129674 249101 135670 -39624 -245556 -264387 -270362 -501525
9346 -501525 -406618 -164561 -80331 62304 270534 229223 280323 160957 -18781 134396
9336 134396 62923 -16195 -2882 -22348 -7681 -13200 -9019 282297 340740 440567 318315 566482
9324 566482 615616 439098 465243 564932 551389 510098 220816 -166004 -220693 -69018 -5512
9313 -5512 186471 -13708 -20087 213461 318130 309566 280666 288488 247694 404022 570733
9302 570733 388649 380588 572885 467187 257629 207269 408180 343540 303754 382393 593391
9291 593391 772450 603063 491939 347092 389478 378006 219125 257759 565186 526506
9281E26506p3497j29216R7353q1654j39117j33594j6018N6139R2080k69883k81596
9270c52497Q5143J77764j8447Q1955R8937K72528J11012m4695J44207J58595l98575
9259C15927j40391N6115P2305K20039j62348j58999J06021J3148j5702r4765q0831
9248A30519k9867p583K55084M1781J43269m11740j42924p3983K4519J09735l7144
9237A666K2287j30339J51161J08259j89607k9874K3741J51575m522l8810j32615
9226f7078l83755M736K31496Q062M8783L09609J34497j6541J14691K00712j19486
9215D65726j59233K5873k56055l9529j30630L3153P5000Q3423J3251K1216p8410
9204E3785Q0414M3791j61158p3013q9413j67722k03841J8064J54000O4404J04987
$$ plain form
9281 526506 453009 323793 421146 339492 200375 66781 50763 106902 198982 -70901 -352497
9270 -352497 -267354 -89590 -108037 -26082 72855 345383 456395 411700 555907 714502 315927
9259 315927 175536 231651 303956 523995 361647 202648 308669 321817 306115 211350 130519
9248 130519 100652 93069 348153 389934 533203 121463 -21461 -95444 -70925 38810 1666
9237 1666 23953 -106386 44775 153034 -36573 -66447 -42706 108869 104347 65537 -67078
9226 -67078 -450833 -446097 -214601 -206539 -157756 151853 286350 269809 384500 585212 465726
9215 465726 306493 332366 76311 36782 -93848 -60695 14305 97728 110979 132195 53785
9204 53785 134199 177990 16832 -56181 -145594 -313316 -517157 -499093 -345093 -280689 -175702
9193a75702J16735J13891l3728j14606p1183K07397j00908j55030j69179K32124
9183a50189K84973j92942q0246J40148M25940L0547k52902j10171m392R5497k79238
9172i2975j00236L33936O8082k01214M7657k30955K44538P4253j50539Q8247j58952
9161g8158J10136O8430k37672k37221o610R4343M0081P2129P2126J23375j02550
9150h1591K578J11818P2253k13300j46971R0688J92603J75085K05571k58320k05442
9139e5028L4780J11861K5593J51334R538J3871L49973J02170O3747Q1986k64463
9128F25362k78041j49515P1938O7605L8893j0768l19051r9376K71728J65475J06688
9117D90938j18715j38421J09410Q5312j08741M0886L25631m17365k70341J50077
$$ plain form
9193 -175702 -58967 54924 21196 -93410 -164593 42804 -58104 -213134 -382313 -150189
9183 -150189 134784 -58158 -138404 1744 427684 458231 205329 95158 90766 186263 -92975
9172 -92975 -193211 140725 208807 7593 55250 -175705 68833 143086 -7453 80794 -78158
9161 -78158 31978 100408 -137264 -374485 -381095 -286752 -246671 -174542 -102416 20959 -81591
9150 -81591 -79013 32805 105058 -108242 -255213 -164525 28078 203163 408734 150414 -55028
9139 -55028 -20248 91613 117206 268540 278078 291949 641922 744092 807839 889825 625362
9128 625362 347321 197806 269744 337349 376242 365474 46423 -52953 218775 384250 490938
9117 490938 372223 233802 343212 428524 319783 360669 686300 268935 -1406 148671
9107A48671j36184m9778J7606O4024J03662J59090n9178j94230O4379J36711J16432
9096C71205L9566l02529m04523k69023n951K46562L44851Q7493O5761n2580j89666
9085f8834R641J29299J74046J13668j90771k12008J26333k9192J2166M6443p9074
9074C1717k0599L9277J29345Q1844j88624j69594j1440J20371J62122n0987O525
9063A29957R6426k34749R1161j48610K72030K03776j35623m1275k110P5409P4427
9052C80819k99373k58058J62911o8479K4901J25352j73502j37509j45466J70012
9042b18392N567n0260M49432J86420p3212r142j37621l28823m8203L9521J36483
9031d8230k9116J0970K9781r101K35412j98255m5701k23126M6020R0526n2641
$$ plain form
9107 148671 12487 -37291 -19685 44339 148001 307091 247913 53683 118062 254773 371205
9096 371205 410771 108242 -296281 -565304 -571255 -324693 20158 107651 173412 120832 -68834
9085 -68834 -59193 70106 244152 357820 167049 -44959 81374 52182 64348 110791 31717
9074 31717 11118 50395 179740 261584 72960 -96634 -108074 12297 174419 123432 129957
9063 129957 226383 -8366 82795 -65815 206215 409991 274368 233093 230983 306392 380819
9052 380819 81446 -176612 -13701 -82180 -57279 68073 -105429 -242938 -388404 -218392
9042 -218392 -212825 -263085 186347 372767 299555 290413 152792 -176031 -224234 -184713 -48230
9031 -48230 -77346 -66376 -36595 -45696 189716 -8539 -54240 -277366 -231346 -140820 -193461
9020a93461K46005j39633j9008L17554j16975k37395R1830L20220k57427j9991
9010h281K12613M43J20450J63238r1702o7804P0317R1501J11586P8997k25723
8999D55635q3426j5590k01464k59681N9K70509J29540R7576K8354J43328o226
8988E58614j55715j5303l13539m6785J48837J08657j68638j59982l4786K64058
8978A85418j619l6736j69398m8044K2312O6001J32085J05302J38869Q4513p6890
8967D01813p3293k99033k81732k42829L02679K64679P1090K5138r5721r745J95824
8956B58870J2313j82116K42865J88520J7982j60480o5704j77477q5597L20551
8946C69727K02538L4713m9752m2992q6040j24676k0951l42068P8344O8694O9315
$$ plain form
9020 -193461 52544 -87089 -106097 211457 94482 -142913 -51083 269137 11710 -8281
9010 -8281 204332 204775 325225 488463 396761 328957 399274 490775 602361 681358 455635
8999 455635 372209 356619 155155 -104526 -104467 166042 295582 393158 421512 564840 558614
8988 558614 402899 387596 74057 27272 176109 284766 116128 -43854 -78640 185418
8978 185418 183799 147063 -22335 -70379 -48067 17934 150019 255321 394190 478703 401813
8967 401813 328520 29487 -252245 -495074 -192395 72284 143374 168512 72791 63046 258870
8956 258870 271183 89067 331932 520452 538434 377954 312250 134773 49176 369727
8946 369727 572265 606978 557226 514234 428194 303518 282567 -59501 18843 87537 156852
8935A56852K4567k78698r0995P601J48627Q6199p2968K16507L9760k11261m2986
8924a6795R6307P7030m8154J26961R8971j91242k61452J30897R0149k002n4804
8913D5866k1107k68337J04384K34087J25282j14006k01464J69264k0781k87736
8903b34548R7224P5109R5388k68805m9591K33627J57285P0840K08833R5419K05610
8892F86391L63580Q6177n1790k03014k51671r7860k58288j09309J3085J15195
8882B92496J92814q8045J26514l59481j5350K6239O2965K184J43466p7674Q8235
8871C94363J20421r1849k07139m4674J25387j40761p2603k50838P4379J7984K02265
8860A26935P2881J58456k2323k91469k22648J59284J69317J23231j93103L8823
$$ plain form
8935 156852 181419 -97279 -188274 -180673 -32046 54153 -18815 197692 237452 26191 -16795
8924 -16795 79512 156542 108388 235349 334320 143078 -118374 12523 102672 100670 45866
8913 45866 24759 -243578 -139194 94893 220175 106169 -95295 73969 53188 -234548
8903 -234548 -137324 -62215 33173 -235632 -285223 -51596 105689 176529 385362 480781 686391
8892 686391 1049971 1136148 1084358 881344 629673 531813 273525 164216 177301 292496
8882 292496 485310 397265 523779 164298 148948 175187 238152 240336 383802 306128 394363
8871 394363 514784 422935 215796 171122 296509 155748 83145 -167693 -93314 -75330 126935
8860 126935 199816 358272 335949 44480 -178168 -18884 150433 273664 80561 119384
8850A19384J06305N4711j26385P2285k39308j52354k93341j43393J03152J04967
8840c93977Q0525l4384M09210J89818m7403j10647r7183j0455Q7505J46554J4945
8829B34508r3178R1494j01703o0338J6815K85411J30448J27651k89517K5573J79739
8818E46903l5244K9407n2122k35267J60390J18557j11865j94851J26649j72247
8808A80310q4994l1849o273J28652J57088k37588j77952j03300K33702J23164
8798A80960J49369N7848J46886k48827l91186j45963R4336J69133m9805k33909
8788b71158J93406J92123J70124p9495q0339k9311K763M3567M3844j94585J67832
8777A58771j43329j81860K05239q6382j10437J01830J26973j49185j06468K21234
$$ plain form
8850 119384 225689 280400 154015 226300 -13008 -165362 -458703 -602096 -498944 -393977
8840 -393977 -313452 -347836 61374 251192 203789 93142 -4041 -14496 73009 219563 234508
8829 234508 141330 232824 131121 70783 87598 373009 503457 631108 341591 367164 546903
8818 546903 511659 541066 488944 253677 414067 532624 420759 225908 352557 180310
8808 180310 95316 63467 57194 185846 342934 105346 -72606 -175906 57796 180960
8798 180960 330329 388177 535063 286236 -104950 -250913 -156577 12556 -37249 -271158
8788 -271158 -77752 114371 284495 205000 124661 95350 98113 141680 185524 -9061 158771
8777 158771 15442 -166418 38821 -47561 -157998 -56168 70805 -78380 -184848 36386
8767C6386K78932k34114k34639O2746J47021J65743J01281l073k95225j08379
8757h3321J18522q961o3570j63854K03431P1592J05522J67330J92367N1582k59287
8746C31353k9060M9816j23427M3499p4640R3896n6339k14258p0963L16676Q8696
8735C55249Q316k91929j30396N99211r549j91534p3703p9559Q4125l8990N6710
8724B87951n74J46363m7693p7272P2579o0843j56898r8777L1925K17195j68123
8713A45833j97751N8067O9165l8641l7240J15068L50445L05738k39018j08058
8703D23608J0055n4282l6770l2476O808L5608K3087j07018o3503K0630o0066J3175
8691A78856j8436m65395K77834k4165j38814n1822j05205k83196m3617J09009
$$ plain form
8767 36386 315318 81204 -153435 -90689 56332 222075 323356 320283 25058 -83321
8757 -83321 35201 26240 -37330 -201184 2247 73839 179361 346691 539058 590640 331353
8746 331353 302293 352109 228682 272181 197541 291437 235098 20840 -50123 266553 355249
8735 355249 363565 71636 -58760 540451 530902 339368 265665 186106 270231 231241 287951
8724 287951 287377 433740 386047 308775 381354 320511 163613 64836 96761 313956 145833
8713 145833 -51918 6149 75314 36673 -567 114501 464946 770684 531666 423608
8703 423608 433663 379381 342611 310135 316943 352551 375638 268620 205117 225747 165681 178856
8691 178856 160420 -304975 -27141 -51306 -190120 -241942 -347147 -630343 -673960 -564951
8681e64951J43086J32567L70832L89680O5752o320P492k69774R6698o0302k89128
8670A5632k24217l4325J45059J82448K29107p4214o0331M4392p9558m2004o7151
8659C4838J14156k0041N1798j73140l2750j07931j1423J83159o3031m385J42623
8648A13873J58421J5154M9813N7331N94j05804O7157Q8327J41014o4466k44710
8637B76704j72627K28926J50673J1097k4888k01683k21581j62114K12702o4657
8627C2552J0174o3795j12460k37331J01060M2916L8966J12902O9785q2632j28325
8616b16188N1027k2601j35876j15971j20841J73505J51084M43425L08225l62841
8606A52948l37529j12249l2125O6435J79433J19638j46273k0707J01184J15776
$$ plain form
8681 -564951 -421865 -289298 81534 471214 536966 530646 538138 268364 365062 304760 15632
8670 15632 -208585 -242910 -97851 84597 313704 239490 179159 223551 143993 101989 34838
8659 34838 148994 128953 180751 7611 -25139 -133070 -144493 38666 -24365 -28750 113873
8648 113873 272294 287448 337261 394592 395186 289382 356539 444866 585880 521414 276704
8637 276704 104077 333003 483676 494773 469885 268202 46621 -115493 97209 32552
8627 32552 42726 -21069 -133529 -370860 -269800 -226884 -187918 -75016 -5231 -87863 -216188
8616 -216188 -165161 -187762 -323638 -439609 -560450 -386945 -235861 207564 515789 152948
8606 152948 -184581 -296830 -328955 -262520 -83087 36551 -109722 -130429 -29245 86531
8596H6531k21288q6572R9259n329O7398m5511k7641L5974K3108m3973R5654N7160
8584C4770J12723k6289J43328l8878K5014k47620k14092Q154J09786K35115j11628
8573C0383K4912k09358L4549M34843O7182k73870j62807J3397k48558O1924J55871
8562g1532N9551Q7657k43086N2632J23976M9889o6848j21077p5330K85516K12552
8551B93900k00061n4858l00146k2226J56410n8349k40520N6798L27469J78583
8541A37000k13671R1476L1741l7036R4779n79P396K33483J66959n6488l38494
8530A16566j16112Q4804j27274n309N6830L721j48888j62818j57047J94007K90692
8519B9172j55399R8613K69575k6386L5043K231j06991K50654j16964J05132l28777
$$ plain form
8596 86531 -134757 -221329 -122070 -127399 -60001 -105512 -133153 -97179 -74071 -118044 -22390 34770
8584 34770 147493 121204 264532 225654 250668 3048 -211044 -202890 -93104 142011 30383
8573 30383 55295 -154063 -119514 315329 382511 108641 -54166 -40769 -289327 -227403 -71532
8562 -71532 -11981 75676 -167410 -114778 9198 59087 -7761 -128838 -204168 81348 293900
8551 293900 93839 38981 -261165 -283391 -126981 -185330 -425850 -369052 -41583 137000
8541 137000 -76671 14805 46546 9510 104289 103710 111106 344589 511548 455060 116566
8530 116566 454 85258 -42016 -47325 9505 13226 -135662 -298480 -455527 -261520 29172
8519 29172 -126227 -27614 241961 215575 250618 252849 145858 396512 279548 384680 55903
8508E5903q6514K75246q7499k58115j82500J16392J0271J83813K63220N5975j11850
8497B34342j68781M5440L12630j59473k50891q5992J09791J24637P9979J11346
8487C53028j22949J4881K93255K42886N8321k64463n6752k40011j26132Q867j14769
8476D6162J32142r9852K11726P8936p3594K00934K7103M6725M3023O0881k45645
8465D28541j2125L497P2941L9688o4326k54319n9679R5735m1284j40621J58349
8454B26397k055r8211j41167k2936K09563r0544j52240J97486L20283j46880k43926
8443E5770j32234l39893k06988J71560L94012L72716j21435l60824j69341K51023
8433h5634O5613r7964J52468K36363K61361J07597j79197l05496k30417n5568
$$ plain form
8508 55903 -30611 244635 157136 -100979 -283479 -167087 -156816 26997 290217 346192 234342
8497 234342 65561 111001 423631 264158 13267 -72725 37066 161703 241682 353028
8487 353028 230079 244960 538215 781101 839422 574959 518207 278196 152064 160931 46162
8476 46162 178304 78452 290178 369114 295520 496454 523557 570282 613305 674186 428541
8465 428541 416416 419913 492854 532542 468216 213897 154218 249953 208669 68048 226397
8454 226397 224342 126131 -15036 -37972 171591 81047 -71193 126293 446576 299696 55770
8443 55770 -76464 -416357 -623345 -451785 -57773 314943 193508 -167316 -336657 -85634
8433 -85634 -20021 -117985 34483 270846 532207 639804 460607 155111 -75306 -130874
8423a30874p0993L69311J63018p3346q3836P5289R4823J76559l6617l12648j26310
8412D4376q127K09835J2362r7839j05553J39408J38263j55251O6585k8644j59780
8401E5635k78449j18179K04890N6802j30200p3255J07140K51517K15701m4552
8391B47050j81916k52477j31841K9150J48053j50736n469J93854J66770M9180
8381A11618N9372J12522P6651p2403R3981p2642O3837j09837k75865K804M2728
8370C2766j26805q9518J11094J26973P4338K13876J23524j35064o39185k40314
8360e48315K19509o026J70078Q1645r6554k56386k33105Q5722Q6020r484J03948
8349d02948L12427J41338k10339j15755k0682j04023K58461q2309J52555J72781
$$ plain form
8423 -130874 -201867 167444 330462 257116 173280 248569 343392 519951 483334 170686 44376
8412 44376 36249 246084 258446 160607 55054 194462 332725 177474 244059 215415 55635
8401 55635 -222814 -340993 -136103 -79301 -209501 -282756 -175616 75901 291602 247050
8391 247050 65134 -187343 -319184 -290034 -141981 -292717 -298186 -104332 62438 111618
8381 111618 170990 283512 360163 287760 381741 309099 372936 263099 -12766 -9962 32766
8370 32766 -94039 -183557 -72463 54510 128848 342724 466248 331184 -308001 -548315
8360 -548315 -328806 -334832 -164754 -83109 -179663 -436049 -669154 -583432 -497412 -506896 -402948
8349 -402948 -90521 50817 -159522 -275277 -295959 -399982 -141521 -223830 -71275 101506
8339A01506Q3484k71970J41731K57484P0636j94226j4285n0552j5838K31202j36413
8328B02759j30165n8355j87039n8676J89097Q0709k579j25030J42164K02914R440
8317B65239r7501j73636K88975J62814k14110p7102L1192P3702J65305k79149
8307A45729l88065K60533J82635P7272k24962m28964p1550m1509R2044j142J29743
8296b68236P10n3770K81526Q7702r0752n5780P0257J15451J14402j63027k7618
8285A0865J0974k6450j1194o0987p989J20243l85579K54007L20041q9795j45093
8274a0957J46870J61397q9272m8851p2041j3328k78214j27316K10211j8591J52068
8263A1976L79215M6920J0819k39210k49074J02043r7002j42563l1272M7262K09687
$$ plain form
8339 101506 184990 -86980 54751 312235 382871 188645 174360 123808 107970 339172 202759
8328 202759 72594 14239 -172800 -231476 -42379 38330 35751 -89279 52885 255799 265239
8317 265239 167738 -5898 283077 445891 231781 154679 185871 259573 424878 145729
8307 145729 -242336 18197 200832 278104 53142 -375822 -447372 -488881 -396837 -397979 -268236
8296 -268236 -267526 -321296 -39770 47932 -42820 -98600 -28343 87108 201510 38483 10865
8285 10865 21839 -4611 -15805 -76792 -84781 35462 -350117 -96110 223931 134136 -10957
8274 -10957 135913 297310 208038 159187 87146 73818 -204396 -331712 -121501 -140092 11976
8263 11976 391191 438111 448930 209720 -39354 62689 -34313 -176876 -208148 -160886 48801
8252D8801K75493N2582j78358o5108j24830j57980J23604K50672J66969O1022
8242D52867j74136j62077j56609p4810J4880r9357o1715k6359n5362K70575k04815
8231b76918K03517J37856j90422j99568J37676J75377j15040Q2412J21083L7967
8221A13940k83557j38404J48250J26654K55063Q3130k4879m00133k44195N2447
8211c11684Q3291n4899N0386K09460j76337P9102J54826k73544k47016k3827J44800
8200c65442J49418K45674L22186K02316r8689j44250L08198J8276l90259q8950
8190A58478j023k24080j80343L14954L20943J2664l22853k95369O4363j6285J98560
8179C0009q2142j87231J85026J31306l9757M4301L2842K0631J31404j40490K5086
$$ plain form
8252 48801 324294 376876 198518 133410 8580 -149400 -25796 224876 391845 452867
8242 452867 278731 116654 -39955 -114765 -99885 -199242 -260957 -287316 -342678 -72103 -276918
8231 -276918 -73401 64455 -125967 -325535 -187859 -12482 -127522 -45110 75973 113940
8221 113940 -169617 -308021 -159771 -33117 221946 305076 280197 -119936 -364131 -311684
8211 -311684 -228393 -283292 -232906 -23446 -199783 -120681 34145 -239399 -486415 -510242 -365442
8200 -365442 -216024 29650 351836 554152 455463 311213 619411 637687 247428 158478
8190 158478 157455 -66625 -246968 67986 388929 401593 78740 -216629 -152266 -168551 30009
8179 30009 -52133 -239364 -54338 76968 37211 81512 114354 134985 266389 125899 150985
8168A50985k69701k06931j09109k3789J87205K03093J73055j60185K44621j80142
8158I102k05549N6603J81027K52804J75715j26958l66950j3343L1363k9233m7073
8147h2492j34971j82568p467M19104r1555l31879j63279k49744j21366N27969
8137d18248K99537m11686K17544K52153J1329n2566m4332j56621j26560K47572
8127a81878K8247k65805k04937j02993M39277N66075L70327J00590l23748l51874
8117G3281k27448L4401K14198j05555j56177K140J6672j13170k6875K6932M5535
8106b16066K77136L20653K74593k14285j97738q8746k93455j95054j56464J16408
8096c73018J83346J22226l08483j13999K42090J2737k06958r9842j08789n9997
$$ plain form
8168 150985 -118716 -325647 -434756 -458545 -271340 -68247 104808 -55377 189244 9102
8158 9102 -196447 -139844 41183 293987 469702 342744 -24206 -37549 -6186 -35419 -82492
8147 -82492 -217463 -400031 -407498 11606 -79949 -411828 -575107 -824851 -946217 -418248
8137 -418248 -118711 -530397 -312853 -60700 -49371 -101937 -146269 -302890 -429450 -181878
8127 -181878 -153631 -419436 -624373 -727366 -288089 277986 648313 748903 425155 73281
8117 73281 -154167 -119766 94432 -11123 -167300 -165160 -148488 -261658 -288533 -261601 -216066
8106 -216066 61070 381723 656316 442031 244293 155547 -137908 -332962 -489426 -373018
8096 -373018 -189672 -67446 -375929 -489928 -247838 -235101 -442059 -541901 -650690 -710687
8086g10687M84033J27161M4318o5959k42902o5297K497k73J49768j28259L92092
8075a3508j88235j55576K22278Q5321j7520p0446J61300k28851j55165K39770
8065a20632J24174l38930j00260J36448N9532J89446J58370k01645J348K31469
8055A39320P4061K4589l27258J48270o7415J7377l9634l2017K04313K5422M9448
8044B16476P4868l19055l03263j00077L13094K36002p5546j39722J39527R3415
8034A35719j84327j26414J36698J08560r9494q97l3673J3029J06951n8910j65648
8023a68406J48487j02810l53882M0171K42289L1691K04424r2418k74926J37398
8013a87982L3737o2842J6112j12045K47935j25717R4597L17573M4492M5757q66
$$ plain form
8086 -710687 -226654 -99493 -55175 -121134 -364036 -429333 -426836 -427109 -277341 -405600 -13508
8075 -13508 -201743 -357319 -135041 -49720 -67240 -137686 23614 -205237 -360402 -120632
8065 -120632 3542 -335388 -435648 -299200 -239668 -50222 108148 -93497 -92149 139320
8055 139320 213381 237970 -89288 58982 -8433 8944 -30690 -62707 141606 167028 216476
8044 216476 291344 -27711 -330974 -431051 -117957 118045 42499 -97223 42304 135719
8034 135719 -48608 -175022 -38324 70236 -29258 -30155 -63828 -50799 56152 -2758 -168406
8023 -168406 -19919 -122729 -476611 -436440 -194151 -162460 41964 -50454 -325380 -187982
8013 -187982 -154245 -217087 -200975 -313020 -65085 -190802 -96205 221368 265860 311617 310751
8002C10751l354J90346m3819q6961m32285m0072J27738K67703M5654J23410o0279
7991C98832l75502k75023K15692K73844K1512K1224j64873J773k15162k98682
7981c96365j77669j93352J96387J53165J08427J32347J65150m4789j23550q1740
7971b61989J42512M15119P2682m4289k57712m66645N6076L79904P5254j76883
7961f5971j50714L9543k18047j36155Q4900L53041J39954k52586K12667j2219
7951e587L1869j08073J55464J23926J80265k24940j60679p458j1734Q4735M5652
7940A03440o2600L999j33164k22315j15833M83364L88103p8294j03421m29757
7930a66478O289k252J03081J73169n7580j97688j97304J57577K77436Q7954r5019
$$ plain form
8002 310751 307397 497743 453924 366963 -65322 -105394 22344 290047 335701 459111 398832
7991 398832 23330 -251693 -36001 237843 259355 280579 115706 117479 -97683 -396365
7981 -396365 -574034 -767386 -570999 -417834 -309407 -177060 -11910 -56699 -180249 -261989
7971 -261989 -119477 295642 368324 324035 66323 -400322 -344246 35658 110912 -65971
7961 -65971 -216685 -177142 -395189 -531344 -446444 -93403 46551 -206035 6632 -5587
7951 -5587 26282 -81791 73673 197599 377864 152924 -7755 -15213 -26947 57788 103440
7940 103440 40840 44839 -88325 -310640 -426473 56891 444994 366700 263279 -166478
7930 -166478 -160189 -162441 -59360 113809 56229 -141459 -338763 -181186 96250 184204 89185
7919H9185j57613O7123J92248r5410J96397J08661k16959j29798J1073j28990
7909f4083P0877J92881l2087j72402J12790P4372q2019j62624P0163J45028j12814
7898D0082o0431k93204m6270J01393J0092o8637j42150n0750J91565J70588J38377
7887i345n5812k58521n8650K53510L5316j79189j17888k11390J67752k3313o539
7876d64069J35367j10367j8341J96869J93093J27740M2807J2229o8021q3882n5640
7865i2215n7433J7111Q6313l6648j25159j57029J3318j75666j32685j46263J42166
7854f64190K61025J72847K18357J14982J9633n5269O332O9030L5933k92154k72397
7843c85871K11969K23936J40935L4905J5093l43850m20771J85812K92528j36k8982
$$ plain form
7919 89185 -68428 -1305 190943 95533 291930 400591 183632 53834 64907 -64083
7909 -64083 6794 199675 167588 -4814 107976 182348 100329 -62295 7868 152896 40082
7898 40082 -20349 -313553 -359823 -258430 -248338 -316975 -459125 -509875 -318310 -147722 -9345
7887 -9345 -65157 -323678 -382328 -128818 -93502 -272691 -390579 -601969 -434217 -457530 -464069
7876 -464069 -328702 -439069 -457410 -260541 -67448 60292 103099 115328 47307 -36575 -92215
7865 -92215 -149648 -132537 -46224 -82872 -208031 -365060 -351742 -527408 -660093 -806356 -664190
7854 -664190 -403165 -230318 -11961 103021 122654 67385 73717 142747 178680 -113474 -385871
7843 -385871 -173902 50034 190969 225874 240967 -102883 -523654 -337842 -45314 -45450 -74432
7832g4432j63080M5549q7426K30485K25636j28781r610J40170J43752J49892N0562
7821E22717k32645j88401p5447q2600P0010j50419k40593K28323J40074l0778
7811c9759k28503O1582K01506o7997j10098J44898J73927k73227j19798J00551
7801a56918J40033o8737j23936j18423O9036q475oj5131O8769Q3504l67515k07098
7789g04897J97758K73008K40117N9560L0870K34437J01811j02418k50925j52622
7779g3301o4140J02962K52582j98640r4554J01302Q5445k15953K82579j64011
7769A4271r6912J47955j01101J89507k01136j47909J74440J41814M6033M0558
7759B07520K03934r6988l32927j91876q2931R1264o2685J31323K4160Q5842j31287
$$ plain form
7832 -74432 -237512 -191963 -279389 -48904 176732 47951 38341 178511 322263 472155 522717
7821 522717 290072 101671 26224 -56376 13634 -136785 -377378 -149055 -8981 -39759
7811 -39759 -268262 -206680 -5174 -73171 -183269 -38371 135556 -137671 -257469 -156918
7801 -156918 -16885 -85622 -209558 -327981 -258945 -267420 -267426 -282557 -213788 -130284 -497799 -704897
7789 -704897 -507139 -234131 5986 65546 96416 330853 432664 330246 79321 -73301
7779 -73301 -137441 -34479 218103 19463 -75091 26211 111656 -104297 178282 14271
7769 14271 -82641 65314 -35787 153720 -47416 -195325 -20885 120929 166962 207520
7759 207520 411454 314466 -18461 -210337 -293268 -202004 -264689 -133366 -109206 -23364 -154651
7748a54651J08000P8650Q6076J56869j42417k72191L7375K67166k47210j99701
7738b82034K30379N7605j4298R6721j82436j71542j58789j25478P3201L07646
7728a69025J07636N5493k9848j02591q5652o8561J07158k45904m1797L54587K19882
7717A01378j9537j44352m4256q5957r1818K22405J88563r7894r4242J41791M4797
7706A20878k3299j286K44639o2986k24652o8159O4876M8806p9996J1962K934p8723
7694d5006o6541j33762Q3926K61047L1309j2804M7193k34379k13762j79980J15479
7683c47280K08136J39172l4498N3901j39163J11609j80290N3613L65405R7456
7673C28061k34475j07266l6019J63738K5291Q4471o7086l4065N7454k39735m1204
$$ plain form
7748 -154651 -46651 31999 118075 274944 132527 -139664 -102289 164877 -82333 -282034
7738 -282034 -51655 5950 -8348 88373 -94063 -265605 -424394 -549872 -476671 -169025
7728 -169025 -61389 -5896 -35744 -138335 -223987 -292548 -185390 -431294 -473091 -118504 101378
7717 101378 81841 -62511 -106767 -192724 -284542 -62137 126426 28532 -65710 76081 120878
7706 120878 97579 96293 340932 277946 53294 -14865 50011 98817 18821 30783 33717 -45006
7694 -45006 -111547 -245309 -161383 99664 130973 118169 165362 -69017 -282779 -462759 -347280
7683 -347280 -139144 28 -34470 19431 -119732 -8123 -188413 -134800 230605 328061
7673 328061 93586 -13680 -49699 114039 139330 223801 156715 122650 180104 -59631 -100835
7662a00835L0756j38504k138Q5772J01681K4067k6762N89r359N2906j65927P7870
7650f9884l0298o1365m5726l05267j38649L11988K1645L1993O4549K9250J02225
7639h9539O4263k4206J10661J16280o0363n8954j47945p1800j93132n6459l4807
7628d46001J40600J04891K44404o7796j24084j21334O3513k59608j16149P9578
7618e01986J08853L58200L81158J2004k81042M0637q8226n2079K08412k1052j21777
7607D3102R5075J588j73579q6967l5677j4954j43146r6642J39899K14771j13139
7596a69669K1485L22279k02344j27953J06241r817j50349j52475J89k1082m6826
7585d30321K38450J26624l06034k65942K66326J62184l4715N2359J35563J33611
$$ plain form
7662 -100835 -70079 -208583 -210721 -124949 -23268 799 -25963 -25374 -34733 18173 -147754 -69884
7650 -69884 -100182 -161547 -207273 -512540 -651189 -339201 -317556 -285563 -221014 -191764 -89539
7639 -89539 -25276 -49482 61179 177459 117096 58142 -89803 -161603 -354735 -411194 -446001
7628 -446001 -305401 -200510 43894 -23902 -147986 -269320 -205807 -465415 -581564 -501986
7618 -501986 -393133 -34933 346225 358229 77187 117824 29598 -22481 185931 164879 43102
7607 43102 138177 139765 -33814 -120781 -156458 -171412 -314558 -411200 -271301 -56530 -169669
7596 -169669 -148184 174095 -28249 -156202 -49961 -59778 -210127 -362602 -362413 -383495 -430321
7585 -430321 -191871 -65247 -371281 -637223 -370897 -208713 -243428 -191069 -55506 78105
7575G8105o7169J36511N8540k49348k99311k04620J70508K70501K42843j18180
7565A8380r2907k47252k21987J09983K09075J68458n3612k25010N3023L900J69257
7554a08692J3729J95838m3045k82360k43058M45617K10302k63817m13281m9944
7544e38711J21260p898O4498O2110K83237n1817P0409K55437m2889l00193j2716
7533i7273J28773L63062k59202q2931p4017j16880l4341M5115k4761m0429l1883
7522b24767p6650J12450J99232j02217K15945K61755N3621j72097L4292m9128
7512B52436l44420j65484J36491J53340n8264L8639K0209q1072k61832K03143
7502a06814K26028K7007O3098k62247j3498K92278J15650j85370j30972R3295
$$ plain form
7575 78105 10936 147447 205987 -43361 -342672 -547292 -376784 -106283 136560 18380
7565 18380 -74527 -321779 -543766 -433783 -224708 -56250 -109862 -334872 -281849 -277949 -108692
7554 -108692 -94963 100875 57830 -224530 -467588 -21971 188331 -75486 -488767 -538711
7544 -538711 -417451 -425349 -360851 -298741 -15504 -67321 3088 258525 215636 -84557 -97273
7533 -97273 31500 394562 135360 52429 -21588 -138468 -172809 -127694 -152455 -192884 -224767
7522 -224767 -301417 -188967 10265 -91952 123993 385748 439369 267272 301564 252436
7512 252436 -91984 -257468 -120977 32363 -25901 12738 32947 -48125 -309957 -106814
7502 -106814 119214 146221 209319 -52928 -66426 225852 341502 156132 25160 118455
7492A18455r7975j10326O9074J22481J01792K15544p3556j075j4600l7062l46395
7481e3643j09920J78806K05184K39128k24161j39069o0667J24287J55607l7143
7471B78409K2352J18923J39623n7230j85573j19287L9138M8711j73751Q1495m0790
7460A52020j8812j28992r7926L6450K72274j5827r5423j68913j94013j26968K7273
7449c58857Q3789j35782N9006o6475j18281j23304J63645J39015O8161R5433L311
7438a90339J7338p451j29484q043n6477n5624j26141J70809J29238j38806k80488
7427f75468O6249J32935J28063J30093j79867L1407P7096l2569P7441O9124J37388
7416c8108j4769J13936L7474K0026L4137j40093J01158m7729J91580J61128k37017
$$ plain form
7492 118455 20480 -89846 -20772 101709 203501 419045 345489 344414 329814 292752 -53643
7481 -53643 -163563 15243 220427 459555 235394 96325 35658 159945 315552 278409
7471 278409 300761 419684 559307 502077 316504 197217 236355 285066 111315 192810 152020
7460 152020 133208 4216 -93710 -57260 215014 199187 103764 -65149 -259162 -386130 -358857
7449 -358857 -275068 -410850 -351844 -418319 -536600 -659904 -496259 -357244 -289083 -193650 -190339
7438 -190339 -173001 -180452 -309936 -317979 -374456 -430080 -556221 -385412 -256174 -394980 -675468
7427 -675468 -609219 -476284 -348221 -218128 -397995 -366588 -289492 -322061 -244620 -175496 -38108
7416 -38108 -52877 61059 98533 118559 152696 12603 113761 66032 257612 418740 181723
7405A81723J6335j15845j51319L21797K7464j69457q9739J51797J34069Q4311
7395C91136k61301o2039l85895n9927N8276p1141J18464L2814n277Q0663O9926
7384i4301P6587O9206K76401j41731l85256j95208K17973J27358R8608j63848
7374a14211j78948N5872P7080K66202r7812m527p2862J85732J79898j00312j64041
7363C2071q6119J36277K4174O0416J4170j21360O9789m9772j91090J28002q530
7352H028Q6967J41701K4474j41797p8476o2143l013O9104J21362J04165n10962
7341b40590j07621L63903L25914K22865m6500j77269j23499j12423k51009Q788
7331a37441l3565J25237J48702O0906K1755k25890k29917R0395J16467k10662
$$ plain form
7405 181723 198058 82213 -69106 252691 280155 110698 20959 172756 306825 391136
7395 391136 129835 67796 -318099 -378026 -319750 -390891 -272427 -239613 -244890 -164227 -94301
7384 -94301 -17714 51492 327893 186162 -199094 -394302 -176329 -48971 49637 -114211
7374 -114211 -293159 -237287 -160207 105995 8183 3656 -69206 116526 296424 196112 32071
7363 32071 -54048 82229 106403 166819 180989 59629 129418 79646 -111444 16558 8028
7352 8028 94995 236696 261170 119373 40897 -21246 -24259 44845 166207 270372 -240590
7341 -240590 -348211 15692 341606 564471 517971 340702 217203 104780 -146229 -137441
7331 -137441 -171006 -45769 102933 163839 185594 -40296 -270213 -179818 -63351 -274013
7321b74013K7469j54755M0036L7347k05921Q4913J62843K5655N5442j33528K37952
7310i6560J94673j46182K91372J12870O2237j60662j44016M4043J9911q7363l24624
7299b34301m4845k19973k3069j62346R0303K28349k7514J39667J26207K01543
7289G4021N540J37098P6918M9119P3226j0706j85238j73030j11230J00989j78576
7278a41869j95036J17422J32754j01767j44839Q966J08175j51866J2950P7560
7268b77550R915k0681o5635K5726L6414L31980j77693q0343n4437j88319K71753
7257a88870J11750j61832o1250j7626j70976r4949r0832J10333J0791J19923K53739
7246a79799K6202J44947J64015j51170J0732j10486j97195j38646K3656J76998
$$ plain form
7321 -274013 -246544 -401299 -361263 -323916 -529837 -444924 -282081 -256426 -200984 -334512 -96560
7310 -96560 98113 -48069 243303 356173 418410 257748 113732 157775 177686 90323 -234301
7299 -234301 -279146 -499119 -522188 -684534 -594231 -365882 -393396 -253729 -127522 74021
7289 74021 79561 216659 293577 342696 415922 405216 219978 46948 -64282 36707 -141869
7278 -141869 -336905 -219483 -86729 -188496 -333335 -324369 -216194 -368060 -355110 -277550
7268 -277550 -267635 -288316 -353951 -328225 -291811 40169 -137524 -217867 -272304 -460623 -188870
7257 -188870 -77120 -238952 -300202 -317828 -488804 -583753 -674585 -564252 -553461 -433538 -179799
7246 -179799 -153597 -8650 155365 4195 14927 -95559 -292754 -431400 -407744 -230746
7236b30746R9260k44262J27495J13582q9470r9858J40028P8187R4630K18467r9889
7225A07424k28475N8508P9098K7439J18604K23445O9177j76495k55140J1460j00133
7214f5088J42335R9855l0775k81598o3383M71227J38413m3708L6367k45969m0492
7203A17184J91095j57851k63737L5461j11509P7060J24746J71294k51859k27484
7193b95600K55783k1955j0894m873K3053J1569p9422K50065M1505m2380Q8580
7182B15431k09839j24849l6630j29404J46864n6879k48279l08112J88738J35992
7172d26967K20350O5920R2298M7811k29427k1060M5994J41006Q7126k78174j73779
7161d28902M1731m0664J8536K33062J86348m178J53475P192k89545k26652q7992
$$ plain form
7236 -230746 -131486 -375748 -248253 -134671 -224141 -323999 -183971 -105784 -11154 207313 107424
7225 107424 -121051 -62543 16555 43994 162598 386043 455220 278725 23585 35045 -65088
7214 -65088 77247 177102 146327 -135271 -198654 272573 410986 367278 403645 157676 117184
7203 117184 308279 150428 -113309 -77848 -189357 -112297 12449 183743 -68116 -295600
7193 -295600 -39817 -61772 -72666 -77539 -54486 -42917 -122339 127726 169231 126851 215431
7182 215431 5592 -119257 -155887 -285291 -138427 -195306 -443585 -751697 -562959 -426967
7172 -426967 -206617 -140697 -48399 -588 -230015 -251075 -205081 -64075 23051 -255123 -428902
7161 -428902 -387171 -427835 -409299 -176237 10111 5933 159408 166600 -122945 -349597 -437589
7150d37589J03425K15537M57187J4520N5228j07399j42919k69281k20021J67424
7140a63888L7256P657m7253J91575J11317K8834Q4272j30933p8057J84536Q0272
7129C05588m27422J45283J57700K44730o9143k06086J59784j06243j11970l1554
7119F0667j17435k03537o9400k60135o6665J14460L22809K54645q1200k92835
7109c38626J21154K29714K98304J04781n5012j05812j65850k2161j98326K2419
7099a09415K14937N8192O2604J16271j69138k61402j17037j21260J18163j7909
7089b25994j5473J14786K37310K15952l26372l73898r396J38905J05589k5055
7079a63646O4226J54653r5415M4056J35432J98330j8470o3290J01040j84791k42643
$$ plain form
7150 -437589 -334164 -118627 338560 353080 408308 300909 157990 -111291 -331312 -163888
7140 -163888 -126632 -118975 -166228 25347 136664 165498 249770 118837 40780 225316 305588
7129 305588 -121834 23449 181149 425879 356736 150650 310434 204191 92221 60667
7119 60667 -56768 -260305 -329705 -589840 -656505 -542045 -219236 35409 -45791 -338626
7109 -338626 -217472 12242 310546 415327 360315 254503 88653 66492 -131834 -109415
7099 -109415 105522 163714 226318 342589 173451 -87951 -204988 -326248 -208085 -225994
7089 -225994 -241467 -126681 110629 326581 209 -373689 -383085 -244180 -138591 -163646
7079 -163646 -99420 55233 -40182 3874 139306 337636 319166 255876 356916 172125 -70518
7068g0518l0998K3214M7332J92837j43333k12110m1685K3387K27225K8549k42024
7057a98124J5230J68229O8113j11983j76182K5824R099l26297k83551K83089L98533
7046a28020k7630l84309k27476o8641L46270L41047M65143J67339k32791K03413
7036D54345k01028k62810j60463p8006J1782j37319L51601K40883k26416J06632
7026I9201J83150r2600l65550l474R4677K1582N9063K70825K09097J0671j22703
7015C63939l06942N3503l2297j89149k40174p9144Q6284P8995j4363j88808m2273
7004e10429K61176J04460j39825O5918L08593J6053j7745j49406j35511J51911
6994d4805j93401l4859j45453J94622J46780Q047K03525K62366k39457k27605
$$ plain form
7068 -70518 -101516 -78302 -30970 161867 18534 -193576 -235261 -211874 15351 43900 -198124
7057 -198124 -182894 -14665 53448 -58535 -234717 -208893 -199794 -526091 -809642 -526553 -128020
7046 -128020 -155650 -539959 -767435 -836076 -489806 -148759 316384 483723 250932 454345
7036 454345 253317 -9493 -169956 -247962 -236180 -373499 -21898 218985 -7431 99201
7026 99201 282351 189751 -175799 -179273 -84596 -63014 -3951 266874 475971 486642 363939
7015 363939 56997 110500 78203 -110946 -351120 -430264 -343980 -264985 -279348 -468156 -510429
7004 -510429 -249253 -144793 -284618 -218700 89893 105946 88201 -61205 -196716 -44805
6994 -44805 -238206 -273065 -418518 -223896 -77116 -69069 134456 396822 157365 -70240
6984g0240L115m3214R8802j60247n6853K55898p8064J3740J93830k0026P6233
6973B12974K4601j00826J39525j09075j07233L8817k35894j3683J5760J26470
6963h564n2893K1589K00351K3506l9634J64765j25833k25591k09123j82693J19159
6952c14961J47200k31784M06456K28657k07931m2263Q2017P1033m2367k52960
6942a56903J45252K77382j68977j03088J32295Q9610p6077j23670r3575J19358
6932D1607Q7941j37113k40936r8380R7393p9845J07344J05863Q5387j6335K3670
6921b3404N8386m60964O6924K14959P6508O0448n7156O4899n6304L0424j30839
6910a56119M48479L25084k8251k24855l10139q8567N7374j30575j42557L1452
$$ plain form
6984 -70240 -67125 -110339 -11537 -171784 -228637 27261 -50803 -37063 156767 136741 212974
6973 212974 237575 136749 276274 167199 59966 98783 -137111 -150794 -135034 -8564
6963 -8564 -61457 -39868 160483 183989 144355 309120 183287 -42304 -251427 -434120 -314961
6952 -314961 -167761 -399545 6911 235568 27637 -14626 67391 138424 96057 -156903
6942 -156903 -11651 265731 96754 -6334 125961 215571 139494 15824 -77751 41607
6932 41607 129548 -7565 -248501 -346881 -249488 -329333 -221989 -116126 -30739 -47074 -23404
6921 -23404 34982 -425982 -359058 -144099 -67591 -7143 -64299 600 -55704 -25280 -156119
6910 -156119 292360 617444 589193 364338 54199 -34368 23006 -107569 -250126 -218674
6900b18674l9833N9632O7368L7237j69229j11620k583q850K47647N6224j13105
6889a95786J94344O1011n33569k05048K28545j22086P4841K03457J23834K6626
6879a43831j27176J3763Q3220k8840l5802k81105j53790J44318O2687K82105l3989
6868b18440J20069n4840k82844p1796K29397N3433j66639J15329J45614K84954
6858A54237j00817o6393L6856N2874k0622Q9156j4508j62841k26439j20240l46043
6847g24780J31270L19911J52079J67119o6478l3184r5421L30451k8784J7370l0800
6836A38753j96066j59355r7466J22490K39747Q3235j22406j39321p527k85973
6826d23889j78730J19062J19473L01490O1240k02425K591j20019L146Q3438K60469
$$ plain form
6900 -218674 -258507 -198875 -131507 -94270 -263499 -375119 -377702 -386552 -138905 -82681 -195786
6889 -195786 -1442 59569 -474000 -679048 -450503 -572589 -497748 -294291 -170457 -143831
6879 -143831 -271007 -257244 -174024 -202864 -238666 -519771 -673561 -529243 -466556 -184451 -218440
6868 -218440 -98371 -153211 -436055 -507851 -278454 -225021 -391660 -276331 -130717 154237
6858 154237 53420 -12973 23883 76757 56135 145291 130783 -32058 -258497 -378737 -724780
6847 -724780 -593510 -273599 -121520 45599 -20879 -54063 -149484 180967 152183 169553 138753
6836 138753 -57313 -216668 -314134 -191644 48103 131338 8932 -130389 -137916 -423889
6826 -423889 -602619 -483557 -364084 -62594 -1354 -203779 -201188 -321207 -318061 -234623 25846
6815B5846J46675p2287R299j3571j2180j31043j032J45873L71905J63175j96136
6804D36524k09615L0252k67947l22638R8382J51570P955p2833j29124Q7521o225
6793a96178P6840O1430K12722L61292k1662j69233k49340j20401M4126J10147
6783A09743l18079j34963P3478K4514P3714J25346L4453J13018j93177J17365
6773B5412J48062J29785L35649O1833q6787r6161l4218j31680J63476L21553l54933
6762D81991k60118m8202J33974o2183k30573j56090M1981n009M2509q2359o1362
6751b05441j07924J79716J96452L5689O895l1120O9938m3924k16703o4639R0660
6740i0401L1119K80808M2102q0935N057J2662O0746k11825J16899L7644j79927
$$ plain form
6815 25846 172521 100234 109533 95962 83782 -47261 -48293 97580 469485 632660 436524
6804 436524 226909 257161 -10786 -333424 -235042 -83472 -75517 -148350 -277474 -189953 -196178
6793 -196178 -119338 -57908 154814 516106 494444 325211 75871 -44530 -404 109743
6783 109743 -208336 -343299 -269821 -245307 -171593 -46247 -11794 101224 -91953 25412
6773 25412 173474 303259 638908 700741 613954 517793 483575 351895 515371 836924 481991
6762 481991 221873 173671 307645 245462 14889 -141201 -99220 -104229 -61720 -144079 -205441
6751 -205441 -313365 -133649 62803 98492 105387 74267 144205 100281 -116422 -181061 -90401
6740 -90401 -59282 221526 263628 182693 187750 200412 261158 49333 166232 203876 23949
6729B3949r9171L80225K93022k97677l19073j13527n6338r8995p0935J24217N6312
6718a77991q3146K44531L59531j84769j77089q447n6118M8788K9993k34530k44719
6707d83966l7231K22917P0126k1937M6119L24788J73806k22157J38552K87634
6697D98651K8305l81905k57607k71696N5280J31276J71030q1049J03999k67052
6687b70768N0385K62376J56830O0091O603O1759J9125k3972r9582j59011m26116
6676c62280R7724K60114m5135k9526J52366m1844j9047k42576J22532L8702j01056
6665a70026m0910k80298k3272P0989J68840L10537K82302j47177j1542K982l2185
6654A30240m1208j66126l89213Q7218p0095j6970J81878K32186J53880J99454
$$ plain form
6729 23949 -75222 305003 598025 300348 -18725 -132252 -188590 -287585 -358520 -234303 -177991
6718 -177991 -261137 -16606 342925 158156 -18933 -27380 -83498 -34710 -4717 -239247 -483966
6707 -483966 -521197 -298280 -228154 -250091 -203972 120816 294622 72465 211017 498651
6697 498651 526956 145051 -112556 -384252 -328972 -197696 -26666 -107715 -3716 -270768
6687 -270768 -220383 41993 198823 258914 265517 327276 346401 322429 222847 63836 -362280
6676 -362280 -264556 -4442 -49577 -79103 73263 31419 12372 -230204 -107672 -68970 -170026
6665 -170026 -210936 -491234 -514506 -443517 -274677 35860 318162 170985 159443 162425 130240
6654 130240 89032 -77094 -466307 -379089 -449184 -466154 -284276 -52090 101790 301244
6644C01244J11758M4276J78984O4327k00554j51621j71601K22543M1829k91066
6634A50119n3077q5885P7116L45929m163l35874k95360j69572R9290J10734J86252
6623B5509j41642j81669N5345n8893k75548Q5093J86139K43384j89362l21963
6613e73607K57283K45014K01028O5753j47671m35300n7309j37021K5555J67862
6603c88413K81396n5248l08054l48166O2459R4249K30274K06192L901j00598j60658
6592d82666K17368K82916P7953q0270k17409n1616q921O7984k0518k14729J68788
6581b61120K00701R5858L1938J11645k58194k31168q2011J2209K26973p6754O9305
6570a60618K09820m6455N5179N1763N4698j21743l86029J06564p1331k79733j862
$$ plain form
6644 301244 413002 457278 636262 700589 500035 348414 176813 399356 441185 150119
6634 150119 97042 11157 88273 434202 430039 94165 -201195 -370767 -271477 -160743 25509
6623 25509 -116133 -297802 -242457 -301350 -576898 -491805 -305666 -62282 -251644 -573607
6613 -573607 -316324 -71310 129718 195471 47800 -387500 -444809 -581830 -556275 -388413
6603 -388413 -107017 -162265 -470319 -818485 -756026 -661777 -431503 -225311 -221410 -322008 -482666
6592 -482666 -265298 17618 95571 15301 -202108 -253724 -262645 -194661 -215179 -429908 -261120
6581 -261120 -60419 35439 67377 179022 -79172 -310340 -392351 -380142 -153169 -229923 -160618
6570 -160618 49202 2747 57926 109689 164387 42644 -343385 -236821 -308152 -587885 -589747
6559e89747L76016K87623j00661l79020m4545K05341j0607J38722j9623k6243
6549a62744K48949J16414J9771j05496j23724j06007q2911n7700K82532n9084
6539c0000k27326O6113J34449J18000L03846j5644r7305O8754Q2033N5951l64464
6528I4407j6589R702l8780R7227j14707k17844n0382J73385J98746k3399k6646
6517H5120k11628N8583N8247K84741j63910j73823J19257J82622L57319k08073
6507C88455m36868k56517J54545J22738K7504L0402k14243L5873O7058K8899j63004
6496b15158j06802N8335K12934j00004O1422k22764m13918L50507K79999J54733
6486E9284k80667j02670J69693N960P5677r0873n3896j7618Q8565L8670j48531
$$ plain form
6559 -589747 -213731 73892 -26769 -405789 -450334 -244993 -255600 -116878 -136501 -162744
6549 -162744 86205 202619 222390 116894 -6830 -112837 -195748 -253448 29084 -30000
6539 -30000 -257326 -191213 -56764 61236 365082 349438 252133 320887 402920 458871 94407
6528 94407 77818 87520 48740 145967 31260 -186584 -236966 -63581 135165 111766 85120
6517 85120 -126508 -67925 -9678 275063 111153 -62670 56587 239209 596528 388455
6507 388455 -48413 -304930 -150385 -27647 -143 30259 -183984 -148111 -81053 -52154 -215158
6496 -215158 -321960 -263625 -50691 -150695 -89273 -312037 -725955 -375448 -95449 59284
6486 59284 -221383 -324053 -154360 -148400 -72723 -163596 -217492 -235110 -146545 -107875 -256406
6475b56406j45183J01945R5562M4161j52858j02811j2479J90366k09191J34240
6465c12654L02064J64258j95666j81861J86890j08089l7643L8571l04265n1461
6455d99856K07746N8212o4760J48742K1951l1841l58274j74085L93742R9811K56900
6444E8288P8729m9082L3383J62005j23261j54412J6496J01253j34880j3726m902
6433c0109m9108j11652q4525k38225J8945J84092K06165j09200r9322J38504M040
6422a70395N1338J30631n5929l31891Q7837J06258J0442j2117Q5340J30599n0212
6411a8099k06284j52361k48644r15L42901L16225L42198J10644j31255l45244
6401I166M2577R8317j59586j70732J71829K31834J09056l496j87262k76148n7153
$$ plain form
6475 -256406 -401589 -299644 -204082 -159921 -312779 -415590 -428069 -237703 -446894 -312654
6465 -312654 -10590 153668 -41998 -223859 -36969 -145058 -182701 -144130 -448395 -499856
6455 -499856 -292110 -233898 -298658 -149916 -127965 -159806 -518080 -692165 -298423 -198612 58288
6444 58288 137017 87935 121318 283323 160062 5650 22146 123399 -11481 -25207 -30109
6433 -30109 -79217 -190869 -275394 -513619 -494674 -310582 -104417 -213617 -312939 -174435 -170395
6422 -170395 -119057 11574 -44355 -376246 -288409 -182151 -171709 -183826 -98486 32113 -18099
6411 -18099 -224383 -376744 -625388 -626303 -283402 32823 375021 485665 354410 9166
6401 9166 51743 150060 -9526 -180258 -8429 223405 332461 328965 141703 -134445 -191598
6390a91598J1640l02542J54892L06293m1933K1063N4162k04272k61344R4118K01282
6379a58239J60315j14472N7917J97176J69417l07532r9567m0030J23352J15646
6369A03983K01857o9421k03679n1491J28974J88293n5054r335j38104k64518J45987
6358b2508J37108J07002L5504j67507j38654K34349M7282j35879J53963M1735
6348B92395j48505j80899k79049j17207J75211J34819m25423j74883N48272J59067
6338a6202J79726O1299J80248R1505k41986m7703J14838J54098j81151k58260
6328C6412q4908J13353j34681L38189J84736j92754l04889l4897J45535k60419
6318a94323m24076n4999J26151M29338K12309k23426j1889k9449j07994k17326
$$ plain form
6390 -191598 -179958 -482500 -327608 -21315 -63248 -42185 11977 -192295 -453639 -359521 -158239
6379 -158239 2076 -112396 -54479 142697 312114 4582 -94985 -135015 -11663 103983
6369 103983 305840 236419 32740 -18751 110223 298516 243462 234127 96023 -168495 -22508
6358 -22508 114600 221602 257106 89599 -49055 185294 232576 96697 250660 292395
6348 292395 143890 -37009 -316058 -433265 -258054 -123235 -548658 -723541 -175269 -16202
6338 -16202 163524 224823 405071 496576 254590 206887 321725 475823 294672 36412
6328 36412 -48496 64857 -69824 268365 453101 260347 -44542 -79439 66096 -194323
6318 -194323 -618399 -673398 -547247 -117909 94400 -129026 -140915 -170364 -278358 -495684
6308d95684n5354O0921L89794J24242K09426N4040j64653J07157P7234j70354
6298A36769J2993O1464J56703M2559p2792J07633M0315J65145K8651k06107j81742
6287B91591j10800k54769j9946j5687J7437M8327O4873Q0800J37615j60153L6855
6276A16143q8800j35304o6160J28188K58983J2058J1248q2322L8398j95495L9188
6265C6125J71224n0982J56798o8735j52914n3502k1923j11501r6797L9484n4479
6254b07202K24724J01230P1069L4807q8376j22927R258k4528n1303R414q1054
6243a24888J98087K5086k95255J78925J43822P8866O3271L8618q0426p9804o3627
6232H2675J46226j16776K00100l8382r064l77925P5978K04947j77862o3416q960
$$ plain form
6308 -495684 -551038 -490117 -100323 23919 233345 287385 122732 229889 307123 136769
6298 136769 149762 211226 367929 410488 337696 445329 485644 650789 679440 473333 291591
6287 291591 180791 -73978 -93924 -109611 -92174 -43847 21026 101826 239441 79288 116143
6276 116143 27343 -107961 -174121 -45933 213050 225108 236356 154034 192432 -3063 36125
6265 36125 207349 156367 313165 244430 91516 38014 16091 -95410 -192207 -152723 -207202
6254 -207202 17522 118752 189821 224628 136252 13325 22583 -1945 -53248 -43834 -124888
6243 -124888 73199 98285 -196970 -18045 125777 204643 267914 306532 226106 146302 82675
6232 82675 228901 112125 312225 273843 264779 -113146 -37168 167779 -10083 -73499 -82459
6221h2459J33603Q124r7483k31983J28074k48937k74493P8244K13941K13178L6860
6210a23331r5086j9051K0043R8225n8401L8041J46961r0891q5319P8238L9911
6199e0660j43314j31908J44663J21757j49781p5235J85481j63256M5452J80540
6189c6261j33460k08554J63533J06905K69409L37672j12395l34931j6867R9990
6179A35041K5148r3730P8442J3217P9334j68630k24615k58295j7743M23791K98155
6168B90115k49186l7565m3832j76088K85248J32201k5119l44500l01242M2462
6158d27506O6441M3424J53725K68675Q1236J7640J41499k18873k32319L2161k85782
6147c59679J27255L3152k77464p6290L70713J3060n9814N4701J24855o8340j7001
$$ plain form
6221 -82459 51144 59268 -38215 -270198 -142124 -391061 -665554 -587310 -373369 -160191 -123331
6210 -123331 -218417 -237468 -217425 -119200 -177601 -139560 7401 -83490 -168809 -90571 -50660
6199 -50660 -193974 -325882 -181219 -59462 -209243 -284478 -98997 -262253 -216801 -36261
6189 -36261 -169721 -378275 -214742 -107837 161572 499244 386849 51918 35051 135041
6179 135041 160189 66459 144901 158118 237452 68822 -155793 -414088 -431831 -8040 290115
6168 290115 40929 3364 -40468 -216556 68692 200893 175774 -168726 -469968 -427506
6158 -427506 -361065 -317641 -163916 104759 185995 203635 345134 126261 -106058 -73897 -359679
6147 -359679 -232424 -199272 -476736 -553026 -182313 -169253 -229067 -174366 -49511 -117851 -134852
6136a34852K9470q0950r7588k2256K52388q7896k09473K88957K43147k54260J06959
6125C3646J38266r653M1102j23799P6732Q9189l07023k08032N6577O8250J96548
6114E1803Q9764M5239j11558k9100J25326k47972p6729M8793p3784P1978N7552
6103d8688N1096K2186q7595R0593m5272K47479K64152J44966j13365n8482l3418
6092D33652q6063j31215l05136J03935P1986O5624p2856J25640L05332k5661l73936
6081A11302j66427q4649J0338P5927k8419K427j05750k05846N4956O9996K6210
6070b39935J96874M26262K36371l08942l43772j72792N8740K49901j82742N0654
6060b9381k9255N3306N2235K4429m702P3131J67321M12K5397Q1603M5873l9980
$$ plain form
6136 -134852 -105382 -186332 -283920 -306176 -53788 -141684 -351157 -62200 180947 -73313 33646
6125 33646 171912 162259 203361 79562 156294 245483 -61540 -269572 -212995 -144745 51803
6114 51803 141567 186806 75248 46148 171474 -76498 -153227 -104434 -178218 -106240 -48688
6103 -48688 2408 24594 -63001 27592 -17680 229799 493951 638917 525552 467070 433652
6092 433652 347589 216374 -88762 15173 87159 152783 79927 205567 510899 485238 111302
6081 111302 -55125 -139774 -129436 -53509 -81928 -79501 -185251 -391097 -336141 -266145 -239935
6070 -239935 -43061 383201 619572 310630 -33142 -205934 -147194 102707 -80035 -29381
6060 -29381 -58636 -5330 46905 71334 66632 139763 307084 307496 332893 414496 460369 420389
6048D20389n9860l70011m13217M8060j02799J2376R3458J24573Q1638N2210J7810
6037i5373J56987K1061j056K4995j15221P5981o2003l87496j85364r299K89287
6026b87501N2843P9461J33495P2654j22820J07452q8824n3746J34591m0027J03182
6015I0760j31012k21768j33608l15645J04368L27773K07493k0973J5558l21741
6005c98795j99527K41812J60501J49288j02637K1652j6824L468r1903j69889o8375
5994d71229L4199J95550o3773R5888K18289M9594J43217j70340n7757l3738J52110
5983I2010j19502M4926j77409r9526Q2892N1868m169J85556J4707j41250L966
5972f5931L8481j25824j23065k9811J04048L56718j83589j32783P3646r7172P0844
$$ plain form
6048 420389 360529 -9482 -422699 -374639 -477438 -465062 -371604 -247031 -165393 -113183 -95373
6037 -95373 61614 82675 81619 106614 -8607 67374 5371 -382125 -567489 -576788 -287501
6026 -287501 -234658 -155197 -21702 50952 -71868 35584 -53240 -106986 27605 -12422 90760
6015 90760 -40252 -262020 -395628 -711273 -606905 -279132 -71639 -92612 -77054 -398795
6005 -398795 -598322 -356510 -196009 -46721 -149358 -127706 -144530 -141062 -232965 -402854 -471229
5994 -471229 -437030 -241480 -305253 -209365 8924 58518 201735 31395 -26362 -60100 92010
5983 92010 -27492 17434 -159975 -259501 -176609 -124741 -128910 56646 71353 -69897 -65931
5972 -65931 -27450 -153274 -276339 -306150 -202102 154616 -28973 -161756 -88110 -185282 -114438
5961a14438q7573J91349P2956j25691J26379Q2289j34894j13756J13853m1607
5951c1133j4141J56957j16212j78120J72340K06302J19770o50K44094q6478j91644
5940B81085k57924m2500J7782k71005k5341O9461N3301n4062r1916J90477J44580
5929A3938O7149J0515j59754J94453K86361K78785r6571k10664q2256l58517p6080
5918a32641o2469q1424K79459J9663k98683l3592j02556k07003O4374J72554J86422
5907a95896K52459J62781p0174q7848j59721j40187l39j37892J31298K56874M8683
5896F0038J09681L7000O2706j4872j63144L6717k20317m8022J69662J83585J78877
5885C91911l1782j02762k21124N1987J5044j95458O0914J71297j6557k46347j77651
$$ plain form
5961 -114438 -202011 -10662 62294 -63397 62982 145271 10377 -103379 10474 -31133
5951 -31133 -45274 111683 -4529 -182649 -10309 195993 315763 315113 559207 472729 281085
5940 281085 23161 -19339 -1557 -272562 -297903 -228442 -175141 -229203 -321119 -130642 13938
5929 13938 81087 91602 -68152 126301 412662 691447 594876 384212 301956 -56561 -132641
5918 -132641 -195110 -276534 2925 22588 -276095 -309687 -412243 -619246 -554872 -382318 -195896
5907 -195896 56563 219344 149170 61322 -98399 -238586 -238925 -376817 -245519 11355 60038
5896 60038 169719 206719 269425 254553 91409 128126 -92191 -140213 29449 213034 391911
5885 391911 360129 257367 36243 88230 103274 -92184 -31270 140027 123470 -122877 -300528
5874c00528J0250Q6246J03589J50400j09220j00802J39386j15158r5334M3060
5864a88111K89221K5238j25238o8396K41358k09973J30902P7550L9765J21227
5854C33543J84298l5874j89797m59989r3218L23199K11168J29685j58184m32868
5844a88037J06053K27698m3906k20249M4395k34768j55186J53840j05227N3554
5834c61833J86392K92389K38330J4688p1312k37995m95921j88698l0039M52667
5824b01332K57001p4395k26567M3262j56227r5803l1008J14967k99818L9965J53859
5813d76096K08505J21666O4571K26322j29546J3922J16471J0237J20795n0857
5803B25990m43O0810K90635k09297j64312k1175P1453N7287r5034l79029m8754
$$ plain form
5874 -300528 -290278 -204032 -100443 49957 -59263 -160065 -20679 -135837 -231171 -188111
5864 -188111 101110 126348 1110 -67286 174072 -35901 95001 172551 212316 333543
5854 333543 517841 481967 292170 -167819 -261037 62162 273330 403015 244831 -188037
5844 -188037 -81984 145714 101808 -118441 -74046 -308814 -464000 -310160 -415387 -361833
5834 -361833 -175441 116948 355278 369966 298654 60659 -435262 -623960 -653999 -201332
5824 -201332 55669 -18726 -245293 -202031 -358258 -454061 -485069 -370102 -669920 -629955 -476096
5813 -476096 -267591 -145925 -81354 144968 15422 29344 145815 156052 276847 225990
5803 225990 225547 286357 576992 367695 203383 182208 253661 310948 215914 -163115 -211869
5792b11869K75920P7443P9315J52413J58673k46894m16052J65563P6114j13611
5782b985K52455l4817p4753J20031K9875O589M5267L7591j76757l4366j40630
5771B7500l51304k18656J49139K13981k16634R4093J31509K57991K6467J5520
5761A29606l9479O7290N1207m9847K1651o7277l21421Q9286K13316q3921l6328
5750b5917r5270m7321j25475K32403j24153J00700n9787K18257Q5188j92718j4624
5739d8717r2754J72221K19290k54552n04515O5672K9715j68158J28332r0278M3497
5728e00247l6171L311J99473J61343J81168J58496j83685L3411O2155J5632j69729
5717g4843L21782K96072o1162j97539j87824q3550j98243j26897K59939K00969
$$ plain form
5792 -211869 64051 141494 220809 373222 531895 285001 -131051 34512 110626 -2985
5782 -2985 249470 214653 139900 259931 289806 296395 341662 379253 202496 168130 27500
5771 27500 -323804 -542460 -393321 -179340 -395974 -301881 -170372 87619 114086 129606
5761 129606 90127 157417 208624 158777 180428 113151 -208270 -118984 94332 10411 -25917
5750 -25917 -121187 -168508 -293983 -61580 -185733 -85033 -144820 73437 158625 -34093 -48717
5739 -48717 -141471 30750 250040 -4512 -509027 -443355 -413640 -581798 -453466 -543744 -500247
5728 -500247 -536418 -533107 -333634 -172291 8877 167373 -16312 17099 79254 94886 -74843
5717 -74843 246939 543011 481849 284310 96486 12936 -185307 -312204 -52265 148704
5707A48704n0192j95237P929J70128K10823k2673l14234J67438K47470o7684k35908
5696F6564k27358K51666J67727j41395m7118J39796l41559k99170j30740L94336
5686a67251J32195J80366Q4215j12473l72796j47981K6214q2460K9845J75297
5676b54829L48455P2966o7865o5777j31176j9033m1073p642N1350j20148J27441
5665a07331j63505r2708K01796N0729J54558J12071j61067j00388K46065R6483
5655B36703m27421j27640j11057j06211J34889J00720K04507l232K1122k43551
5645c21171k52751m4008J99074J63578J44114o8540k13943R6217L14799L861M5813
5634F7043k30423j23755M9142J50571m6078N9664j12215J13086L5881j24403q201
$$ plain form
5707 148704 98512 -96725 -88796 81332 292155 269482 -44752 122686 370156 302472 66564
5696 66564 -160794 90872 258599 117204 70086 209882 -131677 -430847 -561587 -167251
5686 -167251 -35056 145310 229525 117052 -255744 -403725 -377511 -459971 -430126 -254829
5676 -254829 93626 166592 98727 32950 -98226 -117259 -158332 -165974 -114624 -234772 -107331
5665 -107331 -270836 -363544 -161748 -111019 43539 155610 -5457 -105845 140220 236703
5655 236703 -190718 -318358 -429415 -535626 -400737 -300017 -95510 -98742 -77620 -321171
5645 -321171 -573922 -617930 -418856 -255278 -111164 -179704 -393647 -297430 17369 21230 67043
5634 67043 -163380 -287135 -237993 -87422 -133500 -73836 -186051 -72965 -37084 -161487 -169688
5623a69688L1662j01105K35203J74505Q4875p1652l14873p723J95788p5207k8169
5612d6384J43295J7697K09474j394p1187q761n7862J18468J77235l3912k00460
5601B46209j80427j46380R9107J96619j76518k11698j22903K06299l413k29352
5591c22457L17177J52346K50440J09335J0122Q0013j51789k78246Q9777J52319
5581D09037l0461j51584J54509q854l20488q9488j69406j9012N7341k05266M9881
5570c23791K79111J72831j92013l07932Q0173j60395K52805K8369q1067N250K14864
5559c1795j8506M1479J503P7636J52735K04058l26834r7691j70999P2349J15868
5548A9803N446N7484J04377k97066j88894J51247J17857J07947P3729k83082j3232
$$ plain form
5623 -169688 -138026 -239131 -3928 170577 255452 183800 -131073 -138796 56992 -18215 -46384
5612 -46384 96911 114608 324082 322688 251501 242740 184878 303346 480581 446669 246209
5601 246209 65782 -80598 18509 215128 38610 -173088 -295991 -89692 -93105 -322457
5591 -322457 -5280 147066 397506 506841 516963 596976 445187 166941 256718 409037
5581 409037 378576 226992 381501 372647 52159 -37329 -206735 -225747 -168406 -373672 -323791
5570 -323791 -44680 128151 -63862 -371794 -291621 -452016 -199211 -170842 -251909 -246659 -31795
5559 -31795 -50301 -8822 -7319 70317 223052 427110 100276 2585 -168414 -96065 19803
5548 19803 25249 82733 187110 -109956 -298850 -147603 -29746 78201 151930 -131152 -144384
5537a44384j9888J95383J35435j96133j10005k70210K14825J6142K41298J43794
5527B06257j26652j00551K08866l3213k11335k13875J33332J48269K1648q6351
5517e3605k70336j74598K38842L93922p9780O4494M9295j59441J0112Q6034n7120
5506D7819j80398m9427j44448j50815P2771O6916k1420k3885O5306J65754P26
5495a51101L2317J11668q5108J7118m7618O0605j147j63367J68182M42235K8043
5484D11827k97118J6543O0647o3569O4200j01068o7010P9315j01756q9346L17815
$$ plain form
5537 -144384 -164272 31111 166546 -29587 -139592 -409802 -194977 -178835 62463 206257
5527 206257 79605 -20946 187920 154707 -56628 -270503 -137171 11098 32746 -53605
5517 -53605 -323941 -498539 -259697 134225 54445 118939 168234 8793 18905 104939 47819
5506 47819 -132579 -182006 -326454 -477269 -404498 -337582 -359002 -382887 -317581 -151827 -151101
5495 -151101 -118784 -7116 -92224 -75106 -122724 -62119 -63266 -226633 -58451 383784 411827
5484 411827 114709 131252 191899 128330 192530 91462 24452 103767 2011 -87335 230480
$$ [...]
##END NTUPLES=NMR SPECTRUM
##END=
