##TITLE=Analysis number 319077
Compound Code ac 42061 / 08080
Book Reference ac42061
Project Code adrs
Chemist Name mariap
##JCAMPDX= 6.0         $$ Bruker NMR JCAMP-DX V2.0
##DATA TYPE= NMR SPECTRUM
##DATA CLASS= NTUPLES
##ORIGIN= Bruker BioSpin GmbH
##OWNER= nmr
$$ XWIN-NMR		Version 3.5
$$ Fri Apr 28 12:36:59 2006 GMT Daylight Time (UT+1h)  MAYBRIDGE\nmr@NMR_250MHZ
##.OBSERVE FREQUENCY= 250.131544655141
##.OBSERVE NUCLEUS= ^1H
##.ACQUISITION MODE= SIMULTANEOUS (DQD)
##.ACQUISITION SCHEME= undefined
##.AVERAGES= 16
##.DIGITISER RES= 18
##SPECTROMETER/DATA SYSTEM= dpx250
##.PULSE SEQUENCE= zg30
##.SOLVENT NAME= DMSO
##.SHIFT REFERENCE= (INTERNAL, DMSO, 0, 16.522)
##AUDIT TRAIL= $$ (NUMBER, WHEN, WHO, WHERE, WHAT)
$$ ##TITLE= Audit trail, XWIN-NMR		Version 3.5
$$ ##JCAMPDX= 5.01
$$ ##ORIGIN= Bruker BioSpin GmbH
$$ ##OWNER= nmr
$$ C:\u/data/dgb/nmr/ADRS/3440/pdata/1/auditp.txt
$$ ##AUDIT TRAIL=  $$ (NUMBER, WHEN, WHO, WHERE, WHAT)
(   1,<2006-04-28 12:36:24.19 +100>,<MAYBRIDGE\nmr>,<NMR_250MHZ>,
      <created by zg, POWCHK disabled, PULCHK disabled
       configuration hash MD5:
       84 BC 41 DB A1 6E 1D 46 DA 25 12 A5 C1 ED C5 3A
       data hash MD5: 64K
       94 B3 35 06 63 A8 8E E2 37 05 BF 92 8D 3C 5E C5>)
(   2,<2006-04-28 12:36:48.10 +100>,<MAYBRIDGE\nmr>,<NMR_250MHZ>,
      <Start of raw data processing
       ef LB = 0.3 FT_mod = 6 PKNL = 1 SI = 32K 
       data hash MD5: 32K
       B8 F8 4B B9 DC E2 F6 E2 F6 3E 61 70 A0 F6 0C 94>)
(   3,<2006-04-28 12:36:50.56 +100>,<MAYBRIDGE\nmr>,<NMR_250MHZ>,
      <apk 
       data hash MD5: 32K
       75 11 30 C7 CC CD 2F 9D 64 72 33 81 23 D2 00 C3>)
(   4,<2006-04-28 12:36:51.45 +100>,<MAYBRIDGE\nmr>,<NMR_250MHZ>,
      <abs ABSG = 5 
       data hash MD5: 32K
       FE 62 88 06 B2 6A 4F 38 06 8A 97 BF B1 A2 03 B1>)
$$ ##END=
$$ 
$$ hash MD5
$$ C8 CF 0B D8 DE 7A 13 B4 C4 FD 38 D9 60 74 C2 4D
##$RELAX= 
##$RELAX= 
##$RELAX= 
##$RELAX= 
##$RELAX= 
##$RELAX= 
##$RELAX= 
$$ Bruker specific parameters
$$ --------------------------
##$DU= <C:\u>
##$EXPNO= 3440
##$NAME= <ADRS>
##$PROCNO= 1
##$TYPE= <nmr>
##$USER= <dgb>
##$AMP= (0..31)
100 100 100 100 100 100 100 100 100 100 100 100 100 100 100 100 100 100 
100 100 100 100 100 100 100 100 100 100 100 100 100 100 
##$AQSEQ= 0
##$AQ_mod= 3
##$AUNM= <au_zg>
##$AUTOPOS= <31 >
##$BF1= 250.13
##$BF2= 250.13
##$BF3= 250.13
##$BF4= 250.13
##$BF5= 500.13
##$BF6= 500.13
##$BF7= 500.13
##$BF8= 500.13
##$BYTORDA= 1
##$CFDGTYP= 0
##$CFRGTYP= 5
##$CHEMSTR= <none>
##$CNST= (0..31)
1 1 145 1 1 1 1 1 1 1 1 1 1 1 1 1 1 1 1 1 1 1 1 1 1 1 1 1 1 1 1 1 
##$CPDPRG= <>
##$CPDPRG1= <>
##$CPDPRG2= <>
##$CPDPRG3= <>
##$CPDPRG4= <mlev>
##$CPDPRG5= <mlev>
##$CPDPRG6= <mlev>
##$CPDPRG7= <mlev>
##$CPDPRG8= <mlev>
##$CPDPRGB= <>
##$CPDPRGT= <>
##$D= (0..31)
0 1 0 0 0 0 0 0 0 0.06 0 0 0 0 0 0 0.0002 0 0 0 0 0 0 0 0 0 0 0 0 0 0 
0 
##$DATE= 1146224183
##$DBL= (0..7)
120 120 120 120 120 120 120 120 
##$DBP= (0..7)
150 150 150 150 150 150 150 150 
##$DBP07= 0
##$DBPNAM0= <>
$$ [...]
##$SUBNAM7= <"">
##$SUBNAM8= <"">
##$SUBNAM9= <"">
##$SW= 20.6930455092707
##$SWIBOX= (0..15)
0 0 3 0 0 0 0 0 0 0 0 0 0 0 0 0 
##$SW_h= 5175.983436853
##$TD= 65536
##$TD0= 1
##$TE= 295.16
##$TE2= 300
##$TE3= 300
##$TEG= 300
##$TL= (0..7)
0 120 120 120 120 120 120 120 
##$TP= (0..7)
150 150 150 150 150 150 150 150 
##$TP07= 0
##$TPNAME0= <>
##$TPNAME1= <>
##$TPNAME2= <>
##$TPNAME3= <>
##$TPNAME4= <>
##$TPNAME5= <>
##$TPNAME6= <>
##$TPNAME7= <>
##$TPOAL= (0..7)
0.5 0.5 0.5 0.5 0.5 0.5 0.5 0.5 
##$TPOFFS= (0..7)
0 0 0 0 0 0 0 0 
##$TUNHIN= 0
##$TUNHOUT= 0
##$TUNXOUT= 0
##$USERA1= <user>
##$USERA2= <user>
##$USERA3= <user>
##$USERA4= <user>
##$USERA5= <user>
##$V9= 5
##$VALIST= <valist>
##$VCLIST= <CCCCCCCCCCCCCCC>
##$VD= 0
##$VDLIST= <DDDDDDDDDDDDDDD>
##$VPLIST= <PPPPPPPPPPPPPPP>
##$VTLIST= <TTTTTTTTTTTTTTT>
##$WBST= 1024
##$WBSW= 4
##$XGAIN= (0..3)
0 0 0 0 
##$XL= 0
##$YL= 0
##$YMAX_a= 475275
##$YMIN_a= -480530
##$ZGOPTNS= <>
##$ZL1= 120
##$ZL2= 120
##$ZL3= 120
##$ZL4= 120
##$ABSF1= 16.522
##$ABSF2= -4.171173
##$ABSG= 5
##$ABSL= 3
##$ALPHA= 0
##$AQORDER= 0
##$ASSFAC= 0
##$ASSFACI= 0
##$ASSFACX= 0
##$ASSWID= 0
##$AUNMP= <proc_1d>
##$AZFE= 0.1
##$AZFW= 0.1
##$BCFW= 0
##$BC_mod= 0
##$BYTORDP= 0
##$COROFFS= 0
##$CY= 12.5
##$DATMOD= 1
##$DC= 0
##$DFILT= <>
##$DTYPP= 0
##$F1P= 14.0000005364418
##$F2P= -0.99999901652339
##$FCOR= 0.5
##$FTSIZE= 32768
##$FT_mod= 6
##$GAMMA= 0
##$GB= 0
##$INTBC= 1
##$INTSCL= 1
##$ISEN= 128
##$LB= 0.3
##$LEV0= 0
##$LPBIN= 0
##$MAXI= 10000
##$MC2= 0
##$MEAN= 0
##$ME_mod= 0
##$MI= 0
##$NCOEF= 0
##$NC_proc= -2
##$NLEV= 6
##$NOISF1= 0
##$NOISF2= 0
##$NSP= 0
##$NTH_PI= 0
##$NZP= 0
##$OFFSET= 16.522
##$PC= 1
##$PHC0= 9.950419
##$PHC1= -0.3054877
##$PH_mod= 1
##$PKNL= yes
##$PPARMOD= 0
##$PSCAL= 4
##$PSIGN= 0
##$REVERSE= no
##$SF= 250.13
##$SI= 32768
##$SIGF1= 0
##$SIGF2= 0
##$SINO= 400
##$SIOLD= 32768
##$SREGLST= <1H.DMSO>
##$SSB= 0
##$STSI= 32768
##$STSR= 0
##$SW_p= 5175.98343685301
##$SYMM= 0
##$S_DEV= 0
##$TDeff= 65536
##$TDoff= 0
##$TI= <Analysis number 999999
Compound Code 99
Book Reference 9
Project Code 9>
##$TILT= no
##$TM1= 0
##$TM2= 0
##$TOPLEV= 0
##$USERP1= <user>
##$USERP2= <user>
##$USERP3= <user>
##$USERP4= <user>
##$USERP5= <user>
##$WDW= 1
##$XDIM= 32768
##$YMAX_p= 287407912
##$YMIN_p= -29806
$$ End of Bruker specific parameters
$$ ---------------------------------
##NTUPLES= NMR SPECTRUM
##VAR_NAME=  FREQUENCY,     SPECTRUM/REAL,   SPECTRUM/IMAG
##SYMBOL=    X,             R,               I
##VAR_TYPE=  INDEPENDENT,   DEPENDENT,       DEPENDENT
##VAR_FORM=  AFFN,          ASDF,            ASDF
##VAR_DIM=   32768,         32768,           32768
##UNITS=     HZ,            ARBITRARY UNITS, ARBITRARY UNITS
##FACTOR=    0.157963299565203, 1,           1
##FIRST=     4132.6476996994, 0,             0
##LAST=      -1043.33573715361, 0,           0
##MIN=       -1043.33573715361, -29806,      0
##MAX=       4132.6476996994, 287407912,     0
$$ Real data points
##PAGE= N=1
##DATA TABLE= (X++(R..R)), XYDATA
$$ [...]
$$ plain form
15157 -1272 -4544 -5675 -5983 -5407 -4492 -2778 -1484 -1368 -4364 -3345 -1223 -2533 -2898 -6222 -3873 -3474
15141 -3474 -1875 -5741 -9785 -5519 -1716 -414 -665 -3596 -2229 -941 -1075 -679 -2592 -2218 -3013 -741
15125 -741 -1211 -19 -2403 -4264 -2875 -3904 -5252 -3737 -134 -1241 -4098 -4624 -1718 -396 1049
15110 1049 -136 774 -1059 -2404 -917 1223 2607 919 -1194 -617 614 2580 643 153 944 -622
15094 -622 -2172 -749 1243 1966 3274 3577 4425 5680 4885 5133 2447 838 -1872 -2542 -1937 -4607 -4744
15077 -4744 -2653 -1323 -2455 -2593 -1834 -2400 -2232 -2873 -5029 -3941 -3241 -1680 -429 1527 2445 936
15061 936 121 864 1131 -3841 -7514 -7160 -7050 -6185 -1415 987 2763 1859 900 -428 341 2603 -315
15044 -315 -1834 -1348 315 -595 -126 1486 903 -1729 -3254 -5918 -7390 -7166 -5602 -2781 -1573 -1641 -296
$$ packed form
15157a272l272j131l08N76R15J714J294J16k996J019K122j310l65l324K349L99
15141c474J599l866m044M266L803J302k51k931J367J288j34L96j913L74p95K272
15125g41m70J192k384j861J389j029j348J515L603j107k857n26K906J322J445
15110A049j185R10j833j345J487K140J384j688k113N77J231J966j937m90P91j566
15094f22j550J423J992P23J308L03Q48J255p95K48k686j609k710o70O05k670j37
15077d744K091J330j132j38P59n66J68o41k156J088P00J561J251J956R18j509
15061I36q15P43K67m972l673L54J10Q65M770K402J776r04r59j328P69K262k918
15044c15j519M86J663r10M69J612n83k632j525k664j472K24J564K821J208o8J345
$$ plain form
15027 -296 1551 2113 -352 -59 -1834 -1515 -789 -964 379 374 -479 -707 -3114 -1601 210 2566 -561
15010 -561 -918 1 1712 1769 -437 -2412 2920 5133 2346 3750 2096 -1617 -2819 -499 624 1997
14994 1997 1485 -1062 -475 -515 -1783 -4448 -2458 -1974 -3027 -1122 -1822 -5776 -7841 -3972 -4354 -3945 -4328
14977 -4328 -4960 -2222 1141 2550 983 -845 -1514 -3578 -7283 -6943 -3143 -1540 -5307 -3047 773
14962 773 -1155 -3689 -2855 -2792 -18 154 -3573 -4392 -2391 795 1222 -710 1203 1542 1131 1448 378
14945 378 127 -2423 -446 1808 301 -3114 -3180 -1399 93 -1591 -1233 1658 340 155 -2701 -3636
14929 -3636 -3361 -3068 441 3788 3616 1071 -1611 -591 -2012 234 -436 -1882 -1515 -1282 -943 -247 1022
14912 1022 109 3981 2353 -610 1735 3914 3345 1622 -1153 -968 -809 -2979 -78 1146 1193 -295
$$ packed form
15027b96J847N62k465K93j775L19P26j75J343nq53k28k407J513J811K356l127
15010e61l57R19J711N7k206j975N332K213k787J404j654l713j202K320J123J373
14994A997n12k547N87m0j268k665J990M84j053J905p00l954k065L869l82M09l83
14977d328o32K738L363J409j567j828o69k064l705L40L800J603l767K260L820
14962G73j928k534Q34O3K774J72l727q19K001L186M27j932J913L39m11L17j070
14945C78k51k550J977K254j507l415o6J781J492j684L58K891j318j85k856r35
14929c636K75K93L509L347j72k545k682J020j421K246o70j446L67K33L39O96J269
14912A022r13L872j628k963K345K179n69j723k775J85J59k170K901J224M7j488
$$ plain form
14896 -295 -3502 -3742 -4227 -3220 -1084 759 158 -1311 -133 -1511 -2989 -220 2163 208 1569 1711
14880 1711 518 -507 -911 2637 5441 2927 -336 -2499 -1591 -482 -2154 262 -136 -1637 -1724 -677
14864 -677 1116 -1702 -2117 -573 1344 2751 5265 7496 6290 4404 2674 4252 6504 2976 265
14849 265 -2109 -1114 -1838 -2633 -3546 -3833 -1975 -4165 -5057 -4191 -2158 -3767 -4000 -3552 -2778 -635 -132 1336
14831 1336 3179 1320 1806 4228 4449 4303 2557 2562 1032 781 2228 2862 6232 10442 8285 4141 2221
14814 2221 -670 -4364 -6575 -6573 -4491 -1521 685 1000 -1881 -1713 -1586 -2241 -925 -2848 -3076 322 1585
14797 1585 1743 412 -382 941 1156 -1166 -4498 -7391 -7316 -8533 -9867 -6669 -5022 -2944 -4455 -6346
14781 -6346 -4509 -3408 -3207 -4297 -5866 -4302 -3443 -3840 -3877 -5090 -4492 -4769 -3799 -4639 -3781 -837 -1109
$$ packed form
14896b95l207k40m85J007K136J843o01j469J178j378j478K769K383j955J361J42
14880A711j193j025m04L548K804k514l263k163R08J109j672K416l98j501q7J047
14864f77J793k818m15J544J917J407K514K231j206j886j730J578K252l528k711
14849B65k374R95p24p95r13k87J858k190q92Q66K033j609k33M48P74K143N03J468
14831A336J843j859M86K422K21j46j746Nj530k51J447O34L370M210k157m144j920
14814B221k891l694k211KK082K970K206L15k881J68J27o55J316j923k28L398J263
14797A585J58j331p94J323K15k322l332k893P5j217j334L198J647K078j511j891
14781f346J837J101K01j090j569J564Q59l97l7j213N98k77R70q40Q58K944k72
$$ plain form
14764 -1109 -3760 -1820 1323 2207 707 -2705 -5030 -7204 -6790 -2518 382 1838 5049 5083 -394 -817
14748 -817 2163 2685 2706 4056 2150 684 -80 2218 -1354 -2558 -1854 209 2724 1457 2127 1117
14732 1117 -484 -422 -332 478 2559 2858 46 -5685 -5163 -4243 -2579 -313 1478 2570 2126 4138 2112
14715 2112 2337 3706 4958 3589 -449 -1570 -3039 -3162 -845 500 399 1578 3020 1437 2362 -877
14699 -877 -4629 -6174 -8600 -6356 -1666 -945 2237 5079 2271 -540 -2762 -3179 -343 2600 3212 897
14683 897 307 -2203 -2299 -2281 -1484 -1062 -203 -3565 -6287 -4036 973 3573 -2539 -3120 -2825 -2822 -559 -3176
14665 -3176 -1903 3665 2428 1725 -1659 -1806 2584 585 -1930 -4080 -3712 -2751 -3352 -3489 -1049 -1087 -2176
14648 -2176 -2809 -1050 -550 -1612 -131 671 -3077 -4926 -3014 -3759 -2254 534 733 -1415 -2359 -1635
$$ packed form
14764a109k651J940L143Q84j500l412k325k174M14M272K900J456L211L4n477m23
14748h17K980N22K1J350j906j466p64K298l572j204P04K063K515j267O70j010
14732A117j601O2R0Q10K081K99k812n731N22R20J664K266J791J092m44K012k026
14715B112K25J369J252j369m038j121j469j23K317J345j01J179J442j583R25l239
14699h77l752j545k426K244M690P21L182K842k808k811k222m17K836K943O12k315
14683H97n90k510r6J8P97M22Q59l362k722K251N009K600o112n81K95LK263k617
14665c176J273N568j237p03l384j47M390j999k515k150L68R61o01j37K440l8j089
14648b176o33J759N00j062J481Q02l748j849J912p45J505K788J99k148r44P24
$$ plain form
14632 -1635 -650 4 519 3787 2694 1515 2870 7027 6535 3450 379 -132 -1850 230 1576 4150
14616 4150 5953 4085 489 1033 514 -1244 -1037 -57 -402 1054 698 630 1799 546 -389 -1546 -1711
14599 -1711 -4622 -3944 -2681 -651 317 1538 -1745 -5009 -5106 -3864 -3577 -1389 2003 2130 -2423 -4451
14583 -4451 -4757 -3305 -1318 865 -714 -954 -767 -1576 1802 4285 4142 1710 2038 1176 630 -931 -1180
14566 -1180 324 -1608 -1595 666 2453 -973 -4574 -5653 -2577 -927 -2621 -1227 942 1 -421 1015
14550 1015 -18 -2416 -1439 -1082 -2698 -2610 -4567 -2988 -665 1630 1411 -1241 -5618 -7377 -6556 -6151
14534 -6151 -3338 -688 -463 404 -2402 -6035 -5006 -4037 -6015 -6810 -3489 -103 1697 -3728 -7094 -3158
14518 -3158 -1510 -849 -833 1196 1693 4727 4725 3379 2589 1061 -3451 -5788 -3871 -5278 -5737 -2447 1606
$$ packed form
14632a635R85O54N15L268j093j179J355M157m92l085l071n11j718K080J346K574
14616D150J803j868l596N44n19j758K07R80l45J456l56o8J169j253r35j157j65
14599a711k911O78J263K030R68J221l283l264r7J242K87K188L392J27m553k028
14583d451l06J452J987K183j579k40J87q09L378K483j43k432L28q62n46j561k49
14566a180J504j932J3K261J787l426l601j079L076J650j694J394K169r41m22J436
14550A015j033k398R77L57j616Q8j957J579K323K295k19k652m377j759Q21M05
14534f151K813K650K25Q67k806l633J029R69j978p95L321L386J800n425l366L936
14518c158J648O61J6K029M97L034kj346p90j528m512k337J917j407m59L290M053
$$ plain form
14501 1606 2724 2375 3222 3610 3448 433 -1210 -290 -1448 317 1669 1013 -558 -5212 -5534 -579
14485 -579 518 -104 -1020 -438 -2670 -4579 -5347 -3727 -423 981 -344 -2200 -2578 -905 2850 2284
14469 2284 603 -766 5 1375 1885 1375 93 -984 -3570 -5142 -8443 -8853 -5258 -450 2441 2221
14453 2221 795 -1288 -3030 -1962 -1957 1616 4469 3448 4429 3091 -1115 -2975 -1927 -476 -2788 20
14437 20 1172 1706 -303 -3491 -3868 -1861 -3688 -4861 -3749 -1461 -3611 -1708 206 419 1472 120
14421 120 -45 -3624 -1926 -1638 -1347 1432 578 1785 602 2604 2805 1454 -283 295 3261 4076 2462
14404 2462 3418 5241 8221 6386 1325 -55 706 8 -1601 -3352 -1865 323 -1047 -7316 -7228 -2090
14388 -2090 1994 833 -2212 -4176 -2655 2198 5343 2528 -1873 -2413 -1464 -2596 -2485 -976 5 -2265
$$ packed form
14501A606J118l49Q47L88j62l015j643R20j158J765J352o56j571m654l22M955
14485e79J097o22r16N82k232j909p68J620L304J404j325j856l78J673L755n66
14469B284j681j369P71J370N10n10j282j077k586j572l301m10L595M808K891k20
14453B221j426k083j742J068NL573K853j021R81j338m206j860J048J451k312K808
14437B0J152N34k009l188l77K007j827j173J112K288k150J903J914K13J053j352
14421A20j65l579J698K88K91K779q54J207j183K002K01j351j737N78K966Q15j614
14404B462R56J823K980j835n061j380P61o98j609j751J487K188j370o269Q8N138
14388b090M084j161l045j964J521M853L145k815m401n40R49j132J11J509R81k270
$$ plain form
14372 -2265 -3098 -2210 -4020 -4542 -2839 -1621 -1777 640 4386 2298 -225 -1101 -1969 -1483 224 -67 -1013
14355 -1013 -2902 -1051 -929 -363 -531 288 1752 -164 -103 -311 -424 -421 471 50 1135 4553 2667 2984
14337 2984 2128 -938 -2841 -1844 -1548 280 2393 3097 6800 5334 1101 1790 3457 4826 2117 -2536
14321 -2536 -2610 259 2420 2500 515 -424 75 -1057 -2666 -4754 -4632 -2204 -2216 -4326 -3974 -3647 -3573 -3775
14303 -3775 -3246 -2571 -1132 -1131 -1936 -1126 2385 5111 4830 1528 -381 -18 -167 -1605 -4135 -6688 -3753
14286 -3753 -3719 -2074 -2265 -1730 -3250 -2503 -2045 -1132 -1886 -3777 -4110 -4418 -4101 -3931 691 45 1525 4767
14268 4767 3376 2845 2088 1892 1002 -2371 -4006 -3537 -3366 -3470 -4958 -3055 -2835 -2155 -2095 -2329 45 3436
14250 3436 1872 -2697 -2125 -1508 622 4174 4872 3025 624 307 1132 -326 -5899 -5251 -3016 -5657
$$ packed form
14372b265q33Q88j810n22J703J218j56K417L746k088k523q76q68M86J707k91r46
14355a013j889J851J22N66j68Q19J464j916O1k08j13LQ92m21J085L418j886L17
14337B984q56l066j903R97K96J828K113P04L703j466m233O89J667J369k709m653
14321b536p4K869K161Q0j985r39M99j132j609k088J22K428j2k110L52L27P4k02
14303c775N29O75J439Jq05Q10L511K726k81l302j909L63j49j438k530k553K935
14286c753L4J645j91N35j520P47M58R13p54j891l33l08L17J70M622o46J480L242
14268D767j391n31p57j96q90l373j635M69J71j04j488J903K20O80O0k34K374L391
14250C436j564m569N72O17K130L552O98j847k401l17Q25j458n573O48K235k641
$$ plain form
14234 -5657 -7827 -5889 -4964 -1417 343 1340 1189 -1139 -318 2495 1347 -3479 -5470 -6632 -6709 -6250
14218 -6250 -6386 -7298 -7647 -4579 -765 -1554 -2336 115 2337 2665 2940 4919 3683 1972 456 2290
14202 2290 3181 2160 701 -364 -3566 -1695 518 4597 8174 7175 2166 -725 -1378 1387 441 -2358
14186 -2358 -3445 -5015 -6904 -989 1203 -18 1082 72 -319 827 -505 -1469 969 1596 2300 706
14170 706 1608 1574 -1157 -4000 -5098 -5733 -1317 1566 2511 952 832 2867 2494 -485 -2809 -1437 721
14153 721 -2156 -464 1129 -4120 -4359 -2783 -4890 -6420 -5182 -4125 -5874 -3646 -2130 287 -487
14138 -487 -238 -460 -2066 -3744 -5447 -3846 -2988 -2826 -433 -3006 -4441 -2731 -993 -1970 -2737 -2111 -57
14121 -57 -583 390 1141 1359 1356 1033 838 1524 -1504 -2361 -670 -1580 -6148 -4565 -1168 2161 2542 945
$$ packed form
14234e657k170J938R25L547J760R97j51k328Q21K813j148m826j991j162p7M59
14218f250j36r12l49L068L814p89p82K451K222L28K75J979j236j711j516J834
14202B290Q91j021j459j065l202J871K213M079L577r99n009k891o53K765r46k799
14186b358j087j570j889N915K192j221J100j010l91J146j332r64K438O27P04j594
14170G06R02l4k731k843j098o35M416K883R45j559j20K035l73k979k324J372K158
14153G21k877J692J593n249k39J576k107j530J238J057j749K228J516K417p74
14138d87K49k22j606j678j703J601Q58J62K393k573j435J710J738r77p67O26K054
14121e7n26R73P51K18ll23j95O86l028q57J691r10m568J583L397L329L81j597
$$ plain form
14103 945 381 -989 -1701 -765 -707 58 -371 -4219 -2160 -765 -663 1706 4942 5429 4116 1747 -808
14086 -808 -2435 -2634 -3591 -2901 -1325 -1047 -88 -1174 -1235 1839 2240 2014 -646 -3019 -1346 1934 -852
14069 -852 -2501 -3096 -4048 -2319 -3038 -1127 999 -1799 -1756 -291 832 955 -2006 -2056 -2391 -397 11
14052 11 -981 -31 -466 -1959 -2838 996 4572 2955 24 -805 559 1549 -1232 -2369 1128 5123 413
14035 413 -1973 -1118 431 1869 3 -2763 79 2975 614 1037 -1535 -1524 811 -738 3019 4097
14019 4097 4310 1684 -2479 -2836 -3496 -3054 -1309 649 1323 -3127 -7259 -10385 -9847 -5431 -1738 1011
14003 1011 4948 3386 3827 3897 3000 436 -2179 -5531 -6786 -5523 -4129 811 476 -2118 -2173 -406
13987 -406 -2508 -1762 -2325 -2960 -2850 -4008 -1730 657 -2557 -7666 -7170 -8014 -8411 -7786 -6878 -4247 -2409
$$ packed form
14103I45n64j370p12R36N8P65m29l848K059J395J02K369L236M87j313k369k555
14086h08j627j99r57O90J576K78R59j086o1L074M01k26k660k373J673L280k786
14069h52j649n95r52J729p19J911K126k798M3J465J123J23k961n0l35J994M08
14052A1r92R50m35j493q79L834L576j617k931q29J364R90k781j137L497L995m710
14035D13k386Q55J549J438j866k766K842K896k361M23k572J1K335j549L757J078
14019D097K13k626m163l57o60M42J745J958O74m450m132l126N38M416L693K749
14003A011L937j562M41P0q97k564k615l352j255J263J394M940l35k594n5J767
13987d06k102P46n63o35J10j158K278K387l214n109M96q44l97O25R08K631J838
$$ plain form
13970 -2409 -1665 -1900 -80 1760 2696 635 118 -1224 -6531 -8082 -4029 1616 1970 1977 -263 -3819 -5323
13953 -5323 -3674 -1715 2196 2464 1375 99 -1622 -3125 -2880 590 1231 1305 -1531 -1812 -3731 -5577
13937 -5577 -1272 60 -733 -2766 -2288 -2924 -4545 -3908 -4247 -157 -610 -4419 -5998 -5556 -3354 -2979 -3507
13920 -3507 -1746 -1716 1328 3714 508 -3771 -4167 -1606 2994 2671 -1811 -1580 899 246 -2294 -1628
13904 -1628 -1246 136 173 -3416 -4979 -5140 -3472 -1269 -2527 -3305 -2182 -1185 -1519 -1364 -15 -1007 -3078
13887 -3078 -2608 -854 -648 -64 -36 660 -729 -945 1111 1515 -1713 -2269 -4293 -6728 -5188 -2140 2232
13870 2232 2033 -3216 -3371 -2534 -2691 -2438 -1152 -155 2915 1555 -2652 -3528 -639 -2974 -3121 -2479 1517
13853 1517 1581 -953 -1556 -2333 -1156 -1443 -3516 253 1977 1189 45 3863 4311 1282 -1055 -160 482
$$ packed form
13970b409P44k35J820J840R36k061n17j342n307j551M053N645L54Pk240l556j504
13953e323J649J959L911K68j089j276j721j503K45L470O41P4k836k81j919j846
13937e577M305J332p93k033M78o36j621O37l39M090m53l809j579M42K202L75n28
13920c507J761L0L044K386l206m279l96K561M600l23m482K31K479o53k540O66
13904a628L82J382L7l589j563j61J668K203j258p78J123R97l34J55J349r92k071
13887c078M70J754K06N84K8O96j389k16K056M04l228n56k024k435J540L048M372
13870B232j99n249j55Q37j57K53J286R97L070j360m207q76K889k335j47O42L996
13853A517O4k534o03p77J177k87k073L769J724p88j144L818M48l029k337Q95O42
$$ plain form
13836 482 -135 860 998 -806 -3917 -2750 -554 -919 -1640 -2524 -4546 -3402 -2595 -1186 -1807 35 1988
13819 1988 3251 4160 5756 442 -506 1062 930 -709 -3161 -213 -491 855 1618 651 -166 -599 -679
13802 -679 -1374 -2614 -615 -2463 -1110 -4085 -6201 -3391 -756 -1587 -2188 -621 1006 -277 -2476 -2620
13786 -2620 -2146 3411 4956 3375 2189 2537 -140 -2612 -2310 -2825 -2114 -168 -757 -1199 842 3488
13770 3488 4429 4119 73 -4339 -1112 -1322 -1218 775 3123 3581 4266 4103 705 -3103 -5275 -3163
13754 -3163 -1727 -500 1221 -28 -1024 -909 -1135 353 529 -452 -1647 -5217 -6472 -1073 2496 2226
13738 2226 -1233 -1249 -997 -4324 -4635 -3051 -2256 -434 1972 343 -3578 -2331 -4921 -6009 -6669 -5776
13722 -5776 -3875 -5132 -5374 -3644 -2494 -168 309 534 1221 2550 2231 3947 4330 782 239 -2324
$$ packed form
13836D82o17R95J38j804l111J167K196l65p21q84k022J144Q07J409o21J842J953
13819A988J263R09J596n314r48J568j32j639k452K948k78J346P63r67q17m33q0
13802f79o95j240J999j848J353k975k116K810K635q31o01J567J627j283k199j44
13786b620M74N557J545j581j186L48k677k472L02n15P11J946n89m42K041K646
13770C488R41l10m046m412L227k10J04J993K348M58O85j63l398l808k172K112
13754c163J436J227J721j249r96J15k26J488J76r81j195l570j255N399L569k70
13738B226l459j6K52l327l11J584P95J822K406j629l921J247k590j088o60Q93
13722e776J901j257k42J730J150K326M77K25O87J329l19J716L83l548n43k563
$$ plain form
13706 -2324 -3988 -2782 -5423 -2270 1188 1429 2569 3384 4504 765 505 538 -3914 -4579 -689 -504
13690 -504 -340 1400 1297 1250 3198 1806 -343 573 567 -231 2022 -1000 -671 3105 6764 7092 6484 2567
13672 2567 1179 399 4020 4089 3515 1966 -191 757 -513 -2544 241 1891 -2051 -4195 -2853 1906
13656 1906 3778 3316 2198 -516 -3158 -1846 -1472 -1667 -5728 -9865 -10456 -9932 -7831 -2613 2509 1380
13640 1380 -198 -716 -3235 -3038 416 -635 -1282 -1558 687 -181 -5059 -3346 -1866 854 1377 1067
13624 1067 -779 -3097 -1613 24 2923 2698 1304 44 -1586 -1968 -2155 -5323 -8759 -7417 -6584 -7046
13608 -7046 -8047 -4970 -2892 -2829 -3327 -2628 -2115 -592 1090 2976 2967 1430 1595 2235 2694 2123 -1657 -6272
13590 -6272 -5337 -3012 110 -415 -950 -9 -235 -2550 -1404 326 1314 3326 2623 2899 2465 -505 -3263
$$ packed form
13706b324j664J206k641L153L458K41J140Q15J120l739k60L3m452o65L890J85
13690e04J64J740j03m7J948j392k149R16op98K253l022L29L776L659L28o08l917
13672B567j388p80L621O9n74j549k157R48j270k031K785J650l942k144J342M759
13656A906J872m62j118k714k642J312L74j95m061m137n91N24K101N218N122j129
13640A380j578n18k519J97L454j051o47k76K245q68m878J713J480K720N23l10
13624A067j846k318J484J637K899k25j394j260j630l82j87l168l436J342Q33m62
13608g046j001L077K078O3m98O99N13J523J682J886rj537J65O40M59n71l780m615
13590f272R35K325L122n25n35R41k26k315J146J730R88K012p03K76m34k970k758
$$ plain form
13573 -3263 -4699 -2507 -410 -67 -985 1247 1804 1360 2314 1311 -965 269 3036 6353 5055 4212
13557 4212 4145 537 1614 795 2215 2369 2177 2308 117 4061 6711 4136 3095 420 -1537 -1020
13541 -1020 2258 1683 833 338 136 1515 -1640 -2268 -557 1304 1781 -819 -1982 -1090 -1196 -312 -181
13524 -181 -1526 -4356 -5117 -4137 176 707 1647 2136 -67 -164 662 649 -720 -2843 -2713 -4096 -5245 -2506
13506 -2506 -2687 -4318 -1332 922 -1711 -6045 -8469 -7421 -5304 -5029 -3423 314 435 464 -423 -3822
13490 -3822 -2647 16 1691 3446 6456 4739 4087 1328 -1182 -4838 -6351 -327 1156 -765 -140
13475 -140 1083 2269 2549 338 -1814 -1381 -552 -740 218 -1086 -2092 311 2311 3858 5085 3736
13459 3736 -1007 -715 2011 1644 -1455 -1411 744 7455 8161 5984 3872 1010 -931 -2406 1962 2174
$$ packed form
13573c263j436K192K097L43r18K232N57m44R54j003k276J234K767L317j298q43
13557D212o7l608J077q19J420J54j92J31k191L944K650k575j041k675j957N17
13541a020L278n75q50m95k02J379l155o28J711J861M77k600j163Q92j06Q84J31
13524a81j345k830p61R80M313N31R40M89k203r7Q26j3j369k123J30j383j149K739
13506b506j81j631K986K254k633m334k424J048K117K75J606L737J21K9q87l399
13490c822J175K663J675J755L010j717o52k759k510l656j513O024J483j921O25
13475a40J223J186K80k211k152M33Q29j88R58j304j006K403K000J547J227j349
13459C736m743K92K726l67l099M4K155O711P06k177k112k862j941j475M368K12
$$ plain form
13443 2174 4277 7413 4267 914 -2580 -2630 -3811 -7169 -8834 -6266 -3783 -3052 395 -1600 -2271 -2600
13427 -2600 -2954 -3742 -4280 -6639 -8592 -8636 -6351 -5737 -5557 -3826 -243 1975 3767 4228 2123 900 -2179
13410 -2179 -1174 1213 -1506 -1386 162 106 -934 -96 1647 45 -2652 1473 1337 -2794 -3449 -3821
13394 -3821 -1818 -3118 -472 186 1880 6244 6701 4597 4565 4090 1849 1249 4285 3429 1620 -1729
13378 -1729 -5240 -5746 -3209 -1448 1769 2355 416 -120 1264 1965 2900 3593 4218 3969 3435 5837 4107
13361 4107 -2081 -346 2142 1230 120 -1611 -5066 -8930 -4570 -580 -7 690 63 1735 2006 5439
13345 5439 7098 3508 885 559 -1482 -3516 -2827 -3438 -2761 -1136 -3438 -3295 -33 1212 2500 3193
13329 3193 2276 -1240 -1349 -164 2432 630 -2102 1464 2998 3225 2080 1273 3291 6044 5612 3464
$$ packed form
13443B174K103L136l146l353l494n0j181l358j665K568K483P31L447j995o71l29
13427b600l54p88n38k359j953m4K285O14J80J731L583K218J792M61k105j223l079
13410b179J005K387k719J20J548n6j040Q38J743j602k697M125j36m131o55l72
13394c821K003j300K646O58J694M364M57k104l2m75k241o00L036q56j809l349
13378a729l511n06K537J761L217N86j939n36J384P01R35O93O25k49n34K402j730
13361D107o188J735K488r12j110j731l455l864M360L990N73O97o27J672K71L433
13345E439J659l590k623l26k041k034O89o11O77J625k302J43L262J245J288O93
13329C193r17l516j09J185K596j802k732L566J534K27j145q07K018K753m32k148
$$ plain form
13313 3464 2067 -784 -3154 -2851 -2883 -2303 -1816 -3017 -2337 -300 -1073 -1288 -1522 -215 1501 603 1786
13296 1786 963 672 3383 2957 1538 4315 4415 506 304 1999 3792 3770 3331 5736 4363 1733 2788
13279 2788 3298 3711 3396 1687 1456 -535 -1851 -1197 -413 -965 -2532 -3982 -843 -649 -422 403 1052
13262 1052 1597 3678 2206 -1479 -1427 -419 609 -547 -3812 -4396 -4634 -2641 -1664 -3278 -4485 -6012
13246 -6012 -7453 -3243 797 932 129 -1915 1039 215 -664 2037 3136 4027 4805 3680 2090 2321
13230 2321 99 -184 2192 5820 5545 4696 1156 -812 -1532 -739 1571 -31 -2872 -3055 435 5562
13214 5562 3897 3394 2328 1270 229 2268 -1297 -5259 -2284 -811 -341 -1454 -1773 -706 1371
13199 1371 3324 4053 3503 5178 6338 4618 3621 928 1630 2730 1443 576 3837 2507 -971 -867
$$ packed form
13313C464j397k851k370L03l2N80M87j201O80K037p73k15k34J307J716q98J183
13296A786q23k91K711m26j419K777J00l909k02J695J793k2m39K405j373k630J055
13279B788N10M13l15j709k31j991j316O54P84n52j567j450L139J94K27Q25O49
13262A052N45K081j472l685N2J008J028j156l265n84k38J993R77j614j207j527
13246f012j441M210M040J35q03k044K954q24q79K701J099Q91P78j125j590K31
13230B321k222k83K376L628k75q49l540j968p20P93K310j602k841j83L490N127
13214E562j665n03j066j058j041K039l565l962K975J473M70j113l19J067K077
13199A371J953P29n50J675J160j720r97k693P02J100j287q67L261j330l478J04
$$ plain form
13183 -867 411 545 1017 -444 -4682 -6075 -4110 -773 1579 -1013 -4578 -5762 -4281 -973 -288 -706
13167 -706 2051 1952 752 -2131 -2826 -3119 -3930 -2600 -4153 -1425 -1384 -2472 -2974 -952 -597 -834 -1473 -2755
13149 -2755 269 -378 1844 2191 1039 1324 -840 -2599 -3182 -2645 -4379 -2465 -1861 -1322 -2508 -1188
13133 -1188 -2427 1609 2959 6820 7429 3096 457 -189 795 -785 -125 -1486 -1778 -2392 -2890 -5006
13117 -5006 -4207 -179 -318 1820 4925 6792 8045 6062 2761 1862 554 1528 3230 3384 3076 1482
13101 1482 1340 2658 3077 2692 2531 1341 -248 1243 2189 3349 5061 5454 5992 5088 3626 5984 7711
13084 7711 6651 7406 4513 1831 1224 1989 2253 240 2227 5899 6797 5703 4964 3711 1562 1926
13068 1926 3900 2678 -1353 -5799 -3001 -29 -1442 -4532 -1122 894 -2703 -6049 -7230 -7074 -3875
$$ packed form
13183h67J278J34M72j461m238j393J965L337K352k592l565j184J481L308O85m18
13167g06K757r9j200k883o95k93q11J330j553K728M1j088n02K022L55k37o39j282
13149b755L024o47K222L47j152K85k164j759n83N37j734J914O04N39j186J320
13133a188j239M036J350L861O09m333k639o46R84j580O60j361k92o14m98k116
13117e006P99M028j39K138L105J867J253j983l301q99j308R74J702J54l08j594
13101A482j42J318M19l85j61j190j589J491R46J160J712L93N38r04j462K358J727
13084G711j060P55k893k682o07P65K64k013J987L672Q98j094p39j253k149L64
13068A926J974j222m031m446K798K972j413l090L410K016l597l346j181J56L199
$$ plain form
13053 -3875 -2036 -2066 -3407 -4746 -3452 1438 2563 -1133 -5649 -2678 -1148 -2436 -2159 1816 5649
13038 5649 6638 91 -4873 -4567 -3531 560 4511 4975 6021 3623 3597 4192 2023 2464 2911 4692 5684
13021 5684 5514 3942 1992 3471 5973 4812 1235 1358 1199 2256 2029 3041 2756 1066 -280 1840
13005 1840 2914 2048 880 -1115 -740 2085 3069 3554 1863 2782 2942 3183 3303 3514 4026 1520 1729
12988 1729 3460 569 122 -24 -2286 -1518 3431 4317 2144 553 -1449 -662 3443 4304 2299 1625
12972 1625 852 1015 1701 2182 4597 2161 2516 652 -1408 -1086 408 1203 592 856 -270 -1368 1239
12955 1239 619 -1321 -2601 768 767 -880 -3428 -3477 -231 1181 -1011 60 2255 2358 2021 129 -1488
12938 -1488 -763 -992 -2405 -737 -457 2958 2727 -75 -1461 1470 3155 4114 3963 5492 5331 5571 2756
$$ packed form
13053c875J839l0j341j339J294M890J125l696m516K971J530j288K77L975L833
13038E649R89o547m964L06J036M091L951M64J046k398k6N95k169M41M47J781R92
13021E684j70j572j950J479K502j161l577J23j59J057k27J012k85j690j346K120
13005A840J074q66j168j995L75K825R84M85j691R19J60K41J20K11N12k506K09
12988A729J731k891m47j46k262P68M949Q86k173j591k002P87M105Q61k005o74
12972A625p73J63O86M81K415k436L55j864k060L22J494P95o11K64j126j098K607
12955A239o20j940j280L369jj647k548m9L246J412k192J071K195J03l37j892j617
12938a488P25k29j413J668K80L415k31k802j386K931J685R59j51J529j61K40k815
$$ plain form
12921 2756 605 1790 2556 -259 -814 -85 -1501 1590 2354 1096 3773 4656 3423 3655 5214 6448
12905 6448 6816 4415 -458 -2925 2074 3122 3131 1824 1239 -462 1331 2725 2717 2872 6388 4772 4453
12888 4453 2264 -1203 -2323 -1851 1614 2128 1115 4162 4014 2657 -4922 -6312 -3115 -398 -219 1248
12872 1248 3902 7789 6683 2679 1780 1134 36 -105 1218 4859 6303 5257 4323 3447 2025 392
12856 392 -131 -142 -1972 -877 1212 3790 4684 4639 8676 10263 6926 6056 4870 3073 4086 2920 1895
12839 1895 3504 2784 -251 788 5701 8838 7370 4313 3809 3975 4312 5251 5184 2963 2487 2139 3574
12822 3574 3845 6248 2975 1348 3126 2691 -57 4353 3722 1103 3209 2921 1114 465 381 1215 1511
12805 1511 3592 4964 3701 2562 1538 -420 1418 1960 -259 -346 975 2143 2318 3074 3717 1027
$$ packed form
12921B756k151J185P66k815n55P29j416L091P64j258K677Q83j233K32J559J234
12905F448L68k401m873k467M999J048Rj307n85j701J793J394qJ55L516j616l19
12888D453k189l467j120M72L465N14j013L047j48j357p579j390L197K717J79J467
12872A248K654L887j106m004q99o46j098j41J323L641J444j046r34q76j422j633
12856C92n23j1j830J095K089K578Q94m5M037J587l337q70j186j797J013j166j025
12839A895J609p20l035J039M913L137j468l057n04J66L37R39o7k221m76l48J435
12822C574K71K403l273j627J778m35k748M410o31k619K106k88j807o49q4Q34K96
12805A511K081J372j263j139j024j958J838N42k219q7J321J168J75P56O43k690
$$ plain form
12789 1027 1887 5925 4549 5134 4508 4536 6188 8281 8013 4604 6542 7507 6194 4894 4118 3569 1526
12772 1526 -1524 -2543 -2178 -4735 -7385 -3881 2559 4538 4532 2787 5475 4307 2177 2459 4582 4164
12756 4164 4201 3881 2008 2396 4063 4242 1640 2507 4482 1967 620 2541 5159 5023 4263 4681 4525
12739 4525 3939 8902 9294 7003 3910 3354 4355 2421 2463 2405 -499 845 1545 2137 -776 688 2194
12722 2194 5072 3324 236 -1029 -1474 -327 1786 1520 1652 2348 6945 8150 6078 6369 6064 5384
12706 5384 3809 2113 1862 2715 -626 -4579 -5361 -2906 1392 2875 3203 5062 5963 6320 4553 4545 1849
12689 1849 -523 2031 6062 8520 7057 4175 5638 8059 10953 11305 10870 10013 8520 3902 2282
12674 2282 4510 6379 5817 5483 5365 5701 8639 7963 7464 9074 7346 6402 9110 6507 3446 6449
$$ packed form
12789A027Q60M038j376N85o26K8J652K093k68l409J938R65j313j300p76n49k043
12772A526l050j019L65k557k650L504O440J979oj745K688j168k130K82K123m18
12756D164L7l20j873L88J667J79k602Q67J975k515j347J921K618j36p60M18j56
12739D525n86M963L92k291l093n56J001j934M2n8k904J344P00N92k913J464J506
12722B194K878j748l088j265m45J147K113k66J32O96M597J205k072K91l05o80
12706E384j575j696k51Q53l341l953p82K455M298J483L28J859R01L57j767qk696
12689A849k372K554M031K458j463k882J463K421K894L52m35q57j493m618j620
12674B282K228J869n62l34j18L36K938o76m99J610j728r44K708k603l061L003
$$ plain form
12658 6449 7436 7102 6629 6919 6119 2379 3678 8055 8057 6421 7058 7851 5553 4577 1612 2318 2987 5685
12640 5685 4928 1110 1926 4778 5754 5151 7016 6709 5330 6244 9782 10421 8988 7757 9009 9402 9826
12623 9826 7946 8823 9533 10747 12754 13263 11338 11962 8702 8786 10841 11950 10425 9553 11617 10430
12607 10430 7459 8778 7800 5893 6251 7326 6348 5211 7451 9475 8426 7968 9518 12909 13636 14600
12591 14600 13911 11313 9465 8566 6040 8119 9860 11348 8062 5552 5843 7376 10873 10437 8924
12576 8924 8836 7291 7355 7392 7583 5695 4121 5973 9641 9855 7896 9903 8121 6824 6300 3686 3824
12559 3824 5825 7163 7873 9372 10974 8042 4553 4862 7058 9545 10052 9276 9692 7124 6514 8968
12543 8968 11068 12869 11128 9655 8837 11592 9123 7122 4461 4402 10036 10417 11610 12792 11142 11925
$$ packed form
12658F449R87l34m73K90q00l740J299M377Kj636O37P93k298r76k965P06O69K698
12640E685p57l818Q16K852R76o03J865l07j379R14L538O39j433j231J252L93M24
12623I826j880Q77P10J214K007N09j925O24l260Q4K055J109j525q72K064j187
12607A0430k971J319r78j907L58J075r78j137K240K024j049m58J550L391P27R64
12591A4600o89k598j848q99k526K079J741J488l286k510K91J533L497m36j513
12576H924q8j545O4L7J91j888j574J852L668K14j959K007j782j297n24k614J38
12559C824K001J338P10J499J602k932l489L09K196K487N07p76M16k568o10K454
12543H968K100J801j741j473q18K755k469k001k661n9N634L81J193J182j650P83
$$ plain form
12527 11925 10004 8058 9023 11478 10741 8907 8019 9433 8696 10553 13120 14035 10403 10228 11237 9610
12511 9610 9653 11439 12366 14720 11395 8786 7697 6815 8858 9345 11006 13404 12612 10835 12061 14740
12495 14740 13365 12069 11526 13175 15012 13140 8893 7547 9226 10447 13028 12647 10876 11166 15762
12480 15762 14580 14196 13222 15430 16994 17546 16130 11030 9600 12032 15815 16441 14500 11530 11010 10686
12464 10686 9682 9586 8353 8509 10818 11202 14172 17251 19925 18169 16113 15920 16361 18018 20816 18491
12448 18491 14934 12154 14322 14090 13610 11835 14132 18248 21368 18568 15923 17500 16847 15820 15470
12433 15470 13203 11871 11786 9871 9991 13162 14072 9996 8367 10364 11524 10949 11403 12221 12547 14984
12417 14984 17123 16604 13792 10196 8248 11207 15170 15534 15613 17170 16138 20474 20145 18890 17138 13788
$$ packed form
12527A1925j921j946R65K455p37j834q88J414p37J857K567R15l632j75J009j627
12511I610M3J786R27K354l325k609j089q82K043M87J661K398p92j777J226K679
12495A4740j375j296n43J649J837j872m247j346J679J221K581l81j771K90M596
12480A5762j182l84r74K208J564N52j416n100j430K432L783O26j941k970n20l24
12464A0686j004r6j233J56K309L84K970L079K674j756k056j93M41J657K798k325
12448A8491l557k780K168k32m80j775K297M116L120k800k645J577o53j027l50
12433A5470k267j332q5j915J20L171R10m076j629J997J160n75M54Q18L26K437
12417A4984K139n19k812l596j948K959L963L64P9J557j032M336l29j255j752l350
$$ plain form
12401 13788 11710 12725 13743 15146 19346 20212 19731 21593 17672 13375 14199 13938 12663 17616 19189
12386 19189 18927 19360 19210 19378 20117 20691 21620 21450 18971 18855 23602 20118 14928 14531 20045 23797 26304
12369 26304 27662 26746 25158 23376 23615 21656 19962 16623 17278 20118 20286 16710 17004 20909 22986 22377
12353 22377 22933 21423 20464 22847 24739 24114 25533 25430 23424 24847 24115 22217 24234 25501 25654 25558
12337 25558 24679 21962 19688 19809 16877 18121 18582 19029 22114 23673 23458 22947 24043 22622 22403 25497
12321 25497 25626 23313 24659 23135 24425 23986 23414 22205 25195 23284 26240 29747 32007 30347 30145
12306 30145 26800 26548 26877 27870 26812 26941 26355 25376 27365 28056 28128 27373 28026 32201 33769 31151 30491
12289 30491 28366 28710 29756 29900 29318 29144 32388 32458 32912 34458 32003 29983 29247 30335 33803 34835
$$ packed form
12401A3788k078J015J018J403M200Q66m81J862l921m297Q24k61j275M953J573
12386A9189k62M33j50J68P39N74R29j70k479j16M747l484n190l97N514L752K507
12369B6304J358r16j588j782K39j959j694l339O55K840J68l576K94L905K077o09
12353B2377N56j510r59K383J892o25J419j03k006J423p32j898K017J267J53r6
12337B5558q79k717k274J21k932J244M61M47L085J559k15n11J096j421k19L094
12321B5497J29k313J346j524J290m39n72j209K990j911K956L507K260j660k02
12306C0145l345k52L29R93j058J29n86r79J989O91P2p55O53M175J568k618o60
12289C0491k125L44J046J44n82j74L244P0M54J546k455k020p36J088L468J032
$$ plain form
12273 34835 34931 33864 32228 31958 34769 33801 36063 39576 38914 38305 39052 37561 37771 38123 39706 38910 38682
12256 38682 39030 39903 42707 43518 41265 44679 45193 42615 41476 38474 39778 40744 37852 38095 39656 40869
12240 40869 38623 38042 38879 37825 38108 40243 41660 43126 43446 43747 45601 42495 39715 44531 47939 51706
12224 51706 53541 52985 51266 45153 44245 47996 49301 52792 53104 53595 56853 59324 59989 58664 59629 57587
12208 57587 55542 57482 58453 58894 59568 62550 64022 65734 65201 61765 63201 65884 66750 67640 68757 66198
12192 66198 66911 69467 71640 74513 78771 79205 79390 77612 74506 72092 73339 74153 75821 74229 73330 71639
12176 71639 73685 75807 80373 80982 81943 82028 81068 79185 77988 77955 80276 84030 82972 81516 82525 83496
12160 83496 84242 85563 81562 80828 80735 80383 83295 83508 85565 89187 90890 91524 86756 88026 91879 95640
$$ packed form
12273C4835R6j067j636k70K811r68K262L513o62o09P47j491K10L52J583p96k28
12256C8682L48Q73K804Q11k253L414N14k578j139l002J304R66k892K43J561J213
12240D0869k246n81Q37j054K83K135J417J466L20L01J854l106k780M816L408L767
12224E1706J835n56j719o113r08L751J305L491L12M91L258K471O65j325R65k042
12208E7587k045J940R71M41O74K982J472J712n33l436J436K683Q66Q90J117k559
12192F6198P13K556K173K873M258M34J85j778l106k414J247Q14J668j592q99j691
12176G1639K046K122M566O09R61Q5r60j883j197l3K321L754j058j456J009R71
12160H3496P46J321m001p34r3l52K912K13K057L622J703O34m768J270L853L761
$$ plain form
12144 95640 99024 100839 99193 99224 99831 98674 103504 106745 106793 107251 110329 107310 107549 112478 114662 112706
12128 112706 112275 114565 113808 113438 118140 121372 118138 121336 124632 129049 131147 132718 136253 137158 138011
12113 138011 139155 141201 144604 148817 146797 144357 146912 149180 153445 156262 157254 155237 154709 155302 158121
12098 158121 164295 169523 176339 178749 180324 184237 186211 189335 192972 198033 200042 205343 209428 214100
12084 214100 222016 229037 233680 238535 244625 249960 255161 261167 270811 275953 281335 286908 295280 301765
12070 301765 309014 316406 325077 331977 337453 342932 347352 353473 357369 361493 363486 367200 371160 374636
12056 374636 375362 376293 379342 379827 380922 382995 381915 382867 383667 384446 387237 392408 395815 396776 398112 402420
12040 402420 411730 415220 418233 419234 425039 431780 438590 445032 453962 464804 474540 481753 488835 493829
$$ packed form
12144I5640L384J815j646L1O07j157M830L241M8M58L078l019K39M929K184j956
12128A12706m31K290p57l70M702L232l234L198L296M417K098J571L535R05Q53
12113A38011J144K046L403M213k020k440K555K268M265K817R92k017n28N93K819
12098A58121O174N228O816K410J575L913J974L124L637N061K009N301M085M672
12084B14100P916P021M643M855O090N335N201O006R644N142N382N573Q372O485
12070C01765P249P392Q671O900N476N479M420O121L896M124J993L714L960L476
12056C74636P26R31L049M85J095K073j080R52Q00P79K791N171L407R61J336M308
12040D02420R310L490L013J001N805O741O810O442Q930J0842R736P213P082M994
$$ plain form
12026 493829 505251 515306 523660 535886 546115 558963 572042 584771 595516 610122 623942 633204
12014 633204 648160 666036 683109 699816 721218 738404 758027 777052 793268 813699 834866
12003 834866 854874 879819 907088 935528 964500 993251 1020882 1054018 1089473 1125615 1162247
11992 1162247 1200877 1241241 1281974 1328124 1375662 1421472 1472109 1527931 1586672 1647263 1709603
11981 1709603 1773606 1845307 1921857 2002839 2088456 2179023 2276976 2379240 2487022 2607441 2734737
11970 2734737 2867865 3009179 3157175 3317191 3488504 3674591 3875553 4088907 4317105
11961 4317105 4563915 4827072 5109228 5412711 5737614 6084134 6454339 6848484 7263983
11952 7263983 7707879 8176226 8667361 9175961 9700553 10232853 10771090 11302653 11826320
$$ packed form
12026D93829J1422J0055Q354J2226J0229J2848J3079J2729J0745J4606J3820R262
12014F33204J4956J7876J7073J6707K1402J7186J9623J9025J6216K0431K1167
12003H34866K0008K4945K7269K8440K8972K8751K7631L3136L5455L6142L6632
11992A162247L8630M0364M0733M6150M7538M5810N0637N5822N8741O0591O2340
11981A709603O4003P1701P6550Q0982Q5617R0567R7953J02264J07782J20419J27296
11970B734737J33128J41314J47996J60016J71313J86087K00962K13354K28198
11961D317105K46810K63157K82156L03483L24903L46520L70205L94145M15499
11952G263983M43896M68347M91135N08600N24592N32300N38237N31563N23667
$$ plain form
11943 11826320 12328973 12798383 13224579 13596664 13907066 14145911 14305060 14380418 14373955 14287907
11933 14287907 14127555 13897570 13611084 13276261 12905542 12503325 12077171 11643828 11203851
11924 11203851 10769427 10342400 9924498 9520073 9128868 8755329 8400762 8060203 7736864
11915 7736864 7430350 7134454 6854912 6592777 6344081 6109107 5885990 5674981 5475175
11906 5475175 5285293 5105489 4931755 4767930 4613592 4471190 4336280 4202804 4075969
11897 4075969 3954409 3838179 3730103 3626382 3525525 3430501 3343026 3258362 3174889 3092355
11887 3092355 3013916 2938192 2866577 2794561 2727490 2662484 2600159 2543076 2487219 2427450 2370442
11876 2370442 2317817 2267824 2216174 2168941 2122644 2076851 2033018 1990562 1948332 1908792 1869299
$$ packed form
11943A1826320N02653M69410M26196L72085L10402K38845J59149P5358o463q6048
11933A4287907j60352k29985k86486l34823l70719m02217m26154m33343m39977
11924A1203851m34424m27027m17902m04425l91205l73539l54567l40559l23339
11915G736864l06514k95896k79542k62135k48696k34974k23117k11009j99806
11906E475175j89882j79804j73734j63825j54338j42402j34910j33476j26835
11897D075969j21560j16230j08076j03721j00857r5024q7475q4664q3473q2534
11887C092355p8439p5724p1615p2016o7071o5006o2325n7083n5857n9769n7008
11876B370442n2625m9993n1650m7233m6297m5793m3833m2456m2230l9540l9493
$$ plain form
11865 1869299 1827325 1792992 1756764 1715955 1681107 1649599 1618599 1585411 1552962 1521422 1489888
11854 1489888 1463965 1435682 1411028 1386121 1359973 1334859 1311532 1287762 1262518 1239765 1220328
11843 1220328 1201520 1183659 1166750 1147830 1129024 1110300 1095418 1080650 1064776 1049345 1034639
11832 1034639 1021142 1009138 997856 987106 976162 963869 952095 944250 938025 928468 921343 917300
11820 917300 909499 900721 893621 889234 881857 875237 869439 859964 849973 843344 841323 833442 821502 807455
11806 807455 794701 782150 771582 758104 746885 736084 724452 710241 695305 682743 671446
11795 671446 658983 643444 628812 618170 609866 601013 589387 578906 570691 563122 554630 544750 537452
11782 537452 530012 524484 519428 509581 497813 488883 481032 475484 470236 465021 456213 446791 439674 432662
$$ packed form
11865A869299m1974l4333l6228m0809l4848l1508l1000l3188l2449l1540l1534
11854A489888k5923k8283k4654k4907k6148k5114k3327k3770k5244k2753j9437
11843A220328j8808j7861j6909j8920j8806j8724j4882j4768j5874j5431j4706
11832A034639j3497j2004j1282j0750j0944j2293j1774p845o225r557p125m043
11820I17300p801q778p100m387p377o620n798r475r991o629k021p881j1940j4047
11806H07455j2754j2551j0568j3478j1219j0801j1632j4211j4936j2562j1297
11795F71446j2463j5539j4632j0642q304q853j1626j0481q215p569q492r880p298
11782E37452p440n528n056r847j1768q930p851n548n248n215q808r422p117p012
$$ plain form
11768 432662 427510 422288 418813 410577 404016 398289 393890 392401 390031 382010 374638 369485 364502 358060
11754 358060 350484 348277 347147 342562 333057 325200 321570 322030 322428 319525 313668 312329 309296 303480 294282
11739 294282 294985 295669 297827 292220 283233 275981 271888 266648 262590 264265 262541 257818 251850 251194 250398
11724 250398 247316 242925 240841 241456 236836 232605 230056 229210 226240 223693 222454 220865 218785 217447 214927
11709 214927 212415 211740 212692 212098 208451 203988 200951 200590 200954 195125 190241 187802 187875 187841 188283 184308 180889
11692 180889 183136 183319 181190 180229 176967 173054 168971 166938 168593 166833 165441 165012 164798 163454 161588
11677 161588 158812 158535 157707 156232 150250 145604 142735 145352 146323 141874 139299 138190 137009 135090 136106
11662 136106 137661 136349 131199 128343 129226 131089 131574 131030 132450 131076 128115 126491 127188 128410 125380
$$ packed form
11768D32662n152n222l475q236o561n727m399j489k370q021p372n153m983o442
11754C58060p576k207j130m585r505p857l630M60L98k903n857j339l033n816r198
11739B94282P03O84K158n607q987p252m093n240m058J675j724m723n968o56p96
11724B50398l082m391k084O15m620m231k549q46k970k547j239j589k080j338k520
11709B14927k512o75R52n94l647m463l037l61L64n829m884k439P3l4M42l975l419
11692A80889K247J83k129r61l262l913m083k033J655j760j392m29k14j344j866
11677A61588k776k77q28j475n982m646k869K617R71m449k575j109j181j919J016
11662A36106J555j312n150k856Q83J863M85n44J420j374k961j624O97J222l030
$$ plain form
11647 125380 125694 127796 126791 124669 122773 118138 117036 117985 117218 114620 111552 111993 113399 114025 114797 112656
11631 112656 109738 105484 107805 110215 109988 106610 106217 106790 105400 105055 104433 103444 101345 101036 98546 98075
11615 98075 92733 93790 96184 95742 95792 95173 95236 93592 92424 92314 90449 86779 86332 86101 88292 89401 89210
11598 89210 90419 87155 83127 81731 82234 84195 84530 84064 83427 83429 80074 80565 82504 79976 76411 73174
11582 73174 71960 71961 73625 73225 73499 75045 74284 72763 71543 70558 74230 72379 70828 70516 70509 72538 73403
11565 73403 72991 73738 73800 74095 72957 69326 65397 63311 61827 61081 63923 64804 65902 65591 65441 64403 61366
11548 61366 61148 63100 64077 61218 58920 58769 61454 61674 63297 65189 62494 60133 59993 61077 57125 56662
11532 56662 57830 57356 58693 58516 57501 58584 60366 58552 58159 60352 60286 59550 57379 53723 54720 56763
$$ packed form
11647A25380L14K102j005k122j896m635j102R49p67k598l068M41J406O26P72k141
11631A12656k918m254K321K410k27l378l93N73j390l45o22r89k099l09k490m71
11615I8075n342J057K394m42N0o19O3j644j168j10j865l670m47k31K191J109j91
11598H9210J209l264m028j396N03J961L35m66o37Kl355M91J939k528l565l237
11582G3174j214JJ664m00K74J546p61j521j220r85L672j851j551l12pK029Q65
11565G3403m12P47O2K95j138l631l929k086j484p46K842Q81J098l11j50j038l037
11548F1366k18J952R77k859k298j51K685K20J623J892k695k361j40J084l952m63
11532E6662J168m74J337j77j015J083J782j814l93K193o6p36k171l656R97K043
$$ plain form
11516 56763 54962 52208 50622 50507 54499 54456 52348 55180 56690 54785 55822 58176 55847 53479 52709
11501 52709 53080 53189 52326 56083 52880 51617 52219 53379 53001 51520 49041 46975 48903 48342 45829 43898
11485 43898 42557 44211 45035 44725 47772 47382 46277 43297 44299 42853 42375 44080 42643 42471 43147 44310
11469 44310 44394 43154 43569 41056 41325 42432 41175 40619 41930 40459 40737 40988 41385 41621 40769 42264 41289
11452 41289 40878 42260 42722 43857 41277 38711 37374 37307 37936 41225 43164 43372 44226 44988 42567 40592
11436 40592 39532 36897 38313 39183 39578 40246 40461 41617 42484 43567 45629 44148 45310 45022 42762 40547
11420 40547 40695 42368 42886 42196 39807 37360 38683 38706 38800 39661 40762 40742 40861 36928 34197 34567 37744
11403 37744 38348 39655 37161 37866 38681 37089 36369 40349 41783 39907 40421 41392 40025 38810 36227 33851
$$ packed form
11516E6763j801k754j586j15L992m3k108K832J510j905J037K354k329k368p70
11501E2709L71J09q63L757l203j263O02J160l78j481k479k066J928n61k513j931
11485D3898j341J654Q24l10L047l90j105k980J002j446m78J705j437j72O76J163
11469D4310Q4j240M15k513K69J107j257n56J311j471K78K51L97K36q52J495r75
11452D1289m11J382M62J135k580k566j337o7O29L289J939K08Q54P62k421j975
11436D0592j060k635J416Q70L95O68K15J156Q67J083K062j481J162k88k260k215
11420D0547J48J673N18o90k389k447J323K3R4Q61J101k0J19l933k731L70L177
11403C7744O04J307k494P05Q15j592p20L980J434j876N14R71j367j215k583k376
$$ plain form
11387 33851 32311 30794 33252 37720 36414 36044 38009 38495 36597 33913 34308 34225 32129 32443 34714 37011
11371 37011 35595 31134 31434 34447 36482 37200 34466 33272 33017 32291 34567 33495 30167 27580 29506
11356 29506 30479 30212 31941 32977 33976 36619 34583 33726 30926 30180 34718 32857 29884 27211 26612 29340
11340 29340 29579 33309 35724 35084 34582 34253 32364 31727 35066 38436 41039 39955 38500 38038 36239 34695
11324 34695 34115 29505 26766 29417 32264 33951 33528 31004 29658 29208 32282 33912 35338 37200 36175
11309 36175 33798 33856 33370 31966 31093 31311 32110 31778 30397 27314 23276 23440 25010 28513 29162 30836 33817
11292 33817 30831 32263 33726 32812 34178 33696 32857 32656 31757 31163 31111 30356 28448 26779 26541 26928 29150
11275 29150 30778 29592 31922 31991 32159 30041 29367 30927 31400 29594 28996 30553 31380 34836 32442 27299
$$ packed form
11387C3851j540j517K458M468j306l70J965M86j898k684L95q3k096L14K271K297
11371C7011j416m461L00L013K035P18k734j194k55p26K276j072l328k587J926
11356B9506R73k67J729J036R99K643k036q57k800p46M538j861k973k673n99K728
11340B9340K39L730K415o40n02l29j889o37L339L370K603j084j455m62j799j544
11324C4695n80m610k739K651K847J687m23k524j346m50L074J630J426J862j025
11309C6175k377N8m86j404q73K18P99l32j381l083m038J64J570L503O49J674K981
11292C3817k986J432J463r14J366m82q39k01q99n94n2p55j908j669k38L87K222
11275B9150J628j186K330O9J68k118o74J560M73j806n98J557Q27L456k394n143
$$ plain form
11259 27299 25902 26353 28792 29704 30027 31739 30200 29169 28300 27528 27460 29422 32017 32119 30401 31728
11243 31728 30812 28043 23952 22310 24398 26446 25273 26269 27107 28514 29841 29826 28081 30084 32210 29705
11227 29705 27773 28920 29519 27662 31048 31485 31195 26846 28358 29898 30790 28224 26980 27775 26196 25055
11211 25055 26160 30921 31713 29051 28247 27864 27355 25191 24847 24507 23155 22650 23399 24379 27574 31014 30827
11194 30827 32027 29391 27971 27339 28739 29099 28922 29171 30955 32816 30957 31285 29706 29672 30213 31614
11178 31614 30116 26443 23419 25923 27392 27238 28717 27731 28252 26841 27684 27561 25708 26658 28374 26288
11162 26288 25582 24792 26501 26526 26604 26149 25882 27363 27202 27294 29375 31205 28692 26612 25973 25387 28986 27524
11144 27524 26464 28004 28878 28730 28180 27715 26856 26496 25830 24991 26400 27109 24014 25952 28503 28566 29781
$$ packed form
11259B7299j397M51K439R12L23J712j539j031q69p72o8J962K595J02j718J327
11243C1728r16k769m091j642K088K048j173R96Q38J407J327j5j745K003K126k505
11227B9705j932J147N99j857L386M37k90m349J512J540Q92k566j244P95j579j141
11211B5055J105M761P92k662q04l83n09k164l44l40j352n05P49R80L195L440j87
11194C0827J200k636j420o32J400L60j77K49J784J861j859L28j579l4N41J401
11178C1614j498l673l024K504J469j54J479r86N21j411Q43j23j853R50J716k086
11162B6288p06p90J709K5P8m55k67J481j61R2K081J830k513k080o39n86L599j462
11144B7524j060J540Q74j48n50m65q59l60o66q39J409P09l095J938K551O3J215
$$ plain form
11127 29781 28840 29325 30138 29859 28401 31022 28834 27734 26023 26382 27853 27457 24511 25954 26955 26267
11111 26267 26293 23782 23359 25745 24668 26921 30643 32084 30499 30136 30523 28296 25583 27251 30497 30107
11095 30107 27088 26590 26505 24447 23386 23241 22314 25154 28867 28032 26166 28884 28043 27532 27052 25882 24669
11078 24669 24987 29552 29683 29382 26466 25421 26219 27822 27925 27495 25377 25928 28431 25380 24431 26489
11062 26489 28077 28508 27595 26555 26394 26603 29416 29680 27139 24142 22501 21328 21552 22990 26116 26733
11046 26733 28836 29252 24828 25446 29659 33661 37750 34689 31101 32561 36554 38544 39007 36546 34544
11031 34544 37068 41652 45048 43031 43206 47130 47296 47768 44320 42432 43005 46285 46516 48855 51197 55046
11015 55046 60238 59131 57642 61715 57246 50309 47192 44937 42982 42182 44189 47388 48416 50930 52138
$$ packed form
11127B9781r41M85Q13k79j458K621k188j100j711L59J471l96k946J443J001o88
11111B6267K6k511m23K386j077K253L722J441j585l63L87k227k713J668L246l90
11095C0107l019m98q5k058j061j45r27K840L713q35j866K718q41n11m80j170j213
11078B4669L18M565J31l01k916j045P98J603J03m30k118N51K503l051r49K058
11062B6489J588M31r13j040j61K09K813K64k541k997j641j173K24J438L126O17
11046B6733K103M16m424O18M213M002M089l061l588J460L993J990M63k461k002
11031C4544K524M584L396k017J75L924J66M72l448j888N73L280K31K339K342L849
11015E5046N192j107j489M073m469o937l117k255j955q00K007L199J028K514J208
$$ plain form
11000 52138 52174 51420 50920 48834 44742 40594 38695 38456 38100 37028 37260 36270 33343 33882 30172 29241 30208
10983 30208 28845 29623 31577 30512 28322 26236 26951 26930 25743 28037 29059 24126 23238 27382 29578 30790
10967 30790 30504 29460 30652 33094 28181 23743 23417 29035 31927 31258 29191 29760 32427 33462 29690
10952 29690 29897 31201 32936 28724 30071 31128 30083 28024 25481 23624 24439 27627 26480 28343 29835
10937 29835 30980 29187 27309 27659 24535 23512 26177 27030 27187 29003 28415 27345 28000 26830 25908 30210
10921 30210 32431 29729 24213 21993 20687 21576 22974 22285 25878 30805 30229 31556 31642 32162 30984 30144
10905 30144 30527 31114 29135 25475 27604 29498 28750 27751 24607 23790 26956 26605 23753 23854 25414 28386
10889 28386 26819 27778 28401 26610 24144 23882 25924 25596 23384 25127 28146 28417 27478 26162 26015 23289
$$ packed form
11000E2138L6p54n00k086m092m148j899k39l56j072K32r90k927N39l710r31R67
10983C0208j363P78J954j065k190k086P15k1j187K294J022m933q88M144K196J212
10967C0790k86j044J192K442m913m438l26N618K892o69k067N69K667J035l772
10952B9690K07J304J735m212J347J057j045k059k543j857Q15L188j147J863J492
10937B9835J145j793j878L50l124j023K665Q53J57J816n88j070O55j170r22M302
10921C0210K221k702n516k220j306Q89J398o89L593M927n76J327Q6N20j178q40
10905C0144L83N87j979l660K129J894p48r99l144q17L166l51k852J01J560K972
10889B8386j567R59O23j791k466k62K042l28k212J743L019K71r39j316j47k726
$$ plain form
10873 23289 23225 21169 21944 23680 22426 22994 24437 27150 27172 25187 23515 25979 24850 23948 28133 30858
10857 30858 31181 27091 28825 30134 29641 32368 31988 29815 30365 30149 31272 32267 30063 28411 32411 34550
10841 34550 33717 31193 31734 32095 31412 33878 35851 35753 37890 37299 34240 31905 30310 29477 28437 28637 28834
10824 28834 30340 33330 31977 32224 33369 34924 39492 40332 39330 36309 31096 31701 33637 32607 31943
10809 31943 33711 32096 32794 30563 30388 33186 33869 34745 34446 32233 30459 28750 30197 32712 33374 33682
10793 33682 33782 36081 37829 36088 36679 35215 34302 34261 34411 35814 35825 33300 34026 35056 35229 37170 39630
10776 39630 38127 34657 33214 34650 36633 37384 36003 36235 34156 31799 32269 35859 35252 33431 32277
10761 32277 32643 33502 33444 36897 39763 41136 40334 36839 38137 37887 35821 37008 40573 39398 36010 35259
$$ packed form
10873B3289o4k056P75J736j254N68J443K713K2j985j672K464j129r02M185K725
10857C0858L23m090J734J309m93K727l80k173N50k16J123R95k204j652M000K139
10841C4550q33k524N41L61o83K466J973r8K137n91l059k335j595q33j040K00J97
10824B8834J506K990j353K47J145J555M568Q40j002l021n213O05J936j030o64
10809C1943J768j615O98k231j75K798O83Q76k99k213j774j709J447K515O62L08
10793C3682J00K299J748j741N91j464r13m1J50J403J1k525P26J030J73J941K460
10776C9630j503l470j443J436J983P51j381K32k079k357M70L590o07j821j154
10761C2277L66Q59n8L453K866J373q02l495J298k50k066J187L565j175l388p51
$$ plain form
10745 35259 35183 35579 33231 35292 37746 39024 40641 42611 45292 47061 50343 50818 50980 54692 53745 52365
10729 52365 50425 49270 48513 49322 52749 55740 57873 60797 69298 76367 79219 78265 74233 67230 64186
10714 64186 64766 66308 68121 68444 74395 81383 86064 90117 90838 82124 71855 68322 65084 64491 65662
10699 65662 66096 69826 74036 75815 76945 74369 65913 58655 55763 53276 52252 51986 53298 56004 58353
10684 58353 57834 54315 49276 44955 44322 48502 51613 49585 49862 50672 51991 51270 49140 49483 49208 48663
10668 48663 48096 48980 51103 52451 52290 50497 51244 52576 53532 53694 55120 58174 56379 56395 58248 59185 60806
10651 60806 59646 59282 62556 67376 73128 77216 81582 87744 90515 89116 89737 92732 93666 93210 92737 90525
10635 90525 89545 90986 93965 99749 107894 118455 128805 137901 152349 167523 180345 193413 204518
$$ packed form
10745C5259p6L96k348K061K454J278J617J970K681J769L282M75J62L712r47j380
10729E2365j940j155p57Q09L427K991K133K924Q501P069K852r54m032p003l044
10714F4186N80J542J813L23N951O988M681M053P21q714j0269l533l238n93J171
10699F5662M34L730M210J779J130k576q456p258k892k487j024k66J312K706K349
10684E8353n19l519n039m321o33M180L111k028K77Q10J319p21k130L43k75n45
10668D8663n67Q84K123J348j61j793P47J332R56J62J426L054j795J6J853R37J621
10651F0806j160l64L274M820N752M088M366O162K771j399O21K995R34m56m73k212
10635I0525r80J441K979N784Q145J0561J0350R096J4448J5174J2822J3068J1105
$$ plain form
10622 204518 216296 228477 237409 253261 281726 318238 369602 435293 525758 635837 776112
10611 776112 945904 1121658 1287303 1446703 1604289 1738478 1818281 1836531 1837598 1876578
10601 1876578 1988660 2184936 2445461 2734350 3019985 3299789 3565451 3758839 3790028 3664652
10591 3664652 3492390 3398426 3446636 3636110 3926121 4253401 4573198 4873291 5131223 5252234
10581 5252234 5112276 4729211 4285627 3937315 3742306 3691072 3743848 3841252 3946701 4043865
10571 4043865 4108647 4072303 3857530 3494161 3107643 2796961 2589637 2472525 2415905 2389458
10561 2389458 2370296 2346475 2301331 2208820 2046634 1833528 1614343 1422166 1263964 1141563
10551 1141563 1047297 974511 915658 865183 821210 779012 741549 717140 693855 668863 650097
$$ packed form
10622B04518J1778J2181Q932J5852K8465L6512N1364O5691R0465J10079J40275
10611G76112J69792J75754J65645J59400J57586J34189P9803J8250J067L8980
10601A876578J12082J96276K60525K88889K85635K79804K65662J93388L1189j25376
10591C664652j72262r3964M8210J89474K90011L27280L19797L00093K57932J21011
10581E252234j39958l83065m43584l48312j95009n1234N2776R7404J05449R7164
10571D043865O4782l6344k14773l63369l86518l10682k07324j17112n6620k6447
10561B389458j9162k3821m5144r2511j62186k13106k19185j92177j58202j22401
10551A141563r4266p2786n8853n0475m3973m2198l7463k4409k3285k4992j8766
$$ plain form
10540 650097 632629 612278 592500 572048 553735 540112 526640 513426 503210 491998 479238
10529 479238 465599 456513 449873 441803 434081 429284 419588 408227 399985 389649 381005 374264 364960
10516 364960 358821 351049 345901 337856 330230 323489 314938 305579 300798 294217 290430 284033 277561 272954
10502 272954 268162 268167 266262 261076 257227 255485 254268 250897 244382 238770 233516 230480 228592 224820 222259
10487 222259 219025 220699 218756 214809 216725 221419 219637 220959 223227 218597 218475 220009 225354 231355
10473 231355 239318 251179 268082 290611 315558 344281 374867 403456 429789 455597 478063 493056
10461 493056 502864 510043 517625 520573 520730 517639 504271 486467 463048 428394 390436 354541 327191
10448 327191 304341 282979 266164 252930 241076 232589 221835 211213 201379 193469 191374 190131
$$ packed form
10540F50097j7468k0351j9778k0452j8313j3623j3472j3214j0216j1212j2760
10529D79238j3639r086o640q070p722m797r696j1361q242j0336q644o741r304
10516C64960o139p772n148q045p626o741q551r359m781o581l787o397o472m607
10502B72954m792Nj905n186l849j742j217l371o515n612n254l036j888l772k561
10487B22259l234J674j943l947J916M694j782J322K268m630j22J534N345O001
10473B31355P963J1861J6903K2529K4947K8723L0586K8589K6333K5808K2466J4993
10461D93056R808P179P582K948J57l091j3368j7804k3419l4654l7958l5895k7350
10448C27191k2850k1362j6815j3234j1854q487j0754j0622r834p910k095j243
$$ plain form
10436 190131 183641 180725 178692 175062 174960 172996 166370 160633 154818 150675 146337 140095 140747 138518 134739
10421 134739 132807 131772 132891 132247 130522 128899 129019 130019 126512 123356 120241 118719 116932 118415 118175
10406 118175 114959 111171 111299 110646 108821 105524 104088 103256 103855 101135 99948 101070 102332 102234 100753 98443
10390 98443 100471 101254 99553 98839 93537 91379 90792 91558 91490 92975 92800 90292 85917 82157 79587 79374
10374 79374 81480 85050 87007 85731 84743 82701 82048 81784 80068 79643 82457 80753 79104 80192 81355
10359 81355 79086 77300 76870 77763 79473 77788 77776 77441 79401 80970 81047 82300 82382 79967 81165 80719 79672
10342 79672 80282 80982 82544 83650 81807 83456 85436 84984 83324 84382 86855 86644 85292 85414 84543 84089
10326 84089 84140 87771 91889 95306 96725 97472 98792 96571 100696 101736 101515 105276 107972 112368 121577
$$ packed form
10436A90131o490k916k033l630j02j964o626n737n815m143m338o242O52k229l779
10421A34739j932j035J119o44j725j623J20J000l507l156l115j522j787J483k40
10406A18175l216l788J28o53j825l297j436q32N99k720j187J122J262r8j481k310
10390I8443K028P83j701p14n302k158n87P66o8J485j75k508m375l760k570k13
10374G9374K106L570J957j276r88k042o53k64j716m25K814j704j649J088J163
10359H1355k269j786m30Q93J710j685j2l35J960J569P7J253Q2k415J198m46j047
10342G9672O10P00J562J106j843J649J980m52j660J058K473k11j352J22q71m54
10326H4089N1L631M118L417J419P47J320k221M125J040k21L761K696M396R209
$$ plain form
10311 121577 129740 135822 141450 148362 155887 160216 160431 156074 144434 131130 120378 113907 107468 103584
10297 103584 100986 96268 92862 96487 98560 97431 95178 91963 90071 89936 87812 86164 83768 83301 82860
10282 82860 82174 80090 78404 78648 78113 77901 79184 82322 87990 92036 95692 94542 94195 91902 91149 93669
10266 93669 94316 94077 92493 89942 87987 89848 93083 96394 97656 96601 96357 97274 97522 99482 102042 104509
10250 104509 105684 102160 104500 112428 120356 130104 133211 131482 125149 110186 100987 98120 95618 96686
10236 96686 99212 104178 107455 107263 105297 104139 107492 107798 110894 111421 113036 113897 114764 113980 114096 110851
10220 110851 109823 112806 112892 112544 112193 111895 114069 116653 116763 117239 118259 119596 122313 128261 127521 131045
10204 131045 134627 136982 139707 141903 146057 151811 155141 160620 165457 169373 179976 187921 197972 209071
$$ packed form
10311A21577Q163O082N628O912P525M329K15m357j1640j3304j0752o471o439l884
10297A03584k598m718l406L625K073j129k253l215j892j35k124j648k396m67m41
10282H2860o86k084j686K44n35k12J283L138N668M046L656j150l47k293p53K520
10266I3669O47k39j584k551j955J861L235L311J262j055k44R17K48J960K560K467
10250A04509J175l524K340P928P928R748L107j729o333j4963r199k867k502J068
10236I6686K526M966L277j92j966j158L353L06L096N27J615Q61Q67p84J16l245
10220A10851j028K983Q6l48l51k98K174K584J10M76J020J337K717N948p40L524
10204A31045L582K355K725K196M154N754L330N479M837L916J0603P945J0051J1099
$$ plain form
10190 209071 222932 244261 271710 297253 330079 372756 432576 519000 641472 808071 1015473
10179 1015473 1213880 1274426 1113640 816803 553529 403027 335623 302497 277089 257068
10169 257068 243293 236303 230750 226292 225865 227910 230909 231878 233890 238504 239881 238093 233309 231069
10155 231069 226029 224171 226922 228231 229212 231964 235468 241911 245401 248818 253798 256871 255835 254380
10141 254380 251047 251867 250313 249807 251334 254056 256184 258785 259473 258676 257020 255648 257797 260398 267928
10126 267928 274433 284687 292983 300820 309771 320346 329807 340236 346511 351515 357143 363554 367927
10113 367927 373868 381074 390028 394912 400008 407945 419881 430694 446400 462754 481279 499940 518324
10100 518324 536107 552035 569328 589529 614155 644543 678409 719245 755423 792391 843126
$$ packed form
10190B09071J3861K1329K7449K5543L2826M2677N9820Q6424J22472J66599K07402
10179A015473J98407O0546j60786k96837k63274j50502o7404l3126k5408k0021
10169B57068j3775o990n553m458m27K045K999R69K012M614J377j788m784k240
10155B31069n040j858K751J309R81K752L504O443L490L417M980L073j036j455
10141B54380l333Q20j554n06J527K722K128K601O88p97j656j372K149K601P530
10126B67928O505J0254Q296P837Q951J0575R461J0429O275N004N628O411M373
10113C67927N941P206Q954M884N096P937J1936J0813J5706J6354J8525J8661J8384
10100E18324J7783J5928J7293K0201K4626L0388L3866M0836L6178L6968N0735
$$ plain form
10089 843126 899043 955638 1014991 1078285 1149534 1230436 1318878 1414884 1523789 1648904 1801722
10078 1801722 1986895 2213591 2484108 2785419 3122441 3514226 3977614 4500960 5075542
10069 5075542 5736807 6555293 7615604 8997922 10812477 13229881 16549502 21232024
10061 21232024 27863314 36936238 48283626 60623822 72187046 82315227 91743416
10054 91743416 99879655 102419431 94959217 79379357 62291866 48434773 38645266 31907433
10046 31907433 27115336 23553550 20789531 18579954 16786036 15328467 14150193 13207073
10038 13207073 12441189 11798157 11231123 10709513 10207967 9689543 9137949 8579392 8062657
10029 8062657 7614721 7232023 6898694 6600961 6332966 6085512 5853372 5639975 5444220
$$ packed form
10089H43126N5917N6595N9353O3294P1249Q0902Q8442R6006J08905J25115J52818
10078A801722J85173K26696K70517L01311L37022L91785M63388N23346N74582
10069E075542O61265Q18486J060311J382318J814555K417404L319621M682522
10061B1232024O631290R072924J1347388J2340196J1563224J0128181R428189
10054I1743416Q136239K539776p460214j5579860j7087491j3857093r789507o737833
10046C1907433m792097l561786k764019k209577j793918j457569j178274r43120
10038A3207073p65884o43032n67034n21610n01546n18424n51594n58557n16735
10029H062657m47936l82698l33329k97733k67995k47454k32140k13397j95755
$$ plain form
10020 5444220 5263276 5097882 4947561 4803486 4665104 4530971 4406592 4286152 4174337
10011 4174337 4067852 3970465 3880312 3795100 3711061 3626986 3549340 3477089 3412977 3358984 3303812
10000 3303812 3247261 3192266 3138200 3089228 3037216 2983204 2922101 2855147 2783680 2710027 2640945
9989 2640945 2575402 2514305 2452465 2394714 2335595 2281214 2229383 2177944 2125899 2074003 2024061
9978 2024061 1977284 1929891 1885256 1841377 1796564 1756670 1720632 1686882 1649874 1610485 1575656
9967 1575656 1546893 1520326 1492991 1465136 1436588 1412859 1393578 1369700 1349526 1331290 1311477
9956 1311477 1296331 1282274 1267671 1255256 1240418 1226353 1214665 1205678 1194914 1181772 1168990 1160252
9944 1160252 1155224 1151564 1147293 1146495 1149631 1153961 1160621 1171905 1192713 1233950 1298838 1390187 1498736
$$ packed form
10020E444220j80944j65394j50321j44075j38382j34133j24379j20440j11815
10011D174337j06485r7387r0153q5212q4039q4075p7646p2251o4112n3993n5172
10000C303812n6551n4995n4066m8972n2012n4012o1103o6954p1467p3653o9082
9989B640945o5543o1097o1840n7751n9119n4381n1831n1439n2045n1896m9942
9978B024061m6777m7393m4635m3879m4813l9894l6038l3750l7008l9389l4829
9967A575656k8763k6567k7335k7855k8548k3729j9281k3878k0174j8236j9813
9956A311477j5146j4057j4603j2415j4838j4065j1688q987j0764j3142j2782q738
9944A160252n028l660m271p98L136M330O660J1284K0808M1237O4888R1349J08549
$$ plain form
9931 1498736 1614346 1748933 1902378 2038251 2093471 2009910 1813395 1589643 1408358 1285363
9921 1285363 1209445 1163751 1131506 1100381 1073653 1050920 1029500 1011558 994743 979661 967987
9910 967987 956887 947024 938148 929102 918861 912608 907361 900697 894401 884213 875170 869879 862381 856073
9896 856073 847298 837781 833615 828874 822986 819201 814152 809386 802975 800752 799245 798973 799409 798835 797788
9881 797788 796965 797653 799761 799720 795350 794404 792903 794383 797303 801505 806694 809438 815045 814991 812275 812945
9865 812945 818311 826108 838421 846440 853004 856339 860811 866416 876638 885045 891797 897885 903517 910893
9851 910893 917902 926529 935501 942512 952551 961234 973014 986642 1000248 1013823 1026647 1040951 1053539
9838 1053539 1068098 1082607 1096039 1112135 1130557 1149428 1167417 1185001 1204350 1225038 1241847
$$ packed form
9931A498736J15610J34587J53445J35873N5220q3561j96515k23752j81285j22995
9921A285363p5918m5694l2245l1125k6728k2733k1420j7942j6815j5082j1674
9910I67987j1100r863q876r046j0241o253n247o664o296j0188r043n291p498o308
9896H56073q775r517m166m741n888l785n049m766o411k223j507k72M36n74j047
9881G97788q23O88K108m1m370r46j501J480K920M202N189K744N607n4k716O70
9865H12945N366P797J2313Q019O564L335M472N605J0222Q407O752O088N632P376
9851I10893P009Q627Q972P011J0039Q683J1780J3628J3606J3575J2824J4304J2588
9838A053539J4559J4509J3432J6096J8422J8871J7989J7584J9349K0688J6809
$$ plain form
9827 1241847 1261262 1283635 1302303 1321393 1344767 1371890 1397664 1421125 1447326 1472843 1496872
9816 1496872 1525220 1553961 1584673 1613899 1644761 1674934 1706912 1740298 1772920 1804741 1838848
9805 1838848 1870161 1905447 1943465 1979833 2012564 2048745 2084247 2119368 2155453 2189742 2225053
9794 2225053 2263576 2298014 2328796 2361940 2393977 2428679 2460871 2492671 2520101 2547093 2573062
9783 2573062 2600557 2626554 2652214 2674594 2694517 2713448 2729950 2744783 2759447 2768825 2774786 2779619
9771 2779619 2784842 2787598 2786911 2783992 2775329 2765495 2754036 2742276 2728645 2711746 2694826 2673531 2650282
9758 2650282 2627578 2601666 2572795 2544973 2519696 2491678 2462931 2431944 2401943 2371975 2338599
9747 2338599 2307552 2271810 2236190 2203048 2169758 2133782 2100375 2067966 2036724 2002327 1971015
$$ packed form
9827A241847J9415K2373J8668J9090K3374K7123K5774K3461K6201K5517K4029
9816A496872K8348K8741L0712K9226L0862L0173L1978L3386L2622L1821L4107
9805A838848L1313L5286L8018L6368L2731L6181L5502L5121L6085L4289L5311
9794B225053L8523L4438L0782L3144L2037L4702L2192L1800K7430K6992K5969
9783B573062K7495K5997K5660K2380J9923J8931J6502J4833J4664R378N961M833
9771B779619N223K756o87k919q663r834j1459j1760j3631j6899j6920k1295k3249
9758B650282k2704k5912k8871k7822k5277k8018k8747l0987l0001k9968l3376
9747B338599l1047l5742l5620l3142l3290l5976l3407l2409l1242l4397l1312
$$ plain form
9736 1971015 1935561 1908125 1879296 1846808 1816687 1784182 1754045 1726009 1697615 1670309 1639325
9725 1639325 1608718 1581526 1553382 1524512 1493913 1466384 1443860 1422470 1400129 1374657 1349448
9714 1349448 1329259 1306973 1285996 1266374 1245356 1226018 1205245 1182210 1164196 1145421 1124653
9703 1124653 1106472 1086462 1066039 1048360 1034504 1020003 1002026 983950 971601 959519 941916
9692 941916 923465 909168 895373 882508 870909 860295 848943 836764 826438 815013 803933 791062
9680 791062 778736 766881 756237 745900 736729 726920 718353 710314 699680 687209 681573 676125 668970
9667 668970 662928 655319 646544 640482 634138 630909 626920 622961 620791 622709 621973 628689 645464 662837
9653 662837 683663 706486 731686 759591 783052 800314 812842 816733 815423 812972 812231 805456 790694
$$ packed form
9736A971015l5454k7436k8829l2488l0121l2505l0137k8036k8394k7306l0984
9725A639325l0607k7192k8144k8870l0599k7529k2524k1390k2341k5472k5209
9714A349448k0189k2286k0977j9622k1018j9338k0773k3035j8014j8775k0768
9703A124653j8181k0010k0423j7679j3856j4501j7977j8076j2349j2082j7603
9692I41916j8451j4297j3795j2865j1599j0614j1352j2179j0326j1425j1080j2871
9680G91062j2326j1855j0644j0337r171r809q567q039j0634j2471n636n448p155
9667F68970o042p609q775o062o344l229l989l959k170J918p36O716J6775J7373
9653F62837K0826K2823K5200K7905K3461J7262J2528L891j310k451p41o775j4762
$$ plain form
9640 790694 776758 761295 738969 708971 671902 632148 593134 557770 529740 509675 493190 478149
9628 478149 466343 455945 449181 443224 434344 424924 416965 409780 398845 388883 382550 379094 371322 363225
9614 363225 357838 354167 348020 344057 340946 336491 332459 329950 330539 326983 327128 324332 322183 317536 311213
9599 311213 309814 307879 305240 304387 301394 295933 290552 282402 276245 269281 262791 258635 257839 256599 253652
9584 253652 252444 250961 246602 244267 241866 236243 232746 235158 233276 232070 230483 224019 222285 220693
9570 220693 216439 210215 209965 207294 205986 208226 205179 203942 202560 202799 200322 195639 190732 189674 186749
9555 186749 183359 180547 181163 180920 180617 179711 176511 174161 168101 167683 167742 164850 163373 163254 165674 168385
9539 168385 167450 164760 161597 158464 156572 154025 151242 150899 150844 149258 147571 146398 142240 139324 138257
$$ packed form
9640G90694j3936j5463k2326k9998l7069l9754l9014l5364k8030k0065j6485j5041
9628D78149j1806j0398o764n957q880r420p959p185j0935r962o333l456p772q097
9614C63225n387l671o147l963l111m455m032k509N89l556J45k796k149m647o323
9599C11213j399j935k639q53k993n461n381q150o157o964o490m156p96j240k947
9584B53652j208j483m359k335k401n623l497K412j882j206j587o464j734j592
9570B20693m254o224k50k671j308K240l047j237j382K39k477m683m907j058k925
9555A86749l390k812O16k43l03r06l200k350o060m18N9k892j477j19K420K711
9539A68385r35k690l163l133j892k547k783l43n5j586j687j173m158k916j067
$$ plain form
9524 138257 142375 140510 140464 139336 136353 133377 129143 127706 126607 127459 130151 129394 123304 120957 123040
9509 123040 123503 121744 121212 119938 120447 122080 119255 118676 118156 119396 118205 115078 112029 106377 103928 102212
9493 102212 102764 103126 105174 103686 101877 104877 104860 105446 104857 103871 100541 98883 98242 96409 95544 94305 92840
9476 92840 93482 92895 94065 91836 89226 86533 83234 82124 84134 85300 84063 84287 84448 82647 83005 84058
9460 84058 85089 84501 83298 81395 80417 80862 81613 82636 80044 79069 77706 74722 78464 79937 81543 81064
9444 81064 79065 76455 76847 77398 74007 73692 75861 75317 72937 72404 72082 74494 72629 72709 73724 77699 75074
9427 75074 70548 72686 73618 74516 75071 74895 78081 73646 69281 68582 69147 73305 75311 73768 69912 69101
9411 69101 70300 68920 67940 66322 63438 61628 62532 63094 63731 63195 64482 62239 62441 60622 60426 60626 60061
$$ packed form
9524A38257M118j865m6j128k983k976m234j437j099Q52K692p57o090k347K083
9509A23040M63j759n32j274N09J633k825n79n20J240j191l127l049n652k449j716
9493A02212N52L62K048j488j809L000j7N86n89r86l330j658o41j833q65j239j465
9476I2840O42n87J170k229k610k693l299j110K010J166j237K24J61j801L58J053
9460H4058J031n88j203j903r78M45P51J023k592r75j363k984L742J473J606m79
9444H1064j999k610L92N51l391l15K169n44k380n33l22K412j865Q0J015L975k625
9427G5074m526K138R32Q98N55j76L186m435m365o99N65M158K006j543l856q11
9411F9101J199j380r80j618k884j810R04N62O37n36J287k243K02j819j96K00n65
$$ plain form
9394 60061 61205 60979 59770 58760 57478 59352 58720 57055 55341 57083 57706 56399 50779 48660 50450
9379 50450 53882 55765 57801 57623 59926 57866 55270 54375 54312 50287 48909 52875 53865 54928 55631 55845
9363 55845 53754 51420 51911 55706 54333 50516 47134 47608 48908 49392 50121 52155 52091 52617 54096 53824 51866
9346 51866 52364 52921 51101 48984 50030 49760 46968 48659 51473 51487 47991 47187 49920 52246 48562 48350
9330 48350 47356 46301 49297 49200 47663 46538 43210 41943 42236 43857 44768 42781 39737 39759 37988 39427
9314 39427 41474 41359 41040 40056 42488 43130 45847 46785 48135 48185 44466 41170 38793 37833 39065 41750 42630
9297 42630 41627 40511 40802 43781 44804 41085 38833 39480 40517 42877 46705 45322 44446 45114 44757 44060
9281 44060 44113 41759 41851 43820 45104 44417 42942 43795 41194 41367 40762 38501 38317 39737 39545 41528 42816
$$ packed form
9394F0061J144k26j209j010j282J874o32j665j714J742O23j307n620k119J790
9379E0450L432J883K036j78K303k060k596q95o3m025j378L966R90J063P03K14
9363E5845k091k334M91L795j373l817l382M74J300M84P29K034o4N26J479k72j958
9346E1866M98N57j820k117J046k70k792J691K814J4l496q04K733K326l684k12
9330D8350r94j055K996r7j537j125l328j267K93J621R11j987l044K2j771J439
9314C9427K047j15l19r84K432O42K717R38J350N0l719l296k377r60J232K685Q80
9297D2630j003j116K91K979J023l719k252O47J037K360L828j383q76O68l57o97
9281D4060N3k354R2J969J284o87j475Q53k601J73o05k261j84J420j92J983J288
$$ plain form
9264 42816 42122 43701 45559 43937 41428 41294 40857 41655 41630 40283 38432 36896 36047 32648 32029 34244 36726
9247 36726 39475 39263 42021 43180 40980 40556 40820 38455 40054 38382 38932 42182 42076 38673 37765 38664
9231 38664 41541 41523 41259 40528 40014 37691 36114 32292 30058 31803 37078 37901 37545 35511 33743 35031
9215 35031 35981 34753 36362 37927 34591 37982 39297 40282 40148 36819 33682 35711 39547 38339 35820
9200 35820 36080 34810 33854 35321 32944 29002 29705 31815 34699 35994 33066 32906 36701 36772 36032 36784 37093
9183 37093 37445 36994 36507 36613 37690 37560 39522 41816 41630 39208 37542 38770 39283 37722 40852 39970 34537
9166 34537 33958 35156 38738 37275 34195 33586 32781 33987 31763 32051 34332 35454 37615 39741 41384 39863
9150 39863 38349 39713 41286 45129 42307 42726 44014 40504 38585 38245 38184 42871 45956 45108 47328 49428
$$ packed form
9264D2816o94J579J858j622k509j34m37P98k5j347j851j536q49l399o19K215K482
9247C6726K749k12K758J159k200m24K64k365J599j672N50L250j06l403r08Q99
9231C8664K877j8k64p31n14k323j577l822k234J745N275Q23l56k034j768J288
9215C5031R50j228J609J565l336L391J315R85j34l329l137K029L836j208k519
9200C5820K60j270r56J467k377l942P03K110K884J295k928j60L795P1p40P52L09
9183C7093L52m51m87J06J077j30J962K294j86k422j666J228N13j561L130q82n433
9166C4537n79J198L582j463l080o09q05J206k224K88K281J122K161K126J643j521
9150C9863j514J364J573L843k822M19J288l510j919l40o1M687L085q48K220K100
$$ plain form
9134 49428 48872 47298 45747 47769 51987 53464 47659 47493 48409 45982 43544 46153 46448 46512 47032 49905
9118 49905 50719 51613 51330 49470 48613 48861 44923 44046 43994 47227 47208 48576 51034 51010 51092 50621 48482 50175
9100 50175 54887 51751 51138 52376 49878 47243 48317 50459 51490 51514 50700 50259 49984 49324 51660 49322
9084 49322 47804 47302 49458 52136 52004 50857 52492 52521 50743 50319 47928 48128 51854 51449 50143 51649
9068 51649 49376 47525 51518 52155 51774 52796 50674 51021 53217 53395 52539 49637 49307 51911 53985 57123
9052 57123 59014 58204 57138 53256 50006 52368 55386 55939 53973 51162 51492 52574 50180 48747 50923
9037 50923 52118 49164 48791 53047 51205 52015 52205 49905 50569 53507 55304 53757 52271 51648 53731 55098
9021 55098 54064 56686 54563 51551 51346 49687 49124 47638 49690 50639 49311 46565 45127 44246 45044 42068
$$ packed form
9134D9428n56j574j551K022M218J477n805j66R16k427k438K609K95O4N20K873
9118D9905Q14Q94k83j860q57K48l938q77n2L233j9J368K458k4Q2m71k139J693
9100E0175M712l136o13J238k498k635J074K142J031K4q14m41k75o60K336k338
9084D9322j518n02K156K678j32j147J635K9j778m24k391K00L726m05j306J506
9068E1649k273j851L993O37l81J022k122L47K196J78q56k902l30K604K074L138
9052E7123J891q10j066l882l250K362L018N53j966k811L30J082k394j433K176
9037E0923J195k954l73M256j842Q10J90k300O64K938J797j547j486o23K083J367
9021E5098j034K622k123l012k05j659n63j486K052R49j328k746j438q81P98k976
$$ plain form
9005 42068 40143 41262 38331 37249 41898 43769 42848 41060 39915 44345 44716 47112 45232 44275 45283
8990 45283 46392 48722 48797 49456 47456 46528 46451 47055 49284 50979 51524 51097 50355 51760 53717 51233 49500
8973 49500 49027 48811 51529 52785 52487 54462 54326 55303 53365 53606 54078 53181 52135 50098 52969 55038 57793
8956 57793 54982 56152 58028 57596 56860 56229 54260 58165 60185 59671 60504 57104 53099 55524 56975 56883
8940 56883 55718 51522 50421 55592 56169 55248 55786 56083 53333 56088 58519 57883 56872 57138 57128 56262 58775
8923 58775 61444 59280 58792 61657 65642 64043 61030 59305 56692 56625 58441 60164 63468 63268 64267 62980
8907 62980 61472 59619 55705 54195 57341 58966 61263 63080 63472 65435 66915 69412 67768 66505 66390
8892 66390 65301 64878 64613 63579 61865 63528 65144 64318 62588 62430 65376 66665 66243 68447 68454 67615 64680
$$ packed form
9005D2068j925J119k931j082M649J871r21j788j145M430L71K396j880r57J008
8990D5283J109K330P5O59k000r28p7O04K229J695N45m27p42J405J957k484j733
8973D9500m73k16K718J256k98J975j36R77j938K41M72q97j046k037K871K069K755
8956E7793k811J170J876m32p36o31j969L905K020n14Q33l400m005K425J451r2
8940E6883j165m196j101N171N77r21N38K97k750K755K431o36j011K66j0q66K513
8923E8775K669k164m88K865L985j599l013j725k613o7J816J723L304k00R99j287
8907F2980j508j853l914j510L146J625K297J817L92J963J480K497j644j263j15
8892F6390j089m23k65j034j714J663J616q26j730j58K946J289m22K204Pq39k935
$$ plain form
8875 64680 63165 63809 65784 68592 64456 60370 60957 61078 62358 63292 64131 65096 63894 59732 59344 64177
8859 64177 68020 64659 61419 58837 54869 53601 56678 60662 61813 64883 68963 68499 64723 63211 64362
8844 64362 64817 68312 70065 71249 69725 70411 74708 76644 75765 76947 75725 76515 76764 72421 66763 62519
8828 62519 59452 55209 52113 51921 52284 54086 59255 63782 69165 73698 80048 87118 88052 89765 93530
8813 93530 95524 97021 98337 96266 91406 89357 85579 82819 83823 85624 84302 84278 82287 80705 82126
8798 82126 84127 88688 92890 94990 96164 97079 99209 101980 104655 105788 107462 109426 115153 125800 134816
8783 134816 143515 156385 172914 192335 214922 242129 275129 315063 372259 445506 538567 649925
8771 649925 776646 910301 1043912 1173005 1279190 1346391 1362198 1326747 1246640 1131463
$$ packed form
8875F4680j515O44J975K808m136m086N87J21J280R34Q39R65j202m162l88M833
8859F4177L843l361l240k582l968j268L077L984J151L070M080m64l776j512J151
8844F4362M55L495J753J184j524O86M297J936q79J182j222P90K49m343n658m244
8828F2519l067m243l096j92L63J802N169M527N383M533O350P070R34J713L765
8813I3530J994J497J316k071m860k049l778k760J004J801j322k4j991j582J421
8798H2126K001M561M202K100J174R15K130K771K675J133J674J964N727J0647R016
8783A34816Q699J2870J6529J9421K2587K7207L3000L9934N7196P3247R3061J11358
8771F49925J26721J33655J33611J29093J06185O7201J5807l5451q0107j15177
$$ plain form
8761 1131463 999438 866224 742948 638880 551793 485108 432466 394968 363900 338703 318487
8750 318487 301410 288921 277854 266736 256275 244588 235329 224910 214087 205837 200696 195280
8738 195280 191524 186915 180780 179195 176235 175120 175797 171534 165487 161392 157918 154996 153084 145873 143795
8723 143795 146969 143952 139938 137584 134818 137226 139610 139586 141985 142367 143836 143492 139809 136031 138305
8708 138305 140888 141034 139193 135887 136660 134064 128634 121818 119301 119195 115399 113421 115484 113876 113087
8693 113087 109685 109245 108180 106422 108930 111275 109636 107574 106020 103061 99261 94523 95640 96820 99614
8678 99614 102072 105001 110287 109848 109633 112555 113448 114106 118597 123034 121796 120372 120067 119810 117379 119471
8662 119471 118515 117016 114852 113564 115163 115301 115517 115983 115805 120794 127392 134453 138044 141770 144569 146160
$$ packed form
8761A131463j32025j33214j23276j04068q7087o6685n2642l7498l1068k5197k0216
8750C18487j7077j2489j1067j1118j0461j1687r259j0419j0823q250n141n416
8738A95280l756m609o135j585k960j115O77m263o047m095l474k922j912p211k078
8723A43795L174l017m014k354k766K408K384k4K399L82J469l44l683l778K274
8708A38305K583J46j841l306P73k596n430o816k517j06l796j978K063j608p89
8693A13087l402m40j065j758K508K345j639k062j554k959l800m738J117J180K794
8678I9614K458K929N286m39k15K922Q93O58M491M437j238j424l05k57k431K092
8662A19471r56j499k164j288J599J38K16M66j78M989O598P061L591L726K799J591
$$ plain form
8646 146160 150031 152386 156680 157585 156566 153666 161790 171712 177337 181301 190668 198068 206776 218031
8632 218031 225257 232614 250162 275406 296646 312854 325230 339699 358922 379372 388955 364197
8620 364197 325645 288137 253068 225157 212108 201073 192834 193267 195045 192221 186552 183475 180915
8607 180915 176464 172811 171773 169743 167096 164154 164783 161806 158893 158945 155505 156738 157603 158317 161225 165230
8591 165230 164985 166317 170534 169003 172161 174207 173823 176816 180879 181088 179938 179290 178981 182065 182460 183543
8575 183543 187156 189526 186687 181595 187386 196686 204062 208541 210048 216086 229700 249099 271958 292797
8561 292797 305807 301568 276541 242320 217388 207614 210404 218791 227083 233483 236614 239081 242071
8548 242071 243128 244704 248698 252485 255218 255792 251825 248980 253064 257275 260771 263828 270008 275095 274504
$$ packed form
8646A46160L871K355M294R05j019k900Q124R922N625L964R367P400Q708J1255
8632B18031P226P357J7548K5244K1240J6208J2376J4469J9223K0450R583k4758
8620C64197l8552l7508l5069k7911j3049j1035q239M33J778k824n669l077k560
8607A80915m451l653j038k030k647k942O29k977k913N2l440J233Q65P14K908M005
8591A65230k45J332M217j531L158K046l84K993M063K09j150o48l09L084L95J083
8575A83543L613K370k839n092N791R300P376M479J507O038J3614J9399K2859K0839
8561B92797J3010m239k5027l4221k4932r774K790Q387Q292O400L131K467K990
8548B42071J057J576L994L787K733N74l967k845M084M211L496L057O180N087n91
$$ plain form
8533 274504 273670 275178 277006 279750 276892 277969 282644 287122 292978 303156 315580 330041 339402 346331
8519 346331 354244 361352 372114 383147 392839 405400 425292 452759 482095 514810 552709 592970
8507 592970 639987 691148 753787 834583 935712 1066589 1258846 1546980 1951199 2475686
8497 2475686 3131553 3708229 3739670 3063232 2104286 1381398 1018092 856845 766610 701124
8487 701124 659629 636344 623930 621476 621322 623078 620791 613994 609024 608614 608001 603465 600585 601421 600737
8472 600737 601184 598170 598082 601974 605931 611458 619366 628460 638945 647488 657943 667231 674778 680798 683721
8457 683721 687465 688783 691320 698392 704331 713979 727573 739351 750850 760683 769995 783618 799537
8444 799537 816933 838065 864877 899222 937342 983709 1030772 1072813 1106698 1135534 1157196 1176339
$$ packed form
8533B74504q34J508J828K744k858J077M675M478N856J0178J2424J4461R361O929
8519C46331P913P108J0762J1033R692J2561J9892K7467K9336L2715L7899M0261
8507E92970M7017N1161O2639Q0796J01129J30877J92257K88134M04219N24487
8497B475686O55867N76676L1441o76438r58946p22888l63306j61247r0235o5486
8487G01124m1495k3285j2414k454j54J756k287o797m970m10o13m536k880Q36o84
8472F00737M47l014q8L892L957N527P908R094J0485Q543J0455R288P547O020K923
8457F83721L744J318K537P072N939R648J3594J1778J1499R833R312J3623J5919
8444G99537J7396K1132K6812L4345L8120M6367M7063M2041L3885K8836K1662J9143
$$ plain form
8432 1176339 1197311 1222656 1250973 1280343 1313591 1344635 1378148 1414213 1459428 1514159 1573115
8421 1573115 1640514 1711511 1784406 1851996 1915456 1985276 2067436 2160887 2266364 2380622 2508452
8410 2508452 2646088 2797166 2962709 3141157 3335416 3544418 3763869 4000240 4260688 4546130
8400 4546130 4852041 5186306 5553997 5965291 6435241 6995635 7667885 8478903 9449229 10618201
8390 10618201 12038342 13767697 15832865 18216620 20928783 24063355 27793704 32307694
8382 32307694 37881116 45150806 55308400 70023815 91121949 119609333 153725169
8375 153725169 188162768 217558309 241924152 265365439 285385244 287407912 260403801
8368 260403801 214071035 167710924 131816786 106621218 89019946 76402851 67090267
$$ packed form
8432A176339K0972K5345K8317K9370L3248L1044L3513L6065M5215N4731N8956
8421A573115O7399P0997P2895O7590O3460O9820Q2160R3451J05477J14258J27830
8410B508452J37636J51078J65543J78448J94259K09002K19451K36371K60448K85442
8400D546130L05911L34265L67691M11294M69950N60394O72250Q11018R70326J168972
8390A0618201J420141J729355K065168K383755K712163L134572L730349M513990
8382C2307694N573422P269690J0157594J4715415K1098134K8487384L4115836
8375A53725169L4437599K9395541K4365843K3441287K0019805K022668k7004111
8368B60403801m6332766m6360111l5894138k5195568j7601272j2617095r312584
$$ plain form
8361 67090267 59988457 54428090 50023536 46500659 43559230 40895847 38327936 35855399
8353 35855399 33564782 31481488 29574933 27824890 26227791 24786038 23495855 22351424
8345 22351424 21330583 20413020 19579856 18806520 18079007 17396761 16761205 16171750 15632610
8336 15632610 15136039 14674109 14232376 13809851 13406623 13019506 12648126 12301101 11979532
8327 11979532 11677774 11395234 11127341 10865175 10606973 10365799 10148851 9952096 9770598
8318 9770598 9595475 9426275 9265796 9112122 8955903 8793171 8614698 8413417 8189366 7958027
8308 7958027 7734641 7523971 7323975 7134700 6951571 6771114 6593679 6421378 6255553 6093382
8298 6093382 5935089 5778680 5621418 5469608 5319401 5175279 5039342 4914633 4798591 4683754
$$ packed form
8361F7090267p101810n560367m404554l522877k941429k663383k567911k472537
8353C5855399k290617k083294j906555j750043j597099j441753j290183j144431
8345B2351424j020841r17563q33164p73336p27513o82246o35556n89455n39140
8336A5632610m96571m61930m41733m22525m03228l87117l71380l47025l21569
8327A1979532l01758k82540k67893k62166k58202k41174k16948j96755j81498
8318I770598j75123j69200j60479j53674j56219j62732j78473k01281k24051k31339
8308G958027k23386k10670j99996j89275j83129j80457j77435j72301j65825j62171
8298F093382j58293j56409j57262j51810j50207j44122j35937j24709j16042j14837
$$ plain form
8288 4683754 4571327 4462202 4356628 4253592 4155635 4058109 3962173 3870607 3790896 3718656 3649431
8277 3649431 3581587 3516075 3453974 3399025 3344388 3287522 3229722 3175139 3127838 3080926 3039516
8266 3039516 2997771 2955461 2918228 2888508 2865649 2845621 2831280 2820855 2814643 2812211 2810173 2813837
8254 2813837 2837986 2893660 3014656 3221220 3502820 3809547 4146579 4549239 5015470 5410430
8244 5410430 5491287 5121191 4446954 3766470 3253112 2923904 2727541 2607246 2516887 2432579
8234 2432579 2352033 2276390 2206244 2141425 2085474 2032618 1977608 1927027 1879710 1832861 1789618
8223 1789618 1749936 1716649 1689684 1659414 1627306 1597407 1569097 1539216 1502804 1463617 1423133
8212 1423133 1383098 1339643 1303759 1276638 1250358 1223324 1195373 1170652 1148372 1125860 1108203
$$ packed form
8288D683754j12427j09125j05574j03036r7957r7526r5936r1566p9711p2240o9225
8277C649431o7844o5512o2101n4949n4637n6866n7800n4583m7301m6912m1410
8266C039516m1745m2310l7233k9720k2859k0028j4341j0425o212k432k038L664
8254B813837K4149N5674J20996K06564K81600L06727L37032M02660M66231L94960
8244E410430Q0857l70096o74237o80484n13358l29208j96363j20295r0359q4308
8234B432579q0546p5643p0146o4819n5951n2856n5010n0581m7317m6849m3243
8223A789618l9682l3287k6965l0270l2108k9899k8310k9881l6412l9187m0484
8212A423133m0035m3455l5884k7121k6280k7034k7951k4721k2280k2512j7657
$$ plain form
8201 1108203 1089106 1071149 1052613 1028629 1009696 988510 967369 948510 931251 916073 898959
8190 898959 883122 869028 856408 840174 822206 801199 782550 771095 769342 773380 774186 760681
8178 760681 743088 724801 707866 697124 691260 682453 672744 661159 649778 640249 630979 621813 612567
8165 612567 603885 592120 580052 568929 561300 552938 543012 536727 530054 520851 508593 494567 483043
8152 483043 479850 477675 475725 473200 470427 463747 455020 447601 440633 435388 433509 428004 421150 414549
8138 414549 406464 398850 392923 387706 381974 375989 371423 366595 363117 361962 362408 364870 366300 362456 359257
8123 359257 357028 353579 350797 349528 348182 341543 334529 323330 314194 309317 305802 298825 287040 278745
8109 278745 270394 262983 257667 253032 249712 246261 242889 241063 238646 232003 227524 225964 227603 227043 222572
$$ packed form
8201A108203j9097j7957j8536k3984j8933k1186k1141j8859j7259j5178j7114
8190H98959j5837j4094j2620j6234j7968k1007j8649j1455j753M038Q06j3505
8178G60681j7593j8287j6935j0742n864q807r709j1585j1381r529r270r166r246
8165F12567q682j1765j2068j1123p629q362r926o285o673r203j2258j4026j1524
8152D83043l193k175j950k525k773o680q727p419o968n245j879n505o854o601
8138D14549q085p614n927n217n732n985m566m828l478j155M46K462J430l844l199
8123C59257k229l449k782j269j346o639p014j1199r136m877l515o977j1785q295
8109B78745q351p411n316m635l320l451l372j826k417o643m479j560J639n60m471
$$ plain form
8094 222572 216998 210998 208168 205352 202733 200911 201846 201758 201104 198676 192386 187697 182417 178976 175707
8079 175707 172370 167806 164338 160580 158358 155342 151907 146864 145113 146250 145235 145824 146444 148387 147691
8064 147691 145039 143237 141558 141767 142619 141675 138875 131989 128073 127871 128988 127318 127198 123432 120259 120349
8048 120349 119266 119060 119702 117246 112263 110353 108503 105934 101439 92227 86465 85805 84321 82966 81894
8033 81894 81362 79505 82148 86492 87142 86093 82270 77963 76855 79241 78270 77730 78365 74203 74357 75043
8017 75043 75458 72306 68170 66297 67473 68330 66027 64146 65476 67945 70617 71351 75736 79638 81723
8002 81723 84964 86358 88004 87966 86564 86503 87651 92037 94233 98102 101735 108650 116797 124517 136616
7987 136616 149337 166756 187605 209344 241057 283536 339804 409433 496538 605900 730117
$$ packed form
8094B22572n574o000k830k816k619j822R35q8o54k428o290m689n280l441l269
8079A75707l337m564l468l758k222l016l435n043j751J137j015N89O20J943o96
8064A47691k652j802j679K09Q52r44k800o886l916k02J117j670j20l766l173R0
8048A20349j083k06O42k456m983j910j850k569m495r212n762o60j484j355j072
8033H1894n32j857K643M344O50j049l823m307j108K386r71n40O35m162J54O86
8017G5043M15l152m136j873J176Q57k303j881J330K469K672P34M385L902K085
8002H1723L241J394J646l8j402o1J148M386K196L869L633O915Q147P720J2099
7987A36616J2721J7419K0849K1739L1713M2479N6268O9629Q7105J09362J24217
$$ plain form
7976 730117 865136 1000133 1129035 1237165 1313099 1341808 1318654 1245451 1135892 1002384
7966 1002384 863701 734050 618940 527974 458172 402506 358605 327059 304205 285302 266695
7955 266695 249872 231289 216210 204821 190127 178363 169043 159199 151082 144729 140184 134555 128179
7942 128179 124137 121650 114230 103733 95283 90731 85165 79955 75106 71648 65042 61845 61364 61265 65319
7927 65319 68419 70451 68129 66974 68078 72310 79361 82975 85184 87673 88620 81263 72069 65745 64002
7912 64002 59764 55859 50462 45158 40655 38329 35538 34804 40976 43633 43344 41518 42179 43993 41093
7897 41093 36281 34270 32756 32667 34187 33798 32033 31136 30912 35622 34351 27675 24197 25217 25989 27912
7881 27912 26072 25754 26282 27672 28242 29635 33246 32181 29232 25238 25765 25104 27939 28310 27561 30602
$$ packed form
7976G30117J35019J34997J28902J08130P5934K8709k3154p3203j09559j33508
7966A002384j38683j29651j15110r0966o9802n5666m3901l1546k2854j8903j8607
7955B66695j6823j8583j5079j1389j4694j1764r320r844q117o353m545n629o376
7942A28179m042k487p420j0497q450m552n566n210m849l458o606l197m81r9M054
7927F5319L100K032k322j155J104M232P051L614K209K489R47p357r194o324j743
7912F4002m238l905n397n304m503k326k791p34O172K657k89j826O61J814k900
7897D1093m812k011j514q9J520l89j765q97k24M710j271o676l478J020P72J923
7881B7912j840l18N28J390N70J393L611j065k949l994N27o61K835L71p49L041
$$ plain form
7865 30602 29079 27651 20608 19808 21312 17606 16932 20267 22340 23135 22998 24466 26108 26666 27043 25598
7849 25598 27004 26786 24594 25732 25302 21553 17307 12756 13203 14266 15558 16897 14857 9993 10715 13374
7833 13374 12448 11439 12444 11545 11298 11236 10239 8407 8306 5655 4004 6718 6858 4954 1734 25 345
7816 345 3530 5120 4618 6422 6327 2905 368 924 4459 6593 6778 9204 10494 10425 10901 8721 5772
7799 5772 5277 4715 5372 5583 4794 2372 2360 700 -3714 -6154 -3623 -1604 -4139 -7065 -7027 -6433 -6259 -4799
7781 -4799 -2247 -2741 1548 3446 3105 2267 -2559 -5483 -2923 -2103 -344 -262 142 -268 -73 1741 2184
7764 2184 5718 7751 7306 6413 4321 1204 1397 3339 2047 2416 4346 7413 7696 5032 5273 6917
7748 6917 8809 6462 4753 7676 11624 11125 9297 7502 6087 5673 7341 7548 4645 989 -526 -152
$$ packed form
7865C0602j523j428p043q00J504l706o74L335K073P95j37J468J642N58L77j445
7849B5598J406k18k192J138m30l749m246m551M47J063J292J339k040m864P22K659
7833A3374r26j009J005q99k47o2r97j832j01k651j651K714J40j904l220j709L20
7816C45L185J590n02J804r5l422k537N56L535K134J85K426J290o9M76k180k949
7799E772m95n62O57K11p89k422j2j660m414k440K531K019k535k926L8N94J74J460
7781d799K552m94M289J898l41q38m826k924K560Q20J759Q2M04m10J95J814M43
7764B184L534K033m45q93k092l117J93J942j292L69J930L067K83k664K41J644
7748F917J892k347j709K923L948m99j828j795j415m14J668K07k903l656j515L74
$$ plain form
7732 -152 1482 1591 1875 5734 6938 6826 6128 2265 2786 2976 278 -2032 -4899 -4771 -5293 -8261 -5458
7715 -5458 -4305 -5996 -8183 -4991 -5698 -6249 -4127 -1138 -1353 -11 -1325 -2539 -1889 -3628 -5443 -3751
7699 -3751 -2181 -4295 -6854 -4746 -3296 -6081 -4974 -4944 -5332 -4088 -2750 -4376 -5196 -3913 -4282 -4648
7683 -4648 -2059 -324 1828 2350 3922 4526 420 -4313 -2571 -302 -4959 -8424 -5525 -3639 -2234
7668 -2234 -3454 1092 6583 6379 2623 418 2190 3567 2338 -826 -1744 -1854 -5273 -2825 -1537 -1257
7652 -1257 841 -2601 -2463 -562 -752 -2732 -3379 -2837 -886 545 -647 -3291 -4318 -4765 -1449 803
7636 803 324 -736 -1082 -3390 -894 -206 830 -1045 -1747 -880 -2071 -2467 352 774 -1649 1378 3404
7619 3404 -839 -3522 -6096 -6429 -8698 -11001 -10611 -7580 -3532 -5088 -2946 -2690 -1910 -1551 -142 189
$$ packed form
7732a52J634J09K84L859J204j12o98l863N21J90k698k310k867J28n22k968K803
7715e458J153j691k187L192p07n51K122K989k15J342j314j214O50j739j815J692
7699c751J570k114k559K108J450k785J107L0l88J244J338j626q20J283l69l66
7683d648K589J735K152N22J572O04m106m733J742K269m657l465K899J886J405
7668b234j220M546N491k04l756k205J772J377j229l164r18j10l419K448J288K80
7652a257K098l442J38J901j90j980o47N42J951J431j192k644j027m47L316K252
7636H03m79j060l46k308K496O88J036j875p02Q67j191l96K819M22k423L027K026
7619C404m243k683k574l33k269k303L90L031M048j556K142K56P80L59J409L31
$$ plain form
7603 189 1689 743 888 518 -693 -684 75 2401 4862 4210 291 -2120 -1084 205 -1648 -2099 -175
7586 -175 70 1603 2255 3273 2224 -731 376 -598 -2360 -3067 -3605 -3353 -5338 -6789 -5767 -6657 -7395
7569 -7395 -5630 -5677 -5468 -4417 -6874 -8338 -6557 -7306 -4731 -1271 69 -32 -1869 -1895 -2398 -712 2617
7552 2617 -325 -5569 -2490 -1604 1147 1862 334 -37 634 -147 -627 -2233 -1235 -1038 -625 -2018 -2573
7535 -2573 -3241 734 762 -561 -1884 -1147 -2992 -2450 1832 4071 2612 -1546 -709 1838 825 -1295
7519 -1295 -502 313 -1125 25 2014 -2120 -6923 -5752 -7304 -8811 -8031 -6684 -3238 -5765 -9575 -10192
7503 -10192 -5668 -6322 -7545 -6159 -4843 -3005 -3656 -3857 -4630 -2925 -847 -1477 -3462 -3477 -5125 -5150 -5652
7486 -5652 -4580 14 -1061 -2538 -1681 -5537 -7522 -6558 -3982 -4214 -5222 -6213 -5808 -4416 -5907 -7439
$$ packed form
7603A89J500r46J45l70j211RP59K326K461o52l919k411J036J289j853m51J924
7586a75K45J533O52J018j049k955J107r74j762p07n38K52j985j451J022q90p38
7569g395J765m7K09J051k457j464J781p49K575L460J340j01j837k6n03J686L329
7552B617k942n244L079Q86K751P15j528l71O71p81m80j606R98J97M13j393n55
7535b573o68L975K8j323j323P37j845N42M282K239j459m158Q37K547j013k120
7519a295P93Q15j438J150J989m134m803J171j552j507P80J347L446k527l810o17
7503a0192M524o54j223J386J316J838o51k01p73J705K078o30j985j5j648k5n02
7486e652J072M594j075j477Q57l856j985R64K576k32j008r91M05J392j491j532
$$ plain form
7470 -7439 -6343 -3535 -4105 -5640 -7105 -5818 -4260 -4300 -2054 -1230 -1620 -3674 -2664 -4062 -3219 -3298 -5537
7453 -5537 -3869 -2026 -2703 -4739 -6213 -5744 -5837 -4672 -3233 -1734 -2274 -1841 114 2370 525 967 -1621
7436 -1621 -3252 -5280 -6485 -7239 -5526 -2010 -2345 -4066 -2516 1985 2483 -2169 -5325 -6201 -5996 -5991 -7305
7419 -7305 -6715 -5489 -7306 -7954 -7230 -6842 -4599 -4709 -5378 -5184 -3274 -1048 -61 -171 1683 1446 -450
7402 -450 -747 -1805 -4711 -7608 -5712 -6814 -9704 -10559 -8715 -4093 -311 -772 250 -2955 -4206 -1266
7386 -1266 2194 3648 2484 3225 3677 4413 2437 -759 -2845 -4225 -7111 -2830 -650 -4332 -5856 -6447
7370 -6447 -6369 -3063 -1650 -1682 -924 -956 1409 3024 1648 -241 -1583 -55 866 -368 -2159 -4129 -3305
7353 -3305 -3496 -6984 -8568 -8126 -4997 -2983 -1963 -627 -2331 -2705 1455 2675 424 -1063 -1865 -3670
$$ packed form
7470g439J096K808n70j535j465J287J558m0K246Q24l90k054J010j398Q43p9k239
7453e537J668J843o77k036j474M69r3J165J439J499n40M33J955K256j845M42k588
7436a621j631k028j205p54J713L516l35j721J550M501M98m652l156q76K05Nj314
7419g305N90J226j817o48P24L88K243j10o69J94J910K226R87j10J854k37j896
7402d50k97j058k906k897J896j102k890q55J844M622L782m61J022l205j251K940
7386a266L460J454j164P41M52P36j976l196k086j380k886M281K180l682j524n91
7370f447P8L306J413l2P58l2K365J615j376j889j342J528R21j234j791j970Q24
7353c305j91l488j584M42L129K014J020J336j704l74M160J220k251j487q02j805
$$ plain form
7337 -3670 -4963 -6319 -5710 -7027 -6238 -4092 -5666 -6406 -6776 -6312 -6678 -6416 -6591 -3324 -3455 -8896 -8214
7320 -8214 -6019 -1528 -1284 -618 -1799 -2362 -2520 -377 909 -1310 1371 -1061 -2003 -2835 -707 -2605
7304 -2605 -2862 -1997 600 -1038 -1624 507 -232 -1247 -2478 -2400 -3615 -4689 -3587 -1837 -385 -2246
7288 -2246 -5522 -7838 -6103 -4491 -4991 -3785 411 3311 2083 455 -4515 -8923 -8393 -8087 -6053 -6313
7272 -6313 -3274 -2768 -6169 -3776 369 -293 -2626 -220 3926 5468 5067 3952 525 441 1056 1920 1953
7255 1953 -1042 -3152 -3005 212 2282 -386 -1685 -1558 -7614 -10273 -9321 -8571 -7591 -6221 -4991 -5718
7239 -5718 -8094 -5032 -917 -610 2661 3120 -1487 -5198 -6771 -2639 583 1172 3368 6365 9369 6213
7223 6213 -357 -1174 1310 3845 3610 3574 1223 -3508 -3073 -1821 -452 199 -2378 -2840 -1022 -1541 -1206
$$ packed form
7337c670j293j356O09j317P89K146j574p40l70M64l66K62j75L267j31n441O82
7320h214K195M491K44O66j181n63j58K143J286k219K681k432r42q32K128j898
7304b605k57Q65K597j638n86K131p39j015j231P8j215j074J102J750J452j861
7288b246l276k316J735J612n00J206M196K900j228j628m970m408N30L06K034k60
7272f313L039N06l401K393M145o62k333K406M146J542m01j115l427q4O15Q64L3
7255A953k995k110J47L217K070k668j299J27o056k659R52P50R80J370J230p27
7239e718k376L062M115L07L271M59m607l711j573M132L222N89K196K997L004l156
7223F213o570q17K484K535k35l6k351m731M35J252J369O51k577m62J818n19L35
$$ plain form
7206 -1206 -1215 2194 4082 2795 -528 -4135 -6123 -7950 -5743 -4660 -5231 -6537 -10740 -8331 -4463 -568
7190 -568 118 -448 -2868 -3446 -918 -2062 -5270 -7228 -6970 -6006 -1391 -1690 -2468 851 -389 -3853 -6153
7173 -6153 -5747 -5640 -1414 156 1735 752 -392 -525 -841 38 -606 -419 -983 -3021 -5839 -5690 -3334
7156 -3334 -3215 -4237 -4385 -1916 -837 -3002 -3607 -3648 -3629 -4016 -2294 394 1355 -1719 -2524 -2968 -2101 -167
7138 -167 -2180 -1752 -2833 -1659 -268 -2252 -4757 -4373 -3133 -2830 -1312 873 1465 139 -450 -192 -210
7121 -210 -2713 -3368 -1336 1797 551 1628 3434 3313 -967 -2920 -1035 -1303 -3688 -4316 -2770 -1957
7105 -1957 -7046 -5455 868 -131 -3089 -4140 -3182 -3438 -6705 -6576 -2391 -1327 -2266 -3838 -3043 253
7089 253 -185 -3992 -5302 -7958 -7294 -3292 -285 -1071 -263 -2375 -3364 -1966 192 2137 2481 1685 912
$$ packed form
7206a206rL409J888j287l323l607j988j827K207J083n71j306m203K409L868L895
7190e68O86n66k420n78K528j144l208j958K58R64M615k99p78L319j240l464k300
7173f153M06J07M226J570J579r83j144j33l16Q79o44J87n64k038k818J49K356
7156c334J19j022j48K469J079k165o05m1J9l87J722K688R61l074q05m44Q67J934
7138a67k013M28j081J174J391j984k505L84J240L03J518K185N92j326n89K58j8
7121b10k503o55K032L133j246J077J806j21m280j953J885k68k385o28J546Q13
7105a957n089J591O323r99k958j051R58k56l267J29M185J064r39j572P95L296
7089B53m38l807j310k656O64M002L007p86Q08k112r89J398K158J945L44p96p73
$$ plain form
7072 912 -114 -4477 -6522 -4012 -4090 -3222 -5053 -4544 -3329 -3651 -4191 -4541 -4095 -5224 -2902 -2094 -1120 -2155
7054 -2155 -4050 -816 2009 608 -118 493 -3310 -4047 -3236 -2646 -3737 -2648 -2871 -1281 -2534 -4791
7038 -4791 -4898 -4020 -5552 -5347 -5580 -5266 -5697 -4733 -3419 -3255 -3537 -4944 -7058 -5072 -3275 -5721 -5834
7021 -5834 -5665 -6927 -5686 -3935 -6862 -12501 -13809 -12168 -8876 -4858 -1805 -3753 -4878 -4672 -6344
7006 -6344 -4712 -2076 -272 -2934 -3410 -2871 -2927 -3931 -6038 -7308 -7230 -6500 -5095 -2940 -2463 -1150 834
6989 834 268 -2387 -3720 -464 -1140 -964 145 -33 -3102 -3438 912 -1222 -2460 -3150 -3547 -4249 -3809
6972 -3809 -4474 -4345 -3614 -3305 -1325 1949 -2155 -5586 -5478 -3097 -3293 -5695 -6570 -2326 1861 1567 -526
6955 -526 197 1586 1584 45 -3081 -6786 -7530 -6292 -4254 -4314 -3477 -1778 -3362 -6032 -5327 -1017 468
$$ packed form
7072I12j026m363k045K510p8Q68j831N09J215l22n40l50M46j129K322Q08R74j035
7054b155j895L234K825j401p26O11l803p37Q11N90j091J089k23J590j253k257
7038d791j07Q78j532K05k33L14m31R64J314J64k82j407k114J986J797k446j13
7021e834J69j262J241J751k927n639j308J641L292M018L053j948j125K06j672
7006f344J632K636J804k662m76N39n6j004k107j270P8P30J405K155M77J313J984
6989H34n66k655j333L256o76J76J109j78l069l36M350k134j238o90l97p02M40
6972c809o65J29P31L09J980L274m104l431J08K381j96k402q75M244M187k94k093
6955e26P23J389kj539l126l705p44J238K038o0Q37J699j584k670P05M310J485
$$ plain form
6938 468 1007 -2136 -4048 -3821 -3725 -2842 -2530 -3160 -4116 -5705 -3762 279 661 -2579 -6919 -9199 -5568
6921 -5568 -971 404 -2984 -5599 -4136 -1028 -2130 -5134 -5191 -2972 -540 2734 -1488 -3215 -2288 -4028
6905 -4028 -3373 -2925 -1443 -1568 -3207 -2695 1425 4706 4080 2146 -1323 -513 509 -2309 -2083 -2122 -690
6888 -690 581 3079 657 -696 -1215 -1754 762 1031 -109 1208 756 -542 -1193 -2854 -2736 -1813 -3375
6871 -3375 -3358 -3526 -4048 -5455 -5907 -4291 -3883 -3504 -4530 -7470 -3073 -1086 -1389 -823 -2714 -4473 -3000
6854 -3000 -1024 -492 -2953 -3691 -3271 -1054 1578 -609 -897 -295 -1758 -958 -1212 -603 128 -1314 -2225
6837 -2225 -103 3 -95 3660 6184 3302 599 -1145 497 1553 -414 -3215 -2836 -1793 1038 -1522
6821 -1522 -6730 -4739 -1541 -1805 -2977 -1380 878 3505 2864 2071 -1129 -2719 -344 53 -1758 -1370
$$ packed form
6938D68N39l143j912K27R6Q83L12o30r56j589J943M041L82l240m340k280L631
6921e568M597J375l388k615J463L108j102l004n7K219K432L274m222j727R27j740
6905d028O55M48J482j25j639N12M120L281o26j934l469Q10J022k818K26l9J432
6888f90J271K498k422j353n19n39K516K69j140J317m52j298o51j661J18R23j562
6871c375J7j68n22j407m52J616M08L79j026k940M397J987l03N66j891j759J473
6854c000J976N32k461p38M20K217K632k187k88O02j463Q00k54O09P31j442r11
6837b225K122J06r8L755K524k882k703j744J642J056j967k801L79J043K831k560
6821a522n208J991L198k64j172J597K258K627o41p93l200j590K375L97j811L88
$$ plain form
6805 -1370 -6670 -4719 -1801 14 1881 -582 -1388 -1427 -3687 -6774 -5011 -1056 709 1931 3495 813
6789 813 774 1230 632 3415 5099 1139 -1014 -1368 1354 6144 8503 5726 -753 -2117 -21 1654
6773 1654 944 2490 4229 1106 2676 -2549 -2181 1271 997 -54 -1375 -3202 -1794 243 6141 10784
6757 10784 6178 1644 191 -60 2856 3682 1877 -1786 -2004 160 1153 3444 2230 2325 2726 1826 80
6740 80 -715 650 2690 1478 690 1796 -1401 -3767 -3573 -7473 -7898 -5771 -5402 -2898 -2276 -1116 -3529
6723 -3529 -6325 -7936 -6200 -5784 -4650 -6072 -7576 -7703 -4794 -6140 -4938 -2513 -661 1005 565 -3768
6707 -3768 -9859 -9405 -5981 -5370 -6972 -8869 -4504 656 -1060 -6912 -9193 -3199 6164 9575 2966
6692 2966 5726 16416 29511 35817 31434 27526 21089 5627 -14821 -29806 -26558 -11982 -443
$$ packed form
6805a370n300J951K918J815J867k463q06l9k260l087J763L955J765J222J564k682
6789H13l9M56n98K783J684l960k153l54K722M790K359k777o479j364K096J675
6773A654p10J546J739l123J570n225L68L452k74j051j321j827J408K037N898M643
6757A0784m606m534j453k51K916Q26j805l663k18K164R93K291j214R5M01r00j746
6740H0p95J365K040j212p88J106l197k366J94l900m25K127L69K504O22J160k413
6723c529k796j611J736M16J134j422j504j27K909j346J202K425J852J666m40m333
6707c768o091M54L424O11j602j897M365N160j716n852k281N994R363L411o609
6692B966K760J0690J3095O306m383l908o437j5462k0448j4985L248J4576J1539
$$ plain form
6679 -443 1177 -3582 -2394 -2739 -6053 -7025 -5549 -4988 -2383 -311 1282 145 -1223 -4240 -8614 -6027
6663 -6027 -1827 -1322 -1720 -4251 -5587 -4195 -4505 -2739 -149 2521 1755 -2011 -3637 -1265 1306 2760
6647 2760 2317 -82 716 1296 -527 -115 3597 1782 931 748 873 -3667 -2520 1272 133 -705 318
6630 318 2582 1794 -965 -2599 -4423 -3715 -3938 -4617 -1915 -1255 -2795 -2129 -3035 -2581 4370 6831 4924
6613 4924 4595 625 -2797 -2912 1053 1342 420 -1826 -3520 -641 831 1359 2382 3759 6208 2401
6597 2401 -1492 -4636 -6035 -2460 -1778 -5750 -6116 -3830 -2268 -1727 -2093 -765 -196 -1316 -3875 -1988
6581 -1988 -27 -4779 -2664 1059 -345 1607 3157 595 -4212 -1973 777 1082 382 47 -1840 -1994
6565 -1994 -1445 409 1784 2719 931 -816 -891 -2401 -552 -745 968 2496 132 -2155 -884 2995
$$ packed form
6679d43J620m759J188l45l314r72J476N61K605K072J593j137j368l017m374K587
6663f027M200N05l98k531j336J392l10J766K590K670p66l766j626K372K571J454
6647B760m43k399P98N80j823M12L712j815q51j83J25m540J147L792j139q38J023
6630C18K264p88k759j634j824P08k23o79K702O60j540O66r06M54O951K461j907
6613D924l29l970l422j15L965K89r22k246j694K879J472N28J023J377K449l807
6597B401l893l144j399L575O82l972l66K286J562N41l66J328N69j120k559J887
6581a988J961m752K115L723j404J952J550k562m807K239K750L05p00l35j887j54
6565a994N49J854J375R35j788j747p5j510J849j93J713J528k364k287J271L879
$$ plain form
6549 2995 6146 4245 4446 4754 3123 224 1025 -1328 -3134 -4626 -4152 -4904 -3862 -2003 -2939 -3864 -1101
6532 -1101 2125 276 601 -2284 -2123 -1836 1605 3146 1883 1326 -1673 -1563 2019 3796 3190 3498 5568
6515 5568 9233 7337 4019 2339 4931 5258 -286 -1258 -1280 -2939 -3489 -4966 -1848 -386 1078 -14
6499 -14 -156 22 -3049 -4808 -3575 -3070 -1688 -832 160 -535 -1668 2631 1656 -2804 -6090 -3330 -2002
6482 -2002 -4759 -3194 -998 -2421 -1240 -5663 -7405 -6276 -5299 -3375 -1906 -2254 -6275 -5926 -5365 -5782
6466 -5782 -4470 -3153 -353 2162 2691 798 -2311 -3782 -5319 -4310 -2814 -4580 -6127 -3322 -3366 -2494
6450 -2494 -49 849 417 571 5418 4244 4081 2266 684 -352 854 3543 1599 815 1266 -358
6434 -358 120 -655 -2427 162 1415 3362 2898 2011 -107 -1784 -2206 -1266 -165 3468 3402 -321 -91
$$ packed form
6549B995L151j901K01L08j631k899Q01k353j806j492M74p52J042J859r36r25K763
6532a101L226j849L25k885J61K87L441J541j263n57k999J10L582J777o06L08K070
6515E568L665j896l318j680K592L27n544r72k2j659n50j477L118J462J464j092
6499a4j42J78l071j759J233N05J382Q56R92o95j133M299r75m460l286K760J328
6482b002k757J565K196j423J181m423j742J129R77J924J469l48m021L49N61m17
6466e782J312J317K800K515N29j893l109j471j537J009J496j766j547K805m4Q72
6450b494K445Q98m32J54M847j174j63j815j582j036J206K689j944p84M51j624
6434c58M78p75j772K589J253J947m64q87k118j677m22R40J101L633o6l723K30
$$ plain form
6417 -91 1661 880 1812 3988 2600 137 -1020 -3351 -3002 -2094 -2203 372 1318 -64 -2991 -3756 -4505
6400 -4505 -1357 3156 4867 5664 2798 1289 1396 -466 629 666 1931 4749 4217 1750 422 1013
6384 1013 286 -1822 -1725 -2983 -3701 -2411 -1391 -3053 -4678 -3393 -2004 264 -966 1168 6611 11185
6368 11185 8463 5826 3939 4232 2538 1681 293 883 1861 2847 3736 5382 2843 1386 335 -127
6352 -127 -4158 -3112 -2065 -1209 -1603 -3271 -4152 -6846 -6372 -3977 -2668 15 1214 2625 3648 4554
6336 4554 3862 4566 1428 -892 -1174 -567 -2760 -5506 -2326 -3009 -5204 -4653 -3440 -3030 -3944 -5148 -3210
6319 -3210 -4342 -4581 -6317 -2970 -719 1115 2573 1557 -213 398 1112 -2346 -4982 -3298 578 5168
6303 5168 3957 557 -849 -4676 -8324 -7300 -7386 -5996 -2793 -3190 -3685 -4704 -3222 -4813 -5868 -4098
$$ packed form
6417i1J752p81R32K176j388k463j157k331L49R08j09K575R46j382k927p65p49
6400d505L148M513J711P97k866j509J07j862J095L7J265K818n32k467j328N91
6384A013p27k108R7j258p18J290J020j662j625J285J389K268j230K134N443M574
6368A1185k722k637j887K93j694q57j388N90R78R86Q89J646k539j457j051m62
6352a27m031J046J047Q56l94j668q81k694M74K395J309K683J199J411J023R06
6336D554o92P04l138k320k82O07k193k746L180o83k195N51J213M10r14j204J938
6319c210j132k39j736L347K251J834J458j016j770O11P14l458k636J684L876M590
6303E168j211l400j406l827l648J024q6J390L203l97m95j019J482j591j055J770
$$ plain form
6287 -4098 -411 -98 -5452 -4504 3272 9352 7514 3239 4365 5218 3631 2456 10 31 998 -180
6271 -180 -2450 27 1564 1009 1182 -344 -1267 -4294 -6300 -6065 -6149 -5958 -3895 -2503 -4887 -4213 -3013
6254 -3013 -3194 -1949 -3286 -2049 -236 -598 878 2339 1606 2953 5276 4047 697 -52 1371 2371
6238 2371 -309 -1752 -3771 -3246 696 1650 1143 1696 -637 -3425 -3474 -1641 -1059 -697 -29 268 1365
6221 1365 1813 -468 -790 895 331 -1693 -1035 1588 1573 2938 1211 4371 3194 1157 -1114 2191
6205 2191 5359 4721 2313 -2214 -4271 -5320 -3234 -4586 -4218 -4199 -4246 -3225 -4001 -3538 948 2952 77
6188 77 -3390 -3538 -2828 -3612 -3147 -3146 -2253 -5072 -5499 -7113 -6282 -5861 -3781 -2046 -70 559 -1047 939
6170 939 1838 1498 822 1126 829 -1398 -275 -204 -1708 1378 1879 415 -1002 -734 978 1725 604 3576
$$ packed form
6287d098L687L13n354R48P776O080j838m275J126Q53j587j175k446K1R67j178
6271a80k270K477J537n55J73j526r23l027k006K35q4J91K063J392k384O74J200
6254c013j81J245j337J237J813l62J476J461p33J347K323j229l350p49J423J000
6238B371k680j443k019N25L942R54n07N53k333k788m9J833N82L62O68K97J097
6221A365M48k281l22J685n64k024O58K623j5J365j727L160j177k037k271L305
6205B191L168o38k408m527k057j049K086j352L68J9m7J021p76M63M486K004k875
6188G7l467j48P10p84M65JQ93k819m27j614Q31M21K080J735J976O29j606J986
6170I39Q99l40o76L04k97k227J123P1j504L086N01j464j417K68J712P47j121K972
$$ plain form
6152 3576 3916 1333 -390 -686 1046 2793 -479 -1675 -538 813 -2539 -3111 -1751 1880 -831 -2289
6136 -2289 -1377 -3268 -5430 -7264 -4285 133 2386 1242 297 -1312 -399 610 1494 1477 1378 219 -1492
6119 -1492 -3857 -5290 -6237 -3048 -2441 -1738 -88 -912 -638 -1485 -2833 704 279 -1630 -2072 -3529 -4475
6102 -4475 -2137 -2714 -2305 -1324 -3903 -4654 -4257 -3238 -1403 -1354 -1967 -1199 -776 305 458 483 508 123 -2115
6083 -2115 -480 1843 750 -1849 -228 853 -1541 -1968 -4563 -4713 -5811 -4817 -3637 -679 1521 3916
6067 3916 3946 3005 -601 -2615 -2839 -999 2114 3411 273 -3342 -2633 1232 -710 -3241 -6114 -6178 -3691
6050 -3691 -66 361 -643 -2679 -2695 269 2326 -251 -516 -1104 -4482 -2027 882 -416 -3597 -4408
6034 -4408 -4969 -3588 -681 1727 1848 532 -683 -2206 -2305 -1906 -2719 -700 320 458 3331 3011 -3069
$$ packed form
6152C576L40k583j723k96J732J747l272j196J137J351l352n72J360L631k711j458
6136b289R12j891k162j834K979M418K253j144r45j609R13J009Q84j7r9j159j711
6119a492k365j433r47L189O07P03J650q24K74q47j348L537m25j909m42j457r46
6102d475K338n77M09R81k579p51L97J019J835M9o13P68M23J081J53K5K5l85k238
6083b115J635K323j093k599J621J081k394m27k595j50j098R94J180K958K200K395
6067C916L0r41l606k014k24J840L113J297l138l615P09L865j942k531k873o4K487
6050c691L625M27j004k036j6K964K057k577k65n88l378K455K909j298l181q11
6034d408n61J381K907K408J21j316j215j523r9L99q13K019J020J38K873l20o080
$$ plain form
6017 -3069 -6583 -5741 -872 477 -1060 137 814 84 -735 -464 1439 1751 -1105 -4748 -4215 -3516 -3962
6000 -3962 -6700 -6901 -4170 -1870 0 -573 -3248 -2024 189 -287 -3351 -5605 -5241 -3276 -5893 -6259
5984 -6259 -4515 -2137 -1921 -2640 -3808 -5340 -4924 -3110 -3289 -781 -1556 -3896 -1614 -60 2451 729
5968 729 396 1909 1981 -594 -6839 -5949 -3754 -3603 -5693 -7761 -7064 -3278 -129 -1505 -3879 -4096 -6226
5951 -6226 -2920 -772 -1068 -1986 -3776 -1102 1575 -343 1662 3883 4850 6212 4894 2523 -687 -946
5935 -946 -337 -953 -2844 -2945 -1635 -214 1462 1027 644 -2266 -2397 -2321 -2836 -2182 -2216 -556 1845 1240
5917 1240 -43 1877 1834 -156 -500 -122 -126 564 -1752 -4069 -4414 -3479 -687 3444 4031 2249 3261 4794
5899 4794 5329 2732 4355 3753 2399 1166 -4126 -3959 -5158 -6355 -6145 -6300 -3373 -1316 -655 -2111
$$ packed form
6017c069l514Q42M869J349j537J197O77p30q19K71J903L12k856l643N33O99m46
6000c962k738k01K731K300J870n73k675J224K213m76l064k254L64J965k617l66
5984f259J744K378K16p19j168j532M16J814j79K508p75k340K282J554K511j722
5968G29l33J513P2k575o245Q90K195J51k090k068O97L786L149j376k374k17k130
5951f226L306K148k96r18j790K674K677j918K005K221R67J362j318k371l210k59
5935i46O09o16j891j01J310J421J676m35l83k910j31P6n15O54l4J660K401o05
5917A240j283J920m3j990l44L78mO90k316k317l45R35K792M131N87j782J012J533
5899D794N35k597J623o02j354j233n292J67j199j197K10j55K927K057O61j456
$$ plain form
5883 -2111 -858 99 1341 2755 3094 2909 -242 370 -310 -1568 185 -3899 -4147 -2968 635 -1130
5867 -1130 -5200 -3491 19 -831 -2123 -2322 -1097 -575 -62 4049 3959 1775 1362 -926 -261 1337 975
5850 975 868 3230 2213 -2578 -2984 83 -690 -2053 -5501 -7943 -6576 -3681 -1137 -325 -969 1228
5834 1228 2605 3200 2196 -688 850 1902 -571 -4372 -3233 -344 -2069 -1598 2662 3586 1727 -565
5818 -565 2798 3782 576 -2601 -2396 -2928 -3231 -636 1603 -778 14 1468 -864 -2011 -3083 -4659
5802 -4659 -6490 -8183 -5657 -6123 -4284 1188 5017 2416 -384 -1287 -2077 77 -948 -1233 -1949 -1130
5786 -1130 803 2130 3946 2485 -651 -642 1488 3712 611 -1626 -4777 -5514 -3269 -1669 -1604 1629
5770 1629 1695 46 437 -435 -3106 -5217 -4016 818 -1444 -2480 -1107 -1277 -2674 65 2037 2538
$$ packed form
5883b111J253R57J242J414L39j85l151O12o80j258J753m084k48J179L603j765
5867a130m070J709L510q50j292j99J225N22N13M111r0k184m13k288O65J598l62
5850I75j07K362j017m791m06L067p73j363l448k442J367K895K544Q12o44K197
5834A228J377N95j004k884J538J052k473l801J139K889j725M71M260R24j859k292
5818e65L363R84l206l177K05n32l03K595K239k381P92J454k332j147j072j576
5802d659j831j693K526m66J839N472L829k601k800r03p90K154j025k85p16Q19
5786a130J933J327J816j461l136RK130K224l101k237l151p37K245J600O5L233
5770A629O6j649L91q72k671k111J201M834k262j036J373j70j397K739J972N01
$$ plain form
5754 2538 2945 670 -1276 -1169 -1431 -211 1863 1466 2387 1644 460 816 314 -262 1209 366 -518 2941
5736 2941 4221 4034 2153 6 -732 -2747 2044 4814 5631 4401 3826 577 -4419 -2973 592 2227
5720 2227 1236 798 -651 -1945 806 3200 3743 -169 -2903 -1720 775 -542 -1503 -530 1180 458
5704 458 -1387 -1327 2088 1797 1065 27 -2678 -269 -1434 -1945 325 344 -1760 -1132 -1890 -4799 -4138 -2094
5686 -2094 -120 -2067 -3747 -3523 -2392 -1145 -475 -1436 -653 -583 1864 794 -1765 -2578 1477 1594 -1179
5669 -1179 -1416 592 171 333 1726 -2065 -3296 -3539 -2938 1338 3836 1659 -2329 -356 4593 1216
5653 1216 -64 1245 -365 -2173 -2999 -2065 -2104 -3636 -5985 -2443 -1541 -2087 592 83 -925 1939 94
5636 94 -1832 -1494 -1938 -1609 -5794 -7902 -4196 -2067 -1059 -759 -1432 -1197 -1453 -2001 -1794 -1393 -2023 -2554
$$ packed form
5754B538M07k275j946J07k62J220K074l97R21p43j184L56n02n76J471q43q84L459
5736B941J280j87j881k147p38k015M791K770Q17j230n75l249m996J446L565J635
5720B227r91m38j449j294K751K394N43l912k734J183K495j317r61R73J710p22
5704D58j845O0L415k91p32j038k705K409j165n11K270J9k104O28p58k909O61K044
5686b094J974j947j680K24J131J247O70r61P83P0K447j070k559q13M055J17k773
5669a179k37K008m21J62J393l791j231k43O01M276K498k177l988J973M949l377
5653A216j280J309j610j808q26R34l9j532k349L542R02n46K679n09j008K864j845
5636I4j926L38m44L29m185k108L706K129J008L00o73K35k56n48K07M01o30n31
$$ plain form
5618 -2554 -174 1592 -260 -865 -1186 -1213 1219 1488 2218 4201 3984 2201 500 459 -219 -2473 -3119 -3031
5600 -3031 -3643 -3838 -2074 -1123 -344 2757 586 -4808 -4358 -2011 749 461 -1643 -1237 -2772 -2538 -3003
5583 -3003 -4971 -2310 2799 5153 5019 1903 2603 721 -1603 1912 4537 2350 535 503 -1546 -6
5567 -6 55 -1705 -4508 -3621 313 3419 3192 953 -607 -1699 -2250 -3094 -248 458 -1006 213 2889
5550 2889 2092 -726 -2440 -1138 -768 -1178 -3976 -2714 -2168 -2124 1318 2199 945 -2020 -748 -1899 -129
5533 -129 2796 4641 3574 2167 3520 2212 1453 1617 -611 -544 1474 509 -1587 -3472 -3712 -4169 -2309
5516 -2309 1694 2574 -417 -1572 -1449 -1193 -887 -2405 -3836 -6390 -4895 -982 -1376 -5464 -8818 -5667
5500 -5667 -3881 -3171 -2079 -1828 -2654 -3381 -2261 -410 73 144 64 1742 3470 3464 1504 744 2590 1899
$$ packed form
5618b554K380J766j852o05l21k7K432K69P30J983k17j783j701m1o78k254o46Q8
5600c031o12j95J764R51P79L101k171n394M50K347K760k88k104M06j535K34m65
5583c003j968K661N109K354j34l116P00j882k324L515K625k187j815l2k049J540
5567fO1j760k803Q87L934L106k27k239j560j092n51q44K846P06j464J219K676
5550B889p97k818j714J302L70m10k798J262N46M4L442Q81j254k965J272j151J770
5533a29K925J845j067j407J353j308p59J64k228O7K018r65k096j885k40m57J860
5516b309M003Q80k991j155J23K56L06j518j431k554J495L913l94m088l354L151
5500e667J786P10J092K51q26p27J120J851M83P1q0J678J728oj960p60J846o91
$$ plain form
5482 1899 -2642 -4999 -4948 -5121 -3524 -4943 -3097 -2809 -211 -927 130 -500 2183 4139 3755 2274 -874
5465 -874 2125 5414 7579 6027 4983 6181 4048 4525 3900 1888 -2833 -5670 -741 2608 2125 1984
5449 1984 526 1416 2426 710 56 -1746 -2823 -2662 -2464 -2208 1679 3838 2937 3716 7338 7403 3883
5432 3883 2492 3174 5028 5489 3606 3384 4663 41 -1653 -44 -1757 -6574 -9367 -4118 2874 4587
5416 4587 2047 1522 1486 3057 2839 2631 5558 3679 1259 788 -922 -1634 -2431 -1907 -2929 -4233 -2004
5399 -2004 2115 6465 5893 5366 4169 1513 647 860 155 3679 3957 644 -867 -499 1062 1321 -1720
5382 -1720 -4268 -2285 -371 -57 -1569 658 4300 3609 1293 -799 -2173 -2917 -5753 -5951 -6854 -7897
5366 -7897 -5004 -3544 -2363 688 2957 5978 3082 -1450 -2473 -3851 -3753 -1790 -3158 -3918 -4768 -2878
$$ packed form
5482A899m541k357N1j73J597j419J846K88K598p16J057o30K683J956l84j481l148
5465h74K999L289K165j552j044J198k133M77o25k012m721k837M929L349m83j41
5449A984j458Q90J010j716o54j802j077J61J98K56L887K159r01P79L622O5l520
5432C883j391O82J854M61j883k22J279m622j694J609j713m817k793N249O992J713
5416D587k540n25l6J571k18k08K927j879k420m71j710p12p97N24j022j304K229
5399b004M119M350n72n27j197k656q66K13p05L524K78l313j511L68J561K59l041
5382a720k548J983J914L14j512K227L642o91k316k092j374p44k836j98r03j043
5366g897K893J460J181L051K269L021k896m532j023j378R8J963j368p60q50J890
$$ plain form
5350 -2878 -3174 -2703 -617 -902 -4415 -4033 666 3219 3678 2895 4724 5642 6065 6995 5119 5369 4426 1646
5332 1646 -3166 -4766 -3117 -99 3306 2234 3176 3373 2812 2751 2656 771 -1067 -1674 -1688 908 2936
5315 2936 1086 535 -423 476 131 424 -1956 -945 1248 -776 -806 -2155 -401 719 59 326 -88
5298 -88 -775 -518 -1606 -842 1484 3110 2219 1045 65 -545 -1884 -1621 -54 2557 1414 2082 5276
5281 5276 4297 2681 4597 4940 3879 4484 4626 6206 6521 2601 -1230 -138 708 1887 2787 3115 1008
5264 1008 3199 2793 3805 5341 5210 2375 1522 -1725 -306 1465 1463 1517 237 -1256 -1822 -68 1997
5247 1997 1580 -651 1808 -501 -1454 813 4904 6772 4971 4745 2193 -853 -3881 -4639 -408 278
5231 278 -2335 -519 775 3663 5608 5361 2176 923 -57 -2791 -4008 -711 1200 -1626 -3512 -1355
$$ packed form
5350b878k96M71K086k85l513L82M699K553M59p83J829R18M23R30j876K50r43k780
5332A646m812j600J649L018L405j072R42J97n61o1r5j885j838o07j4K596K028
5315B936j850n51r58Q99l45K93k380J011K193k024l0j349J754J120o60K67m14
5298h8o87K57j088P64K326J626q91j174r80o10j339K63J567K611j143O68L194
5281E276r79j616J916L43j061O05J42J580L15l920l831J092Q46J179R00L28k107
5264A008K191m06J012J536j31k835q53l247J419J771kN4j280j493n66J754K065
5247A997m17k231K459k309r53K267M091J868j801k26k552l046l028p58M231O86
5231B78k613J816J294K888J945k47l185j253r80k734j217L297J911k826j886K157
$$ plain form
5215 -1355 -2759 -3135 -2855 -4692 -7043 -5134 -4008 -526 10 981 2677 2548 927 -236 -1352 -1218
5199 -1218 2 2382 2918 3003 4530 3478 -42 214 994 737 188 -1955 -2699 189 2927 1248 -1248
5182 -1248 -332 1130 158 -461 -899 -668 876 1506 1603 468 -1527 -3511 -1951 1865 993 1857 1100 -766
5164 -766 98 1968 660 -1977 -4015 -2297 -421 1115 3423 477 -807 1720 -2329 -4812 -3064
5149 -3064 -3434 415 2839 2510 1094 7 2158 2227 1671 3113 2048 -798 178 4523 5813 4233
5133 4233 2302 -2288 -3925 -3073 -2375 -2715 -2306 -1177 -1134 -3221 -3160 1695 3620 -518 -2311 -1336 440
5116 440 1693 -739 -5061 -2873 694 4211 5163 5414 5898 3923 797 1076 -231 -455 705 2443
5100 2443 4125 6119 6210 2700 321 -202 -472 -1153 14 3264 2298 1116 -2165 -1572 -1183 -2288 -2354
$$ packed form
5215a355j404l76K80j837k351J909J126L482N36R71J696j29j621j163j116J34
5199a218J220K380N36Q5J527j052l520K56P80k57n49k143p44K888K738j679k496
5182a248R16J462r72o19m38K31J544O30R7j135j995j984J560L816q72Q64p57j866
5164g66Q64J870j308k637k038J718J876J536K308k946j284K527m049k483J748
5149c064l70L849K424l29j416j087K151O9n56J442j065k846R76M345J290j580
5133D233j931m590j637Q52O98l40M09J129M3k087O1M855J925m138j793R75J776
5116D40J253k432m322K188L567L517R52K51M84j975l126K79j307k24J160J738
5100B443J682J994R1l510k379n23k70o81J167L250r66j182l281N93L89j105o6
$$ plain form
5083 -2354 366 -706 679 678 2282 1381 -1905 -3908 -1769 561 -570 1802 2034 4488 4494 4297 1604
5066 1604 2891 3412 2235 3028 2444 1601 1050 -1035 877 3940 2942 -479 1945 4017 3168 3481 1840
5049 1840 4115 2856 1192 834 755 -352 -348 545 -1338 -3850 -1607 1741 3144 4288 1893 2982 4049
5032 4049 3706 4602 4351 3487 -65 -541 -256 -398 972 -697 -6010 -2936 722 -192 -1972 -6183 -5909
5015 -5909 -3347 -3126 -4261 -4850 -2283 -1537 -2542 -6453 -9786 -7824 -4059 -4013 -6282 -5175 1057 5315
4999 5315 1875 -4539 -5833 -2478 -3311 -6507 -7185 -4887 -1133 3720 2868 -1952 -1057 1414 2341 1471
4983 1471 712 525 -912 -1054 -921 47 -834 -1984 -572 -725 -1263 -2429 -4770 -7048 -4740 -3101 -2901
4966 -2901 132 -181 -2985 -730 -1673 1860 3308 2617 1798 -53 1288 387 2067 2509 3495 7097 7364
$$ packed form
5083b354K720j072J385jJ604r01l286k003K139K330j131K372K32K454Oj97k693
5066A604J287N21j177P93n84q43n51k085J912L063r98l421K424K072q49L13j641
5049A840K275j259j664l58p9j107MQ93j883k512K243L348J403J144k395J089J067
5032D049l43Q96k51q64l552m76K85j42J370j669n313L074L658r14j780m211K74
5015e909K562K21j135n89K567P46j005l911l333J962L765M6k269J107O232M258
4999E315l440o414j294L355q33l196o78K298L754M853q52m820Q95K471R27q70
4983A471p59j87j437j42J33R68q81j150J412j53n38j166k341k278K308J639K00
4966b901L033l13k804K255r43L533J448o91q19j851J341r01J680M42R86L602K67
$$ plain form
4949 7364 4032 3288 4737 4704 2853 98 521 3812 3960 713 -147 -896 528 470 -606 -1983 -1288
4932 -1288 -472 646 4293 5259 3210 231 -1304 21 1242 -606 -1933 -303 -210 -193 1306 3171
4916 3171 5114 5517 2598 4320 5531 2128 -738 343 905 -1951 -3006 -2055 -2698 -1334 1749 1831
4900 1831 -803 -2326 -1479 2667 1482 136 2153 4435 4399 783 2105 3274 3422 801 -3102 -2836
4884 -2836 -848 -1518 -1081 -1302 -505 2206 1356 20 -1495 -565 379 -1775 -1768 938 3863 4193 3140 5517
4866 5517 5338 4055 2710 884 -379 1337 1733 1418 4591 4464 3213 1096 1784 4808 9011 6093
4850 6093 1602 2191 5529 7013 6556 5960 4199 1075 -1256 -3094 -3524 -3228 -3339 -3403 -4709 -3071 -567
4833 -567 -239 -2801 -2722 -2424 -3625 -1013 -901 -358 1317 1006 2974 2288 -903 -856 -441 -1243 -5085 -5231
$$ packed form
4949G364l332p44J449l3j851k755M23L291J48l247q60p49J424n8j076j377O95
4932a288Q16J118L647R66k049k979j535J325J221j848j327J630R3J7J499J865
4916C171J943M03k919J722J211l403k866J081N62k856j055R51o43J364L083Q2
4900A831k634j523Q47M146j185j346K017K282l6l616J322J169J48k621l903K66
4884b836J988o70M37k21P97K711q50j336j515R30R44k154PK706K925L30j053K377
4866E517j79j283j345j826j263J716L96l15L173j27j251k117O88L024M203k918
4850F093m491N89L338J484m57n96j761l124k331j838m30K96j11o4j306J638K504
4833e67L28k562P9K98j201K612J12N43J675l11J968o86l191M7M15q02l842j46
$$ plain form
4815 -5231 -1104 1168 3213 1490 -2797 -4335 -4084 -609 -151 -2255 -201 -94 -2881 -2472 -4074 158
4799 158 3306 4440 3576 3883 4970 4581 4744 3941 2766 3044 2700 3904 -964 -1801 102 -607 -1480 -57
4781 -57 1291 1637 2218 1082 1366 112 -1564 -595 -911 -3586 12 5493 7097 3984 4358 5489 5701
4764 5701 -306 -4656 -3286 -1776 1356 301 -1445 -1009 -1032 -1212 -893 2054 3785 472 216 2827
4748 2827 5507 7673 7379 6619 6061 3318 3635 2555 4945 6694 5448 4012 5227 1188 -389 -2508
4732 -2508 -507 248 -424 1091 3625 4254 3598 2459 2342 2252 2933 2519 2146 551 1442 960 -1760 -4341
4714 -4341 -4926 -2331 -142 -703 -988 585 791 2584 3318 2219 2870 1502 2094 2252 1273 914 252 1666
4696 1666 1377 1622 2941 1840 -1214 -2059 -2022 -2654 651 1850 83 299 -1303 -1433 -422 1295 2965
$$ packed form
4815e231M127K272K045j723m287j538K51L475M58k104K054J07k787M09j602M232
4799A58L148J134q64L07J087l89J63q03j175K78l44J204m868q37J903p09q73J423
4781e7J348L46N81j136K84j254j676R69l16k675L598N481J604l113L74J131K12
4764E701o007m350J370J510L132j055j746M36k3j80L19K947J731l313k56K611
4748B827K680K166k94p60n58k743L17j080K390J749j246j436J215m039j577k119
4732b508K001P55o72J515K534O29o56j139j17r0O81m14l73j595Q91m82k720k581
4714d341n85K595K189n61k85J573K06J793P34j099O51j368N92J58r79l59o62J414
4696A666k89K45J319j101l054q45L7o32L305J199j767K16j602j30J011J717J670
$$ plain form
4679 2965 3239 -206 -2035 -920 -2332 -1394 -1320 -2290 -6624 -8315 -6138 -4650 -2286 -308 795 1954
4663 1954 1040 824 -2218 -4108 -8597 -10364 -9178 -5542 -5434 -5353 -3818 -2343 1901 3372 3221 817
4647 817 -515 -562 472 645 2762 4622 3918 1983 152 -1478 -3018 -2348 -809 -346 -1970 -2365 -4321
4630 -4321 -8349 -7366 -6508 -1663 1594 3435 2267 797 828 3031 500 -165 -1313 -4292 -5120 -6833
4614 -6833 -2734 -1519 -1708 -2848 -2661 -2436 -750 -898 -2175 -4903 -3111 -2628 -2645 -545 -372 56 -3516
4597 -3516 -4996 -2752 2039 1519 761 -61 999 2055 567 842 5924 5704 2580 2271 1153 -807
4581 -807 -689 -201 885 3484 1963 3029 5417 5531 5451 3884 3396 710 -2566 -4127 -4212 -4238 -2441 -609
4563 -609 1161 1510 4401 1284 -1179 2382 1203 1719 -345 -4532 -4247 -5576 -5260 -5089 -2396 -1998 -3211
$$ packed form
4679B965K74l445j829J115j412R38P4r70m334j691K177J488K364J978J103J159
4663A954r14k16l042j890m489j767J186L636J08Q1J535J475M244J471j51k404
4647H17j332m7J034J73K117J860p04j935j831j630j540O70J539M63j624l95j956
4630d321m028R83Q58M845L257J841j168j470L1K203k531o65j148k979q28j713
4614f833M099J215j89j140J87K25J686j48j277k728J792M83j7K100J73M28l572
4597c516j480K244M791n20p58q22J060J056j488K75N082k20l124l09j118j960
4581h07J18M88J086K599j521J066K388J14q0j567m88k686l276j561q5k6J797J832
4563f09J770L49K891l117k463L561j179N16k064m187K85j329L16J71K693L98j213
$$ plain form
4546 -3211 -4045 -1044 2570 5094 4441 1604 -2425 -2402 -522 2608 3820 183 -1454 811 253 -2056
4530 -2056 -2353 -2012 -1477 -2430 -462 3527 3588 3788 3620 1583 1983 233 400 655 -1047 1291 3362 2578
4512 2578 6411 10182 9268 4860 566 -1749 -1246 -1971 -5067 -5759 -3175 -2457 -2513 545 3499 4064 2734
4495 2734 1208 1239 2982 1903 -2206 -5585 -6194 -2139 197 1111 3392 4774 2972 948 -753 -101
4479 -101 -490 -2011 -3127 5 1139 2197 1293 -1084 -95 -705 -3055 -2726 -1137 -405 -660 1574 -1243
4462 -1243 41 -1267 -1518 1527 227 -1848 1271 1533 1462 -200 -4383 -4766 -4377 -2407 -377 4298
4446 4298 5761 2896 346 -2524 -3395 -2243 -1575 -781 154 -1251 450 444 -100 1988 2877 -189 -124 -1562
4428 -1562 -344 2964 3035 4496 3372 1405 2616 1578 1481 4686 3111 298 975 600 -2370 -2152 -942
$$ packed form
4546c211q34L001L614K524o53k837m029K3J880L130J212l637j637K265n58k309
4530b056k97L41N35r53J968L989O1K00j68k037M00j750J67K55j702K338K071p84
4512B578L833L771r14m408m294k315N03p25l096o92K584P18n6L058K954N65j330
4495B734j526L1J743j079m109l379o09M055K336R14K281J382j802k024j701O52
4479a01l89j521j116L132J134J058r04k377R89o10k350L29J589P32k55K234k817
4462a243J284j308k51L045j300k075L119K62p1j662m183l83L89J970K030M675
4446D298J463k865k550k870q71J152O68P94R35j405J701on44K088Q89l066O5j438
4428a562J218L308P1J461j124j967J211j038r7L205j575k813O77l75k970K18J210
$$ plain form
4411 -942 -1485 -1532 213 305 -144 2952 2978 4020 3320 -171 -3172 -5317 -6843 -5013 -2780 -2786 -3030 -1551
4393 -1551 -1752 -1587 2203 2277 -796 -1043 -1618 -2985 -3064 289 3213 3242 1142 -1141 -3686 -2648 1601
4376 1601 3175 3455 2379 307 1189 1719 363 -1153 -544 810 631 -120 1976 4466 6961 4745
4360 4745 3109 3900 5016 4494 5203 5377 6656 7309 4789 2119 -2406 -3717 -448 2709 3677 4079 1751
4343 1751 882 -3201 -5390 -1039 -651 1126 1794 -1369 -1408 -336 -1105 -400 3849 3863 2450 3428 5071
4326 5071 6250 4275 4489 5211 4646 2951 -748 1082 1310 -890 -2658 -888 -316 2145 -171 -1605
4310 -1605 -116 -383 -1508 -2482 -1774 1037 2254 2057 3402 4369 4408 1680 -780 -522 545 -7 -1373
4293 -1373 316 2198 4452 4892 2465 1570 2694 317 -1042 770 1654 240 3053 3081 1220 3398
$$ packed form
4411i42n43m7J745R2m49L096K6J042p00l491l001k145j526J830K233ok44J479
4393a551k01J65L790P4l073k47n75j367p9L353K924K9k100k283k545J038M249
4376A601J574K80j076k072Q82N30j356j516O09J354j79p51K096K490K495k216
4360D745j636P91J116n22P09J74J279O53k520k670m525j311L269L157R68M02k328
4343A751q69m083k189M351L88J777O68l163l9J072p69P05M249J4j413R78J643
4326E071J179j975K14P22n65j695l699J830K28k200j768J770N72K461k316j434
4310a605J489k67j125r74P08K811J217j97J345R67L9k728k460K58J067n52j366
4293a373J689J882K254M40k427q95J124k377j359J812Q84j414K813K8j861K178
$$ plain form
4277 3398 2068 -75 1105 876 1581 5952 7854 5532 6151 7295 6810 7332 4377 -1300 -3014 -2727
4261 -2727 -876 3018 1664 115 -536 670 -1167 370 -2348 -2798 115 2661 4421 4598 1384 -1528
4245 -1528 -2673 -5345 -5892 -3690 -284 7 1066 3250 3221 7 -2124 870 1643 -1438 -907 727
4229 727 4207 5476 4583 4419 6306 3089 1258 -764 -2201 -2209 -209 2001 2622 149 -3550 -3536 -1349
4212 -1349 -1931 -1849 -1171 961 4182 3008 2207 5193 4797 2977 2750 2110 -133 -955 -3315 -1345 -430
4195 -430 1171 1941 -373 -2836 -2363 -530 595 1902 -119 -2091 -1742 356 3867 2992 2884 2116 1525
4178 1525 188 248 410 -2496 -4223 -5135 -4936 -4482 -4492 -10434 -10398 -7067 -4352 2067 2706 512 -193 -735
4160 -735 -3310 -5033 -2996 -450 3036 6478 6962 5185 3499 4083 4444 2710 972 -179 -77 -1529
$$ packed form
4277C398j330k143J180k29P05M371J902k322O19J144m85N22k955n677j714K87
4261b727J851L894j354j549o51J206j837J537k718m50K913K546J760J77l214k912
4245a528j145k672n47K202L406K91J059K184k9l214k131K994P73l081N31J634
4229G27L480J269q93j64J887l217j831k022j437qK000K210O21k473l699J4K187
4212a349n82Q2O78K132L221j174q01K986l96j820k27o40k243q22k360J970R15
4195d30J601P70k314k463M73J833J125J307k021j972L49K098L511q75j08p68n91
4178A525j337O0J62k906j727r12J99M54j0n942L6L331K715O419O39k194p05n42
4160g35k575j723K037K546L486L442M84j777j686N84L61j734j738j151J02j452
$$ plain form
4144 -1529 -1183 2324 2621 2304 2050 -1171 1606 3846 2776 207 1276 3864 2343 1174 124 -80
4128 -80 -1901 -3169 -1297 2260 3247 981 -83 1095 863 2291 2583 1628 709 1538 2933 3033 -2884
4111 -2884 -2168 3221 5591 2634 2761 3434 2355 765 -1236 535 3445 3165 2586 4207 7906 7305
4095 7305 5968 3768 2511 2197 3600 6396 4775 2118 1425 3437 4714 767 383 2349 3416 297
4079 297 953 245 -15 -834 -4706 -3067 -1538 -1571 414 1281 1421 -392 -238 -1869 -3088 -153 1927
4062 1927 2878 4144 2816 1725 222 -3125 -3387 -4655 -2288 -600 -219 -643 -2304 -2215 -792 1196
4046 1196 4834 4033 -782 -4221 -3293 -2738 -3401 -1952 -1124 297 1202 -102 951 3295 3434 4102 3295
4029 3295 4158 -484 -1701 1359 3139 421 -1237 236 2718 4497 677 1856 2060 -1582 366
$$ packed form
4144a529L46L507K97l17k54l221K777K240j070k569J069K588j521j169j050k04
4128h0j821j268J872L557R87k266j064J178k32J428K92r55r19Q29J395J00n917
4111b884P16N389K370k957J27O73j079j590k001J771K910k80n79J621L699o01
4095G305j337k200j257l14J403K796j621k657o93K012J277l947l84J966J067l119
4079B97O56p08k60q19l872J639J529l3J985Q67J40j813J54j631j219K935K080
4062A927R51J266j328j091j503l347k62j268K367J688L81m24j661Q9J423J988
4046A196L638q01m815l439R28N55o63J449Q28J421R05j304J053K344J39O68q07
4029C295Q63m642j217L060J780k718j658J473K482J779l820J179K04l642J948
$$ plain form
4014 366 1523 1343 1012 599 1224 468 687 2765 658 -3148 -3912 -3395 -1582 -2096 -1955 41 394 759
3996 759 1815 2044 1542 3303 3727 -831 1384 3764 47 -124 -238 -2602 -6517 -5885 -3554 -2847 -1598
3979 -1598 3845 6017 3632 1529 -1585 -1215 -54 292 154 -4175 -3777 -2576 -2359 -3277 -3801 -936 -1130
3962 -1130 1904 3956 5559 8056 7769 4808 3720 4320 6060 9869 4214 -2936 -4112 -1214 -1685 2674
3946 2674 3930 836 -1399 -1153 3664 9831 5715 1657 1235 1646 3161 2042 5655 8924 6434 5779
3930 5779 5613 3121 4067 2558 534 1826 1969 2241 3737 2363 1334 5538 3772 2113 2075 932
3914 932 1752 3710 2154 -1224 -3113 477 3970 2463 2451 200 86 -124 -1964 1117 2883 2772 -170
3897 -170 -692 2887 3970 4486 2116 92 1913 -414 -2846 -1079 0 2430 1316 -835 -521 -1926
$$ packed form
4014C66J157j80l31m13O25p56K19K078k107l806p64N17J813n14J41J996L53L65
3996G59J056K29n02J761M24m558K215K380l717j71j14k364l915O32K331P07J249
3979a598N443K172k385k103l114L70J161L46j38m329L98J201K17r18n24K865j94
3962a130L034K052J603K497k87k961j088O00J740L809n655p150j176K898m71M359
3946B674J256l094k235K46M817O167m116m058m22M11J515j119L613L269k490o55
3930E779j66k492R46j509k024J292J43K72J496j374j029M204j766j659l8j143
3914I32Q20J958j556l378j889L590L493j507j2k251j14k10j840L081J766j11k942
3897a70n22L579J083N16k370k024J821k327k432J767J079K430j114k151L14j405
$$ plain form
3881 -1926 -3246 -2742 -2771 -1841 -2650 -215 357 -1034 -401 762 1123 -1336 -2879 -3277 -1746 1787 4106
3864 4106 3437 577 -3577 -4729 -3144 -1528 1952 2359 1154 31 1747 4903 4609 612 -2193 157
3848 157 -640 -3639 -1615 -1493 -1544 -3553 -3151 -1502 221 371 1601 727 1538 2629 2704 1450 177 -410
3830 -410 637 -243 0 -1091 -4167 -4217 -1621 -146 -3630 -8368 -7529 -5908 -2316 751 2292 944
3814 944 487 859 2953 3788 2718 -2125 -3531 -2141 165 892 1832 3275 2760 1928 1298 700 -1594
3797 -1594 -644 -2476 -4365 -5605 -1958 2234 3506 2161 990 1008 2430 147 -2426 -1712 -1052 1001
3781 1001 269 -204 204 -323 -935 70 2580 4133 3417 2452 -2293 -4172 -791 -1514 2373 2155 -718
3764 -718 -512 951 1829 1991 1577 3475 1827 -873 2081 2002 192 -997 940 1426 780 -226 -3447
$$ packed form
3881a926j320N04k9R30q09K435N72j391O33J163L61k459j543l98J531L533K319
3864D106o69k860m154j152J585J616L480M07j205j123J716L156k94l997k805K350
3848A57p97k999K024J22n1k009M02J649J723J50J230q74Q11J091P5j254j273n87
3830d10J047q80K43j091l076n0K596J475l484m738Q39J621L592L067J541j348
3814I44m57L72K094Q35j070m843j406J390K306P27R40J443n15q32o30n98k294
3797a594R50j832j889j240L647M192J272j345j171J8J422k283k573P14O60K053
3781A001p32m73M08n27o12J005K510J553p16r65m745j879L381p23L887k18k873
3764g18K06J463Q78J62m14J898j648k700K954p9j810j189J937M86o46j006l221
$$ plain form
3747 -3447 -7634 -6892 -2095 2683 4300 3739 2947 1168 2080 903 471 2654 3750 2307 -462 1450
3731 1450 229 3228 5702 3778 3805 1978 -1425 -1911 -3878 -4225 -2299 -671 -593 -1826 -315 -480 -2292
3714 -2292 124 -2849 -3940 -2859 -1298 893 293 -1582 -3146 -1723 -272 459 1048 589 -1162 -1506
3698 -1506 -2532 -834 1506 4181 710 -586 -549 -702 -4444 -6929 -6762 -6054 -4454 -3020 -4649 -5685
3682 -5685 -1076 2978 1449 -383 -3351 -2386 -138 -1268 501 1348 467 1628 2197 639 1125 3731
3666 3731 2943 2966 1497 1408 1829 1580 1929 176 -1552 -2357 -406 -1618 -727 -1444 2571 4600 3892 1808
3648 1808 4745 1112 -4852 -6460 -5427 -2671 2747 5220 4757 4319 5245 3277 -100 1274 -1378 -2782
3632 -2782 -2217 -588 968 2917 7369 3318 1300 56 1856 2575 3067 5123 7217 5624 2225 1831
$$ packed form
3747c447m187P42M797M778J617n61p92j779R12j177m32K183J096j443k769J912
3731A450j221K999K474j924K7j827l403m86j967l47J926J628P8j233J511j65j812
3714b292K416k973j091J081J561K191o00j875j564J423J451P31N89m59j751l44
3698a506j026J698K340K675l471j296L7j53l742k485J67P08J600J434j629j036
3682e685M609M054j529j832k968R65K248j130J769Q47q81J161N69j558M86K606
3666C731p88K3j469q9M21k49L49j753j728q05J951j212Q91p17M015K029p08k084
3648A808K937l633n964j608J033K756N418K473m63m38R26j968l377J374k652j404
3632b782N65J629J556J949M452m051k018j244J800P19M92K056K094j593l399l94
$$ plain form
3616 1831 2086 980 3383 6269 7332 3942 2490 -2345 -3766 -4873 -4107 551 4145 2981 2307 3556
3600 3556 4286 -2459 -2052 3187 3074 2038 3008 -1359 -2973 -116 1080 4438 4017 1600 -45 -625
3584 -625 52 59 -1634 -2251 -1887 -2251 -4811 -6817 -5128 -4739 -4787 -2655 326 4028 5752 4329 3671 1445
3566 1445 1660 2734 -238 -2448 -3869 -294 2353 5017 3142 -873 -1042 1026 3105 2534 559 -226
3550 -226 -453 2042 3889 5927 3216 -774 -756 -1526 2256 3553 -992 -1104 447 -24 -1976 -3274 -3635
3533 -3635 -1448 -1270 -2564 -2173 -527 739 1277 2185 2945 3023 3468 5053 5289 3187 -1896 -3079 -3577
3516 -3577 -5034 -5505 -4611 -3298 -2354 -1219 -2828 1098 6017 8491 5043 2811 3591 3380 2997 2616 2313
3499 2313 3259 911 -2695 -4935 -5097 -3878 -3264 -2293 2879 4700 2850 1242 6165 8437 8176 7217
$$ packed form
3616A831K55j106K403K886J063l390j452m835j421j107P66M658L594j164o74J249
3600C556P30o745M07N239j13j036R70m367j614K857J196L358m21k417j645n80
3584f25O77Pj693o17L64l64k560k006J689L89m8K132K981L702J724j423o58k226
3566A445K15J074k972k210j421L575K647K664j875m015j69K068K079n71j975p85
3550b26k27K495J847K038k711l990J8p70L782J297m545j12J551m71j952j298l61
3533c635K187J78j294L91J646J266N38R08P60P8M45J585K36k102n083j183m98
3516c577j457m71Q94J313R44J135j609L926M919K474l448k232P80k11l83l81l03
3499B313R46k348l606k240j62J219O14R71N172J821j850j608M923K272k61r59
$$ plain form
3483 7217 5616 2620 557 -2594 -2115 492 1135 -15 -1624 -454 -1138 -608 1241 3051 2392 779
3467 779 1106 3905 7432 9033 5478 1111 -196 1440 1298 -2231 -2614 -1615 869 -636 -1375 -1800 -2360
3450 -2360 153 4881 6363 3239 -176 2556 3486 3022 3818 -137 -1544 1614 1983 2230 3838 1308
3434 1308 -886 -1078 -1678 -2772 -1942 -1237 1607 1254 -821 2181 -1877 -1441 -2148 -3611 -5071 -2602 603
3417 603 2371 4359 2854 -2437 -1332 -1524 -4130 -5232 -2172 1094 654 1746 2851 6845 5624 3265
3401 3265 1672 -1529 -3775 -2259 -2825 -5077 -4291 737 4231 4548 3774 3475 2091 -3091 -4658 -1106
3385 -1106 151 589 1617 1712 3338 3030 2239 1871 1470 3159 3262 3415 4558 6183 6399 6428 3460 326
3367 326 -860 -706 -1657 -1822 -1237 1613 -94 -423 -1897 -4393 -4443 -3354 -4700 -2632 -1051 2522 3173
$$ packed form
3483G217j601k996k063l151M79K607O43j150j609J170o84N30J849J810o59j613
3467G79L27K799L527J601l555m367j307J636j42l529l83R99K484j505p39m25n60
3450b360K513M728J482l124l415K732R30m64P96l955j407L158L69K47J608k530
3434A308k194j92o00j094Q30P05K844l53k075L002m058M36p07j463j460K469L205
3417F03J768J988j505n291J105j92k606j102L060L266m40J092J105L994j221k359
3401C265j593l201k246J516n66k252P86N028L494L17p74k99j384n182j567L552
3385a106J257M38J028R5J626l08p91l68m01J689J03J53J143J625K16K9k968l134
3367C26j186J54r51j65N85K850j707l29j474k496n0J089j346K068J581L573O51
$$ plain form
3350 3173 -310 16 2373 -1498 -5663 -3356 -2560 -224 4104 5724 2761 -1801 -2738 -2839 1328 1814
3334 1814 8 678 2648 2833 2845 458 779 3763 3059 1047 -594 173 369 822 3458 3404 4850 3629
3316 3629 3553 4985 4411 1154 1421 2696 3634 5509 3944 1676 990 -158 -1232 -1450 483 1050 2289
3299 2289 2944 1891 1054 1355 202 1894 2459 373 775 578 1958 111 3021 3455 3101 3298 2693
3282 2693 1495 3781 6355 3700 665 -1443 60 1418 2609 6100 6725 6186 7687 9296 8253
3267 8253 6892 5064 228 -2561 -956 1465 1302 -996 1045 2316 1198 -2244 -5020 -4235 -3830 -1163
3251 -1163 -533 -575 1176 1647 640 1001 1782 95 168 2134 6125 4523 1249 1111 -2866 -6619 -2838
3234 -2838 -489 -344 1770 -91 -1399 -1967 -3110 -1631 -1129 689 1037 2208 5189 5571 4039 2920
$$ packed form
3350C173l483L26K357l871m165K307P96K336M328J620k963m562r37j01M167M86
3334A814j806O70J970J85J2k387L21K984p04k012j641P67J96M53K636n4J446j221
3316C629p6J432n74l257K67J275R38J875j565k268o86j148j074k18J933N67J239
3299B289O55j053q37L01j153J692N65k086M02j97J380j847K910M34l54J97o05
3282B693j198K286K574k655l035k108J503J358J191L491O25n39J501J609j043
3267H253j361j828m836k789J605K421j63k298K041J271j118l442k776P85M05K667
3251a163O30m2J751M71j007L61P81j687P3J966L991j602l274j38l977l753L781
3234b838K349J45K114j861j308n68j143J479N02J818L48J171K981L82j532j119
$$ plain form
3218 2920 2534 -1101 -2358 46 1412 1447 3134 1594 533 2259 694 -817 -648 -1854 -2328 -1780
3202 -1780 1193 605 -1716 -3680 -2148 -1210 -3688 -4915 -2232 503 1344 -854 -2028 -2608 -3062 -5141
3186 -5141 -6845 -5796 -2199 -2547 -4736 -2936 -871 -1424 -705 540 -219 513 -643 -666 779 1866 4704
3169 4704 3050 2583 2506 1796 3593 3978 -636 -2449 605 3693 5063 6380 5798 5748 5777 5112 3393 1187
3151 1187 2578 3163 289 797 3630 2996 1476 2596 2090 202 -341 347 3249 1621 4288 5306
3135 5306 5247 785 -2282 355 2038 2785 2201 3694 4289 5088 5993 6113 3985 986 -345 -2028 1514
3118 1514 264 -461 103 1501 1043 -554 -2074 -1419 4443 6943 8421 3900 -286 122 2845 -793
3102 -793 -6413 -3701 -1773 2516 4981 4280 2564 2144 4106 2089 1760 2380 1696 1329 2954 1563 1591
$$ packed form
3218B920l86l635j257K404J366L5J687j540j061J726j565j511J69j206m74N48
3202a780K973n88k321j964J532R38k478j227K683K735Q41k198j174n80m54k079
3186e141j704J049L597l48k189J800K065n53P19J245p59P32j156k3J445J087K838
3169D704j654m67p7p10J797L85m614j813L054L088J370J317n82n0K9o65j719k206
3151A187J391N85k874N08K833o34j520J120n06j888n43O88K902j628K667J018
3135E306n9m462l067K637J683P47n84J493N95P99R05J20k128k999j331j683L542
3118A514j250p25N64J398m58j597j520O55N862K500J478m521m186M08K723l638
3102g93n620K712J928M289K465p01j716m20J962k017l29O20o84l67J625j391K8
$$ plain form
3085 1591 -936 -2791 -1830 -4015 -1955 440 4032 5857 2935 669 189 -1173 -1618 -1680 776 -528
3069 -528 -1092 787 1435 1958 2983 3212 3790 1406 -1163 517 998 2915 2138 1197 3403 4995 5120
3052 5120 3544 3919 5302 4591 5323 3704 2307 1343 1963 1804 829 -1038 -2394 -425 1791 83 887
3035 887 -1467 -985 -1636 -2768 -3586 -4195 -4059 -1874 839 769 -1330 -2505 -184 -1666 -4 -682 -1871
3018 -1871 -2249 -1797 -2519 -3382 -2261 -75 1895 83 -823 498 1599 2978 -1309 -2048 -1890 -60 -2384
3001 -2384 -764 2135 1091 386 4268 6882 5138 2829 1127 1353 3760 4913 5211 7295 8224 6548
2985 6548 8271 8983 10840 5842 -1597 -2739 -2121 -3284 -3862 -2235 462 216 2067 1558 -310 965
2969 965 2778 5109 3518 2615 29 3323 3818 2344 -274 -1499 -437 -859 -3223 -3401 -1809 -1999
$$ packed form
3085A591k527j855R61k185K060K395L592J825k922k266m80j362m45o2K456j304
3069e28n64J879O48N23J025K29N78k384k569J680M81J917p77r41K206J592J25
3052E120j576L75J383p11P32j619j397r64O20j59r75j867j356J969K216j708Q04
3035H87k354M82o51j132q18o09J36K185K713p0k099j175K321j482J662o78j189
3018a871l78M52p22q63J121K186J970j812r06J321J101J379m287p39J58J830k324
3001b384J620K899j044p05L882K614j744k309j702K26K407J153K98K084R29j676
2985F548J723P12J857m998p439j142O18j163n78J627K697k46J851n09j868J275
2969I65J813K331j591r03k586L294M95j474k618j225J062m22k364j78J592j90
$$ plain form
2953 -1999 -171 3133 3060 1304 1596 -785 -2679 -886 -583 -608 -3878 -3273 -3682 -2585 -6196 -8982 -7067
2936 -7067 -10805 -12191 -9141 -9065 -8522 -6984 -4757 -2820 -3016 -3868 -4360 -8934 -10081 -8758 -3633 758
2920 758 1367 1607 -1677 -1535 747 555 -579 816 2916 5867 7971 4355 -505 -1056 150 3882
2904 3882 2503 257 707 223 197 -1820 -3506 -2112 -28 -1954 -4774 -7079 -5229 -3958 -5029 -2005
2888 -2005 863 419 577 457 -208 662 953 -2169 -4100 -6569 -5660 -52 -1256 -5237 -4282 -1719 609
2871 609 2043 1339 -558 -1396 -2025 90 760 107 -277 -1074 -1092 1682 3072 995 -3011 -1083 2411
2854 2411 3074 3946 1842 1264 -938 1038 1388 923 -2071 -1588 -2366 -2944 -1013 979 298 342 566 3216
2836 3216 4878 7309 5890 4681 4982 3683 2241 -340 -693 184 -569 -1283 -2445 -2736 -1889 -1308 137
$$ packed form
2953a999J828L304p3j756K92k381j894J793L03k5l270O05m09J097l611k786J915
2936g067l738j386L050P6N43J538K227J937j96q52m92m574j147J323N125M391
2920G58O09K40l284J42K282j92j134J395K100K951K104l616m860n51J206L732
2904C882j379k246M50m84k6k017j686J394K084j926k820k305J850J271j071L024
2888b005K868m44J58j20o65Q70K91l122j931k469R09N608j204l981R55K563K328
2871F09J434p04j897q38o29K115O70o53l84p97j8K774J390k077m006J928L494
2854B411O63Q72k104n78k202J976L50m65k994M83p78n78J931J992o81M4K24K650
2836C216J662K431j419j209L01j299j442k581l53Q77p53p14j162k91Q47N81J445
$$ plain form
2819 137 1892 -1042 -1046 -2532 -2540 -1138 1463 1564 -1687 -5652 -6261 -6548 -3660 -1377 2033 503 -2548
2802 -2548 -3875 -1692 -4756 -4694 -3123 -1269 -1484 -3661 -4294 -3620 -2200 2744 3995 6229 4178 310
2786 310 2311 3484 4320 4893 2805 409 -258 -1897 -3248 -3914 -3909 -1191 22 -1111 -1205 -1012 1582 647
2768 647 -2808 -1620 -294 -2276 -3857 -5556 -4218 -1269 13 -1264 829 2226 -2042 -5107 -1574
2753 -1574 -3504 -3910 -865 -1215 -2927 -2387 -616 2448 2407 -877 -820 1717 3174 -414 947 2254 -1534
2736 -1534 -1505 286 2360 3384 5061 1759 -1603 -2522 -1684 -383 591 -540 -906 1940 617 -2939
2720 -2939 -1214 1837 27 1530 2138 597 1447 2679 4141 3962 2691 2460 3457 5858 7907 2329
2704 2329 2338 2437 1385 2714 2966 719 -1714 -2317 -2220 -2875 -1274 901 499 -704 750 1352 1923 3021
$$ packed form
2819A37J755k934mj486qJ402K601J01l251l965o09k87K888K283L410j530l051
2802b548j327K183l064O2J571J854k15k177o33O74J420M944J251K234k051l868
2786C10K001J173Q36N73k088k396o67j639j351o66NK718J213j133r4J93K594r35
2768F47l455J188J326j982j581j699J338K949J282j277K093J397m268l065L533
2753a574j930m06L045l50j712N40J771L064m1l284N7K537J457l588J361J307l788
2736a534K9J791K074J024J677l302l362r19Q38J301R74j131l66K846j323l556
2720b939J725L051j810J503O08j541Q50J232J462j79j271k31R97K401K049n578
2704B329RR9j052J329K52k247k433o03R7o55J601K175m02j203J454O02N71J098
$$ plain form
2686 3021 2312 426 1751 926 954 258 1930 956 223 1291 886 1863 755 -1226 -2645 -2806 -401
2669 -401 1812 653 -4072 -5526 -2899 2444 2779 3928 2091 3970 3279 2033 5492 5474 3073 4489
2653 4489 4107 5618 5143 5235 3335 2425 2718 3901 4683 5250 4888 5640 5663 4375 1529 2251 4235 5549
2635 5549 5066 3714 3232 1785 -1513 -541 706 2670 7568 9178 7632 3481 1403 2717 4745 4856
2619 4856 3801 5131 5391 1630 1712 3012 1723 1348 -1543 1256 5373 5244 4832 4854 4997 1449 -361
2602 -361 1010 2417 2961 3103 2467 1121 1293 2057 -1370 -3745 -4313 -3583 -2782 -642 -564 -1287 -387 -2222
2584 -2222 -4100 -435 1023 1194 -847 -3788 -812 1508 -2181 -5378 -7462 -10286 -6773 -4235 -2785
2569 -2785 -1309 -2664 -3822 -5451 -2305 2716 4019 4551 6694 7599 3752 1493 512 -77 2000 3520
$$ packed form
2686C021p09j886J325q25K8o96J672r74p33J068m05R77j108j981j419j61K405
2669d01K213j159m725j454K627N343L35J149j837J879o91j246L459j8k401J416
2653D489l82J511m75R2j900r10K93J183P82N67l62P52K3j288k846P22J984J314
2635E549m83j352m82j447l298R72J247J964M898J610j546m151k078J314K028J11
2619D856j055J330K60l761Q2J300j289l75k891K799M117j29m12K2J43l548j810
2602c61J371J407N44J42o36j346J72P64l427k375n68P30Q01K140P8p23R00j835
2584b222j878L665J458J71k041k941K976K320l689l197k084k824L513K538J450
2569b785J476j355j158j629L146N021J303N32K143R05l847k259r81n89K077J520
$$ plain form
2553 3520 4440 4752 3335 616 42 4552 1846 1368 2329 4529 6009 3878 3852 5899 6323 6054 5951
2536 5951 4115 1024 133 -546 -3069 -2005 -2228 -6944 -6127 -1859 725 378 -2087 -4462 -5146 -5555 -5898
2519 -5898 -5460 -2903 -1946 -1585 -916 -723 -2211 -2265 -2205 -1486 -59 -1199 -2746 -1889 -2857 -4237 -5211 -5313
2501 -5313 -8257 -5371 -4633 -3603 -3986 -3603 -1425 -416 888 4908 1936 1294 3657 3460 2445 -196
2485 -196 -1814 664 -165 -2222 -4665 -4492 -3190 1046 2368 2930 1094 -2904 -3999 -1856 403 -1107
2469 -1107 -757 572 173 -3863 -5663 -3107 -1513 -2501 -4255 -417 3509 6111 5064 5393 5238 3197
2453 3197 2392 573 -1301 -708 -1415 -809 -1076 -2433 -3985 -1366 4464 2633 -369 -348 462 1012 1152
2436 1152 -704 -2305 -4703 -3613 -2098 -650 -2149 -2497 -2595 -1422 -1634 375 -478 1132 4855 4014
$$ packed form
2553C520R20L12j417k719n74M510k706m78R61K200J480k131k6K047M24k69j03
2536E951j836l091q91o79k523J064k23m716Q17M268K584l47k465k375o84m09l43
2519e898M38K557R57L61O69J93j488n4O0P19J427j140j547Q57r68j380r74j02
2501e313k944K886P38J030l83L83K178J009J304M020k972o42K363j97j015k641
2485a96j618K478q29k057k443J73J302M236J322N62j836l998j095K143K259j510
2469a107L50J329l99m036j800K556J594r88j754L838L926K602j047L29j55k041
2453C197q05j819j874N93p07O06k67j357j552K619N830j831l002K1Q10N50J40
2436A152j856j601k398J090J515J448j499l48r8J173k12K009q53J610L723q41
$$ plain form
2420 4014 519 338 1966 275 -10 2006 2574 3953 2035 943 11 -3215 -1084 -722 -2728 -3147
2404 -3147 -3190 -4897 -4656 -2743 -869 2452 4515 1954 -3197 -4442 -3930 -3559 -2990 -3766 -4995 -4638 -3669
2387 -3669 -2236 -2985 -2992 -1678 -929 1204 241 -569 1255 1906 -107 193 1155 -725 -1970 -4133 -2796
2370 -2796 -4244 -5137 -4763 -2009 48 3697 2963 1849 2826 1867 34 1627 2651 3198 6183 6364 2931
2353 2931 3068 2993 5073 2449 1433 1732 3865 5388 3956 1656 625 2411 2470 2093 1306 3571 5228
2336 5228 2553 89 1793 4026 2410 2700 2334 2902 4018 4374 1110 -1009 -3124 -3490 -2425 -289
2320 -289 624 -161 2066 3853 5512 4838 276 -1316 -1063 -2669 -1841 1302 1505 1837 676 -165 304
2303 304 530 2616 4482 3124 1879 -11 513 -1333 -1663 370 -102 -208 -2342 -3618 1364 6116
$$ packed form
2420D014l495j81J628j691k85K016N68J379j918j092r32l226K131L62k006m19
2404c147m3j707K41J913J874L321K063k561n151j245N12L71N69p76j229L57R69
2387c669J433p49pJ314P49K133r63q10J824O51k013L00R62j880j245k163J337
2370b796j448q93L74K754K057L649p34j114R77r59j833J593J024N47K985J81l433
2353B931J37p5K080k624j016K99K133J523j432k300j031J786N9l77p87K265J657
2336E228k675k464J704K233j616K90l66N68J116L56l264k119k115l66J065K136
2320b89R13p85K227J787J659o74m562j592K53j606Q28L143K03L32j161q41M69
2303C04K26K086J866j358j245j890N24j846l30K033m72j06k134j276M982M752
$$ plain form
2287 6116 4728 1417 -1773 -3463 -3128 -1804 528 1846 772 1271 -23 1261 860 3522 4374 4226
2271 4226 3554 654 -2864 -3642 -1167 -577 -2703 -2685 -843 -916 -1723 -1483 2618 2721 573 956 1129 1605
2253 1605 2304 2771 2518 3411 3182 2181 2195 3398 1221 113 2632 2168 -3165 -4028 -2808 -783 -4038
2236 -4038 -5050 -997 -1106 -1612 -389 -1719 -4425 -7040 -6916 -4710 -3793 -3635 -3624 -3243 -1020 -1584 -4833
2219 -4833 -5540 -3516 -3691 -2366 1229 1075 151 -963 -2332 -2086 -1593 -1602 -2811 -1037 2326 5508 3874
2202 3874 1867 -1161 -297 1091 1666 1101 571 1376 1149 457 718 520 3002 1436 422 -3223 -7494
2185 -7494 -3212 389 4632 3858 660 -1905 -4192 -4556 -1935 -581 446 4259 6131 8368 3443
2170 3443 -1706 -4201 -3592 -3033 -3096 -3425 -3547 -4438 -1427 -741 -2902 -221 563 894 1401 262 46 775
$$ packed form
2287F116j388l311l190j690L35J324K332J318j074M99j294J284m01K662Q52j48
2271D226o72k900l518p78K475N90k126J8J842p3q07K40M101J03k148L83J73M76
2253A605O99M67k53Q93k29j001J4J203k177j108K519m64n333q63J220K025l255
2236d038j012M053j09n06J223j330k706k615J24K206R17J58J1L81K223n64l249
2219d833p07K024j75J325L595j54r24j114j369K46M93rj209J774L363L182j634
2202C874k007l028Q64J388N75n65n30Q05k27o92K61j98K482j566j014l645m271
2185g494M282L601M243p74l198k565k287l64K621J354J027L813J872K237m925
2170C443n149k495O09N59o3l29j22q91L011O86k161K681P84L31N07j139k16P29
$$ plain form
2152 775 3058 263 1354 2025 842 1648 -985 -3157 -869 -573 -1192 797 3112 71 -654 1183
2136 1183 1201 592 1282 -38 -293 2884 1304 -1576 -97 1844 5576 3391 -675 -4195 -5729 -1872
2120 -1872 137 -46 4043 4869 891 -3352 -2994 -3274 -926 1105 -2696 -4259 -3386 -3272 -4002 -2747 769
2103 769 348 -2330 -2454 -3206 -2890 1012 4247 6203 4696 3287 4722 5952 5107 1728 1674 1101 3776
2086 3776 5407 5550 3165 2908 -1582 -4404 -1782 -900 -1947 -4544 -5383 497 4244 2450 1826 1089
2070 1089 775 2400 2692 2854 2897 2760 4179 5014 7446 2627 892 -2637 -3280 -1798 -2096 -190 1275
2053 1275 820 620 -2230 -4700 -1543 1409 3019 3169 804 453 -1359 -2270 3214 5705 5326 5557 5021
2036 5021 1338 -3012 -3474 -1934 -2829 -253 1043 1976 1399 -54 -536 -1721 -2489 -2586 -3471 -117 3473
$$ packed form
2152G75K283k795J091O71j183Q06k633k172K288K96o19J989K315l041p25J837
2136A183J8o09O90j320k55L177j580k880J479J941L732k185m066l520j534L857
2120a872K009j83M089Q26l978m243L58k80K348K031l801j563Q73J14p30J255L516
2103G69m21k678j24p52L16L902L235J956j507j409J435J230q45l379n4n73K675
2086C776J631J43k385k57m490k822K622Q82j047k597q39N880L747j794o24p37
2070A089l14J625K92J62M3j37J419Q35K432m819j735l529o43J482k98J906J465
2053A275m55k00k850k470L157K952J610J50k365l51j812r11N484K491l79K31n36
2036E021l683m350m62J540q95K576J296R33n77j453m82j185p68r7q85L354L590
$$ plain form
2019 3473 2027 2024 -833 365 239 2588 6009 5622 5302 1955 -1896 -2201 -85 -2221 -3615 -366 1618
2002 1618 4242 1995 -3154 -4523 -1749 545 2225 2719 4913 7701 8486 4902 6950 5819 4307
1987 4307 3421 2534 4071 4086 3797 3747 1590 887 -18 -1933 -1788 -2015 -3133 -5212 -5742 -5264 -3304 -4489
1969 -4489 -4061 -3236 -2550 -4698 -4888 -2209 -451 -300 860 715 -1235 584 1050 -1161 -207 990 507
1952 507 656 -398 -233 2368 6490 6165 4534 1771 -269 -3378 -4994 -1498 -994 -2711 -310 1974
1936 1974 -648 -2185 -2803 -2756 -52 1292 307 2651 4368 2027 552 5191 4552 4003 3583 4712 3382
1919 3382 2214 301 2804 4047 4422 4381 1185 -1905 958 -2142 -3049 -792 1854 3360 4050 2663
1903 2663 1685 801 6 -2390 -1534 -860 -1701 -5124 -7682 -7261 -2062 -522 -270 2534 5502 5091 4074
$$ packed form
2019C473j446lk857J198j26K349L421l87l20l347l851l05K116k136j394L249J984
2002A618K624k247n149j369K774K294J680M94K194K788P85l584K048j131j512
1987D307q86q87J537J5k89n0k157p03r05j915J45k27j118k079n30M78J960j185
1969d489M28Q25O86k148j90K679J758J51J160j45j950J819M66k211R54J197m83
1952E07J49j054J65K601M122l25j631k763k040l109j616L496N04j717K401K284
1936A974k622j537o18M7K704J344r85K344J717k341j475M639o39n49m20J129j330
1919C382j168j913K503J243L75m1l196l090K863l100r07K257K646J506O90j387
1903B663r78q84p95k396Q56O74q41l423k558M21N199J540K52K804K968m11j017
$$ plain form
1886 4074 2643 1046 -833 -4077 -5708 -6158 -1117 -1988 -3796 -625 2348 1624 1433 865 3575 5639
1870 5639 2814 -415 1851 2376 864 2341 3378 2787 782 -527 -1361 -1045 -728 -379 -447 523 -1173
1853 -1173 -1969 -1793 -1163 257 -1031 -545 1878 1596 -1815 -1926 -2282 660 2211 2225 2114 -67 -362 2664
1835 2664 1575 0 32 -1780 -2561 -4023 -5845 -1229 535 1571 2590 2116 -9 -837 -4146 -3335
1819 -3335 -1252 -848 -878 -1304 -4251 -3970 -4404 -4012 -1856 811 1587 1258 -229 1443 1619 1722 2774 -142
1801 -142 -2792 -4255 -2291 -1181 -2285 -3237 -1987 -3475 -2386 -1272 -657 1442 3829 5145 4936 6502
1785 6502 7525 3976 -1637 -1936 766 3956 2396 2425 3781 2634 980 2217 834 -1025 -2046 126
1769 126 -861 -4231 -3879 -4769 -4867 -3299 -1024 -957 -2185 -2967 -2127 -2015 342 -152 -3265 -2371 1804 1138
$$ packed form
1886D074j431j597j879l244j631m50N041q71j808L171K973p24j91n68K710K064
1870E639k825l229K266N25j512J477J037n91k005j309q34L16L17L49o8R70j696
1853a173p96J76O30J420j288M86K423k82l411j11l56K942J551J4j11k181k95L026
1835B664j089j575L2j812p81j462j822M616J764J036J019m74k125q28l309Q11
1819c335K083M04l0m26k947K81m34L92K156K667P76l29j487J672J76J03J052k916
1801a42k650j463J964J110j104r52J250j488J089J114O15K099K387J316k09J566
1785F502J023l549n613k99K702L190j560K9J356j147j654J237j383j859j021K172
1769A26r87l370L52q90r8J568K275O7j228p82Q40J12K357m94l113Q94M175o66
$$ plain form
1751 1138 -182 360 3518 3105 2218 1738 -1763 -2070 -1411 -5498 -6434 -3173 -6 -1925 -1911 864 2029
1734 2029 1513 143 -469 -2437 342 1166 617 -2633 -4902 -277 2914 2146 2782 -94 179 1800 -216
1717 -216 -1309 -1012 986 3321 1911 795 287 1415 -198 -1054 -660 -1119 516 1976 2019 1214 342
1700 342 936 1042 -1007 153 -678 -1482 -5397 -6255 -235 1930 3722 3496 4451 3196 500 -2099 -2880
1683 -2880 447 1044 -797 -2352 -967 1814 -2856 -4915 -4744 -3442 -2865 -1062 3029 5016 4634 2409
1667 2409 1522 2288 3290 3198 -147 255 2579 620 1105 3316 2789 4160 1278 -2943 -4910 -4002 -1823
1650 -1823 -3627 -5387 -3965 -3686 -1437 -2429 -3968 -5328 -6745 -6769 -5986 -6310 -7181 -8424 -6200 -5230 -3512
1633 -3512 -3420 299 -132 -1252 -2899 -1750 -545 340 1654 739 -862 -4414 -1738 -3165 1297 5359
$$ packed form
1751A138j320N42L158m13q87m80l501l07O59m087r36L261L167j919J4K775J165
1734B029n16j370o12j968K779Q24n49l250k269M625L191p68O36k876K73J621k016
1717b16j093K97J998K335j410j116n08J128j613q56L94m59J635J460M3q05q72
1700C42N94J06k049J160q31q04l915q58O020K165J792k26R55j255k696k599p81
1683b880L327N97j841j555J385K781m670k059J71J302N77J803M091J987l82k225
1667B409q87P66J002r2l345M02K324j959M85K211n27J371k882m221j967R08K179
1650a823j804j760J422K79K249r92j539j360j417k4P83l24q71j243K224R70J718
1633c512R2L719m31j120j647J149J205Q85J314r15j601l552K676j427M462M062
$$ plain form
1617 5359 1309 -662 445 2284 4013 4253 2604 526 -2736 -3939 -3989 -2187 -513 -1625 -4601 -351
1601 -351 1104 300 3909 7255 7127 1235 -1085 -820 -3275 -1824 -330 -16 -1380 -2039 -829 576
1585 576 1476 535 618 1897 1977 2609 2632 -589 -2235 -1595 -1364 -660 -4358 -3853 -2178 -3224 -3488 -2639 -3155
1566 -3155 -3653 -2824 -3808 -2548 908 1551 2220 1005 -1258 393 810 3505 4272 2682 3858 1338 -692
1549 -692 975 2468 1924 -924 -648 2831 4496 3729 1823 -2329 -3570 -2710 -924 551 -636 -1626
1533 -1626 -1726 -3007 -3021 -1016 1764 2629 -236 239 1180 1496 2158 93 -423 709 3208 3791 4148 2031
1515 2031 1761 2827 2361 -879 -1017 1211 3843 2649 473 -457 -1292 -1383 -1742 -1184 -2095 -3329 -3652 -4194
1497 -4194 -2278 -1662 -1414 972 2330 1529 244 -919 -1022 -248 292 2291 958 2402 -1058 -4024
$$ packed form
1617E359m050j971J107J839J729K40j649k078l262j203n0J802J674j112k976M250
1601c51J455q04L609L346j28n892k320K65k455J451J494L14j364o59J210J405
1585E76R00r41Q3J279Q0O32K3l221j646O40K31P04l698N05J675j046k64Q49n16
1566c155m98Q29r84J260L456O43O69j215k263J651M17K695P67j590J176k520k030
1549f92J667J493n44k848K76L479J665p67j906m152j241Q60J786J475j187r90
1533a626j00j281j4K005K780Q65k865M75R41L16O62k065n16J132K499N83L57k117
1515B031k70J066m66l240j38K228K632j194k176r30q35r1l59N58r11j234l23n42
1497d194J916O16K48K386J358q01j285j163j03P74N40J999j333J444l460k966
$$ plain form
1481 -4024 537 2227 277 -1503 640 3570 5485 2597 -25 142 703 354 -183 1217 3279 5226
1465 5226 5832 2279 958 77 -53 -624 -890 -998 -15 2004 5949 7652 6043 2857 -429 -1306 1463
1448 1463 3737 1481 -1829 -6294 -6175 -1008 788 1440 2785 1249 -3490 -6557 -4966 -2163 -2498 -738
1432 -738 -960 619 1224 804 -1739 -2551 -4641 -5411 -2536 223 -839 -1048 599 1845 744 1448 -2255
1415 -2255 -2194 -1737 793 -516 177 303 2592 4625 2372 -359 -4042 -6821 -7118 -1624 761 -1948
1399 -1948 -2107 -1297 -98 -2070 -3707 -2689 -4175 -4596 -5507 -4816 -3935 -1743 487 1985 5021 959
1383 959 -1774 -4040 -1734 -503 -1333 641 -1529 108 4517 5059 1559 -1221 -1779 -2723 -3172 -3902 -1986
1366 -1986 -617 3556 8209 6746 5710 3952 2464 3141 3141 3073 2750 2883 3202 3753 2123 1922 4297 4498
$$ packed form
1481d024M561J690j950j780K143K930J915k888k622J67N61l49n37J400K062J947
1465E226O06l553j321q81j30n71k66j08R83K019L945J703j609l186l286q77K769
1448A463K274k256l310m465J19N167J796O52J345j536m739l067J591K803l35J760
1432g38k22J579O05m20k543q12k090p70K875K759j062k09J647J246j101P04l703
1415b255O1M57K530j309O93J26K289K033k253k731l683k779k97N494K385k709
1399a948j59Q10J199j972j637J018j486m21r11O91Q81K192K230J498L036m062
1383I59k733k266K306J231q30J974k170J637M409N42l500k780n58r44m49p30J916
1366a986J369M173M653j463j036j758j488O77%o8l23J33L19N51j630k01K375K01
$$ plain form
1348 4498 -376 -4220 -4448 -3868 -2699 -3504 -3318 -789 -611 -1344 113 2834 2570 2621 -1900 -1413 -985 -378
1330 -378 -240 377 3312 1554 -406 813 -443 -4416 -5340 -3095 -1162 1315 1169 433 -1307 -1347 -759
1313 -759 -360 -1367 -534 -1522 -2919 -3442 -3408 -722 495 -1886 -6013 -4642 756 3248 3711 2315 578
1296 578 -523 1753 2242 475 -1459 -5530 -6114 -7698 -4386 -796 -698 -2533 -3794 -1705 -2148 -3200
1280 -3200 -808 -398 -1561 -2446 -3498 -2137 -3681 -2764 -836 -2306 -2720 -5521 -6178 -3514 -4040 -5686
1264 -5686 -4712 -3366 -2265 -726 144 1786 3884 1145 -2459 -2870 -3950 -5636 -4891 -5572 -4310 -449
1248 -449 238 -1640 -1478 953 1635 79 -1278 -634 49 -1432 -3346 -3913 -3989 -436 462 963 2965 1974
1230 1974 -129 -1733 439 679 -445 872 -199 -671 1552 6115 5298 1637 -206 -2013 -2076 -771
$$ packed form
1348D498m874l844k28N80J169q05J86K529J78p33J457K721k64N1m521M87M28O07
1330c78J38O17K935j758j960J219j256l973r24K245J933K477j46p36j740m0N88
1313g59L99j007Q33r88j397n23L4K686J217k381m127J371N398K492M63j396j737
1296E78j101K276M89j767j934m071n84j584L312L590R8j835j261K089m43j052
1280c200K392M10j163q85j052J361j544R17J928j470m14k801o57K664n26j646
1264e686R74J346J101J539Q70J642K098k739l604m11j080j686P45o81J262L861
1248d49O87j878J62K431O82j556j357O44O83j481j914n67p6L553Q98N01K002r91
1230A974k103j604K172K40j124J317j071m72K223M563q17l661j843j807o3J305
$$ plain form
1214 -771 -132 1721 1030 1033 2259 874 174 1349 672 1544 -357 -888 -459 1072 -2375 -5050 -2375 -681
1196 -681 490 1629 722 -333 -224 -514 -1970 -471 329 -439 -974 -294 -1422 -2096 -1316 -1401 -2920 -2283
1178 -2283 -877 1287 986 2459 1068 -510 -2207 -4897 -3229 -3844 -1407 1719 819 -560 -1194 -1685
1162 -1685 -5304 -6130 -4194 -2411 -137 -66 -2485 -2483 -2134 -1008 438 1293 2065 2000 1953 999 1615 12 -1293
1143 -1293 -734 1017 2140 5601 5028 2151 -1436 -3072 -2951 -3070 -5001 -7464 -5697 -2882 870 3300
1127 3300 4996 5114 3652 3174 1486 -280 -592 10 -916 -4662 -5055 -3320 -3610 -5402 -4664 -1641 -615
1110 -615 -495 -567 -1017 -4092 -6111 -4169 -3320 -1547 -56 -726 1794 4564 2404 -252 -978 -719 293
1093 293 -1019 212 -199 -2264 -1388 -2811 -3868 -1917 -19 374 -717 -191 -475 -1021 -1241 1869 2149
$$ packed form
1214g71O39J853o91LJ226j385p00J175o77Q72j901n31M29J531l447k675K675J694
1196f81J171J139r07j055J09k90j456J499Q00p68n35O80j128o74P80q5j519O37
1178b283J406K164l01J473j391j578j697k690J668o15K437L126r00j379o34m91
1162a685l619q26J936J783K274P1k419KL49J126J446Q55P72o5m7r54O16j603j305
1143a293N59J751J123L461n73k877l587j636J21j19j931k463J767K815L752K430
1127C300J696J18j462m78j688j766l12O02r26l746l93J735k90j792P38L023J026
1110f15J20p2m50l075k019J942Q49J773J491o70K520K770k160k656p26K59J012
1093B93j312J231m11k065Q76j423j057J951J898L93j091N26k84n46k20L110K80
$$ plain form
1076 2149 -358 -1973 651 2185 2866 3777 1592 -2211 -2505 -5108 -8391 -5860 -3192 -2207 -114 2172
1060 2172 850 -829 937 2161 1613 14 -1971 -49 623 2899 4368 119 -245 1575 2482 3144
1044 3144 197 -3346 -3795 -4386 -4910 -4502 -5825 -6939 -7922 -4055 -2330 -1725 -435 671 3410 4630
1028 4630 3193 2469 1077 1057 1331 1271 1263 1591 -549 497 574 -554 -3694 -2457 -3191 -4680 -6935 -7910
1010 -7910 -5595 -4484 -4316 -2336 -1320 -559 1579 285 86 -5 2231 93 -541 -523 -5389 -6105 -6680
993 -6680 -6815 -6562 -4327 -4469 -2956 -715 -245 -1201 -428 901 1557 1147 -960 -1859 -2906 -1643 -2520 -4275
975 -4275 -4047 -1526 1335 2405 3906 1866 -2577 -2689 -3331 -79 -96 2572 1203 -3926 -5541 -1834
959 -1834 -466 -877 -1915 -78 1714 25 1012 280 -4447 -6227 -4157 -2915 -3534 -2537 901 1682 2618
$$ packed form
1076B149k507j615K624J534O81R11k185l803k94k603l283K531K668R85K093K286
1060B172j322j679J766J224n48j599j985J922O72K276J469m249l64J820R07O62
1044C144k947l543m49n91n24M08j323j114r83L867J725O05J290J106K739J220
1028D630j437p24j392k0K74o0qL28k140J046P7j128l140J237p34j489k255r75
1010g910K315J111J68J980J016P61K138j294j99r1K236k138o34J8m866p16n75
993f680j35K53K235j42J513K241M70r56P73J329O56m10k107q99j047J263q77j755
975d275K28K521K861J070J501k040m443j12o42L252j7K668j369n129j615L707
959a834J368m11j038J837J792j689R87p32m727j780K070J242o19R97L438P81R36
$$ [...]
##END NTUPLES=NMR SPECTRUM
##END=
