##TITLE=Analysis number 317926
Compound Code aw 00087
Project Code adrs
Chemist Name af chempharm
##JCAMPDX= 6.0         $$ Bruker NMR JCAMP-DX V2.0
##DATA TYPE= NMR SPECTRUM
##DATA CLASS= NTUPLES
##ORIGIN= Bruker BioSpin GmbH
##OWNER= nmr
$$ XWIN-NMR		Version 3.5
$$ Wed Mar  8 10:17:38 2006 GMT Standard Time (UT+0h)  MAYBRIDGE\nmr@NMR_250MHZ
##.OBSERVE FREQUENCY= 250.131544655141
##.OBSERVE NUCLEUS= ^1H
##.ACQUISITION MODE= SIMULTANEOUS (DQD)
##.ACQUISITION SCHEME= undefined
##.AVERAGES= 16
##.DIGITISER RES= 18
##SPECTROMETER/DATA SYSTEM= dpx250
##.PULSE SEQUENCE= zg30
##.SOLVENT NAME= CDCl3
##.SHIFT REFERENCE= (INTERNAL, CDCl3, 0, 16.522)
##AUDIT TRAIL= $$ (NUMBER, WHEN, WHO, WHERE, WHAT)
$$ ##TITLE= Audit trail, XWIN-NMR		Version 3.5
$$ ##JCAMPDX= 5.01
$$ ##ORIGIN= Bruker BioSpin GmbH
$$ ##OWNER= nmr
$$ C:\u/data/dgb/nmr/ADRS/240/pdata/1/auditp.txt
$$ ##AUDIT TRAIL=  $$ (NUMBER, WHEN, WHO, WHERE, WHAT)
(   1,<2006-03-08 10:17:18.20 +000>,<MAYBRIDGE\nmr>,<NMR_250MHZ>,
      <created by zg, POWCHK disabled, PULCHK disabled
       configuration hash MD5:
       84 BC 41 DB A1 6E 1D 46 DA 25 12 A5 C1 ED C5 3A
       data hash MD5: 64K
       28 3C 09 C9 72 8C 44 3A AD A9 30 FD 59 30 FB 85>)
(   2,<2006-03-08 10:17:30.50 +000>,<MAYBRIDGE\nmr>,<NMR_250MHZ>,
      <Start of raw data processing
       ef LB = 0.3 FT_mod = 6 PKNL = 1 SI = 32K 
       data hash MD5: 32K
       7F 90 36 6C BB 48 16 EA 12 3E 20 E7 B9 B7 A8 39>)
(   3,<2006-03-08 10:17:32.18 +000>,<MAYBRIDGE\nmr>,<NMR_250MHZ>,
      <apk 
       data hash MD5: 32K
       EC 61 4F 09 DC 0B 0D 13 6C 45 41 5B 18 FF 7D 8B>)
(   4,<2006-03-08 10:17:33.00 +000>,<MAYBRIDGE\nmr>,<NMR_250MHZ>,
      <abs ABSG = 5 
       data hash MD5: 32K
       13 BD 26 F9 FE 05 5C 10 97 C6 D5 54 22 74 17 E9>)
$$ ##END=
$$ 
$$ hash MD5
$$ 4F 22 3A A8 3B 11 42 DF 16 D8 9A ED 47 53 6F 81
##$RELAX= 
##$RELAX= 
##$RELAX= 
##$RELAX= 
##$RELAX= 
##$RELAX= 
##$RELAX= 
$$ Bruker specific parameters
$$ --------------------------
##$DU= <C:\u>
##$EXPNO= 240
##$NAME= <ADRS>
##$PROCNO= 1
##$TYPE= <nmr>
##$USER= <dgb>
##$AMP= (0..31)
100 100 100 100 100 100 100 100 100 100 100 100 100 100 100 100 100 100 
100 100 100 100 100 100 100 100 100 100 100 100 100 100 
##$AQSEQ= 0
##$AQ_mod= 3
##$AUNM= <au_zg>
##$AUTOPOS= <7 >
##$BF1= 250.13
##$BF2= 250.13
##$BF3= 250.13
##$BF4= 250.13
##$BF5= 500.13
##$BF6= 500.13
##$BF7= 500.13
##$BF8= 500.13
##$BYTORDA= 1
##$CFDGTYP= 0
##$CFRGTYP= 5
##$CHEMSTR= <none>
##$CNST= (0..31)
1 1 145 1 1 1 1 1 1 1 1 1 1 1 1 1 1 1 1 1 1 1 1 1 1 1 1 1 1 1 1 1 
##$CPDPRG= <>
##$CPDPRG1= <>
##$CPDPRG2= <>
##$CPDPRG3= <>
##$CPDPRG4= <mlev>
##$CPDPRG5= <mlev>
##$CPDPRG6= <mlev>
##$CPDPRG7= <mlev>
##$CPDPRG8= <mlev>
##$CPDPRGB= <>
##$CPDPRGT= <>
##$D= (0..31)
0 1 0 0 0 0 0 0 0 0.06 0 0 0 0 0 0 0.0002 0 0 0 0 0 0 0 0 0 0 0 0 0 0 
0 
##$DATE= 1141813037
##$DBL= (0..7)
120 120 120 120 120 120 120 120 
##$DBP= (0..7)
150 150 150 150 150 150 150 150 
##$DBP07= 0
##$DBPNAM0= <>
##$DBPNAM1= <>
##$DBPNAM2= <>
$$ [...]
##$SUBNAM7= <"">
##$SUBNAM8= <"">
##$SUBNAM9= <"">
##$SW= 20.6930455092707
##$SWIBOX= (0..15)
0 0 3 0 0 0 0 0 0 0 0 0 0 0 0 0 
##$SW_h= 5175.983436853
##$TD= 65536
##$TD0= 1
##$TE= 294.16
##$TE2= 300
##$TE3= 300
##$TEG= 300
##$TL= (0..7)
0 120 120 120 120 120 120 120 
##$TP= (0..7)
150 150 150 150 150 150 150 150 
##$TP07= 0
##$TPNAME0= <>
##$TPNAME1= <>
##$TPNAME2= <>
##$TPNAME3= <>
##$TPNAME4= <>
##$TPNAME5= <>
##$TPNAME6= <>
##$TPNAME7= <>
##$TPOAL= (0..7)
0.5 0.5 0.5 0.5 0.5 0.5 0.5 0.5 
##$TPOFFS= (0..7)
0 0 0 0 0 0 0 0 
##$TUNHIN= 0
##$TUNHOUT= 0
##$TUNXOUT= 0
##$USERA1= <user>
##$USERA2= <user>
##$USERA3= <user>
##$USERA4= <user>
##$USERA5= <user>
##$V9= 5
##$VALIST= <valist>
##$VCLIST= <CCCCCCCCCCCCCCC>
##$VD= 0
##$VDLIST= <DDDDDDDDDDDDDDD>
##$VPLIST= <PPPPPPPPPPPPPPP>
##$VTLIST= <TTTTTTTTTTTTTTT>
##$WBST= 1024
##$WBSW= 4
##$XGAIN= (0..3)
0 0 0 0 
##$XL= 0
##$YL= 0
##$YMAX_a= 520706
##$YMIN_a= -559407
##$ZGOPTNS= <>
##$ZL1= 120
##$ZL2= 120
##$ZL3= 120
##$ZL4= 120
##$ABSF1= 16.522
##$ABSF2= -4.171173
##$ABSG= 5
##$ABSL= 3
##$ALPHA= 0
##$AQORDER= 0
##$ASSFAC= 0
##$ASSFACI= 0
##$ASSFACX= 0
##$ASSWID= 0
##$AUNMP= <proc_1d>
##$AZFE= 0.1
##$AZFW= 0.1
##$BCFW= 0
##$BC_mod= 0
##$BYTORDP= 0
##$COROFFS= 0
##$CY= 12.5
##$DATMOD= 1
##$DC= 0
##$DFILT= <>
##$DTYPP= 0
##$F1P= 14.0000005364418
##$F2P= -0.99999901652339
##$FCOR= 0.5
##$FTSIZE= 32768
##$FT_mod= 6
##$GAMMA= 0
##$GB= 0
##$INTBC= 1
##$INTSCL= 1
##$ISEN= 128
##$LB= 0.3
##$LEV0= 0
##$LPBIN= 0
##$MAXI= 10000
##$MC2= 0
##$MEAN= 0
##$ME_mod= 0
##$MI= 0
##$NCOEF= 0
##$NC_proc= -2
##$NLEV= 6
##$NOISF1= 0
##$NOISF2= 0
##$NSP= 0
##$NTH_PI= 0
##$NZP= 0
##$OFFSET= 16.522
##$PC= 1
##$PHC0= 160.8096
##$PHC1= 10.45173
##$PH_mod= 1
##$PKNL= yes
##$PPARMOD= 0
##$PSCAL= 4
##$PSIGN= 0
##$REVERSE= no
##$SF= 250.13
##$SI= 32768
##$SIGF1= 0
##$SIGF2= 0
##$SINO= 400
##$SIOLD= 32768
##$SREGLST= <1H.CDCl3>
##$SSB= 0
##$STSI= 32768
##$STSR= 0
##$SW_p= 5175.98343685301
##$SYMM= 0
##$S_DEV= 0
##$TDeff= 65536
##$TDoff= 0
##$TI= <Analysis number 999999
Compound Code 99
Book Reference 9
Project Code 9>
##$TILT= no
##$TM1= 0
##$TM2= 0
##$TOPLEV= 0
##$USERP1= <user>
##$USERP2= <user>
##$USERP3= <user>
##$USERP4= <user>
##$USERP5= <user>
##$WDW= 1
##$XDIM= 32768
##$YMAX_p= 449561674
##$YMIN_p= -563032
$$ End of Bruker specific parameters
$$ ---------------------------------
##NTUPLES= NMR SPECTRUM
##VAR_NAME=  FREQUENCY,     SPECTRUM/REAL,   SPECTRUM/IMAG
##SYMBOL=    X,             R,               I
##VAR_TYPE=  INDEPENDENT,   DEPENDENT,       DEPENDENT
##VAR_FORM=  AFFN,          ASDF,            ASDF
##VAR_DIM=   32768,         32768,           32768
##UNITS=     HZ,            ARBITRARY UNITS, ARBITRARY UNITS
##FACTOR=    0.157963299565203, 1,           1
##FIRST=     4132.6476996994, 0,             0
##LAST=      -1043.33573715361, 0,           0
##MIN=       -1043.33573715361, -563032,     0
##MAX=       4132.6476996994, 449561674,     0
$$ Real data points
##PAGE= N=1
##DATA TABLE= (X++(R..R)), XYDATA
$$ [...]
24404 -8000 -10444 -6794 1223 -1542 -3584 -9229 -11236 -11572 -8960 -12863 -15073 -11237 -14274 -20230 -25503
24389 -25503 -20414 -16918 -18527 -17047 -19188 -17966 -10502 -6492 492 2384 8485 4444 -1699 -436
24375 -436 -1472 -6679 -11931 -11085 -8184 -8096 -6366 -2591 2391 3010 -3539 -9340 -6877 -8898 -15420 -15267
24359 -15267 -12249 -9860 -7198 3297 -147 -10455 -6921 -7613 -8934 -4998 -4229 -10723 -11204 -10852 -11108
24344 -11108 -7501 2132 8872 11499 5319 -451 -3191 -3810 -3804 -5662 -11621 -10529 -5379 1507 -4276
24329 -4276 -8810 -4273 1498 5936 1424 -4491 -11511 -18113 -24080 -22085 -14280 -10945 -13147 -13318 -3632
24314 -3632 803 -775 -6185 -9311 -6024 -7497 -5872 -4740 -7079 -10751 -6711 -13894 -18973 -10392 426
24299 426 273 -990 1857 -4795 1911 2638 -820 -5303 -2941 -1118 -2529 -3660 -3431 -3025 -2120 -1819
24283 -1819 -3099 -5902 -1609 -5859 -13193 -13305 -9404 -1600 921 -6137 -5834 -4937 -8084 -9235 -6588
24268 -6588 -3490 1579 -1084 -3448 -1308 1302 -3956 -5105 -2642 2485 6090 10323 7689 1655 -2125
24253 -2125 3982 10154 12711 10261 5028 -680 -10155 -8722 -5657 -9130 -11626 -9628 -10596 -10369 -4796
24238 -4796 5941 8399 8324 5896 2326 -10901 -11163 -8711 -13443 -9039 526 2422 1982 4521 1300
24223 1300 2 5836 8939 3295 3118 5329 3838 1682 -89 2284 7024 2722 -5912 -7003 -3442
24208 -3442 -4134 3340 2562 -4792 -6400 574 -3885 -4089 -6547 -5822 -6710 -9400 -4087 61 -3127 -3600
24192 -3600 3754 5900 -715 -156 -3736 -2692 2594 2743 -1927 -4048 -2321 -9081 -10696 -5676 1506
24177 1506 1787 -978 180 -2820 -8017 -6343 -6154 701 2571 6179 6863 2328 7123 12287 8334
24162 8334 3541 -2320 -2628 1711 3044 -338 -5907 -4413 2371 1120 1672 4924 1943 3253 2624
24147 2624 -657 8858 6584 179 1650 7996 5373 2136 1152 -1558 911 1427 442 -2172 -1438 1100
24131 1100 2105 2082 -1792 -5241 -8782 -3638 -3380 -10176 -15147 -11854 -9459 -7483 -2380 -356 329 -4300
24115 -4300 -12194 -11699 -13976 -7096 -7783 -11784 -7254 -6442 -8645 -8296 -10392 -7702 -9799 -6938 -6907 -5156
24099 -5156 -7228 -10094 -7612 -6361 -13466 -16097 -16427 -16365 -15675 -14252 -13670 -11769 -1829 1169 -328 -2685
24083 -2685 -648 -3715 -7222 -7065 -4470 -8816 -5863 233 -296 -4351 -6372 -2089 -3855 -4646 -5774
24068 -5774 -2250 -1891 -5867 -7269 -5297 -834 2699 6203 4394 -7388 -12043 -6731 957 2402 4333
24053 4333 -3932 -5858 -3805 -6417 -11414 -8154 -2895 661 2005 4914 7379 6089 12771 17408 18708
24038 18708 16994 6643 313 2388 -530 -1202 -2962 465 -2472 -3670 -366 -727 1004 4130 3486
24023 3486 -1739 -4926 -3809 -6479 -8533 -7246 -11904 -16925 -23467 -16609 -3198 -1076 -5747 -7443
24009 -7443 -6521 -9227 -9874 -2000 -1545 -7935 -7463 -1890 -1087 -1675 -3259 -7877 -9667 -13053 -11504 -10993
23993 -10993 -3838 -402 -2333 -2865 3085 -3015 -9906 -14706 -14323 -10465 -8927 -13349 -13401 -5745 -2884
23978 -2884 800 -2213 -781 3315 1311 1218 -3172 -6965 -14549 -13560 -9581 -6886 -12647 -6381 -4628
23963 -4628 3540 8120 5421 -1937 -2229 237 3351 2435 3324 -202 -7196 -11609 -6467 -2450 -1855 -7979
23947 -7979 -10958 -10751 -12204 -12838 -18706 -13909 -11524 -9651 -8093 -2150 32 -8047 -9865 -8624 -3165
23932 -3165 2547 -1157 -4394 -3115 2374 -4245 -7169 -7462 6188 10989 7116 -4736 -10361 -4191
23918 -4191 1084 1556 421 -566 -3862 -3758 -5710 -6735 -3756 4054 2568 8777 11910 11759 9507 3799
23902 3799 5225 8694 6757 11817 12057 8237 7994 8568 7395 3222 6175 10064 9237 13467 10181 9073
23886 9073 11301 5856 -567 -981 -1956 1907 688 1670 -63 -2471 7004 8074 6140 4737 4285 3353
23870 3353 4149 155 -1804 -7662 -1501 2978 -2870 -3820 2867 -421 -2125 -4862 176 1283 274
23855 274 851 2853 3992 4764 2643 -4807 -644 3581 7552 1851 3296 2551 -1814 1264 1085 -1061
23839 -1061 -4686 -1644 -1046 -3360 -1921 -7746 -6403 -162 4486 5135 3320 735 1113 -4278 -4578 1242
23823 1242 2202 4704 2514 -6106 627 -1047 -1283 4375 2155 6111 10089 3815 -2157 -4112 4467
23808 4467 5585 5023 9730 11604 14954 17613 8642 -3198 -3183 1433 1498 -2843 -5712 -5150 -8333 -6042
23792 -6042 2825 3309 -2243 -664 6856 3638 -880 -6741 -6899 -6222 -4394 1460 5323 3331 1120
23777 1120 -1185 -4898 -3870 -2217 -1092 1794 6184 7294 6648 -255 -1474 -1986 5525 7252 -1453
23762 -1453 105 3375 595 -3415 -1682 1934 4492 -523 -3010 1894 3284 -824 -11184 -5826
23748 -5826 1748 6872 3175 -1656 -5539 -6738 -3070 -306 -2291 -116 2954 3507 3770 -1540 -4075
23733 -4075 -2075 410 -7416 -15689 -17341 -16934 -14048 -12342 -14972 -13528 -8083 -4693 -2820 -2372 4663
23718 4663 6743 3095 5136 7818 11653 9069 -1114 -2444 161 -1043 994 1000 653 3274 -382
23703 -382 -9639 -8747 -7016 -6707 -6426 -4584 -4583 -4899 -2796 2185 -3602 -6599 -10020 1957 6935 6981 5084
23686 5084 8525 6892 -788 -5056 3087 3088 -6329 -7131 -9750 -12429 -11295 -2399 7175 7952 942 -3367
23670 -3367 1343 5385 2226 -1029 -3232 -3844 -7615 -4107 5359 4474 -1195 -4990 212 2961 1111
23655 1111 4602 8776 9128 5707 6237 6738 -1274 -1773 1562 3949 7639 5327 2144 -2334 -2838 2390
23639 2390 -667 -5089 -4122 -75 6180 10276 10393 7767 7350 11635 7359 3142 6756 6679 4993 -1824
23623 -1824 254 4612 733 -1698 -4977 -2526 2224 -1889 -2967 -10332 -11812 -9241 -7454 -3304 2284
23608 2284 5756 12381 14308 16740 16095 11539 5268 2842 3342 4112 3872 5337 4439 -8564 -9949 -401
23592 -401 1158 6625 3707 4700 3001 -4350 -10760 -11503 -8563 -13145 -3017 2906 1633 -3922 -9352
23577 -9352 -7778 -5880 -5831 -1411 10001 10137 10173 5133 1135 -2303 442 154 -2562 -6580 -6782 -8108
23561 -8108 -13856 -11229 -13094 -11154 -6166 691 -4233 -7157 -1882 171 1527 -524 511 1332 1928
23546 1928 177 3147 4406 -4106 -8749 -6807 -5491 -5541 -681 -3851 -5581 -2147 710 1750 3017
23531 3017 -315 -1156 734 7835 10216 11697 9316 6199 582 5089 5281 7796 7918 483 -5427
23516 -5427 -6255 1483 3114 7265 4239 7757 5236 -4522 -8113 -6034 1130 3497 5285 510 -4707
23501 -4707 -6794 -3291 -4756 -3921 -3954 -1090 135 2660 -400 -1062 -1870 -1175 3409 3120 2862 -350 -2367
23484 -2367 -2578 -3176 -4141 2298 -2030 -2900 2188 1578 -2260 1662 4860 1697 3747 2970 -4459 -5384
23468 -5384 -4114 1434 3070 567 3152 6617 1405 -1080 -3272 -1300 -679 7922 10480 6058 2085
23453 2085 5552 6579 7247 6535 7023 7000 6910 7433 5995 2872 -2225 -6614 -7731 -6801 -4349 -9112 -6204
23436 -6204 2863 878 217 -3695 -1798 -3989 -3440 -6456 -9072 -7110 -11231 -7487 -5095 -10729 -18702
23421 -18702 -14881 -4042 -2683 -1530 -3816 -3037 -660 -541 -4090 -9090 -2548 1651 -7639 -3576 5966
23406 5966 7622 2394 -4859 -4082 2775 9305 9403 5082 197 781 6949 6718 2518 189 -7546 -4682
23390 -4682 1869 7014 6742 8801 2540 -7416 -6804 -5510 -9985 -13349 -10682 -6176 1472 6330 2694
23375 2694 -4632 -7610 -7361 -9326 -6379 -10862 -15077 -13901 -9150 -2574 1773 -2159 -5959 -6434 -828
23360 -828 425 5399 4568 -2517 -4844 -3173 -2599 -256 -4809 -5493 -3511 -7191 -2292 787 -5881 -10083
23344 -10083 -5098 -7522 -11671 -11971 -9083 -10278 -12347 -6002 -32 -171 -4452 -2766 -1060 -3380 2935
23329 2935 5641 6888 -3403 -9952 -10099 -12745 -11122 -5880 -11170 -13575 -15947 -19194 -18367 -7352 -1576
23314 -1576 -4109 -4060 -4225 -9841 -16205 -6930 -3608 -3388 2023 3409 1106 -3775 -7490 -3373 278 -2768
23298 -2768 -10165 -7003 -3856 855 -1514 2632 3775 -625 1684 1183 2204 -78 -9446 -4810 -969
23283 -969 -5214 -7032 -11401 -9477 -9446 -12528 -13800 -14737 -10398 -10760 -4066 -1956 -689 2215 -8882 -12407
23267 -12407 -16299 -11313 136 5270 729 -59 -3237 -8270 -5238 1270 4493 -458 3887 8660
23253 8660 2186 -4276 -7987 -8777 -7747 -4727 158 -1242 -2457 -7110 -1947 432 1655 -8094 -12888
23238 -12888 -5870 345 7481 6697 5581 5262 5459 9460 3916 -1911 -5326 -874 -1693 -8068 -3294
23223 -3294 -732 -2463 1653 8100 10947 5173 3149 -6299 -7750 -8234 -7313 -11761 -18022 -10548 -712
23208 -712 647 2003 5541 7546 2624 -422 -1447 499 2925 6775 8022 8433 4158 -5302 -11101
23193 -11101 -7242 -2123 -5915 -6416 -1623 316 -3603 -3314 -4497 -8864 4088 5077 -3673 -8383 -1411
23178 -1411 1007 495 3843 2264 3124 3746 1827 2420 -3497 -4342 -2511 6458 9135 12301 6776 5799
23162 5799 2780 -4429 -1973 -1668 3727 2782 -989 -5706 -7144 4134 12470 7616 6377 3635 2549
23147 2549 2785 2398 5837 7761 3233 180 -2373 -862 2606 785 -3219 -7812 -12482 -12683 -10419
23132 -10419 -2586 8749 9815 2776 5659 2888 -6398 -7190 2849 7025 5343 1055 -6805 -5086
23118 -5086 -397 356 -601 -3324 1116 -137 190 2076 4081 2980 2716 3923 6070 18459 19495
23103 19495 5098 1175 3466 4309 -1467 -9159 -14290 -12468 -2269 328 -1742 2497 4339 867
23089 867 2179 6827 7273 5694 4517 -5070 -1948 -2345 -5566 -7824 -8841 -3752 -611 6777 10554
23074 10554 13163 10312 11386 10684 4571 -1217 -3529 -2914 1293 892 3616 4716 -218 2729 8392
23059 8392 8520 10028 8351 3732 4321 6681 10375 3024 8091 8303 -3632 -15411 -16828 -21034 -13880
23044 -13880 -9832 -10432 -7478 -8375 -3513 -4603 -7224 -9918 -3695 2172 2294 -295 -3330 757 3474
23029 3474 5838 4760 6606 -61 4116 -4035 -3956 -10 -1641 -2719 6820 414 -6069 -10255 -4247
23014 -4247 7672 1969 -2896 1011 3062 -713 -7844 -8668 -4796 -1620 -7217 -4337 1777 2680 -455
22999 -455 7873 8294 6068 6232 10380 5866 -2891 -3375 -3304 -135 2144 4173 5281 3200 843 5232
22983 5232 6244 6789 11558 6415 4714 -2183 -1305 3314 5727 12390 13515 12470 7380 9472 8209
22968 8209 3227 1563 1537 3059 3526 1869 -2010 -1877 -9622 -14728 -12539 -11583 -7575 -5198 886 -386
22952 -386 -3946 4358 10498 3620 -1300 -2281 3316 3734 2342 4271 -1362 -2968 2852 6727 4201
22937 4201 48 1806 3806 4062 2852 -2812 -4767 -1381 881 552 2881 12507 18217 16014 10181
22922 10181 9676 8083 3974 4253 3527 4740 5012 838 -4170 -7158 -4001 4877 8618 11146 12620
22907 12620 4662 -1407 369 -678 858 -4131 -4898 -940 -121 1356 3665 2822 -959 -1429 -2631
22892 -2631 -4582 -2168 3041 6262 6395 1099 2254 7058 1692 -1280 1087 1945 5122 8172 1789
22877 1789 -3066 -735 4127 -1378 -13571 -12595 -12409 -13564 -16189 -4629 2506 -2396 -7759 -4872 -1110
22862 -1110 6516 10585 5120 7126 3948 -1621 -2498 -1633 -4681 -4402 -180 -1717 -986 2615 429 -1977
22846 -1977 -329 2339 1306 3988 5138 2115 4980 2387 -2008 -31 -2282 -441 2964 -3926 -5160
22831 -5160 -7937 -9569 -4560 -6442 -3696 3552 4753 8588 5781 4651 5258 4570 2694 3191 596
22816 596 825 -174 -1752 2366 736 -7364 -12096 -8527 -7502 -10427 -12082 -7143 31 1468 -6223
22801 -6223 -2389 1131 -3506 -6338 -11941 -8834 -4021 -253 4816 9271 15500 16150 12085 9824 4867
22786 4867 5013 10778 8633 2530 -1856 5802 9567 11881 11023 2550 971 -4779 -9664 1637 5310
22771 5310 4032 4233 6823 3926 9738 6678 5712 4006 6400 4526 3672 1035 8508 137 -9138
22756 -9138 -3938 -1743 -6236 -8147 -8740 -9354 -8421 -1490 1074 2122 1319 5406 7736 6160 5411 8015
22740 8015 6846 3976 4662 6392 3251 -2276 -10760 -10907 -3767 3069 794 -5433 -2636 508 3410
22725 3410 3952 -1767 -5985 340 8531 2836 -8803 -13864 -8884 -1270 9532 11733 16873 9758
22711 9758 10306 16382 13220 4758 8033 7846 2627 2835 -1902 -1531 -6174 -6056 266 -1744 -471 4914
22695 4914 3344 -4830 -7544 -10480 243 2454 -2382 3063 1658 1044 4217 12395 19078 13420 8422
22680 8422 -1289 -562 -2415 -7590 -9195 -6414 3923 6828 10462 4103 -1281 -4475 -7071 -7018 1555
22665 1555 9494 6949 -1634 -2057 -1169 -2585 -2049 1837 3283 4459 2276 -1633 -8042 -15705 -15178 -7866
22649 -7866 87 8589 3061 -2584 -4355 -2346 -2907 -754 -1563 2941 4003 4077 3362 -2222 -8018 -7120
22633 -7120 817 8950 6156 4246 1914 -48 -498 -2901 -6892 -9318 -3175 3164 519 -2319 856
22618 856 2541 1016 -4741 -6310 -6854 -2405 -6076 -9272 -1462 4501 2621 1053 -4863 -4502 1085
22603 1085 -1827 -2305 1704 11001 13732 11027 11111 11467 12820 10645 8263 6491 4102 -628 -4686 -3679
22587 -3679 131 -1090 3167 4205 6579 9267 3219 4201 -1873 4051 13066 9663 5081 6230 8253
22572 8253 7264 8100 3050 1301 -3370 -379 4558 7317 3255 -377 -576 -5085 -2211 -6170 -14287
22557 -14287 -19132 -14612 -10556 -10508 -9689 -3534 2971 4352 6738 2819 -630 2534 5948 4582 2987
22542 2987 1308 8260 14815 15840 9748 -2537 -6492 1175 10396 8648 5791 8853 12363 12850 10749
22527 10749 7314 1527 2192 -2515 -9783 -7965 -2082 3137 13443 14304 16587 16370 6996 2128 1646
22512 1646 3047 5855 8205 5210 2425 -913 1805 5475 7311 10852 9549 5080 5182 3694 2654
22497 2654 4081 -1259 -8850 -526 108 -9380 -15474 -8333 -7476 -7301 3955 9527 4905 4395 -957
22482 -957 -4151 4172 8319 8718 10752 5802 5132 -2065 -3199 4468 3360 3596 4599 317 -5477 -6440
22466 -6440 -1964 1439 8018 12517 15552 15662 13117 9022 6233 6338 4057 2955 10790 14129 6265
22451 6265 7518 10615 1953 -9787 -7292 909 107 1987 4152 1891 2780 5005 5738 -849 -3575
22436 -3575 -756 -3160 -7368 -8353 1359 396 -6668 -6486 -2387 3484 89 -6853 -10311 -6534 -1332
22421 -1332 948 1551 4958 4547 7218 5967 2367 3732 -38 -654 -734 2118 2340 4355 2142 -5452
22405 -5452 -3683 -5359 -12889 -9001 -1522 3613 3197 636 -3408 -5228 -132 4346 11674 8593 4852
22390 4852 3403 7809 8921 2714 988 3854 6493 2551 2890 1731 4397 5553 10725 3019 -924
22375 -924 5597 10973 13098 14013 12593 10268 11227 14372 8804 3428 -980 -7297 1945 12163 12806
22360 12806 13419 8286 9814 8921 10497 10754 7782 8373 6525 7301 -512 -1444 -160 -3922 -846 -4365
22344 -4365 -7540 -6643 -4126 -5161 -5833 -3680 162 795 2639 4441 3345 615 -6003 -7093 -5337
22329 -5337 -8331 -13155 -6942 -4750 -2358 4346 10760 9021 8589 4925 1785 -1999 -2983 243 5328
22314 5328 11459 10621 13215 8382 -1221 -5003 -3306 -4429 -1417 3829 1828 620 753 7875 15365
22299 15365 14746 11195 10640 5020 -189 -1981 -4983 -3012 1035 10871 14431 2257 -969 4435 10631
22284 10631 7864 -1273 -1937 2112 5834 2814 1417 -3199 -1916 5408 14692 10090 4316 718 344
22269 344 3903 4754 3852 5696 4005 6960 8881 8154 9517 4696 -2585 1754 6213 2435 -2006 5463
22253 5463 -827 986 3379 3249 8063 7354 6540 4956 -7044 -10712 -870 112 -406 3473 96 808
22237 808 5548 10203 10478 9010 4482 8552 4312 -4606 5679 6931 7177 9092 1317 5880 8289
22222 8289 602 -2936 -6623 -16332 -14555 -9920 -11803 -9483 -5704 -2034 -4192 -13996 -13492 -8914 -4004
22207 -4004 899 3185 3253 7002 4249 4825 -4207 -6753 -2647 1944 1175 7372 11993 7878 1512 -2303
22191 -2303 -3506 -4834 1039 701 -3963 -2792 -6339 -471 1550 4342 4728 7712 7521 2832 4695
22176 4695 14708 14427 10733 8427 9465 8291 8686 4236 588 10618 8741 -2969 -4173 -3183 -5307
22161 -5307 -11658 -16067 -11086 -6416 -3565 4076 3503 2869 850 5735 6531 995 1131 5728 1491 -10416
22145 -10416 -7127 -3717 2417 69 -694 3524 3097 -2457 2286 17181 20531 17050 6743 2159
22131 2159 -1685 -7757 -11465 -5935 -9003 -7820 924 1506 1182 -3103 -1730 5670 4837 -348 -3525
22116 -3525 -2964 -2891 -2974 -2955 -555 -567 2869 6466 -1237 -9800 -12815 -16914 -12530 -7013 -2628 -6358 -7880
22099 -7880 841 11047 13747 16121 10755 2545 1021 2794 2865 6304 1144 -2897 -3716 -1403 2479
22084 2479 1348 4138 5330 -3455 -4085 -6801 -4115 7918 12958 10288 3869 1888 1375 5567 9018
22069 9018 7223 4925 1815 6449 6712 14200 11740 3554 5480 10316 5022 2609 284 1357 1834
22054 1834 -1010 -4790 -3993 3819 8816 10259 10117 9424 12395 12198 7116 6255 10271 12955 10036 7767
22038 7767 6056 4781 4674 6235 2873 2016 -89 -8473 -8321 425 -6182 -6934 -542 10900 6786
22023 6786 6363 7495 7923 9552 10117 14819 11384 6818 4193 4022 4273 2543 -2533 -2999 1060 2140
22007 2140 174 2824 -6063 -6171 -8824 -8529 -3745 8280 7769 -2026 -4907 -4602 -2733 -7927 -6024
21992 -6024 -1086 -2530 -6177 -13408 -9684 2274 5927 11249 9976 647 -4800 -3835 -5515 -4226 -1041
21977 -1041 8909 7675 5072 -60 -6843 -3097 2860 -1271 -2489 -2766 -62 -2841 -3709 -2930 3114
21962 3114 3513 5595 6565 8562 3205 3633 1043 -2833 -3943 -4339 -4775 -3926 -3072 -5560 -258 6182
21946 6182 8519 9200 12225 10669 6858 8435 4980 -400 -5154 -4183 596 10888 11277 7280 -1832
21931 -1832 -5695 -5342 -12300 -13568 -7887 671 166 930 11151 13461 8980 3726 -2122 -10623 -2766
21916 -2766 3469 10418 10887 496 -1346 -2163 3153 7907 6589 5380 3155 1718 2651 2801 -3470
21901 -3470 -4252 2787 1546 -6695 -13325 -9190 -3387 -2071 -1530 1652 4344 4884 8852 11168 8482
21886 8482 4394 6237 6762 7147 3374 6149 6616 4295 1119 3381 2636 -3168 659 1236 3168 5951
21870 5951 7952 10039 7875 7975 7507 7271 3926 9268 8782 3368 -1276 -5494 -881 7324 13901 13691
21854 13691 9157 8872 14210 11893 8782 1391 -4046 -9337 -11421 -2533 -161 -2621 -1763 636 -2713
21839 -2713 -1198 -5060 -7141 -3338 4127 10874 7850 4080 -1104 369 387 -8159 -7755 1928 5540
21824 5540 9316 8034 4843 2948 7186 7308 10322 10061 9737 4879 2873 8376 7891 5031 4638 4151
21808 4151 4970 629 6850 3260 -1637 1205 7680 12147 9792 7051 9292 8770 3671 460 627
21793 627 4834 5086 5169 2846 -755 -3173 -7881 -1751 3883 -307 -9351 -4614 -7672 -8114 646 7356
21777 7356 10740 10355 10825 8189 3983 4582 -2831 -4724 286 5391 8503 4431 -2465 -4135 -2883
21762 -2883 1267 -1148 -1114 5272 8218 6450 5202 5651 10860 9436 4588 10404 15942 15889 12844 11938
21746 11938 15709 15867 16530 12901 3401 3834 4827 3240 8194 5137 343 -10366 -11035 -6295 -5908 -892
21730 -892 6320 3388 -2043 -5563 284 2060 3575 3388 5224 5458 -1805 -7722 -1407 2052 -312
21715 -312 3229 7978 8416 5625 1815 -4267 -838 7260 18 1711 2494 11010 11672 13422 21285 21926
21699 21926 13782 6829 -2407 -1590 -3936 -2337 3368 2560 -2605 -7715 -9452 -11398 -8987 -11651 -9646
21684 -9646 -6146 -5662 -727 8068 10769 13113 8139 12049 11602 14971 15604 9235 7280 7128 8186 6239
21668 6239 5079 7547 10237 6782 4955 7891 4548 935 5569 12854 12720 10410 4515 2908 2455
21653 2455 6200 8258 9903 7246 10185 15273 11915 9370 11000 7467 4883 10725 12160 13213 15260
21638 15260 7145 1749 1548 -4605 -3413 1670 9490 10797 5436 -961 -5444 -4229 -2812 -3310 2001
21623 2001 2497 2757 3957 9282 6263 5177 5087 11343 12259 8958 10088 10486 10563 12095 4500 -4870 -7443
21606 -7443 -4058 2732 6659 3521 2047 6590 8448 12776 11255 9024 9774 10016 3252 -1158 1500
21591 1500 5361 5784 5998 5555 130 -115 3461 873 -3388 -1115 -6315 -2737 3712 2632 -1431 5284
21575 5284 7410 5082 5268 3568 2224 6417 8025 5603 5694 1303 -3499 -2529 3139 4863 3754 6081
21559 6081 7724 6425 8699 12571 7893 3791 1250 -4301 -7122 -8523 -10654 -13307 -9135 -6803 -4788
21544 -4788 -4969 -1611 3038 10617 17481 15943 10293 12351 14820 9125 7712 14622 23396 17886 9608
21529 9608 6063 4048 1028 2523 6689 4339 3983 3767 8237 8042 877 -1920 1831 3706 3882 2193
21513 2193 -2967 -3702 -5767 -4660 -865 5221 7276 4912 6502 8540 7978 -1961 -2228 10858 16666
21498 16666 16103 13810 14458 18326 21429 16112 16866 19805 22146 13011 6786 6675 191 3382 11965
21483 11965 9744 8121 7731 4856 8629 13890 11543 11447 7144 4887 1482 6415 17096 19876 15613
21468 15613 15838 10811 11184 9293 6994 10697 14681 18453 21417 19084 16445 10928 7437 -231 -2670
21453 -2670 -10004 -10911 -2242 -2143 541 5878 9786 8666 4201 -1382 -3732 -2937 -3362 -592 3968 9505
21437 9505 12789 15623 9742 4292 8405 7123 7477 8015 13724 20729 17860 9905 6196 2512 7787
21422 7787 9234 11720 12611 8970 6811 11812 9498 1936 -739 2464 1810 -702 376 -203 3746
21407 3746 451 -963 3347 9654 18374 16236 12895 13771 16909 26223 23893 10677 5548 6064 4323
21392 4323 11164 14563 16976 14598 7798 10781 17585 16358 8988 -234 -809 -3746 -5041 -4668 -2983
21377 -2983 3628 2245 -546 -1934 4310 9090 3834 3827 7875 10161 10188 7599 4400 6788 11440 4884
21361 4884 -7072 -2097 8048 10057 1149 -436 -2721 732 6750 10328 15691 11291 5566 10381
21347 10381 13105 11891 5585 8769 8639 3182 1770 -3271 -2198 346 6310 9540 10820 3777 -938
21332 -938 3513 11764 10290 8914 9375 11063 1899 -2260 -41 -4865 83 926 1560 4242 -937 4110
21316 4110 64 -7339 -3666 6760 6249 1632 6010 7400 7408 5316 13191 18640 16422 12754 9542
21301 9542 8731 18674 19501 16974 16523 14731 13899 16317 19661 17966 11826 10410 9492 7673 12791 17732
21285 17732 9492 1236 1674 7847 10752 8028 5616 6534 9440 11856 11767 10606 9923 9903 6918 4253
21269 4253 8279 12779 12507 16094 13816 12758 15070 6832 4317 4056 6947 721 3936 11145 19889
21254 19889 20555 18532 16185 10027 10861 15578 14679 10487 5989 4583 -3647 3192 8384 9722 10687
21239 10687 6360 5975 8364 10151 3384 842 2677 2355 648 -2468 -1844 -3336 -5198 -352 1166
21224 1166 5370 4162 11869 19363 17096 15265 9599 7249 5974 10938 10832 6464 7315 11346 11155
21209 11155 6727 1157 3604 1382 6189 10342 13338 10069 6771 3383 10381 6204 7137 3745 2928
21194 2928 4714 7443 9265 15254 9530 4256 10345 11835 11008 14185 6412 -106 -65 3298 9248
21179 9248 15212 14417 14736 10125 12395 8177 3020 -2189 -2931 -653 -1424 3182 10847 12933 9084 7993
21163 7993 6694 9463 5579 8648 13211 14630 14770 8426 3589 8350 13988 12181 16105 20898 19425
21148 19425 20387 14496 10948 15106 17272 15569 16654 18770 20253 15667 16964 24314 26363 25066 16328
21133 16328 11721 7534 7126 6997 8134 14556 17862 17114 15469 14786 18108 15207 6900 -322 800
21118 800 6524 12481 17018 15931 5993 -369 277 5171 8362 4601 882 8929 15862 15659 7745
21103 7745 6376 9342 6831 8920 7354 10388 7573 5297 10755 17306 15605 22312 20752 17226 14960
21088 14960 8485 8536 8853 16945 11385 11630 15109 5514 -3619 -7167 -3654 1449 4060 14109 18614
21073 18614 13734 7150 7509 2744 3990 5207 5621 5139 8323 5921 4857 4426 624 3888 6284
21058 6284 8024 8628 10504 6720 -1412 3836 5776 5723 9969 11835 4611 3230 1216 3958 1256
21043 1256 490 -1683 1720 4143 2238 -2568 6808 12647 7574 8534 7582 11158 17336 19597 18898 11891
21027 11891 9089 14066 15993 11016 2847 5121 10013 12112 13825 9435 13262 10212 13974 21213
21013 21213 26263 22773 16209 17191 12149 10691 12451 10876 12695 20042 15748 1514 3458 6304
20999 6304 10754 12865 9719 12764 11560 18237 20363 13361 1955 -1650 -2694 4335 14269 12923
20985 12923 17310 18075 15907 12747 12927 11672 7333 14270 16792 15051 14220 15436 16792 18728 20466
20970 20466 17375 14124 11744 8896 9851 13489 11783 14729 16507 18472 17024 17332 12790 9443 11450
20955 11450 9408 3409 415 1601 -149 3153 7565 8292 -2494 3126 10697 11718 8897 5284
20941 5284 9081 13407 14189 16483 16558 9948 8491 7375 9404 9415 9501 8843 5954 5723 15086 17912 10111
20924 10111 13671 14233 11439 10011 6251 3420 3850 9865 9887 14833 11041 5354 8971 11324 5951
20909 5951 6171 14812 16412 14191 15167 14058 10445 10998 9695 15903 16239 7722 9288 4774 7847 8190
20893 8190 13477 20235 21437 19574 18359 11600 6920 8168 14995 13905 14413 21097 23850 19333 16811
20878 16811 13942 14343 14733 17215 11189 14025 17612 12330 11225 12149 8995 -424 -6193 -4410 -563
20863 -563 3467 6146 12120 23390 20358 8594 2850 -3616 -78 10743 16748 9904 9024 14262
20849 14262 9301 8196 10336 9900 17238 17330 11381 12298 11854 10702 4924 6799 9672 17551 22445 21094
20833 21094 21446 17907 15450 15240 19146 12456 9593 11882 9010 13391 7669 2220 5074 6812 7498
20818 7498 6835 10920 12017 13123 12136 13000 15036 16414 23226 22665 20251 13680 10315 5990 9659 9415
20802 9415 11119 11481 12584 12394 12866 13591 13172 7237 9687 10527 12381 15622 24309 23404 22601 18401 16023
20785 16023 12751 9125 14683 20006 19749 14456 10834 14029 18736 23525 21339 12043 6638 5077 10534
20770 10534 20164 17322 13225 17435 18465 19584 20977 17717 20226 21841 23016 23708 22632 26837 26909
20755 26909 21821 18486 20055 12168 10742 17963 18263 18187 19667 18837 13542 11981 12991 10116 10136 15827
20739 15827 18972 18746 17357 18583 11618 10112 16378 18442 16042 11177 15681 23398 25128 22390 23490
20724 23490 21343 15891 16969 21975 22060 25428 25614 20887 18315 20054 16254 14489 10830 15948 25240
20709 25240 21764 18900 19381 18205 16469 15782 21481 19998 21727 29153 26012 26726 26871 19767 21039
20694 21039 19802 17508 15477 15301 18385 21157 18737 15286 16244 21836 29528 27473 25201 24595 22221
20679 22221 20288 10311 6589 8056 6075 18283 25109 18963 14530 13985 17760 17308 11898 16924 21258
20664 21258 24985 30705 29223 26527 27948 27729 20607 20734 26207 30988 26314 23370 17983 13171 19186
20649 19186 29961 35875 32198 24470 23144 25625 26647 24974 22113 24473 29362 30794 31644 33129
20635 33129 30514 24040 15734 12057 11492 14712 13141 14021 11770 8689 11843 10356 13865 23469 26486
20620 26486 25628 23040 26969 27308 18041 7123 6487 10525 13065 14042 13327 12193 12070 15007 17259 19107
20604 19107 19558 22160 23773 26511 22303 13911 14700 19233 25553 30050 28490 24448 20355 19667 19204
20589 19204 14823 13756 14706 12218 15550 24185 28655 37008 30295 24587 19262 18692 23885 24329 23790
20574 23790 30518 34123 26980 22087 24653 25214 24021 26334 24074 21600 23293 20529 18536 18760 14300
20559 14300 14980 13637 11731 12829 19267 21593 20740 15363 17277 23756 24743 21085 15956 12767 11440
20544 11440 19255 19530 21341 13541 16082 20223 22465 20696 19929 22639 19758 19265 25731 26864 19317
20529 19317 17691 16165 18704 14120 10373 3978 8687 24385 26368 27825 24704 24076 23611 24386 25486
20514 25486 23465 16574 18464 19362 25478 30050 31622 28446 32478 22979 15081 14112 15744 15552 19830
20499 19830 13963 14354 15609 17710 22207 32155 39836 35252 30043 37835 38685 28201 18285 11917 12975
20484 12975 14701 19960 22327 19976 18097 15948 15969 20651 23358 23652 21568 19038 13505 13899 16163
20469 16163 21991 31404 31128 26774 22802 18407 15733 17233 19098 21176 21831 26519 21478 22768 23638
20454 23638 19796 20936 22342 12887 13602 17332 18269 17242 16811 17901 22251 17229 15802 12525 4677
20439 4677 2784 6071 12080 20271 23375 23681 25133 16467 17592 23405 18074 13660 17693 17083 23129
20424 23129 27689 28882 40292 43738 37962 35164 29561 24941 22476 25377 31123 28177 27032 19483
20410 19483 20610 23109 19121 15858 22437 28865 35799 29775 20866 18527 24304 21874 19629 23203
20396 23203 30423 31757 30749 37755 39972 33328 31835 30812 28375 32747 34451 25126 22252 29252
20382 29252 36273 39018 34565 31323 22443 20118 21039 25047 28751 24249 25923 29427 32299 34049 31655
20367 31655 31737 30873 35154 35306 41583 43581 41240 34444 30001 26723 33738 39977 42685 34457 29065
20352 29065 32080 31591 33735 36037 31154 30427 29788 34252 42979 48687 45887 51713 58306 63289 66649
20337 66649 71332 70719 69110 62228 54850 51198 52662 58968 65324 72941 79862 76288 74321 74218 69143
20322 69143 69036 65206 60296 48145 37747 33766 36748 32656 33084 32021 35702 38237 40470 38433
20308 38433 32278 35867 37120 31811 27506 32692 33963 30920 30389 32046 32352 30731 28334 30356 28557
20293 28557 28198 38720 43429 37315 40400 42989 42866 40683 35121 32210 27670 24218 29273 31417 27178
20278 27178 37492 42720 50293 50756 42866 37375 40494 42734 40558 39739 32871 34036 35311 34168 30856
20263 30856 31699 37843 40281 36857 29432 26106 31289 35055 40943 41518 41917 44053 36323 33957 32433
20248 32433 33657 36813 31357 33528 35682 31637 27986 27386 35221 42923 50327 55045 48654 43151 37321
20233 37321 36950 35766 30785 29623 27540 25290 27797 33172 28540 24916 32196 37544 29881 28198 35355
20218 35355 38721 41709 41415 32016 31939 33997 22603 19478 24411 28105 27882 28938 30928 34386 41859
20203 41859 50800 30536 16310 17179 18741 25756 35937 40240 41582 37857 33052 40185 46374 41294
20189 41294 38575 40039 40211 44702 49619 47731 39935 30921 30503 38389 48987 48509 42969 39252 47187
20174 47187 53113 56785 59631 58998 53561 46556 39982 38369 41139 36972 30008 32055 41945 44180 48068
20159 48068 45159 44870 46141 49031 42105 39963 42698 41252 43661 48389 48736 47383 53836 56524 48883
20144 48883 47728 49001 48721 50835 55075 63757 65069 64241 67560 71792 76303 72949 72359 69344 64396
20129 64396 68262 69329 76092 81244 78843 79804 88951 91932 86576 88448 102148 119909 126417 140677
20115 140677 162689 188708 218109 250207 290888 342272 395877 447330 490116 531853 565694
20104 565694 597152 615538 617581 605899 584632 547667 503668 461075 403396 352419 311482 269163
20092 269163 226803 191250 160380 141618 126195 116232 104472 102699 98952 89855 85300 86448 85162
20079 85162 76110 72430 72014 67918 62091 64536 67673 65499 58193 55549 56044 56627 63643 62386 56524
20064 56524 55420 51427 47577 50205 55787 56513 48427 51630 51058 44069 49120 52644 52178 57220 67752
20049 67752 72540 59772 51362 43208 45030 50853 52818 51972 49463 50551 53494 56109 57030 61116 70266
20034 70266 68569 62608 52666 48488 48642 44186 49764 58205 55649 55911 58893 62038 62157 61617 60198
20019 60198 57208 52613 57331 61838 64672 65603 57677 59095 58948 58743 60968 59408 55353 61171 58650
20004 58650 49114 49138 58723 66015 62057 61188 62648 58619 52839 51517 51043 45832 47434 54889 60398
19989 60398 55765 54828 57889 60164 58188 61675 58736 60206 66489 65309 60015 56906 66754 66110 63170
19974 63170 59983 56832 63387 71819 77285 71654 72309 75425 70959 71116 67077 69845 75999 75648 72666
19959 72666 73535 68565 64760 70645 78834 79673 77787 75517 73188 61072 54283 55273 55733 52696 55662
19944 55662 55540 49611 49510 48580 44587 38737 35100 40972 42480 50297 56729 52121 50815 47881 48781
19929 48781 47439 48564 49566 47416 47110 44526 48424 50570 51341 53266 59493 62156 59594 59163 63741
19914 63741 68934 65534 68937 70856 68551 67497 72796 74758 75521 75791 78423 79306 80418 81646 80157
19899 80157 75836 75795 77899 77646 79452 78375 74163 73024 77120 72382 62344 65056 74206 80780 76780
19884 76780 73575 69554 65338 70805 80913 85161 82143 81112 74630 70133 70920 71636 70432 72847 74860
19869 74860 76987 71160 71765 77895 80750 83746 87714 85064 92454 88736 86092 89451 94501 99346 102368
19854 102368 99944 93367 97000 105060 104031 98549 100942 103643 107846 108276 105497 105214 101023 96467 95641
19839 95641 90445 88251 86295 78428 78866 81450 85967 88514 92202 89928 88195 94734 97919 96772 95013
19824 95013 103539 99559 89637 86889 86340 91212 94046 97218 97461 92432 88895 90796 95177 100483 99945
19809 99945 108380 110612 109167 109504 113612 107958 108930 100578 91761 86233 80710 78603 80055 80953 81587
19794 81587 76019 71526 66697 64655 62548 63557 62384 68801 71997 76643 87054 90257 94244 98356
19780 98356 100036 93357 97053 104773 105957 106140 105403 99515 98691 103127 106412 106675 107614 109882 107172 106026
19764 106026 110137 111748 121227 129505 126296 125491 131284 131589 122777 125169 123764 124090 130296 132648 131196
19749 131196 132820 126349 127097 132311 134672 139686 145302 147447 154260 158210 157604 164284 167953 174516 174396
19734 174396 180799 193174 201940 213827 212911 203522 197480 197801 199559 195551 187275 182334 175863 171525
19720 171525 166358 160817 151818 152741 155874 155266 147135 141677 148816 151394 150201 151273 155982 161914 163092
19705 163092 162337 162306 157532 156106 157412 160771 161103 162190 164497 167319 169042 172612 185923 195488 189118
19690 189118 182612 187100 192445 198221 193857 194402 192084 187137 187739 182753 187380 193032 203061 208216
19676 208216 210179 215924 229616 251909 267519 281222 293169 301351 309699 324616 328184 336603 344353
19663 344353 346496 337444 334866 338598 341286 332138 326948 321050 313718 316987 319898 324893 333253 341388
19649 341388 346372 352683 355877 360102 373639 385561 392521 402293 410081 417541 419436 419967 408386 398406
19635 398406 390931 382047 365196 346356 329875 306350 285166 265450 253001 244257 234308 232092
19623 232092 233998 246835 257158 266482 273837 271432 275179 280214 279458 274493 280360 289302 285973 283278
19609 283278 282774 273610 265209 262442 254757 242513 235127 222586 218451 216614 221870 224875 223969 229110
19595 229110 238146 236848 236497 244941 257603 271236 276830 280878 291085 296422 301558 304387 316629
19582 316629 321349 330157 343304 349594 349765 352973 363646 375713 386040 397212 407312 410591 411508
19569 411508 411152 421906 426687 427120 432598 446068 462812 478934 489589 499579 507334 515405 522890
19556 522890 525748 525965 534017 537525 538042 550208 559615 567942 576476 586356 605007 626870 650228 673343
19542 673343 696271 720186 738370 766463 793062 814381 838712 861653 881082 909708 941688
19531 941688 977525 1010884 1050266 1086169 1128397 1165899 1202970 1244844 1293903 1344322 1404029
19520 1404029 1468888 1525263 1592799 1671069 1759312 1852251 1958313 2082151 2221229 2380193
19510 2380193 2563311 2786451 3040059 3317151 3622605 3954312 4305027 4678129 5077552
19501 5077552 5506573 5957217 6460685 7025784 7681804 8479297 9487033 10806140 12599508
19492 12599508 15091029 18478076 22872139 28438823 35148903 42730660 51350487 60743416
19484 60743416 70661977 80583599 88772672 95784536 101485723 104828406 106268501 104529852
19476 104529852 100634122 95502781 88169933 79597438 70110053 60452103 51568477 43286671
19468 43286671 35830099 29368252 23912737 19527561 16139631 13578035 11654895 10173478
19460 10173478 8993726 8018314 7199545 6490294 5865207 5314472 4811324 4351609 3936708
19451 3936708 3548908 3191779 2880668 2607085 2363875 2145274 1945134 1773556 1622340
19442 1622340 1490308 1374648 1266259 1173839 1091616 1014576 938172 874186 819039 767434 712630
19431 712630 662007 618702 574505 529903 484544 440655 403202 365836 333329 303923 276868
19420 276868 251934 230074 212305 197680 180050 168420 151346 141513 140865 139839 130461 129167 127290
19407 127290 117718 105846 90978 79129 69279 65009 54585 45118 42296 33065 22606 20481 21673
19394 21673 12198 11204 16224 18109 9943 -3213 -2901 7295 15211 13394 8349 15818 19864 7472
19380 7472 340 651 -430 -865 -5289 -8167 -2111 8292 15224 19014 19634 18659 16707 18027 28131
19365 28131 33486 41701 46884 55588 64138 69817 58798 56507 58446 61915 52575 46131 34613 24756
19351 24756 14616 2880 -4758 -13134 -16718 -16542 -14605 -26197 -36357 -32277 -30473 -25091 -21423 -17472
19337 -17472 -15958 -7122 -4083 -3350 939 840 -10516 -18336 -28999 -42953 -64687 -92768 -110940 -121790
19323 -121790 -147009 -176892 -193821 -206947 -224699 -238909 -246293 -251013 -256122 -249014 -235767 -228722
19311 -228722 -222584 -209997 -198614 -182982 -177139 -180656 -186437 -178023 -173623 -171213 -169276 -174016 -171555
19298 -171555 -169072 -173508 -179332 -179788 -174057 -170569 -175500 -177296 -175785 -167860 -156648 -149921 -144572 -134184
19284 -134184 -116785 -101835 -85665 -75333 -62334 -60366 -66192 -66272 -67059 -67717 -66984 -70522 -83528 -86343
19270 -86343 -82855 -78378 -69401 -68087 -72754 -82865 -85645 -78898 -70151 -64359 -68956 -68874 -70942 -69552 -68574
19255 -68574 -67931 -70735 -74592 -61610 -56297 -55852 -60525 -64032 -66281 -62426 -55662 -58070 -67169 -68100 -66917
19240 -66917 -62929 -62491 -63780 -59372 -62403 -73485 -74318 -64157 -55229 -49045 -54906 -58377 -56285 -55464 -59802
19225 -59802 -52966 -44774 -45016 -46528 -47834 -44626 -39664 -43350 -44271 -37334 -36932 -42318 -47536 -46581 -47734
19210 -47734 -56849 -58307 -56292 -63559 -68535 -65555 -59952 -61182 -59531 -54259 -45647 -54592 -65362 -67516
19196 -67516 -66471 -62053 -57550 -49551 -47194 -50539 -47065 -42175 -49472 -53344 -51560 -43678 -36905 -32649
19182 -32649 -32903 -39668 -40090 -41439 -37923 -38945 -38994 -38797 -36697 -27592 -18831 -14051 -9244 -4172 2079 2758
19166 2758 -1263 -4553 -13151 -21940 -19252 -18951 -15649 -13335 -12443 -17846 -21937 -17558 -17400 -18962 -12403
19151 -12403 -3676 -177 -1856 -4872 -4749 -6642 1381 10420 29586 60562 106010 163927 230989
19138 230989 291261 334786 349450 331659 291532 247984 195040 150597 127101 111401 98694
19127 98694 97048 98624 101492 97693 80291 56819 35440 17755 -3567 -16916 -20689 -20749 -20061 -23578
19113 -23578 -17223 -17288 -22732 -21856 -18738 -17758 -21831 -22426 -19654 -13100 -7065 6565 20228 34611 60516
19098 60516 84848 109980 135025 149393 151947 145785 139623 132121 129870 143434 172333 219927 272822
19085 272822 331329 385429 419087 418076 386168 324018 256454 184562 127785 91868 66073 46497
19073 46497 37540 41066 44360 47035 40892 31674 16629 11751 3664 -9435 -9842 -15742 -22844 -18554
19059 -18554 -17676 -16573 -17486 -19758 -22212 -23061 -25375 -22804 -30316 -38712 -34311 -27249 -22285 -25921 -22046
19044 -22046 -21356 -29099 -32824 -26787 -27585 -28895 -22642 -23291 -33189 -32013 -31455 -31216 -31834 -29966 -29827 -31558
19028 -31558 -33567 -35772 -26731 -25531 -27076 -25469 -27106 -24733 -25374 -21839 -18381 -17503 -23562 -16832 -14044
19013 -14044 -20986 -17305 -21191 -28772 -31121 -35916 -32650 -38055 -45308 -48465 -49751 -47634 -48161 -52808 -56722
18998 -56722 -59694 -51761 -44275 -45316 -48171 -49390 -47884 -47754 -42929 -36419 -39018 -42232 -44564 -46470 -46926
18983 -46926 -44516 -43726 -40183 -34075 -33288 -36506 -38237 -34846 -31581 -32586 -37061 -39550 -35350 -39051 -31731
18968 -31731 -28051 -24357 -22935 -26552 -35779 -34876 -35753 -39074 -41395 -40538 -34836 -30917 -31305 -36121 -38815
18953 -38815 -39891 -37374 -39386 -35662 -41110 -41393 -43745 -39032 -36983 -39060 -40257 -37272 -39149 -44564 -44660
18938 -44660 -42002 -43672 -39708 -41164 -36272 -28970 -27262 -30763 -37706 -42119 -44382 -43231 -46347 -41088
18924 -41088 -34200 -40593 -45632 -46160 -42173 -38379 -37365 -39371 -36829 -34949 -34310 -35994 -34117 -30708 -27054
18909 -27054 -26120 -21164 -20881 -23121 -22125 -21887 -15680 -9342 -11322 -9327 -6379 -5680 520 5968 7607 -331
18893 -331 -7250 -4180 -1682 -7345 -10140 -17031 -20290 -17699 -16838 -19524 -17670 -13650 -13875 -14978 -12800
18878 -12800 -10942 -22168 -28331 -23914 -20584 -20080 -14979 -16230 -16641 -11805 -1545 696 3392 8682
18864 8682 8386 12571 21255 30047 42285 60313 83878 122458 161230 194239 239844 292614 348799
18851 348799 396620 447584 488687 527752 545760 553595 548256 524181 497291 473623 434303 379109
18839 379109 330968 278114 227742 177279 131918 105196 81133 66259 48296 40421 31660 24549
18827 24549 19719 15984 8484 -214 -2613 -7082 -7988 -13739 -17219 -21038 -20069 -23744 -25603 -18130 -12666
18812 -12666 -17389 -18760 -20162 -21492 -17481 -19155 -24370 -27001 -25547 -31163 -33345 -29398 -21338 -13818
18798 -13818 -26901 -26583 -21127 -21708 -23191 -23204 -22576 -31699 -37098 -37200 -28551 -16067 -16259 -18281 -20841 -26134
18782 -26134 -35342 -30314 -33876 -32089 -28138 -27191 -24132 -23960 -23461 -26399 -28448 -26685 -26236 -23468 -17856
18767 -17856 -9095 2900 8019 14532 19286 19866 18010 6966 -12134 -23894 -29855 -24487 -8981
18754 -8981 -2068 -6326 -7944 -9042 -4468 -4744 -2186 -10595 -24042 -31204 -26821 -24414 -27826 -33312 -29148
18739 -29148 -23874 -16511 -16205 -19566 -21162 -21135 -16603 -17282 -21269 -22911 -19882 -24131 -29161 -29037 -28747 -27654
18723 -27654 -27142 -25463 -25060 -30592 -35241 -31767 -21352 -7707 -13353 -15087 -18200 -25018 -22174 -22289 -15310
18708 -15310 -9749 -20105 -28446 -29349 -28714 -25134 -23011 -24915 -25307 -19635 -14933 -14120 -12327 -16303 -16825
18693 -16825 -18763 -16092 -20878 -27679 -32329 -32274 -33297 -26866 -23270 -25261 -23550 -13222 -13032 -18385 -24976
18678 -24976 -22581 -19579 -17334 -25600 -28350 -30217 -28114 -25867 -27423 -20588 -20736 -28652 -30495 -24334 -15588
18663 -15588 -13633 -6979 -5057 -13855 -20785 -29656 -30253 -27433 -33373 -27741 -23224 -23292 -26433 -23548 -22678
18648 -22678 -24354 -22186 -20644 -21399 -16936 -9703 -14559 -16149 -9827 -7785 -8042 -9082 -10583 -16120 -15862
18633 -15862 -18428 -15449 -15630 -12055 -8258 -1756 1459 1043 -3468 -4479 -3711 453 3023 1188 -835
18618 -835 449 974 -1283 -3541 -5629 -11174 -22063 -25879 -24367 -18989 -14585 -7909 -17896 -20641 -23767
18603 -23767 -28280 -26917 -23790 -24560 -16616 -9888 -18449 -22323 -28143 -31199 -23239 -17079 -15225 -17062 -22022
18588 -22022 -20776 -22925 -25049 -26633 -15741 -9370 -10757 -12767 -15415 -16334 -11321 -14655 -19094 -11507
18574 -11507 -9903 -12954 -11726 -15201 -15809 -12427 -17400 -15396 -18085 -19652 -17089 -13421 -14650 -13751 -11562
18559 -11562 -17738 -16106 -14884 -19769 -33769 -33311 -19374 -8663 -8665 -12473 -8398 -6540 -12428 -21568 -22281
18544 -22281 -19797 -23347 -17915 -8793 -1003 -2827 -10716 -15640 -14735 -16368 -20606 -15251 -5110 4121
18530 4121 8859 9788 2689 1344 2198 589 1498 6230 2696 -2598 3717 1967 7112 10265 15039
18515 15039 22151 27922 34675 39575 48213 48638 47769 52117 57101 54204 46775 49058 44164 37533 34612
18500 34612 28767 24713 30810 34883 32810 33721 28467 20224 14164 7904 5731 3264 227 1723 3941
18485 3941 3068 6187 3824 917 -598 3583 -1364 -4581 2458 4936 4058 6103 4960 5465 3465
18470 3465 2762 2231 1210 3718 2344 9212 8475 7079 8755 13440 13931 11360 11191 13902 13041 14890
18454 14890 19193 26381 28533 30272 27175 22225 23096 29600 34351 33585 23336 15347 19572 20495 16854
18439 16854 19826 9940 -2543 578 2688 3507 8851 11709 19966 28203 37641 41086 35645 32785
18425 32785 36037 42157 45125 50084 51730 55184 66869 85076 106796 132709 168387 205321 245517
18412 245517 290381 337155 387784 451352 514640 571922 617408 634515 649680 671322 688092
18401 688092 693168 680316 652990 610265 570269 544488 529942 523824 516289 506372 493741 486480
18389 486480 473590 469313 466613 465487 472546 480127 474981 469951 468787 473293 477910 482889 499963 518772
18375 518772 535794 548236 572492 600287 634212 644473 635726 624792 615935 587842 542466 489546
18363 489546 436761 391908 350935 309641 276208 252529 237543 211167 190552 183479 184981 192204
18351 192204 197625 196867 184332 163638 145342 131450 119036 119625 134747 160460 179689 167583
18339 167583 139862 116270 94687 89716 94302 105910 128856 140269 145408 140770 135073 135786 132941
18326 132941 128216 136768 154417 169217 177934 194644 210265 225782 244274 259048 278984 292281
18314 292281 279890 269970 273291 266001 244285 215532 185626 164658 138579 108177 87280 75316
18302 75316 66821 63835 63306 56945 56265 56513 48458 38535 34427 35988 32777 29141 25960 16973 15350
18287 15350 12360 9380 9813 14974 17330 11409 1788 -880 7941 9296 -313 6644 7663 4888 7442
18272 7442 8207 5769 -7448 -11618 -5884 491 1647 9787 10856 15296 19319 25961 23656 9010
18258 9010 411 -3648 -4814 1834 -3075 -3290 -8554 -13134 -16711 -22789 -22437 -18773 -17659 -18911 -18848 -17522
18242 -17522 -12607 -18186 -22014 -18267 -12333 -8221 -10609 -9918 -6867 -8599 -11060 -13710 -13577 -19453 -22487
18227 -22487 -22346 -20235 -19189 -24447 -23285 -15338 -13163 -10827 -13827 -14443 -12371 -22392 -17007 -15835 -14801
18212 -14801 -11855 -12550 -11704 -11149 -12329 -9154 -4830 -1709 -3312 -2826 -4590 -14104 -12621 -8512 -13430
18197 -13430 -16659 -19696 -19560 -13180 -4580 -6845 -10211 -4976 -2202 101 -948 1953 -96 -7433 -13085
18182 -13085 -12225 -10724 -7507 1458 6727 679 -9544 -6716 1744 -4442 -7075 -7869 2391 581
18168 581 -6004 -7139 -3164 -6837 -6877 -4120 4160 9297 7084 8899 6979 12511 18453 19140 23942 13460
18152 13460 11877 17405 24578 20527 16514 11556 17460 30117 34604 35865 36343 37545 40500 36382
18138 36382 37361 42945 47472 57342 66033 68105 67598 69475 80341 84092 91447 99593 105964 114745 131016
18123 131016 147446 168556 189164 207238 229488 259391 298561 335720 379255 434040 515777
18112 515777 637410 806552 1040540 1392180 1931423 2847801 4539070 7333904 9551716
18103 9551716 9246210 7375637 4998423 3171163 2131178 1556647 1212697 995791 847101
18094 847101 728590 619401 529616 445476 385563 333692 282084 249293 220242 201357 177276
18083 177276 151598 134201 116546 96064 87284 75404 72240 71709 68792 57943 47869 41827 36318
18070 36318 29128 28980 30222 27856 21638 15658 14018 21456 23579 21353 19226 19604 19363 18179 11813
18055 11813 3706 1028 4829 481 -6339 -11076 -9699 -3518 -2802 -4870 -6179 -10649 -12881 -11407 -14291
18040 -14291 -6433 -4102 -6020 4128 3066 -1169 -988 -6386 -9652 -15727 -14811 -11751 -6797 -7465 -1328
18025 -1328 -4137 -10430 -20802 -23736 -16393 -8062 -7161 -7194 -6585 -9562 -14659 -17820 -19660 -15382 -15880 -13149
18009 -13149 -12762 -10691 -4292 -4054 -6716 -5699 -8613 -6240 -2094 1373 245 1125 -2076 -11807 -23303
17994 -23303 -22993 -17437 -19140 -20014 -20824 -22156 -18765 -18487 -15851 -12015 -18138 -12118 -6354 -8671 -7157
17979 -7157 -4158 -8383 -5645 -11112 -19195 -22432 -20669 -15749 -12641 -14235 -19332 -16961 -16353 -17592 -15959
17964 -15959 -14088 -16619 -16288 -11560 -10562 -1618 4191 5279 6277 202 -2352 -1123 -668 553 -4501
17949 -4501 -13963 -21880 -27807 -36353 -34858 -32203 -24109 -19844 -22790 -19779 -19156 -19812 -20288 -24530 -28922
17934 -28922 -30459 -30455 -28503 -25338 -32201 -35707 -33915 -31454 -24906 -25450 -27213 -23249 -21927 -29803 -29911 -36018
17918 -36018 -39608 -42299 -38701 -40845 -38957 -28522 -26698 -31046 -27021 -22685 -21155 -26414 -18874 -16759
17904 -16759 -18087 -16303 -16417 -11310 -9108 -8437 -7288 -6234 -8337 -18550 -26123 -19754 -19734 -25378 -32388
17889 -32388 -34687 -29209 -24030 -24640 -16356 -8895 -9096 -11815 -12734 -12330 -12373 -11092 -8441 -10918 -20097 -19906
17873 -19906 -17059 -20783 -19537 -20305 -14411 -6293 -1 -1188 -5384 -3187 -1627 -1484 -4560 -6413 -8171
17858 -8171 -3393 -886 -1901 -6998 -14062 -25822 -25097 -18363 -13606 -8936 -9459 -14083 -10519 -7876 355
17843 355 7128 13210 9964 6119 7917 8284 9027 7693 7510 13391 9576 1901 -1962 -7991 -10661 -16923
17827 -16923 -22672 -21983 -18083 -14596 -17844 -26107 -26649 -17996 -15971 -16493 -21950 -12834 -7249 -11098 -21857
17812 -21857 -21358 -12955 -9649 -4458 -10561 -14167 -13567 -9674 -3993 -9336 -13285 -7719 493 2414 -789
17797 -789 -1231 -6476 -9485 -11908 -10818 -8930 -9173 -12206 -11282 -5730 4406 11136 11398 14995 14896 12604
17781 12604 4857 -7995 -12135 -9641 -12492 -13083 -18003 -21971 -19866 -13577 -8819 -8426 -16224 -16272 -9803
17766 -9803 -12817 -14599 -11788 -9593 -16832 -19252 -21620 -23615 -28103 -22421 -20884 -22737 -19325 -23429 -20267
17751 -20267 -18173 -14602 -12911 -11408 -17146 -20709 -13432 -9888 -6538 -8673 -9533 -17094 -28892 -28481 -17586
17736 -17586 -14934 -21016 -16331 -8454 -5503 -8431 -14076 -14883 -12340 -15044 -17403 -19875 -25497 -21754 -17385
17721 -17385 -10347 -5489 -12803 -19739 -15813 -14037 -11603 -2949 -1352 -2093 -9929 -16533 -10408 -6955 -7333
17706 -7333 -12616 -12057 -14536 -6343 3796 -411 -991 -6245 -6556 -3437 -3151 -7803 -12127 -11246 -7158 -4287
17690 -4287 -7010 -13695 -16216 -15039 -11172 -10835 -16379 -17038 -18567 -18607 -18585 -13451 -9800 -3954 -2489 -3020
17674 -3020 -1889 2973 -4973 -14874 -22045 -18778 -17538 -12183 -8647 -13114 -19169 -24959 -28717 -15906
17660 -15906 -7469 -11789 -10716 -6679 -5490 -4473 -6148 -5298 -2534 737 317 -7514 -7339 -6420 -4981
17645 -4981 -3763 -5273 -6219 -5275 -9888 -17371 -17174 -17621 -20649 -18137 -12820 -11637 -12220 -8272 -3398 -3889
17629 -3889 846 3103 2517 4665 4044 -5918 -10376 -4349 -5625 -10092 -8358 -7407 -6840 -5864 -11020 -13143
17613 -13143 -9061 -7474 -373 4500 5527 3569 -1214 -3127 -5138 -8389 -17945 -19127 -12935 -11483
17599 -11483 -8864 -13036 -15341 -17103 -15843 -14444 -14095 -10893 -12212 -10859 -15713 -16517 -12242 -14091 -14819
17584 -14819 -18094 -22153 -24816 -22170 -22348 -18763 -9201 -5349 465 -1713 -3637 -3183 -4951 -2204 135
17569 135 -4882 -8260 -4265 -310 -2126 -1963 -7305 -15864 -14797 -10257 -6706 -7171 -11519 -10297 -4910
17554 -4910 -5530 -8199 -13773 -11609 -6402 1113 -2993 -7847 -9712 -15964 -14041 -10816 -8820 -13890 -12693
17539 -12693 -8751 -7531 -6415 -12781 -13872 -9641 -11032 -9051 -11062 -14295 -13524 -11061 -10507 -11519 -14856
17524 -14856 -13530 -13813 -18962 -18560 -16385 -8743 -5825 -15371 -21034 -16593 -9612 -6142 -11794 -17009 -13497
17509 -13497 -14467 -20065 -20807 -19197 -15919 -8853 -4196 -3006 -7094 -11257 -11542 -9577 -12532 -12266 -9836
17494 -9836 -14752 -16031 -17879 -15600 -14005 -15751 -12422 -11791 -15421 -17429 -8936 -1077 -2236 -2330 922
17479 922 -3094 -3713 -632 3796 3668 -1909 126 -4594 -13012 -12260 -7640 -7214 -5027 -5871 -12164 -13906
17463 -13906 -10311 -15112 -17068 -18359 -20479 -16210 -13430 -13630 -7342 -6786 -8904 -10103 -8710 -12261 -11637
17448 -11637 -7889 -415 -1015 -4438 -8130 -8123 -8331 -4310 2404 13670 21152 23432 22774 24196 15075 2943
17432 2943 -1444 -1293 -1867 -11386 -5066 -5050 -4012 -2780 -1321 3571 -495 -3484 -9628 -2937 -1542 -248
17416 -248 -3483 -8182 -12630 -12042 -12412 -10971 -6925 -2156 -4214 -2189 -3286 -5488 -8044 -2184 1641
17401 1641 799 -978 -2413 5169 1223 -8233 -11480 -8645 -6098 -2038 3855 3904 -304 1657 9083
17386 9083 10628 9071 8502 4747 125 -9234 -12062 -6528 -6220 -6944 -5831 -3648 -7316 -8612 -5467
17371 -5467 2868 -324 -4920 -5842 -9126 -6961 -4771 -2353 759 2918 6938 3058 -4739 468 -924
17356 -924 -8828 597 611 -6674 -9815 -10447 -11216 -5758 -5382 -8736 -15996 -18757 -9902 715 -885 -1608
17340 -1608 -6491 -8575 -22 8515 3181 -379 2143 -1267 -2669 -2457 -3856 -6341 4896 24775
17326 24775 31343 39995 52744 57318 48569 39545 31326 15292 7822 2948 -1956 -4231 -6690 -10068
17312 -10068 -6815 -305 -8263 -9925 -7375 -15404 -21388 -14689 -11693 -11623 -6453 -464 3788 -1560 -7201
17297 -7201 -7711 -998 -4324 -4758 -3423 -5794 -5608 -681 1248 -2783 -6853 -10549 -13650 -8701 -11246
17282 -11246 -13709 -15100 -21021 -23421 -11042 -3540 -5486 -11704 -13413 -11154 -9002 -11602 -14318 -12844
17268 -12844 -10699 -10739 -6326 -6933 -14493 -10227 -13491 -17946 -9271 960 5656 5876 376 -3909 -8932
17253 -8932 -12089 -13445 -5019 3505 12173 -121 -7072 -3343 -4912 -13631 -20729 -18726 -16822 -14572
17239 -14572 -18215 -11513 -13282 -16156 -18547 -16853 -11851 -10044 -13726 -15367 -14081 -16528 -14137 -12080
17225 -12080 -15889 -16526 -15209 -13207 -9526 -8929 -13348 -12119 -2875 -164 -2441 -2525 -6968 -7921 -10885 -13745
17209 -13745 -19873 -21763 -17381 -8151 -1619 627 -1971 -8580 -15294 -16257 -10311 -6684 -7747 -7645 -12759
17194 -12759 -12237 -5816 -3120 -701 -5976 -8916 -11153 -6239 -553 3471 1119 -1811 -4180 -8743 -6345
17179 -6345 -2561 293 854 -821 -6192 -10288 -1941 -3564 -6175 -11132 -14438 -4657 -365 -6892 -5350
17164 -5350 3163 3086 456 6227 9809 12258 6910 7818 13545 13504 6549 -613 489 -1361 -6064 -10934
17148 -10934 -2957 873 -2394 -10253 -15857 -22546 -17493 -14576 -5601 -1473 1646 265 -673 -3360 -10325
17133 -10325 -9454 -6645 -7978 -12493 -13378 -12791 -13021 -20831 -20817 -17314 -10405 -4861 -3117 -7368 -4667 1099
17117 1099 -428 -4330 -9526 -9229 -3710 31 -3005 -3102 -2550 -2834 -4452 -5944 -7734 -1081 3466 -4734
17101 -4734 -8786 -8876 -8896 -7626 -8658 -9463 -7985 -4288 -1318 5204 4116 -3217 -6969 -7673 -2181 3505
17085 3505 72 278 -607 -3095 -2731 -4813 -1874 -2933 5153 8829 9068 14801 17059 8016 -8 3741
17069 3741 4213 4160 5070 -3812 -5585 -5526 -6615 -6634 -390 8540 7086 5634 6325 4980 -575 -9519 -7162
17052 -7162 -9992 -9260 -4080 -2324 -320 -679 -8897 -14406 -8306 -6023 -7202 -7197 -9258 -6990 -276 4479
17036 4479 -861 1359 9291 6199 1384 -1867 -6352 -6886 -8165 -8620 -8287 -4514 -3007 -7139 -5588
17021 -5588 -7732 -5250 -1856 1489 6971 787 -7113 -15669 -19012 -18187 -19343 -14511 -17477 -11368 -253
17006 -253 2405 9866 10178 4835 -1606 -201 5185 9972 8137 5088 -3618 -7521 -7788 -8707 -1458 2940
16990 2940 6562 2079 5164 3761 -3694 2869 5172 3709 2243 -1299 -9785 -6334 -5360 -1194 -1280
16975 -1280 -2913 -3891 315 1062 511 1333 6157 8096 15242 12318 12617 12442 11063 10222 12562 16473
16959 16473 24654 25412 16811 17907 14305 17154 21937 19336 28769 41589 48679 46636 51949 77419
16945 77419 96965 123899 162564 200850 243076 283622 324527 365649 398223 410902 414763 413575
16933 413575 403051 383816 359889 340283 325075 313841 307259 315574 345735 378856 403780 418203
16921 418203 422314 416956 405119 375891 344501 307455 263795 221487 183444 153937 119696 102794
16909 102794 86747 68459 60184 61579 63443 50152 41218 35499 26807 21311 21004 18163 14136 20648
16895 20648 28987 20506 11963 16731 19412 18121 16492 9607 10282 11279 6173 453 3650 12009 11839
16880 11839 6329 1024 -4362 -2792 -2859 -8535 -9033 -449 7349 3551 3539 4029 -1597 -2766 -1773 -493
16864 -493 -5377 -12548 -14764 -10536 -5576 -4909 -5109 -4510 343 3457 -3020 -894 1051 -2206 -7447 -12433
16848 -12433 -12533 -8892 -6504 -3032 -6626 -8573 -4211 -2243 -5724 -3636 138 1227 6432 3475 -448
16833 -448 -7556 -7556 -3293 3693 11062 18652 13817 7413 11391 18479 24786 21463 12444 13901 19964 18359
16817 18359 15678 18382 19605 15543 11712 14084 17912 16432 13467 12685 10108 5267 -1826 -5354 -6196
16802 -6196 -9848 -5821 -3681 -6671 -2710 -6392 -7319 -3968 -3736 -7217 -3401 163 -2141 -4425 -4667
16787 -4667 -966 6735 8153 -1608 -7025 -11630 -13170 -11035 -3314 -1888 -5286 -6175 -6518 -5117 -1655
16772 -1655 -351 -5285 -6042 -9987 -7235 -3511 -888 -718 990 43 -6097 -4379 -1762 1446 -3373
16757 -3373 -3275 -683 5786 6846 -987 -9304 -11377 -6713 -6967 -7334 -10527 -14756 -12443 -9069 -7931 -6632
16741 -6632 -12327 -10219 1767 9926 8604 5556 2028 2230 77 271 -2577 -7187 -4539 -6003 -10373
16726 -10373 -12742 -10712 -4892 -1536 -4909 -4487 -2767 -3276 -4972 -7844 -9963 -11393 -12762 -8682 -589
16711 -589 -146 376 -472 -5683 -5053 -6836 -7564 -11066 -16638 -11506 -5933 -6285 -10240 -12105 -9791 -9768 -8693
16694 -8693 -9580 -12946 -14791 -12457 -9105 -13087 -1558 380 -2524 -1868 -996 -2064 2069 10456 7812
16679 7812 4395 3289 4478 -2529 -2168 -4612 -6782 -7917 -1166 1314 -1933 -3410 -5311 -666 1282
16664 1282 3825 6005 1896 -1800 2816 3905 54 -4980 -7728 -7787 -8871 -2416 -2891 -4057 -1983
16649 -1983 984 586 -6127 -10520 -7805 -4053 -2698 -4707 -3380 -3898 -4350 -7984 -9990 -3534 -5926
16634 -5926 -3691 3900 6919 5767 -338 6040 7910 7642 3552 5882 3762 -2289 -3195 -3347 1247
16619 1247 2352 -2088 -3436 -7856 -3698 434 -2260 -5250 431 -1839 -7281 -5645 -6288 -12454 -8514
16604 -8514 -7714 -5578 -3080 -2795 783 2734 20 -4126 -10256 -14184 -11309 -8063 -6525 -3794 -1792
16589 -1792 2293 1124 -1506 -807 -527 -4226 -5722 -8004 -12177 -8062 1494 -1080 3093 -1400 -8043
16574 -8043 -1080 8642 12027 9593 12213 10977 8829 7432 3089 -3439 -4527 -4388 -5509 -5264 -9494
16559 -9494 -5188 -7589 -13583 -10382 -5048 -1353 3915 7798 5973 3887 -2590 -3642 -7675 -9438 -13347
16544 -13347 -18746 -18697 -15223 -18546 -13226 -11503 -11150 -9076 -8902 -3910 -1403 -2907 668 -1555 -1548 2742
16528 2742 8118 5139 -5252 -4051 -3427 -6527 -10606 -14523 -8401 -586 3441 6755 8021 -15 -5484
16513 -5484 -7033 -10860 -14639 -12111 -4205 -2398 -5857 -16242 -16315 -11047 -9655 -7626 -4222 -472 -762
16498 -762 8285 2152 -1514 -4697 -10570 -4915 4541 1330 248 2570 3006 -6137 -8499 1818 10449
16483 10449 13950 11880 8281 78 -3114 -2946 -2504 614 3005 1944 2037 488 -782 -8726 -6323
16468 -6323 -2320 5751 15245 10524 1239 -9371 -9657 -4156 -338 -6721 -4473 1424 141 -3003 -2353
16453 -2353 -2542 -2151 -11087 -16424 -13445 -10024 -2508 -3132 -6636 -7489 -2467 6156 10838 9073 10234 8108
16437 8108 1332 767 162 -9368 -9807 1261 2839 5342 3138 -1183 -7351 -10121 -11513 -9686 -10086
16422 -10086 -880 2796 -6026 -1450 6307 8490 8551 9748 6124 3237 -4066 -10541 -6991 -3713 -2036
16407 -2036 4182 3880 -2301 -4043 2723 -1220 -5885 -6422 -3013 -4028 -6982 2330 5259 7585 9327
16392 9327 6263 749 -4270 -3670 -11374 -15597 -11590 -6546 -4888 -11771 -10501 -6532 1837 4379 5145
16377 5145 7678 8579 -1608 -1681 -529 -3212 -2103 -3383 -952 -3927 1723 7620 13568 13555 11396 9194
16361 9194 7924 7969 -453 -2860 -1606 1618 -4128 -7925 -7652 -2140 4772 9390 10148 6481 9679 11807
16345 11807 5764 6537 15721 18497 14142 9345 6161 2273 -320 -4537 -4410 -932 1855 6978 8355
16330 8355 6487 136 -1414 204 1912 1570 810 1684 5693 10438 4058 10069 14733 17615 13351
16315 13351 16229 13133 10686 16407 13914 9602 3841 1350 1450 -2200 6656 10027 4547 4634 5807
16300 5807 5280 7452 11974 1313 -4605 -3932 -4571 -4476 2682 14264 14746 12973 6505 3630 7162 6801
16284 6801 1795 4455 12446 13810 6784 3492 1999 6139 4626 1279 -3680 -1221 -6372 -3188 -9897
16269 -9897 -11969 -7985 -13508 -18600 -10542 -2492 49 2080 -101 -11900 -15028 -5052 885 -1155
16255 -1155 -8709 -16640 -19229 -15297 -8542 -440 5966 -64 -1756 55 -1574 -9154 -10265 -9658 -6934
16240 -6934 -3228 -5266 -2594 1216 -6528 -7966 -5896 -447 1189 -2645 -8143 -8358 -8444 -2899 7226
16225 7226 13308 6825 1206 -1691 130 4839 3698 -2047 -1212 154 -3383 -10929 -11413 -4303 -5270
16210 -5270 -2641 3903 6455 2715 6260 5907 5116 5202 706 1854 6139 2247 6075 13518 8953 -3524
16194 -3524 -8834 -1460 145 3779 167 -4033 -3973 947 2810 -450 -7612 -11153 -3882 -6283 -14359
16179 -14359 -7637 -1816 1401 1690 4166 1669 1661 2247 8482 6007 93 2873 2126 3987 6824 6886
16163 6886 7333 8343 6635 3433 3866 6623 4220 516 1253 -316 2841 9244 4248 1316 8591
16148 8591 13269 8858 2131 100 -3412 -1370 5544 3591 -986 4782 3527 8817 4810 -2082 -8252
16133 -8252 -3844 4246 1740 -549 2736 2795 -170 -1872 2417 9225 4024 -3023 -3938 1265 1018 2758
16117 2758 1421 6391 5723 2352 1548 -751 -2308 -4124 3108 1961 -2293 -4785 -5527 977 6987
16102 6987 13382 9677 3690 -500 -4992 -8623 -6196 1898 1801 107 4147 3125 5466 3432 -6911
16087 -6911 -10143 -8934 -6437 -7583 -11095 -6445 -141 -2321 5185 9737 7062 7924 11153 13406 9737
16072 9737 8745 12593 9598 7270 5453 6862 10023 9476 3710 3409 8158 7977 1605 2544 6211 4111
16056 4111 1159 441 1388 2850 1811 3281 10096 20948 21482 16446 10087 1599 -5824 -6231 -624
16041 -624 -1240 1453 2681 3869 -4324 -3563 -1287 -4709 -6109 -2870 -1605 -2823 -1130 7330 9793
16026 9793 9207 2691 3122 -384 -584 6532 8635 2362 4061 3870 3471 5069 6165 8582 3344 2214
16010 2214 8913 12411 8147 7702 4558 590 6269 7130 2353 -2850 -6613 -6532 -1262 3806 4084 7538
15994 7538 11297 10378 4722 10982 10426 4240 1882 5039 5274 4866 7764 9521 10464 10469 9554 3337 3958
15977 3958 4554 -2085 379 2289 533 -311 -1144 -4240 -14670 -8689 -2742 -928 1135 5154 5872
15962 5872 4687 10401 7775 2576 7847 12959 11386 8666 10481 6635 10717 10623 18099 19896 19009
15947 19009 20809 17390 11486 10776 13932 10563 11723 11828 12153 8664 6678 6072 3082 -2374 -2704 2811
15931 2811 8717 6406 6104 7327 8070 10353 8696 7574 12384 15295 21151 30704 43726 47890 53282
15916 53282 54545 52588 53902 48361 31430 17570 17999 18006 17051 25909 23277 11881 5043 748 452
15901 452 5656 8532 12185 11055 9069 -2836 -15024 -13762 -14104 -4714 1853 1849 2598 -747 4217 11303
15885 11303 7291 2175 10558 6371 -1213 10801 15287 10766 2674 4262 5116 4307 2253 5837 6184
15870 6184 -2301 -6207 1204 1772 -2068 1045 -1113 403 -4297 -9090 -8246 -4797 4597 1029 -1799
15855 -1799 4206 8033 13260 9791 -2070 -982 2009 2980 1710 3220 3056 5732 7816 5318 6190
15840 6190 1945 4375 8030 12926 6040 -731 3424 10600 12649 10176 15160 17164 15546 11019 4737
15825 4737 5155 5338 10319 12326 11081 12380 10239 7377 8784 5890 -1004 1126 3099 6633 4470
15810 4470 4077 1380 287 3500 -493 -10907 -8305 -4068 -3300 1311 651 761 2651 1586 -5211
15795 -5211 -5509 3991 9015 8000 3005 1209 -3783 -1271 7870 8513 4489 26 -2318 2142 4254
15780 4254 5120 1662 -1679 3462 9276 15122 16597 12186 11909 12422 12562 12003 13833 14771 5745 4534
15764 4534 7627 10049 12114 8609 7765 6528 1124 3833 6965 41 469 4150 2394 3436 2030
15749 2030 -557 1082 -1388 -4145 7311 8789 5801 3454 -2490 -10849 -5637 1412 3492 5877
15735 5877 3637 97 -3913 -6348 -5524 -3138 -59 -3480 -7608 -4268 2463 6754 8176 8620 8186
15720 8186 12670 15545 14172 14429 11873 7792 9877 10022 5987 3538 7949 -1697 -8656 -8110 345
15705 345 -1295 20 5688 8474 8203 8512 9194 11637 9996 6689 3809 2966 4287 2400 5994 8678
15689 8678 11913 9922 9402 12424 12106 12728 12747 4215 4905 7731 11325 10011 2695 -3874 -3326 1766
15673 1766 6518 7267 8534 1083 -170 -341 3913 10505 6121 4085 10634 1028 -2818 1944 8209
15658 8209 10976 9804 6920 3138 1097 -2553 -11996 -10272 -2397 -474 4232 7464 10926 12052 5616
15643 5616 7497 9741 5943 1658 3286 5441 8204 7831 4887 11448 10117 6407 12570 10565 9215
15628 9215 9311 9270 12251 16264 19350 15423 14724 19186 18042 15298 15888 12620 15530 15461 13090 17742 14748
15611 14748 8049 5598 6674 2511 6034 17031 16747 10538 7645 4074 4826 1935 828 9887 15085
15596 15085 10213 5593 9653 7835 4694 10891 10233 15244 16811 17777 11645 8863 9816 13259 11129
15581 11129 6247 4225 3292 2794 1870 4999 4802 4491 620 4363 9755 8176 7643 9018 6993 3327
15565 3327 7332 10132 6552 -423 -6391 -2396 -4909 -9029 -13455 -15137 -7189 2367 1635 3373 3256
15550 3256 7169 8486 8666 11145 11684 4023 7733 10192 8814 4171 -586 -11617 -80 12372
15536 12372 13346 12153 5630 2447 891 -533 371 665 4620 2849 -2353 -5148 -2633 187 -1810
15521 -1810 -725 7120 10654 10418 10680 10712 6585 -1267 3153 12781 11051 18965 23117 17482 11515 13166
15505 13166 18710 14782 9806 3369 1494 1340 3857 10527 10970 14675 15238 15839 17508 14324 3535
15490 3535 -6350 -9826 -10606 -13383 -5493 2378 6750 1151 -4674 -4819 1632 8900 12186 9120 13321
15475 13321 12050 12085 11512 16149 16950 12324 13654 11241 11248 10696 12674 11093 10499 12339 10856 5467 2124
15458 2124 3320 9959 14662 14013 11306 13172 12082 11231 14417 11897 13046 10852 6511 9848 14205
15443 14205 16992 17506 13279 10262 10372 12096 12283 7692 8137 5629 2339 7257 11679 15206 10870
15428 10870 10772 11735 14504 10281 13365 11141 3463 -1947 -1016 1572 -25 3184 5609 7377 1608
15413 1608 -721 3649 7240 8058 13984 17984 18274 11853 10677 10407 13077 15205 16590 16551 14345 14085
15397 14085 10814 9255 7698 9780 15268 14684 10990 12663 8923 17531 20931 10631 1848 3563
15383 3563 -738 -3452 -1455 -845 2708 6761 9212 7177 3692 2252 7262 17632 21220 19308 18670
15368 18670 13092 16552 18079 14646 9555 7278 7924 11851 10655 12407 9116 8082 7823 7825 12554 14025
15352 14025 10054 15949 16859 10320 5902 6012 8340 7593 2360 2684 6404 12334 9075 15386 19325
15337 19325 19108 16804 8829 8483 8781 11586 9921 10434 6869 5309 3506 773 1807 1799 11386 18863
15321 18863 24050 16037 12752 10533 12372 13027 8464 12158 13535 14382 17158 20304 19684 20507 21261 26410
15305 26410 25926 19189 19414 25829 24729 26232 20804 9133 6044 8814 9462 11435 17901 24761 27528
15290 27528 25519 23056 29160 29944 26667 19303 16258 21119 19521 22614 19105 11954 12504 14254 14801
15275 14801 16896 22999 24805 20866 16684 20492 22195 23703 22488 20251 15677 10251 10026 8499 5744
15260 5744 6369 8314 553 1091 2663 -1082 -1024 5446 7542 7699 11850 9087 8865 14374 19750 19327
15244 19327 11924 7380 7467 13403 10915 5569 11677 17427 21369 17003 8910 10037 10387 10464 15332 24051
15228 24051 26379 21838 14374 9947 11441 13445 18244 21894 19385 10426 8553 4711 3230 10592
15214 10592 12925 13784 8531 8542 4630 7717 9028 9279 8952 3111 -3174 4763 4281 4968 2999 3403
15198 3403 6746 11390 14775 15109 14260 18311 12107 12513 11073 6999 10608 20922 22604 19458 17350
15183 17350 9790 4097 7472 12487 7671 8995 16400 10382 10804 14883 11058 10617 16431 15187 14739
15168 14739 6917 5558 10413 15224 10647 8508 10839 15092 11204 15631 22151 25856 27873 27090 26556
15153 26556 19692 11269 10995 5199 9142 14151 19002 20118 13380 10904 10861 11155 18834 17019 16720 21427
15137 21427 22007 23660 20640 19820 15790 12080 11756 13573 17329 13008 6303 12976 20165 27277 26139
15122 26139 17286 18577 21348 23759 25938 27447 27404 25478 15136 15223 16213 7548 2637 4338 13964
15107 13964 21935 22844 20352 9097 7322 10518 11616 6874 9835 16465 19011 15595 13755 9331
15093 9331 7297 12770 17348 14390 12195 19453 20668 25717 21338 8929 9871 16871 16972 16265 19180
15078 19180 22425 19336 18085 17001 15217 7172 12129 15771 15189 15880 14493 16033 19415 23401 28010
15063 28010 30955 24583 14918 11603 14100 20510 25921 21550 17690 17931 20043 23748 23714 15564 9746
15048 9746 12554 15157 26230 31415 25127 18506 24309 25810 23286 25784 20543 26362 30839 26842
15034 26842 20507 17672 11152 3349 4420 9002 9450 13002 11731 12145 15275 14535 11597 9818 14565
15019 14565 14572 10000 3768 1957 1829 4962 9772 12400 13070 13832 14040 13700 20388 19473 19763 17938 16946
15002 16946 16996 18484 17373 21846 26030 24593 27888 28506 27645 25623 24394 20991 22097 21553 18307 21368
14986 21368 22703 23887 26331 26393 28040 26687 23563 24223 26188 23207 18106 17564 16026 17864 22917
14971 22917 21816 17545 17443 19256 24415 30178 28012 25886 22908 27122 23335 17688 22362 23436 22652
14956 22652 23767 24658 24118 21169 18742 15024 8591 2842 3255 8225 8772 15113 17776 9583 17993
14941 17993 24031 21159 23042 16835 9455 6797 13102 14809 16633 18470 16008 17563 20184 26067
14927 26067 25237 19969 17040 18809 18320 12208 15923 22618 20867 20402 21197 20571 22156 19687 17144 18987
14911 18987 26470 20884 18113 19069 24871 19496 19122 24372 22728 12869 4588 9290 17180 16669 12872
14896 12872 7394 2914 11587 18712 15661 6718 7023 12536 13693 16964 18248 16697 15320 18705 13394
14881 13394 15696 23786 20331 21503 24940 28172 23184 23805 31804 33442 26929 21357 19380 15420 17706
14866 17706 28623 33757 32340 30042 33351 33478 36373 36537 36687 23509 17642 20928 31210 32545
14852 32545 32283 28491 26379 22830 19201 19535 19195 20703 13109 11537 14192 15563 16589 21228 22638
14837 22638 19155 19185 23129 25717 24417 22797 21504 14946 15271 10200 10089 15599 19148 18358 20637 24401
14821 24401 20337 13709 16652 24860 24953 13059 3273 2194 5228 11189 6789 6361 9529 13645 16598
14806 16598 13062 14155 20027 24997 22288 22904 22862 18882 13040 9938 14995 12440 7569 5511 5116
14791 5116 6686 11766 17119 21804 27842 25815 24902 30676 29839 22721 25835 23368 20544 29356 35652
14776 35652 31007 25635 24974 22653 23810 25891 25273 20091 20489 22780 26656 23728 26005 23593 18669
14761 18669 20013 22863 25775 31287 34629 37143 33658 23477 18983 16126 17012 22663 24212 27241
14747 27241 29009 27176 26867 23238 23785 23693 19522 16358 21368 22945 20198 19709 26885 28816 28310 29649
14731 29649 24771 19781 16399 13860 16077 18208 21128 23666 28081 28969 27339 30052 30531 29842 33707
14716 33707 32177 23775 24828 26474 22653 20157 19838 23201 24144 26910 32531 31957 25240 23972 28887
14701 28887 27789 24139 24663 27712 31736 33705 33193 31264 28543 25662 27722 28497 28354 25482 23748
14686 23748 30671 33369 34357 33569 30375 31574 29564 27617 31358 29469 21353 21946 26707 22714 19037
14671 19037 16686 17589 19578 21844 22004 32665 37023 34386 28467 27134 21429 20382 23272 34182
14657 34182 38316 30702 16638 18154 28787 32295 29664 22879 27040 25422 29220 32906 34151 27904
14643 27904 26401 25095 26052 24747 28307 29388 26193 30100 35244 36558 35656 28529 24798 26057 35471
14628 35471 37584 34100 38926 41166 38619 35422 32537 28937 29544 28212 24445 28086 26808 23771 21431
14613 21431 23320 29431 30860 30570 30846 29793 29797 24650 16713 20150 29182 36788 36930 28952 37785 38951
14597 38951 35130 26540 27098 28189 26366 28498 39241 40507 40165 34160 32749 31739 33826 37120 35877
14582 35877 30678 30189 34507 28934 23274 29308 39868 43043 42482 36435 32988 31526 29495 27992 31712
14567 31712 30180 27138 25704 28323 30281 31226 29012 34646 38330 43203 42254 38507 38842 39030 30421
14552 30421 30071 35608 39760 35444 36689 46050 51033 50658 58137 61418 58866 54652 50388 42693 34737
14537 34737 37008 38912 35868 28420 27659 31365 29581 22292 18261 19728 23202 29040 32406 32327 37248
14522 37248 38147 34227 32844 38381 43759 47383 49382 50298 54219 47192 40209 36044 38801 52371 68933
14507 68933 70344 65269 62602 59516 51555 41044 41383 41707 46490 46885 37275 32611 32433 31620 23776
14492 23776 21440 29086 34893 33541 23482 22152 23919 27300 30413 31021 29037 26027 27213 34272
14478 34272 38991 38559 39553 37371 42273 54078 61860 64722 69723 66336 69250 70778 62075 58174 56299
14463 56299 53427 48500 41596 36687 33991 41150 47140 44770 39662 36707 34251 34134 31030 27705 28701
14448 28701 36436 38608 34402 32089 32327 32029 27614 22835 28355 32603 29728 33512 37184 42817 51169
14433 51169 56111 55699 53034 53195 53057 49817 47948 46073 40956 39464 35585 30556 32528 37692 44187
14418 44187 38007 30055 29249 30572 27352 27614 33045 38117 34615 30754 32087 35466 37609 44073 47606
14403 47606 44722 42456 42556 43934 42029 37713 37455 34442 38274 44850 49105 42083 35375 35642 44173
14388 44173 45738 41874 40754 34322 28893 28656 32283 30242 31075 30760 29588 33257 31048 33357 36904
14373 36904 34272 36812 41363 38353 28276 23022 30729 28621 30833 37753 44735 48142 46960 44750
14359 44750 48965 48237 43884 41161 44600 43908 37027 36567 37198 39161 36146 31469 27313 34479 34303 37732
14343 37732 43604 44146 36208 26296 26150 36023 44274 47255 53109 49755 43156 37021 38256 41576 46969
14328 46969 49601 53680 56161 62787 70359 72346 73740 70172 75352 69652 58373 55525 55973 56268 55142
14313 55142 53017 56431 53084 51364 51402 53618 62155 68339 72544 78701 81824 78303 77944 71971 58514
14298 58514 47970 42813 45583 47442 53991 58240 52057 41845 42088 48527 51879 47069 45380 45750
14284 45750 50745 52433 46418 43573 45790 48182 46304 41294 41650 46231 46355 40134 37184 43168 45575
14269 45575 49804 46542 39689 38303 41497 39930 40649 40781 43762 43743 47191 42220 41464 50144 55865 48157
14253 48157 41629 42599 42598 51920 70769 80189 75970 73711 79274 73803 64836 67283 67299 65823 66814 64881
14237 64881 65976 71846 76067 77083 77984 82230 91800 103451 120553 128268 128175 122827 107698 99455
14223 99455 100608 109143 121945 151170 178106 195738 208644 198568 171938 142663 113086 98289
14211 98289 86812 74142 66384 61332 67420 63730 60646 61981 63794 70462 72508 72771 71557 72267
14197 72267 65940 58965 54467 56569 59830 63832 61196 56397 55105 54155 65223 71908 71594 77098 76094
14182 76094 75816 84688 85719 79558 79262 77824 69166 59367 51821 45442 39871 39937 42894 46434 49808
14167 49808 49602 51168 53706 55049 59431 62844 69663 72261 70391 65279 59460 48864 48242 50932 52377
14152 52377 55943 62281 63105 59251 64656 65969 60557 55516 50073 52241 54335 63750 74487 73554 69914
14137 69914 67784 71946 77843 85056 90757 100647 99315 90399 80541 72926 76920 82568 87120 96062
14123 96062 111143 124215 128612 122135 111892 106315 97417 87420 82173 79904 83587 84247 87897 93084
14109 93084 99843 109544 113802 114185 107460 107523 96096 81722 75855 74723 70453 58682 53920 53609 55391
14094 55391 52945 59207 66042 75798 89012 103925 113991 114341 116654 118749 107222 92968 81921
14081 81921 76087 70771 68604 66188 62707 56381 53653 55032 59294 69961 67889 65695 71036 76322
14067 76322 83805 82120 78302 70809 63788 70591 69750 63171 64391 71038 79512 85883 86745 86851 94131
14052 94131 105910 107746 106389 108040 107108 109662 102757 101170 96886 84649 67705 60990 64612 68331
14038 68331 69995 67461 68875 66959 69791 66431 59982 65077 69932 69626 68320 71978 70992 72887 75109
14023 75109 78542 74206 66006 67839 74288 79833 83741 92561 105529 103877 95982 84612 79399 82493
14009 82493 80724 73541 66302 66556 68034 75248 73014 68202 68489 66900 69718 66711 68402 70935 64554
13994 64554 64050 62095 64037 64392 60568 61738 67266 64694 66008 68178 66436 62777 63679 76009 86868
13979 86868 92667 103104 111647 103645 101348 99217 95362 85533 78017 72287 76380 78709 77713 82505
13965 82505 84131 79560 75432 79434 81263 76663 68695 70567 69065 72053 72785 74353 76455 73462 67527
13950 67527 71019 77138 71590 69380 70098 70102 74369 77272 80069 87583 85012 90268 94051 91540 89430
13935 89430 82822 79428 77972 74474 76793 74941 69933 68346 66424 66551 68559 71649 68975 69951 76319
13920 76319 77833 70289 64312 68181 68456 73619 79100 86819 95548 97988 84623 80346 76503 71943
13906 71943 79130 81315 84076 87803 85191 86648 92009 91305 96967 104202 106590 109182 115271 128532
13892 128532 145669 177057 226192 296285 342400 327094 281261 223433 172531 142620 126634
13881 126634 114781 107517 100996 96192 87109 76866 79142 79672 77775 80035 85494 85220 81905 82866
13867 82866 79281 69832 66577 73780 79863 76879 69230 73608 83421 81408 80190 82031 84371 87120
13853 87120 85576 86884 92495 88467 88319 87274 82042 79825 83353 82485 83434 84018 87728 86049 87492
13838 87492 91758 86392 82261 80199 83251 93358 94462 89486 92172 92185 104210 121082 128147 139301
13824 139301 148870 162837 177249 189215 205553 221984 234244 234128 232897 227298 219822 205703 193268
13811 193268 176007 155315 139034 128171 118459 105811 93712 94387 93971 92171 95409 90539 89940
13798 89940 96351 97518 101793 98070 92792 95271 93286 87571 82714 83433 85888 92848 93974 96158 97348
13783 97348 96568 94381 90473 88640 87063 83273 78822 79626 85571 93876 95746 90958 80449 80607 84520
13768 84520 84514 77840 78048 84864 85197 86927 93628 95062 90152 93014 95645 97640 101788 105383 98010 96369
13752 96369 98414 107737 114549 106710 100148 99283 99073 100007 99420 94793 96253 94089 91545 89841 87751
13737 87751 94694 96113 87305 85650 86903 81770 75105 77199 87736 93483 92581 86343 78543 76827
13723 76827 81591 83529 78760 71989 71813 80561 82405 89370 89020 90832 94629 92469 90367 94953 103151
13708 103151 102941 102857 104440 101958 103322 103436 110138 112880 110844 116827 118231 110959 112594 107511 105957
13693 105957 115046 112582 104966 96499 95217 98262 97604 99173 104160 105354 112434 115800 116157 113505 112646
13678 112646 111705 111131 122628 124282 126431 128680 128252 125803 117743 120620 121830 119162 121332 119359 119579
13663 119579 115875 107853 101797 102048 101759 105710 110586 112581 109494 104661 103865 106621 105790 105639 106314 108755
13647 108755 109030 110592 112943 117436 109602 107090 107542 112757 113627 114452 108758 111002 111640 112717 108045
13632 108045 116704 130715 137030 133418 128409 129328 134948 135980 137929 137604 137524 141636 146494 145237 137839
13617 137839 132760 128907 131865 135158 124970 114443 113333 117003 111363 106494 106960 110380 114136 120789
13603 120789 125062 126956 127135 123536 121404 120203 119063 112596 113531 114943 121881 122201 122621 134988 139488
13588 139488 144081 146755 148691 149532 150765 145561 145368 147458 149635 148453 142690 139394 139684 142340 135903
13573 135903 136692 136268 131010 132409 134604 135814 130416 127055 123041 126453 128588 130442 139896 145694 141610
13558 141610 135273 135818 139057 139435 138619 131874 129505 125359 118071 116104 118778 117881 123950 129719 140729
13543 140729 148439 144767 134217 127142 123077 124583 133600 135473 127198 130179 132502 130966 130977 134731
13529 134731 140733 144089 143036 147437 159761 161935 157797 162257 164678 170151 173567 183349 188639 194261
13515 194261 200361 194843 189700 187945 185575 183507 192812 207617 213292 220012 234947 254647 272755
13502 272755 299588 350117 422277 458515 439350 397207 351293 318809 311954 334344 376639 436716
13490 436716 471758 454438 415197 383269 357252 351087 364782 373088 368037 351750 335328 318789
13478 318789 297751 284406 276624 283442 296664 324986 363965 416348 491882 594387 740508
13467 740508 940914 1197819 1520038 1853146 2152219 2391275 2512480 2492228 2357070 2110718
13457 2110718 1801650 1477028 1186354 949206 770881 651537 572232 510432 464821 423665
13447 423665 387260 353175 327672 313956 304198 308727 319647 336268 356529 378524 396409 396092
13435 396092 386653 375286 350508 320352 294549 272949 251900 239638 225409 219087 218403 211944
13423 211944 212392 213220 205000 196862 195165 198730 198572 198458 206496 211485 213064 210305 203312 202724 198875
13408 198875 193764 196798 196857 198482 197883 205363 217042 218837 220923 226620 237949 253305 266004 283505
13394 283505 307549 330286 357482 389639 417629 426598 420431 400764 376936 354296 325492 312445
13382 312445 301806 289396 282024 279261 276948 274389 267779 263954 261508 257039 255457 257816 260438 263500
13368 263500 254069 252962 258262 259354 254762 250128 248884 251900 246756 238472 230597 226347 231090 237051
13354 237051 235930 240698 242466 246430 252126 252747 264555 284340 297535 315822 334505 331534 331276
13341 331276 333874 322562 307917 296362 283413 284506 268166 254262 242134 234326 221156 203411
13329 203411 180341 158075 136926 106783 86750 71206 70872 88165 105176 131853 158959 188916
13317 188916 214570 230389 247647 252136 244437 247792 250039 250834 260560 266677 266605 272188 274673 281136
13303 281136 274411 272444 275862 279836 274843 269187 268003 276118 291870 296465 299353 303288 310540 321506
13289 321506 336083 348878 339966 332480 319259 313111 307620 306541 306673 314181 324715 330214 339657
13276 339657 349327 365755 379609 397707 412805 447614 483761 517222 552490 591258 629112 656986
13264 656986 671599 680150 677216 661700 626804 581396 535980 495691 463149 442287 425241 403802
13252 403802 388952 376707 364837 361309 358748 356652 357445 357750 353342 347526 340283 333411 331981 336928
13238 336928 345308 350698 358490 376743 401503 415378 419329 424572 425563 426577 435234 446870 467951
13225 467951 475723 475057 466683 458642 448276 449980 446197 430349 429401 429462 429676 432743 434440 440025 444825
13210 444825 449151 458007 469949 499578 547864 602753 660273 725976 794760 852820 899043 921268
13198 921268 926304 922617 908444 888198 868262 855935 852898 857243 860799 863383 868806 873213 866855
13185 866855 874489 879238 890545 905456 917617 931077 955864 987722 1028205 1079567 1135178 1200076
13173 1200076 1257435 1307291 1323971 1288090 1214826 1094823 958483 819398 680550 574392
13163 574392 507810 462500 450488 456171 470456 493564 514682 527222 540120 552192 568226 578357
13151 578357 592664 605133 611301 629307 659557 695666 728539 754317 781355 789990 773838 733808
13139 733808 682476 621462 552314 480998 434320 410425 398555 407554 429331 460737 487383 508305
13127 508305 538187 569757 597614 622530 651683 693941 739286 781897 822478 844526 854544
13116 854544 858078 861944 872022 887928 899008 901524 910950 918863 930007 939782 946079 966596 990211
13103 990211 1007553 1025168 1061711 1104522 1144623 1179523 1211666 1238549 1263579 1288319 1316240
13092 1316240 1332453 1335199 1347541 1357653 1361658 1362456 1367209 1380966 1401886 1425096 1453938 1480266
13080 1480266 1512118 1565249 1633659 1702727 1765434 1843898 1936763 2021086 2096883 2178785 2256814
13069 2256814 2331367 2400114 2467021 2528578 2585127 2648153 2715655 2790291 2873163 2971696 3096049
13058 3096049 3235120 3384105 3544904 3723229 3920268 4127216 4333919 4546591 4755318
13049 4755318 4947374 5137639 5352664 5592513 5874825 6196805 6564372 6984148 7468117
13040 7468117 8018608 8639414 9330995 10105430 10961691 11904210 12965770 14171347 15554354
13031 15554354 17168975 19071486 21316257 23983904 27165308 31026868 35816808 41840318
13023 41840318 49607563 59927349 74070138 94171967 123025746 162464281 212383175
13016 212383175 272178291 333631878 386889186 429579089 449561674 444068111 419292608
13009 419292608 374331927 318330668 260543340 206510802 161716340 127299805 102118785
13002 102118785 84011232 70609759 60176356 51681420 44599080 38646588 33646846
12995 33646846 29454067 25950296 23021652 20553515 18457998 16663105 15109616 13777621
12987 13777621 12614396 11600937 10711522 9926841 9227477 8605355 8034904 7517762 7040175
12978 7040175 6589600 6165862 5780954 5429399 5112476 4807357 4539996 4309850 4099163
12969 4099163 3913750 3750569 3590225 3421718 3251150 3076887 2899737 2726381 2545581
12960 2545581 2371883 2197877 2036378 1892116 1756079 1636790 1539729 1470346 1427107 1379941
12950 1379941 1345352 1322198 1291720 1267253 1248522 1218401 1185448 1142208 1098207 1055386 1016679
12939 1016679 974297 940530 898302 846372 801889 764452 721618 685640 655224 622499 601048
12928 601048 586505 583381 581187 578018 587561 589680 589649 587602 591745 591611 590646 585295 578674 570301 562280
12913 562280 562484 560941 567906 581272 592749 611533 640189 690017 766202 857015 983585 1162949
12901 1162949 1398471 1672351 1985735 2341644 2701105 3008058 3247561 3392363 3428100 3348084
12891 3348084 3152980 2868243 2529752 2171351 1821433 1507266 1247141 1031835 857633
12882 857633 732524 633226 559928 510957 479558 450733 427751 407580 390691 372871 358909
12871 358909 352180 345391 339622 343141 354085 360774 371326 387935 401953 405999 380607 307978 199030
12858 199030 75729 -80620 -233963 -365311 -475035 -541146 -563032 -545457 -505905 -444798
12848 -444798 -372035 -299173 -238267 -181883 -137647 -102151 -67419 -43205 -24036 -6489 13534
12837 13534 26363 45177 72850 111418 165070 233802 302105 374882 445860 523568 611316 716563
12825 716563 861647 1064379 1360153 1802441 2416145 3212609 4220050 5367192 6533648
12816 6533648 7580261 8369424 8764303 8758211 8409065 7824628 7109668 6364401 5659076 5038917
12806 5038917 4478643 3958099 3428055 2916797 2451407 2037932 1667274 1347455 1089146
12797 1089146 895438 748083 635062 543496 465453 413722 372641 339988 316499 301324 288966
12786 288966 281664 268354 254557 235040 212448 188240 158594 143077 127765 118559 109404 99464
12774 99464 97631 90639 78729 65849 59421 49595 34373 25108 26570 19329 15221 19128 28028 32407
12760 32407 35693 42469 42220 49815 52912 56702 59516 81458 112048 147104 175205 187233 185175
12747 185175 166055 135434 105330 70281 49827 47100 45465 39325 28220 17070 5919 -8235
12735 -8235 -14724 -21212 -26717 -35584 -43706 -37349 -33347 -34241 -24953 -16503 -9959 -3903 -2018 -7516 -13205
12720 -13205 -18760 -14921 -16866 -11719 -8468 -5682 -8032 -7141 -6467 1931 11810 25061 35041 44913 58295
12705 58295 79320 106113 138595 166682 181400 185243 189460 175314 143035 107155 71163 37849
12693 37849 24797 14493 13928 11622 8666 8790 2761 -5771 -7873 -17739 -21928 -23604 -25676 -30524
12679 -30524 -29259 -23364 -7579 2512 19622 37186 64874 93683 128623 168156 215961 268878
12667 268878 325101 397130 485598 580147 656770 688106 691623 687425 656431 584958 493967 405053
12655 405053 326909 253679 186163 130502 79905 49461 29758 8961 -4930 -17686 -26574 -31371
12643 -31371 -41204 -52018 -48083 -37518 -30321 -21489 -17161 -15468 -26921 -32837 -37480 -37927 -39623 -49789
12629 -49789 -63206 -65109 -58448 -58652 -53584 -48673 -46132 -36345 -33284 -32851 -30738 -35900 -38508 -35772 -38716
12614 -38716 -41625 -34681 -31087 -39276 -40085 -37387 -36483 -34343 -32836 -29847 -27042 -21982 -22856 -16417 -17048
12599 -17048 -17913 -17109 -15690 -13014 -11679 -6681 -3395 -321 -587 -550 -2142 -7098 -7076 -4446 -216 3341
12583 3341 12800 19555 14209 10488 19301 22664 25445 32043 34643 43662 58966 69897 81963 99741
12569 99741 127406 154555 191191 242288 311454 410888 543842 720172 961101 1254967 1587088
12558 1587088 1902196 2172388 2342720 2361146 2258105 2040245 1736147 1414261 1121519 874254
12548 874254 676592 526410 409550 320630 252589 188047 140717 98480 60289 35462 28131
12537 28131 17102 6135 -4377 -14393 -21086 -26045 -37326 -45753 -43175 -48336 -50300 -46442 -51698
12524 -51698 -58819 -63752 -61412 -62772 -66528 -67141 -67069 -56665 -53313 -61009 -59010 -54906 -48578 -49659 -51641
12509 -51641 -53380 -49797 -52881 -51454 -49616 -47630 -50083 -53104 -51775 -41430 -36159 -37164 -39495 -37313
12495 -37313 -38356 -36729 -44988 -47802 -47054 -43791 -45019 -47790 -49897 -49747 -46879 -43122 -37085 -30950 -26111
12480 -26111 -28154 -30093 -32062 -43486 -49368 -47311 -48244 -46503 -41118 -35549 -30241 -28665 -28916 -23640 -27172
12465 -27172 -29818 -30923 -31887 -34157 -37958 -41738 -41499 -38439 -45571 -48494 -49373 -41450 -35120 -31393 -34124
12450 -34124 -32653 -31783 -38627 -40444 -35542 -29256 -32662 -39933 -47916 -50780 -48954 -45833 -51979 -56285 -52659
12435 -52659 -52323 -53154 -49546 -43913 -41845 -44986 -51341 -54596 -60465 -66347 -68658 -63377 -63309 -57265 -65614
12420 -65614 -60995 -54161 -55350 -49553 -42695 -51197 -55590 -53573 -50572 -53790 -59783 -64288 -55402 -50693
12406 -50693 -56847 -66699 -60535 -62132 -60839 -52740 -52836 -56203 -57344 -56671 -64450 -72607 -67388 -60284 -60166
12391 -60166 -62315 -56700 -54338 -55925 -53049 -48384 -40373 -44065 -51653 -60941 -58402 -56748 -55479 -47445
12377 -47445 -47867 -44777 -38226 -32217 -32819 -34465 -34937 -40617 -45322 -44975 -40966 -37234 -31814 -22511 -20891
12362 -20891 -17070 -5880 3927 9470 10188 3705 -8342 -13234 -20979 -35849 -45446 -49532 -49990 -52568
12348 -52568 -54019 -50883 -49423 -54735 -51549 -48618 -54005 -64711 -61409 -50675 -42918 -50475 -50530 -49922 -50704
12333 -50704 -47045 -49219 -53132 -59744 -57550 -60216 -54238 -53708 -52432 -56798 -60234 -63425 -56766 -48705 -49189
12318 -49189 -45530 -44436 -47840 -57743 -58168 -52067 -47652 -43177 -34894 -33271 -38726 -41240 -34919 -37039 -40602
12303 -40602 -42216 -43010 -39923 -42464 -45317 -44881 -47029 -42824 -45056 -44145 -40536 -44877 -55034 -53679 -45343
12288 -45343 -43742 -45953 -49912 -44384 -41568 -44653 -48730 -40497 -47046 -53174 -55411 -53200 -48123 -50610
12274 -50610 -48268 -42389 -38395 -36304 -41291 -43855 -45193 -47216 -46999 -41721 -45070 -49666 -51923 -49692 -45528
12259 -45528 -43717 -41129 -43208 -43924 -42416 -42281 -40743 -39707 -39855 -39858 -42763 -46187 -42966 -41580 -38509 -45975
12243 -45975 -55893 -58414 -56415 -51838 -49822 -47855 -41776 -43139 -50714 -52038 -51187 -46668 -40711 -42984 -48646
12228 -48646 -47103 -41273 -42057 -48482 -50469 -50175 -47982 -44664 -40313 -34664 -35623 -27232 -26775 -30014 -34209
12213 -34209 -32597 -29619 -34257 -41089 -43019 -37234 -42688 -43340 -41725 -40549 -39480 -36080 -39509 -45256 -47878
12198 -47878 -52110 -50591 -49606 -49422 -40581 -35689 -38070 -33134 -34686 -41121 -42952 -40386 -38903 -35532 -39132
12183 -39132 -46262 -39361 -43195 -46675 -44808 -36736 -38601 -40159 -42904 -44120 -41450 -42853 -40135 -44215
12169 -44215 -43691 -43939 -40570 -35407 -42999 -43776 -47275 -48136 -47803 -45415 -50655 -48407 -44810 -39885 -36930 -42173
12153 -42173 -43943 -45231 -43674 -46210 -56773 -57834 -52429 -49143 -49456 -46068 -42084 -45990 -54019 -54201 -47750
12138 -47750 -43147 -38019 -36965 -38755 -37365 -41746 -50483 -49438 -49286 -48012 -48344 -50850 -50157 -42354 -36532
12123 -36532 -41510 -56780 -65381 -60718 -52014 -50427 -44921 -42898 -36128 -38581 -45983 -47933 -42012 -42106 -44585
12108 -44585 -39640 -36679 -40735 -39054 -38866 -47539 -54262 -58870 -49432 -36320 -34951 -42623 -42848 -39736 -38310
12093 -38310 -34935 -40003 -42703 -39005 -38594 -39292 -43923 -41575 -43019 -39466 -34677 -35639 -37364 -34878 -32952
12078 -32952 -24439 -24771 -28280 -27395 -31914 -41745 -47357 -42382 -41848 -43578 -42956 -40801 -37955 -42587 -40241
12063 -40241 -33209 -34828 -37915 -40125 -44382 -45082 -43485 -43663 -45103 -47975 -35575 -26663 -27106 -26433 -29834
12048 -29834 -33484 -27052 -24671 -26223 -25857 -20506 -25405 -24008 -15419 -18542 -22586 -27969 -28196 -34302 -39403
12033 -39403 -38665 -42962 -46718 -43266 -40835 -38334 -32698 -36281 -36526 -38897 -40792 -37469 -37005 -43425 -45575
12018 -45575 -43721 -41696 -41834 -40269 -37374 -38471 -34038 -32272 -33201 -35861 -41414 -42856 -37021 -36107 -29706
12003 -29706 -25217 -28680 -31720 -36484 -41137 -39161 -37457 -34479 -35296 -40796 -40070 -33715 -28143 -29255 -35898
11988 -35898 -35809 -32455 -36087 -35200 -34372 -29198 -26396 -19500 -24175 -32636 -33668 -36435 -40332 -39444 -39625 -41420
11972 -41420 -41848 -35142 -27354 -26599 -25700 -29500 -30858 -35129 -31194 -32691 -35774 -38436 -37728 -39905 -42892
11957 -42892 -41043 -32714 -33012 -29611 -30868 -32839 -35796 -38831 -44283 -46948 -43036 -34417 -34933 -46470 -47844
11942 -47844 -44785 -42219 -41916 -39377 -35872 -30171 -25139 -28676 -26698 -30954 -38291 -36588 -35623 -33052 -29478
11927 -29478 -27077 -30041 -32921 -33347 -28582 -24321 -22285 -32015 -34451 -31881 -26408 -22033 -19994 -26858 -25901
11912 -25901 -26460 -27904 -34360 -32777 -30599 -30987 -35332 -30543 -22929 -23022 -22367 -22672 -20264 -19705 -17410 -14874
11896 -14874 -22082 -24461 -20375 -23418 -28696 -30456 -23382 -15275 -13761 -15126 -24561 -29989 -32343 -33814
11882 -33814 -33505 -31754 -27072 -30483 -30929 -35058 -30163 -28375 -32739 -34606 -27724 -27792 -31136 -34351 -35724
11867 -35724 -36244 -35481 -34286 -36918 -40869 -31610 -28440 -26575 -22070 -21935 -30080 -31692 -29424 -27580 -30300
11852 -30300 -30980 -33572 -36650 -37783 -39869 -31144 -26822 -27389 -25302 -23444 -17981 -27234 -36810 -45095 -46538
11837 -46538 -46668 -39886 -28950 -26967 -28199 -28443 -30419 -33214 -30941 -24057 -21324 -28576 -31393 -32846 -32896
11822 -32896 -25851 -28937 -31688 -29283 -31009 -30191 -25718 -24510 -27927 -30525 -34727 -31807 -27017 -26886 -25516
11807 -25516 -28200 -35578 -30038 -24050 -20429 -18572 -21437 -20381 -21147 -18557 -15143 -12448 -24049 -33304
11793 -33304 -40011 -35475 -33546 -31097 -28595 -28016 -31522 -33093 -33728 -36070 -29361 -27690 -27988 -27873 -32556
11778 -32556 -35075 -31794 -26378 -23558 -21062 -21434 -25057 -22645 -17978 -17480 -14830 -14015 -17828 -15382 -15923
11763 -15923 -16405 -21988 -20061 -11102 -4933 -6011 -4892 -5096 -13306 -19243 -26851 -28347 -28333 -26523 -27869
11748 -27869 -35520 -32976 -28027 -20462 -14306 -10647 -13577 -15755 -15513 -18992 -21310 -26291 -29452 -19526 -11948
11733 -11948 -6269 -14046 -23925 -19945 -16967 -27695 -29317 -23621 -18726 -17049 -15706 -11424 -9761 -12284
11719 -12284 -15942 -21930 -21327 -18792 -20604 -22161 -22094 -20923 -19019 -24849 -27256 -23143 -15905 -15377 -18823
11704 -18823 -20048 -22192 -14652 -11190 -20049 -20361 -19211 -21419 -24394 -23081 -17503 -18898 -14934 -11120 -7921
11689 -7921 -15676 -24529 -23978 -23490 -24840 -23518 -22636 -20548 -21811 -20985 -19327 -13987 -13857 -12689 -20938 -16660
11673 -16660 -11462 -11598 -22267 -24121 -12195 -10640 -12489 -17930 -24784 -24588 -22579 -21205 -33227 -31473
11659 -31473 -24374 -24516 -14081 -9652 -9185 -9279 -15465 -14818 -9950 -6201 -7644 -15908 -19901 -24513 -19637
11644 -19637 -12441 -5809 -4331 -3693 -5656 -6129 -7209 -6745 -7788 -10386 -11581 -22280 -28024 -20107 -16532
11629 -16532 -18436 -21287 -20666 -19576 -20534 -19880 -16104 -19015 -17743 -10532 -11008 -22251 -20022 -14419 -18331
11614 -18331 -22434 -15869 -9244 -9640 -11411 -11045 -12113 -7407 -5825 -10610 -16561 -15116 -11961 -19918 -16906
11599 -16906 -11966 -14838 -11806 -7275 -1921 238 4724 3450 6395 5030 5207 5552 3038 -253 -7462
11584 -7462 -10005 -8195 -7571 -3152 5475 8953 8368 10840 9332 9215 3535 1579 -2217 -3032 588 2381
11568 2381 2980 -908 -2084 -5529 -10508 -6704 -5474 -4326 -6567 -5391 -8109 -13820 -14902 -15320 -14230
11553 -14230 -10758 -5310 -833 3574 -5630 -12530 -17074 -14080 -11864 -9152 -700 -493 -5054 -7225 -8254
11538 -8254 -12146 -12806 -15409 -13340 -7722 -7198 -8228 -6571 -7097 -17256 -18490 -10013 -5495 -7758 -13258
11523 -13258 -18948 -17843 -10761 -8896 -12077 -11813 -7105 -2641 -4714 -891 7630 7096 714 -1900 8
11508 8 -2040 -2190 -3049 -5517 -7127 -11003 -13483 -10365 -8584 -2286 -4081 -7515 -7450 -1509 7133 12321
11492 12321 17238 15897 5412 6415 16340 19823 15941 13624 12432 16184 12965 12442 17987 6308
11478 6308 -1873 366 -3913 -3634 365 3105 4281 7970 2353 1393 3337 11521 13121 6967 7725
11463 7725 -996 -1013 1136 5610 5524 4640 3414 5034 6934 5739 -1122 450 1337 4050 1533 -589
11447 -589 -1360 2341 7604 9829 12451 14321 9681 7226 10778 14687 15296 16570 18063 24160 31589
11432 31589 28751 39915 43299 42916 36274 29598 30219 23819 20324 20155 18863 16859 18175 18463 12554
11417 12554 10914 14233 13598 13804 15868 14626 15096 20504 17360 20699 27571 26140 25421 22684 18538
11402 18538 18634 20521 24470 27583 28086 30829 25748 25319 23766 21183 18704 9625 18829 27446 19732
11387 19732 20714 20652 21249 21898 25584 25764 27321 25758 30825 42315 44696 39468 39464 36949 35830 35095 33484
11370 33484 35413 34557 34697 35163 42003 42799 43187 52434 49982 38129 40487 43181 42874 46284 56761
11355 56761 63279 63520 63999 59842 56774 54243 60304 61369 55704 55440 63501 69153 65037 67292 74932
11340 74932 72041 65218 68088 76459 77206 80859 84447 78306 79289 79575 86750 90032 95167 102726 110771
11325 110771 115732 120097 118160 117712 113654 110162 121470 129644 129751 132090 136240 140444 138243 143527
11311 143527 150427 150904 150263 151511 154885 162610 171892 183508 182840 176188 180975 187420 193320 196718 197242
11296 197242 208196 214031 223898 230127 230535 239945 246787 252964 264290 265357 271934 283244 284845 288235
11282 288235 297269 302302 313210 331741 337368 340942 340906 341355 347044 355499 364797 377601 382323 383042
11268 383042 381554 386583 393916 410996 422388 427496 434840 435369 435722 437097 441303 446897 452741 453017
11254 453017 457887 465143 467112 476620 484108 496393 513924 535554 559933 581942 600239 615212
11242 615212 618581 617644 603120 577499 559829 533375 503592 471483 441033 418896 408299 399283
11230 399283 388621 377234 364134 352049 347386 336850 317348 312081 310336 304990 296378 287877 279400
11217 279400 270200 267617 255230 242731 235869 233496 230893 224204 222825 210967 203297 199037 191739
11204 191739 185463 181925 183407 184639 179832 176755 166948 155014 160756 162907 159749 158323 156462 158209
11190 158209 167609 166678 176938 178126 177275 166481 153306 139941 130546 122503 118084 123095 122088 114209
11176 114209 103707 105595 107833 103725 99403 93524 94248 92968 92504 91985 81910 77691 74510 77000
11162 77000 87172 89408 86435 78384 79197 72140 58701 59159 59848 54297 54727 55548 56531 52051 42378
11147 42378 40288 47476 51160 51768 43022 45979 43146 43496 43613 43307 43713 37471 32519 32213 30736 25598
11131 25598 25782 33396 40108 38875 42110 49765 51086 48048 40871 38546 34589 30897 29155 30129 33361
11116 33361 38818 44807 41473 36330 25734 28711 34812 33054 38703 35017 29176 28664 19610 17966
11102 17966 23000 25372 29220 32425 31826 27621 23191 23371 16593 16077 24108 31260 27041 12593 9237
11087 9237 3139 1806 2271 4441 9236 4028 4986 11912 17499 11600 8676 5776 12660 16219 13826
11072 13826 8432 8308 9816 13564 13349 11844 9868 10280 8539 13590 15668 7979 8771 13360 10230
11057 10230 11723 14005 21812 21187 23205 22285 13997 8696 8056 4106 5580 9348 14349 10669 3242
11042 3242 7101 8649 11935 16376 15500 16767 18815 20959 14522 9882 11406 7462 -1236 -3161 -1637
11027 -1637 6443 11838 11303 7278 8826 19208 19213 19883 23743 17697 15836 18315 14571 7329 9334 9318
11011 9318 11923 10936 3325 5814 10005 18395 25483 28129 31419 37572 46851 54497 68836 87680
10997 87680 106234 123295 130094 124451 112356 104579 98931 86071 70282 59538 49935 38731 30264
10984 30264 15825 11246 10051 2963 -2329 2289 4430 10113 8525 4164 -5656 -10463 -4447 -729
10970 -729 4646 5530 3083 2220 6006 6369 3671 11212 17083 17081 16468 18500 19185 17989 7352 3968 1045
10953 1045 9091 19624 30867 36393 32238 33351 30037 25598 25454 26940 28273 33416 36456 35309
10939 35309 38377 43312 47086 50236 52539 51954 47008 46285 44372 33176 26084 21150 12130 9209 9671
10924 9671 5644 2212 -799 4442 4791 7557 4055 2865 7938 6627 2090 5160 7940 6341 597
10909 597 -364 8060 14014 14690 13022 11102 14440 12313 8262 11043 14387 11314 3614 1146 -5914
10894 -5914 -820 6223 5297 -1358 -7180 -8925 2384 5986 -86 -462 2695 2492 -7339 -13960 -13956 -10373
10878 -10373 -7170 -3995 -6515 -3976 1862 -1191 11825 12790 13237 15189 12772 12920 7764 5735 1430
10863 1430 2311 11054 15692 18306 15436 6721 2892 5167 3390 2784 10211 13309 13003 20610 14915
10848 14915 12161 10201 9946 11283 10900 11818 10830 6487 9057 10849 9859 14305 26473 28421 32908
10833 32908 34691 39768 32651 24018 23048 28363 32645 36251 31978 24066 19474 26116 33577 37585 38941
10818 38941 41453 42066 37211 39404 45231 49540 57460 61908 62681 63694 69536 75620 72755 71017 77301
10803 77301 82061 92661 102684 114900 118824 131269 154601 177251 193347 218692 242145 257697
10791 257697 274188 293697 313774 347915 396468 449003 507989 588601 693455 817671 983651
10780 983651 1215444 1555601 2068053 2882242 4142651 5887619 7853653 9399293 9965128
10771 9965128 9295838 7732265 5880877 4261562 3084830 2315915 1835110 1536929 1325329
10762 1325329 1151279 997004 856276 726891 616485 532775 467443 420688 380212 346094
10752 346094 322905 301271 276572 252313 229522 199960 183406 165558 148977 138906 128996 120445
10740 120445 107277 97607 88401 82534 77059 75182 75813 73037 69212 64377 56548 54128 46165 42393
10726 42393 44414 40298 37383 34346 38862 40105 35774 40532 37378 33914 32901 30793 25215 29976
10712 29976 27229 28785 29795 33327 30207 31144 34585 33696 40550 51276 61538 77070 104869 138846
10698 138846 162798 176352 177714 156625 131034 104495 79012 57917 38219 30477 26642 18153
10686 18153 11019 8088 13739 12632 9153 8424 10018 11626 20128 23333 24146 20895 19561 21631 22441
10671 22441 18344 8856 4060 5101 4252 446 497 -641 4187 6453 8221 1752 3988 3810 752
10656 752 5129 8872 14034 11067 7858 12123 10969 5089 7882 15261 7011 5901 4509 7497 1920
10641 1920 -11538 -14267 -6569 626 -1096 -7137 -2690 1704 690 -1286 -2220 -519 1566 13130
10627 13130 17779 11496 8645 8328 3672 -5905 -5830 -1139 -124 -773 276 -10239 -13921 -11426 -10068
10612 -10068 -9531 -7151 -2894 -5832 -1641 -6827 -10971 -14172 -8729 -3982 513 -4294 -1306 4889 5349
10597 5349 8063 11880 10839 7179 2476 3773 9099 3564 9769 6027 5067 2215 1768 -2050 2794
10582 2794 11112 13393 20760 44542 50911 60315 80832 100258 122450 128648 127334 119919 118302 111865
10568 111865 106965 103097 107371 114705 121333 129398 121559 124302 133030 136601 138673 144557 158568 172177
10554 172177 195899 236719 298476 401784 532119 684171 832680 981055 1124808 1247091
10544 1247091 1340875 1376431 1354116 1268511 1151931 1016666 868961 720605 578367 458601
10534 458601 360594 293589 249267 214633 181348 155257 138629 121338 106723 94800 81498
10523 81498 74266 71403 59729 55524 57621 54228 46511 45926 46749 48641 52075 64992 81579 100719
10509 100719 96165 77885 58482 35950 28443 17513 18722 20177 17835 14528 12827 12481 6052
10496 6052 6849 5650 11329 19151 11431 9872 11218 16011 18002 9072 7578 13116 17504 12123 16164
10481 16164 17088 10174 11396 7006 3702 -6055 -12121 -6513 3896 6485 4939 1344 2441 1212
10467 1212 264 -3205 -7810 -7307 -1740 -1449 718 735 61 -3917 -11095 -13485 -9842 -1349 303 -4629
10451 -4629 -1818 676 -4164 -8501 -13924 -14963 -8242 -14569 -16006 -12028 -10146 -8063 -12070 -7254 -8277
10436 -8277 -7369 -7878 -4542 -8132 -11285 -17819 -22968 -21682 -16452 -15582 -12170 -11107 -14378 -18088 -15092
10421 -15092 -9367 -3565 -1610 -2915 2767 5866 11881 3155 2205 3746 8246 9595 -3641 -2803 202
10406 202 6334 7400 7137 8639 8432 9243 8602 6075 7150 16212 24868 29030 35219 39571 49036 55258
10390 55258 76692 88913 95444 85508 87565 96576 91868 86738 75748 56603 50656 41529 33612
10377 33612 26649 17580 11751 13632 13188 7170 6318 1847 3212 1855 2511 12258 10503 968 -8230
10362 -8230 -9893 -437 6280 6767 6653 13574 25196 36263 47206 53561 50964 48128 39565 34635
10348 34635 17603 7240 5571 5465 13365 7488 -1787 -4001 -2945 -963 -6994 -10586 -7692 -3169
10334 -3169 -3296 -1208 -1461 -861 -2274 2366 485 -5442 399 -5903 -6716 -5014 -632 -1638 498 -407
10318 -407 1326 5157 3487 7488 5127 3097 1051 -2891 -371 9443 9670 8874 2474 -1256 -522 -3901
10302 -3901 -3346 -3527 9362 14349 8976 6567 3226 -478 14 1633 2249 -3525 -5929 -6352 -6166 -8823
10286 -8823 -13013 -12930 -10944 -846 7535 5881 2894 5965 4399 -1314 -5769 -1841 3299 4889 12434
10271 12434 17250 18815 18769 19677 13158 4432 2830 2548 636 -1899 288 -2415 -38 663 -2587 -3175
10255 -3175 1302 4794 -628 -2768 2049 -3343 -7451 -5793 -3988 -8222 -8985 -3120 -1382 -4440 -10496
10240 -10496 -4573 2837 12562 9191 9335 9798 1920 -861 2628 7852 10677 18683 23260 16474 16627
10225 16627 30403 36608 32963 44278 54909 61990 64473 66951 81022 95116 123472 165898 225734
10212 225734 306300 434688 633887 880516 1099241 1196763 1137515 968634 751036 547284
10202 547284 392762 287978 219889 175416 149909 130418 119356 108848 93540 80310 71442
10191 71442 61833 48227 42786 36188 28047 25221 22063 17001 21338 17587 5186 1340 4118 4058
10177 4058 2221 -2628 607 -2331 -6911 -5876 -280 -641 -3020 -8053 -10853 -3476 4431 554 -3282
10162 -3282 -10356 -10497 -8449 -12234 -7373 -1584 -4572 -5932 -9034 -10773 -9795 60 -3614 -11774 -14906
10147 -14906 -18202 -17623 -15356 -9398 591 -370 1978 9046 9039 15232 14389 13401 10831 2674 -320 -6828
10131 -6828 -9917 -4637 -5188 -3784 -8545 -10238 -358 -1717 -10290 -13871 -11174 -9268 -8422 -11235 -15006
10116 -15006 -10595 -4129 -6386 -6654 -58 -362 -7681 -5947 1961 2470 -2170 -595 34 -3862 -6244
10101 -6244 1253 668 -651 2518 4463 6028 3322 798 -5739 -5244 -13376 -8937 -8775 -11666 -14855
10086 -14855 -8423 -5414 -5749 -4984 -4366 -2271 -7375 -4599 -1802 -4421 -9853 -7421 -1793 -1221 -9315
10071 -9315 -10157 -14118 -10746 1116 1169 -6220 -7886 -4872 -4863 -2912 -6877 -5020 -1574 -4031 -8292 -10657
10055 -10657 -8472 -8057 -5613 -12343 -16416 -7559 -11750 -17952 -21169 -23373 -21247 -16307 -13967 -15624 -15489
10040 -15489 -9178 -7811 -12709 -17418 -17910 -11022 -10416 -10569 -7929 -4581 -10920 -17502 -14960 -10469 -6874
10025 -6874 -7767 -7304 -8617 -6978 -5729 -6035 -10077 -9398 -13392 -13910 -10081 -12063 -18245 -23176 -17463 -14086
10009 -14086 -16758 -18629 -20517 -13137 -9150 -7923 -4501 -8664 -10315 -9337 -9714 -7942 2600 882 3075
9994 3075 8510 7605 3274 555 2625 4851 8672 10532 7335 -881 3054 4573 1178 -6034 -8016
9979 -8016 -6737 -8301 -10358 -7736 -3391 1987 1240 -3260 -6587 -4905 -8713 -7117 -11736 -19874 -16640
9964 -16640 -13117 -4384 -3676 -4834 -1814 -3476 -6362 -6777 -2642 -3814 1734 7452 8108 1693 2136 877
9948 877 8048 5467 3274 948 -5722 -3318 -2201 -3934 -1592 4630 6806 14646 12227 8130 9316
9933 9316 17824 14955 2349 -4322 -4173 -11027 -5862 -3037 -37 -1951 3563 10210 13963 16370 11974
9918 11974 2459 2886 -1707 -9325 -8988 -8528 -11062 -13855 -11948 -6844 -4527 -7830 -9580 -7597 -16601
9903 -16601 -19733 -17084 -10085 -858 2842 -849 -5292 -7011 -13277 -13200 -7561 -3700 251 -3160 -5485
9888 -5485 -7107 -12439 -3814 1577 4813 7422 -227 652 -1102 -4314 -5170 681 4893 2856 -5324
9873 -5324 -9624 -9245 -9269 -3618 -1349 -3982 -7662 -9110 -6126 -4847 -4345 -5942 -6350 -9191 -10283 -9906
9857 -9906 -8002 -8148 -5158 -7627 -10849 -12795 -16088 -13518 -11161 -9683 -11597 -18064 -16566 -13922 -4821
9842 -4821 -1901 -5288 -6573 -1403 345 3701 5610 4032 -1920 -3007 -5473 -7305 -9848 -9734 -8822
9827 -8822 -9795 -12261 -10769 -3442 2226 109 -4134 -8367 -9444 -8842 -15084 -14926 -11791 -9441 -9181 -9019
9811 -9019 -10783 -15947 -20282 -20417 -14877 -13724 -18180 -20831 -14733 -2953 -5882 -7566 -7161 -3717 -3181
9796 -3181 5527 8216 8000 3670 3277 5190 7471 13675 13482 13214 6736 846 -1683 -5555 -3841 837
9780 837 875 -988 -9324 -10004 -5559 -7405 -8351 -3380 7270 7160 5368 7448 9156 17708 24282 22978
9764 22978 18985 12424 -836 -7594 -8831 -8220 525 1180 -1498 -7744 -13701 -14336 -10815 -8952 -2844
9749 -2844 -2472 -4953 -5393 -2066 6766 10537 5559 -426 -5681 -8919 -3013 -1843 2587 -3730 -7325
9734 -7325 -7959 -4875 -5142 -3252 -6497 -2408 5262 -6220 -5423 8929 6599 -461 -6275 -6554 -3695
9719 -3695 -7391 -10873 -17935 -18079 -16690 -14091 -15333 -16635 -13506 -8931 -10861 -12260 -12946 -13214 -16044 -9252
9703 -9252 -4636 -3205 -3629 -4046 -1839 -7466 -15786 -19190 -11186 361 5070 6444 348 -9005 -4892
9688 -4892 2902 5014 6011 5546 -2584 -6529 -7385 -10199 -7536 -8303 -4368 -4824 -6006 -5027 3782 4536 500
9671 500 5004 8885 5400 -1419 -9237 -12091 -12577 -13410 -7907 -4510 4879 11073 9414 8270 6167 6724
9655 6724 9693 7162 3262 3094 411 2127 2996 6387 7237 10359 13196 9038 7183 4733 1541 5677
9639 5677 3401 -4893 -2470 3796 12321 8494 -3150 -6939 -6742 -4851 -1291 28 -531 -6958 -9884
9624 -9884 -7235 -5760 -6387 -10495 -13208 -12809 -14115 -9730 -3838 -577 -3272 -4967 -7371 -10887 -1742
9609 -1742 1187 958 -4712 -8321 -4645 -1747 -5555 -6270 -2408 7839 13308 8109 2645 -1590 -14364
9594 -14364 -21323 -21268 -16291 -3475 -2328 -6790 -9449 -9790 -9536 -12645 -18285 -23209 -20127 -9137 -560
9579 -560 -4986 -5965 -9682 -9402 -6666 -8179 -9186 -4160 -9252 -14992 -15826 -7117 -3756 -4625 -6945 -9961
9563 -9961 -4568 3676 9221 4372 -218 -8324 -20642 -15253 -9237 -5026 -7640 -6471 -5003 -6667 -4867
9548 -4867 -3495 1604 -1590 -3677 -2055 -1512 -740 -5800 -5197 -1951 3088 2319 2506 4063 6764 4486
9532 4486 -1427 -3158 -7168 -9724 -3322 1163 -1688 -5552 -401 -5632 -13123 -15981 -10878 -15740 -9539
9517 -9539 -9574 -10214 -11193 -8501 -5295 -2703 -2187 205 621 817 1714 3815 2735 3186 6318 8199 3931
9500 3931 -2966 -10175 -9283 88 -3527 -7922 -6312 9185 1152 -9157 -11777 -14795 -7144 941 -1916
9485 -1916 -4957 -7291 -5558 -2590 -7678 -1162 5053 302 3368 1534 -7095 -14029 -14968 -11292 -1321
9470 -1321 5578 1414 1526 1427 1311 3247 3018 -1753 1238 -7724 -10777 -5612 -5733 -7141 -9622 -11194
9454 -11194 -6248 -5093 -3157 -9703 -11297 -9425 -7389 -5710 -3632 -6263 -13680 -12850 203 -1809 -4305
9439 -4305 2057 -2150 -7156 -9232 -11321 -11571 -11958 -10887 -8177 -2940 -10224 -12152 -7089 3494 9406
9424 9406 7769 -30 -8730 -9747 -11262 -13796 -10212 -8352 -10759 -9543 -7650 -7328 -5356 -7198 -9384
9409 -9384 -11541 -19051 -12169 -3887 -4977 -12477 -13464 -6532 -7096 -8903 -4859 706 321 -2764 -7736 -1166
9393 -1166 5227 10085 5243 2008 5032 2708 -265 638 -3763 -8728 -8346 -11558 -8081 -4060 -5490
9378 -5490 -9882 -8247 -5503 -9308 -7356 -6332 -312 -453 2158 2945 2248 7060 4165 44 -1146 6855
9362 6855 7304 3286 -3383 -7828 -9868 -2430 -1685 630 -1876 1744 -307 14 2375 -4627 -7007 5154
9346 5154 12500 2005 -7431 -2083 -2886 940 5979 7926 3772 11003 9175 4783 7045 10815 13666
9331 13666 14194 13533 8646 590 -1258 2736 6680 6421 3521 4832 4828 3081 4434 2118 -3198 -4134
9315 -4134 -3547 -3243 7789 5840 750 1034 -2224 -4402 -4323 947 2397 5157 8047 4051 6153 1687
9299 1687 -3859 -2904 -1641 458 3877 -692 453 -3614 -6105 -939 -7734 -7177 -1738 -38 7120
9284 7120 2804 -3261 419 -3152 -4953 957 2969 4457 7752 8540 5059 7883 2707 4752 8463
9269 8463 11183 10658 3531 0 -675 -1338 -7737 -6514 1557 800 279 6633 5091 8232 3757 1068
9253 1068 1107 3264 358 -2183 -2748 -5651 -9949 -6220 3952 11971 14716 10616 4480 2592 617
9238 617 -1043 -4495 -3569 106 6604 15322 18252 16991 9862 12945 6689 4866 8401 1854 -4750
9223 -4750 -5437 -1096 -2145 2606 2833 1778 5566 299 -5960 -2061 -9514 -10049 -5562 -5955 -6963 -2770
9207 -2770 618 2031 6158 2328 -2646 -5444 -7613 -4273 2594 -482 -878 -14 2068 3861 868
9192 868 1116 9637 6268 -2726 1859 14117 12985 18601 24309 17556 22399 31289 31761 38598 47188
9177 47188 56545 70735 97237 151150 215940 252051 248364 210637 157608 112513 76672 57377
9165 57377 47446 42549 37256 33553 29827 32929 29042 29399 34753 33536 27864 30002 21455 12213 15536
9150 15536 17837 11441 10141 15423 16296 19255 22909 22192 25491 28629 26058 31301 39680 42824 43876
9135 43876 45076 44823 45934 64312 88807 125203 176961 256355 375489 499013 533841 480233
9123 480233 368327 262660 193526 150038 114899 87930 83388 77403 69001 57732 45519 37864
9111 37864 32063 31889 28843 21033 17270 19930 18632 21850 24844 25761 24229 26617 26679 26976 21348 17899
9095 17899 20219 20248 21279 17331 25332 27538 24599 23839 26608 33897 48124 56913 72617 107553 153462
9080 153462 208636 248359 244108 201280 148234 103002 68684 42236 31030 31531 29866 21087 19995
9067 19995 17964 17535 15974 11400 10736 9115 5098 12889 9476 1325 1554 4013 3173 2982 6571 6513
9051 6513 1679 -680 -1642 2956 3093 1598 -663 913 -2326 -3680 -5783 -2664 -5207 -2875 -1790
9036 -1790 4901 8289 9042 7279 12318 15596 12229 8505 13279 13241 9919 7706 -3753 -2877 -3999 -8692
9020 -8692 -12132 -2710 -2596 -3645 4451 8118 6594 7793 10805 11737 10218 7777 6803 8888 10469 9703
9004 9703 6293 1999 1794 4525 4819 7846 12940 11730 9702 12019 14577 11651 5805 4304 4074 7016
8988 7016 8698 9790 5197 -1330 -2519 715 6827 5075 2123 1536 756 3744 9310 7505 5141
8973 5141 13315 14245 8979 7635 8829 1111 -4201 -7502 -4924 2733 5388 -2082 -6583 -9560 -4817
8958 -4817 -5442 -4031 2108 1230 3687 508 2458 2530 429 -4994 -7328 -3234 -4677 -5960 -6528 -3848
8942 -3848 -6487 -5914 -1966 4612 915 -3569 -1849 -1830 2592 2161 -3262 -1467 -3841 3620 8174 5068
8926 5068 2582 5862 6458 -1778 1059 439 -3302 -4121 -3083 2413 29 -3214 -1257 3764 6916 9535
8910 9535 16511 9047 -2186 -734 -4557 -8373 -6240 -831 -307 280 4718 7328 7158 4169 1003
8895 1003 5900 6295 -1542 527 -6987 -15127 -20898 -17319 -7055 -2797 -1164 -4133 -5807 -2938 -7297
8880 -7297 -4350 -2879 401 -2815 3369 8653 7980 2252 -6678 -8128 -2956 780 3073 1695 6543
8865 6543 9268 4581 3971 5192 1532 3031 4247 2202 8863 7219 2216 -2058 -1229 48 -902 -3982
8849 -3982 -3566 -427 324 232 -3872 1580 6922 8069 5481 3006 7247 10026 8987 5995 8279 10735
8833 10735 5771 4708 10695 14179 5914 -1767 -6507 -1759 4418 6956 4090 22 -1356 2847 1342
8818 1342 -4342 -8019 -4090 531 2690 2035 -1127 6055 -1450 50 -499 611 4805 2799 4496
8803 4496 7891 6166 7354 7864 6687 7042 8128 6954 1507 4678 13774 14258 8882 6297 1480 -1743
8787 -1743 4605 6488 8667 11881 2144 -4294 -4439 -5421 -4313 -3824 -2346 -433 -3943 -9595 -12409 -7819
8771 -7819 6968 11612 1426 1247 8031 13638 12233 4280 1650 6665 7130 10771 14455 13899 17116
8756 17116 13037 5287 -299 1645 4495 1584 -6067 -8601 -380 4315 2351 3221 4448 -4806 -4363
8741 -4363 10602 20933 11111 11270 16839 15069 6060 1187 1815 5116 4700 5271 9817 7333 6520 11572
8725 11572 13386 11729 3857 2488 1383 -1044 3451 9993 13915 13116 6512 -1372 4029 4826 2300
8710 2300 -5276 -4159 3096 12815 18220 12641 9298 9607 12207 11082 9972 12323 6975 2539 3951
8695 3951 4677 8743 11128 12842 17808 18240 18419 8227 -3905 -1499 6962 9803 11732 10496 7111
8680 7111 1908 -773 4197 4343 278 -2270 1990 27 350 7758 9233 8167 13190 13015 6779 8461
8664 8461 7466 8988 8323 4984 5678 7718 8117 -77 -2945 2031 2642 5763 11201 16230 14114 2785
8648 2785 -2363 8266 15539 12770 10159 13646 13614 17981 14159 3727 3618 3605 3335 5431 5730 9752
8632 9752 10467 13873 10031 6101 2313 -1457 -7086 -5755 344 6268 5806 5613 5201 8645 20209 24795
8616 24795 21530 15382 8230 7273 10176 16004 17783 18004 14055 13769 14389 14020 14688 12361 10553 13934
8600 13934 15750 18831 16303 13435 15001 11509 19028 22497 27898 28634 36598 40771 40925 43539 42549
8585 42549 42057 38191 41535 47078 59507 70239 81715 84423 94010 111918 127678 138670 150130
8572 150130 157955 162797 163522 157575 149308 124978 103967 90982 83063 73514 66493 62610 50445 46213
8558 46213 42075 36820 37373 37141 36369 33410 30569 32316 31980 28264 18754 19082 20617 19308 16375 18115
8542 18115 10631 9051 15113 12593 6010 5805 6961 13935 7782 -1233 -2918 2527 7947 7494 8814
8527 8814 5177 4244 9106 10436 11862 10805 16974 20167 14229 1242 -3628 1044 1219 3551 1075
8512 1075 -2580 -665 3072 252 3098 6617 8778 4359 -3417 -1965 237 5346 3024 1431 2002
8497 2002 1650 168 -1981 -1035 -1872 -1033 3365 2657 -5800 -6731 -8791 -9415 -7277 1187 5909 3572 2941
8480 2941 -3596 -6377 2379 6405 -3995 -6833 -364 2816 -403 3499 12069 15019 9856 -174
8466 -174 -2096 1408 -1232 -6433 -7581 -5514 2386 4516 -1279 -220 -2346 -4876 2573 2705 -2133
8451 -2133 -5969 -5883 -3937 -2346 -1292 1180 262 -5 1554 7305 5376 6979 11788 10871 6949 1818
8435 1818 1996 4677 12331 14188 8045 3533 -2542 -2703 -878 5862 8796 12414 9859 5401 308
8420 308 -4468 -842 7875 6504 -100 -2628 -7866 -8407 -3558 2202 1513 -1544 -3645 -5039 -6188 -4275
8404 -4275 -4811 -632 -7092 -9589 -1664 -5254 -9553 -7941 -4030 1686 446 -9332 -8562 -8329 -890 4652
8388 4652 3069 -4037 -4913 -2259 981 5579 780 -1685 -1045 -7486 -7729 -273 5669 7387 5546 1802
8372 1802 2810 6815 -1880 -4222 -4284 -2548 -2396 -2002 2634 3947 -200 -5293 -4449 -5699 -4520 -3119
8356 -3119 -3936 -4621 -2876 -2538 -2386 -636 802 -449 -3858 -1019 -4631 -6966 -4603 -1976 -3476 1067
8340 1067 3320 3353 6487 8113 8940 10682 6224 8719 1699 2183 821 -1328 7695 14667 14283 11411
8324 11411 2072 -5784 -2261 3317 6365 3900 -6637 -9451 -7383 5863 7126 4008 -1975 -983
8310 -983 -2146 -4038 -1088 -850 467 4176 -119 -9714 -16558 -7603 -5786 -4913 3828 13849 12439
8295 12439 10134 7732 -245 562 6563 -674 -12308 -10743 -4282 1103 529 979 872 197 -1499 -1352
8279 -1352 -395 5472 10177 5861 6823 6337 5270 3433 2399 -1137 -8887 -8201 -5052 -4548 -8194 -6117
8263 -6117 -1202 -3241 -5629 -11378 -5575 -380 1756 -283 -474 74 1732 4487 -2693 -6012 -1986
8248 -1986 352 -297 -4089 206 5027 7885 11587 12905 11409 7415 -1280 2838 3589 -388 2133
8233 2133 -223 -4004 -3173 1954 4043 2391 -5478 -8803 -7634 -7134 -5867 -7803 -2106 -2335 -8729 -12756
8217 -12756 -11537 -9505 -2493 4179 8331 7619 11219 7615 3472 254 -8227 -14305 -9736 -11769 -6331
8202 -6331 2240 -2651 -5130 -3291 -2241 -552 -1910 2759 3427 -6329 -8008 -7784 -9011 -9041 -6842 -1063
8186 -1063 -4282 -5712 -6036 -2202 9271 8098 16141 10654 8837 7189 7195 5812 -2389 -4016 -2889 4443
8170 4443 8618 989 -5669 -6659 -4754 -2314 -2717 805 1250 0 1342 -2437 -2612 -1411 -5078 -3690
8154 -3690 -934 -1415 -116 5315 2859 -5907 -3742 102 -1490 -8091 -13175 -8163 -778 260 -1076
8139 -1076 -4724 1252 2266 3006 7386 4766 -95 -49 -7074 -12886 -6599 -6413 -5766 -4691 -4890 -5618 -32
8122 -32 517 -1845 -4622 -5847 -6277 -4520 -8382 -16553 -12760 -8502 -6653 -11203 -14400 -13730 -8473 -3777
8106 -3777 2070 9708 12553 12760 8191 8908 10800 9161 5866 3635 3023 3331 -104 5959 9621 4131
8090 4131 -1116 -3251 -2758 -3201 -8140 -5490 -1289 7636 10564 8243 492 3572 3254 3613 3943 6756
8074 6756 4737 1951 4064 7337 6918 3927 5689 3470 498 -679 -1130 3604 3099 1402 649 1290
8058 1290 -1664 -955 5400 6936 -2749 -3491 2181 3313 1798 -2112 -1095 11918 12638 10510 5754
8043 5754 5568 5701 6686 9984 7860 5984 2825 4611 10927 15761 12380 10998 9539 1782 -2231 87
8027 87 -3022 -10065 -6747 266 2899 910 1154 -1453 -4659 1660 5350 5408 6278 7830 11744 14202
8011 14202 14043 10928 9485 9909 6429 5826 15209 13249 7789 8101 6339 3249 3055 8088 13756 8247
7995 8247 2962 568 9128 6220 4463 6451 12989 23151 17515 9778 7578 5903 7447 8212 12347
7980 12347 6451 13303 14416 11844 16581 23410 26795 26160 26376 28734 35874 30602 21664 21144 18690
7965 18690 22796 24018 29099 26133 23072 17001 12178 11271 2636 2315 7112 9511 14015 14193 10565
7950 10565 12371 15419 17188 16463 15337 8824 8360 9316 9485 11085 7813 10444 14315 15228 11121 16179
7934 16179 18757 14679 16365 22212 24888 28956 27675 22820 12420 13347 15971 14979 14303 19410 21454
7919 21454 24938 24733 28986 28393 31783 25325 16468 15815 10084 8872 13368 21082 24890 19683 10163
7904 10163 13702 18830 25131 28999 23999 13147 2222 3401 14568 15257 13229 13727 17004 22711
7890 22711 21089 21565 19300 14708 7320 7507 9019 6896 1797 2074 6641 8708 10094 10437 10393 8665
7874 8665 8800 10514 8102 10418 11542 12770 15257 15288 3868 -1119 -5030 -3415 5535 13044 7164
7859 7164 3589 12113 16565 15928 10805 490 -2488 2640 1503 -4507 -2763 907 3780 4461 9214
7844 9214 9791 4450 2583 5339 5349 3843 378 2925 -2089 -9476 -4677 5166 9841 13738 14387 9791
7828 9791 1678 -2153 -1222 1051 -1676 -8038 -9545 -3418 1711 -2405 -5604 -7133 -11300 -4969 -5578
7813 -5578 -4310 -3237 2421 1205 -933 206 1195 1421 -4775 -3575 -3084 5749 10112 5033 4865 4322
7797 4322 -548 -5378 -10704 -12732 -10493 -5468 892 5840 2243 3007 4641 7309 12607 11909 6212
7782 6212 -3557 -7240 -9449 -7774 -5910 -366 -4005 -7524 -5225 1661 1039 -541 760 6606 7027
7767 7027 3589 2352 4081 2209 -1059 1205 3788 4603 7261 10625 12228 12486 4773 -2847 -559
7752 -559 348 -2151 985 -994 45 3646 7533 12369 11458 5927 5461 3597 1791 -1659 -1292 3925
7736 3925 11146 7190 171 -5566 -7219 -2755 -5217 -7855 -6394 293 -2479 -5781 -10609 -14216 -4516
7721 -4516 -133 -1368 1172 4603 5460 3084 3680 -90 -4831 -5432 -2431 -7444 -7930 -9032 -8685 -4044
7705 -4044 -6428 -5219 -1647 -1325 3530 7673 12744 10022 -1789 -12603 -13209 2666 8639 7174 5626
7690 5626 5828 7526 7137 477 -7045 -2551 -5185 -1794 -2333 -3159 -10196 -14310 -11784 -7641 -13716 -12970
7674 -12970 -8004 -5629 -4351 -5459 -7554 -8884 -7420 -6329 -8167 -9003 -7506 -8794 -9109 -9903 -5035
7659 -5035 2898 1481 -2263 -711 -78 654 3053 2520 4344 7696 7423 -181 -5293 -4415 -454 4762
7643 4762 1290 3686 -230 -7851 -10160 -11808 -4566 6051 5819 3032 -1345 -3550 -4723 -4324 -2849
7628 -2849 155 -2245 -1620 -1120 -7635 -18989 -17583 -6377 5438 8513 9234 9156 10611 7272 6541 1384
7612 1384 227 -6488 -3259 4002 6043 9079 11206 3671 -3713 -5824 -4143 -3591 -1563 -4336 -12997
7597 -12997 -13452 -11981 -8657 -9215 -8643 -4531 -7880 -6625 -973 -9650 -14280 -10552 -5936 -5947 -6313 -3882
7581 -3882 -971 143 -396 -3243 -7781 -7127 441 -4793 -12196 -6733 4850 1436 -505 5044 9623
7566 9623 6144 7971 11887 13704 6516 2425 5091 10487 8652 3195 3307 5556 8738 12365 10056
7551 10056 11693 11614 8671 3642 3649 6736 3590 -4175 -6946 -8242 -4484 2058 365 2430 5314 7143
7535 7143 3433 4890 7465 8836 9585 4309 -1063 -4495 -3445 -2996 -711 5167 3575 -3514 -1614
7520 -1614 -801 1513 3469 12085 14435 5341 -1901 1949 9747 10583 12911 10093 1872 1938 7268 8577
7504 8577 13382 10705 3568 -6427 -975 -5664 -7998 -7851 -870 2412 3935 777 -2678 -3621 -5600
7489 -5600 -8075 -4166 3700 1762 -783 5020 192 480 -509 -2554 55 3498 3329 4941 -2965 -4836
7473 -4836 140 2376 952 2768 -142 -9524 -11425 -10149 -13708 -13489 -7284 -5368 -2808 440 -3490
7458 -3490 5349 12832 10515 8406 9130 5741 7354 2340 -1205 -2367 -2191 2367 8361 11667 13309
7443 13309 13536 11753 5904 524 -3786 -6219 -4113 -6093 -4548 -4304 -4218 -8337 -13891 -12740 -12897 -4485
7427 -4485 -7065 -10559 -10873 -2624 5397 9095 14814 20411 19990 16029 9350 -1326 2881 6841 -1086
7412 -1086 -9926 350 1972 -6974 -5772 -3245 -3848 -3885 -5601 -12495 -10830 -9180 -8887 -5306 -2351 2584
7396 2584 3983 2077 1316 6407 5292 4603 5108 1090 4520 3588 2410 -2565 -10253 -4788 1054 5246
7380 5246 9941 3524 5594 6221 3981 9015 6380 4402 334 -4985 -2121 -2582 -5658 -4409 -2445
7365 -2445 -3074 -6006 -8653 -7607 2285 5887 223 -1539 -4439 -5713 -7072 -9725 -3005 -1705 -665
7350 -665 -4874 -10413 -9437 -1772 3375 2782 5797 8366 6306 5328 5450 1121 390 7481 6427 5756 5285
7333 5285 -342 -5228 -9777 -11121 -9617 -8976 -6429 -13259 -14372 -15333 -12191 -10865 -12193 -8485 -8563 -12577
7317 -12577 -11526 -7989 -3368 -3648 -7070 -4718 -8349 -8346 992 3684 4997 6291 1583 -1980 570 -2743
7301 -2743 1216 -1355 -2277 -3291 -4449 -2897 -6480 -8479 -7109 -2806 -4669 -3663 -4955 -5707 2046
7286 2046 3393 2217 -4709 -2783 -5746 -11513 -11794 -1943 4973 2738 -1335 2914 1855 843 -5249
7271 -5249 -6191 -3927 -9473 -12079 -9502 -5266 -1159 -4943 -4972 -7329 -3077 1067 2218 -2056 1290 4420
7255 4420 2671 3364 72 1246 1201 -4991 -2193 -5337 -9081 -2606 -2030 -9850 -13320 -13410 -9680 -3707
7239 -3707 3185 12071 15461 5960 -1227 -544 -4523 -6442 -6468 -7729 -4836 -2982 -1545 3911 879 -2361
7223 -2361 -667 2288 5617 6982 4796 -775 2211 7779 301 -5352 -1477 -6186 -9817 -8451 -4585
7208 -4585 -6057 -12568 -9413 -15 -2871 -2612 -2705 -7512 -3747 7749 5213 1713 -2318 -1815 -1534 -7956
7192 -7956 -9428 -8728 -8764 -9341 -5896 -7218 -10769 -10351 -7502 -9892 -11234 -1131 -400 -10898 -2523 4233
7176 4233 -5545 -9190 -8214 -10715 -12323 -10875 -8891 -10982 -12006 -13658 -17580 -11305 -7914 -5783 -4965
7161 -4965 -2057 -3312 1096 1235 1247 -3284 2578 5676 -197 -4257 7387 7799 13062 10807 2353 -5834
7145 -5834 -1637 2528 4242 8479 10961 9037 3298 3405 -6262 -10868 -11041 -4927 833 -401 1373
7130 1373 7458 4900 5214 -1620 -8713 -1284 -88 679 -6949 -6905 -448 7666 11327 7113 1812 -1530
7114 -1530 -5548 -6034 -6583 -5273 -1257 -246 -6844 -8634 -7805 -6628 396 879 -2843 -5286 1182 3696
7098 3696 4559 1017 -10045 -4061 2541 2038 -4717 -13526 -9500 -3969 1305 104 -4270 -10656 -13747
7083 -13747 -13881 -13354 -6779 -1044 4092 1428 -4692 -10998 -17800 -19459 -10998 1174 5313 3069 3078 -1876
7067 -1876 -3691 -4252 -8071 316 -2212 -10258 -10248 -7615 -4183 -2274 -6373 -7032 -10028 -14868 -12991 -8718
7051 -8718 -10470 -9740 -5164 -7847 -12307 -5730 -6519 -8452 -7078 -6288 -43 6525 2374 -3046 301 -843
7035 -843 -15155 -16562 -9104 -10554 -11973 -5260 800 1116 -5744 -10875 -8038 -3109 1312 7795 5532
7020 5532 2335 -4601 -9622 -11331 -7888 -3812 -5547 -7759 -10799 -10347 -6405 -2913 3062 6458 8428
7005 8428 8325 12053 11139 -2815 -12601 -10264 -8349 -3455 -4938 -5215 -2807 1595 1983 212 6144 6127
6989 6127 -1829 -1582 4111 8794 3302 7830 9980 9345 2680 7836 9752 1568 729 959 -7453 -4106
6973 -4106 -4175 -2362 5599 1772 6304 4481 2859 3016 9732 5134 -9741 -9617 -4016 -3406 -7357 -8601
6957 -8601 -1552 3616 -86 -6562 -4574 -5267 -1247 536 -1185 2143 7910 8495 246 1516 2468 7757
6941 7757 15475 18490 12746 9781 11447 9899 4442 5100 12205 11129 1494 -2191 3493 9901 1831
6926 1831 -4227 -3676 2256 3886 259 -1573 4920 10541 4103 -5459 -3399 -380 -2010 -3992 -683
6911 -683 2853 -502 4315 9070 8575 9751 2154 -2226 3343 3995 11283 7011 -8528 -13521 -794
6896 -794 1872 2444 -3553 -11378 -4425 2626 4482 2277 -3492 1784 6797 14928 13844 6042 3430
6881 3430 6014 2761 -2297 2812 2842 -6623 -4832 816 5907 6932 5414 1605 -2560 -5939 1664
6866 1664 10783 6366 6371 7389 3375 61 -669 -9232 -17057 -16354 -5809 -6113 -3007 -2414 1984 14014
6850 14014 15062 9012 3753 7080 14640 16202 8585 1639 -4850 -7952 -914 1996 -7005 -9476 4103
6835 4103 11190 5630 5410 6336 3904 -3674 -9296 -6520 -6629 -6502 -5253 -12557 -11038 3493 9261 2846
6819 2846 -6501 -5949 -991 -455 5499 4145 -3124 -8326 -6447 -2276 -6627 -4331 -3968 351 1531 -109
6803 -109 282 -1246 -6429 -3550 -8042 -10424 -14113 -9739 -5509 -7293 -9840 -10401 491 148 -1797 -596
6787 -596 1400 -7254 -13735 -14133 -8361 -1517 2831 4479 7919 11002 9064 6814 398 701 -272 -3364
6771 -3364 -3912 -3223 -2462 -7313 -7591 -2968 -4911 -7959 -8088 -7807 -2049 -1965 -4225 -5054 -5950 -10323 -11333
6754 -11333 -12301 -6097 -5179 -7915 -6562 113 2295 -339 1067 -967 -10241 -10292 -4248 -3755 -3929 -595
6738 -595 5541 1614 4391 8674 3742 -7175 -6422 -2823 4965 5378 110 -4413 -4354 5739 8255 9937
6722 9937 6872 -315 -3324 -3373 751 2828 1594 -3521 -6090 658 2200 -2056 -1940 -2852 -8686 -10716
6706 -10716 -6121 -6880 -7090 -6316 2658 2694 -3724 -6712 2938 2228 38 -5422 -6848 -13956 -13705 -10118
6690 -10118 -11520 -5255 -5942 -9207 -13937 -18690 -14904 -6005 -1613 2746 4598 588 -6267 -10141 -11963
6675 -11963 -9828 -755 6589 7142 3680 -138 -3450 464 705 -7322 -2221 -2849 -4696 15 134 7589
6659 7589 7626 1140 -5799 -7863 -8824 -9466 -5530 -4031 -3290 1019 -453 -3544 1502 9083 12263 3147
6643 3147 927 3325 10348 6711 -1552 -4172 1344 -1512 -4677 -7826 -8100 -9161 -7155 -7679 -8143 -5258
6627 -5258 -5310 -9096 2431 6176 4445 8480 12839 11500 11922 12593 7685 2603 -3115 -6325 -8979 -6492
6611 -6492 -4049 3585 3209 3820 -6842 -13172 -6840 -4164 -2019 2387 -4719 -5348 -6371 -3143 3331
6596 3331 8524 5260 -4910 -7668 -6227 -7793 -7646 -3873 -5325 -14017 -16577 -14025 -13897 -12160 -3161
6581 -3161 5940 9277 5122 4993 10732 9827 10286 18261 21147 17804 13049 8174 3859 -671 -1718 -7367
6565 -7367 -13941 -9919 -5191 -3473 1054 -8294 -16998 -10237 2907 9698 7757 12073 15637 10835 7736
6550 7736 6854 9648 14098 12094 9486 7811 1982 -5812 -8746 -7329 -7591 -6359 -7699 -9659 -8951 -5771
6534 -5771 -9854 -8000 -339 -1700 -2099 -5781 -14942 -7217 -4660 -3329 -1017 283 653 5586 2591
6519 2591 3696 2267 925 -1193 1335 -1935 -859 4802 1145 4723 7327 4027 3779 3693 3684 3502 5499
6502 5499 4139 -3184 -3634 -3387 -9815 -6411 2542 5961 3944 -2600 370 4308 -252 -4472 -1586
6487 -1586 2020 2664 3929 288 -968 -1831 -1837 -4570 -4190 1330 6356 4741 -266 -2636 -13749 -22910
6471 -22910 -18531 -11337 -5036 461 5691 -874 -6171 -1524 9645 12482 5026 5278 2668 2796 3721
6456 3721 5520 6940 1796 4330 2170 -1420 -7848 48 1805 4176 -5085 -8619 -1629 -30 -2269
6441 -2269 1896 2871 -3989 -3080 -2457 -8269 -10454 -9228 -6071 -8798 -7389 -3422 3398 1964 228 2020
6425 2020 4411 362 -764 -5239 -7583 -3589 8257 14895 12958 14083 8347 8757 7877 5330 5958
6410 5958 2647 -3865 -5345 -4945 -6027 -1102 2658 4374 1779 -4336 -3772 256 -5665 -7218 -4170
6395 -4170 399 1985 -330 -4259 137 -1925 -1660 -1049 2290 3388 7236 2823 2313 4062 2084 11658
6379 11658 22876 27041 20956 15584 6558 -6027 -2980 1805 3282 2915 2965 1195 3244 5425 4483
6364 4483 2543 2778 3962 7717 3662 4956 -2267 -8416 -6985 -7824 -6289 -5896 -10038 -13631 -7867 -9444
6348 -9444 -4061 2568 8155 9611 12592 11994 8151 6581 -1470 -11989 -13329 -5191 4382 2349 -5185
6333 -5185 -11666 -14149 -10112 -8431 -11772 -14464 -14909 -8589 -4051 703 1067 -3213 -4510 -2043 -1958 -6085
6317 -6085 -6235 510 665 2034 6645 11526 11059 11478 12 -2699 3948 6131 3023 978 -2557 -3441
6301 -3441 5844 5318 -795 755 2347 1357 668 -2005 -5206 -9011 -3082 -803 -5150 -4804 4013 -537
6285 -537 -2165 -263 -2105 -2809 258 -4534 -7115 -8550 -10673 -13247 -11307 -5367 -7026 -18035 -11112
6270 -11112 -2518 2428 4090 7574 -3113 -3093 4179 -3375 -9402 -5404 1186 -3996 -9885 -6843 -9685
6255 -9685 -11297 -3548 3093 4372 2257 166 3546 6021 11848 3513 2737 -2481 -4272 -7779 -13715
6240 -13715 -12328 -6064 -10730 -10359 -5607 -5550 -5994 -7070 -3321 -6538 -8095 -4415 -4640 -7996 -10470 -12923
6224 -12923 -12890 -4269 -878 387 2056 6666 12142 7704 2814 -3348 -2695 -5402 -2780 -1400 -1526 4690
6208 4690 7258 5782 3603 3507 7404 286 431 -1036 -2333 2915 5555 -5821 -16385 -11395 -8722
6193 -8722 -14080 -13614 -13454 -10422 -9666 -4140 -2013 -8323 -9975 -5411 -8620 -17097 -16643 -11266 -11660 -7931
6177 -7931 -2275 -3809 -6212 -5035 -8280 -2753 -297 7113 8585 9254 5311 3063 2362 -1322 -1755 -1586
6161 -1586 1081 -2318 -7402 -9401 -8177 -12349 -6296 -3618 1120 6185 5342 311 -4867 -4031 -11155
6146 -11155 -17125 -13775 -8720 -4085 -5164 -7008 -11019 -9691 -5302 -3708 -6324 1070 5278 3343 907
6131 907 -2555 7592 11919 7097 -649 -2280 -497 9870 16524 2711 -5649 372 -1548 -4350
6117 -4350 -4240 743 1206 995 402 -484 1190 8178 7648 5043 -3597 -7118 973 6518 2774 -3444
6101 -3444 -5926 -13 4770 3501 -1716 -740 -3970 -4330 7 -1081 -5923 -7629 -5450 -1408 -4879
6086 -4879 -3504 -4484 -6519 -7804 -8227 -10968 -11446 -6567 -10006 -3937 -218 -1281 -3982 -737 -6623 -14521
6070 -14521 -6695 1242 1116 4438 7029 6972 4260 -1530 -3942 4376 7179 -105 -5053 -4650 8166
6055 8166 9986 266 -3949 621 3430 -1378 -1194 -5737 -14049 -15675 -5088 -2014 1772 2278 -1936
6040 -1936 -3109 -213 -3946 155 9311 1174 -4839 -10020 -8038 -857 1295 7491 -1902 -9863 -7440
6025 -7440 -939 4743 3657 3965 6398 2904 1467 -285 -3287 -1281 -6325 -10055 -2185 1224 587
6010 587 7669 4022 2771 9175 12527 2870 -5973 1280 7946 9533 9015 6707 -4300 -5303 -4746
5995 -4746 -736 5052 5257 -1640 -8703 -10420 -9432 -2374 8529 2565 -6049 -4629 -3795 -5351 -3435
5980 -3435 -1236 -2408 -398 -5413 -7086 -5718 -4847 -1790 -2617 -9938 -8385 -3393 -3544 984 2741 4760
5964 4760 8040 12412 6359 4258 215 2715 9079 6281 3616 5209 849 1482 4711 2113 -6
5949 -6 -1448 -12559 -20431 -16277 -16429 -14287 -10967 -15335 -13919 -19766 -16137 -3938 -1458 1014 1715 -3169
5933 -3169 -11292 -15246 -12254 -3254 9450 10596 1121 -6241 -10670 -14079 -12470 -11975 -10975 711 5534
5918 5534 257 4672 2474 -10859 -6745 3428 3590 -969 2723 -413 -5448 -6175 -9413 -7952 -11988
5903 -11988 -24038 -23645 -18120 -13087 -8372 -4747 1148 6502 7293 4478 6177 4414 4173 6637 1748
5888 1748 -3711 -4763 -8383 -7653 -7115 -8463 -11643 -3118 -272 -9210 -6947 4166 4852 1482 -7951
5873 -7951 -3255 1856 3552 -269 3029 564 -9617 -6749 -5795 -2058 3420 7424 10143 4228 1335
5858 1335 -62 1203 -5386 -3736 -8764 -8465 -9387 -7765 -5794 -2229 -4451 -5081 3418 2881 4203 5956
5842 5956 3690 -3096 -11041 -11778 -4452 -1059 4599 6520 4426 9547 8268 3078 2249 3540 7166
5827 7166 3229 8488 438 -4499 -983 -2963 -24 3000 -3253 -9023 -9826 -5558 -396 3963 -1135
5812 -1135 2564 3041 -819 -7226 -4290 -275 -955 -6531 -3702 -916 -2039 3995 2219 -1163 -1019 1698
5796 1698 -1443 -687 -1633 648 4040 7488 6097 3785 3192 5766 9581 14629 16143 12111 501
5781 501 -5292 -4823 1183 420 -4442 -5065 -2170 2788 3938 170 1879 2142 -265 -3973 -6056 -2803
5765 -2803 2608 -1184 -2484 526 1133 -690 -6629 -10706 -6030 -4723 -8564 -4467 -7003 -5523 543
5750 543 4358 3179 1898 5107 2186 -6840 -4123 -5305 -1965 12565 14756 13359 11393 9331 8813
5735 8813 4040 659 -6358 -8252 -801 -8073 -8322 -10045 -6695 -8151 -11303 -12972 -8301 -1357 -3107
5720 -3107 807 2633 9458 11481 13008 10724 4075 4 -1119 -2161 523 691 3168 -1620 -862
5705 -862 3719 -2264 -8434 -5332 -3786 2906 -563 -5179 322 487 -613 -4019 -12124 -9971 -4652
5690 -4652 2620 2425 -3345 -2929 1435 819 3822 8424 4514 4759 4648 1294 8168 12940 3217 -1720
5674 -1720 1626 6728 10331 7661 3245 5061 -1025 -3015 1586 7704 7738 8729 5036 905 -4111 -5576
5658 -5576 -1359 7356 11222 12855 9279 2443 -1147 -4857 -8701 -3624 1838 -3854 -143 722 -5951
5643 -5951 -9500 -9081 -8818 -3431 -1668 -3784 -951 -4173 -11486 -14890 -3084 1105 -3438 -7869 -8305
5628 -8305 1420 3957 -1257 -3244 -3317 95 -1648 -5478 -7464 -17521 -9943 -274 -397 -3583 -2130
5613 -2130 -1964 1636 4841 5747 6142 6132 8317 2523 1746 -1832 -3419 -5150 -1019 3767 3954 -2421 -2625
5596 -2625 -8499 -10388 -8107 -6964 -2593 3616 396 -9655 -12394 -11167 -7320 1438 2227 -2787 -6343
5581 -6343 -6098 1313 3362 -2575 -5435 447 5242 2084 3554 5576 5178 2834 4247 6601 -2094
5566 -2094 -5959 -2690 -3038 -4021 -3000 -4917 -8140 1004 11566 8214 3913 9471 7350 8354 9448
5551 9448 9016 6956 7213 11636 9474 2374 -5639 -3826 -2172 -8274 -18351 -18613 -6931 2700 2282
5536 2282 481 8972 6454 8818 4427 -7726 -10989 -6590 -1172 -5301 -4340 5208 1881 -2624 7177
5521 7177 2240 1046 -1278 -4950 -586 -2002 -3521 2359 2423 4533 5088 536 -445 -4910 -3095 -3248
5505 -3248 -6392 -551 -1915 -6331 -5676 -967 3103 2257 -1305 -2410 -6827 -4314 4311 6994 2282
5490 2282 815 -3337 -2917 1176 4113 6488 5568 6221 7796 -1507 -4843 -3066 -11432 -11448 -14131 -12756
5474 -12756 -7110 -2342 234 6169 4798 971 2303 -2821 4561 9181 3876 -4062 -7043 -14802 -18215
5459 -18215 -13394 -4262 -883 -8492 -6823 -1140 -2115 4032 1776 -1365 -2468 -4126 -280 -1227 797
5444 797 197 -983 1341 -2150 -191 878 -2721 2375 5894 10885 4822 -2330 -6684 -2516 898
5429 898 6192 5223 2699 11477 5285 2389 8240 6210 7203 7704 4136 2958 -5096 516 6744 10409
5413 10409 9743 6772 8306 5120 1092 689 -1244 3658 7186 1033 -5332 -4684 3577 1456 -3437
5398 -3437 -143 2799 -431 -823 -2922 -3073 705 6220 6775 9425 5266 2358 -2849 -3987 -8829 -6810
5382 -6810 -4206 5249 10044 8561 9283 8126 57 1087 8611 6994 10012 10562 -4202 -3978 -3066 -1789
5366 -1789 716 1746 1336 8302 14309 8822 5692 7421 6216 8826 8569 4607 4638 9395 10239 2925
5350 2925 4845 7814 6675 10067 8269 7799 6255 2089 -1080 2490 6570 8982 -1174 -6845 -7792
5335 -7792 -6544 -7801 -1975 2661 4936 36 3493 6405 10749 2786 -4536 -3029 2272 -3532 -3925
5320 -3925 5453 5521 -2319 -6814 -6507 515 2890 1952 10970 11626 5626 7182 -583 -2138 1708 2188
5304 2188 2184 4618 1806 4174 788 7524 2728 -2913 -3050 587 -4027 -1593 4468 567 1759 5395
5288 5395 4745 4247 7831 9645 -608 -6193 -2024 1139 5460 4197 4540 -43 65 3196 3773 -2273
5272 -2273 -1472 -2216 4069 9999 6999 -1409 -6299 -2423 4937 13124 8202 6459 10557 12185 16974
5257 16974 16156 11557 544 -9120 -4499 -3064 -9345 -13792 -7306 -4240 -4353 -5030 -109 5213 6863
5242 6863 7424 11589 12332 10401 3188 3917 12214 8993 997 -6840 -7585 -8265 1514 7044 3583 5570
5226 5570 4305 -730 -3132 -1707 3651 484 -2622 1643 5267 7656 3928 6396 13991 22028 18490
5211 18490 8887 3943 3996 3994 7129 3367 -4305 -853 -3046 -1329 -6940 -10987 -8640 -6329 -3157 -6153
5195 -6153 -1631 -2221 -390 2684 6913 9306 6883 7718 6930 5922 5274 -1338 -8970 -4650 1177 979
5179 979 2874 1540 -2770 -4008 -4012 617 -4390 -5553 -1786 -1833 -5748 694 1460 12251 13678 8211
5163 8211 8931 9017 9145 4495 1746 3685 5466 12678 11788 -3288 -3977 183 2537 153 990 -3522
5147 -3522 3461 478 -3384 -2320 2557 -298 -8725 -10418 -7822 740 1295 -2849 965 2849 -2560
5132 -2560 3121 -816 -2516 -1859 840 5319 1108 -8310 -7558 3142 9822 6064 3774 2334 2703
5117 2703 4237 2006 3147 7249 6620 3795 277 -4286 -3606 -2336 -463 5 -733 -6261 -1179 4846
5101 4846 6352 6465 2790 4145 5989 60 -1353 8679 14134 6301 -996 -1395 1342 -1653 -1452
5086 -1452 -3573 -6732 -6862 5144 4401 288 5416 7089 3333 1406 3606 2883 -537 4938 10373
5071 10373 9701 7269 4894 1265 -1193 3698 9764 13423 16246 17555 18841 13435 7891 1719 1957
5056 1957 2313 2863 6187 7004 3712 4259 2473 -1335 -5095 -410 -6200 -9774 -7598 -7652 -5153 -9834
5040 -9834 -14456 -9054 -3053 5947 6154 -1459 5564 8961 8648 10853 13668 10080 1789 -2588 -8585
5025 -8585 -9388 -2145 1664 -1912 -6006 -10665 -9820 -2366 -722 2851 12159 16016 21190 18114 11000
5010 11000 6078 3153 7751 9604 4875 190 -579 -125 766 7669 8402 3502 -9961 -12645 -6384
4995 -6384 -3669 -9391 -4444 -5011 -7855 -3905 -2466 1093 3406 9725 2674 -2617 376 -5001 -10066
4980 -10066 -14752 -6615 -3047 2609 7689 -6489 -9458 -2013 -886 2913 1791 1577 5723 933 -1749
4965 -1749 -1706 4834 10440 8865 5621 -216 1153 8591 8429 7279 4346 4836 -895 -2923 -5711 -1943
4949 -1943 904 972 1839 -911 -321 778 7600 3989 -4089 -9156 -8034 -8443 1026 2850 -1826 6610
4933 6610 11433 11700 11262 9968 -1954 -3992 1704 4173 2085 3108 3893 881 -1912 -6646 -4570
4918 -4570 6609 13337 13069 10648 6491 9224 4280 -4124 -11287 -13625 -5618 1361 2021 817 2167
4903 2167 -1489 -825 5995 3874 4181 3732 -2662 -2352 5484 712 -31 1184 -7586 -7495 -1157 6842 8201
4886 8201 5846 4913 4413 -1783 -5172 -9940 -5066 3347 5722 3634 6424 1528 2579 2395 2023 1639
4870 1639 3290 10475 14316 4708 2452 3620 6253 8726 2161 -3351 -3988 -4889 -3203 -3028 -4353 -2375
4854 -2375 -5251 -5199 -2378 2162 -409 1142 -52 -5266 -8567 -9473 -6705 31 1480 -1952 -2446 24
4838 24 -2885 -6559 -4932 289 307 -448 3340 5681 2334 -30 -1913 734 4334 -185 -4539 4002
4822 4002 3103 2137 1628 1960 -1325 -6601 -6344 -8352 -13522 -15045 -7248 -2188 -5465 -10326 -7981 2809
4806 2809 7392 7586 1120 57 -3464 -3643 -4239 -4570 -3050 1897 4281 -932 -8310 -4807 4795 6732
4790 6732 3580 1007 -517 1674 5360 6166 1796 9071 14050 18870 13822 1706 -4861 -10258 -15475
4775 -15475 -17279 -6688 -862 3162 815 -4590 -7403 -16877 -14273 -4376 -1108 -5767 -6811 -3628
4761 -3628 1387 4755 -2526 -6784 -6480 -1780 -1573 65 -443 4324 -3343 -10683 -7105 -4982 -2076 -3166
4745 -3166 -999 -383 560 -3753 1423 -1447 -6186 -4593 -973 -1210 -353 5397 11110 7040 -904 1659
4729 1659 10090 13463 4151 3420 1975 -3288 -738 775 -2478 -1699 2489 846 2620 5220 7195
4714 7195 8511 6238 3056 7034 10145 1419 -10120 -4416 -190 2924 5402 3006 -1003 -6936 -13332
4699 -13332 -11636 -12641 -3551 3801 14934 24325 20815 16388 10988 9094 -1485 -7284 -3722 -2654
4685 -2654 -5928 -9504 -10245 -9607 -4369 3006 -1414 -9670 -9098 -1294 4386 4955 6269 10365 10967 1558
4669 1558 -1271 908 3342 7267 10217 9204 3560 1203 2255 1523 3394 2194 -1719 -6230 686
4654 686 7892 612 -1235 1307 -1182 3796 4920 9782 11257 13809 10881 8199 6872 6768 2559
4639 2559 -10697 -9981 -5134 -8380 -8249 -9936 -8269 28 6817 8982 1185 -8045 -6527 7331 10128
4624 10128 2207 6043 9703 6377 4272 -415 332 234 -3123 -3970 -6425 -4437 -7825 -10200 -9916 -6726
4608 -6726 -6635 -16140 -19555 -17924 -11221 -3397 246 634 216 960 5184 1604 244 -2792 -4501 -843
4592 -843 -4073 -11374 -6873 192 623 3974 -6005 -18728 -21404 -16590 -11916 -10027 -3619 974 1085
4577 1085 -3707 144 1293 -7544 -11871 -7001 3075 10955 11216 8235 5270 -2877 -10723 -11656 -7991
4562 -7991 -5399 128 -1825 232 5207 3943 -845 -1699 1332 1547 1372 6028 6227 2317 2834 -1582
4546 -1582 -3301 -1913 453 -20 398 -255 3436 3538 -4236 -7015 -10169 -12116 -9071 -8727 -8386 -5625
4530 -5625 -9175 -1543 6154 4675 4399 8863 6717 1537 322 -5429 -607 8585 10778 2667 2145
4515 2145 3384 3067 -2263 -2294 -1475 -421 -1925 -1530 -2512 -7919 -6974 -3680 -3343 -5953 2719 7324 5554
4498 5554 26 -10169 -6815 3646 8092 9513 12263 1810 479 1874 1989 -3739 -7425 -7273 -6003
4483 -6003 -2887 6350 12678 15035 10488 2168 -341 285 -545 -63 7751 2763 6435 10267 4370 -1715
4467 -1715 -294 8447 11024 13034 15036 9177 4865 5415 5217 -5549 -8047 -7072 -181 983 -2201
4452 -2201 -2607 4098 7473 4654 -3994 -8263 -8711 -8829 -8601 -5157 4202 7442 5116 6232 12072 7419
4436 7419 2054 7526 9191 4924 2876 -6083 -8404 -10665 -7585 -8751 -4468 4743 4633 -1658 -5071
4421 -5071 12 5601 1875 -867 1486 -213 -911 -1390 -1007 -1053 858 5085 6133 2312 7723 12474
4405 12474 9206 5928 6716 -2308 -7074 -5621 -4757 -3321 -6035 -4635 -9322 -6230 6416 13122 8897
4390 8897 6344 7009 6395 3794 2142 8020 7441 -78 -2438 -1966 -4765 -4500 -612 7656 7007 9546
4374 9546 12808 10424 6167 3995 3904 5791 5046 6346 -2041 -8231 -8615 -5739 -683 -1100 -5342 -2018
4358 -2018 -126 -2040 -1452 -6162 -4698 -6149 -3360 -4610 -8445 -4694 -1540 -424 1089 480 876 -3799
4342 -3799 -2868 1898 5314 1620 -1343 -919 -2491 -1487 2423 -15 -6689 -9972 -3322 1713 2006 -2394
4326 -2394 -3725 3332 10463 4710 -2805 -2846 -5766 -6991 -6025 -8650 -29 11315 9942 6192 2027
4311 2027 4496 6029 6384 3302 3292 57 -35 -611 317 -790 1262 -2133 -2724 4006 3105 1719 -727
4294 -727 1397 6227 5536 2707 5479 7089 -1038 -4068 -6611 -9595 -11381 -8476 -5681 -5025 587 3912
4278 3912 1311 2162 1991 102 -5595 -5134 237 -3767 -3967 1254 -1 -2131 -5874 -4720 -1430 1840
4262 1840 -31 -1714 -1446 -394 1600 -3118 -6234 -2821 -186 -791 439 2221 -2198 -6206 -10609
4247 -10609 -12857 -12394 -13704 -18153 -10066 859 -363 2033 5029 -2554 -11291 -5339 914 1886 -587
4232 -587 5012 9381 7149 813 2434 5591 8214 10262 14565 16984 5761 -2284 -6669 -7079 -4155
4217 -4155 -2455 -2323 -744 284 -4986 -9164 -6802 -2818 -1636 -1281 2052 5175 -313 -7550 -6548
4202 -6548 -10072 -9744 -7015 -842 2079 2487 1942 -2011 -6055 -2060 6273 5185 4140 5400 13112 16498
4186 16498 16824 16704 9479 2707 -105 2209 2224 3147 8421 5384 -6563 -8870 -7549 -8089 -6659 -245
4170 -245 -2021 -4425 4319 5623 5917 3486 867 -7297 -5936 -7585 -9494 -2459 -3890 -5119 -545
4155 -545 -2122 -2594 -2990 -4068 -4282 -23 -2049 -9626 -11270 -7457 -3707 -5222 -4923 -5422 -4002 -186
4139 -186 304 2689 941 -3326 3008 2453 526 -3328 -8524 -6166 -5850 1792 7399 1171 -7870 -4395
4123 -4395 655 -1504 -5876 -8452 -3352 2506 1971 3675 3262 5303 8123 7536 8150 14570 10916 11686
4107 11686 12008 5179 5478 9038 7671 4415 2099 2594 2785 4966 4443 12029 12457 15498 18793 21548
4091 21548 14302 6923 8369 13397 9917 5984 5767 -205 -346 4598 5627 364 503 -3012 -9016
4076 -9016 -6217 -682 -176 482 2 1302 -243 5854 5537 3524 2544 -4598 -4808 -7010 -8673 -1102
4060 -1102 7116 7691 4669 4267 1445 -620 -3992 -1212 3477 1978 -2979 -4253 3796 15497 17292
4045 17292 9041 4130 3736 -1104 -8179 -6343 -8360 -11292 -13245 -12517 -10646 -11044 -9904 -1115 -1423 -9393
4029 -9393 -10368 -5106 -853 -6036 -5546 -10910 -10153 -318 9396 2783 3993 5200 13 -5401 -2273 4430
4013 4430 9475 11209 7055 3824 9719 12971 4981 -6658 -7356 -6678 -5357 -1810 -4020 -2496 -4218
3998 -4218 1122 -881 -3943 -4180 -3352 5550 4233 -913 -2735 -1699 5740 3362 5622 3514 2967 -2549
3982 -2549 -4931 -5004 291 -3159 -747 555 -4634 -2535 3248 8755 8576 5096 7811 54 803 6301
3966 6301 5272 5104 8680 14248 18555 17542 13315 8425 3020 1116 3621 7644 10573 8779 6723
3951 6723 5790 8802 2982 6043 14300 23154 18316 13181 1174 739 4760 1318 1357 4593 6105 7312
3935 7312 7046 2987 1995 503 -865 2660 1053 -2018 -1854 -6100 -4839 993 1975 -3725 -8094 -8535
3919 -8535 -6085 -2074 -777 -8340 360 -962 -4673 -3543 -332 -5916 -6076 -4944 -6705 -5612 -392
3904 -392 3137 888 5567 2457 3421 -1720 -4846 -5215 -2025 -762 -1462 -5102 -7384 -1747 -757 329
3888 329 -772 -4911 -2486 -10751 -5010 1155 5088 7281 12268 13730 2871 -2012 -1170 2341 -3205
3873 -3205 -9432 -9646 -6488 -2869 -89 6673 6130 5633 3566 5362 7659 2855 -3893 -2533 -2082 598
3857 598 1312 3613 3842 -3221 -5578 -4444 -6969 -5772 -2462 -3192 -5242 -2107 578 705 371 4223
3841 4223 4221 -2555 2259 4103 8363 6580 1686 -3872 -6974 -2036 358 4730 5311 6711 5039 3916
3825 3916 5735 5100 404 628 4082 5319 -1096 -427 5357 3234 3714 7478 6667 8966 8521 6905
3809 6905 5227 3803 1260 -5187 -12309 -4773 3653 922 -2959 -4678 -1612 -1265 1676 1555 538
3794 538 5215 8503 7945 4939 2316 179 -4845 -5296 4222 6235 3315 -524 -9563 -14976 -5630 -1403
3778 -1403 -5531 -6851 -3155 15 -3649 -5302 -1304 828 4128 4658 1519 -3182 -3520 -1475 429
3763 429 538 -2072 -7913 -3134 -3386 -244 4795 12103 3202 192 774 310 -845 -729 -614 2958 6931
3746 6931 4728 72 -5534 -1700 1547 -1893 -7272 -2118 -581 2166 -2876 -12699 -10393 -7473 -6891
3731 -6891 1741 8137 5750 1723 -1805 -6483 -9069 -1592 805 -4131 -9069 -2847 5544 1912 -3317
3716 -3317 1005 3503 842 2766 6890 -247 -4018 1057 1036 455 -1358 -6465 -7766 -3588 -5179 -11149
3700 -11149 -5065 -1271 -713 2611 -1961 -10904 -10700 -8459 -5681 4182 4610 2287 4919 5680 1454 852
3684 852 6933 9569 6001 7879 10489 14609 10415 9533 8653 6912 3901 2008 -3898 -4128 -3342 -8195
3668 -8195 -6553 656 6336 6047 -2668 -4237 -4273 -6020 -2280 856 1953 2569 -797 2066 9815 15326
3652 15326 16320 12328 4675 -52 823 3568 5025 9024 190 -4262 -5259 -6626 -2475 -2029 -1485 -3445
3636 -3445 -3305 2551 -1009 -3011 -9039 -15318 -13925 -10907 -1625 -3403 -5830 -2150 1857 8823 9137
3621 9137 6820 917 1814 2790 1365 1013 -11399 -16283 -17073 -16114 -15789 -12576 -3957 3304 3876 7233
3605 7233 10640 424 516 1322 -97 -3381 -2637 9535 3475 3725 8428 4278 -2521 -7681 -18345
3590 -18345 -15029 -13180 -12971 -1891 -1899 -2583 125 5833 7660 1522 -3426 -2900 -1684 -659 492 3949
3574 3949 3230 -3226 -7374 -6320 -5490 -4105 -73 1907 -618 -2997 -932 -2786 -4771 99 4342
3559 4342 7305 -2338 -11025 -5507 -3613 -1918 2779 -1221 4201 5513 5475 5957 6337 7942 11420 3453
3543 3453 -6171 -14707 -10774 486 10624 11773 14232 7848 6139 959 -875 5528 278 -177 -1986
3528 -1986 -866 -5566 -4569 17 -831 212 91 -2949 -4438 -3810 -3184 -993 2169 1176 563 3503 9871
3511 9871 12275 3235 2062 2721 -2708 -5533 -1064 -1301 -3277 -6551 -3930 -1303 4189 2169 -2947
3496 -2947 -9277 -10524 -5597 -4019 -9961 -7516 -5904 -1946 2943 3028 2946 6175 2253 1761 2848 1539
3480 1539 1370 3891 6728 7699 4730 5026 -1004 3089 4464 2465 2778 8225 7212 -1650 -6439 -8796
3464 -8796 -5327 -782 9560 12251 6674 6063 2897 -3560 -3530 44 4477 3403 5705 4682 4246 2413
3448 2413 -4088 -14213 -15557 -12777 -4440 -2644 -4120 -4611 -7002 -9309 -1212 1188 4406 7058 9247
3433 9247 4706 4405 4486 1254 484 -878 -3183 -605 3198 4504 -2235 -4268 -7813 -5703 -2651 -8535
3417 -8535 -8123 -11745 -11274 -1007 2674 2572 11006 6752 8280 2695 2524 4969 966 205 -1183 -3565
3401 -3565 96 3475 2819 -3789 -7495 -5433 -3140 3158 -1352 -7777 -10930 -5645 -342 8015 9861
3386 9861 11682 11724 12481 -20 -11535 -7301 -4346 -3003 -2111 6335 5939 2286 -3292 -6180 -10484 -13614
3370 -13614 -14681 -7863 -1254 6034 2999 971 5127 4990 7859 8422 7037 6845 9868 9273 6457 8376
3354 8376 10102 4773 402 1488 0 -259 -765 433 10103 4267 -264 -3062 -4106 -2233 1449
3339 1449 -2774 -5889 -6404 -4299 -3332 -529 2235 -2465 -7721 -1981 4995 5448 7583 11213 12097 18095
3323 18095 15088 6794 -680 -6134 -5104 879 -1662 -2726 -3074 -2963 -278 3103 6794 8474 5143
3308 5143 4520 7800 7016 7472 3289 2174 4569 6663 3961 2418 5141 13677 10745 926 -7276 -11284
3292 -11284 -2665 3269 6540 9461 8631 2106 -1013 -611 988 1195 1577 4442 5034 3480 3400 2937 5590
3275 5590 896 -1634 793 438 2609 3518 5009 -2144 -6770 -7853 3095 9357 2683 -58 3403
3260 3403 1907 1597 2929 -236 -2419 -2188 -2481 -81 1614 -1247 -3037 1242 8756 7838 9132 9511
3244 9511 6093 5424 71 -2118 -7195 -5167 820 2817 -527 -1437 3590 6645 5204 8467 15123
3229 15123 14376 9441 7614 6797 4969 7478 6815 6546 2402 -3840 3694 14244 8073 2309 972
3214 972 -49 -1125 7972 11030 9066 3770 -4573 -166 6521 5484 3884 4076 3934 3450 2585 2764
3198 2764 3360 -1015 -2914 -718 4407 2262 -2139 84 5496 1840 -540 2056 -4528 -9946 -7816
3183 -7816 -4695 1896 4881 -2401 -12192 -11074 -13583 -10753 -5795 -823 -5142 -11221 -10642 -6429 -5979
3168 -5979 -3384 -2796 413 -1819 -10507 -15202 -12572 -11544 -10946 -5904 -875 -4704 -9380 -8467 -617 4628
3152 4628 2273 -80 1829 7442 5027 2807 -4650 -6658 -4081 -3409 -788 926 1891 6923 9186
3137 9186 8453 5222 3381 5305 4309 -3450 -3103 2085 1168 2357 -706 1433 6217 8173 6515 4248
3121 4248 4936 8683 1452 2784 815 -4605 -2 2234 -473 -3979 -2274 -358 2738 3655 4742
3106 4742 970 871 -3353 -5030 -3566 -2177 -4403 -7811 -5035 2455 3753 530 2550 6526 15725
3091 15725 12612 8967 16524 18632 11044 2807 -5221 -9694 -9225 -10660 -12706 -5819 1720 4423 6363
3076 6363 5934 8185 12590 14739 13030 5512 10088 5000 7053 5847 11401 11719 6428 2071 665
3061 665 547 5268 12147 12330 15663 10292 7771 4271 175 -2532 -3120 -4860 -233 -3714 -177 2622
3045 2622 -1678 -4145 -6595 -9831 -8363 2992 12901 13375 6797 -4760 -1614 1027 3703 3782 -1965
3030 -1965 -4262 -5060 -6832 -2448 285 -731 165 1976 -118 2269 6075 5656 4588 536 -141 -54
3014 -54 8500 10699 10695 7323 4084 4506 6003 -3705 -6152 1609 7624 7484 5662 4256 4989 262 3294
2997 3294 6752 6149 4046 6482 3257 5153 5284 1374 -19 2196 5487 7189 9106 5292 -1556
2982 -1556 -1983 -2077 -1527 -1344 744 490 8797 12624 10859 9827 -2011 -5963 -3353 1491 3134 4258
2966 4258 1562 -4337 4779 21934 15515 2316 -1559 -3853 -6867 -2987 -2189 -3887 -4096 2541 3145
2951 3145 2778 3338 -968 -3602 4974 -1596 -6770 -7239 -6354 -6228 -5953 -10949 -11414 -4179 2043 646 7522
2934 7522 14265 12727 9568 13434 9574 -290 -3050 3742 8324 6300 -845 -5974 -7144 -1990 79
2919 79 -2407 -5700 -3498 1243 2595 -1223 -4517 -5316 -5934 -4844 -1950 1192 4447 7047 7570 8211
2903 8211 3038 -1083 -6619 -3551 5921 7712 4615 2844 1416 5598 13433 5413 -6449 -2959 5363
2888 5363 1492 589 166 -3222 -6721 1304 5395 2288 -4562 -4893 -2674 -3891 -2937 -6379 598 6198
2872 6198 2829 787 -3500 -6823 -1602 -8306 -9902 -7043 -6756 -10031 -11440 -8786 -4081 -606 -1440
2857 -1440 -2806 2451 6423 8273 4119 -1436 1182 11595 10623 4368 1425 25 153 -2283 -6432
2842 -6432 -4373 -4175 -1811 -2710 -1400 -4892 -183 2506 5046 2866 -5333 -5962 -2220 3120 -130 -1034
2826 -1034 3549 10058 9440 6234 8617 15738 13066 13654 18161 10486 4851 8157 9328 4594 317
2811 317 -1659 -152 -338 -4078 -7283 -5065 -8176 -1387 6593 6511 -1018 -1079 896 -7409 -6778 -7901 -4904
2794 -4904 5783 8957 12494 15575 12623 3594 3257 -6604 -6005 5683 3604 589 2667 3966 3233
2779 3233 5010 7254 9254 808 1209 1361 -1638 -6420 -6572 2042 1746 -2845 -1909 420 -495 4328
2763 4328 12171 12161 7625 -720 -1942 -5212 -7799 -12522 -16134 -17053 -13733 -9039 -4255 -9152 -5629 -5160
2747 -5160 1993 5158 4945 -1539 -8238 -3252 -2741 -2044 2996 8678 10141 6845 -400 233 -2813 365
2731 365 -2358 -4485 -4056 546 4723 -550 -3384 3173 8758 5739 2420 -1768 -8100 -6285 3098
2716 3098 8013 7215 638 -4180 -3344 1144 465 -5905 -2202 104 -789 398 633 5245 1589 -549
2700 -549 2642 12696 10194 8676 4178 10924 9228 4070 -4376 -3583 -2738 -4501 -5879 -4192 -8408
2685 -8408 -5893 -2512 -1332 -4985 -2233 -2822 -4028 -3583 -10652 -8750 5471 9909 7354 10116 7274
2670 7274 4907 5019 3280 29 -6394 -8587 -4506 -2397 -2103 2044 6897 4038 2695 8140 8798 9946
2654 9946 13075 11464 5641 5583 11526 12548 6517 -3140 -1417 -1762 -7322 -4096 -773 -1060 -143 -2899
2638 -2899 1102 7146 17107 14870 6156 -2318 -8986 -5238 -72 5947 3205 -1966 -4368 -3058 -2552
2623 -2552 -2544 -317 5297 3606 1367 -2352 -2037 2029 3180 7668 9248 8219 15539 13855 9778 7439
2607 7439 3407 -3063 -3954 489 5088 3657 3327 -1957 -3345 -749 -2607 -4106 -2275 -4415 -2018
2592 -2018 830 -1818 428 3318 1066 5805 5754 2861 4259 8330 4693 865 1010 -454 -1000 -2635
2576 -2635 -7575 -5466 -5208 -6937 -10407 -7737 -6552 -5653 -241 -1291 -1003 2799 7069 11061 12133 12686
2560 12686 17025 16465 11126 4635 173 2115 3568 5788 5366 5583 3409 135 -4485 -5615 -844
2545 -844 5178 9879 6537 1678 -836 440 3533 224 -4857 -3013 442 -3030 1466 6108 4147
2530 4147 3832 8581 1113 -6921 -2284 -1185 -2235 -5792 -7531 -5928 4936 3400 -2186 -2639 -974
2515 -974 1246 -7320 -8694 -3652 -1908 377 -361 478 5474 1130 -4003 -5537 3486 12953 8380 4761
2499 4761 -3367 -11253 -21246 -17034 -8360 -8219 -9040 -4464 -2769 -7254 -10022 -5542 -3787 -1686 -9062
2484 -9062 -8217 -9425 -7173 -9921 -4223 -950 -2029 -2961 2560 14241 15655 8572 -3521 -7540 -6849
2469 -6849 -6409 -7558 -10714 -12370 -15137 -10595 1426 4465 2064 5354 6420 3904 -3078 -8654 -7946
2454 -7946 -851 1116 739 -3095 -2723 465 417 3968 69 -3087 -5085 -2789 -964 -3731 -2776 -2971
2438 -2971 -330 337 -128 2827 1049 6382 4958 4034 10734 7971 5653 2218 -1997 9977 17114
2423 17114 16136 4061 -4894 -5684 -4642 -318 1246 1627 628 1710 5086 4765 2776 5900 5539 -3591
2407 -3591 -9929 -2662 3246 3873 492 -1184 -9184 -13259 -7334 -836 -72 8666 7410 5776 1411
2392 1411 11082 10383 3536 2031 7726 9964 3361 897 -6504 80 8702 9408 1283 -3741 391
2377 391 -305 -1904 2561 -962 -10125 -6763 -6860 -9133 -15797 -11855 -1661 5997 -709 -7211 -1384 6548
2361 6548 893 1260 3102 4005 956 4630 6260 9005 8692 4319 396 8762 10292 4134 12578 14717
2345 14717 9039 2904 -895 -1282 -886 -4733 -5230 -1 1733 501 -3323 -6611 -2948 34 -2672
2330 -2672 -6967 -6877 -5881 -1031 1929 7258 546 -5508 -3408 1585 1028 -8059 -13956 -15108 -5812 -6216
2314 -6216 -6121 -12552 -16199 -12169 -2653 6425 4872 295 -1019 -7826 1657 9926 5728 1378 -3117
2299 -3117 -7743 -10494 -9009 -9059 -7849 253 6002 8626 5906 473 -3551 1146 6630 7166 2500 2279
2283 2279 -2854 -2828 -3890 -9928 -14666 -6492 -1213 -3634 -1032 3832 5174 1992 900 7384 10606
2268 10606 8636 16587 20276 15776 10188 8691 8243 7192 205 -4335 -4733 -4411 1425 119 -3307
2253 -3307 -6033 -7521 -4195 2885 12630 16336 11752 7052 8762 8592 9419 2014 -398 4489 8777
2238 8777 2120 1746 -755 1629 383 -2967 -1814 -1873 -821 -736 -6463 -6633 34 3013 2151 -6053 -40
2221 -40 3747 1858 -964 -5046 -9403 -6531 -1241 -382 -4623 -8320 -5060 -7898 -13092 -11581 -6086 -2137
2205 -2137 -1648 -110 4568 8635 9633 7863 7341 8539 8420 5810 7562 461 -8705 -5348 -1902 -1344
2189 -1344 4592 4970 4794 8803 9310 13590 11211 5367 385 53 4058 13288 12693 -3996 -15955 -12513
2173 -12513 -1457 729 -156 146 3071 1586 3345 5233 8027 5505 7354 7391 -6506 -16051 -14084
2158 -14084 -7478 -5339 -6382 -1537 2038 5216 3316 -1472 6129 5610 3756 -6535 -4678 -1012 -1912
2143 -1912 -6392 -10926 -12992 -10657 -6544 -6342 -6635 -3022 1255 -2585 -5014 -5913 -11375 -15325 -14348 -5612
2127 -5612 838 1222 -3854 -2734 -3878 -4006 -6053 -2124 6647 6069 2979 -4863 -4225 2695 3349 5444
2111 5444 2909 34 483 4620 6455 1028 -363 707 -2220 -4161 -4322 116 -788 2118 -3374 -1119
2095 -1119 2935 3913 7150 10956 9461 3469 -6928 -7452 33 7769 13184 9915 10549 15158 8513
2080 8513 1173 2296 -1506 -4133 -6675 -13599 -13201 -12643 -5777 -4640 600 -3595 -4309 -2031 -6718 -7530
2064 -7530 -8797 -7702 -5178 -353 -1077 350 4083 7210 5600 471 271 -3193 5127 13872 8576
2049 8576 4223 -310 3724 2385 5964 4640 81 -4548 -13067 -19636 -15434 -8097 -4543 2259 4387
2034 4387 8316 11752 6645 481 2462 5506 7998 -1007 -1421 2731 4917 2456 -609 780 5594
2019 5594 15274 9343 3840 -2485 2290 7994 -912 -8162 3852 13182 13532 15820 16231 12408 8548
2004 8548 5164 5019 4272 5944 9046 4874 4837 2443 1210 948 4726 6305 6298 -1915 -9363 -10494 3998
1987 3998 5137 -6672 -11814 -12609 -769 4536 8969 4965 2973 2884 2871 3691 -136 343 8365 11506
1971 11506 13191 8472 6727 11169 10878 11166 10994 9505 10829 8633 5279 -4640 -1892 -654 -2468
1956 -2468 5488 14664 16717 15390 12122 1680 141 339 -4699 478 5365 5424 2074 1489 -5368 -9526
1940 -9526 -4487 7068 12208 14419 12202 5708 3779 5603 9271 8707 6496 6320 5467 5866 4347 5356
1924 5356 6603 4667 -1724 -2953 -4283 -735 -713 99 -2898 4709 8176 7596 9921 5402 2689 8853
1908 8853 10546 7268 947 -4844 -1683 -35 1389 2712 240 -1333 -8530 -7655 -3537 2167 3980
1893 3980 5264 8084 2615 -1368 -2531 -9237 -9373 -2001 3746 3310 2527 -2536 -1196 -568 1268 -1258
1877 -1258 -961 4259 1961 -714 -8369 -15628 -15998 -15116 -13113 -14827 -14104 -6148 -472 276 -5190 -10890
1861 -10890 -7940 -8520 -13950 -14793 -8166 -8598 -13632 -7491 732 -1287 -3104 -5277 -3974 -198 122 6390
1845 6390 15575 11603 6136 7444 8613 4637 3325 734 200 3377 6674 14961 15381 17783 20074
1830 20074 16015 13257 13038 11239 5803 3446 2048 3551 4023 6244 11149 9333 6910 7559 4500
1815 4500 2586 1079 -2652 -629 3604 -4758 -7312 -7357 -5552 -5721 -9775 -11933 -13283 -5533 -4777 -1354
1799 -1354 -689 -195 5383 4479 9853 10236 10155 7803 6971 7302 3424 4205 2588 -2355 1303 -1310 -1742
1782 -1742 -3375 -6049 -2687 1786 -5545 -9769 -3027 1319 -1496 3899 10345 5639 6668 8300 6957
1767 6957 -338 -6617 -14110 -12728 -8392 -9493 -11341 -6505 -1991 2657 5312 7388 8795 5311 205
1752 205 4883 5212 -7742 -16664 -13672 -8524 -9062 -3890 -3712 -4967 -9795 -7326 -1390 -2990 -5078 2779
1736 2779 5076 6916 6662 -221 -4749 -3566 4617 2817 758 5382 -616 -3581 -1823 -971 3256
1721 3256 7063 10602 4754 2465 6210 5669 8979 4850 -4191 993 5088 6187 6301 1797 5600
1706 5600 3925 894 1797 7372 6502 12484 12942 16367 15121 13017 8072 7901 2207 468 2359 -1489
1690 -1489 1092 5789 2705 2769 1816 3853 2746 5211 6693 3946 -2602 -2144 1309 -5289 -8550 -5766
1674 -5766 -2951 2003 -1825 -2397 -2629 221 2205 6703 4317 3063 -1962 -5400 -9692 -13581 -13372 -5456
1658 -5456 -409 1573 258 2949 4259 -2421 -8509 -7523 -9257 -6694 -8776 -11847 -7520 -5231 -5690
1643 -5690 -8089 -12481 -12665 -4266 -7352 -12183 -7377 -8587 -10337 -4431 2263 3917 124 -807 3483
1628 3483 2737 4934 5700 -2206 -29 -2920 -5867 -12581 -14604 -6494 -2838 -5984 -2260 -5375 -5775 -3495
1612 -3495 -9531 -8667 815 8545 11275 202 -5116 -7149 -6631 -7041 -5637 -2766 -5124 -5154 -8229 -12123
1596 -12123 -3809 263 1816 -1899 -6830 -11786 -12592 -13425 -4561 220 1429 -5620 -2739 2020 1278
1581 1278 4745 5701 7293 5660 -960 -9431 -1007 6004 3432 306 -5274 -4500 7923 7916 -596 -10012
1565 -10012 -3630 568 2820 388 753 -336 -1484 427 -842 -2739 6701 9411 5456 -2296 -5904
1550 -5904 -13442 -8303 -1556 -5464 -4679 5990 5231 3931 -1794 -3993 -6676 -3245 -398 -695 3474
1535 3474 2441 -321 4277 2431 4116 6844 623 -2176 -5712 -7545 -7951 -6460 -4686 -4020 -530
1520 -530 4272 2178 1536 -3195 -2879 -5506 -10389 -9650 -6995 -4051 1886 5993 5674 -1108 -2552 1937
1504 1937 1309 4377 331 -8894 -12515 -10390 -6955 -5504 -5021 226 7180 8947 8139 6597 -1115 1847
1488 1847 -802 2741 -289 249 -2216 -4829 -3218 -6078 -7472 -3657 -2454 2783 5408 6850 7968
1473 7968 5118 10263 19409 12380 8077 -1999 -5123 -3527 4314 2962 -3380 -9582 -9999 -11068 -4515
1458 -4515 -2563 790 -2285 2551 7496 10073 5750 -3802 -1646 8881 2755 -2748 -2475 1822 1842
1443 1842 -4469 -8085 -12038 -11100 -2227 2547 -1127 4582 7919 6082 305 -2247 -3050 3917 9276
1428 9276 8673 7098 8013 6932 6381 4032 8161 7769 9475 9979 8138 8602 13348 14329 14247 16001 16496
1411 16496 8036 4921 3982 2504 7662 5044 1646 -6361 -8950 -5515 -3780 -3598 -3724 -5546 1462
1396 1462 1451 -2642 -7932 -4540 3122 1021 781 359 -2671 -2253 -6109 -5189 -4329 -3182 -9269 -14673 -17820
1379 -17820 -17939 -13206 -3476 -4028 -8045 -4812 -2839 -3932 -1910 859 1862 4314 4716 3181 -2160
1364 -2160 -12724 -11236 -5009 -835 122 -324 2879 -433 -309 -1842 334 4812 12035 12578 7125 4877
1348 4877 5797 6886 6117 4534 3578 1720 64 -282 1233 1301 -5262 -2234 2713 2203 -4697 -9880 -12516
1331 -12516 -11856 -5183 -2641 -9192 -11135 -14842 -15159 -10062 -1658 1494 -3448 -7445 -501 4987 8374
1316 8374 7962 7184 6316 4241 7931 7726 1859 -4371 -13069 -7021 -1038 560 -506 -1872 -8396 -5479
1300 -5479 3435 3769 -5848 -3644 2129 1708 4555 5971 1175 565 1523 -749 -8398 -9836 -6536 -3027
1284 -3027 -2051 -2692 -5105 -1726 5843 5632 -5666 -11521 -9829 -9922 -9586 -5040 -5962 -6676 -2909 -2670 -2944
$$ [...]
##END NTUPLES=NMR SPECTRUM
##END=
