##TITLE=Analysis number 313510
Compound Code aw 01051
Book Reference 2
Project Code adrs
Chemist Name stores
##JCAMPDX= 6.0         $$ Bruker NMR JCAMP-DX V2.0
##DATA TYPE= NMR SPECTRUM
##DATA CLASS= NTUPLES
##ORIGIN= Bruker BioSpin GmbH
##OWNER= NMR
$$ XWIN-NMR		Version 3.5
$$ Mon Sep 12 14:58:05 2005 GMT Daylight Time (UT+1h)  MAYBRIDGE\NMR@NMR_250MHZ
##.OBSERVE FREQUENCY= 250.131544655141
##.OBSERVE NUCLEUS= ^1H
##.ACQUISITION MODE= SIMULTANEOUS (DQD)
##.ACQUISITION SCHEME= undefined
##.AVERAGES= 16
##.DIGITISER RES= 18
##SPECTROMETER/DATA SYSTEM= dpx250
##.PULSE SEQUENCE= zg30
##.SOLVENT NAME= CDCl3
##.SHIFT REFERENCE= (INTERNAL, CDCl3, 0, 16.522)
##AUDIT TRAIL= $$ (NUMBER, WHEN, WHO, WHERE, WHAT)
$$ ##TITLE= Audit trail, XWIN-NMR		Version 3.5
$$ ##JCAMPDX= 5.01
$$ ##ORIGIN= Bruker BioSpin GmbH
$$ ##OWNER= NMR
$$ C:\u/data/dgb/nmr/ADRS/9230/pdata/1/auditp.txt
$$ ##AUDIT TRAIL=  $$ (NUMBER, WHEN, WHO, WHERE, WHAT)
(   1,<2005-09-12 14:57:25.71 +100>,<MAYBRIDGE\NMR>,<NMR_250MHZ>,
      <created by zg, POWCHK disabled, PULCHK disabled
       configuration hash MD5:
       62 19 C7 07 E1 42 D1 B7 37 6C 3D D0 77 39 F9 E6
       data hash MD5: 64K
       BE B3 2E 56 0A E1 B8 6E F8 BD 56 2C C8 61 5F 00>)
(   2,<2005-09-12 14:57:42.77 +100>,<MAYBRIDGE\NMR>,<NMR_250MHZ>,
      <Start of raw data processing
       ef LB = 0.3 FT_mod = 6 PKNL = 1 SI = 32K 
       data hash MD5: 32K
       99 8D D3 4C 93 28 D4 0C D6 08 5D 11 BA 90 6E 4C>)
(   3,<2005-09-12 14:57:49.13 +100>,<MAYBRIDGE\NMR>,<NMR_250MHZ>,
      <apk 
       data hash MD5: 32K
       81 9F C1 51 CE 0D 87 7E 6F F2 EC CE EA A9 51 5C>)
(   4,<2005-09-12 14:57:51.21 +100>,<MAYBRIDGE\NMR>,<NMR_250MHZ>,
      <abs ABSG = 5 
       data hash MD5: 32K
       4E 02 65 59 46 7D 06 01 07 FD D5 6B A3 DB 5A 23>)
$$ ##END=
$$ 
$$ hash MD5
$$ 5D 71 B9 54 E9 E7 77 B5 46 37 C0 B5 83 06 F5 68
##$RELAX= 
##$RELAX= 
##$RELAX= 
##$RELAX= 
##$RELAX= 
##$RELAX= 
##$RELAX= 
$$ Bruker specific parameters
$$ --------------------------
##$DU= <C:\u>
##$EXPNO= 9230
##$NAME= <ADRS>
##$PROCNO= 1
##$TYPE= <nmr>
##$USER= <dgb>
##$AMP= (0..31)
100 100 100 100 100 100 100 100 100 100 100 100 100 100 100 100 100 100 
100 100 100 100 100 100 100 100 100 100 100 100 100 100 
##$AQSEQ= 0
##$AQ_mod= 3
##$AUNM= <au_zg>
##$AUTOPOS= <37 >
##$BF1= 250.13
##$BF2= 250.13
##$BF3= 250.13
##$BF4= 250.13
##$BF5= 500.13
##$BF6= 500.13
##$BF7= 500.13
##$BF8= 500.13
##$BYTORDA= 1
##$CFDGTYP= 0
##$CFRGTYP= 5
##$CHEMSTR= <none>
##$CNST= (0..31)
1 1 145 1 1 1 1 1 1 1 1 1 1 1 1 1 1 1 1 1 1 1 1 1 1 1 1 1 1 1 1 1 
##$CPDPRG= <>
##$CPDPRG1= <>
##$CPDPRG2= <>
##$CPDPRG3= <>
##$CPDPRG4= <mlev>
##$CPDPRG5= <mlev>
##$CPDPRG6= <mlev>
##$CPDPRG7= <mlev>
##$CPDPRG8= <mlev>
##$CPDPRGB= <>
##$CPDPRGT= <>
##$D= (0..31)
0 1 0 0 0 0 0 0 0 0.06 0 0 0 0 0 0 0.0002 0 0 0 0 0 0 0 0 0 0 0 0 0 0 
0 
##$DATE= 1126533443
##$DBL= (0..7)
120 120 120 120 120 120 120 120 
##$DBP= (0..7)
150 150 150 150 150 150 150 150 
##$DBP07= 0
##$DBPNAM0= <>
##$DBPNAM1= <>
$$ [...]
##$SUBNAM7= <"">
##$SUBNAM8= <"">
##$SUBNAM9= <"">
##$SW= 20.6930455092707
##$SWIBOX= (0..15)
0 0 3 0 0 0 0 0 0 0 0 0 0 0 0 0 
##$SW_h= 5175.983436853
##$TD= 65536
##$TD0= 1
##$TE= 295.16
##$TE2= 300
##$TE3= 300
##$TEG= 300
##$TL= (0..7)
0 120 120 120 120 120 120 120 
##$TP= (0..7)
150 150 150 150 150 150 150 150 
##$TP07= 0
##$TPNAME0= <>
##$TPNAME1= <>
##$TPNAME2= <>
##$TPNAME3= <>
##$TPNAME4= <>
##$TPNAME5= <>
##$TPNAME6= <>
##$TPNAME7= <>
##$TPOAL= (0..7)
0.5 0.5 0.5 0.5 0.5 0.5 0.5 0.5 
##$TPOFFS= (0..7)
0 0 0 0 0 0 0 0 
##$TUNHIN= 0
##$TUNHOUT= 0
##$TUNXOUT= 0
##$USERA1= <user>
##$USERA2= <user>
##$USERA3= <user>
##$USERA4= <user>
##$USERA5= <user>
##$V9= 5
##$VALIST= <valist>
##$VCLIST= <CCCCCCCCCCCCCCC>
##$VD= 0
##$VDLIST= <DDDDDDDDDDDDDDD>
##$VPLIST= <PPPPPPPPPPPPPPP>
##$VTLIST= <TTTTTTTTTTTTTTT>
##$WBST= 1024
##$WBSW= 4
##$XGAIN= (0..3)
0 0 0 0 
##$XL= 0
##$YL= 0
##$YMAX_a= 692008
##$YMIN_a= -654777
##$ZGOPTNS= <>
##$ZL1= 120
##$ZL2= 120
##$ZL3= 120
##$ZL4= 120
##$ABSF1= 16.522
##$ABSF2= -4.171173
##$ABSG= 5
##$ABSL= 3
##$ALPHA= 0
##$AQORDER= 0
##$ASSFAC= 0
##$ASSFACI= 0
##$ASSFACX= 0
##$ASSWID= 0
##$AUNMP= <proc_1d>
##$AZFE= 0.1
##$AZFW= 0.1
##$BCFW= 0
##$BC_mod= 0
##$BYTORDP= 0
##$COROFFS= 0
##$CY= 12.5
##$DATMOD= 1
##$DC= 0
##$DFILT= <>
##$DTYPP= 0
##$F1P= 14.0000005364418
##$F2P= -0.99999901652339
##$FCOR= 0.5
##$FTSIZE= 32768
##$FT_mod= 6
##$GAMMA= 0
##$GB= 0
##$INTBC= 1
##$INTSCL= 1
##$ISEN= 128
##$LB= 0.3
##$LEV0= 0
##$LPBIN= 0
##$MAXI= 10000
##$MC2= 0
##$MEAN= 0
##$ME_mod= 0
##$MI= 0
##$NCOEF= 0
##$NC_proc= -2
##$NLEV= 6
##$NOISF1= 0
##$NOISF2= 0
##$NSP= 0
##$NTH_PI= 0
##$NZP= 0
##$OFFSET= 16.522
##$PC= 1
##$PHC0= 13.57368
##$PHC1= 7.850062
##$PH_mod= 1
##$PKNL= yes
##$PPARMOD= 0
##$PSCAL= 4
##$PSIGN= 0
##$REVERSE= no
##$SF= 250.13
##$SI= 32768
##$SIGF1= 0
##$SIGF2= 0
##$SINO= 400
##$SIOLD= 32768
##$SREGLST= <1H.CDCl3>
##$SSB= 0
##$STSI= 32768
##$STSR= 0
##$SW_p= 5175.98343685301
##$SYMM= 0
##$S_DEV= 0
##$TDeff= 65536
##$TDoff= 0
##$TI= <Analysis number 999999
Compound Code 99
Book Reference 9
Project Code 9>
##$TILT= no
##$TM1= 0
##$TM2= 0
##$TOPLEV= 0
##$USERP1= <user>
##$USERP2= <user>
##$USERP3= <user>
##$USERP4= <user>
##$USERP5= <user>
##$WDW= 1
##$XDIM= 32768
##$YMAX_p= 371317967
##$YMIN_p= -160037
$$ End of Bruker specific parameters
$$ ---------------------------------
##NTUPLES= NMR SPECTRUM
##VAR_NAME=  FREQUENCY,     SPECTRUM/REAL,   SPECTRUM/IMAG
##SYMBOL=    X,             R,               I
##VAR_TYPE=  INDEPENDENT,   DEPENDENT,       DEPENDENT
##VAR_FORM=  AFFN,          ASDF,            ASDF
##VAR_DIM=   32768,         32768,           32768
##UNITS=     HZ,            ARBITRARY UNITS, ARBITRARY UNITS
##FACTOR=    0.157963299565203, 1,           1
##FIRST=     4132.6476996994, 0,             0
##LAST=      -1043.33573715361, 0,           0
##MIN=       -1043.33573715361, -160037,     0
##MAX=       4132.6476996994, 371317967,     0
$$ Real data points
##PAGE= N=1
##DATA TABLE= (X++(R..R)), XYDATA
$$ [...]
20337 835 302 -160 501 -261 689 697 1472 1305 317 -7 12 503 571 193 -36 -97 57 -883 -1029 -1105 -2554
20316 -2554 -2389 -1970 -149 414 -511 -779 -807 -1108 -1234 -612 -428 474 265 -191 462 422 -330 365 1526
20297 1526 2090 1900 1193 1016 -2 917 1531 2055 1291 1733 1574 258 -709 -346 -99 -271 249 1004 987
20278 987 1965 1954 2420 2240 1170 828 954 9 -2229 -2145 -2739 -2737 -1668 -1316 -790 -680 -1543 -969 -883 -947 -444
20257 -444 -572 -1101 -855 -34 606 950 1152 744 678 -388 -886 -1206 -471 132 -398 -174 225 623 -1124
20238 -1124 -523 277 732 1081 1060 576 404 -436 -718 133 1541 1326 749 850 488 512 1057 1225 1028 633
20218 633 589 849 500 417 1474 404 209 511 324 -17 125 -120 -653 1090 2198 1575 678 52 -694
20199 -694 -359 -878 -1619 -352 908 1497 1011 1247 902 0 388 645 2018 2551 722 -66 -1120 -1281
20181 -1281 -1578 -2635 -2185 -501 941 1365 2140 2002 1418 2789 3893 2310 1729 1284 734 -125 -717
20164 -717 637 423 1096 1332 -238 121 791 1019 952 977 -596 -671 467 -28 -1604 -1150 -369 -712 -157
20145 -157 506 1570 2468 1218 250 176 -894 -1433 -1495 -1412 -509 -866 -817 465 806 158 -867 -724 -529
20126 -529 -451 -178 925 666 34 -243 -31 435 -43 508 -28 3 731 1050 1003 -409 -1066 -1084 262 250
20106 250 1482 1386 446 -64 924 -326 -968 -569 297 -1150 -1159 402 95 -1292 -1043 -144 -937 -1122 -389
20087 -389 445 321 471 854 -52 -916 -719 -923 -856 -10 1406 1140 334 88 604 1020 730 591 219 -240
20067 -240 120 80 388 288 785 1258 1263 1182 1671 -653 -1332 -45 -258 -594 -1288 -2362 -2054 -1810 -1487 -43
20047 -43 451 -1036 -1347 245 1318 496 -712 -406 608 1128 588 745 1336 481 252 927 -180 -732
20029 -732 -574 970 1530 171 -770 911 1640 1478 992 -4 276 -112 230 -98 -685 -1361 -1754 -977 -972
20010 -972 -560 538 99 396 -223 -73 2049 2887 2644 1806 1120 236 119 -155 -966 -1017 214 513 972
19991 972 734 -957 -1482 -610 -163 243 -270 -436 -754 -101 335 841 -81 -894 -1491 -289 -1450 -2264 -1740
19972 -1740 -956 -406 522 -839 -677 -987 -652 -1550 -1528 -1249 -71 558 1033 1742 2358 2155 1709 975 1131
19953 1131 1868 2065 1511 1859 2868 2601 1834 2146 3062 2279 2222 2080 1094 506 446 271 -564 -1124 -356 -1319
19933 -1319 -2136 -1921 -787 137 -227 -292 -753 62 607 616 -789 -2880 -3599 -2736 -955 -101 -270 39 2374
19914 2374 2954 2926 1953 492 -25 -1195 -955 -874 366 755 -86 -1004 -810 -409 -913 -1719 -1690 689 1772
19895 1772 1726 1312 -37 -711 -177 -207 -1231 -1499 -786 -312 -65 -945 -651 -176 -2118 -2815 -186 240 -1285
19876 -1285 -759 105 1401 1007 -589 -863 -172 555 804 727 861 830 1091 847 1043 1551 1608 937 1027 657
19856 657 466 287 -83 422 329 508 698 839 2003 1850 2024 1351 459 -232 132 -561 86 530 -155 -624
19836 -624 263 765 927 1810 2851 2164 1930 901 792 841 670 405 -8 -174 -589 399 412 286 307 731
19816 731 759 398 1061 1144 314 -20 1157 1468 572 568 1051 1050 239 173 237 -333 -1793 -2840 -1614 -569 -931
19795 -931 -1376 -1600 -1761 -2036 -1119 -632 997 2286 2836 1550 1819 2436 2007 1545 1369 460 -897 167
19777 167 289 -321 -391 158 -35 -1213 70 -475 -1444 -1012 -607 -398 -127 -143 -253 -69 -325 -484 -621 -1328
19757 -1328 -1948 -1362 -204 -672 -1122 -756 -980 -1091 -1384 -1934 -2126 -954 -183 -30 -676 -1509 -960 -1249 -659
19738 -659 -6 218 479 1168 987 333 -509 -401 29 627 557 1740 1162 750 544 1077 682 805 537 782
19718 782 -184 -711 -230 501 1482 1355 415 1011 1685 1172 888 577 526 -412 175 -600 -947 -332 425 167
19698 167 -321 -316 14 683 1554 1163 -654 -937 -379 -1014 -890 -1278 -1594 -1455 -428 279 499 256 -679 -813
19678 -813 -1202 -1618 -2265 -2797 -1941 -440 647 419 635 1240 542 829 665 836 640 245 -617 -1543 -1376
19659 -1376 -3246 -2344 -1950 -2066 -3957 -4112 -2685 -776 -340 -842 -1463 -310 -29 -84 -1654 -1446 -673 136
19641 136 -719 -1456 -605 -157 -1028 -1097 -1091 -831 102 560 1221 772 1825 3173 3087 2019 2089 1325 1703 1407
19621 1407 704 -309 -500 86 -376 -786 222 672 382 664 115 104 733 1276 536 -73 -1990 -2031 -874
19602 -874 -1669 -2912 -2030 -231 -275 -697 -10 -347 -897 -730 73 1091 919 1704 952 425 1327 1654 1159
19583 1159 1016 480 -866 -1121 -762 -598 -1340 -1171 -17 -112 -733 -316 585 1198 1396 374 81 -762 192
19564 192 161 23 -321 70 1255 724 -201 -1417 -1161 104 -1596 -2697 -1132 867 855 735 -1143 -2176
19546 -2176 -1912 -1052 -285 141 458 194 -177 96 914 609 624 1007 1424 1179 485 655 -915 -573 -1701
19527 -1701 -2283 -3136 -2589 -1262 -124 -750 -750 -402 592 -350 -630 358 -27 -437 -989 -1604 -2751 -1965 -1339
19508 -1339 -269 -995 -1174 -838 -456 128 -90 -919 -1560 -2675 -2090 -2455 -3624 -3588 -2571 -2576 -2241 -588 -870
19489 -870 -2744 -3303 -2771 -2240 -1645 -627 -1061 -2023 -2241 -1298 -1158 -1661 -1207 -1472 -590 -62 -647 -953 -526
19470 -526 445 295 -196 -724 -1718 -1849 -1505 -1055 -567 -901 -876 -1348 -228 587 1060 1877 1140 653 -214 -1029
19450 -1029 -1883 -2600 -1823 -1998 -1805 -1633 -1282 -934 -324 925 920 46 -871 -265 -378 -773 569 1694 2540
19431 2540 2757 2463 614 -86 811 1477 454 -1271 -1726 -1141 106 736 862 1346 1522 1685 2120 1883
19413 1883 2342 1701 224 -192 -99 -256 -582 614 1153 314 -844 -763 -118 -54 -646 -1542 -1005 -444 -461 -316
19393 -316 -333 -312 -1152 -591 -938 -1444 -1502 -2566 -2255 -1626 -1907 -1246 -156 65 312 1975 959 970 2179
19374 2179 1190 461 67 275 1001 613 -854 -410 50 -87 248 607 448 -771 -842 -1394 -2014 -1671 108
19355 108 1567 1892 887 968 1836 2568 2267 2668 2709 2866 2028 854 1077 86 -38 493 -1352 -2383 -1602
19336 -1602 -959 -930 -1448 -1426 -950 77 393 216 -647 -341 -173 -258 -298 22 -125 -12 -69 -96 -729 86 295
19315 295 -324 -145 64 -277 -1135 -2507 -2224 -1366 -807 92 -351 -983 -1037 521 117 -576 -439 -797 -302
19296 -302 202 -625 -2832 -2531 -2924 -2616 -1598 -531 87 103 -531 -120 296 1227 2085 2064 1736 1473 986
19277 986 429 592 123 -298 -1410 -819 -774 -1050 -345 819 1529 564 -183 -1286 -2810 -2014 -1262 -845 -1781
19258 -1781 -1507 -504 1357 1484 806 939 -216 -978 -157 -377 147 71 -245 -809 -379 -189 -248 -505 -125
19239 -125 539 -18 416 -149 -868 -1024 -1627 -924 -1388 -2854 -2225 -1734 -1710 -1717 -1344 -1286 -91 522 427 1110 767
19218 767 148 117 -355 -918 -1762 -1313 -969 -463 1077 1417 1803 2816 2301 2223 2520 2120 539 293 508
19199 508 474 953 2041 2470 3369 4222 3895 4218 4434 3844 3853 4749 5336 6780 9959 13593 17801 22733 29186
19180 29186 34995 40146 44195 46672 47070 46195 44948 42319 37255 32610 28139 23215 18900 14980 11541
19165 11541 7913 7300 6093 5358 4311 3691 3378 2958 2769 1821 1534 2860 3275 2742 3401 2852 980
19148 980 -209 -263 -785 288 113 826 2329 1685 1758 2160 954 1240 1988 1272 1548 513 75 764 1081
19129 1081 1232 333 -916 -980 -400 663 812 337 877 1108 -50 -495 -1443 -1853 -2474 -1642 -350 -628
19111 -628 -533 -475 -397 -586 390 1563 2164 2044 1617 258 -938 -2261 -1690 771 1669 224 -747 96 311
19092 311 -1155 -1277 343 573 72 375 301 752 171 -316 -1206 -2414 -2523 -1535 -1094 -1238 -1261 -1392 -2014
19073 -2014 -2165 -1047 -409 -671 -214 845 803 -1500 -1446 -1493 -500 -552 -726 -847 -1953 -2234 -2221 -2344 -2628 -3228
19053 -3228 -2865 -2237 -1229 -640 -102 94 420 449 126 -273 412 1021 -58 -295 121 -573 -796 -579 -701
19034 -701 -1123 -1397 -999 417 -401 -801 -236 47 1007 711 -709 -1116 -130 1176 1634 1076 2028 1816 988
19015 988 -33 -1098 -1803 -1459 56 602 633 486 823 834 578 1091 -556 -2220 -903 -940 -268 -1018 -1088
18996 -1088 -930 -647 338 242 -544 -598 -315 540 749 1462 1786 1328 935 -167 -1913 -2586 -2416 -625 -399
18977 -399 -1195 -1360 -2219 -2209 -2218 -2388 -2662 -1804 -2373 -1230 448 -56 -341 -745 8 -781 -643 -884 -1704 -1266
18957 -1266 -1503 -1893 -1544 -1560 -847 76 -378 -982 -635 -437 -919 -1609 -1447 -1810 -2473 -1459 -1617 -1841 -2116
18938 -2116 -1479 -630 -567 228 455 -283 -231 -30 -1162 -1373 -454 -697 -725 -1135 -772 -2738 -3684 -1915 -804
18919 -804 789 959 155 -221 -811 -782 -40 -278 -1263 -2081 -948 -949 -1137 -213 624 1485 597 -72 491 1612
18899 1612 641 -144 -142 -548 -169 584 1174 1408 600 -1413 -836 -919 -2814 -3242 -3360 -2060 -1218 -1299 -1131 -1265
18879 -1265 -2445 -2089 -1962 -321 -144 -472 -86 -271 -1827 -2100 -755 724 1003 404 1028 1873 1736 2154
18861 2154 1829 1176 199 729 801 292 48 49 -311 304 449 -444 -339 -1183 -1296 -36 801 1105 672 700
18841 700 -1015 -1522 -735 -1062 -372 -92 202 -723 -1442 -1067 -297 134 411 369 -24 -752 216 201 564 2109
18821 2109 1556 357 -1855 -2357 -2093 -1459 -1741 -1015 -500 -927 -608 -1911 -2214 -1476 -1072 -784 -122 -36 -463
18802 -463 -766 -429 -713 -1123 -2070 -1370 -1440 -2597 -2106 -1459 -161 -301 1009 884 403 113 157 -226 120
18783 120 351 13 -1883 -1924 -2204 -1940 -1703 -85 1747 858 856 1807 1695 3278 6245 7147 6608 5373 3789
18764 3789 2418 2075 1351 271 -1402 -2649 -2514 -1686 -682 -161 -295 -694 -299 -1273 -1977 -2374 -2075 -1357
18746 -1357 -804 -1332 -3177 -3256 -1728 -291 -447 557 -846 -375 1050 1155 302 -10 -705 -706 -1109 -1471
18728 -1471 -239 -450 -1836 -1258 -538 -517 -1030 -1362 -329 -426 -317 -418 -1649 -1002 -503 -1210 148 1647
18710 1647 1386 -167 -481 660 394 338 42 -1453 -852 -593 -232 -127 -1007 895 1392 -592 -447 -30
18692 -30 460 1552 914 236 1082 1117 963 496 1380 1719 1835 2274 200 -1765 -2654 -1276 897 790 -140
18673 -140 -583 -836 -1557 -974 522 930 882 102 -1252 -1578 -1793 -1657 -524 554 -250 -890 -1146 -1281 -1347
18654 -1347 -1351 -2081 -2302 -598 151 -79 132 -793 -1981 -2318 -2081 -1578 -1798 -1175 -1948 -1261 -1364 -314 -430
18635 -430 -2008 -2784 -2148 -1644 -1986 -1688 -2383 -1902 -2078 -1786 -1041 -272 -1801 -2521 -2487 -3187 -3179 -2210 -972 -70
18615 -70 42 -8 -76 649 91 -35 555 165 1142 2539 2479 1760 382 -738 -1417 -2066 -2779 -2821 -3018 -2212
18595 -2212 -2016 -1843 -1531 -2513 -2388 -869 -358 -678 403 1375 1353 1000 1699 769 -483 318 1375 403
18577 403 -278 -575 -1822 -2302 -1720 4 86 722 813 367 -15 163 1611 2756 1887 1667 557 -1113
18559 -1113 -2698 -2237 -1007 -1519 -2072 -1899 -1797 -1856 -1141 -3 -307 -1272 -442 -598 -1780 -2152 -2464 -1650
18541 -1650 -1870 -1524 -496 383 -514 -1855 -1834 -1112 -1226 381 879 556 118 638 310 -300 -1133 -834 -439
18522 -439 -1591 -473 403 199 488 642 1276 1798 1126 -75 -974 -1380 -1323 -2319 -2017 -421 -1610 -2310
18504 -2310 -159 203 -819 -131 1413 1197 327 204 -158 -596 -739 -2023 -1584 321 1311 2124 1384 291
18486 291 -562 -404 -1831 -2008 -2100 -2456 -1233 -457 -124 -949 -919 -2127 -1978 -1689 -1758 -2137 -732 -359 -567
18467 -567 -61 -1798 -3604 -4268 -3278 -2393 -1232 203 491 157 685 -1184 -2435 -2817 -2576 -620 311
18450 311 -434 -1123 -764 156 -789 -954 -1287 -999 -1422 -1367 -1028 -479 -994 -1281 -730 -1112 -1583 311 1353
18431 1353 581 705 1570 280 -618 -906 -1092 -1051 -910 -981 253 244 -354 278 -47 -306 -452 -1361 162 2
18411 2 -795 275 238 642 129 222 935 697 -1365 -593 577 -199 -1753 -1932 -1770 -1340 -1355 -717 -81 -577
18391 -577 -187 473 1005 732 -530 -1847 -1133 153 207 -464 -607 -217 -852 -761 -604 -119 788 1717 1600
18372 1600 3354 3911 2825 1895 2338 2212 2975 3169 2383 1871 597 -755 -1897 -1442 -138 -229 -566 -548
18354 -548 32 1736 3156 1762 1457 1844 1357 1822 1827 457 -531 -1312 -1550 -743 -71 43 565 859 207
18335 207 -241 -262 -509 -1097 -2246 -2127 -2509 -702 -122 -1193 -861 893 2499 2572 1867 1452 303 538
18317 538 1567 765 263 431 1150 1375 493 1226 1756 2250 2812 1590 -430 -1318 -1218 -1621 -2186 -2061 -1725
18298 -1725 -2058 -1364 -173 -321 -593 -405 -1441 -1707 -807 -924 -1999 -766 -1993 -2228 -1056 -260 -386
18281 -386 -608 -412 693 657 -360 -646 1187 1176 788 220 -631 68 -557 -35 595 -69 -1243 -559 590
18262 590 1302 549 -462 -720 254 724 1896 2842 2980 2385 2168 1950 1694 1716 2185 2058 2285 2639 1504
18243 1504 20 112 602 1131 548 1120 906 -17 -472 219 434 184 626 2252 2157 974 457 -133 98
18224 98 248 -636 -939 -944 541 439 415 77 216 -394 -1151 -1113 -1105 -1276 -1208 -460 78 -773 54 487 1549 1830
18202 1830 2274 2777 2621 3046 1439 218 -575 253 828 504 340 881 1979 2684 3214 1764 2162 1828
18184 1828 1636 2497 1968 1347 1226 835 434 1799 2933 2321 1670 2020 2187 2115 1804 1841 1465 1978 3094
18165 3094 2892 2804 2703 3092 3365 3371 3793 3925 3121 2059 1956 2760 3838 4280 5039 5594 5772 5084 5685 5972
18145 5972 5075 5997 7733 7864 7940 9180 8989 8314 8248 9286 8926 9173 10084 12518 13885 13835 15125 17015
18127 17015 19136 22420 26432 31364 36276 39998 42895 46535 50515 56722 66263 79264 95115 117772
18113 117772 149582 201673 284440 440353 765198 1283734 1662695 1631874 1414370 1108176
18103 1108176 800414 560340 398136 290789 216263 164562 127339 99189 77429 62336
18093 62336 51469 43245 35587 28902 23485 19288 15174 12760 12827 11696 10857 8687 9394 9339 8041 7705
18077 7705 5819 3653 2534 2209 2523 3541 4289 3408 2640 3366 3977 3388 1800 2007 4075 4466 3502
18060 3502 2401 744 296 430 842 1668 1181 606 1273 1906 1680 1505 1093 1595 757 607 545 142 285
18041 285 290 268 684 825 422 -77 -167 -61 1156 1618 1579 961 1125 1859 2392 1721 1063 312 913 1285 1138
18020 1138 2587 3692 2574 1603 1295 281 -984 -1193 -1800 -1397 -348 -209 -1035 -1042 -1194 -201 -283 -488
18002 -488 -321 279 -232 -1242 -587 752 1100 1176 150 -1156 -930 858 2349 2592 2732 2329 2400 1478
17984 1478 1209 1496 2494 2776 2149 1329 1227 194 717 635 -375 -176 142 -276 -1579 -1943 -2594 -2054 -1253
17965 -1253 -106 1598 1003 356 -175 -277 -722 -910 -761 326 698 -249 -781 274 162 -3 2040 2599
17947 2599 626 -16 965 654 1298 1218 1036 861 1993 1668 1612 2132 981 -553 -851 -41 -686 -1887
17929 -1887 -1836 -1680 -1687 -1858 -2040 -1975 -2440 -1722 -285 647 -496 -755 363 495 645 1407 1390 776 362 -85
17909 -85 -162 12 -230 -1009 -1391 -667 324 -645 -1435 -40 1264 542 -831 -997 -766 65 1459 1611 1542
17890 1542 1310 1530 496 -438 -447 1010 2034 1595 1455 84 -1303 -2746 -2482 -1960 -2690 -1833 -766 -1149
17872 -1149 -1224 -812 465 452 -383 -1740 -1640 -1390 -1312 441 894 1833 2269 2750 2629 3208 2798 1752 1959
17853 1959 2463 2245 1958 2056 1154 1496 2158 2389 1446 183 -1050 -425 218 139 -1021 -1256 -1509 -1650 -1635
17834 -1635 -1497 -206 890 -462 -768 814 1677 663 877 1570 1251 605 807 634 1062 1494 2051 2339
17816 2339 2735 2721 3242 3753 4064 5697 5698 4551 2934 2452 3162 3826 2650 1552 528 67 79 -552 -161
17797 -161 427 -295 -764 -711 -323 200 -60 -74 -1039 -902 -28 -1308 -2556 -827 -541 -843 -1220 492 1363
17778 1363 1928 1398 1131 920 -562 -1186 -1594 45 1068 1286 -273 -460 62 28 -163 402 1170 1143 1255
17759 1255 1644 3024 3079 2344 2493 2690 3486 3824 3523 3674 4440 4594 4672 5983 5774 5400 5611 4688 3828
17740 3828 3820 2979 3580 4776 3647 2490 2348 535 0 92 -152 315 131 733 489 391 821 2031 2467
17721 2467 1750 2174 3095 2060 2097 2451 1539 2313 2799 2333 1514 734 962 1447 2218 3577 4176 3242 2603
17702 2603 1781 1424 2619 2780 2725 2016 1812 1935 2715 3149 2662 1312 398 837 1483 1990 1803 651 571
17683 571 564 958 1392 776 -124 335 -171 -1275 -1609 -895 -981 -1415 -879 -328 531 419 133 103 57 -1046 -876
17662 -876 1146 1504 1343 748 -33 -384 -1047 -2581 -1440 -599 368 632 1695 1026 220 -3 314 1057
17644 1057 527 625 -7 275 107 77 -350 45 -30 -2 1295 577 -180 -869 -780 -144 -139 -399 -78 -761 -672 -1601
17622 -1601 -867 -203 55 -951 -731 25 1438 982 -365 -1476 -1355 -2203 -2374 -1340 -305 23 -289
17605 -289 -662 -321 -773 -791 -820 -1431 -945 -345 174 -43 641 515 -540 102 1042 510 466 858 -680 -926
17585 -926 -1218 -1450 -1190 -1138 -1126 -999 -402 -371 -2499 -3195 -2278 -2331 -1618 -757 -514 -1106 -1142 -745 -337 143 -123
17564 -123 -1158 -1493 -1047 15 858 863 742 407 -368 -59 -473 -1832 -2059 -1039 885 1396 146 -606
17546 -606 201 690 510 859 1739 1173 -248 1030 1923 1174 64 50 -249 -264 -1428 -1701 -382 1017
17528 1017 1873 1407 118 -1130 -1247 -1194 -1699 -2217 -2075 -1530 -1562 -805 -883 -799 -21 1076 479 -741 -1366
17509 -1366 -692 265 -1416 -1703 -1779 -880 -1832 -1925 -695 -298 -394 185 -197 242 1130 530 725 153 -1152
17490 -1152 -1544 -1493 -563 -279 623 845 -112 -969 -1531 -772 417 -148 -1310 -2627 -2182 -1638 -986 -254 -65
17471 -65 81 -103 -192 30 1209 567 -487 44 -714 -1016 94 835 314 -107 -184 -85 97 -664 -758 368
17451 368 1112 1711 1408 1427 243 -824 -421 725 1313 2099 3867 3808 4691 6546 8485 8635 7704 5328
17433 5328 1762 -211 -424 -920 -2143 -1798 -1118 -614 -222 127 -220 -2567 -2789 -479 613 76 121 167
17415 167 255 461 1217 1353 743 1566 1551 1699 999 577 -1057 -1543 -1069 -328 1 -478 -1183 -2492 -2997 -2770
17395 -2770 -1954 -1080 -790 -687 -1185 -1304 -2 267 -45 580 489 -731 -1144 -1875 -2274 -1232 -192 -880
17377 -880 -1403 -345 1000 -743 -1629 -1602 -1679 -908 -981 -1907 -2247 -2363 -2614 -2705 -2044 -1354 -464 -753 -1081 -619
17357 -619 215 -812 -1702 -1086 -657 -565 296 -1069 -1771 -1755 -1052 -2607 -3453 -2476 -2536 -2357 -1731 -1544 -2603
17338 -2603 -2145 -1645 -1220 -584 -650 -460 -615 -599 -365 -1508 -1999 -213 464 -575 -475 -1237 -145 620 506
17319 506 -292 -424 -711 -1074 -285 -479 -1538 -1100 474 196 -533 -1032 -616 -661 -1464 -640 -796 -869 -855 -50
17299 -50 -497 -1279 -931 -543 43 -429 -83 900 521 484 882 1582 -152 -1477 -1283 -881 -1035 -1019 -414 -47
17279 -47 -168 -747 -1341 -483 -1283 -1092 -1247 -889 -1021 -1011 -1818 -2804 -1968 -1020 -989 -1536 -895 -1596 -2411 -1145
17259 -1145 -606 288 662 -890 -1561 -1830 -1444 -1632 -2216 -2781 -917 399 -352 608 1414 770 189 -715
17241 -715 -1207 -392 42 -333 -1732 -2261 -853 -304 118 51 -131 -363 -140 -887 -1534 -1421 -821 -772 -643 483
17221 483 201 248 1282 1041 -832 -571 -243 -215 -1347 -2136 -2684 -1470 -891 67 517 -163 767 -162 -647
17202 -647 -366 -1598 -1913 -1328 -2079 -2512 -1466 -609 -101 -950 -2422 -1895 -2333 -1776 -551 249 746 1297
17184 1297 1553 193 -651 -1297 -1345 -1259 -1389 -1076 -1059 -1320 -926 -1476 -1944 -2797 -1707 166 177 -355 16 202
17164 202 -1499 -2435 -2752 -3783 -2024 -1026 -434 -127 -1026 -1702 -1867 -2741 -2290 -1915 -2387 -3632 -2757 -1913
17146 -1913 -1841 -1971 -2604 -3030 -3480 -4099 -3896 -3287 -2570 -1636 -2252 -1730 -1070 -541 274 -603 -1510 -246 -368
17127 -368 618 1426 670 -518 133 821 325 -1237 -2680 -3880 -4918 -4615 -4048 -3286 -3609 -2418 -597
17110 -597 47 -258 291 595 25 -1024 -1416 -2219 -2429 -1411 -1434 -2615 -2660 -2319 -1848 -1974 -1510 -119 1465
17091 1465 1164 1245 1535 1127 -353 -1464 -2837 -3176 -3381 -3346 -3177 -3107 -2143 -907 -1591 -1422 -2210 -2074 -2168
17072 -2168 -1352 -1477 -2411 -2894 -3033 -3298 -3421 -3466 -4259 -3902 -3709 -3898 -3075 -2599 -1786 -1634 -983 -2077 -2354
17053 -2354 -2291 -1227 -993 -1609 -1841 -1565 -2747 -2359 -2184 -3807 -4438 -3238 -1227 88 -393 -1479 -1326
17036 -1326 -1205 -1521 -1186 -1295 -821 279 -1053 -1922 -931 -1469 -2198 -683 -657 -865 -1353 -603 -1476 -2526
17018 -2526 -2161 -400 -885 -2506 -2512 -2376 -1778 -1968 -3339 -2437 -2080 -1767 -203 -319 -956 -1541 -1026 -1444 -1112
16999 -1112 302 -592 -725 -1850 -2146 -2089 -2188 -3061 -2204 -1374 -1868 -1669 -1240 -305 -662 -1559 -2096 -2181 -1911 -1889
16979 -1889 -1695 -985 115 -580 -2055 -2223 -1103 200 -935 -989 -1383 -1691 -2586 -1322 188 -468 -2804
16962 -2804 -2717 -2738 -2784 -2569 -1645 -2490 -1279 -1132 -1875 -1632 -1339 -671 319 -40 -295 -639 -618 -1159 -1858 -870
16942 -870 -839 -646 -990 -1695 -1328 -729 -1013 18 54 -585 -707 -912 -1797 -1381 -6 305 260 -1441 -1634 -1888
16922 -1888 -597 759 486 1357 2037 1023 1048 1365 2406 1983 337 -940 -1399 -691 -949 -1523 -1723 -1665
16904 -1665 -1353 -1687 -2384 -1405 -186 -165 -1155 -1688 -1414 12 -3 283 815 877 -40 -1345 -1595 -1927 -2217
16885 -2217 -1437 -1525 -2756 -2271 -2167 -1808 -1453 -1308 -963 -1729 -616 267 -633 -967 -294 -1572 -2571 -2154 -2444
16866 -2444 -3448 -3503 -3559 -2516 -1818 -1621 -2824 -3534 -3483 -3306 -1877 -1250 -2561 -3846 -3560 -3415 -2763 -2618
16848 -2618 -3408 -2838 -851 466 1079 1558 721 82 552 -479 -2174 -3002 -2930 -2992 -2058 -2189 -4002 -4791
16830 -4791 -3719 -2065 -1829 -2543 -1979 -2380 -2423 -3112 -2628 -1751 -1221 -533 -115 -941 -1240 -1279 -2637 -2665 -2471
16811 -2471 -3085 -2991 -3955 -4749 -3212 -2013 -1727 -2793 -2492 -1729 -1039 -1571 -2072 -2668 -2645 -2283 -381 609 -711
16792 -711 -1628 -2176 -2747 -2140 -1994 -1792 -2028 -1452 -506 -827 -1647 -2178 -1976 -567 1008 1042 287 -259 -1032
16773 -1032 -974 -588 -753 -1225 -1414 -2445 -2871 -1956 -1341 -1125 268 -828 -2387 -2796 -3398 -4388 -4252 -2911
16755 -2911 -2345 -2984 -2341 -1646 -1245 -1720 -1887 -1775 -1431 -841 -1421 -1526 -731 -1489 -2047 -1787 -2196 -2507 -930
16736 -930 -545 -1519 -1153 29 -132 -1519 -2831 -2517 -356 127 -445 -1096 -1923 -1428 -282 -708 -2390 -3025
16718 -3025 -1436 -1494 -1547 -1892 -2551 -3313 -3097 -1788 -1510 -1453 -2529 -3565 -3369 -1698 -865 -1515 -2315 -1849 -1286
16699 -1286 -1643 -1608 -3050 -2539 -1818 -2589 -2536 -2620 -2101 -1362 -2304 -2459 -2366 -1992 -3157 -3768 -3073 -904 -611 -409
16679 -409 -396 -840 -2142 -2174 -3041 -3278 -2626 -2874 -3370 -2756 -1599 -1231 -1549 -1228 -1347 -1619 -1206 -2076 -2422 -2109
16659 -2109 -2336 -2908 -1356 -294 550 541 -464 -1340 -2076 -2181 -1437 -1271 -438 532 944 670 884 749 783
16640 783 612 -431 -775 -132 -43 662 1039 1962 2602 2797 1902 216 -254 193 -145 -54 -534 -1044 -1033 -1079
16620 -1079 -963 128 -362 -848 -1712 -913 -340 -786 -901 -1207 -1877 -1527 -332 -808 -1884 -2268 -1996 -2654
16602 -2654 -2672 -2697 -2345 -2252 -2960 -3487 -2639 -2987 -4186 -3016 -741 40 -1142 -1934 -1467 -992 -726 -1689 -1325
16583 -1325 -332 -898 -1394 -2433 -3046 -3244 -2170 -1560 -1182 -439 -1144 -1568 -1204 -2175 -1808 -1997 -1421 -747 -116
16564 -116 -288 -887 -561 664 983 665 -612 -1875 -2436 -1158 670 565 479 257 697 -323 -1360 -2765
16546 -2765 -2258 -2453 -2830 -2405 -1720 -455 141 87 -1346 -1919 -2016 -2618 -2047 -432 -847 9 299 -1147 -1822
16527 -1822 -498 34 95 -1141 -1496 -1190 -1176 -2342 -2899 -3002 -2924 -3496 -2799 -1787 -2760 -3870 -5185 -4637
16509 -4637 -3738 -2468 -1449 -475 -1127 -1804 -1585 -1816 -792 -1520 -2168 -1469 -1401 -1653 -512 -909 -2357 -2992
16491 -2992 -2665 -2363 -1597 -969 -277 -1257 -1591 -1371 -1267 -1057 -1413 -2115 -2163 -965 -65 -466 87 -959 -1616
16472 -1616 -1838 -2615 -2179 -1322 -378 -404 -428 -476 -64 -1098 -1774 -988 -1987 -2555 -3519 -2675 -1837 -1554 -910 -580
16452 -580 -483 -471 -652 -487 -1020 -897 -1906 -1966 -1537 -494 -1276 -1467 -1806 -3194 -3144 -2560 -2275 -1610 -170 715
16432 715 -77 -1691 -1886 -2445 -2941 -2145 -2712 -1570 -924 -1154 -1504 -2601 -3255 -2859 -2471 -1560 -789 -447 458
16413 458 1725 1282 -1305 -1984 -2398 -2253 -1739 -1196 -214 684 982 -335 -739 1 -1193 -2056 -1949 -2177
16395 -2177 -1863 -1961 -1798 -799 270 -344 103 702 376 -112 -120 1179 519 -1554 -2544 -1181 -26 -381 -1725
16376 -1725 -2541 -2706 -3245 -3002 -1494 -1008 -1162 -1008 -1440 -1399 -2003 -2760 -2444 -2072 -1871 -1759 -2863 -2693 -2095
16357 -2095 -1499 -1303 -1795 -2107 -1776 -1539 -1792 -2154 -848 -1221 -994 -815 -763 -1917 -3111 -3021 -1993 -792
16339 -792 -364 -320 -985 -1670 -2355 -1765 -1239 -584 53 639 227 -670 -1367 -3721 -4230 -3009 -2770 -2459 -1846
16320 -1846 -1852 -1294 1 351 -1221 -2808 -2609 -2265 -1974 -2004 -1997 -1232 -798 -1227 -1613 -2175 -1569 -1303 -882 368
16300 368 336 -866 -1104 -1007 -225 1092 491 -686 -1356 211 -651 -906 -1594 -949 -501 -92 341 -329 -599
16281 -599 -588 -2102 -3689 -4100 -3910 -3661 -3205 -1818 -711 -1720 -2540 -2678 -2409 -2329 -1869 -940 -1427 -1905 -1928
16262 -1928 -1709 -1807 -1897 -976 -20 317 -883 -1174 -961 -1427 -1403 -1592 -1700 -1695 -1 577 -565 -538 -544 540 697
16241 697 701 -2053 -3275 -3203 -2994 -2373 -1235 -986 -1133 -2021 -1267 -1255 -1279 -1386 -1744 -2230 -2971 -2859 -1410 -579
16221 -579 -434 -166 -791 -1706 -2512 -2833 -3408 -3488 -3328 -1711 -1564 -1886 -2732 -2840 -2306 -1576 -931 -1701 -3374
16202 -3374 -3301 -3091 -2157 -2300 -1955 -2340 -1904 -2166 -3244 -3173 -1826 -2748 -2960 -2866 -3708 -3279 -2978 -2229 -530
16183 -530 -1612 -3181 -4291 -4025 -2508 -2061 -1489 -953 -915 -336 -1387 -3179 -2862 -1476 -2140 -2959 -3303 -2349
16165 -2349 -535 -955 -1724 -1653 -2210 -3065 -2835 -2992 -3171 -2296 -157 360 -168 -1615 -2305 -1482 -2277 -2787 -2513
16146 -2513 -2915 -2145 -773 -13 -571 -1575 -1013 -823 -464 -1596 -1723 -2518 -1942 -1960 -2808 -2895 -3211 -3473 -2119
16127 -2119 -1953 -1685 -1312 -1789 -2389 -3022 -3380 -2713 -2700 -596 1091 453 -1050 -1376 -1651 -1965 -1491 -1815 -1080
16108 -1080 -180 -1825 -2248 -2139 -2569 -1529 -958 -822 -1389 -2108 -3279 -3018 -2849 -2214 -1545 -1211 -2086 -2047 -1473
16089 -1473 -2504 -2817 -2945 -2882 -3650 -2690 -1897 -1616 -1531 -538 -369 -792 -2196 -3261 -3558 -3748 -3160 -2946 -1948
16070 -1948 -1203 -1119 -1384 -2226 -2438 -1409 -1121 -2834 -2960 -2062 -961 -621 -1663 -2376 -2605 -2567 -2817 -2238 -1341
16051 -1341 -1314 -1313 -2727 -3054 -3201 -4182 -3711 -2558 -2057 -1936 -1867 -2497 -2553 -2493 -2937 -2219 -2567 -2830 -2155 -1367 -1627
16030 -1627 -1769 -2483 -3207 -2717 -2873 -2530 -2270 -1851 -1876 -2325 -1753 -1070 -1039 -1972 -2207 -1136 -953 -139 -247 -235
16010 -235 -1008 -1745 -1975 -2389 -2459 -1254 -710 151 831 1808 1971 1227 152 -139 -1094 -1340 -1815 -1767 -830 378
15990 378 -24 333 170 -728 -22 795 821 -516 -1314 -1317 -988 -839 -1646 -1731 -1664 -1633 -2076 -2698 -2624 -1407 -1217
15969 -1217 -976 -1071 514 483 -749 -1448 -1749 -2179 -3162 -3991 -3766 -3386 -2185 -1634 -1807 -1310 -1766 -3193 -2867
15950 -2867 -2570 -2804 -1515 -715 -1260 -2202 -3060 -1624 401 1719 -136 -832 -1191 -2335 -2303 -2624 -2312 -2013
15932 -2013 -1935 -2853 -2392 -1619 -1502 -406 150 513 127 -721 -1131 -1331 -2247 -1889 -1429 -892 -788 -191 -198 -952
15912 -952 -1297 -1604 -1971 -2264 -2442 -1784 -2092 -1704 -1140 -885 -544 -2 -548 -550 -1462 -1377 -651 -1144 -1744 -2459 -3420
15891 -3420 -3093 -3083 -3052 -2324 -2686 -2984 -3493 -3671 -3642 -2474 -2105 -2895 -3384 -4010 -3014 -1831 -970 -632 -846 -1860
15871 -1860 -613 -1561 -2437 -1754 -1245 -1175 -2172 -2571 -1726 -1350 -1587 -401 -612 -142 -964 -913 -1398 -2169 -2304
15852 -2304 -2338 -2176 -1597 -92 178 -837 212 -186 181 -501 -1053 -1408 -1419 -551 2 -681 -699 102 125 -1582
15832 -1582 -2491 -1670 -675 -576 -681 -1044 -1603 -2446 -3011 -2471 -3533 -2989 -2303 -1327 -1603 -1850 -1840 -1960 -2807 -3311
15812 -3311 -1865 -553 -57 -879 -1639 -2028 -2952 -2965 -1500 -1967 -2021 -2015 -2540 -3612 -3410 -2258 -1832 -2009 -3151
15793 -3151 -4004 -3814 -2692 -2313 -2133 -2563 -3397 -2396 -1688 -1038 -362 -1242 -2087 -15 1137 429 -1109 -1545
15775 -1545 -1000 -1894 -1922 -1736 -2295 -1213 -2209 -2565 -209 451 -743 -895 -1381 -2298 -2155 -1600 -2952 -3097
15757 -3097 -2592 -2158 -1132 341 623 -515 -1189 -713 -691 -1389 -994 -815 -939 -2008 -2054 -1093 -774 -671 -146
15738 -146 -414 -227 487 -541 -156 -487 -827 -920 -681 -373 -820 -1205 -1631 -1547 -1747 -1291 -268 -521 -462 766
15718 766 324 -751 -1305 -930 -1280 -825 -1450 -984 -391 -1041 -493 -709 -834 -1063 -2046 -2158 -2004 -2169 -2787
15699 -2787 -2086 -1531 -1323 -1105 -352 -727 -697 159 -928 -1553 -1334 -900 -973 -1739 -1667 -761 211 118 1331 983
15679 983 1217 536 -751 -677 -480 -907 -459 331 -867 -1163 -619 -912 -1582 -1770 -2067 -2087 -2380 -1937 -1061 -614
15659 -614 -409 -382 -1225 -1521 -1197 -1542 -724 -165 333 288 -35 97 237 210 712 -326 -1328 -2699 -2266 -883
15639 -883 -706 -408 -243 -1632 -3025 -3529 -1922 -1085 181 -234 -957 -816 -384 -1116 -1227 -2205 -3322 -3651
15621 -3651 -3910 -3706 -2454 -1034 1306 511 -144 275 -120 -690 -1796 -2512 -1789 -21 943 -3 -1222
15604 -1222 -1597 -2365 -3022 -4075 -3037 -1651 -964 -1107 -1173 -1759 -548 -803 -359 389 245 395 -275 -1611
15586 -1611 -82 549 992 -67 -364 355 -586 80 421 -884 -839 -111 470 -317 -1574 -2160 -2561 -1690
15568 -1690 -1283 -1524 -1436 -344 -495 -1220 -605 564 -12 306 373 -101 -263 170 -51 -456 -355 -168 -593
15549 -593 -1105 -1215 -1030 -678 -368 134 -1285 -2564 -3385 -2403 -2066 -2210 -2252 -2053 -1238 -1051 -1214 -1084 -329
15530 -329 -741 -868 -43 -250 -680 -1303 -1515 -1960 -1719 -637 -1302 -1032 -988 -1327 -1884 -4075 -3539 -2919 -2596
15511 -2596 -3173 -3404 -3332 -2198 -417 -837 -2459 -2655 -2961 -2010 -1477 -1893 -2337 -1744 -416 -667 -867 -1656
15493 -1656 -964 -209 879 1452 54 -1246 -1786 -1515 -1871 -1969 -550 -507 -1715 -1980 -730 63 -541 -859
15475 -859 -1932 -2108 -1242 -1048 -687 -2202 -3284 -2643 -2763 -1787 -515 -1097 -1964 -2325 -1136 291 310 988
15457 988 -45 -1545 -1978 -2590 -2575 -2090 -902 -392 -284 552 527 -1426 -1527 -2798 -3086 -1607 -197 1231
15439 1231 1110 34 -1120 -1328 -1347 -580 -1432 -1457 -2343 -1783 -196 1523 1051 -418 -1396 -1623 -1628 -2435 -1769
15420 -1769 -2094 -1942 -1002 -1248 -2204 -2124 -1541 -1713 -751 429 223 -799 -1415 -1791 -2182 -1927 -2023 -2619 -3569
15401 -3569 -3306 -3222 -2534 -2716 -1752 -1010 -848 -1262 -2055 -3070 -3965 -3022 -1372 -468 -759 -468 -71 951 1326
15382 1326 319 -1249 -2175 -1975 -231 533 -440 -417 -337 -34 909 928 125 34 -287 523 444 359 -460 -483 -468
15361 -468 -302 -1855 -2726 -1826 -1482 -1290 -589 -452 -557 -156 14 -194 -111 -611 -808 317 262 564 -250 -792
15341 -792 403 678 709 933 845 -1012 -1513 -1092 -1499 -1126 -567 -1253 -1083 -325 76 -1066 -1750 -1870 -532
15322 -532 381 420 627 1626 2470 1144 594 223 2698 2337 1369 493 -607 -682 561 880 1226 1781 2032
15303 2032 862 363 1404 1522 158 -698 -595 -932 -2195 -2063 -1090 -1163 -980 -1903 -2124 -902 -1262 -1765
15285 -1765 -1093 -986 329 387 418 704 21 -1407 -1166 -187 -579 -231 -862 -415 194 -920 -2546 -1939 -2071
15266 -2071 -2098 -1562 -1060 -1717 -1774 -2264 -2592 -2469 -2019 -1133 -1131 -457 472 683 255 140 -1632 -2480 -1882 -1302
15246 -1302 -477 -126 -568 -1141 -1329 -1059 -1301 -1956 -1680 -2095 -1288 -653 -1056 -118 1696 1998 619 -60 522
15227 522 711 393 1051 1424 1565 1459 -87 -806 -1175 -1508 -1510 -2552 -3262 -3594 -3056 -2677 -2181 -1982 -1013 -1453
15207 -1453 -1664 -1132 -611 -621 -889 -1601 -1865 -1662 -1534 -1644 -1413 -1748 -2263 -2184 -2679 -3035 -2152 -2196 -1128 -509
15187 -509 -823 -886 -1221 -1141 -1285 -444 897 -21 -939 -204 1163 956 1203 1567 1346 145 871 408 -1473
15168 -1473 -1316 -44 -197 -264 -46 66 344 121 -1006 -1693 -1888 -2155 -2043 -1083 -519 -992 -683 136 -862
15149 -862 -842 -228 -26 375 377 -886 -954 -1722 -1273 -1579 -570 -256 -1181 -1710 -2166 -3172 -2426 -1268 -668 -1736
15129 -1736 -2224 -2532 -1510 -1249 -556 -204 -187 681 1027 18 -851 -1360 -564 -461 143 -275 -565 -512 -508 -1655
15109 -1655 -1947 -901 -527 -1245 -1437 -1180 -2363 -3447 -677 714 561 1155 1138 634 1428 778 272 506
15091 506 321 690 399 -187 -403 1191 1195 380 -334 -804 -1371 -900 -1152 -888 708 2142 1328 1235 851 1883
15071 1883 2563 1700 2259 2559 795 -657 -1022 -1417 -1555 -329 1634 1841 1176 503 -726 -1210 -1935 -1442
15053 -1442 211 511 -970 -1367 -1311 -1268 -504 -823 -1238 -317 -750 -839 -1786 -2628 -1778 -1578 -814 680 66
15034 66 -840 -1249 -609 113 699 339 319 1325 1026 403 -185 -495 -551 -420 -440 -738 167 337 1441 1908
15014 1908 2076 2101 2564 1350 1860 1887 1417 797 1669 1130 826 1190 668 1600 2013 1840 1346 643 1524 1976
14994 1976 2802 3781 3229 2087 695 1428 1851 148 -1079 -696 -446 -1012 -987 -851 68 984 1175 340
14976 340 1040 1740 941 -164 -4 -738 -1321 248 175 -467 -271 5 462 186 85 -7 288 1773 3170
14957 3170 2717 944 -810 -37 2453 2718 1355 -733 -1348 -1909 -2126 -2949 -3103 -2815 -1962 -152 252
14940 252 -118 -1250 -1337 35 -936 -1501 -191 364 -9 -283 26 647 2764 1971 817 344 470 -15
14922 -15 -1552 -1699 -633 21 595 1111 388 -299 -1412 -803 -4 119 -538 -1275 -1988 -917 -412 -805 -490
14903 -490 -1300 163 439 798 -560 -1003 -1350 -1732 -1962 -1437 -1072 -910 -973 -1655 -1712 -1320 -1824 -1064 -1020 -885
14883 -885 -309 -450 -142 277 440 -415 -1293 -1337 -1951 -1037 -948 -1184 -825 -779 -1480 -859 254 -63 -811 -1004
14863 -1004 -1163 -1077 -768 -463 -616 -584 -223 -760 -1412 -1817 -1633 -687 -197 56 -149 -784 -1082 148 -873
14844 -873 -1541 -1010 -1676 -1902 -2855 -1851 -574 231 -954 -1464 -1161 -921 -1765 -1931 -1928 -1583 -913 -1195 -1679
14825 -1679 -2296 -1297 151 -287 44 59 490 693 1890 1335 261 351 -642 307 1435 1492 1441 575 710
14806 710 -38 -840 -405 240 170 -170 -767 -849 -1348 -1370 -164 -21 -264 -914 -1663 -110 580 1398 1832 1250
14786 1250 940 762 -799 -852 -383 -444 -708 -1352 -1075 133 267 -504 -1588 -1401 -845 -443 422 150 1115
14767 1115 1721 2098 1743 1238 840 -672 -873 -607 -1592 -2187 -3042 -689 459 -1292 -2613 -1139 -363
14750 -363 -376 -756 -2719 -3755 -3017 -1082 -263 -498 98 -303 -1156 -651 1252 1109 1270 513 -718 -1103
14732 -1103 -786 -898 -180 -637 -981 -2112 -2068 -2244 -2369 -1706 -867 -53 394 407 1054 1055 -571 -254 21 -1032
14712 -1032 183 1841 1671 208 -1013 -81 -684 -602 1107 2282 1696 621 241 570 184 -376 -652
14695 -652 -1276 -991 -1413 -1743 -1142 -822 -156 -604 -1219 -997 -125 1094 1414 926 782 555 -509 -1154 -963
14676 -963 -220 -695 292 1442 1039 474 210 308 649 435 895 765 1045 2499 1800 906 729 318 -2
14657 -2 -766 -744 910 1307 223 -870 -1524 -2387 -2115 -1162 -1803 -988 -1200 -429 -34 -303 499 233 601 1262
14637 1262 1300 584 247 741 1113 1757 2196 1202 1080 -124 1039 1580 1420 747 320 343 660 728 680 446
14617 446 309 -876 13 628 564 147 -1006 -2116 -1875 -2710 -2554 -1008 332 362 814 258 -162 -509 -1320
14598 -1320 -1135 -471 11 469 -100 -148 0 578 1415 1168 1847 1899 692 513 192 -26 -73 240 793 1322
14578 1322 782 727 522 1013 -53 -796 -261 1085 866 841 937 -1320 -1679 -1889 -1520 -641 699 1044 427
14559 427 -5 -727 -2621 -2041 -2108 -2259 -1128 -636 -748 37 460 -255 -701 -1701 -1518 -381 511 1326 2240
14540 2240 676 -892 -317 922 1351 1654 1530 1116 493 -1312 -1291 -1615 -841 513 -201 -582 -800 -122
14522 -122 -203 -486 -661 21 669 244 -1392 -969 95 718 -229 -114 -65 741 714 170 130 -865 -641 -157
14502 -157 701 1313 499 -162 -1491 -1657 -794 -111 260 774 2043 3070 1326 299 573 1214 579 253
14484 253 393 922 662 255 419 -139 110 662 -460 -291 158 401 1231 910 205 478 365 346 252 -204
14464 -204 14 -39 432 1044 799 1337 722 195 -827 -273 -18 179 1244 1364 1077 774 1063 1496 563
14445 563 232 189 463 -582 -1056 -1462 -78 1540 2708 3645 3898 2146 1158 2406 2545 2028 1672 950
14427 950 615 1171 2474 1350 -317 422 251 -48 883 1125 372 575 1030 1756 354 353 446 -1159 -1191
14408 -1191 -1158 -1163 -717 -228 191 1228 -146 989 2166 1900 537 -506 -1139 -1314 -636 -478 -42 515
14390 515 877 -269 -375 -1217 -1249 -1155 343 821 1160 1936 2179 1799 2271 2515 3314 2927 1835 391 -830
14371 -830 -1101 -1220 -1798 -2308 -670 -346 -697 -4 18 -352 161 1503 1790 1706 1261 1345 1144 859 1464 2007
14351 2007 1718 2249 2471 1760 1538 1680 1553 589 -78 323 30 -126 467 1005 237 -37 204 572 1029
14332 1029 86 312 1901 2337 1545 -116 767 819 277 -376 561 1428 1516 602 316 1065 726 803 476 582
14312 582 2023 1365 681 1769 1921 1325 728 1396 1438 771 1490 2600 3188 2792 2242 1462 1281 1363 591
14293 591 1082 279 -46 -356 -643 -1061 -783 -650 -98 360 1377 528 -1312 -2294 -2019 -465 -525 -698 562
14274 562 1519 813 600 40 -329 -581 561 1375 904 1070 1439 2188 1265 409 363 222 72 -125 -693 -1305
14254 -1305 -434 255 622 950 364 223 -229 60 607 -397 -770 -488 -552 -569 -1621 -1133 705 804 1744
14235 1744 1015 -34 482 1756 1834 1855 1199 1948 1684 661 252 730 1122 939 600 719 871 -401 -527
14216 -527 446 -40 -385 -1196 -742 -405 -899 -1132 -387 -295 521 1064 1131 853 1660 2346 1731 851 294 129
14196 129 1082 1259 1515 809 964 1226 1179 378 1136 1317 1471 2833 3138 2621 621 256 1500 1834 2521
14177 2521 3083 2677 1953 2677 3188 2158 1688 874 781 328 97 -941 -509 536 849 912 -161 -570 169
14158 169 458 1004 1729 2254 2141 2393 2371 1239 -1251 -947 30 843 1201 740 10 32 205 -42 255 22
14138 22 49 -9 1113 1808 1930 2036 976 615 932 1438 2338 1699 1712 1516 1938 2038 3207 3251 2332 1304
14118 1304 918 848 729 444 10 851 1866 1425 2155 2346 1424 646 1284 1181 1440 1361 547 736 -366
14099 -366 -509 1069 1624 1430 891 523 176 134 1524 2110 1947 336 -583 -492 362 479 720 780 57 656
14079 656 1229 961 2023 2481 2979 3015 3538 3839 3421 2649 2362 4296 3784 2778 2122 1329 786 1460 2112
14060 2112 2331 2956 3323 3834 3694 3661 4134 3977 2423 2258 2843 2465 2694 3161 2171 1908 3229 3204 2551
14041 2551 2328 1963 1889 1992 970 1470 2474 1667 634 670 1119 1705 2689 2317 2342 2983 2608 1366 612
14022 612 -407 349 983 98 730 1553 1834 3097 3615 2903 644 -115 643 990 925 601 492 -671 -1247
14003 -1247 -140 1141 950 1351 2932 3298 3040 2383 2348 1624 1163 1379 2344 2823 2383 3037 2332 1307
13985 1307 1536 3242 4162 3575 2936 1286 872 -39 1044 1144 1358 490 286 1039 1084 683 2232 2027
13967 2027 1119 712 449 824 740 -353 -296 -300 502 2447 3138 3386 2656 1433 198 -740 -477 384 1212
13948 1212 929 2120 3261 2677 1939 2136 1481 1898 3033 2354 2198 2319 2078 2681 3301 3373 3843 4035 2890
13929 2890 759 533 1107 2160 2271 2465 2319 1993 2082 3425 3440 3346 3401 2788 2724 3450 5002 4373 3941 4181
13909 4181 3172 2202 1980 3746 4939 3548 2300 3284 3483 3470 4759 5459 5460 3353 2672 3273 2693 2364
13891 2364 2655 3080 2996 3566 3508 2459 3091 4555 4057 2506 3035 4929 5548 4636 3961 4500 5710 5069
13873 5069 4545 4412 4214 3354 2187 2334 3461 3663 4830 4991 3532 3826 4573 3323 2453 2495 2444 3177
13855 3177 3089 2650 3070 4175 3528 3103 3666 4370 5685 5931 5070 4333 3545 4289 4592 4534 5020 5123 4864
13836 4864 4716 4509 5120 4834 3901 4336 4112 4032 3567 3036 2567 2764 3520 3660 1735 2142 2980 3147 2345
13817 2345 3052 4795 5176 5575 5694 4991 5221 4545 3168 2937 1891 1922 3134 2847 2437 2820 4211 4682
13799 4682 2582 1472 731 1177 3505 4242 4656 5585 5605 3085 1902 2388 2957 2618 2589 2512 2333 2458 2701
13780 2701 3904 3717 3714 4833 4441 4279 3715 4761 4725 4925 4924 3819 3933 4206 3763 3339 3484 4733 5479
13761 5479 5419 5440 6720 7955 7715 6373 5399 6190 6589 6607 6782 6470 6764 6725 5847 5242 4275 3430 3275 3421
13741 3421 3894 4110 3866 3799 4830 4005 3313 3546 4089 4491 4005 4808 5303 5314 5151 5422 4707 4493 4403 4914
13721 4914 5398 4876 4540 5782 5567 5575 4848 4641 6055 6016 5542 4234 5428 6924 7504 6858 6110 5679 5744
13702 5744 5337 4786 5084 4342 3484 4239 4716 3774 4029 4204 4381 4768 5427 4271 3279 3322 3231 3339 3531 3972
13682 3972 5162 5505 4601 3735 3583 4128 4750 5085 4841 3614 3171 3891 3915 4110 3687 3481 3418 1945 1820
13663 1820 2832 5282 6095 4052 3446 3641 3931 3698 4766 5523 4928 3605 4530 5281 4187 4919 5400
13646 5400 5462 5835 5715 5799 6501 5263 3550 3482 4650 5241 5779 6194 5394 4944 5050 5170 5356 5398 5199 5001
13626 5001 3688 2131 2992 4875 4996 5201 4417 3810 4589 4681 4827 4268 3474 4241 4422 4997 4825 4006 3136
13607 3136 3521 4169 4292 4842 5876 5888 6328 6692 6257 4979 6019 6871 7668 6987 5122 3871 3726 5017
13589 5017 6581 7326 6136 4007 3501 5033 4040 3699 3473 4224 5382 5384 6219 6880 7060 6102 5762 5280
13571 5280 4676 3861 3662 4409 4535 4297 4175 4751 5345 6118 5837 5437 5497 5834 5605 6396 6528 6655 6510 6553
13551 6553 5535 6105 6673 6392 6032 5763 5935 5940 5118 5196 4696 5287 4971 5872 6371 7153 7408 6299 6357 8153
13531 8153 7251 6275 6021 5730 4897 5996 6176 6506 6209 6410 5800 5707 6558 6984 7117 7111 7430 8376 8302 6375
13511 6375 5369 5726 6622 7595 7084 7490 8049 7917 6252 7470 7185 5968 5402 5226 6389 6615 6195 6174
13493 6174 6503 6498 6229 6103 5731 4919 5721 6988 6134 5689 5814 6830 6673 6893 5775 6109 7227 6906 7342
13474 7342 7195 6901 6078 5534 5885 8015 9213 8608 7841 7081 5857 5169 5213 5388 6984 7266 6413 5687
13456 5687 5862 6192 6006 7715 9325 9233 8769 8212 8000 7499 6160 5861 6332 7095 7203 8103 8742 8368 8771
13437 8771 9222 8805 7882 7575 7282 7783 8866 9382 9730 9550 9442 9047 8252 8459 7679 6597 7087 7903 7630
13418 7630 7878 7531 8218 8637 8391 9111 9159 8531 7867 7689 8069 7843 8469 8382 7349 7381 8601 8763 8381 6817
13398 6817 6734 7455 8547 7939 7138 7411 6851 7240 7989 8693 9210 9236 9727 8270 7425 7059 6792 6385 7266
13379 7266 7683 7083 7956 8379 8512 8381 7558 6619 6638 7125 7624 7972 7693 8718 8935 8044 7407 7599 8318
13360 8318 7973 7682 7061 7985 9117 8685 8732 9047 8805 8247 8622 6673 5968 7230 6892 5601 4815 5061
13342 5061 5869 5718 5490 5600 7415 7127 6526 6921 7383 7061 7631 8361 8263 7821 7186 7099 7500 7854 8290 8292
13322 8292 7544 8695 8214 7078 6115 7389 7895 8050 8044 7646 7927 8180 7520 7301 6587 6192 5867 6089 7136
13303 7136 7459 7671 8787 8620 7398 7080 5876 6217 7090 7835 7116 6101 5947 5186 4767 5584 6682 8104
13285 8104 7920 6711 6190 5036 4886 5875 6421 6801 7057 6371 6061 6122 5857 4704 5134 5586 5643 5666 5577 5459
13265 5459 6458 6868 6817 7569 8489 8990 9275 8212 7221 7645 7990 6790 6143 6072 5961 6949 7158 8172 7880
13246 7880 7132 6547 6419 7796 8230 9067 10143 9035 7820 8140 8554 7828 8589 8740 8485 8821 8033 7786
13228 7786 8309 8889 9504 10157 10004 9527 8380 8076 7884 7609 8256 8862 8571 8271 7581 6878 6706 6905 6965
13209 6965 6621 8183 7998 6944 7468 8009 7258 6159 6769 6543 6482 6783 6295 6155 7114 7407 6358 6233
13191 6233 7158 8185 9156 9086 7834 8398 9369 9002 8772 8194 8887 9235 9535 8384 8575 7845 6870 6548 8156
13172 8156 7775 7564 7071 7342 7016 7380 8584 8298 8170 8382 9693 7442 5464 6630 7272 8713 8481
13155 8481 7403 6738 6850 7538 7758 8636 8958 7615 7013 7711 8822 9616 9492 10054 9426 8223 6722 6114
13137 6114 6403 5721 5348 6187 6720 7447 7716 8439 8496 10051 10762 10034 10296 10071 10241 10348 10329 9632 8408
13118 8408 8527 7330 7005 6693 5672 6405 7762 8491 8245 7047 5067 5444 6404 6308 7025 7666 8162 7187
13100 7187 6301 6531 8024 8235 8647 9763 8916 8767 8730 9596 7726 7856 8257 7743 7831 8732 9470 10092 10500
13081 10500 10478 9931 9699 9534 9746 8982 8916 9887 10310 9217 7964 8030 8407 9374 8635 7816 7074 6608 4928
13062 4928 5110 6522 8410 9636 9845 10180 9050 8311 8876 9817 10517 10682 10232 10520 10340 10047 8744 8489
13044 8489 8627 9327 9135 9023 8981 10068 9829 10082 10952 12023 11708 9749 10118 11456 11261 11232 10663 12000
13026 12000 13025 13037 13266 13448 13116 14111 13645 12096 10725 9936 9854 12267 12802 12332 12470 12919 11923 10500
13008 10500 9497 8946 8712 9492 9293 9973 10408 11808 12459 12019 11137 11396 12399 12160 10597 10610 10750 10311
12990 10311 12073 13473 13583 13885 14073 14123 14587 14750 13972 13989 14594 13927 12873 12790 12921 12906 13456 13850 14619
12971 14619 16083 16996 18330 19228 22597 28283 36402 44301 49326 49682 45614 39496 33304 28659 23788
12956 23788 20324 19084 18287 17645 16011 14268 14774 15569 17056 18085 18468 19103 18621 16408 15720 15920 16358
12939 16358 17448 17193 18088 18704 18190 19068 18659 17986 18358 18904 19341 19896 21417 23641 25945 29673 33607
12922 33607 40961 55124 76010 100791 121397 129876 122106 103835 83685 66557 53633 44316
12910 44316 37996 33604 29735 27150 24629 23134 21397 20553 20254 19921 20615 20440 18664 17080 16398 16598
12894 16598 16953 17151 16596 17091 16796 17521 18946 19421 20065 20075 22255 23692 24154 24878 26821 29711 33996
12877 33996 42356 55306 74297 98624 121394 132605 128286 111838 90342 70054 55976 45393
12865 45393 38233 34321 29468 24838 22078 20348 19776 19994 20516 19983 18773 18705 16879 15979 15076 15846 16173
12848 16173 16446 16543 17172 17774 17134 15397 14398 15319 16029 16247 16765 17280 16995 16504 16304 18034 21104 26532
12830 26532 33353 40535 48195 52935 52208 47331 40733 34802 30032 25764 22713 20895 20427 19831 19710
12815 19710 20284 20787 21635 21304 22143 23723 25870 28092 30880 34359 34860 31843 29305 27347 25552 23752
12799 23752 22642 21366 19050 17785 17773 16357 16056 15691 14808 15263 15503 15389 15087 15162 16307 16001 14804
12782 14804 14464 14669 15563 15699 16323 16667 14963 13317 12012 11778 12033 12533 12151 11832 13123 14608 13670
12765 13670 13265 15066 15560 15846 16262 15020 14289 13855 14692 15796 16477 16831 16516 15487 13731 13563 14045
12748 14045 14744 16033 15928 14752 13714 14724 14589 14639 14603 16218 16041 16336 16685 16222 15290 15687 15670 15683 15642
12729 15642 14104 13684 13391 14059 15161 15989 17324 18296 17690 16329 17070 18410 18957 18089 17117 17371 17305 17602
12711 17602 17064 17481 16574 14617 14367 15045 15721 15990 16106 17575 18376 17865 17415 18352 19051 19194 18085 17780
12693 17780 17782 17234 16732 17932 18783 18438 18300 18925 19399 20546 21893 21794 20849 20563 20706 20493 21389 20605 19897
12674 19897 19286 20051 20155 19292 19501 19276 19734 20844 20736 20682 19096 19349 19147 19289 19929 19867 18925 18721 19562
12655 19562 19828 20279 20131 19922 19871 19864 20158 20818 21118 21521 21698 21528 21739 22479 22318 22990 24301 24740 25130 25159
12635 25159 24906 25070 23561 21255 20303 20789 21164 20901 21058 20518 20074 19932 20514 20941 22787 23571 22144 22608
12617 22608 23354 22147 21167 21364 19777 19425 21361 21611 21049 21801 20645 20085 20236 20405 20179 20003 20467 21228
12599 21228 21778 22830 22537 22080 23303 24596 25860 26114 24572 23440 23537 23320 23206 23185 22394 21558 21410 22658
12581 22658 23673 23276 22799 21395 20425 20483 20868 21942 21937 22242 22692 23769 24652 23531 23605 23384 22617 22316 20840
12562 20840 20999 22035 21786 21943 22427 23298 25154 26384 25665 25048 24657 23839 24355 25531 25114 23340 24350
12545 24350 25114 24880 24910 22438 22065 22460 22307 22249 21334 20801 21602 23149 23895 23087 22620 23216 23996 23836 23694
12526 23694 25480 24775 24688 23792 23081 21927 21251 21271 21877 22642 23117 21716 21175 21265 22166 23513 23433 22651 23238
12507 23238 23846 23008 23062 22162 22019 22017 21510 22353 22112 21065 20630 20355 21178 21665 22214 22728 22449 21699 22431 23165
12487 23165 24560 23196 23850 24007 23107 23608 24836 25143 25577 25939 25426 24726 26137 27802 26808 25806 25168
12470 25168 24574 23824 23504 23152 22630 23522 23596 22757 23288 24324 25404 25851 25817 24606 23892 24304 25113 24931 24980
12451 24980 25253 25077 25328 26114 26635 26932 26425 25902 26383 26159 26290 25950 26254 25989 25599 25041 25239 26297 26261
12432 26261 25964 25627 25706 25713 26021 27721 28172 27394 27211 27128 26291 26945 27690 27283 26946 28058 27831 26980 26824 26631
12412 26631 26573 26759 26385 25672 25182 24562 25693 26343 26820 26521 26060 25509 25285 26201 27109 27326 27717 27164 27395
12393 27395 27747 28166 27750 27342 27715 27009 27375 27485 26803 27811 28867 28984 27405 26738 27939 28657 28720 27820
12375 27820 27141 26341 25817 25965 26863 27807 28480 27294 26510 26503 27862 27883 27799 27461 28466 28903 29276 28726 29641
12356 29641 30372 31385 31545 30597 30339 30892 31132 31205 31621 31740 31128 30885 30812 30631 29692 29910 29892 30489 30621 30996
12336 30996 30848 30870 30610 30875 30972 32259 32489 32395 32820 32472 32414 32874 32375 31002 30596 29678 29318 31941 33044
12317 33044 33150 33151 33076 33577 33386 33275 32437 33166 32558 33141 33831 34667 35280 33837 33679 32313 32386 34646 35322
12298 35322 36220 35199 35270 35529 36895 36706 35304 35802 36667 36963 36752 36267 37122 36913 36351 36506 37536 37548
12280 37548 37592 37767 36870 35498 36416 37417 37551 37365 38568 40041 40333 39899 39565 39417 39840 41121 42463
12263 42463 42517 42766 43396 43768 45434 46670 47491 48857 49748 50883 51914 53002 54152 56251 60358 65658
12247 65658 71520 78589 88025 105017 135229 184642 246258 283473 278803 246315 203646 166019
12235 166019 138665 119632 105822 95444 89180 85969 83884 82727 83283 84416 86929 89746 94457
12222 94457 101598 111212 123168 139907 160363 182243 206933 230768 249044 258886 258665 250077 237276
12209 237276 221481 207380 195741 187340 185191 188180 196554 211625 237888 281779 355563 480616
12197 480616 667961 846362 896130 829386 704795 575138 480264 417956 374478 343832 324738
12186 324738 312251 308690 308112 309717 312362 310549 304750 294640 281942 267304 255533 246328 239945
12173 239945 235842 229995 223589 216601 208740 202094 197943 193343 190060 185138 180822 179663 182183 188387
12159 188387 198993 216909 242058 282268 350741 462524 639287 855673 987898 976133 870496
12148 870496 727770 596582 492529 410785 343791 289278 247583 212848 184593 161754 143303
12137 143303 127989 117844 109013 100708 94768 90125 86416 84056 82295 80362 78905 79017 78680 77575
12123 77575 76491 76149 76382 76495 76241 77755 79776 83546 86993 90785 96162 107381 124884 152759 197762
12108 197762 262759 315302 323464 294942 248354 202727 167448 142566 125792 112763 102188 96265
12096 96265 92200 88350 85251 83314 81660 80901 81217 81630 81746 81830 82574 84764 85433 85236 85820 85968 84790
12079 84790 81665 80438 79449 78012 77757 76663 76444 78064 78891 77679 78800 80546 81955 84099 84452 85204
12063 85204 87331 88521 90774 93209 95125 97059 96963 97029 96552 95699 96866 97514 97622 97351 97281 96940 96226 96586
12045 96586 96286 94704 94046 94804 96028 99393 102283 104018 104359 105016 104790 104793 105753 104599 104312 104683 105219 107488
12027 107488 108814 110260 111478 112095 113835 116002 118731 120481 122924 126037 126926 126410 124863 124419 124139
12012 124139 122045 118730 115226 112752 111610 112139 113569 114729 115348 117087 118989 120751 121716 124385 127151
11997 127151 128359 130325 132526 133344 133339 132186 129838 127604 125219 122202 120320 119841 120761 122292 122085 122060
11981 122060 121339 120559 119652 119559 118501 116928 115933 116824 118042 119470 119601 120614 120783 122926 127543 128918
11965 128918 130770 130857 131321 132473 133390 133882 134803 134708 134807 136957 138501 141011 141754 141838 139979 136285 133413
11948 133413 132168 128027 123599 120444 118738 117338 115233 112596 112094 112690 113763 115714 120040 124848 130194
11933 130194 135920 141158 143814 145889 147250 149948 153240 158399 162498 163952 165770 167484 166049 164709
11919 164709 165264 167716 169683 170223 172523 176370 181720 186975 193474 200100 207650 215592 221554 224807 226739
11904 226739 227596 227790 227434 227460 227144 226203 224325 223643 225284 227446 230691 233998 237822 239978 242285 244222
11888 244222 245870 248189 250283 252069 254917 257277 259375 262814 267100 271799 277277 281559 285830 288469
11874 288469 291345 294702 298709 304390 310170 316807 324732 333859 343516 354588 364140 372060 380381 388899
11860 388899 395669 402088 407707 412259 416345 421585 429385 438656 449635 463197 480501 499538 521256
11847 521256 546499 576247 607658 640077 673015 703774 729346 747241 758161 762283 759855 754769
11835 754769 749102 743202 738120 736440 738527 744125 753830 765931 777002 788106 798184 808541 820576
11822 820576 833816 851252 871959 896898 922416 949734 978407 1011167 1048308 1090431 1136614
11811 1136614 1186864 1240652 1297112 1356043 1419473 1491283 1572485 1665179 1769795 1887585 2019357
11800 2019357 2166971 2333692 2520117 2728375 2963306 3231449 3540788 3901014 4330089
11791 4330089 4849617 5483964 6263098 7222210 8408371 9895824 11797483 14278549 17535937
11782 17535937 21697864 26638280 31742053 35950281 38266613 38299671 36339384 33088688
11774 33088688 29315872 25615137 22336976 19622508 17485567 15882639 14761371 14091377
11766 14091377 13867899 14107449 14806825 15883204 17154387 18430739 19645480 20866108
11758 20866108 22229838 23843852 25669326 27526173 29245823 30811353 32389008 34253580
11750 34253580 36621627 39458286 42353982 44622267 45610357 45025989 43050548 40205979
11742 40205979 37106896 34270551 32028683 30499969 29583019 28993066 28376047 27478402 26283428
11733 26283428 24951695 23667513 22529686 21496483 20429548 19240452 17986318 16817363
11725 16817363 15896903 15342441 15224174 15591292 16505283 18068739 20425955 23710193 27937547
11716 27937547 32844930 37755864 41599667 43313105 42451364 39373782 34925188 30014657
11708 30014657 25314342 21169062 17676118 14798597 12446304 10520475 8934973 7621885
11700 7621885 6531390 5627717 4879170 4260724 3751217 3328292 2975912 2681759 2435336
11691 2435336 2225991 2047132 1891573 1752575 1627550 1514475 1411875 1315998 1228898 1150847
11681 1150847 1082767 1023868 972490 926951 885323 846890 810212 775567 743451 714582 688725
11670 688725 662565 637076 610713 583488 557414 534287 513872 495939 479125 465790 453522
11659 453522 441450 429624 418198 406096 393839 381309 367199 355321 344765 334371 325493 318850
11647 318850 313032 306560 301748 296318 290983 284083 275280 267739 260859 254273 246818 239476 234245 230106
11633 230106 225867 221239 217932 216600 216048 215080 213499 212178 210317 208437 208223 206216 203956 202650 201034
11618 201034 198834 195869 192542 190153 187667 187303 185765 183013 182622 182832 180607 178010 174208 170580 167200
11603 167200 163472 159269 156089 154479 155763 159072 162070 167232 172234 178856 186826 196815 210100 227933
11589 227933 249419 271409 290711 301029 302676 296730 280835 260192 237827 217760 199368 182920
11577 182920 170458 159639 149521 140796 133924 128967 124423 120013 116857 115208 112811 111207 110742 111270
11563 111270 111507 110969 109514 107930 108000 109231 111876 115305 117075 117574 115773 112607 109388 106530 103136
11548 103136 99802 97680 96126 94418 91960 89099 86799 83970 80551 78517 77945 78621 78763 78775 79362 79294
11532 79294 78962 78740 77343 76888 75983 76387 76505 78315 81134 84259 88476 90463 89584 87036 83656 81433
11516 81433 77867 71734 66591 63940 61127 58727 56346 56066 54562 52474 52709 52660 53520 54086 53334 54179
11500 54179 55778 57525 56739 56157 56164 56090 55364 55681 54601 54353 54373 53979 54590 55257 55438 56256 55394 55710 54422
11481 54422 54545 54917 53462 52842 52403 51156 51020 51444 51546 51572 53010 52503 52066 52308 52123 51004 50253 50183
11463 50183 51969 52620 52740 52343 52619 53745 53430 53018 52707 53363 53636 53654 53218 52376 52038 50927 49912 49159
11445 49159 48896 48398 48384 49048 48433 49168 49290 50431 50016 48558 48007 46790 44079 42975 42833 43194 45130
11428 45130 45773 46390 47297 47668 47501 48125 49630 49001 48541 47779 48073 47823 47321 46243 45620 45547 45183 44250 44096
11409 44096 44116 44248 44891 45502 44920 43420 44188 42982 41607 41182 40859 40818 40549 39937 39819 39929 42618 44484
11391 44484 46142 47028 47441 47212 47006 46590 44918 43123 41995 42184 42111 42601 42199 42485 43037 42183 41570 40815
11373 40815 41067 41116 41544 42872 41772 40824 40773 41689 42789 42790 42713 41537 42701 44264 45603 47258 48199 50092
11355 50092 51846 52607 53033 54666 57887 61735 64059 67712 71991 77716 85026 93667 104167 117631
11341 117631 134257 152642 172037 191127 205084 211834 212667 205493 193231 178728 164103 151076
11329 151076 140020 129960 123187 119307 117972 117124 118043 121405 126220 133059 139448 147217 155324 164373
11315 164373 175040 188926 202713 214901 228037 240393 252363 264070 273687 279194 280004 276666
11303 276666 269062 257649 245434 234766 226176 218250 214161 211367 211779 212304 212061 210239 208314 209883
11289 209883 211298 212204 214033 218118 224526 231138 240523 254120 271354 292289 313318 334888 354422
11276 354422 371180 387408 400020 409252 410594 403143 386664 362535 334468 306082 279148 256892
11264 256892 239308 225046 216221 209738 204971 202093 201143 199739 199489 198442 196799 197028 199807 203676
11250 203676 209393 216134 222863 231096 238806 244853 249046 249627 246613 241660 235757 229251 221365 212642
11236 212642 204153 196456 189338 183156 176037 168453 160509 154090 147921 143195 138431 134411 132013 131570
11222 131570 132919 134478 138180 145680 153721 162698 171307 179595 185633 188543 187696 183670 176883 168403
11208 168403 157716 146376 135602 126071 115860 106732 98408 91637 86280 81890 78355 76332 73549
11195 73549 70996 68264 66191 65342 65632 65562 64123 62181 62295 61861 59511 58416 57756 58698 59568 60114 58442
11178 58442 56641 56160 55943 54925 54410 55234 56136 55978 56236 56744 55981 56740 56694 57265 56903 55465 54563 54800
11160 54800 54779 54905 55247 55194 55877 56402 56607 57484 58006 57288 56739 57396 58679 57195 56330 56997 57734 58451 59223
11141 59223 59522 58848 59361 59590 60283 60292 60654 60604 60186 61276 61520 60455 60315 60311 61774 63550 63315 63765 63282
11122 63282 62809 63903 65052 65036 64741 66178 67226 67439 68808 71190 71845 73152 74749 76425 78564 80212
11106 80212 79923 80621 82553 83906 86083 87723 87657 87281 88379 88088 87552 89294 89915 90575 90505 91382 93097
11089 93097 94147 93379 92235 93235 96160 97565 98790 99366 101111 103852 104699 104594 105523 107845 110671 112611
11073 112611 112457 112394 112782 113191 112929 113149 114584 116326 117651 117544 116790 116685 116526 117533 118757 119619 120024
11056 120024 119033 117042 116986 116502 114088 111197 108594 106616 105609 104852 103643 103709 105260 107807 110798 112734
11040 112734 115169 115974 116614 118425 121545 124266 126192 127381 129314 129954 129286 128847 128692 129666 130414 130946
11024 130946 131687 131676 129632 128888 129076 128377 128143 128283 127536 127411 127799 128137 129860 132230 136196 140382 144202
11007 144202 147053 151801 156481 161826 166796 172850 179571 187602 196652 206397 216194 223051 226763 227221
10993 227221 226151 224868 225186 226229 228355 232375 238708 247077 256680 267789 278904 288262 296019 302494
10979 302494 307206 307649 304903 300454 295366 290014 286228 284045 281853 280889 282588 284347 284792 285765 286950
10964 286950 286268 285657 285119 285643 287404 288887 289683 293595 297514 300827 304903 309143 313976 318967 323416
10949 323416 328126 333460 339436 345909 352556 359800 367999 375898 382423 390550 399406 407836 416413 424174
10935 424174 432447 442048 450351 459244 468165 477079 485613 494934 502486 511410 521462 531289 541526 552983
10921 552983 566598 580579 595396 610687 625084 640999 656056 671258 687162 703589 720903
10910 720903 739313 760702 783282 807005 831689 856669 883975 911665 939838 967574 996049
10899 996049 1025847 1057424 1092649 1130435 1170419 1214251 1262327 1313200 1367684 1426871 1490375
10888 1490375 1559211 1633955 1713754 1798410 1890107 1989985 2099463 2220829 2355086 2505327
10878 2505327 2671918 2860394 3072904 3311683 3581064 3881943 4217438 4591533 5012042
10869 5012042 5486721 6026826 6650710 7382192 8249525 9288080 10541510 12062322 13907498
10860 13907498 16124259 18739103 21720140 24947609 28182593 31077351 33243192 34364847
10852 34364847 34317570 33201892 31299713 28962780 26517516 24210331 22193949 20546701
10844 20546701 19302128 18462555 18013328 17928487 18163279 18660153 19349463 20165768 21057786
10835 21057786 21995477 22957927 23920710 24848086 25706457 26484779 27221191 28005356 28947871
10826 28947871 30140621 31618097 33328602 35115486 36738610 37932999 38494359 38356475
10818 38356475 37602621 36419080 35016436 33560728 32137880 30759743 29394531 28017420
10810 28017420 26627610 25247023 23894475 22576171 21299086 20068121 18904304 17844545
10802 17844545 16935766 16227973 15765382 15587773 15727478 16216402 17088818 18372634 20072507
10793 20072507 22141829 24442516 26713578 28598279 29739243 29902505 29060224 27374240
10785 27374240 25119817 22584202 20007361 17556780 15327230 13357978 11650616 10187673
10777 10187673 8942155 7883988 6986273 6223360 5572881 5014991 4534439 4118816 3757767
10768 3757767 3441318 3163287 2919485 2703945 2512824 2342469 2187785 2047747 1922093
10759 1922093 1806565 1702571 1608319 1522819 1444520 1374009 1310652 1252324 1196870 1147036 1100368
10748 1100368 1056653 1016461 977341 938667 901625 866376 833563 803386 775816 749506 724479
10737 724479 701621 681180 661420 643218 627205 610416 593046 577109 562365 548073 533546
10726 533546 520759 508628 497633 486816 475310 465079 455994 445732 435219 427364 418538 410057
10714 410057 401349 392903 385080 374813 365742 358903 351665 345285 339153 333853 328602 323847 320890 318180
10700 318180 313452 309385 305667 300482 296964 293391 288357 284585 280888 276838 273481 271638 268371 264371
10686 264371 260773 258374 255917 252838 249054 244909 240540 237065 234462 231617 228138 224308 222836 221669
10672 221669 220435 219644 219594 221014 223124 226611 231263 236262 243748 250888 257456 261996 263183 260558 254798
10657 254798 248203 239729 229070 220397 212109 203368 194711 187960 183555 179053 174147 171245 168058 164795
10643 164795 161040 158122 157786 157246 156447 156374 154644 153272 152956 152146 150685 150020 151036 150987 149953 147938 146269
10626 146269 144332 141976 139429 136856 135084 132146 128858 126750 125895 123717 121326 118940 117660 114582
10612 114582 112722 110405 109703 109330 108032 107349 107411 108321 108380 106689 106085 106937 107208 108720 111280 112776 112603
10595 112603 111814 110113 108349 106016 103513 99819 96319 93349 90831 88557 86585 84463 83316 83325 82617
10580 82617 82062 81458 80606 80969 81959 81871 80417 79008 78200 77955 79082 79402 79069 78698 78326 78621 78195 78443
10562 78443 79006 78284 78488 78065 77584 78631 76935 75744 76060 75433 74680 72650 71803 72334 72400 72757 71935 71544
10544 71544 71033 69981 69570 70625 69974 67649 67777 67265 67026 67363 68556 69172 69135 68704 67040 67265 69635
10527 69635 69749 68225 68364 67766 67303 66015 65311 65869 67847 67788 66978 67624 67259 66007 65445 64993 64219 63998
10509 63998 64231 65145 64715 62852 61546 62413 63448 63237 63291 63664 63405 63204 63366 63623 62377 62446 63397 63051
10491 63051 63098 62864 60868 60406 61698 62436 61794 61096 61518 60096 60177 60100 60435 60144 58639 57701 58018 59903
10473 59903 59249 58659 59175 58747 58542 58684 58852 60285 61463 61919 61996 62277 61792 61640 62490 61792 61036 61165 62335
10454 62335 62745 62658 62423 62593 63821 65235 66399 67820 69832 70139 71131 73337 75148 77521 79829 82577
10438 82577 86336 89063 92051 95478 99017 105916 113439 121716 131955 143326 156814 170819 184924
10425 184924 201566 217134 228144 232802 233054 229336 222435 213217 203365 192505 182771 173541 167759
10412 167759 164156 161137 160653 162077 165170 170422 174990 179633 183587 187544 192471 197429 203426 208036
10398 208036 212420 217585 223773 230667 238852 248398 256892 265256 271458 273959 273011 268801 261732 254021
10384 254021 246809 240906 234643 227742 219997 212518 206224 200118 192912 186670 180291 174503 170620 167457
10370 167457 163736 160547 161153 163530 165416 169793 176422 186300 197618 209465 219859 229025 234197 234035
10356 234035 230079 221385 210136 197173 184024 171556 161018 150940 140948 133749 127018 121267 115877
10343 115877 112525 109785 108235 104723 100638 98484 98107 98001 96704 96074 95132 94885 94392 93251 93069 93392
10327 93392 93036 93963 93829 92818 91218 90538 89989 90844 92352 92529 93196 94841 94825 96560 97834 97641 98073
10310 98073 99057 100466 101414 100657 101195 101177 101401 102502 102978 104096 105460 106541 107377 109011 110228 110620 111257
10293 111257 113920 115775 116660 117202 119535 121900 123595 125117 126849 128734 129804 132416 136402 139347 141972
10278 141972 146952 150003 151346 152028 153648 154387 153672 154440 154190 154338 155154 154483 151984 151229 151198 151824 151069
10261 151069 151509 152357 153952 154119 153588 153964 155027 157334 159176 161300 163568 165446 166968 168135 169198
10246 169198 170928 173354 175350 177269 179586 180290 181471 182520 182358 182090 183782 185661 187074 188618 188681
10231 188681 187867 185719 184589 183785 183331 181792 181060 180867 179685 179953 180372 181617 182590 184801 186314 187996
10215 187996 189578 191958 194577 197632 200624 205045 207190 208562 210607 211741 211635 211538 212205 213459 215212
10200 215212 217288 219359 220788 222542 224898 225749 226378 228737 232428 235172 238445 242140 246872 251124 254092
10185 254092 255673 256980 258510 260348 261694 263323 265421 267452 271038 273547 276046 278629 281620 285519
10171 285519 290508 294084 298308 301618 303873 306998 312735 318344 323108 326657 331434 335805 341422 347494
10157 347494 352402 356330 361897 366231 370631 375893 381222 385416 391373 398200 404151 411058 417817 422990
10143 422990 430300 438046 444291 450676 457948 465225 472399 479099 487281 495496 502526 510732 519013 527834
10129 527834 538231 549459 558355 568057 577799 588753 600233 611000 621788 632847 645320 657201
10117 657201 669074 682928 696854 709941 723854 739987 757287 774609 792530 811080 830994
10106 830994 851140 872792 894748 916463 938140 961150 982847 1004869 1028501 1052552 1076747
10095 1076747 1100713 1127836 1157240 1186773 1218131 1250580 1284148 1319558 1356348 1396852 1437426
10084 1437426 1478706 1523226 1570621 1619208 1671794 1726787 1784230 1843242 1903628 1967277 2035500
10073 2035500 2108696 2185026 2264356 2348492 2438492 2533059 2631132 2737024 2850553 2969358 3093984
10062 3093984 3225800 3367317 3517123 3675340 3843291 4026710 4220318 4424861 4644607
10053 4644607 4880041 5126833 5389047 5669864 5970705 6289772 6628675 6989674 7373873
10044 7373873 7779436 8205690 8656454 9129305 9623152 10135764 10664479 11206731 11755740
10035 11755740 12306773 12851455 13380825 13883876 14350250 14769404 15129624 15419632 15631181
10026 15631181 15758692 15797130 15745128 15606038 15381662 15078893 14709619 14283987 13811739 13304065
10016 13304065 12771236 12224065 11669307 11115558 10570201 10035886 9518139 9018734 8540177
10007 8540177 8085792 7653619 7244714 6857941 6494463 6152381 5831932 5530563 5246873
9998 5246873 4980420 4730875 4497275 4278589 4072895 3880864 3700184 3530769 3371606 3222686
9988 3222686 3082678 2949926 2825937 2708260 2596006 2490623 2392269 2298664 2210546 2127313
9978 2127313 2048405 1972193 1900508 1831865 1766594 1705265 1646049 1589153 1534631 1483374 1435321
9967 1435321 1390841 1347654 1304838 1264669 1226614 1190137 1155036 1122766 1091946 1061510 1032564
9956 1032564 1004360 976583 949381 923481 899171 876568 853961 832949 812952 793401 776168
9945 776168 758249 741121 724127 706709 690295 676260 661848 646806 632705 620044 607212 593663
9933 593663 580569 569323 557823 546335 535300 524448 514763 505283 496022 486143 477043 469480 461740
9920 461740 452166 443573 435710 427741 419989 412459 405368 400251 395290 388760 380410 374028 367007 362696
9906 362696 357885 352429 346897 341785 336057 331291 327509 322936 317453 312224 308805 304894 300776 297576
9892 297576 293651 289538 285264 280147 275752 271376 267961 264756 261523 258288 253881 248925 244839 240954
9878 240954 238508 236187 233990 231106 228612 225162 222806 220003 217148 214539 210803 207794 205785 204259
9864 204259 201428 198187 196355 194253 192824 191490 189358 187333 185669 184077 181955 179960 177786 175505
9850 175505 174303 171737 169951 168349 167350 166860 166163 163979 161829 160169 158487 156943 156675 156143 155031 153535
9834 153535 152633 151009 148721 146191 143999 142709 141111 140000 138691 137117 135726 134301 132664 131058 129070
9819 129070 128057 128147 127709 127449 125727 122007 118098 116407 115338 114111 113699 112360 110296 109624 110201 109542
9803 109542 108709 106595 106148 105621 103735 102285 103093 103048 101374 99307 98278 99190 98779 97085 95401 94462 93870
9786 93870 91927 90227 89992 89009 88196 87151 86351 85570 84288 84275 83724 82717 82708 82991 83404 82743 82724 83468 83044
9767 83044 82147 82240 82513 83168 82735 81846 80014 78479 77095 76267 76978 76441 76127 75705 76141 76775 76426 76330 76077
9748 76077 77368 77422 77478 78309 79108 79620 78496 77069 78220 80115 80905 82261 84129 87058 91847 98157 107186
9731 107186 120293 140343 170518 216974 280000 344534 385768 386821 353796 303502 251012 206677
9719 206677 171333 143386 123597 109487 98227 90146 82804 75649 71873 69951 68243 65887 63334
9706 63334 61747 61058 60251 60211 58989 58913 58907 57208 53831 52644 51894 51407 50304 49447 49205 48562 48145 49192
9688 49192 49106 49121 49327 48416 47967 48012 47738 47713 47726 48245 47784 46888 47188 46606 46206 46236 46583 46626 46189 43893 43815 44407
9666 44407 44521 44446 43812 43816 44772 44853 44149 45120 45919 44990 44412 44072 43957 44795 44774 44029 43364 42561 42499 43052 42603
9645 42603 42615 42657 42515 43074 42034 41706 41835 41722 41108 41834 42893 43730 44931 45982 47007 47761 48001 48353
9627 48353 49783 51966 53597 55341 55034 56330 59012 63196 69056 76148 86897 104161 131842 179738
9613 179738 265347 390170 513497 569151 537670 449823 350057 264124 201799 158481 127314
9602 127314 104541 89049 78384 69708 61944 56855 54904 52164 49126 47498 46892 45468 45089 45628
9588 45628 44905 44447 43262 41625 40499 40615 41208 39871 38464 37316 37464 36611 36565 37723 38230 37074 34843
9571 34843 34171 33556 31901 31313 31923 30904 30541 30989 31111 30377 32073 32026 30786 30335 30596 32179 32718 31692
9553 31692 32005 32218 32726 32955 33928 34346 34040 33438 33771 33838 34848 34751 34428 34826 34980 36545 37540 36782 36311
9534 36311 37088 37316 35968 35403 36384 35306 34841 35121 35200 33794 32787 32683 33042 33538 33489 34353 34519 34815 33267
9515 33267 33444 34519 35998 38961 40363 42196 42017 42557 42918 41942 42101 42584 43075 44229 44413 45047 45879
9498 45879 45953 46702 49005 52507 55269 58119 60819 63734 68579 74005 80308 87050 93658 100959 109027
9483 109027 118869 129579 142974 159180 177377 193788 206720 214754 214368 207813 196756 182280 165159
9470 165159 148876 134496 122298 111428 101429 92725 85576 78698 73381 68436 64739 61247 58282
9457 58282 55235 52657 50917 48814 46849 45514 44183 43048 41836 41624 40184 38364 36904 36650 35978
9442 35978 36214 36333 35259 34192 33396 32561 33508 34812 34214 33063 31166 30819 30693 32213 32282 31586 31198 31082
9424 31082 29836 28801 28666 30237 32167 32898 32939 31702 30232 30564 29380 27757 27573 27891 27989 27097 26277
9407 26277 26269 27575 28385 29438 29766 30272 30534 30523 30968 30916 31275 31558 30361 30595 31045 31457 31589 31044 30456 29563
9387 29563 28445 28840 29917 30581 29905 29269 28573 28819 29361 28558 28331 28496 29710 30921 30846 31625 31687 32059 31589
9368 31589 31033 30655 29622 29511 30330 30371 31254 31738 29770 28828 28764 28519 30240 30240 29678 30415 29925 30296 29513 28068
9348 28068 28633 29457 28757 28695 28727 29299 29493 29100 28651 28560 29010 29045 29534 30659 30593 30039 31087 32547 32952 34341
9328 34341 34989 34595 34374 33903 33010 32551 32412 32193 31863 31576 31277 30711 30620 30376 29391 30744 31637 33333 34629
9309 34629 35286 36921 38425 39516 40516 41244 41030 39324 38351 39426 37828 36549 36591 36019 35995 36340 36776
9292 36776 37914 39206 40267 40316 40818 42494 41779 39824 38513 38121 37461 35311 32701 31484 31957 32607 33471
9275 33471 33719 33423 33368 33908 34305 35032 34590 34335 34011 32938 33586 33818 35242 36107 37077 37177 37100 36522 34675
9256 34675 33508 33352 32757 34380 35030 35716 36899 36316 37696 39180 41798 43166 44073 44056 42970 42758 40844
9239 40844 39879 38940 40430 41707 42590 42597 44340 45246 44367 43330 42708 42859 42061 40933 39251 39138 39518 39060
9221 39060 37679 37724 37957 38071 36545 36398 37176 36449 36042 35906 36941 39575 40430 41770 43072 45438 46237
9204 46237 45638 44075 40872 39000 38486 38049 37319 37120 37534 38143 38198 36782 35793 35083 34572 35223 34716 34763 36218
9185 36218 36528 37242 38420 41614 43609 45627 46369 46886 46488 48300 50418 53133 54981 54071 54542 56217
9169 56217 58153 60170 61807 62184 61672 62028 63318 64540 65564 68620 73219 77723 82373 84350 84169 82512
9153 82512 79806 76772 73144 69527 68483 68172 68066 67908 69776 70040 69367 67565 65072 63888 64602 63751
9137 63751 62148 61880 62600 64252 66854 67474 64299 62240 60056 58438 56771 55316 56168 57158 57521 57961
9121 57961 59510 61781 64577 67983 72508 75461 78530 83811 89736 96129 103524 112831 123537 136065
9107 136065 151842 169646 188960 209892 235223 264137 299564 344927 399671 469950 560204 674766
9095 674766 813169 974118 1151179 1333415 1503739 1647156 1744865 1784306 1764475 1689278
9085 1689278 1566167 1409295 1237078 1065293 904594 763310 643265 542982 462445 397524
9075 397524 344674 301869 265640 237477 215101 195121 178539 165301 155446 147609 141035 134743
9063 134743 129133 124125 119260 114142 109363 107653 106309 104935 102169 98071 93510 89341 85424 82927
9049 82927 81405 80237 80620 81483 81772 82370 82782 83388 83779 84303 84261 81593 78631 76035 75043 76370 77307 78203
9031 78203 80338 83570 85956 86702 87562 88138 87116 86712 87013 88595 90677 90556 89370 89234 88063 85055
9015 85055 83146 80822 79585 79779 80794 83924 88695 92723 95007 95338 95017 92029 86036 78801 71261
9000 71261 64798 62148 60831 61864 65375 68320 67996 64316 58210 51581 49159 49351 51704 55683 61599
8985 61599 67367 70605 70998 71949 74237 77691 81947 85397 87932 91228 96192 101115 104573 106652 108832
8970 108832 112049 112515 109653 106766 106248 105846 105453 106898 111913 118318 123490 129334 136391 139371 138401 139556
8954 139556 148284 163773 179791 187701 187712 192975 206169 217214 221320 224888 228820 230763 231059 233734
8940 233734 239948 250816 258713 257934 252379 251036 250188 242749 237827 235983 232120 224606 219914 212729 205656
8925 205656 199182 191993 183414 175035 171071 170677 173411 176361 178589 179556 180512 180711 178234 174011 169456
8910 169456 164800 159989 156301 151616 147600 148761 152034 156586 162576 168755 174380 179934 184027 186963
8896 186963 187695 186662 184759 178363 166813 148755 122445 93082 63368 33536 5899 -15377 -27840
8883 -27840 -31715 -23826 7036 46937 79555 92963 94798 96267 104167 115829 129877 144119 159415
8870 159415 175976 193571 208376 220990 228559 228789 225172 220194 215040 213111 215797 223181 230515 235944
8856 235944 238667 239957 238569 235879 231181 227173 226344 232930 250075 267289 283510 304971 327956
8843 327956 344960 357267 366670 376232 388342 399395 405394 402063 395200 387953 381717 376092 368109
8830 368109 358353 349881 344859 348528 353977 357210 359941 360717 362694 368356 372036 370664 378770 410754
8816 410754 460842 505423 536203 565324 592067 610162 619815 634647 655500 677931 699057 710272
8804 710272 708622 698041 682023 665240 652476 644117 636906 629351 626899 631265 642962 662325 688661
8791 688661 718132 746733 773033 796101 811761 821491 827513 832573 836956 843735 852818 865752 883993
8778 883993 906297 928410 951677 979509 1010554 1045278 1083432 1121124 1157353 1191222 1229149 1270506
8766 1270506 1314672 1356132 1394209 1430015 1466333 1506290 1551688 1606725 1671388 1743115 1819083
8755 1819083 1891090 1949168 1986609 2007843 2023695 2044941 2079946 2133212 2201274 2280533 2376087
8744 2376087 2484941 2598781 2712766 2822154 2924416 3020923 3117084 3212374 3312785 3426811
8734 3426811 3564325 3732199 3928040 4143659 4372521 4617642 4885491 5177927 5500599 5857585
8724 5857585 6241279 6644895 7081789 7573029 8149725 8847494 9685016 10635653 11637015
8715 11637015 12694059 13873845 15266904 16953683 18908610 21040222 23372741 26007754
8707 26007754 29051639 32622111 36848575 41770823 47189312 53055225 59922086 68662655
8699 68662655 80348894 96393423 118791674 150202721 193807898 251065588 314046932
8692 314046932 360318226 371317967 354396325 322814265 282182062 239067429 199646020
8685 199646020 165857214 137139822 113283150 94166480 79182685 67455410 58238608
8678 58238608 50968350 44939245 39604794 34777964 30428958 26625697 23389566 20657687
8670 20657687 18356263 16438606 14849155 13515716 12378705 11398066 10534756 9756302 9047789
8661 9047789 8407239 7826296 7297970 6824665 6400092 6018179 5670664 5348305 5058739 4810192
8651 4810192 4592236 4385534 4181932 3983182 3782965 3579174 3378567 3186612 3008639 2849593
8641 2849593 2709316 2589637 2487107 2400036 2324040 2256939 2190948 2116442 2026583 1923286 1811983
8630 1811983 1702453 1609517 1536036 1480028 1438424 1406501 1379598 1351463 1317729 1283424 1248458
8619 1248458 1214351 1183099 1155324 1129800 1106852 1085396 1065323 1046103 1027366 1010074 993834
8608 993834 977587 960815 946567 932191 915476 898984 882760 862880 836122 806770 775496 743763
8596 743763 711816 685029 666585 657484 658420 666216 676775 685572 689874 688892 678468 661977 640730
8583 640730 617129 592338 564680 536216 508970 482947 464978 464337 480246 500094 507373 507523 508581
8570 508581 505577 492203 489048 510741 542060 564741 590051 617953 629186 616891 598039 578025
8558 578025 557550 541622 527319 511843 492659 469379 449904 437497 426573 405550 377110 351204
8546 351204 332791 320726 310443 299645 289036 282993 280719 284761 293831 308497 325179 339715
8534 339715 347959 345564 336709 328926 322054 315625 311446 307894 303561 300503 297824 295633 292295 286608
8520 286608 278666 267869 257432 248302 244203 245321 252157 261500 272379 281524 288070 295420 301012 299205
8506 299205 291925 283905 283766 302719 344768 398038 440290 462533 461061 435804 401641 368775 334581
8493 334581 301841 273570 247468 224799 205553 190565 178857 169809 163019 158937 159629 161560 162437
8480 162437 165269 171484 175972 175921 174503 171288 166425 162832 158529 153967 149529 146706 146662 146487 147215 147151
8464 147151 145195 141874 139701 136903 133801 131974 131021 128899 125844 122734 118439 115629 112602 109934 110590
8449 110590 114602 118414 120452 120884 122226 124475 127183 129752 133127 136304 137415 135399 133726 131831 128890
8434 128890 128716 133756 139365 140701 139142 138415 139207 141687 143293 140457 133986 130283 133959 141640 149648
8419 149648 159924 173450 192591 221904 251164 257244 242107 213916 185453 164389 150982 142179
8407 142179 136074 132293 130947 130126 129218 130087 131280 131696 131952 134358 137977 143529 148825 154453 156630 155969
8391 155969 153659 149951 147590 148040 152540 160226 168724 178014 185234 189538 191844 193790 201213 211970
8377 211970 225734 246132 274399 311311 361434 435938 547474 682805 785120 851078 918725
8366 918725 1055880 1333265 1619667 1637248 1452124 1168204 890340 683535 542583 438100
8356 438100 358845 303653 265815 240053 220751 206228 195738 188546 184432 180573 177081 178289 185329
8343 185329 200802 230426 285093 388454 566359 776154 874860 832236 709242 564873 445705
8332 445705 360557 300502 256117 225530 207945 205601 219894 245433 260623 250490 225853 195920
8320 195920 169348 149991 136782 128943 124897 123282 124499 127007 131242 136721 143339 152286 162993
8307 162993 175969 191508 208340 226921 251431 281646 318721 368812 438918 540124 692011
8296 692011 933715 1333652 1901534 2377200 2562370 2549251 2437262 2328213 2254784 2184699
8286 2184699 2087765 1959181 1800122 1617308 1421074 1224654 1041465 877757 739500 624927
8276 624927 531897 458660 398394 351145 313293 280198 251971 229161 209437 193210 180069 170103
8264 170103 162460 156062 151507 146779 142709 140897 142145 146266 154135 165486 182624 209505 260489
8251 260489 362797 537141 728587 802094 745698 617477 475681 361539 280152 220358
8241 220358 175004 141115 117449 100628 88791 79817 75534 73551 70316 62511 51764 41711 33688
8228 33688 28510 24191 21205 21050 21495 21603 21392 22588 23492 23904 24087 24067 24551 25921 27522 28871 29277
8211 29277 30051 31190 32093 34000 34261 34916 35911 36074 35863 36608 36156 35990 35453 35132 35612 37604 38982 40642
8193 40642 41387 40955 39350 36544 35916 35720 36429 36413 36930 37782 38668 38819 36487 32794 30054 27180 24223
8176 24223 24143 24887 26011 26781 28129 29807 30144 28451 27495 27954 27972 27603 28788 29060 28997 28817 27570 26691
8158 26691 26065 25411 25763 24919 24146 23826 24061 25002 24984 26421 26566 25506 24896 24347 23281 22233 20985 19085
8140 19085 17506 16813 15920 16203 17181 18020 18955 20577 21500 20337 20121 20481 20518 21211 20434 18677 18507 19185
8122 19185 19832 19803 20623 22703 22544 22504 21237 20675 20999 21276 20561 21368 22675 23381 26999 29795 34074 37153
8104 37153 38834 37534 34784 31270 27964 24274 21061 17482 15191 15009 14388 14346 15040 15245 14786 16043
8088 16043 15645 14912 14775 14153 13061 12200 10984 8638 8390 9625 9634 11060 13024 14569 15790 17940 20074
8071 20074 21224 24825 29678 35724 44574 55482 64607 71247 72128 67638 61041 52863 46219 40831 35302
8056 35302 30830 27259 24664 22361 20738 18830 18352 18963 18564 17230 16685 16985 17323 16690 16023 17535 18623
8039 18623 19396 19693 19072 19067 19756 20058 20346 20461 21496 22392 25653 32270 39249 47607 55074 61953 61980 56734
8021 56734 50825 42922 34383 28932 24797 20917 18582 17217 16492 16392 15451 14330 15070 13917 12088 11636
8005 11636 11819 12868 13451 12903 11414 11645 11830 11485 10955 11513 11972 11774 12303 11410 10463 10620 11637 12714
7987 12714 13163 12791 12409 11085 9903 8670 8818 9513 10231 10291 11656 12191 11806 12117 11948 12471 12815 12700
7969 12700 13526 12618 13338 13711 13797 13707 14155 14324 14002 14435 14685 15198 15089 13993 12517 11419 11531 12650 13801
7950 13801 14598 14592 13597 13176 12220 11532 11769 12432 13122 12926 12341 11846 12490 12272 12348 11745 10840 9905 8399 7743
7930 7743 5907 3873 4344 4985 5936 4664 3956 3804 3291 4221 4778 3898 3125 3688 4055 4361 4864 5887
7912 5887 7056 6685 7054 8922 9361 9133 9213 9386 10421 10328 10331 10245 10356 9361 8481 7551 8628 11284 13529
7893 13529 13236 12334 12117 14138 16850 18308 18633 18368 16814 14264 12484 11964 11554 10269 8350 8688 8325
7876 8325 6011 5022 5292 6814 7845 7140 7988 8556 8130 7579 8569 9367 11050 11286 11419 12765 13807 13665
7858 13665 13657 13531 12274 10751 10749 11145 11127 10849 11210 10770 9954 9775 10001 12357 14928 17668 20698 23203 24421
7839 24421 24058 23927 25850 27156 24022 20840 18257 15478 13048 12342 10906 10352 10696 10906 10121 10709 10331
7822 10331 11689 13124 14744 16348 17116 18253 19325 20234 21521 22923 23670 23691 22494 20329 18108 15755
7806 15755 14642 13127 12985 13797 15170 15264 15494 15409 16768 18796 21313 25503 28127 29243 28220 25099
7790 25099 21139 16737 15725 15190 13207 13404 14539 14066 14012 15498 16974 16675 17118 18196 20376 21758
7774 21758 24083 24980 26014 27490 29069 29513 27943 26050 25581 24271 23007 21421 21092 19534 16860 16157
7758 16157 15514 14957 14441 12969 12530 11600 11146 10790 10628 10722 11454 12064 12060 11338 11810 11910 11875 11313 11269 12119 12407
7737 12407 13131 13406 13463 13866 14794 15508 15120 15434 15458 16587 17239 17518 17563 16224 15449 15198 15185 14792 13588 12826
7717 12826 12895 12061 9746 8699 9470 9813 9522 10294 10323 9529 8764 9235 9209 9211 9608 8755 8917 8815 9281 9360 8914
7696 8914 7809 9480 10415 9638 9986 9904 9414 8879 9673 10054 9004 8373 7733 6982 8053 8319 8678 8780 9121
7677 9121 7358 7025 7419 8074 8529 8220 8685 8744 8990 8253 7961 8256 8481 7839 7024 7212 8823 8604 6939
7658 6939 6344 6651 5694 4474 4200 4367 4829 4483 4201 5101 4102 3615 3672 4221 3490 2026 1662 1493 2372
7639 2372 2080 2361 2264 1718 1504 814 1126 1526 2282 3620 2844 1891 2837 3534 3100 1283 441 1081 1172 1104
7619 1104 1337 1731 1607 1840 1627 3346 3731 4261 4895 5553 6046 5698 4618 3813 2818 2470 3027 3320 2398
7600 2398 3011 4006 4111 4709 3383 1741 758 333 638 397 173 27 887 1454 424 -342 870 637
7582 637 823 1052 871 288 -179 540 1153 1587 2457 2032 1797 1796 2155 1450 593 1646 2634 1350 -213 -274
7562 -274 884 1891 1690 920 228 -264 0 -218 1106 1992 1597 1301 1479 641 70 128 1333 2039 1120
7543 1120 690 870 -464 -863 -1327 -488 689 198 -768 -1795 -1652 -1143 -588 720 1182 1977 1274 2147
7525 2147 1770 2792 3410 2830 883 423 2701 2191 1026 2122 3094 2558 2068 1049 385 697 415 4
7507 4 13 363 698 -798 -1339 -2311 -1625 29 292 -184 206 -791 -1244 -1387 -839 701 1684 1131 553 1265
7487 1265 3099 3002 1435 1268 2611 2894 2403 2044 1947 436 706 1221 1696 1980 3194 2842 1087 -55
7469 -55 -13 -467 -649 -283 938 1160 489 610 492 362 879 885 836 103 -712 -1278 -1533 -1271 394 951 1798
7448 1798 2580 1847 545 28 -173 98 -2 -1433 -968 -20 1024 2820 1547 514 517 611 1091 629 263
7429 263 -676 -212 542 531 233 -381 -274 783 2035 940 -386 -136 244 -34 -431 176 573 1824 2832
7410 2832 1896 2395 2339 1556 2125 1342 1245 1532 1284 713 751 1660 1192 1280 2120 1486 1454 2018 1051 -873 -1473
7389 -1473 -434 797 737 834 788 690 1428 1537 1835 1802 1965 1971 1486 1909 2713 2518 1941 2306 1534 1527 1236 803
7367 803 982 1077 798 1105 976 905 1776 3188 2801 2333 2280 1750 2372 2973 2512 1551 1598 903 -135 -498 64
7346 64 673 630 450 549 1112 616 315 692 1472 950 1266 1094 925 1219 3533 3673 1447 734 1324 1614
7326 1614 2167 2914 1790 399 504 146 614 847 1302 1393 683 1340 1628 1423 1055 1391 1662 258 -697
7307 -697 -482 295 1304 1893 2378 1771 2195 2595 1752 1526 1099 505 -1529 -1642 -1370 -1585 -1457 106 2277
7288 2277 3114 2717 1825 667 -38 -464 -464 908 1158 1038 293 93 -864 -221 200 -868 -1788 -1560 -1194
7269 -1194 -1177 -101 360 613 599 216 62 7 413 613 1555 1023 -705 -803 346 -378 275 658 -177 162
7249 162 -989 -2227 -1582 -914 -316 -23 1228 1614 804 -713 -1788 -778 -379 -21 -413 -691 -707 197
7231 197 660 166 -1013 -315 187 -404 -578 405 -104 -551 -866 -574 -726 -1180 -965 24 1065 1394 24
7212 24 -390 441 826 1307 1561 924 708 1536 1871 2030 2781 1954 443 -952 -496 -517 -416 -778 -1915 -2178
7192 -2178 -1681 -1758 -1460 -1406 -564 -118 -295 -1878 -1902 -439 1301 1525 1557 1364 1121 446 1110 1550 1488 1179
7172 1179 1118 1199 1624 1008 883 980 -873 -2082 -2017 -2034 -1422 254 294 65 -108 -753 -1229 -730 -216 339 -174
7151 -174 298 1137 -321 -601 556 1178 900 -344 47 1006 1189 292 -19 14 -1022 308 1353 2463
7133 2463 2870 2117 2475 1951 2008 2214 1567 1181 852 1095 2019 2594 1033 818 1028 2105 2278 2538 1791
7114 1791 758 1286 2739 2104 1462 321 -900 -1027 -1443 -2300 -3508 -3349 -3522 -4438 -4068 -3174 -1470 -1296
7096 -1296 -3125 -2626 -840 -316 280 1172 2115 993 -51 168 390 244 654 191 -1309 -941 -552 -986
7078 -986 -689 -1174 -2675 -2091 -1981 -1393 -822 -917 -1364 -2218 -867 -1298 -1285 -587 -959 -869 -374 -901 -1628 -2652
7058 -2652 -2743 -1998 -1341 -2146 -2501 -1864 -1449 -916 -342 -1195 -335 1201 2204 1338 91 -670 -792 770 2112
7039 2112 2185 2183 1837 1835 2160 2160 1272 633 187 527 362 -38 -1108 -762 -282 -1181 -1091 -1122 -2262 -1846 -131 692
7017 692 1608 2191 1288 134 -297 -293 -882 167 625 712 1349 509 -383 -55 214 75 -1182 -1625 -1601 -1646 -795
6996 -795 -893 -1421 297 744 133 448 775 1882 2104 905 949 -23 -1714 -1756 -1157 438 488 -300 -765 -1185
6976 -1185 -664 -465 -904 -1256 -991 -1442 -1162 -1438 -2183 -2226 -1944 -1172 -617 -1141 -1212 -1810 -2613 -1903 -772 -259
6956 -259 -519 -1031 -572 -1062 -837 47 1157 1822 1534 1872 2064 2140 2325 1953 1555 1697 2105 758 820 117
6936 117 619 144 1328 838 -81 775 275 -626 87 283 929 53 -481 -138 877 1094 1677 1982 1191
6917 1191 601 821 -176 -138 -1252 -1463 -1338 -1075 -1066 -178 103 -79 -3 145 891 474 -567 -1216 -769 297
6897 297 1378 2265 2139 1505 1746 641 872 1877 1549 615 -466 -1780 -1724 -491 616 340 -897 -1103
6879 -1103 -1585 -2301 -2232 -2136 -2754 -3252 -2356 -728 -1409 -1716 -1214 -1580 -1774 -1107 -1177 -1529 -2355 -2608 -1671 -268
6859 -268 -68 -1217 -1918 -1381 -1011 -700 182 -1408 -548 1446 1285 -75 -778 -1153 -1333 -2115 -1238 -1231 -2926
6840 -2926 -2519 -2158 -2798 -3309 -3621 -2223 -1726 -918 -725 -992 -1008 -2036 -2794 -3356 -2028 -1207 -464 879 2674
6821 2674 2506 1609 908 -198 -1358 -2188 -2005 -1956 -2218 -1707 -948 160 1922 1970 1436 1796 2487 1844 321
6802 321 -472 -201 -108 -1263 -2064 -1306 467 481 -1160 -1530 -1949 -2724 -1509 354 753 647 392 177 -1229
6783 -1229 -736 705 1043 -770 -1029 -204 -211 -540 -415 226 115 -603 -818 -783 -662 -1201 -1031 -1414 -1115 -1308
6763 -1308 -156 562 356 -501 844 1158 -293 -189 98 -689 -1884 -3189 -3919 -4231 -2694 -2707 -3095 -3572
6745 -3572 -3698 -3947 -2645 -805 -1458 -2724 -2572 -2118 -2008 -1858 -2295 -616 -344 -270 -1376 -1825 -1248 -1343 -2526
6726 -2526 -2948 -954 141 -443 -1092 -1525 -1532 -990 546 -74 -386 -664 -1304 -2491 -2852 -1343 -1457 -231
6708 -231 835 1506 1407 -643 -1831 -1161 -615 74 375 -151 -759 -1396 -1128 -651 -1074 -1685 -1792 -1849 -548
6689 -548 -638 -830 -717 -691 -1966 -2416 -2341 -1727 -2104 -1998 -591 -144 -822 -1518 -1692 -1424 -1818 -1697 -1425 -1374 -495
6668 -495 424 267 -380 -1208 -672 388 251 -354 -1392 -609 530 203 -904 -1926 -1484 894 1171 -995
6650 -995 -2124 -1814 -2331 -1687 -1922 -2901 -3421 -2959 -1771 -1012 -695 -822 -890 -1154 -948 136 1135 1213 913 740
6630 740 522 441 1476 1353 1518 2205 2363 2109 1660 1130 2088 3028 2182 1161 600 -343 -551 681 1094
6611 1094 872 1168 818 779 945 1541 344 -8 -767 -3014 -2487 -898 -880 452 2011 3687 4513 3952
6593 3952 3649 2742 1279 -197 -1595 -1305 -464 -1364 -1133 67 -385 -1449 -1692 -1484 -1250 -576 -226 327
6575 327 623 224 235 -536 -907 -957 -2103 -1058 681 1876 3246 3467 3532 3456 3327 1259 171 -263 303
6556 303 58 -1070 -1050 -1723 -1116 -211 -1445 -1921 -1130 -1089 -824 -459 -108 -849 -1064 -1782 -2373 -2786 -3053 -3006
6536 -3006 -2362 -1929 -44 3752 6275 6797 5968 5127 4754 4330 4033 3529 2506 668 -512 -655 -915 -1238
6518 -1238 -599 -1138 -2884 -2621 -2031 -2977 -2640 -1415 -585 -83 -43 -157 138 -392 -471 -758 -857 -2001 -1862 -838
6498 -838 -1904 -2555 -1598 -51 -65 -966 -975 -383 -530 188 263 -1145 -1052 -249 130 550 528 338 -392 -598 -144
6477 -144 442 654 -289 -504 188 1129 1056 1510 503 1432 473 399 -341 -965 -295 963 1934 1604 1031 -593
6457 -593 -1086 -1707 -1806 -1447 -1747 -1125 -460 -1349 -1928 -1968 -288 808 997 1548 1412 1277 1519 819 -491 -1270
6437 -1270 -2223 -2267 -2651 -2722 -2574 -1355 552 2580 2846 1774 -12 -103 279 985 1238 677 859 2537 2612
6418 2612 1651 1847 1929 1807 1488 994 -609 -1293 -203 288 750 695 158 1071 1521 751 68 351 65 410
6398 410 -222 43 383 279 -2 -507 -1220 -2081 -1147 -525 -2490 -3653 -3748 -3034 -2729 -1875 -590 -1107 -610
6379 -610 130 -689 -1150 -1550 -1374 -602 -23 -388 -296 738 174 -190 176 45 -384 -1470 -186 653 565 -74
6359 -74 590 1720 2306 1986 1048 -400 -1691 -2072 -942 -1021 -181 760 1757 1494 562 1188 1195 1380 988 59
6339 59 176 512 948 1078 1758 1747 1668 1867 1267 311 -114 -594 -611 229 -158 -1233 -1199 -867 -629 -378 892
6318 892 1345 528 -40 -90 -190 -72 -553 -1107 -1480 -1228 -522 815 356 4 301 1273 1421 492 633 1162
6298 1162 776 -44 -558 -382 104 996 1206 1636 1653 1352 940 637 505 -300 -122 -330 -806 -243 -1640 -1559
6278 -1559 -166 -903 -1217 -1300 -1254 41 -66 -1039 -1279 -152 1451 1520 333 -58 635 868 -530 -1536
6260 -1536 -1230 -926 -1385 -1339 -1707 -1588 -370 -201 871 717 -295 -955 0 425 836 921 129 -804 -1459
6241 -1459 -1047 -1054 -283 -54 -277 -711 -1699 -1516 -189 665 529 109 -377 -98 -187 392 720 -330 -601 284
6221 284 870 353 1075 1242 1391 696 1026 -21 -435 -506 -637 -512 541 886 -175 -1139 -65 -646 -826
6202 -826 -1036 -640 -456 299 -114 -968 -1720 -1534 -1978 -1407 -2086 -2286 -1731 -601 -996 -24 733 630 239 981
6182 981 -350 -1893 -3133 -2631 -1477 106 370 -265 -11 -5 -249 -315 -524 131 287 -97 -734 -1210 -1527
6163 -1527 -1040 -1480 -1706 -2009 -1843 -1261 340 1089 999 362 -214 564 211 -753 -1082 -305 583 628 138 792
6143 792 193 -666 -1940 -1265 -128 -848 -130 801 -156 -600 -549 -709 -1129 -1201 -1073 -462 163 406 284 -546
6123 -546 -606 -485 -300 -756 -300 -35 -1623 -2060 -3131 -3443 -1907 -1557 -2372 -1983 -1186 -866 -1454 -2364 -1381
6104 -1381 -578 -1242 -1404 -1324 -2529 -2920 -2505 -2882 -2381 -1043 -1461 -3750 -5131 -4632 -4472 -2530 -1134 -1005
6086 -1005 -1133 -1507 -1963 -703 788 1011 -181 -837 -46 747 228 -437 -1100 -815 818 808 -146 -684 -1716
6067 -1716 -2590 -2701 -1813 -537 -848 -415 674 184 1043 2370 2478 1108 353 590 460 -3 423 -534
6049 -534 -394 539 461 358 1320 1339 623 462 998 709 333 -227 315 1407 1589 1264 728 -808 -3517 -3383
6029 -3383 -2745 -1719 -2221 -2818 -2069 -1381 -1947 -1649 -914 -902 -890 -571 407 588 1507 2711 1979 220 -410
6010 -410 -541 -547 204 512 384 -382 -903 -1248 -2387 -1540 -340 -144 -904 -395 -1125 -1957 -2802 -2448 -1105 -1681
5990 -1681 -2067 -936 -995 -1645 -2070 -1972 -1024 -160 112 442 -129 -1677 -1631 -1165 -1575 -2368 -2568 -2585 -1796 -898
5970 -898 -202 13 -893 -1044 -1284 -1836 -757 -386 -1312 -502 649 -1011 -2418 -2543 -2225 -1604 -1252 -1263 -239
5951 -239 70 1254 737 398 1547 1074 -305 -2052 -2984 -2284 -1542 -1309 -243 -74 591 1356 1303 1909 1179
5932 1179 -66 -216 795 393 -582 -1140 -879 -871 499 1674 1139 -302 -121 546 679 894 629 -605
5914 -605 -593 784 1290 1042 1376 2131 1413 1843 1168 1679 1735 90 -776 -1013 -1152 -1196 -2349 -2908 -2511 -1831
5894 -1831 -1430 -1350 696 960 1120 1550 1312 568 27 505 996 385 -352 -83 354 649 -181 -615 -1593 -2722
5874 -2722 -3188 -2812 -1824 -1038 -807 -487 -272 -440 -526 -132 80 -281 -194 144 303 -608 -530 -1458 -1433 -425 1113
5853 1113 1394 1955 2447 2496 2312 2450 2270 2910 2610 362 410 -499 -245 734 1358 1537 2214 2479 1630 1280
5833 1280 1021 232 48 -758 -874 -26 557 -1077 -1987 -791 156 146 -597 172 705 402 894 60 -27 -798
5813 -798 -2074 -2106 -1347 -727 -413 -171 -151 -699 -669 -214 44 -294 -383 -1258 -1019 157 210 1648 1840 1024 1627
5792 1627 942 1186 810 367 799 1593 2176 1897 1189 1921 2967 3151 1444 1269 437 826 1813 821 80
5773 80 -597 -378 -779 -403 -264 -1049 -2109 -2019 -407 -300 -1222 -1793 -2077 -2166 -1893 -2388 -3567 -2439 -1922 -2117
5753 -2117 -1355 -195 -417 -1136 -1704 -1377 -351 -1032 -2151 -1466 -122 88 -1729 -1417 -1161 -1942 -1564 -207
5735 -207 -540 -1028 -881 -194 -335 -839 -1171 -1369 -55 1006 921 1196 880 667 615 374 622 -701 -1658 -1742
5715 -1742 -1623 -1346 -614 -443 -904 -879 -342 -680 -1434 -697 248 -343 442 -154 -754 -1730 -2833 -2141 -983
5696 -983 -468 234 -67 -1388 -1286 -323 272 122 -321 -583 -343 1590 2524 1865 953 1611 3040 3715 1773
5677 1773 -675 -2772 -2250 99 2687 5505 8355 12090 13676 10835 7222 3062 -898 -1860 -1060 -1216
5661 -1216 -2460 -2727 -2680 -3080 -2236 540 1660 860 99 543 1071 1855 1433 1835 2513 3340 1940 -1147
5643 -1147 -3651 -3550 -1568 1384 3399 6220 9334 8018 5111 2208 296 -183 1418 3436 4028 2596
5627 2596 952 -777 -637 350 892 475 169 -264 -828 -335 131 305 683 1566 1011 -1238 -3264 -2133
5609 -2133 203 2630 4302 5729 8176 9038 8124 4805 2046 1069 1120 515 726 -585 -692 -330 621
5592 621 1305 454 952 730 -515 -1209 -1581 -1317 59 278 -685 -1387 -2141 -2506 -1879 -1293 -77 1608 888
5573 888 1445 1164 163 1193 2888 2876 2396 2481 983 716 1129 1279 1117 445 210 -63 -656 -2086 -1342
5554 -1342 -304 -276 -575 687 657 1183 808 351 -405 -517 -547 -492 -980 -622 -1597 -2128 -1522 -1787 -114 389
5534 389 -754 -1273 -2166 -2413 -1238 -192 953 929 292 358 838 295 -395 686 568 -654 -642 368 103
5515 103 -1774 -1851 -1284 -705 -376 -1131 -1358 -1446 -1467 -2123 -2660 -2513 -2170 -1584 -1528 -1551 -1684 -792 -848 -1311 -6
5494 -6 1832 2297 1862 1500 1458 280 -1359 -1422 -393 -1100 -747 -750 -1171 -1440 -1255 -1655 -935 -143 756 1277 858
5473 858 -580 -861 -1509 -1204 -529 -832 -695 -1375 -1572 276 636 -384 -964 -1556 -1617 -2217 -3177 -3038 -1876
5454 -1876 -1268 -1796 -1951 -1121 -826 -1356 -2181 -2409 -1301 -1081 -99 -54 -9 26 -777 -1071 -919 -162 -1025 -689
5434 -689 -894 -2508 -1902 -1682 -1538 -1541 -599 296 -530 -919 -1109 -1194 -309 -105 992 1134 -54 -1428 -1957 -1403
5414 -1403 123 -521 -685 -1597 -1239 -491 -1015 28 1036 1899 2162 -57 -1270 -1149 72 1102 1824
5397 1824 1766 847 375 -342 -201 942 706 235 391 -239 276 1384 3240 3778 2254 472 777 451
5379 451 135 761 253 -132 -896 273 -121 -648 403 621 337 723 1302 2635 2122 767 -1403 -1247
5361 -1247 -1008 -1374 -1482 -2001 -737 -606 -1428 -1072 650 219 -723 -815 -290 -638 -1214 -653 -179 -507 889
5342 889 2901 2271 634 382 75 -1109 -1868 -1521 -952 -1006 -1381 -788 -35 -2229 -3069 -460 677 -603
5324 -603 -1254 -988 -1311 -797 -75 -59 -427 -415 99 532 277 259 -1036 -1512 -1418 -1009 -770 -282 -1677 -1531 -1694
5303 -1694 -1038 -341 210 256 -924 -304 -421 -355 180 -1585 -1275 -1625 -2278 -2649 -2134 -753 98 -217 -765
5284 -765 14 -321 -864 -52 114 201 463 -137 196 335 343 -546 -1995 -2140 -658 -830 -793 35 925 1820 1606
5263 1606 536 498 715 122 -812 -886 -1594 -485 90 -301 76 236 1302 1654 1079 514 127 -465 -1379
5244 -1379 -1171 -173 -360 712 -131 -1438 -821 35 954 454 329 811 1740 664 -15 724 133 -709 -468
5225 -468 -408 672 1719 1247 1416 2168 2065 1790 911 11 -7 1537 1210 449 -209 -91 501 808 543 392
5205 392 -805 123 118 -218 -1394 -2375 -948 236 -1786 -2155 -1765 -816 -140 -75 915 804 -607 -293 1034
5186 1034 442 -1410 -962 -611 -281 706 836 -282 -1358 -111 113 30 272 564 732 664 1156 -46 -240
5167 -240 141 811 865 666 157 -643 -330 1295 1194 287 321 760 -70 -53 759 1056 1276 1952 2690 1926 1560
5146 1560 1636 909 -180 -950 -284 171 -510 -1037 -546 -770 -900 -662 -773 -396 -852 -1074 303 319 -459 -1480
5126 -1480 -1478 -911 -2195 -2638 -904 -130 789 580 -756 231 799 -393 -915 -1194 -993 -476 264 815 578
5107 578 939 1028 527 195 -558 -739 217 -62 -1264 -2174 -1605 -1522 -1247 -731 -804 -2603 -2337 -1344 -1788 -1519
5087 -1519 -558 -812 -1996 -1677 -1748 -1599 -646 -770 -168 401 606 445 590 1107 589 -267 -920 -1490 -505 183
5067 183 325 1120 1281 855 1261 1914 2062 1594 1540 1925 1913 500 -1654 -1948 -2005 -1686 -456 -629 -294 -545
5047 -545 -903 -1097 -2286 -2007 -1021 -149 242 480 852 1424 1663 2271 1894 1933 1311 1592 1210 715 1929 2670
5027 2670 1434 721 -638 -1052 -994 -274 -346 138 736 827 749 199 681 444 71 897 423 -473 -1117 -708
5007 -708 -157 -127 -802 -289 -353 420 1436 1198 981 650 887 1068 523 -511 -1608 -1588 -2170 -1285 -1713 -1351
4987 -1351 -1209 -2187 -1910 -1348 -1547 -1700 -1954 -1277 -1492 -1960 -1242 -287 -587 -581 412 814 910 1342 -79 -165 -974
4966 -974 -269 1207 586 -317 -1134 -1866 -1639 -1441 -1271 -541 349 -181 -594 -1444 -1595 -1358 -1718 -2176 -921
4947 -921 -4 -1063 -1966 -1957 -1245 -1020 -963 68 123 -1578 -1977 -1872 -1668 -196 74 -301 -460 -200 660 776
4927 776 1240 779 425 482 624 1153 2221 1298 1144 1338 1266 1248 811 1178 2199 2619 674 -880 -974 -813
4907 -813 -1432 -1353 -1683 -1005 -1131 -1194 -911 -579 181 -104 48 -904 -668 -1015 -1038 -1345 -855 -640 -526 -804 -1580
4886 -1580 -1494 -859 -804 -247 -347 -1252 -1139 -965 -1146 -1709 -1889 -1308 -2096 -2360 -1120 -309 276 -694 -1260 -359
4866 -359 -729 -2012 -1205 -1469 -2779 -2049 -1371 -833 -101 10 -1025 -1611 -2102 -2309 -863 -677 376 1632
4848 1632 2250 1662 2227 3140 2735 1892 1000 455 969 325 -440 611 338 14 -1304 -578 400 -581 -1752
4829 -1752 -1401 -486 -458 -1302 -1770 -1939 -869 -240 363 -662 -401 91 562 652 871 619 360 -416 -1225 -1393
4809 -1393 -1265 4 2 -927 -1367 -2094 -2107 -763 -477 117 508 1229 1318 184 -621 -995 -905 -808 -345 218 1456
4788 1456 1551 909 -152 -183 -461 155 1375 2298 1518 435 131 -1191 -1517 -1261 -794 -421 412 202 -1185
4769 -1185 -1733 -1326 -1503 -3068 -3604 -2382 -1353 -67 1372 117 -2441 -2520 -1384 -729 688 873 -526
4752 -526 -1119 -1431 -1746 -131 223 -946 -1598 -1950 -1330 -1302 -1379 -1896 -906 1086 2125 2073 1462 1184 1429 1183
4732 1183 813 -253 -558 -365 738 1926 2306 953 -1613 -701 15 -428 -417 -990 -1106 -276 357 1207
4714 1207 832 -1014 205 1251 801 779 -444 -1871 -2036 -1311 -1758 -2056 -1284 -1106 -1284 -750 215 -365
4696 -365 -342 -80 -44 1571 2729 2032 481 -225 1056 953 -356 1675 1300 -518 -684 -487 -160 703
4678 703 1697 2406 3117 1759 1095 1037 -362 -616 467 1137 1088 272 -1164 -2551 -1385 -4 -826 -1159
4660 -1159 -467 538 509 -13 -470 -374 -183 41 -5 814 347 1092 1230 639 606 660 698 1401 1662 401 -645
4639 -645 3 535 -194 -567 584 2618 1147 -288 336 1847 1875 749 1301 1500 -23 -1244 -1741 -1178
4621 -1178 -203 1326 1247 1105 1304 595 -232 -510 -695 -2445 -2248 -2057 -2912 -3279 -1245 -1252 -1708 -1805 -504 -1200
4601 -1200 -2644 -1285 -90 1498 959 119 807 1181 1150 1049 638 678 520 748 381 -441 -446 -752 -1772
4582 -1772 -3168 -3325 -3434 -3512 -2804 -1682 -1374 -605 125 764 943 1403 1520 881 648 489 -119 550 545 -444
4562 -444 -696 810 997 1208 408 -1452 -1559 -765 -505 274 -312 542 1195 672 128 -1000 -1622 -1374 -1955
4543 -1955 -1351 -62 21 908 1705 377 -720 -488 -916 -1484 -800 456 349 429 244 -45 -269 -229 -271 -1199
4523 -1199 -1770 -244 1423 2010 1962 1515 842 103 302 538 274 -15 209 439 -198 -11 -1187 -1294 -329
4504 -329 -940 93 1012 699 -278 170 240 -160 -729 -425 -1322 -2013 -1594 -2413 -3904 -3818 -3049 -1249 -58
4485 -58 -1129 -2395 -1807 -2299 -2079 -2163 -2225 -1667 -234 -356 -251 -11 950 726 -582 -1456 -1382 -576 -781 -305
4465 -305 -560 -958 -765 -190 -166 -1197 -1779 -315 306 101 467 302 704 756 514 -42 -1894 -2653 -2036 -1276
4445 -1276 -1091 -2852 -2231 -1830 -1383 -1133 -611 -666 -1725 -1720 -927 -2769 -2962 -3053 -3397 -1926 -1501 -1739 -888 -259
4425 -259 -978 -2077 -2556 -2974 -2867 -2449 -2137 -1845 -255 -974 -1010 -1308 -1752 -994 100 -522 0 569 381
4406 381 361 221 -729 -149 -926 -1817 -2182 -644 229 1675 1437 -929 -1342 115 163 3 -824 -1547 -1440
4387 -1440 -2026 -706 375 -277 -921 -320 664 736 556 1259 1868 1884 1780 2119 2730 3031 2142 1774 555
4368 555 630 591 1035 1020 428 58 -758 -1783 -1658 -1127 -544 185 1292 690 270 1031 230 -726 -2364 -3431
4348 -3431 -3712 -2816 -2120 -1857 -2657 -3446 -4174 -4360 -3854 -2773 -110 -61 -532 -1221 -1635 -1265 -1285 -1603 -912 -406
4328 -406 -573 -1315 -2170 -1182 -174 -382 304 821 -172 -187 528 -326 -40 -941 -1937 -1438 -868 279 831 246
4308 246 506 1170 -416 -500 -671 -749 -1677 -714 -571 -599 -1583 -1284 -629 -882 -1092 -1377 -1036 -1470 -2312 -1878 -1523
4287 -1523 -941 -1285 -1296 -823 -1169 -1121 -588 -193 -599 -1508 -2043 -1373 -1737 -2629 -1884 9 651 365 653 470
4267 470 71 -1042 -1285 -350 120 -304 -1234 -790 1465 1470 -330 -954 -1879 -1271 -1666 -598 309 -543 -487 1019
4247 1019 1315 522 1339 1795 1044 650 1013 1287 893 658 485 -586 322 592 523 -539 -2186 -1876 -680
4228 -680 -90 913 792 101 971 1985 1077 1132 729 289 -606 -874 -735 -1029 -1747 -1903 -1246 -610 -1107 -513
4208 -513 544 -22 162 -226 -474 -220 508 362 -240 -515 -475 -650 -617 -178 15 -269 821 1766 2432 1895
4188 1895 1128 -106 -1745 -2977 -2003 -1493 -1422 -1505 -1225 772 865 1450 1949 1033 266 -69 -31 -655 -181 -335
4168 -335 -1233 -1569 -1047 139 767 126 297 574 896 620 -464 -1423 -624 291 408 21 20 -283 -1225 -44
4148 -44 1957 1793 604 -307 -1191 -944 -433 273 73 1031 700 -511 -40 1019 1231 328 -243 -270 -424
4129 -424 -718 -422 -909 -874 -513 -281 -230 -561 -539 483 -181 -554 158 409 238 -322 1088 1254 1166 1365 544
4108 544 150 -590 423 697 1689 970 297 291 369 341 1427 1880 1321 398 -817 -1240 -363 718 499 1353
4088 1353 2310 2426 2055 1832 1315 890 1159 1663 1500 658 141 -416 -1486 -1236 -515 872 2126 1697 213
4069 213 -663 -343 1246 1176 490 1127 508 248 449 363 1367 1350 -227 -1262 -1069 -538 -697 -1140 -965 -1252
4049 -1252 -558 538 232 805 985 254 -1319 -1631 -1181 52 -176 -890 -347 563 818 374 -299 -206 -1030
4030 -1030 -3114 -2692 -2400 -1141 -943 -558 212 192 -420 -751 25 134 231 679 1746 1659 1042 330 82 -1156
4010 -1156 -1376 -775 -756 -488 -288 -592 680 1346 80 -160 948 1380 1227 1323 614 588 1901 1256 671
3991 671 68 -842 -1017 -1225 -935 -736 -1029 -1198 -421 -58 -508 -737 -414 -38 -1693 -2339 -2125 -986 -1792
3972 -1792 -2051 -933 -629 -176 -145 5 -721 -2260 -2975 -2939 -3136 -2288 -1047 -1725 -2489 -1759 -1168 -738 475
3953 475 145 -493 -1365 -993 -1252 -1454 -1571 740 1398 635 -860 -1960 -2047 -2101 -1184 -238 58 -1144 -1055 -562
3933 -562 -785 -193 756 1796 2241 2157 1102 -1183 -2238 -2962 -2466 -1157 -731 370 702 731 691 318 944
3914 944 1483 1485 1267 1103 -5 -895 -831 -499 -207 -564 49 492 1082 642 -479 -534 -818 -341 -734 -1825
3894 -1825 -1823 -298 661 -68 214 300 -603 -954 919 913 415 761 1307 653 813 1449 475 747 491 -825
3874 -825 -1416 -1237 -48 293 481 -327 -1067 -695 527 2330 1194 -82 -422 339 1216 1828 1524 1656
3856 1656 2039 1675 207 -737 -142 -553 98 -3 277 -308 -1540 -1501 -528 -1348 -1524 -394 -58 -1293 -1428
3837 -1428 -363 96 -378 -382 292 -1015 -1386 -2041 -604 536 739 528 -161 -713 -1067 -179 -337 -450 -469
3818 -469 1106 761 765 540 -98 599 757 71 1075 1461 1272 732 770 816 263 -905 -1459 -679 -1054 -662
3798 -662 -664 -464 946 2266 2981 1573 1844 1091 155 635 1382 1187 180 -814 -1402 -700 -5 -641 -869
3779 -869 321 249 631 960 1103 531 474 -57 13 -276 -325 -297 326 707 1684 668 -730 -1474 -1905 -670
3759 -670 -347 -250 104 140 -4 272 205 454 -900 -570 747 3180 3140 2496 465 -307 -1021 -1753 -927 223
3739 223 667 821 744 1327 1033 724 -536 207 296 -775 -271 -309 -364 -741 -739 -863 -736 -857 -574 -896 -1758
3718 -1758 -1133 108 189 -517 -329 -689 -766 -913 -1069 -718 -690 -546 -664 421 1446 1038 261 -1254 -697
3699 -697 196 1236 1379 1327 1674 705 -1128 -1477 -732 480 1281 1027 307 -1041 -869 -866 -572 608 1951
3680 1951 1495 558 371 411 -502 -851 479 997 -270 -448 311 1052 1369 1935 679 1293 1468 1288 1337
3661 1337 1462 2156 1700 1361 1223 -94 27 767 40 748 1882 1643 961 -557 -171 338 -232 -788 -1211
3642 -1211 -218 1205 1295 571 976 816 322 -1225 -556 278 -323 -387 626 -275 -260 -196 -275 201 490 1408
3622 1408 2012 1029 319 122 -343 12 376 548 1224 1357 1104 1738 885 597 691 408 780 826 140 742
3602 742 523 55 0 927 1541 248 -610 -748 -686 -489 451 707 597 1293 1266 1116 421 -587 -472 -1398
3582 -1398 -1948 -1516 -1836 -1801 -1787 -226 1282 1414 2420 2415 1257 860 -429 -1486 -1419 -863 -389 1003 27
3563 27 224 785 1720 1717 1659 992 311 400 -26 -975 -330 647 189 -1010 -2502 -3178 -2911 -2657 -2031 -1296 -2297
3542 -2297 -3867 -3871 -2816 -2466 -1747 -1486 -1032 125 1564 1197 295 228 555 823 -286 -1202 -2048 -829 -1743
3523 -1743 -1724 -2052 -2784 -2297 -679 -167 178 -175 501 1081 1473 981 -969 -1996 -1575 -126 -218 -923 377
3504 377 1290 971 651 186 -1050 -1825 -2038 -2057 -2554 -1656 -513 -717 -1457 -215 -310 -929 -1076 -1489 -1125 -310
3484 -310 187 -393 -627 -1756 -1484 -1794 -794 -1289 -2199 -1456 -1428 -976 -1247 -1024 -1073 -1358 -1388 -1096 41 -1397
3464 -1397 -2201 -1719 -1922 -1144 -257 -457 -409 412 2054 922 366 1236 1252 933 2218 2090 816 1689 1105
3445 1105 792 103 47 -264 599 1489 264 -126 -279 -1586 -845 -984 -1368 -1622 0 1083 1305 1323 569
3426 569 418 14 -581 36 -272 611 1129 1467 1203 1202 1596 1787 758 690 -434 -1153 -1708 -2056 -860 -351
3406 -351 -862 -260 28 711 -48 -266 495 1898 1182 -769 -602 -220 -394 -1690 -901 -596 -717 1037 2202
3387 2202 2593 1284 -254 -864 -828 -861 -1082 -556 486 -844 -1648 -1330 -1018 -980 255 694 547 1165 1085
3368 1085 869 495 -340 -295 547 1975 2585 2823 4361 3814 3190 3991 2658 633 -449 -770 -167 467
3350 467 219 381 1633 2443 3167 3765 2287 1494 1113 1212 1433 292 -66 -636 -954 195 1042 474 -183
3331 -183 -466 -667 -1479 26 1048 1232 1904 1786 906 -509 -322 1243 757 215 520 1905 2958 1161
3313 1161 145 257 -230 -549 -399 -621 -1165 124 852 1012 1258 1404 784 99 -930 -303 -509 -1175 -454
3294 -454 444 128 1200 1304 -37 -1486 -1324 -394 845 1258 1738 985 -860 -802 -865 -533 -15 685 1161
3275 1161 1235 1472 1701 1002 636 1302 1251 1636 2025 2171 1127 327 496 941 1446 -60 -1108 -1320 -708
3256 -708 36 -49 -961 -1471 -1101 645 476 80 -309 278 -53 325 56 -1957 -1622 -406 -897 -416 453
3237 453 -250 -1942 -2604 -2318 -2411 -3003 -2950 -2306 -925 422 -180 666 924 651 368 305 -277 35 136 -78
3217 -78 333 258 -89 -818 -74 1002 568 -444 -1513 -695 -165 982 80 128 292 601 53 -907 -734 -613
3197 -613 -480 -369 949 671 -146 638 580 1423 1936 875 -672 -25 258 928 1171 990 1280 1085 1435
3178 1435 1062 153 -1384 -1443 -490 -362 -402 -1186 -1297 -919 589 849 1684 1823 1009 -484 -1519 -903 -710
3159 -710 120 -296 78 -373 -1730 -1331 -888 -163 990 1641 1079 1531 1456 1114 -28 -727 619 519 -49
3140 -49 -856 10 66 249 1259 1995 367 -1057 -1206 -875 -423 -162 895 384 312 -497 -521 -1120 -829 -763
3120 -763 -827 370 1540 216 -1560 -1411 -945 -1244 -1220 -863 -1377 -1618 -1359 -1227 -2260 -1965 -793 475
3102 475 1165 1807 1308 787 513 1499 2073 1456 715 1194 1334 1633 1099 1587 1905 1033 986 -60 -1103 -703
3082 -703 -758 -1470 -518 1124 1510 -219 88 636 168 919 568 -1003 -665 -258 -257 -654 707 1555 1614 1510
3062 1510 1616 1852 652 454 127 -618 810 1615 -120 -1333 -608 1041 1641 639 1196 1361 1080 187
3044 187 -43 -381 -1929 -999 72 -156 -238 1352 1162 81 -1393 -1173 -2315 -1787 -39 2164 1225 845
3026 845 1272 1445 361 -926 -531 282 557 893 789 1070 313 -585 -1195 -601 197 241 -94 177 537 -711
3006 -711 -2045 -1827 -1055 -578 159 -140 -681 -1368 -1100 -1477 -2409 -2152 -2100 -2470 -1605 -764 -850 -1120 -1121 223 248
2985 248 506 1217 1962 2146 1260 491 -246 -1057 -599 432 94 -369 -2529 -2723 -1318 566 514 79 -899
2966 -899 -2070 -1820 -1012 -1585 -975 680 1948 2773 1936 2048 1632 1804 915 598 -60 -359 789 681 572
2947 572 -2 -762 -903 -1493 -2174 -2593 -2321 -1701 -1177 -1558 -1579 -119 -627 -1021 -1448 -2210 -2294 -1648 -1336 -2256
2927 -2256 -1126 -115 399 537 153 600 670 1641 1352 823 1385 1700 1426 1075 -423 -442 -1109 -795 646
2908 646 1272 1066 1193 1712 1207 128 906 1043 179 830 1860 1929 1212 1384 1686 2014 1767 1084 511 70
2888 70 995 1117 -65 188 876 919 425 700 209 168 -372 -327 213 722 640 990 1342 783 1596 1066 172
2867 172 874 2002 1872 2609 2021 -36 -606 -608 423 1267 1641 1212 1975 2536 1081 -789 -3111 -3011 -1168
2848 -1168 -286 -793 -1309 -1518 -1658 -1491 -931 -226 235 876 112 -637 -706 -627 -620 -854 -529 -266 1312 1222 614
2827 614 268 917 1055 631 300 -545 -18 -41 1870 2099 2759 3549 4087 2663 793 -1739 -2737 -1270 -78
2808 -78 -187 -190 631 318 -367 -187 209 1501 56 -914 447 594 1598 1018 -675 -841 -1050 -776 -288
2789 -288 -157 1024 1821 1902 1130 2225 2578 1281 793 1317 2357 1667 1730 1753 1259 1284 1866 1221 1034 1485
2769 1485 3229 3372 1931 603 -329 -285 -1625 -582 -502 -1248 -45 -72 -534 -1530 -1068 -1681 -1281 12
2751 12 437 8 79 -165 21 180 -500 -1525 -1157 -1850 -1578 -1318 -1443 -1157 -376 333 1661 2110 2260 2088
2731 2088 1819 1156 2008 2030 1151 1424 1124 1665 2963 3183 2841 2065 998 692 555 892 56 -183 -723
2712 -723 -1425 -598 452 119 -1134 -1178 -619 1084 1774 1282 1474 1009 529 138 1095 781 -753 -827 -888 -559
2692 -559 238 287 -74 417 310 1410 1541 1255 1405 795 237 -31 -575 -1047 25 2003 2319 1963 -198
2673 -198 -286 -528 -156 -527 -844 -802 -1191 -784 19 -291 -582 -972 -1460 -2207 -2121 -1918 -1900 -2487 -1958 -1713 -1628 -1813
2651 -1813 -124 -458 -1275 -23 1431 1846 185 -497 184 1813 666 -669 387 117 -468 -1141 -2262
2634 -2262 -2659 -2421 -1340 452 967 1583 1095 588 401 497 1498 420 -748 -576 163 305 60 686
2616 686 528 -560 -1087 -1496 -1195 -1766 -991 407 1083 471 -206 664 1727 2261 2313 1884 2061 2375 1822
2597 1822 1680 715 -223 -1843 -1722 -797 -234 1165 1371 607 -866 -1275 -981 -836 102 867 -319 -910
2579 -910 -182 115 -467 -234 -100 816 1191 1192 1240 234 453 -631 -721 -1104 -870 -643 -719 -539 215 402 787
2558 787 546 822 1687 2047 1849 578 266 -86 -306 327 1011 669 -1420 -2565 -2059 -758 209 553 822
2539 822 1002 674 507 975 1025 1385 1924 1612 1294 610 -197 -357 -765 -1038 -1589 -974 -317 54 1306 1487
2519 1487 459 -409 -700 -680 -856 -411 225 -832 -1436 -630 545 2805 3586 3140 2985 2249 895 903 1115
2500 1115 -101 37 -321 -1106 -2099 -2267 -1572 -1447 -1418 -99 607 962 987 1085 2113 2342 1321 310 -450
2481 -450 -669 64 698 1627 1539 1053 1693 2279 1552 1105 1253 161 -491 -1736 -2263 -1972 -808 21 -942
2462 -942 -852 396 692 139 812 799 143 467 -13 -440 -510 -25 -555 -1863 -1477 670 399 -693 -1008 436
2442 436 1505 671 -212 542 2117 2676 1205 517 -695 -1202 -817 397 429 324 560 1768 1158 285
2424 285 479 1542 1211 807 482 1464 1552 1290 892 376 -476 -802 -134 411 1068 416 167 1178 1597 599
2404 599 1034 852 1122 247 -359 -26 20 951 1172 964 13 -179 181 -108 -297 210 1752 2058 1180 1308
2384 1308 745 784 2058 2093 1311 832 758 -79 207 28 -1003 -1066 -731 -42 652 959 1384 1617 1239 891
2364 891 2321 2487 1168 667 1181 1814 1636 737 160 702 1627 2778 3607 1372 1101 1171 817 959 2028
2345 2028 1246 1412 2505 2652 2373 652 698 1363 1544 1825 1772 188 940 2746 2225 1180 1138 980 -253
2326 -253 -469 121 1352 1828 501 755 -17 -1452 -672 -148 -1383 -873 -1015 -1249 -386 -503 -524 420 801
2307 801 -137 -1463 -978 -965 -727 399 625 -169 -913 -1388 -847 -346 -378 195 1242 417 -353 388 552 411
2287 411 1125 142 972 1500 1169 1442 1289 1306 1924 1121 490 158 1066 1668 1624 1805 2139 1248 -660 -2219
2267 -2219 -2278 -2126 -1120 74 346 1373 883 836 419 277 715 314 -92 55 -654 -1517 -1407 -678 175
2248 175 -36 -788 -587 -239 609 1392 2415 3292 2912 3223 2038 703 1078 1718 1054 -79 -565 -127 116
2229 116 -92 -1072 -584 900 480 248 -81 594 628 112 154 641 2162 1957 249 -1156 -1609 -1872 -1707
2210 -1707 -2015 -2303 -658 146 982 -55 -1527 -782 -560 -568 -1210 -1683 -428 -102 -415 -751 -122 -1081 -526
2191 -526 3 763 386 -2 566 947 2107 2156 933 872 1012 1238 1316 162 -64 -637 -836 -208 -1258 -1777
2171 -1777 -868 -598 -1349 -2878 -2573 -1518 66 274 -11 -482 -919 -338 1343 553 554 796 -907 -3065
2153 -3065 -2690 -1877 -1368 -950 477 -248 -1906 -1228 -22 1333 1660 1725 2199 1707 371 -297 -569 339
2135 339 1006 1189 975 431 185 -624 -1516 -972 -342 -558 -1059 -1250 -1560 -2650 -1495 -64 1712 1558 615
2116 615 1431 1445 702 157 1308 1822 1400 438 277 -121 -343 -1311 -1855 -1469 57 1575 578 82 1266
2097 1266 2105 1130 261 412 314 962 1034 -312 -1242 -509 -422 176 -413 -1032 -1857 -2217 -1604 -1074 -60 -208
2077 -208 -181 -201 -852 -217 -561 -568 -609 -871 -1187 -887 -1381 -1397 711 2050 2934 3517 2321 1031 -497 -1237
2057 -1237 -1976 -1828 -1229 -137 2155 2372 1548 213 360 334 8 73 -519 -640 -1735 -1265 -1090 -573 -258
2038 -258 -571 -536 -135 730 515 -385 -501 -245 869 878 223 202 50 -266 -203 -63 -119 382 1574 1451 1096
2017 1096 1351 268 165 1022 373 167 354 356 1417 1366 869 327 362 479 -295 -756 -849 -201 -127 -1480 -2178
1996 -2178 -1325 -391 -607 -777 -100 123 -205 -411 748 1564 1002 978 791 332 707 224 348 -84 353 213
1976 213 -478 -294 777 1473 794 -1167 -1961 -2130 -1674 -1587 -1173 -539 286 515 782 -1014 -1265 -273 -208 -456
1956 -456 -958 -165 1134 1014 -428 798 1466 1043 1100 1270 1352 1156 1908 1596 911 220 -66 2 295 33
1936 33 448 499 855 1078 1457 1719 718 431 -414 -1909 -1693 -613 -135 -22 -13 -584 -1255 -1622 -2573 -1557
1916 -1557 -306 624 459 -463 -1346 -1787 -2020 -1382 188 613 89 671 1418 2454 2542 1926 604 -472
1898 -472 -951 -1933 -2158 -1394 -1265 -1585 187 1363 1961 1371 1224 -242 -1886 -509 -329 -2338 -862 794
1880 794 1676 1784 1859 1111 557 257 1133 509 435 536 966 1137 -49 954 2404 3236 2444 1548 1452 2077
1860 2077 1529 1584 645 1210 2578 3065 2912 1706 621 709 2182 3120 2382 1721 699 -462 293 1408
1842 1408 1585 220 811 2952 2061 1533 886 1905 2120 2201 1730 987 4 -680 -709 -1050 -704 -65 955
1823 955 2304 1636 -76 -685 -1072 -769 -1168 -1015 -310 -1279 -2049 -1092 -512 -1039 -2053 -2248 -1098 514
1805 514 443 484 843 989 658 847 524 807 302 -558 -330 378 286 1024 524 -633 -1430 -1144 -138 -22
1785 -22 -245 -483 -2189 -1877 167 195 -514 -1399 -1510 -1497 -415 14 -391 -747 -594 -341 375 359 662 976
1765 976 -40 -782 -655 -748 443 1612 1962 1583 -530 -589 -50 481 877 289 -238 -426 -148 -1285 -1361
1746 -1361 203 409 -625 -729 362 -396 -529 -150 -567 -1574 -739 -1196 -2782 -1561 428 1768 2229
1729 2229 2138 347 -446 -1282 -1380 -535 854 2796 1954 1092 1488 450 -546 135 813 1600 971 173 1624
1710 1624 2591 1204 61 457 1069 208 972 1095 483 201 728 1971 1630 -448 -460 -420 -742 4 -229
1691 -229 -1106 -2298 -1254 -284 226 53 -1937 -2198 -1628 -987 -1535 -1580 -1767 -2276 -726 1164 1187 811 1093
1672 1093 695 -889 -490 973 -408 -1516 -907 -197 458 181 84 791 702 -1428 -2935 -3110 -3431 -3087
1654 -3087 -3440 -2358 -1232 -680 -223 -774 -544 -57 350 474 -201 -750 -948 -1206 -1691 -432 -31 429 615
1635 615 -892 -1646 -1886 -654 -271 -381 -971 -1158 -982 -563 -1137 -2241 -2601 -1082 660 -84 -892 -858 -379
1616 -379 138 33 86 1031 1044 -267 -496 95 -389 -951 -518 40 674 506 345 184 978 2048 600 127
1596 127 1702 2165 518 648 1234 1140 -323 -1194 -840 -302 19 -569 492 1012 604 279 -729 -492 -1862
1577 -1862 -2675 -2226 -1907 -941 -494 356 -1393 -1494 -948 -1014 -1734 -2154 -1538 -203 412 -241 601 613 1506 1866
1557 1866 1267 994 611 883 -29 -574 -1168 -1775 -862 247 894 157 249 398 1293 897 387 795 109 -678
1537 -678 -790 -1300 -1941 -2208 -244 692 -119 -437 -1336 -2125 -1820 -5 218 -525 -797 -368 898 937 -194
1518 -194 -975 -673 434 1849 1404 329 307 3 -239 -43 243 300 135 -49 852 1440 -151 -921 -519
1499 -519 -672 -509 68 330 502 503 -100 -859 -1135 647 2290 2842 2268 848 -19 -166 627 1020 547 -318
1479 -318 -1614 -1726 -1214 -989 -224 764 603 -174 -386 -457 252 474 -644 -1459 -1325 -888 -477 715 1030
1460 1030 50 -1312 -1400 -805 -721 300 -270 -972 -923 1051 843 -253 -1039 -615 -153 340 571 -949 -1150
1441 -1150 -605 557 1178 593 -360 -1103 -1763 -1073 -209 1506 1339 516 383 344 436 69 -1012 -1165 -485
1422 -485 -49 -524 -934 -948 -737 -277 255 247 164 227 -55 -5 101 289 71 -106 -1447 -1831 -1878 -1614 -461 1032
1400 1032 1159 -304 -1318 -2531 -1950 -473 -322 -1238 -1466 151 1317 1094 221 421 -486 -463 -28 -2325
1382 -2325 -2026 -1493 -1109 -1176 -942 -520 275 1036 1721 2282 2289 461 -878 -1008 -603 -147 335 -662 -691 -246
1362 -246 853 990 1673 1374 563 242 1364 1152 620 807 1291 237 355 1681 2414 1505 -389 -1083
1344 -1083 134 1410 657 618 1102 1054 -146 -489 -606 -1151 -159 881 669 1093 487 -278 403 1033 383
1325 383 25 -580 -600 -531 450 747 2251 3133 1776 -31 -855 620 903 1386 1879 930 -582 -1117 -684
1306 -684 450 596 563 755 392 238 279 1021 1232 379 -774 71 1926 2190 1921 1494 1017 188 -144 21
1286 21 -20 -695 106 860 552 -650 -2011 -2582 -2420 -1266 7 784 1190 496 1155 736 -798 -1532 -635
1267 -635 -1764 -1607 -1489 -1154 42 571 333 -412 -916 -1538 -1462 334 1372 2115 1688 517 -69 1122
1249 1122 1209 1627 1860 542 405 755 507 -564 -2415 -2311 -603 303 1001 309 577 -289 -729 -11 -199
1230 -199 -528 -731 -672 45 306 -1080 -943 -1277 -1130 -1336 -889 -1056 -2577 -2860 -1941 -1021 -11 555 1107
1211 1107 839 1384 891 799 1029 284 -940 -914 -919 -1754 -554 -315 -912 -1243 -1270 -344 675 1425 1598 1905
1191 1905 1505 842 686 336 1022 979 -833 -811 114 1400 2292 1284 282 1500 1686 853 1253 157
1173 157 -44 390 400 914 1647 1692 1302 572 79 31 289 1048 1590 1641 480 -1226 -920 -717 -1805 -2309
1153 -2309 -1189 -94 936 407 -497 -212 531 622 704 1103 394 -52 192 -695 -1657 -2087 -1929 -714 -572
1134 -572 -87 106 38 -781 -140 -122 -426 34 386 359 930 643 423 616 -170 236 1019 226 -601 -668 -261
1113 -261 77 -197 880 1305 109 -924 -610 108 -83 110 35 -1761 -2612 -3852 -3812 -2208 508 58
1095 58 -1553 -1640 -1622 -662 -1318 -2602 -2254 -1918 -1216 -487 -260 -455 -277 1373 326 -1604 -802 771 966
1076 966 869 239 -187 563 1673 1327 71 -1433 -1119 -77 209 -51 -139 -1603 -1113 -987 25 1915
1058 1915 917 26 379 832 1143 1292 1793 2667 1636 -167 -95 1319 1479 1421 1907 478 -908 -494 1
1039 1 271 842 1785 690 -959 -1629 -2581 -2666 -1641 -343 782 1217 1311 122 -1598 -1589 -2073 -2497 -2473 -2335
1019 -2335 -2373 -2537 -1376 -384 -981 -2067 -1383 -907 917 21 -1764 -1985 -1842 -1562 -1697 -2247 -984 -1066 -2294
1000 -2294 -2201 -844 126 1595 1575 971 1417 1861 1956 643 272 -377 -380 1132 361 745 1955 801 507
981 507 -456 -468 -26 -249 -551 -1166 -694 803 503 825 1534 1934 -318 -2849 -3199 -1778 256 511 1392
962 1392 1140 31 -149 -694 433 750 543 -782 -1646 -1716 -1325 -368 74 -435 -542 -966 -1374 -1619 -1243
943 -1243 -1070 -1700 -1854 -241 639 206 1374 1723 2565 2129 -418 -1783 -2104 -1788 -1556 -779 476 984
925 984 671 689 125 -1612 -1866 -37 717 1103 87 321 850 -168 -51 1617 601 1446 2232 3421
907 3421 2168 1315 519 -369 1117 727 542 146 443 982 1348 872 1291 1010 863 171 -700 -195 1083
888 1083 900 376 335 165 171 -9 -546 -700 19 682 819 -136 -731 -1310 -1419 -1740 -953 -369 -860 -481 -622
867 -622 -972 -1451 -508 -928 -539 -1266 -892 566 1223 1546 1328 -744 -992 -248 379 167 -294 -639 -190 -164
847 -164 1031 584 -531 -2206 -2377 -984 -1334 -775 -341 -1183 -375 296 -72 -501 -570 -405 81 -614 -331
828 -331 167 -447 822 1090 598 988 586 -986 -1048 -79 386 558 629 1244 970 799 472 561 529 75 -820
807 -820 -376 -497 -778 -977 -397 -433 -282 408 -355 -1632 -2225 -1499 -205 239 282 1288 1667 741 -83 -63
787 -63 -758 144 1005 822 777 497 164 -286 -348 -154 -1039 -1063 -37 -201 -47 -300 -494 165 1087 445 -211
766 -211 -497 -1387 -827 -1643 -1476 315 820 827 460 -85 -405 445 2205 1711 1030 182 -130 -55 -1082 -947
746 -947 -1220 -1420 -1903 -2167 -1849 -1226 -564 674 892 798 -813 -2672 -2046 -8 1271 2208 2177 929 -263
727 -263 -1037 -1504 -1401 -1356 -496 532 -352 -534 -662 -144 1432 967 1260 1778 781 614 424 1210 1175 56
707 56 -889 -862 359 191 754 1085 504 278 437 465 1795 911 -209 -212 92 740 -30 -1989 -616 388
687 388 -61 33 -862 -345 300 356 226 -584 542 1437 755 487 908 1531 2451 907 -1445 -2619 -1709 -557
667 -557 736 731 466 -808 -384 651 1122 1608 1069 233 743 599 -13 -620 -1510 -944 -612 -2008 -2768 -1823
647 -1823 369 1650 1868 1795 2076 2358 1810 1069 617 -283 620 952 568 519 -82 -664 488 1159 796 1146
627 1146 -25 -2048 -2042 -905 549 491 447 23 116 774 162 -83 -635 -1169 -2283 -3090 -2285 -1617 -641 -226
607 -226 -1223 -1502 -1241 -1397 -1918 -2791 -4137 -3017 -1137 733 1222 743 796 -68 -620 -1114 -703 817 937
588 937 230 213 41 -71 -809 -1154 -1068 -934 -328 -837 -1873 -1275 -509 -546 -553 -362 545 842 322 -507 462 670
566 670 536 1464 960 228 -737 -255 -245 -173 -934 -828 458 840 1256 1315 1462 -629 -852 -925 595 742 313
545 313 204 -186 -732 -1372 -684 225 1317 1561 265 1021 1216 197 361 169 377 1177 1417 1385 1147 944
525 944 -434 -1264 -1740 -296 769 -753 -2193 -2795 -1881 -1473 -810 -568 368 1067 1598 2356 2145 1189 848
506 848 -136 75 931 830 438 443 -379 -717 1152 1495 528 -476 -1751 -1476 -1523 -1528 -805 -634 -1795 -1944 -1634
485 -1634 -1222 -419 -220 786 1960 3098 2454 1575 1660 708 -840 -457 -779 -832 -817 -537 -503 804 904 -1260
465 -1260 -1109 278 299 -788 -1061 -797 -899 -905 -1819 -1661 -1318 -688 -382 -562 -1621 -1332 375 1773 2106
446 2106 2139 2087 1002 1200 1597 1137 1117 -151 -797 -326 420 697 79 -174 1345 1375 886 663 -892 -972
426 -972 -235 502 763 613 914 546 562 762 290 262 376 180 -141 -352 -801 -716 666 1535 764 -83 -1033
405 -1033 -1191 -526 -890 -976 -711 0 1151 1233 2362 1918 1184 154 106 -147 125 561 1137 1104 293 -781
385 -781 61 -264 -124 -425 -528 1068 833 888 1316 1761 1096 1324 1767 1676 1229 2000 2637 1875 1202 947 380
364 380 -819 -277 -211 -1022 -609 -1003 -1463 -1500 -1342 -1584 -1025 -1934 -2001 -1532 -646 -921 -429 -666 -1006 -128 -122 -813
342 -813 -1296 -1074 -142 -783 -995 -1488 -1820 -1676 -2641 -2959 -1284 146 363 200 -1338 -3129 -2681 -1448 -1252
323 -1252 47 666 80 24 1399 1603 485 -71 -142 -189 -905 -1291 -1149 -1340 -814 -387 -666 -559 5 -501
303 -501 -342 374 462 -959 -847 -810 -1235 48 413 1487 1975 1645 980 792 666 381 145 -253 -618 -270
283 -270 -884 -960 -234 322 840 1383 1564 1069 1059 1161 1138 767 733 173 -413 -1049 -332 208 -839 -836 -810 -681
261 -681 -623 -225 201 -122 122 -152 -277 -328 -142 -1006 -470 223 558 -605 -399 -457 -1689 -1145 -1388 -870 324
240 324 -184 278 193 -212 -564 -1477 -39 193 910 1423 1038 1318 1235 1099 341 -606 -137 502 -90 188 657
219 657 782 525 297 -541 -1250 -1410 -1135 -625 -959 -961 -175 758 1100 1642 1108 846 418 -296 -264 262 1052
198 1052 1099 774 -199 -397 -239 -684 -456 -162 157 481 811 548 654 751 1232 1227 1757 2040 2282 2821 3077
177 3077 2476 1971 870 -362 933 1490 -102 -822 -784 -454 130 462 383 -785 -1686 -2566 -2732 -2254 -1887
158 -1887 -1870 -1781 -1254 -1106 -454 -20 365 -146 -17 249 397 311 731 -24 -554 -1215 -1210 -680 -968 -723 -719 -91
136 -91 306 36 111 369 552 406 313 137 266 497 -58 -430 -1004 -981 -775 -366 -497 -832 -122 485 578 307
114 307 93 856 834 -281 -225 436 350 479 836 1536 1480 22 -592 -433 -404 -726 -804 -380 -502 -520 473 1401
92 1401 1236 733 998 1535 1158 580 657 304 -932 -1793 -489 -931 -1252 -589 90 -268 -207 19 -339 -690
72 -690 -442 -152 -645 -1199 -1580 -1373 -635 217 176 -679 -1384 -1163 -977 248 913 980 1508 1521 1234 701 513
51 513 359 288 527 761 -123 -395 -958 -1533 -1300 -400 -983 -999 -1061 -958 64 154 413 397 370 615 874 707
29 707 -412 -989 -737 -95 -418 -564 227 896 830 405 1330 1815 532 249 673 -50 -154 -449 -664 -716 -269
8 -269 -385 -267 149 68 -245 -192 -260 280
0B80
$$ Imaginary data points
##PAGE= N=2
##DATA TABLE= (X++(I..I)), XYDATA
32767 18777 18457 18798 20079 20713 21232 22678 24421 24540 23560 23191 23861 24895 24935 25023 26096 27489 28476 28939
32749 28939 29758 30649 31099 30663 30367 30444 31916 32754 32916 33289 33420 33449 34650 35407 35495 35954 36808 36593 38470
32730 38470 38428 38144 37631 38498 40145 40559 39336 39178 39449 40645 41782 41946 42652 43337 44501 44692 44383 44413
32712 44413 44066 44474 45521 46460 47230 48070 48790 48734 48379 48638 49118 49623 50202 51142 51459 49956 50097 50545 51295
32693 51295 52993 53796 55164 55434 55064 55828 55658 56527 57614 57909 58273 59066 60319 60176 59078 59495 60614
32676 60614 60612 60556 62211 63380 64181 64868 64719 63856 64724 65838 66433 66510 66829 68324 68983 68901 68110 68583 69399
32657 69399 69274 68917 69542 69643 71364 72959 72650 72854 73286 74134 73859 74543 74806 74843 75460 76267 77080 77038 77066
32638 77066 76827 76935 76399 76567 78124 78971 79494 80072 81565 82131 82878 83202 83373 83178 82563 82457 82736 83923
32620 83923 84648 84796 84574 85668 86001 86071 86408 86592 87255 87650 87739 88522 88613 87991 88210 89559 91159 91995 91931
32601 91931 92389 93448 93395 92010 92038 93699 94877 95014 95272 96620 97238 96109 95427 96823 97072 96484 96089
32584 96089 95969 96392 98009 99530 99976 99549 100409 101138 101136 101638 102010 102177 102819 103751 104744 104625 104056 104525 104805
32565 104805 105454 106110 106532 106789 106861 106899 107207 107583 107540 106806 107133 107317 108111 109670 110011 109782 109933 110581 110404
32546 110404 110689 111089 112310 112731 113687 114140 113860 113950 113844 114068 113446 114806 116045 117088 117711 116631 116471
32529 116471 116828 117662 117958 118377 118015 116847 118138 119092 118878 118928 119826 120112 120868 120746 120431 121193 122154 122476
32511 122476 121277 121422 122237 123278 125270 126865 126183 125488 125654 126341 125572 125008 125931 126121 125887 126336 126687
32494 126687 126735 126586 127261 128681 128998 128575 129422 130169 128975 128170 128611 128338 129583 130161 130324 130694 131640 131965
32476 131965 131918 132192 132939 132951 133030 133953 133817 135300 135553 134498 133945 133218 134399 135103 135136 136019 136343 136378 136115
32457 136115 135995 135459 134782 135604 136737 138152 138966 138831 138479 137224 137735 138383 139072 138905 139155 139697 139465 138907
32439 138907 138085 138671 139677 140604 139960 139092 140192 142261 142315 142826 142909 142463 143845 143695 143822 144627 144805 143924
32421 143924 144657 145192 145234 145601 146035 145481 145638 145881 145317 144831 144367 146146 146077 146146 147531 148263 148754 148009 146957
32402 146957 146847 147083 146914 147912 149367 149377 148995 149677 149754 149218 149002 149385 149866 150188 150705 151251 151530 152259 152066
32383 152066 151168 151946 152681 151584 151148 152041 153770 153823 153799 153104 153031 153241 153421 154591 155144 154504 153982 152697
32365 152697 152417 151740 151348 152172 152148 152860 154626 154362 153989 154148 153609 154269 155825 156236 155663 155272 155738 157062
32347 157062 157325 157125 156822 156407 155486 155431 155929 157161 156152 155214 155727 156547 156953 157275 156694 156808 156520 157344
32329 157344 157853 158332 158918 158179 157628 158910 159656 159507 159694 160464 160205 159260 158463 160062 160407 159353 159492 159507
32311 159507 160132 160393 159836 160459 160251 160006 160466 161441 161718 162873 162374 160317 160216 161828 162316 162479 162041 162579
32293 162579 162266 162215 162429 160901 160703 160810 160664 160676 161022 161920 162751 163984 164263 163878 163454 163408 162636 161838 161945
32274 161945 162099 162036 161416 162334 163563 163656 162085 162056 161803 162031 162861 165097 165751 164771 164465 164847 165338 163925
32256 163925 163992 164450 165063 165988 166298 166452 165838 166030 165857 166060 166096 166083 166466 166763 167175 166812 166083 166817 168010
32237 168010 167304 167238 168749 168652 167564 167828 167087 166831 167763 167098 165611 165217 165308 165676 165607 166470 167516 167990 167354
32218 167354 168073 167910 167762 167494 166927 166353 166391 166510 166692 167550 167906 168262 167668 167788 167732 168110 168730 168315 168893
32199 168893 168895 168315 167666 168502 169542 169740 168526 168093 167139 168015 168959 167572 167210 167832 167941 167351 168142 168989
32181 168989 168237 168788 167284 166941 167041 167839 169336 169742 169412 169381 170361 170870 169103 168024 168669 168521 168490 169844
32163 169844 168934 168145 169060 169339 169716 169666 170030 169574 170278 169660 168666 168736 168742 169094 169501 169935 169885 170459 170114 169919
32143 169919 170064 170307 170137 170084 169982 169129 169441 170115 170475 170831 169895 169781 169359 169137 170262 170702 170614 169770 169576
32124 169576 169951 171001 171258 171335 170236 170239 170215 169221 169370 171505 172326 172344 171789 171428 170948 170395 170353 170213 169559 168998
32104 168998 169274 169675 170189 170197 170699 171802 172841 173093 171889 171360 171845 170731 169011 169271 169563 169352 169435 170624
32086 170624 170351 168977 168667 168899 170427 171216 169927 169681 169610 170533 169829 170034 170705 170177 170384 170763 170816 171133
32068 171133 171405 170554 170578 169095 169702 170900 170481 169280 169747 170967 170118 169696 171277 172334 173779 172981 171070
32051 171070 169453 168047 168634 169202 170326 169853 168920 169360 171320 172072 172660 171232 171059 171260 170220 170334 171127
32034 171127 170961 170380 170216 171059 172175 171869 171372 171080 171278 171552 171843 171741 171666 171814 171485 171942 172851 173832 173200
32015 173200 173620 173299 171686 170923 170948 170840 171049 171316 171642 172153 171827 172741 173365 171843 171183 172062 172462 171967
31997 171967 172242 172743 172774 172069 171078 170289 169681 171023 172418 171679 171009 172418 174127 172555 171234 172246 173105
31980 173105 173087 173643 172662 171859 172165 172309 173223 172537 172400 172802 173501 173536 171579 170196 168699 169156 169730 170315
31962 170315 171946 172873 171644 171059 171985 172338 172278 171686 170977 171344 171379 171325 172498 172308 171177 170894 170901 170493 171180
31943 171180 171559 171658 169993 168597 169242 170174 171357 170801 169799 170436 171224 172701 172425 172681 171604 170605 169872
31926 169872 170712 171575 171956 172103 173155 173948 172919 173280 173185 172560 172794 172367 173129 172876 172928 172491 171942 171372 172671
31907 172671 172485 171446 170109 171632 172504 173172 173670 173940 173172 171540 172533 173245 174305 173419 171730 170820 170811
31890 170811 171223 171387 171993 172072 172470 171192 170136 170370 170257 169858 170112 171375 171692 171496 171565 172037 173048 172813
31872 172813 172938 173112 172848 173311 173918 173848 173095 171918 172992 173719 172827 172395 172232 172409 172398 172171 172022 172148 172275
31853 172275 171912 173168 173397 171932 171880 171702 172139 172118 172763 172632 172938 172129 171577 171026 170741 171451 171673 171690 172943
31834 172943 173643 173186 172258 172643 172719 173002 172706 172917 174516 175314 175989 176153 175798 175147 175315 174353 174133 173641 173358
31815 173358 173733 173530 172398 171544 172491 172421 172466 172687 172631 171298 170719 171100 171463 172218 174201 174121 173327 173060 173644
31796 173644 172320 172140 172024 173082 172679 171611 170862 171103 171158 171697 172804 173238 173615 174061 174439 173752 172413
31779 172413 172019 172808 173813 173868 173883 172870 172753 172851 172867 172146 172285 172367 171955 172827 174770 175083 174360 174731 174971
31760 174971 173926 173031 173473 173453 173486 174295 173916 172933 171732 173196 173898 173890 173521 173668 172608 172315 172811 172544 171936
31741 171936 172814 173551 174173 175204 175561 176345 175325 175172 174864 175279 175177 175203 175489 176006 176050 175353 175557 175158 174427
31722 174427 173509 173361 174098 174382 173824 173384 173914 173834 173843 173782 174270 173848 174222 173989 172573 172668 172217 172755 172585 172728
31702 172728 173938 175850 175600 174673 174564 175033 174916 175125 175167 175079 174837 173950 172904 172548 172791 172922 174016 174525
31684 174525 174284 174894 175622 174604 174337 174705 174507 175173 175065 174273 175752 175968 175556 175346 174334 172314 172557
31667 172557 173575 173284 172700 171523 172292 172903 172865 173658 174356 174869 173160 173396 174247 174828 174385 174062 174998 175860
31649 175860 174532 173319 172732 174027 174925 174989 174892 175901 174301 174812 174907 175141 174701 173386 172192 172563 174148
31632 174148 176406 176974 176489 176463 177230 176067 176380 176820 176841 176202 175358 174229 173606 173303 173614 172304 172189 173041
31614 173041 174223 174068 174640 175618 176089 176331 176167 174374 173228 173582 175471 176445 176185 176003 176677 176600 175298
31597 175298 174552 174106 172609 171919 172278 173655 173387 172987 172321 173270 175322 176510 175981 175575 175275 175270 174226 173480
31579 173480 173598 173275 173126 174322 174540 174003 172966 172654 174133 176319 176950 176211 175694 176056 176637 176436 176806
31562 176806 176862 176423 176056 176194 177033 177667 177550 175676 175012 175418 175708 175147 174786 175350 175221 174167 175077 175587
31544 175587 176217 175728 175141 175511 175981 177066 177186 174835 174218 174849 175488 176171 177372 176894 174369 173956 174633
31527 174633 175280 175855 175688 176104 177096 177231 175127 174082 174294 173718 173821 175035 175612 175817 175711 175445 176653
31510 176653 177196 175766 175959 177037 177809 177555 177392 176795 176557 176973 176348 176179 176628 176874 176572 175985 176372 175677
31492 175677 176149 176896 176301 176102 176218 176460 176013 175238 175660 175560 176326 176525 176715 176334 176917 177033 176853 175998 174842
31473 174842 175277 175680 174920 174638 175512 175680 175779 176668 176682 175596 174474 174845 175704 175950 176044 175973 175954 176756 177847
31454 177847 177349 175897 175719 175685 175760 175631 177082 176315 175018 175112 175537 175815 175276 175450 175226 175085 174387 172987
31436 172987 172937 173763 175478 175961 177153 176765 176474 176657 177345 177350 177927 177971 176671 176343 174910 175063 175806 176175 177022
31417 177022 176359 176804 177883 177463 177573 177611 177709 176497 176909 176648 176637 175794 176657 177755 177337 177463 177114 177461 177239
31398 177239 177319 177410 176694 175655 174521 174841 174185 173956 174471 175164 176493 177584 178029 177534 178170 177812 176402 175073
31380 175073 174498 176382 175999 175133 176004 176776 176718 176703 176756 177030 176240 176721 176803 177342 177666 177132 176915 176689 178337
31361 178337 178245 177986 177206 176005 175725 175788 174845 174488 175362 175373 175881 176017 176233 176899 177424 177237 176128 175474 175907
31342 175907 175505 176428 175052 175108 176203 176712 176303 176704 177555 177436 177021 176443 176061 176269 176466 176708 178119 179383
31324 179383 179144 178908 179253 179240 179240 177496 176207 177002 177582 178787 178727 177570 176932 177071 175954 176822 177417 176348
31306 176348 176667 177561 177573 178195 177509 176750 176355 177461 179286 179416 177896 178014 178691 178313 179067 178803 178363 177121
31288 177121 175915 175823 176570 178455 179609 179356 178463 178515 177924 177475 177293 178329 177649 175858 176901 177308 177126
31271 177126 176627 176527 178210 178412 177679 176663 175788 176042 177166 177166 177535 177520 178143 178101 178351 176877 176885 177564 178714
31252 178714 178351 178186 177608 176764 176581 176982 177989 177282 178129 178070 177175 178365 180581 180965 179728 178484 178190
31235 178190 178408 177316 175934 176015 177345 178144 178360 178944 179932 180614 179438 178842 179570 178507 177455 177241 177375
31218 177375 178606 179588 179426 178434 177987 178118 177458 177247 176965 177369 177162 176750 176409 176915 177430 177657 177332 178365
31200 178365 178279 178155 179161 180303 180522 180708 179744 179413 178397 179116 179502 179866 180369 178779 177978 177764 178606 178532
31182 178532 176467 176123 177602 180308 180301 179897 178503 177647 178007 178639 179122 179844 180608 180590 180184 180480 179662 178665
31164 178665 178747 178674 178367 179655 179522 178667 179009 178584 178343 179251 179608 178940 177919 177142 177439 179796 180782 179694
31146 179694 178111 178520 177950 177471 177722 176446 176006 175919 176707 177280 177879 178705 178371 179164 178985 177486 178365 180066
31128 180066 180486 180550 178811 177794 177493 177455 177456 177543 178194 178884 178717 178006 178116 178307 177839 179015 180777 180598 179095
31109 179095 179068 179560 179233 178383 178398 178672 179346 178679 178758 179574 180551 180132 180134 180209 180852 179592 179053 179703 179467 179688
31089 179688 179672 178836 178187 178132 178428 178216 178193 177924 179514 180618 180986 181393 181467 180028 179894 179739 178710 179357 179570
31070 179570 179250 179334 179771 180888 180823 179647 180096 180669 181003 180169 179569 179790 180012 179929 180201 179316 178213 177275 177541
31051 177541 177783 178147 178743 178155 178077 178569 178866 179696 180379 181015 181076 181205 181622 180941 180794 181027 180594 178986 178950
31032 178950 179340 180536 180124 181679 181873 180876 180892 180834 179488 180012 181049 181050 180671 180703 180360 179151 178829 179621 180431
31013 180431 180340 179949 179453 179404 180061 181138 180790 180152 179929 179831 180765 181611 180173 179122 179424 179481 180048 179337 178398
30994 178398 177605 177224 178107 178127 178931 179079 178330 178935 180044 180304 180843 181351 181056 180505 179390 179035 179225 179754
30976 179754 179357 180026 180373 179192 178895 178964 178304 177846 178362 179008 179550 179887 180237 180829 181163 180258 180095 180451 179533
30957 179533 180410 181389 180949 181198 180942 180965 182050 181484 180966 180364 179535 178835 179496 180729 179599 179220 180446 181401
30939 181401 181223 179757 179323 180175 179939 178742 178708 179300 179325 178051 178224 179246 179275 180207 179769 180880 181022 181369
30921 181369 180681 180423 179841 180419 180539 180197 180185 180663 181295 180939 180796 180324 179353 179454 180371 182107 184483 183941
30903 183941 181878 181157 180893 180676 180669 181100 181035 180827 179935 179222 180249 180642 179958 179729 180528 180141 180125 179902 180273
30884 180273 180715 179714 180391 180302 180748 181841 181909 180843 180619 180799 180865 180191 180676 180715 181109 181370 180774 181438 181907
30865 181907 181293 181813 181571 180790 180733 179575 179497 180401 180673 181244 181600 181258 181756 182104 181488 180995 181429 182208 182979
30846 182979 182011 180763 180840 181666 181653 181351 182824 182643 180265 178852 180427 180831 180479 180035 179324 179332 180330 180694
30828 180694 180416 179698 179688 180635 180664 179675 179915 181556 182586 182747 180872 179890 178978 179061 180245 181074 182009 182809
30810 182809 182467 182494 181861 181901 182697 182772 182770 182411 182491 184288 184408 183123 183501 183275 182420 181638 179680 178804 179563 180615
30790 180615 181188 180329 179977 180676 181017 181193 181965 181637 180622 180183 180489 181219 181949 182887 181981 180813 181957 181582
30772 181582 181875 182637 182054 182088 182451 183497 182796 181875 182740 181118 179976 180151 180175 181458 182048 181952 181018 180714
30754 180714 180270 181722 182268 181429 181178 181830 181866 180981 180729 181311 180577 180355 180770 180170 180192 180732 181663 182927 182096
30735 182096 180705 180833 181400 180854 181571 182413 182941 184315 184215 183914 184443 183538 183199 183491 183077 181518 181551 181130
30717 181130 182211 182580 181913 181800 183011 182015 181037 180580 181440 181958 182535 181997 181810 183089 184168 184569 184176
30700 184176 183681 183112 183733 183550 182700 182712 182585 182278 182450 182738 183569 183516 183678 183407 181901 181633 182132 182079 182919
30681 182919 183180 182243 182779 182976 181579 181756 182816 182597 182674 183497 184715 185295 184402 183398 182575 182601 182836 181471
30663 181471 181729 181813 182685 182721 181786 181971 182539 183352 183525 184233 184973 184852 184223 181890 182141 182418 182422 182324 182122 182011
30643 182011 183316 185062 186332 186656 185040 183187 182251 181665 181326 181539 182279 182367 182136 182694 182840 182034 181721
30626 181721 182888 183252 183698 182366 182248 182738 182975 182720 183091 182386 182285 182581 184078 184727 185391 185209 185021 184717
30608 184717 184827 185568 185109 182742 182389 182677 183759 185405 186041 186171 186822 186386 185165 183676 184358 184432 183373
30591 183373 183915 184039 184366 184504 184630 184931 184595 183040 183007 183523 183421 183894 183182 182619 182076 181808 183506 184425
30573 184425 184362 184724 185037 184105 183416 181578 180530 180762 182685 183430 181850 181352 182560 183448 183527 182989 182485 182800
30555 182800 183450 184505 184614 183974 183857 184540 184167 184108 183495 183163 182636 182418 183747 184658 185464 184938 183856 182525
30537 182525 182547 183457 184757 184681 184223 185054 184472 184872 184025 183722 183616 182807 183039 182682 182227 184017 183440 182203
30519 182203 181533 181971 182451 183299 183639 182938 183056 184853 185048 184430 183875 184726 185285 185408 184628 183752 185089 185992
30501 185992 185598 184771 183636 184581 186526 186680 185399 185300 184609 184210 186015 185664 185097 184770 184741 184570 185388 185337
30483 185337 183642 183030 182688 183248 184205 185656 185277 184500 184216 184971 186202 185909 185194 185794 186595 186642 186540 185610
30465 185610 184680 184067 184187 184018 184721 185077 185160 185129 186142 185904 186408 186036 185088 184047 185237 185749 186722 186685 185001
30446 185001 183786 183838 184326 183566 181637 182056 183309 183971 184080 184657 184712 184563 184179 184921 185288 184622 183788 183629
30428 183629 183577 183003 182350 182341 181070 181351 182346 183155 183662 184211 185546 186011 185754 185234 185131 185387 185430 186360 186861
30409 186861 186981 186718 186008 186251 186953 186968 186557 186624 187135 186243 185355 185658 185010 184022 183670 185122 185910 185400 185486
30390 185486 185774 185446 184594 185582 185753 185715 185543 185143 184964 185049 185062 183817 183628 183918 184676 183487 183318 183642 184039
30371 184039 183778 182813 183913 185169 185615 186017 184442 183373 184500 186127 186642 186319 186560 187581 186907 186014
30355 186014 185200 185234 185701 186672 185915 184459 184388 184966 185072 184749 184131 183744 184572 185009 184812 186203 187180 185672
30337 185672 184684 184862 185781 185747 185404 186174 185948 184737 183652 184744 185722 185211 185913 186558 186739 186614 187223 187657
30319 187657 187908 187296 187421 188033 187440 186322 186195 185774 186004 185867 186264 186382 186451 184839 183857 185163 184895 185059
30301 185059 185183 185985 186697 185965 186050 185851 184648 183947 182907 183951 185212 186553 186401 187256 187200 186125 186000
30284 186000 186366 186840 187336 185841 185156 185251 185284 186627 185708 185486 185811 186077 185851 184913 185786 185658 186068 186075 184251
30265 184251 184107 185532 185364 184447 185069 184793 184388 184745 186126 188102 187558 187422 187515 187910 187739 186583 185994 186501
30247 186501 187814 188644 188413 188107 188186 188425 187852 187987 188057 187633 186181 186677 187615 188387 187407 186149 185357 186050
30229 186050 186005 185771 185113 184438 185779 186237 185933 185239 185708 186244 188137 188624 188533 188191 187380 186699 187231 186572 187030
30210 187030 187437 188156 188505 187463 187763 189007 188706 188969 188168 187518 187478 186758 185864 186119 186176 187491 188575 188591
30192 188591 188967 189519 188686 187634 185927 186063 186688 186557 186844 186680 186777 185124 186131 186813 186591 186867 186769 188098
30174 188098 187737 186558 185098 183819 183859 185994 187194 187911 188614 188992 188027 187030 186485 186673 187498 188052 187800
30157 187800 186599 186491 187518 188062 187784 186922 186992 186506 185925 185825 186023 186460 186773 185558 184559 185126 185746 185993
30139 185993 186017 187221 186977 186917 186286 185858 185954 186586 187497 187663 188366 187959 186929 187211 187709 186315 186649 186867 186536
30120 186536 186827 186676 186344 186714 186588 187260 187751 187390 186397 186408 186954 187705 186971 186460 186588 187670 187491 186874 187441
30101 187441 188098 188123 188818 188536 188292 187719 187061 186563 186472 187442 188245 189413 189353 187773 186554 187074 187412 188374 189912
30082 189912 190343 190446 190412 189141 188486 188302 187912 187479 186654 186649 188196 188218 188564 189463 189697 188786 188734 189551 189485 188676
30062 188676 187791 187793 187535 187781 187548 187688 188694 187763 188366 189342 189454 188642 190091 190320 189605 189486 190064 190244 189693
30043 189693 189179 189138 189350 188270 187873 188262 188283 188257 187285 188052 188097 188105 189153 188809 188430 188288 187543 187177 186643 187586
30023 187586 188273 188380 188504 188644 189883 190872 189377 188445 188539 190003 191100 190932 191430 190192 190365 190758 189960
30006 189960 189410 190416 190716 190454 190086 189674 189543 188717 188428 188234 188360 188168 188050 188288 188564 189038 188424 187176
29988 187176 187529 187294 187673 188034 188600 188389 188459 188416 189151 189086 188805 187722 187607 188295 190323 190336 189340 188942 189042
29969 189042 190799 191268 190537 188450 187095 187715 190152 191511 190800 189872 190530 190951 190886 190745 190358 190273 190020 189732
29951 189732 189725 189557 189418 189417 188372 187372 187173 188974 190296 189018 187680 187447 186837 187500 187897 188377 188695 189199
29933 189199 188500 189004 189093 188389 188108 188126 189171 188680 189398 189610 189517 190278 190934 190325 189345 188585 189166 189127 189542 190168
29913 190168 190140 189086 189051 190363 190079 190747 190276 188958 187919 187113 188513 190226 189817 189912 189553 188190 187141
29896 187141 189032 190051 190045 189966 190073 188856 187359 187241 188854 189506 190453 190411 188680 187412 187401 187906 188396 188394 188344
29877 188344 189210 188522 188104 188555 188155 187918 187680 187845 188181 188766 189559 190813 191313 191314 190838 190963 192071 191041
29859 191041 190701 191942 193013 193594 192197 191489 191115 190583 190506 190848 190743 191552 191373 191032 190081 188469 187198
29842 187198 188234 189056 190311 192094 191702 190608 189622 188744 188585 189519 190196 190684 190698 188692 187762 189148 190608
29825 190608 191403 191455 190972 189565 189994 190255 190373 189847 189277 189586 189371 189607 190959 190688 189859 188440 189148 190769
29807 190769 190169 190046 191277 190151 188729 189585 188972 188279 188257 188360 187685 188199 188000 187238 187350 189144 189570 190193
29789 190193 190728 190663 190269 189818 189242 189988 191582 191957 190636 189869 190418 190301 190136 190465 191338 192219 192024 191790
29771 191790 190225 189828 190322 190292 189548 190121 190086 190127 190708 189768 189706 188953 188230 187825 187775 188363 189146 190625 191234 191572
29751 191572 192353 192302 191601 191010 189947 190218 191211 191838 191660 190993 190963 190568 189597 189883 190233 189479 189510 190210 191461
29732 191461 191430 191379 191805 191499 190789 191177 192140 192271 192356 192829 191926 191067 191457 192665 193068 192165 191044 191085 190225
29713 190225 191136 192357 192607 191331 191320 191069 191764 191190 190540 191724 193459 193062 192881 193744 193366 191660 191616 192012
29695 192012 191127 190485 190367 191415 192435 191946 192629 192663 192087 190178 189690 190383 190543 190465 190068 190055 189856 189947 189771
29676 189771 191712 193142 193660 193563 194618 194686 194695 194439 194537 194544 192577 190417 190551 191728 191366 192000 192243 192307 191830
29657 191830 191485 191282 192682 193590 193953 193663 193488 193037 192528 191904 192337 192417 192229 191452 191618 192114 191674 192208 191446
29638 191446 191650 192182 192078 192899 192932 192873 193281 193447 192661 192346 191474 190944 190080 191070 191708 192908 192747 190949 191292
29619 191292 192517 192355 192104 191845 192036 192717 192755 192867 192071 191952 192605 191904 190764 191704 192449 191605 192050 192180
29601 192180 191962 192328 194170 193499 192931 193000 192603 192863 192838 193391 193515 193137 193262 193752 194869 195695 195328 194343 194274
29582 194274 193093 192864 192526 191480 191614 190857 189406 189685 192202 193907 193519 192315 192261 192797 192589 193457 193046
29565 193046 192301 191633 191997 191963 191366 191290 192479 193425 193402 193681 192645 192156 191597 191978 192621 192054 191867 191587 192502
29546 192502 192718 192865 192330 191476 191052 190375 191329 193484 193759 192564 192535 192444 192633 192318 191903 191778 191627 191798 192753
29527 192753 194139 194374 194893 193062 193261 193556 193632 193340 192973 193406 194620 193966 192255 191594 192250 192776 192761 192853
29509 192853 193078 192526 191682 191699 192130 193025 193127 194031 193764 193154 193835 194211 193322 193451 193299 194135 193784 193922 192945
29490 192945 192033 193114 193493 193475 194075 193855 194984 195514 194767 194996 195529 194064 193585 194553 195921 195742 194650
29473 194650 194157 194433 194466 194450 195551 195837 196054 194704 193327 192979 194110 194061 195217 195376 196027 194781 193915 194032
29455 194032 193922 193146 193289 193320 193273 192817 193177 194025 194615 194205 194911 195292 195784 195170 194707 194205 194868 195028 195435
29436 195435 195715 196403 196123 195423 195464 195381 195583 195990 196839 197370 196881 196195 195704 195344 194951 195158 196092 195900 196510
29417 196510 196133 196139 196140 196051 195414 195746 195404 196169 197665 197358 196756 195916 194687 195405 195878 197101 197552 196581 196645 197337
29397 197337 196795 195698 194385 194204 194548 194640 194375 194927 195377 194500 194426 193753 193913 194063 193675 193184 192934 192298 192722
29378 192722 193160 192820 192987 192669 193413 194123 194173 194685 193782 192496 193008 193887 194532 194554 194711 194465 195370 195547 197255
29359 197255 198295 198508 196832 195172 195405 195043 193894 192931 194021 195324 195086 196042 195260 195762 195723 194840 195365
29342 195365 195691 195557 195126 194602 194673 194856 195106 196528 196594 195927 195690 194838 194607 194993 194815 194294 195431 195871 195426
29323 195426 194670 195118 196130 196747 197580 198237 199299 199272 198477 197049 195698 194961 195390 196157 197129 197264 197681 198329
29305 198329 197629 196599 197369 197297 196532 196209 195649 194380 194962 196580 197048 197135 197032 196552 196500 196460 196011 195346 194623
29286 194623 196023 196511 196187 196475 196316 197432 198380 199303 198910 197511 197416 197186 195843 195664 195759 196110 196305 196150
29268 196150 195091 194684 194616 194479 195165 197042 197418 197719 197653 197010 196786 196724 196858 196921 196803 197412 197117 196502 196769
29249 196769 195874 195871 195177 194235 194631 196210 196314 194917 195053 195312 195877 195371 195500 195996 195508 195826 195485 195406 195653
29230 195653 195257 195213 195559 196681 196751 197757 198754 198839 197884 196144 195550 195310 193957 194658 195499 195804 195535 195950
29212 195950 197020 198339 198633 197398 197710 198087 198107 197485 196201 195429 196574 196744 196540 197298 196760 196547 196652
29195 196652 195834 195269 194907 195209 195184 195813 196770 196196 196816 197452 196948 195583 193952 194480 195328 195197 195247 195031 194972
29176 194972 195196 194985 194139 194306 195302 196536 197322 196903 196417 197008 196217 195613 196125 196709 197784 198317 197670 196943
29158 196943 197780 197892 197353 197628 196722 195792 196258 197567 198659 197666 196588 196484 196751 197976 198206 198024 197653
29141 197653 197284 197840 198108 198829 198525 198243 198253 197577 197222 197059 196277 196500 197891 197634 196710 196663 196110 196617 197991
29122 197991 199134 200104 199494 199154 197424 197036 197406 197168 196407 197068 197999 198580 198252 197127 195348 195608 196586
29105 196586 198236 199396 198434 198745 199223 198793 197582 196766 196768 197106 198289 198787 196868 196725 197657 197184 196450 196257
29087 196257 196876 198368 199109 200129 201194 200778 199408 197502 197445 197711 197716 197123 196446 196432 197714 198595 198784 197900
29069 197900 196960 197631 197974 197619 198307 197830 197244 196054 196506 197146 197236 197577 197342 196891 196661 197093 197110 197866 197781
29050 197781 196886 197901 200389 200290 200720 199675 199362 198816 197177 195845 196589 197673 196676 196632 197515 197818 198670
29033 198670 198429 198041 196437 196689 197128 197929 199171 198849 199326 199161 198360 198142 198250 198255 197595 198390 199541 199765
29015 199765 200294 200088 199284 198691 198624 198784 198260 197817 197431 196578 195977 197190 197713 198062 197221 197563 198976 199696
28997 199696 199757 199849 199545 200629 199890 198797 197362 198079 198920 198301 198482 198197 199161 198913 197527 197163 197864 199041
28979 199041 200530 200473 201254 200971 199875 198896 198304 197582 197776 198145 197014 197332 197955 198721 198943 198413 198935 198508
28961 198508 197286 197836 198787 198726 198669 199203 199381 198752 198824 199883 199980 200220 200828 200323 199978 199757 200133 200561 199466
28942 199466 199870 198865 199035 198235 197107 198130 199944 200546 200005 199993 199843 200417 200652 200803 199722 198971 199847
28925 199847 200392 200397 200442 200516 200240 199789 199372 198959 198624 197520 197450 198148 199281 199793 199384 198408 199410 199918 199857 199160
28905 199160 198212 198553 198522 198540 199551 199323 199414 199238 199294 200023 200832 201609 201583 201209 200743 200460 200359 199879 199407 198373
28885 198373 198329 198682 198958 199981 199537 198998 199643 198527 198506 199904 199843 200282 200958 202236 202553 202419 202689 201414
28867 201414 200938 200512 200732 200864 200258 199152 199677 200247 199787 199596 199600 199496 199432 198675 199503 200199 200016 199410 200825
28848 200825 200422 199831 200537 199697 199699 199888 200128 199591 198656 199422 200244 200055 200230 200530 201537 201960 200731 199726
28830 199726 200177 200559 201768 201459 199743 200776 201606 201602 201103 199331 198786 199574 199078 199239 200319 200733 199304
28813 199304 199445 199968 199277 199393 199992 200820 200944 199694 199821 200023 199240 199195 199505 200244 200926 199786 199790 201039 200628
28794 200628 199918 200565 200664 199033 198754 198346 198209 199972 201217 201579 201136 201280 200816 200061 199296 199499 200569 200499
28776 200499 200920 200897 200931 201990 202033 202462 202729 203365 203618 204237 202652 201256 201447 202819 202272 202259 202218 200068 200264
28757 200264 201318 201876 201540 201296 201946 202072 202679 202303 201720 201745 201399 200680 201463 202277 201449 201689 201778 201195 200694
28738 200694 200083 201210 201624 202853 203430 203024 202342 201535 201688 202317 202244 202814 201761 200842 201513 201231 201274 200615
$$ [...]
##END NTUPLES=NMR SPECTRUM
##END=
