##TITLE=Analysis number 318766
Compound Code btb 00733
Book Reference 438/114
Project Code adrs
Chemist Name antons
##JCAMPDX= 6.0         $$ Bruker NMR JCAMP-DX V2.0
##DATA TYPE= NMR SPECTRUM
##DATA CLASS= NTUPLES
##ORIGIN= Bruker BioSpin GmbH
##OWNER= nmr
$$ XWIN-NMR		Version 3.5
$$ Thu Apr 13 09:40:49 2006 GMT Daylight Time (UT+1h)  MAYBRIDGE\nmr@NMR_250MHZ
##.OBSERVE FREQUENCY= 250.131544655141
##.OBSERVE NUCLEUS= ^1H
##.ACQUISITION MODE= SIMULTANEOUS (DQD)
##.ACQUISITION SCHEME= undefined
##.AVERAGES= 16
##.DIGITISER RES= 18
##SPECTROMETER/DATA SYSTEM= dpx250
##.PULSE SEQUENCE= zg30
##.SOLVENT NAME= CDCl3
##.SHIFT REFERENCE= (INTERNAL, CDCl3, 0, 16.522)
##AUDIT TRAIL= $$ (NUMBER, WHEN, WHO, WHERE, WHAT)
$$ ##TITLE= Audit trail, XWIN-NMR		Version 3.5
$$ ##JCAMPDX= 5.01
$$ ##ORIGIN= Bruker BioSpin GmbH
$$ ##OWNER= nmr
$$ C:\u/data/dgb/nmr/ADRS/2620/pdata/1/auditp.txt
$$ ##AUDIT TRAIL=  $$ (NUMBER, WHEN, WHO, WHERE, WHAT)
(   1,<2006-04-13 09:39:57.32 +100>,<MAYBRIDGE\nmr>,<NMR_250MHZ>,
      <created by zg, POWCHK disabled, PULCHK disabled
       configuration hash MD5:
       84 BC 41 DB A1 6E 1D 46 DA 25 12 A5 C1 ED C5 3A
       data hash MD5: 64K
       97 59 7D 55 13 DE C2 6A 22 5E 6C 92 D1 B8 45 D2>)
(   2,<2006-04-13 09:40:16.52 +100>,<MAYBRIDGE\nmr>,<NMR_250MHZ>,
      <Start of raw data processing
       ef LB = 0.3 FT_mod = 6 PKNL = 1 SI = 32K 
       data hash MD5: 32K
       AA 16 07 72 9F 6B 89 24 20 E3 84 29 6E B8 13 E2>)
(   3,<2006-04-13 09:40:22.26 +100>,<MAYBRIDGE\nmr>,<NMR_250MHZ>,
      <apk 
       data hash MD5: 32K
       9E 18 97 1A C5 87 C6 5A 76 7E F8 3A 3B D3 0C FF>)
(   4,<2006-04-13 09:40:24.13 +100>,<MAYBRIDGE\nmr>,<NMR_250MHZ>,
      <abs ABSG = 5 
       data hash MD5: 32K
       7A 50 07 47 FA C6 A3 A3 2F 6D 0D 5E 9B 97 4C 3E>)
$$ ##END=
$$ 
$$ hash MD5
$$ 1F 4D 08 53 4A 11 86 80 D4 62 13 4D D1 FD BD EE
##$RELAX= 
##$RELAX= 
##$RELAX= 
##$RELAX= 
##$RELAX= 
##$RELAX= 
##$RELAX= 
$$ Bruker specific parameters
$$ --------------------------
##$DU= <C:\u>
##$EXPNO= 2620
##$NAME= <ADRS>
##$PROCNO= 1
##$TYPE= <nmr>
##$USER= <dgb>
##$AMP= (0..31)
100 100 100 100 100 100 100 100 100 100 100 100 100 100 100 100 100 100 
100 100 100 100 100 100 100 100 100 100 100 100 100 100 
##$AQSEQ= 0
##$AQ_mod= 3
##$AUNM= <au_zg>
##$AUTOPOS= <55 >
##$BF1= 250.13
##$BF2= 250.13
##$BF3= 250.13
##$BF4= 250.13
##$BF5= 500.13
##$BF6= 500.13
##$BF7= 500.13
##$BF8= 500.13
##$BYTORDA= 1
##$CFDGTYP= 0
##$CFRGTYP= 5
##$CHEMSTR= <none>
##$CNST= (0..31)
1 1 145 1 1 1 1 1 1 1 1 1 1 1 1 1 1 1 1 1 1 1 1 1 1 1 1 1 1 1 1 1 
##$CPDPRG= <>
##$CPDPRG1= <>
##$CPDPRG2= <>
##$CPDPRG3= <>
##$CPDPRG4= <mlev>
##$CPDPRG5= <mlev>
##$CPDPRG6= <mlev>
##$CPDPRG7= <mlev>
##$CPDPRG8= <mlev>
##$CPDPRGB= <>
##$CPDPRGT= <>
##$D= (0..31)
0 1 0 0 0 0 0 0 0 0.06 0 0 0 0 0 0 0.0002 0 0 0 0 0 0 0 0 0 0 0 0 0 0 
0 
##$DATE= 1144917596
##$DBL= (0..7)
120 120 120 120 120 120 120 120 
##$DBP= (0..7)
150 150 150 150 150 150 150 150 
##$DBP07= 0
##$DBPNAM0= <>
##$DBPNAM1= <>
$$ [...]
##$SUBNAM6= <"">
##$SUBNAM7= <"">
##$SUBNAM8= <"">
##$SUBNAM9= <"">
##$SW= 20.6930455092707
##$SWIBOX= (0..15)
0 0 3 0 0 0 0 0 0 0 0 0 0 0 0 0 
##$SW_h= 5175.983436853
##$TD= 65536
##$TD0= 1
##$TE= 294.16
##$TE2= 300
##$TE3= 300
##$TEG= 300
##$TL= (0..7)
0 120 120 120 120 120 120 120 
##$TP= (0..7)
150 150 150 150 150 150 150 150 
##$TP07= 0
##$TPNAME0= <>
##$TPNAME1= <>
##$TPNAME2= <>
##$TPNAME3= <>
##$TPNAME4= <>
##$TPNAME5= <>
##$TPNAME6= <>
##$TPNAME7= <>
##$TPOAL= (0..7)
0.5 0.5 0.5 0.5 0.5 0.5 0.5 0.5 
##$TPOFFS= (0..7)
0 0 0 0 0 0 0 0 
##$TUNHIN= 0
##$TUNHOUT= 0
##$TUNXOUT= 0
##$USERA1= <user>
##$USERA2= <user>
##$USERA3= <user>
##$USERA4= <user>
##$USERA5= <user>
##$V9= 5
##$VALIST= <valist>
##$VCLIST= <CCCCCCCCCCCCCCC>
##$VD= 0
##$VDLIST= <DDDDDDDDDDDDDDD>
##$VPLIST= <PPPPPPPPPPPPPPP>
##$VTLIST= <TTTTTTTTTTTTTTT>
##$WBST= 1024
##$WBSW= 4
##$XGAIN= (0..3)
0 0 0 0 
##$XL= 0
##$YL= 0
##$YMAX_a= 497807
##$YMIN_a= -309858
##$ZGOPTNS= <>
##$ZL1= 120
##$ZL2= 120
##$ZL3= 120
##$ZL4= 120
##$ABSF1= 16.522
##$ABSF2= -4.171173
##$ABSG= 5
##$ABSL= 3
##$ALPHA= 0
##$AQORDER= 0
##$ASSFAC= 0
##$ASSFACI= 0
##$ASSFACX= 0
##$ASSWID= 0
##$AUNMP= <proc_1d>
##$AZFE= 0.1
##$AZFW= 0.1
##$BCFW= 0
##$BC_mod= 0
##$BYTORDP= 0
##$COROFFS= 0
##$CY= 12.5
##$DATMOD= 1
##$DC= 0
##$DFILT= <>
##$DTYPP= 0
##$F1P= 14.0000005364418
##$F2P= -0.99999901652339
##$FCOR= 0.5
##$FTSIZE= 32768
##$FT_mod= 6
##$GAMMA= 0
##$GB= 0
##$INTBC= 1
##$INTSCL= 1
##$ISEN= 128
##$LB= 0.3
##$LEV0= 0
##$LPBIN= 0
##$MAXI= 10000
##$MC2= 0
##$MEAN= 0
##$ME_mod= 0
##$MI= 0
##$NCOEF= 0
##$NC_proc= -4
##$NLEV= 6
##$NOISF1= 0
##$NOISF2= 0
##$NSP= 0
##$NTH_PI= 0
##$NZP= 0
##$OFFSET= 16.522
##$PC= 1
##$PHC0= 16.6064
##$PHC1= 3.349976
##$PH_mod= 1
##$PKNL= yes
##$PPARMOD= 0
##$PSCAL= 4
##$PSIGN= 0
##$REVERSE= no
##$SF= 250.13
##$SI= 32768
##$SIGF1= 0
##$SIGF2= 0
##$SINO= 400
##$SIOLD= 32768
##$SREGLST= <1H.CDCl3>
##$SSB= 0
##$STSI= 32768
##$STSR= 0
##$SW_p= 5175.98343685301
##$SYMM= 0
##$S_DEV= 0
##$TDeff= 65536
##$TDoff= 0
##$TI= <Analysis number 999999
Compound Code 99
Book Reference 9
Project Code 9>
##$TILT= no
##$TM1= 0
##$TM2= 0
##$TOPLEV= 0
##$USERP1= <user>
##$USERP2= <user>
##$USERP3= <user>
##$USERP4= <user>
##$USERP5= <user>
##$WDW= 1
##$XDIM= 32768
##$YMAX_p= 393072286
##$YMIN_p= -52951
$$ End of Bruker specific parameters
$$ ---------------------------------
##NTUPLES= NMR SPECTRUM
##VAR_NAME=  FREQUENCY,     SPECTRUM/REAL,   SPECTRUM/IMAG
##SYMBOL=    X,             R,               I
##VAR_TYPE=  INDEPENDENT,   DEPENDENT,       DEPENDENT
##VAR_FORM=  AFFN,          ASDF,            ASDF
##VAR_DIM=   32768,         32768,           32768
##UNITS=     HZ,            ARBITRARY UNITS, ARBITRARY UNITS
##FACTOR=    0.157963299565203, 1,           1
##FIRST=     4132.6476996994, 0,             0
##LAST=      -1043.33573715361, 0,           0
##MIN=       -1043.33573715361, -52951,      0
##MAX=       4132.6476996994, 393072286,     0
$$ Real data points
##PAGE= N=1
##DATA TABLE= (X++(R..R)), XYDATA
$$ [...]
$$ plain form
15856 -21267 -18369 -22911 -8677 -1770 -3732 5474 961 -5571 -6122 1408 -1351 4002 8538 14675
15842 14675 20122 27954 17600 17803 25372 38435 33910 21919 20900 26080 16423 172 8226 6669
15828 6669 11846 20222 13301 16470 5702 801 -2029 -76 -20388 -14234 -1869 9816 10238 8183
15814 8183 1714 -91 -1227 -3183 5721 8990 10547 14481 6722 -2105 -20335 -20758 -15916 -5979 -4394
15799 -4394 -214 2402 5493 4800 3807 6077 14375 33900 28572 15285 10132 8552 11911 10752 9757
15784 9757 4288 17053 11846 -2380 -12252 -16965 -8206 -6679 -14120 -22594 -21288 -19116 -15666 -1767
15770 -1767 13691 12441 15656 18962 17432 16693 6646 -3175 -19893 -25678 -10613 -2517 10574 3048
15756 3048 -524 44 14363 15830 12638 17911 17327 7640 -1856 6801 830 -6901 2980 9499 4682
$$ packed form
15856b1267K898m542J4234O907j962R206m513o532n51P530k759N353M536O137
15842A4675N447P832j0354K03P569J3063m525j1991j019N180r657j6251Q054j557
15828F669N177Q376o921L169j0768m901k830J953k0312O154J2365J1685M22k055
15814H183o469j805j136j956Q904L269J557L934p759q827j8230m23M842R937J585
15799d394M180K616L091o93r93K270Q298J9525n328j3287n153j580L359j159r95
15784I757n469J2765n207j4226r872m713Q759J527p441q474J306K172L450J3899
15770a767J5458j250L215L306j530p39j0047r821j6718n785J5065Q096J3091p526
15756C048l572N68J4319J467l192N273n84r687r496Q657n971p731R881O519m817
$$ plain form
15741 4682 9279 2826 5079 15642 18820 15685 -1762 -4774 -3408 8397 13361 20053 1344 -4638
15727 -4638 12571 4304 -5319 -6034 -19866 -12227 2124 7464 -1941 302 -9657 -18217 -19590 -4074
15713 -4074 5649 -4490 -12350 -2187 -13744 -6748 -2980 -752 -635 8271 17550 18433 9011 12192
15699 12192 4620 9861 28148 27110 8223 -12479 -16377 7700 22420 24652 14711 -420 -7039
15686 -7039 -6155 -12410 -14807 -14402 -9390 -8230 -7551 2612 892 609 9759 19832 26090 13271 8207
15671 8207 7638 6818 -16 -8403 -870 -5673 -3725 21025 17355 -1053 -4007 13941 24289 25036
15657 25036 20793 25035 32952 15781 -3410 -16931 -22656 -16662 -20881 -22909 -18271 -11421 -1492 768
15643 768 -4037 -14380 -6907 5600 16871 12403 21730 27352 5134 -12759 -8041 -2163 3151 -4779
$$ packed form
15741D682M597o453K253J0563L178l135j7447l012J366J1805M964O692j8709n982
15727d638J7209q267r623p15j3832P639J4351N340r405K243r959q560j373J5516
15713d074R723j0139p860J0163j1557O996L768K228J17Q906R279Q83r422L181
15699A2192p572N241J8287j038j8887k0702l898K4077J4720K232r941j5131o619
15686g039Q84o255k397M05N012J160O79J0163j720k83R150J0073O258j2819n064
15671H207n69q20o834q387P533m803J948K4750l670j8408k954J7948J0348P47
15657B5036m243M242P917j7171j9191j3521n725N994m219k028M638O850R929K260
15643G68m805j0343P473J2507J1271m468R327N622k2218j7893M718N878N314p930
$$ plain form
15629 -4779 -15823 -12003 -4344 1862 14840 8764 80 -3083 -4063 -3984 -5597 147 -286 3106 12614
15614 12614 13722 19735 18935 23865 31637 32970 26305 16246 -6879 -20908 -14122 -18039 -13489 -5980
15600 -5980 -202 -7412 -8877 -4229 1855 4131 132 -7664 -190 -544 -18670 -10756 592 7605
15586 7605 10036 15064 489 -19602 -19934 -11154 425 1340 -8208 -5291 8623 15784 7728 5269
15572 5269 7435 12965 3590 -7429 -16251 -16876 -18109 -9433 -3897 162 12756 33791 35475 21892
15558 21892 1724 -5594 11869 28276 30122 20853 16039 2984 -7116 -9363 -14933 -11325 -6445
15545 -6445 12111 10866 8776 11846 1343 1261 -4685 -21211 -16038 -11382 -13817 -7980 10827 9993
15531 9993 1888 3770 13739 9366 1285 -1806 -566 5276 7038 10498 7851 -3741 -2680 10827
$$ packed form
15629d779j1044L820P659O206J2978o076q684l163r80P9j613N744m33L392R508
15614A2614J108O013q00M930P772J333o665j0059k3125j4029O786l917M550P509
15600e980N778p210j465M648O084K276l999p796P474l54j8126P914J1348P013
15586G605K431N028j4575k0091l32Q780J1579R15r548K917J3914P161q056k459
15572E269K166N530r375j1019q822o25j233Q676N536M059J2594K1035J684j3583
15558B1892k0168p318J7463J6407J846r269m814j3055j0100k247n570L608M880
15545f445J8556j245k090L070j0503q2n946j6526N173M656k435N837J8807q34
15531I993q105J882R969m373q081l091J240N842J762L460k647j1592J061J3507
$$ plain form
15517 10827 14519 15409 22451 16513 1023 720 8607 -1817 -14372 -5116 962 6041 16956 20950
15503 20950 14518 -1109 -3454 4153 10374 19652 10710 -1134 -3260 10462 9633 13303 13895 7268
15489 7268 3350 24109 31091 28502 36930 17510 -5647 -3298 -6520 -6985 476 -6465 -102 6135
15475 6135 14034 24529 12997 1808 871 2874 3171 -1532 3031 -7056 -7817 6164 7841 3308
15461 3308 2920 -2905 -917 -8124 -10323 -13988 -7328 332 16875 12055 -58 -10087 -13908 -3733
15447 -3733 13141 26374 29223 16164 14335 17656 7297 9954 6638 9202 8005 14836 17827 9493
15433 9493 10367 9751 847 -6072 -7616 -5400 -633 8225 19754 24976 20950 7620 4459 1322 -91
15418 -91 -3721 2516 1749 -8866 -13704 -6300 -7169 -11099 -10126 -20233 -26956 -27953 -30402 -28532 -16938
$$ packed form
15517A0827L692Q90P042n938j5490l03P887j0424j2555R256O078N079J0915L994
15503B0950o432j5627k345P607O221R278q942j1844k126J3722q29L670N92o627
15489G268l918K0759O982k589Q428j9420k3157K349l222m65P461o941O363O237
15475F135P899J0495j1532j1189r37K003K97m703M563j0087p61J3981J677m533
15461C308l88n825J988p207k199l665O660P660J6543m820j2113j0029l821J0175
15447c733J6874J3233K849j3059j829L321j0359K657l316K564j197O831K991q334
15433I493Q74o16q904o919j544K216M767Q858J1529N222m026j3330l161l137j413
15418i1l630O237p67j0615m838P404q69l930R73j0107o723r97k449J870J1594
$$ plain form
15403 -16938 -1181 8475 4691 -1837 -9543 -4762 -4661 -15059 -20631 -17755 -20770 -27532 -16795 -22558
15389 -22558 -18922 -10481 895 6410 130 -1807 -11096 -21677 -8810 -4500 -3527 -16846 -5616
15376 -5616 -4174 -424 10948 10297 1489 -888 -154 4929 18471 15519 1698 -3990 -6579 -10834
15362 -10834 -13383 -13133 -14398 -19187 -15489 -9283 -5131 -2588 -4863 -6753 -4961 9862 -803 1770
15348 1770 21584 21939 21036 11626 -3158 -21984 -11122 -4972 -19826 -14790 -5056 2803 671 298
15334 298 -7537 -10951 -15403 -14804 -10626 -16412 -13644 -8720 -14292 -3440 9064 4417 21544 32621
15320 32621 22397 13504 1560 -7762 2040 8305 699 153 5704 6153 2284 -10383 -12082 -8227
15306 -8227 2853 14373 24432 13118 9961 11085 6830 12289 9234 5165 8330 4451 6225 8376
$$ packed form
15403a6938J5757R656l784o528p706M781J01j0398n572K876l015o762J0737n763
15389b2558L636Q441J1376N515o280j937r289j0581J2867M310R73j3319J1230
15376e616J442L750J1372o51q808k377P34N083J3542k952j3821n688k589m255
15362a0834k549K50j265m789L698O206M152K543k275j890J792J4823j0665K573
15348A770J9814L55r03r410j4784j8826J0862O150j4854N036R734P859k132l73
15334B98p835l414m452N99M178n786K768M924n572J0852J2504m647J7127J1077
15320C2621j0224q893j1944r322R802O265p606n46N551M49l869j2667j699L855
15306h227J1080J1520J0059j1314l157J124m255N459l055m069L165l879J774K151
$$ plain form
15292 8376 11155 6470 741 -12985 -16213 -5383 9603 342 -4642 -2621 -3716 6685 6878 1238
15278 1238 -10772 -20863 -31368 -28300 -14355 -6179 1102 -126 7202 6075 916 6547 18930
15265 18930 17655 7890 6505 660 -13433 -18354 -10781 -14121 -16829 -16924 -6637 -6501 -3919 6138
15251 6138 10020 -1828 -6531 446 7614 4375 5900 15918 11633 -9372 -20540 -12079 5658
15238 5658 -1838 -10257 -13240 -10641 -8424 -12786 -16710 -21122 -19031 -6824 6021 6125 7627 10291
15224 10291 7535 2574 -11101 -20916 -14519 -3255 7215 338 -5296 -4334 -4497 -11180 -9023 5608
15210 5608 10659 -272 10798 11912 3606 3759 -12529 -10534 -8046 -11570 -2676 1664 -3378 3349
15196 3349 -1669 -9020 -9464 -3032 -119 2457 -322 -7081 -5165 -2151 12672 12751 7866 3278 -6998
$$ packed form
15292H376K779m685n729j3726l228J0830J4986r261m984K021j095J0401J93n640
15278A238j2010j0091j0505L068J3945Q176P281j228P328j127n159N631J2383
15265A8930j275r765j385n845j4093m921P573l340k708r5J0287J36K582J0057
15251F138L882j1848m703O977P168l239J525J0018m285k1005j1168Q461J7737
15238E658p496q419k983K599K217m362l924m412K091J2207J2845J04J502K664
15224A0291k756m961j3675r815O397J1264J0470o877n634R62j63o683K157J4631
15210E608N051j0931J1070J114q306J53j6288J995K488l524Q894M340n042O727
15196C349n018p351m44O432K913K576k779o759J916L014J4823P9m885m588j0276
$$ plain form
15181 -6998 -13470 -6928 9936 5548 2877 -7452 6506 16853 1192 2620 -1405 -8503 -5181
15168 -5181 11598 4365 -3233 -15618 -24144 -16846 -998 -5647 -1455 -9236 -4608 -2550 9553 8388
15154 8388 -6575 -11891 867 13220 18762 16449 16953 13542 17558 24396 20752 3749 -7888 -2678
15140 -2678 1903 -7561 -7336 -2715 -4754 -14556 -15918 -13326 -5442 2156 1665 3954 1752 -11350 -17149
15125 -17149 -6471 9523 17618 18523 8082 -6775 604 1327 2654 -5535 -6240 8164 8831 -619
15111 -619 4987 10690 9305 6556 1350 -642 215 -17415 -26993 -20957 -4104 7087 1004 5226
15097 5226 7167 -1127 -8964 -197 8520 20280 18027 6602 -14266 -18032 -4014 6779 -9202
15084 -9202 -29284 -28070 -28603 -36464 -37637 -39615 -26413 -13413 -14670 -18345 -18981 -18302 -21204 -30421 -31202
$$ packed form
15181f998o472O542J6864m388k671j0329J3958J0347j5661J428m025p098L322
15168e181J6779p233p598j2385q526P298J5848m649M192p781M628K058J2103j165
15154H388j4963n316J2758J2353N542k313N04l411M016O838l644j7003j1637N210
15140b678M581r464K25M621k039r802j362K592P884P598m91K289k202j3102n799
15125a7149J0678J5994Q095R05j0441j4857P379P23J327q189p05J4404O67r450
15111f19N606N703j385k749n206j992Q57j7630r578O036J6853J1191o083M222
15097E226J941q294p837Q767Q717J1760k253j1425k0868l766J4018J0793j5981
15084i202k0082J214n33p861j173j978J3202J3000j257l675o36O79k902r217p81
$$ plain form
15069 -31202 -12865 -10101 -13083 -13651 -6329 -1389 -446 1858 2430 8437 8543 5156 1529 3790 14116
15054 14116 8570 689 -3104 -1119 -3923 -2001 -3654 -914 -15862 -20064 -11589 -7279 -23272 -31105
15040 -31105 -19319 -13289 411 14477 30742 29102 13846 -7293 -5393 -2423 1487 12853 19487
15027 19487 1630 310 -2615 -5163 1299 9139 -357 -8999 -4677 2494 13867 2162 -11782
15014 -11782 -14070 -21034 -26951 -25363 -16737 -17466 -16338 -16184 -13559 -9487 7843 -1567 -6741 -994 -21519
14999 -21519 -33986 -38663 -41412 -40034 -21278 -2076 -13999 -975 6178 8549 4926 -1316 -15597
14986 -15597 -7474 -12866 -10881 -9910 -16668 -13984 -7361 -426 -1441 1532 2204 -1944 -1975 1210 991 9807
14970 9807 8335 3110 8464 8655 6159 1273 -12277 -18783 -15415 -9993 -16917 -16597 -1476 18261
$$ packed form
15069c1202J8337K764k982n68P322M940R43K304N72O007J06l387l627K261J0326
15054A4116n546p881l793J985k804J922j653K740j4948m202Q475M310j5993p833
15040c1105J1786O030J3700J4066J6265j640j5256k1139J900K970L910J1366O634
15027A9487j7857j320k925k548O462P840r496q642M322P171J1373j1705j3944
15014a1782k288o964n917J588Q626p29J128J54K625M072J7330r410n174N747k0525
14999b1519j2467m677k749J378J8756J9202j1923J3024P153K371l623o242j4281
14986a5597Q123n392J985R71o758K684O623O935j015K973O72m148l1L185k19Q816
14970I807j472n225N354J91k496m886j3550o506L368N422o924L20J5121J9737
$$ plain form
14956 18261 17398 6401 6463 5170 14157 7945 11007 9062 1388 -17257 -23414 -11177 761 1975
14942 1975 -11163 -15829 -8600 8334 16017 23594 21047 5469 4556 1766 -5248 -6368 -1889 964
14928 964 1282 4824 15030 18218 670 -3088 4106 -5917 -8307 6263 9157 -368 765 -401
14914 -401 2792 4592 16948 28586 16891 -1355 -8729 2353 -1649 -10101 422 1903 1006 1020
14900 1020 -6244 -13891 -21422 -24438 -20152 -17489 -13480 -9416 -13444 -23583 -25056 -22842 -26452 -31926
14886 -31926 -32987 -25352 -17641 -14293 -2462 945 1569 4735 6681 7140 -4086 1900 4538 -4301
14872 -4301 -4735 -4633 -7029 -5909 3480 17143 7350 5075 13738 16881 6602 -5510 -831 11728
14858 11728 7895 -5105 -3409 -1853 -16774 -18260 -24879 -22603 -13916 -16180 -19352 -26174 -25487 -12477
$$ packed form
14956A8261q63j0997O2j293Q987o212L062j945p674j8645o157J2237J1938J214
14942A975j3138m666P229J6934P683P577k547j5578r13k790p014j120M479K853
14928I64L18L542J0206L188j7548l758P194j0023k390J4570K894r525J133j166
14914d01L193J800J2356J1638j1695j8246p374J1082m002q452J0523J481q97J4
14900A020p264p647p531l016M286K663M009M064m028j0139j473K214l610n474
14886c1926j061P635P711L348J1831L407O24L166J946M59j1226N986K638q839
14872d301m34J02k396J120R389J3663r793k275Q663L143j0279j2112M679J2559
14858A1728l833j3000J696J556j4921j486o619K276Q687k264l172o822O87J3010
$$ plain form
14844 -12477 -3541 5128 7161 887 80 -311 -111 -9952 -13679 -10949 -15509 -14197 -7834 -1780 -3388
14829 -3388 -14479 -25848 -26748 -18893 -11298 -4373 4484 8086 12235 6296 -5103 -18829 -7879 -5479
14815 -5479 -10010 -14697 -17448 -10091 -8847 -19490 -16587 -3075 -4823 -8307 -9136 836 10084 4775
14801 4775 -854 3977 3816 6684 3902 9504 9479 6284 18696 23452 10386 -14586 -16567 -1517
14787 -1517 11091 2399 2023 16429 20951 13686 12190 13434 129 -9003 -14518 -11749 -2782 7952
14773 7952 6100 4201 122 -4239 -15118 -23446 -27367 -36505 -24176 -12088 -11030 -13004 -7386 -3807
14759 -3807 -3298 -17229 -21263 -21571 -20393 -22804 -26691 -24839 -12863 -11717 -14024 -14307 -12913 -19361 -13124
14744 -13124 -16620 -16334 -20379 -17287 -11044 -10015 -14399 -15478 -8251 -4888 -7648 -17698 -14606 -17728
$$ packed form
14844a2477Q936Q669K033o274q07l91K00r841l727K730m560J312O363O054j608
14829c388j1091j1369r00P855P595O925Q857L602M149n939j1399j3726J0950K400
14815e479m531m687k751P357J244j0643K903J3512j748l484q29R972R248n309
14801D775n629M831j61K868k782N602k5l195J2412M756j3066k4972j981J5050
14787a517J2608q692l76J4406M522p265j496J244j3305r132n515K769Q967J0734
14773G952j852j899m079m361j0879q328l921r138J2329J2088J058j974N618L579
14759c807N09j3931m034l08J178k411l887J852J1976J146k307k83J394o448O237
14744a3124l496K86m045L092O243J029m384j079P227L363k760j0050L092l122
$$ plain form
14730 -17728 -11275 -12883 -7916 -5666 -16122 -14666 -9489 -25394 -36286 -34917 -21273 -12387 -17493
14717 -17493 -10184 -10945 -16125 -20148 -19943 -20444 -18331 -18260 -16997 -16417 -10448 -4029 -13554 -11723 -8580 -99
14701 -99 5851 730 -4642 -7977 -2186 532 5278 12405 576 -6914 6750 14658 13825 8576 -6778
14686 -6778 -8899 -12120 -17935 -20495 -9812 -9302 -2636 -8102 -21061 -23248 -8753 4710 -1069 -14874
14672 -14874 -16755 -26368 -11416 -5272 -12549 -9622 -2005 -5990 -16801 -18728 -6781 10295 3307
14659 3307 -4337 -1975 3150 -3531 5117 7770 249 -1451 -6163 4930 7568 5792 6571 -1729 -9405
14644 -9405 -8300 -15291 -7658 1237 -1429 -11552 -16598 -14717 -282 2429 -3067 -10828 -22443 -12940
14630 -12940 -6814 -6822 -5273 -13858 -8401 -3472 -14017 -22968 -26270 -6039 12732 27988 31897 28858
$$ packed form
14730a7728O453j608M967K250j0456J456N177j5905j0892J369J3644Q886n106
14717a7493P309p61n180m023K05n01K113P1J263N80N969O419r525J831L143Q481
14701i9N950n121n372l335N791K718M746P127j1829p490J3664P908q33n249j5354
14686f778k121l221n815k560J0683N10O666n466j2959k187J4495J3463n779j3805
14672a4874j881r613J4952O144p277K927P617l985j0811j927J1947J7076o988
14659C307p644K362N125o681Q648K653p521j700m712J1093K638j776P79q300p676
14644i405J105o991P633Q895k666j0123n046J881J4435K711n496p761j1615R503
14630a2940O126qJ549q585N457M929j0545q951l302K0231J8771J5256L909l039
$$ plain form
14616 28858 22333 6974 -7387 -7152 -17278 -14338 -19028 -14661 -7512 -17428 -21775 -15081 -8989 2294
14602 2294 858 -13077 -14884 -4281 -4313 330 8776 5559 -2894 3183 -7983 -24664 -19886 -9204
14588 -9204 -13323 -13216 -21819 -8786 -440 -7919 -18284 -27283 -13894 -9660 -22311 -21687 -19700 -22951
14574 -22951 -26012 -29199 -32300 -32849 -24820 -16690 -16441 -15268 1462 1836 -18172 -35894 -36653 -21496
14560 -21496 -11421 -16433 -15775 -9209 -18868 -14399 -2151 -3214 4779 6663 6300 18800 33230 30624
14546 30624 15342 1065 -8075 -10846 -10703 -6882 -2009 -3514 -10201 -13275 -18841 -30158 -27369 -15207
14532 -15207 -4188 271 2136 3444 668 846 -2946 -13034 -12121 -19346 -13428 -6915 3031 -1963
14518 -1963 -9978 -13579 -17319 -16193 -7351 -5739 -5986 8503 30621 24469 -145 -4059 -5041 35
$$ packed form
14616B8858o525j5359j4361K35j0126K940m690M367P149r916m347O694O092J1283
14602B294j436j3935j807J0603l2M643Q446l217q453O077j1166j6681M778J0682
14588i204m119J07q603J3033Q346p479j0365q999J3389M234j2651O24J987l251
14574b2951l061l187l101n49Q029Q130K49J173J6730L74k0008j7722p59J5157
14560b1496J0075n012O58O566r659M469J2248j063P993J884l63J2500J4430k606
14546C0624j5282j4277r140k771J43L821M873j505o687l074n566j1317K789J2162
14532a5207J1019M459J865J308k776J78l792j0088R13p225N918O513R946m994
14518a963q015l601l740J126Q842J612k47J4489K2118o152k4614l914r82N076
$$ plain form
14504 35 -1369 30 -5962 -12261 -11394 -10592 -7714 7917 16815 22011 23819 9374 -9643 -24181 -4725
14489 -4725 -6443 -25224 -35039 -28841 -20946 -26753 -34706 -23452 -12582 -21129 -30889 -22095 -23190 -29200
14475 -29200 -28058 -16976 -15933 -24192 -24153 -11810 -16046 -16155 -22503 -23186 -24723 -16903 -22076 -29043 -33674
14460 -33674 -39558 -33834 -20447 -14146 -8938 -2885 -514 5511 11701 10465 6647 -6949 -20812 -24152
14446 -24152 -20327 -8950 -5441 -8941 -8490 -14831 -9668 11099 1522 -454 10173 6527 -2001 -9211
14432 -9211 -5220 -9320 -15488 -3272 -5138 -18259 -9161 -13104 -21690 -23320 -19273 -10003 2678 10043
14418 10043 3967 -9304 -7479 -12916 -19964 -22096 -15011 -15225 -27615 -37799 -46738 -44713 -42596 -45245
14404 -45245 -36231 -17539 -2376 5624 4277 836 -6698 -7016 -12182 -18183 -11013 -6055 3899 1358
$$ packed form
14504C5j404J399n992o299Q67Q02K878J5631Q898N196J808j4445j9017j4538J9456
14489d725j718j8781r815O198P895n807p953J1254J0870q547r760Q794j095o010
14475b9200J142J1082J043q259L9J2343m236j09o348o83j537P820n173o967m631
14460c3674n884N724J3387O301N208O053K371O025O190j236l818j3596j3863l340
14446b4152L825J1377L509l500M51o341N163K0767r577j976J0627l646q528p210
14432i211L991m100o168J2216j866j3121R098l943q586j630M047R270J2681P365
14418A0043o076j3271J825n437p048k132P085k14j2390j0184q939K025K117k649
14404d5245R014J8692J5163Q000j347l441p534l18n166o001P170M958R954k541
$$ plain form
14390 1358 11456 15677 -1506 -18845 -9485 -1657 -4767 -20123 -23652 -24168 -31099 -20235 -14255 -11909
14376 -11909 -12856 -10698 -19167 -34407 -35216 -27790 -35007 -30884 -19383 -26925 -34233 -22619 -15123 -12622
14362 -12622 -1252 -232 -15174 -17067 -14141 -12373 -662 -6205 -13318 -24612 -26905 -14175 -5082
14349 -5082 -14128 -20778 -32060 -34038 -21164 -7247 -4417 2066 -744 -13793 -9973 -5136 4255 14161
14335 14161 9181 4659 -4995 -13015 -21140 -12536 -9116 -2286 -10491 -9430 -1554 10684 8263 3486
14321 3486 -2806 -13348 -17457 -13175 -9363 -3039 647 6429 424 -13380 -16499 -14731 -13182 -17107
14307 -17107 -14415 -31120 -28328 -15336 -7046 -7043 -6313 -11187 -16344 -31328 -40319 -31898 -32421 -41999 -31747
14292 -31747 -14355 -18258 -31166 -27026 -17902 -31786 -22003 -5147 6452 2404 2082 -19577 -28615
$$ packed form
14390A358J0098M221j7183j7339R360P828l110j5356l529n16o931J0864N980K346
14376a1909r47K158q469j5240q09P426p217M123J1501p542p308J1614P496K501
14362a2622J1370J020j4942j893K926J768J1711n543p113j1294k293J2730R093
14349e082r046o650j1282j978J2874J3917K830O483k810j3049L820M837R391R906
14335A4161m980m522r654q020q125Q604L420O830q205J061P876J2238k421m777
14321C486o292j0542m109M282L812O324L686N782o005j3804l119J768J549l925
14307a7107K692j6705K792J2992Q290LP30m874n157j4984q991Q421n23r578J0252
14292c1747J7392l903j2908M140R124j3884R783J6856J1599m048l22k1659r038
$$ plain form
14279 -28615 -22170 -19121 -25823 -26487 -26497 -30631 -29593 -22551 -18144 -15706 -6684 4007 8625 -6671 -8243
14264 -8243 -3331 260 -5449 -12307 -245 4618 695 -3842 -10566 -4148 -6297 -20322 -20216 -23429
14250 -23429 -7346 -1304 -6590 -9527 -5317 -12411 -24284 -32472 -29140 -23177 -29394 -25023 -28376 -24881
14236 -24881 -21717 -27576 -22824 -8981 1127 10300 9544 4622 -7355 -8424 -3478 -11791 -13387 -20632
14222 -20632 -28409 -25541 -15991 -19254 -23929 -21944 -6132 8128 11050 14732 16396 23697 3501 -15715
14208 -15715 -28605 -21296 -15980 -15263 -7818 -18305 -19790 -13623 -11574 -5311 -10347 760 -2155 -14980
14194 -14980 -26355 -25150 -24407 -24293 -15383 -21719 -23586 -18767 -7313 -8119 -20574 -5121 -609 -13447
14180 -13447 -23125 -7694 -1516 5092 -2282 -8667 -14854 -9811 -4158 8775 12542 10778 9565 13066
$$ packed form
14279b8615O445L049o702o64j0m134J038P042M407K438R022J0691M618j5296j572
14264h243M912L591n709o858J2062M863l923m537o724O418k149j4025J06l213
14250b3429J6083O042n286k937M210p094j1873q188L332N963o217M371l353L495
14236b4881L164n859M752J3843J0108R173p56m922j1977j069M946q313j596p245
14222b0632p777K868R550l263m675J985J5812J4260K922L682J664P301k0196j9216
14208a5715j2890P309N316P17P445j0487j485O167K049O263n036J1107k915j2825
14194a4980j1375J205P43J14Q910o336j867M819J1454q06j2455J5453M512j2838
14180a3447r678J5431O178O608p374o385o187N043N653J2933L767j764j213L501
$$ plain form
14166 13066 -1899 -13454 -18199 -22116 -19344 -23335 -29442 -27287 -32885 -29228 -33860 -33573 -13319 -680
14152 -680 -1797 -21715 -30143 -32222 -16074 -14931 -28502 -34833 -42065 -36857 -22860 -21577 -20847 -8864
14138 -8864 -1547 -262 2568 3264 -7129 -280 2986 -4712 -5623 -9210 -4924 -12517 -2005 5036 -1243
14123 -1243 -10405 -4779 805 7016 -387 -908 16943 26199 17538 -3420 -2544 12502 13580 -8579
14109 -8579 -8332 1953 -5850 -17650 -14271 -7205 10844 6848 -9909 -16572 -7203 -11620 -17074 -27336
14095 -27336 -25554 -22292 -10669 -2891 -4281 -13563 -24151 -30287 -19663 -10460 -19205 -17913 -18356 -27360
14081 -27360 -14919 -5982 -5887 -8191 -11068 -20502 -35075 -20438 -3711 10714 15254 9621 3316 2687
14067 2687 -9415 -12644 -15420 -23308 -22776 -8609 -11929 -16769 -25328 -27144 -21956 -15503 -12488 -2307
$$ packed form
14166A3066j4965j1555m745l917K772l991o107K155n598L657m632K87K0254J2639
14152f80j117j9918q428k079J6148J143j3571o331p232N208J3997J283P30J1983
14138h864P317J285K830O96j0393O849L266p698r11l587M286p593J0512P041o279
14123a243r162N626N584O211p403n21J7851R256q661k0958Q76J5046J078k2159
14109h579K47J0285p803j1800L379P066J8049l996j6757o663R369m417n454j0262
14095b7336J782L262J1623P778j390r282j0588o136J0624R203q745J292m43r004
14081b7360J2441Q937R5k304k877r434j4573J4637J6727J4425M540n633o305o29
14067B687j2102l229k776p888N32J4167l320m840q559j816N188O453L015J0181
$$ plain form
14053 -2307 10507 16202 4610 -2381 -8297 -12437 2823 4291 -15955 -23634 -12271 -1029 10721
14040 10721 4440 -283 9393 4299 -4893 -15805 -10826 -15021 -19613 -27341 -18733 -8644 -9889 3767
14026 3767 12711 15867 10429 157 -8388 -12328 -11662 -7786 1176 20574 25076 23003 10845 3502
14012 3502 -19363 -25576 -12000 -5721 -10295 -6795 -1719 -4850 -13695 -15894 -4538 9109 17429 16933
13998 16933 11987 20023 17618 17550 6259 1114 -5975 -10899 -9392 -11478 -17659 -7394 -13107 -22835
13984 -22835 -22008 -9943 -7758 -17045 -23955 -31925 -34984 -40199 -39954 -14947 -1540 -531 -10864 -13243
13970 -13243 -21517 -21143 -20081 -23576 -19075 -6345 -10985 -16603 -17174 -17610 -17617 -14800 -21683 -14086 -5713 -7721
13954 -7721 -7550 -15091 -6292 -3908 -8325 -9429 -13129 -12227 -18382 -18297 -19654 -11245 -776 4792 962
$$ packed form
14053b307J2814N695j1592o991n916m140J5260J468k0246p679J1363J1242J1750
14040A0721o281m723R676n094r192j0912M979m195m592p728Q608J0089j245J3656
14026C767Q944L156n438j0272q545l940O66L876Q962J9398M502k073j2158p343
14012C502k2865o213J3576O279m574L500N076l131q845k199J1356J3647Q320m96
13998A6933m946Q036k405o8j1291n145p089m924J507k086o181J0265n713r728
13984b2835Q27J2065K185r287o910p970l059n215K45K5007J3407J009j0333k379
13970a3243q274L74J062l495M501J2730m640n618n71m36pK817o883P597Q373k008
13954g721J71p541Q799K384m417j104l700R02o155Q5j357Q409J0469N568l830
$$ plain form
13939 962 -8268 -17676 -15206 -7641 -11217 -10096 -19396 -24771 -36181 -32544 -26510 -17580 -8416 -16174 -14556
13924 -14556 -12095 -22608 -15903 -16565 -12473 -4120 -12399 5532 8969 13644 3813 -7971 -11085 -9363
13910 -9363 1946 2592 5812 -680 -11832 -17049 -18040 -17904 -20417 -18633 -21698 -17856 -22901 -24700 -16529
13895 -16529 -15601 -16749 -4656 -4395 -5229 -14678 -15023 -6651 -997 -14043 -23153 -21995 -22774 -25083 -15370
13880 -15370 -3318 4568 1237 -4110 -10551 -11421 -5228 5632 1605 -9472 -15012 -9150 5178 -1060
13866 -1060 -14024 -14137 -13918 -17452 -16185 -6685 -10065 -20243 -15812 -23573 -20024 -1721 9232 3590
13852 3590 475 4282 6975 11666 10877 6873 -1240 2687 20276 15114 21486 19267 7695 8212 334
13837 334 -10655 3458 -5542 -2322 -3705 -2517 -7708 -4424 -9441 -18904 -19526 -16244 -6650 -14647 -18388
$$ packed form
13939I62r230r408K470P565l576J121r300n375j1410L637O034Q930R164p758J618
13924a4556K461j0513O705o62M092Q353q279J7931L437M675r831j1784l114J722
13910i363J1309O46L220o492j1152n217r91J36k513J784l065L842n045j799Q171
13895a6529R28j148J2093K61q34r449l45Q372N654j3046r110J158p79k309R713
13880a5370J2052P886l331n347o441q70O193J0860m027j1077n540N862J4328o238
13866a060j2964j13K19l534J267R500l380j0178M431p761L549J8303J0953n642
13852C590l115L807K693M691p89m004q113L927J7589n162O372k219j1572N17p878
13837C34j0989J4113r000L220j383J188n191L284n017r463o22L282R594p997l741
$$ plain form
13822 -18388 -8965 -10532 -19173 -16426 -11151 -16216 -14724 -14014 -20587 -17162 -9734 -8476 -21112 -17234
13808 -17234 -17551 -30603 -18955 -6626 10 255 -11951 -1223 -5653 -22489 -39860 -30266 -17820
13795 -17820 -24672 -14778 -5598 998 14499 22097 14043 10410 -5755 -17491 -15248 -14529 -18604 -15370
13781 -15370 3098 19468 18336 13115 7753 7956 -1922 -10164 -5194 -6894 2706 5760 -4065 -14303
13767 -14303 -16952 -9175 -866 4690 5619 -6761 3323 1511 -817 -2385 294 -493 5944 -1080
13753 -1080 -15505 -21532 -11361 -12125 -10345 -320 -3177 -4166 1009 -369 998 -7031 -6697 -5100 -10204
13738 -10204 -3703 -6096 -5852 6650 12464 10324 10964 1705 -1558 1835 799 305 3023 11868 7799
13723 7799 3952 -15426 -18762 -21504 -19035 -8352 1189 2416 -1402 -4670 -8753 -9966 -15711 -16475
$$ packed form
13822a8388R423j567q641K747N275n065J492P10o573L425P428J258j2636L878
13808a7234l17j3052J1648J2329O636K45j2206J0728m430j6836j7371R594J2446
13795a7820o852R894R180O596J3501P598q054l633j6165j1736K243P19m075L234
13781a5370J8468J6370j132n221n362K03r878q242M970j700R600L054r825j0238
13767a4303k649P777Q309N556R29j2380J0084j812k328j568K679p87O437p024
13753a080j4425o027J0171p64J780J0025k857r89N175j378J367q029L34J597n104
13738a0204O501k393K44J2502N814k140O40r259l263L393j036m94K718Q845m069
13723G799l847j9378l336k742K469J0683R541J227l818l268m083j213n745p64
$$ plain form
13709 -16475 -4844 -5910 -19945 -26219 -21070 -16796 -18608 -14296 -6355 -5369 -9938 -27017 -30156 -21979
13695 -21979 -17941 -17101 -10205 -7599 -2375 -2559 3035 6286 1266 -6926 -4939 -1137 4834 6528 2242
13680 2242 -11318 -12312 -13666 -2292 -2112 -5272 4298 1032 -11656 -23313 -15407 -6870 -15642 -9524
13666 -9524 -16819 -26206 -28432 -10188 -12860 -15870 -4300 -16971 -26488 -20525 -21869 -21043 -25535 -28940
13652 -28940 -28269 -34933 -28019 -18450 -25330 -34947 -36891 -28784 -17323 1537 -4948 -8979 -2699 789
13638 789 -9270 -4657 5152 9006 -2581 -3386 2896 363 -12993 -22689 -18246 -11821 -9641 -13378
13624 -13378 -10121 555 -2935 -3350 1904 13545 14821 -6976 -7266 -8787 -5953 5444 17356 13732
13610 13732 9871 5126 -11830 -25911 -28792 -24158 -19058 -10023 -11116 -18869 -20189 -10082 -9383 -26471
$$ packed form
13709a6475J1631j066j4035o274N149M274j812M312P941R86m569j7079l139Q177
13695b1979M038Q40O896K606N224j84N594L251n020q192J987L802N971J694m286
13680B242j3560r94j354J1374J80l160R570l266j2688j1657P906Q537q772O118
13666i524p295r387k226J8244k672l010J1570j2671r517N963j344Q26m492l405
13652b8940O71o664O914R569o880r617j944Q107J1461J8860o485m031O280L488
13638G89j0059M613R809L854j1587q05O282k533j3356r696M443O425K180l737
13624a3378L257J0676l490m15N254J1641J276k1797k90j521K834J1397J1912l624
13610A3732l861m745j6956j4081k881M634N100R035j093p753j320J0107O99j7088
$$ plain form
13596 -26471 -28206 -21895 -18665 -9941 8390 22391 15801 6281 -133 -9757 -10658 -13373 -31 -9013
13582 -9013 -4568 82 -6494 -10447 -6958 -7237 -3259 7105 -3600 -14183 -21760 -12242 4040 2051
13568 2051 -8152 -15773 -11197 7994 13775 7732 8525 20507 19809 11369 -6802 -21561 -19504 -3236
13554 -3236 -4907 -7936 -955 6823 23913 27073 13305 -3767 -8054 -10308 -11607 -14481 -3485 -284
13540 -284 2742 7712 11141 7663 10417 11799 11025 -3460 -12210 -11930 -12838 -6919 3104 -3900 -13629
13525 -13629 -23193 -20105 -8874 1151 3308 -2822 -15651 -23447 -24004 -8508 -6567 -1971 -3326 -15819
13511 -15819 -18409 -19046 -8191 -8402 -14181 -12195 -12128 -9605 -7734 4583 17161 3658 2716 -11777
13497 -11777 -20125 -15718 -29075 -29062 -17218 -20325 -13511 -13604 2351 8969 19450 17804 13408 8043
$$ packed form
13596b6471j735O311L230Q724J8331J4001o590r520o414r624r01k715J3342q982
13582i013M445M650o576l953L489k79L978J0364j0705j0583p577R518J6282j989
13568B051j0203p621M576J9191N781o043P93J1982o98q440j8171j4759K057J6268
13554c236j671l029O981P778J7090L160j3768j7072m287k254j299k874J0996L201
13540b84L026M970L429l478K754J382p74j4485q750K80r08N919J0023p004r729
13525a3629r564L088J1231J0025K157o130j2829p796n57J5496J941M596j355j2493
13511a5819k590o37J0855k11n779J986O7K523J871J2317J2578j3503r42j4493
13497a1777q348M407j3357J3J1844l107O814r3J5955O618J0481j646m396n365
$$ plain form
13483 8043 12785 6232 -3697 -5394 1663 15453 22344 20541 4626 -3664 -3628 1691 3632 -828 -3099
13468 -3099 2393 -4951 -8403 -7153 -6931 -5331 -2934 -6338 -5907 -12598 -17057 -13634 -5922 -14514 -22152
13453 -22152 -17678 -8403 -3393 9048 25790 12083 9780 5304 -9692 -4781 9833 20716 25810
13440 25810 26648 22935 1146 -9856 -18034 -4284 3080 10946 6905 -6287 -10501 778 500 6038
13426 6038 3795 10280 6550 9803 13014 21807 22403 10706 7986 16710 25404 13674 -815 -8879
13412 -8879 -3388 7607 2717 -6143 -11901 -14789 -13778 -23251 -11485 11238 11481 3675 9340 16082
13398 16082 10966 2630 2554 651 4530 9276 12357 14545 4493 8255 24699 17481 10685 12913
13384 12913 11030 7911 6241 -1922 -636 3103 16348 9726 -3126 -7636 -9768 -13772 -19641 -12869
$$ packed form
13483H043M742o553r929j697P057J3790O891j803j5915q290L6N319J941m460k271
13468c099N492p344l452J250K22J600K397l404M31o691m459L423P712q592p638
13453b2152M474R275N010J2441J6742j3707k303m476j4996M911J4614J0883N094
13440B5810Q38l713k1789j1002q178J3750P364P866m041j3192m214J1279k78N538
13426F038k243O485l730L253L211Q793N96j1697k720Q724Q694j1730j4489q064
13412h879N491J0995m890q860n758k888J011r473J1766K2723K43p806N665O742
13398A6082n116q336p6j903L879M746L081K188j0052L762J6444p218o796K228
13384A2913j883l119j670q163J286L739J3245o622j2852m510k132m004n869O772
$$ plain form
13370 -12869 -15743 -12717 1812 6024 5575 11750 5512 -8439 -12150 -5803 -8942 -21 11427 7964
13356 7964 10402 6018 9633 6221 775 -3603 -707 -3280 -5560 -11098 130 17596 22100 4668
13342 4668 -5548 -8804 -1038 12131 12767 10001 9036 15189 18728 22933 35305 31705 29573 15230
13328 15230 7174 11957 9006 569 3497 -3318 -8600 -7498 2563 4937 2365 4425 -376 4489
13314 4489 158 12096 25677 24615 30069 29460 11192 19417 19702 17173 7560 4010 643 787 13232
13299 13232 31277 21048 12654 16368 23733 22264 22918 20673 20285 19356 10889 1118 -258 3571 -1143
13284 -1143 -4390 3015 7623 17777 21319 23934 19975 35851 28196 11831 21185 36462 28402 20252
13270 20252 22257 23950 18124 873 -8977 -10534 -4117 -2208 16209 28364 26504 7584 -5102
$$ packed form
13370a2869k874L026J4529M212m49O175o238j3951l711O347l139Q921J1448l463
13356G964K438m384L615l412n446m378K896k573k280n538J1228J7466M504j7432
13342D668j0216l256P766J3169O36k766r65O153L539M205J2372l600k132j4343
13328A5230q056M783k951q437K928o815n282J102J0061K374k572K060m801M865
13314D489m331J1938J3581j062N454o09j8268Q225K85k529r613l550l367J44J2445
13299A3232J8045j0229q394L714P365j469O54k245l88r29q467r771j376L829m714
13284a143l247P405M608J0154L542K615l959J5876p655j6365R354J5277q060q150
13270B0252K005J693n826j7251r850j557O417J909J8417J2155j860j8920j2686
$$ plain form
13257 -5102 -666 10733 20555 12641 14203 20715 17061 12092 3023 -1403 32 10637 15752 16910
13243 16910 23805 15576 2847 2738 1372 -8738 -14109 -6244 -1321 7490 8141 10379 2842 8262
13229 8262 8893 18784 18666 15289 19917 17290 21561 18953 19387 19767 15262 13019 5745 6059 13866 8651
13213 8651 14856 22334 16303 7036 7225 24198 28188 26045 25319 25505 16854 15300 14633 22799 33298
13198 33298 16974 6317 -8258 -5989 12771 22368 19730 22075 28659 31832 25801 16446 21711
13185 21711 25241 30692 35139 30277 21691 12076 16867 17885 21376 33520 26013 28350 32293 28363
13171 28363 31628 36634 42768 48438 47815 45304 28387 15484 16355 11446 12788 20533 23514 27405
13157 27405 32828 26365 29052 32312 34316 30734 27158 27310 34960 37856 36346 36531 32224 21502 11267
$$ packed form
13257e102M436J1399R822p914J562O512l654m969r069m426J435J0605N115J158
13243A6910O895q229j2729j09j366j0110n371P865M923Q811O51K238p537N420
13229H262O31R891j18l377M628k627M271k608M34L80m505k243p274L14P807n215
13213H651O205P478o031r267J89J6973L990k143p26J86q651j554o67Q166J0499
13198C3298j6324j0657j4575K269J8760R597k638K345O584L173o031r355N265
13185B1711L530N451M447m862q586r615M791J018L491J2144p507K337L943l930
13171B8363L265N006O134N670o23k511j6917j2903Q71m909J342P745K981L891
13157B7405N423o463K687L260K004l582l576J52P650K896j510J85m307j0722j0235
$$ plain form
13142 11267 14479 14475 19893 25977 26360 15201 20567 47376 62288 58551 50480 44045 44041 45849 42579
13127 42579 40216 43191 46980 63991 60683 53070 38769 30437 38942 31112 24132 28065 27302 26379
13113 26379 31977 27484 17380 22433 20268 12311 1678 4939 16872 24029 37851 35563 39386
13100 39386 45624 47569 48022 53518 53029 49095 46730 33458 19168 7379 7585 25155 32982 28858
13086 28858 17592 10423 22784 23794 22724 36068 28397 27941 31405 47872 46535 38780 34587 32759
13072 32759 35810 35030 40141 44103 51873 50844 34056 23019 31182 38053 35446 35695 33370 28422
13058 28422 27613 32264 38453 42223 35501 52716 70759 72111 62768 54173 55247 55064 53581 47961
13044 47961 37513 38423 44558 42469 49580 41125 38221 42847 35274 35593 39028 47079 54464 46370 44842
$$ packed form
13142A1267L212mN418O084L83j1159N366K6809J4912l737q071o435mJ808l270
13127D2579k363K975L789J7011l308p613j4301q332Q505p830o980L933p63r23
13113B6379N598m493j0104N053k165p957j0633L261J1933P157J3822k288L823
13100C9386O238J945M53N496m89l934k365j3272j4290j1789K06J7570P827m124
13086B8858j1266p169J2361J010j070J3344p671m56L464J6467j337p755m193j828
13072C2759L051p80N111L962P770j029j6788j1037Q163O871k607K49k325m948
13058B8422q09M651O189L770o722J7215J8043J352r343q595J074j83j483n620
13044D7961j0448R10O135k089P111q455k904M626p573L19L435Q051P385q094j528
$$ plain form
13029 44842 61566 58459 48685 45234 40949 35472 29340 27566 31684 34184 40065 52160 41267 34423
13015 34423 35733 50658 50612 35033 34882 41812 44003 39340 48171 45038 37018 53747 63602 61555
13001 61555 52011 50942 60181 64206 54554 56775 55619 52980 59811 59518 53967 40466 29566 39468
12987 39468 58397 61567 73197 63006 43818 26661 28369 34485 38254 34480 41112 50332 48165
12974 48165 45742 40171 42902 45890 37952 32975 41191 54597 61797 58084 61919 63370 49791 37207
12960 37207 45521 46060 41424 55388 55710 54445 64581 66381 50587 45299 50899 65989 67655 59222
12946 59222 51757 54410 62978 59358 54145 56184 52244 46351 50854 67609 81197 85565 75939 66029
12932 66029 65323 61337 64239 70325 75034 78169 75652 78978 76648 74342 73124 70587 73363 87130
$$ packed form
13029D4842J6724l107r774l451m285n477o132j774M118K500N881J2095j0893o844
13015C4423J310J4925m6j5579j51O930K191m663Q831l133q020J6729R855k047
13001F1555r544j069R239M025r652K221j156k639O831k93n551j3501j0900R902
12987C9468J8929L170J1630j0191j9188j7157J708O116L769l774O632R220k167
12974D8165k423n571K731K988p938m977Q216J3406P200l713L835J451j3579j2584
12960C7207Q314N39m636J3964L22j265J0136J800j5794n288N600J5090J666q433
12946E9222p465K653Q568l620n213K039l940n893M503J6755J3588M368r626r910
12932F6029p06l986K902O086M709L135k517L326k330k306j218k537K776J3767
$$ plain form
12918 87130 94884 83108 71447 71369 68845 66975 74824 69502 73921 88034 90938 93749 82467 73941
12904 73941 67683 65739 66405 67942 69837 64533 77024 82934 87911 91241 89691 83900 83457 85967 89466
12889 89466 87133 88580 91148 83578 84780 86858 85056 68761 79107 90631 102616 105303 92541
12876 92541 96117 102637 93709 75707 86839 95987 100226 102972 103441 101885 104127 105260 95668 94005
12862 94005 92483 92625 86701 91830 87977 87203 89003 94832 87422 96749 99469 93400 80234 90409
12848 90409 92971 84583 86014 93405 108283 119275 132314 137816 131946 122186 101211 100975 93853 91237
12834 91237 104362 124069 133035 121317 116752 113468 107121 110747 117205 126316 133275 121757 122150 132365
12820 132365 142503 148576 148499 143294 139707 129464 128274 128723 136671 155728 149068 148998 150096 141694 131781
$$ packed form
12918H7130P754j1776j1661p8k524j870P849n322M419J4113K904K811j1282q526
12904G3941o258j944O66J537J895n304J2491N910M977L330j550n791m43K510L499
12889H9466k333J447K568p570J202K078j802j6295J0346J1524J1985K687j2762
12876I2541L576O520q928j8002J1132R148M239K746M69j556K242J133r592j663
12862I4005j522J42n924N129l853p74J800N829p410R327K720o069j3166J0175
12848I0409K562q388J431P391J4878J0992J3039N502n870r760k0975k36p122k616
12834I1237J3125J9707Q966j1718m565l284o347L626O458R111O959j1518L93J0215
12820A32365J0138O073p7n205l587j0243j190M49P948J9057o660p0J098q402r913
$$ plain form
12805 131781 113062 117564 116873 126870 144200 154093 159787 155245 148906 151430 154340 147819 137277 146489
12791 146489 152219 155615 156645 156103 147396 144498 150975 159896 167014 169058 167428 156330 157129 157036 147249
12776 147249 150866 160482 167557 174434 170650 175790 175005 180417 190977 203112 191207 171591 172168 166641
12762 166641 162881 175441 172843 181692 200657 210556 199041 191782 201575 205928 208175 211226 210166
12749 210166 207418 208985 209834 218622 232207 238596 231784 226684 225217 217839 233155 242825 245119 243823
12735 243823 254488 255548 255209 257218 264275 271652 275121 265257 257882 254283 259706 273409 278591 283023
12721 283023 272832 269141 279045 282427 282601 288823 291536 297178 297621 295962 291802 288003 297678 303533
12707 303533 297104 304628 314825 333079 337638 334227 328137 322327 336493 347691 346171 360562 372585
$$ packed form
12805A31781j8719M502o91R997J7330R893N694m542o339K524K910o521j0542R212
12791A46489N730L396J030n42q707k898O477Q921P118K044j630j1098P99r3r787
12776A47249L617R616P075O877l784N140p85N412J0560J2135j1905j9616N77n527
12762A66641l760J2560k598Q849J8965R899j1515p259R793M353K247L051j060
12749B10166k748J567Q49Q788J3585O389o812n100j467p378J5316R670K294j296
12735B43823J0665J060l39K009P057P377L469r864p375l599N423J3703N182M432
12721B83023j0191l691R904L382J74O222K713N642M43j659m160l799R675N855
12707C03533o429P524J0197J8254M559l411o090n810J4166J1198j520J4391J2023
$$ plain form
12694 372585 371879 365754 368000 365348 364246 354625 349532 353931 355135 357228 358468 368105 374433 375467
12680 375467 389126 395759 393151 400509 410819 411398 408909 406541 405142 404510 415710 411560 402121 402948
12666 402948 402284 403502 404767 417677 438369 446963 445290 437717 441369 450802 455009 459746 463925 468420
12652 468420 472824 460912 473331 488664 491257 496703 504480 504905 504173 510064 500670 489342 494109 498130
12638 498130 496899 499022 521122 530806 528716 549067 560773 555931 564068 566722 571645 584266 593548
12625 593548 611589 618659 626713 630743 640812 648051 637860 644322 651605 665847 682080 694986 702696
12612 702696 714821 715097 710648 714635 710516 725979 736003 747734 766091 787281 806913 818323
12600 818323 834471 852314 848531 845824 859954 880353 900857 920710 931458 934863 943242 954024
$$ packed form
12694C72585p06o125K246k652j102r621n093M399J204K093J240R637O328J034
12680C75467J3659O633k608P358J0310N79k489k368j399o32J1200m150r439Q27
12666D02948o64J218J265J2910K0692Q594j673p573L652R433M207M737M179M495
12652D68420M404j1912J2419J5333K593N446P777M25p32N891r394j1328M767M021
12638D98130j231K123K2100R684k090K0351J1706m842Q137K654M923J2621R282
12625E93548J8041P070Q054M030J0069P239j0191O462P283J4242J6233J2906P710
12612G02696J2125K76m449L987m119J5463J0024J1731J8357K1190J9632J1410
12600H18323J6148J7843l783k707J4130K0399K0504J9853J0748L405Q379J0782
$$ plain form
12588 954024 970519 1005965 1022549 1044051 1063422 1081116 1096216 1105204 1106417 1129739 1155949 1172069
12576 1172069 1174995 1192038 1218929 1237689 1266728 1295018 1313405 1323144 1338860 1367837 1385433 1399409
12564 1399409 1420722 1456647 1475042 1504296 1529071 1530114 1538165 1568465 1595347 1617636 1655122 1681844
12552 1681844 1700956 1724604 1743230 1764601 1795272 1828668 1862700 1892750 1910162 1935024 1960914
12541 1960914 1988382 2005523 2033716 2078742 2119696 2154116 2183140 2210935 2262491 2302423 2355576
12530 2355576 2406916 2452808 2487248 2539178 2592571 2636534 2687031 2756596 2816601 2870201 2927217
12519 2927217 2986024 3047647 3107804 3175064 3266169 3346558 3417511 3499496 3580073 3658078 3737961
12508 3737961 3818699 3905180 4003136 4107380 4229673 4356705 4480972 4592955 4722474 4848165
$$ packed form
12588I54024J6495L5446J6584K1502J9371J7694J5100Q988J213K3322K6210J6120
12576A172069K926J7043K6891J8760K9039K8290J8387R739J5716K8977J7596J3976
12564A399409K1313L5925J8395K9254K4775J043Q051L0300K6882K2289L7486K6722
12552A681844J9112K3648J8626K1371L0671L3396L4032L0050J7412K4862K5890
12541A960914K7468J7141K8193M5026M0954L4420K9024K7795N1556L9932N3153
12530B355576N1340M5892L4440N1930N3393M3963N0497O9565O0005N3600N7016
12519B927217N8807O1623O0157O7260R1105Q0389P0953Q1985Q0577P8005P9883
12508C737961Q0738Q6481R7956J04244J22293J27032J24267J11983J29519J25691
$$ plain form
12498 4848165 4981233 5130589 5294205 5452195 5621614 5792889 5981158 6192953 6396704
12489 6396704 6614624 6837215 7092434 7356631 7619514 7887843 8145712 8410830 8683964
12480 8683964 8962994 9250959 9546059 9848084 10177417 10526325 10908030 11279515 11683535
12471 11683535 12126750 12570803 13030259 13523567 14032814 14554640 15091308 15639941 16207274
12462 16207274 16785054 17374402 17965839 18587446 19216767 19853353 20482300 21108743 21728057
12453 21728057 22342337 22929791 23489525 24032778 24528027 24975433 25374034 25727296 26022418
12444 26022418 26246460 26406689 26510958 26552574 26537196 26472580 26371652 26206891 25975255 25719981
12434 25719981 25415272 25067427 24701659 24293496 23879793 23438973 22975710 22499865 22022768
$$ packed form
12498D848165J33068J49356J63616J57990J69419J71275J88269K11795K03751
12489F396704K17920K22591K55219K64197K62883K68329K57869K65118K73134
12480H683964K79030K87965K95100L02025L29333L48908L81705L71485M04020
12471A1683535M43215M44053M59456M93308N09247N21826N36668N48633N67333
12462A6207274N77780N89348N91437O21607O29321O36586O28947O26443O19314
12453B1728057O14280N87454N59734N43253M95249M47406L98601L53262K95122
12444B6022418K24042J60229J04269M1616j5378o4616j00928j64761k31636k55274
12434B5719981l04709l47845l65768m08163m13703m40820m63263m75845m77097
$$ plain form
12425 22022768 21543176 21059575 20584436 20108192 19645044 19201066 18754908 18332194 17913425
12416 17913425 17502696 17084581 16676274 16258616 15852253 15445632 15039620 14642921 14271504
12407 14271504 13902932 13526619 13181579 12848107 12529027 12229079 11934721 11653352 11372612
12398 11372612 11097846 10819874 10564704 10328607 10090481 9867938 9662164 9458673 9252377
12389 9252377 9038221 8828114 8627963 8439423 8259003 8094061 7920420 7752595 7599121
12380 7599121 7461990 7312357 7167155 7031167 6895887 6758578 6613530 6482859 6361107
12371 6361107 6248189 6141304 6031301 5926528 5819530 5698736 5586146 5487837 5391680 5297837
12361 5297837 5208017 5115378 5026830 4932965 4849370 4773025 4695360 4618055 4540323 4466132 4385337
$$ packed form
12425B2022768m79592m83601m75139m76244m63148m43978m46158m22714m18769
12416A7913425m10729m18115m08307m17658m06363m06621m06012l96699l71417
12407A4271504l68572l76313l45040l33472l19080k99948k94358k81369k80740
12398A1372612k74766k77972k55170k36097k38126k22543k05774k03491k06296
12389I252377k14156k10107k00151j88540j80420j64942j73641j67825j53474
12380G599121j37131j49633j45202j35988j35280j37309j45048j30671j21752
12371F361107j12918j06885j10003j04773j06998j20794j12590r8309r6157r3843
12361E297837q9820r2639q8548r3865q3595p6345p7665p7305p7732p4191q0795
$$ plain form
12350 4385337 4318270 4255012 4188412 4130629 4067800 3990638 3924036 3866739 3829980 3786891 3727671
12339 3727671 3670961 3615149 3568347 3516041 3456996 3414731 3366648 3314466 3275255 3221544 3171667
12328 3171667 3138480 3098426 3054475 3006603 2951519 2913296 2881204 2856615 2829554 2809378 2773108
12317 2773108 2726880 2683008 2646171 2617025 2591995 2566238 2540732 2511931 2476859 2455520 2446811
12306 2446811 2413578 2380433 2352194 2321251 2288001 2259965 2227824 2196585 2157462 2137905 2130003
12295 2130003 2110620 2071653 2043711 2003011 1973336 1946092 1933464 1919728 1905984 1892007 1879721
12284 1879721 1859119 1821704 1787356 1762851 1735388 1718351 1700890 1684533 1672215 1661247 1647513
12273 1647513 1638706 1627879 1610206 1574455 1544193 1526229 1500604 1487567 1467845 1457283 1440321
$$ packed form
12350D385337o7067o3258o6600n7783o2829p7162o6602n7297l6759m3089n9220
12339C727671n6710n5812m6802n2306n9045m2265m8083n2182l9211n3711m9877
12328C171667l3187m0054m3951m7872n5084l8223l2092k4589k7061k0176l6270
12317B773108m6228m3872l6837k9146k5030k5757k5506k8801l5072k1339q709
12306B446811l3233l3145k8239l0943l3250k8036l2141l1239l9123j9557p902
12295B130003j9383l8967k7942m0700k9675k7244j2628j3736j3744j3977j2286
12284A879721k0602l7415l4348k4505k7463j7037j7461j6357j2318j0968j3734
12273A647513q807j0827j7673l5751l0262j7964k5625j3037j9722j0562j6962
$$ plain form
12262 1440321 1411324 1386228 1379660 1365411 1350190 1347623 1332703 1304424 1286257 1273443 1257123 1241134
12250 1241134 1224604 1202069 1190169 1172815 1155093 1154116 1144129 1122765 1111008 1110970 1112629 1115852 1115222
12237 1115222 1107135 1079025 1074445 1078452 1065114 1040971 1029808 1025896 1002490 979645 977559 971362
12225 971362 951016 933269 925986 916406 896580 879422 880333 889947 897112 875146 853115 856196 862535
12212 862535 843089 820638 807744 792843 784913 781183 781295 785766 792930 784725 782979 766771 751151
12199 751151 753805 773852 780007 777092 771204 751279 742407 750657 755493 754070 765662 789096 815512
12186 815512 839042 858898 887963 940003 991281 1018409 1040632 1074401 1105733 1116097 1113618 1132847
12174 1132847 1135990 1125275 1112665 1093489 1073550 1046986 1020638 997548 985730 967274 948922
$$ packed form
12262A440321k8997k5096o568j4249j5221k567j4920k8279j8167j2814j6320j5989
12250A241134j6530k2535j1900j7354j7722r77r987k1364j1757l8J659L223o30
12237A115222q087k8110m580M007j3338k4143j1163l912k3406k2845k086o197
12225I71362k0346j7747p283r580j9826j7158R11R614P165k1966k2031L081O339
12212H62535j9446k2451j2894j4901p930l730J12M471P164q205j746j6208j5620
12199G51151K654K0047O155k915n888j9925q872Q250M836j423J1592K3434K6416
12186H15512K3530J9856K9065N2040N1278K7128K2223L3769L1332J0364k479J9229
12174A132847L143j0715j2610j9176j9939k6564k6348k3090j1818j8456j8352
$$ plain form
12163 948922 941767 935320 936679 931844 939557 954172 958587 966741 972607 991201 1003006 1021435 1047737
12150 1047737 1071995 1094422 1121526 1137622 1150588 1163153 1177107 1188506 1181579 1169390 1166238 1170289
12138 1170289 1152263 1132327 1125444 1124690 1117801 1119397 1125756 1122786 1114296 1106743 1101731 1104107 1103608 1113852
12124 1113852 1107345 1098917 1117623 1116557 1111984 1128204 1151124 1157758 1180119 1211268 1248191 1278300
12112 1278300 1314410 1367751 1399490 1418606 1424374 1430016 1425071 1420925 1410268 1400246 1389881 1389012
12100 1389012 1391978 1397746 1399871 1414158 1427440 1454960 1471628 1499946 1547421 1599261 1643608 1691441
12088 1691441 1734421 1802195 1872872 1925524 1976890 2040072 2112758 2202462 2322953 2457221 2624714
12077 2624714 2816868 3048721 3311061 3613147 3934050 4297195 4736615 5241096 5829504
$$ packed form
12163I48922p155o447J359m835P713J4615M415Q154N866J8594J1805J8429K6302
12150A047737K4258K2427K7104J6096J2966J2565J3954J1399o927j2189l152M051
12138A170289j8026j9936o883p54o889J596O359k970q490p553n012K376m99J0244
12124A113852o507q428J8706j066m573J6220K2920O634K2361L1149L6923L0109
12112A278300L6110N3341L1739J9116N768N642m945m146j0657j0022j0365q69
12100A389012K966N768K125J4287J3282K7520J6668K8318M7475N1840M4347M7833
12088A691441M2980O7774P0677N2652N1366O3182P2686Q9704J20491J34268J67493
12077B624714J92154K31853K62340L02086L20903L63145M39420N04481N88408
$$ plain form
12068 5829504 6536994 7407848 8508366 9917260 11762925 14233023 17545054 21886435
12060 21886435 27305756 33676003 40748233 47949542 54382229 59283516 62223365 62789734
12052 62789734 60646855 56320263 50908614 45190504 39666018 34827526 31065759 28508583
12044 28508583 27022085 26388932 26418754 26957355 27801393 28778717 29744116 30604172 31271785
12035 31271785 31827520 32498666 33595831 35265223 37378027 39787145 42465912 45524003
12027 45524003 49006595 53006957 57499447 62273204 67016801 71359732 74980816 77538827
12019 77538827 78641902 77980004 75647169 72284177 68635274 65173665 62027264 59153123
12011 59153123 56455030 53878635 51466731 49247745 47092806 44890152 42730300 40825249
$$ packed form
12068E829504P07490Q70854J100518J408894J845665K470098L312031M341381
12060B1886435N419321O370247P072230P201309O432687M901287K939849N66369
12052F2789734k142879m326592n411649n718110n524486m838492l761767k557176
12044B8508583j486498o33153K9822N38601Q44038R77324R65399Q60056O67613
12035C1271785N55735O71146J097165J669392K112804K409118K678767L058091
12027D5524003L482592M000362M492490M773757M743597M342931L621084K558011
12019G7538827J103075o61898k332835l362992l648903l461609l146401k874141
12011E9153123k698093k576395k411904k218986k154939k202654k159852j905051
$$ plain form
12003 40825249 39342764 38206883 37204507 36169592 35079076 33977687 33070555 32591951
11995 32591951 32673210 33370795 34782509 37090742 40540938 45258593 51113390 57744017
11987 57744017 64456089 70236663 74264163 76108585 75372414 71907498 66353695 59792601
11979 59792601 52946284 46253818 40220746 35226391 31292367 28235298 25842450 23924122
11971 23924122 22323052 20970282 19817883 18820859 17926082 17129729 16406245 15733316 15108388
11962 15108388 14529908 13983830 13491484 13036178 12602766 12203435 11831496 11486097 11159536
11953 11159536 10836855 10532682 10244923 9968094 9702450 9444426 9198097 8956661 8728323
11944 8728323 8520308 8320171 8118115 7933022 7748233 7570651 7412159 7272824 7134629
$$ packed form
12003D0825249j482485j135881j002376j034915j090516j101389r07132m78604
11995C2591951Q1259O97585J411714K308233L450196M717655N854797O630627
11987E7744017O712072N780574M027500J844422p36171l464916n553803o561094
11979E9792601o846317o692466o033072m994355l934024l057069k392848j918328
11971B3924122j601070j352770j152399r97024q94777p96353p23484o72929o24928
11962A5108388n78480n46078m92346m55306m33412l99331l71939l45399l26561
11953A1159536l22681l04173k87759k76829k65644k58024k46329k41436k28338
11944H728323k08015k00137k02056j85093j84789j77582j58492j39335j38195
$$ plain form
11935 7134629 6988687 6848630 6734787 6627260 6521923 6421799 6321002 6214057 6095086
11926 6095086 5977650 5860332 5736910 5605505 5479395 5342850 5212492 5106560 4994394
11917 4994394 4902383 4819329 4743937 4664391 4588879 4502435 4412997 4335711 4273680 4209859 4136671
11906 4136671 4068602 4006936 3940223 3895910 3856676 3816613 3776587 3728977 3681535 3647233 3616309
11895 3616309 3580289 3545769 3509611 3471879 3419853 3361832 3309812 3257022 3198686 3139104 3077796
11884 3077796 3029549 2989660 2932652 2880421 2834900 2784595 2739187 2696826 2667037 2632153 2593102
11873 2593102 2563858 2552425 2554700 2566752 2565941 2554163 2537496 2507051 2477079 2446852 2412297 2393379
11861 2393379 2381914 2375922 2370089 2354212 2307430 2263459 2222880 2187883 2145275 2085261 2020152 1957379
$$ packed form
11935G134629j45942j40057j13843j07527j05337j00124j00797j06945j18971
11926F095086j17436j17318j23422j31405j26110j36545j30358j05932j12166
11917D994394r2011q3054p5392p9546p5512q6444q9438p7286o2031o3821p3188
11906D136671o8069o1666o6713m4313l9234m0063m0026m7610m7442l4302l0924
11895C616309l6020l4520l6158l7732n2026n8021n2020n2790n8336n9582o1308
11884C077796m8247l9889n7008n2231m5521n0305m5408m2361k9789l4884l9051
11873B593102k9244j1433K275J2052q11j1778j6667l0445k9972l0227l4555j8918
11861B393379j1465n992n833j5877m6782m3971m0579l4997m2608o0014o5109o2773
$$ plain form
11849 1957379 1908602 1871273 1831640 1772181 1732073 1702742 1669139 1644313 1614663 1581177 1553212
11838 1553212 1533433 1510825 1479807 1454148 1438604 1410007 1381649 1356680 1330516 1313272 1283712
11827 1283712 1259720 1255474 1246868 1224093 1214317 1211102 1192956 1166084 1151366 1133724 1112985 1100251
11815 1100251 1075796 1061389 1038681 1028051 1016697 1004120 991865 994800 979413 959660 936530
11804 936530 913872 902046 895568 883085 868211 854087 833899 825652 809834 794131 786148 767194
11792 767194 732666 716334 715616 706055 705465 706165 701786 694078 671889 658444 659049 652436 640344 615125
11778 615125 612681 618672 616777 613682 604734 590584 597750 600932 585948 572610 565290 554032 545189
11765 545189 536344 529328 521773 510383 505566 505187 479122 465668 468138 464641 442694 438405 443805
$$ packed form
11849A957379m8777l7329l9633n9459m0108k9331l3603k4826k9650l3486k7965
11838A553212j9779k2608l1018k5659j5544k8597k8358k4969k6164j7244k9560
11827A283712k3992m246q606k2775r776l215j8146k6872j4718j7642k0739j2734
11815A100251k4455j4407k2708j0630j1354j2577j2255K935j5387j9753k3130
11804I36530k2658j1826o478j2483j4874j4124k0188q247j5818j5703p983j8954
11792G67194l4528j6332p18r561n90P00m379p708k2189j3445O05o613j2092k5219
11778F15125k444N991j895l095q948j4150P166L182j4984j3338p320j1258q843
11765E45189q845p016p555j1390m817l79k6065j3454K470l497k1947m289N400
$$ plain form
11752 443805 441346 440369 437643 421054 413150 397952 379438 372112 368505 365331 369703 375244 381409 375608
11738 375608 373105 368910 364609 351430 333464 328386 331333 332100 338752 349652 337979 332757 332518 324136
11724 324136 314103 318149 323117 310721 297475 276300 277758 267931 270221 277053 267190 259379 261319
11711 261319 265871 261669 255206 265074 256419 251949 253426 240226 236315 235228 249442 252717 258068 265009
11697 265009 253159 248115 265119 267184 253032 233661 242082 228150 218628 216172 208915 212234 212403
11684 212403 209261 215900 199126 179743 185805 191097 200192 196126 194589 190902 180609 187234 184311
11671 184311 181917 175218 176824 181008 176009 154744 144804 138483 160624 163304 153837 142190 159476
11658 159476 167128 174204 184261 181696 168370 162439 138179 137793 130469 137207 145591 157654 166462
$$ packed form
11752D43805k459r77k726j6589p904j5198j8514p326l607l174M372N541O165n801
11738C75608k503m195m301j3179j7966n078K947P67O652J0900j1673n222k39q382
11724C24136j0033M046M968j2396j3246k1175J458r827K290O832r863p811J940
11711B61319M552m202o463R868q655m470J477j3200l911j087J4214L275N351O941
11697B65009j1850n044J7004K065j4152j9371Q421j3932r522k456p257L319J69
11684B12403l142O639j6774j9383O062N292R095m066j537l687j0293O625k923
11671A84311k394o699J606M184m999k1265r940o321K2141K680r467j1647J7286
11658A59476P652P076J0057k565j3326n931k4260l86p324O738Q384J2063Q808
$$ plain form
11645 166462 163822 150370 145232 164408 178752 162344 147107 149316 150285 147299 145300 149124 149304
11632 149304 160199 169887 185889 195085 202972 213870 223558 233468 260172 296678 333585 365426
11620 365426 406921 434225 439394 444255 428907 388998 346866 322735 294130 272417 261012 250159
11608 250159 244472 251675 249313 254011 247394 264723 273784 271284 252191 254002 258004 276486 287826
11595 287826 304970 321019 336448 357776 387371 406730 439490 464862 491721 500363 517601 528971
11583 528971 519929 510068 503213 496386 474922 440591 408533 392663 385644 382864 382400 374619 350716
11570 350716 321244 304456 307111 307083 303099 298142 295719 287171 289123 291786 302510 321146 331593
11557 331593 348531 375454 410597 464873 523571 576428 630029 676807 723033 741186 752476
$$ packed form
11645A66462k640j3452n138J9176J4344j6408j5237K209R69k986j999L824J80
11632A49304J0895R688J6002R196P887J0898R688R910K6704L6506L6907L1841
11620C65426M1495K7304N169M861j5348l9909m2132k4131k8605k1713j1405j0853
11608B50159n687P203k362M698o617J7329R061k500j9093J811M002J8482J1340
11595B87826J7144J6049J5429K1328K9595J9359L2760K5372K6859Q642J7238J1370
11583E28971r042r861o855o827k1464l4331l2058j5870p019k780m64p781k3903
11570C50716k9472j6788K655k8l984m957k423q548J952K663J0724J8636J0447
11557C31593J6938K6923L5143N4276N8698N2857N3601M6778M6226J8153J1290
$$ plain form
11546 752476 724094 686830 652192 599587 544255 501973 465970 423816 390300 366471 351661
11535 351661 331937 310196 292772 294202 288591 271592 252967 255121 254169 246412 237530 228699 232297
11522 232297 238848 242523 250944 267881 281638 290527 309780 334281 363625 398684 432753 471593
11510 471593 507555 549241 581294 601374 624174 636647 648009 628070 604979 578401 543512
11499 543512 496886 472741 444960 410971 372748 343854 320027 299716 284751 263807 242676
11488 242676 230077 213776 214346 213286 207812 221448 217971 206886 209656 218587 218798 215893 217393 219653
11474 219653 234301 254646 276313 301083 326538 332546 360684 395092 410487 408919 417342 416479
11462 416479 402070 383278 379303 370664 331595 299565 282939 250018 240395 233585 225255 214669
$$ packed form
11546G52476k8382l7264l4638n2605n5332m2282l6003m2154l3516k3829j4810
11535C51661j9724k1741j7424J430n611j6999j8625K154r52p757q882q831L598
11522B32297O551L675Q421J6937J3757Q889J9253K4501K9344L5059L4069L8840
11510D71593L5962M1686L2053K0080K2800J2473J1362j9939k3091k6578l4889
11499E43512m6626k4145k7781l3989l8223k8894k3827k0311j4965k0944k1131
11488B42676j2599j6301N70j060n474J3636l477j1085K770Q931K11k905J500K260
11474B19653J4648K0345K1667K4770K5455O008K8138L4408J5395j568Q423q63
11462D16479j4409j8792l975q639l9069l2030j6626l2921r623o810q330j0586
$$ plain form
11450 214669 210230 203142 194058 188483 171606 171904 171477 167774 163599 150244 130202 112137 116328 118906
11436 118906 127074 129031 114221 113975 101144 118048 137201 131975 128595 124720 128333 130341 125519
11423 125519 120288 125201 114480 112256 112414 113944 112685 114164 116885 103061 96096 102065 105737 110097
11409 110097 108495 124976 138414 135485 125417 125226 122156 126084 126403 119225 121263 128750 131069 110850
11395 110850 106344 111724 131735 119704 108510 98334 96149 105090 124303 128678 114552 115523 121851
11382 121851 113107 116207 121908 124736 115628 108201 107381 108716 95405 88167 91516 88800 84373 103451
11368 103451 113295 116026 117269 126482 117818 114280 122340 129629 125826 122386 132489 134909 148606 157606
11354 157606 154118 158254 163957 157036 153773 148844 135058 128471 131069 143662 139682 115063 109159
$$ packed form
11450B14669m439p088r084n575j6877K98m27l703m175j3355k0042j8065M191K578
11436A18906Q168J957j4810k46j2831J6904J9153n226l380l875L613K008m822
11423A25519n231M913j0721k224J58J530j259J479K721j3824o965N969L672M360
11409A10097j602J6481J3438k929j0068j91l070L928L19p178K038P487K319k0219
11395A10850m506N380K0011j2031j1194j0176k185Q941J9213M375j4126R71O328
11382A21851q744L100N701K828r108p427q20J335j3311p238L349k716m427J9078
11368A03451R844K731J243R213q664l538Q060P289l803l440J0103K420J3697R000
11354A57606l488M136N703o921l263m929j3786o587K598J2593l980k4619n904
$$ plain form
11341 109159 113324 101755 100857 106874 95710 100808 116805 121018 116304 105003 96377 92675 92561 89247
11327 89247 94491 106061 101396 110474 111885 108137 109895 116239 131040 139278 124784 119811 117676 116273
11313 116273 123056 130145 136237 142310 139736 128994 131214 134102 130674 132813 137267 138039 129186 126624
11299 126624 124181 117599 121893 122849 119087 126822 126564 115963 114512 115484 115486 122495 130953 128892 142996
11284 142996 144977 137285 145405 158833 168629 191728 204034 221455 240406 266483 301805 333175
11272 333175 357073 370016 379789 394528 403888 422443 438361 436629 423831 417200 410608 402577 383804
11259 383804 356721 332817 313862 322514 327847 328133 332025 326603 328565 321810 325556 332561 339184 346343
11245 346343 352694 358240 363736 362640 391060 431975 459025 487024 528049 565696 613228 655605
$$ packed form
11341A09159M165j1569q98O017j1164N098J5997M213m714j1301q626l702j14l314
11327H9247N244J1570m665R078J411l748J758O344J4801Q238j4494m973k135j403
11313A16273O783P089O092O073k574j0742K220K888l428K139M454P72q853k562
11299A26624k443o582M294R56l762P735k58j0601j451R72KP009Q458k061J4104
11284A42996J981p692Q120J3428R796K3099J2306J7421J8951K6077L5322L1370
11272C33175K3898J2943R773J4739R360J8555J5918j732j2798o631o592q031j8773
11259C83804k7083k3904j8955Q652N333K86L892n422J962o755L746P005O623P159
11245C46343O351N546N496j096K8420M0915K7050K7999M1025L7647M7532M2377
$$ plain form
11233 655605 688372 717013 757051 785360 800635 821797 838471 849600 848664 850425 843700 827051
11221 827051 807927 785075 767168 747641 738376 731182 725875 724800 712571 704077 704095 710051 697156
11208 697156 686051 703718 703601 684687 690381 692468 697279 703903 713506 715984 738529 758502 787872
11195 787872 820623 847689 884613 910616 931379 964868 1005644 1036378 1082226 1125438 1164562
11184 1164562 1234383 1307535 1360388 1391602 1438826 1495086 1538009 1581214 1608294 1629491 1661677
11173 1661677 1689044 1711739 1754623 1817869 1900613 2012877 2157354 2344523 2559911 2817175
11163 2817175 3120904 3486695 3914603 4425761 5089434 5948754 7078101 8564115 10506119
11154 10506119 12968942 15964319 19461093 23394171 27640317 32048793 36378834 40406314
$$ packed form
11233F55605L2767K8641M0038K8309J5275K1162J6674J1129r36J761o725j6649
11221H27051j9124k2852j7907j9527r265p194n307j075j2229q494J8N956j2895
11208F97156j1105J7667j17j8914N694K087M811O624R603K478K2545J9973K9370
11195G87872L2751K7066L6924K6003K0763L3489M0776L0734M5848M3212L9124
11184A164562O9821P3152N2853L1214M7224N6260M2923M3205K7080K1197L2186
11173A661677K7367K2695M2884O3246Q2744J12264J44477J87169K15388K57264
11163B817175L03729L65791M27908N11158O63673Q59320J129347J486014J942004
11154A0506119K462823K995377L496774L933078M246146M408476M330041M027480
$$ plain form
11146 40406314 43916009 46732320 48702488 49685495 49630862 48579866 46641416 43960441
11138 43960441 40730022 37170949 33488620 29882750 26556961 23600110 21095314 19086218
11130 19086218 17543160 16418677 15656821 15181625 14937762 14880764 14997006 15265252 15665511
11121 15665511 16239961 17029331 18088935 19536839 21504503 24125609 27507949 31755714
11113 31755714 36877416 42837949 49553909 56840863 64450605 72072171 79326771 85815296
11105 85815296 91194409 95189080 97609565 98300904 97245932 94559675 90436915 85161579
11097 85161579 79046655 72431078 65689442 59123988 52977768 47435856 42581814 38429149
11089 38429149 34992562 32192068 29928829 28127911 26684151 25503827 24550099 23757238
$$ packed form
11146D0406314L509695K816311J970168R83007n4633j050996j938450k680975
11138D3960441l230419l559073l682329l605870l325789k956851k504796k009096
11130A9086218j543058j124483p61856m75196k43863n6998J16242K68246M00259
11121A5665511N74450P89370J059604J447904J967664K621106L382340M247765
11113C1755714N121702N960533O715960P286954P609742P621566P254600O488525
11105H5815296N379113L994671K420485O91339j054972k686257m122760n275336
11097H5161579o114924o615577o741636o565454o146220n541912m854042m152665
11089C8429149l436587k800494k263239j800918j443760j180324r53728p92861
$$ plain form
11081 23757238 23103956 22596654 22270367 22146854 22295366 22779855 23666603 25061565 27051999
11072 27051999 29683412 32952989 36793885 41076497 45599476 50109446 54365282 58102610
11064 58102610 61104682 63179137 64181574 64022937 62705539 60328757 57071000 53137128
11056 53137128 48762067 44168263 39586298 35257690 31376574 28019380 25187534 22846293
11048 22846293 20967723 19457706 18225018 17203296 16334778 15576583 14879509 14242799 13667155
11039 13667155 13134267 12644263 12174302 11741524 11342024 10969288 10619238 10290106 9999541
11030 9999541 9728454 9477357 9252065 9025081 8801508 8589673 8405991 8236157 8051242
11021 8051242 7869739 7702619 7532146 7360525 7210442 7062754 6889438 6729355 6587343
$$ packed form
11081B3757238o53282n07302l26287j23513J48512M84489Q86748J394962J990434
11072B7051999K631413L269577L840896M282612M522979M509970M255836L737328
11064E8102610L002072K074455J002437j58637j317398k376782l257757l933872
11056E3137128m375061m593804m581965m328608l881116l357194k831846k341241
11048B2846293j878570j510017j232688j021722q68518p58195o97074o36710n75644
11039A3667155n32888m90004m69961m32778l99500l72736l50050l29132k90565
11030I999541k71087k51097k25292k26984k23573k11835j83682j69834j84915
11021H051242j81503j67120j70473j71621j50083j47688j73316j60083j42012
$$ plain form
11012 6587343 6451583 6292732 6143175 5999070 5874298 5752629 5621322 5501397 5379297
11003 5379297 5253663 5124553 5006795 4904175 4814136 4721206 4623801 4536356 4444029 4357958
10993 4357958 4280776 4207006 4146042 4093435 4029672 3967718 3919828 3881923 3850440 3823234 3803466
10982 3803466 3777103 3755208 3737938 3703297 3675153 3660273 3630368 3587522 3528867 3466668 3404805
10971 3404805 3358765 3302781 3229459 3159993 3090066 3010857 2944233 2875713 2797241 2726654 2671768
10960 2671768 2616394 2560313 2509447 2470547 2430851 2376203 2334875 2294653 2246908 2204991 2175490
10949 2175490 2142755 2106099 2087087 2067700 2058842 2058192 2051124 2036747 2035865 2035113 2029781 2023024 2010566
10936 2010566 1993065 1986597 1966209 1948852 1930087 1894867 1854577 1820362 1793019 1748924 1701117
$$ packed form
11012F587343j35760j58851j49557j44105j24772j21669j31307j19925j22100
11003E379297j25634j29110j17758j02620r0039r2930r7405q7445r2327q6071
10993D357958p7182p3770o0964n2607o3763o1954m7890l7905l1483k7206j9768
10982C803466k6363k1895j7270l4641k8144j4880k9905m2846n8655o2199o1863
10971C404805m6040n5984p3322o9466o9927p9209o6624o8520p8472p0587n4886
10960B671768n5374n6081n0866l8900l9696n4648m1328m0222m7745m1917k9501
10949B175490l2735l6656j9012j9387q858o50p068j4377q82p52n332o757j2458
10936B010566j7501o468k0388j7357j8765l5220m0290l4215k7343m4095m7807
$$ plain form
10925 1701117 1655136 1614826 1585591 1551957 1521604 1499461 1484125 1447056 1420812 1379621 1341551
10914 1341551 1327090 1309124 1289608 1280848 1272609 1243997 1206089 1180145 1162581 1145265 1124454 1111514
10902 1111514 1100675 1080710 1062508 1038835 1018101 999304 990127 977492 967914 958851 939055 919753
10890 919753 912262 911110 901067 884314 866007 847350 831009 817037 811598 805423 785003 760591
10878 760591 750511 744538 739362 728209 716067 713565 699149 672962 648626 649562 643765 626124 618943
10865 618943 615910 609551 600169 588988 586532 581050 576094 562781 548194 537021 539110 539070 537511 538852
10851 538852 537956 514529 499693 497776 490587 481633 473164 455214 441691 437581 436936 433008 430843 422920
10837 422920 423582 414427 395802 379469 377542 371459 368475 360694 354513 359441 354955 361616 369560 372531
$$ packed form
10925A701117m5981m0310k9235l3634l0353k2143j5336l7069k6244m1191l8070
10914A341551j4461j7966j9516q760q239k8612l7908k5944j7564j7316k0811j2940
10902A111514j0839j9965j8202k3673k0734j8797r177j2635r578r063j9796j9302
10890I19753p491j152j0043j6753j8307j8657j6341j3972n439o175k0420k4412
10878G60591j0080n973n176j1153j2142k502j4416k6187k4336R36n797j7641p181
10865F18943l033o359r382j1181k456n482m956j3313j4587j1173K089m0j559J341
10851E38852q96k3427j4836j917p189q954q469j7950j3523m110o45l928k165p923
10837D22920O62r155j8625j6333j927o083k984p781o181M928m486O661P944K971
$$ plain form
10823 372531 361370 333668 332484 341084 341835 338424 330238 315667 300383 298798 289757 287902 294452
10810 294452 297759 288535 280254 285682 268885 260769 257930 265185 257580 260404 262307 246954 235820
10797 235820 232994 232512 220675 214716 221619 218112 208180 205531 207237 203779 202767 197526 193153 190139
10783 190139 188902 197744 198381 215189 217301 211986 208218 208522 201911 192944 196918 209454 213038 206546
10769 206546 208746 195592 185514 182831 187238 187147 187161 176744 173059 177954 167286 153268 158771 155552
10755 155552 146448 146741 153104 162974 161901 169949 180977 190636 197894 199797 204452 221442 245723 269786
10741 269786 275636 297175 331326 349919 354644 350958 360449 369267 378013 363294 333925 313434 296822
10728 296822 274272 259085 267833 250946 222061 212655 202551 199591 206568 204641 194676 174015 169619
$$ packed form
10823C72531j1161k7702j184Q600P51l411q186j4571j5284j585r041j855O550
10810B94452L307r224q281N428j6797q116k839P255p605K824J903j5353j1134
10797B35820k826m82j1837n959O903l507r932k649J706l458j012n241m373l014
10783A90139j237Q842O37J6808K112n315l768L04o611q967L974J2536L584o492
10769B06546K200j3154j0078k683M407r1J4j0417l685M895j0668j4018N503l219
10755A55552r104K93O363R870j073Q048J1028R659P258J903M655J6990K4281K4063
10741B69786N850K1539L4151J8593M725l686R491Q818Q746j4719k9369k0491j6612
10728B96822k2550j5187Q748j6887k8885r406j0104k960O977j927r965k0661m396
$$ plain form
10715 169619 176177 182450 172444 184218 193297 207349 222113 231776 253924 271663 303562 337189
10703 337189 374677 415379 452083 485312 522965 564269 591550 602837 619929 624377 612119 594292
10691 594292 572032 542053 503215 466822 437107 411197 371546 337569 322111 295446 278114
10680 278114 273154 265700 268896 268338 267135 240953 206505 198661 194456 202070 204352 203598 206778 221104
10666 221104 232539 235347 242252 254057 265486 292935 333795 367708 393003 392184 397865 409908
10654 409908 420733 418460 414157 398486 373879 344625 332024 324625 296442 257290 242526 229115
10642 229115 207955 201027 187191 168119 164137 162422 153231 161151 162306 153629 161874 158165 143810
10629 143810 123908 138513 146026 132555 118451 108220 104277 115857 137731 146401 137775 131031
$$ packed form
10715A69619O558O273j0006J1774R079J4052J4764R663K2148J7739L1899L3627
10703C37189L7488M0702L6704L3229L7653M1304K7281J1287J7092M448j2258j7827
10691E94292k2260k9979l8838l6393k9715k5910l9651l3977j5458k6665j7332
10680B78114m960p454L196n58j203k6182l4448p844m205P614K282p54L180J4326
10666B21104J1435K808O905J1805J1429K7449M0860L3913K5295q19N681J2043
10654D09908J0825k273m303j5671k4607k9254j2601p399k8183l9152j4764j3411
10642B29115k1160o928j3836j9072l982j715r191P920J155q677Q245l709j4355
10629A43810j9902J4605P513j3471j4104j0231l943J1580K1874Q670q626o744
$$ plain form
10617 131031 124424 118970 122729 143222 155783 149911 136619 123668 136436 134812 127506 136700 136048
10604 136048 139092 130201 111159 106598 91954 80956 71122 74213 81014 91348 80463 75538 80506
10591 80506 101108 114924 104056 100013 96229 95535 95758 88227 79528 76021 82229 83523 73683 71542
10577 71542 84830 96490 94416 74921 71560 69723 53577 62280 80255 78617 73098 69204 66579
10564 66579 76424 79606 79832 78783 78406 80290 75463 60023 53860 58602 64368 66218 68359 74292 69802
10549 69802 57193 56587 50147 62069 71848 63111 59553 51663 53376 60122 66840 64975 70509 81378
10535 81378 77188 66201 59297 61090 72446 72501 53400 60130 79586 77560 69885 65712 63112 73904
10521 73904 75201 57127 53352 75842 90980 93226 76606 71984 74746 76528 79880 81054 90292
$$ packed form
10617A31031o607n454L759K0493J2561n872j3292j2951J2768j624p306R194o52
10604A36048L044q891j9042m561j4644j0998r834L091O801J0334j0885m925M968
10591H0506K0602J3816j0868m043l784o94K23p531q699l507O208J294r840k141
10577G1542J3288J1660k074j9495l361j837j6146Q703J7975j638n519l894k625
10564F6579R845L182K26j049l77J884m827j5440o163M742N766J850K141N933m490
10549F9802j2609o06o440J1922R779q737l558p890J713O746O718j865N534J0869
10535H1378m190j0987o904J793J1356N5j9101O730J9456k026p675m173k600J0792
10521G3904J297j8074l775K2490J5138K246j6620m622K762J782L352J174R238
$$ plain form
10508 90292 95765 91882 82103 77059 80036 75860 76829 75739 74534 83541 83680 72240 76589 84911 89416
10493 89416 83201 82333 82505 74769 70288 68243 68063 78498 93083 95932 89878 84322 86976 89866 87316
10478 87316 88279 94769 90347 73928 76937 83773 77015 76606 68964 65557 72379 79638 64338 62108
10464 62108 76514 77931 70136 78587 93312 106834 107020 95290 85970 69207 70596 73875 81247
10451 81247 87076 82101 83209 84902 78882 71241 61028 63171 61955 70342 72883 74664 76584 84399
10437 84399 81543 74692 86044 86979 94483 110440 115038 96673 83336 74340 77193 77609 77535 81189
10423 81189 80067 85526 91332 98912 91570 80480 84888 89075 95214 92053 105814 115858 120775 116872
10409 116872 108728 112277 127775 115737 92176 78547 75138 71753 81936 89482 91192 84800 96501
$$ packed form
10508I0292N473l883r779n044K977m176R69j090j205R007J39j1440M349Q322M505
10493H9416o215q68J72p736m481k045j80J0435J4585K849o054n556K654K890k550
10478H7316R63O490m422j6419L009O836o758m09p642l407O822P259j5300k230
10464F2108J4406J417p795Q451J4725J3522J86j1730r320j6763J389L279P372
10451H1247N829m975J108J693o020p641j0213K143j216Q387K541J781J920P815
10437H4399k856o851J1352R35P504J5957M598j8365j3337q996K853M16p4L654
10423H1189j122N459N806P580p342j1090M408M187O139l161J3761J0044M917l903
10409A16872q144L549J5498j2038k3561j3629l409l385J0183P546J710o392J1701
$$ plain form
10396 96501 97844 91196 101350 105618 113071 126095 136526 133234 124422 120393 127667 146863 164806
10383 164806 174540 213489 240997 258734 269970 290193 333828 412345 533796 684439 865965
10372 865965 1096579 1359684 1627305 1863644 2061165 2198202 2257954 2237588 2133829 1953746
10362 1953746 1730411 1501221 1286128 1067683 876330 729211 627287 560136 523604 498138
10352 498138 455661 406875 378289 363764 343329 322687 312770 312130 297680 292206 288428 286492 273804
10339 273804 262883 250042 236185 236910 237199 246236 240968 241894 241174 237336 236785 235954 233565 212276 196513
10324 196513 192317 196973 193353 185597 163733 162290 181643 195346 192301 190563 192801 183671 169084
10311 169084 164245 164567 159324 152421 156975 154880 142294 126579 129427 141116 142951 147509 141017 140461
$$ packed form
10396I6501J343o648J0154M268P453J3024J0431l292q812m029P274J9196J7943
10383A64806R734L8949K7508J7737J1236K0223M3635P8517J21451J50643J81526
10372H65965K30614K63105K67621K36339J97521J37037N9752k0366j03759j80083
10362A953746k23335k29190k15093k18445j91353j47119j01924o7151l6532k5466
10352D98138m2477m8786k8586j4525k0435k0642r917o40j4450n474l778j936j2688
10339B73804j0921j2841j3857P25K89R037n268R26p20l838n51q31k389k1289j5763
10324A96513m196M656l620p756k1864j443J9353J3703l045j738K238r130j4587
10311A69084m839L22n243o903M554k095j2586j5715K848J1689J835M558o492n56
$$ plain form
10297 140461 149757 160589 166331 164071 165833 159001 145341 141183 141380 138849 134551 137472 150542 151744
10283 151744 155576 166527 164442 160570 154762 155608 177388 190309 190171 162232 137808 132954 140648
10270 140648 142820 135830 133719 130468 139621 150292 154169 145776 144290 148646 140115 140121 147903 157184 160371
10255 160371 161289 150401 150953 168318 181067 182216 194462 207369 208624 216386 239613 263455 274404
10242 274404 285948 296531 302238 300474 294667 284271 262590 252047 264152 262724 268042 265730 267133
10229 267133 293017 319288 337868 378357 423460 444208 457180 466950 466640 463892 461861 451774
10217 451774 431093 405263 377548 344296 330448 318499 302128 293903 302772 325460 350384 370738
10205 370738 386031 400584 415140 427471 436657 451144 462791 460624 438335 409062 383165 355750
$$ packed form
10297A40461R296J0832N742k260J762o832j3660m158J97k531m298K921J3070J202
10283A51744L832J0951k085l872n808Q46K1780J2921j38k7939k4424m854P694
10270A40648K172o990k111l251R153J0671L877q393j486M356q531OP782R281L187
10255A60371R18j0888N52J7365J2749J149J2246J2907J255P762K3227K3842J0949
10242B74404J1544J0583N707j764n807j0396k1681j0543J2105j428N318k312J403
10229B67133K5884K6271J8580M0489M5103K0748J2972R770l10k748k031j0087
10217D51774k0681k5830k7715l3252j3848j1949j6371q225Q869K2688K4924K0354
10205C70738J5293J4553J4556J2331R186J4487J1647k167k2289k9273k5897k7415
$$ plain form
10193 355750 351795 346570 342412 336637 334404 343943 336659 328968 317402 304588 297680 289218 283377 292136
10179 292136 311553 320765 331143 351282 375070 405013 425920 442493 477714 503592 505538 513587
10167 513587 530556 526904 515467 508612 498680 488102 483606 461775 417861 396275 381348 354537
10155 354537 334605 323484 320515 320631 305416 305067 307367 321758 331915 339851 345585 337359 324117
10142 324117 304469 289638 290068 301663 300285 319855 347378 368626 402522 447055 464727 467946
10130 467946 460277 460917 468135 476463 474673 463548 480325 484930 487917 506297 549942 623476 707564
10117 707564 786485 831239 836464 733198 609658 529402 497671 510950 540632 575014 638363
10106 638363 710407 813733 966292 1158444 1392514 1642129 1876563 2085710 2269958 2448277
$$ packed form
10193C55750l955n225m158n775k233R539p284p691j1566j2814o908q462n841Q759
10179B92136J9417R212J0378K0139K3788K9943K0907J6573L5221K5878J946Q049
10167E13587J6969l652j1437o855r932j0578m496k1831m3914k1586j4927k6811
10155C54537j9932j1121k969J16j5215l49K300J4391J0157P936N734q226j3242
10142C24117j9648j4831M30J1595j378J9570K7523K1248L3896M4533J7672L219
10130D67946p669O40P218Q328j790j1125J6777M605K987J8380M3645P3534Q4088
10117G07564P8921M4754N225j03266j23540q0256l1731J3279K9682L4382O3349
10106F38363P2044J03326J52559J92152K34070K49615K34434K09147J84248J78319
$$ plain form
10096 2448277 2558207 2595005 2581450 2505938 2414888 2308463 2188409 2053473 1921102 1825313
10086 1825313 1752437 1711460 1672958 1622092 1573777 1541825 1522615 1499376 1467945 1438017 1419955
10075 1419955 1392524 1372954 1362080 1352531 1343889 1329506 1325897 1310631 1290143 1283043 1277502 1279061
10063 1279061 1275251 1264647 1258203 1243231 1229177 1222670 1188445 1154708 1155971 1146070 1130434 1118885
10051 1118885 1128507 1133953 1134001 1142690 1157273 1174105 1181157 1182831 1189565 1213120 1242440 1244491 1248039
10038 1248039 1260589 1277648 1292561 1302073 1303768 1307284 1307228 1314318 1331845 1352125 1382050 1411364 1439130
10025 1439130 1481095 1529899 1567366 1606243 1654407 1707423 1778538 1840129 1894014 1949107 2012000
10014 2012000 2089207 2151731 2222811 2300587 2398676 2493754 2601652 2728468 2879629 3029757
$$ packed form
10096B448277J09930L6798j3555p5512r1050j06425j20054j34936j32371r5789
10086A825313p2876m0977l8502n0866m8315l1952j9210k3239l1431k9928j8062
10075A419955k7431j9570j0874r549q642j4383l609j5266k0488p100n541J559
10063A279061l810j0604o444j4972j4054o507l4225l3737J263r901j5636j1549
10051A118885R622N446M8Q689J4583J6832P052J674O734K3555K9320K051L548
10038A248039J2550J7059J4913R512J695L516n6P090J7527K0280K9925K9314K7766
10025A439130M1965M8804L7467L8877M8164N3016P1115O1591N3885N5093O2893
10014B012000P7207O2524P1080P7776R8089R5078J07898J26816J51161J50128
$$ plain form
10004 3029757 3181353 3361677 3578149 3823466 4090550 4420039 4851523 5412796 6118398
9995 6118398 6997900 8059216 9263402 10630021 12147192 13803386 15616010 17594242
9987 17594242 19792292 22326340 25413360 29448431 35131126 43653107 56836615 76684097
9979 76684097 104484664 140346245 183161841 230360580 277417343 320002624 355464153
9972 355464153 380654717 393072286 391453582 375808362 348428486 312517341 271685315
9965 271685315 229722767 189324152 153580688 125334944 105077179 91235221 81631341
9958 81631341 74656985 69317612 65021187 61398023 58177211 55162385 52265811 49475353
9950 49475353 46859890 44473957 42291522 40284641 38441626 36741615 35180587 33760522
$$ packed form
10004C029757J51596J80324K16472K45317K67084L29489M31484N61273P05602
9995F118398Q79502J061316J204186J366619J517171J656194J812624J978232
9987A7594242K198050K534048L087020M035071N682695Q521981J3183508J9847482
9979G6684097K7800567L5861581M2815596M7198739M7056763M2585281L5461529
9972C55464153K5190564J2417569j618704j5645220k7379876l5911145m0832026
9965B71685315m1962548m0398615l5743464k8245744k0257765j3841958r603880
9958H1631341o974356n339373m296425l623164l220812l014826k896574k790458
9950D9475353k615463k385933k182435k006881j843015j700011j561028j420065
$$ plain form
9942 33760522 32476232 31290260 30208314 29224640 28309218 27452021 26652984 25900036 25178681
9933 25178681 24485448 23810784 23145140 22509857 21894605 21308322 20754604 20238516 19750224
9924 19750224 19265313 18792797 18330150 17889900 17467896 17082390 16719852 16352836 15983752
9915 15983752 15619335 15273755 14944084 14612014 14280965 13953935 13635831 13323786 13012872
9906 13012872 12701776 12392847 12093905 11828598 11588321 11369913 11165988 10967609 10792199
9897 10792199 10610994 10443773 10306623 10174653 10043488 9892855 9731033 9564020 9403825
9888 9403825 9231116 9052479 8875210 8706251 8550764 8390512 8227979 8064806 7916761 7778250
9878 7778250 7649235 7520018 7399635 7274334 7150809 7026822 6899988 6764193 6636703 6533121
$$ packed form
9942C3760522j284290j185972j081946r83674r15422q57197p99037p52948p21355
9933B5178681o93233o74664o65644o35283o15252n86283n53718n16088m88292
9924A9750224m84911m72516m62647m40250m22004l85506l62538l67016l69084
9915A5983752l64417l45580l29671l32070l31049l27030l18104l12045l10914
9906A3012872l11096l08929k98942k65307k40277k18408k03925j98379j75410
9897A0792199j81205j67221j37150j31970j31165j50633j61822j67013j60195
9888I403825j72709j78637j77269j68959j55487j60252j62533j63173j48045j38511
9878G778250j29015j29217j20383j25301j23525j23987j26834j35795j27490j03582
$$ plain form
9868 6533121 6436176 6340249 6251451 6154877 6071233 5981365 5883393 5807661 5745437 5723040 5721643 5758509
9856 5758509 5812033 5904372 6025507 6200015 6422421 6683694 7005533 7362054 7737227 8120670
9846 8120670 8505547 8901093 9372850 9969884 10834907 12181108 14243783 17153845 20694249
9837 20694249 24249604 27053575 28345225 27594324 24882199 21175026 17749880 15187227
9829 15187227 13420169 12252642 11506918 11098597 11025815 11300794 11859815 12512452 13105755
9820 13105755 13507169 13500428 13012682 12401954 12007620 12012028 12546349 13672518 15263095 16930302
9810 16930302 18354858 19396582 19709275 19481387 19688530 21068581 23851799 27886089 32734764
9801 32734764 37861901 42622564 46295922 48900202 51212796 53425044 55295992 56543253
$$ packed form
9868F533121r6945r5927q8798r6574q3644q9868r7972p5732o2224k2397j397L6866
9856E758509N3524R2339J21135J74508K22406K61273L21839L56521L75173L83443
9846H120670L84877L95546M71757N97034Q65023J346201K062675K910062L540404
9837B0694249L555355K803971J291650p50901k712125l707173l425146k562653
9829A5187227j767058j167527p45724m08321p2782K74979N59021O52637N93303
9820A3105755M01414o741m87746o10728l94334M408N34321J126169J590577J667207
9810A6930302J424556J041724L12693k27888K07143J380051K783218M034290M848675
9801C2734764N127137M760663L673358K604280K312594K212248J870948J247261
$$ plain form
9793 56543253 56192992 53109091 47386714 40486969 34184135 29550926 26692524 25325781
9785 25325781 25161923 25735282 26549202 27278847 27513184 26941715 25973619 25270194 25053405
9776 25053405 25289678 25780993 26316745 27256339 29378339 32903992 37362179 42419734 47673576
9767 47673576 51661074 53752733 54990485 55541104 55348308 55379295 56152830 57160634 58017303
9758 58017303 58888230 59884843 60466552 60361989 59763703 58339696 55295397 50562966 45242036
9749 45242036 40393502 36348606 33361487 31463961 30418996 30007324 30066191 30372294 30543236
9740 30543236 30411421 30098563 29323355 27685234 25835949 24717278 24601574 25550097 27720193
9731 27720193 31136303 35528568 40460534 45619234 50446675 54035445 56048350 56933039
$$ packed form
9793E6543253l50261l083901n722377o899745o302834m633209k858402j366743
9785B5325781j63858N73359Q13920P29645K34337n71469r68096p03425k16789
9776B5053405K36273M91315N35752R39594K122000L525653M458187N057555N253842
9767D7673576L987498K091659J237752N50619j92796L0987P73535J007804Q56669
9758E8017303Q70927R96613N81709j04563n98286j424007l044299m732431n320930
9749D5242036m848534m044896k987119j897526j044965m11672N8867L06103J70942
9740C0543236j31815l12858p75208j638121j849285j118671j15704R48523K170096
9731B7720193L416110M392265M931966N158700M827441L588770K012905Q84689
$$ plain form
9723 56933039 56536077 54136283 50194456 46209080 42777136 39690334 36872590 34199390
9715 34199390 31531736 29219009 27719780 26948941 26458341 25934870 25001400 23306547 21268494
9706 21268494 19580452 18453220 17768662 17426264 17318052 17239329 17066287 16789625 16333670
9697 16333670 15603111 14767332 14116342 13714595 13558415 13646203 14046704 14897155 16356096
9688 16356096 18533667 21254901 24034677 26222725 27161288 26433338 24107165 20846652
9680 20846652 17676233 15207980 13460883 12228405 11336701 10662135 10128647 9702582 9336972
9671 9336972 9011083 8716595 8433226 8133986 7863891 7613319 7378187 7155450 6937653 6733291
9661 6733291 6555881 6383608 6218651 6068354 5928944 5795719 5671876 5562286 5441746 5332972
$$ packed form
9723E6933039l96962k399794l941827l985376l431944l086802k817744k673200
9715C4199390k667654k312727j499229p70839m90600n23471r33470j694853k038053
9706B1268494j688042j127232o84558l42398j08212p8723j73042k76662m55955
9697A6333670p30559q35779o50990m01747j56180Q7788M00501Q50451J458941
9688A6356096K177571K721234K779776K188048R38563p27950k326173l260513
9680B0846652l170419k468253j747097j232478q91704o74566n33488m26065l65610
9671I336972l25889k94488k83369k99240k70095k50572k35132k22737k17797k04362
9661F733291j77410j72273j64957j50297j39410j33225j23843j09590j20540j08774
$$ plain form
9651 5332972 5231583 5142076 5068981 5000807 4937208 4862734 4778548 4679954 4586477 4514171 4469972
9640 4469972 4400770 4328893 4275804 4207286 4139089 4079357 4029411 3969309 3884296 3805884 3764762
9629 3764762 3717984 3647084 3589806 3521199 3457791 3384286 3308094 3257958 3191479 3129061 3057642
9618 3057642 2995715 2951262 2919220 2864542 2806144 2784016 2761253 2734920 2709685 2685176 2691408 2683533
9606 2683533 2640341 2607250 2583845 2544937 2505418 2475587 2462704 2436168 2401269 2381653 2350856
9595 2350856 2316731 2273251 2232162 2193948 2144088 2101532 2064958 2030672 2012643 2009245 1998564 1979491
9583 1979491 1982783 1989265 1994996 2045782 2145284 2264623 2416137 2634331 2873697 3098994 3307173
9572 3307173 3480809 3598223 3612530 3561177 3440960 3258666 3044880 2820629 2594071 2371410
$$ packed form
9651E332972j01389q9507p3095o8174o3599p4474q4186r8594r3477p2306m4199
9640D469972o9202p1877n3089o8518o8197n9732m9946o0102q5013p8412m1122
9629C764762m6778p0900n7278o8607o3408p3505p6192n0136o6479o2418p1419
9618C057642o1927m4453l2042n4678n8398k2128k2763k6333k5235k4509O232p875
9606B683533m3192l3091k3405l8908l9519k9831j2883k6536l4899j9616l0797
9595B350856l4125m3480m1089l8214m9860m2556l6574l4286j8029l398j0681j9073
9583A979491L292O482N731N0786R9502J19339J51514K18194K39366K25297K08179
9572C307173J73636J17414J4307n1353j20217j82294k13786k24251k26558k22661
$$ plain form
9562 2371410 2155692 1994347 1882698 1784778 1718300 1678764 1629013 1584274 1536832 1480502 1437952
9551 1437952 1407152 1374078 1343143 1309980 1281788 1260845 1243581 1221858 1197025 1172520 1160764
9540 1160764 1130893 1105025 1077024 1040249 1026363 1011753 982138 965127 953291 937279 922334
9529 922334 909204 898137 882479 875896 865948 857691 846036 833714 821107 796281 790216 778439
9517 778439 759582 747119 734576 723445 723851 717631 707619 700507 692202 683151 661262 646940 635984
9504 635984 627280 629551 622000 619235 608504 600845 603397 600497 597937 586654 582649 573394 567526 558181
9490 558181 542749 540437 538203 521946 517846 513777 508147 507132 488353 477479 474871 477075 469907
9477 469907 459014 446258 436281 422945 426172 432212 444362 442030 421848 405188 415178 412334 406615
$$ packed form
9562B371410k15718j61345j11649r7920o6478l9536m9751m4739m7442n6330m2550
9551A437952l0800l3074l0935l3163k8192k0943j7264k1723k4833k4505j1756
9540A160764k9871k5868k8001l6775j3886j4610k9615j7011j1836j6012j4945
9529I22334j3130j1067j5658o583r948q257j1655j2322j2607k4826o065j1777
9517G78439j8857j2463j2543j1131M06o220j0012p112q305r051k1889j4322j0956
9504F35984q704K271p551k765j0731p659K552k900k560j1283m005r255n868r345
9490E58181j5432k312k234j6257m100m069n630j015j8779j0874k608K204p168
9477D69907j0893j2756r977j3336L227O040J2150k332k0182j6660R990k844n719
$$ plain form
9464 406615 417618 413013 403896 401500 401032 400326 397053 401358 408658 400939 383114 367553 360193 355878
9450 355878 360606 377302 385463 382879 383873 376795 361062 354068 346574 355399 352958 346915 354024 354057 353194
9435 353194 362151 359551 342149 336022 346072 351709 366983 377751 405895 414277 420444 419786 420203 413735
9421 413735 388190 372018 352596 339479 340144 347335 335836 321257 308149 316169 318094 314673 322466
9408 322466 335690 332432 314036 301510 305052 310475 321540 332698 337109 352879 352162 359939 362361
9395 362361 361282 360515 377302 404252 426990 450148 480742 501893 520562 531400 527744 528148 529653
9382 529653 512408 506999 479276 446521 416286 386488 362710 352572 358852 359624 356663 357494 359687
9369 359687 367248 368164 358834 367252 366261 358396 357046 363690 371698 385843 416751 455080 487893 507533
$$ packed form
9464D06615J1003m605r117k396m68p06l273M305P300p719j7825j5561p360m315
9450C55878M728J6696Q161k584R94p078j5733o994p494Q825k441o043P109L3q63
9435C53194Q957k600j7402o127J0050N637J5274J0768K8144Q382O167o58M17o468
9421D13735k5545j6172j9422j3117O65P191j1499j4579j3108Q020J925l421P793
9408C22466J3224l258j8396j2526L542N423J1065J1158M411J5770p17P777K422
9395C62361j079p67J6787K6950K2738K3158L0594K1151J8669J0838l656M04J505
9382E29653j7245n409k7723l2755l0235k9798k3778j0138O280P72k961Q31K193
9369C59687P561R16r330Q418r91p865j350O644Q008J4145L0908L8329L2813J9640
$$ plain form
9355 507533 519945 533042 540128 538104 533347 528994 528326 532160 532757 530839 523620 525666 513248 496205
9341 496205 487576 474717 442782 408345 382073 367428 361629 347236 356546 365922 354894 353706 359915
9328 359915 354597 340988 335626 331279 324713 329964 335702 344814 355337 373590 397403 426916 471717
9315 471717 500976 503959 505019 497104 480069 460737 452404 441350 434766 431066 405214 390028 380974
9302 380974 375210 365286 369788 369955 353948 349718 347313 338235 328166 319612 328130 333911 324635 317227
9288 317227 300199 281199 272328 277240 282642 295199 307948 321778 313564 321264 331218 348049 361427
9275 361427 380252 390018 395451 390865 374473 355915 356106 350048 344576 340375 342669 333458 320237 318283
9261 318283 318423 312017 309992 315866 309708 305737 323596 350770 360810 351382 357005 360490 355343 357728
$$ packed form
9355E07533J2412J3097P086k024m757m353o68L834N97j918p219K046j2418j7043
9341D96205q629j2859l1935l4437k6272j4645n799j4393R310R376j1028j188O209
9328C59915n318j3609n362m347o566N251N738R112J0523J8253K3813K9513M4801
9315D71717K9259K983J060p915j7035j9332q333j1054o584l700k5852j5186r054
9302C80974n764r924M502J67j6007m230k405r078j0069q554Q518N781r276p408
9288C17227j7028j9000q871M912N402J2557J2749J3830q214P700R954J6831J3378
9275C61427J8825R766N433m586j6392j8558J91o058n472m201K294r211j3221j954
9261C18283J40o406k025N874o158l971J7859K7174J0040r428N623L485n147K385
$$ plain form
9247 357728 353081 348722 357984 361298 361821 369557 379046 380315 383450 377780 379683 381890 394740 401174
9233 401174 406208 410278 421621 425021 422308 432287 462540 481529 490936 523860 551946 570577 588714
9220 588714 605502 618370 637342 663859 676684 683306 678027 680359 685943 690522 692821 700146 709820
9207 709820 727889 744218 768067 791497 806872 832017 850604 858067 876302 893132 896748 901675
9195 901675 904064 916063 934209 949690 959407 962153 958015 961065 974975 983103 974051 959306 960384
9182 960384 960404 952530 953758 952016 955554 969280 987731 1011602 1055628 1075890 1084809 1090560 1066796
9169 1066796 1023635 981923 934975 872313 825349 778236 745537 726104 694440 666426 661938 655952
9157 655952 643766 623024 598933 580436 580168 573364 576807 573857 562397 554736 543861 534036 510752
$$ packed form
9247C57728m647m359R262L314N23P736R489J269L135n670J903K207J2850O434
9233D01174N034M070J1343L400k713R979L0253J8989R407L2924K8086J8631J8137
9220E88714J6788J2868J8972K6517J2825O622n279K332N584M579K299P325R674
9207G09820J8069J6329K3849K3430J5375K5145J8587P463J8235J6830L616M927
9195I01675K389J1999J8146J5481R717K746m138L050J3910Q128r052j4745J078
9182I60384K0p874J228j742L538J3726J8451K3871M4026K0262Q919N751k3764
9169A066796m3161m1712m6948o2662m6964m7113l2699j9433l1664k8014m488n986
9157F55952j2186k0742k4091j8497k68o804L443k950j1460p661j0875r825k3284
$$ plain form
9144 510752 497513 493086 478138 461082 459917 457522 459979 472405 482337 476740 474211 470536 476025
9131 476025 477478 468681 482549 518057 557702 596906 648340 689421 704047 685677 635646 600738
9119 600738 546120 479895 455143 425982 392605 378820 375811 382897 380483 379964 390188 400909 397505
9106 397505 399458 381423 374221 361189 354451 355489 348037 354302 366478 374834 374662 377895 387071 377771
9092 377771 360148 345422 345632 339553 348642 338494 329922 321148 311271 298957 302877 312724 322407 352019
9078 352019 368855 387337 396438 394454 379997 369080 352164 330957 302532 293361 294145 290098 299237
9065 299237 293024 282178 284341 285277 288664 273071 265750 263498 254672 248641 241785 246226 249032 256785
9051 256785 262934 270601 267342 265686 257874 261515 256086 258201 274235 288978 303597 304410 296402 290132
$$ packed form
9144E10752j3239m427j4948j7056j165k395K457J2426R932n597k529l675N489
9131D76025J453q797J3868L5508L9645L9204N1434M1081J4626j8370n0031l4908
9119F00738n4618o6225k4752k9161l3377j3785l009P086k414n19J0224J0721l404
9106C97505J953j8035p202j3032o738J038p452O265J2176Q356j72L233R176r300
9092C77771j7623j4726K10o079R089j0148q572q774r877j2314L920R847R683K9612
9078C52019J6836J8482R101j984j4457j0917j6916k1207k8425r171P84m047R139
9065B99237o213j0846K163R36L387j5593p321k252q826o031o856M441K806P753
9051B56785O149P667l259j656p812L641n429K115J6034J4743J4619Q13q008o270
$$ plain form
9037 290132 274386 265339 248388 245223 242846 236560 224981 228169 227214 216574 218742 219373 224374 236835
9023 236835 246248 256069 258968 254218 235350 228914 221206 221483 235858 251158 245531 236247 226368 224085
9009 224085 227638 230656 223610 213069 213346 220902 227534 229920 213252 203197 214176 218136 204168
8996 204168 196370 193956 181155 191605 213361 203496 195081 204875 218423 212086 202674 189362 188593
8983 188593 183926 177986 186418 185391 183463 190885 191765 185879 172753 178977 190681 198955 193723 186301
8969 186301 195081 183914 203045 189682 176010 176548 185386 205529 197427 176883 162212 178481 186614
8956 186614 174673 168266 172682 177575 169083 170373 177485 174359 170610 168716 169264 157013 152465 161028
8942 161028 166284 173760 179258 169282 162931 164895 177122 174604 165571 148653 151934 163593 162252 161986
$$ packed form
9037B90132j5746r047j6951l165k377o286j1579L188r55j0640K168O31N001J2461
9023B36835R413R821K899m750j8868o436p708K77J4375J5300n627r284r879k283
9009B24085L553L018p046j0541K77P556O632K386j6668j0055J0979L960j3968
8996B04168p798k414j2801J0450K1756r865q415R794J3548o337r412j3312p69
8983A88593m667n940Q432j027j928P422Q80n886j3126O224J1704Q274n232p422
8969A86301Q780j1167J9131j3363j3672N38Q838K0143q102k0544j4671J6269Q133
8956A86614j1941o407M416M893q492J290P112l126l749j894N48j2251m548Q563
8942A61028N256P476N498r976o351J964J2227k518r033j6918L281J1659j341k66
$$ plain form
8928 161986 160786 159712 163557 173620 169306 172765 176084 182363 176368 166161 173573 167976 171117 170746
8914 170746 170155 170317 166956 159986 147329 146868 148024 154121 156654 160081 168930 173921 169681 159030 156334
8899 156334 145982 137516 141742 152024 152422 135639 132772 140111 147512 148127 155678 160089 155464 168479
8885 168479 189141 197369 197567 195850 207466 217958 211083 218552 251785 263388 274750 288753 319252
8872 319252 380592 493266 647489 814040 940346 1018726 1006728 915275 763446 604686
8862 604686 501273 434479 381346 341318 314742 292229 284800 279719 288434 287589 275717 260018
8850 260018 252651 248265 245776 258416 257747 246648 243131 242061 251114 266404 264166 254869 253469 261879
8836 261879 278812 293149 310087 349433 387992 428210 428067 395639 346717 294054 262255 233326
$$ packed form
8928A61986j200j074L845J0063m314L459L319O279n995j0207P412n597L141l71
8914A70746n91J62l361o970j2657m61J156O097K533L427Q849M991m240j0651k696
8899A56334j0352q466M226J0282L98j6783k867P339P401O15P551M411m625J3015
8885A68479K0662Q228J98j717J1616J0492o875P469L3233J1603J1362J4003L0499
8872C19252O1340J12674J54223J66551J26306P8380j1998r1453j51829j58760
8862F04686j03413o6794n3133m0028k6576k2513p429n081Q715q45j1872j5699
8850B60018p367m386k489J2640o69j1099l517j070R053J5290k238r297j400Q410
8836B61879J6933J4337J6938L9346L8559M0218j43l2428m8922n2663l1799k8929
$$ plain form
8824 233326 218566 230146 242574 244304 246013 243253 237326 233885 231679 232737 234235 238019 227031
8811 227031 216626 214734 212386 205600 207658 214271 212435 204068 200806 204427 201491 190605 198936 210370
8797 210370 217247 211056 206069 196468 179644 180264 193068 190944 198861 199483 206977 207517 200684 202572 188627
8782 188627 194838 204698 214087 208292 197198 196741 190388 189232 185296 197278 201993 186164 169317 164024
8768 164024 156514 149710 146152 153255 158143 153527 158149 164887 171066 172365 171462 176054 164585 162162
8754 162162 176472 177685 182776 184132 172527 164757 160270 154871 157581 174682 172201 171159 152856
8741 152856 156571 183596 195190 201337 191152 176211 182483 181852 184137 199534 196267 184732 181217
8728 181217 178423 177255 176303 187026 175062 158165 158132 161534 157220 167339 156393 155077 158296 169615
$$ packed form
8824B33326j4760J1580J2428J730J709k760n927l441k206J058J498L784j0988
8811B27031j0405j892k348o786K058O613j836q367l262L621k936j0886Q331J1434
8797B10370O877o191m987r601j6824O20J2804k124P917O22P494N40o833J888j3945
8782A88627O211R860R389n795j1094m57o353j156l936J1982M715j5829j6847n293
8768A64024p510o804l558P103M888m616M622O738O179J299r03M592j1469k423
8754A62162J4310J213N091J356j1605p770m487n399K710J7101k481j042j8303
8741A52856L715K7025J1594O147j0185j4941O272o31K285J5397l267j1535l515
8728A81217k794j168r52J0723j1964j6897l3L402m314J0119j0946j316L219J1319
$$ plain form
8714 169615 173190 181107 196484 204555 211281 209628 213371 225904 240232 250555 265063 276202 298462
8701 298462 335295 382817 428912 478010 515793 516375 515985 515900 494802 481513 463130 445556 430326
8688 430326 427860 417809 385712 359952 337642 329639 314898 306843 307497 309629 306689 312433 320441
8675 320441 319776 315047 304175 283605 261055 253270 247226 251557 257000 256570 251078 240204 234622 241295
8661 241295 260153 278160 294636 314044 311657 295281 285889 262962 239069 223409 212222 198404
8649 198404 191554 181139 177585 177041 165093 150587 146178 150585 153576 148300 150571 158161 176925 172482
8635 172482 159853 158234 153300 158920 162511 163486 153097 153440 150878 147891 150404 151014 166222 169649
8621 169649 163853 153015 152829 163844 167819 167947 170312 171180 177156 172026 163579 164199 172339 174869 183511
$$ packed form
8714A69615L575P917J5377Q071O726j653L743J2533J4328J0323J4508J1139K2260
8701B98462L6833M7522M6095M9098L7783N82l90q5k1098j3289j8383j7574j5230
8688D30326k466j0051l2097k5760k2310q003j4741q055O54K132k940N744Q008
8675C20441o65m729j0872k0570k2550p785o044M331N443m30n492j0874n582O673
8661B41295J8858J8007J6476J9408k387j6376r392k2927k3893j5660j1187j3818
8649A98404o850j0415l554n44j1948j4506m409M407K991n276K271P590J8764m443
8635A72482j2629j619m934N620L591R75j0389L43k562k987K513O10J5208L427
8621A69649n796j0838j86J1015L975J28K365Q68N976n130q447O20Q140K530Q642
$$ plain form
8606 183511 190239 181744 171182 155788 149549 162145 171567 178287 191346 210972 229541 232907 246677
8593 246677 258271 264134 280034 310781 360986 447177 578829 744023 897486 1017694 1058169
8582 1058169 983247 808262 629957 482762 387220 343299 321053 292328 281179 283586 290554
8571 290554 285680 274742 252182 232532 223844 224827 217911 201474 185654 176696 176014 183954 192559 184654
8557 184654 171045 164457 164382 150599 142620 142006 127471 111579 113083 125127 127773 138880 156081
8544 156081 157402 153567 150615 139419 143617 150709 154989 151784 134008 124332 122301 124908 123346 115965
8530 115965 113709 117125 111058 99344 101609 96942 101977 100459 94013 91822 104067 100964 103921 94943
8516 94943 93945 93653 93438 92046 96257 103360 116055 120115 134201 156547 159857 172612 182967 198940
$$ packed form
8606A83511O728q495j0562j5394o239J2596R422O720J3059J9626J8569L366J3770
8593B46677J1594N863J5900L0747N0205Q6191J31652J65194J53463J20208M0475
8582A058169p4922j74985j78305j47195r5542m3921k2246k8725j1149K407O968
8571B90554m874j0938k2560j9650q688R83o916j6437j5820q958o82P940Q605p905
8557A84654j3609o588p5j3783p979o14j4535j5892J504J2044K646J1107J7201
8544A56081J321l835k952j1196M198P092M280l205j7776r676k031K607j562p381
8530A15965k256L416o067j1714K265m667N035j518o446k191J2245l103K957q978
8516I4943r98k92k15j392M211P103J2695M060J4086K2346L310J2755J0355J5973
$$ plain form
8502 198940 186050 146660 118746 110829 109377 104810 99262 100379 109696 104492 111011 131688 140426
8489 140426 134359 127469 123710 127741 143630 150169 170093 175565 179395 192605 209718 238556 268811
8476 268811 297027 348626 429452 544034 694828 843958 949570 1000265 960432 859147 710924
8465 710924 558776 451045 372183 315288 280454 261296 238805 215564 207446 202879 198636 193471
8453 193471 188871 175645 150498 145097 155390 159895 158184 151855 151924 151983 161836 171512 167194 151720
8439 151720 143415 146870 144317 127275 126326 142699 149529 149251 143617 129594 121852 124424 128466 131388
8425 131388 126790 126135 124004 103156 95563 88779 82057 80034 78568 95376 95860 93392 102712 104720
8411 104720 88173 79755 87119 87812 84985 80801 95338 100048 98352 99483 113337 118387 127661 132748
$$ packed form
8502A98940j2890l9390k7914p917j452m567n548J117R317n204O519K0677Q738
8489A40426o067o890l759M031J5889O539J9924N472L830J3210J7113K8838L0255
8476B68811K8216N1599Q0826J14582J50794J49130J05612N0695l9833j01285j48223
8465G10924j52148j07731p8862n6895l4834j9158k2491k3241q118m567m243n165
8453A93471m600j3226k5147n401J0293M505j711o329O9N9R853R676m318j5474
8439A51720q305L455k553j7042r49J6373O830k78n634j4023p742K572M042K922
8425A31388m598o55k131k0848p593o784o722k023j466J6808M84k468R320K008
8411A04720j6547q418P364O93k827m184J4537M710j696J131J3854N050R274N087
$$ plain form
8397 132748 139965 132945 120726 120297 114435 116446 126286 124122 120899 117390 110558 105732 109346 101929
8383 101929 94657 90357 85900 88585 101189 105221 100291 101528 110893 105078 106392 104890 98615 104496
8369 104496 106105 92780 77843 82728 72910 75823 60085 62692 80711 87458 86422 69043 64823
8356 64823 73823 79677 87920 86734 83140 97940 88070 67554 62479 66364 62276 70702 74744 75141
8342 75141 63983 47662 50254 44951 71113 85628 80972 68394 65893 72331 67901 60209 61413
8329 61413 64717 66035 59343 49890 53620 49609 48343 40457 35988 46367 52701 55392 53115 49757
8315 49757 48635 44956 43966 55879 66909 54412 52291 46118 43692 50697 42277 44790 54467 48249
8301 48249 50729 44838 26808 23079 45507 64869 54891 59263 62328 62527 47945 42412 41747 40139
$$ packed form
8397A32748P217p020j2219m29n862K011R840k164l223l509o832m826L614p417
8383A01929p272m300m457K685J2604M032m930J237R365n815J314j502o275N881
8369A04496J609j3325j4937M885r818K913j5738K607J8019O747j036j7379m220
8356F4823R000N854Q243j186l594J4800r870k0516n075L885m088Q426M042L97
8342G5141j1158j6321K592n303K6162J4515m656j2578k501O438m430p692J204
8329F1413L304J318o692r453L730m011j266p886m469J0379O334K691k277l358
8315D9757j122l679r90J1913J1030j2497k121o173k426P005q420K513R677o218
8301D8249K480n891j8030l729K2428J9362r978M372L065J99j4582n533o65j608
$$ plain form
8287 40139 46555 51185 70987 51536 45469 54366 60904 62548 69473 67443 57953 54913 53006 54273
8273 54273 49105 47640 43586 31131 23236 33966 36319 49366 56246 61429 59961 55465 44366 43762
8259 43762 36723 36565 33982 42186 43550 36170 45309 45629 49966 57249 67409 72903 60519 65240 68803
8244 68803 66219 59264 52969 59042 55707 36264 33417 42806 51322 44997 33693 17779 15964 26708
8230 26708 36961 45959 51966 51502 61901 67651 69843 57301 43449 47077 58395 53557 38985
8217 38985 32826 52113 61679 57023 49485 53627 65761 71910 70825 74282 72988 61297 60103 69309
8203 69309 84464 102874 122792 136329 150658 170593 188002 181091 168375 177606 176336 171594 154283
8190 154283 147248 128790 108687 92524 95036 104203 104546 101864 95705 82022 87662 102602 117630
$$ packed form
8287D0139O416M630J9802j9451o067Q897O538J644O925k030r490l040j907J267
8273E4273n168j465m054j2455p895J0730K353J3047O880N183j468m496j1099o04
8259D3762p039j58k583Q204J364p380R139L20M337P283J0160N494j2384M721L563
8244F8803k584o955o295O073l335j9443k847R389Q516o325j1304j5914j815J0744
8230B6708J0253Q998O007m64J0399N750K192j2542j3852L628J1318m838j4572
8217C8985o159J9287R566m656p538M142J2134O149j085L457j294j1691j194R206
8203F9309J5155J8410J9918J3537J4329J9935J7409o911j2716R231j270m742j7311
8190A54283p035j8458k0103j6163K512R167L43k682o159j3683N640J4940J5028
$$ plain form
8177 117630 121310 117464 113722 121883 128279 128891 125834 119451 115208 126022 139594 142563 147165 152756
8163 152756 147892 130436 129938 141111 143679 157996 169159 176368 199515 237788 263476 292551 334646
8150 334646 359780 368473 358082 343249 312176 286130 284938 273826 257824 261823 252064 251027 246552
8137 246552 251988 254688 258029 265335 286879 309819 327799 344763 334705 329301 321690 333331 362335
8124 362335 402852 454760 534171 618855 682298 726849 739479 715168 651657 578542 496620 439282
8112 439282 419689 400519 390305 373967 379107 392709 388525 394091 405638 401016 387229 390148 386668
8099 386668 381652 381194 376700 378694 376298 363799 358416 362060 356291 365567 370591 366572 357442 362210
8085 362210 361989 352257 337848 324654 330000 326595 334074 359070 406556 486178 615981 772541
$$ packed form
8177A17630L680l846l742Q161O396O12l057o383m243J0814J3572K969M602N591
8163A52756m864j7456m98J1173K568J4317J1163P209K3147L8273K5688K9075M2095
8150C34646K5134Q693j0391j4833l1073k6046j192j1112j6002L999r759j037m475
8137B46552N436K700L341P306K1544K2940J7980J6964j0058n404p611J1641K9004
8124C62335M0517N1908P9411Q4684O3443M4551J2630k4311o3511p3115q1922n7338
8112D39282j9593j9170j0214j6338N140J3602m184N566J1547m622j3787K919l480
8099C86668n016m58m494J994k396j2499n383L644n769R276N024m019r130M768
8085C62210k21r732j4409j3194N346l405P479K4996M7486P9622J29803J56560
$$ plain form
8073 772541 922124 1064669 1158113 1126422 980873 791383 641830 551490 489972 454994 430418
8062 430418 415441 409133 394660 379469 374850 364543 362510 353651 337957 338601 331330 326455 318015
8049 318015 302068 289796 291158 288489 271004 265408 282048 293603 308184 304225 302848 291735 272399
8036 272399 257348 235495 213725 216952 223892 239598 248915 275495 315819 367130 433037 500688
8024 500688 549111 564472 532755 482393 432380 378405 327253 292589 284149 266792 249367 255611
8012 255611 251306 230483 217901 212001 202599 193052 191888 187755 189096 184708 161072 148893 143887
7999 143887 149649 142758 143802 142112 149016 160445 147795 139646 147490 150383 144838 138449 124710 101087
7985 101087 85496 89972 84378 81012 96032 89929 89956 92256 98003 92709 85820 78628 63058 56988
$$ packed form
8073G72541J49583J42545R3444l1691j45549j89490j49553r0340o1518l4978k4576
8062D30418j4977o308j4473j5191m619j0307k033q859j5694O44p271m875q440
8049C18015j5947j2272J362k669j7485n596J6640J1555J4581l959j377j1113j9336
8036B72399j5051k1853k1770L227O940J5706R317K6580M0324N1311O5907O7651
8024E00688M8423J5361l1717n0362n0013n3975n1152l4664q440j7357j7425O244
8012B55611m305k0823j2582n900r402r547j164m133J341m388k3636j2179n006
7999A43887N762o891J044j690O904J1429j2650q149P844K893n545o389j3739k3623
7985A01087j5591M476n594l366J5020o103K7K300N747n294o889p192j5570o070
$$ plain form
7971 56988 62987 69401 72508 70367 73628 74476 81154 82360 94005 99071 89472 73886 67745 78772
7957 78772 83327 77432 63796 68403 69636 57556 42580 32118 37223 38163 47949 50424 55514 53200
7943 53200 50488 38300 36691 48232 57572 57200 53802 46300 55696 53583 51497 47195 53247 52930 51490
7928 51490 43984 33839 34844 41875 48019 48158 63026 61144 60480 53629 43762 34514 32251 20333
7914 20333 22064 26648 25147 15106 8968 10804 19810 44193 62689 51131 35670 24813 18455
7901 18455 643 10436 18722 18575 21041 11419 6505 19650 21316 29235 52043 52548 58950 51052
7887 51052 52846 51356 38620 23825 12934 3290 3690 6085 6581 5224 8299 12797 6241 14716
7873 14716 32408 40319 28596 23231 24699 14082 14491 16315 11011 17599 14264 17461 21764 17765
$$ packed form
7971E6988N999O414L107k141L261Q48O678J206J1645N066r599j5586o141J1027
7957G8772M555n895j3636M607J233j2080j4976j0462N105R40R786K475N090k314
7943E3200k712j2188j609J1541R340l72l398p502R396k113k086m302O052l17j440
7928E1490p506j0145J005P031O144J39J4868j882o64o851r867r248k263j1918
7914B0333J731M584j501j0041o138J836R006K4383J8496j1558j5461j0857o358
7901A8455j7812R793Q286j47K466r622m914J3145J666P919K2808N05O402p898
7887E1052J794j490j2736j4795j0891r644M00K395M96j357L075M498o556Q475
7873A4716J7692P911j1723n365J468j0617M09J824n304O588l335L197M303l999
$$ plain form
7859 17765 11480 5143 7155 14680 23106 22520 25915 26834 18774 15765 9871 17439 20102 9185 2597
7844 2597 4742 16270 24578 23531 19330 18029 7901 -120 -2252 -8413 -5418 3123 4037 12675 12135
7829 12135 11079 16832 13974 3821 -2798 -2354 22085 31038 31209 39479 32806 22464 15106 12459
7815 12459 16430 18330 2993 -5288 -20043 -19836 -10656 3436 9346 19653 14502 7509 16714 17719
7801 17719 21075 21592 22222 14792 23605 37259 29915 22831 18255 10871 15274 16867 15974 26975 19652
7786 19652 15282 13644 2111 7692 12363 13021 6075 6663 14017 27144 25447 30552 31981 28780 31782
7771 31782 29018 17536 9209 18009 14600 9532 13992 10339 4190 13645 13949 8983 10545 13581 712
7756 712 -3968 9206 8491 9695 22559 23431 16561 10824 8903 5786 5741 -10185 -17894 -9680 13851
$$ packed form
7859A7765o285o337K012P525Q426n86L395R19q060l009n894P568K663j0917o588
7844B597K145J1528Q308j047m201j301j0128q021k132o161K995Q541R14Q638n40
7829A2135j056N753k858j0153o619M44K4439Q953J71Q270o673j0342p358k647
7815A2459L971J900j5337q281j4755K07R180J4092N910J0307n151o993R205J005
7801A7719L356N17O30p430Q813J3654p344p084m576p384M403J593q93J1001p323
7786A9652m370j638j1533N581M671O58o946N88P354J3127j697N105J429l201L002
7771C1782k764j1482q327Q800l409n068M460l653o149R455L04m966J562L036j2869
7756G12m680J3174p15J204J2864Q72o870n737j921l117m5j5926p709Q214K3531
$$ plain form
7741 13851 15563 14775 3126 -13553 -4205 -3899 -2055 7721 5213 1420 4541 5948 1713 383 1615
7726 1615 11029 22933 24877 26028 31904 31478 24487 23715 19815 12113 15847 15677 10363 8240 11665
7711 11665 14017 14998 3327 -9116 -7050 7948 22706 20404 9418 659 -2458 -4785 -1557 -13108
7697 -13108 -20478 -8621 4374 -9265 -18959 -19069 -16103 -10121 -13385 1101 9228 11646 7566 2218
7683 2218 7317 2532 -6374 -11487 -6148 -8126 -4350 -2633 -7328 -4282 -6726 2576 8548 10631 -1861
7668 -1861 -6449 -8634 -15292 -19112 -13810 -6970 -6625 -9052 -13168 -19556 -14532 -7806 -1982 -9177 -14494
7653 -14494 -14366 -21273 -16260 -6227 3704 12811 13355 7468 5461 15174 30063 31189 22206 15589 -1074
7638 -1074 -10440 -3300 -2687 -17968 -31049 -20762 -10808 -4560 9185 6205 11252 12970 4218 -4423
$$ packed form
7741A3851J712p88j1649j6679R348L06J844R776k508l793L121J407m235j330J232
7726A615R414J1904J944J151N876m26o991p72l900p702L734j70n314k123L425
7711A1665K352R81j1671j2443K066J4998J4758k302j0986q759l117k327L228j1551
7697a3108p370J1857J2995j3639r694j10K966N982l264J4486Q127K418m080n348
7683B218N099m785q906n113N339j978L776J717m695L046k444R302N972K083j2492
7668a861m588k185o658l820N302O840L45k427m116o388N024O726N824p195n317
7653a4494J28o907N013J0033R931R107N44n887k007R713J4889J126q983o617j6663
7638a074r366P140O13j5281j3081J0287R954O248J3745k980N047J718q752q641
$$ plain form
7624 -4423 -17947 -25162 -26503 -20603 -10481 6741 19837 27532 18352 14713 8438 18568 5564
7611 5564 1309 16220 34334 25960 8946 4206 1106 -6285 -17285 -11704 2670 -2569 -7130 -8849
7597 -8849 -3567 10095 31352 28674 181 -11323 4814 2145 -2682 -2216 -12219 -13806 1284
7584 1284 14959 19117 -3673 -5645 1452 1591 14110 2957 3221 6576 5560 -7951 -3565 4980
7570 4980 -5139 -5615 -3541 1084 -13466 -27172 -15150 4148 16557 4140 223 -1354 1823
7557 1823 11890 19105 9774 -5083 -7790 -9401 -11281 -10852 -10050 -10393 -1884 -10257 -24972 -18400 -11399
7542 -11399 -16983 -17315 -4996 443 6115 380 -2355 12747 17798 18499 23528 16158 -2519 -13357
7528 -13357 -5877 -11443 -4651 708 1141 1503 6680 15014 5607 -687 -8765 -7359 4220 2321 2175
$$ packed form
7624d423j3524p215j341N900J0122J7222J3096P695r180l639o275J0130j3004
7611E564m255J4911J8114q374j7014m740l100p391j1000N581J4374n239m561j719
7597h849N282J3662K1257k678k8493j1504J6137k669m827M66j0003j587J5090
7584A284J3675M158k2790j972P097J39J2519j1153K64L355j016j3511M386Q545
7570D980j0119m76K074M625j4550j3706J2022J9298J2409j2417l917j577L177
7557A823J0067P215r331j4857k707j611j880M29Q02l43Q509q373j4715O572P001
7542a1399n584l32J2319N439N672n735k735J5102N051P01N029p370j8677j0838
7528a3357P480n566O792N359M33L62N177Q334r407o294q078J406J1579j899j46
$$ plain form
7513 2175 -2864 -12211 -8898 -6067 -5389 -4413 -2384 -460 -7426 -6758 -4957 -2254 1505 6169 3317 7255
7497 7255 1575 -1958 -216 -10632 -18024 -21672 -13641 -386 -5879 -5491 1705 6127 -4315 -5844
7483 -5844 5624 2983 -4494 -3033 -2165 10729 16785 6882 -6598 -2170 -10873 -9044 1099 -3690
7469 -3690 5597 8363 1543 -5222 184 2665 5215 8690 7822 10852 10390 -3288 -11257 4697 11979
7454 11979 4109 4651 3740 8655 12658 4740 6532 -404 -7015 -3617 -7129 -18902 -7358 -1457 -7129
7439 -7129 -18322 -20793 -22273 -19861 -12120 -10839 -7596 -11527 -6899 -10072 -11868 -10563 -10560 -12067 -17247
7424 -17247 -17569 -18212 -17903 -15627 -1877 161 -4274 -7818 -4945 -4314 1351 2323 -1316 -1031 -7288 -9579
7408 -9579 -6554 317 4165 1050 -4981 -5252 -11202 6730 15706 9069 8139 11355 4700 -2853 -2511
$$ packed form
7513B175n039r347L313K831O78R76K029J924o966O68J801K703L759M664k852L938
7497G255n680l533J742j0416p392l648Q031J3255n493L88P196M422j0442j529
7483e844J1468k641p477J461Q68J2894O056r903j3480M428q703J829J0143m789
7469c690R287K766o820o765N406K481K550L475q68L030m62j3678p969J5954P282
7454A1979p870N42r11M915M003p918J792o936o611L398l512j1773J1544N901n672
7439g129j1193k471j480K412P741J281L243l931M628l173j796J305Lj507n180
7424a7247l22o43L09K276J3750K038m435l544K873O31N665R72l639K85o257k291
7408i579L025O871L848l115o031k71n950J7932Q976o637r30L216o655p553L42
$$ plain form
7393 -2511 -10389 6190 3061 -3143 2363 871 -14933 -17437 -17169 -15313 3824 3643 5503 3685 -10926
7378 -10926 5061 15751 17395 15342 4589 -1617 3946 7312 3190 11339 16365 12991 10811 5737
7364 5737 3068 -9420 -15813 -11200 -2387 6062 11073 7874 1615 3999 -7202 -3537 -1036 -4595
7350 -4595 2884 10708 10597 8620 19401 17832 21624 17429 23328 20980 20852 17929 7947 -10746 -16515
7335 -16515 -7457 -1173 -7624 -16964 -15051 -13155 -23182 -18361 -1612 2107 -10417 -13623 -12299 -17414
7321 -17414 -24111 -16197 -17714 -13623 -15215 -19882 -22363 -6566 2626 -4241 -23169 -31914 -25242 -17096
7307 -17096 -11862 -30225 -37484 -24182 -19716 -21458 -18356 -10434 -6223 -1226 3281 -2460 -9598 3355
7293 3355 14375 13050 3415 5938 3357 6872 9178 4400 -9312 -16877 -21656 -26070 -16037 -6073
$$ packed form
7393b511p878J6579l129o204N506j492j5804k504K68J856J9137j81J860j818j4611
7378a0926J5987J0690J644k053j0753o206N563L366m122Q149N026l374k180n074
7364E737k669j2488o393M613Q813Q449N011l199o259K384j1201L665K501l559
7350d595P479P824j11j977J0781j569L792m195N899k348j28k923r982j8693n769
7335a6515R058O284o451r340J913J896j0027M821J6749L719j2524l206J324n115
7321a7414o697P914j517M091j592m667k481J5797R192o867j8928q745O672Q146
7307a7096N234j8363p259J3302M466j742L102P922M211M997M507n741p138J2953
7293C355J1020j325r635K523k581L515K306m778j3712p565m779m414J0033R964
$$ plain form
7279 -6073 -4752 -5337 -8404 -15820 -17699 -16436 -7094 -1657 209 8068 21630 15249 4192 607 5176
7264 5176 6273 13648 15616 15659 8901 1740 -4334 -14417 -12530 -10535 -14700 -8758 1069 -3660 -20251
7249 -20251 -29837 -37167 -26412 -6224 5051 1198 -8990 -14728 -10020 -12018 -11092 -6614 -17716 -14899
7235 -14899 -3766 -774 -7548 -10652 -11399 -5366 -4626 -1234 -131 4425 -2605 -3479 2599 -5035 -2166
7220 -2166 -7477 22 160 -4282 -12346 -14673 -10608 -7495 -2032 19943 19755 8201 -8251 -4042 -11394
7205 -11394 -17108 -12469 -16360 -19468 -10288 -1613 -3527 -20074 -20781 -19396 -13174 -6287 -3700 -11535 -15738
7190 -15738 -15927 -7090 -3431 2785 4421 7590 6138 -6157 4107 6423 -5246 1209 13421 8972
7176 8972 11499 12826 6066 4068 934 -13023 -18882 -11642 -9086 -8717 -9311 5706 4972 4470 -6437
$$ packed form
7279f073J321n85l067p416j879J263R342N437J866P859J3562o381j1057l585M569
7264E176J097P375J968M3o758p161o074j0083J887J995m165N942R827m729j6591
7249b0251r586p330J0755K0188J1275l853j0188n738M708j998R26M478j1102K817
7235a4899J1133K992o774l104p47O033P40L392J103M556p030q74O078p634K869
7220b166n311P499J38m442q064k327M065L113N463K1975j88j1554j6452M209p352
7205a1394n714M639l891l108R180Q675j914j6547p07J385O222O887K587p835m203
7190a5738j89Q837L659O216J636L169j452j2295J0264K316j1669O455J2212m449
7176H972K527J327o760j998l134j3957n859P240K556L69n94J5017p34n02j0907
$$ plain form
7161 -6437 -4483 6428 17983 22416 20021 20531 13187 -3729 -5209 -2710 -1845 -4480 -16068 -15945 -1806
7146 -1806 -917 2588 1416 -12080 -5163 7446 10351 7622 832 97 7400 17946 9187 -11662
7132 -11662 -23032 -23032 -8482 28 -2396 -3029 7222 5194 2480 4195 -2109 -14012 -15990 -18822 -26230
7117 -26230 -16724 -19325 -17984 -19493 -20187 -11756 -8509 3082 1211 4831 -3771 -5956 -2596 -7410 -6879
7102 -6879 -10947 -13313 -3373 -2860 -4042 -7382 -10557 -13133 -3565 -1625 3821 8001 18961 10090 -7661
7087 -7661 -12479 -6881 5869 1563 75 598 -5508 -728 -4986 -2266 6537 8142 4412 10711 -101
7072 -101 -16719 -31007 -26064 -19007 -7070 858 -2403 -412 5538 2310 -5649 6923 3623 -6178
7058 -6178 -3237 4536 348 -2693 1828 5853 8375 -1570 -1924 -10328 -10808 -5794 -51 18538 19466
$$ packed form
7161f437J954J0911J1555M433k395N10p344j6916j480K499Q65k635j1588J23J4139
7146a806Q89L505j172j3496O917J2609K905k729o790p35P303J0546q759k0849
7132a1662j1370%J4550Q510k424o33J0251k028k714J715o304j1903j978k832p408
7117b6230R506k601J341j509o94Q431L247J1591j871L620q602k185L360m814N31
7102f879m068k366R940N13j182l340l175k576R568J940N446M180J0960q871j7751
7087g661m818N598J2750m306j488N23o106M780m258K720Q803J605l730O299j0812
7072a01j6618j4288M943P057J1937P928l261J991N950l228p959J2572l300r801
7058f178K941P773m188l041M521M025K522r945l54q404m80N014N743J8589R28
$$ plain form
7043 19466 18966 256 -13105 -15647 -405 4020 -5037 -10253 -20284 -14962 -11174 -1410 1897 -7541
7029 -7541 -6975 -4975 -7671 -3279 8904 5108 2377 6276 9323 -1688 -5575 -294 17800 24963
7015 24963 18368 16793 24873 8767 -5233 -7492 -1879 1992 6353 -9313 -1323 3340 -3327 289
7001 289 1137 12585 20649 5974 -11503 -10017 -3756 -2333 639 -5400 -19226 -13539 -4169 -7230
6987 -7230 -7373 -17337 -23880 -24750 -24806 -20383 -15360 -13847 -3835 10075 11188 3156 7453 18370 12506
6972 12506 6183 7760 9911 1315 -2476 -4215 -555 893 -2085 -3919 -13129 -15707 -10154 -7786 -9000
6957 -9000 -3835 978 -6300 1668 11137 6655 -233 -10439 -4345 -3576 -10584 -12898 -8271 -2963 -3516
6942 -3516 -3950 -2231 -649 -8598 -3200 -7596 691 8341 12974 881 -3676 759 8634 -10011 -12616
$$ packed form
7043A9466n00j8710j3361k542J5242M425r057n216j0031N322L788R764L307r438
7029g541N66K000k696M392J2183l796k731L899L047j1011l887N281J8094P163
7015B4963o595j575Q080j6106j4000k259N613L871M361j5666P990M663o667L616
7001B89Q48J1448Q064j4675j7477J486O261J423K972o039j3826N687R370l061
6987g230j43r964o543q70n6M423N023J513J0012J3910J113q032M297J0917n864
6972A2506o323J577K151q596l791j739L660J448k978j834r210k578N553K368j214
6957i000N165M813p278P968R469m482o888j0206O094P69p008k314M627N308n53
6942c516m34J719J582p949N398m396Q287P650M633j2093m557M435P875j8645k605
$$ plain form
6927 -12616 -5313 2470 9247 26861 25833 11171 10889 4005 7539 7613 -9362 -11318 -8758 -11741 -11244
6912 -11244 -13453 -26129 -26454 -13877 -8131 -12106 -21618 -22663 -12831 -2188 -2494 125 9382 10808
6898 10808 9242 14396 24951 17093 3691 2941 -5165 -6740 -6100 -10311 -15063 -6706 -6537 -19876 -26219
6883 -26219 -14610 -3084 -5611 -6559 -19559 -17123 -6957 -7910 -11220 -1453 -2400 -8742 -3600 -3058 -6935
6868 -6935 -587 3990 6959 10501 8599 -5621 -18695 -13032 9640 11553 -1979 -16475 -12483 805
6854 805 10431 768 -1570 -668 -387 12006 20656 19393 16713 5354 -3548 -2596 7641 -4315 1556
6839 1556 2736 2136 -112 1373 -3451 7030 11638 -1033 -9120 -5934 5856 6953 6426 8382 1247
6824 1247 -2384 -4011 -1707 -7170 754 -1195 -5235 -13953 -22898 -21506 -14262 -4241 245 -4562 1848
$$ packed form
6927a2616P303P783O777J7614j028j4662k82o884L534P4j6975j956K560k983M97
6912a1244k209j2676l25J2577N746l975r512j045R832J0643l06K619R257J426
6898A0808j566N154J0555p858j3402p50q106j575O40m211m752Q357J69j3339o343
6883b6219J1609J1526k527r48j3000K436J0166r53l310R767r47o342N142N42l877
6868f935O348M577K969L542j902j4220j3074N663K2672J913j3532j4496L992J3288
6854H05R626r663k338R02K81J2393Q650j263k680j1359q902R52J0237j1956N871
6839A556J180o00k248J485m824J0481M608j2671q087L186J1790J097n27J956p135
6824A247l631j627K304n463P924j949m040q718q945J392P244J0021M486m807O410
$$ plain form
6809 1848 7943 -4334 -5820 -1420 -7820 170 3951 -6655 -11665 -6389 -1097 -3824 -2479 -3460 -6336
6794 -6336 -5816 -7670 -6975 -11123 -12831 -13923 -17609 -21085 -15542 -12098 -9462 -10831 -10516 -17843 -6482
6779 -6482 6107 10688 14398 -5356 -20038 -30664 -16003 -6703 5856 5542 -5669 784 -10909
6766 -10909 -10437 9097 19122 11546 -5885 -8178 -4342 -7496 -20069 -27997 -31516 -32347 -29880 -27045
6752 -27045 -20250 -5003 321 -8532 -28756 -42799 -32345 -8857 270 -1989 -5382 -13084 -8551
6739 -8551 3106 3767 -18017 -27309 -24577 -22045 -13569 -13184 -9955 -5881 -2839 -4004 -1163 13056 10966
6724 10966 5774 13240 19329 16660 7926 -13995 -29527 -24147 396 13218 8489 -4146 -21095
6711 -21095 -22138 -9956 -8110 -3889 -4350 -5042 -838 -1882 -7114 -12822 -2286 13415 6667 3401
$$ packed form
6809A848O095j2277j486M400o400P990L781j0606n010N276N292k727J345r81k876
6794f336N20j854O95m148j708j092l686l476N543L444K636j369L15p327J1361
6779f482J2589M581L710j9754j4682j0626J4661R300J2559l14j1211O453j1693
6766a0909M72J9534J0025p576j7431k293L836l154j2573p928l519q31K467K835
6752b7045O795J5247N324q853k0224j4043J0454K3488R127k259l393p702M533
6739h551J1657O61k1784r292K732K532Q476L85L229M074L042j165K841J4219k090
6724A0966n192P466O089k669q734k1921j5532N380K4543J2822m729j2635j6949
6711b1095j043J2182J846M221m61o92M204j044n232n708J0536J5701o748l266
$$ plain form
6697 3401 -6502 -849 5024 4946 16616 13387 6407 3418 1241 6038 2226 -13162 -15579 -13287 -5871
6682 -5871 -3263 -3917 -2831 -7730 -4923 -15204 -11994 2191 -868 -20035 -25968 -15397 -2110 4935
6668 4935 447 2 194 -3261 -8433 -13589 -13886 -3879 3560 10168 3990 0 1438 2301 -3366 -15260
6652 -15260 -16095 -16407 -23111 -16916 -17569 -18954 2280 9678 5526 16126 11227 9266 5791 -2808 10330
6637 10330 9942 1369 -6541 -177 -2284 -25029 -18307 -11723 -20106 -16707 -9565 -14379 -20944 -26884 -43583
6622 -43583 -43812 -44368 -33967 -13210 -2864 -4300 1523 -3167 6215 9206 627 -12214 -15302 -15668
6608 -15668 -8072 -177 -10550 -12440 2918 458 -8649 -8893 -11768 -15200 -9849 -10756 -5083 -5880 -11976
6593 -11976 -7495 -7757 -15798 -9275 -1054 -9662 -12243 -8823 -3891 146 5455 5808 -4742 -4680 -6535
$$ packed form
6697C401r903N653N873p8J1670l229o980k989k177M797l812j5388k417K292P416
6682e871K608o54J086m899K807j0281L210J4185l059j9167n933J0571J3287P045
6668D935m488m45J92l455n172n156k97J0007P439O608o178l990J438Q63n667j1894
6652a5260q35l12o704O195o53j385K1234P398m152J0600m899j961l475q599J3138
6637A0330l88q573p910O364k107k2745O722O584q383L399P142m814o565n940j6699
6622d3583k29n56J0401K0757J0346j436N823m690R382K991q579j2841l088l66
6608a5668P596P895j0373j890J5358k460r107k44k875l432N351r07N673p97o096
6593a1976M481k62q041O523Q221q608k581L420M932M037N309L53j0550O2j855
$$ plain form
6578 -6535 3375 -7752 -17705 -5182 4884 -3320 850 382 1854 -8406 -13611 -7511 -9651 -12767
6564 -12767 -9473 6669 19444 18495 5415 2009 6172 3159 5401 14738 14916 10929 19545 22071
6550 22071 17060 10618 4598 3816 4341 -740 9285 21751 16989 5821 21310 16535 -2076 -2713
6536 -2713 7178 10548 5960 -4638 -18956 -33481 -28125 -3583 8367 -5248 -23217 -25668 -22209
6523 -22209 -10109 -796 932 -4584 -8590 -4976 -10128 -11509 0 1185 -852 -6052 734 4881
6509 4881 6003 -1754 7393 15129 17498 17756 16280 -1161 -9574 146 10695 9841 3058 2876 165
6494 165 306 3013 139 -4905 -3976 2464 -1633 -3764 451 13077 19869 18814 -1421 -7428 -788
6479 -788 -2855 -7558 -6012 6701 8747 14956 10114 10457 17620 12095 14584 16888 3818 -5377 -15014
$$ packed form
6578f535R910j1127r953J2523J0066q204M170m68J472j0260n205O100k140l116
6564a2767L294J6142J2775r49j3080l406M163l013K242R337J78l987Q616K526
6550B2071n011o442o020p82N25n081J0025J2466m762j1168J5489m775j8611o37
6536b713R891L370m588j0598j4318j4525N356K4542J1950j3615j7969k451L459
6523b2209J2100R313J728n516m006L614n152j381J1509J185k037n200O786M147
6509D881J122p757R147P736K369K58j476j7441q413R720J0549q54o783j82k711
6494A65J41K707k874n044R29O440m097k131M215J2626O792j055k0235o007O640
6479g88k067m703J546J2713K046O209m842L43P163n525K489K304j3070r195r637
$$ plain form
6464 -15014 -7237 -6351 -7875 -11202 -1037 674 -5407 -1153 3859 9393 10657 4812 2592 16228
6450 16228 24029 19239 8805 -1501 -6187 -2694 1588 -8145 -12363 -11608 -7677 -8302 -4438 -1478 995
6435 995 -1003 -16307 -19751 -20280 -4712 -7195 -15519 -18544 -13725 -8070 -8674 -12506 -14668 -7477 -3931
6420 -3931 -5080 5853 6970 -14453 -23614 -15775 -10733 -17837 -7152 7679 2223 -9895 -27668
6407 -27668 -31674 -13293 278 8450 16039 9952 4940 2319 7625 -1893 -2044 -9142 -18425 -7434
6393 -7434 9818 16859 12567 12753 11299 4930 -11006 -25297 -41105 -41223 -33975 -34445 -37077 -25407
6379 -25407 -5940 -17696 -26349 -23867 -7940 -4248 -6813 -5232 -12702 -11887 -6755 -5656 -10613 -6996
6365 -6996 -428 -15618 -23474 -12281 4715 3963 -10922 589 10034 6218 8335 -1597 -7656 -7678
$$ packed form
6464a5014P777Q86j524l327J0165J711o081M254N012N534J264n845k220J3636
6450A6228P801m790j0434j0306m686L493M282r733m218P55L931o25L864K960K473
6435I95j998j5304l444n29J5568k483q324l025M819N655o04l832k162P191L546
6420c931j149J0933J117k1423r161P839N042p104J0685J4831n456j2118j7773
6407b7668m006J8381J3571Q172P589o087n012k621N306r518j51p098r283J0991
6393g434J7252P041m292J86j454o369j5936j4291j5808j18P248m70k632J1670
6379b5407J9467j1756q653K482J5927L692k565J581p470Q15N132J099m957L617
6365f996O568j5190p856J1193J6996p52j4885J1511R445l816K117r932o059k2
$$ plain form
6351 -7678 -17271 -8861 -6219 -2855 -20001 -19224 -12067 -9999 -4577 -2835 -9425 -9346 -4981 -6394 -4886
6336 -4886 -13562 -609 6550 171 121 5503 7090 9799 -1767 -9354 -6188 -91 6697 22237 9855
6321 9855 -131 -1873 -11871 -11744 3586 3899 5884 21915 35111 31780 26093 9384 7333 9807
6307 9807 14655 14209 25153 33692 27680 30406 35549 24441 8543 2725 -14500 -11020 -11770 -9457
6293 -9457 -11093 -8981 -3849 -10662 -11766 -20545 -21994 -5807 7996 16338 13321 14364 21784 18674
6279 18674 7639 7763 8634 9187 11066 15547 23354 16070 17544 5888 818 12783 22412 22567 24010
6264 24010 32100 8420 -6522 -9017 -3865 -246 -3397 -16646 -12941 -16322 -22033 -16178 -15870 -27059
6250 -27059 -31223 -18032 -2492 6195 8172 1196 -8308 -15670 -7661 -8484 -26855 -18104 -5821 -383
$$ packed form
6351g678r593Q410K642L364j7146P77P157K068N422J742o590P9M365j413J508
6336d886q676J2953P159o379n0N382J587K709j1566p587L166O097O788J5540j2382
6321I855r986j742r998J27J5330L13J985J6031J3196l331n687j6709k051K474
6307I807M848m46J0944Q539o012K726N143j1108j5898n818j7225L480p50K313
6293i457j636K112N132o813j104q779j449J6187J3803Q342l017J043P420l110
6279A8674j1035J24Q71N53J879M481P807p284J474j1656n070J1965R629J55J443
6264B4010Q090k3680j4942k495N152L619l151j3249L705l381n711N855L08j1189
6250b7059m164J3191J5540Q687J977o976r504p362Q009q23j8371Q751J2283N438
$$ plain form
6236 -383 -12592 -19585 -21016 -20672 -17989 2373 -532 1847 5810 -10781 -21260 -14744 -11781 -14054
6222 -14054 -22180 -29171 -29902 -27004 -16907 -8092 6260 13633 9698 7479 7739 14868 8307 6067 6591
6207 6591 12466 25599 18247 14101 15519 22297 19918 12483 7951 4532 -2925 1773 1577 -4847 -6873
6192 -6873 -12718 -12585 -15345 -5419 5050 13845 14891 -109 -350 537 -13566 -8301 6299 8881 9724
6177 9724 2696 -6128 -1294 -4939 -10204 -21361 -26716 -29876 -23469 -9923 -3770 -6411 -7781 5714
6163 5714 14890 14673 6468 6658 6799 -4795 -6786 2424 9454 22111 10395 -2724 -14960 -20923
6149 -20923 -10088 2178 -6706 -11554 -3920 -2137 -533 -1069 8007 4953 -2549 -16816 -31385 -30971
6135 -30971 -18133 -13044 -5521 2565 -2016 -17408 -23124 -11282 -2125 -4773 -15739 -12995 -7805 -5113
$$ packed form
6236c83j2209o993j431L44K683K0362k905K379L963j6591j0479O516K963k273
6222a4054q126o991p31K898J0097Q815J4352P373l935k219K60P129o561k240N24
6207F591N875J3133p352m146J418O778k379p435m532l419p457M698j96o424k026
6192f873n845J33k760R926J0469Q795J046j5000k41Q87j4103N265J4600K582Q43
6177I724p028q824M834l645n265j1157n355l160O407J3546O153k641j370J3495
6163E714R176k17q205J90J41j1594j991R210P030J2657j1716j3119j2236n963
6149b0923J0835J2266q884m848P634J783J604n36R076l054p502j4267j4569M14
6135c0971J2838N089P523Q086m581j5392n716J1842R157k648j0966K744N190K692
$$ plain form
6121 -5113 288 701 6240 11975 23623 37470 21820 7290 354 -4959 629 4431 19243 6782
6107 6782 1386 2121 1736 -2343 -7989 -588 -10893 -17396 -14569 -16373 -9025 -5371 -4949 -6419 6338
6092 6338 17401 8281 11434 6094 10091 15541 3994 2006 8409 1442 -8305 6749 16318 9832
6078 9832 2595 1232 833 -192 -6532 -6527 -822 3449 2632 -4393 -13037 -10397 -7168 -15071 -18335 -24566
6062 -24566 -19949 -8593 -2450 13599 23097 14893 1477 -12462 -14978 -18847 -23886 -12985 -2691
6049 -2691 6431 12030 16288 16744 18436 23626 20490 13798 4493 3131 8732 -2859 9353 17036 1989
6034 1989 -1767 1966 9960 8630 6135 -96 871 -2543 -2951 4036 5987 5439 3826 1276 7579 7496
6018 7496 15225 21007 13888 16907 5034 367 8417 9414 19346 9031 -2104 -587 -4326 -662
$$ packed form
6121e113N401M13N539N735J1648J3847j5650j4530o936n313N588L802J4812j2461
6107F782n396P35l85m079n646P401j0305o503K827j804P348L654M22j470J2757
6092F338J1063r120L153n340L997N450j1547j988O403o967r747J5054R569o486
6078I832p237j363l99j025o340NN705M271q17p025q644K640L229p903l264o231
6062b4566M617J1356O143J6049R498q204j3416j3939k516l869n039J0901J0294
6049b691R122N599M258M56J692N190l136o692r305j362N601j1591J2212P683j5047
6034A989l756L733P994j330k495o231R67l414m08O987J951n48j613k550O303q3
6018G496P729N782p119L019j1873m667Q050R97R932j0315j1135J517l739L664
$$ plain form
6004 -662 6732 8906 117 352 -5462 1940 6880 2140 -12380 -15383 -12028 -22579 -21308 -10340 858
5989 858 1584 -3540 -8359 -2044 -20987 -21474 -15793 -9655 -10247 -16111 -15424 -8330 -17 -3395 -5231 -18701
5973 -18701 -26724 -17791 -4804 -10109 -17173 -18074 -19398 -7191 1581 -2447 -16154 -25508 -20879 -21
5959 -21 491 4877 6267 3772 14425 13969 1088 -18436 -6740 5166 7147 9437 9657 5603 5554
5944 5554 6846 13493 22497 18635 12923 6501 6213 12457 8816 4402 1202 4359 -1433 1482 8929
5929 8929 2713 131 3416 2514 10565 10718 12252 -151 1894 6693 -1809 -4660 -14672 -21455 -27471
5914 -27471 -29361 -36126 -43669 -39652 -36586 -32011 -37316 -35005 -22134 -8871 -5380 7338 -3728 -12114
5900 -12114 -2645 1654 15768 9263 -8531 -15786 -9915 -5587 2137 -4789 -6475 -880 -3433 -3607
$$ packed form
6004f62P394K174q789K35n814P402M940m740j4520l003L355j0551J271J0968J1198
5989H58P26n124m819O315j8943m87N681O138n92n864O87P094Q313l378j836j3470
5973a8701q023Q933J2987n305p064r01j324J2207Q772m028j3707r354M629K0858
5959b1N12M386J390k495J0653m56j2881j9524J1696J1906J981K290K20m054m9
5944E554J292O647R004l862n712o422k88O244l641m414l200L157n792K915P447
5929H929o216k582L285r02Q051J53J534j2403K045M799q502k851j0012o783o016
5914b7471j890o765p543M017L066M575n305K311J2871J3263L491J2718j1066q386
5900a2114R469M299J4114o505j7794p255N871M328P724o926j686N595k553j74
$$ plain form
5886 -3607 -4182 -1079 1695 2493 4680 4655 5080 3969 1196 -820 -423 -10076 -16373 -16784 -17240 -8473 -2821
5869 -2821 -5862 -11389 -9000 -183 -1874 13378 19701 11593 6975 3900 -1672 -15609 -19889 -21802
5855 -21802 -19160 -17996 -18573 -17117 -17200 -10065 -5705 -7925 3715 4147 11144 8861 -10607 -25391 -28143
5840 -28143 -30862 -21128 -17846 -25656 -23531 -17767 -8396 -2679 -7373 -18659 -24979 -11160 -12541 -520
5826 -520 9465 14968 15013 17054 4078 -2712 -6822 -6160 -6432 -2594 -6742 3780 11670 5668 -11491
5811 -11491 -23602 -27430 -18304 -20352 -27903 -17666 -13396 -9940 -10955 -7600 -12112 -1825 9224 -1083
5797 -1083 -8744 -2945 -1113 -9735 -7876 -4812 -8879 3901 910 7360 12048 5972 1019 2224 12804
5782 12804 15365 12026 3817 -443 2440 6048 2389 -2750 -4758 -11488 -5655 5907 7199 -11012
$$ packed form
5886c607n75L103K774P98K187k5M25j111k773k016L97r653o297m11m56Q767N652
5869b821l041n527K389Q817j691J5252O323q108m618l075n572j3937m280j913
5855b1802K642J164n77J456q3P135M360k220J1640M32O997k283j9468j4784k752
5840b8143k719R734L282p810K125N764R371N717m694j1286o320J3819j381J2021
5826e20R985N503M5K041j2976o790m110O62k72L838m148J0522P890o002j7159
5811a1491j2111l828R126k048p551J0237M270L456j015L355m512J0287J1049j0307
5797a083p661N799J832q622J859L064m067J2780k991O450M688o076m953J205J0580
5782A2804K561l339q209m260K883L608l659n139k008o730N833J1562J292j8211
$$ plain form
5768 -11012 -20083 -20463 -10182 -16294 -17205 -14334 -18039 -10029 8693 6114 -5856 -12470 -12389 13052 22678
5753 22678 18463 12176 15914 7893 -7365 -15040 -9186 703 952 20872 17583 14050 3342 -6364
5739 -6364 -14582 -16258 -9247 -2555 12884 3076 -19651 -28066 -25172 -19498 -4139 -2018 -6571 3477
5725 3477 -4572 -17040 -11700 -7360 -7236 -1088 1224 -13393 -10778 -16784 -23279 -27014 -21621 -22713 -10077
5710 -10077 -14946 -8602 752 -6010 -5297 1790 -553 -13463 -7199 1786 5502 -2482 -2377 -2703 174
5695 174 3637 8242 451 1152 11042 14812 -1043 -16382 -15600 -11136 -7106 -4186 -7557 -596 891
5680 891 -12088 -5845 -7062 -14489 -15918 -19116 -16413 -13323 -7464 -3657 -3509 -3172 -4454 -6337 -6221 -6453
5664 -6453 705 4083 -1609 124 -4836 -7756 -9926 5328 4795 8217 10479 1202 -3246 585 3637
$$ packed form
5768a1012r071l80J0281o112r11K871l705Q010J8722k579j1970o614Q1K5441R626
5753B2678m215o287L738q021j5258p675N854R889K49J9920l289l533j0708r706
5739f364q218j676P011O692J5439r808k2727q415K894N674J5359K121m553J0048
5725C477q049j2468N340M340J24O148K312j4617K615o006o495l735N393j092J2636
5710a0077m869O344R354o762P13P087k343j2910O264Q985L716p984J05l26K877
5695A74L463M605p791P01R890L770j5855j5339P82M464M030K920l371O961J487
5680H91j2979O243j217p427j429l198K703L090N859L807J48L37j282j883J16k32
5664f453P158L378n692J733m960k920k170J5254n33L422K262r277m448L831L052
$$ plain form
5649 3637 9640 5814 -8067 -7001 8264 2101 -8019 -19664 -25468 -28329 -18078 -10170 -3924 -11218
5635 -11218 -16311 -6656 2148 13258 10793 3487 5782 19453 13477 2468 -4093 -6986 9328 19579
5621 19579 22704 21132 1121 9858 26076 27981 26967 4244 -4763 -17306 -12698 -23382 -39670
5608 -39670 -24967 -5640 -2415 -120 -11478 -15031 -22964 -11329 8540 21317 23666 10873 1020
5595 1020 -637 9540 11280 -277 387 -13409 -18945 -20458 -20316 -9083 -3262 -2059 -3586 -10858
5581 -10858 -8837 -7423 -1346 -1382 1672 -7879 2053 8827 -3849 -15544 -29079 -22870 -17025 -17395 -7492
5566 -7492 3429 3325 9587 12506 13817 12279 3646 6990 7749 -6322 -30556 -33159 -22469 -17964
5552 -17964 -5122 -6429 -19804 -24032 -14473 -3400 981 4887 13815 10411 10903 11379 14092 11260
$$ packed form
5649C637O003l826j3881J066J5265o163j0120j1645n804k861J0251P908O246p294
5635a1218n093R655Q804J1110k465p306K295J3671n976j1009o561k893J6314J0251
5621A9579L125j572k0011Q737J6218J905j014k2723r007j2543M608j0684j6288
5608c9670J4703J9327L225K295j1358l553p933J1635J9869J2777K349j2793r853
5595A020j657J0177J740j1557O64j3796n536j513J42J1233N821J203j527p272
5581a0858K021J414O077l6L054r551R932O774j2676j1695j3535O209N845l70R903
5566g492J0921j04O262K919J311j538q633L344P59j4071k4234k603J0690M505
5552a7964J2842j307j3375m228R559J1073M381L906Q928l404M92M76K713k832
$$ plain form
5538 11260 19366 25519 19312 15527 -2469 -10515 -4764 2704 6098 5562 19270 18515 6499 -5460
5524 -5460 -389 2417 1459 2638 7011 -3511 -8497 -5869 -8316 -5354 4412 7467 1240 -5872 -8481
5509 -8481 -9168 -11960 -5471 4227 -992 -11067 -13942 -1815 8752 8439 5041 -3983 324 -5719 -11314
5494 -11314 -20825 -14061 -2467 3775 -2466 -3210 4466 2794 7934 10764 8904 7285 852 8504 5808
5479 5808 474 -4296 -10694 -24345 -27268 -24606 -18071 -8745 -5097 -1312 6600 -2464 -14308 -17119
5465 -17119 -4818 -9570 -22522 -15306 -6692 -2128 -9829 -6279 -11293 -18829 -20432 -20093 -18902 -11073
5451 -11073 -2386 2530 -1556 -1800 -13 2457 2496 -1011 -5113 -6368 -10312 -16657 -14010 -4129 -8209
5436 -8209 -18571 -8229 -2615 -14353 -10557 -6252 -6380 263 8249 2613 -3147 -17044 -16171 -12194
$$ packed form
5538A1260Q106O153o207l785j7996q046N751P468L394n36J3708p55j2016j1959
5524e460N071K806r58J179M373j0522m986K628k447K962R766L055o227p112k609
5509h481o87k792O489R698n219j0075k875J2127J0567l13l398r024M307o043n595
5494a1314r511O764J1594O242o241p44P676j672N140K830j860j619o433P652k696
5479E808n334m770o398j3651k923K662O535R326L648L785P912r064j1844k811
5465a7119J2301m752j2952P216Q614M564p701L550n014p536j603L39J191P829
5451a1073Q687M916m086k44J787K470L9l507m102j255l944o345K647R881m080
5436h209j0362J0342N614j1738L796M305j28O643P986n636n760j3897Q73L977
$$ plain form
5422 -12194 -318 15767 17775 2549 804 7773 17449 13855 14546 -5674 -14072 -15240 -5571 -2371
5408 -2371 6082 8788 2991 6669 4931 4618 5099 15834 10327 9373 2197 -16585 -16064 -15208 -16690 -14730
5392 -14730 -21249 -25820 -34903 -22838 -18923 -16233 -9261 -12367 -7770 -1274 -7869 -13618 -16182 -15118
5378 -15118 -6982 4114 2404 2386 13334 12237 7773 -3615 -28734 -23508 -13870 -5292 -3195 4970
5364 4970 10215 9061 2218 8572 17820 15755 11261 -10491 -31180 -46372 -45301 -32893 -29974 -27825
5350 -27825 -10879 -89 -8454 -11545 -2121 -11393 -15031 -8932 -6016 -20009 -15922 -11618 -10774 -5458
5336 -5458 -8068 -9918 -9283 -11408 -21397 -9061 4454 9143 8177 -3863 -2775 -5 -1071 1422 -2924
5321 -2924 -6172 6051 6522 1235 9621 14742 10444 1687 -9869 -21276 -17378 2153 -1494 -8256
$$ packed form
5422a2194J1876J6085K008j5226j745O969R676l594O91k0220q398j168R669L200
5408b371Q453K706n797L678j738l13M81J0735n507r54p176j8782N21Q56j482J960
5392a4730o519m571r083J2065L915K690O972l106M597O496o595n749k564J064
5378a5118Q136J1096j710j8J0948j097m464j1388k5119N226R638Q578K097Q165
5364D970N245j154o843O354R248k065m494k1752k0689j5192J071J2408K919K149
5350b7825J6946J0790q365l091R424r272l638O099K916j3993M087M304Q44N316
5336e458k610j850O35k125r989J2336J3515M689r66j2040J088K770j066K493m346
5321b924l248J2223M71n287Q386N121m298q757j1556j1407L898J9531l647o762
$$ plain form
5307 -8256 -8850 -10781 1286 6159 -6199 -7189 4714 -4003 -10853 -16885 -22870 -9557 -299 -9149
5293 -9149 -17019 602 9215 5295 -3625 -11041 -10226 -22578 -21833 -7808 -5807 -15020 -6395 -4721 -12323
5278 -12323 -16986 -28537 -30863 -34248 -42919 -31038 -20633 -18477 -15216 -25615 -27975 -24929 -21297 -10696
5264 -10696 -5109 342 -11086 -12487 -7655 -10280 -15182 -25864 -19442 -11615 -2214 5484 9789 17476
5250 17476 4075 -5779 -16194 -10818 -1838 -3665 -9136 4698 4006 5738 8595 5838 -1283 6331
5236 6331 10979 13701 2846 -7632 -14953 -13817 -14262 -9580 -4870 1719 -4609 -7647 -5620 -1099 3610
5221 3610 -8996 -19227 -19685 -25581 -24731 -22137 -16243 -11846 -6171 669 -1108 4388 21070 16604 14794
5206 14794 11910 7933 -5189 -5861 561 -6291 -7610 -17867 -13715 -5499 -6094 -1751 -2765 -14519
$$ packed form
5307h256n94j931J2067M873j2358r90J1903q717o850o032n985J3313R258q850
5293i149p870J7621Q613l920q920p416Q15j2352P45J4025K001r213Q625J674p602
5278a2323m663j1551k326l385q671J1881J0405K156L261j0399k360L046L632J0601
5264a0696N587N451j1428j401M832k625m902j0682O422P827R401P698M305P687
5250A7476j3401r854j0415N376Q980j827n471J3834o92J732K857k757p121P614
5236F331M648K722j0855j0478p321J136m45M682M710O589o328l038K027M521M709
5221C610j2606j0231m58n896Q50K594N894M397N675O840j777N496J6682m466j810
5206A4794k884l977j3122o72O422o852j319j0257M152Q216n95M343j014j1754
$$ plain form
5192 -14519 -19612 -4192 2469 -1418 1221 -71 -7165 -5839 -927 9817 16554 17803 -913 -7993
5178 -7993 -1611 5059 10272 9394 -3401 2737 6390 2720 -3554 2746 3156 -1522 1048 1849 -6237
5163 -6237 -9591 -10195 -13305 -17577 -16784 -7938 -4695 7152 12038 10073 6581 6478 9342 7850 -3894
5148 -3894 4404 15435 7959 4975 -7507 -25422 -14953 -5690 -1999 -12137 -15188 -3398 -5986
5135 -5986 -26194 -19383 -2032 2086 65 -20605 -27413 -37068 -37017 -23647 -9537 -644 1635 8419
5121 8419 8974 -428 -7165 -6563 18844 27003 21349 24212 26320 11183 -9745 -14614 -4428 4370
5107 4370 -2832 -9338 -7101 -2271 7575 14567 12158 -1485 4535 4949 6978 8194 3460 -1765 8093
5092 8093 22352 10173 -9110 -9659 -1583 -9445 -15424 -18376 -6976 -4128 -7596 -13828 -9407 -8623
$$ packed form
5192a4519n093J5420O661l887K639j292p094J326M912J0744O737J249j8716p080
5178g993O382O670N213q78j2795O138L653l670o274O300M10m678K570Q01q086
5163f237l354o04l110m272P93Q846L243J1847M886j965l492j03K864j492j1744
5148c894Q298J1031p476k984j2482j7915J0469R263L691j0138l051J1790k588
5135e986k0208O811J7351M118k021k0670o808r655N1J3370J4110Q893K279O784
5121H419N55r402o737O02K5407Q159n654K863K108j5137k0928m869J0186Q798
5107D370p202o506K237M830R846O992k409j3643O020M14K029J216m734n225R858
5092H093J4259j2179j9283n49Q076p862n979k952J1400K848l468o232M421P84
$$ plain form
5078 -8623 -13183 -13496 -6811 -4918 -7213 -1493 3518 -873 6178 -6144 -28877 -25639 -21305 -17235 -6962
5063 -6962 -3836 -3512 -433 -17 187 -2906 1692 149 -9202 -13476 -13547 784 14869 19877 16106 10111
5047 10111 4472 2279 13201 9729 -4710 -11734 -11461 -21056 -24883 -22148 -18131 -6354 -4389 -4307 -9973
5032 -9973 -7707 4382 13037 10764 1362 -306 628 12610 19594 11731 13024 13471 -6736 -5677 -8803
5017 -8803 -9251 2863 9030 -6747 -18240 -24704 -13987 -2405 3308 -2813 -3237 -14497 -16274 -13903
5003 -13903 -3323 -14202 -9828 2839 18689 18785 12624 13501 13578 11666 4941 2639 6001 -6835 -9228
4988 -9228 -4721 -538 6506 7888 1035 17865 20216 25596 7564 -2083 6017 4715 4345 6019 12062
4973 12062 22199 24994 25118 29649 22031 16745 13470 15810 10523 -4194 -9890 -15798 -11906 -8038
$$ packed form
5078h623m560l13O685J893k295N720N011m391P051j2322k2733L238M334M070J0273
5063f962L126L24L079M16K04l093M598j543r351m274p1J4331J4085N008l771n995
5047A0111n639k193J0922l472j4439p024K73r595l827K735M017J1777J965Q2n666
5032i973K266J2089Q655k273r402j668R34J1982O984p863J293M47k0207J059l126
5017h803m48J2114O167j5777j1493o464J0717J1582N713o121m24j1260j777K371
5003a3903J0580j0879M374J2667J5850R6o161Q77P7j912o725k302L362j2836k393
4988i228M507M183P044J382o853J6830K351N380j8032r647Q100j302l70J674O043
4973A2062J0137K795J24M531p618n286l275K340n287j4717n696n908L892L868
$$ plain form
4959 -8038 -20693 -7395 -2450 1880 -5216 -6693 3380 12155 19470 10924 6510 3066 -6391 -9936
4945 -9936 -13701 -15654 -6911 -7509 -8913 1281 9286 -5844 -14082 -4668 3754 -3195 1310 6155 7695
4930 7695 8145 3436 -10270 -12427 -6212 5325 14829 4350 -9282 -24975 -14816 -10454 -7829 -15502
4916 -15502 -11108 9988 21492 20497 24325 23063 21556 21110 16821 18214 21457 12459 6167 8383 9903
4901 9903 -1236 -10743 3047 12388 5335 -10704 -19118 -11883 -8274 287 8545 20692 17968 5907
4887 5907 -2473 -8220 1766 9409 2956 5681 18688 20527 10523 6964 8243 -4813 -2743 989
4873 989 6410 4013 355 -809 -4375 -17850 -7951 5886 4939 -6086 -6045 -5748 1912 20125 17898
4858 17898 8434 -175 -4218 -1189 -12093 -12517 -7026 90 -8050 -17543 -23075 -23926 -8005 5555
$$ packed form
4959h038j2655J3298M945M330p096j477J0073Q775P315q546m414l444r457l545
4945i936l765j953Q743n98j404J0194Q005j5130q238R414Q422o949M505M845J540
4930G695M50m709j3706k157O215J1537R504j0479j3632j5693J0159M362K625p673
4916a5502M394K1096J1504r95L828j262j507m46m289J393L243q998o292K216J520
4901I903j1139r507J3790R341p053j6039q414P235L609Q561Q258J2147k724j2061
4887E907q380n747R986P643o453K725J3007J839j0004l559J279j3056K070L732
4873I89N421k397l658j164l566j3475R899J3837r47j1025M1K97P660J8213k227
4858A7898r464q609m043L029j0904m24N491P116q140r493n532q51J5921J3560
$$ plain form
4844 5555 13095 14879 11304 3304 -9461 -6838 -4655 -5018 -229 -14942 -17991 -4737 -448 -1162 4667
4829 4667 18240 15926 10561 8695 3825 7720 16424 17747 14115 16719 11451 2997 1439 -10695
4815 -10695 -14203 -8920 -6762 -10692 -9921 -9572 -6620 -5295 2411 1307 -122 7391 14733 19503 16512
4800 16512 5090 14008 25359 18376 4608 8577 746 -8494 216 6378 18188 27255 22642 9862
4786 9862 1392 -5016 -4282 -1236 -2165 -7677 -3204 -11552 -12024 -14691 -20157 -22272 -15156 -12841 -11489 -17365
4770 -17365 -11941 7187 9177 1873 1332 -304 -40 2092 -116 -6667 -7654 -12326 -5165 6474 6483 2840
4754 2840 -11140 -22988 -19864 -16149 -11193 -7187 4050 3399 4700 9919 20020 8560 5974 5821
4740 5821 6483 6153 2574 12755 15809 12334 3049 2787 12232 9838 7667 9813 6659 -14477 -23278
$$ packed form
4844E555P540J784l575q000j2765K623K183l63M789j4713l049J3254M289p14N829
4829D667J3573k314n365j866m870L895Q704J323l632K604n268q454j558j2134
4815a0695l508N283K158l930P71L49K952J325P706j104j429P513P342M770k991
4800A6512j1422Q918J1351o983j3768L969p831r240Q710O162J1810R067m613j2780
4786I862q470o408P34L046r29n512M473q348m72k667n466k115P116K315J352n876
4770a7365N424J9128J990p304n41j636K64K132k208o551r87m672P161J1639Rl643
4754B840j3980j1848L124L715M956M006J1237o51J301N219J0101j1460k586j53
4740E821O62l30l579J0181L054l475r285k62R445k394k171K146l154k1136q801
$$ plain form
4725 -23278 -8330 5720 12422 11459 11534 5396 2736 -12265 -3063 14011 9709 7944 8372 11634 9432
4710 9432 1533 1539 4204 6289 1481 9910 9399 14777 14565 11522 6591 8207 9254 -228 4555 8900
4694 8900 -693 3338 6375 101 -8451 -7353 3154 -4229 -10754 -9078 -4418 -16931 -20109 -11670
4680 -11670 2883 10171 9396 -4924 -13305 -14899 -9318 -4507 3359 6103 -10982 -19502 -28336 -22831
4666 -22831 -13124 -9132 -5202 -4640 -7196 1674 4096 -6107 -25307 -32128 -18305 -8120 -14635 -18123
4652 -18123 -5296 4872 17763 18148 2989 942 3686 2037 2558 -3026 -11795 -5098 -16698 -20723
4638 -20723 -15812 -9916 -7066 -15193 -2550 6681 22713 28846 31074 31310 21288 4928 1947 -1421
4624 -1421 6928 7018 -1894 -23912 -29844 -26063 -22159 -18409 -19942 -6420 -2908 -12428 -9776 -27482 -30451
$$ packed form
4725b3278J4948J4050O702r63P5o138k660j5001R202J7074m302j765M28L262k202
4710I432p899OK665K085m808Q429n11N378k12l043m931J616J047r482M783M345
4694H900r593M031L037o274q552J098J0507p383o525J676M660j2513l178Q439
4680a1670J4553P288p75j4320q381j594N581M811P866K744j7085q520q834N505
4666b2831R707L992L930N62k556Q870K422j0203j9200o821J3823J0185o515l488
4652a8123J2827J0168J2891L85j5159k047K744j649N21n584q769O697j1600m025
4638b0723M911N896K850q127J2643R231J6032O133K228K36j0022j6360k981l368
4624a421Q349R0q912k2018n932L781L904L750j533J3522L512r520K652j7706k969
$$ plain form
4609 -30451 -21779 -17483 -8750 -8394 -13519 -8357 -6923 -13661 -11962 -4517 4979 16746 18959 14232 6972
4594 6972 -4141 -8207 -9125 -5506 -12999 -15917 -16283 -16052 -22956 -20443 -772 -373 -567 -2274 -7046 -12934
4578 -12934 -14108 -16840 -25285 -25230 -20898 -10709 -286 15363 10476 6224 2541 -564 2457 2719 -6211
4563 -6211 -10659 -8732 -7122 106 2456 -3597 -10715 -14656 -18914 -18616 -16077 -7322 -9628 -10179 -1569
4548 -1569 -89 1868 12247 -132 -7555 -4487 3712 -1673 -28990 -28080 -5713 -7195 -5305 -2097
4534 -2097 427 -5128 1981 1174 -1031 -2902 -9634 -19833 -13936 -6319 -14700 -19098 -21261 -8443 -9454
4519 -9454 -7424 -6295 -13433 -16388 -9430 -8313 -9121 -35 114 -1693 -4714 1183 -9292 -11494 566
4504 566 18471 26741 5407 -7634 -2969 -7015 -8405 -8694 -6130 1907 -3661 -9515 -13207 -458
$$ packed form
4609c0451Q672M296Q733L56n125N162J434o738J699P445R496J1767K213m727p260
4594F972j1113m066r18L619p493k918l66K31o904K513J9671L99j94j707m772n888
4578a2934j174k732q445N5M332J0189J0423J5649m887m252l683l105L021K62q930
4563f211m448J927J610P228K350o053p118l941m258K98K539Q755k306n51Q610
4548a569J480J957J0379j2379p423L068Q199n385k7317R10K2367j482J890L208
4534b097K524n555P109q07k205j871o732j0199N897P617q381m398k163J2818j011
4519i454K030J129p138k955O958J117q08R086J49j807l021N897j0475k202J2060
4504E66J7905Q270k1334j3041M665m046j390k89K564Q037n568n854l692J2749
$$ plain form
4490 -458 3035 10485 10501 6914 2463 -5197 2224 6317 8483 11061 11117 6271 197 -3861 -10326 -7933
4474 -7933 898 -2178 -5076 -3219 -5077 -8783 2030 4329 1230 5215 1840 -6168 -5317 -8495 -11748
4459 -11748 -16706 -28624 -21136 -16235 -9571 -1696 4093 10624 7868 -5944 4793 8685 -858 429
4445 429 16790 10680 10831 6677 13973 13200 21727 25308 17830 23087 22172 15409 11911 2542 2090 18509
4429 18509 20718 16460 7334 9509 12916 6418 3535 16345 15502 20006 15842 16804 16902 3319 -5555
4414 -5555 -9057 -8936 -23988 -15849 -6930 -4377 -2227 -7512 -2444 216 -870 -654 3772 6671 16403
4399 16403 12108 14503 20191 15748 -602 -6204 5282 8510 -2492 -7151 1525 555 7549 11841
4385 11841 5674 -9460 -14851 -15521 -12787 -6025 -10955 -14695 -6995 -4147 -17011 -24341 -22093 -16144
$$ packed form
4490d58L493P450J6l587m451p660P421M093K166K578N6m846o074m058o465K393
4474g933Q831l076k898J857j858l706J0813K299l099L985l375q008Q51l178l253
4459a1748m958j1918P488M901O664P875N789O531k756j3812J0737L892r543J287
4445D29J6361o110J51m154P296p73Q527L581p478N257r15o763l498r369m52J6419
4429A8509K209m258r126K175L407o498k883J2810q43M504m164R62R8j3583q874
4414e555l502J21j5052Q139Q919K553K150n285N068K660j086K16M426K899R732
4399A6403m295K395N688m443j6350n602J1486L228j1002m659Q676r70O994M292
4385A1841o167j5134n391o70K734O762m930l740P700K848j2864p330K248N949
$$ plain form
4371 -16144 -16903 -21543 -23111 -18959 -3163 3148 14651 1649 -5661 -13647 -7869 -11283 -6203 -13273
4357 -13273 -24664 -21302 -14756 -21475 -28063 -10006 12254 21391 25147 29361 7635 -16818 -24423
4344 -24423 -14453 -9915 -3908 -4165 -8882 -1090 -11737 -26508 -25135 -14494 -13131 -14345 -13526 -9479
4330 -9479 -5789 2195 -768 -5300 7500 5427 -9142 6260 18647 3361 -16414 -23294 -13455
4317 -13455 -11992 -13537 1125 3415 8282 7488 11117 23731 13721 5917 14798 23120 21919 -2442
4303 -2442 -14941 -9927 -14691 -6593 8308 11398 13667 7138 -3340 -4032 -1259 4581 8301 2074
4289 2074 -7338 -3094 -20789 -30833 -31402 -27086 -14466 -9068 -6946 -12827 -18920 -22124 -13553 -14262 -4661
4274 -4661 -7076 -9226 6640 13653 7663 9879 12257 10223 5987 8613 2538 4706 7543 6347 9962
$$ packed form
4371a6144p59m640j568M152J5796O311J1503j3002p310p986N778l414N080p070
4357a3273j1391L362O546o719o588J8057K2260R137L756M214k1726k4453p605
4344b4423R970M538O007k57m717P792j0647j4771J373J0641J363j214Q19M047
4330i479L690P984k963m532J2800k073j4569J5402J2387j5286j9775o880R839
4317a3455J463j545J4662K290M867p94L629J2614j0010p804Q881Q322j201k4361
4303b442j2499N014m764Q098J4901L090K269o529j0478o92K773N840L720o227
4289B074r412M244j7695j0044n69M316J2620N398K122n881o093l204Q571p09R601
4274d661k415k150J5866P013n990K216K378k034m236K626o075K168K837j196L615
$$ plain form
4259 9962 10739 -433 -6333 -9930 -8354 -18450 -17941 -4027 2143 5839 -474 7101 7842 6562 7357
4244 7357 -3275 -7642 -2549 -4146 -1651 6633 -1645 -1947 1713 14079 13600 11432 14525 10772 15236
4229 15236 23341 14614 -532 -2334 -5353 3459 -1436 -7550 -9650 -11998 -1264 -7419 -12323 -1407
4215 -1407 1668 -8066 -6064 5892 -3662 -19002 -23909 -25204 -17112 -9540 2823 10305 5379 9207
4201 9207 17235 19885 21695 10671 -574 3093 11399 4918 3283 -4946 -7372 1937 -2805 -2106 -402
4186 -402 1706 885 -8569 -9495 -16899 -22366 -29637 -25119 -10140 4262 14673 10921 -2522 -19610
4172 -19610 -28436 -14873 -3820 -14143 -15009 -10217 -18183 -22294 -22802 -23715 -16978 -4007 -7328 -5845
4158 -5845 -5040 -5670 -2834 8203 10273 4953 5225 4375 -3903 7623 8085 -284 -4226 -11152 -9829 1104
$$ packed form
4259I962P77j1172n900l597J576j0096N09J3914O170L696o313P575P41j280P95
4244G357j0632m367N093j597K495Q284q278l02L660J2366m79k168L093l753M464
4229A5236Q105q727j5146j802l019Q812m895o114k100k348J0734o155m904J0916
4215a407L075r734K002J1956r554j5340m907j295Q092P572J2363P482m926L828
4201I207Q028K650J810j1024j1245L667Q306o481j635q229k426R309m742O99J704
4186d02K108q21r454r26p404n467p271M518J4979J4402J0411l752j3443j7088
4172a9610q826J3563J1053j0323q66M792p966m111n08r13O737J2971l321J483
4158e845Q05o30K836J1037K070n320K72q50q278J1526M62q369l942o926J323J0933
$$ plain form
4142 1104 6679 13113 6356 13912 21349 19395 14128 16581 12763 4710 2363 17832 18992 11689 5437
4127 5437 12267 19374 15925 -2659 -3982 -714 -8877 -6156 -6886 -1364 6671 -4725 -15014 -12060
4113 -12060 -10624 -5026 -7323 -5270 -12101 -13206 -5180 7487 5728 4935 1001 4038 5943 3772 1006
4098 1006 -2430 -910 -977 5231 1240 338 -1497 -12073 1318 18875 21124 13835 -510 -6236 -9108
4083 -9108 -12301 -15212 -19015 -14674 -9080 -3965 -5166 -20837 -18406 -2347 6125 8376 13251 1557
4069 1557 -8014 5046 16851 26185 11729 7419 414 -1634 -1824 -3379 -2935 11797 14029 14639 7139
4054 7139 -2793 -7276 882 347 -6693 -2853 3533 -4332 -3745 20 7787 8599 9943 4614 -16818
4039 -16818 -21841 -27796 -14372 1625 9848 23599 21971 13980 5804 -7594 -9641 -2313 23751
$$ packed form
4142A104N575O434o757P556P437j954n267K453l818q053k347J5469J160p303o252
4127E437O830P107l449j8584j323L268q163K721p30N522Q035j1396j0289K954
4113a2060J436N598k297K053o831j105Q026J2667j759p93l934L037J905k171k766
4098A006l436J520o7O208l991r02j835j0576J3391J7557K249p289j4345n726k872
4083i108l193k911l803M341N594N115j201j5671K431J6059Q472K251M875j1694
4069A557r571J3060J1805R334j4456m310p005k048j90j555M44J4732K232O10p500
4054G139r932m483Q158n35p040L840O386p865N87L765P767Q12J344n329k1432
4039a6818n023n955J3424J5997Q223J3751j628p991q176j3398k047P328K6064
$$ plain form
4026 23751 33578 19405 4688 -165 -5880 -10215 4081 1918 2769 8690 11279 -2778 -14504 -22443
4012 -22443 -3017 9963 5872 -10167 -15074 -12592 -8325 -15743 -9816 3512 11330 15990 10180 2036
3998 2036 -3718 -6793 -6666 -4237 3761 23280 23511 22574 19828 6960 -4313 -3999 10168 17939 11601
3983 11601 16121 8392 -2583 -15413 -4485 1247 12576 17316 7663 -1512 -6236 4606 12125
3970 12125 7169 9792 17785 16870 16911 28590 20064 15183 10455 4373 9936 5094 8852 5487 -6265
3955 -6265 -9566 -1456 2471 -1435 -9143 -14043 -23074 -14220 -616 11974 9240 -737 -1701 -4523 -852
3940 -852 720 239 11811 25135 16337 791 -7874 -11544 -8947 -19917 -17173 -19189 -16192 -9023
3926 -9023 792 4274 -448 -9510 -7412 -5916 -6716 -7055 592 8016 10879 8504 -2543 -12349 -1697
$$ packed form
4026B3751R827j4173j4717m853n715m335J4296k163Q51N921K589j4057j1726p939
4012b2443J9426J2980m091j6039m907K482M267p418N927J3328P818M660n810q144
3998B036n754l075J27K429P998J9519K31r37k746j2868j1273L14J4167P771o338
3983A1601M520p729j0975j2830J0928N732J1329M740r653r175m724J0842P519
3970A2125m956K623P993r15M1J1679q526m881m728o082N563m842L758l365j1752
3955f265l301Q110L927l906p708m900r031Q854J3604J2590k734r977r64k822L671
3940h52J572m81J1572J3324q798j5546q665l670K597j0970K744k016K997P169
3926i023R815L482m722r062K098J496q00l39P647P424K863k375j1047r806J0652
$$ plain form
3911 -1697 8623 2805 -2319 -2526 -1165 1846 -2408 -4955 2357 11251 -14056 -31927 -34630 -34426 -18157
3896 -18157 -9561 -6507 -5069 -9627 -18792 -14530 -11740 -14053 -2515 -1434 -4325 -4976 -11080 -10305 -16597
3881 -16597 -10451 2592 -3284 -5671 4193 23683 36098 33653 16640 7442 1786 -10563 -9240
3868 -9240 1828 15748 8617 17254 35978 35895 18983 16527 12630 -2208 -2339 13335 7370 5185
3854 5185 18006 14876 5791 -5150 -17144 -12030 -4187 6288 16321 6280 -8581 50 4532
3841 4532 14249 15606 17797 11074 10486 15414 9398 4416 -1687 -13583 -16097 2585 7143 5401 17542
3826 17542 1882 -12966 -24581 -12138 -2524 89 2842 9473 510 -4059 -1811 2152 5914 1084
3812 1084 -5329 -6712 -1671 -2055 -2402 -5374 -18715 -15874 -20716 -13693 -10746 -11618 -7254 5498 3336
$$ packed form
3911a697J0320n818n124k07J361L011m254k547P312Q894k5307j7871k703K04J6269
3896a8157Q596L054J438m558r165M262K790k313J1538J081k891o51o104P75o292
3881a6597O146J3043n876k387R864J9490J2415k445j7013r198n656j2349J323
3868i240J1068J3920p131Q637J8724q3j6912k456l897j4838j31J5674n965k185
3854E185J2821l130r085j0941j1994N114P843J0475J0033j0041j4861Q631M482
3841D532R717J357K191o723n88M928o016m982o103j1896k514J8682M558j742J2141
3826A7542j5660j4848j1615J2443R614K613K753O631q963m569K248L963L762m830
3812A084o413j383N041l84l47k972j3341K841m842P023K947q72M364J2752k162
$$ plain form
3797 3336 2878 8174 6577 11510 8754 7430 701 -6423 8101 23916 7934 -4519 -15408 -35298
3783 -35298 -21643 -18101 -18594 -10333 -20929 -17223 480 7507 -716 -9887 -24690 -17800 -2432 -2374
3769 -2374 3753 19690 24809 21963 10195 11061 11856 1152 2289 -4206 206 466 -6197 -1133 8599
3754 8599 3620 -5309 2478 7531 4526 -12696 -20951 -22579 -14762 -5619 3316 5384 -220 -6798 -2718
3739 -2718 -5498 -14454 -7750 -15934 -20644 -21928 -23910 -24233 -18550 -7132 -10686 -13945 -12812 -10419 -16110
3724 -16110 -24047 -12586 -6832 397 10348 16385 11159 10419 12044 795 -10575 -8875 -12908 -6210
3710 -6210 -21110 -24392 -18955 -17333 -14199 -13947 -22387 -17952 -9698 -3733 -7724 -18058 -24815 -19581 -25855
3695 -25855 -18396 -4647 -343 -10901 -9683 -2949 4840 9830 7738 1429 -1647 1091 3334 -19546
$$ packed form
3797C336m58N296j597M933k756j324o729p124J4524J5815j5982j2453j0889j9890
3783c5298J3655L542m93Q261j0596L706J7703P027q223r171j4803O890J5368N8
3769b374O127J5937N119k846j1768Q66P95j0704J137o495M412K60o663N064R732
3754H599m979q929P787N053l005j7222q255j628P817R143Q935K068n604o578M080
3739b718k780q956O704q184m710j284j982l23N683J1418l554l259J133K393n691
3724a6110p937J1461N754P229R951O037n226p40J625j1249j1370J700m033O698
3710f210j4900l282N437J622L134K52q440M435Q254N965l991j0334o757N234o274
3695b5855P459J3749M304j0558J218O734P789M990k092o309l076K738K243k2880
$$ plain form
3681 -19546 -20376 -8905 -11916 -5937 6361 12997 8712 5914 16014 19032 2292 -8339 -7323 -5019
3667 -5019 -364 -3446 -11466 -3433 2517 3621 17307 13884 23265 18950 4457 5203 3566 1954 3365
$$ packed form
3681a9546q30J1471l011N979J2298O636m285k798J0100L018j6740j0631J016K304
3667e019M655l082q020Q033N950J104J3686l423R381m315j4493P46j637j612J411
$$ [...]
##END NTUPLES=NMR SPECTRUM
##END=
