##TITLE=Analysis number 317935
Compound Code btb 02219
Project Code adrs
Chemist Name stores
##JCAMPDX= 6.0         $$ Bruker NMR JCAMP-DX V2.0
##DATA TYPE= NMR SPECTRUM
##DATA CLASS= NTUPLES
##ORIGIN= Bruker BioSpin GmbH
##OWNER= nmr
$$ XWIN-NMR		Version 3.5
$$ Wed Mar  8 13:35:41 2006 GMT Standard Time (UT+0h)  MAYBRIDGE\nmr@NMR_250MHZ
##.OBSERVE FREQUENCY= 250.131544655141
##.OBSERVE NUCLEUS= ^1H
##.ACQUISITION MODE= SIMULTANEOUS (DQD)
##.ACQUISITION SCHEME= undefined
##.AVERAGES= 16
##.DIGITISER RES= 18
##SPECTROMETER/DATA SYSTEM= dpx250
##.PULSE SEQUENCE= zg30
##.SOLVENT NAME= CDCl3
##.SHIFT REFERENCE= (INTERNAL, CDCl3, 0, 16.522)
##AUDIT TRAIL= $$ (NUMBER, WHEN, WHO, WHERE, WHAT)
$$ ##TITLE= Audit trail, XWIN-NMR		Version 3.5
$$ ##JCAMPDX= 5.01
$$ ##ORIGIN= Bruker BioSpin GmbH
$$ ##OWNER= nmr
$$ C:\u/data/dgb/nmr/ADRS/300/pdata/1/auditp.txt
$$ ##AUDIT TRAIL=  $$ (NUMBER, WHEN, WHO, WHERE, WHAT)
(   1,<2006-03-08 13:35:20.68 +000>,<MAYBRIDGE\nmr>,<NMR_250MHZ>,
      <created by zg, POWCHK disabled, PULCHK disabled
       configuration hash MD5:
       84 BC 41 DB A1 6E 1D 46 DA 25 12 A5 C1 ED C5 3A
       data hash MD5: 64K
       30 8B EA 2F EC 1E 76 E3 6B B1 CB D7 BB 94 5E B0>)
(   2,<2006-03-08 13:35:32.55 +000>,<MAYBRIDGE\nmr>,<NMR_250MHZ>,
      <Start of raw data processing
       ef LB = 0.3 FT_mod = 6 PKNL = 1 SI = 32K 
       data hash MD5: 32K
       58 40 CE 68 5B 6B EE 07 61 BB 5D 99 D3 39 FA DF>)
(   3,<2006-03-08 13:35:34.13 +000>,<MAYBRIDGE\nmr>,<NMR_250MHZ>,
      <apk 
       data hash MD5: 32K
       AF 83 67 54 23 7C DB 34 2C 55 50 E8 81 A6 09 B0>)
(   4,<2006-03-08 13:35:34.93 +000>,<MAYBRIDGE\nmr>,<NMR_250MHZ>,
      <abs ABSG = 5 
       data hash MD5: 32K
       FD AA 18 57 8E 70 4E C6 8E 64 93 D5 67 CE A9 A6>)
$$ ##END=
$$ 
$$ hash MD5
$$ AB DA 9D 67 DB C3 78 A8 C1 DD 3F 74 4B DB 48 47
##$RELAX= 
##$RELAX= 
##$RELAX= 
##$RELAX= 
##$RELAX= 
##$RELAX= 
##$RELAX= 
$$ Bruker specific parameters
$$ --------------------------
##$DU= <C:\u>
##$EXPNO= 300
##$NAME= <ADRS>
##$PROCNO= 1
##$TYPE= <nmr>
##$USER= <dgb>
##$AMP= (0..31)
100 100 100 100 100 100 100 100 100 100 100 100 100 100 100 100 100 100 
100 100 100 100 100 100 100 100 100 100 100 100 100 100 
##$AQSEQ= 0
##$AQ_mod= 3
##$AUNM= <au_zg>
##$AUTOPOS= <33 >
##$BF1= 250.13
##$BF2= 250.13
##$BF3= 250.13
##$BF4= 250.13
##$BF5= 500.13
##$BF6= 500.13
##$BF7= 500.13
##$BF8= 500.13
##$BYTORDA= 1
##$CFDGTYP= 0
##$CFRGTYP= 5
##$CHEMSTR= <none>
##$CNST= (0..31)
1 1 145 1 1 1 1 1 1 1 1 1 1 1 1 1 1 1 1 1 1 1 1 1 1 1 1 1 1 1 1 1 
##$CPDPRG= <>
##$CPDPRG1= <>
##$CPDPRG2= <>
##$CPDPRG3= <>
##$CPDPRG4= <mlev>
##$CPDPRG5= <mlev>
##$CPDPRG6= <mlev>
##$CPDPRG7= <mlev>
##$CPDPRG8= <mlev>
##$CPDPRGB= <>
##$CPDPRGT= <>
##$D= (0..31)
0 1 0 0 0 0 0 0 0 0.06 0 0 0 0 0 0 0.0002 0 0 0 0 0 0 0 0 0 0 0 0 0 0 
0 
##$DATE= 1141824919
##$DBL= (0..7)
120 120 120 120 120 120 120 120 
##$DBP= (0..7)
150 150 150 150 150 150 150 150 
##$DBP07= 0
##$DBPNAM0= <>
##$DBPNAM1= <>
##$DBPNAM2= <>
$$ [...]
##$SUBNAM7= <"">
##$SUBNAM8= <"">
##$SUBNAM9= <"">
##$SW= 20.6930455092707
##$SWIBOX= (0..15)
0 0 3 0 0 0 0 0 0 0 0 0 0 0 0 0 
##$SW_h= 5175.983436853
##$TD= 65536
##$TD0= 1
##$TE= 294.16
##$TE2= 300
##$TE3= 300
##$TEG= 300
##$TL= (0..7)
0 120 120 120 120 120 120 120 
##$TP= (0..7)
150 150 150 150 150 150 150 150 
##$TP07= 0
##$TPNAME0= <>
##$TPNAME1= <>
##$TPNAME2= <>
##$TPNAME3= <>
##$TPNAME4= <>
##$TPNAME5= <>
##$TPNAME6= <>
##$TPNAME7= <>
##$TPOAL= (0..7)
0.5 0.5 0.5 0.5 0.5 0.5 0.5 0.5 
##$TPOFFS= (0..7)
0 0 0 0 0 0 0 0 
##$TUNHIN= 0
##$TUNHOUT= 0
##$TUNXOUT= 0
##$USERA1= <user>
##$USERA2= <user>
##$USERA3= <user>
##$USERA4= <user>
##$USERA5= <user>
##$V9= 5
##$VALIST= <valist>
##$VCLIST= <CCCCCCCCCCCCCCC>
##$VD= 0
##$VDLIST= <DDDDDDDDDDDDDDD>
##$VPLIST= <PPPPPPPPPPPPPPP>
##$VTLIST= <TTTTTTTTTTTTTTT>
##$WBST= 1024
##$WBSW= 4
##$XGAIN= (0..3)
0 0 0 0 
##$XL= 0
##$YL= 0
##$YMAX_a= 407332
##$YMIN_a= -514145
##$ZGOPTNS= <>
##$ZL1= 120
##$ZL2= 120
##$ZL3= 120
##$ZL4= 120
##$ABSF1= 16.522
##$ABSF2= -4.171173
##$ABSG= 5
##$ABSL= 3
##$ALPHA= 0
##$AQORDER= 0
##$ASSFAC= 0
##$ASSFACI= 0
##$ASSFACX= 0
##$ASSWID= 0
##$AUNMP= <proc_1d>
##$AZFE= 0.1
##$AZFW= 0.1
##$BCFW= 0
##$BC_mod= 0
##$BYTORDP= 0
##$COROFFS= 0
##$CY= 12.5
##$DATMOD= 1
##$DC= 0
##$DFILT= <>
##$DTYPP= 0
##$F1P= 14.0000005364418
##$F2P= -0.99999901652339
##$FCOR= 0.5
##$FTSIZE= 32768
##$FT_mod= 6
##$GAMMA= 0
##$GB= 0
##$INTBC= 1
##$INTSCL= 1
##$ISEN= 128
##$LB= 0.3
##$LEV0= 0
##$LPBIN= 0
##$MAXI= 10000
##$MC2= 0
##$MEAN= 0
##$ME_mod= 0
##$MI= 0
##$NCOEF= 0
##$NC_proc= -5
##$NLEV= 6
##$NOISF1= 0
##$NOISF2= 0
##$NSP= 0
##$NTH_PI= 0
##$NZP= 0
##$OFFSET= 16.522
##$PC= 1
##$PHC0= 168.6263
##$PHC1= 6.799656
##$PH_mod= 1
##$PKNL= yes
##$PPARMOD= 0
##$PSCAL= 4
##$PSIGN= 0
##$REVERSE= no
##$SF= 250.13
##$SI= 32768
##$SIGF1= 0
##$SIGF2= 0
##$SINO= 400
##$SIOLD= 32768
##$SREGLST= <1H.CDCl3>
##$SSB= 0
##$STSI= 32768
##$STSR= 0
##$SW_p= 5175.98343685301
##$SYMM= 0
##$S_DEV= 0
##$TDeff= 65536
##$TDoff= 0
##$TI= <Analysis number 999999
Compound Code 99
Book Reference 9
Project Code 9>
##$TILT= no
##$TM1= 0
##$TM2= 0
##$TOPLEV= 0
##$USERP1= <user>
##$USERP2= <user>
##$USERP3= <user>
##$USERP4= <user>
##$USERP5= <user>
##$WDW= 1
##$XDIM= 32768
##$YMAX_p= 386262230
##$YMIN_p= -537843
$$ End of Bruker specific parameters
$$ ---------------------------------
##NTUPLES= NMR SPECTRUM
##VAR_NAME=  FREQUENCY,     SPECTRUM/REAL,   SPECTRUM/IMAG
##SYMBOL=    X,             R,               I
##VAR_TYPE=  INDEPENDENT,   DEPENDENT,       DEPENDENT
##VAR_FORM=  AFFN,          ASDF,            ASDF
##VAR_DIM=   32768,         32768,           32768
##UNITS=     HZ,            ARBITRARY UNITS, ARBITRARY UNITS
##FACTOR=    0.157963299565203, 1,           1
##FIRST=     4132.6476996994, 0,             0
##LAST=      -1043.33573715361, 0,           0
##MIN=       -1043.33573715361, -537843,     0
##MAX=       4132.6476996994, 386262230,     0
$$ Real data points
##PAGE= N=1
##DATA TABLE= (X++(R..R)), XYDATA
$$ [...]
22013 249537 285605 245623 232581 212711 159933 286120 336412 352508 359826 326679 193401
22002 193401 100945 113697 106933 32599 -75278 -104479 31660 5778 9213 37025 174683
21991 174683 74713 -74247 -43401 -53012 -9659 -36213 -31010 60719 90646 6748 8944 31339
21979 31339 68357 88384 -3335 -93531 -125285 -50627 16586 -40774 -72622 -252455 -204394
21968 -204394 -54682 21133 36439 51085 89907 180809 10424 -45597 -109350 -183886 -98805
21957 -98805 -53877 -118026 -133483 -131182 -104956 37111 129488 148121 34076 61025 -22105
21946 -22105 -31727 45360 28439 -36740 52829 111137 166111 177223 145338 69510 -39784 -62252
21934 -62252 51800 -17142 -92934 -54969 -25738 -237218 -275123 -76058 -43332 -75428 -39807
21923 -39807 -30630 -21810 25990 55778 -88339 -107957 31011 573 64830 123173 15302
21912 15302 12332 -21735 55785 96610 67888 133374 163256 248516 143596 -30823 -3003
21901 -3003 162820 277795 217534 124462 120738 36997 -18380 10484 19294 37312 63716 104019
21889 104019 32747 65798 101418 34538 -73626 -59529 -46472 -197923 -143915 11593 23548
21878 23548 -26993 -90314 -36265 34455 19562 24906 32387 -71223 -223750 -190312 -199288 -248930
21866 -248930 -269205 -288040 -199303 -132560 -15037 -39624 -10353 46934 58026 30471 -5364
21855 -5364 -175793 -230958 -147002 -86296 95251 111868 61801 59726 -69215 -105749 -9893
21844 -9893 -55805 352 -50729 -44837 56339 128422 155286 193457 204451 92202 12729 -114711
21832 -114711 -72236 -104067 -75270 -78849 100890 155765 73302 84476 154684 199698 114560
21821 114560 71456 81245 230355 251996 175737 13812 -72876 -85973 -17096 -65555 -128594
21810 -128594 -219233 -342751 -183211 -39750 4747 38740 25728 -26563 -137248 -72014 42009
21799 42009 -16905 27162 107591 150281 181427 -45161 -127091 -149099 -117280 -122640 -188177 -224555
21787 -224555 -199608 -168032 -37294 4571 -43970 -177341 -133987 -17825 -30601 -48373 660
21776 660 -80165 -28278 -15301 48858 22054 -99177 -179599 -130412 -84814 -149930 -118489 -73190
21764 -73190 6817 30044 -12590 -114538 -148591 -118279 20477 120810 28943 -23695 -29857
21753 -29857 15603 93776 76542 87050 104565 130426 88998 83787 -7144 -57382 60362 192055
21741 192055 186331 126125 63231 -4611 91222 126105 19071 -47939 53488 -20496 -24604
21730 -24604 13369 -7496 -18943 -94062 -218050 -191642 -75675 -18215 -71708 -82558 19167
21719 19167 -46086 -156638 -197574 -97401 -21356 -24116 -147643 -213251 -209447 -178468 -191052
21708 -191052 -261954 -149657 -42724 -36917 43985 103536 51950 9184 -82723 -140157 -169442
21697 -169442 -61723 -62296 -98468 -135087 -35109 -67320 -148441 -193534 -67854 76813 121364
21686 121364 78150 -16001 -5376 62456 47746 21733 -140116 -253879 -161112 -74224 3633
21675 3633 -40623 -131696 -86383 68855 123895 -43035 -181372 -127175 10256 69222 -51760
21664 -51760 -163105 -248368 -132911 -82736 -55619 -126950 -150149 -164927 -65693 -68736 -58124
21653 -58124 6320 2171 -92113 -68346 -12130 -77776 -146353 -95818 -159383 -184081 -64338 35626
21641 35626 -34223 -157796 -161024 -290032 -298789 -176100 -172771 -75380 41328 102465 62294
21630 62294 44826 48238 31384 367 36942 60173 106456 168352 160373 34603 7761 516
21618 516 -34438 -11339 -3360 -109033 64641 138847 81910 9051 -1982 -27025 -61676 62214
21606 62214 129659 114001 -44888 10214 54278 -38378 -80874 -119956 -145401 -131612 17025
21595 17025 -28240 -14050 -35396 48577 73038 2051 -36280 -78130 -188631 -214748 -194596
21584 -194596 -41325 -6300 -217592 -254654 -172045 -101902 -29897 -42323 -117546 -91260 -170841
21573 -170841 -258346 -132221 67305 -949 -221408 -280516 -307461 -289055 -122718 40939
21563 40939 -11808 -51770 4661 28064 101619 51436 25830 112176 62720 10924 -83520 2624
21551 2624 100615 129993 134451 137644 55557 -59543 -188598 -80462 -29639 -2812 29939 27249
21539 27249 32657 34399 -26742 33869 94747 126391 109274 -118687 -148269 -38295 -2189 27223
21527 27223 31212 26755 41236 -49077 -126366 -3479 -32545 -198541 -234769 -122175 21490
21516 21490 62666 -88978 -173117 -170693 -133663 -33159 -37277 9822 -21451 62792 -11750 59323
21504 59323 62507 134429 127272 -1412 -99766 -49576 3034 4066 -68970 -118382 -41938 42687
21492 42687 101776 -3335 -26062 15890 -40438 58081 168587 72829 42851 87867 173262
21481 173262 71367 -121811 -83719 49240 37063 65219 2716 -44986 75112 131638 146691
21470 146691 78395 31376 41713 10014 106097 123688 134258 100032 -25510 -71479 27488
21459 27488 36721 -133458 -125640 -83450 -135294 -98554 46653 99934 37332 -134435 -191669
21448 -191669 -9723 -20635 -21303 -78014 -49471 -73182 -44458 -78320 -60951 62002 91328
21437 91328 -81059 -127320 -101879 -62222 -8784 -154924 -231447 -60144 -43946 -129695 -60071
21426 -60071 -12944 -33873 -124026 -152751 -25005 -51649 -29368 32975 49104 24140 85050
21415 85050 14943 -41557 -18638 7358 -30988 -131310 -40864 28813 -25239 16503 121153
21404 121153 162943 173554 182109 148494 121363 62998 -39107 -110567 -161486 -118426 -116940 -35926
21392 -35926 -100632 -170511 -100536 -91510 -223712 -252760 -222382 -202430 -153912 -215703 -268666 -260068
21380 -260068 -200644 -143695 -146934 -189341 -165994 -107652 116701 203258 175514 145509 122867
21369 122867 88888 98839 70626 36592 38118 -93126 -150470 -170307 -9326 19916 42912
21358 42912 84117 143120 122601 173235 188862 136929 9468 -18308 29418 -67726 -128331
21347 -128331 -70236 -84951 -51046 33286 -9648 -20649 633 42136 89456 95705 -6298
21336 -6298 -41879 15368 33183 -70758 -68442 -110888 -11274 -23538 -87303 -68764 -7827 38420
21324 38420 59183 99494 154115 146881 136090 170798 166509 114252 132058 128605 86505 -13996
21312 -13996 -105318 -90021 -103074 -220747 -216584 -211730 -249665 -206886 -63254 -57674 -93288 -125789
21300 -125789 -98980 -163242 -204602 -173188 -141075 -58197 72431 91579 -2662 14837 88490
21289 88490 84667 135691 166845 43284 -24938 -14439 30557 65035 105023 82132 54549 -33344
21277 -33344 -79309 -50471 -35064 -110918 -31075 -9842 -141075 -183288 -172383 -91168 -13567
21266 -13567 30912 51435 -24952 -90701 116942 206339 112093 86359 193101 169776 158149
21255 158149 164991 92491 75096 187809 138868 81794 -1567 39618 96544 137507 15078
21244 15078 -41122 14080 3566 -135016 -197755 -126672 -131223 -38702 -73928 -208561 -218875
21233 -218875 -131874 -17320 62737 128922 183327 265271 311466 233987 180690 111891 1232
21222 1232 -26841 -45767 -104899 -79535 -121743 -200937 -242445 -126761 48305 111502 158470
21211 158470 152749 107568 2804 -228285 -195448 -113678 -141908 -72095 31479 68976 12815
21200 12815 8311 -63109 63465 182171 113181 84725 105163 45209 57931 216550 332863
21189 332863 270823 111648 1496 -175161 -263179 -194957 -93996 -71194 -62701 -36612 -122042
21178 -122042 -165892 -162943 -31989 128425 98106 43820 64100 -3733 -28060 94958 155509
21167 155509 170571 109049 -19204 -57211 -41852 78914 108377 57163 28882 84819 160474
21156 160474 177322 167341 12951 -118688 -49846 -173180 -115524 -139588 -3815 -98418 -54742
21145 -54742 -53167 -81848 -82067 -6654 64536 120736 113439 125723 99919 61596 41531 29126
21133 29126 -42884 -72204 -119072 -76934 852 -20615 24099 14379 -80858 -84182 93945 169792
21121 169792 37384 -28988 12104 3276 -59939 -24181 -4118 20336 -14725 -18076 -130149
21110 -130149 -129387 -36164 -31060 -20833 62778 41624 -42382 -230344 -337087 -260025 -163888 -86397
21098 -86397 90194 98127 45306 89476 12424 21751 -135789 -248226 -246428 -205659 -19462
21087 -19462 93414 20020 -66711 -139851 -155674 -163757 -183992 -134824 -110495 -46181 105575
21076 105575 144490 194898 146659 120689 196577 155107 102968 150056 109522 98273 34609
21065 34609 -22353 -121358 -158869 23407 21414 -35052 -26339 14363 -13894 70468 174299 52894
21053 52894 97576 39934 -24920 -95341 -160060 -164774 -131991 -150314 -132569 -109428 69301 55966
21041 55966 -32613 -75046 -163401 -247033 -157305 -145959 -64286 -1532 -73431 79560 154198
21030 154198 54931 44597 70837 -6266 -31803 -39579 79267 10351 -111766 -131570 -94487
21019 -94487 -162076 -147706 -84263 89917 135888 71059 -43383 -12206 -22347 -49438 -89377
21008 -89377 -138897 -196307 -188267 -82231 -1906 96265 -9541 -57493 -46771 -81467 -135799
20997 -135799 -106134 -30362 -38575 -17395 40033 34072 84513 62952 33508 -58868 -18500 16514
20985 16514 13043 164191 147013 46072 -106297 -144874 -184601 -146383 -92119 -96849 -172962
20974 -172962 -118849 -3092 27327 87574 142636 95554 105599 -63280 -315066 -436801 -376046
20963 -376046 -247619 -205409 -120014 -35948 17383 26560 58798 36052 -101502 -137005 -194701
20952 -194701 -174169 -190735 -266130 -209446 -72734 -28615 43988 156633 -503 -203157 -154833
20941 -154833 -176271 -143948 -113757 -79373 -100056 -37670 22165 205023 177627 81612 50639
20930 50639 49118 7444 -57138 -3797 2507 -48692 -29801 21012 -42897 -104831 162917 270079
20918 270079 189860 104958 35585 51384 32565 64949 69807 20946 59407 95886 122876 202944
20906 202944 35777 -20325 23069 19552 -10691 1321 68938 16355 -14725 29295 43969
20895 43969 117802 162739 155903 74527 80481 126785 137915 162707 138199 48434 104105 3503
20883 3503 -142101 -123558 -10738 46913 -59816 -64624 -51185 -191773 -304915 -214379 -106332
20872 -106332 -101099 -23769 -19083 44242 111233 102810 -184775 -266778 -93159 -87781 -190710 -179050
20860 -179050 -174447 -58209 154246 191308 60510 138665 171474 91063 98680 102411 120935
20849 120935 -24693 -99580 -107445 -93428 -33437 1580 147986 81739 -58472 -72784 -142047
20838 -142047 -78120 134031 166449 146984 154675 189316 290766 141902 -74883 -67892 -80996
20827 -80996 -166217 -226957 -159241 -65676 -8783 -71951 -126345 -187944 -88594 40384 106958
20816 106958 69125 68872 53700 41450 105148 166093 79025 -19049 -121811 -79944 20526
20805 20526 20184 -48142 -22364 107666 81637 -20281 -26241 -65653 -13278 -15316 -35737 -102477
20793 -102477 -210177 -94473 -3575 -14416 -71540 -96948 1420 10494 22374 -33221 -29917
20782 -29917 78676 167271 131465 183434 121750 95906 131799 99450 74797 151327 60133
20771 60133 35294 84812 49388 127451 100385 92811 161796 75874 -129497 -17716 129413
20760 129413 149426 123496 103742 51353 22364 58359 83785 86227 17848 -143198 -107503
20749 -107503 115194 98569 -889 -68194 -113181 -141992 -1682 38783 22933 12084 -1814
20738 -1814 -939 25297 101775 40713 24557 5104 21916 -67649 -146973 -72134 -46259 -124691
20726 -124691 -155662 -136506 -91289 -44379 11741 34680 24014 -4107 42504 49919 -10983 -8505
20714 -8505 93544 123111 273816 253144 63866 -56755 -170219 -126448 -68384 -144736 -227788
20703 -227788 -89507 -48106 -121198 -180338 -175353 -42284 -20315 27209 31298 119773 163941
20692 163941 48218 -45066 -71618 -131066 -184443 -280829 -192039 -110290 -84618 3589 -46826
20681 -46826 -95894 49516 55532 -53630 -86575 -56611 -65547 -221448 -142702 -195801 -124526
20670 -124526 -16831 -81886 -244169 -121355 104302 228096 156986 12051 -135222 -80034
20660 -80034 15320 58579 41717 31510 -15490 -51954 -62112 -154858 -239766 -198845 -170282 -54550
20648 -54550 69060 63986 76687 45041 -22435 -130994 -65842 -24157 42594 34124 17787 49375
20636 49375 58390 3401 -33838 45846 136444 99518 30490 72990 89554 39101 67530 109690
20624 109690 -18107 -4097 48325 -39931 -188520 -53615 -11030 40869 50700 94239 177008
20613 177008 109331 -88652 -164441 -225772 -132610 -115804 -147438 -101077 -64746 -50253 -99116
20602 -99116 -155692 -138850 -21709 -82511 6428 20588 -61620 -137711 -248966 -317259 -302526
20591 -302526 -167503 -112048 -40112 111442 139437 -29917 -87781 -95242 -81693 -47066 -84634
20580 -84634 -15882 43810 93973 155548 250389 231212 76956 -65388 -81270 -127906 -111383
20569 -111383 -186102 -149651 -190377 -76730 105162 98439 -53867 38882 83780 48484 -40474
20558 -40474 -129889 -170396 -100726 -122484 -204319 -264353 -164599 -50740 -49979 -112376 -143556 -47226
20546 -47226 28990 172779 95193 102625 56517 -37984 -40328 -133280 -76605 -30959 -37706 -39568
20534 -39568 -123748 -96390 -62095 -101143 -222778 -139701 -68359 -96668 -39804 -57854 19266
20523 19266 -91697 -142633 -65517 -62404 -155880 -167391 -137781 -145931 -29801 59509 8355 -37648
20511 -37648 -120834 -210043 -195846 -83534 -12216 -610 46770 -11083 -22174 -3165 -110686
20500 -110686 -168974 -274404 -308095 -243350 -205843 -155338 -17790 -20281 48923 46921 55233 121239
20488 121239 155157 121424 237406 300084 289598 224981 11559 -95383 -34980 90142 142595
20477 142595 99865 -53351 -213199 -186204 -38243 76324 218130 89415 -79013 -102697
20467 -102697 32801 40158 -18692 -100876 -117073 -10775 52132 74223 100247 132933 119072
20456 119072 165929 139271 95187 65795 18215 16197 31541 -52528 -105552 -111730 -155325 -182340
20444 -182340 -26247 -4005 -11038 21623 -41468 -76963 69169 81691 -23983 51518 155345
20433 155345 111454 -10986 -92806 -137565 -205315 -147317 -51202 23008 86815 94666 62205
20422 62205 -48157 -4688 -34721 -109906 -138447 -78615 -85296 -38092 -68462 -99413 -28564 -20983
20410 -20983 -42947 -9856 90620 107845 152185 199490 238147 144619 167319 218468 195719
20399 195719 172319 217013 75387 18259 -7820 88456 199426 212634 241844 106322 -48215
20388 -48215 -49062 -7526 9245 -79847 -124843 -51768 56434 57684 49698 -42499 -55509 4982
20376 4982 1412 -38551 -19220 84635 143880 158429 116595 111960 88489 41507 -15260 -56182
20364 -56182 52100 187679 132675 44111 78629 95809 81552 44470 -65563 -132696 -100282
20353 -100282 68724 187821 56047 -127891 -199981 -247238 -155711 -52502 -22000 -24410 -91719
20342 -91719 -90360 -13832 147 -59977 85238 41877 32264 36389 91793 57756 86767 138442
20330 138442 -14446 -167868 -87928 -54407 100089 175142 182889 155873 92347 139597 32785
20319 32785 -13070 -54436 -194670 -229019 -174861 -139304 -95914 124208 60723 -57479 -153433
20308 -153433 -211110 -261288 -144581 -53078 -121646 -70558 -139344 -119598 -65532 -77617 14668
20297 14668 -62717 -156771 -100171 -90912 -69413 -8673 -35536 -69556 -35629 7117 -18010 -78978
20285 -78978 -53490 -24720 -26690 22981 64754 160502 211158 143508 -41152 -146370 -101803
20274 -101803 -108822 -55857 -27861 -137049 -120995 -13155 -33659 -32901 69800 49666 -20988
20263 -20988 -42927 11564 102562 36334 -13441 -91076 -170630 -114180 -26476 73283 58325 144311
20251 144311 152394 141116 145301 79646 -65491 -63642 -67022 -97012 7448 80854 67506 53824
20239 53824 -26495 -201119 -180550 -22562 72957 -72549 -177314 -200459 -95813 22575
20229 22575 -44603 -205778 -181004 -158666 29810 115879 -59743 -64032 46656 117161 107730
20218 107730 47260 -81691 -182315 -276507 -290133 -139373 -15420 131117 129579 104852 32709
20207 32709 -32194 2125 180419 160159 176409 158311 178738 181722 137170 100353 109395 171643
20195 171643 215633 136470 14828 -85131 -50869 -165757 -261818 -234015 -219137 -204812 -86164
20184 -86164 -171001 -273508 -184454 -268282 -304549 -167324 768 36452 29932 -12326 -39556
20173 -39556 -6342 48942 138698 137972 82739 11569 -26313 36001 84249 66126 -12973 57957
20161 57957 156057 200694 111485 -25659 24255 132498 148195 130582 34683 49651 44771
20150 44771 -12769 -72713 -120762 -111937 -10662 -37243 -47456 -38326 -22936 -84275 -163693 -68404
20138 -68404 -48805 -7557 -31035 -45913 -36541 24610 43407 38420 122999 72896 86817 4384
20126 4384 -17950 -32436 58031 54182 2740 5777 100658 77017 24811 -61222 -61456 -44789 36229
20113 36229 164443 125962 65557 17015 60243 122561 10678 -72137 12703 -8819 -80536
20102 -80536 29571 156884 70280 49113 13838 -12981 -27067 30509 64627 59636 1533
20091 1533 -21009 -25470 -138902 -110254 -64914 14152 -17027 -41127 25792 82299 86775 88924
20079 88924 4004 1022 26571 165105 117967 22945 -4536 74447 122312 135070 153809 193833
20067 193833 122419 163472 135646 10878 -22788 4023 102716 105773 -35397 -72662 -76309
20056 -76309 -134075 -65750 24723 -46221 -85470 -123466 -235432 -221708 -132805 21257 92518
20045 92518 94838 119190 34116 -27434 -93432 2449 60846 80215 66610 -116330 -165545 -133387
20033 -133387 -96569 11490 47523 72152 134918 15300 -157561 -223956 -164211 -187272 -186030
20022 -186030 -170913 -195685 -108054 -29553 -100199 -74738 -61844 -176037 -99364 -99974 -157453 -129859
20010 -129859 -197546 -179190 -209778 -176041 -163878 -101903 -119216 -149302 -73767 -100432 -144435
19999 -144435 -145421 -77841 -74836 -92876 -85552 -53511 7755 -6310 8718 -128878 -157335 -88460
19987 -88460 -152523 -102169 -112117 -177358 -64005 87615 34049 -16681 11785 30137 87038
19976 87038 46768 34665 64634 20858 -50602 -90620 -135847 -155520 -164585 -148273 -57155 23595
19964 23595 34026 -52687 -5832 109694 205113 194583 201980 132706 84699 79731 65841 -58516
19952 -58516 -3065 76004 20389 51165 96691 102709 144259 97780 29635 48478 70136 142771
19940 142771 62738 -72895 -170679 -229782 -162803 -67455 -72910 15362 8556 -6833 43906 87628
19928 87628 -10436 -58431 -75062 -78590 -187019 -119610 -155598 -117942 -125354 -45956 43002 118362
19916 118362 281721 203811 144912 23221 -28432 -128093 -174484 -155711 9782 -5477 8497
19905 8497 -55746 -92390 -63169 12209 65427 19988 65523 46924 9606 -52669 -141692 -140448
19893 -140448 -200935 -180129 -142137 -31618 -12682 174844 232418 151458 133853 140301 39538
19882 39538 82113 163094 240421 201880 152644 56746 125878 145821 96618 97503 91324 76389
19870 76389 17585 45370 -23574 -58997 -85735 -161363 -208741 -59005 -55552 -39927 46040 123286
19858 123286 126767 77335 43333 10962 -5023 102567 85647 32768 15647 -68480 -44720
19847 -44720 -42952 -3260 -69741 -90772 -232601 -269628 -139889 -88888 -60468 -46947 -111036
19836 -111036 -66493 -48587 -91118 -127580 11500 -31951 46570 -34665 79946 276401 153441
19825 153441 70570 -9933 -25474 -239181 -324182 -219607 -96766 -48860 66646 331777
19815 331777 369520 261199 197641 227612 207197 157554 45170 -12418 -15913 116734 87534
19804 87534 96009 54078 18474 123449 238335 229702 234060 259868 315366 264787 108926 98180
19792 98180 125376 51112 -62701 -81163 -89737 -46466 -2882 37038 -26691 -78933 -119607 -95722
19780 -95722 -176647 -118888 -37614 84697 112859 27383 -3669 123204 123693 110697 33311 36510
19768 36510 174423 269237 231763 171620 60897 91400 83490 8550 -26974 -43387 33740
19757 33740 -2235 38040 105575 63088 111431 58856 47221 -104195 -117458 -23620 61509
19746 61509 15783 10575 -3764 84603 111782 31627 83820 167316 30743 -172322 -162319
19735 -162319 -148692 -84649 51637 59269 -17932 -44938 -131751 -78897 -29623 -83000 -17324
19724 -17324 -95283 -17917 13463 80022 66825 87827 141406 90616 57371 -36218 -92588 -214119
19712 -214119 -72568 -16141 -97965 -49883 -28039 3931 92435 -31348 -80088 -50102 -107600
19701 -107600 -90364 -18069 30389 79936 52670 39885 63974 -23756 -104762 -131810 -70875
19690 -70875 -85832 12142 -19005 6126 66233 86373 96510 79757 -90404 -46766 -129335
19679 -129335 -144298 -73943 13070 72387 62679 25791 -91 -37246 -96596 -179203 -190872 -225626
19667 -225626 -146898 -200068 -100474 -2601 63699 112925 124694 96998 -5056 -50584 -58176
19656 -58176 -117580 -166954 -49694 -113439 -11872 70451 77618 -159193 -158416 -150333 -150829 -116849
19644 -116849 -15279 -25804 16606 -79472 -52275 24690 30983 193040 206638 135883 122398
19633 122398 69080 -77389 -156968 -140405 -660 16380 120192 14511 -132691 -210633
19623 -210633 -150681 -69599 25280 -31215 -80600 30672 71862 76214 80297 -7240 -31956 14351
19611 14351 -8457 77113 -63777 -115457 -78165 -59878 -97418 -139336 -212259 -283366 -120955
19600 -120955 -36390 -45123 -118411 138481 180225 188525 209198 186266 21036 -141757 -211281
19589 -211281 -182102 -156489 -136761 -268294 -372247 -406307 -284652 -126208 -27199 -1513 6092
19578 6092 -95004 -167257 -168343 -107623 -27437 22982 -12318 -69045 -91768 -5159 -48913 -94417
19566 -94417 -87528 -4901 -2896 -28564 -48705 -69955 -80060 -11670 24322 119362 150652 48179
19554 48179 -13428 112122 139614 101335 109498 93501 83302 19582 61169 120039 67616 -19086
19542 -19086 -171925 -168715 -35856 -75510 -97586 -193834 -297941 -274339 -250411 -354395 -302603
19531 -302603 -209414 -256040 -220653 -330270 -361558 -241142 -109838 -7395 32226 122222 125528
19520 125528 87102 89331 190581 171815 112645 73635 -27729 -115627 -131461 -163287 -84900
19509 -84900 -50776 -64931 -75995 -102367 -168166 -249119 -302161 -354399 -284078 -217030 -78849
19498 -78849 -117501 -92416 -106982 -116096 -140404 -205687 -250101 -148885 -53205 -24877 -18459 -75261
19486 -75261 -124635 -114095 -70008 -106640 -11408 -37008 -74774 -100775 -161493 -159594 -239258 -163829
19474 -163829 -82334 -122664 -155208 -133733 -161290 -106112 -68378 -63507 -44814 -115843 16750
19463 16750 71138 82268 70697 -12315 -9534 31867 79404 73761 -12070 -86164 -56354 -66710
19451 -66710 -141064 -298517 -260307 -63662 40198 -10519 -28625 -68424 15616 -91506 -124277
19440 -124277 -44087 34980 73051 57285 -14304 -133620 -132288 -84206 -138915 -79841 34
19429 34 108804 1878 -178659 -97315 22148 -70061 -99526 -125296 -225719 -172996 -33916
19418 -33916 -13642 -74725 5078 18364 -125336 -177853 -213207 -40263 33733 55645 60221
19407 60221 54177 9220 102057 180811 189723 121537 7115 169263 228320 59220 -104757
19396 -104757 -137798 -168989 -146972 -56602 -150092 -211872 -106997 -81612 -101517 -65434 10416
19385 10416 -58252 -46886 -8861 7372 79351 -207 -28303 -60885 -31388 -57495 -70920 -67129
19373 -67129 -143100 -194781 -86286 -6394 -32293 -92804 -97199 11887 44770 95577 55307
19362 55307 52525 53067 34011 -22007 -54219 -27808 38863 183516 40534 -19047 -27643 -35098
19350 -35098 -26651 -42368 -40915 -23046 -69055 -137336 -114418 -118146 -132801 -106286 -50723 118073
19338 118073 227986 223886 106200 27305 -31235 -81040 -126721 -111054 71949 168773 -3209
19327 -3209 -134841 -93139 -7484 24321 116180 78429 -16961 -116592 -184762 -110118 -99614 -72048
19315 -72048 -138581 -91568 -77293 -107258 -21822 -62068 -127658 -612 112183 111659 95750 109547
19303 109547 58132 37115 187730 192322 175218 182764 177790 127155 24853 86777 72756 37020
19291 37020 50858 51054 117941 36453 29963 14629 38960 9445 -37817 -154830 -176147 -191356
19279 -191356 -145416 -59352 -35769 -33276 9561 290611 213152 18663 15122 87229 28792
19268 28792 2051 -155950 -135569 -108834 -48622 -171578 -196811 -61171 79384 32777 38508
19257 38508 -40730 -124298 -80921 -39073 52049 51755 34769 77232 126210 154889 95840 31870
19245 31870 100380 77843 35523 60042 88979 238142 246255 155809 62515 14236 -57691 -82073
19233 -82073 -37760 -87279 -102319 23831 -12862 75807 51648 65400 -38174 30189 66698
19222 66698 63732 3458 -86615 -279619 -290134 -153014 -77539 7283 6703 103879 178417 158678
19210 158678 186037 230343 191868 60857 91170 48325 146158 174261 208337 74068 -172423
19199 -172423 -240589 -240412 -184691 -35036 74411 -62133 -97394 -82783 -64888 -136896 -144199
19188 -144199 -53306 -55913 69649 -46906 -140919 4115 86789 39247 -18946 20020 51851
19177 51851 46245 -65048 -106951 -76693 -77015 -54058 73949 130938 69727 -66208 -111217 -88436
19165 -88436 -126103 1733 213885 305181 248614 89722 5966 10105 -2095 -66302 -100472
19154 -100472 -153908 -83357 144540 160192 117508 103664 -3403 -32261 4667 -7882 99092
19143 99092 183284 269402 249035 116060 63690 35031 168285 232720 174969 172146 192905
19132 192905 125417 61513 27521 -87682 -125798 -101580 -27756 -17287 -78043 -44215 1554
19121 1554 17811 -10570 75193 160103 149828 101438 163345 254381 153740 62523 54070 -5716
19109 -5716 -109408 -248126 -356583 -399980 -415796 -222796 1562 161038 251691 301048 262323
19098 262323 233070 132578 122062 83030 64818 135491 148823 226916 284669 185634 153023
19087 153023 175916 142603 115877 102450 11648 39412 19196 35451 30786 22944 53068 50658
19075 50658 17415 -4874 -133765 -1761 55335 -37570 27197 66404 59407 133308 41632
19064 41632 29650 -83230 -190242 -187811 -103494 -168600 -135283 -53226 -77251 -218580 -311575
19053 -311575 -246840 -210506 -170928 -183213 -226585 -172649 -137668 -124505 69190 44100 78033
19042 78033 77422 51792 -650 -43890 65939 68926 -4516 -93202 -85181 -59268 -37337 65666
19030 65666 113708 101591 73924 54193 -75375 -98318 -79640 -35714 -12618 17652 -169901
19019 -169901 -240490 -143461 -49376 -83258 -78247 -8946 73043 -30163 -47381 61053 46587
19008 46587 59767 141948 187612 141266 145039 167242 191497 185471 266076 315445 284168 177900
18996 177900 194980 298328 314171 184156 91890 121511 133179 24598 -56143 -53300 -12656
18985 -12656 33952 127617 211422 156346 -22050 4592 59754 165789 273562 291330 57008
18974 57008 90143 211720 188035 176043 157352 101492 59331 67328 -128958 -154601 -76903
18963 -76903 -54652 -10338 41749 147303 155106 100210 54456 81798 184872 170488 111129
18952 111129 135102 140428 55058 -84611 -133800 -184822 -104477 54805 171690 2277 -181097
18941 -181097 -231737 -228561 -285206 -231772 -38546 -45513 -100360 -2012 99150 52002 -89982
18930 -89982 -146180 -102837 -81777 -40398 -63828 -5794 -6562 -96231 -78428 -25881 -57066 -77110
18918 -77110 -20343 -4801 -49662 -151991 -31320 8306 117147 198657 174301 135982 113037
18907 113037 10822 28257 42102 -25019 -88025 -89007 -13650 53972 154481 110340 66129
18896 66129 175021 89567 49997 140938 182656 108916 -46019 -37991 -15968 -122359 -10460
18885 -10460 129645 21363 64905 167853 241636 164138 88705 43038 61432 48936 20384
18874 20384 89355 62928 121614 105974 51519 76961 -3898 -80237 -163674 -166760 -41987 63439
18862 63439 68280 76878 168907 129728 105922 -16618 -1996 -54548 -148941 -7491 38902 -82498
18850 -82498 -158345 -188837 -80459 -75882 -72841 -71597 -133208 -82150 -64483 -48015 82665 210141
18838 210141 231839 225071 240940 232790 309635 285710 186741 93216 128650 209776 240608 208169
18826 208169 93617 95018 147774 130701 15798 23488 57493 -57320 -26003 142812 84486
18815 84486 108165 92267 -16695 -15476 58095 141222 225749 195968 157150 90313 35445 71965
18803 71965 226415 205947 115843 19601 -6956 136007 162379 68487 45859 145007 194868
18792 194868 225025 258936 332488 361569 295230 212125 64775 18630 104959 176619 78969
18781 78969 55211 107375 147283 242793 230010 178008 192368 207030 44771 -37281 -31237 -2853
18769 -2853 -1852 62889 237230 384568 641550 1043965 1191043 973054 703990 473245
18759 473245 239335 72320 53013 43341 110545 154630 316922 339882 296938 364198 294634
18748 294634 256519 234830 127702 42950 67916 115003 49736 -3757 42886 86571 108575
18737 108575 -26715 -178564 -297968 -231349 -64229 -71902 -165874 -144111 -65176 -65865 -171140
18726 -171140 -67015 24166 88627 184520 334396 290482 23344 39080 11890 -89437 -102147
18715 -102147 -7111 33052 107541 79309 11704 60124 33464 47166 115936 99510 96294 67181
18703 67181 25846 54273 -32963 37853 107505 152652 140838 3296 -29260 -144896 -137603
18692 -137603 -60017 -62409 -86428 -188670 -148017 -186038 -148009 -18333 38813 8002 -64777
18681 -64777 -41574 -24363 43959 55575 -86451 -118915 -7690 79124 84456 84109 197576 167522
18669 167522 161839 52280 -41957 -123274 -64233 -19287 41111 11073 6265 1014 -57884 -143032
18657 -143032 -118249 -139039 -82365 -36536 86215 125371 65563 -2250 88800 60318 -23234
18646 -23234 -134761 -177706 -130054 -114281 -179596 -296843 -222576 -79652 -24827 20632 102278
18635 102278 223370 252856 256542 263351 154605 58789 149777 104702 -3482 8130 -30014
18624 -30014 4626 136903 212063 63030 145247 169483 102490 95513 -1355 -21798 58327
18613 58327 125560 53661 124617 306268 333583 234997 134463 143777 96711 78103 -8689
18602 -8689 -52744 -1845 30475 -98399 -137215 -108014 20252 36882 35648 37507 121260 212675
18590 212675 219809 -27356 5633 80927 110698 183742 240298 192558 23861 -33671 -59284
18579 -59284 -113179 -62965 -34429 -34373 52911 99691 90527 82429 201998 214786 162610 232620
18567 232620 150593 146116 185357 187592 155245 23833 111904 85184 49866 9241 17090 73218
18555 73218 66095 109855 157312 94687 18562 29573 7626 39519 21911 41707 21167 69706
18543 69706 132232 137283 124452 140206 130344 145464 166430 157847 99565 30865 151583 199951
18531 199951 109545 151753 245406 387704 239403 114983 151798 184245 171538 250818 210457
18520 210457 125725 44391 11821 -512 -144259 -157107 -10233 85794 3695 -79318 -170825
18509 -170825 -169896 -120467 -117334 -122934 -61518 -88212 -174922 -105495 -65548 -98951 -80634 71097
18497 71097 168833 37770 -35593 35714 -18095 -35716 -81 -35512 118068 111454 -167449
18486 -167449 -154103 -153619 -153837 -54701 -77552 -36421 45255 188261 150074 140521 99571 -61846
18474 -61846 -98036 -44668 -58111 103178 94014 6357 98575 85891 43823 92469 181134 172202
18462 172202 44497 -72212 -76160 65273 140327 154660 190089 187518 128717 97018 -14546
18451 -14546 -140002 -64773 40025 110788 40533 -2463 9069 -29608 -86760 41107 173474
18440 173474 99909 131654 139381 69566 106833 154357 132195 95024 187844 248653 167431 112776
18428 112776 -5083 -170734 -94043 2062 5588 84889 2852 -116388 -99844 -88755 -102801
18417 -102801 -38348 -39567 -26203 12923 34554 68087 170803 303826 205541 38682 3195
18406 3195 63369 126356 125774 -74762 9826 35657 21777 59409 149397 51513 22308 -130442
18394 -130442 -77865 115907 181599 86931 -4578 44179 134029 179599 260206 233738 174645
18383 174645 123801 -67657 -151622 -34662 117136 249647 162424 59588 -4779 96566
18373 96566 89329 70121 122633 118448 71339 78788 -89152 -83539 31595 84457 159623 146515
18361 146515 95329 18923 8907 34346 121083 242657 213217 251163 289798 241272 227163
18350 227163 290526 204776 170102 168367 22814 -22337 -22315 -59960 -59317 60028 168874 216734
18338 216734 196282 25219 13128 -21709 65894 155265 116099 56818 56574 -36937 -35268 124272
18326 124272 127861 124507 180447 143975 124219 72717 -39458 -65700 12837 116979 163556
18315 163556 143652 259523 346249 238695 131439 171683 263007 320562 317982 224678 144833
18304 144833 83567 87072 -32366 -44997 -5783 -57536 -66575 -61449 -23542 98411 168724 312283
18292 312283 336460 175857 118516 161882 138126 188278 227980 259189 203369 171528 266003
18281 266003 290192 252660 253533 336535 242947 204977 137664 184537 164168 131549 94380 171993
18269 171993 173159 110333 223548 245883 237827 205293 170849 202124 255214 268385 68071
18258 68071 70045 181918 216597 257254 352154 262342 139664 127986 217441 230367 124856
18247 124856 173891 266200 315604 259097 263310 241488 237553 248372 363586 445055 466902 569575
18235 569575 515831 408112 387057 428327 492189 469818 493241 483101 519026 628776 627713
18224 627713 683462 628529 573824 541761 520559 576377 730730 820263 808425 744562 758917
18213 758917 671536 525669 341396 216738 239297 347596 330681 305082 310030 317499 280519
18202 280519 330609 363608 309302 313047 413518 402178 485945 403741 283184 259104 235126
18191 235126 315288 422717 433218 410307 467849 593327 548094 392151 503819 625124
18181 625124 690682 682007 763171 867488 1091951 1136364 1075131 926826 757534 618854 564164
18170 564164 687821 946500 1181628 1340854 1341976 1223426 1020100 864500 771990 843368
18160 843368 824341 823981 722980 743035 721040 633446 705249 793024 738371 743182 778820 791748
18148 791748 725115 773503 789960 762828 748767 789190 873586 818056 749935 731352 859495
18137 859495 959151 1029210 1151433 1261835 1342903 1528196 1648316 1789487 1912176 2133951
18127 2133951 2226849 2190444 2209907 2431731 2597559 2740621 3225173 3701066 4078665 4506788
18117 4506788 5109417 5761908 6597281 7914865 9833383 12739920 16907367 23204042 33755487
18108 33755487 53092169 89994727 146844791 186738898 191019967 148929994 94230018
18101 94230018 59699283 40783076 30140807 23688943 19814009 17314847 15519183 14012233
18093 14012233 12817884 11723230 10266424 8781624 7422474 6419947 5764512 5293402
18085 5293402 4777600 4439860 4143903 3871720 3668304 3543740 3398963 3063487 2569148
18076 2569148 2341810 2135683 2030203 1953873 1857609 1686272 1653826 1655669 1621750 1421605
18066 1421605 1180536 994908 945923 900725 751132 541009 456752 503273 617748 653852
18056 653852 605333 587855 481511 389544 380892 522611 548865 382792 237633 316859 357197
18045 357197 322169 315926 183198 199384 167341 93679 76561 207359 260314 264956 286607
18034 286607 261020 283898 265081 246750 361234 405192 404984 382980 420781 344025 287780 231861
18022 231861 165612 152456 197043 145269 150548 110973 150576 190160 142510 98218 146846 350025
18010 350025 384807 341977 336047 394364 269173 269928 326263 301441 365745 400773 385026 311860
17998 311860 260441 246676 253504 246256 150886 138184 111065 211991 255149 272910 346134 322226
17986 322226 165310 110377 192153 271437 287134 259174 223539 338570 296870 186181 176202
17975 176202 255636 249313 145727 479 79428 50941 28591 17747 86730 141520 117784
17964 117784 133120 170950 262239 386636 456202 453473 460760 360957 353865 344165 252442 195075
17952 195075 262692 187162 370878 409277 352396 369257 326404 272730 233546 72912 27114
17941 27114 89947 251478 377912 454914 457376 401386 408794 338675 348856 374178 439741 454467
17929 454467 408794 415690 354982 367322 389939 339558 315809 398442 382220 293868 291335 332965
17917 332965 394665 394189 390616 413081 447757 539005 496791 269798 249211 385349 454618 492666
17905 492666 548457 471525 477504 471216 541911 462165 334644 287870 265637 424817 406672
17894 406672 351789 440730 543235 497218 453808 513588 610529 506968 485625 426406 357069
17883 357069 426363 435392 359202 331329 405034 538000 527401 571708 514540 387761 360317
17872 360317 291923 362881 566554 666027 724372 787215 780584 755788 822983 790614 761117
17861 761117 680784 620634 553425 615741 589922 505203 517782 557318 560521 525484 612844 635747
17849 635747 713990 653838 671457 641896 650333 728058 772641 862080 890172 869422 846229 802336
17837 802336 777330 771229 853466 946149 1024891 1000940 1015476 1033540 968342 1051206 1138564 979870
17825 979870 774731 825773 882199 901793 988628 1216400 1196176 1157602 1123767 1284823 1368653
17814 1368653 1343614 1328671 1290134 1278083 1368167 1237882 1172080 1128601 1130750 1121410 1077366
17803 1077366 1208198 1290930 1242792 1238752 1262021 1256283 1399151 1558606 1636965 1743399 1807599
17792 1807599 1735999 1477178 1342049 1262271 1301446 1495064 1535486 1707856 1833981 1735278
17782 1735278 1621954 1603186 1544221 1611912 1747657 1736117 1759032 1969865 2102423 2277775
17772 2277775 2574917 2694512 2713127 2717048 2639483 2725332 3008457 3250447 3474602 3700834
17762 3700834 3982131 4176075 4250072 4283761 4351396 4466354 4571825 4879713 5455821 6184814
17752 6184814 6807794 7631100 9046406 11206814 14394738 19348428 26804498 35999802
17744 35999802 45700258 54776264 62418178 66882360 66193314 60052490 51816550 46393609
17736 46393609 46301992 52634727 66911223 89184996 112971387 126688790 123116911 105640422
17728 105640422 86091536 72650407 64090497 56283586 47433281 38308250 30950894 26032903
17720 26032903 22545913 19976243 17838954 16153550 14881595 13804231 13097851 12578961
17712 12578961 12120948 11833529 11697372 11699247 12043568 12379884 12858242 13659480 15026221
17703 15026221 17158696 20753680 26055351 32182301 36890850 38160801 36317694 33208566
17695 33208566 31527582 33017298 38434675 48569259 63786326 81582085 97180454
17688 97180454 107761179 113436561 116378819 117332022 116767624 119545274 133318140 159704498
17680 159704498 185694149 192245143 172377897 134683915 99723709 76339765 62899780
17673 62899780 56959751 57830099 64071037 68780916 67090617 57232410 44480122 34984137
17665 34984137 28582145 24256085 21221881 19049320 17387952 16092876 15157214 14411638
17657 14411638 13511457 12552547 11658077 10921538 10503721 10104769 9665235 9214151 8797010
17648 8797010 8568055 8497853 8518580 8680377 9193473 9913004 10611590 11697105 13160042
17639 13160042 15243229 18385004 23128191 30559044 42682202 63187953 94636717 127684176
17631 127684176 145873529 140250206 116717693 95313120 86633696 85466278 82858794
17624 82858794 74947991 63071375 54659767 53064574 58594545 68727159 74693205 71639806
17616 71639806 58784065 43582078 32893715 26104964 21682111 18701223 16568304 14975294
17608 14975294 13778981 12763149 11992761 11316700 10773034 10294809 9759768 9404668 8937965
17599 8937965 8540311 8170893 7947233 7856888 8004219 8414597 9130195 10261332 11950922
17590 11950922 14249431 17496817 22539479 30973977 45238289 67420743 90561759 101373428
17582 101373428 94860191 74416989 55932448 45716054 42279028 45042656 55029881
17575 55029881 71275642 83592180 84028320 70407950 51122219 36337772 26931424
17568 26931424 20966886 17004644 14405561 12597412 11198226 10073318 9209234 8570148
17560 8570148 7839072 7084721 6586515 6098165 5439632 4823653 4168620 3647755 3444445
17551 3444445 3373850 3333618 3234536 3104199 2945881 2789151 2479821 2136455 1977555 1801176
17541 1801176 1657162 1506566 1314528 1268457 1296249 1133926 1084246 1022393 984733 1040438
17531 1040438 854814 752745 789412 771578 710281 770652 814988 859920 782520 579799 495956
17520 495956 503846 447750 390377 237058 232748 292535 276179 350015 339032 327716 465975
17509 465975 567531 574313 600260 686069 685347 626029 566044 480884 461164 525377 503695 553499
17497 553499 515199 498615 546902 550784 491305 414423 293233 413396 584772 680243 558030
17486 558030 624416 629270 658239 686886 652528 551799 576950 642529 830532 798868 721994
17475 721994 584192 506133 425684 378887 420801 336897 396284 622863 572357 486234 597357
17464 597357 709866 684382 653837 792662 764283 770207 870951 931440 950297 993209 919906
17453 919906 897079 827793 739103 683927 814766 818947 774283 724285 647367 722488 764676
17442 764676 925478 1045402 1250049 1577320 1750874 1559433 1299809 1130282 1047178 924685
17432 924685 840665 842211 809099 865091 904036 870477 889768 901360 889790 885035 1011162 940884
17420 940884 901552 889353 1083030 1217685 1162864 1107540 1135258 1142993 1226569 1260034 1269981
17409 1269981 1299661 1376066 1437558 1433810 1416541 1637683 1813926 1696795 1800807 2013612
17399 2013612 2140773 2269004 2382198 2279523 2069778 1945294 2092855 2343444 2649585
17390 2649585 3082881 3565352 3970822 4203191 4190841 4111418 4222349 4507321 5098050 5785527
17380 5785527 6828000 8288476 10248275 12925654 17108723 23881198 35029914 50625848
17372 50625848 63617134 67541254 60304723 48034256 39951774 37398902 40114153 49024908
17364 49024908 66620240 91819745 111013247 113400997 95575654 69094325 48815273
17357 48815273 36160813 28331511 23450022 20372536 18356342 17106001 16479530 15838067
17349 15838067 15089499 14233643 13542134 13154762 12936152 12887091 13047199 13308921 13537956
17340 13537956 13767160 13909644 14446103 15322214 16859721 18979882 21852219 25839297 31762939
17331 31762939 40798129 54162517 74392438 103336900 133955094 157612862 169513221
17324 169513221 169505670 171147179 182986377 212904746 251428917 287957040 311601773 312832329
17316 312832329 295744046 256167481 206154592 161094312 121158670 91176662 71672401
17309 71672401 59429103 51445320 45795859 41207423 37056459 33293026 29854867 26969048
17301 26969048 24664288 22749126 21260359 20214235 19461972 18822171 18326161 17636573 16967392
17292 16967392 16418967 15836779 15320851 15040878 14935291 15217410 16105125 17485163 19761987
17283 19761987 23327818 28883546 38118713 53425075 73243327 88627179 95814517 95638252
17275 95638252 101373282 121974848 146695769 162603947 167754949 173412686 187124699
17268 187124699 189028127 168333116 125851219 87451715 63042153 48175026 38534586
17261 38534586 32113036 27740929 24384834 21734934 19617864 17829797 15940949 14025928
17253 14025928 12418128 11127388 10168481 9476879 8962999 8772137 8520271 7960005 7302721
17244 7302721 6802902 6377324 6000095 5688646 5294108 4743084 4111188 3645059 3295766
17235 3295766 2760248 2398035 2174654 2057343 2149977 2349758 2451622 2369365 1965375 1625220
17225 1625220 1523350 1401489 1381221 1320927 1158190 919566 905082 816857 768693 803322
17215 803322 840984 716522 732552 722661 710211 761981 716946 568547 464257 410794 426661
17204 426661 416652 435062 423714 327405 395345 395312 323743 424139 418495 453766 409501 452098
17192 452098 442223 432464 409101 400457 416779 379117 251353 217449 124444 -35100 -85011 8535
17180 8535 260621 329843 305399 262712 242420 202286 244897 162050 109544 133645 180944 198906
17168 198906 328984 452588 550339 640116 641086 702072 697293 580707 487755 367750 470830
17157 470830 523081 557399 667719 656964 578329 479054 399365 326884 275801 219909 109898
17146 109898 92884 105397 98380 -24606 -196743 -195632 -117719 -200130 -285642 -319948 -280140
17135 -280140 -291819 -206127 -173893 -225919 -218593 -136839 -59144 -16385 -10117 139839 209747 268675
17123 268675 208966 263231 266574 386729 474842 397619 352841 274364 317056 362193 439402
17112 439402 540187 628001 608766 524644 380885 363633 323963 147897 28106 129613
17102 129613 152110 91275 93626 68411 29986 -22979 29773 77658 43942 -40906 -90337 -241702
17090 -241702 -366309 -387435 -197835 -117393 -99304 -69749 -108966 -208762 -183261 -138941 -21239
17079 -21239 61356 55254 -3163 9021 92070 182867 168779 142623 225354 275226 316751 303895
17067 303895 143549 128097 197517 186919 200635 122423 167902 170049 216335 242426 42856
17056 42856 -29210 -3900 15288 -1336 -9271 -92140 -37239 5306 56003 47747 -133291 -98704
17044 -98704 41883 70890 50145 -46812 -72559 -71490 -39186 -15582 -141384 -177221 -97986
17033 -97986 -36005 -76219 -117850 -157568 -176062 -123083 -32097 -148662 -179465 -164093 -118311
17022 -118311 -148623 -200123 -141842 -102013 -80983 -74711 -99102 -61274 13044 50427 -4972 -57476
17010 -57476 -128939 -137613 -9764 -38239 -107236 -168735 -160487 -90483 -46249 -37473 -688 -70693
16998 -70693 -102230 -117637 -81411 25378 -96592 -148057 -41742 92762 165758 133971 34264
16987 34264 -113167 -237009 -149621 12171 -5617 -16899 66540 -3819 -129391 -170319 -79176
16976 -79176 -85052 -177159 -216172 -146684 -180749 -191871 -180673 -178807 -86779 -188674 -203779 -89816
16964 -89816 -68707 -49222 -83192 -95879 -143197 -119922 -108988 -211332 -166741 -143047 -128172
16953 -128172 -98636 -88533 -22356 75075 88947 100362 79283 -19588 -21089 -47427 -11987 -86339
16941 -86339 -202867 -343223 -276488 -254564 -230496 -314235 -113534 -32430 -155725 -214572 -203105
16930 -203105 -86860 -136231 -124945 -55503 -46643 -80512 5046 22377 -24693 -67447 -236907
16919 -236907 -195061 -216233 -222124 -236080 -268129 -285107 -353041 -294623 -209134 -113656 -59126 18228
16907 18228 -31751 -61089 -145100 -233509 -269246 -256756 -167105 -163049 -72260 58896 138165 184052
16895 184052 158304 39721 18594 -178116 -188590 -99605 -22076 -96394 -122442 -154793 -122543
16884 -122543 -186646 -78106 14507 56634 67707 -20736 20214 -14514 -1383 17436 -69504
16873 -69504 -147982 -185487 -189112 -190376 -168854 -89797 -20645 13768 38525 82205 112372 248261
16861 248261 276600 224918 193286 155497 22385 75679 111985 147015 102194 238714 203748
16850 203748 60671 103463 74262 100842 168465 186823 22745 -14726 40329 172420 205695
16839 205695 241721 279796 275215 242631 288562 447206 528995 547418 623341 552524 324612
16828 324612 212023 311452 305773 356644 458103 618553 742445 669352 498193 446327 377232
16817 377232 366290 336774 415568 430540 473091 571830 445324 204111 294658 403249 511818
16806 511818 601973 576232 569703 589079 635236 706092 593166 507179 431777 360659 247065
16795 247065 157251 217628 237687 111684 -91728 -101326 -76513 9788 95704 272924 420812
16784 420812 398015 468730 459547 400122 314985 274454 342105 357640 495853 715241 743363
16773 743363 621305 505733 452239 317977 201240 191180 265701 272105 195422 307416 315108
16762 315108 168610 131317 265314 326844 234785 181878 199351 173218 229909 299620 134477
16751 134477 67709 103200 54230 51258 7414 -126425 -95812 -15290 39572 42486 2795 26749
16739 26749 -4512 -26166 -81440 -50602 38735 140680 153816 12563 -59547 -44528 -52732
16728 -52732 -33420 -178263 -260356 -321406 -305562 -316663 -253033 -211260 -213908 -139409 -147969 -148339
16716 -148339 -69486 -11507 -51030 -101380 -131100 -19067 65457 45549 -55640 -6764 70944
16705 70944 36181 62230 26915 -51212 -26043 10162 25604 70708 57675 77786 168737 215385
16693 215385 252993 214145 114767 160187 136099 149874 137311 217259 192599 157031 186903
16682 186903 105055 -19840 -66215 42101 224219 131343 -44533 -71441 -136517 -165718 -204383
16671 -204383 -158763 -37141 -94419 -132670 -100653 -41976 -119476 -163225 -67817 -16091 53720
16660 53720 44400 9448 1251 -107920 -120572 98701 125680 3714 -64664 -149796 -38598
16649 -38598 -32852 -86118 -37021 6116 35885 56063 94899 73706 -11458 153208 198904 108171
16637 108171 98910 92936 118969 104826 36148 32919 -1287 25280 66274 6511 -109274 -130684
16625 -130684 -92096 -116447 -132094 -115164 -206903 -234080 -206462 -126438 31913 81506 78037
16614 78037 156222 103952 -9232 -23948 -27058 -36445 56294 75696 -82474 -119346 -126898 -130412
16602 -130412 -265320 -418717 -455027 -304851 15801 86457 -86923 -174635 -194543 -197190 -148934
16591 -148934 -51246 -106120 -199192 -240180 -211037 -189460 -140739 -43250 -10090 -46249 -75520
16580 -75520 -34126 -54932 -13788 -45645 -125523 -108964 -140324 -89389 4739 -3434 -36685 -147600
16568 -147600 -187433 -149931 -157446 45386 56319 37704 -8251 -6328 -137879 -175339 -238252
16557 -238252 -185649 -191337 -101560 -105685 -133631 -111964 37023 39905 3395 -49030 -160438 -281764
16545 -281764 -264560 -347644 -150049 37889 -4459 3236 7452 -33717 -78612 -98758 -130131
16534 -130131 -133400 -111179 -140167 -122573 -44067 5624 -54015 -71050 -7398 170767 275758
16523 275758 251856 168918 150348 38279 133428 151320 -20358 -72563 -113027 -207153 -249928
16512 -249928 -190377 -48107 20083 -24927 -128225 -68635 -127031 -184603 -182251 -204878 -206251
16501 -206251 -94677 -40823 -100213 -111731 -230581 -314967 -137660 -38503 11239 39339 48037
16490 48037 75379 -99205 -136113 -81242 -57445 11716 -32016 -26287 48035 108007 87946 -140728
16478 -140728 -163687 -191302 -242289 30561 -28430 -201027 -189395 -192794 -103569 -62890 -262156
16467 -262156 -321064 -140703 -48322 -4878 -89710 -83428 -8078 30932 -20411 6320 8770 -12999
16455 -12999 -155972 -337440 -299463 -304860 -198739 -115544 12454 53262 103121 145630 84640
16444 84640 72820 112455 130646 5118 -113705 -123337 -27478 -3243 -43671 -55644 19123
16433 19123 -8212 -238105 -204680 6269 125980 210646 95964 -2853 -46454 -82107 -131788
16422 -131788 -26562 41717 12426 -181028 -201862 -40766 84600 73237 -11631 17196 43977
16411 43977 74020 51487 -50082 -74659 -154559 -233727 -191572 -120494 -55886 -169212 -284851
16400 -284851 -217513 -168676 -154233 -271729 -291005 -266439 -276417 -241270 -148696 -166806 -137449
16389 -137449 -143825 -117670 -111256 -62196 -43883 56774 72261 149468 193755 97154 -29220
16378 -29220 -26085 -24906 -344 127324 229083 175250 134685 114030 50580 -15606 -105217 -175743
16366 -175743 -302134 -324196 -270228 -183319 -122059 -87636 -3994 -114853 -118519 -50434 103
16355 103 -186417 -319876 -174360 -79623 -79745 -82483 -1687 -19692 -112367 -149606 -126481 -151388
16343 -151388 -92678 -93313 -61366 110727 151835 -27845 -44617 -135195 -177821 -235464 -242026 -262628
16331 -262628 -118255 -47506 18273 -63310 -103927 -24194 -59229 -45958 10358 19654 -29644
16320 -29644 -73573 -124613 -61210 167430 199374 150715 186796 186584 150189 40168 -48534 -108413
16308 -108413 -102747 -205738 -193188 -140865 -107535 -199137 -214437 -167922 -206779 -298827 -171577
16297 -171577 -99946 -63682 42668 -1012 -68023 6261 -66647 -130163 -142924 -136390 -1786
16286 -1786 12278 109631 40769 -85907 51057 -35312 -222625 -272398 -77241 -4808 8586
16275 8586 -26373 -5024 -11139 56131 78488 -12031 40305 29702 42302 16584 14296 19069
16263 19069 -121885 -239759 -224247 -299789 -152299 -79074 -13600 38473 52701 102736 161577
16252 161577 137131 110879 45935 -172937 -121404 -17515 -56258 -51038 -47778 -140410 -144628 -4925
16240 -4925 121473 231171 286245 238814 168292 208468 300117 258846 108340 14025 8591
16229 8591 -56091 -45743 9438 -77352 -83794 -56052 -50940 -74248 -53352 -123764 -219920 -77485
16217 -77485 50840 83675 33946 5490 10075 -28940 15074 2692 -4325 -54239 27285 -38675
16205 -38675 -191855 -277823 -147516 -101962 -165544 -179672 -79351 -62622 -49360 -39318 -126057
16194 -126057 -13370 36836 -30676 -162603 -126795 -131889 -127417 -202535 -152170 -21475 -78061
16183 -78061 -135211 -97772 -41513 -71150 7538 -781 -106629 -113026 -189022 -70863 -75326 -185950
16171 -185950 -140405 -177073 -260998 -299875 -256550 -176396 -277163 -249832 -68945 -28447 -43433
16160 -43433 -33321 -27344 107792 101359 -10774 -91970 -68149 -1575 -20263 -149545 -73725
16149 -73725 -73285 -92324 -72164 -67978 -25659 11819 -84990 -155577 -171212 -121530 -49882 3963
16137 3963 56086 92948 18564 26677 109803 39398 -47360 -11532 15981 -68006 -163664 -131057
16125 -131057 -115374 -39400 30288 -26363 29965 3131 -5106 -50141 -35039 -24054 -45881 19073
16113 19073 107321 178769 197364 172517 26209 23092 30109 -22346 42618 77895 171501 193832
16101 193832 62651 -45928 -144732 -47643 19064 5451 60804 74159 14391 89309 125238
16090 125238 101880 5360 8901 -30452 -39307 -71717 -117739 -64743 -1909 -44999 -107651 -24864
16078 -24864 -40603 -183139 -122120 37550 19909 -11867 -1098 -34866 -87624 -130326 -116640
16067 -116640 -96442 -120866 -92135 -106791 -208287 -86280 87591 107212 15527 108988 198183
16056 198183 253317 73909 23987 135160 167874 85283 -1516 -38032 -43559 -40876 -212212
16045 -212212 -225133 -121241 18267 -8066 -95400 -41356 -74092 -93373 -138174 -110213 -67273
16034 -67273 -87722 -163914 -176267 -232168 -178154 -145453 -88530 -41574 -62989 -67190 -25477 -62823
16022 -62823 6099 62552 -13540 -81791 -177469 -122698 -89736 -71469 -12317 93110 154398
16011 154398 123470 31166 -86935 -80092 -21009 -11649 73989 69655 76779 6590 -25321 -41632
15999 -41632 -18641 -52346 -26390 20993 -68284 -144052 -130150 -93574 -76304 6799 65612 83988
15987 83988 18438 -11426 -50728 -76125 -78858 -90988 -95626 -185285 -141274 -155555 -137820 -138542
15975 -138542 -219419 -155450 -68193 -96034 52369 237728 195096 108792 81784 51282 61757
15964 61757 51124 27090 79246 112432 82335 46421 77046 187794 255087 145467 50957
15953 50957 27095 44612 -1005 -54407 -64333 55495 389 12949 49153 -122226 -141144
15942 -141144 -8005 90221 56845 25529 8330 7159 -46553 -109368 -101626 -104281 -141052 -107212
15930 -107212 -70500 -26577 51136 16814 68781 72932 96785 104286 163573 155602 72758 -31003
15918 -31003 -75358 -78396 -141541 -5698 55612 108154 186358 190645 183196 14790 -150444 -209173
15906 -209173 -196100 -164165 -74050 -71905 -112737 -158938 -281838 -259076 -131814 -135258 -192073
15895 -192073 -122949 -58830 -6720 31244 42241 -220 -72096 -119962 -199659 -102147 -22325
15884 -22325 38925 -19653 -127046 -52278 5735 -2046 -48927 -153785 -239177 -126638 -146917
15873 -146917 -109626 -94440 -30116 58 -29217 -47298 65294 56245 26183 -17359 -51315
15862 -51315 -95440 -15291 35855 74076 -52378 -146510 -159063 -255759 -178712 -174010 -78376 11585
15850 11585 30618 49987 104015 72057 96157 69210 118493 -27876 -27225 58929 74119 124731
15838 124731 103348 147712 110464 118689 41466 25391 43762 73694 78523 132078 115491 139756
15826 139756 28028 54335 92917 126443 210519 166263 109865 169608 167596 225759 174798
15815 174798 209240 149736 34671 -16682 31817 134289 136951 49068 36983 87495 -61531
15804 -61531 -198678 -28042 27091 -12817 -2880 27068 54479 30537 17168 -15801 -101829
15793 -101829 -41241 18472 -44083 -87285 -62590 -156945 -156514 -76194 -60793 16218 32378 -1599
15781 -1599 51911 16575 -169890 -180538 -22541 -24963 -46042 47581 -24076 -72635 53460
15770 53460 4429 -36783 53625 88151 148753 96094 28641 169123 270059 214937 276114
15759 276114 200922 262091 289779 174687 101302 11817 -11821 7818 -22466 -136868 -143884
15748 -143884 -125569 -72236 76989 58220 18458 -44504 -168155 -263514 -191523 -158996 -97783
15737 -97783 -103541 -206948 -233773 -182098 -27748 115480 179437 113125 105948 115462 76973 68821
15725 68821 -60611 -182446 -190273 -165928 -151056 -152862 -286729 -214182 -180808 -226145 -164187
15714 -164187 1788 -1296 -86653 -130670 -131956 -78769 -30513 -64235 -25153 -54835 -2818 -6969
15702 -6969 -8617 45180 184965 113362 -39059 -176706 -237689 -213064 -215663 -197235 -240004 -200620
15690 -200620 -152071 -24172 46996 37936 46814 57039 -2987 -100048 -159716 -207893 -206264 -214003
15678 -214003 -172950 -148840 -40749 -12715 -16191 -7713 -14435 119141 90442 -40656 32597
15667 32597 73494 97441 20477 -30165 -4083 7135 34680 -4028 -109386 -174983 -170768 -164701
15655 -164701 -46900 -42269 -99543 -147000 -195118 -52445 84029 150314 90390 -173646 -195859
15644 -195859 -58719 -22462 -20606 -65206 -35768 -43259 -64647 -75058 2214 27693 -28452 44192
15632 44192 69966 -7341 -55033 -42468 -3210 57105 -28854 -28899 78684 75224 -161172 -287077
15620 -287077 -218252 -113256 -219027 -310021 -213280 -100389 -8170 -108222 -42055 73460
15610 73460 115240 2850 -61976 -69090 -127176 -152629 -12702 -57168 -48693 28480 -90429
15599 -90429 -98674 -99752 -124079 -51633 86562 96337 119533 82824 55311 47179 -879 -87635
15587 -87635 -317206 -427572 -411022 -326656 -282944 -234469 -88732 29188 -28988 -77917 -5175
15576 -5175 -52018 20723 97719 61763 41090 109973 140548 61100 -38173 -90058 -21729 115242
15564 115242 172172 140158 -10734 -213196 -163223 -92696 37316 45044 19805 -113804 28199
15553 28199 21294 -1371 -6713 -6606 -22662 -49105 -22624 -60107 -139543 -242696 -278278 -307424
15541 -307424 -188675 -18948 -92353 -144487 -98883 -172898 -104007 45876 83161 109591 2106
15530 2106 -6848 20873 4858 8356 -7976 -72216 -123708 -93729 110196 33134 -177121 -201938
15518 -201938 -20392 101334 30518 -37207 55756 90539 80401 41440 9651 4022 -19615
15507 -19615 -13557 15984 32082 -22078 -65387 24716 123443 -19104 -7773 125420 189742
15496 189742 316264 416576 184664 -74093 -32846 132402 184728 53212 14601 78501
15486 78501 141104 95105 -28169 -1120 37777 -95460 -114697 -75527 -21244 -103217 -69217
15475 -69217 40760 -16310 -59605 6393 71795 89987 -61712 -145129 -183623 -168537 -120404
15464 -120404 -68382 -24440 52945 114881 126665 221389 144166 -107022 -129793 -252422 -369234
15453 -369234 -241345 -97455 -52471 -36014 -107903 -68370 36371 66553 35840 -3777 -116094
15442 -116094 -182062 -173125 -163704 -39775 -53369 -63307 -66025 -94053 -144972 -194620 -125234 -113887
15430 -113887 -279426 -349732 -262120 -88169 -160281 -104424 3866 -2010 13680 65234 41005
15419 41005 -3492 -99173 -135032 -63387 73122 75493 35742 75769 55311 103937 197983 115839
15407 115839 41843 71304 27804 -9164 44482 128646 51825 54119 -22849 13167 18354 101612
15395 101612 132590 164423 121932 75896 29204 39960 54476 148519 117896 -56008 -143692
15384 -143692 -118214 -84010 -29908 44695 71913 157393 140474 82227 30431 143733 186093
15373 186093 113862 10326 -34960 -155751 -372654 -384135 -302635 -189730 -41150 -77648
15363 -77648 -28611 -45775 -39012 -41172 -61463 -58723 -156692 -194054 -111583 -89119 -188191 -191846
15351 -191846 -81442 -54664 -92815 -56465 -30939 -82293 -66228 -163148 -128275 -6433 -6003
15340 -6003 -101425 -73714 20467 167593 246003 211367 72817 46504 110005 193436 111177
15329 111177 108918 172915 156980 191781 119379 125471 187797 210561 171555 132737 87947 130573
15317 130573 215959 128234 33289 -73540 -98752 4901 65419 -75216 -141153 -128688 -158499
15306 -158499 -265664 -276223 -166650 -29414 83530 103119 163144 193921 119071 107234 75298
15295 75298 8502 -44654 52582 104423 141885 7335 -18536 -27013 -44709 -53861 -17712 44736
15283 44736 8030 -38232 -31294 18437 -20534 62529 129430 87596 39276 89685 18291 26298
15271 26298 22260 103101 224219 190787 254216 237705 166804 121001 -27897 -107829 -65871
15260 -65871 1120 93656 175378 225674 147976 101797 101095 51671 107443 197233 210132 132028
15248 132028 119839 90688 24863 -51582 -30701 -56044 1709 17753 14447 42110 56611 -9731
15236 -9731 -23934 -57296 -129804 -171059 -218799 -60933 -66999 -82259 -5533 207 -30958 -29519
15224 -29519 883 91896 180589 192937 -3997 -17462 -46922 -58669 -73469 752 130364
15213 130364 143056 90830 123112 -25476 24544 189502 112197 -12460 -76859 -20347 -126758
15202 -126758 -182338 -284030 -201787 -57490 -83749 -25063 -32085 74289 76881 112602 52000
15191 52000 -20205 -6647 -7109 1622 -65493 -111710 -16754 56553 87094 148581 67057 -57615
15179 -57615 -12428 30457 41445 81797 32018 9396 -17310 50504 12746 -205121 -266903
15168 -266903 -114638 -98954 -56687 39990 -42191 -44940 -38493 70795 121950 -10242 -25207
15157 -25207 33312 66341 106853 46960 105435 99941 -69670 -30825 37894 91330 124340 167368
15145 167368 124200 23384 -25230 -39620 29973 -1076 -36247 116677 304238 293320 219176
15134 219176 42325 -6104 -16967 65392 164388 157284 12958 -51954 -71274 -109999 -125116
15123 -125116 -127678 -134350 -145069 -106493 -49143 -102571 4155 118096 103681 -12179 -129987
15112 -129987 -148452 -160660 -17169 130094 151938 2273 -65128 -61040 14681 146919 190662
15101 190662 206218 184828 152876 119769 175997 16359 -136575 -125241 -156294 -79026 139509
15090 139509 158538 131174 53903 127034 202573 179174 209564 169224 106422 55073 81941
15079 81941 78786 19673 45153 -11752 -21578 -18664 13078 125226 -21150 33498 23517 -100061
15067 -100061 -249006 -149732 27509 86655 118522 90612 42220 63133 -55143 -92084 -30310
15056 -30310 7825 27648 54002 161110 11443 -50923 -27258 -895 -24120 58299 41066
15045 41066 -57987 -23893 1242 -49369 -76067 -140073 -200769 -178956 -106961 -43274 -9004 56637
15033 56637 155021 86086 -21266 -194542 -287627 -203113 14833 77801 -80459 -42779 43793
15022 43793 85100 8939 8432 36915 186041 162818 14279 -4813 -37917 -29018 -24641 83767
15010 83767 78903 -52450 -168596 -244716 -171773 -115893 20457 -40357 -94024 5240 95160
14999 95160 62337 -92361 -145308 -94780 -176013 -282567 -302647 -280604 -176565 -187275 -251173
14988 -251173 -237742 -47468 -13065 -71092 -19867 142863 183582 46314 -30033 64685 173735
14977 173735 95377 72870 -4004 -13295 64267 74309 106909 511 -96177 -68780 -65982 24262
14965 24262 -23648 -16029 143640 220401 87836 -31196 13762 31810 28317 43318 -66488
14954 -66488 -83076 -98492 -99820 -3704 74734 84741 102540 6067 19494 115446 125325 54482
14942 54482 -111042 -128279 1530 174937 229037 176159 167108 138556 169569 103459 -51670
14931 -51670 -24833 90121 73236 56057 86533 60361 110696 85495 98119 106012 -98560
14920 -98560 -98467 -37465 -24475 58699 67409 21012 21260 43699 107778 66676 69929 -42026 -63646
14907 -63646 -143870 -136648 -192855 -187097 -66369 -29669 76725 63409 40153 207859 190891
14896 190891 28539 -73651 -46284 -849 89406 185594 220796 223449 322762 291331 170256
14885 170256 23422 -10853 -16334 -51972 22949 -87247 -119450 -79323 -5906 48567 129729
14874 129729 111030 41202 -86312 -17846 -58833 -115210 26827 20753 -142957 -144092 -88685
14863 -88685 -253317 -285721 -218427 -278508 -345413 -296928 -289769 -344367 -271021 -51662 -5367
14852 -5367 2407 96881 113297 55859 36502 -15225 -74217 -109122 3759 82995 82555 14341
14840 14341 -82719 -33822 63769 209553 222877 246918 249106 182157 9339 -44142 -130369
14829 -130369 -157997 -123317 -43084 36108 86616 6314 15146 30804 25046 -727 80627 112776
14817 112776 51322 -2768 -67562 -17210 -41149 -80142 -32820 115887 181406 172066 225184
14806 225184 22124 -134316 -124862 -23581 94753 150894 -17736 -65013 30756 -9075 -28952
14795 -28952 -38158 -9524 -94409 -170770 -157485 -129268 68819 25847 38836 65412 -28729 -152119
14783 -152119 -123969 40653 8459 -28174 26967 36286 34845 51758 -3869 -139766 -62267
14772 -62267 133098 107248 65562 65171 -57772 -71177 94962 89982 57787 55162 23238 170063
14760 170063 230756 248398 103692 30293 85546 91415 31529 136278 138446 109216 3891
14749 3891 23914 19750 32243 -13925 9301 61208 212892 106864 -15008 18528 -44
14738 -44 -86775 5327 55509 -1672 192743 320111 283991 193485 102136 -9153 -56675 -2571
14726 -2571 -39960 -127193 -75944 -4797 16354 14440 -17844 -142647 -171391 -241749 -170222 -35722
14714 -35722 -81235 -44907 -74924 -95154 -16274 -6043 -109234 -117678 29654 153881 40823
14703 40823 -49205 -42569 -29549 53907 28933 92922 -53611 -89434 10259 136318 99112
14692 99112 173751 261188 313579 192815 83976 15868 62955 15271 -35833 -33999 -25701 -103131
14680 -103131 -110934 -103774 -21117 48964 8932 105131 -4361 -96394 -248549 -204661 -170837
14669 -170837 -113331 -63265 -15183 -88062 -62299 21841 2457 47187 -12937 -76337 -95476
14658 -95476 -164297 -120437 41220 150911 67234 25532 51165 17938 -45544 -98797 -143995
14647 -143995 -201836 -178372 -174172 -40996 122716 111478 107812 117780 118515 705 -47625 49649
14635 49649 83751 -24368 -146502 -51527 -20 -21543 -118635 -116692 36783 -2153 -36693
14624 -36693 -32868 -123600 105191 107010 57093 -9175 -109440 -171790 -31672 -5391 -95412
14613 -95412 -61947 -15358 -25252 -52607 -108721 -219418 -168974 -134026 -116117 -137073 -71608 34779
14601 34779 66996 166904 257652 288777 148446 80240 19289 21653 19199 21706 66537 134004
14589 134004 132827 79667 104136 69425 -92529 -28773 199799 150900 -103787 -114321 -93835
14578 -93835 16150 57594 67192 48405 17519 29439 -738 -80532 -137394 -24350 59374
14567 59374 96284 165598 207862 214535 190263 163712 166739 184042 196300 125713 -28461 -111369
14555 -111369 -138437 2431 -35743 -75040 -18759 58425 19352 114462 160792 75756 -10902
14544 -10902 85426 28917 -105181 -51981 45475 163324 100349 167298 113666 40898 104201
14533 104201 167377 140850 131246 131013 188982 128301 52976 15506 -50806 -80505 -39738 8337
14521 8337 4221 49340 22705 48904 93052 136580 113744 166330 302182 314444 283430 226854
14509 226854 212848 200238 251586 269050 167331 181102 222222 137660 61663 -83610 -196331
14498 -196331 -206559 -235800 -211773 -109396 -42348 -70776 84126 124208 81169 21405 -716
14487 -716 -68186 -20138 33237 -20535 -20705 43919 119679 138387 58366 -76647 -139927 -25148
14475 -25148 36399 -34108 -177540 -108622 -576 -22519 -75621 -32500 22316 110495 -19788
14464 -19788 -172409 -114819 -1776 57089 -49420 -93227 -40251 7083 -21230 18124 179260
14453 179260 261798 329353 291548 204779 201075 120672 -606 -27589 80893 175144 29889
14442 29889 65663 77446 76758 90001 85187 23179 -48606 -43825 2702 88923 53637 6160
14430 6160 -59572 -61853 59879 228766 147156 125679 142433 170208 196390 199227 190390 207562
14418 207562 75925 -45748 -127614 12754 64665 60018 61425 -26018 14383 151446 73154
14407 73154 -7799 -106341 -145070 -78743 21629 109274 75559 -2569 -95774 -129618 -62476
14396 -62476 6753 35001 135737 77072 60318 9055 -48445 -1825 -31886 -60212 18949
14385 18949 26247 -95700 -87742 95811 143781 188183 236346 72205 48286 78730 52587
14374 52587 -18493 -54729 -80508 -26684 13823 54846 72889 23221 105306 129101 250854
14363 250854 308541 319983 167677 -23696 -12897 84099 88198 84556 48076 -60013 -143275
14352 -143275 -65532 19814 29308 18339 27842 33173 -20185 56629 159045 173632 117915 48517
14340 48517 36821 -9801 -46866 -23353 25133 101646 101902 -13255 69320 154946 115949 112838
14328 112838 107891 74260 85834 221135 245864 87504 -54221 45636 112682 154734 93543
14317 93543 -13127 -115495 -182813 -94681 -28440 -80072 -6109 51634 35758 31801 11222
14306 11222 26562 63789 41359 29897 37219 88398 72412 104365 147073 97651 -32903 -168708
14294 -168708 -168473 28539 81296 79562 128408 115253 88421 70031 80672 144526 247336 207801
14282 207801 183837 93908 43296 176703 232691 199336 227936 145361 91043 177461 111386
14271 111386 78101 144042 108817 19625 -16338 -61843 11959 81600 48513 1496 40850
14260 40850 109498 95658 -6957 -46737 -817 83517 40477 -14237 34002 -12495 65926
14249 65926 73551 4491 60927 108794 97059 153890 266732 197325 89130 126750 201727
14238 201727 158404 37687 54770 71572 120622 251555 152758 79831 23668 20684 207341
14227 207341 266891 236565 158580 88283 50748 -23337 -8366 27755 57341 43779 56291
14216 56291 93880 30885 28394 6932 -1085 43472 101134 148650 71739 -79993 -43392 -35421
14204 -35421 -154317 -287766 -200046 -117454 -14298 54390 49025 4548 -63285 -54663 -36366
14193 -36366 32481 75534 21014 -22748 -5737 -182731 -279197 -186286 -59695 19549 66937
14182 66937 122612 75392 -12645 132489 284171 188790 -14206 -85357 -169967 -140597 -36189
14171 -36189 -44967 -33175 -43006 7412 36396 155379 292932 334238 210038 43167 -17477
14160 -17477 -32713 -76940 -7468 95531 100289 -28 11481 14613 -75291 -86364 109868
14149 109868 162951 90925 86201 33496 -39442 -11395 54578 23635 175662 256753 353101
14138 353101 282870 182565 107192 126385 157849 110352 20180 -82660 -49763 63204 77692
14127 77692 41438 98219 133218 124900 121592 73301 139653 174080 62402 800 -55840 39502
14115 39502 -2723 -45702 -3200 -3490 20606 91945 136587 163227 183351 217832 145719 178030
14103 178030 124137 115997 113660 25940 17309 -122150 -222546 -209252 -59419 108177 -50106
14092 -50106 -190617 7663 -120192 -157540 -47112 117060 206545 204779 195804 128297 112963
14081 112963 108801 74489 11416 97053 148550 211985 85397 13164 41919 -47497 -23705
14070 -23705 50128 86922 113103 272234 422507 309190 228855 319492 308201 308291 242065 132235
14058 132235 161098 224590 207546 111117 46213 -21314 40167 127438 193068 230004 155000
14047 155000 92879 67505 33929 1217 97191 90410 242500 282449 131898 5580 48883
14036 48883 52863 -17846 -27674 -79648 -87703 41427 116967 113717 65366 47149 70487 157364
14024 157364 170619 30162 45201 17885 101436 78110 87422 26428 1756 142876 206949
14013 206949 204234 187630 234848 178291 57250 -36826 -44510 7034 17183 102019 183000 178086
14001 178086 132457 -11174 80482 154959 167403 198292 215570 276020 263334 223237 176356
13990 176356 79621 107247 276909 214213 162048 131665 224408 221673 160338 136290 87297
13979 87297 186855 214389 125278 99421 74768 105344 176410 168085 177312 123586 189384 165511
13967 165511 115932 57195 106214 189648 186747 167243 222375 191714 119071 91169 145558 -17004
13955 -17004 -92527 -3820 22585 5821 51380 46291 99778 48112 113476 208494 309412 283432
13943 283432 312256 356852 313383 218213 145594 107492 112504 261380 339907 297530 293383 294504
13931 294504 310124 325759 279406 243903 210510 99189 162439 199284 157756 124617 35940
13920 35940 55004 11349 -94676 -54381 5381 27469 111991 176447 210208 193888 250577
13909 250577 269804 269811 324060 348952 324646 253419 262015 267941 315982 201252 128067 41272
13897 41272 -33332 18500 116691 76069 -7303 -10456 35151 96487 100222 110468 173279 191448
13885 191448 229402 337545 324703 346882 417340 367517 240305 204392 237655 132990 42779
13874 42779 131578 124973 238472 242335 277784 234878 159323 105414 129025 120285 140335 294795
13862 294795 300925 258512 239308 205360 133778 148864 69606 2656 9557 185050 253532 220267
13850 220267 268810 231988 151334 -17837 -114154 -39909 92293 81524 200611 335214 216703
13839 216703 -23770 -101790 -79361 48977 100697 112227 7702 114624 221911 248589
13829 248589 259940 209362 131031 119481 44321 -38724 -49549 -81407 -94701 7180 115310
13818 115310 287781 386106 431029 404448 327224 369928 344422 383284 443110 463251 400612
13807 400612 345520 338132 248866 249449 246993 288822 295433 370337 398230 300752 231306 163822
13795 163822 125446 168662 217068 164508 150178 212109 182799 167666 156293 228467 207021
13784 207021 193885 133947 112615 71001 180282 200964 126047 26623 63170 24224 148834
13773 148834 152503 152817 273036 330694 351412 512658 413942 408416 407145 334859 311777 226569
13761 226569 266399 285218 167137 127658 109923 18144 8107 59806 39292 -38490 64462
13750 64462 130925 10067 67005 72952 137878 171254 190028 299062 317367 286065 148063
13739 148063 135830 129912 150151 119504 136242 52261 48257 103258 145719 128168 98224 226652
13727 226652 385998 417833 330474 339078 291388 208176 71313 -8162 11319 88579 104814
13716 104814 42644 142273 150596 164749 228523 210235 189556 288643 221823 236147 181032 173601
13704 173601 195870 355443 289140 122843 47216 190470 342732 343593 245488 203839 157104
13693 157104 187450 305299 431052 391883 346124 279289 294121 292012 287822 149397 233656
13682 233656 286677 319609 230724 202884 148179 155728 289050 221241 140437 131534 192309 323144
13670 323144 333969 306197 239103 144448 139961 244600 203452 170329 231606 316073 423846
13659 423846 232127 120612 77517 141124 151250 151241 152206 232751 211142 163605 182298 152798
13647 152798 151149 122130 84234 154970 200088 236132 196123 219338 86460 112198 105385 123477
13635 123477 134858 92582 150767 294809 343449 474241 499868 482290 486865 477525 486558 357758
13623 357758 363781 406585 426072 412860 383239 321707 260165 230070 174402 97276 47033 -49447
13611 -49447 60757 253488 349543 303434 292254 287687 257761 185953 227734 259515 237875
13600 237875 204474 227585 229114 307460 249540 188780 277898 273716 280014 235565 185095 244303
13588 244303 258455 144597 174388 246088 363797 402054 332870 249095 288927 376293 402035
13577 402035 312667 244591 169616 304555 435526 466524 398366 296427 355887 377119 385991
13566 385991 329405 349970 388300 397962 279007 207052 160860 75084 188231 321427 380064
13555 380064 427058 376850 331163 401055 380771 269957 314420 312412 317875 380434 351445 472637
13543 472637 418575 330741 403402 446157 446748 406235 351086 348248 420257 483120 399730 364051
13531 364051 413799 481336 591755 577659 525392 461763 416021 383988 376317 362422 435501
13520 435501 444781 475668 465563 446459 513068 569113 598410 578144 480451 392366 372927 382036
13508 382036 365516 472639 374228 258536 219565 232122 281387 419350 492945 581649 704837
13497 704837 649655 479002 455253 357001 295403 330800 350775 376654 317541 318377 307476 390934
13485 390934 441971 536136 474856 387937 345972 425743 491506 484445 412956 496771 507084 462331
13473 462331 479589 503502 575767 502609 493252 441241 513719 565882 574007 706516 585078
13462 585078 460455 417257 389287 451049 359395 413040 390247 462020 468095 492127 538722
13451 538722 544510 500749 462142 469916 480072 510810 418982 346481 273379 321233 466609 540053
13439 540053 562285 651739 574755 519578 588652 704748 656648 531228 470563 444806 480242
13428 480242 600110 590536 647310 554103 589374 529550 401303 446437 508846 471307 596527
13417 596527 614671 548413 521088 358357 453606 582508 532832 571746 520090 637250 775655
13406 775655 781047 806767 768091 696418 672341 671890 619651 629152 716376 680615 563722 551152
13394 551152 653370 634499 573897 630225 619509 627911 716748 704221 570942 591481 570038
13383 570038 448798 513206 488594 498094 573177 602786 557999 476283 684171 798514 684677
13372 684677 542511 574831 678483 558402 537884 623880 743903 856054 930734 769783
13362 769783 739396 688623 744917 785449 769674 763652 604288 506555 533054 639056 660366
13351 660366 497957 516524 596199 605341 610015 706970 783097 726330 623750 605231 625039
13340 625039 744613 780886 786997 716679 747851 752234 682069 738850 695431 787219 752314 634333
13328 634333 684328 651581 673676 849097 945844 999871 943501 844906 831496 905382 828453
13317 828453 791612 876661 886563 845464 944890 966469 859454 815831 859902 818452 730971
13306 730971 715221 722657 749451 860517 837988 821982 737292 714353 760195 854113 954977
13295 954977 942000 943289 936742 874036 857093 812214 760923 861000 1023223 1074100 1018944
13284 1018944 965636 1033661 1115068 1126692 1069432 1119070 1115273 1080279 1009576 898893 802132
13273 802132 834490 859558 930150 930736 968156 980479 887901 767377 848551 857021 839764 933876
13261 933876 1099319 1182957 1105058 1138898 1124735 1073999 1045260 1052722 1140179 1219406 1289631
13250 1289631 1354345 1263687 1065110 928534 928974 1028772 1025899 952971 1072711 1151585 1227664
13239 1227664 1199410 1115070 1143899 1249936 1364259 1369679 1347252 1325363 1331256 1325854 1212381
13228 1212381 1092369 1187780 1296112 1358139 1348062 1362856 1444441 1518299 1481139 1371802 1514268
13217 1514268 1563904 1517285 1482041 1551396 1572102 1725311 1678891 1587754 1667851 1725768 1606873
13206 1606873 1444960 1439670 1528463 1627949 1723320 1706534 1600749 1630422 1696994 1737709 1713831
13195 1713831 1795729 1993246 2197820 2344831 2663516 2882845 3060143 3204986 3281888 3224483
13185 3224483 3044173 2862855 2699517 2673660 2573267 2492932 2450316 2495202 2582589 2618879
13175 2618879 2685136 2746852 2844083 2894524 2890163 2912862 3037673 3011660 2904388 3021953 3139104
13164 3139104 3195730 3215932 3301011 3460820 3608517 3730094 3787898 3733147 3626717 3607800
13154 3607800 3522435 3548152 3484486 3372555 3314300 3292021 3214418 3213353 3214523 3216655 3278296 3346102
13142 3346102 3254238 3300929 3219378 3145636 3179386 3306258 3332855 3413144 3610492 3772638 4011829
13131 4011829 4177139 4257202 4209268 4116198 4014777 3915643 3784912 3554778 3405464 3235356
13121 3235356 3232382 3226444 3097792 3068607 3019105 3064721 3123096 3156844 3088450 3048421 3125268
13110 3125268 3147758 3139561 3136756 3130223 3066492 3106748 3169575 3215606 3248535 3285425 3383083 3425469
13098 3425469 3501950 3629319 3567694 3504740 3426681 3366169 3304383 3273314 3331486 3423536 3471979
13087 3471979 3481487 3538068 3596575 3688768 3706593 3666333 3819858 3853791 3861316 3996759 3887935
13076 3887935 3865310 3964129 4115039 4175103 4235175 4229852 4292631 4378557 4438977 4439574 4396057 4351435
13064 4351435 4442558 4401864 4457068 4720293 4708887 4872834 4992195 5040544 5018465 5038812 5189919
13053 5189919 5291908 5337949 5447663 5643483 5715208 5738288 5735991 5730393 5794878 5794338 5914726
13042 5914726 6160122 6352937 6392841 6528057 6627076 6592423 6614953 6733282 6787724 6881325
13032 6881325 6962501 7073116 7232595 7370167 7435119 7516988 7728834 7817455 7986334 8124855
13022 8124855 8201824 8310374 8519892 8732232 8849446 8928793 8985102 9024513 9159598 9360401
13012 9360401 9592858 9865115 10011365 10241409 10410818 10540439 10796573 11106871 11374994
13003 11374994 11690907 12066797 12375414 12666247 12974014 13238421 13400879 13547278 13848885
12994 13848885 14189696 14522395 14795816 15183187 15538667 15733991 16085838 16449958 16788039
12985 16788039 17198253 17654186 18169622 18683736 19222776 19659536 20049618 20435633 20943173
12976 20943173 21568805 22279054 23006701 23633407 24191063 24785962 25399040 26128340 26921805
12967 26921805 27486954 28296933 29274483 30270142 31177097 32054658 32925795 33903562 34846630
12958 34846630 35859182 36982726 37977498 39069570 40233361 41490006 42896265 44457198
12950 44457198 45958845 47285622 48779768 50299640 52000744 53590982 55242730 56915172
12942 56915172 58746516 60698739 62578753 64426463 66219702 67965976 69855981 71748342
12934 71748342 73501575 75435979 77350706 79160297 80916768 82628758 84291270 85908599
12926 85908599 87398370 88751606 89948700 91000116 91871655 92489260 92891505 93237363 93400674
12917 93400674 93353866 93167675 92804763 92275335 91679201 90972250 90077129 88907018 87643159
12908 87643159 86196146 84713883 83219580 81500713 79689658 77802015 76084330 74485238
12900 74485238 72658971 70795285 68938607 67053072 65174831 63298608 61461921 59743424
12892 59743424 58028950 56376571 54748398 53074470 51476756 50060367 48612291 47142417
12884 47142417 45879987 44654152 43349683 41913920 40481927 39221813 38139224 37179281
12876 37179281 36090073 34984328 33870568 32828830 32057862 31246990 30380869 29498615 28716554
12867 28716554 28026290 27422308 26801380 26166222 25268708 24637851 24061697 23623642 23158436
12858 23158436 22657917 22193611 21680531 21166904 20792611 20319481 19543136 19062258 18606781
12849 18606781 18207517 17829361 17398392 17072563 16766097 16391765 15989023 15550281 15192443
12840 15192443 14778494 14488023 14201257 13965176 13736815 13451742 13157754 12953640 12779132
12831 12779132 12622304 12573001 12394936 12209076 12089411 11798116 11449255 11179092 11010929
12822 11010929 10837830 10735597 10773519 10676806 10453869 10293999 10181885 10134725 9953330 9854190
12812 9854190 9870067 9751121 9528854 9260735 9114555 9022499 9002889 9081849 9068646 8834425
12802 8834425 8751100 8723684 8629549 8644212 8730088 8834270 8754626 8744815 8770814 8737788 8702239
12791 8702239 8748070 8732159 8721224 8766400 8865252 9070959 9115727 9080895 9202701 9250566 9269193
12780 9269193 9281255 9259172 9344597 9475189 9608340 9720290 9880334 10028206 10329334 10627556
12770 10627556 10924195 11270738 11703708 12195402 12548056 12979307 13488871 13927952 14600393
12761 14600393 15279893 16237199 17303379 18414822 19774511 21305728 23024939 25153907
12753 25153907 27662274 30530180 33863981 37967668 43137271 49862315 58843405 70754854
12745 70754854 86605584 107828293 136131227 172630478 217162272 265347682 306811863
12738 306811863 329220784 325723384 299657672 261950133 223689238 190827293 165645838
12731 165645838 147964598 137182446 132238363 132546656 137471949 145926018 156947925 169369429
12723 169369429 181345945 191204614 198498373 203568036 207625963 212277254 218868595 228724559
12715 228724559 242941237 262250893 285934067 311578181 335169294 351845324 357170555
12708 357170555 349458100 330827349 306430042 281387701 258987470 240845373 227433361
12701 227433361 218648730 213683799 211364160 210276908 209120062 206594855 201523664 193181503
12693 193181503 182143099 170050133 158908685 150580004 146125255 146761647 153239308 166491788
12685 166491788 187327917 216043233 251680768 290272542 324324357 343923709 341524414
12678 341524414 316795549 276996535 232901527 192636519 159148813 132683172 112063725
12671 112063725 96211067 83718180 73795208 65795208 59064962 53110227 47873607 43227394
12663 43227394 38944550 35114447 31832978 28982730 26388605 24090412 22073754 20423425
12655 20423425 18975104 17582590 16365048 15398173 14406247 13457814 12592202 11768212 10913899
12646 10913899 10276956 9735548 9084918 8496581 7999316 7655639 7330257 6998546 6638864
12637 6638864 6270090 6097726 5982666 5714416 5329830 5012558 4645369 4419779 4333561 4185778
12627 4185778 3876424 3667719 3567129 3471272 3264910 3176892 3166433 3194998 3240361 3194554
12617 3194554 3031001 2979049 3077478 3107207 2984842 2760998 2770232 2640067 2543292 2477613 2305420
12606 2305420 2393101 2397983 2376015 2371141 2347981 2210056 2091295 2098773 2064683 1872741 1785026
12595 1785026 1763115 1794713 1795363 1749256 1830347 1783746 1617532 1655960 1764703 1839671 1942890
12584 1942890 2004097 1858069 1741818 1912036 1939062 1787676 1728339 1678997 1770835 1685149
12574 1685149 1550800 1521782 1546200 1525767 1614484 1655915 1846263 1985076 1972955 2045907 2136215
12563 2136215 2217514 2180846 2223154 2186811 2105812 1960117 1857167 1806805 1732213 1640807 1530921
12552 1530921 1322045 1167659 1119277 1077244 1020591 979435 993590 1096671 1055745 1060723 1114837
12541 1114837 1125545 1120697 971815 945815 848846 848845 868774 983805 1006161 779383 796370 840537
12529 840537 717833 675300 765282 844319 911577 1003509 940906 973481 950416 1043103 1104953
12518 1104953 1123178 1132668 1110936 1056181 992047 1007938 959615 872638 827985 799665 839768
12507 839768 842839 856213 933415 830791 862097 880270 848704 796268 831793 736778 642019
12496 642019 653539 654100 533721 418020 575422 705818 716907 772614 799690 849318 825742
12485 825742 797511 741666 670270 635449 755236 844269 943671 902549 871282 1016251 1058622
12474 1058622 793554 603629 634160 704064 729849 696739 510862 463661 409505 424874 404784
12463 404784 483232 513516 543680 624051 660180 626060 563053 496088 442407 402613 474464
12452 474464 591859 566894 519397 651481 683242 580916 521004 445785 425141 484191 445986
12441 445986 384455 375158 480551 596708 483830 517031 669319 692950 647787 590759 532918
12430 532918 405363 360162 408002 366144 398492 315468 305416 388401 440023 567937 671155
12419 671155 615886 510741 454121 439592 373590 382169 293467 277628 341769 389238 444804
12408 444804 455570 448861 455355 448124 485988 579604 506417 458039 459293 503725 476464 420099
12396 420099 415707 373975 366269 234202 141545 294991 296979 261352 363743 353623 302621
12385 302621 318719 395937 456130 476003 384683 355312 300646 323830 449731 500194 382069
12374 382069 289777 223878 305111 472646 517091 443826 446932 340972 374803 323714 275224
12363 275224 318746 401377 427080 304846 241489 272177 299014 265522 272995 373788 432437
12352 432437 364954 329568 269818 284593 237270 159922 216343 72792 182264 243877 195287
12341 195287 233832 223450 311287 393285 399374 393919 371300 304149 289342 294982 369870 338545
12329 338545 246524 191810 169294 170712 215290 197675 132858 221936 256653 305095 282504 343350
12317 343350 392016 387558 442626 428728 378230 362934 359965 303970 244069 293466 272205 117216
12305 117216 122344 299632 369357 308974 315736 326636 405241 349192 281873 329267 361244 389518
12293 389518 443255 516260 553668 672575 684444 913010 1077793 1166175 1367663 1478493
12283 1478493 1653322 1894178 1986339 1876679 1599460 1377383 1237480 1138701 1099270 1035284
12273 1035284 1034586 1122522 1030411 854882 913816 904989 1050719 1158070 1183464 1183249 1203092 1279854
12261 1279854 1363789 1320439 1479543 1662119 1763912 1784211 1976327 2209145 2113986 2050476
12251 2050476 1995235 1697402 1456167 1235790 1127867 1127610 1199572 1268620 1156261 1243336 1325349
12240 1325349 1361310 1341093 1443904 1483590 1350952 1159610 876540 820073 946929 927931
12230 927931 960954 1052886 1106790 1360907 1549909 1678431 1881668 1909637 1830062 1789126 1490479
12219 1490479 1128708 954472 952822 852072 827696 755772 693011 520427 388406 507692
12209 507692 521590 321860 275524 249511 217429 127154 197829 234789 315605 439659 402305
12198 402305 225567 136464 186698 157776 186574 265178 248787 279341 303963 297148 237033
12187 237033 167713 228633 331326 328900 177145 285711 362131 295210 266222 317810 391185
12176 391185 362150 282229 320428 306781 281358 332781 320572 371695 301046 233943 338288
12165 338288 499431 433224 317530 278959 315965 299632 279117 293605 242928 321321 367638
12154 367638 401672 407809 392122 345353 428658 506749 494624 557526 729976 688020 675289
12143 675289 881913 1141895 1340039 1688485 1907730 2134415 2376564 2585281 2747499 2709479
12133 2709479 2607626 2492331 2340799 2243718 2071052 1914433 1682462 1517550 1323164 1228283
12123 1228283 1170080 983618 783417 746336 790872 730709 557574 481958 378580 459176
12113 459176 395297 312946 280768 367780 556494 524821 400113 468727 519405 560592 548382
12102 548382 429887 373324 380257 410882 374364 239887 128172 194286 313232 258503 237887
12091 237887 213433 160487 186962 180037 200792 197398 233748 309305 323032 248767 182923 108173
12079 108173 61190 84411 207642 295571 417439 364228 296802 218933 105122 22285 52154
12068 52154 116431 188856 163020 124946 128724 110341 96424 73013 80220 246532 218813 212990
12056 212990 229281 302449 221776 55768 77025 89947 84634 158705 232691 182796 223720
12045 223720 262383 129770 64469 -3177 -4376 -35943 -90451 -53533 -68394 -24719 67637
12034 67637 69259 58089 197250 317051 289045 174640 79448 28378 -10841 137581 194053
12023 194053 52442 -9464 44782 41600 15316 -77154 -147297 -71248 67790 107912 195831
12012 195831 110183 75641 97196 37698 63191 -30457 -75002 -71736 -169328 -44272 128237
12001 128237 99262 -23598 -113916 -4105 40960 82558 69187 56558 53540 4919 108014
11990 108014 123023 73554 -38197 -79116 -29208 -77872 43138 154965 215843 219087 130423
11979 130423 104698 117217 99453 75747 106494 52822 -1838 30592 -29909 -146121 -85398
11968 -85398 121001 175014 185922 141417 288110 201475 177525 221142 214058 182318 137000
11957 137000 99710 114707 129252 89060 27605 125293 109904 40170 110401 14684 61367
11946 61367 156998 204261 147937 24551 -63715 -72352 -127592 -105811 -30092 15829 -12132 -76868
11934 -76868 -1527 42450 -69427 -36575 111225 203734 137157 106334 169425 306268 412109
11923 412109 337464 175619 90962 11905 78417 126139 91991 35327 60480 49886 29895
11912 29895 -88187 46585 157117 229014 222982 238662 165985 198752 166224 105685 14648
11901 14648 99772 172228 178616 261980 354877 323876 231091 117845 51911 66578 180480
11890 180480 146837 38202 97994 108797 107212 84039 -3183 26441 52514 40562 -51378
11879 -51378 -85504 61486 167880 133278 102321 150808 239473 284560 259218 114339 -14235
11868 -14235 135496 271794 223853 238290 278532 261721 174401 207047 187965 152954 162999
11857 162999 224095 136114 81398 188858 112176 89792 -3988 -92367 -40446 13293 75447
11846 75447 52716 159187 172468 161440 127214 31477 -143709 -30209 60260 114793 157360
11835 157360 141381 132104 133960 135833 120019 133466 150341 112132 116070 155397 120976 149161
11823 149161 91391 20933 -67574 -116846 -123559 54832 202382 35428 37737 120111 221829
11812 221829 95674 4600 56620 59674 -66209 1062 -46545 -87849 -100973 -111157 -15029
11801 -15029 58206 -2573 303 687 67798 98388 56838 72914 149901 194293 115777 126153
11789 126153 138800 91054 117795 141518 112059 183293 245794 199691 179838 214892 259666
11778 259666 166937 110259 79313 38378 94081 245989 252878 274159 335304 316418 171143
11767 171143 128213 198909 202352 342148 329127 216111 149138 173337 192962 271497 252347
11756 252347 76160 -19537 -12382 134470 190970 190498 56641 103984 80733 149646 206861
11745 206861 220309 235989 330817 352532 395790 324974 295826 302504 181366 117630 127922
11734 127922 203565 278156 430369 420983 348754 329918 202752 137708 160697 88588 125590
11723 125590 130312 161600 261530 361517 443118 470357 390673 269448 196270 205474 213212 200553
11711 200553 175867 194270 228973 220102 226992 285697 265150 216298 278630 400371 609467
11700 609467 622637 639823 710958 866349 1048357 1258908 1393725 1657380 2038283 2139538
11690 2139538 2160020 1973546 1792656 1607944 1463557 1327329 1269428 1153102 1082105 1278876
11680 1278876 1257015 1129532 1055354 1062967 1130260 1200904 1284138 1362271 1433598 1372059 1356358
11669 1356358 1438502 1498570 1621935 1583567 1645816 1776578 2019299 1993928 1960441 1962465 2003287
11658 2003287 1892790 1749745 1729371 1710259 1746413 1735567 1583319 1440882 1405457 1314696
11648 1314696 1181068 1031982 868502 881227 829880 803217 782486 773831 946217 1062781
11638 1062781 1112673 1239371 1454845 1600982 1793693 1883104 1839648 1894830 1859912 1604504
11628 1604504 1479475 1324667 1087781 968640 917575 918228 820760 629767 549449 585266 484952
11617 484952 444706 435551 422634 492457 374694 226365 156825 234610 264725 267111 307771
11606 307771 413996 313808 319743 374735 410926 518914 659074 715885 625537 575582 557442
11595 557442 456188 381656 398621 410891 428214 530861 611914 548571 427462 317705 366313
11584 366313 405705 486884 493855 448806 376921 332659 315080 359207 309838 209448 191134
11573 191134 59096 41659 79894 115689 163027 201551 291668 305449 333186 420628 413726
11562 413726 314957 177606 736 17274 159391 419359 486440 463238 456770 413513 292257
11551 292257 125317 95951 142274 231478 244117 149088 195854 226566 235715 161809 110778
11540 110778 183747 230632 266581 259461 198254 42684 -142867 6523 152831 158588 144629
11529 144629 239770 363612 482749 557805 627462 685384 712106 808105 808414 597884 447055
11518 447055 379890 306241 234248 313194 427082 445300 514367 494476 450031 490488 422830
11507 422830 467481 501762 477409 453551 466406 582820 621833 510055 532342 552100 568936
11496 568936 620312 679678 627908 521719 513480 508140 453315 465273 530211 635227 641269 626632
11484 626632 510396 546120 583295 526788 580801 719538 653179 531319 376439 458149 422977
11473 422977 386093 657010 714825 668608 681975 645002 575063 630751 717805 611506 533116
11462 533116 681429 755160 613562 440940 381659 622405 762336 730381 623100 577449
11452 577449 666887 727427 675386 666207 658889 717186 729068 701765 615962 505594 454738 471151
11440 471151 485975 396455 424548 553977 666090 623089 541401 517558 554126 572824 544822
11429 544822 557232 487565 458359 602038 628213 704632 648832 529671 538451 491049 535049
11418 535049 734699 823587 788026 746357 772649 852654 779191 733047 706177 708953 621656
11407 621656 792009 903980 713549 555823 637709 741754 783572 817376 892349 965646
11397 965646 1006002 1006462 1118126 1088863 1131359 1085067 1073022 1203240 1252788 1248806 1338085 1418874
11385 1418874 1593581 1655062 1749194 1985803 2114650 2011069 1981946 1886178 1905254 1847982
11375 1847982 1632760 1538433 1601329 1710291 1704062 1597075 1519128 1574962 1519868 1410231 1295182
11364 1295182 1331703 1398176 1454170 1341574 1382818 1405845 1456402 1495243 1589090 1551270 1525000
11353 1525000 1553570 1567972 1587594 1663221 1710463 1603819 1654531 1735749 1837786 1791019 1811931
11342 1811931 1882432 1921671 1971131 2050441 2019318 2004843 1960019 2020707 2051467 2160305 2384235
11331 2384235 2581827 2548462 2619672 2669985 2733879 2700431 2617724 2738955 2888344 2933104 2857509
11320 2857509 2927463 2897248 2852175 2875149 3090975 3317065 3481077 3547802 3674440 3945974
11310 3945974 4052503 4136650 4198682 4324994 4535735 4667425 4760200 4887022 5048316 5180303
11300 5180303 5499486 5777537 6047321 6298027 6607261 7007992 7454015 7912143 8249469
11291 8249469 8705075 9218882 10027262 10804246 11633417 12745719 14157106 15676399 17292431
11282 17292431 19353333 21795606 24384802 27619488 31712676 37045099 44154634 53700092
11274 53700092 66922962 85447845 111161829 146489242 193971535 253329596 316731458
11267 316731458 366524098 386262230 371172208 330786978 281465272 234230140 194360972
11260 194360972 164195011 143796176 132158935 127285715 127634669 132392336 140599128 151158135
11252 151158135 163507913 176786335 189585962 200757309 209257115 214967733 218631057
11245 218631057 221831036 227004740 236510327 251899660 273534311 300153127 327649718
11238 327649718 350813263 364321319 364861823 352857729 332209462 308468423 286142663
11231 286142663 268012719 254624955 244871896 237126785 229725855 221304198 211002746
11224 211002746 198440249 183841290 168451795 153563731 140569800 130248299 123266340
11217 123266340 120350619 122274151 130153165 145099725 168113354 199945825 240191656
11210 240191656 285643440 328647877 355619110 354512180 323241451 272701764 219403659
11203 219403659 174067126 138963985 112494269 93021658 78910815 68470595 60486302
11196 60486302 53958324 48288192 43271666 38530769 34103720 30353177 26984908 24091425
11188 24091425 21572891 19517005 17874707 16508349 15110735 13863413 12743256 11741642
11180 11741642 10748355 9852700 9154542 8411831 7725578 7130658 6732802 6322954 5912371
11171 5912371 5581211 5193516 4872193 4624227 4356973 4093054 3927894 3604347 3383162
11162 3383162 3139928 2945165 2915520 2806241 2603907 2330056 2207895 2143631 1929566 1801141
11152 1801141 1746276 1716925 1712282 1622149 1445236 1310469 1208202 1223194 1223284 1202672 1133485
11141 1133485 1209334 1257789 1221422 1064488 894705 776036 790511 766159 773269 981413 926187
11130 926187 930536 911132 835137 741795 786329 700757 748830 738283 670308 603145 579050 608882
11118 608882 733630 692029 603084 643469 601648 624016 756056 727200 774343 715167 660372
11107 660372 652255 605717 535876 441085 480431 525205 537707 487011 413855 462446 516331 659167
11095 659167 708667 662663 752524 887018 877901 851021 870576 790429 670737 670073 670508 629663
11083 629663 515078 449359 358591 273165 363691 562990 453494 378370 358862 419324 410976
11072 410976 373763 265780 182975 251902 226425 140421 54204 8637 -47012 -30021 92187
11061 92187 24063 103667 203700 221835 170418 43646 -6422 55101 186790 316448 363297
11050 363297 230418 80031 -25880 45533 169007 290983 261719 112176 130714 299605
11040 299605 219088 154440 280686 386221 429931 447043 413810 434691 352006 262539 255672
11029 255672 279575 220578 224385 161808 90503 -55749 -97752 -79483 -84781 -184305 -133680 -153293
11017 -153293 -8856 123553 230640 210249 272538 298884 261288 294957 261669 134401 114256
11006 114256 103539 122644 199579 258686 231130 271107 292988 284637 246892 256277 297605 192665
10994 192665 178207 166865 137774 184695 140084 124057 239823 341915 356632 378392 272034
10983 272034 150693 52145 49586 131786 151073 78086 -24951 -41967 -37298 31023 110778
10972 110778 126677 19319 21542 63199 -40303 -81305 -50075 57539 38623 73453 -7020
10961 -7020 39713 12655 -49735 37061 126769 204782 153881 62273 61817 25698 -75314 -192305
10949 -192305 -209570 -178177 -106928 -115720 -74943 35262 -6516 56522 233449 268765 198442
10938 198442 10562 -41406 -147145 -247845 -316171 -287553 -79671 39507 -42511 -170795
10928 -170795 -123859 -69484 -8966 -14109 42671 147262 88480 38870 -72857 -121772 -13286
10917 -13286 -50108 -49840 -42172 7208 -91347 -82532 -16586 32356 91709 116385 155135 146742 266738
10904 266738 163022 26808 136801 71074 -48814 -144229 -77499 22593 -79464 -134726
10894 -134726 -98378 -95065 -185168 -234190 -204042 -116815 -44012 -66102 -41436 -31790 -139571 -102002
10882 -102002 -57464 77399 -79446 -144652 -52920 -15939 -25178 -10982 70818 -2573 -31395
10871 -31395 23420 -2609 -49781 295 -78980 -162659 -141859 -80620 -23959 132740 128610 4905
10859 4905 -55700 -138898 -102078 14014 208246 302635 292725 350883 367497 399966 386389 271456
10847 271456 335558 397646 351840 327222 486764 641314 715157 747710 924547 1144151 1412541
10836 1412541 1594802 1700929 1521791 1509237 1440219 1231977 1011468 817406 581635 592504
10826 592504 537972 486148 628840 817088 934535 936122 916268 893216 851942 998306 1208405
10815 1208405 1291069 1396349 1390962 1286613 1427459 1508726 1433324 1568450 1768273 1767390 1621402
10804 1621402 1625428 1597415 1443524 1373187 1308054 1286225 1264740 1202837 1064425 1106340 986919
10793 986919 947849 1028011 981248 885689 783319 662317 570816 600957 662848 628028 694112
10782 694112 832354 1049326 1235581 1392426 1634367 1680512 1760770 1705391 1516426 1260919
10772 1260919 1008006 966018 891893 680949 359081 138233 134087 105215 23853 60557 76416
10761 76416 189239 291424 255050 241286 333598 388126 309403 193099 161125 64170 -81076
10750 -81076 -108406 -116351 -192407 -320385 -239396 -117740 -36521 57003 -44082 -150066 -191277
10739 -191277 -130354 -192796 -207324 -43825 47828 70872 34640 -74609 -53540 32191 -39866
10728 -39866 -234140 -246127 -247923 -207588 -124441 -93439 -23983 -7024 -31892 -10306 -75196 -87158
10716 -87158 -123982 -34185 -129353 -117595 -34296 -42992 -83056 3393 50615 -50827 -115143 -210766
10704 -210766 -171109 -138774 -110562 -6935 -7322 -50402 -187753 -199229 -169831 -52726 61578
10693 61578 79247 42003 56815 46402 7174 -55772 -146277 -234611 -312159 -130198 13884
10682 13884 -41492 -137535 -82910 74746 -108265 -189826 -53314 -70199 -111318 -140125 -158856
10671 -158856 -113166 -103696 -120446 -133397 -132692 -137017 -162508 -67860 73726 -27103 -105074 -148373
10659 -148373 -11696 92160 88080 103700 85864 6496 -119001 -195094 -188331 -152452 -116317
10648 -116317 -179648 -236411 -142874 -71256 37961 157502 79726 -7036 170329 246884 214922
10637 214922 130678 128316 197462 160110 22055 56613 35546 -81829 -120947 -163229 -250107
10626 -250107 -314481 -304600 -246328 -84916 -48410 -48062 -95193 -98170 -104771 10018 -7384 -76814
10614 -76814 -85031 -44184 37794 15207 33505 28083 94669 191112 193157 306 -89694 -42184
10602 -42184 -28038 28043 30362 88958 107606 75067 42926 46804 168083 75971 -42773 -27896
10590 -27896 2361 -28175 24902 72082 99292 -16921 -144714 -298263 -226490 -125994 -152246
10579 -152246 -74441 -18108 65071 158876 255345 22007 -24345 -4744 35456 39541 74047
10568 74047 78540 -26521 22275 21600 -73718 -160108 -159628 -169350 -274618 -244897 -186458 -179536 -182893
10555 -182893 -34819 88818 146672 85643 133301 118909 80803 81067 26961 8271 41288
10544 41288 26142 20116 -121882 -125400 -91149 -115979 -259134 -199318 -95790 -41001 -83184
10533 -83184 -84930 -110346 -56012 -27648 -31248 3988 27118 15016 -18857 37856 213856 381268
10521 381268 186175 106036 33390 103139 76687 -11084 -102954 -101454 -86499 -148601 -188802
10510 -188802 -160053 -208873 -188510 -121144 -177050 -83277 -60149 22986 44861 12530 66658
10499 66658 29989 -84794 -120294 -202015 -171336 -160621 -54750 -78317 -75858 -19328 -41180
10488 -41180 -95256 -67360 6182 -62062 -111676 -43890 -65140 -32842 -165347 -231688 -139483
10477 -139483 -68436 -57366 -175905 -254667 -166522 -122702 -150220 -154129 -154513 -158600 -147183 -88510
10465 -88510 -137107 -122781 -164301 -148594 -197750 -137878 -75227 -85398 -21434 192741 242180
10454 242180 225977 211027 166731 111925 87049 56226 -44742 -133891 -126797 -114146 -140549
10443 -140549 -83644 87548 217736 273169 231346 269020 214533 69986 -72106 -145575 -51008
10432 -51008 15050 36985 39534 134184 170668 133815 170302 109949 52276 -52703 -198794
10421 -198794 -206572 -151698 -74823 24849 64348 46101 40188 2647 -13931 -43477 -96218 -228200
10409 -228200 -188570 -132482 -125732 -87956 -54282 -49472 -62802 41291 131203 84414 54725 40373
10397 40373 22976 -109389 -196457 -203874 -136032 -136948 -28148 10393 94121 -9651 -103328 -155398
10385 -155398 -127249 -71025 8596 -57887 -99051 -149375 -304650 -332946 -226278 -183655 -103967
10374 -103967 12829 42797 -11883 -56286 -71608 -34532 -52838 -10691 143890 202081 180917
10363 180917 150916 123711 56856 98443 58629 6198 -10369 -224581 -249656 -27895 132592
10352 132592 100419 92075 134893 -6959 -155805 -129889 -25819 -19739 -133888 -3733 46998
10341 46998 21396 42499 -86525 -213610 -229702 -136557 -20745 -33315 -15101 35938 -54727
10330 -54727 -18497 10426 -131544 -133554 -80445 26229 63852 55924 -32372 -227421 -311231
10319 -311231 -232977 -271108 -224659 -140748 -141255 -130181 21415 16351 -59339 -82377 -141 73268
10307 73268 15106 -183800 -266860 -239431 -160765 -97003 -140133 -208047 -189361 -59615 -31686
10296 -31686 19045 197908 277635 332247 267744 98382 12467 4740 12563 132979 46275
10285 46275 -105568 -199902 -111856 -26866 53288 -3453 -145345 -115337 -79425 17297 37738
10274 37738 36245 98946 139939 58855 -55023 5358 -155373 -238946 -205914 -136711 -103332
10263 -103332 -7736 -3322 -18060 -95258 -82104 -126757 -152702 -158894 -106136 -22989 81564 90515
10251 90515 101060 -26551 -90294 -115362 -76536 -68305 -125600 -92240 33107 91760 -19919
10240 -19919 -164044 -64993 -2104 -598 -139904 -157131 -165047 -78209 -5340 -73471 -135515 -120668
10228 -120668 -151802 -119678 -90813 -79061 -123536 -106527 34573 -24232 7419 148094 91721
10217 91721 103915 162359 74581 -5120 51765 21057 -62558 -220984 -319862 -240891 -56098
10206 -56098 -34910 -169659 -95927 20462 -71273 -45260 -112139 -43606 25673 -39002 -86596
10195 -86596 -98247 -95569 12015 64963 66601 -83585 -189842 -2447 6622 -219282 -329976
10184 -329976 -389403 -447104 -276558 -170514 -111148 -79689 -17165 72897 33412 -163926 -176276
10173 -176276 40036 166778 157220 148527 -32268 -195609 -207032 -29905 2085 61733 102279
10162 102279 28283 -26904 -20125 14987 42552 19649 -97024 -35812 116998 101848 -10217
10151 -10217 -59453 379 22572 -53040 -74551 -25829 71554 82621 42157 -50211 -22505 -8039
10139 -8039 5754 137922 137166 123011 82536 58025 100297 117271 131103 82715 74589 82560
10127 82560 73657 97535 34527 21652 -47026 -264024 -351484 -288360 -209998 -172571 -129368 -210933
10115 -210933 -318580 -254579 -202557 -158294 -73499 -41887 72573 119640 234718 206051 84634
10104 84634 -30380 -204013 -171414 -65340 -98071 -97771 -80209 -134290 -72096 7676 123862
10093 123862 111794 91623 93903 65881 46691 -72422 -71429 13459 63298 53366 -54169 -34875
10081 -34875 -201169 -200795 -53376 -83099 -134664 -195352 -224723 -218071 -294404 -206565 -68725 -90361
10069 -90361 -71540 -3649 19826 -32597 -90063 111593 141706 42799 -282 -25956 -15586
10058 -15586 113578 72861 30687 -10501 -6641 74092 2867 -196438 -183519 -115852 -126270
10047 -126270 15201 83872 169203 114561 -74978 -326013 -338877 -214532 -69715 -51482
10037 -51482 -57293 -44658 -72937 -65088 -212957 -192557 -214503 -113940 -74931 15004 41293 94389
10025 94389 18724 -93428 -223355 -244838 -313053 -361354 -151694 21440 43966 88934 30158
10014 30158 1494 50197 42094 -34660 -76274 21445 236912 173131 41301 -101751 -69991
10003 -69991 -62343 -115874 -122552 -61718 -28602 -65268 -26758 72659 -87578 -71025 27878 123535
9991 123535 228143 168337 43106 -42536 -180854 -213723 -165973 -117995 -93577 -170276 -187553
9980 -187553 -86119 -71764 -94063 -107306 -209621 -188079 -117682 -64989 -88037 -7200 87413
9969 87413 101344 -67406 -228631 -216880 -163447 -109054 -101524 -153419 -98801 -61885 -119170 -120270
9957 -120270 -67703 170620 173892 138506 136770 152559 112586 33799 87715 33474 46764 -37518
9945 -37518 -57985 -47182 14103 68663 85294 -83061 -133782 -79175 16344 37667 -97550
9934 -97550 -93902 6569 -58608 -455 -5070 -45304 -122035 42605 51251 -134499 -245336 -212059
9922 -212059 -78186 -10537 -89027 -51198 15640 53420 113174 105391 -1930 -49850 -68273
9911 -68273 -84443 -50979 -116707 -191354 -93228 -132821 -88745 40205 81071 126593 55994 30062
9899 30062 160209 131525 86813 -63845 -147737 -183191 -139837 -139456 -150970 -83684 -34086 80686
9887 80686 142350 183783 87972 97280 -15501 -179557 -298392 -207352 -93032 -479 -18413
9876 -18413 -29430 -27931 12790 -27761 -73409 -141328 -103115 -25327 14923 -77541 6362 19801
9864 19801 -25687 -66620 -112956 -148839 -75003 57354 159506 165273 188723 228977 164005 101965
9852 101965 80947 26429 -109677 -65449 6797 16932 63264 23228 -213409 -220133 -233273
9841 -233273 -99093 107792 109036 59172 77639 -38443 -160207 -212986 -133501 -135105 -134274 -209814
9829 -209814 -160952 -149868 -142524 -178121 -187103 -136118 -107381 -82108 -148140 -130528 -66165 16914
9817 16914 58342 -11034 97243 209668 73027 -35814 115551 100524 -13160 -84284 19308
9806 19308 -67774 -195340 -263577 -290655 -335083 -195101 -101958 -96704 22974 7344 50094
9795 50094 107867 43081 -109865 -78623 25642 -17242 -69522 3324 -93281 -106913 -132477
9784 -132477 -24310 101947 26994 -13121 15423 654 4712 -25 147565 255473 195661
9773 195661 119897 163964 236321 130965 126905 94683 -23966 -33325 -1594 122568 259571
9762 259571 243339 214209 50284 82814 192068 65372 -25850 -987 -115804 -75678 -9882
9751 -9882 8047 -60422 -84231 -88253 -138868 -166780 -101741 35065 98767 21521 21266 7877
9739 7877 -13049 33002 61071 115920 -35248 -144092 -69632 22696 35232 -105283 -118824
9728 -118824 14774 49034 86108 -43543 -187120 -52746 -87988 -205745 -144690 -118513 -121572
9717 -121572 -74034 -13443 -76855 -117437 -173226 -136646 -57501 111177 81320 -39278 -36557
9706 -36557 -43124 -90780 -60068 40082 85215 61136 147973 130423 51870 -139933 -275673
9695 -275673 -214937 -72062 -72167 -59365 -49394 -34728 -23891 -34127 46046 93259 89393 47226
9683 47226 -103263 -41638 38807 31906 11402 18054 16365 22493 102555 -37455 -71013 161691
9671 161691 124603 8525 80563 186281 172569 226044 292802 199458 54658 45350 -98942
9660 -98942 -120559 -7145 129554 26787 -151666 -153673 -108821 -74465 -112025 -61556 -23233
9649 -23233 -161144 -145254 20747 175422 108662 -50617 -174119 -248128 -250901 6244 60897
9638 60897 61085 52423 72784 71261 -60927 -7997 8318 -32146 -93574 -130213 -104394 18032
9626 18032 66552 77202 45902 71235 38091 -31633 -75326 -66759 -63703 -40437 -132111 -205493
9614 -205493 -87035 70663 120869 81790 118351 153145 32022 82846 90812 52355 16214
9603 16214 78311 64170 16402 90047 -16533 -134624 -40344 20320 -49556 8108 3865 -79663
9591 -79663 -117029 42305 102589 49905 29389 1406 -32753 -64415 -116621 -194845 -122535 -39100
9579 -39100 85754 47801 14851 -21299 -37606 -60103 -42555 -51993 -64665 24831 109321 45334
9567 45334 -10796 38646 94054 129002 -22194 -80712 67749 214335 185088 -14016 -29734
9556 -29734 -102477 -129350 -35175 -20814 -67776 -36789 14689 79654 104708 37008 2402 26120
9544 26120 -107098 -180628 -81770 60598 106876 34168 -70078 -21946 22007 -15840 -2480
9533 -2480 5393 -82333 -122429 -82136 -13736 27059 -35286 13483 -87267 -229140 -292217 -36955
9521 -36955 53972 -59495 -63234 -26179 27029 -43030 -62454 -47963 43386 71324 -57453 -121125
9509 -121125 -151800 -92662 -56746 12451 3261 -59922 -205720 -191830 -81291 74230 49456
9498 49456 -51419 -83378 9933 49937 184738 229957 91464 -83084 -80900 3187 26765
9487 26765 61094 108679 184711 252936 242375 147623 -36800 -29141 176760 191476 167258 94608
9475 94608 -75970 -29044 23905 28869 24533 -17208 32408 3738 65545 178542 136779 4651
9463 4651 114131 141033 -16002 -82996 -145648 -125519 9476 59530 -9324 6991 59901
9452 59901 133619 122609 32836 -166399 -248899 -76631 -45635 -136311 -201540 -258904 -128416
9441 -128416 -87977 52460 -5520 -15092 -43916 -49875 -47042 95482 134585 59455 12595 74157
9429 74157 143967 163202 127364 135254 192713 234810 150185 40192 21850 42428 -40936 -46501
9417 -46501 133280 201691 277241 352335 163262 58933 32990 138185 212122 155793 118979
9406 118979 70458 -15471 17413 64853 138588 203214 237718 216495 155837 118687 73981 145659
9394 145659 262924 281172 205374 118130 125825 135470 39549 20340 37264 63066 144701 79006
9382 79006 105506 223995 242015 242922 247031 103448 -25263 47132 141925 109945 86443 9234
9370 9234 -56780 48921 100939 164879 368388 278565 36997 37469 33962 106143 84073 70564
9358 70564 88936 52955 51613 144828 203104 336969 149473 100973 198312 235242 239874 151829
9346 151829 128977 226894 300858 296409 242858 232873 111859 113512 96248 -17351 -155422 -140904
9334 -140904 -120071 -87805 -53372 -134588 -81669 -33712 157754 230719 268465 279674 371762
9323 371762 433275 337952 134275 3018 121170 200985 287035 285713 267106 327532 273364
9312 273364 209863 290423 267020 417126 392228 245992 178732 142425 62060 36207 -16824
9301 -16824 -13643 57422 143838 257244 313608 312300 327409 391481 401339 298061 297605 158086
9289 158086 88215 230974 382350 349988 213376 132742 271621 373736 365983 311220 235710
9278 235710 244864 325976 250227 186586 244197 247526 233135 310534 349841 279918 264800 168702
9266 168702 264137 225482 254792 322130 489094 489008 484293 402313 268762 387506 615020 647622
9254 647622 672902 585556 538870 477279 404628 344014 436662 453379 416803 365405 502642
9243 502642 691723 646348 547766 581999 624970 675075 571981 580077 667977 659958 637916 679072
9231 679072 732790 687390 705692 640224 640111 756997 830584 741074 729400 720788 777240 798221
9219 798221 862553 949571 969624 943633 1098182 1200187 1139533 1174635 1245130 1184993 1221602
9208 1221602 1231087 1298966 1307682 1293987 1296033 1367645 1411888 1430143 1467893 1450851 1599268 1848538
9196 1848538 1876215 1734007 1726540 1804251 2064284 2110031 2099794 2160429 2261735 2249771 2224583
9185 2224583 2409115 2508673 2602483 2866986 3059074 3128588 3220014 3296930 3484079 3619426
9175 3619426 3741168 3921978 4212341 4438248 4557750 4671018 5004768 5394837 5645870 5901541
9165 5901541 6267387 6670175 7112351 7549897 8069806 8476654 8785327 9240393 9833535 10392361
9155 10392361 10917777 11566607 12264280 12783349 13338377 14052831 14574396 15008262 15353609
9146 15353609 15833006 16282225 16375705 16337791 16517646 16507277 16314630 16176646 15804443 15532365
9136 15532365 15286833 14772725 14313024 13880867 13370500 12766687 12238722 11678154 10990935
9127 10990935 10495952 9974976 9515132 9061866 8637309 8199021 7802229 7344758 6787264
9118 6787264 6441810 6140132 5926456 5686581 5527399 5157210 4784939 4544449 4510761 4450517
9108 4450517 4262633 4043031 3867495 3592177 3394536 3260614 3218053 3187924 2979134 2691410
9098 2691410 2544043 2550273 2576146 2361026 2149867 2110709 2093892 1997827 1994929 1920705 1827929
9087 1827929 1825301 1817645 1714860 1571941 1354730 1304712 1278986 1277621 1210694 1126019 1087788
9076 1087788 1157691 1259364 1299959 1293447 1257681 1247781 1132601 977368 904416 880383 766543
9065 766543 804630 831338 904406 827631 698424 766581 718548 626629 658701 649031 595017 508843
9053 508843 428997 371331 538567 633444 618633 509372 384624 390727 469180 545655 556919
9042 556919 498550 463415 333802 381870 462437 493205 452571 377709 407586 309117 245451
9031 245451 267668 382118 490541 472922 431133 449517 480575 424556 323677 247570 297578
9020 297578 344861 395443 434426 467116 443920 334077 370503 340437 331469 335362 218650 120388
9008 120388 205286 173483 242688 271384 352436 278140 297142 459409 502708 390383 324508
8997 324508 276461 222641 208289 153269 45549 84138 131857 204998 202436 137088 160546 176665
8985 176665 139004 278763 261709 219158 297720 219056 142526 97769 105060 84653 123455 194406
8973 194406 235712 90672 -70204 -8871 204356 322514 354967 293372 134199 111492 255807
8962 255807 253878 165452 47076 -24309 -53245 78850 215529 185975 73176 6031 68287
8951 68287 90733 138719 88399 166876 127537 105083 78741 33278 74748 121055 133052 133871
8939 133871 -124284 -133840 118037 234257 163633 133762 140148 185584 176167 276201 257870
8928 257870 202502 181041 201701 209362 185733 121939 73042 -100119 -110086 -97541 -3275 24126
8916 24126 33843 105090 90961 130466 149535 174016 279099 258973 199335 24645 2732 77227
8904 77227 62754 89697 97863 47879 37566 12385 -55139 23243 12270 -26238 19624 54884
8892 54884 45852 -68551 -81155 -69832 -42080 -23136 -61635 -127652 -35384 40221 72748 89188
8880 89188 14137 45932 -57086 -111945 43674 164820 152699 202056 220471 133215 951
8869 951 5239 30642 -88801 -92022 -82644 -66562 1950 12739 -12002 26388 82244 135521 100293
8856 100293 62387 199786 213827 123316 -11292 -34615 54893 57598 -23681 87512 196140
8845 196140 8634 -181479 -194374 -188916 -69627 40395 -14382 53773 52279 33966 -31902
8834 -31902 -55756 -96326 -64993 -69747 -74637 18721 140133 127299 -5704 -49791 52091 129424
8822 129424 153101 174360 265640 209347 196718 33274 -26337 18622 157696 219283 226247
8811 226247 98710 -49146 -80727 -46482 -44643 3023 86936 66573 17652 -61684 41601
8800 41601 130616 167460 125219 32743 2427 26756 55646 -6972 -9546 -91427 -189617 -144540
8788 -144540 -150134 -139392 -136318 -156891 -174905 -134088 -39302 -78143 -158724 -152966 -9360 34145
8776 34145 -4896 -83748 9258 74942 58025 -45618 -39833 -12598 83631 71321 5859 96363
8764 96363 152202 129703 24673 -94400 -89286 -105359 -28963 -41971 72704 -19234 -142974
8753 -142974 -206987 -135499 -145247 -131415 -17244 -25729 -179822 -280646 -267236 -252514 -346620
8742 -346620 -334098 -273850 -126674 23269 122470 54373 39183 70451 238361 241828 104119
8731 104119 27748 -5008 -30099 9938 44508 10344 -18063 13477 -28322 -111294 -202665 -260124
8719 -260124 -143466 -103923 -129001 22446 -33863 -127702 -151651 -121800 -86469 106880 212328
8708 212328 268684 96984 68088 69127 -63259 -94476 -96420 -125309 -68103 -47457 -40698 -42619
8696 -42619 11699 -44574 -49926 -57036 -85536 52297 100548 81612 1060 -14852 -58358 -84010
8684 -84010 -73322 -48172 -20120 20542 85821 137324 106011 68747 106519 109052 69117 109740
8672 109740 150946 242521 277598 216952 116571 58369 -108558 -156779 -15200 63508 64187
8661 64187 144096 119920 173715 223070 210076 -10352 -32548 128377 211540 175559 195953
8650 195953 104734 11176 -41244 10360 40295 -35357 -104694 -147896 -83739 -64172 -73283 28164
8638 28164 -53643 -94760 -195109 -115161 -69469 -173652 -268413 -202249 -30253 -34911 33057
8627 33057 23992 -19267 -9702 -75103 -257734 -236664 -9392 144317 194731 193307 59306 14353
8615 14353 -86817 -119963 -176197 -256170 -130104 -20494 70947 67472 84659 133310 125945 160686
8603 160686 227094 406524 542938 477059 372869 328919 400850 417127 403576 333241 280308
8592 280308 353534 292388 200710 76617 94587 79016 156174 162868 119478 51014 -72569
8581 -72569 -82705 -99098 -31027 166106 191452 244054 65013 -4612 18650 -4424 177443
8570 177443 166382 69625 62218 16777 6900 632 298 -30186 11308 35576 -100790 5084
8558 5084 -79414 -296561 -268915 -206389 -165589 -134026 -66759 -93622 -31049 64039 40325 38684
8546 38684 77277 -2323 -42518 -105066 -117673 -149130 -104865 -68581 -75687 -150493 -93257 20826
8534 20826 -15842 -127742 -94487 -19805 17917 61037 72960 83746 77383 50132 50917 25424
8522 25424 -50193 -40382 93325 161169 165109 95737 -6897 -67635 -10965 31746 127043 -39768
8510 -39768 -50062 63284 85591 88972 47303 -20780 -63200 7406 66641 14160 -75514 -214458
8498 -214458 -155162 -25609 -37658 16497 86685 112576 75790 74082 81281 41193 20675 23251
8486 23251 -42554 -201836 -218948 -163472 -102971 -157444 -70907 -63568 -87317 -29582 40435 143771
8474 143771 296713 328038 310499 151460 94563 128360 157437 69471 3627 142042 202236
8463 202236 113680 148053 56992 -45820 52911 162659 143123 186667 197752 3252 -89430
8452 -89430 -112487 -115009 -86749 -46122 72963 124387 65211 40145 -3369 -23497 -12809 -112151
8440 -112151 -161119 -115163 -12923 31507 11021 -54754 -129180 -171864 -174426 -90781 -51571 -94458
8428 -94458 -167227 -139458 -1321 76751 -34666 -188201 -188001 -40031 -43770 -130588 -109956 -55701
8416 -55701 -38807 -56568 -22278 -13924 -62018 -164007 -185810 -138113 -193308 -39222 -66496 -8599
8404 -8599 -18043 -154391 -240688 -191080 -83259 -64648 -34738 -58456 58543 121973 75372 131401
8392 131401 111409 48501 -8435 -73362 68530 39286 29831 158064 194307 171830 131919
8381 131919 168412 185325 66384 -3134 -43816 6537 5336 137338 152020 117762 95369
8370 95369 105644 99875 62606 69426 93112 66197 64464 7968 53474 -63259 -67820 -63408 -30807
8357 -30807 -6064 -154344 -133285 -60654 75910 187366 161695 9792 -23256 38200 -9502
8346 -9502 -15479 33240 44343 -21815 -29713 -102747 -71679 62331 76852 34000 72781 24558
8334 24558 1065 47215 4389 73474 75843 -13546 1522 75763 152177 45149 57705 123155
8322 123155 130093 131441 120567 29538 23568 -9078 -148973 -216531 -203820 -123569 66550 78471
8310 78471 17161 -67541 -77803 -108761 -226371 -139977 -38463 -33267 4702 49700 9017 -134024
8298 -134024 -242303 -214040 -286891 -275958 -202060 -214244 -287308 -281012 -304035 -278707 -137087
8287 -137087 30239 15148 -10997 -8357 66144 16299 45993 -9684 -106974 -91786 -133069 -233769
8275 -233769 -128722 57523 184390 141470 154731 98998 22047 -2022 -49488 -61385 -55
8264 -55 -16634 15638 74584 74695 14395 -140021 -127993 -85006 -82387 -66636 -123297 -45409 -10328
8251 -10328 78356 -70146 7881 92776 63836 -12982 -36900 33758 85699 197923 191859 154321
8239 154321 155368 100529 39238 -27773 -90155 7540 9180 53363 25910 -143788 -134192 -5661
8227 -5661 92091 48811 13288 95073 21685 -53203 20165 44636 -41283 -113551 -127385 -52091
8215 -52091 -6942 79555 104025 148723 193730 97040 46780 26498 -31749 -70678 -44006 -15398
8203 -15398 14747 37694 43577 47329 -7215 -43847 -87893 -6756 110440 148966 269714 291470
8191 291470 245141 139030 83214 52876 33286 3710 -5957 -28111 -281 22105 20548 18693
8179 18693 161851 127324 101978 59535 96083 147526 127262 243672 272913 117912 104081
8168 104081 89889 209294 191419 21648 40073 137530 91888 103401 126927 133932 99728
8157 99728 74009 41471 33428 -63069 22783 71341 53233 5104 -56849 -22038 74196 102302
8145 102302 64640 -57244 8147 -6888 -77816 -43416 48816 115537 48229 61055 76851
8134 76851 56406 38383 156357 176630 168522 160319 67194 43765 18130 53858 404 26969
8122 26969 60945 77888 -29027 -136131 15293 4314 -83592 -39513 15141 -30375 -168255
8111 -168255 -192922 23430 131376 50421 -8256 57639 113728 85580 77239 248523 266551
8100 266551 192298 225378 166768 125655 86023 -20904 -49078 28020 -2160 -118536 -85214
8089 -85214 -86459 -28724 6482 138874 162583 19782 -7382 -30741 -51021 -63320 -138091 -118956
8077 -118956 -13967 47936 57345 38581 -44042 -81283 -4636 155859 212001 183031 152817
8066 152817 143148 69493 66288 121463 -10157 -44747 23207 89998 83628 -16452 -13097 92294
8054 92294 160573 48394 -36403 -30010 -42267 -72022 -33929 -24826 16048 -99009 -81294 -78345
8042 -78345 -138490 -94715 -37994 5117 125577 180603 177901 106877 112680 105244 101837 152187
8030 152187 108290 -41710 -121345 -41736 81127 184476 138474 32907 -100928 -207153
8020 -207153 -289234 -332624 -142452 -154865 -122930 -132894 -42411 -5274 -8832 -117848 -79660 124647
8008 124647 169146 115083 48432 16430 -35386 79242 115690 121833 29857 -10834 82884 108330
7996 108330 102187 19644 -32886 48676 39997 129340 123530 -31766 -39645 -62233 -24616 108602
7984 108602 30643 -78497 -153217 -238973 -98696 -26605 -18847 -93489 -56324 25589 85117
7973 85117 123801 173824 20272 -122566 -93706 54147 -41930 -73803 -118362 -123720 45284
7962 45284 81382 8059 57110 142395 60230 44114 37264 -23970 -172195 -51626 21612 -70764
7950 -70764 -149059 -51424 7692 296 -123932 -172265 -129790 -95410 -97628 -105787 -131455 -112090
7938 -112090 19865 -151007 -214713 -96578 -58555 2905 61509 65777 46170 17244 101658
7927 101658 215077 94047 -73457 -64833 969 870 -98186 -122073 -256689 -278305 -287197 -230581
7915 -230581 -219285 -184772 -19177 47384 8551 -342 18829 -21954 18553 -10097 67108 181052
7903 181052 102658 -2508 -23992 -104451 -220357 -139110 156705 226600 233022 134145 -43665
7892 -43665 -159941 -146079 -163706 -92508 91222 175487 135808 99513 126432 176592 62753
7881 62753 -9652 26383 133762 205357 148059 52228 -35867 5282 32031 102357 59728 12493
7869 12493 -111205 -135445 -183945 -205261 -93297 -8835 31138 -62325 -126982 -56411 -51408 -79247
7857 -79247 -135787 -128698 -126856 -80454 -142188 -197180 -105585 16688 -47572 -180517 -118158 16096
7845 16096 14807 122089 26806 72628 183612 92113 86760 111985 162474 229430 232547 257805
7833 257805 149784 -85267 -128777 34405 17390 -44232 21271 95416 38485 -44863 -117829
7822 -117829 -43536 -145058 -143958 -138818 -153151 -170365 -118692 -37763 -14931 11037 -18955 -55359
7810 -55359 -71988 28954 151521 138991 136072 90385 53077 20733 -9699 -66032 -79770 -101711
7798 -101711 -80135 -4103 58937 76625 -52728 -128440 -39534 -96091 -260866 -321322 -238614
7787 -238614 -158774 -184569 -106812 13581 92382 39701 -25000 2933 23319 25688 2804 -54717
7775 -54717 -107324 -123968 -57236 -103364 -88112 -137753 -123882 31617 101838 66222 82543 5733
7763 5733 -47763 -143770 -213787 -277783 -163995 23478 26279 -136308 -109440 -142485 -223947 -196411
7751 -196411 -28729 16499 -85719 -94291 -212630 -252176 -257746 -209678 58407 255836 267319
7740 267319 241583 140560 61240 -44184 -99508 -149732 -86653 -118621 -257043 -235889 -167194
7729 -167194 -129735 -142597 -171714 -179393 -134480 -133211 -124875 -50702 -47218 -76594 -30390 -32772 -25405
7716 -25405 42308 7064 146604 97703 50057 40118 -96380 -185563 -103450 -47316 -135070 -102849
7704 -102849 28331 25425 41364 114224 235945 247323 184965 131408 61220 33567 8131
7693 8131 -88343 -157654 -216602 -98776 -7484 -72177 -215506 -178408 -46337 9355 39453
7682 39453 57275 132512 42129 -23275 -112543 -263478 -268812 -172229 -237069 -243416 -146805 -80821
7670 -80821 -141826 -191190 -140789 -38391 -159296 -139571 -100954 -19635 -70569 -19860 -87648
7659 -87648 -114217 -62884 -32770 -82214 -125136 -136789 -164534 -110652 6900 -17724 -52285 -216408
7647 -216408 -204207 -40836 197510 241581 81909 -41565 -15935 4683 -18207 -24744 38371
7636 38371 -14792 -82202 -96965 -49194 -110795 -141266 -99895 -20514 -38497 -52279 -65060 -196174
7624 -196174 -173125 -245425 -311682 -195559 -98292 -26879 16616 -69224 -130745 -182500 -214347
7613 -214347 -194827 -71320 6414 -25455 -49827 -11407 -73714 -54229 10678 69060 17683
7602 17683 19215 83349 167194 170436 96874 -29040 14599 15018 -48168 -94041 -56421 18703
7590 18703 15340 17001 140088 79653 -63775 -107250 -121750 -90468 -154015 -116867 -63721 -61350
7578 -61350 -130287 -76160 -37570 -79692 -106778 -93936 -130417 -103247 -58014 11158 115487 73307
7566 73307 120715 106754 35273 39856 109983 80306 -20783 11914 110710 45669 -65874 -56396
7554 -56396 -64317 24394 117496 165700 80419 -65770 -92376 -132141 -123463 -68833 -87004 -150553
7542 -150553 -110148 -61388 -138065 -82863 -7177 103827 116922 142275 195627 204521 8092
7531 8092 -16139 131163 175800 167334 91267 -10593 25231 -15007 -59356 19394 46242 -16200
7519 -16200 -117908 -120290 49324 254711 205811 176944 105285 -6832 -197192 -220401 -128720
7508 -128720 -39662 -80043 -37642 -10043 -55781 -99434 -6094 109204 96827 94278 44615 -44634
7496 -44634 54663 91457 34993 -79970 -26057 67498 7578 -110354 -129962 22036 72658
7485 72658 29544 -26195 -99579 -29434 -4156 -6490 63303 104659 55160 149042 113462 87676
7473 87676 -18113 -47293 -59531 -107536 -85994 -150633 -103622 -171974 -230009 -9957 49567
7462 49567 47027 86949 25182 -629 13226 78518 11239 -43584 -28917 87423 60056 53966
7450 53966 133977 131281 88279 -117934 -283236 -211484 -88773 -49765 -97890 -142128 -85350
7439 -85350 -33419 -9264 -30451 44616 -13412 -124777 -174545 -108094 15145 109289 -289
7428 -289 -44677 26837 44703 -23845 -100006 -91296 -52319 -99209 -99074 -27652 -128974 -140148 -221384
7415 -221384 -215222 -131560 -5521 216135 253820 192260 109422 56354 102421 126145 189989
7404 189989 111193 93698 -42528 15715 95342 -49887 -97568 -42336 -35122 -53267 -85065
7393 -85065 -242409 -124909 52609 160675 124997 117342 128083 122621 112124 53616 55492 23457
7381 23457 16442 -109135 -109023 -27368 99620 83132 87956 95940 111505 215421 128105 39208
7369 39208 16824 -95238 -170906 -63958 86464 122003 -15626 -161401 -118489 -64351 -115651
7358 -115651 -64399 -41708 -91518 -87692 -73451 -60305 -29834 114627 192245 176874 32030
7347 32030 -40487 13180 -180717 -113775 71355 112388 18508 -71712 -108187 -154885 -69398
7336 -69398 14110 -103320 -199591 -172638 -69300 -26646 20945 13964 1869 102927 188255
7325 188255 198575 149033 141515 60327 -21223 -75308 -59193 -78496 -43988 -30424 64354 190442
7313 190442 194345 112342 41741 -110961 -225270 -265781 -211066 -57230 -8183 -148147 -188767
7302 -188767 -121542 -116490 -122834 -208348 -169101 -101341 -108531 -47354 -120815 -145317 -132747 -111750
7290 -111750 -122153 -143580 -43608 20480 198792 160567 65572 -11405 26943 10551 61889
7279 61889 -40149 -105063 -163084 21914 75950 -46921 -70818 -97073 80792 202249 177644
7268 177644 55221 -24562 29353 -21421 -58625 -51095 23883 -19374 -109041 -154657 -239278 -294164
7256 -294164 -217598 -88484 -155079 -111835 -34033 -16119 -12668 30704 58780 52388 -10776 -82437
7244 -82437 -113396 -99876 -30944 2237 -6305 -140060 -250155 -291119 -142735 -29063 -66036
7233 -66036 -212 77679 128704 19906 1013 112934 65420 62529 82331 -54510 -157759
7222 -157759 -324127 -251181 -116519 -85071 -114981 -1649 48648 42473 -26141 -47963 -156846
7211 -156846 -227389 -119715 5222 19838 -9009 -46353 -301824 -372495 -298282 -274693 -209969
7200 -209969 -184314 -109941 -113586 -67833 -99400 53029 130641 49095 45967 -37260 -49476 -67600
7188 -67600 -55341 -106317 18754 64227 -82073 -182466 -97387 -46754 -35391 37068 71575
7177 71575 70003 79656 52766 -6415 -89672 -82708 -147346 -238757 -176761 -88011 -111017 -49308
7165 -49308 -13496 -81871 -66588 -10014 8086 -7198 -52125 -103203 -22961 10816 -2542 -35785
7153 -35785 -36925 38126 15226 -129402 -160384 -173312 -197638 -170653 -96415 -157836 -282120 -304587
7141 -304587 -112214 11375 -20047 -42146 -67312 -20054 -15913 -66501 -63320 -43310 -24832 -24574
7129 -24574 -62994 -45673 24092 35448 109151 -6150 -42373 94636 179758 206235 195774
7118 195774 151353 175070 178905 160345 117295 985 -152378 -275338 -224332 -175962 97476
7107 97476 156018 105563 81016 51285 75101 37605 -24147 -19088 61811 39806 66848 23360
7095 23360 -81792 -92995 -65425 -16121 53235 31562 -41876 9197 2152 -91156 -186074 -152980
7083 -152980 -221624 -232812 -163517 -80030 137540 160808 60002 34532 23323 16987 24223 102440
7071 102440 125454 112012 123830 155851 146299 121865 52099 66876 218517 140878 78746 58830
7059 58830 11627 12206 53035 52664 18828 -67913 -167224 -61078 16430 -50021 -162628 -239005
7047 -239005 -231339 -189755 -102816 -149171 -125951 -8192 21954 -24110 -88293 13674 44845
7036 44845 -5218 119899 164498 128274 124885 84891 51963 -27173 -30459 -66042 -40081 -205617
7024 -205617 -178543 -27063 -57949 -47447 -41752 -66275 21771 32633 -26620 44001 162387
7013 162387 14478 -137449 -64750 -130244 -172941 -121766 -116025 -104448 -138511 -106687 -185824
7002 -185824 -160038 -188204 -153943 -188982 -83646 -109787 -269463 -237432 -142571 -179526 -207567
6991 -207567 -204078 -149813 -200030 -196243 -118366 23134 129132 189060 207168 152599 195708 165459
6979 165459 -32524 -57941 42322 52397 68391 80694 204729 204278 144787 60910 20242
6968 20242 177526 276877 177656 -10200 -63405 -6975 59848 69577 92179 -11479 8867
6957 8867 19323 36635 48058 -22480 -45215 -82983 110477 272730 305311 282541 165299
6946 165299 120756 193567 241113 136172 69419 -38323 -141421 -92841 -49067 -67920 28217
6935 28217 -18186 -148128 -26105 63291 76030 160937 41148 -59358 6611 -41499 -123419
6924 -123419 -86266 14365 23537 -147275 -176712 -206039 -141541 -126002 -118681 -35126 -85658 107888
6912 107888 155174 51968 108994 214673 149317 140788 188096 176019 62546 54765 -16725
6901 -16725 -225209 -314776 -305299 -198216 -45951 -79026 -80826 -33603 -25385 17880 47100 11645
6889 11645 -18047 -74398 -42658 -14992 39683 4025 -21392 -115983 -81686 -59632 -118184 419
6877 419 11618 -54299 -62216 44831 114162 16475 23391 30440 67108 100051 102583 93542 17994
6864 17994 -93596 -134784 -78028 -30156 -39354 98558 108930 22781 15244 -48162 -55961 -62636
6852 -62636 -144432 -87907 -39616 3643 -4869 -4398 135691 152351 116069 134164 70711 21248
6840 21248 -39182 66993 58530 203923 182026 188727 176267 139934 -44124 -43698 155201 164802
6828 164802 66188 43440 46930 63016 65470 117323 144212 126007 169334 63685 -15155 -3167
6816 -3167 53890 40732 54516 73552 64826 25464 -43796 -3067 11663 -41120 -50902 -9971
6804 -9971 60567 94494 136460 166881 76863 -41236 -34497 29302 139365 152075 2153 38620
6792 38620 95355 113446 125232 64748 -34076 66466 161727 248537 249509 135771 -1190 -61146
6780 -61146 -21146 -56223 -20961 -9097 -31300 28360 61762 -6131 -61714 -16271 45923 -23271
6768 -23271 -90823 -140965 -149145 -72791 7928 137810 148342 77613 88039 116339 17305 -67845
6756 -67845 -123290 -147911 -83965 50201 140830 174844 111945 -22863 -27283 -31874 9043 147062
6744 147062 167560 101432 61646 -104451 -46068 -13551 -47387 -78171 -42993 -181093 -284845
6733 -284845 -329475 -182428 -26005 1903 -196686 -256805 -256107 -176242 -158811 -140685 -117633
6722 -117633 -13528 134386 190197 47781 -90723 -96135 -113136 -199221 -125904 -68660 -22029
6711 -22029 -1506 98202 65640 -85889 -150677 -128449 20809 46832 -12786 -23668 -33409 33637
6699 33637 101815 162777 164104 85425 31153 2615 146124 154350 184210 220226 178147 111875
6687 111875 50197 79278 -6167 -71178 80695 293323 351188 326319 181761 107155 159484
6676 159484 2758 -19135 60878 -34480 -17301 95007 44390 27726 17476 -6549 12001
6665 12001 -20243 -15495 22514 143531 147693 96793 -6443 -112824 -188973 -85347 45985
6654 45985 -45777 -162255 -105720 -82946 -144993 -76000 -13533 -20332 -827 -16959 -24051 -4763
6642 -4763 -16115 -81109 -116440 -37301 -25551 -35451 -36880 53590 147270 179346 115576 39832
6630 39832 -8164 -2767 -11008 23635 36711 12310 -45904 -126018 -82110 -90239 -107631 17347
6618 17347 19241 -29547 -16962 -19304 22302 -5266 -28685 -78032 -89902 -90252 -81454 -121030 -145177
6605 -145177 -255659 -207469 -140442 -162190 -8379 80572 32293 41139 -80359 -85414 -59272
6594 -59272 67729 136696 117414 51623 -25429 -147807 -69466 -29492 -163601 -199408 -132166
6583 -132166 56245 98215 178774 197870 134446 33965 -29468 57377 581 -30558 -58258
6572 -58258 -42708 69930 78474 30267 47033 -23303 72482 61704 10171 23539 194019 135973
6560 135973 87678 74189 71916 117121 157373 77019 42880 -130759 -259730 -226470 -22776
6549 -22776 8863 -26555 23606 76467 67017 7995 32516 45034 30718 61191 91820 -66110
6537 -66110 -141618 -169893 -267130 -201592 -76165 -23470 -62419 -82190 -26841 27081 -27147 11682
6525 11682 86075 86969 -17817 47813 30145 -18028 6129 194131 283560 157043 145902 97564
6513 97564 87932 70144 23599 2569 -29852 -69821 -131674 -199472 -148703 -29763 -44148 228
6501 228 -76280 -110824 -112224 -188537 -117875 1868 33818 121982 111388 29506 99098 73295
6489 73295 43503 13524 -123546 -179932 -138161 -136624 -88526 51731 130679 120372 88735 96771
6477 96771 169805 91773 -35797 -60719 -1427 -34143 37261 195396 196319 115868 162787 65590
6465 65590 -16149 -62272 68375 140940 152842 109586 -54579 -98804 -7888 95894 84006
6454 84006 21202 15719 -3762 -119657 -12213 16786 -70802 -81832 -90152 -145811 -175100 -164726
6442 -164726 -99843 49437 156125 66906 90760 -25918 -56742 -48732 -529 -86125 -205664
6431 -205664 -195443 -130307 -130803 -148059 -151049 -132781 -133790 3682 -8471 -18089 -49078 -95833
6419 -95833 -191068 -202377 -136270 -109485 -177875 -278887 -311698 -247437 -379656 -329498 -167100
6408 -167100 -257617 -294496 -324452 -215423 -122020 -71407 -157582 -244838 -237228 -204648 -78790
6397 -78790 46227 61978 99518 63964 4156 -99163 -173356 -152873 25155 96224 188802
6386 188802 114975 81255 19890 -28059 -2627 -22064 -47932 -169164 -249498 -194209 -102874
6375 -102874 -147779 -101226 -16835 52228 189683 188343 -1684 -67389 -43289 105462 77869
6364 77869 15863 -32773 -126433 -39704 15051 47496 1865 25210 67147 40542 -18162 43744
6352 43744 118797 163896 194925 143532 206138 109124 25456 -16607 -86036 -101040 -52192 3392
6340 3392 91517 35945 -32169 -130671 -170905 -100097 -40045 -77900 -50190 8244 -74826 -110725
6328 -110725 43605 49456 11784 51832 136217 49411 38435 50938 -58058 -128175 -164142
6317 -164142 -115474 -107136 -26141 2815 45535 128719 127656 146491 84654 -17382 -109574 -176599
6305 -176599 -206260 -258477 -30533 197866 138382 18363 -18455 144032 345692 374087 236650
6294 236650 176749 76155 99076 122833 41433 20605 63770 5719 -173721 -256107 -219316
6283 -219316 -102079 -98291 -194568 -231818 -160495 7386 34500 62723 17299 -9010 -24177
6272 -24177 -319 110583 184230 254010 211673 219804 143328 93724 126710 93439 -34076 839
6260 839 42031 126831 148345 94441 125536 239573 149385 34509 -25238 -100914 -163178 -4330
6248 -4330 87540 167670 167111 107615 -69401 -86096 39970 176173 268017 156324 37550
6237 37550 -32635 -3602 -51756 -76754 -102893 -192676 -156230 -43212 -67379 -120007 -116188 -156159
6225 -156159 -172622 -221385 -338622 -384003 -290593 -87761 -64049 -56190 -98717 -155871 -79095
6214 -79095 -111761 -39330 14365 102486 88289 105518 40845 27897 73221 136359 167185 170493
6202 170493 1895 -72279 -64707 -103621 1758 5744 2384 60508 115318 45373 -183439 -244039
6190 -244039 -191429 -122633 -68114 -138535 -224300 -157329 -88237 -59494 -235021 -199098 -116375
6179 -116375 40962 143465 83526 58568 161597 167222 103042 104576 237652 112399 -10442
6168 -10442 -25994 107797 140404 151921 109463 42644 -9354 -147455 -247582 -200123 -125424
6157 -125424 -116682 -153311 -75733 77048 115190 13013 -125054 -248305 -264289 -240436 -159008
6146 -159008 -58787 -22977 -84728 -119352 -94840 -106102 -140880 -52404 -54482 17735 100230 97890
6134 97890 175079 184040 311919 399894 355939 135654 -19921 -166927 -157261 -143668 -26173
6123 -26173 71831 124149 164229 2603 21777 1162 -129837 -116318 -26633 5144 -34086
6112 -34086 -3920 72328 -19604 -78334 -161856 -181168 -93398 -110041 -143026 -90167 -75111 -59228
6100 -59228 -59153 -24826 -37362 -52296 -40921 -23951 18181 5436 52017 -18269 48808 58392 -1073
6087 -1073 139761 70442 -114959 -260234 -387058 -375967 -307008 -267785 -181472 -40627 11468
6076 11468 -26078 -65763 -14617 9309 54580 46160 97075 165905 107756 -8320 53170 8553
6064 8553 106454 114620 144883 91989 56992 -87098 1196 72818 85578 23324 -5075 -42702
6052 -42702 -44538 -937 -33456 -3306 -12381 -185161 -218553 -88311 -118544 -96413 111640 143002
6040 143002 81574 -7106 -23982 117166 61024 -30248 -10468 88924 63514 57845 -70131
6029 -70131 -150213 -23644 35346 56330 208586 67993 -2032 53888 86651 18519 -120055
6018 -120055 -113121 -29945 25376 101522 176900 69027 33328 -96427 -133975 -65891 29692
6007 29692 84399 -3717 -85267 -67787 -58459 -20519 -31162 -68805 -71606 -98748 -37757 -86492
5995 -86492 -136146 -44054 146571 192870 18020 -102672 14396 40048 -58789 -103661 66931
5984 66931 72144 61095 119265 78927 50127 31712 65797 55524 -14070 -21674 -57909 -46267
5972 -46267 -44645 4035 63797 46763 73777 105384 111510 134704 -6284 53507 146536 115872
5960 115872 77003 -41724 -76926 -109938 -140310 -182603 -137754 -10383 30780 77069 60208
5949 60208 52685 85973 30697 21812 32520 2951 -52350 -167086 -179282 -130392 -72247 24069
5937 24069 6516 11765 97226 110577 192497 78095 1996 -31764 -11177 -109866 -106269 -7303
5925 -7303 61889 23810 -6984 45383 46788 -10877 -95492 -83077 15602 32701 8969 117630
5913 117630 55509 -30278 112548 74742 126289 144811 213903 111078 -18781 26954 52813
5902 52813 99917 83041 9162 -2381 -3862 8728 -30426 -69430 14556 117381 135982 23128
5890 23128 5019 86622 84834 177056 147951 80517 46002 -49289 -97458 -210164 -220381 -114051
5878 -114051 8636 59298 163944 152501 80254 75914 116650 129231 81708 -17370 -76383
5867 -76383 -6302 -8553 -14654 -10572 -99662 -184191 -77536 -22964 -85674 -9802 95221 36711
5855 36711 28801 28207 11155 33136 144096 205917 175401 169255 115895 118984 128999 164640 194960
5842 194960 226483 216521 199475 216380 129347 26429 -21457 -148933 -152761 -132038 -121645 59493
5830 59493 85086 -5158 15366 -69821 -24267 -108692 -150941 30901 156439 223920 172149
5819 172149 142854 133288 84728 104829 63693 -83068 -99759 -59747 33398 52926 51893 31726
5807 31726 -63440 -109600 -87485 4677 7234 -2612 67447 78265 -118656 -135040 -110629 -144032
5795 -144032 -39980 -108853 -78022 -21199 -131130 -195491 -207915 -159746 -75493 42840 199038
5784 199038 179855 160512 79471 -17705 -111001 10104 41881 -35405 -106385 -233 3669
5773 3669 -178583 -152411 -106322 -47916 -104413 -76077 26386 1210 66307 102584 131464 227538
5761 227538 255867 212298 30493 36840 54115 40347 89098 159583 39476 66615 42093
5750 42093 4564 -31758 -73096 -247286 -244234 -203977 -146959 -38942 -6174 38087 27073 -6164
5738 -6164 -14979 21729 33718 57751 121207 133537 16763 -21771 -29839 8047 6739 30548
5726 30548 47845 38794 93906 146618 197874 241649 219041 66239 -24926 -40622 31414 48553
5714 48553 -47878 -128211 -86011 -113782 -80030 -9734 20761 22548 17750 19802 76859 93522
5702 93522 85805 100643 78954 -65421 -115615 -41802 110500 124334 27568 56563 178153
5691 178153 124297 24164 -19563 -88588 -55370 -120502 -111352 -102780 -47072 -129949 -147376 -167500
5679 -167500 -215008 -144866 -66270 37893 87080 47689 59113 59303 89914 149748 135339 116429
5667 116429 149577 9093 -61927 -93346 87738 248881 204906 58880 -10613 -9980 78779
5656 78779 59530 116404 197540 165553 152176 145506 66468 -64482 -147729 -202681 -156592 -146805
5644 -146805 -75843 57757 127417 43553 -5085 -113838 -59862 33501 -35006 -76210 -102394
5633 -102394 -127075 -105553 -172795 -136080 -42284 56052 15920 -94894 -105980 -150234 -166855
5622 -166855 -96665 -27814 -102414 -150516 -124925 -566 -12751 -78542 -83914 -49811 -76416 -40729
5610 -40729 -104549 -121577 -67022 75047 33858 -9533 -46102 -38215 46024 69030 -41142 -102531
5598 -102531 -95805 -102557 -89950 -77654 -137661 -232239 -285085 -202456 -173749 -41600 71438 161044
5586 161044 233067 154444 -24582 8076 149962 126160 12014 -76341 -14289 -45620 -66233
5575 -66233 -25639 -119937 -145163 -101450 -154303 -190822 -151253 -142062 -61108 -7868 -46517 -67189
5563 -67189 -111271 1364 138344 132311 1567 -51438 1528 86076 74482 86277 16761
5552 16761 -30709 107542 201821 85993 -109240 -174604 -91042 -1714 51170 127461 95787
5541 95787 -93259 -235425 -100701 58443 13539 -10045 -58335 -112601 -27197 -46405 -156697
5530 -156697 -273197 -255678 -226493 -184729 -63735 89539 -22225 -84970 -16315 61592 -7570
5519 -7570 -50093 -129697 -105622 -28277 -56387 -94273 -238233 -157551 -19532 -42160 -179949
5508 -179949 -139055 -62411 -52479 62071 169311 50310 -53210 25690 117780 119149 138766
5497 138766 84155 90244 123470 3121 -168457 -136212 -164677 -169418 -99127 -93790 -49045 -120172
5485 -120172 -161291 -182430 -173931 -25092 75553 48337 -19766 -5690 145716 125184 52029
5474 52029 49143 16860 68204 -24281 -61823 -63541 29232 -20976 -140255 -39657 359 44746
5462 44746 49610 16961 107556 181838 29399 -89334 -243798 -255091 -150236 -121845 -65930
5451 -65930 -80243 -132329 -140748 -166415 13609 66021 48529 131341 122819 78008 143196 124901
5439 124901 6574 65988 25268 -75602 -64606 -12765 172332 127082 13378 16945 -24097
5428 -24097 -26689 -42064 -27233 -77526 -45796 -37665 -14643 16550 147380 152287 207855 220375
5416 220375 117156 41792 118090 165915 126984 15342 13022 110539 -27074 -101170 -46137
5405 -46137 -41830 -128059 -140071 -18403 47872 69208 172595 145283 98869 108826 24799 12059
5393 12059 23447 84642 82046 71313 71996 107096 192941 191788 188487 115296 2524 -17466 -35112
5380 -35112 -58541 5337 154857 73306 69861 142383 218755 316103 232350 30726 -182316
5369 -182316 -138699 28282 15790 -45591 70338 116272 81433 -61818 -107238 -164284 -79317
5358 -79317 32288 13113 -146866 -136931 -59398 50988 96404 -1755 -14251 17634 -11725
5347 -11725 -35979 -58073 -73261 -23580 14427 -58213 -127695 -177857 -106222 -88241 -905 -21483
5335 -21483 79471 175711 264387 367746 309158 178753 110676 64534 -1765 18441 103040
5324 103040 -46462 -128397 -31737 7585 34299 61025 -48777 -122133 -128039 -84267 -138158
5313 -138158 -286235 -375425 -326552 -192132 -71449 25407 -75188 11757 -32104 -10813 75433
5302 75433 68325 126412 222281 133962 19887 3051 -5126 89566 203449 179357 243856 280285
5290 280285 226029 175369 7191 -85324 -22175 -59120 3159 31041 158830 242900 201592
5279 201592 192849 71862 -28237 -60118 -117018 -189524 -97008 87237 98688 -46773 16634
5268 16634 93360 7085 -77568 -5733 61090 -28646 23933 67738 92037 119531 77676 29015
5256 29015 6282 8284 -62893 -6068 39250 15469 80505 48998 37463 -24275 -4482 -21856
5244 -21856 52916 1787 -16637 -39534 32226 -31889 -154184 -159320 -9820 153039 344874
5233 344874 272667 141157 43743 111328 170838 35352 17349 16603 64643 151663 150932 120197
5221 120197 51644 166167 287467 248850 130331 -72567 -171192 -217083 -155367 -109012 37534
5210 37534 25018 6223 80910 109250 243803 197050 9431 8322 62922 100797 113813 143449
5198 143449 138935 151465 48062 -59150 -101185 -98762 -55590 -85941 -187070 -224682 -155732
5187 -155732 -60856 -53105 -99604 -93792 -174065 -144874 -133978 -76884 -19079 -41166 -2771 34971
5175 34971 17560 -83 -1794 109598 161212 171258 51079 -41544 -36330 -51845 -63154 -28844
5163 -28844 68253 57295 -68991 -21919 24381 38948 6182 -32748 70818 183726 248761
5152 248761 120270 -23547 -83071 -103465 -75110 -52148 -82603 -143112 -155568 -258906 -88742
5141 -88742 88496 63952 15432 -102689 -113424 -31764 -110349 -127715 65326 16428 10316
5130 10316 52716 -81461 -155867 -236951 -285954 -176152 -62581 -54912 -126150 -238115 -260634
5119 -260634 -117786 52350 3908 29507 349 26244 34135 -20289 -49870 -60154 -76393
5108 -76393 -41751 103544 151646 225517 203645 285659 334496 181312 24954 -1143 -69814
5097 -69814 -158980 -166468 -4621 -33953 -118229 -138155 -6658 -24216 -8397 -16747 -92579 -99771
5085 -99771 -137034 -153921 -143631 -173568 -149979 -46785 19787 23515 -63213 -41627 -44164 45571
5073 45571 142465 116869 43372 -65434 -98527 -125082 10263 37310 98745 139927 235674
5062 235674 320217 156749 -84919 -93211 -117974 -76386 88411 163959 164451 200344 135935 166387
5050 166387 160079 137337 45046 36905 -11427 -1695 55214 118687 120699 27580 -103134 -128594
5038 -128594 -60326 -39857 -22702 5549 13152 44021 57194 119121 55706 81433 84364 72626
5026 72626 19622 -83406 -105026 1191 77096 -5594 -142227 -132201 -41284 -125879 -145817
5015 -145817 -171814 -113559 37062 142820 104389 44719 122693 158506 118824 129447 106086
5004 106086 -355 -40719 -17017 -20637 61774 98219 51816 -37974 77385 13462 -16915
4993 -16915 25408 171081 181035 112765 679 -91117 -31361 -13930 -174889 -259422 -184708
4982 -184708 -156127 -214181 -127384 -32480 63679 43049 -59580 -68061 -105122 -203516 -251206 -206001
4970 -206001 -274678 -275606 -149071 -192636 -97753 -4157 -109088 -82431 -94027 -49046 -27095 -134134
4958 -134134 -218480 -242503 -238590 -148388 -102683 -205321 -82788 -63283 -196071 -124747 -17470
4947 -17470 1534 -6604 17361 21233 173503 195604 160084 158173 82035 44943 -22174 74179
4935 74179 170374 -22424 -119965 -223271 -149956 -16651 -93225 -196231 -186621 -62304 -114041
4924 -114041 -160531 -134320 -141239 -117466 702 19369 71558 81060 77991 -25908 -100825 -82740
4912 -82740 31750 54788 14746 -69793 -95934 -149932 -195389 -74852 34559 -25514 -114699
4901 -114699 -111501 -2213 -86165 -24740 -51199 -24735 65391 -17268 -77315 -171790 -83970 68334
4889 68334 102722 -65106 -29609 -197688 -196884 -223502 -194371 -74029 18945 -14907 59745 72574
4877 72574 71380 27981 21437 83094 54146 39265 -4537 -124967 -67067 -147089 -151654 -181767
4865 -181767 -241560 -231451 -178346 -190111 -150939 -84798 -147867 -130286 -56366 24706 51312 85998
4853 85998 86651 84240 -22358 -121567 -9372 -12389 -109257 -135117 -140393 -108813 -145992 -1270
4841 -1270 49003 -122327 -207319 -95061 -32188 -71805 -117012 -115633 -93150 -33123 75045 47655
4829 47655 -79808 -142486 -102322 -84798 -97442 -100303 -124763 -203483 -201161 -156138 -97699 -63644
4817 -63644 145530 175133 75470 -64451 -112919 -25381 -93018 -119567 -182028 -135020 -165710
4806 -165710 -211016 -188643 -125606 -103111 44369 72531 -108257 -110069 4218 64623 27344
4795 27344 -161434 -48504 160441 210541 303529 377284 361383 252918 274012 247694 152209
4784 152209 64180 -53642 -134072 -206550 -76790 3382 -118 8178 -30818 -62140 92188
4773 92188 151809 95448 17765 -39357 9576 38663 108722 71954 -85845 -118592 -165695 -55845
4761 -55845 -71018 -67292 -103793 -5655 53844 70690 128378 178084 155310 59169 -24001 70165
4749 70165 16749 -75576 -92160 -84539 -51978 -97318 -127655 -41756 5759 33768 -75613 -47718
4737 -47718 95710 -2060 -16616 79709 -40097 37750 97628 80757 115805 118683 53464 39290
4725 39290 118801 157860 245641 203023 117024 128407 88616 80630 32991 3991 19417 -35573
4713 -35573 -116934 -141872 -138319 -41016 -10589 142126 252036 196839 151450 36491 -15125
4702 -15125 -16108 -29771 -154433 -149071 -273181 -248176 -139066 -159706 -105448 -101227 -37938 -76546
4690 -76546 54917 52062 -56942 -133710 -97980 -79707 -94950 -133810 -342250 -325389 -259089
4679 -259089 -237412 -252449 -211109 -143122 -150565 -87476 -14669 -17073 -132454 -306346 -168064
4668 -168064 -28303 -31451 -69703 -37570 12953 64547 64504 87725 53715 -27074 8996 -29392
4656 -29392 -104425 -119186 -102128 -105015 -136329 -69939 -77949 -119098 -125029 -29596 41758 22127
4644 22127 103706 238796 251616 54443 -15530 41135 24125 -29338 103862 70168 3237
4633 3237 20600 -47082 -74453 -117277 -129809 -81325 -94644 -44646 -52371 -166815 -86649 -100105
4621 -100105 -19950 50767 15861 74704 10993 30815 -13576 -104834 -101458 -25322 -52154 46370
4609 46370 123080 27639 -8792 119796 68052 -54833 -46628 33255 61193 90567 57294 -57720
4597 -57720 -62751 -136484 -186357 -122982 -39915 -37967 -21955 -61830 -42325 -17814 94129 134352
4585 134352 202957 208117 157250 120960 197174 292124 148486 2945 -4628 6105 7947 -108889
4573 -108889 -63489 -69664 -92942 -149309 -129754 -104320 -143614 -123973 -94300 25405 -75503
4562 -75503 -128557 -97505 -16158 -71689 -96265 -85134 -29563 -966 -90938 -265259 -243163 -122260
4550 -122260 -34313 83573 67308 103742 118891 121311 21466 38307 -62457 -87744 43949
4539 43949 54221 -42129 -110995 21655 -31742 7511 -43753 28991 139494 151832 140864
4528 140864 45531 -49465 -203106 -108543 -47990 -34173 -29828 -26882 -1665 40708 14004 -62471
4516 -62471 -32917 -13958 -17256 -110466 -118210 -60088 51285 155314 200161 294767 244414 111320
4504 111320 -21602 -104238 -191811 -280613 -270744 -215554 -184088 -8927 -7861 -92506 60833
4493 60833 122855 147151 117751 58432 46862 30825 12778 3735 -113128 -165133 -14938 -20669
4481 -20669 23520 91897 57574 -19303 22399 36609 -75251 -143936 -18029 -22433 -73529 -137067
4469 -137067 -229247 -227026 -200506 -138319 -108040 -66553 -4523 147313 230571 249898 128172
4458 128172 -25552 -103486 -89039 28434 163367 166377 90057 -17228 18640 -15949 -20256
4447 -20256 2004 47381 97380 63820 132158 149149 27567 14390 95967 158221 110962 69927
4435 69927 57348 -8111 16957 -120716 -221200 -132288 -135019 -228670 -317521 -177995 100192
4424 100192 175184 86155 694 -5048 -10761 -130529 -173252 -51865 223789 20691 -45723
4413 -45723 -128424 -35779 5329 -17200 137384 144420 94770 135562 97722 30391 -96476 -53276
4401 -53276 118546 70901 143494 125739 96333 45213 107332 156442 135629 138049 109750 129714
4389 129714 172285 146726 153530 97663 62459 28758 16821 -84261 -82911 -174504 -239937 -251253
4377 -251253 -135848 -66826 -22743 22235 -71200 -108839 -56554 -24667 -14995 -47324 -696 -31260
4365 -31260 30947 128877 34343 -89985 -213170 -392217 -398896 -202729 -25698 124108 189168
4354 189168 70725 -50625 -50519 -13789 -36336 31913 30814 219518 277771 228901 134287 194340
4342 194340 219683 174990 131131 26551 -85161 -58007 -17782 49954 86200 154466 222559
4331 222559 223315 25150 -44424 -23780 -87414 -11361 89818 -7609 -223287 -188878 -215512
4320 -215512 -212967 -148509 -113507 2416 169818 172138 156035 110761 -51962 -108537 22927
4309 22927 168432 163280 193507 278180 217273 160796 46481 -74188 -21267 -27905 63508 212105
4297 212105 249196 48705 -6589 -84939 -38065 -58784 -87810 -5529 -45251 -100332 -30767
4286 -30767 -66471 -53497 9232 -36510 -113052 -167338 -29514 -13936 -106933 -105524 -133402 -146696
4274 -146696 -178401 -220534 -161299 -84999 9706 43200 55464 69308 25848 27868 20521 -89793
4262 -89793 -192116 -224266 -186921 -70645 46288 195895 188789 50736 18307 -73405 -60218
4251 -60218 82154 93105 -17153 -6028 109291 70619 73133 203923 176610 36113 -11262
4240 -11262 -158462 -71119 27397 -67961 -128247 -168711 25609 136587 2077 -138888 -219671
4229 -219671 -38916 131424 248700 249425 196431 67013 13946 69933 69085 -29818 -23672 123206
4217 123206 158329 49556 68684 112109 29025 -65085 36385 586 -152274 -93746 -28247
4206 -28247 -13249 -124237 -263807 -257936 -132842 -86733 -97508 -192525 -182748 42080 29374
4195 29374 11888 -57925 -43467 62729 37277 -42397 -155238 -108296 30698 33018 -99349
4184 -99349 -194693 -204764 -97410 -79882 -45881 34326 107065 136192 166358 176321 70558 -25775
4172 -25775 -41763 -27920 4589 51439 47699 -95268 -140765 -321857 -219975 -60207 94228
4161 94228 107538 149907 156039 168088 141694 196574 92203 -51100 -9823 -14624 -108053 10497
4149 10497 90793 131154 105680 -13139 -55374 -83889 11925 -59830 -94281 -47465 -169627
4138 -169627 -217276 -203075 -128653 -85399 -78318 -121836 -139056 -107174 59707 91144 -10657
4127 -10657 -30424 13331 4989 -29685 -66444 9489 36645 -9589 32626 -58931 -150580 -131992
4115 -131992 -11261 43056 -10508 -130761 -255659 -332409 -183993 -149558 -154589 -87912 -70850
4104 -70850 -112326 -74888 -47778 1224 43017 62787 133100 88272 27175 -60676 -37952 1410
4092 1410 -90480 -122211 -9610 110691 126903 47739 42749 74174 88906 -56104 -133768 -165680
4080 -165680 -234093 -305676 -183703 -67067 -2863 28063 59796 -36777 -56272 13637 -27553
4069 -27553 -52100 -101737 -115264 -97597 -51320 -49631 -137460 -39459 57826 105534 244378 305808
4057 305808 243517 215303 135283 76444 -46537 -128672 -145969 -107989 -33910 -11451 -77635
4046 -77635 -150561 -208396 -161155 -48568 -29757 -19343 129832 282829 250576 129119 10670
4035 10670 88069 133649 88579 135423 146768 -32877 1150 152996 136176 49012 967
4024 967 -5807 -33084 -77459 -140191 -241799 -213242 -140628 -160243 -195301 -149992 -74499 13481
4012 13481 -39935 -54802 -68234 -43084 39793 167713 275874 189253 346 -175192 -217217
4001 -217217 -172124 -94376 11932 157864 226948 267842 214230 63648 -19856 -93491 -153883
3990 -153883 -185472 -144341 -23610 5356 -16933 -235169 -237859 -22411 11256 -39229 -170052
3979 -170052 -159461 -94858 -35650 -50903 -33713 68250 102315 98415 66621 64490 88625 -34839
3967 -34839 60782 90315 26680 14621 -7319 -30029 -115789 -86476 -52422 -52819 -43265 -20411
3955 -20411 26715 59977 6929 -60467 -160297 -4347 78832 80635 20800 -34434 18010 107810
3943 107810 88522 -27513 -4367 50243 38391 -153902 -199480 -112177 -57468 -102918 -56101
3932 -56101 -138467 -169795 -233647 -123703 545 -4228 -58353 -141978 -280879 -257046 -207435
3921 -207435 -178177 -176096 -12351 154629 258631 212886 139858 96016 115063 -11064 -89019
3910 -89019 -110348 -233609 -130019 -39091 116480 257568 183482 116305 111087 34041 -96621
3899 -96621 -25357 -47500 -63558 -2995 3705 -13893 83478 97382 55278 -29856 -103178 -280622
3887 -280622 -502262 -537843 -417714 -199985 -135992 -109419 -187726 -275202 -210266 -57065 100121
3876 100121 258935 85407 -137714 -215274 -250545 -153648 -12327 76046 41018 -124132 -149678
3865 -149678 -204581 -226362 -51162 72677 175564 207818 173891 98834 102009 225025 313564
3854 313564 274831 181150 146240 119468 181829 245645 299138 177418 139189 28803 9765
3843 9765 35554 57711 8019 13875 69913 -46497 -101767 -236315 -256558 -203210 -113041 -55331
3831 -55331 49617 35633 5870 56045 59621 11461 -62565 61465 109916 41073 -61954
3820 -61954 -43361 -34458 -55211 -32392 1381 -19286 116197 164259 108387 61588 117720 96346
3808 96346 -19495 -78016 -73040 -7243 -17075 28535 14616 -6341 -18813 -25538 -7799 91232
3796 91232 118354 52915 20779 7959 -56915 45811 71454 60198 100300 30495 -45631 50918
3784 50918 21896 -7359 -46052 28619 128423 129710 52673 -77236 -70704 -64524 -82125 -16814
3772 -16814 25164 101388 46801 44077 -15353 -177306 -280355 -95693 -70814 -36973 -124847
3761 -124847 -161001 -99416 -69317 -113106 -92466 -53473 -117853 -160034 -216116 -245512 -26769
3750 -26769 -6308 -12155 -157453 -228683 -118263 -67877 -49494 -122604 -186640 -204849 -164073 2162
3738 2162 144585 117295 70276 142034 204096 69126 1369 -12238 42605 6571 85631 130756
3726 130756 91119 84076 -20478 -69464 -17941 -9967 -97757 -131996 -261789 -452145 -440699
3715 -440699 -348354 -230264 -148485 -42572 51662 9900 26736 82445 47772 19769 108999
3704 108999 46048 86305 36056 2872 29069 41911 26360 -10589 -105725 -185733 -180921 -63751
3692 -63751 -404 28666 46594 -9882 -96653 -216564 -214683 -88431 25013 18717 -47071 1775
3680 1775 104870 58015 8449 -33490 2794 70261 131707 82391 80846 128294 56956 95801
3668 95801 110927 52561 34530 -36073 26181 16933 -41581 -25991 -86138 -204907 -118953 -68227
3656 -68227 -88882 -54633 12136 -69374 -128812 50810 52853 88955 188799 298558 217437 43263
3644 43263 -124277 -242277 -240010 -270241 -329909 -183973 -39655 -81758 -66530 144976 153334
3633 153334 62151 -49871 -131888 -181726 -7558 6848 -7359 -4139 34424 113758 79133
3622 79133 31979 -25674 -66368 -35141 -75141 -89500 -101037 -47980 15250 -3738 26683 20345
3610 20345 7170 67202 34855 -60568 -42802 3608 -59559 -71315 -30874 -106652 -89627 -102534
3598 -102534 -82015 -57899 -61496 -69376 -54009 -108872 -74889 -110086 13880 -37488 -162039 -167034
3586 -167034 -98404 -4630 15326 -12762 -77482 -77542 -1829 85466 178889 191543 286619 217114
3574 217114 14433 -921 -18825 -52031 10540 107024 96900 185028 135046 56565 97962
3563 97962 3355 52970 16325 -58832 -13837 113586 111016 10431 -93235 -111928 -122129
3552 -122129 -20534 131693 31293 -90790 31353 172790 159995 162911 195014 127252 76690
3541 76690 50498 -14104 -54800 -5671 7929 97435 279651 246408 179626 188090 115572 59262
3529 59262 20716 -23542 -51468 -39733 50499 -8609 -5508 51667 -114 10433 148763 205746
3517 205746 175239 127436 40509 -15413 10496 164416 261828 243559 164963 88922 168056
3506 168056 74605 44369 -23312 -38505 -52521 16770 119899 176790 102014 -27467 -55647
3495 -55647 -28280 81004 31511 -38027 14215 65593 25532 66700 -27490 -101835 -72589 -67934
3483 -67934 45455 64047 80358 27530 84910 217309 174837 -20333 -74014 -38982 -33118
3472 -33118 -24796 20803 192925 182771 -2930 45188 145073 192346 80742 -3009 119768
3461 119768 228137 82471 -5730 -45841 -62675 -44381 -42304 -95403 -46848 -6147 -20312
3450 -20312 -5362 115177 129029 198093 192285 73506 -3346 -17320 5823 100708 103653 90388
3438 90388 105590 87533 143629 196902 150836 76407 -3395 -74241 -100311 -101902 39108 156320
3426 156320 200406 143160 198491 230284 176346 153799 161572 242084 172464 142256 221238 133385
3414 133385 68586 44200 82022 218512 172183 149050 187149 13932 -81456 -142789 -163156
3403 -163156 -105743 -71168 -64676 -113132 -61746 -123625 -171030 -102418 -82878 15758 -4983 -89610
3391 -89610 -99617 -77424 -7831 59201 72709 221582 197027 130242 91229 -36839 -20019
3380 -20019 -72661 -115814 -141242 -181675 -165738 -205298 -291348 -326982 -230158 -131807 -144164 -64426
3368 -64426 36657 -45708 -29508 22069 7441 52205 43021 64489 44351 -36484 -30309 15022
3356 15022 -56735 -24967 43831 25827 18388 899 -19732 -19830 -103085 -9172 103659 -82048
3344 -82048 -144874 -121645 -50199 20287 97808 82938 -32074 -108082 -82122 -87967 -67298 -88685
3332 -88685 -90422 64874 145853 40237 39913 61015 -38805 -195153 -141269 12268 144040
3321 144040 87626 -14852 -28896 62561 101364 92377 143970 165995 92908 114050 146346 110198
3309 110198 150624 264245 307235 141514 53537 -47841 -121950 -46004 133652 244736 108567
3298 108567 8994 37151 107279 -17468 -40438 -81872 -12634 -20127 -57951 -182038 -145461
3287 -145461 -88441 63104 89475 111979 -1502 -60829 -76907 -87834 -12589 -48115 -43057
3276 -43057 -10984 69885 145444 72425 17464 -3049 46481 111226 15581 17176 -31303 -139837
3264 -139837 -240980 -238354 -96793 -155368 -119122 -155541 -182335 -217269 -116325 -895 91888
3253 91888 71469 -109222 -188930 -61397 10143 50103 -16501 764 83388 -4467 -85460
3242 -85460 -80717 43925 -41291 -28101 -116921 -183718 -146126 -78216 -34850 -45148 -29540 -18691
3230 -18691 36691 119007 33316 -65716 35294 -61009 -215960 -188207 -177890 -57257 -13310
3219 -13310 10078 109193 113109 43532 26635 5699 -50574 -3051 53044 15827 -293 63480
3207 63480 16923 -61483 -43205 44594 -10824 -95114 -61317 -50844 -51939 -85694 -78701 36402
3195 36402 65008 51766 7521 -30163 -18459 174026 271368 315008 234595 96824 26987
3184 26987 -23025 51325 29604 -54166 -69128 -140831 -79949 -15360 -11477 9565 9331 -47060
3172 -47060 -119383 -5908 71456 176516 181047 61464 76545 102844 139750 -16910 -29198
$$ [...]
##END NTUPLES=NMR SPECTRUM
##END=
