##TITLE=317048
cc 40111
350/186/2
adrs
chrisr
##JCAMPDX= 6.0         $$ Bruker NMR JCAMP-DX V2.0
##DATA TYPE= NMR SPECTRUM
##DATA CLASS= NTUPLES
##ORIGIN= Bruker BioSpin GmbH
##OWNER= nmr
$$ XWIN-NMR		Version 3.5
$$ Wed Jul 12 08:55:05 2006 GMT Daylight Time (UT+1h)  MAYBRIDGE\nmr@NMR_250MHZ
##.OBSERVE FREQUENCY= 250.131544655141
##.OBSERVE NUCLEUS= ^1H
##.ACQUISITION MODE= SIMULTANEOUS (DQD)
##.ACQUISITION SCHEME= undefined
##.AVERAGES= 16
##.DIGITISER RES= 18
##SPECTROMETER/DATA SYSTEM= dpx250
##.PULSE SEQUENCE= zg30
##.SOLVENT NAME= CDCl3
##.SHIFT REFERENCE= (INTERNAL, CDCl3, 0, 16.522)
##AUDIT TRAIL= $$ (NUMBER, WHEN, WHO, WHERE, WHAT)
$$ ##TITLE= Audit trail, XWIN-NMR		Version 3.5
$$ ##JCAMPDX= 5.01
$$ ##ORIGIN= Bruker BioSpin GmbH
$$ ##OWNER= nmr
$$ C:/u/data/dgb/nmr/ADRS/15640/pdata/1/auditp.txt
$$ ##AUDIT TRAIL=  $$ (NUMBER, WHEN, WHO, WHERE, WHAT)
(   1,<2006-02-06 12:36:46.85 +000>,<MAYBRIDGE\nmr>,<NMR_250MHZ>,
      <created by zg, POWCHK disabled, PULCHK disabled
       configuration hash MD5:
       84 BC 41 DB A1 6E 1D 46 DA 25 12 A5 C1 ED C5 3A
       data hash MD5: 64K
       9E 39 0A E2 7F A3 5E 0D 93 F5 D4 11 E6 A6 81 31>)
(   2,<2006-02-06 12:36:52.26 +000>,<MAYBRIDGE\nmr>,<NMR_250MHZ>,
      <Start of raw data processing
       ef LB = 0.3 FT_mod = 6 PKNL = 1 SI = 32K 
       data hash MD5: 32K
       A4 9C CC 38 52 11 CB FA F6 EF 0D F0 C4 55 40 A0>)
(   3,<2006-02-06 12:36:54.18 +000>,<MAYBRIDGE\nmr>,<NMR_250MHZ>,
      <apk 
       data hash MD5: 32K
       91 85 DC 35 8A 62 31 D1 8F 50 2D A3 A9 D3 8E 7A>)
(   4,<2006-02-06 12:36:55.16 +000>,<MAYBRIDGE\nmr>,<NMR_250MHZ>,
      <abs ABSG = 5 
       data hash MD5: 32K
       0D 84 0B AB 4B F3 75 67 E6 5D 8D 9C A0 F0 CE 0F>)
$$ ##END=
$$ 
$$ hash MD5
$$ 23 AB AC 2F 77 7F AD 8E 4E 67 68 FC 09 D6 47 D1
##$RELAX= 
##$RELAX= 
##$RELAX= 
##$RELAX= 
##$RELAX= 
##$RELAX= 
##$RELAX= 
$$ Bruker specific parameters
$$ --------------------------
##$DU= <C:\Restored>
##$EXPNO= 15640
##$NAME= <ADRS>
##$PROCNO= 1
##$TYPE= <nmr>
##$USER= <dgb>
##$AMP= (0..31)
100 100 100 100 100 100 100 100 100 100 100 100 100 100 100 100 100 100 
100 100 100 100 100 100 100 100 100 100 100 100 100 100 
##$AQSEQ= 0
##$AQ_mod= 3
##$AUNM= <au_zg>
##$AUTOPOS= <9 >
##$BF1= 250.13
##$BF2= 250.13
##$BF3= 250.13
##$BF4= 250.13
##$BF5= 500.13
##$BF6= 500.13
##$BF7= 500.13
##$BF8= 500.13
##$BYTORDA= 1
##$CFDGTYP= 0
##$CFRGTYP= 5
##$CHEMSTR= <none>
##$CNST= (0..31)
1 1 145 1 1 1 1 1 1 1 1 1 1 1 1 1 1 1 1 1 1 1 1 1 1 1 1 1 1 1 1 1 
##$CPDPRG= <>
##$CPDPRG1= <>
##$CPDPRG2= <>
##$CPDPRG3= <>
##$CPDPRG4= <mlev>
##$CPDPRG5= <mlev>
##$CPDPRG6= <mlev>
##$CPDPRG7= <mlev>
##$CPDPRG8= <mlev>
##$CPDPRGB= <>
##$CPDPRGT= <>
##$D= (0..31)
0 1 0 0 0 0 0 0 0 0.06 0 0 0 0 0 0 0.0002 0 0 0 0 0 0 0 0 0 0 0 0 0 0 
0 
##$DATE= 1139229405
##$DBL= (0..7)
120 120 120 120 120 120 120 120 
##$DBP= (0..7)
150 150 150 150 150 150 150 150 
##$DBP07= 0
##$DBPNAM0= <>
##$DBPNAM1= <>
##$DBPNAM2= <>
##$DBPNAM3= <>
##$DBPNAM4= <>
##$DBPNAM5= <>
$$ [...]
##$SUBNAM7= <"">
##$SUBNAM8= <"">
##$SUBNAM9= <"">
##$SW= 20.6930455092707
##$SWIBOX= (0..15)
0 0 3 0 0 0 0 0 0 0 0 0 0 0 0 0 
##$SW_h= 5175.983436853
##$TD= 65536
##$TD0= 1
##$TE= 294.16
##$TE2= 300
##$TE3= 300
##$TEG= 300
##$TL= (0..7)
0 120 120 120 120 120 120 120 
##$TP= (0..7)
150 150 150 150 150 150 150 150 
##$TP07= 0
##$TPNAME0= <>
##$TPNAME1= <>
##$TPNAME2= <>
##$TPNAME3= <>
##$TPNAME4= <>
##$TPNAME5= <>
##$TPNAME6= <>
##$TPNAME7= <>
##$TPOAL= (0..7)
0.5 0.5 0.5 0.5 0.5 0.5 0.5 0.5 
##$TPOFFS= (0..7)
0 0 0 0 0 0 0 0 
##$TUNHIN= 0
##$TUNHOUT= 0
##$TUNXOUT= 0
##$USERA1= <user>
##$USERA2= <user>
##$USERA3= <user>
##$USERA4= <user>
##$USERA5= <user>
##$V9= 5
##$VALIST= <valist>
##$VCLIST= <CCCCCCCCCCCCCCC>
##$VD= 0
##$VDLIST= <DDDDDDDDDDDDDDD>
##$VPLIST= <PPPPPPPPPPPPPPP>
##$VTLIST= <TTTTTTTTTTTTTTT>
##$WBST= 1024
##$WBSW= 4
##$XGAIN= (0..3)
0 0 0 0 
##$XL= 0
##$YL= 0
##$YMAX_a= 483721
##$YMIN_a= -378470
##$ZGOPTNS= <>
##$ZL1= 120
##$ZL2= 120
##$ZL3= 120
##$ZL4= 120
##$ABSF1= 16.522
##$ABSF2= -4.171173
##$ABSG= 5
##$ABSL= 3
##$ALPHA= 0
##$AQORDER= 0
##$ASSFAC= 0
##$ASSFACI= 0
##$ASSFACX= 0
##$ASSWID= 0
##$AUNMP= <proc_1d>
##$AZFE= 0.1
##$AZFW= 0.1
##$BCFW= 0
##$BC_mod= 0
##$BYTORDP= 0
##$COROFFS= 0
##$CY= 12.5
##$DATMOD= 1
##$DC= 0
##$DFILT= <>
##$DTYPP= 0
##$F1P= 14.0000005364418
##$F2P= -0.99999901652339
##$FCOR= 0.5
##$FTSIZE= 32768
##$FT_mod= 6
##$GAMMA= 0
##$GB= 0
##$INTBC= 1
##$INTSCL= 1
##$ISEN= 128
##$LB= 0.3
##$LEV0= 0
##$LPBIN= 0
##$MAXI= 10000
##$MC2= 0
##$MEAN= 0
##$ME_mod= 0
##$MI= 0
##$NCOEF= 0
##$NC_proc= -4
##$NLEV= 6
##$NOISF1= 0
##$NOISF2= 0
##$NSP= 0
##$NTH_PI= 0
##$NZP= 0
##$OFFSET= 16.522
##$PC= 1
##$PHC0= 100.0864
##$PHC1= 5.102499
##$PH_mod= 1
##$PKNL= yes
##$PPARMOD= 0
##$PSCAL= 4
##$PSIGN= 0
##$REVERSE= no
##$SF= 250.13
##$SI= 32768
##$SIGF1= 0
##$SIGF2= 0
##$SINO= 400
##$SIOLD= 32768
##$SREGLST= <1H.CDCl3>
##$SSB= 0
##$STSI= 32768
##$STSR= 0
##$SW_p= 5175.98343685301
##$SYMM= 0
##$S_DEV= 0
##$TDeff= 65536
##$TDoff= 0
##$TI= <Analysis number 999999
Compound Code 99
Book Reference 9
Project Code 9>
##$TILT= no
##$TM1= 0
##$TM2= 0
##$TOPLEV= 0
##$USERP1= <user>
##$USERP2= <user>
##$USERP3= <user>
##$USERP4= <user>
##$USERP5= <user>
##$WDW= 1
##$XDIM= 32768
##$YMAX_p= 308874176
##$YMIN_p= -400689
$$ End of Bruker specific parameters
$$ ---------------------------------
##NTUPLES= NMR SPECTRUM
##VAR_NAME=  FREQUENCY,     SPECTRUM/REAL,   SPECTRUM/IMAG
##SYMBOL=    X,             R,               I
##VAR_TYPE=  INDEPENDENT,   DEPENDENT,       DEPENDENT
##VAR_FORM=  AFFN,          ASDF,            ASDF
##VAR_DIM=   32768,         32768,           32768
##UNITS=     HZ,            ARBITRARY UNITS, ARBITRARY UNITS
##FACTOR=    0.157963299565203, 1,           1
##FIRST=     4132.6476996994, 0,             0
##LAST=      -1043.33573715361, 0,           0
##MIN=       -1043.33573715361, -400689,     0
##MAX=       4132.6476996994, 308874176,     0
$$ Real data points
##PAGE= N=1
##DATA TABLE= (X++(R..R)), XYDATA
$$ [...]
17873B09350L478r370m380L0659J0679R246j2346O262L4291J6531J2236J4629
17861C21265J9977K2908L6909L7862N4043R1905J00163Q8818N8651J4534J0550
17850H57585N863k4444R959R7406R9720J06712R6125J25612R6450K0272J6408
17839A507668p269M445j582O3706J81292K27694K87717L67495L84277M97930O93789
17828D207162R09543J258742J772996K593500L949312O197952R131989J1592561
17820D1613757J1892052Q752615M354403k339640q314515j0839886j1248465r451310
17812B4419011o810572m427114k834839j941970j344666r75611p03898m93142
17804D887199m11874l48705l28065k68405j84254j42437p6430K4269J06468O4934
$$ plain form
17873 209350 212828 203458 199078 229737 240416 249662 237316 243578 277869 294400 306636 321265
17861 321265 341242 364150 401059 438921 492964 584869 685032 773850 832501 847035 857585
17850 857585 863448 839004 848963 946369 1046089 1152801 1248926 1374538 1470988 1491260 1507668
17839 1507668 1500399 1504844 1503262 1566968 1748260 1975954 2263671 2631166 3015443 3513373 4207162
17828 4207162 5116705 6375447 8148443 10741943 14691255 20889207 30021196 41613757
17820 41613757 53505809 62258424 66612827 64273187 55958672 45118786 33870321 24419011
17812 24419011 17608439 13181325 10346486 8404516 7059850 6084239 5380341 4887199
17804 4887199 4475325 4126620 3798555 3530150 3345896 3203459 3127029 3151298 3257766 3322700
17794C322700O0757L6410m5589q8062n0734K9059R1348J85123K74501L52857M69221
17783D637591N47068O66503P80595J053797J430848K080677K992384M424221O835351
17774B5449035J0515952J4981382J8521165J8451608J4047375O170489l920556
17767A04216450j2956746j7556854j8054015j5443755j1367621p598365m948228
17760A6290866l291927k324951j711674j253969r58158p58244n97425m65968l60049
17751D568501l30572k97840j88876j11682o2819l7265m3910o3407j11925j72303
17741C147902j78977j19487j117P4229J31131J53712K05166J98362J91097K30258
17731D032276L49477N12325P67720J197715J849175K877814M531858O596249Q200683
$$ plain form
17794 3322700 3383457 3419867 3374278 3286216 3235482 3264541 3355889 3541012 3815513 4168370 4637591
17783 4637591 5184659 5851162 6631757 7685554 9116402 11197079 14189463 18613684 25449035
17774 25449035 35964987 50946369 69467534 87919142 101966517 108137006 104216450
17767 104216450 91259704 73702850 55648835 40205080 28837459 21239094 16290866
17760 16290866 12998939 10673988 8962314 7708345 6750187 5991943 5394518 4928550 4568501
17751 4568501 4237929 3940089 3751213 3639531 3576712 3539447 3495537 3432130 3320205 3147902
17741 3147902 2968925 2849438 2848321 2922550 3053681 3207393 3412559 3610921 3802018 4032276
17731 4032276 4381753 4894078 5661798 6859513 8708688 11586502 16118360 22714609 30915292
17722C0915292Q114281N747005K498725k416162o319137p877692p916745o418926
17714A6326641m584885k988814j952289j334984r72342p04068n34453m08833k75353
17705B570620k50948k02708j77249j36914r6059p6413n9239k3104j6081l1781
17695A500124m5492m6228p1493m3762q2491r0890n5643j6108k465k3054n4095
17684I68403q2131q3163q9200n6255l0559n5967l9492j9526j8703m7760o908J2765
17672D51504J3596p384K6508M1613M1500J2992o030K1591p785p548j4004q836
17660E57717M5190J6710J2399j5076j3441p467l621m8157l4205K7346O580m4658
17648D99317j5108o4628m9781m2768l9521o1939n7036l4457k0031j3220k3281
$$ plain form
17722 30915292 39029573 44776578 47275303 44859141 38540004 30662312 22745567 16326641
17714 16326641 11741756 8752942 6800653 5465669 4493327 3789259 3254806 2845973 2570620
17705 2570620 2319672 2116964 1939715 1802801 1706742 1630329 1571090 1547986 1531905 1500124
17695 1500124 1454632 1408404 1336911 1293149 1210658 1119768 1064125 1048017 1045552 1022498 968403
17684 968403 886272 803109 713909 657654 627095 571128 531636 512110 493407 445647 438739 451504
17672 451504 465100 457716 484224 525837 567337 580329 574299 595890 588105 580557 566553 557717
17660 557717 602907 619617 632016 616940 603499 596032 592411 544254 510049 537395 543975 499317
17648 499317 484209 419581 369800 327032 287511 225572 168536 134079 114048 100828 77547
17637G7547L9811K3987N698P826k149n980R590J191l5401j1799J3469K7228K2251
17624A73269K7080J4878K2606J5711R596j5330j5876N537M8622L1001J2993m351
17612C25736j7137l6307j0770j5967M766k1234j1449K7490p275P097q441l0720
17600B05789m6673l4801l1373j0920l680j6603l3450k0855m5453j5895r873m069
17588f7856K0159l20K1522M1557O930J0495J0001k1858j4020L6087J9915O669
17576F9281N654K2941k1664j7158K2326K3654o934k1763J8537N306r153J4946
17564A05973j5448m945j6413p013K4262O789l3781p702J2752L82o815l309j1759
17551D2973J711r378K974J0856p694k8474M780M0629K1494M138j7240l0382N082
$$ plain form
17637 77547 117358 141345 147043 154869 152720 146740 156330 157521 122120 110321 123790 151018 173269
17624 173269 200349 215227 237833 253544 263140 247810 231934 237471 286093 317094 330087 325736
17612 325736 308599 272292 261522 245555 250321 229087 217638 245128 237853 244950 236509 205789
17600 205789 159116 124315 92942 82022 78342 61739 28289 7434 -38019 -53914 -63787 -67856
17588 -67856 -47697 -48017 -26495 15062 21992 32487 42488 20630 6610 42697 62612 69281
17576 69281 74935 97876 76212 59054 81380 105034 98100 76337 94874 100180 91027 105973
17564 105973 90525 85580 69167 62154 86416 93205 59424 51722 64474 64856 58041 54732 42973
17551 42973 44684 35306 38280 49136 41442 12968 17748 58377 79871 84009 66769 36387 41469
17538D1469p695m7398K187j958j6942J6769K0381K8445R508J2390N568j7945j246
17525D3533j7218K469N134J720R576j8230m046M676M259K8473L008m4912j3429
17512E013L544r990N085L0503r215j0638o076j5973J0299N578J6389j4646j3682
17499c809j1327N63J5570J2257j8193l888L6826j0428k629p527l0393j0205J2114
17486b1069k6188o465r227L3340K6289K0617J451l440J6426N399q69l5616k0919
17473b0271Q182j1169J5526M5061Q650J2527l2682p657j6086k7565M879L8605
17461A8000Q85p89j5457Q669o255J225k931m644k628k51J3947K5005o158r235
17447A9383J2000K8004K9027P7259J04325O695l3624o0544n2716l8333m0079j7276
$$ plain form
17538 41469 33774 -13624 -11437 -13395 -30337 -13568 6813 35258 44766 57156 62724 44779 43533
17525 43533 26315 28784 33918 35638 45214 26984 22938 27614 31873 60346 63354 18442 5013
17512 5013 8557 -1433 3652 34155 24940 14302 8226 -7747 2552 8130 24519 9873 -3809
17499 -3809 -15136 -14573 997 13254 -4939 -8827 27999 17571 14942 7415 -22978 -33183 -21069
17486 -21069 -47257 -53722 -62949 -29609 -3320 17297 18748 15308 31734 37133 36264 648 -20271
17473 -20271 -12089 -23258 -7732 37329 45979 58506 25824 18167 2081 -25484 -20605 18000
17461 18000 18885 18096 2639 11308 5053 6278 3347 -1297 -3925 -4176 9771 34776 28618 19383
17447 19383 31383 59387 88414 165673 269998 276693 243069 182525 129809 91476 51397 34121
17435C4121J1954j5715r908r656q747J3913p349j8079K2729L1639l178j0500J8932
17422E0156N503K735K6532K833l158m866j3499m833J6078J3359j0581J443O519
17409H8221l266L675j7181q190K4641o56k2453k7193k0455j0507j2967r04K0012
17396A2777n432K1835J5272p502j1185k70M1833K3270k8849L836M3644J4151q65
17383A22515j0811L777j3882j0691k7381k866J5734Q310j60k3611j5564j6183
17371B9187j8322J0349k1925k2116J875l471M4145j4706j3951p318p626j0245
17359c4124M2366J9614K7220j554m0822P392N574j4369Q394o542J624M580l4450
17346a5097k3858k2138o762L0361L0809n700L2998k8482n0817l133N420j111K1937
$$ plain form
17435 34121 46075 30360 20452 10796 2049 15962 8613 -9466 13263 44902 41724 31224 50156
17422 50156 55659 58394 84926 87759 84601 79735 66236 61403 77481 90840 80259 81702 88221
17409 88221 84955 88630 71449 63259 87900 87244 64791 37598 17143 6636 -6331 -7235 12777
17396 12777 7345 29180 44452 36950 25765 25495 67328 90598 61749 65585 109229 123380 122515
17383 122515 111704 115481 101599 90908 63527 60661 76395 84705 84545 60934 45370 29187
17371 29187 10865 21214 -711 -22827 -20952 -24423 19722 5016 -8935 -16253 -23879 -34124
17359 -34124 8242 27856 55076 53522 12700 20092 25666 11297 19691 13149 14773 19353 -15097
17346 -15097 -38955 -61093 -67855 -37494 -6685 -12385 20613 -7869 -58686 -61819 -56399 -57510 -35573
17333c5573M4440J6798k2155P639J5393Q828m410J2276O283j5211k5127l5689
17321b6508Q940o858K059L0694q602m787N9J068L4124J6213M0517L8608M7853
17308A73380M8622M1694J9307j4951l5169l1335n8650l7764J04k6218l5432J637
17296D5225m7044q753K0803q842J4848R562j3830l1243j4413j3738K136L3327
17284a1962K3575P848J9011J0218k5464n0572j6300L9988J326J5020J6567k3455
17272E800o068m506k405m908o558K4829M0728J1966K1442M3784K3793N9259R8447
17259C05603R4158O2179L9034l072m4526p7396r4243q2854o6311m0750k2569J668
17247G0921L752r799l2437m2908j0972k4825J0052l85J655K1399r930J1407r73
$$ plain form
17333 -35573 8867 25665 3510 11149 26542 35370 30960 43236 49519 34308 9181 -26508
17321 -26508 -17568 -24426 -22367 8327 -275 -5062 -5003 -3935 30189 46402 86919 125527 173380
17308 173380 222002 263696 283003 268052 232883 201548 142898 105134 105238 79020 43588 45225
17296 45225 -1819 -10572 10231 1389 16237 25799 11969 -19274 -33687 -47425 -45289 -11962
17284 -11962 11613 19461 38472 48690 23226 -27346 -43646 -3658 -2332 12688 29255 5800
17272 5800 -268 -4774 -7179 -12087 -18645 6184 46912 58878 80320 124104 147897 207156 305603
17259 305603 399761 461940 500974 497902 453376 375980 281737 198883 132572 91822 69253 70921
17247 70921 74673 64874 32437 -10471 -21443 -46268 -36216 -36601 -34946 -13547 -23477 -12070 -13043
17234a3043P819J1049q92M418J8138P181J2819l0268k2274P673p164l3761k991
17221d1296l220j7962J3033J2719l75q324L5232J9066J7080M1077N0319M1369
17209A58718M9788N2849m632l2755p5168m6820l3393k2304l6272l0615L358J108
17197a6138N914o804k3966Q074J832p788K2236K1205k4835J459k3797j3089K2958
17184c2739K688J7245m86o823m174r355n490K4166L4304j2013o184k7014k3708
17171d9583N401M572L3274L805q857q695n237J5420J3992q316p171K5993n081
17158I517Q038J2051l1117r666j3367l555J0578o768q441J3144K8352J0062k6107
17145g279k5915R790Q658J8310p77Q255j5312m2709k3823J4079J9424l810k5697
$$ plain form
17234 -13043 -5224 5825 4933 9351 27489 34670 47489 17221 -5053 2620 -4544 -38305 -41296
17221 -41296 -44516 -62478 -49445 -36726 -37101 -45425 -10193 8873 25953 67030 117349 158718
17209 158718 208506 261355 256723 223968 148800 101980 68587 46283 10011 -20604 -17246 -16138
17197 -16138 -10224 -17028 -40994 -32920 -31088 -38876 -16640 4565 -20270 -18811 -42608 -55697 -32739
17184 -32739 -30051 -12806 -13292 -20115 -24289 -33644 -39134 -14968 19336 7323 1139 -25875 -49583
17171 -49583 -44182 -39610 -6336 -2531 -11388 -20083 -25320 -9900 4092 -4224 -11395 14598 9517
17158 9517 17555 29606 -1511 -11177 -24544 -28099 -17521 -24289 -32730 -19586 8766 18828 -7279
17145 -7279 -33194 -23404 -14746 3564 2787 11042 -4270 -46979 -70802 -56723 -37299 -41109 -66806
17132f6806J6765J5248Q449k505o84J9174J3379j1629j1453m015K6277r595J449
17119e946J790j355j2393k3112j0741L5729K6058L356R52l0380R188r724P460
17106i118J273L003j0584Q346k5255L098M892j0050J516n046j19o489J7879r173
17092c5827j0249J4085p562J0242j2306j6176j901J1769K4533R352j6303j1221
17080d1564J5625J4670k5524m627J9902J6119J8767R14l490J3042m64l8954l7721
17067e3305k3733J7710K3141K7732q321j5113J5416r665j0094Q188l826k8594
17055f0464M550L1737K2908K0671j0171m508Q224n478j8941j95O256J420k854
17042f845J0027o116l236Q748l070m108k9013j7247K5902J1064m432p0p539J3049
$$ plain form
17132 -66806 -50041 -34793 -26344 -28849 -29533 -10359 3020 -8609 -20062 -24077 2200 -7395 -5946
17119 -5946 -4156 -5511 -17904 -41016 -51757 -16028 10030 13386 14338 -16042 -6854 -16578 -9118
17106 -9118 -7845 -4842 -15426 -7080 -32335 -29237 -24345 -34395 -32879 -37925 -38044 -44533 -26654 -35827
17092 -35827 -46076 -31991 -39553 -29311 -41617 -57793 -59694 -47925 -23392 -14040 -30343 -41564
17080 -41564 -25939 -11269 -36793 -41420 -21518 -5399 13368 14282 10792 23834 23370 -15584 -53305
17067 -53305 -77038 -59328 -36187 -8455 -16776 -31889 -16473 -26138 -36232 -28044 -31870 -60464
17055 -60464 -55914 -24177 -1269 19402 9231 4723 12947 7469 -11472 -11667 -5411 -3991 -6845
17042 -6845 3182 -2934 -6170 2578 -492 -4600 -33613 -50860 -24958 -13894 -18326 -18396 -25935 -12886
17028a2886n232l180J6884K4693j157k6123K145q89P759o579j9968J7298m82l514
17014a1231Q824j0010k2617j8171P429K0543Q538N908n650k3742j3817R228J9449
17001b5319m064J1156Q314K3035n818J4054k5226m2404l2974J3525K0362J3455
16989c1904J7126p75l0327j7647m941L5523J15j9775K923K0981Q201n756o452
16976c2708k0164k3848J6852L199J9326J2278J2506j656P628N299j5742k1163
16964c8193o619J8943k3382j7368j0723K3577N460L2630J8430R021M586k0067
16952c705k3625K8361q435m406P212L5924J2528k4932l9240r254J5110j3556o982
16939c5000j433J4813R884m1358L0280L174k6506j9701Q080L2985J7921r586K9685
$$ plain form
17028 -12886 -18118 -21298 -4414 20279 19122 -7001 -4856 -5745 2014 -4565 -24533 -7235 -7717 -11231
17014 -11231 -2407 -12417 -35034 -53205 -45776 -25233 -16695 -10787 -16437 -40179 -53996 -44768 -25319
17001 -25319 -29383 -18227 -9913 13122 7304 21358 -3868 -46272 -79246 -65721 -45359 -31904
16989 -31904 -14778 -15553 -45880 -63527 -68468 -32945 -32830 -52605 -49682 -28701 -20500 -26256 -32708
16976 -32708 -52872 -76720 -59868 -56669 -37343 -25065 -12559 -14215 -6587 -1288 -17030 -38193
16964 -38193 -44812 -25869 -49251 -66619 -77342 -53765 -48305 -15675 2755 11776 16362 -3705
16952 -3705 -27330 1031 -7404 -11810 -4598 31326 43854 18922 -20318 -29572 -14462 -28018 -35000
16939 -35000 -36433 -21620 -11736 -53094 -22814 -19640 -46146 -65847 -57767 -24782 -6861 -16447 13238
16926A3238o88k891j6018R700o627K734k480K8221j095j6492l315J6995q908k0737
16912h363L210P490k0901j2505j9257J5669L0006K4781k7523l1883O644K1396
16900a1236J192j6848K1587K7321j7337k1574j2460N02l359k918N368K1266Q991
16887D95K314L740M677J4669O608j0912j1691l6058j1249J0362Q664j1792J530
16874b8643j4965L423M54P647m36K8405q295j3490j7376j1067j4326J8714K0879
16861b9076O106k1653q09l571J6959L0028J2158k0460k51k8952k8689o116J4433
16848e9893K7309k1970k6462K6326J7283J2380j1092k3005J5931J324K311J9372
16836b0186k7956j8922k63K6942K0069k2674k5300j4971L9030K2468k421L643
$$ plain form
16926 13238 12550 9659 -6359 3341 -3286 -552 -3032 25189 24094 7602 4287 21282 12374 -8363
16912 -8363 -5153 2337 -18564 -31069 -50326 -34657 -4651 20130 -7393 -39276 -32632 -11236
16900 -11236 -10044 -26892 -5305 22016 4679 -16895 -29355 -28853 -32212 -35130 -29762 -8496 495
16887 495 2809 6549 11226 25895 32503 21591 9900 -26158 -37407 -27045 -18381 -30173 -28643
16874 -28643 -43608 -40185 -39731 -32084 -32520 -4115 -12410 -25900 -43276 -54343 -68669 -49955 -29076
16861 -29076 -22970 -44623 -45432 -49003 -32044 -2016 10142 -10318 -10569 -39521 -68210 -74326 -59893
16848 -59893 -32584 -54554 -81016 -54690 -37407 -25027 -36119 -59124 -43193 -41869 -39558 -20186
16836 -20186 -48142 -67064 -67327 -40385 -20316 -42990 -68290 -83261 -44231 -21763 -24184 -20541
16824b0541K459j1687o315j0900q12J5976K8441M911K439j5471m1465l523J7495
16811c8993L652L038O902K2097J1495j9303r406P740n33o696j0637j6388K641
16798d4391K9773J8151j2332m6372j3532Q299N532L6921J9424j29l2375J900k709
16785c1840R105j0287j9468j5840Q392K3503K1668l819j2504M873J0216j814j0980
16772b8795k7103k5760K421K5322L8098K5683Q043p828j030k8687k0323L008P902
16759b9049k0095j9353L1439K4847O69k4283J8091K375P183M364q005K5426P286
16746B0895k3349j7390O329k620l485j5272p346K7020J3210j595j859K543k254
16733e173K406o632j2682p394K5045r274m249N0022Q916j2533l010j0609q157
$$ plain form
16824 -20541 -18082 -29769 -36084 -46984 -47796 -31820 -3379 1532 3971 -11500 -52965 -56488 -38993
16811 -38993 -35341 -32303 -25401 -3304 8191 -11112 -20518 -12778 -13311 -20007 -30644 -47032 -44391
16798 -44391 -14618 3533 -8799 -55171 -68703 -60404 -54872 -17951 1473 1344 -31031 -29131 -31840
16785 -31840 -22735 -33022 -52490 -68330 -59938 -36435 -14767 -18586 -31090 -26217 -16001 -17815 -28795
16772 -28795 -55898 -81658 -79237 -53915 -15817 9866 17909 10081 9051 -19636 -39959 -36951 -29049
16759 -29049 -49144 -68497 -37058 -12211 -11542 -35825 -17734 -15359 -8176 -3812 -11817 13609 20895
16746 20895 -2454 -19844 -13515 -16135 -19620 -34892 -42238 -15218 -2008 -3603 -5462 -2919 -5173
16733 -5173 -2767 -9399 -22081 -29475 -4430 -13704 -17953 32069 40985 28452 25442 14833 6676
16720F676l694j7525l986q882j1340J2510J4926j3386o545N52p986j2967Q153
16707d3494m152o38J6663r886J3722L058J0217J3445k363r415K226k7911O894
16694c1634K0364K1173M263j2411J0081k6625k2488j2927K32p886J321j861j4970
16681g3368n181m199R721M8678N6q15j510j0294J9013j1613L131J0683J9034l483
16667a47R517K512j4737l6858k1863L4478K7666R561J527k4348k8840j3663J7732
16654c7463K2651J614j7916l564j1138J6051J8710k687n289P074K0651R414m2291
16641b4183j8825J4731L1095J39m5336J0456M34o833j9284R706J7322l5593j5175
16628h1346J6511J4617K4201L800n712Q399q348j1335L780m189k9850K876L4241
$$ plain form
16720 6676 2982 -14543 -18529 -27411 -38751 -26241 -11315 -24701 -31246 -30694 -38680 -51647 -43494
16707 -43494 -47646 -48284 -31621 -41507 -27785 -24727 -14510 -1065 -3428 -12843 -10617 -38528 -31634
16694 -31634 -11270 9903 14166 1755 11836 -14789 -37277 -50204 -49972 -57858 -56537 -58398 -73368
16681 -73368 -78549 -82748 -73027 -24349 -24293 -25108 -26618 -36912 -17899 -29512 -26381 -15698 3336 -147
16667 -147 9370 11882 -2855 -39713 -61576 -27098 568 10129 11656 -12692 -41532 -55195 -37463
16654 -37463 -14812 -13198 -31114 -34678 -45816 -29765 -11055 -13742 -19031 -11957 8694 18108 -24183
16641 -24183 -43008 -28277 2818 2957 -42379 -31923 -31489 -38322 -57606 -47900 -30578 -66171 -81346
16628 -81346 -64835 -50218 -26017 -22217 -27929 -19530 -27878 -39213 -35433 -39622 -69472 -66596 -32355
16615c2355k941p653l393K6470j704l8830p831J5968j3354j1049L1230j1267l0941
16602h7650P580L1426J3598j9833k9470J6636K5010M090j7759M0230o4N733j9333
16589b9806k0457K0868M6866o457j7597k6401j0537o155J4206J5968Q430r547
16577b0619J428J380m551J0678k6035m477J3915j8662k0055J9602P273o331K8836
16564a7618q638k75K4459J9905k103l1466k6509O233K1319J092J357J6354J3022
16551A7132J0708k5961k4727K19q426k3797j0514J9734l955P417J3872J1237J7788
16538G27P136j2218l327K073J4158j568p608p236r238J1697J6284j7319k6127
16525c2566k1944p074p379l2926J2368K8820R809N014n257J3422J0242l406Q666
$$ plain form
16615 -32355 -35296 -42949 -46342 -19872 -21576 -60406 -68237 -52269 -65623 -76672 -45442 -56709 -87650
16602 -87650 -80070 -48644 -35046 -54879 -84349 -67713 -42703 -38613 -56372 -16142 -16206 -10473 -29806
16589 -29806 -50263 -29395 17471 11014 -6583 -32984 -43521 -49676 -35470 -19502 -11072 -20619
16577 -20619 -19191 -17811 -22362 -11684 -37719 -42196 -28281 -46943 -66998 -47396 -40123 -46454 -17618
16564 -17618 -26256 -26531 -2072 17833 15730 -15736 -42245 -36012 -14693 -13601 -12244 4110 17132
16551 17132 27840 1879 -22848 -22629 -31055 -54852 -65366 -45632 -49587 -42170 -28298 -17061 727
16538 727 7863 -4355 -7682 -5609 8549 6981 -627 -7863 -17101 -5404 10880 -6439 -32566
16525 -32566 -54510 -61584 -68963 -101889 -89521 -60701 -50892 -45878 -51135 -37713 -27471 -30877 -22211
16512b2211j3171O76l0103j6892J2282J5447J101o568l844j751K1808P579K1600
16499a4047J145j6633p610j4246j6536J9753J206J6976J7554J011j7187o84P632
16486b1666j7221J6145L2824M043k2261o797K1565r52m3333L887R873j296m736
16473b9925Q929K8595q538k0934j7109n194k7100Q26K9263K6905K721j0025m3301
16460f4887O672J6798J5115J0621k1290n810J0224L680K245q825P794M268J718
16447b1677p654o375K4750K8995r167k5430j1085r761M660N706J2369L59j0977
16434b5287j9880k9191J9490K0412m234k1512J2465J6616J628N987J1680J2118
16422B92j9096k5350J2020J6464N314k635k3048M12R104m653j5467p079K6357
$$ plain form
16512 -22211 -35382 -34706 -64809 -81701 -69419 -53972 -52871 -59439 -63283 -65034 -43226 -35647 -14047
16499 -14047 -12902 -29535 -37145 -51391 -67927 -48174 -46968 -29992 -12438 -11427 -28614 -29298 -21666
16486 -21666 -38887 -22742 10082 14125 -8136 -14933 6632 5680 -37653 -33766 -23893 -25189 -29925
16473 -29925 -20996 7599 -939 -21873 -38982 -44176 -71276 -70450 -41187 -14282 -11561 -21586 -64887
16460 -64887 -58215 -41417 -26302 -15681 -36971 -42781 -32557 -28877 -26632 -35457 -27663 -23395 -21677
16447 -21677 -29331 -35706 -10956 18039 8872 -16558 -27643 -37404 -32744 -27038 -14669 -14310 -25287
16434 -25287 -45167 -74358 -54868 -34456 -38690 -60202 -47737 -31121 -29493 -23506 -11826 292
16422 292 -18804 -44154 -32134 -15670 -10356 -12991 -36039 -35627 -26523 -31176 -46643 -53722 -27365
16409b7365k55J1815J0967k7j9870p406M457K6689L025n434j7642j0677j1827
16396d3550p700M140Q202n710J9414k135j1358J238J8286j4328j1203o478M322
16383d6860J5364K0160L7280j3023j1944L705j0945k9142j4357n288J4915J0080
16371c0055q399K43J9995L3533L85L509j4687r165q913J0511r326j6754N631j4960
16357c8452J4654N3312m8762j5229l412L324K131Q378r005j0692M095K5332M008
16344a0318L1456M4911m7965l0120M89j0328J8130J8270J4419j4998k5478j7054
16332b8586Q820J3704j1379j7878J7972J191m423m364K5019O764o888q933n261
16319a4242p819K6761M889k9433K1944J2936K657j1086j2467K7590j6272k2194
$$ plain form
16409 -27365 -27620 -15805 -4838 -4865 -24735 -32141 -27684 -995 2030 -3404 -21046 -31723 -43550
16396 -43550 -51250 -47110 -38908 -44618 -25204 -27339 -38697 -37459 -19173 -33501 -44704 -51182 -46860
16383 -46860 -31496 -11336 25944 12921 977 4682 -6263 -35405 -49762 -55050 -40135 -30055
16371 -30055 -38454 -38211 -18216 15317 15702 19211 4524 -4641 -13554 -3043 -12369 -29123 -23492 -38452
16357 -38452 -23798 29514 -19248 -34477 -37889 -34565 -32434 -24056 -33061 -43753 -39658 -14326 -10318
16344 -10318 21138 66049 18084 -12036 -11547 -21875 -3745 14525 28944 13946 -11532 -28586
16332 -28586 -19766 -6062 -17441 -35319 -17347 -16156 -20579 -24943 76 6840 -48 -8981 -14242
16319 -14242 -22061 4700 9589 -19844 2100 15036 17693 6607 -5860 21730 5458 -16736
16307a6736n756O17k0200K025J4467R717l653J0824K6819J0518k8012J1006j2507
16294h71k1285l728J7281J7161j5203n700m3687j3606K0060J8343j0534K3624
16282a8145K1133l769j3135N620k2001Q522O935k8370k664O22K4101K391j937
16269b0697J957M366p690J804Q328J4401p206k8548J669K9523k645K565j755j8471
16255b2399L521k0466k7066J3747K1599n59q862j7538J8442m524j253k4177j7040
16242h6575K5998J2487L4830L066j6727q832l3837J4774K9414l012j8093K2081
16230b4426J9279l092j1700k2870j7543j0016l727L0257M3283r384l202N950O052
16217a139J1178R751k0301l5146k2696K3708J5409r128p378P994l8792J7613Q279
$$ plain form
16307 -16736 -22492 -21875 -42075 -40050 -25583 -15866 -19519 -8695 18124 28642 630 11636 -871
16294 -871 -22156 -25884 -8603 8558 -6645 -12345 -56032 -69638 -49578 -31235 -41769 -18145
16282 -18145 2988 -781 -13916 -8296 -30297 -21775 -14840 -43210 -45874 -45252 -21151 -18760 -20697
16269 -20697 -18740 -14374 -22064 -20260 -11932 2469 -4737 -33285 -31616 -2093 -4738 -2173 -3928 -22399
16255 -22399 -18878 -39344 -66410 -52663 -31064 -31623 -40485 -58023 -39581 -44105 -45358 -69535 -86575
16242 -86575 -60577 -48090 -13260 -10194 -26921 -35753 -69590 -54816 -25402 -28414 -46507 -24426
16230 -24426 -5147 -8239 -19939 -42809 -60352 -70368 -74095 -43838 -555 -9939 -13141 -7191 -1139
16217 -1139 10039 19790 -511 -35657 -58353 -34645 -19236 -28364 -35742 -27748 -66540 -48927 -40648
16204d0648k9798j9984L3714P687J6281n282P16Q828j6801L9984L088k6791M0283
16191A1277r866p694j1473j156P922j0806L617O664j8894k4959J40J8129j574
16178c8673k1851k190J4375J6654O223L117j6647J9050L6444O85m60L488j0808
16165I407m0524p133l242P834K1468n194Q610J4698n8L2419m616m0769j6842J8005
16151e937p747N016k3247j7917L419K8571N194n165K455r283K1329P949P084o956
16137D765J7139M354M618k0693p413k6969j7815J5660K8889K0392L6756k9245
16125C0438j777J8695j1856m6950j8606J9046J7636N19j4836J5958K879k0386
16113i240j6454k0437p600j5050J283L1467L6505r701J2062l058l1260j4192R060
$$ plain form
16204 -40648 -70446 -90430 -56716 -49029 -32748 -38030 -37314 -28486 -45287 -5303 -2215 -29006 11277
16191 11277 1411 -6283 -17756 -18912 -10990 -21796 -18179 -11515 -30409 -55368 -55228 -37099 -38673
16178 -38673 -60524 -62714 -48339 -31685 -25462 -22345 -38992 -19942 16502 17187 16727 20215 9407
16165 9407 -31117 -38250 -41492 -33658 -12190 -17384 -8774 5924 5866 38285 33669 -7100 -23942 -5937
16151 -5937 -13684 -8668 -31915 -49832 -46413 -17842 -12648 -17813 -15358 -24641 -3312 4637 11721 4765
16137 4765 21904 26258 30876 10183 2770 -24199 -42014 -26354 2535 22927 59683 30438
16125 30438 28661 47356 35500 -11450 -30056 -11010 6626 7145 -7691 8267 11146 -9240
16113 -9240 -25694 -46131 -53731 -68781 -67498 -36031 474 -9227 2835 -223 -31483 -45675 -36615
16100c6615k9220M2438J6003j2336j6062q681K3725K7757r913j1697j3145Q929
16088a8817N372k4969l738M6923q03L89q142j3743j956r795J6926N174M71k7394
16074c4102j7432J2363p963l1610P794M8206K3779J913j1235j4834j1698K0272
16062a4547R593j7184Q526K2808K1377j7690k7580J8632k734J1946n260j305J1647
16049A8229O344m336L3076L038l3829j1659J5672J3509K03J639k0217M363J0807
16036C6839j3776m7599l3601K7895P119J1736k6814j3329K3593K7419J1982j519
16024I945l7984k7809J5937n791r695M104R447k2100J996l453J9729J9790k0763
16011d6647j3403L0947M17o634j1020o02R22r501o147l514J4703K0728J6313N987
$$ plain form
16100 -36615 -65835 -23397 -7394 -19730 -35792 -44473 -20748 7009 -2904 -14601 -27746 -18817
16088 -18817 -13445 -38414 -42152 4771 3968 4357 -3785 -17528 -19484 -29279 -12353 -7179 -6708 -34102
16074 -34102 -51534 -39171 -47134 -78744 -70950 -22744 1035 2948 -8287 -23121 -34819 -14547
16062 -14547 -4954 -22138 -13612 9196 30573 12883 -14697 3935 1201 13147 7887 6582 18229
16049 18229 24573 20237 53313 56351 22522 10863 26535 40044 40247 41886 21669 26032 36839
16036 36839 23063 -24536 -58137 -30242 -23123 -11387 -38201 -51530 -27937 -518 11464 9945
16024 9945 -28039 -55848 -39911 -45702 -55397 -51293 -41846 -63946 -61950 -65403 -45674 -25884 -46647
16011 -46647 -60050 -29103 -28686 -35320 -46340 -46942 -46020 -55521 -61668 -65182 -50479 -29751 -13438 -7451
15997g451j2543r016K997M122J2034J147R025r612j0553J1642Q889l0376J2296
15984a7399k383j346L4432o61k1914j7904J1467J9676k205o07L477L920J5485
15971B4038n241L110j8632P089l296l149J8621J732J7338j3344j3942K8659O743
15958D9726Q132J0570l3844j2289L029j99j7890r552j529P117j1266m2069j5827
15945f5891K5234L0732L982j1677n028j2509J5289k478l0884j811j123j0882k620
15932f9666K4945R647K1970L842l387k3630j336K8359R863O119o937k458L015
15919C46O43J400K2564N793k2972n094N039O476k576P996l520k4453j3865j417
15905b3640k1213R027l027R074j6019l975L424L747J3868k5435O38J9096J1799
$$ plain form
15997 -7451 -19994 -29010 -26013 -21891 -9857 -8710 315 -9297 -19850 -8208 681 -29695 -17399
15984 -17399 -19782 -21128 13304 12643 -9271 -27175 -15708 3968 1763 1156 4633 8553 24038
15971 24038 18797 21907 3275 10364 7068 3919 22540 24272 41610 28266 14324 42983 49726
15958 49726 57858 68428 34584 22295 25324 25125 7235 -2317 -3846 3271 -7995 -50064 -65891
15945 -65891 -40657 -9925 -5943 -17620 -22648 -35157 -19868 -22346 -53230 -55041 -56164 -67046 -69666
15932 -69666 -44721 -35074 -13104 -9262 -12649 -36279 -37615 -9256 607 6726 -211 -2669 346
15919 346 989 2389 24953 30746 7774 2680 7719 14195 11619 19615 16095 -8358 -22223 -23640
15905 -23640 -44853 -35826 -38853 -29779 -45798 -49773 -46349 -42602 -28734 -54169 -53531 -34435 -22636
15892b2636o275K5033k110n313q418k642J978o257j8485o833j922q021j1301K0620
15878e2582R564J0107K4059K8467J881k3587j0652j6086K0781n179k1720n193
15866d0140J5172k1179k7620K0124P813K8612L0575J8392m9798j1737j1097R32
15854c9951k0626K4974K8327j3522j2386j497J3323K1904J8417j9349l0261q822
15842c9469Q958k1355j4329J4851n320L9106M1569j4940l3485N196M2964J8773
15830D2519j9357j1486M598P723l772O146K4057k4758j9555j963j2399M372J136
15817b739p170J4241j972J0247J5680l7021k9165K6720K9846J8202j6682j0003
15805A0184j760j9925j4443n635k469R862j0779J5457J2904L0058L0599r055K760
$$ plain form
15892 -22636 -28911 -3878 -5988 -11301 -19719 -22361 -20383 -26640 -45125 -51958 -53880 -61901 -73202 -52582
15878 -52582 -43018 -32911 -8852 19615 21496 -2091 -12743 -28829 -8048 -13227 -34947 -40140
15866 -40140 -24968 -46147 -73767 -53643 -45830 -17218 13357 31749 -18049 -29786 -40883 -39951
15854 -39951 -60577 -35603 -7276 -20798 -33184 -34681 -21358 546 18963 -386 -30647 -39469
15842 -39469 -30511 -51866 -66195 -51344 -56664 -17558 24011 9071 -24414 -19218 23746 42519
15830 42519 23162 11676 16274 23997 20225 26371 50428 25670 6115 4152 -8247 -3875 -2739
15817 -2739 -9909 4332 2360 12607 28287 -8734 -37899 -11179 18667 36869 20187 10184
15805 10184 8424 -11501 -25944 -31579 -34048 -24186 -34965 -19508 -6604 23454 54053 44998 47758
15792D7758m3861j7016J8086R542l0540O882J7318M68q579J8708r246l0749j9624
15779d0853m248j0780J5190K8516R839K0331K4660J4422j3030m80j9080k0294
15767D193J7671j4954l450J779l657J851R565l99r209R056j1031o905j5998j5864
15753c7352m970o369J0144L487J2262N120M921o574j0866R91L539k5347j7627
15740f8641P645J4872N136R125j3978j4785J2287q033J2314R712L2157Q901l97
15727F315m149R091J728l4555k3072J0410r470J0799M021j4532L5716m400J2938
15714H40J1466m093o169j6243K18Q118m977J2553O445m1489n686K6048j7133p853
15700c7955N365P681K845o092k564P969K2642J1137J540O344j5061k4065j0660
$$ plain form
15792 47758 3897 -13119 4967 14509 -16031 -9149 8169 8637 58 18766 9520 -21229 -40853
15779 -40853 -45101 -55881 -40691 -12175 -2336 17995 42655 57077 44047 43567 24487 4193
15767 4193 21864 6910 3460 5239 1582 3433 12998 12599 3390 12446 1415 -5490 -21488 -37352
15753 -37352 -42322 -48691 -38547 -35060 -22798 -17678 -12757 -19331 -30197 -29206 -25667 -51014 -68641
15740 -68641 -60996 -46124 -40988 -31863 -45841 -60626 -48339 -56372 -44058 -34346 -2189 6712 6315
15727 6315 2166 11257 12985 -21570 -44642 -34232 -43702 -32903 -28882 -43414 -7698 -12098 840
15714 840 12306 8213 2044 -14199 -13981 -5863 -10840 1713 8158 -33331 -39017 -12969 -30102 -37955
15700 -37955 -32590 -24909 -22064 -28156 -30720 -22751 -109 11028 12568 18912 3851 -20214 -30874
15687c0874K6782J293m0114j8620K3369J7464j2868K6839J546K7497L7594J012
15675F0920m1133k0924m0251k3616o124L1856k0998J0496K5141J8615o099k0029
15663c2146j1673J9222J5887m046k5026k9931K4599L0926k2400k0061L0323m768
15651b9094J030J1234M91o2655m1513K4243L3506L3943J4486J7663K14o20M257
15638G185k7350o830o121l4919J1175L9450L3593R702l2467j2413K4402j969J818
15625E256m024q361K592K9574j6193j1404j9164j8917l4808j007M638j0162N478
15612g6502O749J5725L1995L2825L3488J9228j629j2380m1653n963K1969J9078
15600D2930N50j0939j5572K2744j2791n759J550m013k2448J0085N949m4676k1121
$$ plain form
15687 -30874 -4092 -2799 -42913 -61533 -38164 -20700 -33568 -6729 -5183 22314 59908 60920
15675 60920 19787 -1137 -41388 -65004 -71128 -39272 -60270 -49774 -24633 -6018 -12117 -32146
15663 -32146 -43819 -24597 -8710 -12756 -37782 -67713 -43114 -12188 -34588 -54649 -24326 -29094
15651 -29094 -28064 -16830 -16339 -78994 -120507 -96264 -62758 -28815 -14329 3334 3548 2928 7185
15638 7185 -20165 -26995 -33116 -68035 -56860 -17410 16183 25885 -6582 -18995 5407 3438 5256
15625 5256 1232 -7129 -4537 25037 8844 -2560 -21724 -40641 -75449 -76456 -71818 -81980 -76502
15612 -76502 -69753 -54028 -22033 10792 44280 63508 61879 49499 7846 1883 23852 42930
15600 42930 43480 32541 16969 39713 26922 21163 22713 18700 -3748 6337 12286 -32390 -53511
15587e3511k2980j7333K5766L5503J3692k562J5674R043l2565R692m779Q778J0826
15574d756k975L0225o238l2395l547L9J1612L597j2900K474j00k0282l0345J8981
15560d6610J9611J8199J785N168Q993K2701j9779m732m2974j9402q417O220J3994
15547d5243J9543n044l905l179j2523J0211J5715J1587l03l5457K945Q992R973
15534b6688M66J2177r961l515J4062J5648r17J1297J7807m83k9966m2651l989
15521d6713J2878r138j6535L2044L7162r994k0597k6146j2173J8851J5741N899
15509a8721p286r848q386p46K2480M024K4522R411n874L461J0919q986j3617J5339
15495A6692j609L728p027j9634Q749K8140n924J2700l0975l5418q758j1144J1125
$$ plain form
15587 -53511 -76491 -93824 -68058 -32555 -18863 -21425 -5751 3292 -29273 -19581 -24360 -15582 -4756
15574 -4756 -7731 22494 16256 -16139 -19686 -19647 -8035 -4438 -17338 -14864 -14964 -35246 -65591 -46610
15560 -46610 -26999 -8800 -7015 -1847 7146 29847 10068 5336 -37638 -57040 -65457 -59237 -45243
15547 -45243 -25700 -30744 -34649 -37828 -50351 -40140 -24425 -12838 -13141 -48598 -45653 -36661 -26688
15534 -26688 -26222 -14045 -24006 -27521 -13459 2189 1272 12569 30376 29893 -73 -42724 -46713
15521 -46713 -33835 -42973 -59508 -27464 9698 -296 -20893 -47039 -59212 -40361 -24620 -18721
15509 -18721 -26007 -35855 -44241 -44987 -22507 -18483 6039 15450 9576 13037 23956 14970 1353 16692
15495 16692 15083 18811 11784 -7850 899 29039 23115 35815 4840 -30578 -39336 -50480 -39355
15482c9355q700n556o221j4702L0133K5191q80q947j46j1820n19R976j5710R599
15468c7657L0604m456MQ387J7070J2229M882m018k0296m2383j7338L1370Q040
15455a3562r742l556N595K0960Q421l1555P622K3699K3370l597q639k4449j5733
15442b1166K1687K2768k1672k2170k0793q960j1936K6614K7787r9l5507pQ048
15429c5406Q844o932K4135R215K6034Q416p954j2901j712p044k8692k7952K5647
15416b6302N816K2948j3972L400j0620M15j2320K606K1811K136J84r910J5647
15403A839K2979q259l0809k7037J0958K7282M7000j0398l045j1708o372n155k9206
15390b1931n375J0017j171K977P742l509j0052J0894j3072J6228J101K245J613
$$ plain form
15482 -39355 -48055 -53611 -59832 -74534 -44401 -19210 -20090 -29037 -29183 -41003 -41522 -31546 -47256 -37657
15468 -37657 -7053 -11509 -11505 -3118 13952 26181 31063 27045 6749 -35634 -52972 -21602 -13562
15455 -13562 -23304 -26860 -21265 -305 8116 -23439 -15817 7882 31252 27655 19016 -5433 -21166
15442 -21166 521 23289 1617 -20553 -41346 -50306 -62242 -35628 -7841 -7940 -43447 -43454 -35406
15429 -35406 -26562 -33494 -9359 -144 25890 34306 26352 13451 11739 4695 -23997 -51949 -26302
15416 -26302 -20486 2462 -11510 -8110 -18730 -18315 -30635 -28029 -6218 -4082 -3898 -13808 1839
15403 1839 24818 16559 -14250 -41287 -30329 -3047 43953 33555 30510 18802 12430 7275 -21931
15390 -21931 -27306 -17289 -18460 -15483 -7741 -11250 -21302 -10408 -23480 -7252 -6151 -3906 -2293
15377b293n255J3665j0427j1801M950K0483j6910l977J5728R376O437r078N886
15364A6784j9792j352k5315r701Q776K6828j0052k0266K7855M0452R38j939k0786
15351A2430l1509J3862K2916O034j6086j6854O766J5801j3279J497N257j0764
15339c929k4956Q729K0413J5416k2867o067o079k3167J9551j5227o83K109k261
15326c9018J1195K2750K6566r858o199j300j0339J5165L182L233m170k5008J572
15313a2229J1472l767j6346M939J4246R788K3236P553l3583r194N683J9314k2684
15300a572p995J1911Q492k9819j9112Q883J2385N299J5766K0684k322O269k5667
15287C202k3084Q024Q022L013L792j1905R02K468j4239M572N438j4294o538P3
$$ plain form
15377 -2293 -7548 6117 -4310 -16111 -11161 9322 -7588 -11565 4163 13539 19976 10898 16784
15364 16784 -3008 -4360 -29675 -39376 -30600 -3772 -13824 -34090 -6235 34217 35155 33216 12430
15351 12430 -19079 -5217 17699 23733 7647 -9207 -2441 13360 81 1578 6835 -3929
15339 -3929 -28885 -20156 257 15673 -7194 -13261 -19340 -42507 -22956 -38183 -38866 -36757 -39018
15326 -39018 -27823 -5073 21493 11635 5436 4136 -6203 8962 12144 15377 11207 -13801 -12229
15313 -12229 -757 -4524 -20870 -15931 -1685 8103 31339 38892 5309 -3885 1798 21112 -1572
15300 -1572 -9567 2344 10836 -18983 -38095 -29212 -16827 -11528 4238 24922 22600 28869 3202
15287 3202 -19882 -11858 -3836 -823 2969 -8936 -8034 -5566 -19805 -15233 -9795 -24089 -30627 -30554
15273c0554q500j1449K094O792K6806J0946j7153j6652M761M57J2369K187J5693
15260b203O995l4289l6644k970k788K0704O144K0203M0246J6038p254n922o318
15247A1942j0341p23K3419j302J3173J082k4136j7599R14J155k5194k2610K6181
15234b4039K7543o964R20J9200L403k8529J7047p586l3083M35J3269L6333J0843
15221B8792j3298l9236j533J3658l433q072j8060j3742k6024j7754L1517L2150
15209c5035o51r206J3428J2457O503K4000j2634l9208j0503k306j6453Q581Q5
15196f0942J0983K9899L0811J1499M160j805l434j5920P119L488o4732r636L7665
15183b0845J0088n675k6389J377J4685L0977J3101j5909K804k5917j7969l078
$$ plain form
15273 -30554 -39054 -50503 -48409 -41617 -14811 -3865 -21018 -37670 -32909 -32452 -20083 -17896 -2203
15260 -2203 4792 -29497 -66141 -69111 -71899 -51195 -45051 -24848 15398 31436 24182 18260 11942
15247 11942 1601 878 24297 22995 36168 37250 13114 -4485 -3571 -2416 -27610 -50220 -24039
15234 -24039 3504 -3460 -2540 16660 20063 -8466 8581 995 -32088 -31653 -18384 17949 28792
15221 28792 15494 -23742 -25275 -11617 -15050 -23122 -41182 -54924 -80948 -98702 -67185 -35035
15209 -35035 -35686 -44892 -31464 -19007 -12504 11496 -1138 -40346 -50849 -53155 -69608 -61027 -60942
15196 -60942 -49959 -20060 10751 22250 26410 24605 21171 5251 12370 15858 -48874 -58510 -20845
15183 -20845 -10757 -16432 -42821 -41444 -26759 4218 17319 1410 4214 -21703 -39672 -42750
15171d2750j5873q932L4019K8700J8679m081m056P187M587q759L356p985k5934
15158b1842R864j5068J0978j3096J0044N077o31j9258R672L931L6579J9790m0645
15145d605l3951K852j5750j4996O792J7084L8662J4746R144l0776j3911q151j1957
15132d4817M962j1259K4741J7152L4305J9938l0684n0179j2345L453R040N190
15120c0503J8868K90N588k4518k5767j1761J3682N902J5437Q874J3427J7702n055
15107B166K0094M6319P226j1381j0120k8452j9653r997J0920J1443l266J1201
15095B6500r48j5720k1324J2518L41o98J0J1712k1484j6215J9551L4481j3851
15082A4873o96j5482J4431m580l804q650j887J459p661J2248J1124o856k231n93
$$ plain form
15171 -42750 -58623 -67555 -33536 -4836 13843 9762 5706 12893 17480 8721 12077 4092 -21842
15158 -21842 -11978 -27046 -16068 -29164 -19120 -14043 -14674 -33932 -24260 -20329 16250 36040 -4605
15145 -4605 -38556 -35704 -51454 -66450 -59658 -42574 -3912 10834 19978 -10798 -24709 -32860 -44817
15132 -44817 -39855 -51114 -26373 -9221 25084 45022 14338 -35841 -48186 -44733 -35693 -30503
15120 -30503 -11635 -11345 -5757 -30275 -56042 -67803 -54121 -48219 -32782 -23908 -10481 7221 2166
15107 2166 22260 68579 75805 64424 54304 25852 6199 -3798 7122 18565 15299 26500
15095 26500 25552 9832 -11492 1026 1367 669 679 12391 -9093 -25308 -5757 28724 14873
15082 14873 14177 -1305 13126 8546 4742 -3908 -5795 -4336 -11997 251 11375 4519 2288 1695
15068A695J5387o14R128q198j3421L683l957n736m525n871J6758n345K0785O542
15054B6311j3063M489p692n915k3146J0806J7430k5378j2235J3627O113J32j7292
15041b5813o626N681J2690K3805N684p94J3218N06o964j1520Q45J3572n311n455
15027A3518K753J9470K593j3450k9578j4301P853O697J3766K329m312j4262q271
15014a5195K187q189K899M190R23j9849K0675J9523L0228J7308k5830j4592J5912
15001C0190Q584l0151j9986O174J5560j879j9663j9716K0307N873j5706O144k8278
14988d2547p168M430M2474j027j8720m355L092J1861J1541p836P825p515j864
14975i809l140m010J7282Q129Q260k1649q235K0359l611j1064K0585R922k0483
$$ plain form
15068 1695 17082 16468 25596 17398 3977 7660 3703 -2033 -6558 -12429 4329 -1016 19769 26311
15054 26311 13248 17737 10045 4130 -19016 -8210 9220 -16158 -28393 -14766 -8653 -8521 -25813
15041 -25813 -32439 -26758 -14068 9737 15421 14627 27845 28351 21387 9867 10712 24284 18973 13518
15027 13518 16271 35741 38334 24884 -4694 -18995 -11142 -4445 9321 11650 7338 -6924 -15195
15014 -15195 -13008 -21197 -18298 -14108 -13185 -33034 -12359 7164 37392 54700 28870 14278 30190
15001 30190 38774 8623 -11363 -5189 10371 8492 -11171 -30887 -10580 -4707 -20413 -14269 -42547
14988 -42547 -49715 -45285 -2811 -3838 -22558 -26913 -23821 -11960 -419 -8255 -430 -7945 -9809
14975 -9809 -12949 -16959 323 8452 16712 -4937 -13172 7187 3576 -7488 13097 23019 2536
14962B536m858n759J5678L7888j6940l0385R791j2179n567J4351q552M278o184
14949e902j8953L78l354l832Q703k4127k3553K3215k417K6792L361J269j6688
14936c5108j3089M944K707n012J4276J0813m315k2667k3526r91l383J2533M9074
14923a3744K4896j3161m2921N96J1737K4205q768m3328j4155m208K9997M8819
14911c5J4917l3196J1105q92l293Q07Q5K322K625J0711J3902j9124j1035q31q040
14896a9972J1379L2715k3788j6271K8052J1523k138k6888q064N0938J7772j1022
14884D4236k8881j0128K7146j3908r569r278j5681L515J0803J7132l486N083J0596
14871B7580m110k0674J3416j3962p020k0711l0518J1290N126J1833J7008j7593
$$ plain form
14962 2536 -2322 -8081 7597 45485 28545 -1840 7951 -4228 -9795 4556 -3996 282 -5902
14949 -5902 -24855 -24477 -27831 -31663 -22960 -47087 -70640 -47425 -49842 -23050 -19689 -18420 -35108
14936 -35108 -48197 -43253 -40546 -45558 -31282 -20469 -24784 -47451 -70977 -71968 -75351 -62818 -13744
14923 -13744 11152 -2009 -44930 -44334 -32597 -8392 -17160 -60488 -74643 -78851 -48854 -35
14911 -35 14882 -18314 -7209 -8101 -11394 -10587 -10502 -8180 -5555 5156 19058 -66 -11101 -11932 -19972
14896 -19972 -8593 24122 334 -15937 12115 23638 21500 -5388 -13452 37486 55258 44236
14884 44236 15355 5227 32373 18465 8896 -382 -16063 -12548 -1745 15387 11901 16984 27580
14871 27580 23470 2796 16212 2250 -4770 -25481 -55999 -44709 -39583 -27750 -10742 -28335
14859b8335k8520K1530L5628K6010J1885L015m2522l2201j3694J039o553J4123
14847c8595K4774J3008j1150J0606J0038k9881k3617M0071K4572r768k1077j5417
14835b6436j1148K501r578J4769J6769k2860J1109O007j0635J30j7064K1992K0361
14822d083j902o997k163J2765J9032j0572k2684j6852J5924j455N773M503j4915
14809b3626L939K2346Q002j0485r454j815J9224J9701j7678N50N40k5501k4340
14796c8597J0844O250L9325M8893j1640k4207j042l1514j7352q251j9595M719
14784d2167J2250o723Q6P72M0916j4795p369k290M763P458l118p557J7171j252
14770a855q359n846J5653O648K1843P824P240J7733j5584n4407j0295K415k0628
$$ plain form
14859 -28335 -56855 -35325 303 26313 38198 41213 -1309 -33510 -47204 -46165 -52718 -38595
14847 -38595 -13821 -813 -11963 -1357 8681 -21200 -44817 -4746 19826 10058 -11019 -26436
14835 -26436 -37584 -35083 -44661 -29892 -13123 -35983 -24874 -18867 -29502 -29372 -46436 -24444 -4083
14822 -4083 -5985 -12982 -15145 -2380 16652 6080 -16604 -33456 -17532 -18987 -13214 -8711 -23626
14809 -23626 -19687 2659 10661 176 -9278 -11093 8131 27832 10154 10704 11244 -14257 -38597
14796 -38597 -27753 -21503 17822 66715 55075 30868 29826 -1688 -19040 -27291 -46886 -42167
14784 -42167 -29917 -36640 -36554 -35782 5134 -9661 -17030 -19320 -14557 -7099 -10217 -17774 -603 -1855
14770 -1855 -10214 -16060 -407 6241 28084 35908 43148 60881 45297 -9110 -19405 -16990 -37618
14757c7618k09J898L618j0555j1676K1091J5026K1035J9489Q786k1699j192K6920
14744C4914m3743l3464J3891O938j37j7378L716p407j0222K1698L8775K1752r35
14731B8398j1991n241k6273k791j4809N782K091k68K4817K684p355m860j6620
14718b6436l357J4260K1892j8286p485J8878K8085J510j6495O304K2676j9404
14706B2142j1605k8508J1891j1255J4327J5405L0277o642l6958l6758N613K5591
14694f480k822j3900j4168r243J8394N488J5077r96k3054r980O968M943q545L1362
14680f956J9632p488p263j7450k0449R537J3215K0048M100j412j8635o122K6926
14667G683q781j7618J0945Q932p323J1041J7921J6863J5961p623j8349k2649J0028
$$ plain form
14757 -37618 -37827 -35929 -32311 -42866 -54542 -33451 -18425 2610 22099 30885 9186 7994 34914
14744 34914 -8829 -42293 -28402 -21464 -21601 -38979 -35263 -42670 -52892 -31194 7581 29333 28398
14731 28398 16407 11166 -15107 -17898 -32707 -26925 -24834 -25102 -285 2399 -4956 -9816 -26436
14718 -26436 -29793 -15533 6359 -11927 -19412 -534 27551 29061 12566 18870 41546 22142
14706 22142 10537 -17971 -6080 -17335 -3008 12397 42674 36032 -926 -37684 -32071 -6480
14694 -6480 -9302 -23202 -37370 -46613 -28219 -22731 -7654 -8650 -31704 -41684 -34716 -29773 -38318 -6956
14680 -6956 12676 5188 -2075 -19525 -39974 -30437 -17222 2826 6926 5514 -13121 -19243 7683
14667 7683 -1098 -18716 -7771 1161 -6162 4879 22800 39663 55624 48001 29652 7003 17031
14654A7031m51L156K3476r00l7055k6577Q015K5661o432k1946k1316j7217p939
14641f2494L097j2744K5677N1624K4246J7647l1406l3427M274K693o288J0055
14629g046K7213K1203j3671m080j6366J0436O601P5k247j3890l5458j1926m0730
14616g9886l068j323L4788L8153K9931Q024j7412p003m36J367m488k164k474L240
14602b751K6648L0031p791r20J7340R430q261N563k4728p46O818l6660k6141k3563
14588c5731k270L6566j997l2657J2191J6875q934k7690L0196K000k1384J6840
14576a5995K9235n290m11K9774j1314j571O747j1206j2197K06J8260m74j4298
14563A1466j0891j5438k439o232L710J1230k000O816m392j1501J1162j4193k4063
$$ plain form
14654 17031 16580 19736 43212 42312 5257 -21320 -13305 12356 5924 -16022 -37338 -54555 -62494
14641 -62494 -59397 -72141 -46464 5160 29406 47053 15647 -17780 -13506 -10813 -17101 -7046
14629 -7046 20167 41370 27699 23619 7253 17689 24290 24365 22118 8228 -27230 -39156 -79886
14616 -79886 -82954 -84277 -49489 -11336 18595 26619 9207 2204 1768 3135 -1353 -3517 -5991 -2751
14602 -2751 23897 53928 46137 45217 62557 71987 63726 69289 44561 43815 50633 13973 -12168 -35731
14588 -35731 -38001 -1435 -3432 -36089 -23898 -7023 -15957 -43647 -13451 -11451 -32835 -15995
14576 -15995 13240 7950 7539 37313 25999 24428 31175 19969 7772 7978 26238 25764 11466
14563 11466 575 -14863 -17302 -23534 -19824 -8594 -10594 -3778 -8170 -19671 -8509 -22702 -46765
14550d6765l919J2996J3161J4953m798k113j2874n858R135J8390J5994K3023l04
14537C1021j7719r427j9696J3685q89l6197k3768N4179K1376k416J0068O317k278
14524B4256K384K4794k4959l4558J4720J7558k430r859k8526j2386N164K4857
14512A015K2889J6384m781m648k47R366n936m1815R37K010l106j3027j529M320
14498a8168J7532J9796J6246k522j3147j447k8115k3134K128o46j8612J4395L0183
14485e511J0162j7161l06L8364J2427R196J0343j3373j5915K878k1096l088K8387
14472C5307r656k1833N110k1008k452j0059K7122J593j1683j7022L385J1458J6331
14459F593J3143n273l892k0076q016K2063K2370n514K9805q585l0633O830M221
$$ plain form
14550 -46765 -50684 -37688 -24527 -9574 -14372 -16485 -29359 -35217 -26082 -7692 8302 31325 31021
14537 31021 13302 3875 -15821 -2136 -3025 -39222 -62990 -8811 12565 10149 20217 26534 24256
14524 24256 26640 51434 26475 -8083 6637 24195 21765 11906 -16620 -29006 -23842 1015
14512 1015 23904 40288 35507 30859 30612 39978 34042 -7773 -6836 -4826 -7932 -20959 -22488 -18168
14498 -18168 -636 19160 35406 32884 19737 18290 -9825 -32959 -30831 -31477 -50089 -35694 -5511
14485 -5511 4651 -12510 -12816 25548 37975 47171 57514 44141 28226 31104 10008 6920 35307
14472 35307 25651 3818 8928 -12080 -14532 -24591 2531 4124 -7559 -24581 -21196 -9738 6593
14459 6593 19736 14463 10571 -9505 -17521 4542 26912 21398 51203 42618 11985 18815 23036
14446B3036j895n291Q718j7024P74j4223j0278J0390P144k586j1775M355o464
14433a5119O650m708K4209J7865j1626j8851k1328Q267J4650J5007J5136O812
14421C6964j2070m3301m8730J5757L4900m017j6824j082N825M244j224l039K8736
14408c861K951P228l514J945k0552j1085k119M359J6804N214J0615Q753l6150
14395a9412j0141L9557N673j9036K0072J1888J2697P309n57k41k6360j9839O775
14382H385L297k0284j0998J4694k7166j6846K738K4415L7620L2510k1100k9734
14370b469r058k956J2139m704m755R079j5946j8529J9680L6859K4375K1347n880
14357E9182k5786K1889K0230k3033j2127k5535J000J2983k5257r478L372J6458
$$ plain form
14446 23036 21141 15850 24568 7544 8318 -5905 -16183 -5793 1351 -1235 -13010 -8655 -15119
14433 -15119 -8469 -13177 11032 28897 17271 -1580 -22908 -14641 9 15016 30152 36964
14421 36964 24894 -18407 -67137 -51380 -16480 -20497 -37321 -38403 -32578 -28334 -29558 -32597 -3861
14408 -3861 -910 6318 2804 4749 -15803 -26888 -29007 -24648 -7844 -2630 7985 16738 -19412
14395 -19412 -29553 10004 15677 -3359 16713 28601 41298 48607 48050 47809 21449 1610 8385
14382 8385 11682 -8602 -19600 -4906 -32072 -48918 -46180 -21765 15855 48365 27265 -2469
14370 -2469 -11527 -14483 -2344 -7048 -11803 -2724 -18670 -37199 -17519 19340 43715 65062 59182
14357 59182 33396 55285 75515 52482 40355 14820 15820 28803 3546 -5932 -2560 13898
14345A3898J568j3321J858k4883p251p089K6334K6597M571K3416L515J5423k3231
14332D1405k4549j9504j1274K8349R370P12L479l748k0224q248k35J4111Q39J2083
14318B2566j6417j2501k1786j3796J2929j2674K7346N846m094l6349k883J9621
14306c2192n812K9566R836J2176J37l3070M902J3197L3451k0094j7405o055j1289
14293b2652j4256L812K4903K4516l637m482j9921j2688J2033r200l0212L745Q651
14280c9388L0613K2261L297k0765M500J961O030q854r441j4154R385q345q603
14267c1503L2090L3353j6124k1403L966k14J3540K5952n057k070J4772p091j4478
14254B5733k4724k0452L87J1793K3472J7843k1727j6009K4636P595J2164n971
$$ plain form
14345 13898 15466 2145 4003 -20880 -28131 -35220 -8886 17711 22282 45698 49213 64636 41405
14332 41405 16856 -2648 -13922 14427 23797 24509 27988 24240 4016 -4232 -4467 9644 10483 22566
14318 22566 6149 -6352 -28138 -41934 -29005 -41679 -14333 -8487 -12581 -48930 -51813 -32192
14306 -32192 -38004 -8438 1398 13574 13711 -19359 -14457 -1260 32191 12097 -5308 -11363 -22652
14293 -22652 -36908 -33096 -8193 16323 12686 8204 -11717 -24405 -12372 -21572 -51784 -48039 -39388
14280 -39388 -8775 13486 16783 -3982 518 2479 8509 -345 -9786 -23940 -14555 -22900 -31503
14267 -31503 587 33940 17816 -3587 379 165 13705 39657 34600 32530 47302 40211 25733
14254 25733 1009 -19443 -19056 -7263 16209 34052 12325 -3684 20952 28547 40711 34740
14242C4740j9555K652j6387p329m257k7032k781J4704L040j1066K5204L1326M435
14229B7694l9890M929j2239M135K7J1257J8201K33m358l181j4188j0721Q950K7214
14215A8063j8491r594J4615P044L0754Q775j5785m9510j1663K1172R950P670j1458
14202A542k5907M757J7509J0122r240j8064Q718J6469m623j0670n486J5075L944
14189D146j5693j0333n189J6077P256p552o043L0024l0171k6803K7989L8515K0236
14176D2459j4230k7759j7131J4584O247J0168o969N164o602J247j766j1840k144
14163h572R989J4880K8465J7564r526k6547q619J052J7188k0973m4760J6343J7603
14150D087J4970j637j1690j1010P736N520L4058r668l4654j1671K4972J5337l0253
$$ plain form
14242 34740 15185 17837 1450 -5879 -10136 -37168 -39949 -25245 -22205 -33271 -8067 23259 27694
14229 27694 -12196 -7267 -19506 -15371 -15344 -4087 14114 14347 9989 6808 -7380 -18101 -9151 18063
14215 18063 -428 -10022 4593 11637 42391 51166 35381 -14129 -25792 -4620 5330 13000 1542
14202 1542 -24365 -19608 -2099 8023 -1217 -19281 -10563 5906 1283 -9387 -14873 202 4146
14189 4146 -11547 -21880 -27069 -10992 -3736 -11288 -17331 12693 -17478 -44281 -16292 22223 42459
14176 42459 28229 470 -16661 -2077 4170 14338 7369 12533 5931 7178 5412 -6428 -8572
14163 -8572 1417 16297 44762 62326 52800 26253 17634 18686 35874 14901 -29859 -13516 4087
14150 4087 19057 17420 5730 -5280 2456 7976 42034 32366 -2288 -13959 11013 26350 -3903
14137c903o541R464J602o361m0940o694K4099L312j8896K3631K3878k795r443
14124i587j231J7546N418k8335r286K366j370R876N302J6617j124k4473l846J4556
14110g571j9885J2684L643J9224j1911q689J1896k3265J4423K2210j1539k807
14098a587R689P553J1790m996j7294j8642L230L7995K347k543M0096K1268l4785
14085E4121j8655j2318j0277J356j9364k90J1983j2074m874k484j402Q570n875
14072a1583L833Q771K4719L874J2080K2965J4951j2961o946k7204j1517l362j4681
14059B939k0195j2361j1173j6981q457K8714J0024N58K9860L3043l1673k5839
14047b1541k165J1811K3145J4996j3419k2183K901M1352J8683k0332k0840k969
$$ plain form
14137 -3903 -10444 -980 622 -5739 -46679 -53373 -29274 -25962 -44858 -21227 2651 -144 -9587
14124 -9587 -10818 6728 12146 -16189 -25475 -23109 -24479 -14603 -9301 7316 6192 -18281 -22127 -7571
14110 -7571 -27456 -14772 -11129 8095 -3816 -12505 -609 -23874 -9451 12759 1220 -1587
14098 -1587 8102 15655 27445 22449 5155 -13487 -10257 27738 30085 27542 67638 88906 54121
14085 54121 35466 23148 12871 14227 -5137 -5427 6556 -5518 -10392 -12876 -14278 -5708 -11583
14072 -11583 -7750 1021 25740 29614 41694 64659 79610 66649 59703 32499 20982 17620 2939
14059 2939 -17256 -29617 -40790 -57771 -66228 -37514 -27490 -26932 2928 35971 4298 -21541
14047 -21541 -23706 -11895 11250 26246 12827 -9356 -6455 34897 53580 33248 12408 9439
14035I439r712J061M6608M823k5344M708Q107k231k2411j3993r346j9099j4077
14022d1467o186K5067Q088j3822K375o306L218o582Q86j5459K4382J987K4574
14009G55J1955K3542J2871l5258k3605q240K5722J648q462J0210K1408j490o689
13996B4367k7893l1498o705K9620K230q828J1057J1600k1002k0857J617j4637
13984e0929o5J7643Q660J8944L7203J1646j2327p003K0911k9517l800Q953J3764
13971C4083J8936M3466J0293K6270J4093j2062j4941k2218N243j2811J3825j6490
13959H7687o4028k3665J4695K7341L041L272r296M555K94j9841k5974j0196O687
13946e428J6408Q395m8819r363L2797J2744K7815R438L600k1451l0204J0931N440
$$ plain form
14035 9439 -273 788 47396 52219 26875 31583 39690 37459 15048 1055 -8291 -27390 -41467
14022 -41467 -47653 -22586 -14498 -28320 -25945 -32251 -29033 -35615 -34729 -50188 -25806 -23819 755
14009 755 12710 36252 49123 13865 -9740 -17980 7742 9390 928 11138 32546 31056 24367
13996 24367 -3526 -35024 -41729 -12109 -9879 -18707 -7650 3950 -17052 -37909 -36292 -50929
13984 -50929 -50994 -33351 -24691 -5747 31456 43102 30775 23772 44683 15166 11366 20319 34083
13971 34083 53019 96485 106778 133048 147141 135079 120138 97920 103163 90352 104177 87687
13959 87687 23659 -6 14689 42030 45071 48343 39047 43602 43896 24055 -1919 -12115 -5428
13946 -5428 10980 19375 -29444 -38807 -6010 6734 34549 43987 47587 26136 -4068 6863 12303
13933A2303j7584n807j1308l595p47L1014J4610n907j2756n3567k0995M5458J4754
13920a4127l0148j6158k2536J0714N8816K1049j1269j3863L6002J8804R2J5867
13908E3243J2780k0443l5235j5474J8755J3606M848j275k8953k0159q03K0966
13896A856J6361j1807l1599j5300P458J8995L4462J5976o323l44j2123j2128L749
13883I233N909P428Q668j2922k5163m840k2423J2424L1603j5425j5622R927j1710
13870b2913K2682K9236R584q273k1157J1718j403j3661N689K3680J1107k717j2663
13857C0909j1556r838J9360M744j2488m681J9759J3271J9998l6936j5038O224
13845B3728j6115l636K0066r622j5904q869k230q583M259k0319K1946N4229p021
$$ plain form
13933 12303 -5281 -11088 -22396 -25991 -26738 4276 18886 12979 223 -53344 -74339 -28881 -14127
13920 -14127 -44275 -60433 -82969 -72255 -13439 7610 -3659 -17522 18480 37284 37376 53243
13908 53243 66023 45580 10345 -5129 13626 27232 32080 30805 1852 -18307 -19110 1856
13896 1856 18217 6410 -25189 -40489 -33031 -14036 20426 36402 30079 29735 17612 5484 9233
13883 9233 15142 22570 31238 18316 -6847 -11687 -34110 -21686 9917 -5508 -21130 -11203 -22913
13870 -22913 -231 29005 38589 30316 9159 20877 19474 5813 11502 35182 46289 43572 30909
13857 30909 19353 9515 28875 33619 21131 16450 36209 49480 69478 32542 17504 23728
13845 23728 7613 3977 24043 14421 -1483 -10352 -12582 -21165 -16906 -37225 -15279 38950 31929
13832C1929k2395k5035k0489r704j2155L5731J0533O133L154o17Q921O526J3932
13819B6464J1713j7220j0243J2282P282M480j670j717j2478k2504j9250j0153
13807c3014m710J8577L0981J2671J8685J1857l022k0134k510j9321J5350m09j5901
13794I100k1505l592J9472k1887m043K3271K4370J934J4362o199o38j3724l1512
13781a0591J6664j6225j4769J1820k7010N615L5992L3030J0119j6364q433j4506
13769E342J3503K2659j0448q26K187l6369n5147j7455L4524J6283J4643K7071
13757A5967J0639r480K0212j3640L406K216l350q309R819P281l0908M722m041
13744D534L147j3616o48p1O734p825J8974j3545j7900k8909K439J5719J9071k325
$$ plain form
13832 31929 9534 -15501 -35990 -45694 -57849 -22118 -11585 -5452 -2298 -2915 6006 12532 26464
13819 26464 38177 20957 10714 22996 30278 34758 33088 31371 18893 -3611 -22861 -33014
13807 -33014 -37724 -19147 11834 24505 43190 55047 52025 31891 29381 10060 25410 25001 9100
13794 9100 -12405 -15997 3475 -18412 -22455 816 25186 27120 41482 35283 34645 20921 -10591
13781 -10591 6073 -10152 -24921 -13101 -40111 -34496 1496 34526 44645 28281 19848 5342
13769 5342 18845 41504 31056 30230 32417 -3952 -59099 -76554 -42030 -25747 -11104 15967
13757 15967 26606 17126 37338 23698 27104 29320 25970 17661 27480 34761 3853 8575 4534
13744 4534 7681 -5935 -6583 -6654 80 -7745 11229 -2316 -20216 -49125 -46686 -30967 -11896 -14221
13730a4221k091p486m523r026l2765r931O108K8949K1012o699q601J8914M0218
13717A9858p613J7000M802N942k8419k5538J8958J4490J4057o023j7732P252m191
13704A2843m3984N809N3884K1358P992M951k3185P0L2627n309k4485r425j170
13691C1976L745M133j4182J5883K5363R403p895n259k735q898j127p115j401K4859
13677F6750m899J0309p357j5708M790J440k3629j6494j5899P165J6560Q741Q468
13664D0237M940L062j9671m702j5499J3762L0524j452j5810k0707n543J0050M215
13651B3406J722j1031o311M372K228N7245J9194k7422l4811k6318J2964J0802
13639B6040q942q287J4496J5515K6966K5172q168J934M779l7249q890J1957l807
$$ plain form
13730 -14221 -16312 -23798 -28321 -37347 -70112 -80043 -73935 -44986 -23974 -30673 -39274 -20360 19858
13717 19858 12245 29245 34047 39989 11570 -13968 4990 19480 33537 27514 9782 17034 12843
13704 12843 -31141 -25332 28552 49910 57902 62853 39668 39738 72365 67056 42571 33146 31976
13691 31976 35721 39854 25672 41555 66918 76321 68426 63167 60432 51534 50407 43292 41891 66750
13677 66750 61851 72160 64803 49095 53885 55325 31696 15202 -697 6468 23028 31769 40237
13664 40237 45177 48239 28568 23866 8367 22129 52653 51201 35391 14684 9141 19191 23406
13651 23406 25128 14097 7786 12158 14386 71631 90825 63403 28592 2274 15238 26040
13639 26040 17098 8811 23307 38822 65788 90960 82792 84726 89505 52256 43366 55323 51516
13626E1516j4472O360M591p628j2593K684N379k2464M360N844j4262k69K978l052
13612H972J8876k950j4082J9846N189j1756q677K754J910j7286l2274k4119J7969
13599c5628P10Q214K3231K065J1960L8272J9609k7735J8295N828k555k2688p193
13586C2385j528J8487K9631j4576k2730l4754j3890j441J6935M2635k498j7482
13574C1174q706j741J76l293R351K6225J0002j9757k0005k0985J3404J1542O740
13561C4127J9896j2937l3453J4088R002j81J4244m64K209j66o583J2192j23k2880
13547B8971j1553J8755l459j8807P851Q801Q945j0335J7341J5024j1907j7233
13535C2394j8493J1011J2490J7486l598k2196j0336l120J0582n622Q587K0730
$$ plain form
13626 51516 37044 43404 47995 40367 27774 30458 35837 13373 17733 23577 9315 9046 12024 8972
13612 8972 27848 24898 10816 30662 35851 24095 15418 18172 20082 2796 -29478 -53597 -35628
13599 -35628 -34918 -26704 -3473 -1408 10552 48824 68433 40698 58993 64821 62266 39578 32385
13586 32385 30857 49344 78975 64399 41669 6915 -6975 -8416 8519 51154 48656 31174
13574 31174 22468 20727 20903 17610 26961 53186 63188 43431 23426 2441 15845 27387 34127
13561 34127 54023 41086 7633 21721 30723 30542 44786 44322 46531 46365 39782 51974 51851 28971
13547 28971 17418 36173 32714 13907 21758 30559 39504 29169 46510 61534 49627 32394
13535 32394 13901 24912 37402 54888 51290 29094 18758 15638 26220 20598 29185 49915
13523D9915k6249N710P360l3143k1949p532k322K0258M5686J4244Q48k6780o409
13510A9637n94j607j3506j168K2041J1125M535k2368O1O007j8879j2262K6604
13497A9626L552p574r846k2258q538O938M481K4918j7101j7487L288J2897L849
13484c255L0871L468J2287J170j3243n646k2452J0806R406O912M979j7353Q293
13471B6243Q133J429k9067K4197L6624J8974l9906r644K402J7019K0270J3921
13459I0595j9779n3309k9487J2177J1773M916J3539O025n1245p452L3536J0449
13447B1738J1316r438K5294J2934j2339k4818O347J4964k5271j5197k2181J0089
13435f562m148n335o33O777J8912q225J0758L4807J0133j8639k7235j8442j7234
$$ plain form
13523 49915 23666 29376 36736 3593 -18356 -25888 -28210 -7952 37734 51978 52826 26046 19637
13510 19637 19043 17436 3930 2762 24803 35928 40463 18095 18156 24163 5284 -6978 19626
13497 19626 23178 15604 5758 -16500 -25038 -18100 -13619 11299 -5802 -23289 -20001 -7104 -3255
13484 -3255 27616 31084 43371 44541 31298 25652 3200 14006 23412 30324 35303 17950 26243
13471 26243 34376 35805 6738 30935 67559 86533 46627 36983 39385 56404 76674 90595
13459 90595 70816 17507 -11980 197 11970 16886 30425 36450 -14795 -22247 11289 21738
13447 21738 33054 23616 48910 61844 49505 24687 31034 45998 20727 5530 -16651 -6562
13435 -6562 -10710 -16045 -16678 -9901 9011 786 11544 46351 56484 37845 10610 -7832 -25066
13422b5066J7437J6940P559J2195M3P438K818k372R470J6707p443n621J4661j7883
13408D6883k2028j4712J7925L5331M094j4625j0699N064j528L7464r978q217K514
13395F7488l9869k0859R314J494J8484K633j4749m969J2252K3988q71q33J2689
13382F6192m675L081r815o819Q349j9144p744J1376N894K8518j9040k7527P577
13369C6223O272L8869K4490l493j9599p426k9340m174L5210J7763n873P351p719
13356H8554j5560k3040k3693k6540Q981K9921J3053n478j5755N078J6552j2089
13344C9984P948J7455m225l0729k881J4410R073n630J3421J9478j1447q518R698
13331F8037J2561N747j0214j4583K2158J3398j3541N701k5573K009J0891J4888
$$ plain form
13422 -25066 -7629 9311 16870 29065 29108 36546 39364 36992 46462 63169 55726 50105 64766 46883
13408 46883 24855 10143 28068 63399 67493 52868 42169 47233 45705 83169 73191 64974 67488
13395 67488 27619 6760 16074 17568 36052 38685 23936 18967 31219 55207 54336 53503 66192
13382 66192 61517 64598 54783 47964 56313 37169 29425 40801 46695 75213 56173 28646 36223
13369 36223 42495 81364 105854 102361 82762 75336 45996 41822 77032 94795 88922 96273 88554
13356 88554 72994 49954 26261 -279 8702 38623 51676 46198 30443 35521 52073 39984
13344 39984 47932 65387 61162 30433 27552 41962 51035 45405 58826 78304 66857 58339 68037
13331 68037 80598 86345 76131 61548 83706 97104 83563 89264 63691 65700 76591 91479
13319I1479j7495j6982M516O114K2130r132L482P950P674R433j2601M201k2224
13306G8545j9511R21K6624j8009l0229l8484L1923K8347j8653l4125J3929K9712
13294E0990O056J7603P008Q59j3172n201O485J2553k4531J3279p907k6598r428
13281B7996J0049l94o955M599j06J8987Q650j60k6036P519N330N804r788M670
13267E0165j5927o511O953j3736J8983K643o912p741K0069K1577K493q854j3606
13254D9596O625N326L334K8779k831Q100j0075l0887Q943K6082J175J826j9829
13241G6164q81J3846K7763j8339l0700j9924J2202K5260J2650K805k5845k5768
13229D9233k6223R579K6911Q934J3469J4141m956J9128j9397J1727n699j4308
$$ plain form
13319 91479 73984 57002 61518 67632 89762 80630 84112 92062 99736 109169 96568 100769 78545
13306 78545 59034 59955 86579 68570 38341 -143 31780 60127 41474 7349 21278 50990
13294 50990 57046 74649 81657 82516 69344 64143 70628 83181 58650 71929 64022 37424 27996
13281 27996 38045 37651 30696 35295 35189 54176 62826 62666 36630 44149 49479 55283 45495 50165
13267 50165 34238 27727 34680 20944 39927 42570 35658 27917 47986 69563 72056 63202 49596
13254 49596 56221 61547 64881 93660 90829 98929 88854 57967 66910 92992 94167 95993 76164
13241 76164 75283 89129 116892 98553 67853 47929 60131 85391 98041 100846 75001 49233
13229 49233 23010 32589 59500 68434 81903 96044 91088 110216 90819 102546 96847 82539
13217H2539j1558n742J0027n576k5563J8865L829k0863K070K4059j3977Q367J117
13204F7594j717q414k2120J5694k35m115J2779L3158K095l637j6076J0276n583
13191G9699J3575j6534j7382L6109P130j6068j7977K316k6752N006K9234K0185
13179I8541k2896k4599q198L589L3023N298J8136j7020J168M0457j8600j761K1254
13166A28392j4940l5363O8J1122R555J288k7991p67M150j3828r085M901K1113
13153G8615R284j3491Q511K2200R737j3995l5545O074J4374K8481k629J5813J9985
13140A47414m9026o276j2436J387J339P357j7300j4476J4767K6005q154J009K1738
13127A13348k112j4663K1119j620m380l575L387M194j1077j1400j8038k740k6784
$$ plain form
13217 82539 70981 65239 75266 69690 44127 62992 66821 45958 48028 72087 58110 66477 67594
13204 67594 65877 57463 35343 51037 50802 46687 59466 92624 94719 91082 75006 85282 79699
13191 79699 93274 76740 59358 95467 102597 86529 68552 70868 44116 49122 78356 98541
13179 98541 75645 51046 42848 46437 79460 84758 102894 85874 87042 127499 108899 107138 128392
13166 128392 113452 78089 78157 89279 98834 100122 72131 71364 75514 61686 52601 57502 78615
13153 78615 87899 74408 82919 105119 114856 100861 65316 71390 85764 114245 111616 127429 147414
13140 147414 98388 92112 79676 81063 82402 89759 72459 57983 72750 98755 90601 91610 113348
13127 113348 111236 96573 117692 116072 111692 108117 111504 115698 104621 93221 75183 72443 45659
13114D5659p93K5214M4833j746k3429l211R800J5665O57j8651M827k0540j8038
13101F0247j088K3464r820N931K854p10j1471k4708l531R50j833M2184K6453N820
13087A14742q613J4696n611q456P209k3124M558j8403j2182K6148J7745J5274
13075A23983p162M382N358j1534n549j6774J115J5366J663l923J9091R349J3682
13062A49047j3451k2885p496K0648Q374j9714l7247K5038J2401J5104k3370j7383
13050H9066M559j758j3994j395K9370L1255j4689J6294K4588o136J194l5053k1726
13037A01575k6428L027K7835N486o207K1346L679j0600N349p59n622j5513j3077
13024I0091R830K5505o531N901K174O971j6494l3000j5439K265J0764L3922P393
$$ plain form
13114 45659 44866 70080 114913 113167 89738 86527 96327 111992 112649 93998 98825 78285 60247
13101 60247 59159 82623 72803 78734 81588 80878 69407 44699 41168 42118 40285 82469 108922 114742
13087 114742 106129 120825 115214 106758 113967 90843 95401 76998 64816 90964 108709 123983
13075 123983 116821 121203 126561 115027 109478 92704 93819 109185 110848 106925 126016 135365 149047
13062 149047 135596 112711 105215 125863 134237 114523 77276 102314 114715 129819 106449 89066
13050 89066 93625 91867 77873 76478 105848 137103 122414 138708 163296 157160 158354 123301 101575
13037 101575 75147 78174 106009 111495 105288 126634 130313 119713 125062 124303 118681 103168 90091
13024 90091 99921 125426 118895 124796 126970 133941 117447 84447 69008 71273 82037 115959 123352
13011A23352l4477j6337n505P4K2852k3750p895K1069j0632L592j6882k774J1025
12998F3712L163K5248K2841k1972J2568L1647R336j8120R137q321J4238L318j3109
12985A33686k6793N712J2423n683K078J3683J7145j001J2800K4171j004k893l112
12972A81212K4962K3202J3840K3712L9864K2714O8651Q1290Q7853J01911R4703
12961G63914J06911R0643K4931k8321p4709p8818j18246o8243n6519m3111j9994
12950D98438l1312k5344j5971L3975K2212L5755M4385M8769P221K2137M0788N1266
12938G32319O5304N5723L5062n934K2495N1770N0747R423K7197K4365J7571j7882
12926A068160l5333k5019l1946m4572p1033n0861m7067l3669m3813m0891m2511
$$ plain form
13011 123352 88875 72538 67033 67107 89959 66209 58314 79383 68751 72343 55461 52687 63712
12998 63712 66875 92123 114964 92992 105560 137207 146543 128423 137560 129239 143477 146795 133686
12985 133686 106893 112605 125028 119345 121423 135106 152251 151250 164050 188221 187217 184324 181212
12972 181212 206174 229376 243216 266928 306792 329506 398157 479447 567300 669211 763914
12961 763914 870825 961468 986399 958078 883369 804551 686305 618062 561543 518432 498438
12950 498438 467126 441782 425811 459786 481998 517753 562138 610907 618128 640265 681053 732319
12938 732319 797623 853346 888408 882474 904969 956739 1007486 1016909 1044106 1068471 1086042 1068160
12926 1068160 1032827 1007808 975862 931290 860257 809396 762329 728660 684847 643956 601445
12915F01445m9183l0136j3358k490L2849J786o089K7358K1283L9113O6045J13583
12903H02206R8769P3485P1486J3673k1896o9222j08507j00421j04510r0803o1076
12892E03184n2597o5672m6828o749l7251j4325j5619j9652L357o006k2991p561
12880B11290l4635j8782R16q294q579J4925K9278L1854N456m707k625q814P284
12867B14567j699j3117K0710R616n1458N468J3010J7021m131j5184k2350m407
12855A68046J1418K1970M953l2679j7051P856j021j0087K4846J7615J3394J5117
12843B24377r784j7046j574P974P857l869J6477j1809j8354m572J0062J360j4724
12830A86375m2689j4424P932M919L393M697K6528J8652K2864j0248J8543J6380
$$ plain form
12915 601445 552262 522126 508768 506278 539127 540913 534824 562182 583465 622578 688623 802206
12903 802206 900975 974460 1045946 1059619 1037723 968501 859994 759573 655063 564260 503184
12892 503184 450587 384915 338087 331338 294087 279762 264143 244491 247848 241842 218851 211290
12880 211290 176655 157873 158789 150495 141916 156841 186119 217973 223429 218722 216097 207283 214567
12867 214567 212868 199751 220461 230077 178619 184087 197097 214118 209987 194803 172453 168046
12855 168046 179464 201434 206387 173708 156657 164513 163492 153405 178251 195866 209260 224377
12843 224377 214593 197547 195973 203947 211804 207935 224412 212603 194249 189677 199739 201099 186375
12830 186375 143686 129262 137194 142113 145506 150203 176731 195383 218247 207999 226542 242922
12818B42922l894m5343l926L1850j1646j2771Q90k0348P232n483k1740K897J4711
12805A75351L3765L2090K479m7044l2634J8396J0619J8406K9093J4155o536j3344
12793B34796j0248r654k1723j4044J1414J2391R929M581K0244L678L2580J3383
12781B87327J4742L2007J6090l7484m1857N460k0866k6656K4565J7658j9960l958
12769B47068M777J7093J8940L4805M662j7361J9540K1506Q004k836p971N073j990
12756C51310j295j1736l6259j6462j335L2504J5945j4838j9157J5332M5142K4550
12744C83701r098k1406K8387J8388R756l0678r864k536q092J2605M035m800N473
12731C75871Q080L6264J948l3047j9844K2827L5597K1948j2507k8230o264K4151
$$ plain form
12818 242922 239028 193685 189759 221609 209963 197192 198082 177734 184966 179483 157743 160640 175351
12805 175351 209116 241206 243685 196641 164007 182403 193022 211428 240521 254676 248140 234796
12793 234796 224548 214894 193171 179127 190541 202932 212861 217442 237686 241364 273944 287327
12781 287327 302069 334076 350166 312682 270825 276285 255419 228763 253328 270986 251026 247068
12769 247068 251845 268938 287878 322683 327345 309984 329524 351030 359034 356198 348227 353300 351310
12756 351310 350015 338279 302020 285558 284223 316727 332672 317834 298677 314009 359151 383701
12744 383701 374603 353197 381584 399972 409728 379050 369186 366650 358558 371163 375198 370398 375871
12731 375871 383951 420215 422163 389116 369272 392099 427696 449644 437137 408907 402643 426794
12719D26794l722n7374j7592k658o048L132j1272o374J3542K6748J5075r134k966
12706C68151l2984J2608O40J9617P23j551M32k2416n400J4742K866k3610q296
12693C25522q464j1280r408K6464J92j4011k165L0378Q830k2905m698p826J0585
12680C21214O868k642K6019J7678J0251J1135Q513N894j9657q375J7529r427j4584
12667C70416K0921L4676r99j6430j7174L4300K116J3322M1951K5003J8227J3499
12655E39828J3472M1345K3737Q509l438o583J9991J7099K2342M0702N3064N3925
12643H23993L4188K8047k7L6263r328k1843l6207l3832j5325L32k7577q479J4546
12630G84751L7099K8246J8848L0159L3675J9475L8300M4766J8253J4555J7082
$$ plain form
12719 426794 423072 365698 348106 345448 339400 342532 331260 324886 338428 365176 380251 371117 368151
12706 368151 335167 347775 348415 368032 368755 367204 367636 345220 339820 354562 357428 333818 325522
12693 325522 317058 305778 296370 322834 323026 309015 306850 337228 346058 323153 318455 310629 321214
12680 321214 328082 325440 351459 369137 379388 390523 399036 404930 385273 376898 394427 385000 370416
12667 370416 391337 426013 425014 408584 391410 425710 427826 441148 483099 508102 526329 539828
12655 539828 553300 594645 618382 626891 623453 616870 636861 653960 676302 717004 770068 823993
12643 823993 858181 886228 886201 922464 913136 891293 855086 821254 805929 806261 778684 770205 784751
12630 784751 821850 850096 868944 899103 932778 952253 990553 1035319 1053572 1068127 1085209
12619A085209M1384L1411j983j1248L7549J3472K401m2027j0962j1886k3551k4110
12607A085659l6739m6953k9141j1176k638L3229O199k0699l4093m976m524J137
12595I35285k3492J1477M4599J6100L181j523L2765L2613L1683L0621J5337M6667
12583A175313M8959J5731O904N850N852j7910l7134l540m4546n4817l3599L3600
12571A100663K6718r943r728O276O939K1434L8527O6751N3921N5818M5357N1229
12559A453962O2273L1100O1477O9190O0536N0621P6873R1676R7261R3864R3447
12548B242280J07941J19683J02421J24542J64980J70770K02157K28565K17783
12539C681122K20767K68784K97509L28923L81955M60078M86056N71196O55320
$$ plain form
12619 1085209 1126593 1158004 1156021 1144773 1182322 1195794 1198195 1156168 1145206 1133320 1109769 1085659
12607 1085659 1048920 1001967 972826 961650 959012 992241 998440 977741 943648 938672 934148 935285
12595 935285 911793 923270 967869 983969 987150 985627 1018392 1051005 1082688 1113309 1128646 1175313
12583 1175313 1224272 1240003 1246907 1252757 1258609 1240699 1203565 1200025 1155479 1100662 1067063 1100663
12571 1100663 1127381 1117438 1107710 1113986 1120925 1142359 1180886 1247637 1301558 1357376 1402733 1453962
12559 1453962 1516235 1547335 1608812 1678002 1738538 1789159 1866032 1957708 2054969 2148833 2242280
12548 2242280 2350221 2469904 2572325 2696867 2861847 3032617 3234774 3463339 3681122
12539 3681122 3901889 4170673 4468182 4797105 5179060 5639138 6125194 6696390 7351710
12530G351710P31588Q42672R85434J141032J348245J561648J816897K148008K634010
12521B0561244L315229M183616N420031P166976R451138J2475044J6313553K0695356
12513I9582187K4610081K5441077K0015898Q746470l979739j4572984k0661904
12506A39181086k1451833j8596551j4389899j0322923o969327m249807j994386
12499F1206360p5772J591499L115996M473499N698264O673415P434398P987943
12491I8105602Q394668Q736951R100701R423273R678941R649976R226431Q297878
12483A70614421O792551M747310K346485k41199k705058m873696o601733p802698
12475A62276383q485930q781636q752372q576774q279580p925471p635379p295491
$$ plain form
12530 7351710 8083298 8925970 9911404 11052436 12400681 13962329 15779226 17927234 20561244
12521 20561244 23876473 28060089 33480120 40647096 50098234 62573278 78886831 99582187
12513 99582187 124192268 149633345 169649243 178395713 174415974 159842990 139181086
12506 139181086 117729253 99132702 84742803 74419880 67450553 63200746 61206360
12499 61206360 61130588 62722087 65838083 70311582 76009846 82683261 90117659 98105602
12491 98105602 106500270 115237221 124337922 133761195 143440136 153090112 162316543 170614421
12483 170614421 177406972 182154282 184500767 184259568 181554510 176680814 170079081 162276383
12475 162276383 153790453 145008817 136256445 127679671 119400091 111474620 103839241 96543750
12467I6543750o868357o270099n534710m612078l454316k094810n07600J273536
12459F8475316L392422N954816R069149J2795675J6797871K0310083K1574192
12452A58369524J8289729R273992l065040j4278591k1785025k4500696k2874699
12445I9429194j9120309j5094022j1634651q915378o855351n352670m194975l334038
12437B4927800k706665k215218j881952j639299j489285j365617j208505j079763
12429A1341496r68298q15782p25532o28209n73702m85024m18811m02579l61773
12420E961786l01385k99537k80324k23080k08372k04501j85178k24804k00976
12411C833629j24783j22918j49322j31902j46698j39129j09518j34695j26677
$$ plain form
12467 96543750 89675393 83405294 77870584 73258506 69804190 67709380 67201780 68475316
12459 68475316 71867738 77822554 86891703 99687378 116485249 136795332 158369524
12452 158369524 176659253 185933245 182868205 168589614 146804589 122303893 99429194
12445 99429194 80308885 65214863 53580212 44664834 37809483 32456813 28261838 24927800
12437 24927800 22221135 20005917 18123965 16484666 14995381 13629764 12421259 11341496
12429 11341496 10373198 9557416 8831884 8203675 7629973 7144949 6726138 6323559 5961786
12420 5961786 5660401 5360864 5080540 4857460 4649088 4444587 4259409 4034605 3833629
12411 3833629 3708846 3585928 3436606 3304704 3158006 3018877 2909359 2774664 2647987
12402B647987j02224j04855o8046p6851q2179p8029n7061q7956m0886o3943p9316
12391A806641j04587p4969l8502m1115o4767p6786q7752n1878p8892p6704p1796
12380A038893l0329j8520k5049j8733m2203m0955K6011K7529m3j6901j369q593
12368H89738l8885k0561P244K1573j1723k2995n1396n4139l1377J1284k5952n0627
12356F22184q510j1890j9620m0489o6960l3005m3746K791K5811N030K899J5136
12344D49631L0773J9047J1955M2368L1534L1299J7232j5473K2464L3230J173k4974
12332F50259j5417k3340l8124l9586k3818j2675l7894n6182o5465o2208n8866
12321B16684l3307j1451k4706k3051N1712L5736J7180M9618j534j9983k0030N531
$$ plain form
12402 2647987 2545763 2440908 2372862 2296011 2213832 2135803 2078742 1990786 1949900 1885957 1806641
12391 1806641 1702054 1627085 1588583 1547468 1482701 1405915 1318163 1266285 1187393 1110689 1038893
12380 1038893 1008564 990044 964995 946262 904059 863104 889115 916644 916601 899700 898331 889738
12368 889738 850853 830292 837536 859109 847386 824391 772995 718856 687479 698763 672811 622184
12356 622184 613674 601784 582164 541675 474715 441710 397964 400755 426566 431596 434495 449631
12344 449631 480404 499451 511406 553774 585308 616607 633839 618366 640830 674060 675233 650259
12332 650259 634842 611502 573378 533792 509974 497299 459405 403223 337758 275550 216684
12321 216684 183377 171926 147220 124169 175881 211617 228797 278415 276881 256898 236868 242399
12309B42399J6248K7128P039j5507J4685J1412J5838J6866K3122L3912K304J6389
12297D11835J9903n272p6R877k6179m776n062q216n400J5872j2403n5845k4697
12284C09561J796P014K8132n923m7725k180J3328p604k0965Q345o938q452K0744
12271B89133J0941k3584Q563p596k958J4342J9640k1901k3372k0963J2184O957
12259B61386k6625L196J782j4407j905j1987j9603m493J0285L0069n870k4761
12247A97067P514K7386J112j3390K3012J7983K5281k2357N13n781l292Q035j4995
12234B48088j751o254n464j5038j4338o793M275o470L475K3010P442k3397k7423
12221A79362k4684N565K417j8747K68o708m602P695K1833M2371r659j9992J4238
$$ plain form
12309 242399 258647 285775 292814 277307 291992 303404 319242 336108 359230 393142 395446 411835
12297 411835 431738 426466 426390 436267 410088 405312 400250 392034 386634 402506 390103 334258 309561
12284 309561 311357 318371 346503 340580 292855 290675 304003 296399 275434 283779 276841 268389 289133
12271 289133 300074 276490 285053 277457 274499 288841 308481 286580 263208 242245 254429 261386
12259 261386 234761 237957 239739 225332 223427 211440 191837 187344 197629 227698 221828 197067
12247 197067 204581 231967 233079 219689 242701 260684 285965 263608 264121 258340 255048 263083 248088
12234 248088 246337 240083 234619 219581 205243 198450 202725 196255 199730 222740 230182 206785 179362
12221 179362 154678 160243 162660 143913 144181 137473 132871 140566 162399 204770 195111 175119 189357
12208A89357n407M399m310k3713M865J9393J9912R189K5163q38J6101O683j1326
12195B49468k2036m884J9869K2954j626J1937l463L555K2526L6009N9762O174
12183D00245K4707K5243J8297J9579N8202O0758M9791L4409L7471J6811K2479
12172G67992L9520K7095L3976N8036P143M023P118j8841k2060l7487r0615q2717
12160F93183q0867q1191n1868l9302o3097q1055p1678j7506m4915j5471L5125
12149A81358M454j2624j0697P796J8760j5985L1248L5709k0487l3699l272K9903
12137B12464O1040J3964j4228p952m049O819K5640K4293J8224j4484m260l532
12125C13939J5916n352q843p206O940K5302K9728J9037N0916N0676k572l490J5883
$$ plain form
12208 189357 183950 188349 184039 160326 165191 184584 204496 213685 238848 238010 254111 260794 249468
12195 249468 227432 222548 242417 265371 263745 275682 272219 275774 298300 334309 394071 400245
12183 400245 424952 450195 468492 488071 546273 607031 656822 691231 728702 745513 767992
12172 767992 807512 834607 868583 926619 933762 937785 944903 926062 904002 866515 775900 693183
12160 693183 612316 531125 479257 439955 376858 295803 224125 206619 161704 146233 181358
12149 181358 185812 173188 162491 170287 189047 173062 204310 240019 219532 185833 182561 212464
12137 212464 273504 287468 273240 265288 261239 268058 293698 317991 336215 321731 317471 313939
12125 313939 329855 324503 315660 308454 315394 340696 370424 389461 440377 491053 488481 484991 500874
12112E00874N1930K965L527K7368K6624K8953J6865L9522N8502O8426Q5504P9578
12100I90638R1863J07897J18070P7140P7361P1427R9891R2093J63465K59612L42527
12089B491984M92599N86263O81651P73448P83076O23903M86453L00119J1334k61603
12079F969227m51214n88118o18821o03675n08406m36041k80587j19400K523Q4445
12069C449933J31364K14154K74813K75879L14306L85413M63337N46459O82914
12060F738572Q06332R85548J192654J487724J790123K039036K268314K440744
12052A9749047K558815K756134L084549L580700M441761N864498Q343685J2465113
12044F2844302J8387619K4641472K9348924L3927264L7194174L6698002L0901621
$$ plain form
12112 500874 552804 555769 559296 586664 613288 642241 659106 698628 757130 825556 911060 990638
12100 990638 1082501 1190398 1308468 1385608 1462969 1534396 1634287 1726380 1889845 2149457 2491984
12089 2491984 2984583 3570846 4252497 5025945 5809021 6432924 6919377 7219496 7230830 6969227
12079 6969227 6518013 5929895 5311074 4707399 4198993 3762952 3482365 3362965 3365488 3449933
12069 3449933 3581297 3795451 4070264 4346143 4660449 5045862 5509199 6055658 6738572
12060 6738572 7544904 8530452 9723106 11210830 13000953 15039989 17308303 19749047
12052 19749047 22307862 25063996 28148545 31729245 36171006 42035504 50379189 62844302
12044 62844302 81231921 105873393 135222317 169149581 206343755 243041757 273943378
12037B73943378K2442040J2365653J23105j2857132k4308412l1281684l5245952
12030B05180996l6125294l3871114k8874128k3212382j7466891j2046477q123366
12023D5461344n713368m269259l441714l041153k813711k664209k538317k381356
12015A8598257k206671j934703j699993j414851j140132r37691p54850n89345
12007G920021n25072m70607m09828l29488k94357k73663k48365k34213j73078
11998D961350j59309j13315j30514j18442j69789k39309k51222k40932k58941
11989C279577k15157k41210k03104j61190j43950j78290j58138j29225j27176
11980A722137j18495j19135q2189n4966j02583o5172n3995p3013o8405o5651n0438
$$ plain form
12037 273943378 296385418 308751071 308874176 296017044 271708632 240426948 205180996
12030 205180996 169055702 135184588 106310460 83098078 65631187 53584710 45461344
12023 45461344 39747976 35478717 32037003 28995850 26182139 23517930 20979613 18598257
12015 18598257 16391586 14456883 12756890 11342039 10201907 9264216 8509366 7920021
12007 7920021 7394949 6924342 6514514 6185026 5890669 5617006 5368641 5134428 4961350
11998 4961350 4802041 4688726 4558212 4439770 4269981 4030672 3779450 3538518 3279577
11989 3279577 3064420 2823210 2620106 2458916 2314966 2136676 1978538 1849313 1722137
11980 1722137 1603642 1484507 1402318 1347352 1244769 1179597 1125602 1052589 984184 918533 868095
11969H68095l1537j9316p721k5846j4727R183m814m7462j8513l5183l8143p466
11957F26550J6056l560j9108M64p733l2637m1261q854J0222O293p473j3619k0855
11944E04485j7405j7033p241j0913k4060L2079L0026O014K242o119Q024J245k7774
11931D73570l6684P779p32l2034J6922J2355J9627k5350l915K5352k475k8692
11919D25723m0271j5755m3152j7017k6948n9558n3836n7958q0705q0374q4650
11908a34501q0370r1653o9967k4198R947J7083K5456J8542N1001K6804r902K295
11896b59463R086J9328p261n549L3743K4017L4738L2767L4653O0751L4147J0879
11884B1836K4001K4580L5339J2993r219n088j482k1092K94n662k1236O506L7064
$$ plain form
11969 868095 836558 817242 809521 783675 768948 778131 773317 725855 707342 672159 634016 626550
11957 626550 642606 639046 619938 620402 612669 580032 538771 529917 540139 546432 538959 525340 504485
11944 504485 487080 470047 462806 451893 427833 459912 489938 495952 498194 492075 500099 501344 473570
11931 473570 436886 444665 443933 411899 428821 441176 460803 435453 431538 456890 454415 425723
11919 425723 385452 369697 326545 309528 282580 223022 169186 111228 30523 -49851 -134501
11908 -134501 -214871 -306524 -376491 -400689 -390742 -373659 -348203 -329661 -278660 -251856 -261758 -259463
11896 -259463 -250377 -231049 -238310 -243859 -210116 -186099 -151361 -118594 -83941 -23190 10957 21836
11884 21836 45837 70417 105756 118749 109530 104442 102960 81868 82162 76500 55264 61770 98834
11871I8834K7298P864R428J262j9776l1299m570M553J7283J2553J4781K2412m0752
11858A19871j2583L0647k2182o546L695o947J3048k0279J8232n806j6779k8782
11846F5589J5833J6121j5451k78J1905k7653j1093L3147l4224j5767J1523r31
11834D8721m609j0612p974J0750J3208O208r380j1011j662J6974l028l411J4429
11821E8603Q532r979p698q962j443L773Q862j6495j3010K1220N014L1564J0235
11808I0216o129J185P896k1090J1483j3897k6277k158J8087l6464p089O78k3470
11795g029K252n458j7654J1230K959J9078K1966l992q625k2406k6346K1762K9824
11782A7561R490J0575j7430k3324k5624K4053Q574k263j6725L121j6267k896M0674
$$ plain form
11871 98834 126132 133996 143424 144686 124910 93611 89041 93594 110877 123430 138211 160623 119871
11858 119871 107288 137935 115753 109207 112902 105955 119003 98724 116956 111150 94371 65589
11846 65589 81422 97543 82092 81814 93719 66066 54973 88120 53896 38129 49652 48721
11834 48721 44112 33500 25526 36276 49484 55692 46312 35301 33639 50613 47585 44174 58603
11821 58603 67135 57156 49458 40496 39053 42826 51688 35193 22183 43403 48417 79981 90216
11808 90216 84087 85272 93168 72078 83561 69664 43387 41229 59316 22852 15763 16441 -7029
11795 -7029 -4777 -10235 -27889 -16659 -13700 5378 27344 23352 14727 -7679 -34025 -12263 17561
11782 17561 27051 37626 20196 -3128 -28752 -4699 3875 1612 -15113 -11992 -28259 -31155 9519
11769I519J5277j4057j7755K230k6581Q875K8500J0906P885K3635j1060j7872
11757A9502k7906k180J9759l059j0910J487O340O303N39j5857o049o250M953l0519
11743d3847M31J1536M742K1916o966K4501P748l781l2745j0038K905K1865p83
11730b516M431K0789J4112j8775p248j388m354j0933J2572J3807J3442J8741l1832
11717B0848k4874J4709j3364R561J8275k8036j3055M039J9988j633j295k608J4870
11704A7425j1146K1162r313Q783L746Q59J478J4554K4850J9741M887k3855j5199
11691E7972O707r59O550r826m097k0965j3009P026k7724j8390K0518J5949J5374
11678C5126J3133j756j0190K305l2158m030J0596k3254J2571J4892J1280J8942
$$ plain form
11769 9519 24796 10739 -7016 -4786 -31367 -22492 6008 16914 24799 48434 37374 19502
11757 19502 -8404 -10584 9175 6116 -4794 -3307 3033 9336 9875 -5982 -12031 -18281 -13328 -43847
11743 -43847 -43416 -31880 -27138 -5222 -12188 12313 20061 16280 -16465 -26503 -23598 -1733 -2516
11730 -2516 1915 22704 36816 18041 10793 9405 5051 -5882 6690 20497 33939 52680 20848
11717 20848 -4026 10683 -2681 6880 25155 -2881 -15936 -11897 8091 6458 5163 2555 17425
11704 17425 6279 27441 18128 26911 30657 31516 32994 47548 72398 92139 97026 73171 57972
11691 57972 64679 63720 70270 60444 56347 35382 22373 29399 1675 -16715 3803 19752 35126
11678 35126 48259 46503 36313 38618 6460 2430 13026 -10228 2343 17235 28515 47457
11666D7457P573K2089l9739k3397k3386K6321L8925l578k1378j940l7332j5462
11654b3847J5643J8918K3328j6895R748p020k8147K4938L5458j050k7314L3256
11642E7016K411j5654k3135k1026m29J5789J6447J8622j0085J7651K9014J8973
11630A05594J3509o260K1227K4744j5609N7276L7771K9034N5381M7341J05302
11619D75310J32621J45293J33963J54332J83929J45591R4436M5205k6818p1043
11609A412819j01054j21318j51345j89405j76126j42830j35798q5511m2472P021
11599B73981q83m2321n4371l6168k7445p726K9144j6925j6459m3598j3721K586
11587D6094k218n076K1124J5460P773k5693j5085k86k1703o409j2293l4802J9520
$$ plain form
11666 47457 55030 77119 37380 13983 -9403 16918 55843 52265 30887 28947 -8385 -23847
11654 -23847 -8204 10714 34042 17147 26895 19875 -8272 16666 52124 51074 23760 57016
11642 57016 59427 43773 20638 -388 -817 14972 31419 50041 39956 57607 86621 105594
11630 105594 119103 112843 134070 158814 143205 200481 238252 267286 322667 370008 475310
11619 475310 607931 753224 887187 1041519 1225448 1371039 1465475 1510680 1483862 1412819
11609 1412819 1311765 1190447 1039102 849697 673571 530741 394943 309432 266960 273981
11599 273981 273098 230777 176406 140238 112793 105067 134211 117286 100827 57229 43508 46094
11587 46094 43876 38800 59924 75384 83157 57464 42379 42093 20390 13981 1688 -33114 -13594
11574a3594K3461Q388J175N005o434j1737J9631O296j0569l1446k2892M1775L2826
11561D1885K891k1434l3788J5373J2044j4835k5929j7911K6659J1909j614Q776
11549D026J3210j7571o61N591L121n736J2549O712r22K954k335l0816J8980m430
11535D672j3176J39Q5k3108K8652K7784L40j7549K3258n566k1101k5097O738K015
11521a1914J86K8307J4168P527K9645m054l7400q286J0152j2066m5838k0548N3051
11508B930N0974j478j19j4690j8605K2392J4231R67J556j7746J8605L633k1436
11495D1214m3999k4812K132n752J0943J1330k0738J0855k4896l2016q092L8740
11483d5091J1003J4116L728J9114j1269J054J4425k209l9515m411R005o699J0668
$$ plain form
11574 -13594 9867 18255 19430 24435 18001 6264 25895 32191 21622 -9824 -32716 9059 41885
11561 41885 44776 23342 -10446 4927 16971 2136 -23793 -41704 -15045 -3136 -4750 4026
11549 4026 17236 -335 -996 4595 7716 1980 14529 21241 20319 23273 20938 -9878 9102 4672
11535 4672 -8504 -8365 -8280 -31388 -2736 25048 25388 7839 31097 25531 4430 -20667 -13929 -11914
11521 -11914 -11728 16579 30747 38274 67919 63865 26465 18179 28331 16265 -29573 -50121 2930
11508 2930 53904 52426 52307 37617 19012 41404 55635 56602 58158 40412 59017 62650 41214
11495 41214 -2785 -27597 -25465 -31217 -20274 -8944 -29682 -18827 -43723 -75739 -83831 -45091
11483 -45091 -34088 -19972 -16244 2870 -8399 -7345 7080 4871 -34644 -39055 -30050 -36749 -26081
11470b6081N090k873o968R371L7106j7392k8700j8769R417N4128J7588j3147l054
11457A5716j3883R756Q409j2285M44j2461J1379J5023L447N062o763J909j6435
11444I318Q629J1678j0701r770J6447K7891k639L3797j578k4277k0460j0344M059
11431C2050m846n566m356m147K3407j81r386j6311j0865P013L6420J5033l3215
11418B5050j7366M817k2106j0217k4056J1144K7981m129k44K3693Q784J1857J2109
11405D7317L345j1235k489L098n235n085J971l1041j5824J0482J8556J5729K9116
11392E8705j9107k9853L165j2705k376M479J0412J5371J7110l5200l6178K187
11380b3990k07k719q832k054R741j3308L0636M8018R155q44k5186k1969J7252
$$ plain form
11470 -26081 -20991 -23864 -30832 -21461 15645 -1747 -30447 -49216 -39799 14329 31917 18770 15716
11457 15716 1833 11589 19998 7713 8157 -4304 7075 22098 25545 30607 23844 25753 9318
11444 9318 17947 29625 18924 9154 25601 53492 50853 84650 83072 58795 38335 27991 32050
11431 32050 27204 21638 17282 13135 36542 36361 26975 10664 -201 6812 43232 58265 25050
11418 25050 7684 12501 -9605 -19822 -43878 -32734 -4753 -8882 -9126 14567 23351 35208 47317
11405 47317 50662 39427 36938 40036 34801 29716 31687 646 -15178 -4696 13860 29589 58705
11392 58705 39598 9745 12910 205 -2171 2308 12720 28091 45201 10001 -26177 -23990
11380 -23990 -24197 -26916 -35748 -37802 -28061 -41369 -10733 37285 46440 45596 20410 -1559 15693
11367A5693L8213M480j4590L342J1014m8452J727N785k423L194q8j3647K3499
11354B7747O433r637j3610j8281N898M65J7618L2294m433k7323q381n41j278J1081
11340A8052J600q090k0119m715r76m793J2076K7038Q685L875j759r480P648J0447
11326C9489j973m813q31J1486L339Q530R737k8701q898K563o153J4801K157j5722
11312B5011j1816J6873K4641P508k202o041P176J4297q521l4305L633L825J2669
11299E2748j7531j3891m122K4890M0047J4952p352k3727l8667L155P140n947N83
11286C2278m244J410N632K0930J1368k6412l2353J2562j7361J704K4118J9222
11274D8854J1526R498K5573j3349K210j8907k6820j0721K1451K1363j0338J0156
$$ plain form
11367 15693 53906 58386 43796 47138 58152 9700 11427 17212 14789 17983 17895 4248 27747
11354 27747 34180 24543 10933 -7348 -1450 -985 16633 48927 44494 17171 8790 8249 6971 18052
11340 18052 19652 11562 -8557 -13272 -14248 -19041 -6965 20073 28758 32633 30874 21394 29042 39489
11326 39489 37516 32703 31872 43358 46697 55227 64964 36263 27365 29928 23775 38576 40733 25011
11312 25011 13195 30068 54709 62217 60015 53974 61150 75447 66926 32621 36254 40079 52748
11299 52748 35217 21326 17204 42094 82141 97093 89741 66014 27347 30502 37642 31695 32278
11286 32278 28034 29444 35076 56006 67374 40962 8609 21171 3810 5514 29632 48854
11274 48854 60380 69878 95451 82102 84312 65405 38585 27864 49315 70678 60340 70496
11262G0496J1807R705k2265j8947J537R004p963j9040J5066n941o445l12l318
11249C3384N253n988o852J0853r221k8559K2433M820R071Q193k3673M999K5798
11236E0511K6239j991k1099j3742N420k5723P113K882J3550N050J7469J852j3837
11223E3694k3p326R034J7322O21j0573L1504N2326n9197n4414K3744K283l520
11210E5475J1409R254j139O87m036j729L69p515J8433J0926j5160j2012L1222
11197I6184o790J3989L0944j3030k7773k9028n078M288j6644j8866l180K4773
11185D9789N195O878m911O438k230k5926K1403K2386n757q731j841M584J1721
11172G8998j2349J134K1166j4423N987K052N404O02j2925l5074j2753j2143N885
$$ plain form
11262 70496 82303 92008 69743 50796 52333 61337 53374 34334 49400 43459 37014 36702 33384
11249 33384 38637 32649 25797 36650 27429 -1130 21303 26123 35194 43387 19714 24713 50511
11236 50511 76750 74759 53660 39918 45338 19615 26728 29610 43160 48210 65679 67531 53694
11223 53694 53671 46345 55379 72701 73322 62749 94253 146579 87382 32968 56712 58995 55475
11210 55475 66884 76138 74999 75686 71650 69921 70290 62775 81208 92134 76974 64962 96184
11197 96184 89394 103383 134327 121297 93524 64496 59418 63706 47062 28196 25016 49789
11185 49789 54984 61862 56951 63389 61159 35233 56636 79022 73265 64534 62693 67277 78998
11172 78998 66649 67783 88949 74526 80513 82565 87969 88571 75646 40572 27819 15676 21561
11159B1561J2138j8297L144J5290L431J3737K926j2192j4001N88J7295J6158J204
11146F2982K5079J0047L2480l3724r598K6846k3826n2375k3892J6374K2606k057
11134E0942R547Q870O503L742j0016l741K2277j8428k0993r158L6589J8505k99
11121I4340j4441J3788m241J0949m912j2892j9719k7858l769Q571J9658L4601
11109I4075q321j6224k032l4066J9951M1163r121m4518k2898k259K9922J8774
11097F4446j4370J4542K130k7758j7232n499M05K0553L476j0264j9172K785M638
11084A8680J0195K501Q735K3063j5162j4081J5753N917R544j9339J6398k1016
11072D1188K1520J3526m742k0023Q86k4985k5103N2704L7231j440l9630J0085
$$ plain form
11159 21561 33699 15402 18546 33836 37267 51004 53930 41738 27737 28325 45620 61778 62982
11146 62982 88061 98108 130588 96864 87266 114112 90286 37911 14019 30393 52999 50942
11134 50942 60489 69359 75862 79604 69588 65847 88124 69696 48703 39545 76134 94639 94340
11121 94340 79899 93687 89446 100395 95483 82591 62872 35014 31245 39816 59474 94075
11109 94075 85754 69530 67498 33432 53383 94546 85425 40907 18009 15750 45672 64446
11097 64446 50076 64618 66748 38990 21758 16259 16664 37217 40693 30429 11257 14042 18680
11084 18680 28875 31376 40111 63174 48012 33931 49684 55601 65145 45806 62204 41188
11072 41188 62708 76234 71492 51469 52355 27370 2267 54971 92202 90762 51132 61217
11060F1217j0111N812L716J9200J773k0769p531j6194J5152J805r028M2456P087
11047I4585k7536k4836m107J9746J9715J6299n828j4048J706k276J4369k1025
11035F6764K588K1168L169j993m597m973Q509k1796o944L9855K5038j6911p071
11022A02806l130l239l1307j4612J7907K7697N949p616j2452o761J262j1461J4624
11009G9667Q702K6221Q281p46K5856k3923m7278L7789n019j5739M435j3834k851
10996H1561J6128J7024j504K304k0007j0467J0837Q278j7674l451R146j6678j3829
10983F1668J3369R321j1865r503K8936K3065N407J5265n706j0349j9125J5755
10971A16238J9375M216j084k3441j8535K0981p455P911j6257n651R589j701j2945
$$ plain form
11060 61217 51106 56918 60634 79834 81607 60838 53307 37113 52265 54070 45042 87498 94585
11047 94585 67049 42213 38106 57852 77567 93866 88038 73990 75696 73420 87789 66764
11035 66764 69352 90520 93689 91696 87099 82126 90635 68839 61895 101750 126788 109877 102806
11022 102806 99676 96437 65130 50518 68425 96122 102071 94455 82003 75242 76504 65043 79667
11009 79667 88369 114590 122871 122125 147981 124058 76780 114569 109550 93811 98246 84412 81561
10996 81561 97689 114713 113209 115513 95506 85039 95876 104154 86480 83029 92175 75497 61668
10983 61668 75037 84358 72493 62990 91926 114991 120398 135663 129957 119608 100483 116238
10971 116238 135613 139829 138745 115304 96769 117750 110295 118206 101949 96298 105887 104186 91241
10958I1241J2299K6104j6486j698m02P08K5403n202k374m935K3768l74j1783n207
10944A31062J7452l245j1772j0151K5922J0321k7774L180j3087J9212J8189j4396
10932A44913m45r096N828J6505K3917K0953j6408n360k150q015r365L891M1503
10919B06671Q612P681K3586O993j2959J2298K3548L1787L5927k4425K1913M114
10907C45746L8438P3433N7460L4127Q8454J00819M7315M1766K1241j3713k7672
10896H07414l1412l4748n4308m8099m2830k8059j346O511P956l969K4521L9290
10884F40921K9611J8976M0074K9019J5307J6864k0249j5635K0828M8192M1162
10873H65070N7582K5710m259o014L0624M14l1929k8121l7528m8094k8289j907
$$ plain form
10958 91241 103540 129644 113158 111460 111058 111766 137169 131967 129593 124658 148426 148052 136269 131062
10944 131062 148514 145269 133497 123346 149268 159589 131815 134995 121908 141120 159309 144913
10932 144913 144468 135372 141200 157705 181622 202575 186167 180807 178657 170642 161277 165168 206671
10919 206671 215283 222964 246550 253543 240584 252882 276430 308217 344144 319719 341632 345746
10907 345746 384184 457617 515077 549204 637658 738477 785792 827558 848799 835086 807414
10896 807414 776002 741254 686946 638847 596017 567958 566612 573123 581079 577110 601631 640921
10884 640921 670532 689508 729582 758601 773908 790772 770523 754888 775716 823908 865070
10873 865070 922652 948362 944103 938089 968713 969127 937198 909077 871549 823455 795166 793259
10861G93259l0261o999j828L510j0439m1014j6322k5167m7349j4931J7615J2595
10849F32669K137j8414m380R077K4254J6750L5980M6797O345L7007K4493l0951
10837G81764j5494k1820n3227n1120l6336n5235p0729m2191j4212l7089k0156
10826C64155l3825k2997j2964k381J3607m225j9280m531l947J928Q123k0305N550
10813B68908Q08M998O093L266K340j310k3811j4015q724o418q296J031j0406J1171
10799B25635K5722J304J1657n582J9283J0695O782M565j8329j8201k445j9216
10787B41870O24L404n386J3100J1677m429K516l339K0192K5525j4806M093K9513
10774C24554J0082L861J6018L3231K8526L29q459L713j4551l533J8312r788l670
$$ plain form
10861 793259 762998 755999 754171 757681 747242 706228 689906 664739 617390 602459 620074 632669
10849 632669 634806 616392 612012 621089 645343 662093 698073 744870 751215 788222 812715 781764
10837 781764 766270 744450 691223 640103 603767 548532 477803 435612 421400 384311 364155
10826 364155 330330 307333 294369 291988 305595 301370 282090 277559 273612 275540 283663 263358 268908
10813 268908 269716 274714 280807 284073 286413 285103 261292 247277 238553 232135 223839 224870 214464 225635
10799 225635 251357 252661 264318 258736 278019 288714 295496 300061 281732 263531 261086 241870
10787 241870 242494 245898 240512 253612 265289 260860 263376 260037 280229 305754 290948 295041 324554
10774 324554 334636 338497 354515 387746 416272 416601 408142 411855 397304 393771 412083 402295 398625
10761C98625j2025p528j8276m899p626l465n1l784k1766K8034q64q546L6608J0440
10747C84877J2438K3581J7301n257j4339K9169J2922r971J3082l029m0774k3728
10735C96272j776k0234J3303K2271Q818R665K3074M165R280M100O555K9235K1524
10722E26252J1936L2774L7054k3015k7059o886m244k1621q853J2463j1151O43
10710E18293j0346O800N359K34j2430J8402P156o1188m434K4828j6264J6542m145
10697D88807r474r431n052K6456J9465J6147j5489J1651j3871j4155n104Q454
10685D98404j3882K6472k0264o531J8042K1397L0301J2559k9577K097j7685n056
10673E16277r995P780J6848p067j9657o363p630j3723M220J2151j6677J6222K9355
$$ plain form
10761 398625 386600 379072 360796 355897 348271 344806 344755 340971 319205 347239 346375 337829 374437 384877
10747 384877 397315 420896 438197 432940 418601 447770 460692 450721 463803 460774 420000 396272
10735 396272 394496 374262 387565 409836 418654 428319 451393 455558 464838 468938 475493 504728 526252
10722 526252 538188 570962 608016 585001 557942 551056 546812 525191 516338 528801 517650 518293
10710 518293 507947 514747 520106 520340 507910 526312 533468 472280 467846 492674 476410 492952 488807
10697 488807 479333 469902 464850 491306 510771 526918 511429 523080 509209 495054 489950 498404
10685 498404 484522 510994 490730 484199 502241 523638 553939 566498 536921 539018 521333 516277
10673 516277 506282 514062 530910 523843 504186 497823 490193 476470 480690 492841 476164 492386 521741
10660E21741M0428J1384J0835k0143k4314J2412K9050L038J233r955m460o111
10648E65138r949k2165l172O940J1572j732R587K1742J6276O767N98M0361J4597
10635F56560Q758k069O254l701m872K3165K8367o349K4690M4245J5810K9798K6512
10622H47168K37K7252N4652L3447L1146L4917K0920j970L0159K4296j041K2975
10610A124158M1409K7887k2236m544K59N363K5636J6985L0953K6102L7326R925
10598A319223L2752L5172M506K3892L6936L039J2684J9077j5578k7959q259n827
10586A429658J5196L8227K9447o160j2338l3448k8954j3150o023J3581K7989j1004
10574A443021l7766O110J1371k2733R796K2866K3955J2592J6783Q899L2472M6749
$$ plain form
10660 521741 562169 573553 584388 564245 539931 552343 581393 584431 585664 575709 571249 565138
10648 565138 555189 533024 529852 536792 548364 546632 556219 577961 594237 601004 601602 641963 656560
10635 656560 665318 663249 669503 665802 660930 684095 712462 706113 730803 775048 790858 820656 847168
10622 847168 847405 874657 929309 962756 993902 1028819 1049739 1047769 1077928 1102224 1101183 1124158
10610 1124158 1165567 1193454 1171218 1166674 1166933 1172296 1197932 1214917 1245870 1271972 1309298 1319223
10598 1319223 1351975 1387147 1391653 1415545 1452481 1455520 1468204 1487281 1471703 1443744 1435485 1429658
10586 1429658 1444854 1483081 1512528 1506368 1494030 1460582 1431628 1418478 1412455 1426036 1454025 1443021
10574 1443021 1405255 1411365 1422736 1400003 1409799 1432665 1456620 1469212 1485995 1494894 1527366 1574115
10562A574115L7084P579M578L5778L1749M5408L9207K3534L1053Q552N6410L7834
10550A932881J3024K5031K9376L0319K0101L4320L8418K7998L6092J7472K7576
10539B232608O2738M8541M3266P7219P4074O7839P6674Q3348P1150P5473J23189
10528C036119J12744J26381J54681J44610J37616J75249J62810J52659J66477
10519D369346K10668K16822K34645K48464K88938L07397L57563L69128M04357
10510G007328M36921M95875N41561N91397O80525P52880P98409R03066J050824
10501A3258786J207619J393431J610343J841891K114534K454591K835663L342646
10493C0059504L903771M577392N361871O350921P498268Q884544J0422880J1913558
$$ plain form
10562 1574115 1611199 1618778 1623356 1659134 1690883 1736291 1775498 1799032 1830085 1838637 1895047 1932881
10550 1932881 1945905 1970936 2000312 2030631 2050732 2085052 2123470 2151468 2187560 2205032 2232608
10539 2232608 2295346 2343887 2387153 2464372 2538446 2606285 2682959 2766307 2837457 2912930 3036119
10528 3036119 3148863 3275244 3429925 3574535 3712151 3887400 4050210 4202869 4369346
10519 4369346 4580014 4796836 5031481 5279945 5568883 5876280 6233843 6602971 7007328
10510 7007328 7444249 7940124 8481685 9073082 9753607 10506487 11304896 12207962 13258786
10501 13258786 14466405 15859836 17470179 19312070 21426604 23881195 26716858 30059504
10493 30059504 33963275 38540667 43902538 50253459 57751727 66636271 77059151 88972709
10485H8972709J2890451J2824053J1136981P744440L204193j586196n646667q264470
10477A21275494r385213r161284q037569o401126m585234k780824r56388P70396
10469H0738252K402442L881811M961757N498087N350601M582319L349584K108862
10461A12873715J399295J462989K313523L726644N385890O839154P666544P481340
10453A49149094O114856L639045M17449k931547n716110p432360p908526p311428
10445A28020473o000422m356653k876909k041640j932185k473004l425815m315818
10437A00598027m859498m906898m401849l445337k258766r07917N48022K028992
10429H2394776L504168M951169O207383P034500P164547O331896M291967J199714
$$ plain form
10485 88972709 101863160 114687213 125824194 133568634 136772827 135186631 129539964 121275494
10477 121275494 111890281 102728997 94691428 88290302 83705068 80924244 79967856 80738252
10469 80738252 83140694 87022505 91984262 97482349 102832950 107415269 110764853 112873715
10461 112873715 114273010 115735999 118049522 121776166 127162056 134001210 141667754 149149094
10453 149149094 155263950 158902995 159320444 156388897 150672787 143240427 135331901 128020473
10445 128020473 122020051 117663398 114786489 112744849 110812664 108339660 104913845 100598027
10437 100598027 95738529 90831631 86429782 82984445 80725679 79817762 80365784 82394776
10429 82394776 85898944 90850113 97057496 104091996 111256543 117588439 121880406 123080120
10421A23080120k414959n899969q580217j0155529j0583023j0162002r303635
10414F5980786q179624p008991n969620n035049m244541l620654l089851k664382
10406B6168074k315100k046733j804657j605940j433251j282878j167966j007324
10398A3504225q97781p97026p26289o69505n75969n19027n07262m86345m43158
10389G881863l86799l55048l46015l09153l09102k60170k39231k42637k48632
10380E185076j91172j86776j84653j75754j53337j42194j36952j28219j37083
10371C748936j67241j40378r9700j04425j01535q9433r1069r0747j01667j15197
10361B647544q9605r2537r5092q6228q7410r7622q5742r3416m5522n8176m7716
$$ plain form
10421 123080120 120665161 114765192 106184975 96029446 85446423 75284421 65980786
10414 65980786 57801162 50792171 44822551 39787502 35542961 31922307 28832456 26168074
10406 26168074 23852974 21806241 20001584 18395644 16962393 15679515 14511549 13504225
10398 13504225 12606444 11809418 11083129 10413624 9837655 9318628 8811366 8325021 7881863
10389 7881863 7495064 7140016 6794001 6484848 6175746 5915576 5676345 5433708 5185076
10380 5185076 4993904 4807128 4622475 4446721 4293384 4151190 4014238 3886019 3748936
10371 3748936 3581695 3441317 3341617 3237192 3135657 3046224 2955155 2864408 2762741 2647544
10361 2647544 2557939 2465402 2370310 2284082 2196672 2099050 2013308 1919892 1874370 1816194 1768478
10350A768478j7427n4448q9245l5533l5484k0992q584k4335j661k1054o2324n6913
10338A340478l2962j3683m6080n2554m1046k7970j4131j5459l7866j2797j0687
10327A035243l0581j7327n4926l9437o168N019j7529k2916j7192Q153q236n154
10315H28949J8516J6912N483N910K572O123J2801K7285M9431P8745K8592L3451
10303A114770L6822K03m2644o7519k9816k5281n2858o9078q5422q5770m8045m3235
10291F02127m1981k303j9105q056p397o686q812n529N611m725j1289L2610K6530
10278E50995L5299L6240J6974J9029K327j7738k3253m7188k6754M744j633k7437
10266E21605k7684R241q203m983O5430O4477J2755K0842L8363J1498l4508m4197
$$ plain form
10350 1768478 1751051 1696603 1607358 1571825 1536341 1515349 1506765 1482430 1480769 1459715 1397391 1340478
10338 1340478 1307516 1293833 1247753 1195199 1154153 1126183 1112052 1096593 1058727 1045930 1035243
10327 1035243 1004662 987335 932409 892972 886804 891823 874294 851378 834186 842339 834103 828949
10315 828949 847465 864377 869860 875770 878342 884465 897266 924551 973982 1052727 1081319 1114770
10303 1114770 1151592 1151795 1109151 1041632 1011816 986535 933677 864599 779177 693407 645362 602127
10291 602127 560146 557843 538738 530682 523285 516599 507787 502258 507869 503144 491855 524465 550995
10278 550995 586294 622534 639508 658537 660864 643126 619873 572685 545931 550675 549042 521605
10266 521605 493921 503162 494959 489976 555406 619883 632638 653480 691843 703341 668833 624636
10254F24636l0947l1345q942l1497k1600k5341l8888j7546L938M5874K4196P770
10242E00308J2435J2455J6239K4809K5997K0506n28j9603N029J7296O1322P4500
10230G50765Q1435O9813Q7592J41215J39594J24210J21402L7769J4083J1149j3784
10219A565243l6568q9717n9471k8468m0947q6658q1350l3005n1713j05118p9316
10208H72912q3742q7085r2622n4957o5521l4379m9746l1302j9689o928j3238K4050
10196C57753j9652k8961o499k0833k0584K8657L2453K803l4903j5256R633K550
10184B87161l2918k44k0215k1436k9037j9354K1295J1757k5836l2350j4956K3043
10172A46910L2699K0073O758K9991J1497q04J025j953K9912j131J8947k045o7652
$$ plain form
10254 624636 593689 562344 553402 521905 500305 474964 436076 418530 422468 468342 492538 500308
10242 500308 512743 525198 541437 566246 592243 612749 612221 592618 597647 614943 676265 750765
10230 750765 832200 902013 989605 1130820 1270414 1394624 1516026 1553795 1567878 1579027 1565243
10219 1565243 1528675 1438958 1379487 1351019 1310072 1223414 1142064 1109059 1057346 952228 872912
10208 872912 789170 702085 609463 554506 488985 454606 404860 373558 353869 346941 333703 357753
10196 357753 338101 309140 302641 281808 261224 289881 322334 325137 290234 274978 284611 287161
10184 287161 254243 253999 233784 212348 183311 163957 185252 197009 171173 138823 123867 146910
10172 146910 179609 199682 206440 236431 247928 247124 248149 246196 276108 274977 293924 291879 224227
10159B24227l4912K1962J1055O496K4459k4808l9456k4978J4781L8695J9142m52
10147B36211K411j2969J5791n855m663K0256N5945M6604Q5770R5159J04719J19478
10135G58857Q9672P1235O5933O6705N7152M345J9146J6578K2214K0908n3005l2320
10123A107420m9666q4671o8046k2271k6717l8068k4613k5963l1172o7592o4156
10112F04485q8643r5953r6348m4324j5195r411k4789J7995m8043m0002K4810O453
10100A91035J5924l3385j6490M756j3622n549k0506j2529J3158K7252N786J2809
10088A68639J5186L0901K9070L135J9153K1526r646j1988j8152k8767k392j437
10076B15228k0041k8341K1971K5176J4816J4058K3007J0174J2475M4658N1012
$$ plain form
10159 224227 189315 211277 222332 228828 253287 228479 189023 164045 178826 217521 236663 236211
10147 236211 238622 225653 241444 235589 230926 251182 307127 353731 439501 534660 639379 758857
10135 758857 848529 919764 985697 1052402 1109554 1113899 1133045 1149623 1171837 1192745 1139740 1107420
10123 1107420 1057754 973083 905037 882766 856049 817981 793368 767405 736233 668641 604485
10112 604485 515842 419889 323541 279217 264022 254611 229822 247817 199774 159772 184582 191035
10100 191035 206959 173574 157084 161840 148218 142669 122163 109634 122792 150044 155830 168639
10088 168639 183825 214726 243796 246931 266084 287610 277964 265976 247824 219057 216665 215228
10076 215228 195187 166846 188817 213993 228809 242867 265874 276048 288523 333181 384193
10065C84193L7833M9380O0849L0820N6307P6518O7592N2887K4684K8705K2715
10054H92483N235L365L5806J17456K24678L30054O5299j09363j10561k64825j90779
10043I98848r8387k8985k2324k3503n665P39l1875l5008j5519R926K6165Q967
10031G83379K0012L7882L0919J7627k078k1825l4961j8833l7934l3031k6885j8103
10019F96169k0596j1401k9223m1155k412M765j1582j8272k4034j0511k4765K108
10007E09091j6505J6820r018L5259M8304J9621K4316Q484j1234J0774k0903l3073
9995E81936j8693l2206m9203m6101k2778j7741k1700l0305l0837k2002l8988l5705
9983B15677k6122l0871j0625N981n835l5642J3325J4734l601j3207l7674Q654
$$ plain form
10065 384193 422026 471406 532255 563075 619382 695900 763492 816379 841063 869768 892483
10054 892483 897718 901083 936889 1054345 1279023 1609077 1674376 1565013 1454452 1189627 998848
10043 998848 900461 871476 849152 825649 819984 820723 788848 753840 738321 748247 774412 783379
10031 783379 803391 841273 872192 889819 887741 865916 830955 812122 774188 741157 714272 696169
10019 696169 675573 664172 634949 593794 591382 596147 584565 566293 542259 531748 506983 509091
10007 509091 492586 509406 500388 535647 583951 603572 627888 636372 625138 635912 615009 581936
9995 581936 563243 531037 481834 435733 412955 395214 373514 343209 312372 290370 251382 215677
9983 215677 189555 158684 148059 154040 148205 112563 125888 140622 137021 123814 86140 94794
9971I4794n97l0168j7545M660K054j730k1873J3572K8967k8120j5808J299N960
9958C5465n193j7016k7185M469O687Q247Q955K0889l440j771j8792P867K96K1568
9944D1046J8044q109j1917J042m30j2080j4691J257k0869k4253J7585K6703L586
9931A6914p127q119K184k0812L853P982j915J4838J4788K3101j2166k9490k9279
9918b5248m713K5467J4464k3447m032J2099j3323m774Q158K3551J286J3877q3
9905B3282j7579k747r199O535L754J5432l866l935L5343O193m25l1752q606M3353
9891E5783k421m523q09K195j946j8807j7527J4536L428r890p093J5021k281O341
9877C2007Q792k2629k3363j6849k7792L4322L1845J6639p742k1831J3635r087
$$ plain form
9971 94794 94197 64029 46484 51144 53198 51468 29595 43167 72134 44014 28206 29505 35465
9958 35465 30272 13256 -13929 -9460 -2773 5474 14429 35318 31878 30107 11315 19182 19478 41046
9944 41046 59090 50981 39064 40106 39676 27596 12905 14162 -6707 -30960 -13375 13328 16914
9931 16914 9787 1668 3852 -16960 -13107 -5125 -7040 7798 22586 45687 33521 4031 -25248
9918 -25248 -29961 -4494 9970 -13477 -17509 -5410 -18733 -23507 -15349 8202 9488 23365 23282
9905 23282 5703 2956 -6243 292 4046 19478 15612 11677 47020 53213 52788 21036 12430 55783
9891 55783 53362 48839 48030 50225 48279 29472 11945 26481 29909 20019 12926 27947 25666 32007
9877 32007 40799 18170 -5193 -22042 -49834 -15512 16333 32972 25230 3399 17034 7947
9865G947j0442m4621r244J2784L640J6931K9716j477L605J4131Q070j605j3084
9852A6351J274k643J4891K1518M187J3125k9115m7580M52K3030J165N130j1356
9839A0429k862P963N16J8203J5040j6476k4659J6383o812j2062M8j0582q935J0268
9825c538J4223K188L448K0848j8526J858m875j8904K474K0044J8320K0491K090
9812F0141j80l2672r789J0309j2165o918k639J2982J3103q100L357j9770R418
9799A7077R87q640j4229K4287N203j2958R21j7058J6610J363J4309J8138j1034
9786C4976n864l915o825p757J0499J9711J6157k8253j7497j3376j5880J1957n704
9773a1771m4321o306J5624M2523J6570J4707j2239r103l662l735j825k96K396
$$ plain form
9865 7947 -2495 -47116 -56360 -43576 -39936 -23005 6711 5234 8839 22970 31040 29435 16351
9852 16351 17625 14982 29873 51391 55578 68703 39588 -7992 -7540 15490 16655 21785 10429
9839 10429 7567 15530 16046 34249 49289 32813 8154 24537 17725 5663 5711 -4871 -13806 -3538
9825 -3538 10685 12873 16321 37169 18643 20501 15626 -3278 -804 19240 37560 58051 60141
9812 60141 59961 27289 17500 27809 15644 8726 6087 19069 32172 24072 27429 7659 17077
9799 17077 18064 9424 -4805 19482 24685 11727 12648 -4410 12200 13563 27872 46010 34976
9786 34976 29112 25197 18372 10615 21114 40825 56982 28729 11232 -2144 -18024 -6067 -11771
9773 -11771 -56092 -62398 -46774 -4251 12319 27026 14787 5684 2022 -1713 -3538 -3834 -1438
9760a438m160p826J1209J3124M224j99J8088j0576l5011p047R972j0097k462J2355
9746i844J3216J9474j1670j8615j235j6775k5344J9646J4875O816J1751k8031
9734b5736p762k158K9635L3886J6155L450j3082q402m428J2218J9152n181p197
9721D0550Q395J3045N159l4679k4257J9713J6201o894l1549J1124o016r752n1
9708I89Q300l705j2356j0306o714k918j968K6779J2388j6474k0366J8109K9374
9695B1132M914K3527J0453l0137J8864r177q351K6997N450R61j6130j6192r979
9682B2332K3219O006l7365p803j2439J845q796j778J4769J3978j3402j100K532
9669A998J339L245K1730J4579m7528p833K3020J1087N273P465M755k904l708j3057
$$ plain form
9760 -1438 -5598 -13424 -2215 10909 15133 14934 33022 22446 -12565 -19612 -9640 -19737 -22199 -9844
9746 -9844 3372 22846 11176 -7439 -8674 -25449 -50793 -31147 -16272 -9456 2295 -25736
9734 -25736 -33498 -35656 -6021 27865 44020 47470 34388 25986 21558 33776 52928 47747 40550
9721 40550 48945 61990 67149 32470 8213 27926 44127 37233 5684 16808 10792 1040 989
9708 989 9289 5584 -6772 -17078 -23792 -26710 -28678 -1899 10489 -5985 -26351 -8242 21132
9695 21132 26046 49573 60026 29889 48753 39576 31225 58222 63672 64633 48503 32311 22332
9682 22332 45551 51557 14192 6389 -6050 -4205 -13001 -14779 -10 13968 566 -534 1998
9669 1998 3337 6582 28312 42891 -4637 -12470 10550 21637 26910 34375 39130 36226 32518 19461
9655A9461J6287J1830M491k6233J0214j7142l7775j8924J4766L3536j2840R223
9643F894j0541j7344J9991J4647J1889P456k2146l6307J3913K6187K4893r147
9631C0385m526j4333R21K87j7125j0976J3839J4629K2054j8107j3957K6995J3629
9618D3715k2038K809m695N07j1537j789P606J4059M540J796O706Q366J463j1936
9604C9572m282n531J9502K783J9958j1565k9637j7650r947K8887K4570Q324n224
9591E9760O441M900J803j2671K1306q164j4718k0808l665n917k386Q014k4315
9578I580l4779J5633J6543O123J1330J1570M451P236k9676j1200M917J8403J8374
9565D8505o421J5873l644l293K2022J4180j2129j7213j3117J760q16q114n387
$$ plain form
9655 19461 35748 47578 52069 25836 36050 18908 -18867 -37791 -23025 10511 -2329 6894
9643 6894 -3647 -20991 -1000 13647 25536 32992 10846 -25461 -11548 14639 39532 30385
9631 30385 25859 11526 12447 12734 -4391 -15367 -1528 13101 35155 17048 3091 30086 43715
9618 43715 21677 24486 19791 20298 8761 6972 14578 28637 33177 34973 41679 50045 51508 39572
9604 39572 35290 29759 49261 52044 72002 60437 30800 13150 3203 32090 56660 64984 59760
9591 59760 66201 71101 72904 60233 81539 73375 58657 37849 34184 28267 25881 33895 9580
9578 9580 -25199 -9566 6977 13100 24430 36000 40451 47687 18011 6811 11728 30131 48505
9565 48505 42084 57957 54313 51020 73042 87222 75093 57880 44763 46523 45707 37593 32206
9552C2206K9765J3294m0660p668L1737j5130o193N9L3096K338r864m622P671k069
9538F3960j2154k385k6149l5900k0403j7241K8118J2117K7399r711Q243K084m097
9525A3881m490J9035O731k647j7400n131j869J7212J3793M0024K432M819L718
9512I0108l799K0213j350k8473p907j8448q001j9420L561L997M023L2035M327
9499G0866k0752m1656k2439K659O880J8092K665Q930K1888M349k5696J7419K4051
9486F7256K727J9354O817j0647j1966J609q342m762J8835K225l1741J404J0516
9473F3285R404K2308j0006q576N79m968l544j0999J6658J115q738L6604j0290
9460I2832n056L267k0197R193n602O545J1712k0440j5335J9742K5791J1837J7527
$$ plain form
9552 32206 61971 75265 34605 26937 58674 43544 37351 37410 70506 72844 62980 58358 66029 63960
9538 63960 51806 49421 23272 -12628 -33031 -50272 -22154 -10037 17362 7651 15894 17978 13881
9525 13881 9391 28426 35157 32510 15110 9979 8110 25322 39115 79139 81571 86390 90108
9512 90108 86309 106522 105172 76699 68792 50344 42343 22923 26484 30481 34504 66539 70866
9499 70866 50114 8458 -13981 -11322 -4442 13650 16315 25245 47133 51482 25786 43205 67256
9486 67256 69983 89337 96154 85507 73541 75150 66808 62046 80881 83106 51365 52769 63285
9473 63285 72689 94997 84991 76415 76994 72026 68482 57483 74141 75256 66518 103122 92832
9460 92832 87776 91043 70846 80039 74437 80982 92694 72254 56919 76661 102452 114289 131816
9447A31816Q018K72R66K1024j4307j7618n548J4561K9210M0298P789n236l5277
9434A75968J0964J0658O333j4190K174J5701j3835J3031K4397l369k1641Q597
9422B14788N433j285J8289K0971J5079K464K3471K832J3936J4549m178J9991J9561
9409C65901L3416N0105J2991j6630Q305N7125N1960Q204J6867J4330M1684L1271
9397F75529K4668O1665O7104O7616K2032L6627M8594P2062M8970P1876R2764P4216
9385A363723R3299J21612J18667J27004J52645J68140J52865J54510K02915J86035
9375B841415J82270J90225J98083K03477J66139J52605J39373J13832N5801j388
9365D241832m837q6295q5709r9531j44347j90459j77836j72686j92487j88172
$$ plain form
9447 131816 139834 140106 141072 162096 147789 130171 124623 139184 168394 208692 216481 211245 175968
9434 175968 186932 197590 203923 189733 191907 207608 193773 206804 231201 227832 206191 214788
9422 214788 220221 218936 237225 258196 273275 275739 299210 302042 315978 330527 326349 346340 365901
9409 365901 399317 449422 462413 445783 454088 511213 563173 571377 588244 602574 644258 675529
9397 675529 700197 761862 828966 896582 918614 955241 1003835 1075897 1124867 1196743 1289507 1363723
9385 1363723 1457022 1578634 1697301 1824305 1976950 2145090 2297955 2452465 2655380 2841415
9375 2841415 3023685 3213910 3411993 3615470 3781609 3934214 4073587 4187419 4243220 4241832
9365 4241832 4236995 4150700 4064991 3965460 3821113 3630654 3452818 3280132 3087645 2899473
9355B899473j41026j74992j78717j53707j61910j42827j18205j36299j04432p8840
9345A508518j07495j35209q8435l0917l5809j8851l0544m0829j06553q3782o3462
9334G66632j7177k5888n4692l6234k5979m5010k0474l0506j7628j1177k7489k5816
9322D28562o095J6163l7244k7882j2836Q742k0127n4147j8334j6835j1565p961
9310B40441J6472J4133j6350J2862Q457j6588k4663q124R030j7924L690R585J2887
9297B43908J8027L994M211k8044k8064m2958l286J2549K1309K6136m59j233k7211
9284A98879j7375q050M073j9204m9674K5236J1262j454J478J7687K107m9868j6255
9271I8842O405m652l2887j0931r856k0414L2956L4635K655j2254J8293K8621R911
$$ plain form
9355 2899473 2758447 2583455 2404738 2251031 2089121 1946294 1828089 1691790 1587358 1508518
9345 1508518 1401023 1265814 1177379 1146462 1110653 1091802 1061258 1020429 913876 830094 766632
9334 766632 749455 723567 668875 632641 606662 561652 541178 510672 493044 481867 454378 428562
9322 428562 422467 438630 401386 373504 360668 369410 349283 295136 276802 259967 248402 240441
9310 240441 256913 271046 254696 267558 276015 259427 234764 226640 235670 217746 221436 231021 243908
9297 243908 261935 265929 270140 242096 214032 171074 167788 180337 201646 227782 227323 226090 198879
9284 198879 181504 173454 177527 158323 108649 133885 145147 143693 145171 162858 164965 115097 98842
9271 98842 105247 100595 67708 56777 46921 26507 59463 94098 96753 84499 102792 131413 141324
9258A41324j63k5627n343j4712k2694p30J2703J7083j6810m224j666K375J0641
9245I2157j3760k4432k58Q288L33K9130K7832k3735l9807j48J2582K273O235J8047
9231I4737J0857l1421l6774P022J8576J1265j0641M994J4531J6368k4591P005
9219H1928K1342j3046L309J0358j598o872k3296p511J0793L494j0877p59j1717
9206E5548k2000M232J8424K2659q41M387R526j6109j3601N284L5806O516l028
9193A06803k0709k3008j3729K3138L554R004M885J4645R975P722p497l3377P811
9180H9217J0826L455o691j143n686M58J8443k4935k6486j4183k9475P209M0624
9167F1633J4588J174J6021l13k499J650j0579m238J0037l0885j5811J3560P203
$$ plain form
9258 141324 141161 115534 110191 95479 72785 72055 84758 101841 85031 80807 79141 81516 92157
9245 92157 78397 53965 53707 61995 62328 91458 119290 95555 55748 55600 68182 70455 76690 94737
9231 94737 105594 74173 37399 44421 62997 74262 63621 68615 83146 99514 74923 81928
9219 81928 103270 90224 93533 103891 102293 95421 72125 64614 75407 78901 68024 67265 55548
9206 55548 33548 37780 56204 78863 78022 82409 91935 75826 62225 67509 103315 109831 106803
9193 106803 86094 63086 49357 72495 76049 85053 89938 104583 114558 122280 114783 81406 89217
9180 89217 100043 103498 96807 95664 89978 90436 108879 83944 57458 43275 13800 21009 61633
9167 61633 76221 77395 93416 93103 90604 92254 81675 77437 87474 56589 40778 54338 61541
9154F1541J7483J5879J4287j1010j8764k3106j2538K8788K152J9072K3231q816
9142A08199j1415k556k6137j147L2055L4613N560k5961l5560l537m218m468K601
9129F8029j3053j3582P706j7390j5569o578N7115L1557j0688l8478j1583J9357
9117E6843j7445q631k350J2976N1420L926m27L1550P022j5942k8673J0887J6425
9104A17581L93p582k0795k5775j4660m310p629K2089J3341O796n6l1465p10J8270
9090F5488j5389l0340J036K3002j0980M141j722K4691j5945l1017l667j12K7091
9077C6277L408j1836o749k4437K3347l304j4235K0033Q137j036K8844K7226k0188
9064F5487j1431Q472J0131M4522J4581k8280k7560k0713J5137k0181j991J4809
$$ plain form
9154 61541 79024 94903 109190 98180 79416 56310 43772 72560 74712 93784 117015 108199
9142 108199 96784 94228 68091 66944 98999 133612 139172 113211 77651 74114 69896 65428 68029
9129 68029 54976 41394 49100 31710 16141 9563 66678 98235 87547 49069 37486 56843
9117 56843 39398 30767 28417 41393 92813 96739 96312 127862 134884 118942 90269 101156 117581
9104 117581 117974 110392 89597 63822 49162 44852 37223 59312 72653 79449 79393 47928 47218 65488
9090 65488 50099 19759 20795 43797 32817 36958 35236 59927 43982 12965 9298 9186 36277
9077 36277 39685 27849 21100 -3337 20010 16706 2471 22504 30641 29605 58449 85675 65487
9064 65487 54056 62528 72659 117181 131762 103482 75922 55209 70346 50165 48174 62983
9052F2983M088r051J5352J4154k7675j8366j4602J150j479Q876J6622L1845j6803
9039F7094j1439q486o561J0282k8960j5911j4076l022M6456P404l516K1959l7828
9026B3396m1845P703J7283J4656J5734J9354P032p419L2938K0056j4676r369o992
9013G7851j6272Q160j528l2415P182j2452l1872j4168O879j1996J0728M5338k7625
9000G810k4471K2634K3167L197k7632l737M365J8692o287O091O203J8477m775
8987D3734p061K7664J4035L3468j2201M395J2941Q857o81k5229l6936l3846j8925
8974A0215J4610P537M30J3831j4456k9279p369Q77K7832n390l5431m5458L421
8961e8630M3849L0188K4006J0401j6807K7541J6980J0367k503k6469R577K1013
$$ plain form
9052 62983 67071 58020 73372 87526 59851 41485 26883 28033 26554 35430 52052 83897 67094
9039 67094 55655 47169 40608 50890 21930 6019 -8057 -11079 35377 42781 39265 61224 23396
9026 23396 -18449 -10746 6537 21193 36927 56281 63313 55894 88832 108888 94212 84843 77851
9013 77851 61579 69739 68211 35796 42978 30526 -1346 -15514 -8635 -20631 -9903 35435 7810
9000 7810 -16661 5973 29140 32337 4705 968 5333 24025 17738 23829 30032 48509 43734
8987 43734 36673 64337 78372 111840 99639 104034 116975 125832 125151 99922 62986 29140 10215
8974 10215 24825 32362 32792 46623 32167 2888 -4481 -3604 24228 18838 -16593 -62051 -58630
8961 -58630 -14781 15407 39413 49814 33007 60548 77528 87895 85392 58923 68500 89513
8949H9513k0976l6513m165k3504n257j0870O504Q839P434K936J0714p815J688
8936A8528L524O221J7630J6453J2048K0019r524m0900l2511J3276L422r372J9868
8923C8682J4066l1522k8283k5813L631L4835L2695J9161n608k4241j8523J3466
8911B2546N67r48j2935j0863r570j802L3962Q886j744j8549m764j964L457J7382
8897B3661j1694l8604K165K2219L7282J2942o464j6432j7238j1016P916j7047
8885a2310n934K7463K9347Q673l892j5133K3422J832j1612J4043j0094K5366o599
8872F4572l0441K1281j2833j6501J8528p092j8521R486j7012K1965R809k0463
8860B2778K0536K2796L1908q982k8095j8072J2097r70k0701Q856J8977J4696k4629
$$ plain form
8949 89513 68537 32024 27859 4355 -902 -11772 -5268 3571 11005 13941 24655 16840 18528
8936 18528 22052 28273 45903 62356 74404 94423 84899 43999 11488 24764 28186 18814 38682
8923 38682 52748 21226 -7057 -32870 -29239 5596 38291 57452 51844 27603 9080 22546
8911 22546 23113 22165 9230 -1633 -11203 -13005 20957 29843 28099 9550 4786 2822 6279 23661
8897 23661 11967 -26637 -24472 -2253 35029 47971 41507 25075 7837 -3179 4737 -12310
8885 -12310 -18244 9219 38566 47239 43347 28214 51636 53468 41856 55899 45805 71171 64572
8872 64572 34131 55412 42579 26078 44606 37514 18993 28479 11467 33432 43241 22778
8860 22778 43314 66110 98018 89036 60941 42869 54966 53996 33295 42151 61128 75824 51195
8847E1195j3943l3262j1726M211K8419L4062j1481j6274j7136j1135L896n569
8835A257q856J8456j1479J9651J1771r918k3247r582K3476J9156P087O767J9510
8822F4049j2157R558o633L207Q642J1193M4425L8824M3623N1095N9190O5744N0286
8809D31046l8271o8575n6182n1530n5463n5520p378o321l0792k098n973l0100
8797B2843Q09K587K206k291j5097r469j900R655J4056K9288K9521R040k608N037
8783I3677j4101K293k8183j7247J8702M948j4883j4306m593K4926J9491J7734
8771H8458j7113J9284K0395j1799K96j2130q647K0428M3571L5325R973L6675k2167
8758B02549m0101n5351l1944k1980J0476K8212M466P968j5942k3249l2643k160
$$ plain form
8847 51195 37252 3990 -7736 -3525 24894 58956 47475 31201 14065 2930 6826 1257
8835 1257 -7599 10857 -622 19029 30800 20882 -2365 -11947 11529 30685 37772 44539 64049
8822 64049 51892 61450 54817 58024 66666 77859 122284 161108 204731 255826 315016 380760 431046
8809 431046 392775 324200 268018 216488 161025 105505 98127 91806 61014 58916 52943 22843
8797 22843 23652 26239 28445 26154 11057 1588 -312 9343 23399 52687 82208 91248 88640 93677
8783 93677 79576 81869 53686 36439 55141 60089 45206 30900 26307 51233 70724 88458
8771 88458 71345 90629 111024 99225 99521 87391 78744 99172 142743 178068 188041 224716 202549
8758 202549 162448 107097 75153 53173 63649 91861 96327 104295 88353 65104 32461 30301
8746C0301j6420R568O880K253P128K115k981J2891J3238r480k7029j2642L2982
8733D8804K4903J8971l925k1985K9191L7949j4224k4397M834J5537k8023q842
8721G8793l248J5951M791K524k0644K2545J2660n757j1689N887K3216k7838n2002
8708D5189J7762R124m423L834J222q011M205j0634N380j4604K512r68l155p939
8694C9494j3527l607J3663L536K0643J8J4878L759j4727N009O505K5062J3348
8681A14054r981k9648k0369o261J7587m459j1823J0727R304k678J2042l572j2761
8668F2162L0224K3325j0544N909J495k0656j4224J3762P364j1978k5767Q081K0617
8655H9770O483J7079K1228L0852J6895k421n1879L722j5569J7992K668j1533j1243
$$ plain form
8746 30301 13881 23449 30329 32582 39710 41825 38844 51735 64973 55493 28464 15822 48804
8733 48804 73707 92678 88753 66768 95959 133908 119684 95287 100121 115658 87635 78793
8721 78793 75545 91496 96287 98811 78167 100712 113372 107615 95926 101813 125029 97191 45189
8708 45189 62951 72075 67652 71486 72708 64697 68902 58268 63648 49044 51556 50588 47433 39494
8694 39494 25967 22360 36023 39559 60202 60220 75098 78857 64130 69139 75644 100706 114054
8681 114054 104073 74425 54056 47795 65382 60923 49100 59827 69131 66453 78495 74923 62162
8668 62162 92386 115711 105167 111076 112571 91915 77691 91453 98817 86839 61072 69153 89770
8655 89770 96253 113332 134560 165412 182307 179886 128007 131729 116160 134152 136820 125287 114044
8642A14044k0170K7818M1676J4394k4155m1493R754Q763K564P200P678r613k1011
8629A17449n875J9560N0963K816k7124J16k958p693J3543k159j2253L234K6228
8616A75847L990L9527M3328J8416L1744p690j1413r67K7279Q078K6578L7708L1847
8603D24272J8694O2337P5963N7888O1259M7736K0030k0331k6329o2983o4348l9140
8591E55048n0060k8354l5490o3724l4903m4166j238J7933k9075j8341r736n397
8579B52497j9614j8127R143j1340j2911n192J1473Q763r883K3529K4687k3621
8567B29404k8613j6515J9028l952k5699j2975P86L6384L0888Q528J3501n125j5833
8554B29807J3085P1773O2535Q7833K0522l5001p0283q7011m7208l9227j9619k1286
$$ plain form
8642 114044 93874 121692 163368 177762 153607 112114 121868 130631 133195 140395 148073 138460 117449
8629 117449 111574 131134 182097 184913 157789 157905 154947 147254 160797 158638 146385 149619 175847
8616 175847 179837 219364 262692 281108 312852 305162 293749 292782 320061 328139 354717 392425 424272
8603 424272 442966 505303 581266 639154 700413 748149 768179 747848 721519 658536 594188 555048
8591 555048 504988 476634 441144 377420 342517 298351 297113 315046 285971 267630 257894 252497
8579 252497 232883 214756 223899 212559 199648 194456 205929 214692 204809 228338 253025 229404
8567 229404 200791 184276 203304 199352 173653 160678 161464 197848 228736 237264 250765 245640 229807
8554 229807 242892 314665 377200 465033 485555 450554 380271 293260 246052 206825 187206 165920
8542A65920j5436m657O179J1080M7155L2623p089r942q79L923K2254O6745N6974
8529C74850N6160J10132J27793L7863j7017n8258o8036n2809m5072l2998o3101
8518C69507n8673m1589o3032k7612n358n7767m6496j5425J3825j4038J5433J8383
8506H7158M4399J5340J6854O2851L6681K6565k8556o4102l9599m0706k2471l388
8494I1026n315j0369k6913J1916M8053K0075K6002K5448p622j7985l725Q673m900
8481A54364Q46J5168k5276o396j899l569N353R305k8716o138j0269l1634J5053
8468H6192N072k62j2418J6032J4401k6823k0213j851l9205j0295L5904K3963J6308
8455H6805k1542j9381J0542N980J9514J5546M3615L6530J7155m9641o1046j1420
$$ plain form
8542 165920 150484 145827 152006 163086 210241 242864 235775 225833 224954 228877 251131 317876 374850
8529 374850 431010 541142 668935 706798 689781 631523 563487 510678 465606 432608 369507
8518 369507 310834 269245 206213 178601 173243 115476 68980 53555 67380 53342 68775 87158
8506 87158 131557 146897 163751 226602 263283 289848 261292 197190 157591 116885 94414 91026
8494 91026 85711 75342 48429 60345 108398 128473 154475 179923 172301 154316 150591 159264 154364
8481 154364 155210 170378 145102 138706 136807 133238 138591 147896 119180 113042 102773 71139 86192
8468 86192 91264 91002 78584 94616 109017 82194 61981 60130 20925 10630 46534 70497 86805
8455 86805 65263 45882 56424 62404 81918 97464 141079 177609 194764 145123 84077 72657
8443G2657L8757J8943j8818k1619l6179k6892K593J1072J4487k4170m794K4566
8431E0603j6143j9880j1012k8062J4620K6097j9176p088K3760L3365K0534j5322
8419E2296j2157n709J6206j158J7374J5435M4063O3970L6834L8075R092k0776
8407B53545r3092o5923o599j4677p851J5469K7958N958j520k7466l5910l3565
8395A6327K874K3601p088k3872j7157N982O758J4566K5316j6209n823K9161J1397
8382F5833k3422j0315J6183K3935l4013l6230j9366j2267l307K5156L2698O411
8370C1296J2985j1223j3231L623j8618j9341j7376p310L1895J654J8331N706m980
8357A3411k6575m602J6196K3593K0878m782k150j767j5397n282j4656o704L1785
$$ plain form
8443 72657 111414 130357 111539 89920 53741 26849 29442 40514 55001 30831 26037 50603
8431 50603 34460 14580 3568 -24494 -9874 16223 -2953 -10041 13719 47084 67618 52296
8419 52296 40139 34430 50636 49478 66852 82287 126350 190320 227154 265229 274321 253545
8407 253545 160453 94530 87931 73254 65403 80872 108830 114788 113268 85802 49892 16327
8395 16327 19201 42802 35714 11842 -5315 667 7425 21991 47307 31098 25275 54436 65833
8382 65833 42411 32096 48279 72214 38201 1971 -17395 -29662 -32969 -7813 24885 31296
8370 31296 44281 33058 19827 23450 4832 -14509 -31885 -39195 -7300 -5646 12685 18391 13411
8357 13411 -13164 -17766 -1570 22023 42901 38119 35969 34202 18805 13523 -1133 -7837 23948
8344B3948o822j1028j4888j7866K999l287J1268K2456L4371k048k8009P467K0257
8331C8818l2724l6345o604k501J2128J6590K5812k088P319m160j6654l6175R673
8318b6911J0678J6193j0319N443l838J2030k260R338K0038l2976p890K4853m731
8305I648j1716m107q958K180J8420J0064q654j8926K714L1312k0132L30J6011
8292A8186q699k7448j3477o763J2449Q519J0705L366J0383K8720J4834K770p158
8279D6387j4924Q132L902p836J558m924O80j942k3497J3322J2499J3630k3719
8266B3268j8571m806R278k146j9780P075M9253K5544R711j9694k7218J5554O382
8253E3850k8578J406l481k3111k3616N354L2085J490k9426j1867O653p907o434
$$ plain form
8344 23948 17126 6098 -8790 -26656 -23657 -26944 -15676 6780 41151 39103 11094 18561 38818
8331 38818 6094 -30251 -36855 -39356 -27228 -10638 15174 13086 20405 16245 -409 -36584 -26911
8318 -26911 -16233 -40 -10359 -4916 -8754 3276 1016 10354 30392 -2584 -10474 14379 9648
8305 9648 -2068 -6175 -15133 -12953 5467 15531 6877 -12049 -9335 21977 1845 2175 18186
8292 18186 9487 -17961 -31438 -38201 -25752 -17233 -6528 -3162 7221 35941 50775 53545 46387
8279 46387 31463 39595 43497 35661 37219 32295 32975 31033 7536 20858 33357 46987 23268
8266 23268 4697 -109 9169 7023 -12757 -5682 43571 69115 78826 59132 31914 47468 53850
8253 53850 25272 26678 23197 86 -23530 -18176 13909 15399 -14027 -25894 -19241 -27148 -33582
8240c3582J6235K9237P296k282j4177j733j0201j1564K0697k087j8085j1797K6633
8227e410J5833Q078p929K1123K3063l1533k5472L268r028j7475j5552Q84K5335
8214a4815J3157o526J1228O348K6606K019j7537R725R993q885l3893j8472R099
8201a1953P46O313K9R092K883N378O867K185j8567q066j3013l177L6807M754j2786
8186G492n32K1642J1328M490j8862j0241k2225l1616r82J36j3160L0323N316k0466
8172c7357P314L6521Q935n014p139J4428n155k0985p407K9530P790L829P347K714
8158C5351O916Q621k744k1502j3864L0279K5752J3119j1859l4451o914K2496L7136
8145H8336j1990j3670J0821k5942n924L4405n978k0161j0564q637K0711J2523
$$ plain form
8240 -33582 -17347 11890 19186 16904 2727 994 -9207 -20771 -74 -2161 -20246 -32043 -5410
8227 -5410 10423 18501 10572 31695 54758 23225 -2247 1021 -8007 -25482 -41034 -40150 -14815
8214 -14815 -1658 -8184 3044 9392 35998 38017 20480 30205 40198 31313 -2580 -21052 -11953
8201 -11953 -11207 -4894 -4865 4227 7110 12488 19355 21540 2973 -5093 -18106 -21283 15524 20278 7492
8186 7492 6960 28602 39930 44420 25558 15317 -6908 -38524 -39506 -39370 -52530 -22207 -16891 -37357
8172 -37357 -30043 6478 15413 10399 3260 17688 12533 -8452 -15859 13671 21461 25290 32637 35351
8158 35351 42267 50888 48144 26642 12778 43057 68809 81928 70069 35618 28704 51200 88336
8145 88336 76346 62676 73497 47555 41631 76036 70058 49897 39333 30696 51407 63930
8133F3930L0596j9026n565Q719J2679q233k0928j6769p171j2431J4775j0443M5198
8120G5331K5905j315R18L9334J4944j6772k5774J1905N093p182j6256p086l8944
8107F0101j1748o603K996J3713J039L8670N625l785K387K6582K5807r228j9016
8094A26540m773l851K160O833J4661j3587j3566J9079N91L861Q069J0563o886
8081A49694j3128N194J483J4611J7843l340M658k2573j5637K9973J8782K1597
8069B09157K3779Q144j4398k4582q893L543l0548n6484J7332J8365J445j3085
8057A33775l014j4631K333J2425L5047J8949J4472q313j5413K4866M4784Q844
8045B54124J5884j7027k7542k4847j6125k4966k3318j078J2058J8415J6118K037
$$ plain form
8133 63930 94526 75500 69935 78654 91333 83100 62172 45403 38232 25801 40576 30133 75331
8120 75331 101236 99921 100839 140173 155117 138345 112571 124476 129569 122387 106131 99045 60101
8107 60101 48353 41750 44746 58459 59498 98168 103793 100008 102395 128977 154784 145556 126540
8094 126540 121767 117916 120076 126909 141570 127983 114417 133496 134087 137948 146017 156580 149694
8081 149694 136566 141760 143243 157854 175697 172357 177015 154442 138805 168778 187560 209157
8069 209157 232936 241080 226682 202100 193207 196750 166202 109718 127050 145415 146860 133775
8057 133775 130761 116130 118463 130888 165935 184884 199356 191043 175630 200496 245280 254124
8045 254124 270008 252981 225439 200592 184467 159501 136183 135105 147163 165578 181696 183733
8033A83733J8907K0489j6363j4680l9313J456J1095J5224j4143j6741K6870K8646
8021B05180N733J8350J0627m5471n0659L1072J6275P97J1997o143j582J2591J9156
8008B27923o741k1391M666p167j719M3620N2891Q4861N2415M8072m350l0283l9993
7995D02804n6537n0769l5964l9427j8766l2401j8769K9757o925k3061J2100j307
7983A60735L426J1870l1541k8019O206J9340j41k031r011j3509k8987M858J6416
7970A09612J6177O552J0261K0311K439j7094j951J183q334J325N85K3762K7406
7957A92234O32P144p315R315L209J0572J230k631j8032J2026j4952j8965j4180
7944A60287j2975j473j8476r477M486R204j8997k1620l683j3745l7061J1431N681
$$ plain form
8033 183733 202640 223129 206766 192086 152773 154229 165324 180548 166405 149664 176534 205180
8021 205180 210913 229263 239890 194419 143760 174832 191107 191904 203901 197758 196176 208767 227923
8008 227923 221182 199791 204457 197290 195571 239191 292082 376943 429358 477430 473080 442797 402804
7995 402804 346267 295498 259534 220107 201341 168940 150171 179928 173003 149942 162042 160735
7983 160735 164161 176031 144490 116471 122677 142017 141876 139845 130834 117325 88338 93196 109612
7970 109612 125789 132341 142602 162913 165352 148258 146307 147490 139156 140481 141066 164828 192234
7957 192234 192866 200010 192695 202010 205219 215791 217021 214390 196358 208384 193432 174467 160287
7944 160287 147312 145839 127363 117886 122372 131576 112579 90959 87276 73531 36470 47901 53582
7931E3582P248J5099J4172j4557J6676J0815P649J2113j6152k6001q754l026j5422
7918E3442J2146O589L658J3239J2446L683k1256k3024P386J7729j834p02j882
7905H1620O732k4249J3188Q610m965l4182j4001J9758J4716o778k8897j5661L5845
7892E1736R499m2445j4431Q452K1940J2542l0305r641J3594L0855L478j8991k2242
7879A4041L925Q715J1499K5097J1559j1704q85N413M982k8591l7218m952J9153
7866B1034L2630L265k1693J3807Q119j5820K4207p772l1888L8084K8708l7020
7854E5661l3402K130N930K738j574j748K3570m069q886K500k3819j9669J7762
7841A7124j2204R249k2344J0333K4860K2683m226k9461p769P716J953K1421P881
$$ plain form
7931 53582 60830 75929 90101 75544 92220 103035 110684 122797 106645 80644 71890 68864 53442
7918 53442 65588 72177 75835 89074 101520 105203 83947 60923 68309 86038 84204 83502 81620
7905 81620 88352 64103 77291 85901 80936 46754 32753 52511 67227 60449 31552 15891 51736
7892 51736 61235 18790 4359 12811 34751 47293 16988 7347 20941 51796 55274 36283 14041
7879 14041 17966 26681 38180 63277 74836 63132 62247 67660 72642 44051 6833 1881 21034
7866 21034 53664 56929 35236 49043 57162 41342 65549 57777 25889 63973 92681 55661
7854 55661 22259 24389 30319 33057 31483 29735 53305 49236 40350 42850 19031 -638 17124
7841 17124 4920 14169 -8175 2158 27018 49701 45475 16014 8245 15961 17914 39335 47216
7828D7216l649k3993l5066p444K3804N074r371j9956l62J2975J0165o974r186
7815a6767r32o776k8392k0181J4782j929J2398J4636j1173n532J1895J4121J475
7802b2375k3642L224m061J8417J8722K2082N574l2839m2655k2563J5869K1177
7790d3070N190N147J178J9756Q290k2870k1611j2883P687J4960J5471J3636J566
7777g553L905J4637L044k9013J0266p261j2381J3467J4323l892l3051o073J4067
7764b5515J6609J812P034L201L659j811J3505J0965k0684r816J088q339k4469
7751c2761l0699r82L39J68N157K1857L2505m418l622K5555J458l898q091k1033
7737a8465j3779J4021o980K6633K0358m362k2575k5984j2702K3934O13o11J4444
$$ plain form
7828 47216 43567 19574 -15492 -22936 868 5942 -3429 -23385 -23747 -10772 -607 -7581 -16767
7815 -16767 -17699 -24475 -52867 -73048 -58266 -60195 -47797 -33161 -44334 -49866 -37971 -23850 -22375
7802 -22375 -46017 -42793 -46854 -28437 -9715 12367 17941 -14898 -57553 -80116 -64247 -43070
7790 -43070 -37880 -32733 -31555 -11799 -3509 -26379 -47990 -60873 -53186 -38226 -22755 -9119 -7553
7777 -7553 -3648 10989 14033 -14980 -4714 -11975 -24356 -10889 3434 -458 -33509 -39582 -25515
7764 -25515 -8906 -7094 -60 3141 6800 4989 18494 29459 8775 -1041 47 -8292 -32761
7751 -32761 -63460 -64442 -64103 -63935 -58778 -36921 -4416 -8834 -12456 13099 14557 10659 2568 -18465
7737 -18465 -32244 -18223 -25203 1430 21788 17426 -5149 -31133 -43835 -19901 -19288 -19899 -5455
7724e455j121J1371L089L606j8880r00L48P897J9527j792j940J842j8502k0386
7710b1296R846j4832j6386O217j2072j2948J4642L6833J9984J1527o637j1703
7698C175j5005n663j645r568j917P433j302J3147j0621l879k6009k1160J2370
7685f0644J5366j989J9762K6399o303k1024j939K0966J6392j828K3593j0748k4838
7672f835j4809n731L788J2334j4691M362o199m582L2599J8993k8816O981m885
7659g491p447N471l3474J2944k742j4461j7661O873J8055L2807K597j3277k5062
7646d2868J8127K7971j530o11p40J592m063P871j4191Q631q938r663l3110n77
7632e2099K3759j3858O973L7860O674j4305j208R577j9161P123J6972p290j196
$$ plain form
7724 -5455 -6576 4795 7884 11490 -7390 -8290 -7942 -45 19482 17690 15750 17592 -910 -21296
7710 -21296 -11450 -26282 -42668 -36451 -48523 -61471 -46829 -9996 9988 21515 14878 3175
7698 3175 -11830 -17493 -19138 -28706 -30623 -23190 -24492 -11345 -21966 -25845 -51854 -73014 -60644
7685 -60644 -45278 -47267 -27505 -1106 -7409 -28433 -30372 -9406 6986 5158 28751 18003 -6835
7672 -6835 -21644 -27375 -23587 -11253 -25944 -21582 -27781 -32363 236 19229 -9587 -2606 -7491
7659 -7491 -14938 -9467 -42941 -29997 -32739 -47200 -64861 -57988 -39933 -7126 -4529 -17806 -42868
7646 -42868 -24741 3230 1700 1089 349 1941 -2122 5749 -8442 189 -8749 -18412 -51522 -52099
7632 -52099 -28340 -42198 -35225 2635 9309 -4996 -6204 3373 -15788 -8665 8307 1017 -179
7619a79k2022j3526K3597p10O068J6741K243m026j7682j4744m440L202J8137q045
7605a5386q300J0578j4631L632Q900O587J876k2097l0481J5602J4523J330K9504
7592A637K9924o787k2713l0437n425j3962m53P430L2460M028J0486n020k6292
7579b5124m701P356K6195k0820J8450K1460k0224k7301j5679J5387J5969J6355
7567G323J34k4281L4301k026k4738p906O708J4332R299k0032k690o615J21k6631
7553d2701j0834N741J424j4013K4266p242O260K3008J0224k123k2097J5077k988
7540a5998n723J3133l896l5887Q014J0651J4899n753p831l600o952Q809L9837
7527I703j2384Q477P052Q287Q344o120j980j5033n652k868Q237O143J2957L562
$$ plain form
7619 -179 -22201 -35727 -12130 -12840 -6772 9969 12212 8186 -9496 -24240 -28680 -25478 -7341 -15386
7605 -15386 -23686 -13108 -27739 -24107 -15207 -8620 -6744 -28841 -59322 -43720 -29197 -27867 1637
7592 1637 31561 24774 2061 -28376 -33801 -47763 -48216 -40786 -8326 -4298 6188 1168 -25124
7579 -25124 -29825 -22469 3726 -17094 1356 22816 2592 -24709 -40388 -25001 -9032 7323
7567 7323 7457 -16824 17477 15451 -9287 -17193 -10485 3847 13146 -6886 -9576 -16191 -16070 -42701
7553 -42701 -53535 -47794 -46370 -60383 -36117 -43359 -37099 -14091 -3867 -5990 -28087 -13010 -15998
7540 -15998 -21721 -8588 -12484 -48371 -40357 -29706 -14807 -20560 -28391 -31991 -38943 -30134 9703
7527 9703 -2681 5796 12848 21135 29479 23359 21379 6346 694 -2174 6063 12206 25163 28725
7513B8725p300l1726l8834k4723q642K1959M6153k409k4596J334J0543o661L3
7500c6144n227j6732j059k8572l138M9096M6650j1148k2062J7268l067j3575k4959
7487e2669L445K2788J3419K2006J5842m984j0169l975k8500j4773j900O13J0988
7474b7869J0489r369j0515P60P132J1979p252r554M631k371J6870O989J8260K6605
7460C6785L684l725k09l0740k1299J4086p334J2351j3656q863o831p180P051P767
7446a8113n664J2009O47K4734q479m3147k4071J7135L2061J0700J451L1323K5957
7433E6543k8987l4366Q931K6120j481m079j0124M181j236k9684Q220J3117l1686
7420b4531O791J2080J0245Q90j5688J0434j4043j7431O562Q519N361k2888N055
$$ plain form
7513 28725 21425 -10301 -49135 -73858 -82500 -60541 -14388 -16797 -41393 -40059 -29516 -36177 -36144
7500 -36144 -41371 -58103 -59162 -87734 -90872 -41776 4874 -6274 -28336 -11068 -14135 -27710 -52669
7487 -52669 -49224 -26436 -13017 8989 24831 19847 9678 5703 -22797 -37570 -39470 -38857 -27869
7474 -27869 -17380 -26749 -37264 -36504 -29372 -17393 -24645 -34199 -29568 -31939 -15069 -8080 10180 36785
7460 36785 40469 36744 36535 5795 -15504 -1418 -8752 3599 -10057 -18920 -25751 -32931 -25880 -18113
7446 -18113 -23777 -11768 -11121 13613 5134 -38013 -62084 -44949 -12888 -2188 -737 30586 56543
7433 56543 27556 -6810 2121 28241 26760 22681 12557 16738 15502 -14182 -5962 7155 -24531
7420 -24531 -17740 -5660 4585 5475 -10213 221 -13822 -31253 -24691 -16172 -10811 -33699 -28644
7407b8644K2070k6538N737J2075j5503J8153K8947o355l631J3541j884o447K125
7394A3646r653o177K5774j7451j0239j3465l7710K23L772N458o20L0016j5878
7381c2304r732o583M345L9666o688J6895R896k3768j9869j36J0194k1534J201
7368c8417j9582N090r790J0761j1696K1909J8667J4484J0844m977L1498M393r302
7355B3882n230K0349L904o692j5162k301K200j0841J7857k3539k4257k1742Q37
7342d0735L6913j478K2826N626k2606j8340J465n167j3566L536J23K1558p287
7329a7132j6089k100P842P458k2375R71J6533j8532p82k0051K6174L3541J0399
7316E857m464j6166J1070o146m0808k2588J6851K8264J32m746N483p006O749L989
$$ plain form
7407 -28644 -6574 -33112 -27375 -15300 -30803 -12650 16297 9942 6311 19852 17968 11521 13646
7394 13646 3993 -2184 23590 6139 -4100 -17565 -55275 -55052 -51280 -45822 -46442 -16426 -32304
7381 -32304 -42036 -48619 -44274 -4608 -11296 5599 15495 -8273 -28142 -28278 -18084 -39618 -38417
7368 -38417 -57999 -52909 -62699 -51938 -63634 -41725 -23058 -8574 2270 -2707 28791 33184 23882
7355 23882 18652 39001 42905 36213 21051 18750 20950 10109 27966 4427 -19830 -41572 -40735
7342 -40735 -3822 -5300 17526 23152 546 -17794 -16329 -21496 -35062 -31526 -31403 -9845 -17132
7329 -17132 -33221 -35321 -27479 -20021 -42396 -41425 -24892 -43424 -44206 -64257 -38083 -4542 5857
7316 5857 1393 -14773 -3703 -9849 -50657 -73245 -56394 -28130 -27998 -32744 -27261 -34267 -27518 -23529
7302b3529P002j7499Q692j4027P105j7494J1135j3298K829O416P782J4639p972
7289b8219k588J6953J6347q206J9844O674Q063m884n678J2616j8116n531k0765
7276a3490K0386J3359j5271L886o636k8371J642J177R427O672J2461j8933J289
7263a2402j7508r575l667N1127N573j2720o807J8102j5077k2688L621M4447J8033
7250D0459m2490l9915j685J2923K3349k8029k3599k3599k5647L0872N5746L595
7238a8020m3970j4078L4096L7124Q408n552J6707k4850k2522j2374L7728j6066
7226b3369n9943O145J1129Q27K0140J1543k5081K199P703k4373O430J7973J2432
7213c6245j3422k4624L3745J7859J0866J626j2073J9642p92k6235J411J4908J1381
$$ plain form
7302 -23529 -16527 -34026 -25334 -39361 -32256 -49750 -38615 -51913 -49084 -42668 -34886 -20247 -28219
7289 -28219 -30807 -13854 2493 -5713 14131 20805 28868 23984 18306 30922 12806 7275 -13490
7276 -13490 6896 20255 4984 8870 2234 -26137 -24495 -23318 -13891 -7219 5242 -13691 -12402
7263 -12402 -29910 -39485 -43152 7975 13548 828 -5979 12123 -2954 -25642 -22021 22426 40459
7250 40459 -2031 -41946 -43631 -30708 -7359 -35388 -58987 -82586 -108233 -77361 -21615 -18020
7238 -18020 -61990 -76068 -41972 -4848 3560 -1992 14715 -10135 -32657 -45031 -7303 -23369
7226 -23369 -83312 -77167 -66038 -65211 -45071 -33528 -58609 -56410 -48707 -73080 -66650 -48677 -36245
7213 -36245 -49667 -74291 -40546 -22687 -11821 -10195 -22268 -2626 -3418 -29653 -28242 -13334 -1953
7200a953k7659l7275R968M0683K8611J5369l1352j8482J0556P1r910R554J0594
7187a225j6539j9920Q56j0102j0859J9128R719J8284K0127J1256k79k7482k8903
7174c5939K1512K5488l7758j9103K4836L2363j8515K2940o839j4384o190m946
7162a6535M019J1133p661n320O002J2620J0436P38J4492n221k1735k1025k4721
7149d2778J1660J9352J945N319n802l1335K1602J27j3518k598K4414k590m057
7136a8259J2943J4307j8535j8752K7166K4849j6658m6434j1165K0615L6531j8396
7124a1788k2378J9172k0086k3367j0355K7820J5687R726K584j9987J301J8516
7112a3155J956J9727J4387r139q375m0731j7471R374J9041j3400M902J4567n580
$$ plain form
7200 -1953 -29612 -66887 -56919 -16236 12375 27744 -3608 -22090 -11534 -11463 -21373 -11819 -1225
7187 -1225 -17764 -37684 -36828 -46930 -57789 -38661 -28942 -10658 9469 20725 20446 -7036 -35939
7174 -35939 -14427 11061 -26697 -45800 -20964 11399 -7116 15824 8985 -5399 -11589 -16535
7162 -16535 -12516 -1383 -9044 -14364 -8362 4258 14694 15432 29924 24703 2968 -18057 -42778
7149 -42778 -31118 -11766 -9821 -4502 -10304 -41639 -20037 -19910 -33428 -36026 -11612 -14202 -18259
7136 -18259 -5316 8991 -9544 -28296 -1130 23719 7061 -39373 -50538 -29923 6608 -11788
7124 -11788 -34166 -14994 -35080 -58447 -68802 -40982 -25295 -15569 -12985 -32972 -31671 -13155
7112 -13155 -11199 8528 22915 13776 5401 -35330 -52801 -43427 -24386 -37786 -32884 -18317 -23897
7099b3897r616O534j37l280N618k1071q038N936n124k1228m501K2838L3385K5755
7085C174K1955M084j5935j6678l9304Q884J6054Q055J0850K315j3169J2048j657
7072F76j6813k2655K5730N346l892k742J8835j0722j6531r408p100K9250O71K531
7058f824L773o222j2777j2497j3864J7803K3334m570m3203l6421L8569K7329r924
7045c5494K3634J1740j0576r024p637m125k0312K4535J1549l3111k772K0530O240
7032b4823L797J4941j9576K307M483J7383P048J2335j0337j2576k467K0201N618
7019A8334n167r071j8573j697L179p272j5927Q584j3101O784R065J7371n97J326
7005f762p406J6481L735N43j275o427k5570K15J408M300K6531K2293l9183k0101
$$ plain form
7099 -23897 -33513 -26979 -27116 -30396 -24778 -45849 -53887 -47951 -53075 -74303 -78804 -55966 -22581 3174
7085 3174 25129 29213 13278 -3400 -42704 -33820 -17766 -9711 1139 3454 -9715 2333 676
7072 676 -16137 -38792 -13062 -7716 -11608 -14350 4485 -6237 -22768 -32176 -39276 -10026 -9355 -6824
7058 -6824 -3051 -9273 -22050 -34547 -48411 -30608 -7274 -11844 -55047 -91468 -52899 -25570 -35494
7045 -35494 -11860 -120 -10696 -19720 -27357 -31482 -51794 -27259 -15710 -48821 -51593 -31063 -24823
7032 -24823 -21026 -6085 -25661 -23354 -18871 -1488 5560 17895 7558 -5018 -7485 12716 18334
7019 18334 13167 4096 -14477 -16174 -12995 -20267 -36194 -27610 -40711 -33927 -24862 -7491 -8088 -6762
7005 -6762 -14168 2313 6048 6591 5316 -1111 -26681 -26466 -25058 -20758 5773 28066 -11117 -31218
6991c1218k1647J9379J5314n800k64p433K0937j235N566L766J8944k9r591j0292
6977c603k9308j4072J8587J9608q17o698J6541o150O101Q394j9102k4509P108
6964b7920J5420m167j712J3469J265j0008k446O855J996K3613N673K946j681k7434
6950d131j8772l585J512q557J9248j6475k6855L180J5761N008Q348P784J6844
6937f90j3513j5708l9925j292m328L507K7362J4909J5945K5535j0289k6022k2429
6924d6938K8509n940Q361l594l9112M875L7531R434n997N2001J0416r335k8958
6911A1253j1577P669j7424j2090J4260j5773k2344K0291K7821k7215k622p997
6899c5748M700j8439J6229J5279p477J1626P617l064l572k0945q153M1010J5568
$$ plain form
6991 -31218 -52865 -33486 -18172 -23972 -24236 -31669 -10732 -11967 -6401 -2635 16309 16280 6689 -3603
6977 -3603 -32911 -46983 -28396 -8788 -9605 -16303 238 -5912 189 8583 -10519 -35028 -27920
6964 -27920 -12500 -16667 -18379 -4910 -3645 -13653 -16099 -9244 -7248 16365 22038 24984 23303 -4131
6950 -4131 -22903 -26488 -24976 -33533 -14285 -30760 -57615 -54435 -38674 -33666 -25318 -17534 -690
6937 -690 -14203 -29911 -69836 -71128 -75456 -71949 -44587 -29678 -13733 11802 1513 -24509 -46938
6924 -46938 -18429 -24369 -16008 -19602 -58714 -53839 -16308 -6874 -12871 39130 49546 40211 11253
6911 11253 -324 7345 -10079 -22169 -7909 -23682 -46026 -25735 2086 -25129 -27751 -35748
6899 -35748 -31048 -49487 -33258 -17979 -25456 -13830 -6213 -9277 -12849 -33794 -41947 -937 14631
6886A4631l4706l720R597j1267J252k3597P07p799N209L1494L890L8433r376P012
6872B1760P096l437k2288j6257N115K2943n029j4647k6575R14J7487n146N94J5496
6858a974J5450L21k1165k2663J1328J9923r371K3885l536l4240J2729K7870K777
6845B1334m6080j5068P11L45j5445J386k985l4609o258K2210J4417J4737K0424
6832b4881j2298j2952Q628L71Q774J1376J1645N310L435R559N032k092k4619q943
6818b1655J9811l271j194J2837N651k0903J0989J317p571p939k1115k840O120
6805b9763p903j0687M159O674k0716Q709j833j8588L818J3996L7601K830j6362
6792b8065J7077J2065R063m236l145k154o439L153J6209m682m777J5219k27O152
$$ plain form
6886 14631 -20075 -23795 -14198 -25465 -24213 -47810 -47103 -54902 -49693 -18199 -14309 24124 14748 21760
6872 21760 28856 25419 3131 -13126 -8011 14932 9903 -4744 -31319 -30405 -12918 -18064 -17470 -1974
6858 -1974 13476 13797 -7368 -30031 -18703 1220 -8151 15734 12198 -22042 -9313 18557 21334
6845 21334 -24746 -39814 -39103 -38758 -54203 -52817 -55802 -90411 -96669 -74459 -60042 -45305 -24881
6832 -24881 -37179 -50131 -41503 -41132 -32358 -20982 -9337 -4027 -592 8967 13999 11907 -12712 -21655
6818 -21655 -1844 -5115 -6309 6528 12179 -8724 2265 3582 -3989 -11928 -33043 -35883 -29763
6805 -29763 -37666 -48353 -44194 -37520 -58236 -49527 -51360 -69948 -66130 -52134 -14533 -11703 -28065
6792 -28065 -10988 1077 10140 5904 2759 605 -5834 -2681 13528 8846 4069 19288 19061 25213
6778B5213j4382k9819o444k5343k0573K2989L4499J5720l205j610M7095j034k7682
6765A5424k0399O664j0536J1764M311k4111k2736k5603k3076L429M8347J0026
6753b6496J8864R5o661J7044K1143p734k790N38j1836K0068j365J2913m232J8902
6739D8453J7649l4549n3972m849J5513N288k061j742k31j2052J0236J6273L1035
6726C4991K5362m1154k625m625k3288k2430J4600J0355J911j2685p189J3340Q542
6713d895k9010l6898j6330K8760K6302r028n945J1122K1584M272k2332k2737q547
6700f3682K0369J8414N560q268j098J539m166j1159P276o489M795j6306J2393
6687d0822p047L0692K6187j4272k194O943r034k2094j065K8652J193k5502p515
$$ plain form
6778 25213 10831 -18988 -25432 -50775 -71348 -48359 -13860 1860 -1345 -2955 44140 43106 15424
6765 15424 -4975 1689 -8847 2917 7228 -16883 -39619 -65222 -88298 -84869 -36522 -26496
6753 -26496 -7632 -7537 -14198 2846 23989 16255 13465 14003 2167 22235 20870 33783 29551 48453
6739 48453 66102 31553 -22419 -27268 -11755 -6467 -8528 -10270 -10501 -22553 -12317 3956 34991
6726 34991 60353 19199 16574 11949 -11339 -33769 -19169 -8814 -6903 -19588 -26777 -13437 -4895
6713 -4895 -33905 -70803 -87133 -58373 -32071 -41099 -47044 -35922 -14338 -10066 -32398 -55135 -63682
6700 -63682 -43313 -24899 -19339 -27607 -28705 -27166 -31332 -42491 -35215 -41704 -36909 -53215 -40822
6687 -40822 -47869 -17177 9010 -5262 -7456 -513 -9547 -31641 -32706 -4054 -2861 -28363 -35878
6674c5878K4572m232J6918K6442M296j2735o443K824j601M673j8896p308k906
6661a0274l0791j5781K0918K3296J2902k2621K810m429J2979L8752K5356j2107
6649D1010j0517j2123r3L221l1133j0094J3822o668k195P063M32k6512l656q458
6635d5901m840K379K4983J0119R390K6791M944j1530k5062R14l1235j982j5867
6622e6897M786K0816J7822j0249k1598L847j1014K7718K2483k3929j2689O330
6610c2574L9478M111K2753J1993k8090l3073j5322N071J4344m238p979n559j8234
6597d7319j2230J6767j380k9148K2324L8861J706k7703q856J3160L5992R775j1283
6584F66J6551Q689k675l3171k7872j6523n669K0918R087L4343j6035j175L3966
$$ plain form
6674 -35878 -11306 -15538 1380 27822 32118 19383 12940 15764 14163 18836 -60 -7368 -10274
6661 -10274 -41065 -56846 -35928 -12632 270 -22351 -19541 -23970 -10991 27761 53117 41010
6649 41010 30493 18370 18277 21498 -9635 -19729 -5907 -12575 -14770 -7707 -7275 -33787 -37443 -45901
6635 -45901 -50741 -48362 -23379 -13260 -3870 22921 27865 16335 -8727 -7813 -39048 -41030 -56897
6622 -56897 -52111 -31295 -13473 -23722 -45320 -41473 -52487 -24769 -2286 -26215 -38904 -32574
6610 -32574 6904 11015 33768 45761 17671 -15402 -30724 -25653 -11309 -15547 -23526 -29085 -47319
6597 -47319 -59549 -42782 -44162 -73310 -50986 -12125 -10419 -38122 -46978 -33818 2174 11949 666
6584 666 17217 25906 23231 -9940 -37812 -54335 -60004 -39086 -29999 4344 -11691 -12866 21100
6571B1100Q649r911k4025o123j0792O454J6003L010L722l280l2157k308O633J1070
6557a1955J44r683m4526M981J7886P818P008j8994J6085L3987L897j6176m093
6544a3621J7223K8077j4662k7869r983R703M474j7922O97J4030m792r984p847
6531c2476J1600J2764M90j7726J6451j9079L8905K2900j6901j0704m1892j7134
6519e2802J4867J2021j4035j6936J433K8171K8536j0335n003J5661n784o27q10
6506e643n192j1265R659P047N999M176k3389k5937N919J1464J993m355O131L623
6492a9770j0784L697l27K9812K2789K3503k9273o6985M765J240J3924M0773j4728
6479a364m6951j0684k3042J5489J1377K5826J5232O082m7259k0702K2311K8529
$$ plain form
6571 21100 29749 19838 -4187 -10310 -21102 -14648 1355 4365 8087 4807 -27350 -29658 -23025 -11955
6557 -11955 -11811 -21494 -66020 -61039 -43153 -35335 -28327 -47321 -31236 2751 6648 -9528 -13621
6544 -13621 3602 31679 17017 -10852 -20835 -11132 -6658 -24580 -23883 -9853 -14645 -24629 -32476
6531 -32476 -20876 -8112 -7622 -25348 -8897 -27976 10929 33829 16928 6224 -35668 -52802
6519 -52802 -37935 -25914 -39949 -56885 -55452 -27281 1255 -9080 -14083 1578 -4206 -4833 -5643
6506 -5643 -10835 -22100 -12441 -5394 605 4781 -18608 -44545 -38626 -27162 -25169 -29524 -23393 -19770
6492 -19770 -30554 -26857 -27184 2628 25417 48920 19647 -47338 -42573 -41333 -27409 13364 -1364
6479 -1364 -48315 -58999 -82041 -66552 -55175 -29349 -14117 -8035 -55294 -75996 -53685 -25156
6467b5156M939j8743L7588K4199l203l3432J1088n129l2212K105J1995R618K6017
6454I674k628k0786k1580J5420J4004l0892N66L9612J1631J2723N494m1956l6208
6441d4926J5012J9173J2647j0922j7608o699J9588K9363J469k048K1415K8847
6429F5311N129P625k8856k5057j5818j4344j9482K2314J8802j447j4130K401K0347
6416B2795M966N02j8432K629j1358N220j6393J072J863k0336k5443K80k722J6159
6402c9198R422k3397K5103K8571j4821j5709l5365j0692J8769J1192K7718j5807
6390c4214K895J6407N106j4681o73j9059j8739o54K1448j1110o506K4981l162
6377c7961k213J0054J0296p43J5765O495j3413Q781k1061j822J0336O551o097
$$ plain form
6467 -25156 -20217 -38960 -1372 22827 19624 -13808 -2720 -7849 -40061 -37956 -25961 -16343 9674
6454 9674 7046 -13740 -35320 -19900 -5896 -36788 -36222 3390 15021 27744 33238 -8718 -44926
6441 -44926 -29914 -10741 1906 -9016 -26624 -33323 -13735 15628 17097 15049 36464 65311
6429 65311 70440 78065 49209 24152 8334 -6010 -25492 -3178 15624 14177 47 2448 22795
6416 22795 27761 28263 9831 12460 1102 6322 -10071 -8999 -7136 -27472 -52915 -52635 -55357 -39198
6402 -39198 -29776 -53173 -28070 501 -14320 -30029 -65394 -76086 -57317 -46125 -18407 -34214
6390 -34214 -31319 -14912 -9806 -24487 -25160 -44219 -62958 -63612 -42164 -53274 -59780 -34799 -37961
6377 -37961 -40174 -30120 -19824 -20567 -4802 1693 -11720 -2939 -24000 -25822 -15486 -8935 -15032
6364a5032K7114M568l1291k6787J2355K5041M539j8554n43K1240J3369j9225J4869
6351A1663N27q130N662P824K4382j8736k9107K064j5481J7256O520k3041k9349
6338d7946K7562J1246L296k378k3883K5588L4450j3146k1177m186j3573j8421
6326d2568L1538K5862j2562k4564j5080K5837K4473j9091k7707j7952K8370K269
6314b1175k1887k8262k4815L2062J1482O471L2178M1608K943J1360n518r477j3288
6301A3682k5857o259O722j3305n429k776j1215R089M62j3879J8330J4248k2647
6288c8834o331N354O182J0960l1407N611L5032N137K472j6258j982N218L0972
6275A2126Mn1846l82m16J6399R373j9957j0652j8087j8752k18K4952J1667k914
$$ plain form
6364 -15032 12082 16650 -14641 -41428 -29073 -4032 507 -18047 -18590 2650 16019 -3206 11663
6351 11663 12190 4060 9722 17546 41928 23192 -5915 -3851 -19332 -2076 4444 -18597 -47946
6338 -47946 -20384 -9138 -5842 -8220 -32103 -6515 27935 14789 -6388 -10574 -24147 -42568
6326 -42568 -11030 14832 2270 -22294 -37374 -11537 12936 -6155 -33862 -51814 -23444 -21175
6314 -21175 -43062 -71324 -96139 -64077 -52595 -46124 -13946 27662 30605 41965 36447 26970 13682
6301 13682 -12175 -18434 -11712 -25017 -30446 -33222 -44437 -35348 -34886 -48765 -30435 -16187 -38834
6288 -38834 -45165 -39811 -33629 -22669 -54076 -48465 -13433 -8296 -5824 -22082 -24064 -18846 12126
6275 12126 12130 -39716 -40098 -40514 -24115 -14742 -34699 -45351 -63438 -82190 -82408 -57456 -45789 -48703
6261d8703N521L962L5865L2663j1593j9955K556j1449J4372K6139R535k6499l1398
6248a8984n945m560m500j9312R538P443K3471L547j6479j0176L314o456L2375
6235f724J5625K2351j0732Q901K7385k184k8947j1531p940j9379o062r970J3679
6222a5528J9342O171k3687j7648k1700O793L099m121M675m837K4331j5730j3724
6209e2564J9815M523j2486K5980J3148J060j8941j0341J816J7622J861k7500J2498
6196b3509M1168P493q451l1935J5760k347j0763j7151J8665N771R614M146L193
6183A1654O530k928r025K8024l0462k8610j6111r587o59J1121L2442r347k3980
6170d0938R170J5964J6095K9739j2825j8559M730k2275P039K5135J2308j3630
$$ plain form
6261 -48703 -43182 -39220 -3355 29308 17715 -2240 316 -11133 3239 29378 38913 12414 -18984
6248 -18984 -24929 -29489 -33989 -53301 -43763 -36320 -12849 -9302 -25781 -35957 -32643 -39099 -6724
6235 -6724 8901 31252 20520 29421 56806 54622 25675 14144 6204 -13175 -19237 -29207 -15528
6222 -15528 3814 9985 -13702 -31350 -53050 -46257 -43158 -47279 -42604 -47441 -23110 -38840 -52564
6209 -52564 -32749 -28226 -40712 -14732 -1584 -524 -19465 -29806 -27990 -10368 -8507 -36007 -23509
6196 -23509 17659 25152 16701 -15234 526 -1821 -12584 -29735 -11070 -5299 4315 8461 11654
6183 11654 18184 15256 6231 34255 3793 -24817 -40928 -50515 -51174 -40053 -7611 -16958 -40938
6170 -40938 -31768 -15804 291 30030 17205 -1354 3376 -18899 -11860 13275 25583 11953
6158A1953l721R371O795j3667p015r744L516K2029J51O771N983J239J141l7229
6144b427Q976L1612j9686j6092J0374k6562K566L035N093L0356J4068l3621k4777
$$ plain form
6158 11953 8232 17603 24398 10731 3716 -6028 -2512 19517 19668 26439 32422 33661 34802 -2427
6144 -2427 6549 38161 18475 2383 12757 -13805 -11239 -8204 -3111 27245 41313 7692 -17085
$$ [...]
##END NTUPLES=NMR SPECTRUM
##END=
