##TITLE=Analysis number 322445
Compound Code cc 40201
Book Reference 468/167/4
Project Code adrs
Chemist Name colinb
##JCAMPDX= 6.0         $$ Bruker NMR JCAMP-DX V2.0
##DATA TYPE= NMR SPECTRUM
##DATA CLASS= NTUPLES
##ORIGIN= Bruker BioSpin GmbH
##OWNER= nmr
$$ XWIN-NMR		Version 3.5
$$ Tue Sep 26 14:22:35 2006 GMT Daylight Time (UT+1h)  MAYBRIDGE\nmr@NMR_250MHZ
##.OBSERVE FREQUENCY= 250.131544655141
##.OBSERVE NUCLEUS= ^1H
##.ACQUISITION MODE= SIMULTANEOUS (DQD)
##.ACQUISITION SCHEME= undefined
##.AVERAGES= 16
##.DIGITISER RES= 18
##SPECTROMETER/DATA SYSTEM= dpx250
##.PULSE SEQUENCE= zg30
##.SOLVENT NAME= DMSO
##.SHIFT REFERENCE= (INTERNAL, DMSO, 0, 16.522)
##AUDIT TRAIL= $$ (NUMBER, WHEN, WHO, WHERE, WHAT)
$$ ##TITLE= Audit trail, XWIN-NMR		Version 3.5
$$ ##JCAMPDX= 5.01
$$ ##ORIGIN= Bruker BioSpin GmbH
$$ ##OWNER= nmr
$$ C:\u/data/dgb/nmr/ADRS/1420/pdata/1/auditp.txt
$$ ##AUDIT TRAIL=  $$ (NUMBER, WHEN, WHO, WHERE, WHAT)
(   1,<2006-09-26 14:22:08.83 +100>,<MAYBRIDGE\nmr>,<NMR_250MHZ>,
      <created by zg, POWCHK disabled, PULCHK disabled
       configuration hash MD5:
       E2 DF 36 D8 04 B2 41 60 5A D7 A3 38 5A 4B D0 FE
       data hash MD5: 64K
       5C CB DD C5 B3 17 45 03 D8 17 6E 15 DE 7A DF 75>)
(   2,<2006-09-26 14:22:23.99 +100>,<MAYBRIDGE\nmr>,<NMR_250MHZ>,
      <Start of raw data processing
       ef LB = 0.3 FT_mod = 6 PKNL = 1 SI = 32K 
       data hash MD5: 32K
       F8 90 49 3A 3B 60 EA E4 6B A5 DC 07 72 33 62 43>)
(   3,<2006-09-26 14:22:25.71 +100>,<MAYBRIDGE\nmr>,<NMR_250MHZ>,
      <apk 
       data hash MD5: 32K
       AC DF 35 DD F5 5F 6C D6 BC 16 DA BE 95 FF E9 56>)
(   4,<2006-09-26 14:22:26.73 +100>,<MAYBRIDGE\nmr>,<NMR_250MHZ>,
      <abs ABSG = 5 
       data hash MD5: 32K
       22 F2 29 62 53 7E 7F F8 78 56 20 4F B9 FD C4 DD>)
$$ ##END=
$$ 
$$ hash MD5
$$ 0D 2A 35 24 9C 2D A6 F2 1B 8D 5D B1 F3 F7 35 F1
##$RELAX= 
##$RELAX= 
##$RELAX= 
##$RELAX= 
##$RELAX= 
##$RELAX= 
##$RELAX= 
$$ Bruker specific parameters
$$ --------------------------
##$DU= <C:\u>
##$EXPNO= 1420
##$NAME= <ADRS>
##$PROCNO= 1
##$TYPE= <nmr>
##$USER= <dgb>
##$AMP= (0..31)
100 100 100 100 100 100 100 100 100 100 100 100 100 100 100 100 100 100 
100 100 100 100 100 100 100 100 100 100 100 100 100 100 
##$AQSEQ= 0
##$AQ_mod= 3
##$AUNM= <au_zg>
##$AUTOPOS= <40 >
##$BF1= 250.13
##$BF2= 250.13
##$BF3= 250.13
##$BF4= 250.13
##$BF5= 500.13
##$BF6= 500.13
##$BF7= 500.13
##$BF8= 500.13
##$BYTORDA= 1
##$CFDGTYP= 0
##$CFRGTYP= 5
##$CHEMSTR= <none>
##$CNST= (0..31)
1 1 145 1 1 1 1 1 1 1 1 1 1 1 1 1 1 1 1 1 1 1 1 1 1 1 1 1 1 1 1 1 
##$CPDPRG= <>
##$CPDPRG1= <>
##$CPDPRG2= <>
##$CPDPRG3= <>
##$CPDPRG4= <mlev>
##$CPDPRG5= <mlev>
##$CPDPRG6= <mlev>
##$CPDPRG7= <mlev>
##$CPDPRG8= <mlev>
##$CPDPRGB= <>
##$CPDPRGT= <>
##$D= (0..31)
0 1 0 0 0 0 0 0 0 0.06 0 0 0 0 0 0 0.0002 0 0 0 0 0 0 0 0 0 0 0 0 0 0 
0 
##$DATE= 1159276927
##$DBL= (0..7)
120 120 120 120 120 120 120 120 
##$DBP= (0..7)
150 150 150 150 150 150 150 150 
##$DBP07= 0
##$DBPNAM0= <>
##$DBPNAM1= <>
$$ [...]
##$SUBNAM7= <"">
##$SUBNAM8= <"">
##$SUBNAM9= <"">
##$SW= 20.6930455092707
##$SWIBOX= (0..15)
0 0 3 0 0 0 0 0 0 0 0 0 0 0 0 0 
##$SW_h= 5175.983436853
##$TD= 65536
##$TD0= 1
##$TE= 295.16
##$TE2= 300
##$TE3= 300
##$TEG= 300
##$TL= (0..7)
0 120 120 120 120 120 120 120 
##$TP= (0..7)
150 150 150 150 150 150 150 150 
##$TP07= 0
##$TPNAME0= <>
##$TPNAME1= <>
##$TPNAME2= <>
##$TPNAME3= <>
##$TPNAME4= <>
##$TPNAME5= <>
##$TPNAME6= <>
##$TPNAME7= <>
##$TPOAL= (0..7)
0.5 0.5 0.5 0.5 0.5 0.5 0.5 0.5 
##$TPOFFS= (0..7)
0 0 0 0 0 0 0 0 
##$TUNHIN= 0
##$TUNHOUT= 0
##$TUNXOUT= 0
##$USERA1= <user>
##$USERA2= <user>
##$USERA3= <user>
##$USERA4= <user>
##$USERA5= <user>
##$V9= 5
##$VALIST= <valist>
##$VCLIST= <CCCCCCCCCCCCCCC>
##$VD= 0
##$VDLIST= <DDDDDDDDDDDDDDD>
##$VPLIST= <PPPPPPPPPPPPPPP>
##$VTLIST= <TTTTTTTTTTTTTTT>
##$WBST= 1024
##$WBSW= 4
##$XGAIN= (0..3)
0 0 0 0 
##$XL= 0
##$YL= 0
##$YMAX_a= 263891
##$YMIN_a= -360753
##$ZGOPTNS= <>
##$ZL1= 120
##$ZL2= 120
##$ZL3= 120
##$ZL4= 120
##$ABSF1= 16.522
##$ABSF2= -4.171173
##$ABSG= 5
##$ABSL= 3
##$ALPHA= 0
##$AQORDER= 0
##$ASSFAC= 0
##$ASSFACI= 0
##$ASSFACX= 0
##$ASSWID= 0
##$AUNMP= <proc_1d>
##$AZFE= 0.1
##$AZFW= 0.1
##$BCFW= 0
##$BC_mod= 0
##$BYTORDP= 0
##$COROFFS= 0
##$CY= 12.5
##$DATMOD= 1
##$DC= 0
##$DFILT= <>
##$DTYPP= 0
##$F1P= 14.0000005364418
##$F2P= -0.99999901652339
##$FCOR= 0.5
##$FTSIZE= 32768
##$FT_mod= 6
##$GAMMA= 0
##$GB= 0
##$INTBC= 1
##$INTSCL= 1
##$ISEN= 128
##$LB= 0.3
##$LEV0= 0
##$LPBIN= 0
##$MAXI= 10000
##$MC2= 0
##$MEAN= 0
##$ME_mod= 0
##$MI= 0
##$NCOEF= 0
##$NC_proc= -5
##$NLEV= 6
##$NOISF1= 0
##$NOISF2= 0
##$NSP= 0
##$NTH_PI= 0
##$NZP= 0
##$OFFSET= 16.522
##$PC= 1
##$PHC0= 141.2811
##$PHC1= 12.35169
##$PH_mod= 1
##$PKNL= yes
##$PPARMOD= 0
##$PSCAL= 4
##$PSIGN= 0
##$REVERSE= no
##$SF= 250.13
##$SI= 32768
##$SIGF1= 0
##$SIGF2= 0
##$SINO= 400
##$SIOLD= 32768
##$SREGLST= <1H.DMSO>
##$SSB= 0
##$STSI= 32768
##$STSR= 0
##$SW_p= 5175.98343685301
##$SYMM= 0
##$S_DEV= 0
##$TDeff= 65536
##$TDoff= 0
##$TI= <Analysis number 999999
Compound Code 99
Book Reference 9
Project Code 9>
##$TILT= no
##$TM1= 0
##$TM2= 0
##$TOPLEV= 0
##$USERP1= <user>
##$USERP2= <user>
##$USERP3= <user>
##$USERP4= <user>
##$USERP5= <user>
##$WDW= 1
##$XDIM= 32768
##$YMAX_p= 372390418
##$YMIN_p= -1002455
$$ End of Bruker specific parameters
$$ ---------------------------------
##NTUPLES= NMR SPECTRUM
##VAR_NAME=  FREQUENCY,     SPECTRUM/REAL,   SPECTRUM/IMAG
##SYMBOL=    X,             R,               I
##VAR_TYPE=  INDEPENDENT,   DEPENDENT,       DEPENDENT
##VAR_FORM=  AFFN,          ASDF,            ASDF
##VAR_DIM=   32768,         32768,           32768
##UNITS=     HZ,            ARBITRARY UNITS, ARBITRARY UNITS
##FACTOR=    0.157963299565203, 1,           1
##FIRST=     4132.6476996994, 0,             0
##LAST=      -1043.33573715361, 0,           0
##MIN=       -1043.33573715361, -1002455,    0
##MAX=       4132.6476996994, 372390418,     0
$$ Real data points
##PAGE= N=1
##DATA TABLE= (X++(R..R)), XYDATA
$$ [...]
24459a54547J28114K05607j62468j74414k269P3283M32393j67435j50841Q2298
$$ -154547 -26433 179174 16706 -157708 -159977 -86694 345699 178264 27423 109721
24449A09721j07206n0119j3069r0786j74359J1321O9010J72767j46888r3083k55090
$$ 109721 2515 -47604 -60673 -151459 -325818 -314497 -245487 -72720 -219608 -312691 -567781
24438e67781K51929K50697M2595j61451R4706M3442l1475L6671j21899j69282
$$ -567781 -315852 -65155 -22560 -184011 -89305 -45863 -77338 -40667 -162566 -331848
24428c31848K4706J42335j42504l0025Q1070n431r315N8026J4070K05344R5256
$$ -331848 -307142 -164807 -307311 -337336 -256266 -261697 -271012 -212986 -198916 6428 101684
24417A01684p9500J18207J21290l5190k11199r3549j69248j01507J58006K47389
$$ 101684 22184 140391 261681 226491 15292 -78257 -247505 -349012 -191006 56383
24407E6383Q7799l01849j34705J73198N3760j88607q1499j05393J73068J58520
$$ 56383 144182 -157667 -292372 -119174 -65414 -254021 -335520 -440913 -267845 -109325
24397a09325n7482R974p8109m4636K18454J62677R5403k622j1307J23911O7754
$$ -109325 -166807 -156833 -234942 -279578 -61124 101553 196956 194334 183027 306938 374692
24386C74692j51449n9670j13350j1299j02888k3994n7765M0285K16635K8903n1498
$$ 374692 223243 163573 50223 38924 -63964 -87958 -145723 -105438 111197 140100 88602
24375H8602o1237k67212p9020J63275J71098K63401l1868k63485m50789p6083
$$ 88602 27365 -239847 -318867 -155592 15506 278907 247039 -16446 -467235 -543318
24365e43318J56487K52379P6259J1510J36480j31488K6140k9226j57403L7297
$$ -543318 -386831 -134452 -58193 -46683 89797 -41691 -15551 -44777 -202180 -164883
24355a64883J33384M1948m9618J1785q7617Q3330k6204j38959r752j10542j59571
$$ -164883 -31499 10449 -39169 -27384 -115001 -31671 -57875 -196834 -206586 -317128 -476699
24344d76699O6710K57788O1421l44000o9815l5489L30717K15093O5541L3856k01089
$$ -476699 -409989 -152201 -90780 -434780 -504595 -540084 -209367 5726 71267 105123 -95966
24333i5966j9168J74082J04919j74137j52199k32389k44652J78511M7818K03234
$$ -95966 -115134 58948 163867 -10270 -162469 -394858 -639510 -460999 -413181 -209947
24323b09947K7745M7150j03980J01810N7648j9776J57251P6281j61781m0995K17316
$$ -209947 -182202 -135052 -239032 -137222 -79574 -99350 57901 134182 -27599 -68594 148722
24312A48722J61555Q9332o3483K20262j71078k62409l78604L4545J10889P756
$$ 148722 310277 399609 336126 556388 385310 122901 -255703 -221158 -110269 -102513
24302a02513l8569k578n2252P0187J33568N4444n22k93555j85457r738j5197J55862
$$ -102513 -141082 -143660 -195912 -125725 7843 62287 61765 -231790 -417247 -426985 -442182 -286320
24290b86320K34417N0587j50172o6231J55214j20574q1026J08202J99023l4916
$$ -286320 -51903 -1316 -151488 -217719 -62505 -183079 -264105 -155903 43120 8204
24280H204R5288j08681k51647j91295N9389L64926j10908j64165J2148K42555
$$ 8204 103492 -5189 -256836 -448131 -388742 -23816 -134724 -298889 -286741 -44186
24270d4186J82827R6642m0436l15924m7451J9162L6090L8399j06665n24575j29034
$$ -44186 138641 235283 194847 -121077 -168528 -149366 -113276 -74877 -181542 -706117 -835151
24259h35151Q8784J39177j8242r156r908K11247L6388N8813K41535P5240K4889
$$ -835151 -746367 -607190 -625432 -634588 -644496 -433249 -396861 -338048 -96513 -21273 3616
24248C616J2405P6448n8030l9279k20128j48939k30520J47001J69091J45679K64747
$$ 3616 16021 92469 34439 -4840 -224968 -373907 -604427 -457426 -288335 -142656 122091
24237A22091J8320r1202l4861m069k07752n5864K19155J22907m0253J65601M6884
$$ 122091 140411 49209 14348 10279 -197473 -253337 -34182 88725 48472 214073 260957
24226B60957n44383j71915Q9966N8540K4396J57082M7881J93921Q9321P0939j05980
$$ 260957 -283426 -455341 -365375 -306835 -282439 -125357 -77476 116445 205766 276705 170725
24215A70725L292R5434k34323L2850j07377j76986P9566J67767J58237l04053
$$ 170725 174017 269451 35128 67978 -39399 -216385 -136819 30948 189185 -114868
24205a14868j79816Q4819R4420j23857K26969J01177o3072O1825L6863j09751
$$ -114868 -294684 -209865 -115445 -239302 -12333 88844 25772 87597 124460 14709
24195A4709k9359J24944j80444P5836R6500j02985K4965j01046L5416n141J5871
$$ 14709 -14650 110294 -70150 5686 102186 -799 24166 -76880 -41464 -46605 -30734
24184c0734j04272m1779j1403O66O7116M6619K00187j83382M6069J81795K3128
$$ -30734 -135006 -176785 -188188 -187522 -120406 -73787 126400 -56982 -10913 170882 194010
24173A94010j11500j60559K00323m2638j99136Q6402M1403K04765j179M4235q7725
$$ 194010 82510 -78049 122274 79636 -119500 -33098 8305 213070 211891 256126 168401
24162A68401l94576j22155K74992K6587r2815M244L7184n0333K43896K8865l87390
$$ 168401 -226175 -348330 -73338 -46751 -139566 -135322 -98138 -148471 95425 124290 -263100
24151b63100k448Q7569j73891m5307j18784J13400K73223K64144j22789J3085
$$ -263100 -265548 -177979 -351870 -397177 -515961 -402561 -129338 134806 12017 25102
24141B5102o5728j65080j73513p6027J37033J62265N7540O7863k9398j30M5784
$$ 25102 -40626 -205706 -379219 -455246 -318213 -155948 -98408 -30545 -59943 -60073 -14289
24130a4289J9108k67200O2428L9271p3415p3392Q1929Q7061J33992j1159j43099
$$ -14289 4819 -262381 -199953 -160682 -234097 -307489 -225560 -138499 -4507 -15666 -158765
24119a58765K5018K67246j32607r1527l7969k08862k8017l5145J22175M8400J93690
$$ -158765 -133747 133499 892 -90635 -128604 -337466 -365483 -400628 -278453 -230053 -36363
24108c6363J2922r0674p032j81850j16152k6063J23968j9451n811K39496p5984
$$ -36363 -23441 -114115 -121147 -302997 -419149 -445212 -321244 -340695 -346506 -107010 -182994
24097a82994n2624O9380M2136j73822N579r694J18624o3073K148Q0616L0915R1106
$$ -182994 -235618 -166238 -124102 -297924 -292345 -302039 -183415 -246488 -244340 -163724 -132809 -41703
24085d1703J29153n6194p6360J70798L56626O0735k22893j86432k08685k07580
$$ -41703 87450 31256 -45104 125694 482320 543055 320162 133730 -74955 -282535
24075b82535J23037l4264j13140P373J66820J41748k13860j58526J25747L2294
$$ -282535 -159498 -193762 -306902 -299529 -132709 9039 -204821 -363347 -237600 -205306
24065b05306k1009k13106K34545J12881J93319O3999R218j57782p6221J17926
$$ -205306 -226315 -439421 -204876 -91995 101324 165323 174541 16759 -59462 58464
24055E8464K21546J0282O026j90798K7276J96164j83812l11698J07293j4692j42036
$$ 58464 280010 290292 296318 105520 132796 328960 145148 -166550 -59257 -73949 -215985
24044b15985q5760Q5370k04989k6260P1516r9323N1630J75849J27425o7246k00969
$$ -215985 -301745 -216375 -421364 -447624 -376108 -475431 -423801 -247952 -120527 -187773 -388742
24033c88742J84392j2790k9645j9560J30725m571j68562N9215j63606P3978J2506
$$ -388742 -204350 -217140 -246785 -266345 -135620 -140191 -308753 -249538 -413144 -339166 -326660
24022c26660L6961J78824P3150j47241K80302M679j22847O9493j77167Q6039K36907
$$ -326660 -289699 -110875 -37725 -184966 95336 100015 -22832 46661 -130506 -44467 192440
24011A92440j73241L2240n2524j33981M8075p4167j72863j56724O1496J71488
$$ 192440 19199 51439 -1085 -135066 -86991 -161158 -334021 -490745 -429249 -257761
24001b57761l446J10814Q8255q9770J71729J9969p1051L659J4591M2270K07249
$$ -257761 -261207 -150393 -62138 -151908 19821 39790 -31261 -27602 -13011 29259 236508
23990B36508o1738k26921K2682k79713L4234K78937J10379j41566N8201k17779
$$ 236508 174770 -52151 -29469 -309182 -274948 3989 114368 -27198 31003 -186776
23980a86776k31201J0356m0441J95441K16562P0737j36516M0001K14238L3176
$$ -186776 -417977 -407621 -448062 -252621 -36059 34678 -101838 -61837 152401 185577
23970A85577o3833J9203K34004j32400o0184p3242j62798J43468J23796k96814
$$ 185577 121744 140947 374951 242551 182367 109125 -53673 89795 213591 -83223
23960h3223l6693J5112M2614N3646K428j96268m4008l42892m7587K81834m9228
$$ -83223 -119916 -104804 -62190 -8544 -6116 -202384 -246392 -589284 -636871 -355037 -404265
23949d04265K145J9511l8581o3318J18654J14209J3432q9172k5732K01402J95457
$$ -404265 -402120 -382609 -421190 -484508 -365854 -251645 -238213 -327385 -353117 -151715 43742
23938D3742j6831k05483p08K07227p8621o8368K26989l7562r3871j3670O1991
$$ 43742 26911 -178572 -179280 27947 -50674 -119042 107947 70385 -23486 -37156 24835
23927B4835J16215P7975p1003k01240J31601R9502P6277j64535j71446O1301l31381
$$ 24835 141050 219025 148022 -53218 78383 177885 254162 89627 -81819 -20518 -351899
23916c51899r7192j73673L4039J22710J08225m1131p0032Q4305K00243n304J676
$$ -351899 -449091 -622764 -588725 -466015 -357790 -398921 -468953 -384648 -184405 -189709 -188033
23905a88033J16575J9675j3012j72767J02526j8200J68731J34365r1858l2105
$$ -188033 -71458 -51783 -64795 -237562 -135036 -153236 15495 149860 58002 25897
23895B5897j23862M885J00388j07458M9501J84777J83001J5948j27918M8599R1456
$$ 25897 -97965 -93080 7308 -100150 -50649 134128 317129 333077 205159 253758 345214
23884C45214j44319L9175J07953l25548j28944K44948j98912p484M8915k5154
$$ 345214 200895 240070 348023 22475 -106469 138479 -60433 -67917 -19002 -44156
23874d4156K45887l5407k27726k04685k5470k0730N8775k8729Q4853J93104J86710
$$ -44156 201731 166324 -61402 -266087 -291557 -312287 -253512 -282241 -197388 -4284 182426
23863A82426l09333j90228N6944J06199j73294m2124N6144j29032k4543K09909
$$ 182426 -126907 -317135 -260191 -153992 -327286 -369410 -313266 -442298 -466841 -256932
23853b56932K58484k9311J6460J26727J39033r9532q2133o9793J10286J80967
$$ -256932 1552 -27759 -11299 115428 254461 154929 72796 3003 113289 294256
23843B94256k92016k94907L4871L29198J00425k8136j14980j20697k7867R7414
$$ 294256 2240 -292667 -257796 71402 171827 143691 28711 -91986 -119853 -22439
23833b2439Q3840q8087k38477K47979m2020j89137L5863J10850k08851k2961l013
$$ -22439 61401 -26686 -265163 -17184 -59204 -248341 -212478 -101628 -310479 -333440 -336453
23822c36453J69376R7650K471j10105j63687K38690J64765K3806L3331k1300j11873
$$ -336453 -167077 -69427 -66956 -177061 -340748 -102058 62707 86513 119844 98544 -13329
23811a3329j0638K0674P2021j53642j24146J36486j10245J31228j2575J5229J44339
$$ -13329 -23967 -3293 68728 -84914 -209060 -72574 -182819 -51591 -64166 -48937 95402
23800I5402M2493j60405j28600j17618k25942l6901J70356N2902J48037k71875
$$ 95402 137895 -22510 -151110 -268728 -494670 -531571 -361215 -308313 -160276 -432151
23790d32151R14P1470J8331O5607j04552Q7774J33389j60185j24690J09172K04364
$$ -432151 -431237 -359767 -341436 -275829 -380381 -292607 -159218 -319403 -444093 -334921 -130557
23779a30557K03295N0790j36366J28756r5245j9727j66782r9884j47966j55065
$$ -130557 72738 123528 -12838 115918 20673 946 -165836 -265720 -413686 -568751
23769e68751J02694M18275L3051O1905o159j14745l8294J00991O5682J02047K22214
$$ -568751 -466057 -47782 -14731 47174 41015 -73730 -112024 -11033 54649 156696 378910
23758C78910j65622l61510k87540M4929K55720k8237l2658n2941J16249k2840
$$ 378910 213288 -148222 -435762 -390833 -135113 -163350 -196008 -248949 -132700 -155540
23748a55540j07559K20521P9511j60542j39147l9058L2119M7353k54332k22406
$$ -155540 -263099 -42578 36933 -123609 -262756 -301814 -269695 -222342 -476674 -699080
23738f99080J69544J98265n9306R5408J68632j60702j5481n0727q2374k0129j9715
$$ -699080 -529536 -331271 -390577 -295169 -126537 -287239 -302720 -353447 -435821 -455950 -475665
23727d75665j11300Q6826J89082K92461M4784k34386l30747L11145M09348K18104
$$ -475665 -586965 -500139 -311057 -18596 26188 -208198 -538945 -227800 181548 399652
23717C99652o231m18829l62352J14447M45155p7453m27700j90605L8040J58103
$$ 399652 393421 -25408 -387760 -273313 171842 94389 -333311 -523916 -485876 -327773
23707c27773L42478K05223k7468K3505k18602k9290J78694J36741J89422k90028
$$ -327773 14705 219928 192460 215965 -2637 -31927 146767 283508 472930 182902
23697A82902j93792J27710J62086j03985n1580N6084m0174j02829l64600k4136
$$ 182902 -10890 116820 278906 174921 123341 179425 139251 36422 -328178 -352314
23687c52314K22314P184J74811r152j41388j01380m2679o7170k36959J350K32935
$$ -352314 -130000 -122816 51995 42843 -98545 -199925 -242604 -309774 -546733 -545383 -312448
23676c12448J45055Q5326K00114k9600k27319j27j25657j57855J16231j9607J25939
$$ -312448 -167393 -82067 118047 88447 -138872 -138999 -264656 -422511 -306280 -325887 -199948
23665a99948M1377Q4179J09712q6591o1514J02679J14582j10455k20501K9825
$$ -199948 -158571 -74392 35320 -51271 -112785 -10106 104476 -5979 -226480 -196655
23655a96655J84959J24574M8062o2105K89050O8913j02761J21124j43441Q3316
$$ -196655 -11696 112878 160940 98835 387885 456798 354037 475161 331720 415036
23645D15036N9374j74362m67187j22793j57487J27580K58524J49793M703j71747
$$ 415036 474410 300048 -167139 -289932 -447419 -319839 -61315 88478 93181 -78566
23635g8566k4189l9479o6335l4516J54648L1766j62172o7431K60615K05844p7011
$$ -78566 -102755 -142234 -208569 -243085 -88437 -56671 -218843 -286274 -25659 180185 103174
23624A03174j55533N5405j31402l63230l3142O2417P0197J03355P7470j0580j58023
$$ 103174 -52359 3046 -128356 -491586 -524728 -462311 -392114 -288759 -211289 -221869 -379892
23613c79892p0462K61164o238o8194J73592P4270r3060M7051o7480j13629L6047
$$ -379892 -450354 -189190 -195428 -263622 -90030 -15760 -108820 -61769 -129249 -242878 -206831
23602b06831K00719j22314q758K02439J00512j99564r8767j02189k24349o9054
$$ -206831 -6112 -128426 -137184 65255 165767 -33797 -132564 -234753 -459102 -528156
23592e28156K13311J09020K24106J44368J81032l2258m783l69573l44748l1547
$$ -528156 -314845 -205825 18281 162649 343681 311423 306640 -62933 -407681 -439228
23582d39228P8040J29842P9159J58269O967n795O4941R3455P4410j64764l19350
$$ -439228 -361188 -231346 -152187 6082 13049 7254 72195 165650 240060 75296 -244054
23571b44054l95504J09277J5383P8568L72798M6949j31910r6702P8549K477q2154
$$ -244054 -639558 -530281 -514898 -436330 -63532 -16583 -148493 -245195 -166646 -164169 -246323
23560b46323R6321J14033O2450j30257o7709J15771n1187j74867q9624O1701J88974
$$ -246323 -150002 -35969 26481 -103776 -171485 -55714 -106901 -281768 -371392 -309691 -120717
23549a20717J9036J4226j30455q0788Q9058n2869o418n9677k1433J98146M8969
$$ -120717 -101681 -87455 -217910 -298698 -209640 -262509 -268927 -328604 -350037 -151891 -102922
23538a02922j63471j26417O6681p9489j7355K59870j30011o9644K98551J26744
$$ -102922 -266393 -392810 -326129 -405618 -422973 -163103 -293114 -362758 -64207 62537
23528F2537k30076r3887M32856j28044j81805k0152N7149O0560N2202J8984j40292
$$ 62537 -167539 -261426 171430 43386 -138419 -158571 -101422 -40862 11340 30324 -109968
23517a09968M9314m1700J30393m2851j83771M6172J89697R6876j3847r3652m0238
$$ -109968 -60654 -102354 28039 -14812 -198583 -152411 37286 134162 120315 26663 -13575
23506a3575M9695o7632j678l1128l4761K750L911o4643k97810n6447K77344L8905
$$ -13575 36120 -31512 -33190 -64318 -99079 -96329 -92418 -157061 -454871 -511318 -233974 -195069
23494a95069P0871P4325k61861m7028j13002J26147k6473L6775p2336j14331Q3173
$$ -195069 -124198 -49873 -311734 -358762 -471764 -345617 -372090 -335315 -407651 -521982 -438809
23483d38809m4901K8430J20166J87527Q5205K23206m5407k45792k39647n4160
$$ -438809 -483710 -455280 -335114 -147587 -62382 160824 115417 -130375 -370022 -424182
23473d24182q3027L75725K93564j86222l62039n962K27776J33242k61017j96401
$$ -424182 -507209 -131484 162080 -24142 -386181 -392143 -164367 -31125 -292142 -488543
23463d88543J22090R494j280j12512P3120K78825O853o5142J86178K95204r187
$$ -488543 -366453 -356959 -358239 -470751 -397631 -118806 -111953 -177095 9083 304287 295100
23452B95100n7207q4601p1132l2180j18671j27931L2280J07945Q7554J9313L35091
$$ 295100 237893 153292 82160 49980 -68691 -196622 -164342 -56397 31157 50470 385561
23441C85561j507k42568l58695l5413J69038J22676k363j19782k21105j62546
$$ 385561 384054 141486 -217209 -252622 -83584 39092 36729 -83053 -304158 -466704
23431d66704p3640J43599J05168J33671j03554j5520P3907J35292j00626j23216
$$ -466704 -540344 -396745 -291577 -157906 -261460 -276980 -203073 -67781 -168407 -291623
23421b91623j74240j05117l4559K26598K07339Q3200q0782j20149j63012R0834
$$ -291623 -465863 -570980 -605539 -378941 -171602 -88402 -169184 -289333 -452345 -361511
23411c61511J38553N4806J70981L80249j32568k33380K47608p8577j93131j8099
$$ -361511 -222958 -168152 2829 383078 250510 17130 264738 186161 -6970 -25069
23401b5069O0818O8771P1439k37475j67123J5321P3931m9333m5974q7123r6833
$$ -25069 35749 104520 175959 -61516 -228639 -213318 -139387 -188720 -234694 -321817 -418650
23390d18650R5327L22856p1187j12403N9050l0995j04406p2522j96540J7473m390
$$ -418650 -323323 -467 -71654 -184057 -125007 -156002 -260408 -332930 -529470 -511997 -516387
23379e16387K75827J85233l0754N4146Q5957j10160Q5639J66682J61170q9185
$$ -516387 -240560 -55327 -86081 -31935 54022 -56138 29501 196183 357353 268168
23369B68168J9261J58243j0754j52549m1773l28800k07417j4486J80309p9508
$$ 268168 287429 445672 434918 282369 240596 -88204 -295621 -310107 -129798 -209306
23359b09306J60468J6134k27516K84955J88726q5738r5130r918J39962k8600R3286
$$ -209306 -48838 -32704 -260220 24735 213461 127723 32593 22675 162637 134037 227323
23348B27323r7516n0985J34767j08796j06029O9836l7529j18205J61666N8434
$$ 227323 129807 78822 213589 104793 -1236 68600 31071 -87134 74532 132966
23338A32966o0717k07473j67989m4668K2509K07409K14709j30634k02460o5584
$$ 132966 72249 -135224 -303213 -347881 -325372 -117963 96746 -33888 -236348 -301932
23328c01932J5158Q9646q3572k25253P5966J70408K00441K3586j79502j11377
$$ -301932 -286774 -197128 -280700 -505953 -429987 -259579 -59138 -35552 -215054 -326431
23318c26431r3193m4811o1579K21295O5462j03634k79247J22268L25607l2371
$$ -326431 -419624 -464435 -526014 -304719 -239257 -342891 -622138 -499870 -174263 -206634
23308b06634m9651P3382L0477L4271J23772K7434J7616k23003K71046J67655q6874
$$ -206634 -256285 -182903 -152426 -118155 5617 33051 50667 -172336 98710 266365 179491
23297A79491r922l34789l11231j10507j6472L52961K16751k28833j69741J47957
$$ 179491 169569 -165220 -476451 -586958 -603430 -250469 -33718 -262551 -432292 -284335
23287b84335J13770N6292J34815k46921j4427J8834k2741J08132j43588J1668
$$ -284335 -170565 -114273 20542 -226379 -240806 -221972 -244713 -136581 -280169 -268501
23277b68501J91189j4001k955J64813M175j05472K8472l9552j45756j1127j1482
$$ -268501 -77312 -91313 -94268 70545 74720 -30752 -2280 -41832 -187588 -198715 -210197
23266b10197J46186l4570j7712P5035Q8223k2236q8430r5404j47962j27042j69535
$$ -210197 -64011 -98581 -116293 -41258 46965 24729 -63701 -159105 -307067 -434109 -603644
23255f03644k9630N6021K0427q00o715J67560L21307q3584J00118P6811r5302
$$ -603644 -633274 -577253 -556826 -557626 -564341 -396781 -75474 -159058 -58940 17871 -77431
23244g7431p2940J27268O1098k31705j47016k22311J02812J81121K73071J83847
$$ -77431 -150371 -23103 37995 -193710 -340726 -563037 -460225 -279104 -6033 177814
23234A77814K7072j37307j4887n2483n0486j73347r2501p067q601P2113O8723
$$ 177814 204886 67579 52692 209 -50277 -223624 -316125 -323192 -331793 -259680 -190957
23223a90957N1942J00440J5434m9207l4660j61726j39772J14163R9316R5422N5607
$$ -190957 -139015 -38575 -23141 -72348 -107008 -268734 -408506 -294343 -195027 -99605 -43998
23212d3998J56766J4529K2526M9860j12762m5881k02349J26954Q2030N4605p6202
$$ -43998 112768 127297 149823 199683 86921 41040 -161309 -34355 47675 102280 26078
23201B6078P6772N9560J22417j22716j12357k98699j03109j98495J14876K24058
$$ 26078 102850 162410 284827 162111 49754 -248945 -352054 -550549 -435673 -211615
23191b11615K6920o763o393j14754O1159R5166j1472R1674J63519j50774l0470
$$ -211615 -184695 -191458 -197851 -312605 -251446 -156280 -167752 -76078 87441 -63333 -93803
23180i3803r5551P4458J27142j50445j26263K5226Q0552P1769J9487o0578J42969
$$ -93803 -189354 -114896 12246 -138199 -264462 -239236 -158684 -86915 -67428 -128006 14963
23169A4963L2700L9598j29508J7377k00819m19247P6647J43639j860J72875M0911
$$ 14963 47663 87261 -42247 -24870 -225689 -644936 -568289 -424650 -426510 -253635 -212724
23158b12724N1392O8008M6499L41101O4724m1358k83894j31983k82449j15355
$$ -212724 -161332 -93324 -46825 294276 359000 317642 33748 -98235 -380684 -496039
23148d96039L8377K8843J27232J22465J80609P7952k998j33316k88768J67849
$$ -496039 -457662 -428819 -301587 -179122 1487 79439 76441 -56875 -345643 -177794
23138a77794J26866K1108m6528r9024o2670K31655k9393p4133k5420P0570j6756
$$ -177794 -50928 -29820 -76348 -175372 -238042 -6387 -35780 -109913 -135333 -64763 -81519
23127h1519m0242j4661Q6824n6867K9843K00273n6520q0436j23699Q1410J6374
$$ -81519 -121761 -136422 -49598 -106465 -76622 123651 67131 -13305 -137004 -55594 -39220
23116c9220o6894J42306p903J58052Q5041k65501Q4554Q1149l5036j55045j95908
$$ -39220 -106114 36192 28289 186341 271382 5881 90435 171584 136548 -18497 -214405
23105b14405p2522R7222j54306K07408J0908k26838L9163J51527M9095L379L272
$$ -214405 -286927 -189705 -344011 -136603 -125695 -352533 -313370 -161843 -112748 -109369 -106097
23094a06097N9240q73k17179P198N5103R9730J99799K9097l8629L37J3777n0200
$$ -106097 -46857 -47730 -264909 -257711 -202608 -102878 96921 126018 87389 87726 101503 51303
23082E1303j24924q6681P5746O7141L8717k52525j00077Q7140R9359J00875j82233
$$ 51303 -73621 -160302 -84556 -17415 21302 -231223 -331300 -244160 -144801 -43926 -226159
23071b26159j46113L1574K22431J47878q7324o7525J39630l0966J38982J01967
$$ -226159 -372272 -340698 -118267 29611 -57713 -125238 14392 -16574 122408 224375
23061B24375K6709k82151j22397K27633j33140p4564j52042O5449J39968j04869
$$ 224375 251084 -31067 -153464 74169 -58971 -133535 -285577 -220128 -80160 -185029
23051a85029j14579O1871J39317J2691J3189K25794q9577j59421P0599j90817
$$ -185029 -299608 -237737 -98420 -85729 -72540 153254 63677 -95744 -25145 -215962
23041b15962O2377R0162K7501L6326J35829o7316n8258q1121j14233Q5798j18201
$$ -215962 -153585 -63423 -35922 404 136233 68917 10659 -70462 -184695 -98897 -217098
23030b17098N0689L4535j30068J3016K24064K28859p659J15171M598O9318p7546
$$ -217098 -166409 -131874 -261942 -248926 -24862 203997 196338 311509 316107 385425 307879
23019C07879l88281l28529L7163R9722J6123N1549r5876j06376J47295L67764
$$ 307879 -80402 -408931 -371768 -272046 -255923 -204374 -300250 -406626 -259331 108433
23009A08433Q3796j65375j65057j5669J72693n3496N0598M5607m2372j48239p6258
$$ 108433 192229 26854 -138203 -153872 18821 -34675 15923 61530 19158 -129081 -205339
22998b05339K05572l0577J09753m9090j82023K45640Q8025j09200K71099K44985
$$ -205339 233 -30344 79409 30319 -151704 93936 181961 72761 343860 588845
22988E88845j80465k54829j61243J03581k04381M2393j44028j19208N0811J90608
$$ 588845 408380 153551 -7692 95889 -108492 -66099 -210127 -329335 -278524 -87916
22978h7916j78457M8701K09076J37527j63412k94422K08853J25842K52702n2692
$$ -87916 -266373 -217672 -8596 128931 -34481 -328903 -120050 5792 258494 205802
22968B05802k09292j28655k77861N6391J84307J35811J10577k20745J43471Q4881
$$ 205802 -3490 -132145 -410006 -353615 -169308 -33497 77080 -143665 -194 84687
22958H4687P5123K4717j11252j15179N2056m5319j48442r9621j7715n3339O6875
$$ 84687 159810 184527 73275 -41904 10152 -35167 -183609 -283230 -300945 -354284 -287409
22947b87409K36415l0806j29378k661k2676J51285Q7940M057o6296j77818j37797
$$ -287409 -50994 -81800 -211178 -213839 -236515 -85230 2710 6767 -59529 -237347 -375144
22936c75144p5453J66604r4851O698L25345J79980k18399N8879R2265N8668j8417
$$ -375144 -450597 -283993 -378844 -372146 -46801 133179 -85220 -26341 65924 124592 106175
22925A06175j9339J47454j17736k22246o219M3466J97243J39781n450j2090k1624
$$ 106175 86836 234290 116554 -105692 -111911 -68445 128798 268579 263129 251039 229415
22914B29415r088j20264j72713j51149J65821k0554j18675j75271k07356K58923
$$ 229415 220327 100063 -72650 -223799 -57978 -78532 -197207 -372478 -579834 -320911
22904c20911L16832R9800o5556K3468K38558N5154m6151k40424M891j72390m8523
$$ -320911 -4079 95721 30165 53633 292191 347345 301194 60770 65661 -106729 -155252
22893a55252p5986p581O0715J88693M6079J28307j02345k80811j46353r3304N3167
$$ -155252 -231238 -238819 -178104 10589 56668 184975 82630 -198181 -344534 -437838 -384671
22882c84671K1885L9717N8137J76962Q6989r01j22801l9833k08777r7522p6581
$$ -384671 -362786 -323069 -264932 -87970 -981 -1882 -124683 -164516 -373293 -470815 -547396
22871e47396J3756J21609l6216m4868K46242N9030J33815Q859O8475J22767r4002
$$ -547396 -533640 -412031 -448247 -493115 -246873 -187843 -54028 -45169 23306 146073 52071
22860E2071J07547Q1768j92570o5531L4422K04565j41959j63809N9252j69385
$$ 52071 159618 241386 48816 -16715 17707 222272 80313 -83496 -24244 -193629
22850a93629k47326K48046P1347j66399O0958n6823k48080k31126K45590K15996
$$ -193629 -440955 -192909 -121562 -287961 -227003 -283826 -531906 -763032 -517442 -301446
22840c01446k04816r7527L42432J48482J81726k279l1852q6949O9041j6333L50330
$$ -301446 -506262 -603789 -261357 -112875 68851 66572 34720 -52229 16812 479 350809
22829C50809R1052k44811p4050o2355q9070R4182p7563k1839N2204M1358k12576
$$ 350809 441861 197050 123000 60645 -28425 65757 -11806 -33645 18559 59917 -152659
22818a52659j32187O9929J43594l5299L10364J85124N9595j55419j15717q3558
$$ -152659 -284846 -214917 -71323 -106622 203742 388866 448461 293042 177325 93767
22808I3767P9939j76339m03798l8353r8886K57412J31589m3559j33387k03069
$$ 93767 173706 -2633 -406431 -444784 -543670 -286258 -154669 -198228 -331615 -534684
22798e34684j84351J68237K89598L27180j27362j62188K14661K7703j318k9544
$$ -534684 -719035 -550798 -261200 65980 -61382 -223570 -8909 18794 17476 -12068
22788a2068Q3824k4810M4253J61378K2933k08032o4826J79125l3655k26244Q035
$$ -12068 71756 46946 91199 252577 275510 67478 2652 181777 148122 -78122 -70087
22777g0087j19549Q8955l0635J16339n0635n8103n3934p9720J55393L0948k07592
$$ -70087 -189636 -100681 -131316 -14977 -65612 -123715 -177649 -257369 -101976 -71028 -278620
22766b78620m9512J34427K10686J20647O317j58985j461J30830L4613r6236k07292
$$ -278620 -328132 -193705 16981 137628 143945 -15040 -16501 114329 148942 52706 -154586
22755a54586j44169j04437L5844J14981J71072m0523n5614M2523k98j0003K4530
$$ -154586 -298755 -403192 -367348 -252367 -81295 -121818 -177432 -134909 -135207 -145210 -120680
22744a20680J93470N8104K881k48103j72249m8194K10827J4219j05765O5714J68286
$$ -120680 72790 130894 133775 -114328 -286577 -334771 -123944 -109725 -215490 -149776 18510
22733A8510n277k03737j37651r744J04851J41188M2202J20965J25446P4736o6369
$$ 18510 13233 -190504 -328155 -337899 -233048 -91860 -49658 71307 196753 271489 205120
22722B05120k23274R9390J3405k58615k88459J52501N9492j7862r4976R3694K27272
$$ 205120 -18154 81236 94641 -163974 -452433 -299932 -240440 -258302 -353278 -259584 -32312
22711c2312P2686P8127j72319k24286l8828r5098j26633k1515j19070r0567K20271
$$ -32312 40374 118501 -53818 -278104 -316932 -412030 -538663 -560178 -679248 -769815 -549544
22700e49544K54430J22653j70603k14169P6371J19754Q3937P7887m2273J9837
$$ -549544 -295114 -172461 -343064 -557233 -480862 -361108 -277171 -199284 -241557 -221720
22690b21720J93045m2752k24442O5091K97583M8981j16805k10244l47269j03305
$$ -221720 -28675 -71427 -295869 -230778 66805 115786 -1019 -211263 -558532 -661837
22680f61837K23210L99000J10316J01064j24294K9646P7522J93036q2718l11109
$$ -661837 -438627 -39627 70689 171753 47459 77105 154627 347663 264945 -46164
22670d6164L7277Q4007L2881j51002j52597k60649j56290N1396M8295J79799J83982
$$ -46164 -8887 75120 108001 -43001 -195598 -456247 -612537 -561141 -512846 -333047 -149065
22659a49065j3515j51662P8261J64523n8058j70428j3257K1123J7127J2139K66160
$$ -149065 -162580 -314242 -235981 -71458 -129516 -299944 -313201 -292078 -274951 -262812 3348
22648C348n719l01052L1891Q4855L7921l8070M7392J16535j12799j49829P999
$$ 3348 -2371 -303423 -271532 -186677 -148756 -186826 -139434 -22899 -135698 -285527 -277528
22637b77528M3275J6863j690J283q826J03508J45961K05928K6565r1188k87354
$$ -277528 -234253 -217390 -219080 -217797 -226623 -123115 22846 228774 255339 164151 -123203
22626a23203L6811r5475j07132o2972N2013Q4757K08069Q7332l6795j30954L5178
$$ -123203 -86392 -181867 -288999 -351971 -299958 -215201 -7132 80200 43405 -87549 -52371
22615e2371j77404k07400j19357O9043N2505J73697L1360Q4250N6435j30361j54006
$$ -52371 -229775 -437175 -556532 -487489 -434984 -261287 -229927 -145677 -89242 -219603 -373609
22604c73609k67452L55912J06667k3822k45025n3095M29052J57400j56808j36586
$$ -373609 -641061 -285149 -178482 -202304 -447329 -500424 -71372 86028 -70780 -207366
22594b07366M048k588J15416j6584q6778O6460j27931k36040M5535K47180Q3261
$$ -207366 -203318 -205906 -90490 -107074 -193852 -127392 -255323 -491363 -445828 -198648 -115387
22583a15387J7494L5277m5835P9019J67952j39896j69830R761k6565L5217K71524
$$ -115387 -97893 -62616 -108451 -29432 138520 -1376 -171206 -161445 -188010 -152793 118731
22572A18731K16445K1229l88610J26661J02984k57333r295m0649J47629J45787
$$ 118731 335176 356405 -32205 94456 197440 -59893 -69188 -109837 37792 183579
22562A83579r4814k74156j30878K8408Q0026K58499K72806k2795l26366p1397
$$ 183579 88765 -185391 -316269 -287861 -207835 50664 323470 300675 -25691 -97088
22552i7088j56410J1829L08305j83303j10534J37075j06014J7221K57304j6458
$$ -97088 -253498 -241669 66636 -116667 -227201 -90126 -196140 -178919 78385 61927
22542F1927k49661J16138J65730J672k8445q0674j56390j42735l7233J48953N5723
$$ 61927 -187734 -71596 94134 95806 67361 -13313 -169703 -312438 -349671 -200718 -144995
22531a44995j72325j6132N4181K54807J01655Q0093j46002j70536K56867m4609
$$ -144995 -317320 -333452 -279271 -24464 77191 157284 11282 -159254 97613 53004
22521E3004j68715M3429J02188k13403n4269p0222j97715J63643J95943J84776
$$ 53004 -115711 -72282 29906 -183497 -237766 -307988 -505703 -342060 -146117 38659
22511C8659O7786o393M3200j36077M0505J38882P1623j25194k27778m3385L7649
$$ 38659 106445 100052 143252 7175 47680 186562 258185 132991 -94787 -138172 -100523
22500a00523o4636J47801q3914k15077r5147P9185J11774Q9338k8707m287p2922
$$ -100523 -165159 -17358 -101272 -316349 -411496 -332311 -220537 -131199 -159906 -164193 -237115
22489b37115m478N9768N4478r6361M5736L02391q7172k84455j78617M9037J43078
$$ -237115 -241593 -181825 -127347 -223708 -177972 124419 37247 -247208 -425825 -376788 -233710
22478b33710K62695L7663O5079j10476l8261K31982j84035k25107k6172j5856
$$ -233710 28985 66648 131727 21251 -17010 214972 30937 -194170 -220342 -236198
22468b36198J87269m5971l3384o3707J81915K03130R8585j30439N4077k38688
$$ -236198 -48929 -94900 -128284 -191991 -10076 193054 291639 161200 215277 -23411
22458b3411l32017j84840J35981K10415J98198J73729K235l75812j29261K90040
$$ -23411 -355428 -540268 -404287 -193872 4326 178055 180290 -195522 -324783 -34743
22448c4743M4943l8465m1405m2717p4876N2712K67025J28288k13278n9828J16063
$$ -34743 10200 -28265 -69670 -112387 -187263 -134551 132474 260762 47484 -12344 103719
22437A03719J28367j66121q7915q507K7726j689l33667j65469Q1072J79334k2651
$$ 103719 232086 65965 -21950 -30457 -2731 -4420 -338087 -503556 -422484 -243150 -265801
22426b65801r8274q9747j33525K2192J43568k06114j82557K36551K21026J20271
$$ -265801 -364075 -453822 -587347 -565155 -421587 -627701 -810258 -573707 -352681 -232410
22416b32410k2926J86585J19323J34826J64094k35914j99287J6184K04630O6180
$$ -232410 -255336 -68751 50572 185398 349492 113578 -85709 -69525 135105 201285
22406B01285q0997M5341K0953j5324J79798l9400O4219J13665j42168K3834r324
$$ 201285 120288 165629 186582 171258 351056 311656 375875 489540 347372 371206 361882
22395C61882o6154l51420j48375j6623R469k75304p7626N0868K38606K63474q2082
$$ 361882 295728 -55692 -204067 -220690 -211221 -486525 -564151 -513283 -274677 -11203 -93285
22384i3285k15253J26555j55371l9478K84239J24224J35930k25800j24635K8787
$$ -93285 -308538 -181983 -337354 -376832 -92593 31631 167561 -58239 -182874 -154087
22374a54087l5772J59694J22644M7150l4834p0061m8605J47862q9524m7852j42717
$$ -154087 -189859 -30165 92479 139629 104795 34734 -13871 133991 44467 -3385 -146102
22363a46102R3729J89390J63287O055j1445k28922j83500R9658J5236O2022j3666
$$ -146102 -52373 137017 300304 306359 294914 65992 -117508 -17850 -2614 59408 45742
22352D5742J76120k5317J1010P0670o8447j00850n9074P536J96109Q6684p0407
$$ 45742 221862 196545 207555 278225 209778 108928 49854 57390 253499 340183 269776
22341B69776j47171k14778k71234j01263J39696k6173K00142J27064J48695m1494
$$ 269776 122605 -92173 -363407 -464670 -324974 -351147 -151005 -23941 124754 83260
22331H3260j06369o961o3988j0548j88753q7442K25960P0859p5807j16241K0233
$$ 83260 -23109 -30070 -94058 -104606 -293359 -380801 -154841 -83982 -159789 -276030 -255797
22320b55797R1597J75690j81101j13591M6641Q9476m2100L9020K88788r1187M6337
$$ -255797 -164200 11490 -169611 -283202 -236561 -147085 -189185 -150165 138623 47436 93773
22309I3773l6803k42664k44799K70495J25613j39772K4243q0504k51669J26951
$$ 93773 56970 -185694 -430493 -159998 -34385 -174157 -149914 -230418 -482087 -355136
22299c55136K70676J49155q824j12240q2128Q1995j57282J70053J23431M5960
$$ -355136 -84460 64695 55871 -56369 -138497 -56502 -213784 -43731 79700 125660
22289A25660J52758J11060k50138j92005q4390k38059j66787j92485K20404L65609
$$ 125660 278418 389478 139340 -52665 -137055 -375114 -541901 -734386 -513982 -148373
22279a48373J87703j14074j59085N8969J66726R0266J72317o487l7313r9128k32693
$$ -148373 39330 -74744 -233829 -174860 -8134 82132 254449 247962 210649 111521 -121172
22268a21172k57864N4513J68299J12435k51709N1474m8510O4537L49180k4406
$$ -121172 -379036 -324523 -156224 -43789 -295498 -244024 -292534 -227997 121183 96777
22258I6777l01566r6662J92551L42214j6138j00246o0158m3697K52881K71725
$$ 96777 -204789 -301451 -108900 233314 217176 116930 56772 13075 265956 537681
22248E37681k96552l57246O3264k14846P7786L75891Q0624p9903j20578r4578
$$ 537681 241129 -116117 -52853 -267699 -189913 185978 266602 186699 66121 -28457
22238b8457j34234O1108K41631J2650K9292k4188j17881n9786j56079j4848m4534
$$ -28457 -162691 -101583 140048 152698 181990 157802 39921 -19865 -175944 -190792 -235326
22227b35326k09756K27905K77925K8433k23873Q947J95710j29048J71569o0799
$$ -235326 -445082 -217177 60748 89181 -134692 -125745 69965 -59083 112486 51687
22217E1687j68752m5775N4598K7634J21224m6506j98626J50583K9541r0788N5427
$$ 51687 -117065 -162840 -108242 -80608 40616 -5890 -204516 -53933 -24392 -115180 -59753
22206e9753Q5652j05125p3324j97757R4572J71887J58957j91315j43186J72799
$$ -59753 25899 -79226 -152550 -350307 -255735 -83848 75109 -116206 -259392 -86593
22196h6593R9347p3468J13128J53312r8751O4255J84012j75338l33007l7977J91553
$$ -86593 12754 -60714 52414 205726 106975 171230 355242 179904 -153103 -191080 473
22185D73K6102p2324j92717j43218J28600J78140L2735j24120M0045K6668p9392
$$ 473 26575 -45749 -238466 -381684 -253084 -74944 -42209 -166329 -126284 -99616 -179008
22174a79008j75400n7069K19001o1496j56218n3579M9786J28378M3358R2502J03183
$$ -179008 -354408 -411477 -192476 -253972 -410190 -463769 -413983 -285605 -242247 -149745 -46562
22163d6562j39265j54478k21165M1595M1584J36548J06393J66426K39374K18447
$$ -46562 -185827 -340305 -561470 -519875 -478291 -341743 -235350 -68924 170450 388897
22153C88897J0197k75764k29066Q7114j59282p5303p4272M9338J76006r2759j62146
$$ 388897 399094 123330 -105736 -18622 -177904 -253207 -327479 -278141 -102135 -194894 -357040
22142c57040k70132l7471L92256K47812j03853K1131K42377k83399o2018L1577
$$ -357040 -627172 -664643 -272387 -24575 -128428 -107297 135080 -148319 -210337 -178760
22132a78760j25952K3569J05695n4099k0140j193p196J95831J70109k14676k28209
$$ -178760 -304712 -281143 -175448 -229547 -249687 -250880 -258076 -62245 107864 -106812 -335021
22121c35021J2769J22127p8315L02585M3100j29734J22562j35360m4018k0149
$$ -335021 -322252 -200125 -278440 24145 67245 -62489 60073 -75287 -119305 -139454
22111a39454J04625R1779Q4458j58604j59717K10258L0279j54955o8000k2787
$$ -139454 -34829 56950 141408 -17196 -176913 33345 63624 -91331 -159331 -182118
22101a82118j21653k48764k5643J47842J54561J71082j91336r6463M2849j03153
$$ -182118 -303771 -552535 -578178 -430336 -275775 -104693 -296029 -392492 -349643 -452796
22091d52796J96399j33622n8769L7359L9341P859K53507L01143L95k38990j52127
$$ -452796 -256397 -390019 -448788 -411429 -372088 -364229 -110722 190421 190816 -48174 -200301
22080b00301j66642K26347n5989Q7846K4910O3364j74062n2093J45480j8388M9647
$$ -200301 -366943 -140596 -196585 -108739 -83829 -20465 -194527 -246620 -101140 -119528 -69881
22069f9881j02785J02886k1665k51254J0559K53371O1165j52901N6678P5498O8284
$$ -69881 -172666 -69780 -91445 -342699 -332140 -78769 -17604 -170505 -113827 -38329 29955
22058B9955l23379k88592Q6658L24141N1790J65317j28565O5385R2637K56684
$$ 29955 -293424 -582016 -495358 -171217 -119427 45890 -82675 -17290 75347 332031
22048C32031P3450j34022J73376j79168j52737n9494L2013j87789l30966j30696
$$ 332031 405481 271459 444835 265667 112930 53436 85449 -102340 -433306 -564002
22038e64002L68471L96614l7722j17096k93068N6316M1837k2462L9561r8023j04946
$$ -564002 -195531 201083 163361 46265 -246803 -190487 -148650 -171112 -131551 -229574 -334520
22027c34520J21661J83624P7541q6466j46259m1629J20675j26054j10363k44280
$$ -334520 -212859 -29235 48306 -38160 -184419 -226048 -105373 -231427 -341790 -586070
22017e86070j74567L19684J27029o6534N9624j0065n852k086N6215R7347k22084
$$ -586070 -760637 -440953 -313924 -380458 -320834 -330899 -336751 -338837 -282622 -185275 -407359
22006d07359J66825P7787J05388j63949j92521L0417L3536m447J11390J66898
$$ -407359 -240534 -162747 -57359 -221308 -413829 -383412 -349876 -354323 -242933 -76035
21996g6035j56985k64938k7589J79837Q8466j7994j75854L370K65045j6508M7727
$$ -76035 -233020 -497958 -525547 -345710 -257244 -275238 -451092 -447722 -182677 -199185 -151458
21985a51458l5161p2295j58510J04655p4813J5960J88564K31774J22268j51557
$$ -151458 -186619 -258914 -417424 -312769 -387582 -371622 -183058 48716 170984 19427
21975A9427j18291J16432j14874J08255J39024p2445j21944m4704j07768R9003
$$ 19427 -98864 17568 -97306 10949 149973 77528 -44416 -89120 -196888 -97885
21965i7885R3958P9510J62259j29886l35720j45411J45122M9933J97084K44242
$$ -97885 -3927 75583 237842 107956 -227764 -373175 -228053 -178120 18964 263206
21955B63206k5322j02433l16325n3583J80719K3556K76223q2887k95694n2477
$$ 263206 237884 135451 -180874 -234457 -53738 -30182 246041 163154 -132540 -185017
21945a85017N0383l4021J01712Q0253j0093k2436J09032j64880o2900K10715Q2501
$$ -185017 -134634 -168655 -66943 13310 3217 -19219 89813 -75067 -137967 72748 155249
21934A55249K07368J16624j0281k10046k34031l05720l40367m4272J27529J01981
$$ 155249 362617 479241 468960 258914 24883 -280837 -621204 -665476 -537947 -435966
21924d35966J20878J41361J06181r8595k18450j2806K29234N4450k60755j71902
$$ -435966 -315088 -173727 -67546 -166141 -384591 -397397 -168163 -113713 -374468 -546370
21914e46370O1159J32035n2094M7060P962m4712o4601j5999n1517M2946J58447
$$ -546370 -485211 -353176 -405270 -358210 -350248 -394960 -459561 -475560 -527077 -484131 -325684
21903c25684K49383M6458j78762Q6908K06481L8762j92269L8928k32875J6794
$$ -325684 -76301 -29843 -208605 -121697 84784 123546 -68723 -29795 -262670 -245876
21893b45876J79184m7823L3693l7594j44822M6752R3937J29619J41983j78159
$$ -245876 -66692 -114515 -80822 -118416 -263238 -216486 -122549 7070 149053 -29106
21883b9106k39114o8876M2195j90352q0307J09388L10056K12789n6024K1961L6512
$$ -29106 -268220 -337096 -294901 -485253 -565560 -456172 -146116 66673 10649 32610 69122
21872F9122k1203j79361p5818j15086k9442J38334R2259P473j74883j2013m5631
$$ 69122 47919 -131442 -207260 -322346 -351788 -213454 -121195 -113722 -288605 -300618 -346249
21861c46249K64806p6892r8823K28951M6073j08588J47655m5764k71365q4102
$$ -346249 -81443 -158335 -257158 -28207 17866 -90722 56933 11169 -260196 -344298
21851c44298Q8736M5686j61135Q4420L08319J36978j18296j04956j01024O5798
$$ -344298 -255562 -209876 -371011 -286591 21728 158706 40410 -64546 -165570 -99772
21841i9772l209k28997j26703L06820J78033k46580n9621K38018k1953J41545
$$ -99772 -102981 -331978 -458681 -151861 26172 -220408 -280029 -42011 -63964 77581
21831G7581L173O0417p0580k9839j95403L2180j6994j84263j46906J47912J75118
$$ 77581 80754 141171 70591 40752 -154651 -122471 -139465 -323728 -470634 -322722 -147604
21820a47604J46029J52947J83472J16600k08567k96432k55208k27189j87437K40308
$$ -147604 -1575 151372 334844 451444 242877 -53555 -308763 -535952 -723389 -483081
21810d83081J20367K06746j7395k15387k49067K7027n1744K53321O3671J23150
$$ -483081 -362714 -155968 -173363 -388750 -637817 -610790 -662534 -409213 -345542 -222392
21800b22392K07540O8129j44710Q4624O8447k69928j11252K73508J42496j38849
$$ -222392 -14852 53277 -91433 -6809 61638 -208290 -319542 -46034 96462 -42387
21790d2387M6451j9384R1565k03521j37716j81652N3895K75454J11468q7434k46674
$$ -42387 4064 -15320 76245 -127276 -264992 -446644 -392749 -117295 -5827 -93261 -339935
21779c39935j76839J50798K08169o2609K0678J83758k83046L9123P4374K9965
$$ -339935 -516774 -365976 -157807 -220416 -199738 -15980 -299026 -259903 -185529 -155564
21769a55564J54805r3356k7257K3293J82849j57235k40095J27432K84237N6159
$$ -155564 -759 -94115 -121372 -98079 84770 -72465 -312560 -185128 99109 155268
21759A55268q2001o040m57p1043p9221k8736J7036Q7291L8419K7815j10020j40747
$$ 155268 73267 67227 66770 -4273 -83494 -112230 -95194 -7903 30516 58331 -51689 -192436
21747a92436n6776L9335k17620o7968K50747N7655J40227J53643L12j6761k68264
$$ -192436 -249212 -209877 -427497 -495465 -244718 -187063 -46836 106807 107119 90358 -177906
21736a77906k45551O3824j949P9245q7431n3630K85457J52938k9788m4248R7203
$$ -177906 -423457 -359633 -361582 -282337 -369768 -423398 -137941 14997 -14791 -59039 38164
21725C8164J34432p0805j9667l8156J29440l0685r8037k37169k09875J75700k5488
$$ 38164 172596 101791 82124 43968 173408 142723 44686 -192483 -402358 -226658 -252146
21714b52146j48518K09678M7316K75836J02630P445N4092j62671k67637n0894
$$ -252146 -400664 -190986 -143670 132166 234796 242241 296333 133662 -133975 -184869
21704a84869Q1905m7488j88937j43508J24422P6577l6349K09909J03991K37702
$$ -184869 -102964 -150452 -339389 -482897 -358475 -281898 -318247 -108338 -4347 233355
21694B33355K8597M3725K709j74869j06049j43783k05031r5125J65875L39444
$$ 233355 261952 305677 308386 133517 27468 -116315 -321346 -416471 -250596 88848
21684H8848r7231n3525P7871j16243R0496J36341j96937l9190J91463j56970j43998
$$ 88848 -8383 -61908 15963 -100280 -9784 126557 -70380 -109570 81893 -75077 -219075
21673b19075L3944O2451O508j86989n5756J56271K36138J08871j88924o3547q3940
$$ -219075 -185131 -122680 -116172 -303161 -358917 -202646 33492 142363 -46561 -110108 -194048
21662a94048j7015j25515P104J21862Q1699l38591K08884l047p4394j27502l3735
$$ -194048 -211063 -336578 -329474 -207612 -125913 -464504 -255620 -258667 -333061 -460563 -494298
21651d94298J17860J48201j91705J7646M2202o1914r6864o1550J24088J94526
$$ -494298 -376438 -228237 -419942 -402296 -360094 -422008 -518872 -580422 -456334 -261808
21641b61808M4844J78175m2099l9529J26772N7129Q7039J23162k6993k22385k35933
$$ -261808 -216964 -38789 -80888 -120417 6355 63484 150523 273685 246692 24307 -211626
21630b11626R6704N4417k60834j43444m7758K94480O1673p8211L9035K56412J9085
$$ -211626 -114922 -60505 -321339 -464783 -512541 -218061 -156388 -234599 -195564 60848 79933
21619G9933k38110L3688O3822r0137P7041k66814N081J98313J1615k98336O4721
$$ 79933 -158177 -124489 -60667 -150804 -73763 -340577 -335496 -137183 -125568 -423904 -359183
21608c59183J14333J71295P7083o8380n1194L5080P4292j10420k82702q9499J06852
$$ -359183 -244850 -73555 3528 -64852 -116046 -80966 -6674 -117094 -399796 -489295 -382443
21597c82443J52869m1653j58567j37470L6071K73232L27458K100k5623O9213j59021
$$ -382443 -229574 -271227 -429794 -567264 -531193 -257961 69497 71597 45974 115187 -43834
21586d3834k65513q3403J39518J41929R8702j2513r1596P6881k03030J13971K55751
$$ -43834 -309347 -392750 -253232 -111303 -12601 -25114 -116710 -39829 -242859 -128888 126863
21575A26863m2478l1779p8205j31299M9095Q0002J8806k77470J1738j8977O0378
$$ 126863 84385 52606 -25599 -156898 -107803 -27801 -8995 -286465 -274727 -293704 -233326
21564b33326J15879m4438K25945K51040m9970k18182j92522j1362K24720J51019
$$ -233326 -117447 -161885 64060 315100 265130 46948 -145574 -156936 67784 218803
21554B18803Q7720m8052l9301l03205k07137J1753Q8656k7407k64080n5663K3280
$$ 218803 306523 258471 219170 -84035 -291172 -279419 -190763 -218170 -482250 -537913 -514633
21543e14633J60210J60292j2344O1997N2755k64471n2240Q7779L8347K62753j40421
$$ -514633 -354423 -194131 -206475 -144478 -91723 -356194 -408434 -320655 -282308 -19555 -159976
21532a59976j03901N8301J19731M8082j13915R0936K7495j234Q0741j87722k78494
$$ -159976 -263877 -205576 -85845 -37763 -151678 -60742 -33247 -34481 46260 -141462 -419956
21521d19956J37313J54645M8325m0020P9300P3632j82095j59172R6637P1578N4921
$$ -419956 -282643 -127998 -79673 -119693 -40393 33239 -148856 -308028 -211391 -139813 -84892
21510h4892q316K95631P1401k05493K554j10264j58812k6047j85165k60871K81945
$$ -84892 -93208 202423 273824 68331 70885 -39379 -198191 -224238 -409403 -670274 -388329
21499c88329M02222R8568r8114l0654j0234m2549N7985N2242j45194j79755j52504
$$ -388329 13893 112461 14347 -16307 -26541 -69090 -11105 41137 -104057 -283812 -436316
21488d36316j34029K56884J23679P756J20489K78243j56781k74699J54330J15
$$ -436316 -570345 -313461 -189782 -182026 -61537 216706 59925 -214774 -60444 -60329
21478f0329P9399P3086j00848j67138P6246R9681K2546J03471p217j51584j52863
$$ -60329 19070 92156 -8692 -175830 -99584 97 22643 126114 118897 -32687 -185550
21467a85550m5470M2204O137k14264k6331R3237n6853j66227J47811Q4678n4452
$$ -185550 -231020 -188816 -182679 -396943 -423274 -330037 -386890 -553117 -405306 -320628 -375080
21456c75080o8327R0462K10891k656j2198k20999N9689j04859n1169l2018K86310
$$ -375080 -443407 -352945 -142054 -144710 -156908 -377907 -318218 -423077 -474246 -506264 -219954
21445b19954P0306J5359N3297P2290j28565L0514j12593j29496P6394K31454N0325
$$ -219954 -149648 -134289 -80992 -8702 -137267 -106753 -219346 -348842 -272448 -40994 9331
21434I331Q6279j60669j17062j1890m8316J28615J421Q9354J54443N4688n6429
$$ 9331 95610 -65059 -182121 -194011 -242327 -113712 -112291 -22937 131506 186194 129765
21423A29765m1712J5888r9931J08056j13651n0403j51532j81121K16269O5804
$$ 129765 88053 103941 4010 112066 -1585 -51988 -203520 -384641 -168372 -102568
21413a02568M557p521m1495q3721J63911o1980k09402j35016J58531O0944j92001
$$ -102568 -98011 -105532 -147027 -230748 -66837 -128817 -338219 -473235 -314704 -253760 -445761
21402d45761R4981J69743k38042j29886J20475O9624J730L6723l8946M8312J79461
$$ -445761 -350780 -181037 -419079 -548965 -428490 -358866 -357136 -320413 -359359 -311047 -131586
21391a31586J02125Q1918q3913j84258O2086L28265K32754J5194j93379k2824
$$ -131586 -29461 52457 -31456 -215714 -153628 174637 407391 422585 229206 206382
21381B06382j96363R8790O9169n6365j9090k07454r1638N0063j76547j57810R6837
$$ 206382 10019 108809 177978 121613 102523 -104931 -196569 -146506 -323053 -480863 -384026
21370c84026J19288L7742q9187j45636j27373J26640j10511P3248J41196J43751
$$ -384026 -264738 -226996 -316183 -461819 -589192 -462552 -573063 -499815 -358619 -214868
21360b14868j23509j6918J88711N5897p6734L3173K24770R6680K9946j84245j97987
$$ -214868 -338377 -355295 -166584 -110687 -187421 -154248 70522 167202 197148 12903 -185084
21349a85084j32225K4988N8082P8366P2322j7857o1889k04158k4191K38591K42560
$$ -185084 -317309 -292321 -234239 -155873 -83551 -101408 -163297 -367455 -391646 -153055 89505
21338H9505P4047j06810k01327M2296o8327j30745m8747L9358J22267p2956K38064
$$ 89505 163552 56742 -144585 -102289 -170616 -301361 -350108 -310750 -188483 -261439 -23375
21327b3375J96872j17498k6246K03967p1273k2802P6859n8710j24048j5108k28297
$$ -23375 173497 55999 29753 233720 162447 139645 216504 157794 33746 18638 -209659
21316b09659n9015J3868P3659J63712J90658K16577o2653l92611m3320n6j38359
$$ -209659 -268674 -254806 -181147 -17435 173223 389800 327147 -65464 -108784 -108840 -247199
21305b47199r1474J46564R7370r2088J27125J70436j16898j8289l6240q681j57445
$$ -247199 -338673 -192109 -94739 -186827 -59702 110734 -6164 -24453 -60693 -69374 -226819
21294b26819L5360l5186R1812k0727J95518J25387j81103o4640L8112q8728k97984
$$ -226819 -191459 -226645 -134833 -155560 39958 165345 -15758 -80398 -42286 -131014 -428998
21283d28998j98314J80412L99006M5453K8380L844j28945q7117j62153J97607
$$ -428998 -627312 -446900 -47894 -2441 25939 29783 -99162 -186279 -348432 -150825
21273a50825P5175j25001j41320P5823R9117p8261l34545K19371K67203J22656
$$ -150825 -75650 -200651 -341971 -266148 -167031 -245292 -579837 -360466 -93263 29393
21263B9393m0825p2885j41442o4291j03910q270J24158J28652K32919J60247j13505
$$ 29393 -11432 -84317 -225759 -290050 -393960 -402230 -278072 -149420 83499 243746 130241
21252A30241j64318k9243j3233J47950J6660k07661p3872j5353k08639J15416
$$ 130241 -34077 -63320 -76553 71397 88057 -119604 -193476 -208829 -417468 -302052
21242c02052l6061j52771o126L5765J65096J27422O4164L524r6945m3941j24498
$$ -302052 -338113 -490884 -497010 -461245 -296149 -168727 -104563 -101039 -197984 -241925 -366423
21231c66423J85483j37594l7398J94662n643r7803M7145M3448q8556m619P233
$$ -366423 -180940 -318534 -355932 -161270 -166913 -264716 -217571 -174123 -262679 -267298 -260065
21220b60065J38828J30719l27798r8101J25337R2638j76452k02110O5537L82511
$$ -260065 -121237 9482 -318316 -416417 -291080 -198442 -374894 -577004 -511467 -128956
21210a28956k0317R9311J29681L5224O6372j53387k3890Q8430L066j18575j24143
$$ -128956 -149273 -49962 79719 114943 181315 27928 4038 92468 95534 -23041 -147184
21199a47184p9806J89421L23151j00656l30851j42888K9436k9280j6892J5969
$$ -147184 -226990 -37569 285582 184926 -145925 -288813 -259377 -288657 -305549 -289580
21189b89580m6649R0832J68560l297o8565J34014L62249p4205o0699K7429J291
$$ -289580 -336229 -245397 -76837 -80134 -148699 -14685 347564 273359 212660 240089 241380
21178B41380J39071j81878l90879P7407l4111J9194J54807J971j56622j46227
$$ 241380 380451 198573 -192306 -114899 -149010 -129816 24991 26962 -129660 -275887
21168b75887J53003J35720k6402L0774k2535o3556j60927J95325P6092p4798j5211
$$ -275887 -122884 12836 -13566 17208 -5327 -68883 -229810 -34485 41607 -33191 -48402
21157d8402M7997K37840J04555n4777j84413j35076J75264M5765o0958k25429
$$ -48402 -405 237435 341990 287213 102800 -32276 142988 188753 127795 -97634
21147i7634j19865J53170j48834K1952q8026O0275J75615O3012l49977k11256
$$ -97634 -217499 -64329 -213163 -191211 -279237 -218962 -43347 19665 -330312 -541568
21137e41568Q1371J17123Q4783K19311L09941j65337l96093R617K90469L5876
$$ -541568 -460197 -343074 -258291 -38980 270961 105624 -290469 -280852 9617 45493
21127D5493n2392j55516n1577K52758N4624M7335j31599m44665j42334j30732
$$ 45493 -6899 -162415 -213992 38766 93390 140725 9126 -435539 -577873 -708605
21117g08605L0178M04239K09188K67128l613j57177l7380J76131j18832n194J16419
$$ -708605 -678427 -274188 -65000 202128 198515 41338 3958 180089 61257 56063 172482
21106A72482l1003l7586L3838o3984M6055l29808l3891L03962J0174K3595Q0333
$$ 172482 141479 103893 137731 73747 119802 -210006 -243897 60065 70239 93834 174167
21095A74167R7270n7211j54525L29647J7469l30886j04329k10901K4736j23785
$$ 174167 271437 214226 59701 389348 406817 75931 -28398 -239299 -214563 -338348
21085c38348n2095J78726J60213p2951K39427P1475j65926K03748k01996j60372
$$ -338348 -390443 -211717 -51504 -124455 114972 186447 20521 224269 22273 -138099
21075a38099K68222L16487j85720l41446j56157J20680L30859J9300j59465o3038
$$ -138099 130123 446610 260890 -80556 -236713 -116033 214826 234126 74661 11623
21065A1623P4137r6885R5703J2092k8224p0684m4257j81066m2068J43392o075
$$ 11623 85760 -11125 84578 96670 68446 -2238 -46495 -227561 -269629 -126237 -132312
21054a32312j53205L3165L0914K0007J88057k50565j63236n4106J55576n1188
$$ -132312 -285517 -252352 -221438 -201431 -13374 -263939 -427175 -481281 -325705 -376893
21044c76893k3014M11177n9897j3667j11651j15652O954j36224L1012J6362R4301
$$ -376893 -399907 11270 -48627 -62294 -173945 -289597 -282643 -418867 -387855 -371493 -277192
21033b77192j07280O8245j28523J74253K40661K19100m2462m4399o3870k10463
$$ -277192 -384472 -316227 -444750 -270497 -29836 189264 146802 102403 38533 -171930
21023a71930j12440j1319m7981P1397R655Q6705J83451M0924o3687p2218r1054
$$ -171930 -284370 -295689 -343670 -272273 -262618 -175913 7538 48462 -15225 -87443 -178497
21012a78497P1425J66087Q5987K49123j59074l31306M0817j6598k51874p5536
$$ -178497 -107072 59015 145002 394125 235051 -96255 -55438 -72036 -323910 -399446
21002c99446j69219j35714J73589J61582L61118J4461q6537n1311L9497K4018
$$ -399446 -568665 -704379 -530790 -369208 -8090 6371 -80166 -131477 -91980 -67962
20992f7962j5759O7l58137j9856O9293Q4607R5989J33621K65697p7980k78399
$$ -67962 -83721 -83654 -441791 -461647 -392354 -307747 -211758 -78137 187560 109580 -168819
20981a68819n3200J56111J07r5550N8691J8421L6988j38775l8693N0175m4545
$$ -168819 -222019 -65908 -65801 -161351 -102660 -84239 -47251 -186026 -224719 -174544 -219089
20970b19089Q9343J96733J02318j38193l19420J79429J19287k4788L9043P0030
$$ -219089 -129746 66987 169305 31112 -288308 -108879 10408 -14380 24663 94693
20960I4693q3723k33672J37245j22451j10186o4213J6093J88368p7104N9283N4724
$$ 94693 10970 -222702 -85457 -207908 -318094 -382307 -366214 -177846 -254950 -195667 -140943
20949a40943J6716j40252k8736J75542J3542k4802l0999L143M9546L04785K2559
$$ -140943 -124227 -264479 -293215 -117673 -104131 -128933 -159932 -156789 -107243 197542 220101
20938B20101j85710j41030p4353J38485r7382q5218O70K88088J75120j73917k34919
$$ 220101 34391 -106639 -180992 -42507 -139889 -225107 -224437 63651 238771 64854 -170065
20927a70065m7301L430l3990J08818O3791R0404N1188L0204K1192l7863K28830
$$ -170065 -217366 -213936 -247926 -139108 -75317 15087 66275 96479 117671 79808 308638
20916C08638J07795k64484j08423J87948M7211k01250j31688K0537r8990j08519
$$ 308638 416433 151949 43526 231474 278685 77435 -54253 -33716 -132706 -241225
20906b41225P023q4582n9879R2774R9361J8482J30842J72058N8676k54437m7462
$$ -241225 -234202 -318784 -378663 -285889 -186528 -168046 -37204 134854 193530 -60907 -108369
20895a08369n7463j13915J10187K10863J05917M2563j03677J21916P1446Q3391
$$ -108369 -165832 -279747 -169560 41303 147220 189783 86106 208022 279468 362859
20885C62859k81160k62533L9070J49006K4158j89621j35372o5615M5202K51588
$$ 362859 81699 -180834 -141764 7242 31400 -158221 -293593 -359208 -314006 -62418
20875f2418O1127P1091Q8767k02919j19151r0680K19283J23176R3618k8182r8365
$$ -62418 -1291 69800 158567 -44352 -163503 -254183 -34900 88276 181894 153712 55347
20864E5347M552m8409J22891r5434l1304n1539k6278q1019m1298J50946O3806
$$ 55347 59899 11490 134381 38947 7643 -43896 -70174 -151193 -192491 -41545 22261
20853B2261j82044Q7015N7809j15760j10605M7081J91507K9875J61033M9952r3541
$$ 22261 -159783 -72768 -14959 -130719 -241324 -194243 -2736 27139 188172 238124 144583
20842A44583j21281q0304J8231n0570K21185J81583J5014l9569j79152j05243
$$ 144583 23302 -57002 -38771 -89341 131844 313427 328441 288872 109720 4477
20832D477L00447J74453l4378j66163j39929j06480j31193L30288J91369k57212
$$ 4477 304924 479377 444999 278836 138907 32427 -98766 231522 422891 165679
20822A65679N5261j63996j67181L4496N8054L2982j94250j49520j05034P0094
$$ 165679 220940 56944 -110237 -75741 -17687 15295 -178955 -328475 -433509 -363415
20812c63415K28087J97977J5842j06107R5597k59484q0655J93877M7173n6553
$$ -363415 -135328 62649 78491 -27616 67981 -191503 -272158 -78281 -31108 -87661
20802h7661j71537J2087o2074K46523J24622j237k62117k35385K6962J42387J56124
$$ -87661 -259198 -247111 -309185 -62662 61960 60723 -201394 -436779 -409817 -267430 -111306
20791a11306J14426l0126J09123o0867j00418J95098N7529k22442m653k3390R6227
$$ -111306 3120 -27006 82117 21250 -79168 115930 173459 -48983 -53636 -77026 19201
20780A9201L9973O2223j4847k00508j59770j30035L08122L7483j52548J27861
$$ 19201 59174 121397 106550 -93958 -253728 -383763 -75641 -38158 -190706 -62845
20770f2845J17247o5329k66491P833K72408K30369k42826j30463O9591J53819
$$ -62845 54402 -10927 -277418 -269585 2823 233192 -9634 -140097 -70506 83313
20760H3313J12497k27605j4675r0346j30204q734q5235Q5726L03009R3435j19778
$$ 83313 195810 -31795 -46470 -136816 -267020 -275754 -360989 -275263 27746 121181 1403
20749A403k14663R3743J96355J11110p3160j9490k66746j71114Q7719K59596R6764
$$ 1403 -213260 -119517 76838 187948 114788 95298 -171448 -342562 -254843 4753 101517
20738A01517M1452R1528k9130O8867Q4040k55222j47143K46755M3380j77583j49864
$$ 101517 142969 234497 205367 274234 358274 103052 -44091 202664 246044 68461 -81403
20727h1403K6168J95481J1827N2793M1869J29929J27099k07299j15066r454p5727
$$ -81403 -55235 140246 152073 204866 246735 376664 503763 296464 181398 171944 96217
20716I6217j42380j77750j4278J60245q8273j32639p7515K6810K9077K99230J55024
$$ 96217 -46163 -223913 -238191 -77946 -166219 -298858 -376373 -349563 -320486 -21256 133768
20705A33768K26237j89461j14590J25475L4655M697N0286k76640k42373k0441
$$ 133768 360005 170544 55954 181429 216084 220781 271067 -5573 -247946 -268387
20695b68387K52284M1820O6731l7655j70011J55779j63598j03174P8260J82381
$$ -268387 -16103 25717 92448 54793 -115218 40561 -123037 -226211 -147951 34430
20685C4430L23755n9308j62895p514n4904p5049J75166P8143j00358R292k0461
$$ 34430 358185 298877 135982 128468 73564 -1485 173681 251824 151466 160758 140297
20674A40297j2718J12815O3891k44626O8372P7758j0983K7803o1908J2865n5828
$$ 140297 127579 240394 304285 59659 128031 205789 194806 222609 160701 173566 117738
20663A17738p6586l9080Q0717j54348m9696L04852p3846j35243k03138P0855J46846
$$ 117738 41152 2072 82789 -71559 -121255 183597 109751 -25492 -228630 -157775 -10929
20652a0929j09496j23139J76704K34890j51818J02197K18852k21323M4152Q2928
$$ -10929 -120425 -243564 -66860 168030 16212 118409 337261 115938 160090 243018
20642B43018j68984Q6306N5729m2561k15182L635m7957k7611M6762m7473k03445
$$ 243018 74034 160340 216069 173508 -41674 -38039 -85996 -113607 -66845 -114318 -317763
20631c17763q6460K40153K3305J78156P8790J1460j78320K2221J30129P5295n8714
$$ -317763 -404223 -164070 -140765 37391 116181 127641 -50679 -28458 101671 176966 118252
20620A18252p2353k40158n7553J64856l6655k2634J51025J09627J70728R7432
$$ 118252 45899 -194259 -251812 -86956 -123611 -146245 4780 114407 285135 382567
20610C82567p0073N0100j27564j32575r4594j38409j19649J7397m4804O534P1281
$$ 382567 312494 362594 235030 102455 7861 -130548 -250197 -232800 -277604 -271070 -199789
20599a99789k22390J93394L46016J53474L1867k15979Q8947k14088j61100J72008
$$ -199789 -422179 -228785 117231 270705 302572 86593 175540 -38548 -199648 -27640
20589b7640l9359P0407N4761k16057O245p9940M6343r1421J69054K0885k26005
$$ -27640 -66999 3408 58169 -157888 -151643 -231583 -185240 -276661 -107607 -86722 -312727
20578c12727j11927L4848J25225J2064J29808j08928N6529L6905J8842O3680P2834
$$ -312727 -424654 -389806 -264581 -252517 -122709 -231637 -175108 -138203 -119361 -55681 17153
20567A7153o4801R8075J92677R347m09430j7548K46721N6260j03753k9192o5965
$$ 17153 -47648 50427 243104 252451 -156979 -174527 72194 128454 24701 -4491 -70456
20556g0456J11550J71398L2570P6788M7669k05542l78584j70583O2846k7442N0767
$$ -70456 41094 212492 245062 321850 369519 163977 -214607 -385190 -322344 -349786 -299019
20545b99019Q7558J93972J40387k25848J16002K33453K168L9596q5084l20150
$$ -299019 -211461 -17489 122898 -102950 13052 246505 248673 288269 203185 -116965
20535a16965k84659Q3770K55056K51276J66283k83062n79200M5648K72369J290
$$ -116965 -401624 -317854 -62798 188478 354761 71699 -507501 -461853 -189484 -188194
20525a88194l69704K70387L24347q1567j34389K9541J35966l0089j70662L6059
$$ -188194 -557898 -287511 36836 -44731 -179120 -149579 -13613 -43702 -214364 -178305
20515a78305J05229j1431k21168k29593L12699K18822j15612q7418R9381Q193
$$ -178305 -73076 -84507 -305675 -535268 -222569 -3747 -119359 -206777 -107396 -99203
20505i9203K4875k50287j02620K24851K88680k33727j44527J00606Q9101n8493
$$ -99203 -74328 -324615 -427235 -202384 86296 -147431 -291958 -191352 -102251 -160744
20495a60744J9717m2415j68008O5201J32758K89026k7525P767l32812k71567p542
$$ -160744 -141027 -183442 -351450 -286249 -153491 135535 108010 115777 -217035 -488602 -496144
20484d96144K83907K81999q9955L0602o9907O0237K5852l3818J53378q0418Q9760
$$ -496144 -212237 69762 -20193 10409 -59498 739 26591 -7227 146151 65733 155493
20473A55493q5714N053J59412r4002o9391k38748P2870q6711l3792K70078k35580
$$ 155493 69779 74832 234244 140242 70851 -167897 -95027 -181738 -215530 54548 -181032
20462a81032j42932J01901j38680N186k1791k720R4405K34805q350K53883J30820
$$ -181032 -323964 -222063 -360743 -355557 -377348 -380068 -285663 -50858 -59208 194675 325495
20451C25495j38591j68496j14878O3837J35248j66398N4332J16373o5954N2032
$$ 325495 186904 18408 -96470 -32633 102615 -63783 -9451 106922 40968 93000
20441I3000n2154J7336k9280k17118o9452j47091j11556J73153J80077Q0814j6132
$$ 93000 40846 58182 28902 -188216 -257668 -404759 -516315 -343162 -163085 -82271 -98403
20430i8403J29178p9625k44561M1155j0835O5842L7277J7491j31100J49283J58841
$$ -98403 30775 -48850 -293411 -252256 -263091 -197249 -159972 -142481 -273581 -124298 34543
20419C4543n6523R619O989p7415j03906N8158l0126l3673q3373j24016L0472K77608
$$ 34543 -21980 -12361 -5372 -82787 -186693 -128535 -158661 -192334 -275707 -399723 -369251 -91643
20407i1643J3849j31797p0446L9431n9886O6308j67942J99978p6301n8844J73836
$$ -91643 -77794 -209591 -280037 -240606 -300492 -234184 -402126 -202148 -278449 -337293 -163457
20396a63457j55164j19384J39101Q2484j96753R9333J33037M6796j24764Q5282
$$ -163457 -318621 -438005 -298904 -216420 -413173 -313840 -180803 -134007 -258771 -173489
20386a73489J40045q4516q8992J1823M1191K8808K5544p8032o7193k28308j05221
$$ -173489 -33444 -117960 -206952 -195129 -153938 -125130 -99586 -177618 -244811 -473119 -578340
20375e78340l6825l5955J88698K5740K59912Q8195N8942M3619P9322J7234j48750
$$ -578340 -615165 -651120 -462422 -436682 -176770 -88575 -29633 13986 93308 110542 -38208
20364c8208j95378k34293j8418K36568J74323q0003r9164j62158m8539K52597
$$ -38208 -233586 -467879 -486297 -249729 -75406 -155409 -254573 -416731 -465270 -212673
20354b12673K16360J7215N1605P543N2416r5505m6107r7748j54204K68387m851
$$ -212673 3687 20902 72507 80050 132466 36961 -9146 -106894 -261098 7289 2438
20343B438p8012n752K17818L9103P0080L12175o7486k79279l16292P6172K59839
$$ 2438 -75574 -81326 136492 175595 245675 557850 490364 211085 -105207 -29035 230804
20332B30804k18233l55816o6935L52384m2590k62398J42191L28679J55593j30979
$$ 230804 12571 -343245 -410180 -57796 -100386 -362784 -220593 108086 263679 132700
20322A32700Q7719J53755p5478m4118j41903r5808n1772K9402J40217O4155j43189
$$ 132700 220419 374174 298696 254578 112675 16867 -34905 -5503 134714 198869 55680
20311E5680q046J14156j22213l9308q6870j55841r6867J00445N6340M434R5713
$$ 55680 47634 161790 39577 269 -86601 -242442 -339309 -238864 -182524 -178090 -82377
20300h2377Q7214J65964j16515k48567M5504l2980J0999q3935j0660O1221L01578
$$ -82377 4837 170801 54286 -194281 -148777 -181757 -170758 -254693 -265353 -204132 97446
20289I7446Q8226J9506r7196k776n6239j47230K2418J4110l384q8830k0217p8027
$$ 97446 185672 205178 107982 105206 48967 -98263 -75845 -61735 -65119 -153949 -174166 -252193
20277b52193j92784R5869J6857L17217M4965l5466j02321r3274j40080j41808
$$ -252193 -444977 -349108 -332251 -15034 29931 -5535 -107856 -201130 -341210 -483018
20267d83018R2509M3723l806j04002J86003n8987n8565N4091L3632R3203J27435
$$ -483018 -390509 -346786 -350592 -454594 -268591 -327578 -386143 -332052 -298420 -205217 -77782
20256g7782l7923k58796J54409L27525J88465J1247j73268J03227j36492j55521
$$ -77782 -115705 -374501 -220092 107433 295898 307145 133877 237104 100612 -54909
20246e4909P8594L4772K2675J69013r0046k96237p5753J54317o3200k42839L635
$$ -54909 23685 58457 81132 250145 160099 -136138 -211891 -57574 -120774 -363613 -359978
20235c59978Q4930j993O4430J76197K52643J14444j22396k23027O4874k9502j7966
$$ -359978 -275048 -277041 -212611 -36414 216229 330673 208277 -14750 50124 20622 2656
20224B656l1907p1811J15961M9647m0415p1995j57919J73384j04063j25786Q8430
$$ 2656 -29251 -101062 14899 64546 24131 -47864 -205783 -32399 -136462 -262248 -173818
20213a73818m3331K0414Q0494J2244P1103P1973j03101j55676K18107Q5468M0153
$$ -173818 -217149 -196735 -116241 -103997 -32894 39079 -64022 -219698 -1591 83877 124030
20202A24030j12429j02533j807J37489p3761j86935P8390J11886j07923j58374
$$ 124030 11601 -90932 -92739 44750 -29011 -215946 -137556 -25670 -133593 -291967
20192b91967K45140r3920j46659p9413J21529R5233m5931Q3241K06173J13868
$$ -291967 -46827 -140747 -287406 -366819 -245290 -150057 -195988 -112747 93426 207294
20182B07294j6454j89291j66218K31334J29272L222k49159J27519K6446j50460
$$ 207294 190840 1549 -164669 66665 195937 199159 -50000 77519 103965 -46495
20172d6495n6449J25972k11561m6821K00950r3201J13496R2817m1099o8173l8892
$$ -46495 -102944 23028 -188533 -235354 -34404 -127605 -14109 78708 37609 -30564 -69456
20161f9456J8543K70138o9967j22890j29027J89236J14190j99965l42604l34882
$$ -69456 -50913 219225 149258 26368 -102659 86577 200767 802 -341802 -676684
20151f76684P8553L42610L23466k9335M9838J8912L8262J27795K2061j9577Q110
$$ -676684 -598131 -255521 67945 38610 88448 107360 145622 273417 295478 275901 284011
20140B84011N820j82335l6990K22106j8923j19300n5480J31293n6013l36789o0911
$$ 284011 289831 107496 70506 292612 273689 154389 98909 230202 174189 -162600 -223511
20129b23511K52103J97819R202J67037k23898j49686J35893o8018P0198Q8416
$$ -223511 28592 226411 235613 402650 178752 29066 164959 96941 167139 255555
20119B55555M2391l50034l30758J00393L57475m964R2563K53853l2096p0009q597
$$ 255555 297946 -52088 -382846 -282453 75022 70058 162621 416474 384378 314369 305772
20108C05772Q7882r9874k556J67327j79119k04285o2694K9476O1178P0533J32992
$$ 305772 393654 293780 291224 458551 279432 75147 12453 41929 103107 173640 306632
20097C06632q6626k13042M2422O5686j47259J9745J64167J86546M5757k7130j1765
$$ 306632 220006 6964 49386 115072 -32187 -12442 151725 338271 384028 356898 345133
20086C45133k72212j09138k8633r3551K34160J10766n1342j03679k9164J05616
$$ 345133 72921 -36217 -64850 -158401 75759 186525 135183 31504 2340 107956
20076A07956K28282J63446l18073k67182j10473n4573K57365M49012P4775p8493
$$ 107956 336238 499684 181611 -85571 -196044 -250617 6748 455760 530535 452042
20066D52042j87809J06692M00109J86974q7251k49921O305K80792N3937k58396
$$ 452042 264233 370925 771034 958008 870757 620836 627141 907933 961870 703474
20056G03474j30178R0470j85688l92600K50826K63218J64262k97942l25107j63437
$$ 703474 573296 663766 478078 85478 336304 599522 763784 465842 140735 -22702
20046b2702r4696J72529J77929L4176k42294J92526k4120j4292J74808L3979r2268
$$ -22702 -117398 55131 233060 267236 24942 217468 193348 179056 353864 387843 295575
20035B95575l64763O7301K36481K96452q9150j41627m4769J05626j0575j01924
$$ 295575 -69188 -1887 234594 531046 441896 300269 255500 361126 350551 248627
20025B48627l12428K03784J01380o8091j41277J26227P7744k60714j87692J65569
$$ 248627 -63801 139983 241363 173272 31995 158222 235966 -24748 -212440 -46871
20015d6871L1490n0413O407K94966J60051k5953j34207p1052P6631J26148R6260
$$ -46871 -15381 -65794 -59387 235579 395630 369677 235470 164418 241049 367197 463457
20004D63457k02309k15946m2759j20418k4431l0724J4612J06282J06222m6407
$$ 463457 261148 45202 2443 -117975 -142406 -173130 -158518 -52236 53986 7579
19994G579P4887j45079j44772J8804K09499j08619l1032k30045j42712J18687
$$ 7579 82466 -62613 -207385 -188581 20918 -87701 -118733 -348778 -491490 -372803
19984c72803K56632J23379K9360J24154N5294j03135p4299r8642M4354k1024K59407
$$ -372803 -116171 7208 36568 160722 216016 112881 38582 -60060 -15706 -36730 222677
19973B22677M48491q7321k41157j488K41228K6474K3916o31O3163m0379P1441
$$ 222677 671168 583847 342690 341202 582430 608904 632820 632189 695352 654973 726414
19962G26414j31959k55522K9395J2851N5974K17427J3958l6322J41659L7933N8883
$$ 726414 594455 338933 368328 381179 437153 654580 668538 632216 773875 811808 870691
19951H70691J43556j42443k25655l360J12736l4081n0937j78428k02931N9850
$$ 870691 1014247 871804 646149 642789 755525 721444 670507 492079 289148 348998
19941C48998K86298J36937n9419q1433p3326j97038j20272P3901J65298K066R9802
$$ 348998 635296 772233 712814 631381 558055 361017 240745 314646 479944 482010 581812
19930E81812O1026n3603j07719K75029L08777p4307O7328R8760j55183R0776J60225
$$ 581812 642838 589235 481516 756545 1065322 991015 1058343 1157103 1001920 1092696 1252921
19919A252921k25901j64100K0326k47314k45458k60913L19667M17829L50060J03188
$$ 1252921 1027020 862920 883246 635932 390474 129561 449228 867057 1217117 1320305
19909A320305j20442k0218L66627L23116r9179j42885k11678l4882r4355p775
$$ 1320305 1199863 1179645 1546272 1869388 1770209 1627324 1415646 1380764 1286409 1278634
19899A278634l65370j35039J05492P9953j39642j68688o3056j60898J56800M09458
$$ 1278634 913264 778225 883717 963670 824028 655340 592284 431386 588186 997644
19889I97644q3533n1479R5913J04310R4119J13088j48388N0394k68506j88139
$$ 997644 914111 862632 958545 1062855 1156974 1270062 1121674 1172068 903562 715423
19879G15423P3417j93688R03L4577K13057J30436j01893K5904j13890l40N9655
$$ 715423 788840 595152 596055 630632 843689 974125 872232 898136 784246 783906 843561
19868H43561K2001l0786k52812J9059K10585Q8657k26527j54428K79821P5352
$$ 843561 865562 834776 581964 601023 811608 900265 673738 519310 799131 874483
19858H74483l9526l9823k33981R616K76302J47955o4325l28338k78247j30969
$$ 874483 834957 795134 561153 570769 847071 995026 930701 602363 324116 193147
19848A93147K19397M28266M1768l72334n7896r2311L0892j85400j74688K18988
$$ 193147 412544 840810 882578 510244 452348 360037 390929 205529 30841 249829
19838B49829N1570J17777J6685K5808r5908k54217L23601K32314K9153k42245
$$ 249829 301399 419176 435861 461669 365761 111544 435145 667459 696612 454367
19828D54367l00131J02844J91781j2446k8212R7445j61133j38307k2643K19566
$$ 454367 154236 257080 448861 436415 408203 505648 344515 206208 183565 403131
19818D03131N9560k78911k26310m8972k4136J60797K97830k2476j61616K5983
$$ 403131 462691 183780 -42530 -91502 -115638 45159 342989 320513 158897 184880
19808A84880N4721k7111P9929J56397M3568J4256o5050o3750o8820j30510o2235
$$ 184880 239601 212490 292419 448816 492384 506640 441590 377840 309020 178510 116275
19797A16275j31034N2262J97259K60308n6594J56688k82290j31373L9439k4060
$$ 116275 -14759 37503 234762 495070 438476 595164 312874 181501 220940 196880
19787A96880n6173j88910M4390J38250J55478L0607j91020K038J37379j48920
$$ 196880 140707 -48203 -3813 134437 289915 320522 129502 131540 268919 119999
19777A19999n9798o9994j03997l5760K03429M5066L3233r2202j34540j4029K29722
$$ 119999 60201 -9793 -113790 -149550 53879 98945 132178 39976 -94564 -108593 121129
19766A21129K34979j47139j85168K15200O6714j07646J57198J40363j9166J892
$$ 121129 356108 208969 23801 239001 305715 198069 355267 495630 476464 478356
19756D78356Q0790K4286M7692j6961j7756j05047l0613N0094N9878O5497R0508
$$ 478356 559146 583432 631124 614163 596407 491360 460747 510841 570719 636216 726724
19745G26724j0813j04100j48780j02624P5033O1797r221M1073j41999Q2972J60745
$$ 726724 715911 611811 463031 360407 435440 497237 488016 529089 387090 470062 630807
19734F30807M9881o8303P6483j89888k67249j11477r0011j151K25858K7438K74
$$ 630807 680688 612385 688868 498980 231731 120254 30243 29092 254950 282388 282662
19723B82662n439P4813J15761j33823k48000J07081J04825K5487j26909J20702
$$ 282662 277223 352036 467797 333974 85974 193055 297880 323367 196458 317160
19713C17160K43934l2058j43286N2954j5752O100n1129O4428q0524j85852m463
$$ 317160 561094 529036 385750 438704 422952 429052 377923 442351 361827 175975 171512
19702A71512R9368J1855J66118j15900o5508q1926P4476J44501J79920j78273
$$ 171512 270880 282735 448853 332953 267445 185519 259995 404496 584416 406143
19692D06143l34651j49606J39177K11306K3664k2496J60469l1373Q2815j33302
$$ 406143 71492 -78114 61063 272369 296033 273537 434006 402633 485448 352146
19682C52146j3042k5109O5226J19702p1826k06099P7957P5141m9272j05334L3632
$$ 352146 339104 313995 379221 498923 427097 220998 298955 374096 324824 219490 253122
19671B53122J43942m3188k81105k7071L72858l3956k30347J81909l8675L3855
$$ 253122 397064 353876 72771 45700 418558 384602 154255 336164 297489 331344
19661C31344O2266j29655P8619k10584J585L43178R9980J51844P0969r8910j26738
$$ 331344 393610 263955 342574 131990 133575 476753 576733 728577 799546 700636 573898
19650E73898j49288m08491j6098K37075J31882J3799J72504J38436l799K3379
$$ 573898 424610 16119 21 237096 368978 382777 555281 693717 689918 713297
19640G13297O4535m0738j13940p6278n3136K42134J87598o1612j4641K83446p5106
$$ 713297 777832 737094 623154 546876 493740 735874 923472 861860 847219 1130665 1055559
19629A055559k73293j63215j53051k4810J04727J188j28792j36029L9182k91165
$$ 1055559 782266 619051 466000 441190 545917 547105 418313 282284 321466 30301
19619C0301j455K96209K20298J95524J72569r8210j31213M2306P4553K14075k74716
$$ 30301 28846 325055 545353 740877 913446 815236 684023 726329 800882 1014957 740241
19608G40241n4657L8776M2080L5821P4518j7661K609n7923j13018n6371J70258
$$ 740241 685584 724360 766440 802261 876779 859118 861727 803804 690786 634415 804673
19597H04673M8892K44895J87640j78110J4710j51590P3551L42246p7535j30256
$$ 804673 853565 1098460 1286100 1107990 1122700 971110 1044661 1386907 1309372 1179116
19587A179116r2884J39929m5172k27691k02184P4990J44169o6165j21501J51241
$$ 1179116 1086232 1226161 1180989 953298 751114 826104 970273 904108 782607 933848
19577I33848j58766k95647m752K27396p1069L5177O4182J88490K87391K45094
$$ 933848 775082 479435 474683 702079 631010 666187 730369 918859 1206250 1451344
19567A451344j3814l48396j30708P6992J90317k09169l77602k34122Q2830K74849
$$ 1451344 1437530 1089134 958426 1035418 1225735 1016566 638964 404842 487672 762521
19557G62521K31012J24699l1126Q7885k2403q4835N8299L31361K12640j45949
$$ 762521 993533 1118232 1087106 1174991 1152588 1067753 1126052 1457413 1670053 1524104
19547A524104l7096k08648k45679J6625K13041O6640o5866O4544j84385j86037
$$ 1524104 1487008 1278360 1032681 1049306 1262347 1328987 1263121 1327665 1143280 957243
19537I57243J2571L56958J15715P5370K0609l8030j46333q2937P7675p6140L177
$$ 957243 969814 1326772 1442487 1517857 1538466 1500436 1354103 1271166 1348841 1272701 1275878
19526A275878N9441J72010K45503K18270j487q7657N0202J33485j97088k73638
$$ 1275878 1335319 1507329 1752832 1971102 1969615 1881958 1932160 2065645 1868557 1594919
19516A594919n2298P2157J07762L8313p012J8368k5619J8221J4622R9301J76854
$$ 1594919 1542621 1614778 1722540 1760853 1753841 1772209 1746590 1764811 1779433 1878734 2055588
19505B055588k91974l18808J79505K44495J83097N6535J34332J24149l4355p9820
$$ 2055588 1763614 1444806 1624311 1868806 2051903 2108438 2242770 2366919 2332564 2252744
19495B252744o2515j00544J90887J7497L5769J20980K39233K00611j19406o2257
$$ 2252744 2190229 2089685 2280572 2298069 2333838 2454818 2694051 2894662 2775256 2712999
19485B712999q9896K06378L62777L23163K15023K25435L7744J95086K28952K27755
$$ 2712999 2623103 2829481 3192258 3515421 3730444 3955879 3993623 4188709 4417661 4645416
19475D645416J78174O4778K61071N16609O51421P63722P41959J109282J722204
$$ 4645416 4823590 4888368 5149439 5666048 6317469 7081191 7823150 8932432 10654636
19466A0654636J955194K538297L358532L433586K784247K485705K841344M598704
$$ 10654636 12609830 15148127 18506659 21940245 24724492 27210197 30051541 34650245
19458C4650245M805708R31540m304792m805155k708661J38367J433132p6351l100814
$$ 34650245 39455953 40387493 36082701 31277546 28568885 28707252 30140384 30064033 26963219
19449B6963219l940574k246052n38720J40645M28813O65104R55227J198128N20363
$$ 26963219 23022645 20776593 20237873 20378518 20807331 21472435 22427662 23625790 24146153
19440B4146153j097737k085386j906387j194774l83405k03355n6930J56935N05008
$$ 24146153 23048416 20963030 19056643 17861869 17478464 17275109 17218179 17375114 17880122
19431A7880122O65409P29947P12176J013429J594678J884110K477386K545340
$$ 17880122 18545531 19275478 19987654 21001083 22595761 24479871 26957257 29502597
19423B9502597K562045K468754K918828L253385K881533J702000R99268J357348
$$ 29502597 32064642 34533396 37452224 40705609 43587142 45289142 46288410 47645758
19415D7645758K758559M786755P233936J0691491J5432078K0858819K6530128
$$ 47645758 50404317 55191072 62425008 73116499 88548577 109407396 135937524
19408A35937524L0554050L2264077L4160588L8669763M3639586L8490081J5071458
$$ 135937524 166491574 198755651 232916239 271586002 315225588 353715669 368787127
19401C68787127r985344k3369973l0379643k9265753k0910138j2760275k546415
$$ 368787127 358801783 335431810 305052167 275786414 254876276 242116001 239569586
19394B39569586J0015295K0765257K6678398K6614617K2411963J7623238Q712064
$$ 239569586 249584881 270350138 297028536 323643153 346055116 363678354 372390418
19387C72390418n707507k2373642m2066732n5610773m8704753l2815724k0930411
$$ 372390418 366682911 344309269 302242537 246631764 197927011 165111287 144180876
19380A44180876j3183781p730480l762899j315164n608n34601j351850k076207
$$ 144180876 130997095 123266615 119503716 118188552 118182944 117648343 116296493 114220286
19372A14220286k357957k066585k420700l758420m243552l349085k356192j366551
$$ 114220286 111862329 109795744 107375044 103616624 99373072 96023987 93667795 92301244
19364I2301244o11553N653m8799p45263j681233l036139m169959m690269m372701
$$ 92301244 91689691 91695344 91646545 90901282 89220049 86183910 82013951 77323682 72950981
19355G2950981l247943k314669j776743j481682j121320o15273J11836K03467
$$ 72950981 69703038 67388369 65611626 64129944 63008624 62393351 62505187 62708654
19347F2708654q17742k004587j967109q62782P2704J49738k606Q45851K511805
$$ 62708654 61890912 59886325 57919216 57056434 57129138 57278876 57276270 58122121 60633926
19338F0633926L488242J696472k703256l650365j970897R95953L262045J843455
$$ 60633926 64122168 65818640 63115384 59465019 57494122 58490075 61752120 63595575
19330F3595575m220121p598244n403741l045916j954150j531479o83123J149415
$$ 63595575 59375454 51777210 46373469 43327553 41373403 39841924 39158801 40308216
19322D0308216K851072N374376Q547630J0715144J0775712R081052P914506J2159512
$$ 40308216 43159288 48533664 57081294 67796438 78572150 87653202 95567708 107727220
19314A07727220J9978579J7616025q105685l3195367k7430948j6250810r380837
$$ 107727220 127705799 145321824 137216139 104020772 76589824 60339014 50958177
19307E0958177n668532k972110j297185K49306J264881K667249N762479R445661
$$ 50958177 45289645 42317535 41020350 41269656 42534537 45201786 50964265 60409926
19299F0409926J3117516J4399290J2762554J0201806J2425376K1750290K5997785
$$ 60409926 73527442 87926732 100689286 110891092 123316468 145066758 171064543
19292A71064543N092021l5071841m0260668k4559272j3532684q132894n622527
$$ 171064543 176156564 141084723 100824055 76264783 62732099 54599205 48976678
19285D8976678m806475m190988l373473k797937j984123j521722j093401o70337
$$ 48976678 44170203 39979215 36605742 33807805 31823682 30301960 29208559 28538222
19277B8538222n42549n18389k82333j41773K0886R0475M33643O35089P33393J435282
$$ 28538222 27995673 27477284 27194951 27053178 27074064 27164539 27598182 28233271 28966664 30401946
19267C0401946J450942J012187m38503k128455k184234j943207j660685j509234
$$ 30401946 31852888 32865075 32426572 30298117 28113883 26170676 24509991 23000757
19259B3000757j399914j147079j200654j006695q19295q00557q43842l77695k60525
$$ 23000757 21600843 20453764 19253110 18246415 17427120 16626563 15782721 15405026 15144501
19250A5144501j24115l26142o02342o96227m17794m57618l29276l60001l96548
$$ 15144501 15020386 14694244 14091902 13395675 12977881 12520263 12190987 11830986 11434438
19241A1434438j14648r7464l76648k71822l90113k98799j11027j55369j07424
$$ 11434438 11319790 11222326 10845678 10573856 10183743 9884944 9773917 9618548 9511124
19232I511124k25414n00102l51400j65476k33174j29030k13090j58412j14759
$$ 9511124 9285710 8785608 8434208 8268732 8035558 7906528 7693438 7535026 7420267
19223G420267j46435r5384q5797k62052k36721j56368k81664r9470N0920j25774
$$ 7420267 7273832 7178448 7092651 6830599 6593878 6437510 6155846 6056376 6107296 5981522
19213E981522l3094j46998l35580l7114N569j69058k0635j55091r4808r1810N585
$$ 5981522 5948428 5801430 5465850 5428736 5434305 5265247 5244612 5089521 4994713 4902903 4908488
19202D908488n5609k69320k00242j97140O4963J24885j58157l25658j4308j0666
$$ 4908488 4852879 4583559 4383317 4186177 4251140 4376025 4217868 3892210 3877902 3867236
19192C867236Q3773k0694k01519j25313r356j9131K87637K5120j88719M566j0962
$$ 3867236 3951009 3930315 3728796 3603483 3594127 3574996 3862633 3887753 3699034 3703600 3692638
19181C692638M7435k3954j5101j44510J506J55823K81474K39117J58980M43891
$$ 3692638 3740073 3716119 3701018 3556508 3558014 3713837 3995311 4234428 4393408 4837299
19171D837299K98302Q5196M68444N19004K23995j7528J70665M51722K38535P53453
$$ 4837299 5135601 5220797 5689241 6208245 6432240 6414712 6585377 7037099 7275634 8029087
19161H029087J372765J760528K494046L717842N632753Q804472J3296714J5377690
$$ 8029087 9401852 11162380 13656426 17374268 23007021 31811493 45108207 60485897
19153F0485897J3855352J0996644R522593J6462571L0041933K7512254j4132145
$$ 60485897 74341249 85337893 94860486 111323057 141364990 168877244 154745099
19146A54745099m8725902l6848140k0014275j0885406o310122l858380k232072
$$ 154745099 106019197 69171057 49156782 38271376 31961254 28102874 25870802
19139B5870802m34601J452164K788992N280563Q450711J1514116J1674969R177226
$$ 25870802 25436201 26888365 29677357 34957920 43408631 54922747 66597716 75774942
19131G5774942P313119J0105635K0276526K5502561M961948l2421407l3352936
$$ 75774942 83088061 93193696 113470222 138972783 143934731 111513324 78160388
19124G8160388j8552318r452504n289096m175632m760800m237725l008889k387237
$$ 78160388 59608070 50155566 44866470 40690838 35930038 31692313 28683424 26296187
19116B6296187j603537r54469n73244j65110k93651k50618K00184M46146K53841
$$ 26296187 24692650 23738181 23164937 22999827 22706176 22455558 22655742 23101888 23355729
19107B3355729J91317J2416P9515J73660O30396P94231o7071j309385k114529
$$ 23355729 23547046 23559462 23638977 23812637 24443033 25237264 25170193 23860808 21746279
19098B1746279k023347j674086j165970j018498j052510r77000r15811o79865
$$ 21746279 19722932 18048846 16882876 15864378 14811868 13834868 12919057 12239192
19090A2239192n39195l95129l76860k37141m56489n12386n62562o32227k03986
$$ 12239192 11699997 11304868 10928008 10690867 10234378 9721992 9159430 8527203 8323217
19081H323217j13443l1552J55216l68490m06031r3279K4864j39738l76453l81526
$$ 8323217 8209774 8178222 8333438 7964948 7558917 7465638 7490502 7350764 6974311 6592785
19071F592785j10112j59735j37501j96847p1972j92419r572j3202j17118K48216
$$ 6592785 6482673 6322938 6185437 5988590 5916618 5724199 5714627 5701425 5584307 5832523
19061E832523J39417J81385P4835j83925j1672k11100j49945l17622n8655j2650
$$ 5832523 5971940 6153325 6228160 6044235 6032563 5821463 5671518 5353896 5295241 5282591
19051E282591l11735k66416n56729n25890k14645j45558p5005J50937l1627J56967
$$ 5282591 4970856 4704440 4147711 3621821 3407176 3261618 3186613 3337550 3305923 3462890
19041C462890L7307j74966j71266q4425l5698j69632q1153k3389m0963j15612
$$ 3462890 3500197 3325231 3153965 3069540 3033842 2864210 2783057 2759668 2718705 2603093
19031B603093j46577k14784j17753K6853Q0131J28776q2735k41184j52238J65552
$$ 2603093 2456516 2241732 2123979 2150832 2230963 2359739 2277004 2035820 1883582 2049134
19021B049134J40236l5951m5004j58621l50108j28316L29245j83075l18041R0669
$$ 2049134 2189370 2153419 2108415 1949794 1599686 1471370 1800615 1617540 1299499 1390168
19011A390168K22911J18859j2102k78764j2485Q0942m6654K26190J42744j36554
$$ 1390168 1613079 1731938 1719836 1441072 1428587 1509529 1462875 1689065 1831809 1695255
19001A695255L5477j3453Q878k33619k65976j60894N9450j38986J87362J17708
$$ 1695255 1730732 1717279 1726157 1492538 1226562 1065668 1125118 986132 1173494 1291202
18991A291202J13546k04158l09322m976J14022q732j25511l2782J36050J5351
$$ 1291202 1404748 1200590 891268 886292 1000314 991582 866071 833289 969339 984690
18981I84690k3921q592R3687J83668J45815L9571j74964k58518k23695q9995O2989
$$ 984690 960769 952177 1045864 1229532 1375347 1414918 1239954 981436 757741 667746 730735
18970G30735K13925j95460j50752p0607J92017J43117J70998j78946j48436O1156
$$ 730735 944660 749200 598448 527841 719858 862975 1033973 855027 706591 767747
18960G67747O0474m9929J06768k2677j7494M0055o823q7755j11906L7184P0817
$$ 767747 828221 778292 885060 862383 844889 884944 878121 790366 678460 715644 786461
18949G86461j78698J01144n7566M2153J27117l6689K03562j28509p5531k30337
$$ 786461 607763 708907 651341 693494 820611 783922 987484 858975 783444 553107
18939E53107K5884L85549J73799l423o9811j29828J54619j15529k3732m9355J38409
$$ 553107 578991 964540 1138339 1134916 1065105 935277 1089896 974367 950635 901280 1039689
18928A039689R1527j36211k44671k9395O3999k9251J66172J22012j95215k40439
$$ 1039689 1131216 995005 750334 720939 784938 755687 921859 1043871 848656 608217
18918F08217M742j15404R4917J26384r1012q5575n2831J42202K0731k88288N4812
$$ 608217 612959 497555 592472 718856 627844 542269 489438 631640 652371 364083 418895
18907D18895J31081R9230O6853k02768n3156O4343M6607j39376Q2303J64422K78933
$$ 418895 549976 649206 716059 513291 460135 524478 571085 431709 514012 678434 957367
18896I57367N5145J88022l3798k29792l9637Q6661O0598j00194k17171l32502
$$ 957367 1012512 1200534 1166736 936944 897307 983968 1044566 944372 727201 394699
18886C94699j65780M78285J11126J42356K40246j1072q3784k47510m3165L13118
$$ 394699 228919 707204 818330 960686 1200932 1189860 1106076 858566 815401 1128519
18876A128519L87810j21594l29144J31343m3228K70714J13590k33491o151K2135
$$ 1128519 1516329 1394735 1065591 1196934 1153706 1424420 1538010 1304519 1298368 1320503
18866A320503j99399Q056L1866l8557j65791l07315J65230J88804j55671k31376
$$ 1320503 1121104 1129160 1161026 1122469 956678 649363 814593 1003397 847726 616350
18856F16350L26691K62036l0232o963o3991l8151j49713k20709J06043Q0818r9494
$$ 616350 943041 1205077 1174845 1167882 1103891 1065740 916027 695318 801361 882179 782685
18845G82685P3092m6931q6967L8047J5820l5042J26828p0656q9562q6495N0529
$$ 782685 855777 808846 721879 759926 775746 740704 867532 796876 707314 620819 671348
18834F71348K11563O2416j70557q2372o551J79441m7439m71352k14144L36337
$$ 671348 882911 945327 774770 692398 685847 865288 817849 346497 132353 468690
18824D68690K93359R1034O6401l41j05393k9174l9035q270j48068K8546M9197
$$ 468690 762049 853083 919484 919143 813750 784576 745541 737271 589203 617749 666946
18813F66946q00J51539q1227l06138p0525n7366k58545m631J40620R5323k4245
$$ 666946 666146 817685 736458 430320 359795 302429 43884 39253 179873 275196 250951
18802B50951M1355M0433Q3969J8116k02807q4820L8439J90157K0300o4835n9658
$$ 250951 292306 332739 416708 434824 232017 147197 185636 375793 396093 331258 271600
18791B71600O4479j17264q3304J80704k47596j00254n541O0876j1408R7356o0521
$$ 271600 336079 218815 135511 316215 68619 -31635 -37176 23700 12292 109648 49127
18780D9127l22443o0225J57894q650J5214J84861K19482j41873R6114K44532j60270
$$ 49127 -273316 -333541 -175647 -184297 -169083 15778 235260 93387 189501 434033 273763
18769B73763l6776R2881r7187j32153L6011O083o3200j46317p4481Q9727K39503
$$ 273763 236987 329868 232681 100528 136539 142622 79422 -66895 -141376 -51649 187854
18758A87854J39500K34523j81886j8015j76550k47333N1799R4895K5404k01884
$$ 187854 327354 561877 379991 361976 185426 -61907 -10108 84787 110191 -91693
18748i1693j79944L72473N2481n1051o0727p4923N107j1650J0782P2030n7466
$$ -91693 -271637 100836 153317 102266 41539 -33384 -28277 -39927 -29145 42885 -14581
18737a4581l2007o6335j07674J9009N5702l3959K03839Q2607j62038M9952L6709
$$ -14581 -46588 -112923 -220597 -201588 -145886 -179845 23994 106601 -55437 -5485 31224
18726C1224p1813J7762N0191J76933R501J10596O3545j03847P3451J05778O5687
$$ 31224 -40589 -22827 27364 204297 213798 324394 387939 284092 357543 463321 529008
18715E29008o1786J94168k53668j5111L41344L9422j45329n8281j79549l38350
$$ 529008 467222 661390 407722 392611 733955 773377 628048 569767 390218 51868
18705E1868p5078K18080r866L6538J85696R5402j78013j39490j01786N9963M6433
$$ 51868 -23210 194870 185004 221542 407238 502640 324627 185137 83351 143314 189747
18694A89747M5266M06778R9418l18821M7210J09647J05508l02395k76629p3220
$$ 189747 235013 641791 741209 422388 469598 579245 684753 382358 105729 32509
18684C2509k119L105q0813M3874n018J31259j3359l422r7402J72517k09024p2186
$$ 32509 30390 33495 -47318 -3444 -8462 122797 109438 106016 8614 181131 -27893 -100079
18672a00079K2900J26582j92064j06365K9978P7536K60705J92913l3629j65561
$$ -100079 -77179 49403 -142661 -249026 -219048 -141512 119193 312106 278477 112916
18662A12916k76590j66252K3507Q1749j55689J48478J90973R2554J24309J08753
$$ 112916 -163674 -329926 -306419 -224670 -380359 -231881 -40908 51646 175955 284708
18652B84708J4815J59464J13939q3463j71246k06950j63211K2759K59135J71524
$$ 284708 299523 458987 572926 489463 318217 111267 -51944 -29185 229950 401474
18642D01474j98001k5172J360r1621j02676J2131K3026k7927n9517J30287K11060
$$ 401474 203473 178301 179661 88040 -14636 -2505 20521 -7406 -66923 63364 274424
18631B74424j74516o2890M67l8227j24180n1588k45889J0946M9584K05111K77113
$$ 274424 99908 37018 37485 -742 -124922 -176510 -422399 -411453 -361869 -156758 120355
18620A20355L578J58696O7604P1962J35289n5644j78940l72280j52585k2442J40424
$$ 120355 123933 282629 350233 422195 557484 501840 322900 -49380 -201965 -224407 -83983
18609h3983k02590o0601J61808J52591P3010k4538N2285M5686L7094j9912n0551
$$ -83983 -286573 -347174 -185366 -32775 40235 15697 67982 113668 150762 130850 80299
18598H0299K6033j75207j96723K05491L8345m1703k2749n9278J50460l7028J08801
$$ 80299 106332 -68875 -265598 -60107 -21762 -63465 -86214 -145492 4968 -32060 76741
18587G6741J5340P2131l93652L5261J39736K7082n1246Q4477M1889K9287j37411
$$ 76741 92081 164212 -229440 -194179 -54443 -27361 -78607 5870 47759 77046 -60365
18576f0365R2374K43571L2539j37537j43620J27625K3917Q8981r4139k3270j77522
$$ -60365 32009 275580 308119 170582 26962 154587 178504 267485 173346 150076 -27446
18565b7446q4381l4009k34417r0369K72875K53277p3908L0165n7808j74650M8310
$$ -27446 -111827 -145836 -380253 -470622 -197747 55530 -18378 11787 -46021 -220671 -172361
18554a72361J76765L08278l6545n2257O3503o8355k7659R9121r0357l31542k1876
$$ -172361 4404 312682 276137 223880 287383 219028 191369 290490 200133 -131409 -153285
18543a53285J21761K07634q586j29780J1236Q6658K10050J89133p5695P3226Q7282
$$ -153285 -31524 176110 167524 37744 48980 135638 345688 534821 459126 532352 619634
18532F19634j35879k65320r1055j03936K17685P6869M4615j6415k3302J13627
$$ 619634 483755 218435 127380 23444 241129 317998 362613 346198 322896 436523
18522D36523O2659O2690j41393r2353L7713J20052K15772k9621K6026k9685k29204
$$ 436523 499182 561872 420479 328126 365839 485891 701663 672042 698068 668383 439179
18511D39179m5024k09243m2470J05700O5719j33989j85412J28161p9817J12011
$$ 439179 394155 184912 142442 248142 313861 179872 -5540 122621 42804 154815
18501A54815K49973k1890k78551j44120K1598K00218o2735R3271L9308K38748
$$ 154815 404788 382898 104347 -39773 -18175 182043 119308 212579 251887 490635
18491D90635K98451j57483k44914l5236j77590j70757R462L5443l9024l0681o9962
$$ 490635 789086 631603 386689 351453 173863 3106 12568 48011 8987 -21694 -91656
18480i1656j77257J19066J49273Q0811M33389K10473j32176j75696o1671l3983
$$ -91656 -268913 -149847 -574 80237 513626 724099 591923 416227 354556 320573
18470C20573j40013j46729J11353P2795j8541j07633j2231q5502j6047J7455O2352
$$ 320573 180560 33831 145184 217979 199438 91805 79574 -5928 -21975 -4520 57832
18459E7832o2941J71675L03773K6859m6636n1949j34791K6948j13598k97386m9675
$$ 57832 -5109 166566 470339 497198 450562 398613 263822 290770 177172 -120214 -169889
18448a69889Q8041j92807O9881J88907K3770J24881j42069j29738j10426l2101
$$ -169889 -81848 -274655 -204774 -15867 7903 132784 -9285 -139023 -249449 -281550
18438b81550R2751J30989J43052j16711j53725J09175J54964J41200k14937J1949
$$ -281550 -188799 -57810 85242 -31469 -185194 -76019 78945 220145 5208 17157
18428A7157R5433M1314J39792R9847k02228l10574p4166q887J74281P8148J13037
$$ 17157 112590 153904 293696 393543 191315 -119259 -193425 -202312 -28031 50117 163154
18417A63154J06975n9364M798J43835J22753q1044k54476k08364l7612j01084
$$ 163154 270129 210765 215563 359398 482151 401107 146631 -61733 -99345 -200429
18407b00429j49160J1503J24453J99543J05526J05721k08326j01790k69805j44
$$ -200429 -349589 -338086 -213633 -14090 91436 197157 -11169 -112959 -382764 -382908
18397c82908K52189n2741m936J27267J42475j13442K8257o0569P4171O142j4529
$$ -382908 -130719 -183460 -188396 -61129 81346 -32096 -3839 -64408 9763 15905 1376
18386A376j9246M4372k14539N5463J93308J57561J5947o9663k49323q7566J58792
$$ 1376 -17870 26502 -188037 -132574 60734 218295 234242 164579 -84744 -172310 -13518
18375a3518Q3959o910j86769k21585J80879J79263j55456R2653j1672j02635j78667
$$ -13518 70441 63531 -123238 -344823 -163944 15319 -140137 -47484 -59156 -161791 -340458
18364c40458K177K38740J211M348j17306J11597R3701p5636L9841J149P2156K18375
$$ -340458 -338281 -99541 -98330 -93982 -211288 -99691 -5990 -81626 -41785 -40636 31520 249895
18352B49895L0003J3851q6911l8131j09771k23067j19510q4776J40043K61752
$$ 249895 279898 293749 206838 168707 58936 -164131 -283641 -368417 -228374 33378
18342C3378M5290l1672j15843j03238J65996K14378J17190m5724q9358O2611Q854
$$ 33378 78668 46996 -68847 -172085 -6089 208289 325479 279755 190397 253008 261862
18331B61862j86868N1097K08188R5562j3539l94848k06444L0496P3297O679J04210
$$ 261862 74994 126091 334279 429841 416302 21454 -184990 -154494 -81197 -74518 29692
18320B9692J74996J40154p8595J87889j29057k64888J36479n7866j12060l16398
$$ 29692 204688 344842 266247 454136 325079 60191 196670 138804 26744 -289654
18310b89654j04450k42852J85085N35049L71738j79872r8198L0648p1925p1608
$$ -289654 -394104 -636956 -451871 83178 454916 275044 176846 207494 135569 63961
18300F3961J80706j7481m4273j19057r3391N2699M3314m0830k39830j42842J44531
$$ 63961 244667 227186 182913 63856 -29535 23164 66478 25648 -214182 -357024 -212493
18289b12493J84479m721O2490N114K5188J82474r800m4107j78332n4266k891j61236
$$ -212493 -28014 -32735 29755 34869 60057 242531 232731 188624 10292 -43974 -46865 -208101
18277b08101J07735J32067J92870K08919o5985k56535K5480J39186o6312k01223
$$ -208101 -100366 31701 224571 433490 367505 110970 136450 275636 209324 8101
18267H101j59482p0971J68590J51463R7387k04397j93140k02379j2726P7236M8741
$$ 8101 -151381 -222352 -53762 97701 195088 -9309 -202449 -404828 -417554 -340318 -291577
18256b91577k4436J20550K3148l6173m9468L974L01867J19085j11317k64562j26022
$$ -291577 -316013 -195463 -172315 -208488 -257956 -253982 47885 166970 55653 -208909 -334931
18245c34931L45791J96932p6954k04434q8169O888M8870p5470O0306K01167m7150
$$ -334931 10860 207792 130838 -73596 -161765 -154877 -106007 -181477 -121171 79996 32846
18234C2846J06148K64926k06704J32354M7079k11490j45527R0325P4388j78141
$$ 32846 138994 403920 197216 329570 376649 165159 19632 109957 184345 6204
18224F204M730J56126P5754N9659M6607k07603k22889j60037k17017J10531J44360
$$ 6204 10934 167060 242814 302473 349080 141477 -81412 -241449 -458466 -347935 -203575
18213b03575j37229n3359k6065K98795J35078K1158n2124k3948L9433J32409O0415
$$ -203575 -340804 -394163 -420228 -121433 13645 34803 -17321 -41269 -1836 130573 190988
18202A90988Q1667p5476k07709n0411L2453N2362N5816n5576K0816j8960M2139
$$ 190988 272655 197179 -10530 -60941 -28488 23874 79690 24114 44930 25970 68109
18191F8109j54742J03067J06081j45490k28867R6597J93387j40141j77692j36419
$$ 68109 -86633 16434 122515 -22975 -251842 -155245 38142 -101999 -279691 -416110
18181d16110O0659K32085j87975K35501K02054J84396n1039k40539J8154o1608
$$ -416110 -355451 -123366 -311341 -75840 126214 310610 259571 19032 37186 -24422
18171b4422M453J34281J6637k36493k86996k41124J41307M3605L61584J72679
$$ -24422 -19969 114312 130949 -105544 -392540 -633664 -492357 -448752 -87168 85511
18161H5511r82k51821k86665J10801L24354J55569N6839q0146j29603Q8815j37754
$$ 85511 84529 -167292 -453957 -343156 -18802 136767 193606 113460 -16143 72672 -65082
18150f5082K1367R857k7060j66862j82900m7280n1557J05150j6860J0O9302J66686
$$ -65082 -43715 -33858 -60918 -227780 -410680 -457960 -509517 -404367 -421227 -421217 -351915 -185229
18138a85229k8182j08455L1972q3054J12853J49224L42756N2435j37712k18461
$$ -185229 -213411 -321866 -289894 -372948 -260095 -110871 231885 284320 146608 -71853
18128g1853k17674L565O6862L7653J33064P2391j5898j94793j40024n932j69457
$$ -71853 -289527 -285962 -219100 -181447 -48383 24008 8110 -186683 -326707 -332639 -502096
18117e02096N2602K56901j12761L0333K55064M10433l1423l72163m88670L4024
$$ -502096 -449494 -192593 -305354 -275021 -19957 390476 359053 -13110 -501780 -467756
18107d67756L47378n3260K80847m8240j31167p4394q2772l9214l9137Q6197Q1347
$$ -467756 -120378 -173638 107209 58969 -72198 -146592 -229364 -268578 -307715 -221518 -140171
18096a40171R5397j43525K5883O1716j61559L2029K6459k7207K52050P2575m647
$$ -140171 -44774 -188299 -162416 -100700 -262259 -230230 -203771 -230978 21072 93647 89000
18085H9000l4286L5507o1053J12147r7176j19531L8051K31402J02662j18664k2086
$$ 89000 54714 90221 29168 141315 44139 -75392 -37341 194061 296723 178059 155973
18074A55973k6761J7352L4450M1985m7750r8862K2903j48584q7490k4952J70308
$$ 155973 129212 146564 181014 222999 175249 76387 99290 -49294 -136784 -161736 8572
18063H572J13404k24727o6969l8284O1612P5052J24942K07629k52698L7129k03760
$$ 8572 121976 -102751 -169720 -208004 -146392 -71340 53602 261231 8533 45662 -158098
18052a58098l7529o5419K1382Q3908J63738R3373j44824k35424K6558K6335p7063
$$ -158098 -195627 -261046 -239664 -155756 7982 101355 -43469 -278893 -252335 -226000 -303063
18041c03063M3550J67868j23865K10369M24594j00923j87070j14863Q5434J56354
$$ -303063 -259513 -91645 -215510 -5141 419453 318530 131460 16597 102031 258385
18031B58385r3504n6336j56177k81337k8348L17764P2139j88607j50680Q3543
$$ 258385 164881 108545 -47632 -328969 -357317 -39553 32586 -156021 -306701 -223158
18021b23158J52491K23527k43598j39111j70079K3424j16181j09091L63374J85825
$$ -223158 -70667 152860 -90738 -229849 -399928 -376504 -492685 -601776 -238402 -52577
18011e2577p2299m1056J10379o9560l6376K44122J76569k15482k17817k10120
$$ -52577 -124876 -165932 -55553 -125113 -161489 82633 259202 43720 -174097 -384217
18001c84217J82692n1106r8650K17394R1408j6264L9601O509j00226k9928J69298
$$ -384217 -201525 -252631 -351281 -133887 -42479 -58743 -19142 -12633 -112859 -142787 26511
17990B6511K47980j35715j62058j12334J1185P0463j19331n8986K0878j42445
$$ 26511 274491 138776 -23282 -135616 -124431 -53968 -173299 -232285 -211407 -353852
17980c53852J64798N2912n409p9300k4295k2521k3134J41858O9469O5041J98168
$$ -353852 -189054 -136142 -141551 -220851 -245146 -267667 -290801 -148943 -79474 -14433 183735
17969A83735j32777J994j2916O7371K2989P8367K54620p3618k40615k1738L42062
$$ 183735 50958 52952 40036 107407 130396 208763 463383 389765 149150 127412 469474
17958D69474j12384j39843j55807J21538j6894k4789K0738p5934K57905K16092
$$ 469474 357090 217247 61440 182978 166084 141295 162033 86099 344004 560096
17948E60096k86718k75644o3745q2237k5863J17235j18056j16130K07043K99512
$$ 560096 273378 -2266 -66011 -148248 -174111 -56876 -174932 -291062 -84019 215493
17938B15493q6231m4996K9711O2631R6373k93966r9252J79310L60056J7688o5464
$$ 215493 129262 84266 113977 176608 272981 -20985 -120237 59073 419129 436817 371353
17927C71353j51666j02082l7445q9650P383j51300R8181K14255j19814j77179
$$ 371353 219687 117605 80160 -9490 -2107 -153407 -55226 159029 39215 -137964
17917a37964r6410J10749M5222J33790J47205M6180j35679l6020o650j86046J17054
$$ -137964 -234374 -123625 -78403 55387 202592 248772 113093 77073 70423 -115623 1431
17906A431J84198j65984J8996M6121P1031k2311j91263j02505M3145n437o5546
$$ 1431 185629 19645 38641 84762 155793 133482 -57781 -160286 -117141 -122578 -188124
17895a88124M6557r0385q6572k0878J86301j63022n6338M9532J10362j82511k46888
$$ -188124 -141567 -231952 -318524 -339402 -153101 -316123 -372461 -322929 -212567 -395078 -641966
17884f41966J09922J39142M6911K54596o5520l7156P4620M1260J07531r8774l37519
$$ -641966 -532044 -392902 -345991 -91395 -156915 -194071 -119451 -78191 29340 -69434 -406953
17873d06953J26063Q3162r767j03007M6145k00672Q0214P3444K50288K5307j47113
$$ -406953 -280890 -197728 -207495 -310502 -264357 -465029 -384815 -311371 -61083 -35776 -182889
17862a82889K5754J6772j01802K45856R8975J65842j54581Q43M17863p3036l43544
$$ -182889 -157135 -140363 -242165 3691 102666 268508 113927 114770 532633 459597 116053
17851A16053n5896K72927m12908j80433L0157J32560K06728R6482o021J56201
$$ 116053 60157 333084 -79824 -260257 -230100 -97540 109188 205670 199649 355850
17841C55850o6938k49011l0034l18296j86742j31321o1312K12315K24688K54866
$$ 355850 288912 39901 9867 -308429 -495171 -626492 -687804 -475489 -250801 4065
17831D065l4870m1294R2974J94803O3240j41777p6993J9973m2064J28714m9668
$$ 4065 -30805 -72099 20875 215678 278918 137141 60148 80121 38057 166771 117103
17820A17103j03122j10799k00342o4686J10130M8994j52885N7139J3791j07979
$$ 117103 13981 -96818 -297160 -361846 -251716 -202722 -355607 -298468 -284677 -392656
17810c92656J3398J04527L5204J03922j82839N6883Q0734p6116Q4610J71942l2415
$$ -392656 -379258 -274731 -239527 -135605 -318444 -261561 -180827 -256943 -172333 -391 -32806
17799c2806j08253o5478j68078P2344J12156N4983j51002o886P599J70439O4863
$$ -32806 -141059 -206537 -374615 -302271 -190115 -135132 -286134 -293020 -285421 -114982 -50119
17788e0119q6444j8965K01262k6518j12266N5689N2427j34264j8128L0385j23181
$$ -50119 -136563 -155528 45734 19216 -93050 -37361 15066 -119198 -137326 -106941 -230122
17777b30122K25356J69450n753q6599j15630k41527k7361J16256J33043K2967
$$ -230122 -4766 164684 158931 72332 -43298 -284825 -312186 -195930 -62887 -39920
17767c9920r4654M3487J13999J10165K1571j8212k25422o0079L1314j44794j99287
$$ -39920 -134574 -91087 22912 133077 154648 136436 -88986 -149065 -117751 -262545 -461832
17756d61832J73345J29668L1379K94935Q637l53898k38426J86847l3144k35010
$$ -461832 -288487 -158819 -127440 167495 176132 -177766 -416192 -229345 -262489 -497499
17746d97499R0333J82639Q4325K07491J9332k6861P152J13026K9752j28049j76339
$$ -497499 -407166 -224527 -140202 67289 86621 59760 66912 179938 209690 81641 -94698
17735i4698R6634J10477j25029j37617k6296O4308K34150L5781K0306N9895j12005
$$ -94698 1936 112413 -12616 -150233 -176529 -112221 121929 157710 178016 237911 125906
17724A25906N0463J39373J9660j82125k33045j36492k44341J61634r0068j43805
$$ 125906 176369 315742 335402 153277 -79768 -216260 -460601 -298967 -389035 -532840
17714e32840L1312j7619K29505J59895Q1267j56958r3022J01442K08596J37625
$$ -532840 -501528 -519147 -289642 -129747 -48480 -205438 -298460 -197018 11578 149203
17704A49203J26772M7945j72071j95900p0119K54154L02006J22323L055K290r4438
$$ 149203 275975 323920 151849 -44051 -114170 139984 441990 564313 567368 569658 475220
17693D75220k64464j36109n5049M8774j17104N6873K73501j54858q2013j00785
$$ 475220 210756 74647 19598 68372 -48732 8141 281642 126784 44771 -56014
17683e6014r5800k5449K39672Q9878J34420N2856l48339k8514M7505N2331L9186
$$ -56014 -151814 -177263 62409 152287 286707 339563 -8776 -37290 10215 62546 101732
17672A01732J34378J1721k01122j10223J34362j70781r4201J24005k7872N2724
$$ 101732 236110 247831 46709 -63514 70848 -99933 -194134 -70129 -98001 -45277
17662d5277k36731p7592K69454L49m441J03952j58583L9341K70426j85597q3369
$$ -45277 -282008 -359600 -90146 -89797 -94238 9714 -148869 -109528 160898 -24699 -108068
17651a08068j77731k6003j3159Q695L1045k1347l3617O3379J65426J9623J32238
$$ -108068 -285799 -311802 -324961 -316266 -285221 -306568 -340185 -276806 -111380 -91757 40481
17640D0481O1244j88951p7008J34395J50324j17257k22767J12015k6446l37432
$$ 40481 101725 -87226 -164234 -29839 120485 3228 -219539 -107524 -133970 -471402
17630d71402o8827O5380q2423J59050K85915J72930R7054l65174Q1605J45970
$$ -471402 -540229 -474849 -557272 -398222 -112307 60623 157677 -207497 -125892 20078
17620B0078R1768j71045j52973n8058L42635J99357j02812j2321j7949m025M3148
$$ 20078 111846 -59199 -212172 -270230 72405 271762 168950 156629 138680 134655 177803
17609A77803m481L7336P2327J12534k26224m4836L221q9743N7402J3323M102P4094
$$ 177803 173322 210658 282985 395519 169295 124459 127680 37937 95339 108662 112764 186858
17597A86858R90k62708m3805K44603j02637o0417K05805j22951l5917K15472P4643
$$ 186858 187848 -74860 -118665 125938 23301 -37116 168689 45738 9821 225293 299936
17586B99936j45222p8767M9031r6528J12183Q7571P6282k97492o7330L13712n4141
$$ 299936 154714 75947 124978 28450 140633 228204 304486 6994 -60336 253376 199235
17575A99235K07461J80624O5886j289l39534j51617r1249n9207J21569j24757
$$ 199235 406696 587320 653206 651917 312383 160766 69517 10310 131879 7122
17565G122j43273L7007o823j1035Q3080k82292J08180O0637n4746L7074P5063
$$ 7122 -136151 -99144 -105967 -117002 -33922 -316214 -208034 -147397 -202143 -165069 -90006
17554i0006j05331J1812R3907j13327j55620J20237J06968K02410Q5513m6840
$$ -90006 -195337 -183525 -89618 -202945 -358565 -238328 -131360 71050 156563 109723
17544A09723k49137p5595o2012L6041J31138L6940l6844M1612M8752J06262k64436
$$ 109723 -139414 -215009 -277021 -240980 -109842 -72902 -109746 -68134 -19382 86880 -177556
17533a77556j54471J35184p1972J90893k6106o1143n2365j03775J08299k5312
$$ -177556 -332027 -196843 -268815 -77922 -104028 -165171 -217536 -321311 -213012 -238324
17523b38324j03823j518q4802K2420K14691K2936j8013J04299K4557n1856J19247
$$ -238324 -342147 -343665 -428467 -406047 -191356 -168420 -186433 -82134 -57577 -109433 9814
17512I814j21024J15995J78039O7803N6677r6934j63659J50506J6551j85039j18013
$$ 9814 -111210 4785 182824 250627 307304 210370 46711 197217 213768 28729 -89284
17501h9284m1511J02008K78256J4519r9538L1859k30040l22442K3322J26992J57384
$$ -89284 -130795 -28787 249469 263988 164450 196309 -33731 -356173 -332851 -205859 -48475
17490d8475j65856p1873Q420J7773J0060K0168j41180j6416J01524r4277n9471
$$ -48475 -214331 -286204 -277784 -260011 -249951 -229783 -370963 -387379 -285855 -380132 -439603
17479d39603N4636Q6237J01053L311N1956J37861R740q5082N467j87716j72070
$$ -439603 -384967 -298730 -197677 -194366 -142410 -4549 5191 -79891 -74424 -262140 -434210
17468d34210K9128J76245J49578P9624j13111n6863m2715P1007j044p9477K0985
$$ -434210 -405082 -228837 -79259 365 -112746 -169609 -212324 -141317 -142361 -221838 -200853
17457b00853R9087q9991j0898K39819J17564O0557p5725j59251J667K04926q307
$$ -200853 -101766 -191757 -202655 37164 154728 215285 139560 -19691 -18024 186902 178595
17446A78595M9809k7327J23984k7687k36769p5559K6253K27636J42741j61612
$$ 178595 228404 201077 325061 297374 60605 -14954 11299 238935 381676 220064
17436B20064j10639J68218M9652k89181m9099Q8090q172n5053k28111P6445q4678
$$ 220064 109425 277643 327295 38114 -10985 77105 68933 13880 -214231 -137786 -222464
17425b22464J5691J44277O4689O5210J33880J20673o0254O1454O4713O9164j53729
$$ -222464 -206773 -62496 2193 67403 201283 321956 261702 323156 387869 457033 303304
17414C03304k64263J26673j29502n9745K1262J4197J02722j9025r274j81049j85749
$$ 303304 39041 165714 36212 -23533 -2271 11926 114648 95623 86349 -94700 -280449
17403b80449l25444J64090K90368R865P9267K69333q8793m2080q5115k20829n8230
$$ -280449 -605893 -441803 -151435 -141570 -62303 207030 118237 76157 -8958 -229787 -288017
17392b88017N4486J35167j08566l45507O9759J78358o7954k50039n7213p1301
$$ -288017 -233531 -98364 -206930 -552437 -482678 -304320 -372274 -622313 -679526 -750827
17382g50827P2380K51599J08230J07279l9041J21235J73088j12033K84987L04141
$$ -750827 -678447 -426848 -318618 -211339 -250380 -129145 43943 -68090 216897 521038
17372E21038j67506k5353j53339l8060j8628j66007L4466Q4004k14529j1979l08094
$$ 521038 353532 328179 174840 136780 118152 -47855 -13389 70615 -143914 -155893 -463987
17361d63987k11453J67377L3425o8541k9071J87667L4526k0220j19555k8780J22249
$$ -463987 -675440 -508063 -474638 -543179 -572250 -384583 -350057 -370277 -489832 -518612 -396363
17350c96363N6128J1485Q7146J59393q4331p8007K13198Q356j17950j91931l4941
$$ -396363 -340235 -328750 -241604 -82211 -166542 -244549 -31351 -22995 -140945 -332876 -367817
17339c67817Q2809R2778N9569J85642J26390p4482J43126l3040n1452J48525j56468
$$ -367817 -285008 -192230 -132661 52981 179371 104889 248015 214975 163523 312048 155580
17328A55580j41547J80712Q3057J8534k7310k0620j18411q1811J23858J71072
$$ 155580 14033 194745 277802 296336 269026 248406 129995 48184 172042 343114
17318C43114K8934j67258k64423o844o5035J71457k629j59078J59973P6467J09376
$$ 343114 372048 204790 -59633 -66477 -131512 39945 37316 -121762 38211 114678 224054
17307B24054M875M3720m5423k49830r2197K4210P2585J74129J47826j95435j83339
$$ 224054 228929 272649 227226 -22604 -114801 -90591 -18006 156123 303949 108514 -74825
17296g4825N5087Q4913J34870J04925K0929n2894P0968k18085m5030q5815j11611
$$ -74825 -19738 65175 200045 304970 325899 273005 343973 125888 80858 -4957 -116568
17285a16568J96809K81899M88j40866k68539r4073p7075Q7132Q5916N3066K6077
$$ -116568 80241 362140 362628 221762 -46777 -140850 -217925 -130793 -44877 8189 34266
17274C4266j18783k48801j81863j05299k24852l8761K85608R6658K5472K5252
$$ 34266 -84517 -333318 -515181 -620480 -845332 -884093 -598485 -501827 -476355 -451103
17264d51103L0952M4982L41771k4131j18872K15701L9721k67968j21482L9393
$$ -451103 -420151 -375169 -33398 -57529 -176401 39300 79021 -188947 -310429 -271036
17254b71036J20692J74817q7387l262Q5712j57742k5450M538k9930k17931R1639
$$ -271036 -150344 24473 -62914 -66176 19536 -138206 -163656 -159118 -189048 -406979 -315340
17243c15340l5399L8957J21263J41776l3541j69218j16048L11740J54391k9046
$$ -315340 -350739 -311782 -190519 -48743 -82284 -251502 -367550 -55810 98581 69535
17233F9535q349K49150j33429k9891k4904J76494N1641k64240q6550L0639N9848
$$ 69535 61186 310336 176907 147016 122112 298606 350247 86007 -543 30096 89944
17222H9944R456l7227K32100j23769k64631j37064K00596J49714j88362q8888
$$ 89944 99400 62173 294273 170504 -94127 -231191 -30595 119119 -69243 -158131
17212a58131q6219l0313q1156N5838Q0475n6356j84581M9074J05587P8756O3694
$$ -158131 -244350 -274663 -355819 -299981 -219506 -275862 -460443 -411369 -305782 -227026 -163332
17201a63332J49826L1555R5664k11535l90681J1797p7885J43151O1776j35553
$$ -163332 -13506 18049 113713 -97822 -488503 -476706 -554591 -411440 -349664 -485217
17191d85217L80579L37601o0396m28759k32972j17438O5158J40668M6569J1226
$$ -485217 -104638 232963 172567 -256192 -489164 -606602 -541444 -400776 -354207 -342981
17181c42981L6498K8222K26403J01598J8873J85106j4997L3182j2610l2244J17597
$$ -342981 -306483 -278261 -51858 49740 68613 253719 238722 271904 259294 227050 344647
17170C44647k58162L620r9928j29029l36180N8912J03978n4810K32814N8566L09878
$$ 344647 86485 90105 -9823 -138852 -475032 -416120 -312142 -366952 -134138 -75572 234306
17159B34306r1902p9131P8379k4196J81776k7217k63411j05380K35869M90409
$$ 234306 142404 63273 141652 117456 299232 272015 8604 -96776 139093 629502
17149F29502Q6710j99508k81029k27428K4678o3267L3790Q0339n0278q0051p8197
$$ 629502 716212 516704 235675 8247 32925 -30342 3448 83787 33509 -46542 -124739
17138a24739l35523j20657K59372L65827J85302K61755j95394l4899K30413N125
$$ -124739 -460262 -580919 -321547 44280 229582 491337 295943 261044 491457 496582
17128D96582j85417k07644j18029p08M4777l0154j88963J20426J64631K32808
$$ 496582 311165 103521 -14508 -15216 29561 -593 -189556 -69130 95501 328309
17118C28309j86756l19939l2939L1896J63775N9723N570j65849p8143J16222j5259
$$ 328309 141553 -178386 -211325 -179429 -15654 44069 49639 -116210 -194353 -78131 -93390
17107i3390M7543o5308j9063Q5360l8494m4595J72770J42001J61358j38046l04082
$$ -93390 -45847 -111155 -130218 -44858 -83352 -127947 44823 186824 348182 210136 -93946
17096i3946J27654J48262m3316J4301K23067J20957j9423k03305l59707m461L8101
$$ -93946 33708 181970 138654 152955 376022 496979 477556 274251 -85456 -89917 -51816
17085e1816r1590N1423J66874p5377o0194P3178Q6623j86491M9551K19641k43999
$$ -51816 -143406 -91983 74891 -486 -60680 12498 99121 -87370 -37819 181822 -62177
17074f2177o6647K78728J61409J9824k70944m12539j60490J51787J10912O2646
$$ -62177 -128824 149904 311313 331137 60193 -352346 -512836 -361049 -250137 -187491
17064a87491K9103P3039K23888j11373l03311j29268K24932M15374O4580j31258
$$ -187491 -158388 -85349 138539 27166 -276145 -405413 -180481 234893 299473 168215
17054A68215j36910p5533k56347n1234J46142K77014J55907K2661j51708j46539
$$ 168215 31305 -44228 -300575 -351809 -205667 71347 227254 249915 98207 -48332
17044d8332j35036j8228N3236L09916M1259k92138k14147n2940J08606J31160
$$ -48332 -183368 -201596 -148360 161556 202815 -89323 -303470 -356410 -247804 -116644
17034a16644l03930k60257L80586M79561O7668j27790o8317O2865J67489K51173
$$ -116644 -420574 -680831 -300245 179316 246984 119194 50877 113742 281231 532404
17024E32404M1310j61853j83839j86433j56642N8822j38183R2175Q4879j4169
$$ 532404 573714 411861 228022 41589 -115053 -56231 -194414 -102239 -17360 -31529
17014c1529j32247n61j0546M5577q3237j93235j5503l3293L11965J78601j04335
$$ -31529 -163776 -164337 -174883 -129306 -212543 -405778 -421281 -454574 -142609 35992 -68343
17003f8343j10348m4571m1321j1679j157r1185j07784O1052K22841K62805j59737
$$ -68343 -178691 -223262 -264583 -276262 -277419 -368604 -476388 -415336 -192495 70310 -89427
16992h9427j35609p858j9524L18943J26097p4316J9544k9210J13918p5198l2078
$$ -89427 -225036 -232894 -252418 66525 192622 118306 137850 108640 222558 147360 115282
16981A15282j43711l5483R825J63886J66238j28054k60312J32685j91008Q2381
$$ 115282 -28429 -63912 -54087 109799 276037 147983 -112329 20356 -170652 -88271
16971h8271K68696j74456m88343n7418R7986j13626l8862J13474J59491O4853
$$ -88271 180425 5969 -482374 -539792 -441806 -555432 -594294 -480820 -321329 -256476
16961b56476J50100o3123j953J58448R6905m2262k4948K823n4507Q18J16269j33009
$$ -256476 -106376 -169499 -171452 -13004 83901 41639 16691 19514 -34993 -34175 82094 -50915
16949e0915j00596J05633j20177j21236L7386l4869n7225l1322k9596j7653J44106
$$ -50915 -151511 -45878 -166055 -287291 -249905 -284774 -341999 -373321 -402917 -420570 -276464
16938b76464j58441o8161J44271n6167L8263J94962K21537j34631k03938j1755
$$ -276464 -434905 -503066 -358795 -414962 -376699 -181737 39800 -94831 -298769 -310524
16928c10524j13942J05617J37720j11287r3637k30471Q0640R972L11994Q2818
$$ -310524 -424466 -318849 -181129 -292416 -386053 -616524 -535884 -525912 -213918 -131100
16918a31100r1795L45785J58783k05955l2919J73307L7301k53681R1632j30658
$$ -131100 -222895 122890 281673 75718 42799 216106 253407 -274 91358 -39300
16908c9300J18648J00078j72746n0860r1995j36145j72856j8118R7838K77066
$$ -39300 79348 179426 6680 -44180 -136175 -272320 -445176 -463294 -365456 -88390
16898h8390J2737n3580O7406L23843r5786l10228M1337j3295N9466R897j08875
$$ -88390 -75653 -129233 -61827 262016 166230 -143998 -102661 -115956 -56490 -46593 -155468
16887a55468p5628l6882J0601j85117k96125Q7336J57457K43439Q960p0623Q775
$$ -155468 -231096 -267978 -257377 -442494 -738619 -651283 -493826 -250387 -241427 -312050 -303275
16876c03275L2237L26184J01342n5557J35546n5892j7730K6157l90591k25652
$$ -303275 -271038 55146 156488 100931 236477 180585 162855 189012 -201579 -427231
16866d27231j6448k13N7880K31678P7333j65655Q7144K0783K2704j07040q7508
$$ -427231 -443679 -443892 -386012 -154334 -77001 -242656 -155512 -134729 -112025 -219065 -306573
16855c06573M695o1367K9551J58755N8511O6986k21343J55694K12417j60722m9576
$$ -306573 -301878 -363245 -333694 -174939 -116428 -49442 -270785 -115091 97326 -63396 -112972
16844a12972Q8561j56342m8513J09807J07477n6850j71950k22419J60272K74194
$$ -112972 -24411 -180753 -229266 -119459 -11982 -68832 -240782 -463201 -302929 -28735
16834b8735K03976j13761k96191k5373J57483J26723o5534n231l00934j9124J09564
$$ -28735 175241 61480 -234711 -260084 -102601 24122 -41412 -46643 -347577 -366701 -257137
16823b57137J36254N3152p5351k53698K3441n1841N9786J14142J42166J49544
$$ -257137 -120883 -67731 -143082 -396780 -373339 -425180 -365394 -251252 -109086 40458
16813D0458j69522K0841j6053j04642N2669J67910J54387K16310Q9089P7019j61277
$$ 40458 -129064 -108223 -124276 -228918 -176249 -8339 146048 362358 451447 528466 367189
16802C67189j95051j05742k9548l2105J5933L1770P190J27369M8491j41039k15927
$$ 367189 172138 66396 36848 4743 20676 52446 59636 187005 235496 94457 -121470
16791a21470L2739n229j84282R5647M8343O6277N5666J89402j971P2814n1529
$$ -121470 -88731 -93960 -278242 -182595 -134252 -67975 -12309 177093 175122 247936 196407
16780A96407l19716j63793K22892K14539J06152J24774K11506j79319k90272j73255
$$ 196407 -123309 -287102 -64210 150329 256481 381255 592761 413442 123170 -50085
16770e0085r3232N6099k3965k47180k00448K46640K88461L5554J01852M720O4061
$$ -50085 -143317 -87218 -111183 -358363 -558811 -312171 -23710 11844 113696 118416 182477
16759A82477j83346k45629N1513n813P722L14374J9672k55530j07114J5809n4633
$$ 182477 -869 -246498 -194985 -200798 -193076 121298 140970 -114560 -221674 -205865 -260498
16748b60498n371K04225J32984p6280l60938k4161J52758J40023r2236l8764j3256
$$ -260498 -265869 -61644 71340 -4940 -365878 -390039 -237281 -97258 -189494 -228258 -241514
16737b41514R5333l4672j16826J1043j73971O1057j32647J60812J03476J2341
$$ -241514 -146181 -180853 -297679 -286636 -460607 -399550 -532197 -371385 -267909 -255568
16727b55568N0613R1293m0343J83728j07848J09758p8080P04k3204k34947o2642
$$ -255568 -204955 -113662 -154005 29723 -78125 31633 -46447 -45743 -68947 -303894 -366536
16716c66536l0312M03434P5047k56103n2223k577k8465o8727K0138p6680m1843
$$ -366536 -396848 6586 81633 -174470 -226693 -229270 -257735 -326462 -306324 -383004 -424847
16705d24847R1938p7920n4352J75792J03161K9035l23075k53106N1120K67708
$$ -424847 -332909 -410829 -465181 -289389 -186228 -157193 -480268 -733374 -682254 -414546
16695d14546L51053J59946K42909m4245k77613j71407j97753n519L7988j25831
$$ -414546 -63493 96453 339362 295117 17504 -153903 -351656 -357175 -319187 -445018
16685d45018K7646J86825n4690R2796j08229k4314k6950K6525J49014L8192j36779
$$ -445018 -417372 -230547 -285237 -192441 -300670 -324984 -351934 -325409 -176395 -138203 -274982
16674b74982m2014J6206Q3354J12840K41033j31058j82698K10707N5833M7756
$$ -274982 -316996 -300790 -217436 -104596 136437 5379 -177319 33388 89221 136977
16664A36977P9596R3452j79054k52811m4880n4377R1337j24205j55789k46548
$$ 136977 216573 310025 130971 -121840 -166720 -221097 -129760 -253965 -409754 -656302
16654f56302Q601J62890J43754K26433n9020j02962l1808M0782J14975k8593M1270
$$ -656302 -647701 -484811 -341057 -114624 -173644 -276606 -308414 -267632 -152657 -181250 -139980
16643a39980p5477J30453L0760K07603J13081k4800p7447m9727j08990m06446
$$ -139980 -215457 -85004 -54244 153359 266440 241640 164193 114466 5476 -400970
16633d00970k4520J24442K333R1263r5400j73961J99712L68400J87398Q9029j11174
$$ -400970 -425490 -301048 -298715 -207452 -302852 -476813 -277101 91299 278697 367726 256552
16622B56552O348P1593r1030j67480k53401K49736J73629k1569m3965j64270J0395
$$ 256552 262900 334493 243463 75983 -177418 72318 245947 224378 180413 16143 26538
16611B6538K8557j1503j43086n0829M6002k11982M1486j72257P4990J07693p1503
$$ 26538 55095 43592 -99494 -150323 -104321 -316303 -274817 -447074 -372084 -264391 -335894
16600c35894k6660M1301j90766J981K25163J52016n979m0360q7668J85062K42364
$$ -335894 -362554 -321253 -512019 -510038 -284875 -132859 -138838 -179198 -266866 -81804 160560
16589A60560n8723P6966o868l0674k6712P1750k1443l3683J8787J75450k016k02140
$$ 160560 101837 178803 171935 141261 114549 186299 164856 131173 149960 325410 323394 121254
16577A21254j22669o6159k97235j19829p7018J70825J68048J35169l3396k64481
$$ 121254 -1415 -67574 -364809 -484638 -561656 -390831 -222783 -87614 -121010 -385491
16567c85491Q4220l06920l7406O7314K10521K34371j34306j15719n9966K23639
$$ -385491 -301271 -608191 -645597 -578283 -367762 -133391 -267697 -383416 -443382 -219743
16557b19743Q0434K47526M8188o9917R664O072n6671j35537p6293n97J73690N9553
$$ -219743 -139309 108217 156405 86488 96152 102224 45553 -89984 -166277 -166874 6816 66369
16545F6369O165M7799J10436n0533k43697j67258k463L2908o5641K9079m5063
$$ 66369 72534 120333 230769 180236 -63461 -230719 -233182 -200274 -265915 -236836 -281899
16534b81899n1491P0320M5742k6620L9678N4955n5294l3605K28427J88420Q9097
$$ -281899 -333390 -263070 -217328 -243948 -204270 -149315 -204609 -238214 -9787 178633 267730
16523B67730o0038J63664j38873k00736M5585j18644j80828m5740J88381L17685
$$ 267730 207692 371356 232483 31747 77332 -41312 -222140 -267880 -79499 238186
16513B38186Q9226O5410k81617k88764O7491L78672j21224J0514K67874q4175
$$ 238186 327412 392822 111205 -177559 -110068 268604 147380 157894 425768 341593
16503C41593m97310j19899K24744R6676N4203M1361P0470l8192j77264j10498
$$ 341593 -155717 -275616 -50872 45804 100007 141368 211838 173646 -3618 -114116
16493a14116K59908K74275k57132l36752k83242J59252K7081M5248J47915L5408
$$ -114116 145792 420067 162935 -173817 -457059 -297807 -270726 -225478 -77563 -42155
16483d2155K73999l1443l61262j08464r4827J05404K64043k5274O421N782j12653
$$ -42155 231844 200401 -160861 -269325 -364152 -258748 5295 -19979 -13558 -7776 -120429
16472a20429Q9602j2824r5937l62844L6613j6328k5398J39550K28899k7420K2277
$$ -120429 -30827 -43651 -139588 -502432 -465819 -482147 -507545 -367995 -139096 -166516 -144239
16461a44239K5901Q0418R7212N2968j77483k12344j19495J79904J81473K01948
$$ -144239 -118338 -37920 59292 112260 -65223 -277567 -397062 -217158 -35685 166263
16451A66263k6839j6509q1504k53110J11047J72932J14517r2628q9467J17847
$$ 166263 139424 122915 41411 -211699 -100652 72280 186797 94169 4702 122549
16441A22549j1460L4309j73017j18294k34667J7465J56777K45743J96733J337
$$ 122549 111089 145398 -27619 -145913 -380580 -363115 -206338 39405 236138 237475
16431B37475k06653m6293K88583l9437j98043r308j55864q6207J1400l1200J55113
$$ 237475 30822 -15471 273112 233675 35632 26324 -129540 -215747 -204347 -235547 -80434
16420h0434M2649j19170j00767r7128J27344R8212j43274k3839J49976j7402K70022
$$ -80434 -37785 -156955 -257722 -354850 -227506 -129294 -272568 -296407 -146431 -163833 106189
16409A06189K28165j90448j50328m6163O9698p6331k08500r6764n5171J39126
$$ 106189 334354 143906 -6422 -52585 17113 -59218 -267718 -364482 -419653 -280527
16399b80527K40881J38210J45461q1952j66698j38174l14584O7379K94174J55326
$$ -280527 -39646 98564 244025 162073 -4625 -142799 -457383 -390004 -95830 59496
16389E9496j39588Q9175r8601r9410q9012L2897J61080J83579j91565j51218K3236
$$ 59496 -80092 9083 -89518 -188928 -277940 -245043 -83963 99616 -91949 -243167 -219931
16378b19931O5249j29102j45400K88929K57544J92462j64688j46086P3618k7804
$$ -219931 -154682 -283784 -429184 -140255 117289 309751 145063 -1023 72595 44791
16368D4791j43075J65750L2057J29494J53166P4629M2882l65780k50842J64940
$$ 44791 -98284 67466 99523 229017 382183 456812 499694 133914 -116928 48012
16358D8012o8481K9828j25717l7320m9878k7914N2981O9274K10673P4557j98528
$$ 48012 -20469 9359 -116358 -153678 -203556 -231470 -178489 -109215 101458 176015 -22513
16347b2513j51127k77M1292O8926o7838K076J04213L0893J08399j90487j21354
$$ -22513 -173640 -173917 -132625 -63699 -131537 -129461 -25248 5645 114044 -76443 -197797
16336a97797k49193J79842j5166l8132j803L0358o3179j8696J89998J02326N8062
$$ -197797 -446990 -267148 -282314 -320446 -322249 -291891 -355070 -373766 -183768 -81442 -23380
16325b3380j02600L7318K26375J30407j5298j75387j26489q4644M727K5246J40997
$$ -23380 -125980 -88662 137713 268120 252822 77435 -49054 -133698 -128971 -103725 37272
16314C7272n5599j14606J24736J90461J06257m4846k7694k89387J22420k0041
$$ 37272 -18327 -132933 -8197 182264 288521 243675 215981 -73406 49014 28973
16304B8973j84866M7334K57482M5433O0795p4032m38519L439N0678L6942k54116
$$ 28973 -155893 -108559 148923 194356 255151 181119 -257400 -253961 -203283 -166341 -420457
16293d20457k9439L70975J01947P4664L6458j60843r0621L5385K0696j02838L2284
$$ -420457 -449896 -78921 23026 97690 134148 -26695 -117316 -81931 -61235 -164073 -131789
16282a31789K7376k2998j14645J34589n1787K60854J71017l41717o354n7893J60865
$$ -131789 -104413 -127411 -242056 -107467 -159254 101600 272617 -69100 -75454 -133347 27518
16271B7518L6725k1447j08622j37664p4169J670M6129J99614Q9919j23884K8363
$$ 27518 64243 42796 -65826 -203490 -277659 -275989 -229860 -30246 59673 -64211 -35848
16260c5848J88494P0664j01840o4473K3812k6567j55072J03779N0511J66738P5096
$$ -35848 152646 223310 121470 56997 80809 54242 -100830 2949 53460 220198 295294
16249B95294j35928p5798j50024J22814m4145n0565l0252L25972J27516N6257
$$ 295294 159366 83568 -66456 56358 12213 -38352 -68604 257368 384884 441141
16239D41141k67885k27007O0877r0899O5127K3888N3162J15778n3362q9940K45563
$$ 441141 173256 -53751 7126 -83773 -18646 5242 58404 174182 120820 30880 276443
16228B76443k64220l03917j48866L39854M38274p9053j27846j89185j45965l18080
$$ 276443 12223 -291694 -440560 -100706 337568 258515 130669 -58516 -204481 -522561
16218e22561Q8215Q6198N9293J19528L3733k16802P342j8778K3877J17840J24906
$$ -522561 -434346 -348148 -288855 -169327 -135594 -352396 -345054 -363832 -339955 -222115 -97209
16207i7209n6444J15841J34248J6963k43182J8886k62328J30130O8737j29047
$$ -97209 -153653 -37812 96436 113399 -129783 -110897 -373225 -243095 -174358 -303405
16197c03405J36846L9566P2251J17885N5946n4358j77548j53742n4549J78563
$$ -303405 -166559 -126993 -54742 63143 119089 64731 -112817 -266559 -321108 -142545
16187a42545Q5214j37169J31424p9736q2896q7388k65084j02292J69675q1898
$$ -142545 -57331 -194500 -63076 -142812 -225708 -313096 -578180 -680472 -510797 -592695
16177e92695j55846M8915N31287P7725K08635J2642j7428j2872k71948r4553J88664
$$ -592695 -748541 -699626 -168339 -90614 118021 130663 113235 100363 -171585 -266138 -77474
16166g7474M4317j52061O3531p7190k636J24330K24485j53467m0834j33524j34903
$$ -77474 -33157 -185218 -121687 -198877 -201513 -77183 147302 -6165 -46999 -180523 -315426
16155c15426k05243q8760j2838J12403R2444Q5699Q6536L8643J45885J07536O1830
$$ -315426 -520669 -609429 -622267 -509864 -417420 -331721 -245185 -206542 -60657 46879 108709
16144A08709q7481n1624J22024J33819J21073j11517M8795O6239j40605j09804
$$ 108709 21228 -30396 91628 225447 346520 235003 283798 350037 209432 99628
16134I9628k39409o2206J13530l0848j2048J59389J07336j22118R506j00908L0933
$$ 99628 -139781 -201987 -88457 -119305 -131353 28036 135372 13254 22760 -78148 -47215
16123d7215M6166N5118m1014k0947J402j45077J9314J70043o6823l11657p7983
$$ -47215 -1049 54069 13055 -7892 -6490 -151567 -132253 37790 -29033 -340690 -418673
16112d18673J32879K25425Q807J11226r3526o9284J84083q7925J77093q8275j72028
$$ -418673 -285794 -60369 -51562 59664 -33862 -103146 80937 -6988 170105 81830 -90198
16101i0198J02415j5673Q0235J9698q3866J30125k19823j67826J60687j46811
$$ -90198 12217 -3456 76779 96477 12611 142736 -77087 -244913 -84226 -231037
16091b31037p3090L70143L7140J27446Q8636k45284j41436K09510r9017N9917
$$ -231037 -304127 66016 103156 230602 319238 73954 -67482 142028 43011 102928
16081A02928k85525k00298L03790J78402m6693k04262l7268P1551l9727j6031
$$ 102928 -182597 -382895 -79105 99297 52604 -151658 -188926 -117375 -157102 -173133
16071a73133j29746r9637M7780L82229R0833k40437j56042m6858J21524J06397
$$ -173133 -302879 -402516 -354736 27493 118326 -122111 -278153 -325011 -203487 -97090
16061i7090r2454j90156J18782L02299K85582j0725L9184p7220n8152l15364k30530
$$ -97090 -189544 -379700 -260918 41381 326963 316238 355422 278202 220050 -95314 -325844
16050c25844j90853P2228P003K4957J50148K6177J63638K31060r3497n0006N2174
$$ -325844 -516697 -444469 -437466 -412509 -262361 -236184 -72546 158514 65017 15011 67185
16039F7185m8914j17413j00515l6891L9621m2335K24043L5335p6702r8085R3775
$$ 67185 18271 -99142 -199657 -236548 -196927 -239262 -15219 20116 -56586 -154671 -60896
16028f0896o9519j66222J99598K72776j53185J34371K22850j00692m8989k82163
$$ -60896 -130415 -296637 -97039 175737 22552 156923 379773 279081 230092 -52071
16018e2071J43985J35845j33709j25466M1209q3304j65013o3430j11571M8223
$$ -52071 91914 227759 94050 -31416 9793 -73511 -238524 -301954 -413525 -365302
16008c65302K96749K85519J29980j17667M2125J05656j34060j36093o0461R8471
$$ -365302 -68553 216966 346946 229279 271404 377060 243000 106907 46446 144917
15998A44917k78621n159q198k08413N2090L23742K72881l8571j44879k4151j6141
$$ 144917 -133704 -138863 -147061 -355474 -303384 20358 293239 254668 109789 85638 69497
15987F9497r2228j70423Q6451r692M8948j08837o6987J29051J10267k3044k06621
$$ 69497 -22731 -193154 -106703 -116395 -67447 -176284 -243271 -114220 -3953 -26997 -233618
15976b33618L8770L0350l5644P9876q9044j21980K29509J8369O9205j2427o0305
$$ -233618 -194848 -164498 -200142 -120266 -209310 -331290 -101781 -83412 -14207 -26634 -86939
15965h6939n6698Q1048m282o5095n0207J40156k7728j22157n0765J58379K1268
$$ -86939 -143637 -62589 -66871 -131966 -182173 -42017 -69745 -191902 -242667 -84288 -63020
15954f3020j05955r5651J16365N5934j00894j01675O2772K23863J62024O6040
$$ -63020 -168975 -264626 -148261 -92327 -193221 -294896 -232124 -8261 153763 219803
15944B19803k5567k24647m7347l5930j52531N6837R7364r219P5609r1601p7448
$$ 219803 194236 -30411 -77758 -113688 -266219 -209382 -112018 -121237 -45628 -137229 -214677
15933b14677m1742r6210j86421J54840J00939N8354K20382l7553j25614P8969
$$ -214677 -256419 -352629 -539050 -384210 -283271 -224917 -4535 -42088 -167702 -88733
15923h8733p8962Q0425L6353m6350j25256j63486K03709K61180M7542j9654J28358
$$ -88733 -167695 -87270 -50917 -97267 -222523 -386009 -182300 78880 126422 106768 235126
15912B35126j12509j64123J75777l7640L3950K01693K364P249o9204Q9o7099k51670
$$ 235126 122617 -41506 134271 96631 130581 332274 334638 341887 272683 272772 205673 -45997
15900d5997j91672j57889K19990O8617q6491k2736l8380j88713m9408J53380L6087
$$ -45997 -237669 -395558 -175568 -106951 -193442 -216178 -254558 -443271 -492679 -339299 -303212
15889c03212j55451m7934L89106K06221J3428K2033J07241j61767l08040j50822
$$ -303212 -458663 -506597 -117491 88730 102158 124191 231432 69665 -238375 -389197
15879c89197J40327p3646K59425K08383j24765j16658J079J56967o5274j2387
$$ -389197 -248870 -322516 -63091 145292 20527 -96131 -95052 61915 -3359 -15746
15869a5746J27510N8582k97717j46925J32570J50472Q9614n0878J9011j94795
$$ -15746 111764 170346 -127371 -274296 -141726 8746 98360 47482 66493 -128302
15859a28302m2491J00274k66544L1649l8154R938J46077L02708J72094L9153Q3008
$$ -128302 -170793 -70519 -337063 -305414 -343568 -333630 -187553 115155 287249 326402 409410
15848D09410m0868j10294n5533m2099k73303r8255k4149n5582j39099L3738P6214
$$ 409410 368542 258248 202715 160616 -112687 -210942 -235091 -290673 -429772 -396034 -319820
15837c19820P7649Q6441M6805J71834q4489k1939P5915q1366l8298q0939j63815
$$ -319820 -242171 -155730 -108925 62909 -21580 -43519 32396 -48970 -87268 -168207 -332022
15826c32022r0655L88547J90614n2956q6885j8054j19045K41681n0966r8378m1271
$$ -332022 -422677 -34130 156484 103528 16643 -1411 -120456 121225 70259 -28119 -69390
15815f9390K45240J16654k50174k80901K30063J0362J38160j16053j16189l1370
$$ -69390 175850 292504 42330 -238571 -8508 1854 140014 23961 -92228 -123598
15805a23598q3185O2504K1709p3086q2199O3824m874K1725J69113J06743J18246
$$ -123598 -206783 -144279 -122570 -195656 -277855 -214031 -218905 -197180 -28067 78676 196922
15794A96922Q227k14014j23531j85762Q5050R7429k2266J00342K2959K17557q4588
$$ 196922 205149 -8865 -132396 -318158 -233108 -135679 -157945 -57603 -34644 182913 98325
15783I8325J5644R6771j27339j98485j20462J07204j02614J68554P9645k30083
$$ 98325 113969 210740 83401 -115084 -235546 -128342 -230956 -62402 17243 -212840
15773b12840J04522R6237J5760M0321O4478J36059J9318k37955l7687J12278J1822
$$ -212840 -108318 -12081 3679 44000 108478 244537 263855 25900 -11787 100491 112313
15762A12313R3180R2035r224j34067K0761J13590N3200j11462j31842m2932J0191
$$ 112313 205493 297528 288304 154237 174998 288588 341788 230326 98484 55552 65743
15751F5743j74616j5701K04032N6360J11056K19052j70411j15315M9879J47452
$$ 65743 -108873 -124574 79458 135818 246874 465926 295515 180200 230079 377531
15741C77531j41927k5243k5663p273Q3167J36271k08592j0120K8101j36678Q122
$$ 377531 235604 210361 184698 177425 260592 396863 188271 178151 206252 69574 77696
15730G7696o2636J2128Q3114M9027K9369J2856K6753j40849n5860O0217L4895
$$ 77696 15060 27188 110302 159329 188698 201554 228307 87458 31598 91815 126710
15719A26710j18888m0099K47528J36620n6864L1012m3253j83365j31518j32306
$$ 126710 7822 -32277 215251 351871 295007 326019 282766 99401 -32117 -164423
15709a64423l1431n6674J3340J08163j0935n7459k88065M4413K03779J05909j31551
$$ -164423 -195854 -252528 -239188 -131025 -141960 -199419 -487484 -443071 -239292 -133383 -264934
15698b64934l00656J30724L34747J50145l1621n6536j14437o7671O2257J52911
$$ -264934 -565590 -434866 -100119 50026 18405 -38131 -152568 -220239 -157982 -5071
15688e071j06638P3097M8619O2743J95683P6436j76799m34554r7738J07532j47482
$$ -5071 -111709 -38612 10007 72750 268433 344869 168070 -266484 -364222 -256690 -404172
15677d04172k35580K29092L33919J86905k36361n8886J12940k6914Q4975o476
$$ -404172 -639752 -410660 -76741 110164 -126197 -185083 -72143 -99057 -14082 -20558
15667b0558k25217R5118r5422K0272J67789M5069J96593p935j61546l05613K01461
$$ -20558 -245775 -150657 -246079 -225807 -58018 -12949 183644 175709 14163 -291450 -89989
15656h9989m5631q8344J90566J42751k17805q6251M6377K31708K62583n1837l27939
$$ -89989 -135620 -223964 -33398 109353 -108452 -194703 -148326 83382 345965 294128 -33811
15645c3811j27148J46653n8621j36097K9405L12339K49497o7444m6316o2491j18814
$$ -33811 -160959 -14306 -72927 -209024 -179619 132720 382217 314773 268457 205966 87152
15634H7152j63711P5833q622j42598j1467J67676J59978r0892r0692j2678k22501
$$ 87152 -76559 -726 -9348 -151946 -163413 4263 164241 73349 -17343 -30021 -252522
15623b52522K20331K20556J93904j03184j56839l30113k41683j44376K31435Q470
$$ -252522 -32191 188365 382269 279085 122246 -207867 -449550 -593926 -362491 -354021
15613c54021J21298J88852R108n3882n6299o6735M6590J49851r3718N342L7960
$$ -354021 -232723 -43871 -34763 -88645 -144944 -211679 -165089 -15238 -108956 -103614 -65654
15602f5654J37001K22557j05803j09682k4376q735N4999m6487q6379j07807j81431
$$ -65654 71347 293904 188101 78419 54043 45308 100307 53820 -32559 -140366 -321797
15591c21797j34789l6272J45381J65998k04604p3409m2790J45136K28843m2095
$$ -321797 -456586 -492858 -347477 -181479 -386083 -459492 -502282 -357146 -128303 -170398
15581a70398R4521R3664r1664n7900j77749l20412M15723K12606j22378Q4615
$$ -170398 -75877 17787 -73877 -131777 -309526 -629938 -214215 -1609 -123987 -39372
15571c9372M3288O3489J58429P6677J0978m94799l80724K5899K27840K06085R9407
$$ -39372 3916 67405 225834 302511 313489 -181310 -562034 -536135 -308295 -102210 -2803
15560b803K9310j65673o867L53067j06134l58927J81215k32400j38092J04783
$$ -2803 26507 -139166 -146033 207034 100900 -258027 -76812 -309212 -447304 -342521
15550c42521K28637L51674P5781j20883k22763j57603r7706O6821J47742q0317
$$ -342521 -113884 237790 313571 192688 -30075 -187678 -285384 -218563 -70821 -151138
15540a51138M2673L65958J87111j35313J352M142J59360k30164l07348m8077R7918
$$ -151138 -108465 257493 444604 309291 310643 314785 474145 243981 -63367 -111444 -13526
15529a3526L2496k3476J98259r5595j73289O9689j75387L4786N8033R8473N8761
$$ -13526 18970 -4506 193753 98158 -75131 -5442 -180829 -146043 -88010 10463 69224
15518F9224j67004R1619O2125l5798L1440p3040k7752j92942j36082R541k1452
$$ 69224 -97780 -6161 55964 20166 51606 -21434 -49186 -242128 -378210 -368669 -390121
15507c90121R1943L42858N6538j31312q6716P3718j2223j77471j07879m4058j16179
$$ -390121 -298178 44680 101218 -30094 -116810 -43092 -55315 -232786 -340665 -384723 -500902
15496e00902o5503L02315Q3068k02125q6325n0007J8734J51326J66860q2030j37529
$$ -500902 -566405 -264090 -181022 -383147 -469472 -519479 -500745 -349419 -182559 -264589 -402118
15485d02118j13264K31308m9309N7963K72749j2329l24627l29613J30651P9938
$$ -402118 -515382 -284074 -333383 -275420 -2671 -15000 -339627 -669240 -538589 -458651
15475d58651Q2958K65025K06141j28975J9068k7346n4999Q7191J91583J16997
$$ -458651 -375693 -110668 95473 -33502 -14434 -41780 -96779 -9588 181995 298992
15465B98992J85931j21029j55280l19656l8179J91225J04391Q3066j12021j88907
$$ 298992 484923 363894 208614 -111042 -149221 42004 146395 229461 117440 -71467
15455g1467j4808p3383R1633J14118n6114J40118P9192p6943j82928P5623L077
$$ -71467 -86275 -159658 -68025 46093 -10021 130097 209289 132346 -50582 25041 28118
15444B8118N7325K0204j78102J17094j55520j2944j55085l3810L6935n1501q4674
$$ 28118 85443 105647 -72455 44639 -110881 -123825 -278910 -312720 -275785 -327286 -411960
15433d11960J5238j1744J43048j3099j95997N0964K01464P7120j1280J53220J36345
$$ -411960 -396722 -408466 -265418 -278517 -474514 -423550 -222086 -144966 -156246 -3026 133319
15422A33319j4240j22462l46255j2720Q0375K03774M0253j83333o7971K4762J78359
$$ 133319 119079 -3383 -349638 -362358 -281983 -78209 -37956 -221289 -289260 -264498 -86139
15411h6139l0704N6741K27596j63017Q565j36504l3655R4516j04103p6169k4034
$$ -86139 -116843 -60102 167494 4477 13042 -123462 -157117 -62601 -166704 -242873 -266907
15400b66907j18229n349J71694J85008k68061O4766J10250L40696l7190N9157
$$ -266907 -385136 -390485 -218791 -33783 -301844 -237078 -126828 213868 176678 235835
15390B35835j00223o1910p0609J17944J3385k7614M2081o6216j19550j4913j09885
$$ 235835 135612 73702 3093 121037 134422 106808 148889 82673 -36877 -51790 -161675
15379a61675p3003J00979O5053j62033k8326K94368k26478j25341k7478o838M6142
$$ -161675 -234678 -133699 -68646 -230679 -259005 35363 -191115 -316456 -343934 -350772 -304630
15368c04630O6138q446J92715O6025j7445j73645j16582J86598K11713l17938
$$ -304630 -238492 -246938 -54223 11802 -5643 -179288 -295870 -109272 102441 -215497
15358b15497q9515K341J37795K87128j92320l39499N595K4756J82477N6177L240
$$ -215497 -305012 -302671 -164876 122252 -70068 -409567 -403972 -379216 -196739 -140562 -137322
15347a37322l1593k31859r7999J63869J86132K75194J86979L0655r2907N2968
$$ -137322 -168915 -400774 -498773 -334904 -148772 126422 313401 344056 251149 304117
15337C04117j89332k15833j83552l07922K33441K86892O6334j76367k506K81608
$$ 304117 114785 -101048 -284600 -592522 -359081 -72189 -5855 -182222 -184728 96880
15327I6880j77239Q1202o3992j79850j64552J90178L34087Q0512j05868j70602
$$ 96880 -80359 843 -63149 -242999 -407551 -217373 116714 197226 91358 -79244
15317g9244K3724K30221J25507J54661K413k28927j44035L6497k50012n0415J26414
$$ -79244 -55520 174701 300208 454869 457282 228355 84320 120817 -129195 -179610 -53196
15306e3196J1768N8370k7707j60438j59597m4434J12449R2376j06018J3634K90694
$$ -53196 -41428 16942 -10765 -171203 -330800 -375234 -262785 -170409 -276427 -262793 27901
15295B7901Q1062l19542j91721O493K80363J98402j85815k92730k01128q4844
$$ 27901 108963 -210579 -402300 -395807 -115444 82958 -102857 -395587 -596715 -681559
15285f81559K93873J77825J73414K17059k9112j52849j28985j62671k25931j6841
$$ -681559 -387686 -209861 -36447 180612 151500 -1349 -130334 -293005 -518936 -535777
15275e35777K81162J70957N0611j41001N8468l8769L60817l4824m51568j12396
$$ -535777 -254615 -83658 -33047 -174048 -115580 -154349 206468 171644 -279924 -392320
15265c92320K60730J42654n9747J52941J214k4759j17557j15756o819L7040L59933
$$ -392320 -131590 11064 -48683 104258 105472 80713 -36844 -152600 -159419 -122379 237554
15254B37554L08092j24915j40368k20390Q7217J35659K9944j49484j84756j1640
$$ 237554 545646 420731 280363 59973 147190 282849 312793 163309 -21447 -33087
15244c3087j6801k2119j5924J25359q1204r2977J75713o952R185J71660k10781
$$ -33087 -49888 -72007 -87931 37428 -43776 -136753 38960 32008 41193 212853 2072
15233B072Q8591j7584j06148K7203P7976L7014o8657j16929K09478P7762q0263
$$ 2072 90663 73079 -33069 -5866 72110 109124 40467 -76462 133016 210778 130515
15222A30515j29489l8694P6935J9020L300j45048k90435k4510J82494J59961j1703
$$ 130515 1026 -37668 39267 58287 61587 -83461 -373896 -398406 -215912 -55951 -67654
15211f7654J24968J06433Q5283j03799j08821M8898j43371m1119K52898K0368
$$ -67654 57314 163747 249030 145231 36410 85308 -58063 -99182 153716 174084
15201A74084L3701r4364j26509K45004l021J29569L0528j32771L1105m30849r5405
$$ 174084 207785 113421 -13088 231916 228895 358464 388992 256221 287326 -143523 -238928
15190b38928p2055P8574J82846K69536k1491k43264k7009K5028J15264J11136
$$ -238928 -310983 -232409 -49563 219973 198482 -44782 -71791 -46763 68501 179637
15180A79637r8295P6413k4683O0621k7322o4811k48532L6875p6393J91676J32129
$$ 179637 81342 157755 133072 193693 166371 101560 -146972 -110097 -186490 5186 137315
15169A37315j00088O2937M4632J92766k26601j53945l3555k9057K57338P4417
$$ 137315 37227 100164 144796 337562 110961 -42984 -76539 -105596 151742 226159
15159B26159j01454Q3106M2275q1272K8933q023j14039j95830P8419K01983n1539
$$ 226159 124705 207811 250086 168814 197747 189724 75685 -120145 -41726 160257 108718
15148A08718l1242M9199j17092O2162J5943M4117j19803k03943j23453L73622
$$ 108718 77476 126675 9583 71745 87688 131805 12002 -191941 -315394 58228
15138E8228J88022j18583r6194j56919R8850K92361j27376k97887r6096J47049
$$ 58228 246250 127667 31473 -125446 -26596 265765 138389 -159498 -255594 -108545
15128a08545J31886J88785P9502n8758r9248l7818j04995n1336k3905o3015L2735
$$ -108545 23341 212126 291628 232870 133622 95804 -9191 -60527 -84432 -147447 -114712
15117a14712Q7210J27363j32058k63564P9558K34004J11855o0526J82164j72248
$$ -114712 -27502 99861 -32197 -295761 -216203 17801 129656 69130 251294 79046
15107G9046k82383O2605j40479N6485K23274M4271K4852K48587J33807j90883
$$ 79046 -203337 -140732 -281211 -224726 -1452 42819 67671 316258 450065 259182
15097B59182j33887k95099j33874K46953L613M070J68869o4673j35272Q532j9435
$$ 259182 125295 -169804 -303678 -56725 -53112 -49042 119827 55154 -80118 -71586 -91021
15086i1021K6683r0453R9331J90107J15683Q6620p7346o3102j73185j8977j02611
$$ -91021 -64338 -154791 -55460 134647 250330 336950 259604 196502 23317 4340 -98271
15075i8271m0443r6460N5178K10776Q2937N8690o0822k8417j27587K78519R3550
$$ -98271 -138714 -235174 -179996 30780 113717 172407 111585 83168 -44419 234100 327650
15064C27650k22523j25495k6037l7016J52744j49694l90380p9669J27813J66498
$$ 327650 105127 -20368 -46405 -83421 69323 -80371 -470751 -550420 -422607 -256109
15054b56109N3750K8259K41617n9669j46644l9028p5477O2635K953Q8504K71990
$$ -256109 -202359 -174100 67517 7848 -138796 -177824 -253301 -190666 -187713 -99209 172781
15043A72781L929O2583j80959Q6501M9582k54965k65319m3087K16986K1160j07376
$$ 172781 176710 239293 58334 144835 194417 -60548 -325867 -368954 -151968 -130808 -238184
15032b38184o2732n0279R8095J91104K28116o2701k27136N6713J68827R5485J26881
$$ -238184 -300916 -351195 -253100 -61996 166120 103419 -123717 -67004 101823 197308 324189
15021C24189j28686k7153k75559r6585m5528R137K22752J65212l867J62223j7922
$$ 324189 195503 168350 -107209 -203794 -249322 -240185 -17433 147779 143912 306135 288213
15010B88213J6141j44803m73339p4242K64643R929j67587J09677J92290L12502
$$ 288213 304354 159551 -313788 -388030 -123387 -113458 -281045 -171368 20922 333424
15000C33424K44029J18672l9068l74012m4272J11109J59320j31110p4710k1311
$$ 333424 577453 696125 657057 283045 238773 349882 509202 378092 303382 282071
14990B82071q6334j3804l1217j25356J72742L7804M3794k07459l7340L6494j25851
$$ 282071 195737 181933 150716 25360 198102 235906 279700 72241 34901 71395 -54456
14979e4456j20769O1259J40443J05226j70366P9403l1982r1473J50861L00698
$$ -54456 -175225 -113966 26477 131703 -38663 40740 8758 -82715 68146 368844
14969C68844R376o9468m7574m8933R8830q8583J24336L9917j21722K1144P1781
$$ 368844 378220 308752 261178 212245 311075 222492 346828 386745 265023 286167 357948
14958C57948j1763j62508j54885j23936K00459L7494M589K022n9372J78918r8295
$$ 357948 346185 183677 28792 -95144 105315 142809 147398 149420 90048 268966 170671
14947A70671q9132M6422K22035P1702P9167k34462j78303k51110J0585K7869l8789
$$ 170671 81539 127961 349996 421698 500865 266403 88100 -163010 -152425 -124556 -163345
14936a63345K23382J8060P0110K2954k13712N5258m2352j02625m483l6086P7352
$$ -163345 60037 78097 148207 171161 -42551 12707 -29645 -132270 -136753 -172839 -95487
14925i5487J99420J20206R7934q0605j77654J14336O2836j3242l27950j05860
$$ -95487 103933 224139 322073 241468 63814 178150 240986 227744 -100206 -206066
14915b06066J97505k6442j13038n447P0912o0635J57440J54912m4247l18073J44359
$$ -206066 -8561 -35003 -148041 -153488 -82576 -143211 14229 169141 124894 -193179 -48820
14904d8820L23181J27057n9542K186j20855M024M2097n423j55020M6418j08952
$$ -48820 274361 401418 341876 344062 223207 227231 269328 263905 108885 155303 46351
14893D6351q1827j67056J13561M9561P0657m0692p7084j337J15720j04819J31828
$$ 46351 -35476 -202532 -88971 -39410 31247 -9445 -86529 -87866 27854 -76965 54863
14882E4863n8180k42399J398j06883n7353J46003J97129J61725L5427j08953J85
$$ 54863 -3317 -245716 -244318 -351201 -408554 -262551 -65422 96303 131730 22777 22962
14871B2962P3546n9642J40172K08756p1247l19785q8294J32315k82975P8261L29196
$$ 22962 96508 36866 177038 385794 314547 -5238 -93532 38783 -244192 -165931 163265
14860A63265R9897Q8788P0369j67646P4037k50354r4713K565J46179j53057j84487
$$ 163265 263162 351950 422319 254673 328710 78356 -16357 -13792 132387 -20670 -205157
14849b05157k1423M4873r0399O8961J39493O3857N8228J44065o5975l10266k03991
$$ -205157 -226580 -181707 -272106 -203145 -63652 205 58433 202498 136523 -173743 -377734
14838c77734M5720N5648K27721J91977N2400p7801m3531o6979q4675J63537m2047
$$ -377734 -332014 -276366 -48645 143332 195732 117931 74400 7421 -77254 86283 44236
14827D4236Q5655M1383J2917j27786Q6044L9752K8091j71414j28438p7875K6150
$$ 44236 129891 171274 184191 56405 142449 182201 210292 38878 -89560 -167435 -141285
14816a41285j13584P3029K40602j4610j94440p6830L5453n1688n371O0522M3592
$$ -141285 -254869 -181840 58762 44152 -150288 -227118 -191665 -243353 -248724 -188202 -144610
14805a44610J03097J94245j07953K2834J89142k75913j21373n6091j10587J17524
$$ -144610 -41513 152732 44779 67613 256755 -19158 -140531 -196622 -307209 -189685
14795a89685J84242L98648j40722l70010k5141Q5977j7184L2232n9541o4484j59923
$$ -189685 -5443 393205 252483 -117527 -142668 -56691 -73875 -41643 -101184 -165668 -325591
14784c25591j002K07855J29375L442L0057J61070K73759j20968j56778k95395
$$ -325591 -326593 -118738 10637 14079 44136 205206 478965 357997 201219 -94176
14774i4176J8088j9157P9550J51195l4992J24073p7788p8370p235Q1354J85358
$$ -94176 -76088 -95245 -15695 135500 100508 224581 146793 68423 61188 142542 327900
14763C27900Q4530M9761k82506j38581j9305J91518j46728j83349Q5926P3277
$$ 327900 412430 462191 179685 41104 21799 213317 66589 -116760 -30834 42443
14753D2443K78997o228n0546J90318Q2931m1223l11192k22681k14428J63657K65252
$$ 42443 321440 315212 264666 454984 537915 496692 185500 -37181 -251609 -87952 177300
14742A77300K33325j3476o4326n7776K50610j25744o3871o6737j08130j39326
$$ 177300 410625 397149 332823 275047 525657 399913 336042 269305 161175 21849
14732B1849J65071J60846l4202j50947l7981J4203j08314k3733J57697K41909
$$ 21849 186920 347766 313564 162617 124636 138839 30525 6792 164489 406398
14722D06398J25526R3693k5780k18416j2964j75126n0721k11618L9094J55207
$$ 406398 531924 625617 599837 381421 368457 193331 142610 -69008 -29914 125293
14712A25293j548q8933J46717P9371o3221N5483r6560k61006j32560O0631N5780
$$ 125293 123745 34812 181529 260900 197679 253162 156602 -104404 -236964 -176333 -120553
14701a20553M9551j02722J20696K98129p8727R1227p9122j42578R6370P0455J99437
$$ -120553 -71002 -173724 -53028 245101 166374 257601 178479 35901 132271 202726 402163
14690D02163J0759k09772n4636K66464K89568j03065l8734j25649j84345k51930
$$ 402163 412922 203150 148514 414978 704546 601481 562747 437098 252753 823
14680H23J89657K0987R8481P0048K03762o3958p9986j27395j10966Q5261m0118
$$ 823 190480 211467 309948 379996 583758 519800 439814 312419 201453 286714 246596
14669B46596r6959l499n3103M4365P9231k65778J50890K06873j12449j90475j36347
$$ 246596 149637 146138 93035 137400 216631 -49147 101743 308616 196167 5692 -130655
14658a30655q7593J07864J46026J20123K20768k22852j66604j4606J03904k4763
$$ -130655 -218248 -110384 35642 155765 376533 153681 -12923 -27529 76375 51612
14648E1612j7758m8815J15095K49819K26532N1650l25693r2352q5706j07202J07689
$$ 51612 33854 -14961 100134 349953 576485 628135 302442 210090 124384 17182 124871
14637A24871J85678j6415r6222N5882m5437J04088o7204k5037J12146M2042j71745
$$ 124871 310549 294134 197912 253794 208357 312445 245241 220204 332350 374392 202647
14626B02647r26j02953k008J86638J21538p0503j82242r8532k3308K57395K37586
$$ 202647 201721 98768 96760 283398 404936 334433 152191 53659 30351 287746 525332
14615E25332j52849j96097n3087k3945M533J82214J97779r1612j52246k30390
$$ 525332 372483 176386 123299 99354 103887 286101 483880 392268 240022 9632
14605I632k09133l1241K57601J83825j91253m2771J1805J75236J45517j9505j47749
$$ 9632 -199501 -230742 26859 210684 19431 -23340 -11535 163701 309218 289713 141964
14594A41964j85687j04810M2899j51113J15091K85856R9004Q3474N8245R063N1968
$$ 141964 -43723 -148533 -105634 -256747 -141656 144200 243204 326678 384923 393986 445954
14583D45954j27419m7569j50005o7486J55483K0842J42769P3384M3583P3803r9501
$$ 445954 318535 270966 120961 53475 208958 229800 372569 445953 489536 563339 463838
14572D63838j4331j40847m30149k06867J05274j20328J70077M13780N2434k21725
$$ 463838 449507 308660 -121489 -328356 -223082 -343410 -173333 240447 292881 71156
14562G1156j07600J08495Q1400L2336J01481j88694l01937j14994K75996L42954
$$ 71156 -36444 72051 153451 185787 287268 98574 -203363 -318357 -42361 300593
14552C00593J15444j17303N7977j13371j00332J6183O3279R0470J81404k8317
$$ 300593 416037 298734 356711 243340 143008 159191 222470 312940 494344 466027
14542D66027m8809j77356l69259k78483J95708K00801j4304P0941J44964R8003
$$ 466027 417218 239862 -129397 -407880 -212172 -11371 -25675 45266 190230 288233
14532B88233j24313l01434l0882m7759M1852J84523J17133q7817J92251o4231
$$ 288233 163920 -137514 -168396 -216155 -174303 10220 127353 39536 231787 167556
14522A67556q036P5665k27885j03768J03144j10588M8478r421k3328K8804k8033
$$ 167556 159520 235185 7300 -96468 6676 -103912 -55434 -64855 -88183 -59379 -87412
14511h7412l0860K23733M7896j42769K33024Q3011n8931j3945K00737J63464m3564
$$ -87412 -118272 105461 153357 10588 243612 326623 267692 253747 454484 617948 574384
14500E74384k75236p6271J38432m8841m02613O8976K63063j56133K8054p7591
$$ 574384 299148 222877 361309 312468 -90145 -21169 241894 85761 113815 36224
14490C6224j92670j0795Q4103J66057K62558J11844J4377m6682k258k88796K7976
$$ 36224 -156446 -167241 -83138 82919 345477 457321 471698 425016 422758 133962 161938
14479A61938Q0631j55832L07373j5290k10029J5993n0146p2146O9378N7182M111
$$ 161938 242569 86737 394110 378820 168791 184784 134638 62492 131870 189052 193163
14468A93163J52996R5678k45710j7677K3686J57542l2386j51778j27191j92551
$$ 193163 346159 441837 196127 178450 202136 359678 327292 175514 48323 -144228
14458a44228J32306Q9435j63371L3329J21274o3437Q3162J51723p2747m7548k3900
$$ -144228 -11922 77513 -85858 -52529 68745 5308 88470 240193 167446 119898 95998
14447I5998L4971o3183l756J45915J23282q0722q1198q202l8768K24427J10815
$$ 95998 130969 67786 64030 209945 333227 252505 171307 163105 124337 348764 459579
14436D59579J5528j78837j31258K3200J70042j63728j74265K16515p3214j48486
$$ 459579 475107 296270 165012 188212 358254 194526 20261 236776 163562 15076
14426A5076J56055J87161J74301r4771R9901j45908O6768j44729j09880k66269
$$ 15076 171131 358292 532593 437822 537723 391815 458583 313854 203974 -62295
14416f2295j40525n2576m5914L54858L69927J28590K6728q4546q4298j25813K6904
$$ -62295 -202820 -255396 -301310 53548 423475 552065 578793 494247 409949 284136 311040
14405C11040n8782j30524L7149K81870R318j633k1871l3129J0925n4479j38516
$$ 311040 252258 121734 158883 440753 450071 448438 426567 393438 404363 349884 211368
14394B11368L3511J50802j94423M8181L2030o1982m1308j12513j30950j04200
$$ 211368 244879 395681 201258 249439 281469 219487 178179 65666 -65284 -169484
14384a69484l27229n3289N71528J86422j0069k01076J2690J26576j07316P7412
$$ -169484 -496713 -550002 21526 207948 197879 -3197 9493 136069 28753 106165
14374A06165o8226j32613k02N6948N331K3145M8197m154j724r0246J36932J64528
$$ 106165 37939 -94674 -94876 -37928 -32597 -9452 38745 34591 32867 -57379 79553 244081
14362B44081n0188r0288R4134K09848M7457P9264R6900j18716k69376Q8296Q1887
$$ 244081 193893 103605 197739 407587 455044 534308 631208 512492 243116 331412 413299
14351D13299O1868j71922p9185J31982K3159j79565k02796j50475L6168L21076
$$ 413299 475167 303245 224060 356042 379201 199636 -3160 -153635 -117467 203609
14341B03609K45414J18654J04598q2262j83283o8632J97759j6934k20492j72404
$$ 203609 449023 567677 672275 590013 406730 338098 535857 518923 298431 126027
14331A26027p0474J47935j06929N0229N9388j24184M0035J98507o9387j41828
$$ 126027 55553 203488 96559 146788 206176 81992 122027 320534 251147 109319
$$ [...]
##END NTUPLES=NMR SPECTRUM
##END=
