##TITLE=Analysis number 322317
Compound Code cc 40204
Book Reference 468/164
Project Code adrs
Chemist Name colinb
##JCAMPDX= 6.0         $$ Bruker NMR JCAMP-DX V2.0
##DATA TYPE= NMR SPECTRUM
##DATA CLASS= NTUPLES
##ORIGIN= Bruker BioSpin GmbH
##OWNER= nmr
$$ XWIN-NMR		Version 3.5
$$ Thu Sep 21 08:12:22 2006 GMT Daylight Time (UT+1h)  MAYBRIDGE\nmr@NMR_250MHZ
##.OBSERVE FREQUENCY= 250.131544655141
##.OBSERVE NUCLEUS= ^1H
##.ACQUISITION MODE= SIMULTANEOUS (DQD)
##.ACQUISITION SCHEME= undefined
##.AVERAGES= 16
##.DIGITISER RES= 18
##SPECTROMETER/DATA SYSTEM= dpx250
##.PULSE SEQUENCE= zg30
##.SOLVENT NAME= CDCl3
##.SHIFT REFERENCE= (INTERNAL, CDCl3, 0, 16.522)
##AUDIT TRAIL= $$ (NUMBER, WHEN, WHO, WHERE, WHAT)
$$ ##TITLE= Audit trail, XWIN-NMR		Version 3.5
$$ ##JCAMPDX= 5.01
$$ ##ORIGIN= Bruker BioSpin GmbH
$$ ##OWNER= nmr
$$ C:\u/data/dgb/nmr/ADRS/1080/pdata/1/auditp.txt
$$ ##AUDIT TRAIL=  $$ (NUMBER, WHEN, WHO, WHERE, WHAT)
(   1,<2006-09-21 08:11:54.35 +100>,<MAYBRIDGE\nmr>,<NMR_250MHZ>,
      <created by zg, POWCHK disabled, PULCHK disabled
       configuration hash MD5:
       E2 DF 36 D8 04 B2 41 60 5A D7 A3 38 5A 4B D0 FE
       data hash MD5: 64K
       2A 8E D1 E0 F0 BC FB 77 EB 19 82 68 1F 20 FE 22>)
(   2,<2006-09-21 08:12:07.85 +100>,<MAYBRIDGE\nmr>,<NMR_250MHZ>,
      <Start of raw data processing
       ef LB = 0.3 FT_mod = 6 PKNL = 1 SI = 32K 
       data hash MD5: 32K
       41 B9 82 75 13 B8 44 54 F0 ED D1 3B B7 3D 3C 56>)
(   3,<2006-09-21 08:12:09.51 +100>,<MAYBRIDGE\nmr>,<NMR_250MHZ>,
      <apk 
       data hash MD5: 32K
       1D B8 51 05 57 A4 14 B7 F3 6D B6 22 F7 02 41 F9>)
(   4,<2006-09-21 08:12:10.26 +100>,<MAYBRIDGE\nmr>,<NMR_250MHZ>,
      <abs ABSG = 5 
       data hash MD5: 32K
       3C 94 7A 33 A3 5B EF 90 55 94 67 A0 E6 C2 EC F8>)
$$ ##END=
$$ 
$$ hash MD5
$$ D0 F4 D9 11 0F D8 E9 5C 02 AA 66 BC 64 77 22 EC
##$RELAX= 
##$RELAX= 
##$RELAX= 
##$RELAX= 
##$RELAX= 
##$RELAX= 
##$RELAX= 
$$ Bruker specific parameters
$$ --------------------------
##$DU= <C:\u>
##$EXPNO= 1080
##$NAME= <ADRS>
##$PROCNO= 1
##$TYPE= <nmr>
##$USER= <dgb>
##$AMP= (0..31)
100 100 100 100 100 100 100 100 100 100 100 100 100 100 100 100 100 100 
100 100 100 100 100 100 100 100 100 100 100 100 100 100 
##$AQSEQ= 0
##$AQ_mod= 3
##$AUNM= <au_zg>
##$AUTOPOS= <31 >
##$BF1= 250.13
##$BF2= 250.13
##$BF3= 250.13
##$BF4= 250.13
##$BF5= 500.13
##$BF6= 500.13
##$BF7= 500.13
##$BF8= 500.13
##$BYTORDA= 1
##$CFDGTYP= 0
##$CFRGTYP= 5
##$CHEMSTR= <none>
##$CNST= (0..31)
1 1 145 1 1 1 1 1 1 1 1 1 1 1 1 1 1 1 1 1 1 1 1 1 1 1 1 1 1 1 1 1 
##$CPDPRG= <>
##$CPDPRG1= <>
##$CPDPRG2= <>
##$CPDPRG3= <>
##$CPDPRG4= <mlev>
##$CPDPRG5= <mlev>
##$CPDPRG6= <mlev>
##$CPDPRG7= <mlev>
##$CPDPRG8= <mlev>
##$CPDPRGB= <>
##$CPDPRGT= <>
##$D= (0..31)
0 1 0 0 0 0 0 0 0 0.06 0 0 0 0 0 0 0.0002 0 0 0 0 0 0 0 0 0 0 0 0 0 0 
0 
##$DATE= 1158822712
##$DBL= (0..7)
120 120 120 120 120 120 120 120 
##$DBP= (0..7)
150 150 150 150 150 150 150 150 
##$DBP07= 0
##$DBPNAM0= <>
##$DBPNAM1= <>
$$ [...]
##$SUBNAM7= <"">
##$SUBNAM8= <"">
##$SUBNAM9= <"">
##$SW= 20.6930455092707
##$SWIBOX= (0..15)
0 0 3 0 0 0 0 0 0 0 0 0 0 0 0 0 
##$SW_h= 5175.983436853
##$TD= 65536
##$TD0= 1
##$TE= 295.16
##$TE2= 300
##$TE3= 300
##$TEG= 300
##$TL= (0..7)
0 120 120 120 120 120 120 120 
##$TP= (0..7)
150 150 150 150 150 150 150 150 
##$TP07= 0
##$TPNAME0= <>
##$TPNAME1= <>
##$TPNAME2= <>
##$TPNAME3= <>
##$TPNAME4= <>
##$TPNAME5= <>
##$TPNAME6= <>
##$TPNAME7= <>
##$TPOAL= (0..7)
0.5 0.5 0.5 0.5 0.5 0.5 0.5 0.5 
##$TPOFFS= (0..7)
0 0 0 0 0 0 0 0 
##$TUNHIN= 0
##$TUNHOUT= 0
##$TUNXOUT= 0
##$USERA1= <user>
##$USERA2= <user>
##$USERA3= <user>
##$USERA4= <user>
##$USERA5= <user>
##$V9= 5
##$VALIST= <valist>
##$VCLIST= <CCCCCCCCCCCCCCC>
##$VD= 0
##$VDLIST= <DDDDDDDDDDDDDDD>
##$VPLIST= <PPPPPPPPPPPPPPP>
##$VTLIST= <TTTTTTTTTTTTTTT>
##$WBST= 1024
##$WBSW= 4
##$XGAIN= (0..3)
0 0 0 0 
##$XL= 0
##$YL= 0
##$YMAX_a= 266289
##$YMIN_a= -378226
##$ZGOPTNS= <>
##$ZL1= 120
##$ZL2= 120
##$ZL3= 120
##$ZL4= 120
##$ABSF1= 16.522
##$ABSF2= -4.171173
##$ABSG= 5
##$ABSL= 3
##$ALPHA= 0
##$AQORDER= 0
##$ASSFAC= 0
##$ASSFACI= 0
##$ASSFACX= 0
##$ASSWID= 0
##$AUNMP= <proc_1d>
##$AZFE= 0.1
##$AZFW= 0.1
##$BCFW= 0
##$BC_mod= 0
##$BYTORDP= 0
##$COROFFS= 0
##$CY= 12.5
##$DATMOD= 1
##$DC= 0
##$DFILT= <>
##$DTYPP= 0
##$F1P= 14.0000005364418
##$F2P= -0.99999901652339
##$FCOR= 0.5
##$FTSIZE= 32768
##$FT_mod= 6
##$GAMMA= 0
##$GB= 0
##$INTBC= 1
##$INTSCL= 1
##$ISEN= 128
##$LB= 0.3
##$LEV0= 0
##$LPBIN= 0
##$MAXI= 10000
##$MC2= 0
##$MEAN= 0
##$ME_mod= 0
##$MI= 0
##$NCOEF= 0
##$NC_proc= -5
##$NLEV= 6
##$NOISF1= 0
##$NOISF2= 0
##$NSP= 0
##$NTH_PI= 0
##$NZP= 0
##$OFFSET= 16.522
##$PC= 1
##$PHC0= 151.9928
##$PHC1= -1.195768
##$PH_mod= 1
##$PKNL= yes
##$PPARMOD= 0
##$PSCAL= 4
##$PSIGN= 0
##$REVERSE= no
##$SF= 250.13
##$SI= 32768
##$SIGF1= 0
##$SIGF2= 0
##$SINO= 400
##$SIOLD= 32768
##$SREGLST= <1H.CDCl3>
##$SSB= 0
##$STSI= 32768
##$STSR= 0
##$SW_p= 5175.98343685301
##$SYMM= 0
##$S_DEV= 0
##$TDeff= 65536
##$TDoff= 0
##$TI= <Analysis number 999999
Compound Code 99
Book Reference 9
Project Code 9>
##$TILT= no
##$TM1= 0
##$TM2= 0
##$TOPLEV= 0
##$USERP1= <user>
##$USERP2= <user>
##$USERP3= <user>
##$USERP4= <user>
##$USERP5= <user>
##$WDW= 1
##$XDIM= 32768
##$YMAX_p= 504542401
##$YMIN_p= -1057194
$$ End of Bruker specific parameters
$$ ---------------------------------
##NTUPLES= NMR SPECTRUM
##VAR_NAME=  FREQUENCY,     SPECTRUM/REAL,   SPECTRUM/IMAG
##SYMBOL=    X,             R,               I
##VAR_TYPE=  INDEPENDENT,   DEPENDENT,       DEPENDENT
##VAR_FORM=  AFFN,          ASDF,            ASDF
##VAR_DIM=   32768,         32768,           32768
##UNITS=     HZ,            ARBITRARY UNITS, ARBITRARY UNITS
##FACTOR=    0.157963299565203, 1,           1
##FIRST=     4132.6476996994, 0,             0
##LAST=      -1043.33573715361, 0,           0
##MIN=       -1043.33573715361, -1057194,    0
##MAX=       4132.6476996994, 504542401,     0
$$ Real data points
##PAGE= N=1
##DATA TABLE= (X++(R..R)), XYDATA
$$ [...]
24149F815m26248R2917L9382J94262L2792K2881k10041j80265K16736K46891J26376
24138A62498J1760K28797j64119j55252o7868m7679K8509M001Q4285r6814j44801
24127a56683k22309K9799Q6046k80915l01003J67105K65108K00082J36925k80831
24117c56676k6873J11435q6197K21244J95964J6439J64594M8027k72174l1436
24107a5653l938q0177j22034J74129K41164K0819J67602m3179n4985j2867j41883
24096A28998o9295j92358p5229J96538J58959k19278Q7792J01897r9238m4195
24086b5409O1373J08695j16824J11250j17325k2265O0124M4376j3625J24059m405
24075B10024o9799O2358L2555j38406k09251k4588j61702K7494M83401O3553l52947
$$ plain form
24149 6815 -419433 -326516 -287134 -92872 -60080 -37199 -247240 -427505 -210769 36122 162498
24138 162498 174258 403055 238936 83684 15816 -31863 -3354 647 84932 -11882 -156683
24127 -156683 -378992 -349193 -263147 -544062 -845065 -677960 -412852 -212770 -75845 -356676
24117 -356676 -383549 -272114 -358311 -137067 58897 75336 239930 287957 15783 -15653
24107 -15653 -19591 -99768 -221802 -47673 193491 214310 381912 338733 283748 270881 128998
24096 128998 59703 -132655 -207884 -11346 147613 -71665 16127 118024 18786 -25409
24086 -25409 35964 144659 27835 139085 21760 -505 59619 103995 90370 214429 210024
24075 210024 140225 202583 235138 96732 -112519 -137107 -298809 -271315 212086 275639 -77308
24064g7308k9151n4637j03503P8301o035K80868O4770l4426q2379k26402K77153
24053H7251K40808l49350k53303j15722O2903M04625J61162j71291j31059M082
24043e9894J97103O4136J75135N5821j69731m64330J96466M9330j86463k778J82593
24032C7388L8115K85350k52837l50697J69342K29206j74995j35368J08822J81723
24022A36049j5550j29798j9661M6208K05843P7345j14685l71124k9439L71875
24012A57063J60876q1700J08297J98420j3953n67815j97993j21295Q1348K56947
24002a9805J13931k1559K86418K7125l31155j32173k3275m4051M3725L147J33340
23991C5668J51750J45447J65349j11926k12341o8633J95583j2700r0342p6134
$$ plain form
24064 -77308 -106459 -161096 -264599 -186298 -192333 88535 153305 118879 36500 -189902 87251
24053 87251 328059 -21291 -274594 -390316 -327413 77212 238374 67083 -63976 -59894
24043 -59894 137209 201345 376480 432301 262570 -201760 -5294 44036 -142427 -145205 37388
24032 37388 75503 360853 108016 -242681 -73339 155867 -19128 -154496 -45674 136049
24022 136049 120499 -9299 -28960 17248 223091 300436 185751 -185373 -214812 157063
24012 157063 317939 236239 344536 542956 529003 -38812 -236805 -358100 -276752 -19805
24002 -19805 94126 72567 358985 386110 54955 -77218 -100493 -144544 -100819 -97672 35668
23991 35668 187418 332865 498214 386288 173947 105314 300897 288197 197855 121721
23981A21721J09405j40685O811J19508l75663p2899K01661J75156J17986M5243
23971C08244k21339L40366J3672k77373k67052m8533K60742O978R7975K7128k37607
23960C201j21560k8302J64020K31459L6817j52144l04364j20460L1895J63699
23950i5739Q586J24538j24082L3399J72417p6790k54281j59292j31927N1343m0869
23939d92697P3825o0149M01093K78984P5808O9409q9805J7073L8537J4972o0613
23928B66437Q7450O2610k38582j91441J99245J21200j4441p5246p2421J08918
23918B53729p7763J53930j36991L5140q4757j22731L6989M5125l23654k30097
23908d51080K66026L31781m5943M7594j05604j81450K0464J02722N9369q2890
$$ plain form
23981 121721 231126 90441 97252 216760 -158903 -231802 -30141 145015 263001 308244
23971 308244 86905 427271 440943 163570 -103482 -152015 108727 115705 213680 240808 3201
23960 3201 -118359 -146661 17359 248818 285635 133491 -170873 -291333 -259438 -95739
23950 -95739 -87153 37385 -86697 -53298 119119 42329 -211952 -371244 -503171 -451828 -492697
23939 -492697 -418872 -479021 -77928 201056 276864 346273 256468 273541 312078 327050 266437
23928 266437 353887 416497 177915 -13526 185719 306919 292478 217232 144811 253729
23918 253729 175966 329896 192905 228045 143288 20557 57546 102671 -220983 -451080
23908 -451080 -185054 146727 100784 148378 42774 -138676 -118212 -15490 43879 -39011
23898c9011l5808J01824L25712j97779j99932J88602o4124K7669M5459o0212j29122
23887c6722M5991J39962j55680K5253J47377q4550k42071K03384J60358j79736
23877B3566J2026J49647K561j9314j31109l30072k60949J76591J99783M8938P240
23866a21092K31701K82460q8380k91081p6840k76177K25906R4028M6451m9967
23856b2991j99968K00211j09810o6952L39204r1559M3778L09065k63r4498k84774
23845B1443j8530R8178j18315j02994K27058l0182j01662l8212j32704M9472k8529
23834a74977j25765L26017j21239m8734L07192J62865k4102J8976j08085k10183
23824A965M0354j20686j84616j5627J28873R2211k05400j29031K232L70521J47804
$$ plain form
23898 -39011 -74819 27005 352717 154938 -44994 143608 79484 107153 152612 92400 -36722
23887 -36722 9269 149231 -6449 18804 166181 81631 -160440 42944 203302 23566
23877 23566 35592 185239 187800 168486 37377 -292695 -553644 -377053 -177270 -128332 -121092
23866 -121092 110609 393069 304689 13608 -63232 -339409 -113503 -19475 26976 -22991
23856 -22991 -222959 -22748 -132558 -199510 139694 48135 91913 400978 400715 306217 21443
23845 21443 2913 101091 -17224 -120218 106840 76658 -25004 -63216 -195920 -146448 -174977
23834 -174977 -300742 25275 -95964 -144698 162494 325359 301257 320233 212148 1965
23824 1965 42319 -78367 -262983 -278610 -149737 -57526 -262926 -391957 -389725 -19204 128600
23813A28600k33286j4724J8349o7213K33087j15904J29638O5763J92592j6012
23803C20890l45442k903J40437o0267r7142l7756J7200K46454k08812n3746L1425
23792d9662R0369n7572K42639K96189K52825k10638K8069l26740J7772p589K05000
23781D80662j25698k30961j28552K65350J40565j42902r8124j90893q6308J2010
23771a04851K16618k7252j77577J0209J58840J75085k40472n4844K23385l11439
23761a32298k63066J27074K89988J36045k21878j6098P5997j3628K07652Q8641
23751B78429k00797l25866J59329M4756j23738o9357K58479K18346k03380j81496
23741a45295L02180j31203J03388J73910P7982k34239Q683p2301k6185L7621l2565
$$ plain form
23813 128600 -104686 -119410 -101061 -168274 64813 -51091 78547 144310 336902 320890
23803 320890 -24552 -27455 112982 52715 -44427 -82183 -64983 181471 -27341 -81087 -49662
23792 -49662 40707 -16865 225774 521963 774788 564150 592219 265479 283251 275662 480662
23781 480662 354964 124003 -4549 260801 401366 258464 160340 -30553 -116861 -104851
23771 -104851 111767 84515 -93062 -82853 75987 251072 10600 -44244 179141 -132298
23761 -132298 -395364 -268290 21698 157743 -64135 -80233 -4236 -17864 189788 278429
23751 278429 77632 -248234 -88905 -44149 -167887 -237244 21235 239581 36201 -145295
23741 -145295 156885 25682 129070 302980 380962 146723 155406 83105 56920 94541 61976
23730F1976m04623j83246L50003O516J3074J0490n4211J49141K59904j89630k17523
23719a98129n8309l3267K90863M67009K20900P5405L2526m04911l29911o1958
23709B18J29715J35241l1827O9367j53914l13649p5090j68375O8231j02349L43716
23698i8716R7237j04336j63525Q7885L8425p5412j24277j93279K31087J65338
23688a39573l0954J11511K04150Q3467j00795J30872j32625k78099J14736j29060
23678a66370k37214N58988K89458l7122k6k92461k72095P7911k8231J68915n5071
23667F682j25508O6688m8633P6717k0794N8449j15053Q2687M34193K53488j26266
23656E42650j67368k94045j70550J45161L2928j41647J4839K59643j49705k57976
$$ plain form
23730 61976 -342647 -525893 -175890 -169374 -156300 -145810 -200021 -50880 209024 19394 -198129
23719 -198129 -256438 -289705 1158 468167 689067 764472 796998 392087 62176 218
23709 218 129933 265174 233347 302714 148800 -164849 -239939 -408314 -340083 -442432 -98716
23698 -98716 -1479 -105815 -269340 -181455 -143030 -218442 -342719 -535998 -304911 -139573
23688 -139573 -170527 -59016 145134 228601 127806 258678 126053 -152046 -37310 -166370
23678 -166370 -403584 155404 444862 407740 407714 115253 -156842 -78931 -107162 61753 6682
23667 6682 -118826 -52138 -100771 -24054 -44848 13601 -101452 -18765 415428 668916 542650
23656 542650 375282 81237 -89313 55848 88776 -52871 -38032 221611 71906 -186070
23646a86070j73672K83800J82562o7284r1385n5208O7763m9819J35363P6844k43037
23635a20143J40938J08447J2381L2655p1728N794j71608Q6107j45589l26996P3402
23624c76340O6241K01781P3498N2065J44391j0568l16119K06761l0218l379K91770
23613B99883j88225j93523l49684j87559K82358K84215k34148L17429J55775O4938
23603B51459l00673J87796q6667o7929r2379J88957N4553l04171p3567L8916j82465
23592c86170j55788j79099N9829J39596K07637O9841J88689n5819p5462J64657
23582b2089K72774k06090m0377J0911N7242N3255j86939K8519J85634j65605j0886
23571b3651J10109M0038N3366J95309J99345J475k75212j68114m1647J38876q4217
$$ plain form
23646 -186070 -359742 -75942 106620 39336 -52049 -107257 -39494 -89313 46050 122894 -120143
23635 -120143 20795 129242 141623 174278 102550 108344 -63264 22843 -122746 -449742 -376340
23624 -376340 -310099 -108318 -34820 17245 161636 151068 -165051 41710 11492 8113 299883
23613 299883 111658 -81865 -431549 -619108 -336750 -52535 -286683 30746 186521 251459
23603 251459 -49214 138582 51915 -16014 -108393 80564 135117 -169054 -242621 -203705 -386170
23592 -386170 -541958 -721057 -661228 -521632 -313995 -244154 -55465 -111284 -186746 -22089
23582 -22089 250685 44595 4218 15129 72371 125626 -61313 -32794 152840 -12765 -23651
23571 -23651 86458 126496 179862 375171 574516 575991 300779 132665 91018 229894 145677
23560A45677M289k41455j67945J61506K60281j82155J5868J31662j13057J65442
23550A80113J47645M3481q9304Q7734q3941K3279j27671k97540o6025N4011Q9884
23539c8334p7969r7152j37134n4999M02965O6952j73849J42364J43736p1698j358
23528A03524k24950r0160K7762K13820k51875l64216K56818M93875n2357l54727
23518b42486j98456L7997J2355K62961l0806l37774k08054R4183L67497L3907
23508b08676L3539j15129K52581O7980N3422K9809P307l8336j81965j77285J44928
23497a31825J81978l044q8892L57454j78158k2418Q0131j66968J06975k3626J6509
23486A28116J09674o0299j83328o9538o3088j99497r0354K65290K24072K2169
$$ plain form
23560 145677 149966 -91489 -259434 -97928 162353 -19802 -3934 127728 14671 180113
23550 180113 327758 371239 281935 369669 285728 309007 181336 -116204 -182229 -128218 -38334
23539 -38334 -116303 -213455 -350589 -405588 -2623 64329 -109520 32844 176580 104882 103524
23528 103524 -121426 -211586 -183824 29996 -221879 -586095 -329277 164598 112241 -242486
23518 -242486 -440942 -402945 -390590 -127629 -158435 -496209 -704263 -610080 -242583 -208676
23508 -208676 -175137 -290266 -37685 30295 83717 113526 120833 82497 -99468 -276753 -131825
23497 -131825 50153 47109 -41783 315671 137513 115095 195226 28258 135233 111607 128116
23486 128116 237790 177491 -5837 -75375 -138463 -337960 -428314 -163024 61048 83217
23476H3217k9430m0313J59155K32522p8772j31688J16121j00445q0214o2006k52870
23465a84723k0829k2402p77J14238J70561o332r4888R1880O5766j15424J22722
23454A19792P4222l48698r3250J82299K11035l8023k85103M9369K26242J14196
23444B12081L23530K10601q8663k59395r3967j40129m14535j15723n5112q8316
23434e09628L19074K10680J60950n3837n0303k02540r7038K82881o3810j58917
23424a62488j91549m7722j5173J60826j21183k80164j18384O227K97750j42j05305
23413e77307P3701M39613J12461J13889m1013k15266j85790P520K31803M50245
23403D09856K8550k33029m68653j95966P5615J95706J9540J04005l38737j67533
$$ plain form
23476 83217 53787 13474 172629 405151 326379 194691 310812 210367 130153 68147 -184723
23465 -184723 -205552 -227954 -228731 -114493 56068 49736 -45152 46728 112494 -2930 119792
23454 119792 194014 -154684 -247934 -65635 145400 107377 -177726 -128357 97885 212081
23444 212081 535611 746212 657549 398154 304187 164058 -250477 -366200 -421312 -509628
23434 -509628 -190554 20126 181076 127239 76936 -125604 -222642 60239 -3571 -162488
23424 -162488 -354037 -401759 -416932 -256106 -377289 -657453 -775837 -769610 -471860 -472002 -577307
23413 -577307 -503606 -63993 48468 162357 121344 -93922 -279712 -272192 -40389 409856
23403 409856 438406 205377 -263276 -459242 -383627 -187921 -168381 -64376 -403113 -570646
23393e70646k8229J8968K92383M13950j06353J02769N9173j32180R7182J0260
23383A57277j29197j98454m67414J89816K80302r3442p238J571N0533k2059j11263
23372c49568L0371J25391K38009M5383j0533K9711j86708k1291J32206J85540
23362B18511k40481j98354k724R0476J60496q938j25373k1718K79312L11518J5531
23351D78256k86834j7981m5282l7170k86213l64129J70921K19375K91157R1107
23341B13207N0931j84230K0190p9631m4954M942k83317j65105J24408K5896L2408
23330b85255K45550K18929K2993r8758j8240m09722j57332K53122K5780P4510
23320a28423K6919p941Q0611l85m0276n506l8888J55664j3179k55908j8095R7370
$$ plain form
23393 -570646 -598875 -579907 -287524 126426 20073 122842 182015 49835 147017 157277
23383 157277 28080 -170374 -637788 -447972 -167670 -261112 -268350 -266779 -216246 -238305 -349568
23372 -349568 -319197 -193806 44203 89586 79053 108764 -77944 -99235 32971 218511
23362 218511 -21970 -220324 -223048 -132572 27924 18986 -106387 -128105 151207 462725 478256
23351 478256 191422 173441 128159 90989 -195224 -559353 -388432 -169057 122100 213207
23341 213207 264138 79908 100098 20467 -24487 -19545 -302862 -467967 -343559 -317663 -285255
23330 -285255 -39705 179224 202217 103459 85219 -324503 -481835 -228713 -202933 -128423
23320 -128423 -101504 -109445 -28834 -29219 -69495 -75001 -113889 41775 28596 -227312 -245407 -148037
23308a48037k66610j9113N7361J8664J77020R6883J01709R3594K49314j28381
23298B32404p0853r6713l7041j02714j7753J75096J30077J81239m27425q5932
23288a19615L50720q8061j39595N4373j04140J15403J75258n9366j8915K4533
23278A90595j2189J36359o8637l20383J30729O4059n6618q3731J62837p0819l73896
23267c01694l7603J73189k03107P6350M4864L38822J30195r4223m2216P5565J60106
23256C20248p2501k09573k81282J19374J10343L6260J01029J14042m7416j2639
23246A77885o5301k78699k3793K4623K10950R8528q0554Q7117j74014m0190L06861
23235B43413j12755j9981j69749J24479N6473k33619Q1754J5779Q439j17415k8998
$$ plain form
23308 -148037 -414647 -433760 -376399 -357735 -180715 -83832 17877 111471 360785 232404
23298 232404 161551 64838 27797 -74917 -92670 82426 212503 393742 -33683 -119615
23288 -119615 231105 143044 3449 57822 -46318 69085 244343 184977 166062 190595
23278 190595 178406 314765 246128 -74255 56474 120533 63915 -19816 143021 72202 -301694
23267 -301694 -339297 -166108 -369215 -292865 -248001 90821 221016 126793 84577 160142 320248
23256 320248 247747 38174 -243108 -123734 -13391 22869 123898 237940 190524 177885
23246 177885 112584 -166115 -189908 -165285 45665 144193 63639 150756 -23258 -63448 243413
23235 243413 130658 110677 -59072 65407 121880 -111739 -29985 -14206 -5767 -123182 -152180
23224a52180r8026j37041j44864K970L6485M1930J34044m1196m0777K19012k31977
23213d11620j9274K79806J75468J85389K04924R4663j93975k91789Q144Q3682
23203A15418o6098n6014j27357M4887J8665m6292j12571j96600M9596j13941p7955
23192e68262m951J4588K50919L0139L08925L0074k17829l4727N9910j2870k66674
23181d10758j92171L70297J54977j10710n7756J91041M2132J9730L8153O3461
23171A08396J78562J88692j68726m4501k4559j67312L4779J68815O7792r8405
23161B43533K9528R2091l56666j97566K69785L75050J66909k00118m28565k15461
23151b21480k5529q9013Q9267K4472m770Q0092L7430L11146J22202j97523l318
$$ plain form
23224 -152180 -250206 -387247 -532111 -529141 -492656 -450726 -316682 -357878 -398655 -179643 -411620
23213 -411620 -430894 -151088 24380 209769 414693 509356 315381 23592 31736 115418
23203 115418 49320 -6694 -134051 -89164 -70499 -116791 -229362 -425962 -376366 -490307 -568262
23192 -568262 -573213 -558625 -307706 -277567 31358 61432 -156397 -191124 -131214 -144084 -410758
23181 -410758 -602929 -232632 -77655 -188365 -246121 -55080 -12948 6782 44935 108396
23171 108396 286958 475650 306924 262423 237864 70552 105331 274146 341938 243533
23161 243533 273061 365152 8486 -189080 80705 455755 622664 422546 -6019 -221480
23151 -221480 -247009 -336022 -246755 -222283 -227053 -146961 -109531 201615 323817 126294 122976
23140A22976k00368j88370k81409p9925J32745J55921J78422M1912j13825j7505
23130b49426J75955R0660K64017L30156N8069l00756k37885q2211j21920J1836
23120f1505J81670j72308p0254o2799j43748J60502J42076J19027Q6536k1720
23110A57477K32725J41575N4402j55746Q8185K68706K40402J45317K19662J32221
23100A524926J90617K38631M64344q222k21155k70799l68798m61179k21671l5092
23090H31602M2729o1860n0700R4666p6722l72909k28898j38973j51037k06749
23080c18851r5883N6157j29941L61793M15551k1365k34253j3434M5257O2960j05660
23069B2331j4736J9075P7239r235K29463L18436L7133k06479j16639p7523m06901
$$ plain form
23140 122976 -77392 -265762 -547171 -627096 -494351 -338430 -160008 -118096 -231921 -249426
23130 -249426 -73471 17189 281206 611362 669431 368675 130790 48579 -73341 -61505
23120 -61505 120165 -52143 -122397 -185196 -328944 -168442 -26366 92661 179197 157477
23110 157477 390202 531777 586179 430433 518618 787324 1027726 1173043 1392705 1524926
23100 1524926 1715543 1954174 2418518 2410296 2189141 1918342 1549544 1088365 866694 831602
23090 831602 874331 812471 761771 856437 779715 406806 177908 38935 -112102 -318851
23080 -318851 -414734 -358577 -488518 -126725 288826 267461 33208 19774 65031 127991 22331
23069 22331 7595 26670 103909 94674 324137 642573 679706 473227 356588 279065 -127836
23058a27836o8572K33762J62366J43481J14798k23173m35684R1721K00926j6968
23048G4821J11757J940J7231K4270n3084j92240q0297p6648J84799q9101K7669
23037d8883L5300J95948K24542j00587n2163n0113j65794j82626J10633K00161
23027A66418K36054k31090l23240K02799K18436j62821q699M4736K15798o1451
23017B96940k37201p6566J82238K29395L0096l48353j76274O3115J40590k98553
23007a94573k03472K43361K32937k37116J6397m3237K13478J00369K1677j83994
22997c4173p2030M259P6592m0231j3559J95772J17927J5167j40601r8259K6342
22986C7206O9678j45462l24600O3455M8877j98774R256J83821J80975J86400n6385
$$ plain form
23058 -127836 -196408 37354 199720 343201 457999 234826 -200858 -109137 91789 74821
23048 74821 186578 188518 205749 230019 176935 -15305 -95602 -172250 12549 -76552 -48883
23037 -48883 -13583 182365 406907 306320 254157 204044 38250 -144376 -33743 166418
23027 166418 402472 171382 -151858 50941 269377 106556 97857 142593 358391 296940
23017 296940 59739 -16827 165411 394806 424902 76549 -99725 -36610 103980 -194573
23007 -194573 -398045 -154684 78253 -158863 -142466 -185703 27775 128144 149821 -34173
22997 -34173 -106203 -101944 -25352 -65583 -79142 116630 234557 249724 109123 10864 37206
22986 37206 106884 -38578 -363178 -299723 -250846 -449620 -440364 -256543 -75568 110832 54447
22975E4447j52250O7863J17807j38623r3253n5495R9251M0988J02776l987k4823
22964A4701m3230N6010J63544J60421L8145m409q5390j24531J4254k566J43748
22953C30697K0573m3158l24536k03065l024K0529j00138R7009J02089K8989J77093
22942A03058j16434k82806l10219J99631N2301O4778r708M10545K85674j51433
22932B45387l9133k91378j86241K21729K3048k75723k8872L67997J16200K4363
22922A77377q3966k7924L2064J26535Q4393k35338l05731j26817M4090j36094
22912d51411o1481P9251N48748m5986j92375M7684R1821j11888K71900J65779
22902C42042j02159k28871k52845M2767M2280J57276L45641j37772l0679j96226
$$ plain form
22975 54447 -97803 -29940 87867 -50756 -144009 -199504 -100253 -59265 43511 39524 14701
22964 14701 -28529 27481 191025 351446 389591 385182 299792 175261 189515 186949 330697
22953 330697 351270 308112 -16424 -219489 -222513 -201984 -302122 -205113 -103024 -74035 103058
22942 103058 -13376 -296182 -606401 -406770 -354469 -289691 -299399 111146 396820 245387
22932 245387 206254 -85124 -271365 -49636 -26588 -302311 -331183 36814 153014 177377
22922 177377 93411 65487 97551 224086 308479 73141 -232590 -359407 -315317 -451411
22912 -451411 -512892 -433641 115107 69121 -123254 -75570 16251 -95637 176263 342042
22902 342042 239883 11012 -241833 -199066 -156786 490 346131 208359 177680 -18546
22892a8546k3368K37609Q3048j33578k57992L3193Q3953J61816m1002j21755O3608
22881F6986j2268j29535P5123K72035k16783j66774m8333L7274K1579K18061K74123
22870C91488l1159n884m70432k0608J96328J10573n3058l3449j61037j11039j47568
22859c35845N888J6479L92479K14345L6504m1477o7528j84617k11342J48663P4904
22848D8453J76206J45734j93400Q2554k9489m4488N8098q2451k7621k61743j13570
22837b41717j84425K83848N30765k7951l19619J51608j40114N4302K08260K30985
22827E45942j40042l49590J87765k26841j57882l4155N3883K08687r4795j47166
22817a54194j92855j56109p6194K30623J00363J92479K23138J51762p7428k59908
$$ plain form
22892 -18546 -41914 195695 278743 145165 -112827 -79634 4319 166135 125133 3378 66986
22881 66986 54718 -74817 306 272341 55558 -111216 -159549 -122275 -100696 117365 391488
22870 391488 360329 354445 -115987 -136595 59733 170306 117248 83799 -77238 -188277 -335845
22859 -335845 -329957 -313478 79001 293346 329850 288373 220845 36228 -175114 -26451 48453
22848 48453 224659 370393 176993 259547 230058 185570 243668 161217 133596 -128147 -241717
22837 -241717 -426142 -142294 388471 360520 40901 192509 52395 106697 314957 545942
22827 545942 405900 56310 244075 17234 -140648 -174803 -120920 87767 -7028 -154194
22817 -154194 -347049 -503158 -579352 -348729 -248366 -55887 167251 319013 241585 -18323
22807a8323j86000N5468J66474J71877J10817n1268k4224M4681j43181P8342J21747
22796C26410J07275o1996k12256j21001p2922l4025j10734j54414k6265o961j54953
22785e21842j32136Q5234J77433J98338M3478j57709J16870j38209J47416m45
22775a81572m1842J0700L59171K34894l80589k50802J37837M91955J41482j48557
22765C72677j77937k12026q4797r3777j21203j09707L9218K06175J56438J4475
22755a0464K17407J69464J54564J14853K3483k45003k55537q6717k14993J68571
22745C5628K7472J00782K91177J33486l770J18954L861N1604M7134j80190o32437
22734f299k1182K79094Q5474j22199j24053J74368J47528K64610n5839J5209j50857
$$ plain form
22807 -18323 -204323 -148855 17619 189496 300313 249045 224821 269502 126321 204663 326410
22796 326410 433685 371689 159433 38432 -34490 -68515 -179249 -333663 -359928 -366889 -521842
22785 -521842 -653978 -568744 -391311 -192973 -149495 -307204 -190334 -328543 -181127 -181572
22775 -181572 -223414 -212714 146457 381351 762 -250040 -112203 379752 521234 372677
22765 372677 194740 -17286 -102083 -195860 -317063 -426770 -387552 -181377 -24939 -10464
22755 -10464 206943 376407 530971 645824 669307 424304 168767 82050 -132943 35628
22745 35628 63100 163882 455059 588545 584775 703729 707590 759194 806328 626138 -6299
22734 -6299 -27481 251613 337087 214888 90835 265203 412731 677341 621502 636711 485854
22723D85854m45873L4376J20068N7684J10575J32846p0997K3732P9917L7743L20129
22712H86054k3899j01240j88781P9918r1566k45661k41144j50550j20965K5269
22702a72565j9873J54686q4462L1785m4888O8411L89329j53043k17879N5848j20220
22691a12871q3703M1003J05686Q4853q6524N7304J21517J44016m1442p0272l23156
22680a63589m5463J36709K60344K767J54379N10195J64813m48840k00951j60181
22670B10183l6985k07090k13224M67430J01734K47250r7268K4846j47026n5423
22660B94427J65676q254K8654J37334j8171k85562j12936k33630K20999N22066
22650G10603J55945j56626j6328N4403l25747K1265M7543K22978L45688J30159
$$ plain form
22723 485854 39981 74357 194425 252109 362684 495530 424533 448265 528182 565925 886054
22712 886054 862155 760915 572134 652052 560486 314825 73681 -76869 -197834 -172565
22702 -172565 -192438 -37752 -122214 -90429 -135317 -66906 322423 169380 -48499 7349 -112871
22691 -112871 -196574 -155571 -49885 34968 -51556 5748 127265 271281 229839 159567 -163589
22680 -163589 -209052 -72343 188001 190768 345147 855342 1020155 571315 370364 210183
22670 210183 173198 -33892 -247116 220314 322048 569298 472030 496876 349850 294427
22660 294427 460103 451849 480503 617837 599666 314104 201168 -32462 188537 710603
22650 710603 866548 709922 693594 747997 422250 443515 491058 714036 1059724 1189883
22640A189883l11785m07890J27108L37989l6678n4115k13051j35509R8325M26665
22630A020942K56926N9315K75566K40792L61932k02213P2314J66458j43924j09185
22620A998923k11316k88605o9435j71091l3266j10230j79855Q250K84846p5121
22610A153100K03839o0544n4629k8674R23J38278J24724R5582J73062n8000j889
22599A685772j8472m2982k12205m303k03030o3198n426K65413L0354J34998j7631
22588A549290n4082J52819j21538P184K61238K55427q1722p0468j00739K44299
22578B041708K96973K50792L07395L81722K59917L63377P3816J93723N74003P84611
22568E528037P05955P67507P47705R90114J549286K155837K827846L890461N292468
$$ plain form
22640 1189883 878098 470208 597316 935305 898627 844512 631461 495952 594277 1020942
22630 1020942 1277868 1337183 1612749 1853541 2215473 2013260 2085574 2252032 2108108 1998923
22620 1998923 1787607 1499002 1429567 1258476 1225210 1114980 935125 943375 1228221 1153100
22610 1153100 1356939 1296395 1241766 1213092 1214015 1352293 1477017 1572599 1745661 1687661 1685772
22599 1685772 1667300 1624318 1412113 1407810 1204780 1141582 1136156 1401569 1431923 1566921 1549290
22588 1549290 1495208 1648027 1526489 1533673 1794911 2050338 1968616 1898148 1797409 2041708
22578 2041708 2338681 2589473 2896868 3278590 3538507 3901884 3975700 4169423 4743426 5528037
22568 5528037 6233992 7001499 7749204 8739318 10288604 12444441 15272287 19162748 24455216
22559B4455216P580940J0883318J6005914K3078696L0772067L7660307M6302939
22552A96739397N7983670O2636062M9440521L4909058J7345624k5295382n4402865
22545C39356085n7855344o2859133n6505935l7872143k3217407j5561793j1638574
22538G3845756r032432o868451n221399m201330l326199l064434k671175k380076
22530C7080260j926333j441946j324167j320258j365495j101585j230649j555670
22522B5814157j134044r72387j030551q11177o44395q37797p89424n26773o65655
22513A8401954m84326m31572k91409n74205n61059l39550l85477n28613p88697
22504A4017046o23951l92720k94050l25847k55873j53300l45355l92532l27462
$$ plain form
22559 24455216 32036156 42919474 58925388 82004084 112776151 150436458 196739397
22552 196739397 254723067 317359129 366799650 401708708 419054332 393758950 339356085
22545 339356085 281500741 218641608 162135673 124263530 101046123 85484330 73845756
22538 73845756 64813324 57944873 52723474 48522144 45195945 42131511 39460336 37080260
22530 37080260 35153927 33711981 32387814 31067556 29702061 28600476 27369827 25814157
22522 25814157 24680113 23707726 22677175 21865998 21221603 20383806 19594382 19067609 18401954
22513 18401954 17917628 17486056 17194647 16620442 16059383 15719833 15334356 14805743 14017046
22504 14017046 13393095 13000375 12706325 12380478 12124605 11971305 11625950 11233418 10905956
22495A0905956n27692l23443j82436l25277k74078l98896l66058k98205n45345
22486G664526k05877p4806j38869j64549m2527r025k14808k15221J08810l85979
22476F321675n6366M66794N26294k2870n6570K98197K50547j48507n07390n13722
22466F558082n33278m10540k99973k87803j55694J1870k29299k30212j26903m58416
22456C837834k11047J64042R6281K21423p9190l84016j79016j8312N0432l50816
22446C147615k86349o7378k67122j73996J58037K46143j93092k38611l37l12127
22436B012783j11765r8497Q354K24359j51850l56963J87239J76077R7051n5121
22426A931667m3011L69948P6359j70501J22323J12100Q0314o2884J10449j64548
$$ plain form
22495 10905956 10378264 10054821 9872385 9547108 9273030 8874134 8508076 8209871 7664526
22486 7664526 7458649 7383843 7244974 7080425 7037898 7028873 6814065 6598844 6707654 6321675
22476 6321675 6265309 6732103 7258397 7235527 7178957 7477154 7727701 7579194 7071804 6558082
22466 6558082 6024804 5614264 5314291 5026488 4870794 4882664 4653365 4423153 4296250 3837834
22456 3837834 3626787 3790829 3887110 4108533 4029343 3645327 3466311 3447999 3498431 3147615
22446 3147615 2861266 2793888 2526766 2352770 2510807 2756950 2563858 2325247 2324910 2012783
22436 2012783 1901018 1802521 1810875 2035234 1883384 1526421 1713660 1889737 1986788 1931667
22426 1931667 1888656 2258604 2334963 2164462 2286785 2398885 2479199 2416315 2526764 2362216
22416B362216k56179q1698m06397k74965j17685k0691m112k74520j31572J12326
22406I06723K979L62272j25252j55487K90742L2510k18050k44442k05276m5532
22396F01187j06917n881q8726m02955k4558n3904N94175j6944J41981J66787k42082
22385E62163l07018R6654K30527J36128K96776n39108k74888J53595J30905p613
22375D78121l9286L11152r6783K49654J20195m8855l83000j48716j02161j729
22365C38592j26043O6541q40k70586j88807k65642K4904M77430L8406k9261j9075
22354D5619n8666J38433J32502k07519l4066q5244J50141J99343J30552L0096
22344D41191K3286K01157k35102j55558J55119Q1913j49752k58946R0034R6948
$$ plain form
22416 2362216 2106037 2024339 1617942 1342977 1225292 1204601 1200489 925969 794397 906723
22406 906723 909702 1271974 1146722 991235 1281977 1314487 1096437 851995 646719 601187
22396 601187 494270 488389 399663 -3292 -27850 -81754 512421 495477 637458 804245 562163
22385 562163 255145 351799 582326 718454 1015230 476122 201234 354829 485734 478121
22375 478121 438835 749987 653204 902858 1023053 974198 591198 442482 340321 338592
22365 338592 212549 279090 278250 7664 -181143 -446785 -421881 55549 93955 64694 45619
22354 45619 -13047 125386 257888 50369 16303 -68941 81200 280543 411095 441191
22344 441191 464477 665634 430532 274974 430093 512006 362254 103308 193342 290290
22334B90290k79633k91918J2839J76078K80328O14045K3433k35136Q1299k6269
22324F45356k1053k1912j69406m07842k11750R9187K19076J33891k1726j1450
22314B32371J29723P848o5588j28173J46639J12563J7439r9593j16321N2586K5904
22303C15398k4375K07966k31426k4228K65375k27401m04348j96978J90085J87983
22293E8051k25219l9215K99194J77511l7803K0394m2008J8247R2698P0607q0838
22282C11619q1563J01863j48213k85410Q7999M0251k20831j23612J36185K30952
22272D9240K77625K5056k2485j55041J23285K29032j52658K47164J14412j0372
22262G25258l0770j94052n4395k76878k10686m3469J21785N3037J26492K53913
$$ plain form
22334 290290 10657 -281261 -268422 -92344 187984 802029 825462 590326 671625 645356
22324 645356 624303 602391 432985 25143 -186607 -87420 131656 265547 243821 232371
22314 232371 362094 369942 304354 176181 322820 435383 452822 353229 236908 289494 315398
22303 315398 291023 498989 267563 243335 508710 281309 -123039 -320017 -129932 58051
22293 58051 -167168 -206383 92811 270322 232519 252913 210905 229152 321850 392457 311619
22282 311619 230056 331919 183706 -101704 -13705 26546 -194285 -317897 -181712 49240
22272 49240 326865 351921 329436 174395 297680 526712 374054 621218 735630 725258
22262 725258 694488 500436 446041 169163 -41523 -84992 36793 89830 216322 470235
22252D70235k66466l95789m6676k1676j1576j22304O6019L65563j27520L5095
22242e5095N2254p5718k32677Q8629q684j90236J86930p0637r3439N1723o8097
22231d15047n75K16717K28378k7684k30052j38209K7701K31063R3266l8420M391
22220d8471j60407M891j4034K08107J66139J51973K31159R9717M6064K2919k66195
22209D41862j94637j60060N1652K41763j32123q9011j26712j19917P2633J07333
22199I2783L4497J24440O8680m6020k10209j37451n82j37576l4991L00258L49387
22188D03216k6597k19108N6948J40341o0009k68817J7540R3080j1716P9857N796
22177B10531J78028J15637k5289L2099K46729k42664m11061j20580N6888K49751
$$ plain form
22252 470235 203769 -192020 -238696 -260372 -271948 -394252 -328233 37330 -90190 -55095
22242 -55095 -2841 -78559 -311236 -222607 -231291 -421527 -234597 -305234 -398673 -346950 -415047
22231 -415047 -415622 -198905 29473 1789 -228263 -366472 -338771 -107708 -14442 -52862 -48471
22220 -48471 -208878 -203987 -218021 -9914 156225 308198 539357 639074 685138 708057 441862
22209 441862 247225 87165 138817 380580 248457 159446 32734 -87183 -14550 92783
22199 92783 127280 251720 320400 274380 64171 -73280 -73862 -211438 -246429 53829 403216
22188 403216 376619 157511 214459 354800 294791 25974 43514 136594 124878 204735 210531
22177 210531 388559 504196 478907 511006 757735 515071 104010 -16570 40318 290069
22167B90069K36864k59933j9658o0741j82475p8776L41313L11048K71447k34781
22157F14377M5802j37501j80457q3474J24662K68654k24698m73054J5412J97546
22147A67269n5450J33308k46736R5273L09400M5182n69566j64583j8974J45144
22137a59733n4992l12865K13682J67566J93782r170R9364n1890j75446j51879
22127b41581K41560Q5055j63474N8796m6108P0580J85717L6140l17299J07092
22117A6478J02587k80535k49826j96272J23779K5124l8908M24211j46793j65339
22107c85494P4495J55313j43875J07582J90792p6382J53904J41090p1060j13678
22097C2687K5456J05396k11878k65902j92971P5687K56846K3788J59148L6499
$$ plain form
22167 290069 526933 267000 247342 186601 4126 -74650 266663 577711 849158 614377
22157 614377 660179 522678 342221 258747 383409 652063 427365 -45689 -30277 167269
22147 167269 111819 245127 -1609 93664 403064 448246 -121320 -285903 -304877 -159733
22137 -159733 -214725 -527590 -313908 -146342 47440 38270 137634 85744 -89702 -241581
22127 -241581 -21 85034 -78440 -19644 -65752 4828 190545 226685 -90614 16478
22117 16478 119065 -161470 -411296 -607568 -483789 -458665 -497573 -73362 -220155 -385494
22107 -385494 -310999 -155686 -299561 -191979 -1187 -77569 76335 217425 146365 32687
22097 32687 58143 163539 -48339 -314241 -507212 -431525 -174679 -150891 8257 44756
22087D4756R2370K05309J1874k50676j53685J69598O7650r8879p1120k77052p5399
22076c35254N1109K91093K01660M2030L0968J86446j29977j6413o5676j50429
22066A05557J53805R8559k03536l6629l78289j73768J58296J60458J91791Q3603
22056A59847j94170o9686l96719j31707K5990K80163M13375r5882k03014J29094
22046h2709j7742K47594R4353J04199k25680l48643K2132J57199o8522J57010
22036C9191K14531r4449l7962r2253p6601j70213m6157j26624l36314m8248L58597
22025d16502M66267N1623r8452J53397j24621N4107j53678j72064j22972P8737
22015b84158k36266J7117L13105J82927m530p2236p0074j31170Q1591L50592J37639
$$ plain form
22087 44756 137126 342435 354309 103633 -50052 119546 187196 88317 17197 -259855 -335254
22076 -335254 -284145 6948 208608 250638 281606 468052 338075 321662 255986 105557
22066 105557 259362 357921 154385 117756 -260533 -434301 -276005 -115547 76244 159847
22056 159847 -34323 -104009 -500728 -632435 -606445 -326282 87093 -8789 -211803 -82709
22046 -82709 -100451 147143 241496 345695 120015 -228628 -206496 -49297 -117819 39191
22036 39191 253722 159273 121311 29058 -47543 -217756 -263913 -390537 -726851 -775099 -416502
22025 -416502 49765 101388 2936 156333 31712 85819 -67859 -239923 -362895 -284158
22015 -284158 -520424 -503307 -190202 -7275 -11805 -84041 -154115 -285285 -203694 146898 284537
22004B84537k05629k90911O7056L06737K97374j87529j1302K24751J17478K25701
21994H28263M95940M13694N35780P5075j12420k19830q8443j21088k10446j40368
21984A456157r4695j06078n52777j31113M7259j3077m6364l30556k26420j13886
21974a11550J46096k2930j3621M8076j56183j98299L3445K00824Q3428o5391N1488
21963d617j5872m0763k05203l39290l4353N62178L70778j34715j12632J70281
21953B15792J41075J11237Q4169k7283j70423q8355j58163m07981j02204P6662
21943c25474K34096K13236j85747k30334K03750K34066j02154J0649k54886n1994
21933b54792L75422j0064n7114K10945J8283Q0191j94350K1032R4965j50015p4617
$$ plain form
22004 284537 78908 -212003 -144947 161790 459164 271635 260333 485084 602562 828263
21994 828263 1324203 1737897 2273677 2348752 2236332 2016502 1928059 1806971 1596525 1456157
21984 1456157 1361462 1255384 702607 571494 618753 605676 559312 228756 2336 -111550
21974 -111550 34546 11616 -2005 46071 -110112 -308411 -274966 -74142 9286 -56105 -4617
21963 -4617 -20489 -61252 -266455 -605745 -640098 -77920 292858 158143 45511 215792
21953 215792 356867 468104 552273 524990 354567 266212 108049 -299932 -402136 -325474
21943 -325474 -91378 121858 -63889 -294223 -90473 143593 41439 52088 -202798 -254792
21933 -254792 120630 110566 53452 264397 282680 362871 168521 189553 284518 134503 59886
21922E9886Q719J92911P9572j63577o2411m23836q8658M12955l8168J90417L07518
21911D75328k81017q9528J44264k23061k82635k12571L39593L41558K63887O4855
21901E40673p0331j62822n7785j69969J003O6787j61461j96394k19388O6841l9532
21890d02378N0484K30280P9988K58648L8176j72982J61470L01299J51285j13520
21880E82750k80447j27542j16693o806M5259q3641r6559j47154J42339J61885
21870G3391J34764L3575m8011R4812k27454J4917l27524n4768J79333k8075J17871
21859c7169L53030K70332j78443k12863r7490j23317o7972k26473R7522J04656
21849a18187K02778l03673j80633q0842N545J4571j3787J13333K75618J50054
$$ plain form
21922 59886 68605 261516 341088 177511 115100 -308736 -397394 15561 -22607 167810 475328
21911 475328 194311 104783 249047 25986 -256649 -469220 -129627 211931 475818 540673
21901 540673 470342 307520 249735 79766 80769 147556 -13905 -210299 -429687 -362846 -402378
21890 -402378 -351894 -121614 -41626 217022 255198 82216 243686 544985 696270 582750
21880 582750 302303 174761 58068 51262 96521 12880 -83679 -230833 -88494 73391
21870 73391 208155 241730 193719 288531 61077 75994 -251530 -306298 -126965 -155040 -37169
21859 -37169 315861 586193 407750 194887 97397 -25920 -93892 -320365 -222843 -118187
21849 -118187 84591 -219082 -399715 -480557 -475012 -460441 -474228 -360895 -85277 64777
21839F4777J65207J15147j06317P3896J1186j4319l26020j37772P1201j202j92628
21828b76844J48946j18213J94957m5885l32372K3534J35734n240J0149O4720K69909
21817F9395J30997j84369P5447R3177M7057P76m2057O3508k51103J32234R0346
21806B25408n7080k3060k66454L698J95664K93899J25585l0518l10434p6927j6192
21795F3589N7681J29519k31612J9826O6556J91798O3374k961r3135J85835M9017
21784D99487j55522j58930O8142J1903l35886k32775J0404j26372K25617K30718
21774C6786j6481q5233l44044J57101J85426J84441p6733j58218J48863M7746
21764G9654j26705m6451k5886K3824j45412p5446P3606K12525K33116N7236q4470
$$ plain form
21839 64777 229984 345131 238814 312710 323896 309577 -16443 -154215 -83014 -84216 -276844
21828 -276844 -127898 -246111 -51154 -97039 -429411 -405877 -270143 -275383 -265234 -200514 69395
21817 69395 200392 16023 91470 184647 231704 232480 190423 253931 2828 135062 225408
21806 225408 168328 145268 -121186 -117488 78176 372075 497660 467142 156708 79781 63589
21795 63589 121270 250789 19177 39003 105559 297357 360731 357770 264635 450470 499487
21784 499487 343965 185035 253177 265080 -70806 -303581 -293177 -419549 -193932 36786
21774 36786 20305 -64928 -408972 -251871 -66445 117996 41263 -116955 31908 79654
21764 79654 -47051 -93502 -119388 -95564 -240976 -316422 -242816 -30291 202825 260061 175591
21753A75591j61424J0339K99084Q745l62568L571L07508j89398k645l73638q3356
21742c68191J27991K34799j18978n8074K40865K17589J63542M2396k26725j71233
21732H3981Q5626j55246j45654o0534l1464j18048j55418q7020J40679J26382
21722c16716L77272K34755J51177k2583K45180m2246k45376l76582J14817j80612
21712f0914J38154k6067k02312Q0400K42977o2404R1648j61951l25118j93071
21702d78658j01864L11697J39509M1583p913k61259J07944J41825Q2524J57872
21692A33260j93809j46264o1693K54942K19513J13797l00450k00724m6911p371
21682b35710L18746K08752K9683j03544k55480n5077p2625J08204M86597L68794
$$ plain form
21753 175591 14167 24506 323590 332335 -30233 -26662 280846 91448 88803 -284835 -368191
21742 -368191 -240200 -5401 -124379 -182453 58412 276001 439543 481939 255214 83981
21732 83981 169607 14361 -131293 -191827 -223291 -341339 -496757 -583777 -443098 -316716
21722 -316716 60556 295311 446488 423905 669085 626839 381463 4881 119698 -60914
21712 -60914 77240 51173 -151139 -70739 172238 109834 201482 39531 -285587 -478658
21702 -478658 -580522 -268825 -129316 -87733 -95646 -356905 -248961 -107136 -24612 133260
21692 133260 -60549 -206813 -268506 -13564 205949 319746 19296 -181428 -228339 -235710
21682 -235710 83036 291788 321471 217927 -37553 -92630 -165255 -57051 429546 798340
21672G98340k27202l99429l1192K08272k29395k17613K11693J91296j34263j90392
21662a9885l07298k09384r795Q4J18158j85373n8865J41792J35509L39800k16133
21651b71390P1778K57778k14887k56641m8659K29949K29246J83205R1336k5799
21641B45916k56923k1578o5602P2138j33197Q7726M1551J38574n8186K3466P4231
21630A48116j83900O9045R3937m3010R5860p9595L6119K01641l262j62551j67170
21619E230k26107O1144J12826R3200k23488j61298N6018K25953j09516o0747K80106
21608E3321R6914o1092k08521J71431k5785N6352j37387L864m2575r4817q1209
21597b69504J32221J70962j32834k09470J50218j03261J32466K94320J76070j66571
$$ plain form
21672 798340 571138 171709 140517 348789 119394 -98219 113474 304770 170507 -19885
21662 -19885 -327183 -536567 -546362 -546278 -428120 -613493 -672358 -530566 -395057 -55257 -271390
21651 -271390 -199612 58166 -156721 -413362 -462021 -232072 -2826 180379 271715 245916
21641 245916 -11007 -32585 -98187 -26049 -159246 -71520 -29969 108605 50419 73885 148116
21630 148116 -35784 33261 127198 84188 180048 100453 136572 338213 334951 172400 5230
21619 5230 -220877 -159733 -46907 46293 -177195 -338493 -282475 -56522 -166038 -226785 53321
21608 53321 150235 89143 -119378 52053 26268 82620 -54767 -50903 -93478 -188295 -269504
21597 -269504 -137283 33679 -99155 -308625 -158407 -261668 -129202 165118 341188 174617
21587A74617j69231R3232p266M5187J8840K79878o1514K35662k39006j54669o1825
21576A53905J9000J47395P6093j32764N9849j71849K5380o0394j56672M95384
21566D55327m8298l01684l55566n4669J69220j66401J50169J23370J5721k7830
21556d0641Q3666k17672n9334R9081Q1638L5945l7642j82307o4111J19323O0615
21545a21439k73149l59705q159K99696K28212R6596J39951J93050M4113J31762
21535C70928p7989N1884j57755K0015J14764K0206n8941j08963K825j4621n5059
21524A07294o2651J12381L5494k34945r6762J28047o2936j81951o7686j67695
21514d91410J45334J50116L06503n4814q8153n7963P0198J73000j5787k11378
$$ plain form
21587 174617 5386 98618 91352 136539 155379 435257 373743 609405 370399 215730 153905
21576 153905 172905 320300 396393 263629 323478 151629 177009 116615 -40057 455327
21566 455327 407029 105345 -250221 -304890 -135670 -302071 -151902 -28532 -12811 -40641
21556 -40641 43025 -174647 -233981 -134900 -53262 -17317 -54959 -237266 -301377 -182054 -121439
21545 -121439 -394588 -754293 -762452 -462756 -234544 -137948 2003 195053 239166 370928
21535 370928 292939 344823 187068 207083 321847 342053 283112 174149 176974 162353 107294
21524 107294 44643 157024 192518 -42427 -139189 -11142 -74078 -256029 -323715 -491410
21514 -491410 -346076 -195960 110543 55729 -32424 -90387 -20189 152811 137024 -74354
21504g4354r4015K42995j44582q520N3127k9347n5914J0762M2068J59151J04253
21493B05624j08094P450J09533J30013L16160M508l59623j36528j90996l23175
21483c45128M63692O4167k18784M2553J32040J75874L33822m5917j21575l1145
21473D49599k04468j00778j97385j26090L9776o0328K4133P9246n4482l292P0378
21462h3691Q5859J21210o7505N677R4006j45939n780n1106j91093n7681j46340
21451d42383J53107J99221R0801q0105j81762J27003N6215j5023K63640J54217
21441C24931J78946l03412m73455J54427J95599J95141j764j40814j33685K5333
21431B1247O0337j63382j65802n5659K36211N2524j61810j7711P4258k3774Q9641
$$ plain form
21504 -74354 -168369 74626 -69956 -78476 -25349 -54696 -110610 -99848 -57780 101371 205624
21493 205624 97530 104980 214513 344526 660686 665194 305571 169043 -21953 -345128
21483 -345128 118564 182731 -36053 6500 138540 314414 648236 602319 480744 449599
21473 449599 245131 144353 -53032 -179122 -139346 -199674 -175541 -96295 -150777 -154069 -83691
21462 -83691 2168 123378 55873 61550 155556 9617 3837 -47269 -238362 -296043 -442383
21451 -442383 -289276 -90055 746 -79359 -261121 -134118 -77903 -92926 170714 324931
21441 324931 503877 200465 -272990 -118563 77036 272177 270413 129599 -4086 21247
21431 21247 81584 -81798 -247600 -303259 -67048 -14524 -176334 -194045 -119787 -143561 -53920
21420e3920J52798R4441R006K3012m1617r0934r4007j74042O9817N2920K853k0082
21408f9755n8810J20690J09318k19126O4607L74892N8677J51758j26430l68777
21398C7044l75745k23712R2696L40184K5335J83129m9934M0364q71k61775j08321
21387c01606K62970J14954o6677j21493k7560p58k30317j0013K76099L6619j02574
21376a70356K6562K88626J52924j12524k93304p4242O9877j8621K42671L3810
21366A45423l6646n0662J8085k32280K71597J1995o2505J85696N9571k21986j91547
21355a03259j87905J07226L2512J68828P911j832k27075J40006O1704j37100J42608
21344C624J98189j71499j334N6516k67080J35500J39247j33286O9846q1050O9970
$$ plain form
21420 -53920 98878 193319 202325 225337 183720 92786 -1221 -175263 -105446 -52526 -49673 -69755
21408 -69755 -128565 -7875 101443 -117683 -53076 321816 380493 532251 405821 37044
21398 37044 -338701 -562413 -469717 -129533 -104198 78931 28997 69361 68490 -193285 -301606
21387 -301606 -38636 76318 9641 -111852 -139412 -140170 -370487 -380500 -104401 -67782 -170356
21376 -170356 -143794 144832 297756 185232 -108072 -182314 -112437 -131058 111613 145423
21366 145423 108777 58115 76200 -156080 115517 127512 65007 250703 310274 88288 -103259
21355 -103259 -291164 -183938 -151426 17402 25313 23481 -203594 -63588 -1884 -138984 3624
21344 3624 201813 30314 28980 85496 -181584 -46084 93163 -40123 29723 -51327 18643
21333A8643k02350J0349K4194K21045K80241K49271J216k63561l8664N4708j84754
21322A70338n2546j59989o5408K28630P1377p5445j82104r6191o9443M1410K12721
21311B3350l3362O9543R2909K4776N2963j18436r0462L753k6616k19692l9273
21300b60547o8468K28827J1502J5534n2665N3979j52424K7873P8476R3817l43506
21289c67602j00893M3782J23523K1752k01750J70607K45118J65866k8311l3864
21279C8228J54504j20682j12797K30924j06913j99571K47145j4990k23563j69388
21269b77103k9811P1956K90466J43264k15612l40247k24376Q6587K20224o741
21259b81393r8097J40723K03475k66965j49715P4505J99108L7593j40448J59978
$$ plain form
21333 18643 -183707 -173358 -149164 71881 352122 601393 602609 339048 300384 355092 170338
21322 170338 117792 -42197 -107605 121025 192402 116957 -65147 -161338 -230781 -189371 23350
21311 23350 -10012 59531 152440 177216 230179 111743 21281 25034 -1582 -221274 -260547
21300 -260547 -329015 -100188 -88686 -73152 -125817 -71838 -224262 -196389 -117913 -24096 -367602
21289 -367602 -468495 -424713 -301190 -279438 -481188 -310581 -65463 100403 72092 38228
21279 38228 192732 72050 -40747 190177 83264 -116307 130838 115848 -107715 -277103
21269 -277103 -306914 -234958 55508 198772 -16840 -357087 -581463 -494876 -274652 -281393
21259 -281393 -379490 -238767 -35292 -302257 -451972 -377467 -178359 -140766 -281214 -121236
21249a21236R5332P8877M3135j26613n4313L00135p127k8537r5366q6783j28447
21238a30943l5588K03819L8037q7557o8728m9479j09957n6881J7817L88838K35017
21227C44395M4868k33780L1720J83187j58376j63618Q891o552j48500R6369j75690
21216a77086J5066o1335J46340K54866L7993L10078P1648j08809O1705K52421
21206H02887k88882k17723j86246j50716j10155J75949J60530J33668Q399R639
21196C37350K9663L5501n40628m9233J9913k2531J67448k29849m2359J6988K30582
21185d7155j1649J36034p9713J01871p6812j83395J86777N6160J14055K2326j76566
21174D1933k51804r9579M20730l5474l12092J50964J21748K32014K24564j78053
$$ plain form
21249 -121236 -25904 52973 96108 -30505 -84818 215317 208190 179653 84287 -2496 -130943
21238 -130943 -166531 37288 75325 -12232 -80960 -130439 -240396 -297277 -279460 109378 344395
21227 344395 389263 155483 187203 370390 212014 48396 57287 50735 -97765 -1396 -177086
21216 -177086 -162020 -223355 -77015 177851 215844 525922 597570 488761 550466 802887
21206 802887 514005 296282 110036 -40680 -150835 25114 185644 319312 327711 337350
21196 337350 367013 402514 -138114 -187347 -167434 -189965 -22517 -252366 -294725 -277737 -47155
21185 -47155 -58804 77230 -2483 99388 22576 -160819 25958 82118 196173 218499 41933
21174 41933 -209871 -309450 111280 75806 -236286 -85322 36426 268440 493004 314951
21164C14951R559L8935k70514m27386j70727m5646J66719K06984M9301k15679
21154c43503J70357Q6568k7953P8540k06511j35923K54375j20526M523J21861
21144a18192J81228L103m3781o6436J46728O2092r1983l87646M9280K75920K00155
21133B10468k6789j18788M7828L15756L8576M8847J60483p8774l49705j66669
21123H1233o579J98511N9107q034n02607k48871j13219p4075j40968L26959K43248
21112a85295r746J64330k92607j7388J60636J76509p573j36783j00685n8155o0018
21101c66775J14961j6165N9103K66006M119q4286P1779p0351J03880R9396k16332
21090c4665l09314j12569O6641K01780k4586r8378L3451K50590r3391j62423J28780
$$ plain form
21164 314951 324510 363445 92931 -334455 -505182 -550828 -384109 -177125 -127824 -343503
21154 -343503 -173146 -86578 -114531 -35991 -242502 -378425 -124050 -244576 -240053 -118192
21144 -118192 63036 66139 22358 -44078 102650 164742 72759 -314887 -265607 10313 210468
21133 210468 183679 64891 112719 428475 467051 515898 676381 597607 247902 81233
21123 81233 74654 273165 332272 324238 -178369 -427240 -540459 -614534 -755502 -428543 -185295
21112 -185295 -195041 -30711 -323318 -340706 -180070 -3561 -11134 -147917 -248602 -306757 -366775
21101 -366775 -251814 -267979 -208876 57130 61249 -23037 48742 -21609 82271 181667 -34665
21090 -34665 -343979 -456548 -389907 -188127 -212713 -311091 -277640 -27050 -120441 -282864 -154084
21079a54084m1156j9147q519j65024j74959J03080L8472o7994J96789Q1534k460
21068b13468J30853J20529k74751J65147n693k30495M6114j9984j94412O9787
21058d06373n7677j47697L6058K35183J86540N0040K3507o6869K35727J84651
21048B73090j90685m82671j52035J92189J23714J5499P8006l0168N1387M381K91502
21037A74209J85697j62668J29670l17870k87038O3871L45448l2180J9273O3223
21027A81635M6267j03551m4806O8012k18484J61452J04028O8221J36245l8566
21017C60453k18452k22638p7929P0113o5325j09653J32944J29594N6671j3410
21007D2368j46881J6309J51871O9157P1222j95168k06406p4520K95925p5808k64346
$$ plain form
21079 -154084 -195240 -214387 -222906 -387930 -562889 -459809 -421337 -489331 -292542 -211008 -213468
21068 -213468 -82615 37914 -236837 -71690 -77383 -307878 -261764 -281748 -476160 -406373
21058 -406373 -464050 -611747 -575689 -340506 -153966 -103926 -80419 -147288 88439 273090
21048 273090 82405 -400266 -552301 -360112 -236398 -220899 -142893 -173061 -121674 -117293 174209
21037 174209 359906 197238 326908 9038 -278000 -214129 131319 99139 118412 181635
21027 181635 227902 124351 79545 147557 -70927 90525 194553 262774 399019 360453
21017 360453 142001 -80637 -158566 -88453 -153778 -263431 -130487 -893 55778 42368
21007 42368 -104513 -88204 63667 132824 204046 8878 -197528 -272048 23877 -51931 -316277
20996c16277O0688P9451K16864K5109j84386q9702k7694J78117P1727m0119p710
20985c3932k78910k65239J66119J65034k68507K38859Q8440P3821r2795Q5140
20975a21970K78336k39163k79320P1469O5829J74184J61378N9219K14929P2287
20965D57178k07755j54481O1353J2853n873J49429r5184L4758j82198l09301j48574
20954c87795o2439J34994K47525K55929p3290j41502l230L8525Q2007M5309O3727
20943A99760K23231N9847J80349k8223j76741l65951k81465K1481K33010L2213
20933I7511k07964M3678j10275j3784K4602n2289j01771q6525K64010J46422j22650
20922a19035M3785O7632L9368R1104m4908L0440O8389N2439j90739j07802r3752
$$ plain form
20996 -316277 -255589 -176138 40726 65835 -118551 -208253 -235947 -57830 13897 -26222 -33932
20985 -33932 -312842 -578081 -411962 -246928 -515435 -276576 -188136 -114315 -207110 -121970
20975 -121970 156366 -82797 -362117 -290648 -224819 -50635 110743 169962 384891 457178
20965 457178 249423 94942 156295 169148 163275 312704 217520 252278 70080 -239221 -387795
20954 -387795 -450234 -315240 -67715 188214 114924 -26578 -29808 8717 90724 136033 199760
20943 199760 422991 482838 663187 634964 458223 92272 -189193 -167712 65298 97511
20933 97511 -110453 -66775 -177050 -190834 -166232 -218521 -320292 -406817 -142807 3615 -119035
20922 -119035 -75250 -7618 31750 122854 77946 108386 176775 229214 38475 -69327 -163079
20911a63079j88230K16171K28693l21827j5344m7423J33155K14652n9469j01771
20901a04472j78515Q3999N1339p887Q3038j64480r1184o3575K83701L5810n1425
20890a23651k09133k31773K17113M64525j25336n3869J67270j0476J567Q5114
20880A81351j15491N0300j54329m2004n0308K91108j37673j27456R3737L36706
20870C25941K1924J00719k03043p5343p2360j27902j22224p0770q7950q1089N3576
20859c38521q7424M0810J24196K77943K61114j76266O3375j44733p6954j74360
20849b30820J31643J293J9026Q8215J43384n94q2080l5597l025K10424j15388
20838A26481k00979k21203R4736j05142k41418N7636K23824O9277J14215M9354
$$ plain form
20911 -163079 -351309 -135138 93555 -228272 -243616 -291039 -157884 56768 -2701 -104472
20901 -104472 -282987 -198988 -147649 -155536 -72498 -236978 -328162 -391737 -108036 -72226 -123651
20890 -123651 -332784 -564557 -347444 117081 -8255 -62124 105146 94670 96237 181351
20880 181351 65860 116160 -38169 -80173 -130481 160627 22954 -104502 -10765 325941
20870 325941 347865 448584 245541 170198 97838 -30064 -152288 -223058 -311008 -392097 -338521
20859 -338521 -425945 -385135 -260939 17004 278118 101852 165227 20494 -56460 -230820
20849 -230820 -99177 -97884 -78858 9357 152741 152147 70067 34470 31445 241869 126481
20838 126481 -74498 -295701 -200965 -306107 -547525 -489889 -266065 -196788 -82573 -33219
20828c3219k05856j85958J1390P9504M2189J0943J61567k9421K6269q2336j03654
20817c08582j73839J29183j4712P8030J3595Q6946J55543j81820J01646k1894
20807a35904o7095j63446J20026J3761K35667J80826j55614j07148k74388N7330
20797b95985K39560o8321k09276J16127K51850K0269j78886K62734r1683k68209
20787b21820j45807L1544L01598K0034j07008l19187K2935K9556K1031J97399
20777a69725L00466M1902J70242M22053k29073k63018k84058l2071o1772J25183
20767B0129k3121k00730J79417L7167l03075l34094O6578M29288L11186k08534
20757b5789K35998J18675J02669R2988J5496m81153P1950l2958j24925K58730
$$ plain form
20828 -33219 -239075 -425033 -413643 -334139 -291950 -281007 -119440 -148861 -122592 -204928 -308582
20817 -308582 -482421 -353238 -367950 -289920 -276325 -189379 -33836 -215656 -114010 -135904
20807 -135904 -202999 -366445 -246419 -232658 3009 183835 28221 -78927 -353315 -295985
20797 -295985 -56425 -124746 -334022 -217895 33955 54224 -124662 138072 46389 -221820
20787 -221820 -367627 -336083 -34485 -14451 -121459 -440646 -417711 -388155 -367124 -169725
20777 -169725 130741 172643 342885 764938 535865 272847 -11211 -43282 -105054 20129
20767 20129 -2992 -203722 -24305 12862 -290213 -624307 -557729 -128441 182745 -25789
20757 -25789 210209 328884 431553 524541 540037 58884 130834 97876 -27049 231681
20747B31681j18812N2980J71200K8395r0362K11644J94985k29279k00931k86065
20737c4564O3113M26290j1543j55277J66386k57226m37129j16938r7216L76171
20727g7933J1397o062J09767O4218J44814J36540Q8385k12018k39800k41437j59347
20716c81476J70697L13614J60635l09521j0691L19907j34424j36667Q9018j51415
20706g0323m3048n3237l0924N0652q2224p2954L50882J0450K07826K71155Q3164
20695F21419j73117j18504j94714J3013l640N2372k17093k5429O831q2652L3505
20684h8009K63154n9024j18205L2665M8779k37676k05367K17910J74158M6582
20674G4967j4111K75836P1254R6489l35692m59254R653J37237L44605N6679l40654
$$ plain form
20747 231681 112869 165849 337049 365444 275082 486726 681711 452432 251501 -34564
20737 -34564 28549 454839 443296 288019 454405 197179 -239950 -356888 -454104 -77933
20727 -77933 -66536 -72598 37169 101387 246201 382741 471126 259108 19308 -222129 -381476
20716 -381476 -210779 102835 263470 -46051 -56742 263165 128741 -7926 81092 -70323
20706 -70323 -113371 -166608 -197532 -146880 -229104 -302058 48824 59274 267100 538255 621419
20695 621419 448302 329798 135084 148097 144457 196829 -20264 -45693 -38862 -121514 -88009
20684 -88009 175145 116121 -2084 30581 79360 -158316 -363683 -145773 28385 74967
20674 74967 60856 336692 407946 504435 168743 -290511 -280858 -143621 200984 257663 -82991
20663h2991N4414K91427j25746j1121P3433j11768L8109K6520K87318k1263R427
20652D27759j52602k31253N0573N1364N2051k8915q5227L2226j72669j69171P1564
20641a54300R5816K93861j68815k27702n351j13343L8503K62195J77194q1845
20631A16213R8319J37181l97775j05718J51388L29712j06090k26150q382R520
20621a782Q6865L9810p4180J2205j71973j186J7543P8496j15464J14481l6942
20610e2127J29936m0529j28410R1547r5997L66122j94658k08659k68482j11413
20600e12670R9889K47881j31141n6511K51255J8789J09433K6758P1605j20613
20590D675N9295Q2271j59108r4512R400j25072j32097J16419J00646J62347o3031
$$ plain form
20663 -82991 -28577 262850 137104 125983 199416 87648 125757 152277 439595 418332 427759
20652 427759 275157 43904 94477 145841 197892 168977 83750 115976 -56693 -225864 -154300
20641 -154300 -58484 235377 66562 -161140 -166491 -279834 -241331 20864 198058 116213
20631 116213 214532 351713 -46062 -151780 -392 329320 223230 -2920 -11302 -1782
20621 -1782 85083 124893 50713 62918 -109055 -110241 -92698 -14202 -129666 -15185 -52127
20610 -52127 77809 37280 -91130 417 -95580 270542 75884 -132775 -401257 -512670
20600 -512670 -412781 -164900 -296041 -352552 -101297 -82508 26925 53683 125288 4675
20590 4675 63970 146241 -12867 -107379 -97979 -223051 -355148 -238729 -138083 24264 -38767
20579c8767J43979N9710J61748R3180k67282k33175j47053j12122K00020K26711
20569H6949n011j41004j2336j01237K83630R4899j08705k16623l8278J35962Q958
20558a2796K05637J70493p7305j34656J0608M12190p0844q9269j45617k40759
20548B7682j39755J45576r4042j40851l99451J56589K94952J53869k28911j64985
20538c89327J54154K48590j51099m8352p2444M2525J22853J80791J10789k3160
20528A75320n36k25178m11440L3630N5215k30072q4184K0525K45708k5525k4517
20517d71054N9124P7268j49468P635J64001K96478J86227k2753k37467k07563
20507b97572K42832P2968n9148L8183L7562R0569Q1201o8519J5339o0255p1885
$$ plain form
20579 -38767 105212 164922 326670 419850 152568 -80607 -227660 -339782 -139762 86949
20569 86949 81938 -59066 -71402 -172639 110991 205890 97185 -119438 -157716 -21754 -12796
20558 -12796 192841 363334 286029 151373 161981 574171 503327 414058 268441 27682
20548 27682 -112073 33503 -60539 -201390 -600841 -444252 -149300 4569 -224342 -389327
20538 -389327 -235173 13417 -137682 -186034 -258478 -215953 -93100 87691 198480 175320
20528 175320 174784 -50394 -461834 -428204 -372989 -603061 -687245 -666720 -421012 -446537 -471054
20517 -471054 -411930 -334662 -484130 -476495 -312494 -16016 170211 147458 -90009 -297572
20507 -297572 -54740 18228 -40920 -2737 34825 125394 206595 138076 153415 93160 21275
20496B1275J67753J2486r4064k87676j01664J23963J41052j24119K17283K89904
20486C66193J85697J6042j13638j88239n6723n9190J48367k48004j52883J12520
20476A0142L30904P0787R027k8276q0558j39322o8660J67256j54033k01849O670
20465g7912L35467R7814K24179K5168n20474m9841l6777k30399j0276J6106L10739
20454H3794J86530j05613j07272J11215J2214J61410M3647k24287j96672j63444
20444a98478J93300j219j34031p5678K66571P2178k01320l501J42742J28287l1776
20433A57075Q0849K64552j29891l46270m18689m5042J77255Q7477Q9744K40023
20423A57083K14894m8231k56779J24447j87015j1964p0751m778K8034o5705m2858
$$ plain form
20496 21275 189028 201514 107450 -180226 -281890 -157927 -16875 -140994 76289 366193
20486 366193 551890 567932 454294 266055 209332 150142 298509 50505 -102378 10142
20476 10142 341046 411833 420860 392584 312026 172704 104044 271300 117267 -84582 -77912
20465 -77912 257555 355369 579548 604716 84242 34401 -2376 -232775 -243051 -226945 83794
20454 83794 270324 164711 57439 168654 180868 342278 385925 161638 -35034 -198478
20444 -198478 -5178 -6397 -140428 -216106 50465 122643 -78677 -82178 60564 188851 157075
20433 157075 237924 502476 372585 26315 -392374 -437416 -260161 -172684 -82940 157083
20423 157083 371977 323746 66967 191414 4399 -7565 -78316 -83094 -55060 -120765 -163623
20412a63623J07857L37669K83328k59111n5033j39238M6767q7699k24322k66752
20402d20157K13219J54019o8406k95503j5762N70789M4923n2780J02309K27940
20392D60591l02343j50994k41028o5518p878n7662J16817J89931J91128J14923
20382B47967R8508k94111j66502J11168L27246q2625q0283k38928j39670L4543
20372a82687J37400J35577k07664J76560M5130j84606j33959N9689n7744J01854
20362a10450j18601j80399J81773P6681o1665m1890j97470M6166L06224J11123
20352A1492K00365L2315m20928k96543K30774J50300K06541N3715k87981K9764
20342i0186R9672K9188n4977J36465j04184M8539j73085k91357p3437O9804K73410
$$ plain form
20412 -163623 -55766 281903 565231 306120 251087 111849 158616 70917 -153405 -420157
20402 -420157 -206938 -52919 -121325 -416828 -432590 138199 183122 130342 232651 460591
20392 460591 158248 7254 -233774 -299292 -307170 -364832 -248015 -58084 133044 247967
20382 247967 346475 52364 -114138 -2970 324276 241651 161368 -77560 -217230 -182687
20372 -182687 -45287 90290 -117374 59186 104316 -80290 -214249 -154560 -212304 -110450
20362 -110450 -229051 -409450 -227677 -150996 -212661 -254551 -452021 -405855 -99631 11492
20352 11492 211857 244172 -176756 -473299 -242525 -92225 114316 168031 -119950 -90186
20342 -90186 9486 38674 -16303 120162 15978 64517 -108568 -399925 -473362 -403558 -130148
20331a30148Q0522k38479O0758K42812o4855M6199K0535o0127j06077k02375J24772
20320b26463L38786L3163J02094k10989k97701J0958J39485K54479K05867l71649
20310b1970l2140J12786m2777M3942k784J95932l35739m44097L86748p7625k10546
20299d28270J10975K60077L88899J12594l30368o8783L57513J23129k2811j38509
20289C64446k4564R9113R2413j54676j81136k30231k91176O1161K89751L1024
20279E6125J26949L8727J04451j18584j60813R6233l7354J2343K868j03108R4694
20268A12531K11043J86397o4212j29004M7762j38084k01553K263j90655P7275
20258h6237J33064N7232p5893m8863K57066J43288J50084j33013k12416k9444
$$ plain form
20331 -130148 -49626 -288105 -227347 15465 -49390 -3191 17344 -42783 -148860 -351235 -226463
20320 -226463 112323 145486 247580 36591 -261110 -250152 -110667 143812 349679 -21970
20310 -21970 -54110 58676 15899 59841 57057 252989 -82750 -526847 -140099 -217724 -428270
20299 -428270 -317295 -57218 331681 444275 113907 45124 402637 525766 502955 364446
20289 364446 339882 438995 531408 376732 195596 -34635 -325811 -264650 25101 56125
20279 56125 183074 221801 326252 207668 46855 143088 105734 118077 120945 17837 112531
20268 112531 323574 509971 445759 316755 364517 226433 24880 27143 -163512 -86237
20258 -86237 46827 104059 28166 -20697 236369 379657 529741 396728 184312 154868
20248A54868j6885k0319j33695r4683M6505R4800J51256J44849j33918j57754
20238C5024q5571K72670r4387j47535L28827J03349j83892o1526k0502k0617N8658
20227A84498M2937j29412q2397K77607o9561n851K53343k0514j22336j57058R9107
20216B70363m240r7673L135K90867K9609Q8946M3667q4656j19739J31989J0786
20205E63054l29663k22084J50868K4666l33884j10543p6010j26477K66363L45353
20195A51643M8418k59289j74779j50154J11342L30589n33p2469K17080m7646j2685
20184A41517j25053N4705j18027L33205k7264k24326L48060M2217o6090j8509
20174C40435J65191J27601N9043R8519r8690l5399p9483O2656j4031j89088L7683
$$ plain form
20248 154868 137983 117664 -16031 -110714 -64209 30591 181847 326696 192778 35024
20238 35024 -50547 222123 127736 -19799 309028 412377 228485 166959 146457 125840 184498
20227 184498 227435 98023 15626 293233 223672 217821 471164 450650 328314 171256 270363
20216 270363 266123 168450 171585 462452 492061 581007 624674 540018 420279 552268 563054
20205 563054 233391 11307 162175 186841 -147043 -257586 -333596 -460073 -193710 151643
20195 151643 200061 -59228 -234007 -384161 -272819 57770 57237 -15232 201848 154202 141517
20184 141517 16464 71169 -46858 286347 259083 34757 382817 425034 358944 340435
20174 340435 505626 633227 692270 790789 692099 656700 577217 639873 625842 436754 474437
20163D74437Q4206L05607J31798j84946j51270l53267r4768p6355j62250O2987
20153C6179M9530P3269K21869j22076k45183k24476K34336L83809O1325o5705
20143D02877j33778J22234J79237J92469m8448j94728j46256p104K8182J55066
20133E49751J09785k44963l60314j28446m1954J20671K52820K27665K3103j34228
20123C73890j8631p0446k32641q2480O8875L12814K25477K60010j28148l7221
20113F71499j10567k88585Q1525l24293l0286P8199P7580N808K29116p7661j62256
20102A50079J37110J35178O625p1273J09357K11568m5847o6786j32483j0395n7488
20091C65645j68800k02120j54123J3849o3938J34815J87736K1638l6511K50738
$$ plain form
20163 474437 558643 864250 996048 811102 659832 306565 211797 135442 -26808 36179
20153 36179 85709 158978 380847 258771 13588 -210888 23448 407257 468582 402877
20143 402877 269099 391333 570570 763039 714591 519863 373607 366503 394685 549751
20133 549751 659536 414573 54259 -74187 -116141 4530 257350 485015 508118 373890
20123 373890 355259 284813 52172 -30308 38567 351381 576858 836868 708720 671499
20113 671499 560932 272347 353872 29579 -707 77492 155072 160880 389996 312335 150079
20102 150079 287189 422367 428992 357719 467076 678644 632797 566011 433528 423133 365645
20091 365645 196845 -5275 -159398 -145549 -209487 -74672 113064 134702 98191 348929
20081C48929L8537k27001j2076M09966J94217l82808r1025j34976J4893M92310
20071F50966o42K3574j88996k87556j24263n3351L39198K62206J17705K82831
20061A021672J86055J74988J16789k3011j10522k50257m15401l07920L65693M62609
20051A220695J95697j58226q1285P4526J48319K31328j10034j46671j6746k37235
20041A120368j56173k8729j66472m91241l32659J59237J63543Q6302K88489K09379
20031H52044K3350k44867j12925k17995j53313j31825K37988J38877k77774j7754
20021I5806J61288J76474m7243j38880R59J13486n4317K15970J22636J53886j7255
20010G82810j46827N3440p6349J54728O0879L58942L26657L803k47019m40347
$$ plain form
20081 348929 387466 160465 148389 558355 752572 369764 278739 143763 158656 650966
20071 650966 650324 673898 484902 197346 73083 19732 358930 621136 738841 1021672
20061 1021672 1207727 1382715 1499504 1476493 1365971 1115714 700313 392393 758086 1220695
20051 1220695 1416392 1258166 1176881 1251407 1399726 1631054 1521020 1374349 1357603 1120368
20041 1120368 964195 935466 768994 277753 -54906 104331 267874 354176 642665 852044
20031 852044 875394 630527 517602 299607 146294 14469 252457 391334 113560 95806
20021 95806 257094 433568 386325 247445 248404 361890 307573 523543 646179 800065 782810
20010 782810 635983 689423 613074 767802 828681 1187623 1514280 1518083 1271064 830717
20000H30717K44606K08207k773m5175j139K72j92318j19188k0586L041J67544
19989A073208k4274r6901q6522J06706j07705q8052j67458j51370l82015n3917
19979B1700K89727J03201P2665O2767k28403n1860K63561M03634q9126k77896
19969E69970j57045j02400k7930J33970O3067N6048j61644J49634J35591P0441
19959G29702j28213j43455j96285j68188L8098J24463m4098L23145n0953j19651
19949C64565j71802j49217K98001N6648l4134P8J38567k2175j13139j65673j94359
19938G360L9986q0203J28718O5598k37334J58321K91034k83734l09688J35761
19928h4181J39963K31633K46628p9351N9447k21053k09570L6788l5571o545L18391
$$ plain form
20000 830717 1075323 1283530 1280757 1235582 1234443 1234715 1042397 923209 902623 905664 1073208
19989 1073208 1048934 952033 865511 972217 864512 776460 609002 457632 75617 21700
19979 21700 311427 414628 487293 550060 321657 269797 533358 936992 847866 569970
19969 569970 412925 310525 282595 416565 479632 535680 374036 523670 659261 729702
19959 729702 601489 458034 261749 93561 131659 256122 212024 535169 484216 364565
19949 364565 192763 43546 341547 398195 364061 364139 502706 480531 367392 201719 7360
19938 7360 47346 -32857 95861 161459 -75875 82446 373480 89746 -219942 -84181
19928 -84181 55782 287415 534043 454692 514139 293086 83516 120304 84733 78188 396579
19917C96579J44833K48104n9292l05988k56880j16402r2395n3441J88253J39054
19907B32425j06333K0804j80000o804K45304o2905L0620K187J24383J79508L5512
19896E14701p7614r6691J04941J59843r4330j46526q9242J49192Q2153j38736
19886C67691J1184J07866r8932k774k10140n5353J96606q5598j72561Q6350j72424
19875b8085N7035L07123J89368l34152n1355K82177K09287K90574J74413j99995
19865H96390k64087r6906K21101J36483k76242N6883L22857l46326l68545k05296
19855G6312j623L4051M92257J98305k99084j69618l20169j94987p2736K55348
19845a944L38088J09366N8454j32925J72447J22548j12706J70545J19122k50250
$$ plain form
19917 396579 541412 789516 730224 424236 167356 50954 -41441 -94882 93371 232425
19907 232425 126092 146896 -33104 -39908 205396 142491 173111 175298 299681 479189 514701
19896 514701 437087 340396 445337 605180 510850 364324 275082 424274 506427 367691
19886 367691 378875 486741 387809 385035 174895 119542 316148 230550 57989 144339 -28085
19875 -28085 28950 336073 525441 191289 139934 422111 631398 921972 1096385 896390
19865 896390 632303 535397 756498 892981 616739 673622 996479 650153 281608 76312
19855 76312 74689 108740 600997 799302 500218 330600 10431 -184556 -257292 -1944
19845 -1944 336144 445510 503964 371039 543486 666034 553328 723873 842995 592745
19835E92745j64716P3906r2402j61178l5981K6707j58653J31939J26993O9024
19825D08384K09707M2179l39596l71568P5054L39240L41554O7593j83369k99063
19815B90115K6295K48739K77630J36729O3448M38910J77163m20970k29016l43124
19805F65919j57553o7155j0957J01712n3924p7216K41017K0975K02816M49684
19795A315318l352k29021l5349K13567P8453L55920K52520k40042m83572j29322
19785A095120j01471j13727j147L72561K644l8746j62779J10035J42595K39762
19775A544847j29348q026L3547k51721j75870R1282J66682K02358J25523J9492
19765A618766K49144M586J69350l12756k07425j88083j18286j82484k62765J19895
$$ plain form
19835 592745 428029 501935 409533 248355 212374 239081 80428 212367 339360 408384
19825 408384 618091 660270 320674 -50894 24160 363400 704954 772547 589178 290115
19815 290115 316410 565149 842779 979508 1042956 1481866 1659029 1238059 1009043 665919
19805 665919 508366 441211 430254 531966 478042 400826 641843 662818 865634 1315318
19795 1315318 1311966 1082945 1047596 1261163 1339616 1695536 1948056 1708014 1224442 1095120
19785 1095120 993649 879922 878775 1251336 1253980 1215234 1052455 1162490 1305085 1544847
19775 1544847 1415499 1407473 1441020 1189299 1013429 1104711 1271393 1473751 1599274 1618766
19765 1618766 1867910 1872496 2041846 1729090 1521665 1333582 1215296 1032812 770047 889942
19755H89942J98872j991j66232r255j21389Q1334K26912J66954N2054j23194J83967
19744A377974O1417o4746Q5802K26200o4476j70391r3260k60507O8964j25115
19734A041862j50469J94590K40052j39496K5198K63025J90696R4483j51892J1842
19724A619891K80003J61524J66117N5560J62181L48873j47725n02638l83840j21575
19714A638371J03936j5946J60724J55223j81469j13504j38675J23250q7335k10182
19704A434393l48854J5044j55935Q0067L9282r2340j02313P8834K07801k80570
19694H75409j89505K81315M419q5707j2707P1103J99427l08010j21942P3667K8293
19683H15762J68721p428p4343N0500j77543j35650O8788n9894k01944J16779K30698
$$ plain form
19755 889942 1088814 1086823 920591 911336 789947 871281 1098193 1265147 1317201 1194007 1377974
19744 1377974 1439391 1374645 1460447 1686647 1622171 1451780 1358520 1098013 1166977 1041862
19734 1041862 891393 1085983 1326035 1186539 1211737 1474762 1665458 1759941 1608049 1619891
19724 1619891 1899894 2061418 2227535 2283095 2445276 2794149 2646424 2143786 1759946 1638371
19714 1638371 1742307 1726361 1887085 2042308 1860839 1747335 1608660 1731910 1644575 1434393
19704 1434393 1085539 1100583 944648 1024715 1063997 971657 869344 948178 1155979 875409
19694 875409 685904 967219 971638 885931 873224 944327 1143754 835744 713802 787469 815762
19683 815762 984483 977055 902712 953212 775669 640019 708807 648913 446969 563748 794446
19672G94446P1467k14466j35464o8984J32448K06464N1608K62138r8666k81189
19662G19802l9953J41880J2202O7541J95245J58136k7852j09927K4702J38468
19652A280244J08481L9608R3997k5028L9219j20174j25327m6330j5806j15295
19642A113589k46133p4423k67664K38570L42707J42627k59814k5119n1469L168
19632I16039J49799J40066J05667O3741k16486k79288J05030J54647J06640j88534
19622A057321O449j84569k04288K81368L61914L50177J89084J2741k48723p2002
19612A549472J24850j75033m0028M7576M4337O2854J20898R8244k7670K50420
19602B055920k33418p9562K75425k39115q5008L12298J88467J52410M7109j77021
$$ plain form
19672 794446 865913 651447 515983 446999 579447 785911 837519 1099657 1000991 719802
19662 719802 679849 821729 833931 901472 1096717 1254853 1227001 1117074 1141776 1280244
19652 1280244 1388725 1428333 1522330 1497302 1536521 1416347 1291020 1244690 1228884 1113589
19642 1113589 867456 793033 525369 763939 1106646 1249273 989459 964340 912871 916039
19632 916039 1065838 1205904 1311571 1375312 1158826 879538 984568 1139215 1245855 1057321
19622 1057321 1063770 879201 674913 956281 1318195 1668372 1857456 1870197 1621474 1549472
19612 1549472 1674322 1499289 1459261 1506837 1551174 1614028 1734926 1833170 1805500 2055920
19602 2055920 1822502 1742940 2018365 1779250 1694242 2006540 2195007 2347417 2394526 2217505
19592B217505j23383o8069L295P3886J13771l46106O9145K17834J47639M35102
19582B740619K45113j34839l4881J27431L37721N7088j60409J32456K31039L31540
19572C872878L71104M00035M41434P71635K76548K93484O69055P21837L87081
19563H205091O18888J160961J232886J586563K334301K810718L223124L666886
19555B4839418N080379N718745N673001M201630M267433N626934P614826J2707677
19547G5730043J7899993K1611371K8024219L6938546L5463412J6764314O811602
19540B39243500K444956j7667788k9586547k3030070j6183003j9769820j6959384
19533A18491844p993722m26950K239244j982130o087194p877898j2877639j3938663
$$ plain form
19592 2217505 2094122 2026053 2029348 2103234 2217005 1870899 1940044 2157878 2305517 2740619
19582 2740619 2985732 2850893 2816012 2943443 3281164 3338252 3177843 3310299 3541338 3872878
19572 3872878 4243982 4644017 5085451 5857086 6133634 6427118 7096173 7818010 8205091
19563 8205091 8823979 9984940 11217826 12804389 15138690 17949408 21172532 24839418
19555 24839418 29919797 35638542 41311543 45513173 49780606 55407540 63022366 75730043
19547 75730043 93630036 115241407 143265626 180204172 215667584 232431898 239243500
19540 239243500 241688456 224020668 194434121 171404051 155221048 135451228 118491844
19533 118491844 110498122 110071172 112310416 110328286 104241092 96363194 83485555 69546892
19525F9546892j0639035o981536m951013l590338k256580j475834j255201r83157
19517C7414198o08105p06661n73317k04384M1808M0665P86096J221332J881341
19508C9292973K928479M513646O912065Q733376R989998J2200675J4660385J3585115
19500A12816712P525913M329615L290768P53857N142741J4353372K5058618L7272319
19492B10543915M4918124L7964682L1558364L5933100J3597106k4754489l2223500
19485C17537302l8393271n4859837m8153038k9933427j7273143r024951m501160
19478A15398475n566509p275315p334498r882167j0919591q666269o365733m445882
19470E4942511l548172k824634k562729j947091j933289k071108j833894j313079
$$ plain form
19525 69546892 58907857 51926321 46975308 43384970 41128390 39652556 38397355 37414198
19517 37414198 36806093 36099432 35526115 35321731 35363539 35404204 36190300 37411632 39292973
19508 39292973 42221452 46735098 53647163 62380539 72370537 84571212 99231597 112816712
19500 112816712 120342625 124672240 127963008 128716865 133859606 148212978 173271596 210543915
19492 210543915 255462039 293426721 324985085 360918185 374515291 349760802 317537302
19485 317537302 279144031 224284194 176131156 146197729 128924586 119899635 115398475
19478 115398475 109831966 102556651 95222153 85339986 74420395 65754126 59388393 54942511
19470 54942511 51394339 48569705 46006976 44059885 42126596 40055488 38221594 36908515
19462C6908515j444810j815048j372947j106635j387875j149566j004694j023263
19454B6603677r23740r51131r35452q18893o09938o04092p14430r06152o56353
19445A9483496m28882l49313n85415o11866o81376o47496m20061o70878j6380
19436A5071829j26766m74008l22508k03500n50133o97354k40059j79019m04705
19427A1873777m46565l27823m60953j97418j68689k19979J2940o9842k14420m1397
19417I739631R3889Q3468Q5543l65369m15134j81368n65060m12584m05035j55428
19407G502553J0869k34882n35723j11417P5855R780k12986j33440n2544j79807
19397F138258l35870J60260J16534j12567j71958j51296j68902P8780k60131j49913
$$ plain form
19462 36908515 35463705 33648657 32275710 31169075 29781200 28631634 27626940 26603677
19454 26603677 25679937 24728806 23793354 22974461 22364523 21760431 21046001 20139849 19483496
19445 19483496 19054614 18705301 18119886 17508020 16826644 16179148 15759087 15088209 15071829
19436 15071829 14945063 14471055 14148547 13945047 13394914 12697560 12457501 12278482 11873777
19427 11873777 11427212 11099389 10638436 10441018 10272329 10052350 10065290 9995448 9781028 9739631
19417 9739631 9833520 9916988 10002531 9637162 9222028 9040660 8475600 8063016 7657981 7502553
19407 7502553 7513422 7278540 6742817 6631400 6707255 6717035 6504049 6370609 6318065 6138258
19397 6138258 5802388 5962648 6079182 5966615 5794657 5643361 5474459 5553239 5293108 5143195
19387E143195m17021k10854r3558J57858R1381j63342l63372j40307P1929J277
19377D077186Q1895J19907k20656R8619L24486K34675k16062m07439O7116J88699
19367D348426K53610M15581q6320l50734j6632L05433o4541l40224l08181k11866
19357C944552m6112j55862k91806j67639n8506j07699l0705L0306M7603j18874
19347C045258j44423m5259j36024J03590j45248o3059r8100Q7637J00264j37812
19337B566824r1909n7263L74609L59973j04993N5056K3512J00261j47938k34838
19327B843294j04466J74242L27094J72479J61550R6127k28537j76581L7849k2058
19317C280993k5149J34517L88729j49171j38756J11544K96881k20150K15145M3666
$$ plain form
19387 5143195 4726174 4515320 4421762 4579620 4671001 4507659 4144287 4003980 4075909 4077186
19377 4077186 4159081 4278988 4058332 4156951 4481437 4716112 4500050 4092611 4159727 4348426
19367 4348426 4602036 5017617 4931297 4580563 4563931 4869364 4804823 4464599 4156418 3944552
19357 3944552 3898440 3742578 3450772 3283133 3224627 3116928 3086223 3116529 3164132 3045258
19347 3045258 2900835 2855576 2719552 2823142 2677894 2614835 2516735 2604372 2704636 2566824
19337 2566824 2474915 2417652 2792261 3152234 3047241 3102297 3125809 3226070 3078132 2843294
19327 2843294 2738828 2913070 3240164 3412643 3574193 3670320 3441783 3265202 3303051 3280993
19317 3280993 3255844 3390361 3779090 3629919 3491163 3602707 3899588 3679438 3894583 3938249
19307C938249K30321J68371j17273l2777k52147Q2716k40168r9458L45567J79233
19297D202634J84484q156p4895N3352L57935J75431J34233L61974L24689J59007
19287E870688k3115L60027J49929L35996O94898R06107P99856P73424P40877O36410
19277A1245097N00665M88921J016875J517537J259585J757551K691742L843617
19269B4321590N235621O204821O893264O908855Q021776J1322243J3793611Q572815
19261I1274596L044819R897164K2489661L3905798L8645131L9928988N2830314
19254B92016471P2587498M8907270k5639959n1858157l0376737l9242722n5062242
19247B11331422m1208891k1182849q947731l114222r1952M987603R597310J126084
$$ plain form
19307 3938249 4168570 4336941 4219668 4186891 3934744 4017460 3777292 3677834 4023401 4202634
19297 4202634 4387118 4378962 4304067 4357419 4715354 4890785 5025018 5386992 5711681 5870688
19287 5870688 5847573 6207600 6357529 6693525 7388423 8294530 9094386 9867810 10608687 11245097
19277 11245097 11745762 12234683 13251558 14769095 16028680 17786231 20477973 24321590
19269 24321590 29557211 35762032 42655296 49564151 57585927 68908170 82701781 91274596
19261 91274596 94319415 104216579 126706240 160612038 199257169 239186157 292016471
19254 292016471 364603969 413511239 387871280 336013123 305636386 266393664 211331422
19247 211331422 170122531 148939682 139991951 136877729 136785777 141773380 151370690 152496774
19239A52496774j7508429k4042085j8156936j1730837p192578m433702l006559
19232F6425648j605929k39309J065383K398174L703348N579056Q506563J2955698
19224I8788632J8289966K2131564K2714941K2657358K7399864L1508447J4612960
19217B58103732k0712407l4953161k4716938j3198889n615930L477901J0506141
19210A72890449M371629o541137k909161Q748483J8579792K8312711M5225454
19203B68678220O2331140N1371735K0286120K3823801N1009543K7041842n8666203
19196D45876198j01889550q1741932n2589554l3150651k1585761j5223183r831260
19189A29864307n347018n349541j0763750j2361684r394931o536334n340405n028172
$$ plain form
19239 152496774 134988345 110946260 92789324 81058487 73865909 69432207 66425648
19232 66425648 64819719 64580410 65645793 68043967 71747315 77326371 85832934 98788632
19224 98788632 117078598 139210162 161925103 184582461 211982325 243490772 258103732
19217 258103732 237391325 202438164 177721226 164522337 158906407 162384308 172890449
19210 172890449 177262078 170720941 167811780 176560263 195140055 223452766 268678220
19203 268678220 331009360 382381095 402667215 426491016 477500559 504542401 445876198
19196 445876198 343986648 262244716 209655162 176504511 154918750 139695567 129864307
19189 129864307 124517289 119167748 108403998 96042314 86647383 80111049 74770644 69742472
19181F9742472m279021l089208k522203k209367k198516j864016j893390j551361
19173E0135390j659275j812173j747745j916932j888241j404895j157915j284718
19165C7263496j422708j370009j315865j037313q45728r82162j122468r08655
19157B8258588p27696p68380n18657m43681p36895o62776l73513p21532r04704
19148B2400754p18221m62818o41920p91065o50542n02956o27961n92439n94794
19139A6818038o48941n02914m01584n23382p34290k99443m68813l47966k15702
19130A2675003l70188j30050N8607K97319k73425l42301j56230k64382m52572
19121A1041781m78766o04024o9592k18610l05183m15790j31461j30691k04929
$$ plain form
19181 69742472 65463451 62374243 59852040 57642673 55444157 53580141 51686751 50135390
19173 50135390 48476115 46663942 44916197 42999265 41111024 39706129 38548214 37263496
19165 37263496 35840788 34470779 33154914 32117601 31271873 30289711 29167243 28258588
19157 28258588 27530892 26762512 26243855 25800174 25063279 24400503 24026990 23305458 22400754
19148 22400754 21682533 21219715 20577795 19786730 19136188 18633232 18005271 17412832 16818038
19139 16818038 16169097 15666183 15264599 14741217 14006927 13707484 13238671 12890705 12675003
19130 12675003 12304815 12174765 12233372 12530691 12257266 11914965 11758735 11494353 11041781
19121 11041781 10563015 9958991 9889399 9670789 9365606 8949816 8818355 8687664 8482735
19112H482735k15575l82013k27425l39293n28487l87287K45337l2503l28513j77223
19102F109753p0784l67167k25418k10468q6278K62553J30623j96485m28342J68246
19092E086233N5946J98142k15066k40434K9828K18770l00263j66993l53760l53631
19082C958772j12534j34321Q8063Q9615k92104J02591J64159K32743N6440K0232
19072D173656j45620l75348l58738k7703J23501L21452O1554p8593o45610n26249
19062B522302j72009j64456q1210J10407k23557j79610M8891K72378M4962m721
19052B173377o0803N8563P0728k75995Q4455m186J04504j40776l58795J69364
19042A820436J75876k2557m9534j95310l75900J36955M58411R5606k02824m0088
$$ plain form
19112 8482735 8267160 7885147 7657722 7318429 6789942 6402655 6647992 6615489 6286976 6109753
19102 6109753 6038969 5671802 5446384 5235916 5149638 5412191 5542814 5346329 4917987 5086233
19092 5086233 5142179 5340321 5125255 4884821 4914649 5133419 4833156 4666163 4312403 3958772
19082 3958772 3846238 3711917 3799980 3889595 3597491 3700082 3864241 4096984 4153424 4173656
19072 4173656 4028036 3652688 3293950 3266247 3389748 3711200 3772754 3694161 3048551 2522302
19062 2522302 2350293 2185837 2104627 2215034 1991477 1811867 1860758 2133136 2178098 2173377
19052 2173377 2112574 2171137 2241865 1965870 2050325 2046139 2150643 2009867 1651072 1820436
19042 1820436 1996312 1973755 1924221 1728911 1353011 1489966 1948377 2043983 1841159 1801071
19032A801071O5715K66177K62767J8583J81396J12196Q5103K25501O150j72981
19022B851678J1838J91673O77780K12420k31331l04844O2477K09807o3608l36588
19012C281302l43041j79503k67894m68557k66291L34720K53529L92985K29568
19003B966818K14076O2081L71580K99699j29494l98806l05403l68098J23367K32338
18993C068158l44529m12005M6172m4017k99889k4071J61868K30463r4019q8983
18983B199148J96888j81421m69884k32560Q6704K08161M51442L6269l4962K81046
18973B540831K53136k35122j85699J71201J00384j49563k29216j34531k30095
18964A901326r2206L1009L3179J46429J38088R6075L757j15646r7610j97833j11104
$$ plain form
19032 1801071 1866786 2132963 2395730 2414313 2595709 2707905 2793008 3018509 3024659 2851678
19022 2851678 2863516 3055189 3732969 3945389 3714058 3409214 3471691 3681498 3617890 3281302
19012 3281302 2938261 2758758 2490864 2022307 1756016 2090736 2344265 2737250 2966818
19003 2966818 3180894 3242975 3614555 3914254 3784760 3385954 3080551 2712453 2835820 3068158
18993 3068158 2723629 2311624 2357796 2313779 2013890 1989819 2151687 2382150 2288131 2199148
18983 2199148 2396036 2214615 1744731 1512171 1598875 1807036 2258478 2294747 2259785 2540831
18973 2540831 2793967 2558845 2373146 2544347 2644731 2495168 2265952 2131421 1901326
18964 1901326 1809120 1840129 1873308 2019737 2157825 2253900 2257657 2142011 2044401 1846568 1735464
18953A735464j10722J22536J62686j86287j46281j29454j46408K28048N21440
18944B051022Q637k61128L7879j08500j07496J24707Q0780k1693k29578j07348
18934A467282K0943K04988K2214O0761j71177K08186J66972K29459j5412j40448
18924B053768j78554r241l10434k12858m9918n5672J01216Q8265K70651j39920
18914A557303m01341j80738N9348L01817J82302j13179j81948k20202Q9026L22814
18904A415202K53638M9174q6501J16953J4639j99885r5610L9576J15332P5401
18894A697919k78679k39844K09598K89377j13691r9114K24403j82304k36951J77412
18884A448126L33402R4727k19648l33618J49756L31513L0863j43799k82459j52193
$$ plain form
18953 1735464 1624742 1747278 1909964 1723677 1577396 1447942 1301534 1529582 2051022
18944 2051022 2059659 1798531 1836410 1727910 1620414 1745121 1825901 1804208 1574630 1467282
18934 1467282 1488225 1693213 1715427 1776188 1605011 1813197 1980169 2209628 2194216 2053768
18924 2053768 1875214 1865973 1555539 1342681 1292763 1237091 1338307 1426572 1697223 1557303
18914 1557303 1155962 975224 1034572 1336389 1518691 1405512 1223564 1003362 1092388 1415202
18904 1415202 1668840 1718014 1631513 1748466 1763105 1563220 1467610 1507186 1622518 1697919
18894 1697919 1419240 1179396 1388994 1678371 1564680 1465566 1689969 1507665 1270714 1448126
18884 1448126 1781528 1876255 1656607 1322989 1472745 1804258 1835121 1691322 1408863 1256670
18874A256670k75428k42141M16935K1271o0174J86215N6662q9735j30140j0703
18864A129432K56301k3809O8408o2571j10224K01289O0657K08312J3826m57129
18854A284492k48858J22767L6526L82985K20091K08220J83106P1343l16745l29060
18844A614867j66343P1916J15300K29059n0650J16084O8874n6187M1972m4621
18834A940271j19058j98544K0988J45172Q0012J28542p7095k87505K13101M5018
18824A890902m48095k84421K09014K66623L63278J41787j22915o3100J14673J79690
18814B247436K15739j55279l34426m6728k06736O0008J48939n7752j22241J96439
18804A945399L71909k21534m4149j66430P0751J06134P079j35358j11324j51122
$$ plain form
18874 1256670 981242 739101 1156036 1177307 1117133 1303348 1360010 1270275 1140135 1129432
18864 1129432 1385733 1361924 1430332 1367761 1257537 1458826 1519483 1727795 1741621 1284492
18854 1284492 1035634 1158401 1194927 1577912 1798003 2006223 2189329 2260672 1943927 1614867
18844 1614867 1448524 1520440 1635740 1864799 1814149 1930233 1999107 1942920 1984892 1940271
18834 1940271 1821213 1622669 1643657 1788829 1868841 1997383 1920288 1632783 1845884 1890902
18824 1890902 1442807 1158386 1367400 1634023 1997301 2139088 2016173 1953073 2067746 2247436
18814 2247436 2463175 2307896 1973470 1926742 1720006 1780014 1928953 1871201 1748960 1945399
18804 1945399 2317308 2095774 2051625 1885195 1955946 2062080 2069159 1933801 1822477 1671355
18794A671355j59385N8234m1791N21190J14606J030l26131J1412o3482j16244
18784A670794N1628k0690O0561J20784j83096j57986r5915K15926Q2504j37166
18774A607344J83392O3901R473L293k6758K09915M88714O36178Q1259o10727l84723
18763B261261l30188k8472j66654p6685K94532L5971P4035r121O8509K74256p8360
18752B319084l47098L23950M4494l1354K94697Q2584p697J97568R618L8778p504
18741B917120j20860q6750k73141n8867R2158K36119M4636r4617q272O3171l17039
18730B393658l61542p4730m21128k45434J36020J9504k45442M438k7459L1901
18720A209786J25052L37935Q7526M9684j69864k37386p5178K35292L07582j62333
$$ plain form
18794 1671355 1511970 1570204 1528413 2049603 2164209 2165239 1839108 1850520 1787038 1670794
18784 1670794 1722422 1701732 1762293 1883077 1699981 1541995 1446080 1662006 1744510 1607344
18774 1607344 1790736 1854637 1864110 1867403 1840645 2050560 2539274 3175452 3256711 2645984 2261261
18763 2261261 1931073 1902601 1735947 1659262 1953794 1989765 2063800 2054679 2123188 2397444 2319084
18752 2319084 1971986 2295936 2340430 2309076 2603773 2686357 2678660 2876228 2885846 2924624 2917120
18741 2917120 2796260 2709510 2436369 2377502 2469660 2705779 2750415 2655798 2647526 2710697 2393658
18730 2393658 2032116 1957386 1536258 1290824 1426844 1446348 1200906 1205344 1177885 1209786
18720 1209786 1334838 1672773 1760299 1809983 1640119 1402733 1327555 1562847 1870429 1708096
18710A708096l84537l37818K61182K32935L0539j08036j66549J1990J42568k2153
18700A368217J09734N7022J24202J9815j38494L4559K89084K66269K15147k27407
18690B118148j87125J58934k1182l28634m39561n6324K89252J43403L41980K39354
18680B258245J93548l7337p5004K15495l00271k13172l34646Q1713K41732n3704
18670A976599k47858j26023O0375J47033J12063k15289k06072O5605J49848l17758
18660A398523K08415K34124J03319k55968k35285R8622j3064q0306J85740m7850
18650A596270k64037Q6408J6583l21103J8604J93025L14981l7569L4754P4319
18640A712235k16338n36895j01871N6935r104N2615R9226k7686j30862J09465
$$ plain form
18710 1708096 1323559 985741 1246923 1479858 1510397 1402361 1235812 1247802 1390370 1368217
18700 1368217 1477951 1534973 1659175 1678990 1540496 1575055 1864139 2130408 2345555 2118148
18690 2118148 1931023 2089957 2068775 1740141 1300580 1244256 1533508 1676911 2018891 2258245
18680 2258245 2451793 2414456 2339452 2554947 2254676 2041504 1706858 1788571 2030303 1976599
18670 1976599 1728741 1602718 1663093 1810126 1922189 1706900 1500828 1566433 1716281 1398523
18660 1398523 1606938 1841062 1944381 1688413 1453128 1551750 1538686 1458380 1644120 1596270
18650 1596270 1332233 1418641 1435224 1114121 1132725 1325750 1640731 1603162 1637916 1712235
18640 1712235 1495897 959002 857131 914066 904962 957577 1056803 1029117 898255 1007720
18630A007720K02209J55276O1882J44770K97238L09780j48038j28468l3834K93443
18620B161978Q996l37333m13029o7304K56063O1433l30897k58088P5999L05935
18610A463753Q5332j04220m00082l47407P8329M37735M16701K65386L82138J98941
18600B476606l27183l58227m6129r0699k31638k10228q1290k2235J18183J68280
18590A395440J93452j6125j93648J07048K17686j10784j7140n2314J07776j3879
18580A617512k59182q4965l1228N1640o1440K13791J9129k13607O1557j13925
18570A199282J66194m5828o6413J46207K14761r800L2922q5805l0450k74577j58132
18559A088361K35795J05335M2961o3737m5069J67924J42160m7873j48332J90798
$$ plain form
18630 1007720 1209929 1365205 1427087 1571857 1869095 2178875 2030837 1902369 1868535 2161978
18620 2161978 2170974 1833641 1420612 1353308 1609371 1670804 1339907 1081819 1157818 1463753
18610 1463753 1549085 1444865 1044783 697376 775705 1213440 1630141 1895527 2277665 2476606
18600 2476606 2149423 1791196 1745067 1654368 1422730 1212502 1131212 1108977 1227160 1395440
18590 1395440 1588892 1572767 1379119 1486167 1703853 1593069 1575929 1523615 1631391 1617512
18580 1617512 1358330 1273365 1242137 1293777 1232337 1446128 1465257 1251650 1313207 1199282
18570 1199282 1365476 1319648 1253235 1399442 1614203 1604403 1637325 1551520 1521070 1246493 1088361
18559 1088361 1324156 1429491 1472452 1408715 1363646 1531570 1673730 1625857 1477525 1668323
18549A668323n0792p273O2770j95210q4945m0351k5421O6963Q2991O4857P3044
18538A614956P6517R1006M0842M9576Q5219L462M2631j06190j57429l2701R6253
18527A804142j37359j99632j12878P9626Q6442P6701J0557m7982O5762Q497K09326
18516A843202n003j79426k10131m4208M06j19607J91539K7134j23456o4608O9398
18505A385240m425k248m4841R9529K97099j20836j37615J0237K61978N3048K31664
18494B028830L12665k24070j14464k064j63921R4872M45646K48273J02833J45193
18484B873793k67362j49409K10714J79655J87166M12287J68403o3980J36991K55940
18474C944198j46054k25252k7808l6681p7753j76625o2473J56617j7076k18548
$$ plain form
18549 1668323 1617531 1610258 1673028 1477818 1392873 1352522 1327101 1394064 1477055 1541912 1614956
18538 1614956 1691473 1782479 1823321 1872897 1958116 1961578 2004209 1898019 1740590 1707889 1804142
18527 1804142 1666783 1467151 1354273 1433899 1520341 1597042 1607599 1559617 1625379 1633876 1843202
18516 1843202 1838199 1658773 1448642 1404434 1404840 1285233 1476772 1503906 1380450 1315842 1385240
18505 1385240 1380815 1378567 1333726 1433255 1730354 1609518 1471903 1482140 1744118 1797166 2028830
18494 2028830 2341495 2117425 2002961 2000897 1836976 1931848 2377494 2625767 2728600 2873793
18484 2873793 2606431 2457022 2667736 2847391 3034557 3446844 3615247 3551267 3688258 3944198
18474 3944198 3798144 3572892 3545084 3508403 3430650 3254025 3191552 3348169 3331093 3112545
18464C112545K48509K65325o522R9582J94439O409O4630J8976N3637j42998K26229
18453D140761K41360k061K01401K96007O52349L76433J59805N44608P73614R18602
18443H302879O91365N12470J78698j97399N99477J149835J241991K019438K635194
18434A7133948L400611M840215P183608J0521256J6608715K4826393L0928199
18427A15442945K8574760K4909818L8662549N8953888K0686432o1702611p2731714
18420A52796067m4197439k4915723j4691279r162266n904713l372861p39283J066258
18412E0878761L065693O142695J1078277J8117431K6154986K7604311K3038019
18405A66080173K7114986M8191317M5131569k7105923p5842296n6400420l1653941
$$ plain form
18464 3112545 3361054 3626379 3619857 3719439 3913878 3920287 3984917 4003893 4057530 3914532 4140761
18453 4140761 4382121 4380060 4581461 4877468 5529817 5906250 6066055 6610663 7384277 8302879
18443 8302879 8994244 9506714 9685412 9488013 10087490 11237325 12479316 14498754 17133948
18434 17133948 20534559 25374774 32558382 43079638 59688353 84514746 115442945
18427 115442945 144017705 168927523 207590072 266543960 287230392 225527781 152796067
18420 152796067 108598628 83682905 68991626 59829360 53924647 50551786 49812503 50878761
18412 50878761 53944454 60087149 71165426 89282857 115437843 143042154 166080173
18405 166080173 193195159 241386476 286518045 259412122 183569826 127169406 95515465
18398I5515465j8999715j2612736q916786o269111m595045l247250k722200k329765
18390C5822857j906906j530657j613298j106429o05794o63097p60089q02777r37198
18381B5896612r58472j316536j392487j177308j057411l36823l87006q89671p56638
18372A7624260m03116l23507k57696m38803m74304l19732j48707n17771j31959
18363A4608665l15245m71324m53433o48860n72507p45100k60734j0085j21831
18354A1009546j69952k97628K42998j2527j81043l00735j35358m18108l35189
18345I402004m67282j96412m9059r2533k8824k32960l88928k55832k40255M8032
18335G497951J75095K7058k88311n19467r1887K37857k19906j55312l65357l70774
$$ plain form
18398 95515465 76515750 63903014 54986228 48717117 44122072 40874822 38152622 35822857
18390 35822857 33915951 32385294 30771996 29665567 29059773 28396676 27636587 26833810 25896612
18381 25896612 24938140 23621604 22229117 21051809 19994398 19657575 19270569 18380898 17624260
18372 17624260 17221144 16897637 16639941 16201138 15726834 15407102 15258395 14740624 14608665
18363 14608665 14293420 13822096 13368663 12719803 12147296 11402196 11141462 11131377 11009546
18354 11009546 10839594 10541966 10784964 10772437 10591394 10290659 10155301 9737193 9402004
18345 9402004 8934722 8738310 8689251 8596718 8567894 8334934 7946006 7690174 7449919 7497951
18335 7497951 7673046 7700104 7411793 6892326 6800439 7038296 6818390 6663078 6297721 5926947
18325E926947L9833J83719N0506p5157j39243k8134m94223m46265J882J52736
18315E172601L24906M9865m17599k05755j8097k92765k07295O1966N1722k06147
18305D313402r2804j84312k8331N2224K8467j48115J79007L86097k44113l19977
18295C941545m86265j116K68086r68l49102j85671k8059l8419j43482K36275O8250
18284C281074n8556J09886j83343m67128n8073K37587k90775m95079O226J23559
18274B205378k06512k6535L57420J35679k22457M062P3558k38340q9692O234K54128
18263B252923Q4656l20548k13290j98934R5011J75233j50931k49281j09049n901
18253A359889K22498k9624Q9498l27554l11139K31973L36669m9655l4610O2407
$$ plain form
18325 5926947 5966780 6150499 6201005 6125848 5986605 5958471 5464248 5017983 5019865 5172601
18315 5172601 5497507 5547372 5129773 4924018 4905921 4613156 4405861 4467827 4519549 4313402
18305 4313402 4220598 4036286 4007955 4060179 4088646 3940531 4119538 4505635 4261522 3941545
18295 3941545 3455280 3454164 3722250 3721282 3372180 3186509 3158450 3120031 2976549 3212824 3281074
18284 3281074 3222518 3332404 3149061 2681933 2623860 2861447 2570672 2075593 2081819 2205378
18274 2205378 1998866 1972331 2329751 2465430 2242973 2247035 2320593 2082253 1992561 1998795 2252923
18263 2252923 2337579 2017031 1803741 1604807 1699818 1875051 1724120 1474839 1365790 1359889
18253 1359889 1582387 1552763 1642261 1314707 1003568 1235541 1572210 1522555 1487945 1550352
18243A550352n6589p0786J8273k9589m3556J16962P9603l04791k55933R3198J08745
18232A205889j51775l11002q6610J8510J64O1791J46266j75798l68394j37158
18222B01883j50184K79535N25370J59566n592j12649k27366j19438J20146K03036
18212H74307J08116k09512m24109o3234K98719O3272j41461j89320K43323J21677
18202F81778j37210n938R4132o4366J2851l5744O2934K31910P8436J5708o6180
18191H68311j77286r2172j42673k87098N7143M36958k2851j89768r0944j64299
18181A95321m3650M81114L96067K34502l1440k88113k70253r8896R6578K1854
18171F93084K72563R9798k13958j11817n3765K13333L05712K9659K1894J13465
$$ plain form
18243 1550352 1493763 1422977 1441250 1411661 1368105 1485067 1564670 1259879 1003946 1097144 1205889
18232 1205889 1054114 743112 656502 675012 675176 736967 883233 707435 339041 201883
18222 201883 51699 331234 856604 1016170 1010578 897929 670563 551125 671271 874307
18212 874307 982423 772911 348802 285568 584287 647559 506098 316778 560101 681778
18202 681778 544568 538630 632762 568396 581247 545503 608437 840347 918783 934491 868311
18191 868311 691025 598853 456180 169082 226225 663183 640332 450564 359620 195321
18181 195321 151671 632785 1028852 1263354 1231914 943801 673548 574652 671230 693084
18171 693084 965647 1065445 851487 739670 685905 899238 1204950 1234609 1256503 1369968
18161A369968n0823p599q8954j77323J5804l8553M5935J22389j16246J5474K59884
18150A349956J13342J4961n5778p1377N5365j34965K32867L14664o4804m6281
18140A707950o5569n9436K97240K35185J17139N89K40499K55484J43606J25249
18130B997936L42049N67404L13320J91250L63728P24551Q63897J046175J603960
18121I014270J851460K351872L642038M673764O841427J0467976J7280607K7146531
18113H3269945L5732520L2853194K3965001L8454460P6669903M3441652q7870333
18106B46516342r1775673m9785887k6977537j6493726j1134803p576955n130527
18099C7641234l953985k830660k494828k415732j913798j561570j479069j128266
$$ plain form
18161 1369968 1319145 1311546 1222592 1045269 1061073 1022520 1068455 1190844 1074598 1090072 1349956
18150 1349956 1463298 1478259 1422481 1351104 1406469 1271504 1504371 1819035 1754231 1707950
18140 1707950 1642381 1582945 1880185 2115370 2232509 2233098 2473597 2729081 2872687 2997936
18130 2997936 3339985 3907389 4220709 4411959 4775687 5500238 6364135 7410310 9014270
18121 9014270 10865730 13217602 16859640 21533404 28374831 38842807 56123414 83269945
18113 83269945 119002465 151855659 175820660 214275120 290945023 334386675 246516342
18106 246516342 154740669 104954782 77977245 61483519 50348716 42771761 37641234
18099 37641234 33687249 30856589 28361761 25946029 24032231 22470661 20991592 19863326
18091A9863326q80857q21151n48339o63400q11028q34755n70275o73935p51733
18082A3307853o44473m49355p8156k73156q23623p29415l57767l42515l16423
18073I292970l93170k46785j58280k16339j71547l77791l23984J50859J1704j97367
18063G370270k28200k26354j95781k28924l82261l09142p039l7497j40457k11559
18053E403056l77020j08441o8289j8862l79216k75335l70554j71559O3830r8597
18043C599013l86498j50489j05613k02063Q5538k691J45759N9235l1420r6195
18033B914576k55447l8877j66927k70837j37197L0249P553J03610J13259r5579
18023B204383q6377p1611j97304j58367n3360J10275k07756j83824q4990J47327
$$ plain form
18091 19863326 18982469 18161318 17612979 16949579 16138551 15303796 14733521 14059586 13307853
18082 13307853 12663380 12214025 12135869 11862713 11039090 10309675 9951908 9609393 9292970
18073 9292970 8899800 8653015 8494735 8278396 8106849 7729058 7405074 7555933 7567637 7370270
18063 7370270 7142070 6915716 6719935 6491011 6108750 5799608 5792569 5755072 5614615 5403056
18053 5403056 5026036 4917595 4849306 4830444 4451228 4175893 3805339 3633780 3697610 3599013
18043 3599013 3212515 3062026 2956413 2754350 2839888 2837197 2982956 3042191 3010771 2914576
18033 2914576 2659129 2620252 2453325 2182488 2045291 2075540 2083093 2186703 2299962 2204383
18023 2204383 2118006 2046395 1849091 1690724 1637364 1747639 1539883 1356059 1271069 1418396
18013A418396m388n4414n8508j33857K31643p6083J40284J26286J1619Q6622k2889
18002A664711k39348l24677M3008J77843J20467l21352j30600R5490J70918j89618
17992A066842j70298J32878N558j0252j4496j83531j9338J10110L3710k57531
17982F93652K8515J85258k06000r0299R858O2867l4619r9761k46638r6288N1405
17971B57950P5849q3194k22864J38685K97825J33110j33080j96139m4553k80066
17961e6477n3666J20804L77891L33396l4903n8458O585j45639l35758j51708R5987
17950I8054J71236k1360k57600j05533J22698M17683J27047j13341o9689J60077
17940E29272j41275j78567j64692j90331j66829J39466R9854o8784J12483j5313
$$ plain form
18013 1418396 1414008 1359594 1301086 1167229 1398872 1322789 1463073 1589359 1600978 1687600 1664711
18002 1664711 1425363 1100686 1143694 1321537 1442004 1120652 990052 1085542 1256460 1066842
17992 1066842 896544 1029422 1034980 1024728 1010232 826701 807363 917473 951183 693652
17982 693652 722167 907425 701425 611126 620984 683851 649232 549471 302833 206545 257950
17971 257950 333799 250605 27741 166426 464251 597361 464281 268142 223589 -56477
17961 -56477 -110143 10661 388552 721948 687045 628587 635172 489533 153775 2067 98054
17950 98054 269290 247930 -9670 -115203 7495 425178 552225 438884 369195 529272
17940 529272 387997 209430 44738 -145593 -312422 -172956 -73102 -141886 -29403 -44716
17930d4716R1666O5218K5398Q3604Q2606j6942k39553J40670k57519l4097r946
17919a13611k38302N1999o4414j71419r7838K71948K79741L159q6983K37732M2138
17908A14150k97849K670Q8614P1376n3463K18882j66013O0245J17659r5837J59902
17897B20336P7054M206j89938J2441K14487n2837n2843q0534J06302l327j05236
17886A50111j42770N5694k32337k67618L3536q1446q057Q1329J50005N21147K66618
17875E26212j48685J32997p327j17378n45873k8712J34602M0185J76523o6809
17865I5735j68493O913n43460p4595K28227K26340J57932K84126m24l64423n0253
17854b02375j83326J05604J47053l1223r8701K46515L35894K9203k10977J10055
$$ plain form
17930 -44716 46950 112168 137566 221170 303776 286834 47281 187951 -69568 -103665 -113611
17919 -113611 -351913 -299914 -364328 -535747 -633585 -361637 -81896 -78737 -165720 72012 114150
17908 114150 -183699 -181029 -92415 -21039 -74502 144380 -21633 38612 156271 60434 220336
17897 220336 297390 301596 111658 124099 338586 285749 232906 152372 258674 255347 150111
17886 150111 7341 63035 -169302 -436920 -403384 -484830 -492887 -411558 -261553 259594 526212
17875 526212 377527 510524 503197 385819 -160054 -188766 -54164 -13979 162544 95735
17865 95735 -72758 -65845 -609305 -683900 -455673 -229333 -71401 212725 212301 -152122 -202375
17854 -202375 -385701 -280097 -133044 -164267 -262968 -16453 319441 348644 137667 247722
17844B47722p2705k97569j75942o4518J6001K42515N26k1602o908o7553J46683
17833e3350L82619j74559r597N2149O480P9799j05365m0467j6200J73650K8509
17822C23668L28051K38443K49331L43477L0481r970m24439k16925j83456n8865
17812F19796j01058j93092l05620M0875M06268o0123k04805m42727L59644M12964
17802E32122L17298J63042k97799J62334L03355k68176m40105j98596K08808j49981
17792C32302k5721q7879j7242k27044j37058j43667O0132l396K07061L15226k3470
17781B49244j14202p0383K74883J7625k35823J33301j94413l98602J59784J5274
17771a63312K1153j3947j36936o0932M3894K23413J32483j1635j54467k19480
$$ plain form
17844 247722 175017 -122552 -298494 -363012 -347011 -104496 -103970 -125572 -132480 -200033 -53350
17833 -53350 329269 154710 145113 197262 203742 283541 178176 137709 121509 295159 323668
17822 323668 651719 890162 1139493 1482970 1513451 1503481 1079042 862117 678661 619796
17812 619796 518738 325646 20026 60901 467169 407046 202241 -240486 119158 532122
17802 532122 849420 1012462 714663 876997 1180352 912176 472071 273475 482283 332302
17792 332302 306581 218702 201460 -25584 -162642 -306309 -246177 -249573 -42512 272714 249244
17781 249244 135042 64659 339542 357167 121344 254645 60232 -338370 -178586 -163312
17771 -163312 -142159 -156106 -293042 -353974 -310080 -86667 45816 34181 -120286 -339766
17761c39766p406M13825K41751j01300j38905N3001j72060m0300Q6444j87058
17751a91774M7046j738k26987J27741L9873Q4428M7994j55354J2235J57624M4090
17740a4822k79874m5984K13150J40432j42166j24983O1188K11147j6349p5168
17730g3429J69213R5811P2470J61122J40472J47529j55033p589j32608n5135j52556
17719B10267j00448n8100J18931k17287J7197j40119j739N7708k24685k21339
17709e59614K26703j50802O0175J90280J01881m7974j71588r8322R3541K03054
17699a52666L15068L05534M9163j92008P5158j11257R2307L7639l10252k73888
17689a65202K35864L14661J09717k81475l08806j59608j44676K48452K25359J43114
$$ plain form
17761 -339766 -347172 66653 308404 207104 68199 121200 -50860 -91160 -4716 -191774
17751 -191774 -144728 -146466 -373453 -245712 -205839 -121411 -73417 -228771 -216536 -58912 -14822
17740 -14822 -294696 -340680 -127530 12902 -129264 -254247 -193059 18088 1739 -73429
17730 -73429 95784 191595 264065 425187 565659 713188 558155 550566 417958 362823 210267
17719 210267 109819 51719 170650 -46637 -29440 -169559 -171298 -113590 -338275 -559614
17709 -559614 -332911 -483713 -423538 -233258 -131377 -179351 -350939 -449261 -355720 -152666
17699 -152666 162402 467936 517099 325091 400249 288992 381299 418938 108686 -165202
17689 -165202 70662 385323 495040 213565 -95241 -254849 -399525 -151073 74286 217400
17679B17400M6649j57662K267m7661P3042K92111k6891P7698r3966j71369j22659
17668H8959Q3401j38449m8740J61372q2173j08991j46570L15889Q3182L0758k55378
17657a6740j37796k07049M0882N649L9971L15317J94664q6726r0113Q8576r1684
17646E4951l60292j0763N982l638O9642k3484L46900p8768j86032j30977J23701
17635a92778J88506L13946L42314n1011M1320l08105l00543l13800Q5890j07220
17625c01481L8990R0062K38585K95364q6235l93460j00548l6148j86462j17212
17615e58545J33227K57928J31531P0800Q7386K11159k30401k77270l19282J96273
17605b97194L37694k61483j38393n6777n3848j9376j05803K12373J53362K44281
$$ plain form
17679 217400 264049 106387 108654 60993 134035 426146 399255 476953 382987 211618 88959
17668 88959 172360 33911 -14829 146543 64370 -44621 -191191 124698 207880 238638 -16740
17657 -16740 -154536 -361585 -320703 -315054 -275083 40234 234898 148172 58059 146635 54951
17646 54951 -305341 -316104 -310122 -313760 -244118 -267602 79298 530 -185502 -316479 -192778
17635 -192778 -4272 309674 651988 600977 642297 334192 33649 -280151 -194261 -301481
17625 -301481 -262491 -172429 66156 361520 275285 -118175 -218723 -254871 -441333 -558545
17615 -558545 -425318 -167390 -35859 34941 122327 333486 103085 -174185 -493467 -297194
17605 -297194 40500 -220983 -359376 -416153 -470001 -489377 -595180 -382807 -229445 14836
17595A4836j04445k62721J78171J02346L49733K35920l34586q3110j6085k26916
17585a46857j23759j01404K71053J08988j37234Q7633k39221o5049J72341J91139
17575A7630r2901O958Q4196P5181K0536K67477K15752j47921l82065j35087M2291
17564b7953o6669p092j15161J73156J71266L1898N2992j04411j48366k19882M52
17553b59770J883L618K55958J03496l16442m3825J09084L6517n1712o6498J80095
17542d7596L09578J4800j17656n0279j06056j50852n1151J14257O0030j30942
17532a55867P1889o5619n8429k33552q8767j777J67588J1730k552K09475K05065
17521E9184k031R4629L45934j10837l07300K6519J10290j82981r5649K10788m5184
$$ plain form
17595 14836 -89609 -352330 -174159 -71813 277920 513840 179254 96144 80059 -146857
17585 -146857 -270616 -372020 -100967 8021 -129213 -41580 -280801 -345850 -173509 17630
17575 17630 -75271 -68313 15883 91064 111600 379077 594829 446908 64843 -70244 -27953
17564 -27953 -94622 -101714 -216875 -43719 127547 159445 212437 108026 -40340 -260222 -259770
17553 -259770 -257887 -254269 1689 105185 -211257 -255082 -145998 -109481 -161193 -227691 -47596
17542 -47596 261982 276782 159126 108847 2791 -148061 -199212 -84955 -24925 -155867
17532 -155867 -83978 -149597 -208026 -441578 -530345 -532122 -364534 -352804 -355356 -145881 59184
17521 59184 57153 151782 497716 386879 79579 106098 216388 33407 -62242 148546 103362
17510A03362k20175J4561j82597m05792J70566K20462K29329o9256r2858j94946
17500d27344L72404L55436J13237P8377m2283j75760N5148j47851j59866j72463
17490a50965k9326O0601N8528J4622l82462j99686K58943P4694j28391n3669M10298
17479f6813o479j76088R7738M7608o1389L3260Q9060j40828r6823Q9888J01138
17468h9728k20510J4609J53256J99701p4253J43609L09823n2993k11825k49334
17458g7645J60923Q224k41977o9154O0822L04366K3568r2766o398p8576K7052
17447A8439P8148L09845N09044K72898J46896M26676k14645o02049l77820k5262
17437E42170K14956K8317k60014l10916o164K20773o552m8322K11122k05187r6277
$$ plain form
17510 103362 -116813 -102252 -284849 -690641 -520075 -299613 -70284 -139540 -232398 -427344
17500 -427344 -54940 300496 413733 492110 449827 274067 329215 181364 21498 -150965
17490 -150965 -180291 -119690 -61162 -46540 -429002 -628688 -369745 -295051 -423442 -477111 -66813
17479 -66813 -73292 -249380 -151642 -104034 -165423 -132163 -43103 -183931 -280754 -190866 -89728
17468 -89728 -310238 -295629 -142373 57328 -16925 126684 436507 383514 171689 -77645
17458 -77645 83278 91502 -150475 -219629 -158807 145559 169127 76361 69963 -8613 18439
17447 18439 96587 406432 915476 1188374 1335270 1761946 1547301 945252 567432 542170
17437 542170 757126 785443 525429 214513 208349 429122 422570 374248 585370 380183 283906
17426B83906p1687k58391k6913j15649j61983j30007J35283K30560J42513m8629
17416b0997m9344O9396J4318o8218J73085o2966P7175k55164l08212Q5830K69997
17405g5100Q932k05919R6158L28030K7848J3641O5625j89216R2323L08338M8622
17394E19282k65056j82495J69515M0388q5594o3402j650K31875m7736P688o3312
17383B59503k18097j60671L5994j22472k62462L54672K43867k20893j41015j06328
17373c37902J60088J53030k545K87788l1810Q2468K67432q5734l06355J34405
17363C20865n3537L1558l6787J47807J72348l87421m58915j24360j65920J30636
17353d23726J90060J06704Q1340R5663n6482l8219p9927J73239J19143K7719o9282
$$ plain form
17426 283906 212219 -46172 -73085 -188734 -350717 -480724 -345441 -114881 27632 -20997
17416 -20997 -70341 -945 13373 -54845 118240 55274 132449 -122715 -430927 -345097 -75100
17405 -75100 -66168 -272087 -175929 152101 179949 193590 259215 69999 162322 470660 519282
17394 519282 254226 71731 241246 281634 196040 132638 130988 362863 315127 322815 259503
17383 259503 41406 -119265 -83271 -205743 -468205 -113533 130334 -90559 -231574 -337902
17373 -337902 -177814 -24784 -27329 260459 228649 311117 578549 492815 186460 320865
17363 320865 267328 298886 262099 409906 582254 194833 -264082 -388442 -554362 -423726
17353 -423726 -233666 -126962 -45622 50041 -6441 -44660 -124587 48652 167795 195514 126232
17342A26232k25336n7784q4180l2309m1667j870Q1944J44836K69636J19589J77162
17331D76253k83668j41026j00763o3909j9345J63041n5887j65548j1436J43936
17321e8352r5110J39171j8492N2525L5037p626k5084j05449K12586n803k21279
17310i7876n7452Q2590J60955J21416J39140J238j68214L53801j4702n49626k85593
17299c14323K26188K37724k58461j37823J10774L12378j84485J7702K8678j55109
17289a16757l2945Q1139K07914L30444j20197l86921j11827L762L9946L17270
17279B11828K37937N576K43837j65367l25667j92609n0754r1420J3077j46999
17269b60561N743m1793L28264J93651J36506k2761j74610J82296R6842j84465
$$ plain form
17342 126232 -99104 -156888 -241068 -273377 -315044 -316914 -234970 -90134 179502 299091 476253
17331 476253 192585 51559 -49204 -113113 -132458 30583 -25304 -190852 -202288 -58352
17321 -58352 -153462 -14291 -32783 19742 54779 47153 22069 -83380 129206 123403 -97876
17310 -97876 -155328 -72738 88217 209633 348773 350011 181797 535598 520896 -28730 -314323
17299 -314323 -88135 149589 -108872 -246695 -135921 176457 -8028 9674 38352 -116757
17289 -116757 -149702 -68563 139351 469795 349598 -37323 -149150 -145388 -105442 211828
17279 211828 449765 455341 699178 533811 208144 15535 -35219 -126639 -113562 -260561
17269 -260561 -254818 -296611 31653 225304 361810 339049 164439 346735 443577 259112
17259B59112k75873M0714K56971o246q6079m2060j75667n8287K21270j00755k56483
17248b23383j70666J14122J89087J8984R5150J49282J66764r4343j66473j27997
17238d9473l36649n063J23201J19143L4743j6824J68073k85791k9600N3524K6612
17227a98104m8264J93701J03233l6394m0860J5622J1245M0488q0389L1789J07226
17216I9293j85099k07076j03590J14743J95122j84984l8609k14454k88084J37449
17206f75289J02795L34190Q7377k59985p6188R9916O7992J57130L04568N3079
17196A95585j86488j7504j45706K00583p6678l40807j63532K6712L13794J44347
17186d9694Q0022J45937M1416J3j12435k04307l5735j8735M76791J15729l42718
$$ plain form
17259 259112 -16761 23953 280924 274678 188599 146539 -29128 -87415 133855 33100 -223383
17248 -223383 -394049 -279927 -90840 -71856 23294 172576 339340 244997 78524 -49473
17238 -49473 -386122 -391185 -267984 -148841 -114098 -130922 37151 -248640 -278240 -224716 -198104
17227 -198104 -246368 -52667 50566 14172 -26688 -11066 179 40667 -39722 -7933 99293
17216 99293 -85806 -292882 -396472 -281729 -86607 -271591 -310200 -524654 -812738 -675289
17206 -675289 -572494 -238304 -150927 -410912 -487100 -387184 -319192 -162062 142506 195585
17196 195585 9097 -8407 -154113 46470 -30208 -371015 -534547 -507835 -194041 -49694
17186 -49694 30328 176265 217681 217694 105259 -99048 -134783 -153518 323273 439002 96284
17175I6284o234O0809K21818N6332k43450j7540l11353k94449o4336l9775L7469
17164e04425J67813J30336K94366j97178j94578O7623M04953J4045j6721j80120
17154a3886j78187l04029J14926L93533q3927j31447J50389K77652j3876j74676
17144C6472k753K72411k0870k62863j17264J83457K01214M9633j95840J4946j76332
17133a7789J2751k3783L7035j00908P5440J0966l3788K32002j90337j97074j3117
17122b08602P3125r8850n8185J66627k7074M6300m9976j64964J52497J49200k2381
17111d2283k03525J24945K32548M8955k4711o6826k46044j5668k6249K5894K54318
17100F1354r3347k50237K57197K64627k88425j30233N1079O2006j9609j70648
$$ plain form
17175 96284 90050 150859 372677 429009 185559 168019 -143334 -437783 -502119 -541894 -504425
17164 -504425 -336612 -206276 88090 -109088 -303666 -236043 168910 182955 166234 -13886
17154 -13886 -192073 -496102 -381176 12357 -71570 -203017 -52628 225024 211148 36472
17144 36472 33719 306130 285260 22397 -94867 88590 289804 339437 143597 158543 -17789
17133 -17789 -5038 -28821 8214 -92694 -17254 -6288 -40076 191926 1589 -195485 -208602
17122 -208602 -135477 -234327 -292512 -125885 -152959 -106659 -156635 -321599 -169102 -19902 -42283
17111 -42283 -245808 -120863 111685 160640 135929 69103 -176941 -192609 -218858 -192964 61354
17100 61354 -31993 -282230 -25033 239594 -48831 -179064 -127985 -65979 -85588 -256236
17090b56236o6048o9115P7212J6478J86129m9730J4197Q3318p2367o3460J93586
17079f036k29369O701J66490K6826k01348J9013M86348N404l6706q8166J36138
17068B85295J92204m05492j15494Q1017N3588k30449l5541J33594J08715l3223
17058C4214k01224j00382J19562J38458k1394J07596K65859L29092j09328l64193
17048A98260m7663K71644L8966j16473n930q8126P3363q4342q8214j2879L2027
17037A70633k1736K29531j11887p3419n5055l88989P9383O7153P1012j2385M4439
17026a320M3014k48609J21644L400k64868r5182J62240L39076M7704k33256j18911
17015b45068P6866J82857n7163m9686L02971P9963j11892o8794J07450j04647
$$ plain form
17090 -256236 -322284 -391399 -314187 -297709 -111580 -161310 -147113 -63795 -136162 -199622 -6036
17079 -6036 -235405 -228704 -62214 -35388 -236736 -217723 268625 274029 237323 149157 285295
17068 285295 477499 72007 -43487 37530 91118 -139331 -174872 -41278 67437 34214
17058 34214 -167010 -267392 -147830 -9372 -30766 76830 342689 671781 562453 198260
17048 198260 150597 422241 461207 344734 338804 250678 324041 239699 151485 138606 170633
17037 170633 148897 378428 266541 193122 138067 -250922 -171539 -104386 -33374 -45759 -1320
17026 -1320 41694 -206915 -85271 -81871 -346739 -441921 -279681 59395 107099 -126157 -245068
17015 -245068 -168202 14655 -42508 -92194 210777 290740 178848 110054 217504 112857
17005A12857J3200K7728j92161O6679L3511R1034j48221j20973K69770l25319
16995a71895l61766J1317K88879j4297j99856L04476j06762m03388O2867L86628
16985b03797K29821j86817k9052o0513J92762j22516j07820J98267J08947K75980
16975B95262J73683K01918P585j90923l58330k43015Q5440J53433J38971k6871
16965B37153R0353N905Q6313J03693O2799k45366j62054p8179r092l71596j90706
16954d70777m1681M27268J08013K09418K57838Q3395l6560k17423k26818K992
16944I5665l28593k62364J954m505L11596O7155J11509l723M3885J15064M0281
16933A87924m5136j05731j67457k07496N4170J64367j53827j16571J16615J82625
$$ plain form
17005 112857 126057 153785 -38376 28303 61814 152848 4627 -116346 153424 -171895
16995 -171895 -533661 -522344 -233465 -247762 -447618 -143142 -249904 -653292 -590425 -203797
16985 -203797 26024 -160793 -189845 -250358 -57596 -180112 -287932 -89665 19282 295262
16975 295262 468945 670863 678448 487525 129195 -113820 -28380 125053 264024 237153
16965 237153 327506 333411 419724 523417 586216 340850 178796 100617 91525 -280071 -470777
16954 -470777 -512458 -85190 22823 232241 490079 573474 536914 319491 92673 95665
16944 95665 -232928 -495292 -493338 -497843 -186247 -119092 -7583 -11306 32579 147643 187924
16933 187924 142788 37057 -130400 -337896 -283726 -119359 -273186 -389757 -273142 -90517
16923i0517k39792m385j4605j10788K11166K99182j3492K2827K31117Q3571k4253
16912C50031K12840O9758j96841j38465Q9718J51627m6487m5483l8518k56185
16902A51995j52373l1083J9873J34904J74140K073l30145l82349p9135K6353J67577
16891b98170J74759K4356P9434m2649j08271p0312K03615k8766q856j52362J91716
16880c5506L23666K61560k92032k90688J8465P2196k76058L962J00312o6119K7642
16869a52600j28319P2673J99199J9794l25027p4828L49222K18583k6583k95564
16859a43450k83274J03951P6759j47096J01329K03028J92294J73545Q4666J23197
16849D84949n0327j19231m3565l6633j457j36361J7874k51473k47982R0078R7809
$$ plain form
16923 -90517 -330309 -334694 -349299 -460087 -248921 50261 36769 59596 290713 374284 350031
16912 350031 562871 632629 435788 297323 387041 538668 492181 446698 408180 151995
16902 151995 -378 -31461 -11588 123316 297456 299529 -30616 -412965 -492100 -465747 -298170
16891 -298170 -123411 -99055 -19621 -62270 -170541 -240853 -37238 -66004 -74860 -227222 -35506
16880 -35506 288160 549720 257688 -33000 -14535 57661 -218397 -214435 -114123 -180242 -152600
16869 -152600 -280919 -208246 -9047 10747 -314280 -389108 -39886 178697 152114 -143450
16859 -143450 -426724 -322773 -246014 -393110 -291781 -88753 103541 277086 361752 484949
16849 484949 434622 315391 271826 235193 233736 97375 115249 -136224 -384206 -294128 -196319
16838a96319j29961n7878j01568N2341P8044N1877j83560L6285K12056L63178
16828A24495J02869P4377n4533l67310R2022j53741r045J1324L21612P6883j13648
16817A05305M4296N5833l39200k52831P7568M58085n7921l06005q179L15091K21382
16806C13424O6876J29523j00351j70028k3119J77570Q2041j21392n5623n1927
16796B46994j833J21173L5762J25736J98883k32755o6908R6903j45890j31082
16786B46983k69888p4074r8174J81462L31152O7866o1037j62901l1553o1999J61055
16775B28892L22245N3449k77081O1034j213n3650K2649O919k57768j46021K91826
16764B51281k2363q9407J11327J11559q5529l83104J38843J55149l11618n0052
$$ plain form
16838 -196319 -326280 -384158 -485726 -433385 -355341 -303464 -487024 -450739 -238683 124495
16828 124495 227364 301741 247208 -120102 -28080 -181821 -190866 -179542 142070 218953 105305
16817 105305 149601 205434 -133766 -386597 -309029 149056 91135 -214870 -223049 92042 313424
16806 313424 380300 509823 409472 239444 216325 393895 475936 354544 298921 246994
16796 246994 245161 366334 402096 527832 726715 493960 427052 523955 378065 246983
16786 246983 -22905 -96979 -195153 -13691 317461 385327 324290 161389 129836 67837 228892
16775 228892 551137 604586 327505 388539 387326 333676 356325 363244 105476 -40545 251281
16764 251281 228918 139511 250838 362397 276868 -106236 32607 187756 -123862 -173914
16754a73914J94810j05965J21228J99995L9702m6958l38695j78758J23317K3302
16744a41936P6733K45426K02635j63607l09403L8539J25114J24580o4612l05013
16734a71544J1183p7857J68947J3625J55143k2727K58280p1294l62014k60318
16724c58576N5812M9334j56250j32021l3110Q1249K05633l564K62226J83371n6584
16713I7520j70947M4800r5431J30096n2560l9591K2541j63995r6135m5664l5111
16702d04477J68371K89154L5598j35035q1767K1216J44296J60686J9163P0960
16692B88165k24787m46900j43847M9825Q4268J19695J52171j55657j14679J8302
16682c73444m9341l0644L68481J8861j2712j5625q0260n3300p0605q4785j12988
$$ plain form
16754 -173914 20896 -85069 36159 236154 275856 228898 -109797 -288555 -165238 -141936
16744 -141936 -65203 180223 382858 219251 -90152 -51613 73501 198081 133469 -171544
16734 -171544 -160361 -238218 -69271 -55646 99497 76770 335050 263756 -98258 -358576
16724 -358576 -302764 -253430 -409680 -541701 -574811 -493562 -287929 -291493 -29267 154104 97520
16713 97520 -73427 -28627 -124058 6038 -46522 -86113 -63572 -227567 -323702 -369366 -404477
16702 -404477 -236106 53048 88646 -46389 -128156 -106940 37356 198042 217205 288165
16692 288165 63378 -383522 -527369 -477544 -393276 -273581 -121410 -277067 -391746 -373444
16682 -373444 -422785 -453429 -84948 -66087 -78799 -94424 -174684 -227984 -298589 -383374 -496362
16671d96362j03437J69893j55856L12023L47876J94788j27255j84508r0811Q0132
16661e3517q561p6419j70809j3967q7064n3829n4258J07009M6580K95850K25326
16650A56341m7078k01742K77360K38070k15097l31633p8495J89906M3335o3828
16640c2861M920r0458m5139P1627j81961k63105J24838M53660k4941r8469K07383
16629A25494K35933J99841j69359j53003K1853O7804Q6801r1162l73432k04451
16619b53681j24575K52842K56285O0904J10304j48874Q4089r7780q5785k83479
16609b29750n0894K21506j42456J3694L36519O6434j4766j87568k1j02180J1055
16598g8427j66354O7610j08625R3789Q3709m8720q1559j49393K4051K45559R6609
$$ plain form
16671 -496362 -599799 -429906 -585762 -273739 74137 268925 141670 -42838 -133649 -53517
16661 -53517 -62078 -138497 -309306 -323273 -410337 -464166 -518424 -411415 -364835 -68985 156341
16650 156341 109263 -92479 184881 422951 207854 -123779 -202274 -12368 30967 -32861
16640 -32861 -27941 -118399 -163538 -91911 -273872 -536977 -412139 41521 16580 -81889 125494
16629 125494 361427 561268 391909 238906 260759 328563 415364 324202 -49230 -253681
16619 -253681 -378256 -125414 130871 191775 302079 153205 237294 139514 53729 -229750
16609 -229750 -280644 -59138 -201594 -187900 148619 215053 200287 12719 12698 -89482 -78427
16598 -78427 -244781 -177171 -285796 -192007 -108298 -157018 -238577 -387970 -363919 -118360 -21751
16587b1751M3480M33j46684o6088M4945P2403r5183J26204J97888j49781R3405
16576I9271Q3571k32799k12747j56188J10328o8347L12940J47442O2117J58406
16566C03994O3915r6716n45620m89254J49905J27848L4567l162K03035K02809
16556d8679l2422M083N0328O2513l02245J4609J26580O2486j10711K6136q8227
16545b35549J58308J26425q0050N1249J5661k18009j58616K5991J12514j75855
16535c77931J58078J65384j51725k74297j04998j5758j716n5713P6859R1410K11336
16524b79071J95754o9368J2893J0346J8189L4963m9696j74638K78442J0694j39787
16513a51279j33009l00683K44891K80570j01640P5813M7033j45817m89194j08951
$$ plain form
16587 -21751 21729 22162 -124522 -190610 -145665 -73262 -168445 -42241 155647 5866 99271
16576 99271 182842 -49957 -262704 -418892 -308564 -376911 -63971 83471 145588 303994
16566 303994 367909 271193 -274427 -763681 -613776 -485928 -451361 -454523 -251488 -48679
16556 -48679 -81101 -77018 -26690 35823 -266422 -251813 -125233 -62747 -173458 -147322 -235549
16545 -235549 -77241 49184 -30866 20383 36044 -181965 -340581 -314590 -202076 -377931
16535 -377931 -219853 -54469 -206194 -480491 -585489 -601247 -602963 -658676 -581817 -490407 -279071
16524 -279071 -83317 -152685 -139792 -129446 -111257 -76294 -125990 -300628 -22186 -11492 -151279
16513 -151279 -284288 -584971 -340080 -59510 -161150 -85337 -38304 -184121 -673315 -782266
16503g82266M61030M53749K48855Q2404K5647r8945k65346k62174L4241q1078
16493a83883j43296J15713J06983J01445J14891M6610K19337Q0803o5226J38819
16483E32196j6461J26974k97406l38053j23930M3288J18101O8284L86680J12385
16473F12058r5349j88329k49523j54261O2751k1866J6155j92948k9037j16118
16463c56467J08135K25368r1694j730Q3240m3544j00893k9801q7107K70504n2708
16452g6697L0731J02970L82844o9775j39039k37392l779J26306j32518K98360
16442B82011l0034k49149P8984J56736Q1134p2492k72270k46000p1382K00168
16432a42294L35359J87907J06327q1290o22134k26986k2235L16527P6159j67180
$$ plain form
16503 -782266 -321236 132513 381368 463772 489419 390474 125128 -137046 -102805 -183883
16493 -183883 -327179 -211466 -104483 -3038 111853 158463 377800 458603 393377 532196
16483 532196 515735 642709 345303 7250 -116680 -73392 44709 112993 499673 612058
16473 612058 516709 328380 78857 -75404 -12653 -34519 -18364 -211312 -240349 -356467
16463 -356467 -248332 -22964 -114658 -116388 -33148 -76692 -177585 -207386 -294493 -23989 -76697
16452 -76697 -45966 57004 439848 370073 231034 -6358 -10137 116169 -16349 282011
16442 282011 251977 2828 81812 238548 319682 247190 -25080 -271080 -342462 -142294
16432 -142294 193065 380972 487299 406009 -216125 -443111 -465346 -148819 -72660 -239840
16422b39840Q2150J97144J07314m0460L8065J92431k32528J47638K48003p0911
16412D29006j38628j66749j5404l7983r4989L401L9547M611q7243K32124K0693
16401A88386n268r3090o4719l5474N2161n7137J30146L58952n1498j52739j62234
16390A07486k06002m32594M1919K12008j1457o9672J34020j33944J1958o5450
16380d11728K83986M8133Q4768J95779M2275n5240j64079R7195J77976K31295
16370E30360l41509j25858o2404K7161l9112J7351k90316J26524L9120j13571
16360b32254K3221L87J15665J41842M7173Q5866J17713Q8881j0069p755k15419
16349A55251r8211K01944P1970l1970K2614l1235R2466k22923j60161j86154K42166
$$ plain form
16422 -239840 -157690 39454 146768 106308 144373 336804 104276 251914 499917 429006
16412 429006 290378 123629 108225 70242 -24747 -21346 18201 22812 -64431 167693 188386
16401 188386 183118 90028 25309 -10165 41996 -15141 115005 473957 422459 269720 107486
16390 107486 -98516 -531110 -489191 -277183 -288640 -358312 -224292 -358236 -346278 -411728
16380 -411728 -127742 -79609 5159 200938 243213 187973 23894 121089 299065 530360
16370 530360 188851 62993 589 27750 -11362 5989 -284327 -157803 -118683 -232254
16360 -232254 -209033 -208646 -92981 48861 96034 181900 299613 388494 378425 370670 155251
16349 155251 57040 258984 330954 298984 321598 290363 382829 159906 -255 -186409 55757
16338E5757L86382L1943j24011r1666l87334j90207K60395k9110M4854O6136J90916
16327B14055J53869J28512k00247k14794k28250j5343J64384N2488j276j88773
16317a35375J3882J07012N2948J08270j39136J81027q9273P9096k56278p0376
16307a48203L42361J9608j37997k26136L3686O5392L1509l3971k52997J26964
16297a79784L78121p9515l4135l1057j27073M5320L6832N1629k18140l82463K48190
16286b92075Q9895N7837j49674n8094J61452P2274q781j085k29584r2105j03368
16275e53308L52L43683J82426j23062k78942r3385j87422J39179L11984J58389
16265a00106J83848m2273N7359n4596K26324Q8668J29926j78852l05045J30215
$$ plain form
16338 55757 442139 474082 350071 258405 -128929 -319136 -58741 -87851 -42997 23139 214055
16327 214055 367924 496436 296189 81395 -146855 -162198 2186 54674 53398 -135375
16317 -135375 -121493 -14481 38467 146737 7601 188628 99355 178451 -77827 -148203
16307 -148203 194158 213766 75769 -150367 -116681 -51289 -19780 -53751 -306748 -179784
16297 -179784 198337 118822 84687 53630 -73443 -28123 8709 60338 -157802 -540265 -292075
16286 -292075 -202180 -144343 -294017 -352111 -190659 -118385 -127166 -128251 -357835 -449940 -553308
16275 -553308 -552956 -209273 -26847 -149909 -428851 -522236 -709658 -570479 -258495 -100106
16265 -100106 83742 41469 98828 44232 270556 359224 489150 310298 5253 135468
16255A35468j32569j99299k1010J43091m4083n9022K49855P3792l05262l731Q1193
16244h1577J03026J72265L87681l2073k20247j68836L15507L11504J89215o46161
16234C30304k69407M4441r0478J04722P2505j42989p5086o9894k43422k7404L24358
16223d2350K08196M9076K9337j66561L2600J52301J6117l78669q9129R8399M22736
16212C32053J5715o2737K15200J54487l0165l14351k22793m93630k2656K42501
16202a86376K78885J21647k10006j71435Q3595K92477P6933J50046J76727j67827
16192D44666j64584r1269j7728j57385M1438k8k39519j35278J47979J72746J02340
16181A03378P2962l2229k88784J9520J76658J78568J2355k72545j28569M2881
$$ plain form
16255 135468 2899 -196400 -217410 -74319 -118402 -177424 72431 146223 -159039 -162770 -81577
16244 -81577 21449 193714 581395 549322 329075 160239 475746 787250 976465 330304
16234 330304 60897 105338 14860 119582 192087 49098 -25988 -95882 -339304 -366708 -42350
16223 -42350 165846 214922 244259 77698 110298 262599 278716 -99953 -189082 -90683 332053
16212 332053 347768 285031 500231 654718 624553 310202 87409 -406221 -428877 -186376
16202 -186376 92509 214156 4150 -167285 -83690 208787 285720 435766 612493 444666
16192 444666 280082 188813 171085 13700 55138 55110 -184409 -319687 -171708 1038 103378
16181 103378 176340 144111 -144673 -125153 51505 230073 242428 -30117 -158686 -115805
16171a15805K45683K24692r3499j94013j49454j38683Q2299J43334k02336j26301
16161c24083j4604J65403Q0351K438l11778j44208K66561L16339J08560m6163
16151I8816k90441p0116M6443J61459J3401j8392j24031j76842j91013K10882
16141c39834K71658K8368m7053O1461N9188l8294Q2206j61055K1163p7937r1279
16130b31408Q4005J27286R3877P9579J45231o0708M0546l041k82873K3404P5587
16119I1485K9582j71038q0516K25555k0553l66806J5026k47063M4292O03480L19702
16108D43146j89771l89117n26153j59004K27422K30292L23938J62974O5226j5855
16098A73098j1525j31214o8874J35012J86587k24931J43958j58764o6526j60588
$$ plain form
16171 -115805 129878 354570 261071 67058 -82396 -221079 -138780 4554 -197782 -324083
16161 -324083 -338687 -173284 -92933 -90495 -402273 -546481 -279920 36419 144979 98816
16151 98816 -191625 -261741 -215298 -53839 -40438 -58830 -182861 -359703 -550716 -339834
16141 -339834 -68176 -39808 -86861 -25400 33788 -4506 77700 -83355 -62192 -140129 -231408
16130 -231408 -147403 -20117 73760 153339 298570 237862 278408 275367 -7506 15898 91485
16119 91485 121067 -49971 -130487 95068 74515 -292291 -277265 -524328 -480036 123444 443146
16108 443146 253375 -135742 -661895 -820899 -593477 -363185 -39247 123727 188953 173098
16098 173098 161573 30359 -38515 96497 283084 58153 202111 43347 -23179 -183767
16088a83767p1168q5784K3818l9739Q1584L27184J74234j05788m01712M0061J82416
16077e8661J97348p6957m0979J71664J9279l74243k03009K4678J14853L01187
16067G5160j80221j6922J7867J82301K20543j20978k14690j24502M9869R8034
16057a3539k7207j90625k65305j05921M2526K41557L4666O8563J97773r2887r720
16046a20119L58700K7954k74936k82675p1379J25534Q2977M6297k04422J03561
16036b08508K248j05266J20883K02620Q164N7629j21746l9682K83408O1717J5711
16025B77178j32243p3443j41203j02109K62466J56815j08697k62717r9956J41520
16015h2389k82888k83280L2143L8941R2734K91925J68672j27993r229K10096R6424
$$ plain form
16088 -183767 -254935 -340719 -316901 -356640 -275056 52128 226362 120574 -281138 -241077 -58661
16077 -58661 138687 61730 20751 192415 211694 -162549 -365558 -340880 -226027 75160
16067 75160 -105061 -121983 -104116 78185 298728 177750 -36940 -161442 -111573 -13539
16057 -13539 -40746 -231371 -496676 -602597 -560071 -318514 -283848 -215285 -17512 -110399 -120119
16046 -120119 238581 266535 -8401 -291076 -362455 -236921 -153944 -107647 -312069 -208508
16036 -208508 -206260 -311526 -190643 11977 20141 77770 -43976 -83658 199750 261467 277178
16025 277178 144935 71492 -69711 -171820 90646 247461 138764 -123953 -223909 -82389
16015 -82389 -365277 -648557 -616414 -577473 -484739 -192814 -24142 -152135 -161364 48732 145156
16004A45156J95158J58877j3421k13318j48883R0789J42394M0475j55181l3337
15994B08709m9042l39284j72464O2589j14835n7995Q0881L75543p0953k64812
15984c41663j05308M3812K5112P575k5679K59230L71728O9893o2270l83608K2072
15973a19106K65095j5717j14539J15743j14208j47440J9581j2800J07958J30934
15963A15501j26255J44788L29343J63298j47657k08728l5019J62508n9748k20979
15953A17052j83357r777q2896J51319J80660J52303n6520n5340l76155j50413
15943c13124J39382J59273P0802l0013k59602P1828J51605j85268R4754K01339
15933A00976o3159m4583L0002J63377J84400p9134Q5985J15176k57039r9251J26043
$$ plain form
16004 145156 340314 499191 485770 272452 123569 214358 356752 397227 242046 208709
15994 208709 159667 -179617 -352081 -289492 -404327 -462322 -381441 -5898 -76851 -341663
15984 -341663 -446971 -403159 -378047 -370472 -396151 -136921 234807 304700 242430 -141178 -119106
15973 -119106 145989 130272 15733 131476 17268 -130172 -110591 -123391 -15433 115501
15963 115501 -10754 134034 463377 626675 479018 270290 235271 397779 338031 117052
15953 117052 -66305 -76082 -158978 -7659 173001 325304 268784 213444 -162711 -313124
15943 -313124 -173742 -14469 56333 26320 -233282 -161454 -9849 -195117 -100363 100976
15933 100976 37817 -6766 23236 186613 371013 291879 377864 493040 236001 136750 262793
15922B62793N0243j50973q9082M3529k08896k96998J57204J29973R7739r8647
15912a03115J86114K72506j41155j61842k02739j37998o3321M29499L78738M4204
15902E00891l3891j40726j37428j6928O1279p9662l15981k43832k15445J15477
15892e06246K86250L76718K31905k8791l2902j35566j2851k3198k35755l0309
15882a10745o1666J89162K167q2771o7867j7263J09293J77033l81504j76735N7865
15871c63031J12881J04030J36385J11176J47394j21222J25456J72952j69501m29841
15861a73321m2369M4292K14667r767j99117j82240L1748J20031J58663L11895
15851B74482J05135K24674p545j86286k00114m1270k17501k43016j82105J40414
$$ plain form
15922 262793 313036 162063 72981 116510 -92386 -389384 -232180 -102207 -4468 -103115
15912 -103115 82999 355505 214350 52508 -150231 -288229 -351550 77949 456687 500891
15902 500891 467000 326274 188846 171918 233197 153535 -162446 -406278 -621723 -506246
15892 -506246 -219996 156722 388627 359836 326934 191368 178517 155319 -80436 -110745
15882 -110745 -172411 16751 18918 -63853 -131720 -148983 -39690 137343 -244161 -420896 -363031
15871 -363031 -250150 -146120 -9735 101441 248835 127613 253069 426021 256520 -173321
15861 -173321 -215690 -171398 43269 33502 -165615 -347855 -316107 -196076 -37413 274482
15851 274482 379617 604291 596746 410460 210346 169076 -48425 -291441 -473546 -333132
15841c33132n8456J35771p8306J36738J56807J82324p0029p7819Q2840J30332
15831B07070Q965k73376k15179j49075M15642L11800j25507k38149k9664K15602
15821A28129K43364j46587j08913J48604n0694J5002j75429j19248j51821j76087
15811c93680R2425Q3565j08637p5106J10033J56722L01039Q9951l61346M0294
15801f4740M4820R9975L03603r2399l20152m7707m1165n3959N3098j47726k35607
15790e01959k1117K39801K50631O633j1960j04800j19173J2952K9891l12086j4970
15779e46157k5588O8004K77161J09598K36356p945k74272j13247n6185J96920
15769a35355L21689l6410K32153J0452l87567p9541O619l08199J53966L00212
$$ plain form
15841 -333132 -391588 -255817 -334123 -197385 -40578 141746 71717 -6102 76738 207070
15831 207070 216035 -57341 -272520 -421595 -5953 305847 180340 -57809 -87473 128129
15821 128129 371493 224906 115993 264597 213903 228905 53476 -65772 -217593 -393680
15811 -393680 -301255 -217690 -326327 -401433 -291400 -134678 166361 256312 -105034 -64740
15801 -64740 -19920 80055 383658 291259 -28893 -76600 -117765 -171724 -118626 -266352 -501959
15790 -501959 -523076 -283275 -32644 -26011 -37971 -142771 -261944 -248992 -219101 -531187 -546157
15779 -546157 -571745 -503741 -226580 -116982 119374 111429 -162843 -276090 -332275 -135355
15769 -135355 186334 149924 382077 392529 4962 -74579 -67960 -376159 -222193 78019
15759G8019K86989q2699l00721K20191m1919j61642j63527l2608K34306M67J01164
15748A38020n7478n4737o9948J44455K24412k38066l59028L0525K02193n5510
15738i5162J23323M8739N1090j43822o020j56076R129K64754k2682j91631l37599
15727d55957J74371J46562j26929Q3568J16501j02779O7513j9888K2923j472M6974
15716d8613K595O2162n5837k7791p6632N6793K5262p9817j19894P7250O2287k43090
15704c65325O932k58765J12572K81886L1662J72417L5197j21982p7244J3009N4265
15693a15376J21567P7439j04858L1610K32722j2313o7954j78847K9166k7683l1115
15682d5642k55144j71087m1690r6047K71202K33690J56168K26299j73213j05054
$$ plain form
15759 78019 365008 282309 -18412 201779 159860 -1782 -165309 -197917 36389 36856 138020
15748 138020 80542 25805 -44143 100312 324724 86658 -272370 -241845 -39652 -95162
15738 -95162 28161 76900 127990 -15832 -21852 -177928 -168799 95955 73273 -118358 -455957
15727 -455957 -281586 -135024 -261953 -178385 -61884 -164663 -97150 -117038 -94115 -95587 -48613
15716 -48613 -46018 16144 -39693 -67484 -144116 -87323 -62061 -141878 -261772 -184522 -122235 -365325
15704 -365325 -358393 -617158 -504586 -222700 -191038 -18621 16576 -105406 -182650 -169641 -115376
15693 -115376 6191 83630 -21228 10382 243104 230791 162837 -16010 13156 -14527 -45642
15682 -45642 -300786 -471873 -513563 -609610 -338408 -104718 51450 277749 104536 -518
15672e18Q0105J76734k21609q1073L16058J03554l23122j99748K40805J69319
15662B60505L1140p0355j32076o2518J61781l32385k28382K15753M9774j92694
15652b99457O7528j8728l0595L08239L73852J3774r7144j22561j20496j2237r1021
15641b8846l09593p6325j08011K22663L87775l1533k78748O3703j52034o4226
15631c75175K72954J71892j36984n1613M03961P2413o6583j85765J00446O0251
15621B65797k21240k3485j55623k7633j31091j1095k3673P6642L37113K27349
15611C13061m0559l31295L02523L20647j44470j12371Q212J85725O2221o7757
15601D95937l06435j99161O9149j30173q8899J13147j5620l6471k51468j47155
$$ plain form
15672 -518 79587 256321 34712 -46361 269697 373251 50129 -149619 91186 260505
15662 260505 291645 221290 89214 26696 188477 -143908 -372290 -156537 -106763 -299457
15652 -299457 -231929 -250657 -281252 26987 400839 414613 317469 194908 74412 62175 -28846
15641 -28846 -338439 -414764 -522775 -300112 87663 56130 -222618 -158915 -310949 -375175
15631 -375175 -102221 69671 -67313 -118926 285035 357448 290865 105100 205546 265797
15621 265797 44557 21072 -134551 -162184 -293275 -304370 -328043 -251401 85712 313061
15611 313061 272502 -58793 243730 564377 419907 307536 315748 501473 563694 495937
15601 495937 189502 -9659 59490 -70683 -159582 -46435 -62055 -98526 -349994 -497149
15591d97149K42099K73820J42988K54127j52913j95966J92037Q215j00361O3233
15581B30130j50458l92800j4702K38531L45342Q6803l20793k74951K73380M1426
15571F1908m7001j19941q4561k63528M1519K99453K95104P7160n0026j04159j52484
15560d6556j4045J35054r2007n0693p8984r9863N6164L38082K30562j52774j88617
15549C6323j04294o9005M6707K73790J42892Q687p0945l38931j64406j23058L36298
15538b5942J91767n3501l7959N0741O7269j46028q1257K53604L01159k47815k78895
15527f857r7922J2905O5152Q7236j08287j56341K6107j78994j47173K10478K32964
15516f0732p7991j21111L3714J73964j34120j40761J35602J90828R1909r003j9695
$$ plain form
15591 -497149 -255050 18770 161758 415885 262972 67006 259043 267258 166897 230130
15581 230130 79672 -313128 -327830 -89299 256043 342846 22053 -252898 20482 61908
15571 61908 14907 -105034 -189595 -453123 -411604 -112151 182953 260113 210087 105928 -46556
15560 -46556 -60601 74453 -17554 -68247 -147231 -247094 -190930 147152 377714 224940 36323
15549 36323 -67971 -136976 -90269 183521 326413 335100 264155 -74776 -239182 -362240 -25942
15538 -25942 165825 112324 74365 125106 192375 46347 -34910 218694 519853 272038 -6857
15527 -6857 -104779 -91874 -26722 60514 -47773 -204114 -178007 -357001 -504174 -293696 -60732
15516 -60732 -138723 -259834 -226120 -52156 -186276 -327037 -191435 -607 91302 82299 62604
15505F2604l6768k6270j57920k41868L6043M71366K91545o5919N6895j26949k98573
15494c5814o162j34535k80627k57672K13857M89488R7344l40038k54771J99870
15484c09060N19090K32598J22238R8703j60304m24705j66676m7956J55820J01162
15474A20910q5771K1358K29119J72743k39198j96882p6399J84930N1561j23845
15464E8526k26288l3661K64734J12655l1108j76828l06234m1445P5784O0913R1367
15453a51585J27279J82514J47456p1342k1168N0026k5807k64536m56925j02053
15443e86141K03849L16720n4822q1590O619m9125K29302K99658k34386k19157
15433a69073o9659j038j2881K25432J36251n0628Q5819o0504j73621J12247J33710
$$ plain form
15505 62604 25836 -434 -158354 -400222 -364179 107187 398732 332813 389708 262759 -35814
15494 -35814 -41976 -176511 -457138 -714810 -500953 -11465 85879 -254159 -508930 -309060
15484 -309060 210030 442628 564866 663569 503265 78560 -88116 -136072 19748 120910
15474 120910 35139 56497 285616 458359 219161 22279 -54120 130810 182371 58526
15464 58526 -167762 -201423 63311 175966 144858 -31970 -338204 -379649 -303865 -242952 -151585
15453 -151585 -24306 158208 305664 234322 213154 263180 237373 -27163 -484088 -586141
15443 -586141 -382292 -65572 -120394 -201984 -195365 -244490 -15188 284470 50084 -169073
15433 -169073 -238732 -239770 -252651 -27219 109032 58404 144223 83719 -89902 22345 156055
15422A56055J27504L2921j13720j51923n8066J29934K25042k3457k02602j5515
15412A06173M4600r3765K34997O775n4164r5175j82163r8497P7191l7180j9770
15401a10978k2063J23743K20559j23669j83833K9525r8931O276K6911J66987l6257
15390a730J03197r1681M1818L0791p4305J09378K25591n7989j02697K08965N4860
15379D46198m7269j27170r4156m4285J8976k31740j87116J19309L23172q6292
15369H9627J97493J62648P8251l60649j95363r4739j35509n6488R1954L25688
15359A02913J76942K7423j81974j12737j60019L3289J7218J60027N2968j87090
15349g1040R474N0336L21797J95974O435j17047j76174j07873j87725k57434N9362
$$ plain form
15422 156055 283559 316480 202760 50837 -7229 122705 347747 324290 121688 106173
15412 106173 150773 57008 292005 298780 244616 149441 -32722 -131219 -54028 -91208 -110978
15401 -110978 -133041 -9298 211261 87592 -96241 -66716 -165647 -159371 -132460 34527 -1730
15390 -1730 101467 9786 51604 82395 8090 117468 343059 285070 182373 391338 446198
15379 446198 398929 271759 177603 133318 152294 -79446 -266562 -147253 175919 89627
15369 89627 287120 449768 528019 167370 -27993 -122732 -258241 -314729 -222775 102913
15359 102913 279855 307278 125304 12567 -147452 -114163 -96945 63082 116050 -71040
15349 -71040 -61566 -11230 310567 506541 512976 395929 219755 111882 -75843 -333277 -273915
15338b73915N1694L8945J41828J47086R1159q8392k21696O6738J22786j51837
15328g5604j30248l0757J02148L47030L8561J9362j03863j09226K20779N12348
15318G90530r6169m03166k48292Q6087K04207k1572j39378n5460j97239L4081
15308d6371j68830O3255J56893l3890r5890j98574N8039r8468j18936K16208J30318
15297a36246l23963L17880M07105K71781q0777k52294J05651K28732l91795o55883
15287e09809L31422L07261J30208m4976j43672J26274m5813r4615P918r8352J71445
15276A37291Q1508q0030k37071J1112K8301j26814m1875J31193M9079K5921Q149
15265a3236k45908o9508k63577j0350K51461L25075J42634m00009l57970J00932
$$ plain form
15338 -273915 -222221 -183276 -41448 105638 196797 108405 -113291 -46553 76233 -75604
15328 -75604 -205852 -236609 -134461 212569 251130 270492 166629 57403 278182 790530
15318 790530 694361 291195 42903 128990 333197 311625 172247 116787 -80452 -46371
15308 -46371 -215201 -151946 4947 -28943 -124833 -323407 -265368 -363836 -482772 -266564 -136246
15297 -136246 -460209 -142329 264776 536557 455780 203486 309137 537869 146074 -509809
15287 -509809 -178387 128874 259082 214106 70434 196708 150895 56280 64198 -34154 137291
15276 137291 218799 138769 -98302 -87190 -58889 -185703 -227578 -96385 -47306 -21385 -13236
15265 -13236 -259144 -328652 -592229 -602579 -351118 -26043 116591 -283418 -641388 -540456
15255e40456K36559Q6571J19165M1062K84607j9489j6441J08930k42345J01571
15245A59734j69352l24407K32046J49175k57402q9368J5971j8492n20230J87137
15235f35188L91156M99389R2275j44802j06728l8021J87532j92701k03764J16006
15225c4846R070q1154j62298l9668M9467L7408J90143J52352k48295j56758j9579
15214c04158K25299J26262j75298k2327J05695M4510K07759J35092j45432q8172
15204A09230j37238N5498k59881L0282P1662k35607j78263R9926J95957J10943
15194a37491o7060O253K42050J10298j19445k49887M8882J52838k92406k10592
15184e16560L17424L24417J18951J0365M073j95629m75650J85895J43094J21360
$$ plain form
15255 -540456 -303897 -217326 -98161 -57099 227508 208019 191578 300508 58163 159734
15245 159734 -9618 -334025 -101979 47196 -210206 -299574 -283603 -302095 -822325 -635188
15235 -635188 -244032 255357 347632 202830 96102 58081 245613 52912 -150852 -34846
15225 -34846 -25776 -106930 -269228 -308896 -259429 -222021 -31878 120474 -127821 -284579 -304158
15214 -304158 -78859 47403 -127895 -150222 -44527 -17 207742 342834 197402 109230
15204 109230 -28008 27490 -232391 -202109 -130447 -366054 -544317 -444391 -248434 -137491
15194 -137491 -204551 -198298 43752 154050 34605 -215282 -166400 -13562 -305968 -516560
15184 -516560 -199136 125281 244232 254597 258670 63041 -412609 -226714 -83620 37740
15174C7740j20317l01801k31630K06074L8585J3767L00966o143r2631r2319m613
15163b52322O8623L28489L74032K7314k02528k63664J0996m1937j31381k48337
15153c30715N7625j11991o1158P9293L83495j6085k78502q2327L59122J96134
15143A94891j86471j57659J0409L01249l4798K04580J07474k96559K6358J83234
15133C52708R370j8305k91390r8974l5396k86950K06863M10936O012k87873m7731
15122h0730J22699J5501N9205K0397J67626r1212k63442p7890l7265J48669j10174
15111a26616P5720j78496J48306J30734j18733o2031j2667j67988K94768Q7093
15101G0090q2701j17723K7629L18055m4642J21711j71695k0453L51166l7991l16718
$$ plain form
15174 37740 -82577 -384378 -616008 -409934 -371349 -357582 -56616 -62759 -155390 -247709 -252322
15163 -252322 -183699 144790 518822 546136 343608 79944 90940 49003 -82378 -330715
15153 -330715 -273090 -385081 -446239 -366946 16549 464 -278038 -360365 -1243 194891
15143 194891 8420 -149239 -138830 162419 127621 332201 439675 143116 169474 352708
15133 352708 362078 343773 52383 -46591 -81987 -368937 -162074 248862 254874 -32999 -80730
15122 -80730 41969 57470 116675 137072 304698 213486 -49956 -127846 -165111 -16442 -126616
15111 -126616 -50896 -229392 -81086 49648 -69085 -131116 -143783 -311771 -17003 70090
15101 70090 -12611 -130334 -102705 215350 170708 292419 120724 100271 451437 413446 96728
15090I6728r7686K32948j85251R275K22089J12175k76966j82452j45452Q5887
15080a28705J29582K92584L53621j11449l23826j63473O3103J22856J57963K1857
15070D14113j50835n4584k36116J16777O49J09937M5721m0899l8275p5505K92905
15059C83888J52248K2094N9122J00067k17733m08172M7202n5509j01836j96841
15049b15470J18861L5703L3025K99j51579k95482l1929K34333J63523k2314j56437
15038b87467J64269J76004J51150J73521n6376j16574Q2348q7095J84457J40846
15028E25083j19409n45943l4223J76195O1054k17790J69258J26606o8388l01673
15018b29230m1810L86706k9665j10718j5999m1811j53047p3335J42168q6358j81795
$$ plain form
15090 96728 -958 231990 46739 56014 278103 390278 113312 -69140 -214592 -128705
15080 -128705 877 293461 647082 535633 211807 48334 111437 234293 392256 414113
15070 414113 263278 208694 -27422 89355 90004 199941 245662 204763 166488 90983 383888
15059 383888 536136 558230 617352 717419 499686 91514 138716 83207 -18629 -215470
15049 -215470 -96609 -60906 -27881 -27582 -179161 -474643 -506572 -272239 -108716 -131030 -287467
15038 -287467 -123198 52806 203956 377477 321101 204527 286875 199780 384237 525083
15028 525083 405674 -140269 -174492 1703 62757 -155033 14225 140831 72443 -229230
15018 -229230 -271040 115666 86001 -24717 -40716 -82527 -235574 -308909 -166741 -253099 -434894
15007d34894p602L42643J37838J37681j37508K8971k2747M7315J25994L9202j55224
14996A01669P8242J47906j03527k36630j74958j49071O6271k8467N4472L42219
14986I8126j49161p1532J65216p3648q974K02895k51110j9182L28903K06627k08038
14975B20122j78788L3401j72354n7756Q0470M3002J29967J44224r5464n0053J1984
14964A08755j89035p867m9108R8606Q1474j75685j13555p6845K10067J69304j32839
14953g6728J47604J17240l3009p3698j73610j05759p4066Q9632K32692l8796m1403
14942b9901K09621p0667p3808J3353k66993J37438Q9298o5660K5692o7021R6935
14931a713j05301j30565m8659K17563K34719m0192r3579J0051K4558j70224k73305
$$ plain form
15007 -434894 -442496 -99853 37985 175666 38158 67129 44382 91697 217691 256893 101669
14996 101669 179911 327817 224290 -12340 -187298 -336369 -270098 -298565 -244093 98126
14986 98126 -51035 -122567 42649 -30999 -39973 162922 -88188 -107370 221533 428160 220122
14975 220122 41334 74735 -97619 -155375 -74905 -31903 98064 242288 146824 96771 108755
14964 108755 -80280 -88147 -137255 -38649 42825 -132860 -246415 -323260 -113193 56111 -76728
14953 -76728 70876 188116 155107 81409 -92201 -197960 -272026 -182394 50298 11502 -29901
14942 -29901 179720 109053 35245 48598 -218395 -80957 8341 -57319 -31627 -98648 -1713
14931 -1713 -107014 -237579 -286238 -68675 166044 125852 32273 42324 66882 -103342 -376647
14920c76647J48109K8399K13676j02611k42258J38921J01782o3352j40058K07659
14910h6380M10q5139J71142J23141L42342l1869k8990j02017j12790k1031k11548
14899d2729j82621j01055m3452q0203L1562K30395J56337M1942R201J55757J83725
14888C58859J93686r56o5292j15661p7884n4278j48379j59962J6289o2786p2775
14877a89139L8760L2284J68986j70463o9091m1883o9857j14639L51715L03213
14867B39886o7259j31914J44069K06444m20q3362l12809l04743O7792K52446N798
14856A5928p514j59416j32413K83945L24489J01622K5786O388j62142k22224j50889
14845g6440j42575N0395K8122K04411K9433l51988M762K62091L15863N433q4669
$$ plain form
14920 -376647 -228538 -200139 13537 -89074 -331332 -192411 -90629 -153981 -294039 -86380
14910 -86380 -85970 -171109 33 123174 465516 433647 404657 302640 189850 168819 -42729
14899 -42729 -225350 -326405 -369857 -450060 -418498 -188103 -31766 10176 19377 175134 358859
14888 358859 552545 551589 486297 370636 292752 238474 90095 -69867 -53578 -116364 -189139
14877 -189139 -150379 -118095 50891 -119572 -188663 -230546 -300403 -415042 -63327 239886
14867 239886 172627 40713 184782 391226 390806 307444 -5365 -310108 -242316 10130 15928
14856 15928 8414 -151002 -283415 530 325019 426641 452427 458815 296673 74449 -76440
14845 -76440 -219015 -168620 -140498 63913 93346 -258642 -253880 8211 324074 329507 244838
14834B44838m68576N9910J00294l3402J94405K191p7041J60419Q6818K9330J18643
14823D17829J18824k07076j73902P2298n5642l6764O6340j05856Q3800J4564O592
14812B01007l2106k72594J85792P6985R4561j11008k01335k8572l39724l5406
14802d62400K95750L36996J04124q4892k93495p7276J48975K46164l4908J6766
14792A95804k31558j19970J18620j2632L12793J95240K9030o1834j58057q0082
14782A87354j65338r2020l7271K95750o4067L856j53990K15672J36746l26795
14772a03k92740O3047M00742L14018j2948k69182n0843J7814L28818n2874Q0690
14761E26439l9817r0288J40232O9428j26614q8048m60255j7126J60235j38924
$$ plain form
14834 244838 -223738 -163828 -63534 -96936 97469 99660 22619 183038 269856 299186 417829
14823 417829 536653 329577 155675 227973 172331 135567 201907 96051 179851 194415 201007
14812 201007 168901 -103693 82099 159084 253645 142637 -58698 -87270 -426994 -462400
14802 -462400 -166650 170346 274470 189578 -103917 -181193 -32218 213946 179038 195804
14792 195804 -35754 -155724 -37104 -49736 263057 458297 487327 425493 267436 187354
14782 187354 22016 -70004 -107275 188475 124408 128264 -25726 189946 326692 -103
14772 -103 -292843 -229796 170946 484964 472016 202834 151991 169805 498623 445749 526439
14761 526439 486622 396334 536566 605994 479380 391332 -68923 -86049 74186 -64738
14751f4738O084j54454r4009J25013k8280K39757K00661J49363l39159n7190n6943
14740g3895M1604n5739J4672l14105J81445K36357j1453p7090J06635k41894j50850
14729c44313K98703K93617j96274p9780M3332p9325q159l1513j8938O4841J40128
14718H2319K07539J38108J4487P9313j50406k53065p0389n6585m1904n3629O82
14707a03530J39905J34991j81372j27242k852L5667l8823N9466J14813k2729l4971
14696b6677m4653m0964J12667K71221j74472l384p858j19459K36288j30698k90508
14685b18497J5770j29063k5989K86448l1960k4308J0556K14795O4336o1570K9051
14674A29569n1630j64817R9088q3001j27934j81194J28624K57039M51108p1557
$$ plain form
14751 -64738 -58654 -213108 -307117 -182104 -210384 29373 230034 379397 40238 -16952 -73895
14740 -73895 -32291 -88030 -73358 -387463 -206018 30339 18886 -58204 48431 -193463 -344313
14729 -344313 -45610 248007 51733 -28047 15285 -64040 -72199 -103712 -122650 -57809 82319
14718 82319 289858 427966 442453 521766 371360 118295 47906 -8679 -50583 -104212 -103530
14707 -103530 36375 171366 -10006 -137248 -140100 -104433 -143256 -83790 31023 8294 -26677
14696 -26677 -71330 -112294 373 271594 97122 93738 85880 -33579 202709 72011 -218497
14685 -218497 -202727 -331790 -357779 -71331 -103291 -127599 -117043 97752 162088 100518 129569
14674 129569 77939 -86878 12210 -70791 -198725 -379919 -251295 5744 456852 385295
14664C85295j53757J36361r2472Q1981j83181j49397j71040N6753K60099M7211
14654B17853k49547j37173J17032q8184L22691j59754j89248J5579K90282J376
14644A40907k19854j08526J84219r7608J86844Q257l9465O783j29884k7344l2535
14633a28206p8990N8167J58483k65549k2114K71658J04220k48564M3290Q8285
14623a9320Q6002p07M1401R2667q7082R064P7181k05834J7623L80494L18112k31648
14611D77953j13048J92496j15761k33449l547p9901n8003k26283O7023j05819
14601a98339n3718J80910L34826o7731k185n8921n4995k44k01097N4223J49936
14590H2665k0933l19140q5613K86795J69892j11275m79377k58444K01438N43034
$$ plain form
14664 385295 231538 367899 275427 357408 174227 24830 -146210 -89457 170642 217853
14654 217853 -31694 -168867 -51835 -140019 182672 22918 -166330 -150751 139531 140907
14644 140907 -78947 -187473 -3254 -100862 85982 94239 54774 61557 -68327 -95671 -128206
14633 -128206 -207196 -149029 9454 -256095 -278209 -6551 97669 -150895 -107605 -19320
14623 -19320 66682 65975 107376 200043 112961 122025 199206 -6628 10995 391489 709601 477953
14611 477953 364905 557401 441640 208191 204644 124743 66740 -159543 -92520 -198339
14601 -198339 -252057 -71147 263679 195948 193763 134842 79847 79603 -121494 -67271 82665
14590 82665 61732 -257408 -343021 -56226 113666 2391 -476986 -735430 -533992 9042
14580I042J54580o5511K63215K8058r6310J07193R0177n8426j18953j29615l2925
14569A50525N0317j23098k1346n4950k32801K56592J89928k08905N6935Q0001
14559A43198k87578j53002J5497L4638Q3522k6200M5245J34228K23335M157p9847
14548A37193n14j91886j0172k1012j06278k07856Q9916J65094J69963K5081J82062
14537B31591k38961j29099K1807M0451j1291j29955K28407J60019o9479j82213
14527g8723O7282Q2043o0202l15446l35712J36699J16718K17892J56204P5601
14517F2356P0860J13672K26713j09921j52281l6222M6037K01471K2196j18552
14507C26329R9137k12211l8780j6919K72040J69656J92507l309n5242j98653k34468
$$ plain form
14580 9042 163622 98111 361326 389384 293074 400267 490444 432018 313065 183450 150525
14569 150525 200842 77744 56398 1448 -231353 25239 215167 6262 63197 143198
14559 143198 -144380 -297382 -281885 -247247 -163725 -189925 -144680 -10452 212883 217040 137193
14548 137193 136679 -55207 -65379 -86391 -192669 -400525 -310609 -145515 24448 49529 231591
14537 231591 -7370 -136469 -114662 -74211 -85502 -215457 12950 172969 103490 -78723
14527 -78723 -11441 70602 10400 -305046 -640758 -504059 -387341 -169449 -13245 62356
14517 62356 133216 246888 473601 363680 211399 175177 221214 422685 444881 326329
14507 326329 425466 213255 174475 157556 429596 599252 791759 788450 733208 534555 300087
14496C00087L7191r1483k01189M5346L00535K63416L7909q1845k49895m03895
14486d3823R4645J9655j46286o1213J01072J8607N8158J4659j51199j03167R3245
14475a05647K59307L2512k56899Q5916j45744M8590J8522M4455j23045r2021o8341
14464c02395J77809J34196K48645M8519J60511j20791l25036l08567j54307k9592
14454d71008O9249K43297K35893J26316j16303r0298l2332j12648K28511M2578
14444A23255j5653J1261k5710J42833k59267k10811O9864J81489K99587k29691
14434H7157j12854K2787k23457q3067J99012r2813N887J72109J72761M25074J13698
14423F86294k34652m04890p0958K0185Q1759J4684j1724J81027k28736k05181
$$ plain form
14496 300087 337278 245795 44606 89952 390487 653903 691812 609967 360072 -43823
14486 -43823 50822 70477 -75809 -137022 -35950 -17343 40815 55474 -95725 -198892 -105647
14475 -105647 153660 186172 -70727 15189 -130555 -81965 -63443 -18988 -142033 -234054 -302395
14464 -302395 -124586 9610 258255 306774 467285 346494 21458 -287109 -441416 -471008
14454 -471008 -401759 -158462 77431 203747 87444 -2854 -35186 -147834 80677 123255
14444 123255 107602 118863 93153 235986 -23281 -234092 -164228 17261 316848 87157
14434 87157 -25697 -2910 -226367 -309434 -110422 -203235 -197348 -25239 147522 572596 686294
14423 686294 451642 46752 -24206 -4021 77738 92422 80698 261725 32989 -172192
14413a72192j77231n1154K28502J69292K77930j18614J35547K67299l7264k14355
14403C07760j47365K319K27206n0578j90003L4928j09401j7319J61870o2546n0415
14392A06456M5178J15416J97913r1328m05890j80304K02166J92840M1435k95576
14382g1694j31337o4032M1951J36175K79161J68316k99012k72760O0960L78167
14372B25895j89883j30320j8137J53873J65282m17249j89178R4214J02193K9674
14362a73636L2997m11583k93560J98471K35354n3509K6412J69141l5265J82144
14352a23034n9619J02189J59236j72415o6833j41083j48898K65024J24217J15113
14342E3897K82994K08956l90044k07930j07496J63N0194J14136o5499p8766J14127
$$ plain form
14413 -172192 -349423 -400577 -172075 -2783 275147 156533 292080 559379 522115 307760
14403 307760 160395 162714 389920 339342 149339 184267 74866 57547 219417 156871 106456
14392 106456 151634 267050 464963 373635 -32255 -212559 -10393 182447 223882 -71694
14382 -71694 -203031 -267063 -225112 -88937 190224 358540 59528 -213232 -152272 225895
14372 225895 36012 -94308 -112445 41428 206710 -210539 -399717 -305503 -203310 -173636
14362 -173636 -140639 -552222 -845782 -647311 -411957 -465466 -439054 -269913 -305178 -123034
14352 -123034 -182653 -80464 78772 -93643 -160476 -301559 -450457 -185433 -61216 53897
14342 53897 336891 545847 155803 -52127 -159623 -159460 -109266 4870 -60629 -139395 -25268
14331b5268N4254R7510p0553k67335N843J31455j93919k43645k10392K62785J38812
14320c20453J7598J84192j0186J179K49401K05998k71886L2064Q6519j94260m3744
14309f3578J11470L7757j82835q6270L21747J07180k39209j57047k25954J03276
14299b73463N6241J20329M5929K24028Q5016n0993K6933M5513j0987j46689k93371
14288a71514Q9773J90327K88162J7209j12745j0827l61487Q1653M7609J35285
14278A93445O8115k38155j0462o6549N0105o3395r1853M32801J18721l66543k07563
14267a81333n5716J62825j98157j73960j74150N1443J34654q6835N2549K03583
14257b65097P6089j56661J05840L39300j63121J56642L83251j41343k26191n4454
$$ plain form
14331 -25268 28986 126496 55943 -211392 -205549 -74094 -268013 -511658 -722050 -459265 -320453
14320 -320453 -302855 -118663 -128849 -127670 121731 327729 55843 87907 174426 -19834 -63578
14309 -63578 47892 85649 -97186 -183456 138291 245471 6262 -150785 -376739 -273463
14299 -273463 -217222 -96893 -50964 173064 258080 207087 234020 279533 268546 121857 -171514
14288 -171514 -81741 108586 396748 413957 301212 290385 -71102 10551 58160 193445
14278 193445 261560 23405 12943 -53606 -3501 -66896 -158749 274052 392773 26230 -181333
14267 -181333 -237049 -74224 -272381 -446341 -620491 -569048 -434394 -521229 -468680 -265097
14257 -265097 -189008 -345669 -239829 99471 -63650 92992 476243 334900 108709 54255
14247E4255O4343j9512N6401J03682K51421k06519k91200o0318j04537K88244
14237A36260K29045j61214o7254j30004j09674L3069K04086J14619n8614l96081
14227b05762k39893M9722k61142r8474K7224L08792L09268J43200p9256O1391
14217A5070L17361J80159P0864k53914p6224P224k21104p1324K12022j65329q7739
14206g2934l0549K5098J77624k94448P571K91083J65166r2874J55688j76088j75403
14195b0066P2088k46836j35071q3993O4886P9314r9244q676K42886J01636L98707
$$ plain form
14247 54255 118598 99086 155487 259169 510590 304071 12871 -47447 -151984 136260
14237 136260 365305 204091 136837 6833 -102841 -69772 134314 248933 190319 -205762
14227 -205762 -445655 -395933 -657075 -755549 -728325 -419533 -110265 32935 -46321 15070
14217 15070 332431 512590 583454 329540 253316 260540 39436 -31888 180134 14805 -72934
14206 -72934 -103483 -78385 99239 -195209 -187638 103445 268611 175737 331425 155337 -20066
14195 -20066 52022 -194814 -329885 -413878 -348992 -269678 -368922 -377598 -134712 -33076 365631
$$ [...]
##END NTUPLES=NMR SPECTRUM
##END=
