##TITLE=Analysis number 322176
Compound Code cc 41201
Book Reference 505/4
Project Code adrs
Chemist Name robb
##JCAMPDX= 6.0         $$ Bruker NMR JCAMP-DX V2.0
##DATA TYPE= NMR SPECTRUM
##DATA CLASS= NTUPLES
##ORIGIN= Bruker BioSpin GmbH
##OWNER= nmr
$$ XWIN-NMR		Version 3.5
$$ Fri Sep 15 10:57:38 2006 GMT Daylight Time (UT+1h)  MAYBRIDGE\nmr@NMR_250MHZ
##.OBSERVE FREQUENCY= 250.131544655141
##.OBSERVE NUCLEUS= ^1H
##.ACQUISITION MODE= SIMULTANEOUS (DQD)
##.ACQUISITION SCHEME= undefined
##.AVERAGES= 16
##.DIGITISER RES= 18
##SPECTROMETER/DATA SYSTEM= dpx250
##.PULSE SEQUENCE= zg30
##.SOLVENT NAME= CDCl3
##.SHIFT REFERENCE= (INTERNAL, CDCl3, 0, 16.522)
##AUDIT TRAIL= $$ (NUMBER, WHEN, WHO, WHERE, WHAT)
$$ ##TITLE= Audit trail, XWIN-NMR		Version 3.5
$$ ##JCAMPDX= 5.01
$$ ##ORIGIN= Bruker BioSpin GmbH
$$ ##OWNER= nmr
$$ C:\u/data/dgb/nmr/ADRS/780/pdata/1/auditp.txt
$$ ##AUDIT TRAIL=  $$ (NUMBER, WHEN, WHO, WHERE, WHAT)
(   1,<2006-09-15 10:57:11.71 +100>,<MAYBRIDGE\nmr>,<NMR_250MHZ>,
      <created by zg, POWCHK disabled, PULCHK disabled
       configuration hash MD5:
       E2 DF 36 D8 04 B2 41 60 5A D7 A3 38 5A 4B D0 FE
       data hash MD5: 64K
       7B 2E 2A C5 44 34 A1 C5 36 E6 A7 11 8A F2 9B D8>)
(   2,<2006-09-15 10:57:27.43 +100>,<MAYBRIDGE\nmr>,<NMR_250MHZ>,
      <Start of raw data processing
       ef LB = 0.3 FT_mod = 6 PKNL = 1 SI = 32K 
       data hash MD5: 32K
       0B 89 51 FE 12 3E EC 4C 1F EF 7A AC 40 B1 E3 21>)
(   3,<2006-09-15 10:57:29.21 +100>,<MAYBRIDGE\nmr>,<NMR_250MHZ>,
      <apk 
       data hash MD5: 32K
       68 1B 7B C0 BE 4D 71 64 5C 83 16 1B 61 9F FD DF>)
(   4,<2006-09-15 10:57:30.13 +100>,<MAYBRIDGE\nmr>,<NMR_250MHZ>,
      <abs ABSG = 5 
       data hash MD5: 32K
       F2 3E 0D 7F 7E CC CC F4 61 36 3E 3C 44 1E 6A E1>)
$$ ##END=
$$ 
$$ hash MD5
$$ 49 44 39 C5 1A 69 E2 51 24 4B 1C 03 F2 DA C6 66
##$RELAX= 
##$RELAX= 
##$RELAX= 
##$RELAX= 
##$RELAX= 
##$RELAX= 
##$RELAX= 
$$ Bruker specific parameters
$$ --------------------------
##$DU= <C:\u>
##$EXPNO= 780
##$NAME= <ADRS>
##$PROCNO= 1
##$TYPE= <nmr>
##$USER= <dgb>
##$AMP= (0..31)
100 100 100 100 100 100 100 100 100 100 100 100 100 100 100 100 100 100 
100 100 100 100 100 100 100 100 100 100 100 100 100 100 
##$AQSEQ= 0
##$AQ_mod= 3
##$AUNM= <au_zg>
##$AUTOPOS= <42 >
##$BF1= 250.13
##$BF2= 250.13
##$BF3= 250.13
##$BF4= 250.13
##$BF5= 500.13
##$BF6= 500.13
##$BF7= 500.13
##$BF8= 500.13
##$BYTORDA= 1
##$CFDGTYP= 0
##$CFRGTYP= 5
##$CHEMSTR= <none>
##$CNST= (0..31)
1 1 145 1 1 1 1 1 1 1 1 1 1 1 1 1 1 1 1 1 1 1 1 1 1 1 1 1 1 1 1 1 
##$CPDPRG= <>
##$CPDPRG1= <>
##$CPDPRG2= <>
##$CPDPRG3= <>
##$CPDPRG4= <mlev>
##$CPDPRG5= <mlev>
##$CPDPRG6= <mlev>
##$CPDPRG7= <mlev>
##$CPDPRG8= <mlev>
##$CPDPRGB= <>
##$CPDPRGT= <>
##$D= (0..31)
0 1 0 0 0 0 0 0 0 0.06 0 0 0 0 0 0 0.0002 0 0 0 0 0 0 0 0 0 0 0 0 0 0 
0 
##$DATE= 1158314230
##$DBL= (0..7)
120 120 120 120 120 120 120 120 
##$DBP= (0..7)
150 150 150 150 150 150 150 150 
##$DBP07= 0
##$DBPNAM0= <>
##$DBPNAM1= <>
$$ [...]
##$SUBNAM7= <"">
##$SUBNAM8= <"">
##$SUBNAM9= <"">
##$SW= 20.6930455092707
##$SWIBOX= (0..15)
0 0 3 0 0 0 0 0 0 0 0 0 0 0 0 0 
##$SW_h= 5175.983436853
##$TD= 65536
##$TD0= 1
##$TE= 295.16
##$TE2= 300
##$TE3= 300
##$TEG= 300
##$TL= (0..7)
0 120 120 120 120 120 120 120 
##$TP= (0..7)
150 150 150 150 150 150 150 150 
##$TP07= 0
##$TPNAME0= <>
##$TPNAME1= <>
##$TPNAME2= <>
##$TPNAME3= <>
##$TPNAME4= <>
##$TPNAME5= <>
##$TPNAME6= <>
##$TPNAME7= <>
##$TPOAL= (0..7)
0.5 0.5 0.5 0.5 0.5 0.5 0.5 0.5 
##$TPOFFS= (0..7)
0 0 0 0 0 0 0 0 
##$TUNHIN= 0
##$TUNHOUT= 0
##$TUNXOUT= 0
##$USERA1= <user>
##$USERA2= <user>
##$USERA3= <user>
##$USERA4= <user>
##$USERA5= <user>
##$V9= 5
##$VALIST= <valist>
##$VCLIST= <CCCCCCCCCCCCCCC>
##$VD= 0
##$VDLIST= <DDDDDDDDDDDDDDD>
##$VPLIST= <PPPPPPPPPPPPPPP>
##$VTLIST= <TTTTTTTTTTTTTTT>
##$WBST= 1024
##$WBSW= 4
##$XGAIN= (0..3)
0 0 0 0 
##$XL= 0
##$YL= 0
##$YMAX_a= 321442
##$YMIN_a= -373307
##$ZGOPTNS= <>
##$ZL1= 120
##$ZL2= 120
##$ZL3= 120
##$ZL4= 120
##$ABSF1= 16.522
##$ABSF2= -4.171173
##$ABSG= 5
##$ABSL= 3
##$ALPHA= 0
##$AQORDER= 0
##$ASSFAC= 0
##$ASSFACI= 0
##$ASSFACX= 0
##$ASSWID= 0
##$AUNMP= <proc_1d>
##$AZFE= 0.1
##$AZFW= 0.1
##$BCFW= 0
##$BC_mod= 0
##$BYTORDP= 0
##$COROFFS= 0
##$CY= 12.5
##$DATMOD= 1
##$DC= 0
##$DFILT= <>
##$DTYPP= 0
##$F1P= 14.0000005364418
##$F2P= -0.99999901652339
##$FCOR= 0.5
##$FTSIZE= 32768
##$FT_mod= 6
##$GAMMA= 0
##$GB= 0
##$INTBC= 1
##$INTSCL= 1
##$ISEN= 128
##$LB= 0.3
##$LEV0= 0
##$LPBIN= 0
##$MAXI= 10000
##$MC2= 0
##$MEAN= 0
##$ME_mod= 0
##$MI= 0
##$NCOEF= 0
##$NC_proc= -6
##$NLEV= 6
##$NOISF1= 0
##$NOISF2= 0
##$NSP= 0
##$NTH_PI= 0
##$NZP= 0
##$OFFSET= 16.522
##$PC= 1
##$PHC0= 145.5684
##$PHC1= 6.461371
##$PH_mod= 1
##$PKNL= yes
##$PPARMOD= 0
##$PSCAL= 4
##$PSIGN= 0
##$REVERSE= no
##$SF= 250.13
##$SI= 32768
##$SIGF1= 0
##$SIGF2= 0
##$SINO= 400
##$SIOLD= 32768
##$SREGLST= <1H.CDCl3>
##$SSB= 0
##$STSI= 32768
##$STSR= 0
##$SW_p= 5175.98343685301
##$SYMM= 0
##$S_DEV= 0
##$TDeff= 65536
##$TDoff= 0
##$TI= <Analysis number 999999
Compound Code 99
Book Reference 9
Project Code 9>
##$TILT= no
##$TM1= 0
##$TM2= 0
##$TOPLEV= 0
##$USERP1= <user>
##$USERP2= <user>
##$USERP3= <user>
##$USERP4= <user>
##$USERP5= <user>
##$WDW= 1
##$XDIM= 32768
##$YMAX_p= 436086020
##$YMIN_p= -419942
$$ End of Bruker specific parameters
$$ ---------------------------------
##NTUPLES= NMR SPECTRUM
##VAR_NAME=  FREQUENCY,     SPECTRUM/REAL,   SPECTRUM/IMAG
##SYMBOL=    X,             R,               I
##VAR_TYPE=  INDEPENDENT,   DEPENDENT,       DEPENDENT
##VAR_FORM=  AFFN,          ASDF,            ASDF
##VAR_DIM=   32768,         32768,           32768
##UNITS=     HZ,            ARBITRARY UNITS, ARBITRARY UNITS
##FACTOR=    0.157963299565203, 1,           1
##FIRST=     4132.6476996994, 0,             0
##LAST=      -1043.33573715361, 0,           0
##MIN=       -1043.33573715361, -419942,     0
##MAX=       4132.6476996994, 436086020,     0
$$ Real data points
##PAGE= N=1
##DATA TABLE= (X++(R..R)), XYDATA
$$ [...]
14004G5169K6114P9892m2893L1685L2277M4036m7080r6756p3829l0821L2528k2056
13992H266K8577m5382J2371L2942j0349Q9776m3631n4303k1884K3866j5714j1798
13980g263q8396M5369L3011J14141O4114O0019L620q1652l2123q1868J1952O4345
13968A05269n831J8307L0111j9100K9226J224n9226l8141L8199n1042p3793J30917
13956A06120N8542m7827L7166Q0737O4985k8128q07l0566J9846Q4631p3411q9025
13944A82263m1345q4171O5749M5434P989r4176p7877N7919N0544m7161M5441J37874
13932B48483K5197J2436l3957o1393q6944O0813J48163L5989l3888J6145N444
13921C36488j82599q4491Q4248p4179r845m6049J22735J46863k7158j1542J3445
$$ y = [75169, 101283, 181175, 138282, 169967, 202244, 246280, 199200, 102444, 28615, -2206, 30322, 8266, 36843, -8539, 3832, 36774, 26425, 116201, 72570, 18267, -3617, 20249, 4535, -7263, -95659, -50290, -17279, 96862, 160976, 220995, 224615, 142963, 110840, 28972, 40924, 105269, 99438, 117745, 147856, 128756, 157982, 159206, 99980, 61839, 100038, 48996, -24797, 106120, 164662, 116835, 154001, 234738, 299723, 271595, 270788, 240222, 260068, 344699, 271288, 182263, 140918, 56747, 122496, 167930, 175919, 81743, 3866, 61785, 112329, 65168, 110609, 248483, 273680, 286116, 252159, 190766, 103822, 164635, 312798, 348787, 314899, 331044, 336488, 153889, 69398, 153646, 79467, 69622, 23573, 146308, 293171, 266013, 254471, 267916]
13910B67916n0264L3389p1216M8102m4707K4032Q3075m4023r3739q5471O3528
13899A30622m3578P116Q3706R5746n1432j10161P5911N0957l2864J1594N733L7316
13887B60666N6611l9224r1453L1665M2572j877M2473k4817r2342l4357M9814M64
13875B00195J7331j2960j3229k9001p5966j676P829J2350j3144N2385P4318N2977
13863B71409j7813m8339N5129N1224p053k5464J81170l2043o0286Q2580O8892
13852E19406n8376O844p4684k9452J8422M7003N774p9400l9295L5169J75107k3677
13840E02841j38292J9694q5833m863N1338O4223K956j4835J1519M3575j9308k6148
13828D06867J8818O6764j26512j44825k1738L7954q646k685K1915k1491M8814
$$ y = [267916, 217652, 251041, 179825, 227927, 183220, 207252, 290327, 246304, 152565, 67094, 130622, 87044, 94160, 177866, 273612, 222180, 112019, 187930, 238887, 206023, 217617, 223350, 260666, 317277, 278053, 186600, 218265, 260837, 258960, 301433, 276616, 184274, 149917, 199731, 200195, 217526, 204566, 191337, 162336, 86370, 84694, 92523, 104873, 91729, 144114, 218432, 271409, 253596, 205257, 260386, 311610, 304557, 279093, 460263, 428220, 367934, 450514, 519406, 461030, 467874, 393190, 363738, 382160, 429163, 434937, 355537, 316242, 351411, 526518, 502841, 364549, 384243, 298410, 293547, 344885, 409108, 412064, 397229, 408748, 452323, 433015, 406867, 425685, 492449, 365937, 221112, 199374, 237328, 228682, 225997, 247912, 226421, 275235]
13817B75235l5418K4574M8808j9291o4723K128J45786j03102r7416J08008J6808
13806C01397Q379P4868j07137j34599j9451n291m5072M3192J8118l4814J07336
13795B06926J64502n1199K1379N0828N517L5457o5062Q858o8593p7569k9659Q9327
13783B90712j94k6652N86J72088J61477L7580P842P6441K1949q127N6079J38964
13771I28745p0308j95751q6248m790L0290j13954p1830p3432j1726O1685J5914
13760D08595l5361r6332p0232Q3469M0141J7372n4593L6499n4254q8006M2757
13749B30055P7224J30252J04826N032J2203N9278o9334l5131J58566J35813M6910
13738H55694k8209J3223N640m8602p8076r6455L552P4217J12118r0660p0633J6826
$$ y = [275235, 239817, 264391, 313199, 293908, 229185, 231313, 377099, 273997, 176581, 284589, 301397, 309776, 384644, 277507, 142908, 123457, 118166, 73094, 116286, 134404, 99590, 206926, 371428, 320229, 341608, 392436, 397953, 433410, 368348, 377206, 308613, 231044, 201385, 290712, 290518, 263866, 264452, 436540, 598017, 635597, 643439, 719880, 741829, 733702, 789781, 928745, 858437, 662686, 576438, 571648, 601938, 487984, 416154, 342722, 330996, 392681, 408595, 373234, 276902, 206670, 290139, 330280, 347652, 293059, 329558, 275304, 187298, 230055, 307279, 437531, 542357, 547389, 559592, 618870, 549536, 514405, 672971, 808784, 855694, 827485, 840708, 846348, 797746, 719670, 623215, 626767, 700984, 813102, 722442, 651809, 668635]
13726F68635Q7079j1608J4986J29240J2841j04580O72P0270M2575N8083n4032
13715I14161O968k6423r5466j03923j571N2096m9611j45223j42492l6578j9054
13704C52884n099l6543O7823J9847k9058n4908L1626P7985J7552Q9101P6383K7112
13692F34705K3670j2890P4978J41537J33595L8702j1575Q9477j640j47890J8731
13681I81400m5717L1054M6943j97705j349j2801j23043p6807J903j6749N0170
13670F37299N4590m6977L0373Q0312N1953r5231l0049K0022m7155n256N5469l4375
13658F70975j15785n9590j5866j4244K721m0249n6083P634J47903L1334j03128
13647D55622p8001m8001P0903O1637N8346p7357q5347M1647P7603J17524J06923
$$ y = [668635, 755714, 744106, 759092, 888332, 901173, 796593, 797265, 867535, 910110, 968193, 914161, 921129, 894706, 799240, 695317, 693746, 745842, 696231, 551008, 408516, 371938, 352884, 347785, 311242, 379065, 398912, 369854, 314946, 346572, 424557, 442109, 531210, 607593, 634705, 658375, 645485, 720463, 862000, 995595, 1034297, 1022722, 1112199, 1110559, 962669, 981400, 935683, 966737, 1013680, 815975, 814626, 801825, 678782, 601975, 603878, 587129, 637299, 691889, 644912, 675285, 755597, 807550, 712319, 682270, 702292, 655137, 649881, 705350, 670975, 555190, 495600, 479734, 465490, 468211, 427962, 371879, 379513, 527416, 558750, 455622, 377621, 329620, 400523, 462160, 520506, 443149, 357802, 399449, 477052, 594576, 701499]
13636G01499K5718j1217l5454p582P8667M3787p8693j36412L1535j8105N810K1732
13624F21285L2183j14980N5736O5689K3984K598M6847K1462M2385J52955Q1840
13613A031984Q0298m4176n9258R7500L7417j2718o947n1742n2742k4406P204j35390
13601H67024k8359R5752N5859j12767q7525l9128R7908K05482K3650j03497k02637
13590G71762j24869J15838j0177o3038j0751N5355O8891K8373p4400q9503j4513
13579F52968j3089q268K0852K108J324K6510j09405M7993J3530j13704k9835J24183
13567F15167k2594r5097K4096J61450J0997j17877n6068J02539J78688M3014j01860
13556G42455m2171Q6110J50803P6208j6383J0923L2369j19715n0117K7492J0275
$$ y = [701499, 727217, 716000, 680546, 672964, 751631, 795418, 716725, 580313, 611848, 593743, 599553, 621285, 653468, 538488, 594224, 659913, 683897, 686495, 733342, 754804, 797189, 950144, 1031984, 1112282, 1068106, 1008848, 1106348, 1143765, 1131047, 1124100, 1072358, 1019616, 995210, 1002414, 867024, 838665, 934417, 990276, 877509, 789984, 750856, 848764, 1054246, 1077896, 974399, 771762, 646893, 762731, 752554, 689516, 678765, 734120, 803011, 831384, 756984, 667481, 652968, 639879, 631611, 652463, 654571, 655895, 682405, 573000, 620993, 634523, 520819, 490984, 615167, 592573, 497476, 521572, 683022, 694019, 576142, 520074, 622613, 801301, 844315, 742455, 700284, 786394, 937197, 1013405, 997022, 1007945, 1040314, 920599, 870482, 897974, 908249]
13545I08249Q5115j12695J8194O4422l8597P5648R1824K2987R3158K8276l3857
13534A202724L1005J06404J4479n8997n2734k0696M7832M6575J41445R1754P7670
13523A627461J07070J01401M0386l3914n0778j81471j81305j14643k2912k6958
13513A264337N0227j01790l2870k9184j53155r1895M7230j06n5193l7451J09843
13502I69993K6807J08537M6263q2970L0366P7230Q9368J04170L8979o3222J5407
13491A360928P1917Q7489M5256P9292o896L1741J26750J21994j21877k16878o7389
13480A512327J21428K9909n5061j70568j93091q0667j3474m4048q9069j46977
13470H70709p5573J10519R2252j9909m4526r049k1941O946q7301l1462J4006M5072
$$ y = [908249, 993364, 880669, 898863, 963285, 924688, 1000336, 1092160, 1115147, 1208305, 1236581, 1202724, 1233729, 1340133, 1354612, 1295615, 1242881, 1222185, 1270017, 1316592, 1458037, 1549791, 1627461, 1734531, 1835932, 1876318, 1842404, 1791626, 1610155, 1428850, 1314207, 1291295, 1264337, 1314564, 1212774, 1179904, 1150720, 997565, 905670, 952900, 952794, 897601, 860150, 969993, 996800, 1105337, 1151600, 1068630, 1098996, 1176226, 1265594, 1369764, 1408743, 1345521, 1360928, 1432845, 1520334, 1565590, 1644882, 1637986, 1669727, 1796477, 1918471, 1796594, 1579716, 1512327, 1633755, 1663664, 1608603, 1438035, 1244944, 1164277, 1150803, 1106755, 1017686, 870709, 795136, 905655, 997907, 977998, 933472, 924423, 902482, 909428, 822127, 790665, 804671, 849743]
13458H49743Q5648J18462P1764L7510K2277J31668J54966k0427j55606n6135N0820
13447A290690O8721q6084k06666j38174n6862L2395P6781j0683K323K1445J41711
13436A135597M3681J6510K687k3055k8701j98P9409j6552l3344p0585n3534K3453
13424A075368m2372O3959J44274L6628L3160J7021J04017j0661O6154P9823J59120
13413A726491R3525p9908r5864j19629J4305L3863L2273k5908j27217j14134N1911
13402A389708P1738j32094L2712J33730o1831p7724l1524o3882j11650p3849O4802
13391A140136k1174M486n1853K4795N8891P2022R0211P3k9221p1777N7226J48026
13379A421841M3093j3691K8181q1221q9255l3386J6034O5496Q5730J08605Q2061
$$ y = [849743, 935391, 1053853, 1125617, 1163127, 1185404, 1317072, 1472038, 1451611, 1296005, 1239870, 1290690, 1359411, 1273327, 1066661, 928487, 871625, 904020, 980801, 970118, 972441, 993886, 1135597, 1179278, 1195788, 1198475, 1175420, 1146719, 1146521, 1225930, 1209378, 1176034, 1105449, 1051915, 1075368, 1032996, 1096955, 1241229, 1277857, 1311017, 1328038, 1432055, 1421394, 1487548, 1567371, 1726491, 1820016, 1740108, 1644244, 1524615, 1538920, 1572783, 1605056, 1579148, 1451931, 1337797, 1389708, 1461446, 1329352, 1362064, 1495794, 1433963, 1356239, 1324715, 1260833, 1149183, 1075334, 1140136, 1118962, 1123448, 1071595, 1096390, 1155281, 1227303, 1317514, 1317587, 1288366, 1216589, 1273815, 1421841, 1464934, 1451243, 1479424, 1398203, 1308948, 1275562, 1291596, 1357092, 1442822, 1551427, 1633488]
13368A633488L4948N7481R1366J5734o1936K5675j34330N3635k2939q9212r8321
13357A505589l0637O6722J69616K5596j02137j17260j61861j4126R8553L8246
13347A478301o7653p9093p2044m4548k8331p6783J03361K0606n0205K4905P5059
13336A283575L0814j72660m8952J15017m50j7317M4740N2710K6438J0721m6412
13325A278224r439j1504j6213n8070o0498M1565k7372O5875J7379j03882n5354
13314A060711O4130J13382J32583J17609j9507m5461L161m3366j9563k4775l1575
13303A307329k2114q5840K8503q2500j85678O565O4313P176l7861Q9313P0277
13292A159483n9741M477j30374k7708O9621r7917n1277R359N2630J9054P2366
$$ y = [1633488, 1668436, 1725917, 1817283, 1833017, 1771081, 1796756, 1662426, 1716061, 1693122, 1603910, 1505589, 1474952, 1541674, 1711290, 1736886, 1634749, 1517489, 1355628, 1341502, 1440055, 1478301, 1410648, 1331555, 1259511, 1214963, 1186632, 1109849, 1213210, 1233816, 1183611, 1208516, 1283575, 1314389, 1141729, 1092777, 1207794, 1207344, 1190027, 1234767, 1287477, 1313915, 1324636, 1278224, 1268785, 1257281, 1241068, 1182998, 1122500, 1164065, 1136693, 1202568, 1219947, 1116065, 1060711, 1124841, 1238223, 1370806, 1488415, 1468908, 1423447, 1426608, 1383242, 1363679, 1338904, 1307329, 1285215, 1199375, 1227878, 1145378, 959700, 966265, 1030578, 1037754, 999893, 1089206, 1159483, 1099742, 1104219, 973845, 946137, 1015758, 917841, 866564, 875923, 928553, 947607, 1019973]
13281A019973Q8672J16572L4962j16375m0355j1642K750O7879L9674R6771L0378
13270A329259L9302L9331m0843J58408M2802K1811P3601N4454m4162j11457p5473
13259A487033N6064p0675K1855P2697J00356K0286M6355m4317M8345J17458k0936
13248A834521j03400n212R9570l4836m0355R158K9296j5614K4347R2632N7738
13237A947845J6645R7272O7166j203L7886R6820O1888K5023q5730o7938M1873
13226B237547P0036j8042P6659O2844O2485J99522j7057j6140J28190K4247O0584
13215B870875P3053L437n6256N2687k4493M4242J01952J96067R9790Q9220J35189
13204C585763k4400J47430J94017J89226M6516Q164J29675K07663J78690K03425
$$ y = [1019973, 1108645, 1225217, 1260179, 1143804, 1103449, 1091807, 1094557, 1162436, 1202110, 1298881, 1329259, 1368561, 1407892, 1367049, 1525457, 1568259, 1590070, 1663671, 1718125, 1673963, 1562506, 1487033, 1543097, 1472422, 1494277, 1566974, 1667330, 1687616, 1733971, 1689654, 1737999, 1855457, 1834521, 1731121, 1725909, 1825479, 1790643, 1750288, 1759446, 1788742, 1773128, 1797475, 1890107, 1947845, 1964490, 2061762, 2128928, 2127725, 2165611, 2262431, 2324319, 2349342, 2263612, 2195674, 2237547, 2307583, 2289541, 2366200, 2429044, 2491529, 2691051, 2673994, 2657854, 2786044, 2810291, 2870875, 2943928, 2947365, 2891109, 2943796, 2919303, 2963545, 3065497, 3261564, 3361354, 3450574, 3585763, 3561363, 3708793, 3902810, 4092036, 4138552, 4146716, 4276391, 4484054, 4662744, 4866169]
13194D866169J81982J10913P4746K72989K96394K61577L75501K97423L50082M11939
13184G499715N14967O93707P47206P08617R88214J299080J544775J869545K313045
13175A8178871K602214K936269L537989L977748M056381M039465M052308M122775
13167D7504020L932167L855286L711713L398020L548259L702801L863707L633452
13159G7149425L475020L427671L433101L170505K519708J760697J010768K23032
13151I6169927N0647K25704J125023K472805L669980M071545L735709K593383
13143A14114723J232505l10223j734140k746122l319823l198921k748833k185597
13135I9103569j644481j181944r53798r50798j118604j448795j997885k588567
$$ y = [4866169, 5048151, 5159064, 5233810, 5506799, 5803193, 6064770, 6440271, 6737694, 7087776, 7499715, 8014682, 8708389, 9455595, 10164212, 11152426, 12451506, 13996281, 15865826, 18178871, 20781085, 23717354, 27255343, 31233091, 35289472, 39328937, 43381245, 47504020, 51436187, 55291473, 59003186, 62401206, 65949465, 69652266, 73515973, 77149425, 80624445, 84052116, 87485217, 90655722, 93175430, 94936127, 95946895, 96169927, 96220574, 96446278, 97571301, 100044106, 103714086, 107785631, 111521340, 114114723, 115347228, 115037005, 113302865, 110556743, 107236920, 104037999, 101289166, 99103569, 97459088, 96277144, 95323346, 94372548, 93253944, 91805149, 89807264, 87218697]
13127H7218697l039737l320719l348702l249991l068643k734352k659590k991212
13119F2805751l778121m480346m588966m179021l616108l009723k567329k012080
13111C4574057j306581p58929k00807L09790Q84477J545664K119381K700171L120844
13102D2988067L599605L879942M060790M083349L499367K946232K377094K145033
13094F9579479J997350K099719K369832K720613L185130L634249M061322M350142
13086I3997836M591430M679768L911184K730320J739483J130268R09373R88933
13078A14678595J592325K723603M168098N289754N346066M567419K810873R14986
13070A42091719r90362l487809n775253p377990p581025o226373m381319k344330
$$ y = [87218697, 84178960, 80858241, 77509539, 74259548, 71190905, 68456553, 65796963, 62805751, 59027630, 54547284, 49958318, 45779297, 42163189, 39153466, 36586137, 34574057, 33267476, 32508547, 32307740, 32617530, 33502007, 35047671, 37167052, 39867223, 42988067, 46587672, 50467614, 54528404, 58611753, 62111120, 65057352, 67434446, 69579479, 71576829, 73676548, 76046380, 78766993, 81952123, 85586372, 89647694, 93997836, 98589266, 103269034, 107180218, 109910538, 111650021, 112780289, 113689662, 114678595, 116270920, 118994523, 123162621, 128452375, 133798441, 138365860, 141176733, 142091719, 141101357, 137613548, 131838295, 124460305, 116879280, 110652907, 106271588, 103927258]
13062A03927258q11281L75445J286928J679751J619985R76944j992j319536k953753
13053A04779749m429367n353253n561259n179872m441645l705913l305508l595954
13045F9206978l898855m099343m502320m649839m607766m219950l611243k805643
13037C6812019k111148j644031j294673j000503q01778p38003p01797n54820o38518
13028B7326748o77338n15250l07625l27619l83068m13364m40661n08434m78653
13019B3274736n02949n60954n86515l43944k17014j44506m870r5722j57747J07201
13009B0767716N4395J24382K94697L14688M14204O42684P90314J082475J529565
13000B6015120J883823K019309K094429K081208K353474K728498L155785L937940
$$ y = [103927258, 103115977, 103491422, 104778350, 106458101, 108078086, 109055030, 109053038, 107733502, 104779749, 100350382, 94997129, 89435870, 84255998, 79814353, 76108440, 72802932, 69206978, 65308123, 61208780, 56706460, 52056621, 47448855, 43228905, 39617662, 36812019, 34700871, 33056840, 31762167, 30761664, 29959886, 29221883, 28520086, 27965266, 27326748, 26649410, 26134160, 25826535, 25498916, 25115848, 24702484, 24261823, 23753389, 23274736, 22771787, 22210833, 21624318, 21280374, 21063360, 20918854, 20913984, 20818262, 20660515, 20767716, 20822111, 20946493, 21241190, 21555878, 21970082, 22612766, 23403080, 24485555, 26015120, 27898943, 29918252, 32012681, 34093889, 36447363, 39175861, 42331646, 46269586]
12992D6269586M726274N497036O042596O553617O898020O703542O103824M654596
12984I3449091K687696Q32087q96352j965979k344467j796553m18522J290024
12976I0837025K938829M595566N828189O631738O817251O512460O109652N173461
12968A35444171L595146J460080j165961l970244n964015o737019o451118n262752
12960A10948288l833251k831859k232241j832941j810117j862056j788875j579253
12952I3177695j394881j294083j330671j410963j619684j522509j254057q12727
12944H2538120l73232m04652m22125p75189j256047j568108j515560j344030j147073
12935G3732104q43082m16281K37350J000459J545621K181613K404269K826533
$$ y = [46269586, 50995860, 56492896, 62535492, 69089109, 75987129, 82690671, 88794495, 93449091, 96136787, 96968874, 96072522, 94106543, 91762076, 89965523, 89547001, 90837025, 93775854, 98371420, 104199609, 110831347, 117648598, 124161058, 130270710, 135444171, 139039317, 140499397, 139333436, 135363192, 129399177, 122662158, 116211040, 110948288, 107115037, 104283178, 102050937, 100217996, 98407879, 96545823, 94756948, 93177695, 91782814, 90488731, 89158060, 87747097, 86127413, 84604904, 83350847, 82538120, 82164888, 81760236, 81338111, 80562922, 79306875, 77738767, 76223207, 74879177, 73732104, 72889022, 72472741, 72710091, 73710550, 75256171, 77437784, 79842053, 82668586]
12927H2668586L197588L449330L430040L082896K723939K456270K521486K722920
12919A06253055K597004K413770K205917J770109P80745q29427k775937m077131
12911A08338105l803697k567387j088103M33786J999767L560520N089539N947328
12903A17909858N729502M474129L014296J832940Q13914l34639k982980o909788
12895A23547232j0845985j2952984j2828058j0851768q633273o917773n596194
12888E4921197m574266l838658l269477k898206k388804j982402j680537j344850
12880C2943997j132519j140089j104203r71158j026339j018565r76223p49094
12872B4825807o78259p65592p93916n26711n68584o39421n71974o28804o78814
$$ y = [82668586, 85866174, 89315504, 92745544, 95828440, 98552379, 101008649, 103530135, 106253055, 108850059, 111263829, 113469746, 115239855, 116020600, 115191173, 112415236, 108338105, 104534408, 101967021, 100878918, 101312704, 103312471, 106872991, 111962530, 117909858, 123639360, 128113489, 131127785, 132960725, 133774639, 133440000, 130457020, 123547232, 112701247, 99748263, 86920205, 76068437, 67435164, 60517391, 54921197, 50346931, 46508273, 43238796, 40340590, 37951786, 35969384, 34288847, 32943997, 31811478, 30671389, 29567186, 28596028, 27569689, 26551124, 25574901, 24825807, 24147548, 23381956, 22588040, 22061329, 21492745, 20853324, 20281350, 19652546, 18973732]
12863A8973732o68663n70405n65032o73791m93070o08346o32095l96519l74930
12854A3990881m19369k32908j41068k48281k86116q6476p3764j22732j88585k26641
12844A1964941m30920m16514l95438m08362m56307m88523n12296m66307m57972
12835G932302l73104k49159j72064j12157j38071j92007j51951p5050N5827n3570
12825F470996r7476q2105j71471j96425j87712k60379l6960j75556j71882j72623
12815D918407q6783j09807j16489j15810j24296j40161j26619r3280j10577j16112
12805C778473j15518j01508q3720l9527j02189q1008j26671R80n3099q2900j06291
12794B887022j17408m2328m3572o3362N2671k8592j57780j20487p7001p8184j01215
$$ y = [18973732, 18305069, 17734664, 17169632, 16495841, 16002771, 15394425, 14762330, 14365811, 13990881, 13571512, 13338604, 13197536, 12949255, 12663139, 12576663, 12502899, 12380167, 12191582, 11964941, 11534021, 11117507, 10722069, 10313707, 9857400, 9368877, 8856581, 8390274, 7932302, 7559198, 7310039, 7137975, 7025818, 6887747, 6695740, 6543789, 6468739, 6524566, 6470996, 6373520, 6291415, 6119944, 5923519, 5735807, 5475428, 5438468, 5262912, 5091030, 4918407, 4831624, 4721817, 4605328, 4489518, 4365222, 4225061, 4098442, 4005162, 3894585, 3778473, 3662955, 3561447, 3477727, 3438200, 3336011, 3255003, 3128332, 3129312, 3076213, 2993313, 2887022, 2769614, 2727286, 2683714, 2620352, 2673023, 2644431, 2486651, 2366164, 2289163, 2210979, 2109764]
12783B109764K1160k5986q5044l6178N523m0360j16372J07665J33234o3024k1100
12772A989282l7841O9161J5394l5576p0229j69554j46721l8872p7576r5226q3537
12761A318705r583J11554n828K3566M4906K9753j8912J29829m79N5695J54989
12750A834195J1258l53532k86744j56958j12886j4088J10759k748J7673q3625
12740I63304n0523n554M8539L3137P5665j7368m3633j63913m4032Q2991J67853
12729A046466k7160j01748p4016j5209M8902k100p3454o8623K6781J87554j8131
12718I29262k4676J7061M5524q9393m041r9315K4735o253j38451p8240L1259J68419
12706G75891M1124n3751o0395L6819O0005J34714N3740o6166Q0621L7728j1886
$$ y = [2109764, 2130924, 2104938, 2019894, 1983716, 1989239, 1948879, 1832507, 1940172, 2073406, 2010382, 1989282, 1951441, 2020602, 2035996, 2000420, 1930191, 1760637, 1613916, 1575044, 1497468, 1402242, 1318705, 1309122, 1420676, 1414848, 1438414, 1483320, 1513073, 1494161, 1623990, 1623511, 1679206, 1834195, 1845453, 1491921, 1205177, 1048219, 935333, 921245, 1032004, 1029256, 1046929, 963304, 912781, 907227, 955766, 988903, 1064568, 1047200, 1003567, 839654, 795622, 878613, 1046466, 1019306, 917558, 843542, 828333, 877235, 875135, 801681, 733058, 759839, 947393, 929262, 904586, 921647, 967171, 877778, 873737, 774422, 799157, 792904, 654453, 576213, 607472, 775891, 817015, 763264, 702869, 739688, 799693, 934407, 988147, 921981, 1002602, 1040330, 1028444]
12695A028444J8254P1635L7194Q0622k6883q0946j7766L6915J02334J9647r0245
12684A179205q6378R1372P7777n9546j06194j35351M0872J51154k052J3478N3475
12673A217812l3229Q010j5443j35975M9135O6555Q2173k3329j16363q3262n9929
12662I56155Q7837K5384o4312j10247L1771N8951k2214j8722j20621M6127Q5029
12651I55138J07882Q2266k8086K137m9366N7031n5803j73986p3771m2030O7132
12640H48544P6450J59542q683q3907J05336O4528k1877O0406P7216L6536M1142
12629A355233n4513q2781j2834O1090Q0057j00799j7683M6660l5260O6019o825
12618A298364q8555m9077K5086l3409J6347n6891o3617o5262r5045K6861R1574
$$ y = [1028444, 1046698, 1118333, 1155527, 1236149, 1209266, 1128320, 1110554, 1147469, 1249803, 1269450, 1179205, 1092827, 1184199, 1261976, 1202430, 1096236, 960885, 1001757, 1152911, 1150859, 1164337, 1217812, 1184583, 1192593, 1177150, 1041175, 1090310, 1156865, 1239038, 1215709, 1099346, 1016084, 956155, 1043992, 1069376, 1005064, 894817, 926588, 985539, 963325, 944603, 823982, 870109, 955138, 1063020, 1145286, 1117200, 1119337, 1069971, 1127002, 1071199, 897213, 823442, 781412, 848544, 924994, 1084536, 1075853, 991946, 1097282, 1161810, 1139933, 1200339, 1277555, 1314091, 1355233, 1300720, 1217939, 1205105, 1266195, 1346252, 1245453, 1227770, 1274430, 1239170, 1305189, 1298364, 1209809, 1160732, 1185818, 1152409, 1168756, 1111865, 1048248, 982986, 887941, 914802, 1006376]
12607A006376J07798m6354j39156k3335P7469J26842l9775m8696O113o902K8796
12596A049176J8958j8120q4081l4717J80443R2235k9680m6392m3113Q0135k6201
12585A138643J8981o868P0430J4608j49236k482L9093j7520r4004J25736K0193
12574A157574m8777j66214j25954l3734m9472o2801M9330k7481P5187K2322p6276
12563G13704o3412P180O3432O126n0551r6655M6792Q5285j07433k2366l603m1025
12551E37474q9891J45779P5499j02759K6409m0435q1904j4974j7070m55M234J4157
12539D56064K2713j5882J06815Q7490o193q8478m1172L2926J68371J09876R6697
12528I29227J4097j18819p8896j8716N4843M7118Q6935m8667n3525K5402L4083
$$ y = [1006376, 1114174, 1067820, 928664, 905329, 982798, 1109640, 1069865, 1021169, 1027282, 1020380, 1049176, 1068134, 1050014, 965933, 931216, 1111659, 1203894, 1174214, 1127822, 1084709, 1164844, 1138643, 1157624, 1150756, 1221186, 1235794, 1086558, 1084076, 1123169, 1105649, 1011645, 1137381, 1157574, 1108797, 942583, 816629, 782895, 733423, 670622, 719952, 692471, 767658, 789980, 713704, 650292, 657472, 720904, 727030, 676479, 579824, 626616, 711901, 604468, 582102, 578499, 537474, 447583, 593362, 668861, 566102, 592511, 552076, 470172, 455198, 438128, 437673, 441907, 456064, 478777, 462895, 569710, 657200, 651007, 562529, 521357, 554283, 722654, 832530, 929227, 943324, 824505, 745609, 726893, 781736, 828854, 915789, 867122, 813597, 838999, 873082]
12517H73082r798j1731J17411N0829j9129J25782k1323n839L5631m3624j13315
12506I77976p7364l3172L6823j6581O2402n1328j43942j77395K3006R0866K5888
12495G17179j25180o138k5391L3595l58J94973J06753j12260j36897M335K7913
12484F78524L9230k4837N46N9282l687K5473n496M0512j1004m5984M472M1759
12472G98790J22802K1825p1740M7549O7159n9259j345J2691m9654j3521J81480
12461A056777J59609j17916o8670J5252m6976r6512M9584J976m521p3595n875
12450H69133P8895J20138N5688R2570Q7173r3928J1401j04373k793R9414n851
12439A207467r1463j65071p6310O3620q5411j59105L1183K4601O8550J15991n9863
$$ y = [873082, 863284, 851553, 968964, 1019793, 1000664, 1126446, 1105123, 1099284, 1134915, 1091291, 977976, 900612, 867440, 904263, 887682, 950084, 898756, 754814, 577419, 600425, 691291, 717179, 591999, 585861, 560470, 594065, 593707, 788680, 895433, 783173, 646276, 650611, 678524, 717754, 692917, 693463, 752745, 749058, 774531, 769035, 809547, 798543, 752559, 757031, 798790, 921592, 943417, 871677, 919226, 986385, 927126, 925781, 938472, 888818, 875297, 1056777, 1216386, 1098470, 1029800, 1045052, 998076, 901564, 951148, 953124, 948603, 875008, 869133, 948028, 1068166, 1123854, 1216424, 1303597, 1209669, 1221070, 1116697, 1113904, 1213318, 1207467, 1116004, 950933, 874623, 938243, 852832, 693727, 724910, 749511, 818061, 934052, 874189]
12428H74189l7518m6587r6257l0659j10031O022J77873R84m9J689q5696P9855
12416G33815M2759L8119k1775O2097K5523q3888o882N8157Q2379M6407j16138
12405H60573r5913q7396K8319R7615J46985k6625k2621m1243J04828j1598j25408
12394H27516l0867j806J9425K835k0620o0283J21205Q7718R5971J8863M3194P9781
12382A182932M7706J73128K02353K0705O8274L2251n2684r8904l0916M4303L8338
12371A627486m6126k4527Q9631O1448L5827J52737r0038j06668P3427P3339M6025
12360A892561K2603l3424n327j22457j4436K4816J21335n868M4867J73058k6456
12349B071272m2097J74893O6019J1151K627J70988J02161J41426j4950L097J32986
$$ y = [874189, 836671, 790084, 693827, 663168, 553137, 559159, 737032, 738016, 737967, 739656, 653960, 733815, 776574, 814693, 792918, 855015, 880538, 796650, 789768, 847925, 930304, 976711, 860573, 764660, 677264, 705583, 803198, 950183, 923558, 900937, 859694, 964522, 952924, 827516, 796649, 794843, 814268, 817103, 796483, 736200, 857405, 945123, 1041094, 1059957, 1103151, 1182932, 1230638, 1403766, 1606119, 1626824, 1695098, 1727349, 1674665, 1575761, 1544845, 1589148, 1627486, 1581360, 1556833, 1646464, 1707912, 1743739, 1896476, 1806438, 1699770, 1773197, 1846536, 1892561, 1915164, 1881740, 1876413, 1753956, 1739520, 1764336, 1885671, 1879803, 1924670, 2097728, 2071272, 2029175, 2204068, 2270087, 2281238, 2283865, 2454853, 2557014, 2698440, 2683490, 2686587, 2819573]
12338B819573R3174l4220p4648J11142J57260l9185j48013K1486J13564P4452
12328C094585J22781J56721J58677J50978R3678k1796O5365J5983q4592K6157
12318C778537q8104n521O5497K3414O0596R8637J89802J47463J68913K38292J17827
12307D795353R5015J76202K44294K11649J83642K40699M21647L90717M67036N36962
12297G763216O47293P85938Q27686Q42966P99005P13930Q51457J131836J505898
12288A5869225J888510K340290L109645L585846M047842M223734M297739M107362
12280D3470193L696111K890605J339390j80188j264101j953536k006065j627911
12272D4364498j079124m14577M2169L09811O85026J349925K181632L062223M039820
$$ y = [2819573, 2912747, 2878527, 2803879, 2915021, 3072281, 3033096, 2885083, 2906569, 3020133, 3094585, 3217366, 3374087, 3532764, 3683742, 3777420, 3755624, 3820989, 3836972, 3752380, 3778537, 3690433, 3684912, 3750409, 3773823, 3834419, 3933056, 4122858, 4270321, 4439234, 4677526, 4795353, 4890368, 5066570, 5310864, 5522513, 5706155, 5946854, 6368501, 6759218, 7226254, 7763216, 8410509, 9196447, 10024133, 10867099, 11666104, 12380034, 13231491, 14363327, 15869225, 17757735, 20098025, 23207670, 26793516, 30841358, 35065092, 39362831, 43470193, 47166304, 50056909, 51396299, 51216111, 49952010, 47998474, 45992409, 44364498, 43285374, 42870797, 42912966, 43222777, 43907803, 45257728, 47439360, 50501583, 54541403]
12263E4541403M632031N022598N620428O346414O767995O140047M331224J932510
12255I5334650n11961j976352l081885m464361o168482p373305p358423o216603
12247E8183278m767334l716754k829961k072221j525382j014229l87549j52308
12239D1717540j17543P5648L16499L17125J79359J72945J69180L23751K61506
12230D3416010J78427k6968j25989J08904K93849M62461M17696M85447P65131
12221D5974968J140031J515222J975774K565883L088930L686441M243074M684271
12213F8874594M955957M780054M220834L427042K646495K098303J677494J010894
12205I3691667K56884j71920m3014N99487J040757J330260J807064K603963L322648
$$ y = [54541403, 59173434, 64196032, 69816460, 76162874, 82930869, 89070916, 93402140, 95334650, 94822689, 92846337, 89764452, 85300091, 79131609, 71758304, 64399881, 58183278, 53415944, 49699190, 46869229, 44797008, 43271626, 42257397, 41869848, 41717540, 41599997, 41675645, 41992144, 42309269, 42488628, 42661573, 42830753, 43154504, 43416010, 43594437, 43567469, 43441480, 43550384, 43844233, 44306694, 44724390, 45209837, 45974968, 47114999, 48630221, 50605995, 53171878, 56260808, 59947249, 64190323, 68874594, 73830551, 78610605, 82831439, 86258481, 88904976, 91003279, 92680773, 93691667, 93948551, 93776631, 93733617, 94333104, 95373861, 96704121, 98511185, 101115148, 104437796]
12196A04437796L822377M081633M394663M914121N569708N562384M560795K500853
12188A39844330q6652k362103m152333n441662o157144o550517p317024q503363
12180I9273532r839629j0116067q741541o696168m952811l902154l169301k459827
12172D9396034j837877j526556j437529j292512j107708q33227o94183n93504
12164D0072938n58646n90300o06131o94728m68292p2688J74940L55259M63217
12155C8075569N55235O07657M98242L33380K16490R4804P3968Q0327Q1192L13832
12145D0930696P56699J337163J934482J995037J895039J687760J572350J329085
12137E3438311P29891j25467j131592j594401j193276m31177L33956R75907J538205
$$ y = [104437796, 108260173, 112341806, 116736469, 121650590, 127220298, 132782682, 137343477, 139844330, 139757678, 137395575, 133243242, 127801580, 121644436, 115093919, 107776895, 99273532, 89433903, 79317836, 70576295, 63880127, 58927316, 55025162, 51855861, 49396034, 47558157, 46031601, 44594072, 43301560, 42193852, 41360625, 40666442, 40072938, 39514292, 38923992, 38317861, 37623133, 37154841, 37082153, 37257093, 37612352, 38075569, 38630804, 39238461, 39736703, 40070083, 40286573, 40381377, 40455345, 40535672, 40616864, 40930696, 41687395, 43024558, 44959040, 46954077, 48849116, 50536876, 52109226, 53438311, 54168202, 54042735, 52911143, 51316742, 50123466, 49692289, 50026245, 51002152, 52540357]
12128E2540357J935349K179128K589111L070793L274608L080072K837449K012263
12120G3519130J198627M20368o03933k427110m439749o200019p282186p382673
12112D6802455o012936m764220l691055l032885k733493k572986k196266j836747
12104A9961867j485686j206545r83692q19487o80176n94532n80097m45065l92987
12095A2773600l90896k49310k24765l40366k53605k26430k21316k40595l13775
12086A0312542l93837l21941n05451k95329l45439k81413k18283l76007j45544
12077G429298o9508o4928q6676j28519j78968k02272k30442l01920j67566k6043
12067E972456j79621j03263J6427j38723l8498n9322k06364j85242p7796j12314
$$ y = [52540357, 54475706, 56654834, 59243945, 62314738, 65589346, 68669418, 71506867, 73519130, 74717757, 75138125, 74534192, 72107082, 67667333, 61467314, 54185128, 46802455, 40789519, 36025299, 32334244, 29301359, 26567866, 23994880, 21798614, 19961867, 18476181, 17269636, 16285944, 15466457, 14786281, 14191749, 13611652, 13166587, 12773600, 12382704, 12133394, 11908629, 11568263, 11314658, 11088228, 10866912, 10626317, 10312542, 9918705, 9596764, 9091313, 8795984, 8450545, 8169132, 7950849, 7574842, 7429298, 7359790, 7294862, 7208186, 7079667, 6900699, 6698427, 6467985, 6166065, 5998499, 5972456, 5792835, 5689572, 5705999, 5567276, 5528778, 5469456, 5263092, 5077850, 5000054, 4887740]
12057D887740j10876m0352r2924j47289k09274j77412j61231r0731k2810j07900
12047C726941j75579k11051n0508o018m8627j46465n0615n3496l3496q6186j32828
12036B732072o6255M5682p8731n8672n87j0232q2253m0593j21524j71451p8774
12025B068682p5681O1657M2010o5302p0201o6764j3560K5250K9019m3115q2004
12014A809991q1354M1020K1976K4802n4906k6377m1610O3883p9596j48933m9267
12003A479629j63297p5932r7099r588m5442L2650l8141p4572K9781R8115p0625
11992A065479m8023J04185O1773j06373r4373M2373q0098j02922q068L8540M3550
11981I16043L1462o064j07741j82619m0602k730P7204J8540P35K3150J5246o9193
$$ y = [4887740, 4776864, 4736512, 4643588, 4496299, 4287025, 4109613, 3948382, 3857651, 3834841, 3726941, 3551362, 3340311, 3289803, 3283785, 3235158, 3088693, 3038078, 2984582, 2951086, 2864900, 2732072, 2665817, 2711499, 2632768, 2574096, 2573509, 2563277, 2481024, 2440431, 2318907, 2147456, 2068682, 1993001, 2054658, 2096668, 2031366, 1961165, 1894401, 1880841, 1906091, 1935110, 1891995, 1809991, 1728637, 1769657, 1791633, 1816435, 1761529, 1735152, 1693542, 1757425, 1677829, 1528896, 1479629, 1316332, 1240400, 1143301, 1133713, 1088271, 1120921, 1082780, 1008208, 1037989, 1136104, 1065479, 1017456, 1121641, 1183414, 1077041, 982668, 1025041, 944943, 842021, 833953, 872493, 916043, 947505, 941441, 833700, 651081, 610479, 607749, 684953, 703493, 704228, 727378, 742624, 673431]
11969F73431J4379L5490j5914L5585J4823N3206k9431j37255M0826k9490K7124
11958F82774n5398n2386M374q9184j9291m951r2479K9573N0156P8638q48n1772
11946D79206j53493l4771N6001j1578j71234o6767M5674K1341J15162L4022J0906
11935C24469L8468q3610l0541J717l6077m6557L251M4704m6321n7986J56337J01613
11923C69467j54138j3236K0206p7802l1166k7930p1941q8138J43775Q4748L9750
11912A93595P5869N1993K8926j06595q8009k6709o130O5864k2921M5714J8278
11901B29875j33969L0756N6052p0024M1734R1554O4876p4953o6366j40879j11124
11890h2468j23776J9557J58599Q3525Q5356p7067j29554L3064R4692K3804j5232
$$ y = [673431, 687810, 723300, 707386, 742971, 757794, 811000, 781569, 644314, 685140, 655650, 682774, 627376, 574990, 579364, 490180, 470889, 465938, 373459, 403032, 453188, 531826, 530978, 479206, 325713, 290942, 346943, 335365, 164131, 97364, 143038, 164379, 279541, 313563, 324469, 362937, 279327, 248786, 250503, 214426, 167869, 171120, 215824, 169503, 111517, 267854, 369467, 215329, 202093, 222299, 144497, 113331, 85401, 13460, -74678, 69097, 153845, 193595, 269464, 321457, 350383, 243788, 155779, 129070, 122940, 188804, 165883, 211597, 229875, 95906, 126662, 182714, 112690, 154424, 245978, 310854, 235901, 169535, 28656, -82468, -206244, -186687, -28088, 55437, 140793, 63726, -65828, -32764, 61928, 85732, 70500]
11879G0500j1401J2877n6406Q0280M1586j78246j34550M8219R8656O9291p7678
11868c6872J9754l6768N310M0087k8920J8858k6122j7565n0899j06485J91150
11857b8472M628K661m9023L8973J17926o9709j13644N5458J02425L2645q3349
11846A0519l5687Q9168j32243n7325K8648R0368O4759l101L7750Q300J8248L0763
11834A50167j6084J15466q2328o4651M0560k367k5869O3872j6597l4935K8120
11823A55354R3126J5165K1032J44000L5812p5467j8143L7354q9377K456O8080
11812C89392L3566P0993J1221j36798k59472k563J00889Q0749N6004l2055j44551
11801A67375j50583O779O8315N5691K3047p7155n2503Q9257j3806j483Q6777j9701
$$ y = [70500, 59099, 71976, 15570, 95850, 137436, -40810, -175360, -127141, -28485, 40806, -36872, -17118, -53886, -48576, -8489, -37409, -18551, -44673, -62238, -113137, -219622, -28472, -23844, -21183, -70206, -31233, 86693, 16984, -96660, -41202, 61223, 93868, 10519, -25168, 64000, -68243, -125568, -96920, -6552, 58207, 55106, 92856, 101156, 119404, 150167, 134083, 249549, 167221, 102570, 143130, 140763, 114894, 178766, 162169, 127234, 155354, 248480, 263645, 284677, 428677, 464489, 389022, 370879, 408233, 318856, 321312, 389392, 422958, 493951, 505172, 368374, 108902, 106339, 207228, 287977, 343981, 311926, 167375, 16792, 23571, 91886, 147577, 170624, 93469, 40966, 130223, 116417, 114934, 201711, 182010]
11789A82010j03831J61086J17002m7301j1557j8864O7709O8386r2009o6308k0183
11778B36140j11209n1166Q1056L8823Q7910R5414K0707j30783L1282M9734K5199
11767C73107j6224m7760m7283J06612K6912j4319R2856M2790q200l6299J9905
11756D92097j3172N4993P0427M3969n6001O6764O7857j8808j9325p463N9755Q5689
11744H26782n4422m4028J1453M435M8918n4633n3183r7421k20447K9585R6390
11733D93429m6021K230N1613p8335m4092n8884r8700j27201J3926m221l3899M0128
11721A09973J12624m2621o8008j10876P3127K8766l2820l5313J86444m4286j8166
11710A58844m79p5992P5503j02018n7244M9495J35776n2824K1255l7130L0570
$$ y = [182010, 78179, 239265, 356267, 308966, 297409, 278545, 346254, 414640, 322631, 256323, 236140, 124931, 73765, 154821, 193644, 281554, 376968, 397675, 266892, 298174, 347908, 373107, 356883, 309123, 261840, 368452, 395364, 381045, 473901, 516691, 508491, 472192, 492097, 478925, 533918, 604345, 648314, 592313, 659077, 726934, 708126, 688801, 681338, 741093, 826782, 772360, 728332, 739785, 744220, 793138, 738505, 685322, 587901, 367454, 397039, 493429, 447408, 449638, 501251, 422916, 378824, 319940, 221240, 94039, 107965, 103744, 69845, 109973, 222597, 179976, 111968, 1092, 74219, 102985, 70165, 34852, 221296, 177010, 158844, 158365, 82373, 157876, 55858, -1386, 48109, 183885, 131061, 152316, 115186, 145756]
11699A45756N2633K718M7337M564m427m6839j9152m6538K5593j0548N9098l0754
11687A79441k162L7324k6685l355k8326j4759l1073j16090R8384J48442N0411
11676B91552J52857J25j2219Q9870O429p2896j62880p5448j9445R144J3331O6625
11664B87045l1820J683O2605J5637K6604j01559k18994m2454L0117J17652R2441
11653B38957k9847r1425l7536P6602P5660N6739l4209m0357j66921j7458o1414
11642c1209P6873M2375p998j6075n2740o0927P0273Q8842m0081n3055L9499M1415
11630I7192N133j05957k8109j17326n1947Q1553J66171J13969O5907j27827m5522
11619E3237M7939p9523j33N4414k6143l7743p9411J0951Q6189n0952j42019p5919
$$ y = [145756, 198389, 201107, 248444, 253008, 248581, 201742, 182590, 136052, 161645, 151097, 210195, 179441, 177279, 214603, 187918, 184563, 156237, 141478, 110405, -5685, 92699, 241141, 291552, 444409, 444534, 432315, 522185, 528614, 455718, 292838, 217390, 197945, 207089, 220420, 287045, 255225, 256908, 319513, 335150, 361754, 260195, 41201, -1253, 28864, 146516, 238957, 209110, 117685, 80149, 156751, 232411, 289150, 254941, 214584, 47663, 30205, -31209, 45664, 88039, 80041, 63966, 11226, -49701, 20572, 109414, 69333, 16278, 55777, 97192, 102325, -3632, -31741, -149067, -201014, -119461, 46710, 160679, 226586, 98759, 53237, 101176, 21653, 21520, 75934, 49791, 12048, -67363, -56412, 29777, -21175, -163194, -239113]
11607b39113Q786J13743J26417M1333n5650n2831N6836J09506M7753n9578N8429
11596A55631q1290j01048k1684P8763O657o3767p8502j14859K8756J55096K10140
11585A73893O6200n2780L1851j8937N1798K7061j56225m1221Q8959j6205k7866
11574A26528j15678n8920N2444n0782M2709P3704n0186K4026N3757l3244j40053
11563g5695J4635k015r635Q1063P2303k2420K1167J6122J4878j17614m3679n8150
11551a09040l6028J70368J08516M7009Q7163j18150n5731P367J5567m0283l598
11540G3160q0452J5372K9853K7881P679q2702q7815j87O8761R915j3389m2789
11528g4713K1600O7261l951o8101m1688K740L8365P4299M5929n137r5896o357
$$ y = [-239113, -230327, -116584, 9833, 51166, -4484, -57315, -479, 109027, 156780, 97202, 155631, 74341, -26707, -48391, 30372, 37029, -26738, -105240, -220099, -191343, -36247, 173893, 240093, 187313, 219164, 200227, 252025, 279086, 122861, 81640, 170599, 154394, 126528, 10850, -48070, 4374, -46408, -3699, 70005, 19819, 43845, 97602, 64358, -75695, -61060, -63075, -72710, 8353, 80656, 58236, 79403, 95525, 110403, -7211, -50890, -109040, -145068, 25300, 133816, 180825, 267988, 149838, 94107, 101474, 117041, 76758, 73160, -7292, 8080, 37933, 65814, 73493, -9209, -97024, -97211, -28450, -18535, -31924, -74713, -53113, 14148, 10197, -57904, -99592, -96852, -58487, 15812, 61741, 56604, -39292, -45649]
11516d5649L8069j03251m8526j6490l1703n310J19201L0646l6039l8057p16O7556
11504g0269J0524R8355L4834j3539k3771k5118j21322k148O8556L5767P2604Q5539
11492A50012l1741j8474o2575m7111m149k6434K5795J15027K8421o1126p5179
11481g534o6763j09162r2212P9178L8077P0737M0760L759m712l5494r1330L4933
11469a39763K1853K0866L5166m278K6345M8288j7251j02903l4490O5030K3150
11458e7987Q726r434L8035k925O1403M8529k0539p033o3001K1005J05726n5953
11446F6552j30195o2432j7850M2759J1559Q017R9675O1510o5861o9106K2868Q896
11434b3608P281L7672J06862P1218n2986R841R8518m1781j18707j1925J25260
$$ y = [-45649, -7580, -110831, -159357, -175847, -207550, -212860, -93659, -63013, -99052, -137109, -137825, -70269, -59745, 38610, 73444, 59905, 36134, 11016, -110306, -112454, -43898, -8131, 64473, 150012, 118271, 99797, 37222, -9889, -14038, -40472, -14677, 100350, 128771, 67645, -7534, -74297, -183459, -275671, -196493, -158416, -87679, -46919, -43160, -47872, -83366, -174696, -139763, -117910, -97044, -61878, -66156, -39811, 8477, -8774, -111677, -146167, -81137, -57987, -49261, -58695, -20660, -23585, 37818, 86347, 65808, 58775, -4226, 16779, 122505, 66552, -63643, -126075, -143925, -101166, -89607, -81590, 18085, 79595, 13734, -55372, -32504, -23608, -16327, 21345, 128207, 199425, 146439, 156280, 254798, 213017, 94310, 82385, 207645]
11423B07645j28488o2242K4418K2004L5055L3218J7895l5470K8612J1094j06000
11412D7741j48897J035R1156m767m0243p5695P9535J00289L4807j1308J9883Q9710
11400A83246k0768p1418j0567L2203K4670q9602r1384J23650M2921M5419k4964
11389A43406q6685m8440j046m9608J3167O0776Q4878k8668l6735m7786Q9309m1821
11377E0747l0059j00390j56058l1156M0059J4544R3024J20263N28J2965J13810
11366A28277J8451J7911R452Q413M8818j9516l0509m8354o3176l4868K3138P2092
11354A30129Q499j04613r1658L3367J53058L8805j282Q1956J24348R363j46866
11343B35106p4860j1028N1210l8883k6986M3656L1322m3184j32432o5923R3249
$$ y = [207645, 79157, 16915, 41333, 63337, 98392, 131610, 149505, 114035, 142647, 153741, 47741, -101156, -100121, -8965, -13732, -53975, -129670, -50135, 50154, 84961, 73653, 93536, 183246, 162478, 91060, 80493, 112696, 137366, 47764, -43620, 80030, 122951, 168370, 143406, 56721, 8281, 7235, -42373, -29206, 31570, 116448, 87780, 51045, 3259, 92568, 50747, 20688, -79702, -235760, -266916, -226857, -212313, -119289, 974, 1502, 14467, 128277, 146728, 164639, 174091, 182504, 231322, 211806, 181297, 132943, 69767, 34899, 58037, 130129, 138628, 34015, -57643, -24276, 128782, 167587, 166305, 248261, 372609, 381972, 235106, 160246, 149218, 200428, 161545, 134559, 178215, 209537, 166353, 33921, -32002, 61247]
11332F1247R1489p5021n1133l1616m6370L0812K60k0582N9104N6603m741l6387
11320C3665k2621j02162L5201K1802q3367l0545L8808J14544O396j0444L9554
11309D0831L1458M3088o2487j68261j122K1901O8403P2671J6474p6276j1829Q4184
11297E9035R3807K2488p0957m6220J6630j20737K7428N6039q6723l5505Q601J6843
11285e9271P0475L1077r2132n4310L8352L0019N5171R2604N3940o9301l4075j0139
11273E2410q8333N8912J01944K178n9188n8668j37276K99J60595L4024k0770N9881
11261A06008J2217o1487j6442J3607M8450K363j2521n4364M602O1301P6343O3965
11249B44042L7764j25187K1868K2844N6901m8463j39844q7751O6086J47302J7115
$$ y = [61247, 152736, 77715, 26582, -5034, -51404, -20592, -20332, -40914, 18190, 74793, 70052, 33665, 11044, -91118, -55917, -34115, -117482, -148027, -109219, 5325, 11721, 1277, 40831, 72289, 115377, 52890, -115371, -116493, -94592, -26189, 46482, 62956, -13320, -25149, 59035, 152842, 175330, 104373, 58153, 74783, -45954, -18526, 37513, -49210, -84715, -76114, -59271, 11204, 42281, -49851, -104161, -65809, -35790, 19381, 111985, 165925, 96624, 62549, 52410, -35923, 22989, 124933, 127111, 67923, 9255, -128021, -127722, 32873, 66897, 46127, 106008, 118225, 56738, 40296, 53903, 102353, 104716, 92195, 37831, 42433, 103734, 180077, 244042, 281806, 156619, 178487, 201331, 258232, 209769, 69925, -17826, 48260, 195562, 212677]
11238B12677j000q2246j48458n7234L8309M6902L6709k4126k0574l4392l5271
11227f8704R2734J87991o7961p04J9151J29273N7353m0286n0816o3079o337J5513
11215B04128j8114l3980O7430J10231n7835k9133Q4396N4369o5433j45600j40501
11204B9958k1857M2068O9899J43436K4776o9192q2811o0314p5987R293L6647M8700
11192I4616J04337J10812j2226K4154n8866j35861q25K0348n8131l8704j0110
11181C9544l2182M6969p4985r0893L4702L1233O6735O243M3109n8929k8212L1412
11169A4746K5967q719J168O2353O5816o5406j4326M7838j921m8960N9864q35q1092
11156E6493L7972p7499k0383j256L9718m5070K1461o148q0228M517k4985N4154
$$ y = [212677, 211677, 129431, -19027, -76261, -37952, 8950, 45659, 21533, 959, -33433, -68704, 24030, 212021, 144060, 143356, 162507, 291780, 349133, 308847, 258031, 194952, 188615, 204128, 186014, 152034, 219464, 329695, 271860, 242727, 327123, 381492, 316059, 170459, 29958, 8101, 50169, 120068, 263504, 288280, 219088, 136277, 75963, -24, 9269, 45916, 94616, 198953, 309765, 297539, 321693, 262827, 126966, 126141, 146489, 88358, 49654, 39544, 7362, 54331, -20654, -111547, -76845, -45612, 21123, 27366, 70475, 11546, -16666, 14746, 40713, 31994, 33162, 95515, 161331, 95925, 81599, 129437, 127516, 78556, 138420, 137585, 56493, 94465, 16966, -3417, -4673, 35045, -10025, 11436, 5288, -74940, -70423, -95408, -41254]
11144d1254Q0337M7906O5054N087o9342l2984j36066j11645J79167J54568P5392
11133B16220l3386m3723j980N164N1297q5802m5143M2296l3422p1349l0190J54320
11121A24302O118p9776l6593o2854J74764L7397Q4145L063j16947j36601m4866
11110d7848N7803L0418p4908n4156L9690m6462m060N2446J2081j07019O9835J18682
11098D6502J06188J6979n8397J6700q4742r4826L5846K35217L1524l4601r9304
11087A17086p7856m5402J1250R4837o6935L0694O5281L2499M9187J8450o8920
11076A60171j61121j5786Q5869Q9236M3074l9166m1515Q218j6065k1982j11363
11065b0430j15247n6206M3545P8786p34L0725N2034j7761J19462O2970j4681m4765
$$ y = [-41254, 39083, 86989, 152043, 157130, 87788, 54804, -81262, -192907, -13740, 140828, 216220, 182834, 139111, 137131, 142295, 193592, 107790, 62647, 104943, 71521, 172, -30018, 124302, 130420, 50644, 14051, -48803, 125961, 163358, 247503, 250566, 133619, -2982, -47848, 9955, 40373, -34535, -88691, -49001, -95463, -99523, -47077, -34996, -142015, -72180, 46502, 152690, 169669, 111272, 127972, 43230, -51596, -15750, 219467, 250991, 216390, 117086, 39230, -6172, 5078, 99915, 32980, 63674, 128955, 161454, 210641, 229091, 160171, -950, -16736, 69133, 158369, 201443, 162277, 120762, 128980, 112915, 90933, -20430, -135677, -191883, -148338, -69552, -70286, -39561, 12473, -5288, 114174, 177144, 162463, 117698]
11053A17698r5926L7718J12288j5679j5076l8022k252n631r2097L1321r2023j8881
11041g6562L630q7916j8154N0946K3157M3405R7226J26285M1818n6903J13352
11030B60284n9315q1753o3658O7805N7014N4364j3005j9450j5150m7541l3037
11019A06558l5736m2372j08o9381j16436n6138J78392J97224J08498n9213J07086
11008C18374p6343j28753n1772Q0248L7623m6321r7739Q7150M2217M8123k0606
10997A92201N028J0725P4500j2918l8801R847o7743q7021j09950J0891L5560p0989
10985d8670J09589J35421M731M8670p6639r3225j3439l906M0584q1658N5009L0529
10973A06996K9136r3698r9414J8907J26964R3249p5872m9132k2775M058p0954
$$ y = [117698, 21772, 59490, 171778, 156099, 141023, 103001, 100749, 95118, 3021, 34342, -57681, -76562, -72932, -160848, -179002, -128056, -104899, -61494, 35732, 162017, 203835, 146932, 260284, 200969, 119216, 55558, 123363, 180377, 234741, 221736, 202286, 187136, 139595, 106558, 70822, 28450, 28342, -41039, -157475, -213613, -35221, 162003, 270501, 211288, 318374, 242031, 113278, 61506, 141754, 179377, 133056, 35317, 122467, 164684, 212807, 192201, 197229, 207954, 282454, 269536, 230735, 240582, 172839, 85818, -24132, -13241, 22319, -48670, 60919, 196340, 201071, 249741, 173102, 79877, 66438, 62532, 103116, 21458, 76467, 106996, 136132, 42434, -56980, -38073, 88891, 182140, 106268, 57136, 34361, 38419, -32535]
10962c2535M4207R1084q9328q6982J78841L1373j13886P94M4366m9167k9419l8054
10950d8706q4035J7026J72071R0598J2786P252M613p1122K6660l1399r2369J01985
10938A05360N8857P3683J28397N5616j53336j68696k7858l0245K4501L6012r2143
10927A0148p641J45984k9625q1675q6762L8894m2326P2406O6140n939L9163Q179
10915A26946q2542j04352J14774Q3533J7199j1625J43286L5620j8690p1j48734
10904A55344k5991m044l4834o1779k0844J0172K2574Q7891J5560o0972n5450K9701
10892E7328N1965k532k5470r329P900n1767Q0228m7659q9301J7592J44188j07543
10880B5600p9880N2645L8653j3854l3123j6321L5468J31429p3367q0285M5544
$$ y = [-32535, 11672, 102756, 13428, -73554, 105287, 136660, 22774, 23568, 67934, 18767, -10652, -48706, -132741, -115715, 56356, 146954, 159740, 166992, 171605, 100483, 127143, 95744, 3375, 105360, 164217, 237900, 366297, 421913, 268577, 99881, 72023, 41778, 66279, 102291, 10148, 2507, 148491, 118866, 37191, -49571, -10677, -53003, 19403, 85543, 79604, 118767, 126946, 44404, -59948, 54826, 138359, 155558, 143933, 287219, 322839, 304149, 304078, 155344, 129353, 125309, 90475, 28696, 7852, 18024, 40598, 128489, 144049, 83077, 27627, 57328, 109293, 106761, 81291, 71962, 79862, 28095, 108323, 60664, -28637, -11045, 133143, 25600, -54280, -1635, 37018, 23164, -9959, -26280, 9188, 140617, 67250, -13035, 32509]
10869C2509O9456l5967J03666R479M4753L7595J2970K7803p804Q1349n2755j46107
10857A76947o5196m2305P7172P8220k041p8967J63172l2831j42899K93J86848
10846C18413N4194K1740J7595J6373N4827j07739r4365n0446J7251K3386j2842
10835B58387k0654o8114j19743k1576Q4476K9514j5215N4746K2278O705n1708
10824A59096k08303k2876K51152J98148j2646j70571j30932k4775Q4592J99354
10814C22239o9413k5663l7202j48379o533J02972J4192O3036O9515J24854Q1012
10803D90630M0471R7308l9341n2979j31237K329M2275n2166r4755L4274Q6577
10792D23386l2034q6518r039P012m1137R93n9495J13511M3288o2489l6213J24444
$$ y = [32509, 101965, 65998, 169664, 179143, 223896, 261491, 274461, 302264, 294460, 375809, 323054, 176947, 111751, 69446, 146618, 224838, 222797, 143830, 307002, 274171, 131272, 131565, 318413, 372607, 394347, 411942, 428315, 483142, 375403, 281038, 230592, 247843, 271229, 258387, 237733, 169619, 49876, 28300, 112776, 142290, 127075, 181821, 204099, 210804, 159096, -49207, -72083, 179069, 377217, 364571, 194000, 63068, 38293, 122885, 322239, 252826, 227163, 189961, 41582, 35049, 138021, 152213, 215249, 284764, 409618, 490630, 531101, 628409, 589068, 536089, 404852, 407181, 449456, 397290, 302535, 336809, 423386, 391352, 304834, 295795, 302807, 261670, 262663, 203168, 316679, 359967, 297478, 261265, 385709]
10780C85709P4368j64748p6981M1743j5636m0530j8950K3805J4369L6403N9654
10769C19206Q5629O9419L332M3228O6858L0667O7615p9265q1167r2268P099m8030
10757C92323j9684J3812n6684m3080J25703J85658K5023J113N9820O7873O8116
10746H19993j54434j62367j47873j08104j9549J73777l0795o7202l0653R90m8729
10735B25054j35193m2487M9492J47342J1200p7508J3137K1552N4347M6349L1567
10724C44852M6539q1286K7002K8772l3078O0601J06259P2289O7656J70513K15531
10713A025650J08678M2979O9918Q1950N6649Q8798q768j7846p5109r2947l0120
10702A249832M1613j4118p2839j62224p2492r7372k22160j71640l7254m2817P3053
$$ y = [385709, 460077, 295329, 218348, 260091, 244455, 203925, 184975, 208780, 223149, 259552, 319206, 404835, 474254, 477586, 520814, 587672, 618339, 685954, 606689, 525522, 433254, 440353, 392323, 372639, 386451, 329767, 286687, 412390, 598048, 623071, 624184, 684004, 751877, 819993, 665559, 503192, 355319, 247215, 227666, 401443, 370648, 303446, 272793, 273783, 225054, 89861, 47374, 96866, 244208, 255408, 177900, 191037, 212589, 266936, 313285, 344852, 391391, 310105, 337107, 365879, 332801, 393402, 499661, 571950, 639606, 810119, 1025650, 1134328, 1177307, 1247225, 1329175, 1385824, 1474622, 1465854, 1448008, 1372899, 1279952, 1249832, 1291445, 1277327, 1204488, 1042264, 969772, 872400, 650240, 478600, 441346, 398529, 471582]
10691D71582O2927P6716J15133K835L9991l2044j27947k4480N6013R5390N2390
10680G88506k1169K04923J49473P3802k1028J32322R4775k1264j0308r6783J02118
10669A375367J40434j1770O5780J26927J00397N1032M9846P2926j39748j71146
10659A660045k17093j59324j27844j16047j44341j02731r6559j5146J6421j46641
10649E50740m9808K6776L108l8037O88K8119j5273P8115r3360k02151j00628J60000
10637C48289J40635Q2204P8955L0430M1761r4030p9661M7177J32218R048K288
10626G39314J31380M8926J14694P2192j20544q4181k3708J44992j0171j00270
10616I12624j6026j63801m3348L759m0613L427p4551O2358m2484m3252q2345j05689
$$ y = [471582, 534509, 611225, 726358, 729193, 769184, 737140, 609193, 584713, 640726, 736116, 788506, 767337, 972260, 1121733, 1195535, 1174507, 1306829, 1401604, 1380340, 1370032, 1273249, 1375367, 1515801, 1504031, 1569811, 1696738, 1797135, 1848167, 1898013, 1970939, 1831191, 1660045, 1442952, 1283628, 1155784, 1039737, 895396, 792665, 696106, 680960, 697381, 550740, 500932, 527708, 530816, 492779, 493467, 521586, 506313, 584428, 491068, 288917, 188289, 348289, 488924, 571128, 650083, 680513, 722274, 628244, 548583, 595760, 727978, 737026, 739314, 870694, 919620, 1034314, 1106506, 985962, 901781, 878073, 1023065, 1012894, 912624, 896598, 732797, 689449, 693208, 652595, 656022, 581471, 643829, 601345, 558093, 475748, 370059]
10604C70059q186k3072p6865J32983j9416n1844j3938K3949m5322j09835j02462
10593G6051k4498R1425R4737Q4052l1135Q719M1181R5621K9873j8352M6021o1672
10581D32023k6263j6462K4666J70693J705l8312l4509p8876J3812n164P1388n3967
10569D60734l4869j25297p9325L5479Q8239L2364O6906k9666n8750r46O3219n0680
10557C67408l8231N9608j4198o2558j05782L0848J59267R2598k3203m3386q1020
10546C41351J8069R6345m1406r2968j2975p2676n8714J75498L5369o6477j13647
10535B07769K0828L5158M378P7632J20429j62972j80302K2547N6030l6709R8610
10524B63398J14435l001n0089n7288p6011J8958R4921J18828J08990k8555j7912
$$ y = [370059, 361873, 338801, 261936, 394919, 375503, 323659, 309721, 333670, 288348, 178513, 76051, 51553, 142978, 237715, 321767, 290632, 299351, 340532, 436153, 466026, 447674, 493695, 432023, 405760, 389298, 413964, 584657, 586362, 548050, 513541, 434665, 448477, 443313, 514701, 460734, 425865, 300568, 221243, 256722, 344961, 377325, 444231, 414565, 355815, 354869, 418088, 367408, 329177, 388785, 374587, 312029, 206247, 237095, 396362, 488960, 465757, 422371, 341351, 359420, 455765, 414359, 321391, 308416, 235740, 177026, 352524, 387893, 321416, 207769, 228597, 263755, 268133, 345765, 466194, 303222, 122920, 145467, 201497, 164788, 263398, 377833, 374832, 324743, 267455, 191444, 210402, 305323, 424151, 533141, 504586, 486674]
10513D86674p814j5322k9126n0246p0166Q3572Q5176o4594k2284J4449K5806J66412
10501F02537M9385r5267l2967L3469L863J3412j44257j04487N5548R4955R0064
10490E66255q344j29880p8005n6306N3697J61734M5727K5298o0689r9312L0510
10479D50685P5742k4493L602p2157j13804q311j4667O8660l6036N1572N0870K7936
10467D59599L472n0179j28970M5205J06377N2293k3850Q2610J25449J5782k0037
10456F67751J05896P8339j57795m4841L270o2612M0111Q0775M6210o6175j12216
10445E78713P149R2231O4690o0605j23655L3323j9228k9895k7629K7333N0721
10434E93148j42418q0883Q8494M5378n719M3121L4751Q3734P1337j7526l9475
$$ y = [486674, 478860, 463538, 434412, 384166, 314000, 397572, 482748, 418154, 395870, 410319, 436125, 602537, 651922, 556655, 523688, 557157, 561020, 574432, 430175, 325688, 381236, 476191, 566255, 557911, 428031, 350026, 293720, 347417, 509151, 554878, 580176, 519487, 420175, 450685, 526427, 501934, 505536, 433379, 319575, 311264, 296597, 365257, 329221, 380793, 431663, 459599, 463071, 412892, 283922, 329127, 435504, 487797, 463947, 546557, 672006, 687788, 667751, 773647, 851986, 694191, 649350, 652620, 590008, 630119, 710894, 757104, 690929, 578713, 585862, 678093, 742783, 682178, 558523, 591846, 572618, 542723, 515094, 542427, 593148, 450730, 369847, 458341, 503719, 498000, 541121, 575872, 659606, 730943, 713417, 673942]
10423F73942o6300N6189k815J9010k2121o9914N5101J33693Q477K3609o919l455
10411G98497L0945J1145K0144n9374j1982j1346K2205R9746q561N1837L6540R9262
10399A079058o121o8337m8649j37221k4943N8084N2927k4372q001n2589N2009
10388H71845K56876L3963j49529p5952L148N2004k4414l4606O0600J88442K31557
10377A413934K06952L34592L57064N47176N48513N57516N80156N21404M42805
10368E510112L60155J75061j8121l85050o60768p62572p57511m77673l39897j38527
10358B505209o5559j37817q7433j44460j80808q4625N2788P0176K5933p0672J4153
10347A896885m9534l3358l4331l909M0874o619M1414L4898J605K9927N5714J12437
$$ y = [673942, 607642, 663831, 661016, 680026, 657905, 587991, 643092, 776785, 785262, 808871, 801952, 798497, 829442, 840587, 860731, 801357, 789375, 778029, 800234, 899980, 891419, 943256, 979796, 1079058, 1072937, 1004600, 955951, 818730, 793787, 851871, 904798, 880426, 872425, 819836, 871845, 1128721, 1162684, 1013155, 937203, 940351, 992355, 967941, 933335, 993935, 1182377, 1413934, 1620886, 1955478, 2312542, 2859718, 3408231, 3965747, 4545903, 5067307, 5510112, 5870267, 6045328, 6027207, 5642157, 4981389, 4218817, 3461306, 2983633, 2643736, 2505209, 2439650, 2301833, 2214400, 2069940, 1889132, 1804507, 1857295, 1927471, 1953404, 1882732, 1896885, 1847351, 1813993, 1779662, 1775753, 1816627, 1810008, 1851422, 1886320, 1887925, 1917852, 1973566, 2086003]
10335B086003J22196Q9873J45885J52624J24973L77707O42985Q08635Q75062J021487
10325F447430J052852J090798J113743J040322Q85771L58596m17235p74958j116255
10316I681064j243076j100151q31738q41341n70896m79777l52823k68362l27408
10307C665492j02265n5734j00152j66732n5673p2909j06325j12131j22004k9978
10297B741589j4349o5689n8487n8878j17096n8336j9486m6455n6638J24196J37395
10286B507766L4585J47869R9347Q8649J53099J48495M35289N71245O40670P35736
10276E562750P81841P08295O05472N27185J62174j78221n31792q44729r59770
10267E833205q43413p08097o27726m43001l53897j94795j15633j81373j14415
$$ y = [2086003, 2208199, 2298072, 2443957, 2596581, 2721554, 3099261, 3742246, 4550881, 5425943, 6447430, 7500282, 8591080, 9704823, 10745145, 11630916, 11989512, 11572277, 10797319, 9681064, 8437988, 7337837, 6506099, 5664758, 5093862, 4614085, 4261262, 3992900, 3665492, 3563227, 3507493, 3407341, 3240609, 3184936, 3112027, 3005702, 2893571, 2771567, 2741589, 2727240, 2661551, 2603064, 2544186, 2427090, 2368754, 2349268, 2302813, 2246175, 2370371, 2507766, 2542351, 2690220, 2789567, 2878216, 3031315, 3179810, 3615099, 4186344, 4827014, 5562750, 6344591, 7052886, 7658358, 8185543, 8347717, 8169496, 7637704, 6792975, 5833205, 4989792, 4281695, 3653969, 3210968, 2857071, 2662276, 2546643, 2365270, 2250855]
10258B250855j86991j91965r7079m4364l4605N0263P1749K94j00325r8680m6898
10247A572254N5687J18485q975j65905j1348m394n1929P774k4633K4384j6001
10236A495399j24198j00112K2384J19784K56237J34332l6206j0080l3266L6125
10226A760399L1495P0742l94m2797O3555K7966j3383l5653j34659j1192M3827
10215A759906k4321m9594q8528q7618r7081m8953K402n1362Q0578O1813N7598
10204A514840n7225j47825j20843j823n4496O3318Q0522P6031J11044k6840q8166
10193A348537p1230L5972L8792J07096k3189j26948J8818n0740j18475K6186N3783
10182A238602m3767o8319J44008k1265P1586j84p4169L1610R4905j14987l2653
$$ y = [2250855, 2063864, 1871899, 1774820, 1730456, 1695851, 1746114, 1817863, 1818157, 1717832, 1619152, 1572254, 1627941, 1746426, 1737451, 1571546, 1560198, 1555804, 1503875, 1511649, 1487016, 1511400, 1495399, 1371201, 1271089, 1293473, 1413257, 1669494, 1803826, 1767620, 1757540, 1724274, 1760399, 1791894, 1862636, 1862242, 1819445, 1883000, 1910966, 1897583, 1861930, 1727271, 1716079, 1759906, 1735585, 1685991, 1597463, 1509845, 1412764, 1363811, 1366213, 1314851, 1395429, 1457242, 1514840, 1457615, 1309790, 1188947, 1187124, 1132628, 1195946, 1276468, 1352499, 1463543, 1436703, 1348537, 1277307, 1313279, 1352071, 1459167, 1435978, 1309030, 1327848, 1277108, 1158633, 1184819, 1238602, 1194835, 1126516, 1270524, 1249259, 1320845, 1320661, 1246492, 1278102, 1373007, 1258020, 1225367]
10171A225367m4826o7863J02937J47810J5183r1771n1809l8032k0719J6230r4172
10160A098335r0280Q8637l4481K4336K1707m6521j12205m362R7311q2924j7758
10149I41795k9290K3270R9616M3572Q0908O0538m5213N2515k8184j01508Q4763
10138A182782M3978K6504P6549J1177M9356L5918K5926M0486n5500M7202R6709
10127A581087o589k4301r433k2401J08628K3330r4532j63457r1607l6765N6896
10116A320856N9490j27410J4165R3490J00166J0476l1336M5645P6681M9314l3343
10105A578194J4236Q8514J14736J32763j0114l6570r0107j27187m5065J01398
10095A720798O791m1289J41117K3502j27258k0517J20458p5233q3796K5661l15
$$ y = [1225367, 1180541, 1112678, 1215615, 1363425, 1378608, 1286837, 1235028, 1196996, 1176277, 1192507, 1098335, 1008055, 1096692, 1062211, 1086547, 1108254, 1061733, 949528, 945166, 1042477, 959553, 941795, 912505, 935775, 1035391, 1078963, 1159871, 1220409, 1175196, 1227711, 1199527, 1098019, 1182782, 1226760, 1253264, 1329813, 1340990, 1390346, 1426264, 1452190, 1492676, 1437176, 1484378, 1581087, 1574498, 1550197, 1540764, 1518363, 1626991, 1650321, 1555789, 1392332, 1300725, 1263960, 1320856, 1380346, 1252936, 1267101, 1360591, 1460757, 1471233, 1439897, 1485542, 1562223, 1611537, 1578194, 1592430, 1680944, 1795680, 1928443, 1918329, 1881759, 1791652, 1664465, 1619400, 1720798, 1727589, 1686300, 1827417, 1850919, 1723661, 1703144, 1823602, 1748369, 1664573, 1690234, 1689919]
10084A689919K0177r0987m418L3252m7431r1750K4368L619R9170L2334L3607o9864
10072A631996m5266J2016j44199k0628R0584J01115O0382J459K2578o6745n0704
10061A592588P1305Q0152O5409J3174n0419r7665j27851l4105M6401k9299P3495
10050A603185j6582l7807P2427O7656N1747O9410j1904q5569J9118K3398o5798
10039A689281N4687M0277j5651k4898K7569p3122m4736L0416l8096O8549L7995
10028A752271P8247O6187O4774k4945o8730l431M1824P6478M8116m4429R1587
10017B077949P4379L8788J71212M1225m8123o2344K6311L6382M5593o666R1171
10006B485877J12214N9662o1583n3741n8230R0405J74095R8022M1058r6215m6425
$$ y = [1689919, 1710096, 1619109, 1614691, 1647943, 1600512, 1508762, 1533130, 1536749, 1635919, 1668253, 1701860, 1631996, 1586730, 1598746, 1454547, 1433919, 1524503, 1625618, 1686000, 1687459, 1710037, 1643292, 1592588, 1663893, 1744045, 1809454, 1822628, 1772209, 1674544, 1546693, 1512588, 1558989, 1529690, 1603185, 1586603, 1548796, 1621223, 1688879, 1740626, 1810036, 1798132, 1712563, 1731681, 1755079, 1689281, 1743968, 1784245, 1768594, 1743696, 1771265, 1698143, 1653407, 1683823, 1645727, 1714276, 1752271, 1830518, 1896705, 1961479, 1936534, 1867804, 1864373, 1906197, 1982675, 2030791, 1986362, 2077949, 2152328, 2191116, 2362328, 2403553, 2355430, 2293086, 2319397, 2355779, 2401372, 2394706, 2485877, 2598091, 2657753, 2596170, 2542429, 2484199, 2574604, 2748699, 2846721, 2887779, 2791564, 2745139]
9995B745139K462J08636M6295L9478J09693j29699l1784J49996J51420J05194
9985C296830M2399p747j0038K8512J06907P3714K6307N6729J86030J61540L0835
9974C992018J11174J98319J56437J3347R9737J33769l832P5228j02355k9917o3830
9963D580095j2452m1326r170l1941l4263P4992K01356J08703J3082K5880P8959
9952D953915J67294K36887L34920L07638K49409K36099N66623M86321O57349Q83909
9942I080364R30673J221158J965730K913096L618908L326527K091778J566964
9934B6715198K550236K988154K120019j921193n855966m767283k622709j413860
9926A7792596q57580n16975j9622K80788M13205O50704R13882J016671J068078
$$ y = [2745139, 2747601, 2856237, 2902532, 2942010, 3051703, 2922004, 2890220, 3040216, 3191636, 3296830, 3339229, 3331482, 3321444, 3349956, 3456863, 3530577, 3556884, 3613613, 3799643, 3961183, 3992018, 4103192, 4301511, 4457948, 4471295, 4571032, 4704801, 4700969, 4776197, 4673842, 4643925, 4580095, 4567643, 4526317, 4517147, 4485206, 4450943, 4525935, 4727291, 4835994, 4849076, 4874956, 4953915, 5121209, 5358096, 5693016, 6000654, 6250063, 6486162, 7052785, 7539106, 8196455, 9080364, 10011037, 11232195, 13197925, 16111021, 19729929, 23056456, 25148234, 26715198, 29265434, 32253588, 34373607, 32452414, 26596448, 21829165, 19206456, 17792596, 16935016, 16418041, 16398419, 16679207, 17092412, 17743116, 18656998, 19673669, 20741747]
9917B0741747J150773J321254J513105J513850J240665J149170J342013J428272
9909C1400849J365127J060330P58705N20699O34606Q73600Q21829P71254R12783
9900C9119782J026990R92704R39136J012850J069644J106188J252616J505982
9892D8025892J805421J921747K213726K292450K148564J902826J269014M39300
9884F2018940N7196j59894J7641K94345P08605J038453J454039J943310K203327
9875F9575962K284206K380151K587079K689114K502095J844671R24413J48135
9867H4935826j83235o30840j231577k026258k546362k541730k669467l121925
9859F9984432l306344l113195k347334j367658l80636O75691J431105K064715
$$ y = [20741747, 21892520, 23213774, 24726879, 26240729, 27481394, 28630564, 29972577, 31400849, 32765976, 33826306, 34585011, 35105710, 35740316, 36613916, 37435745, 38206999, 39119782, 40146772, 41139476, 42078612, 43091462, 44161106, 45267294, 46519910, 48025892, 49831313, 51753060, 53966786, 56259236, 58407800, 60310626, 61579640, 62018940, 62076136, 61916242, 61933883, 62228228, 62936833, 63975286, 65429325, 67372635, 69575962, 71860168, 74240319, 76827398, 79516512, 82018607, 83863278, 84787691, 84935826, 84752591, 84121751, 82890174, 80863916, 78317554, 75775824, 73106357, 69984432, 66678088, 63564893, 61217559, 59849901, 59469265, 60144956, 61576061, 63640776]
9851F3640776K639856K908557K964553K434568J451069J20181p04325j233995
9843G4221240j601960j851970j253994j23569J004478J960231K596255L190671
9835G8141382L324953L584719L856926L907838L865776L526250L090067K565376
9827A05863287J700423Q47248N70162M04042L03981M25791J153267J941590K497707
9818A15707498K566546K160903J427735O36800l88560j483274k077818k435166
9810A16114664k828699l482217l822482l402355k774018k561869k673363k544690
9802I2024971k248486j806527j283011p77480l33583J57659L43110J30818K01817
9793H6409288Q4083o05447j208793j338393j078467j084990j641739k401041k799511
$$ y = [63640776, 66280632, 69189189, 72153742, 74588310, 76039379, 76159560, 75455235, 74221240, 72619280, 70767310, 69513316, 69389747, 70394225, 72354456, 74950711, 78141382, 81466335, 85051054, 88907980, 92815818, 96681594, 100207844, 103297911, 105863287, 107563710, 108410958, 108981120, 109385162, 109689143, 110114934, 111268201, 113209791, 115707498, 118274044, 120434947, 121862682, 122499482, 122110922, 120627648, 118549830, 116114664, 113285965, 109803748, 105981266, 102578911, 99804893, 97243024, 94569661, 92024971, 89776485, 87969958, 86686947, 85909467, 85575884, 85733543, 86076653, 86207471, 86409288, 86493371, 85887924, 84679131, 83340738, 82262271, 81177281, 79535542, 77134501, 74334990]
9784G4334990l327722l923234m345965m244946l697012l034968k335392j808024
9776D7617727j362537j262429j380946j411951j526018j528257j275785j102017
9768C6767787r68809r64297p40219m66580l82481m13911j08042n9582k24747k15410
9758C2223709k60693m86149m25833n58868n60734l93943m21051l49290n5196J84947
9748B8896899L59784M15063L90697L11132O9581m7305m17850r11252j149481j148751
9738B6768517j134661j099688p46700n17761l96616k28813p0241r978J96219K1946
9728B2782224j88275j02438j7919N0296J18774R5313J42379K87271K78777M35388
9718B3881790M95998L16454K49758J07225J07774J27084K32344K63381K69578
$$ y = [74334990, 71007268, 67084034, 62738069, 58493123, 54796111, 51761143, 49425751, 47617727, 46255190, 44992761, 43611815, 42199864, 40673846, 39145589, 37869804, 36767787, 35798978, 34834681, 34094462, 33627882, 33245401, 32831490, 32723448, 32663866, 32439119, 32223709, 31963016, 31476867, 31051034, 30492166, 29931432, 29537489, 29116438, 28767148, 28711952, 28896899, 29256683, 29671746, 30062443, 30373575, 30443156, 30395851, 29978001, 29066749, 27917268, 26768517, 25633856, 24534168, 23787468, 23269707, 22873091, 22644278, 22574037, 22564059, 22760278, 22782224, 22593949, 22491511, 22473592, 22523888, 22642662, 22737975, 22880354, 23167625, 23446402, 23881790, 24377788, 24694242, 24944000, 25051225, 25158999, 25286083, 25518427, 25781808, 26051386]
9709B6051386L92523N24432N89586R01081Q14918P47541P89321Q47030Q57434
9700C2515252O25980M18874J02189J8229P9230K16657L43870N67202O29936Q13352
9690C6330771J128959J500012J816371K084841K182194K052170J822132J641074
9682E0558524J849674K227351K966733L515423M049128M291180M169909L984665
9674G7612587L731586K928247K374807J708978J311704J481997J716973K222959
9666I5089838K940148L135408K786736J939410J215255J180266J912556K632083
9658A12831700K752897K539829J880887J432888J345115J101349J95369q91594
9650A23188440j655940j679032j419937j011257p34958m73033o19969q36637j333319
$$ y = [26051386, 26443909, 26968341, 27557927, 28459008, 29273926, 30021467, 30810788, 31657818, 32515252, 33141232, 33560106, 33662295, 33680524, 33759754, 33976411, 34320281, 34887483, 35517419, 36330771, 37459730, 38959742, 40776113, 42860954, 45043148, 47095318, 48917450, 50558524, 52408198, 54635549, 57602282, 61117705, 65166833, 69458013, 73627922, 77612587, 81344173, 84272420, 86647227, 88356205, 89667909, 91149906, 92866879, 95089838, 98029986, 101165394, 103952130, 105891540, 107106795, 108287061, 110199617, 112831700, 115584597, 118124426, 120005313, 121438201, 122783316, 123884665, 124080034, 123188440, 121532500, 119853468, 118433531, 117422274, 116687316, 116214283, 115594314, 114757677, 113424358]
9641A13424358k110114k934490l233853k879772j989047j075582j98749M46028
9633I9448779J123867J574692J561350J191130N77143k36891r77256j580365k009614
9624A00672835k210306j947218j522759j381702j573149k017919k341729k545436
9616H5132617k371343j674962j036949m14806N570L47936M13320N03907N54673
9607H1459963M46702l33205j483170k253861k467844k225091j822265j696195
9599F9625034j967214k012094k103302k104612k086682k164540k009953j931879
9591E3244758j843544j560333j185466q12964m00463l84531k99862k81382k66061
9582D6210152j04536q6999j17404k63653k91653J00562K90689J54092j74026o90244
$$ y = [113424358, 111314244, 108379754, 105145901, 102266129, 100277082, 99201500, 99002751, 99448779, 100572646, 102147338, 103708688, 104899818, 105476961, 105240070, 104262814, 102682449, 100672835, 98462529, 96515311, 94992552, 93610850, 92037701, 90019782, 87678053, 85132617, 82761274, 81086312, 80049363, 79634557, 79640127, 79988063, 80401383, 80905290, 81459963, 81906665, 81573460, 80090290, 77836429, 75368585, 73143494, 71321229, 69625034, 67657820, 65645726, 63542424, 61437812, 59351130, 57186590, 55176637, 53244758, 51401214, 49840881, 48655415, 47842451, 47441988, 47057457, 46757595, 46476213, 46210152, 46105616, 46018617, 45901213, 45637560, 45345907, 45446469, 45737158, 45891250, 45717224, 45026980]
9572D5026980q23140p75465o54097l75246l12336l35434m33606o39621p07469
9563C9970566q02798p79219p27568n93542l55424m68608q37459j072794j161069
9554C3172085r46490j111925j333069j400017j378987j243252j185529j034678
9546B3538138r00581p19607n86348n13217m65996l48752k45386l16671j43578
9537A9298002J26788M8126j14591j74524l52746m44449m19127n25238l37278k01649
9527A6903314k33705l03001k56233k76400l18533k09147k36607k30714r9499N1064
9517A4790539J50932J72413L19369J98187J15908P0712R713L2620k34299l15045
9507A5311049k41285k03496k64475l62698l76184l82558n16776n34993l79624
$$ y = [45026980, 44203840, 43428375, 42774278, 42399032, 42086696, 41751262, 41317656, 40678035, 39970566, 39167768, 38388549, 37660981, 37067439, 36712015, 36243407, 35405948, 34333154, 33172085, 32225595, 31113670, 29780601, 28380584, 27001597, 25758345, 24572816, 23538138, 22637557, 21917950, 21331602, 20818385, 20352389, 20003637, 19758251, 19441580, 19298002, 19424790, 19472916, 19358325, 19183801, 18831055, 18386606, 17967479, 17442241, 17104963, 16903314, 16669609, 16366608, 16110375, 15833975, 15515442, 15306295, 15069688, 14838974, 14739475, 14790539, 14941471, 15113884, 15433253, 15631440, 15747348, 15818060, 15827773, 15860393, 15626094, 15311049, 15069764, 14866268, 14601793, 14239095, 13862911, 13480353, 12963577, 12428584, 12048960]
9498A2048960m48318l79140k77835m33208l01543l00356k50143j84433j28123
9489I345861k06446j85395j50491j90433o1112p0394k17068j03911p9563j96443
9479G884605j06825M340j0925j25189k7508j09979j41361l4399M8112L9849K6210
9468G446930m2754J02754K4272m4328j53010n4023J0596o5397j6045j50415j36403
9457F922177j91895l74621k14765j34860p6815k29852k34602j53441j49027m8377
9447E113922o5080m7669q3734j41077l3176m071l8845j04262k00103j80881N00
9436D215524j20079j09301K9529o0531r1526J579K6923n9869K3551p9795q3951
9425C692054p5849P4155M5573m5641k3774j6257J22080J7361j26933n5303n1041
$$ y = [12048960, 11600642, 11221502, 10943667, 10510459, 10208916, 9908560, 9658417, 9473984, 9345861, 9139415, 8954020, 8803529, 8613096, 8551984, 8481590, 8264522, 8160611, 8081048, 7884605, 7777780, 7782120, 7771195, 7646006, 7618498, 7508519, 7367158, 7332759, 7380871, 7420720, 7446930, 7404176, 7506930, 7531202, 7486874, 7333864, 7279841, 7290437, 7225040, 7208995, 7058580, 6922177, 6730282, 6355661, 6140896, 6006036, 5929221, 5699369, 5464767, 5311326, 5162299, 5113922, 5048842, 5001173, 4917439, 4776362, 4743186, 4739115, 4700270, 4596008, 4395905, 4215024, 4215524, 4095445, 3986144, 4015673, 3955142, 3863616, 3865195, 3892118, 3832249, 3855800, 3776005, 3692054, 3616205, 3690360, 3735933, 3690292, 3666518, 3650261, 3772341, 3789702, 3662769, 3607466, 3556425]
9414C556425P6115O3375P252j29919n1393k0223Q6634R5925P6352m938L9812q5901
9402C709516o2014N6431M4721q138O5182K575J32147J33658l4660n077Q0658J00718
9390D215717j1760j14664q3871j5301J13269j4641j59121j8908J1017n6993q8535
9379C776209j929j2307q7452j11535K9408N3408K6031m1921J33730K6762n9827
9368C730577O7735L8178N8171L8321J53662L5513M0715L8461m2424P8166J64657
9357D401732J33306O3293R0761K18261L29212L46710K26654K66692M41572N32183
9347G050376M87990L67767L35077M95628M79365K53361J38789r8741k76943k35261
9337H997408k11243j99033j70881j23438k46413k25970q1101P138j56494j61900
$$ y = [3556425, 3632540, 3695915, 3703167, 3573248, 3521855, 3501632, 3588266, 3684191, 3760543, 3755605, 3795417, 3709516, 3647502, 3703933, 3748654, 3740516, 3805698, 3808273, 3940420, 4074078, 4039418, 4034341, 4114999, 4215717, 4203957, 4089293, 4005422, 3990121, 4103390, 4088749, 3929628, 3910720, 3921737, 3864744, 3776209, 3774280, 3761973, 3674521, 3562986, 3592394, 3645802, 3671833, 3629912, 3763642, 3790404, 3730577, 3798312, 3836490, 3894661, 3932982, 4086644, 4122157, 4162872, 4201333, 4158909, 4237075, 4401732, 4535038, 4598331, 4689092, 4907353, 5236565, 5583275, 5809929, 6076621, 6518193, 7050376, 7538366, 7906133, 8241210, 8736838, 9216203, 9469564, 9608353, 9509612, 9232669, 8997408, 8786165, 8587132, 8416251, 8292813, 8046400, 7820430, 7739329, 7746467, 7589973, 7428073]
9327G428073j76461l6010J30964M70218M62583M28999M46546M60239M01118N83746
9317A0600015M26208M8135k04086k08910k43654j35353j22184j68092k39030o3015
9307I690034J4967q2904L1641J28093J52211R9949J30292Q0950K21347K68820
9297A0735400J97386J81118J73870K07363J99745K41964K77112L59603O62465
9288A3236026Q17584Q44971J123860J354902J544806J682244J839496J872015
9280B4315904K040108K303135K395006K309926K192864K103803J941561J638108
9272D1240415J233753P67515Q24092J112312J460008J647539J157590O41904L620
9263E0088748n37905j136805k101524k423190k283454j764317j079555p31609
$$ y = [7428073, 7251612, 7215602, 7346566, 7816784, 8279367, 8708366, 9154912, 9615151, 10016269, 10600015, 11026223, 11074358, 10870272, 10661362, 10417708, 10282355, 10160171, 9992079, 9753049, 9690034, 9705001, 9622097, 9653738, 9781831, 9934042, 10033991, 10164283, 10245233, 10466580, 10735400, 10932786, 11113904, 11287774, 11495137, 11694882, 11936846, 12213958, 12573561, 13236026, 14053610, 14898581, 16022441, 17377343, 18922149, 20604393, 22443889, 24315904, 26356012, 28659147, 31054153, 33364079, 35556943, 37660746, 39602307, 41240415, 42474168, 43241683, 44065775, 45178087, 46638095, 48285634, 49443224, 50085128, 50088748, 49550843, 48414038, 46312514, 43889324, 41605870, 39841553, 38761998, 38030389]
9255C8030389n88438m19166j33878J17324N31856R33645J171278J646292J835447
9246D3124749J847721J705895J701054J800867J688739J130220o1889j143028
9238E1794328j518079j541151j311557j392057j656597j475707q81649j77683
9230D1839848L64987R19311J428252J744980K077647K310597K446137K523532
9222E5655291K562261K539778K355458K090023J705842J319605J089046P46735
9214G0064039N1492o82208j020154p51793j92637O85035J786793K909555M162477
9205G7012599N320483O321778P187274P771528Q322639Q634102Q467432P659546
9197A36697381O041615L853296J086205j429458l331607m361485m745904m280998
$$ y = [38030389, 37441951, 37022785, 36888907, 37006231, 37538087, 38471732, 39643010, 41289302, 43124749, 44972470, 46678365, 48379419, 50180286, 51869025, 52999245, 52937356, 51794328, 50276249, 48735098, 47423541, 46031484, 44374887, 42899180, 42017531, 41839848, 42204835, 43124146, 44552398, 46297378, 48375025, 50685622, 53131759, 55655291, 58217552, 60757330, 63112788, 65202811, 66908653, 68228258, 69317304, 70064039, 70115531, 69433323, 68413169, 67661376, 67468739, 68153774, 69940567, 72850122, 77012599, 82333082, 88654860, 95842134, 103613662, 111936301, 120570403, 129037835, 136697381, 142738996, 146592292, 147678497, 146249039, 142917432, 138555947, 133810043, 129529045]
9189A29529045l244105j869576j23210J930501L982063N364426N378606L884176
9181A44831926K249912J623662J884380J537240m07797l355544n277296n113312
9173A37973171l697993k642930j863210j207712l14748R18273K199265L763603
9165A35127719N470789O904074P825387Q914278J0054248J0875567J0538474Q948172
9157B04658708P468127O149562M900778L195593J839042J265800J535237J724327
9149B32737174J590935K149412L927649O463351Q502172R529323J0423849J0927426
9141B86251291J0340122R436593Q882829Q302904P086257N405841L493492J834998
9133C41034327R33892M9851n12794Q4046J405682L223573N454139P727888R362733
$$ y = [129529045, 126284940, 124415364, 124292154, 126222655, 130204718, 135569144, 140947750, 144831926, 147081838, 148705500, 150589880, 152127120, 151719323, 148363779, 143086483, 137973171, 134275178, 131632248, 129769038, 128561326, 128246578, 129164851, 131364116, 135127719, 140598508, 147502582, 155327969, 164242247, 174296495, 185172062, 195710536, 204658708, 212126835, 218276397, 223177175, 226372768, 228211810, 229477610, 231012847, 232737174, 234328109, 236477521, 240405170, 246868521, 255370693, 264900016, 275323865, 286251291, 296591413, 306028006, 314910835, 323213739, 330299996, 335705837, 339199329, 341034327, 341968219, 342018070, 341505276, 341589322, 342995004, 346218577, 351672716, 359400604, 368763337]
9124C68763337R998709R339614Q121469P266879O435279N538148N379237N310961
9116D26153633M435580L199458J874247M23102j539210l162898m645510n665558
9108D21072844n840230m596800k440802j328999k406358m347466n296613m796938
9100C90018638l184388j716370j223438r56026m30045n28621j565912l519111
9092C76894727n814553p308043p440657p462856p947051r101773r500903q301418
9084C14017473o693664o387908o782613o910594o157643m966752m980507o981063
9076B64156729r896922j1904769j1970868j0576453r399569r747624j1473790
9069A89186734j2315508j0925613q417819n605580l710222k596342j869371j516117
$$ y = [368763337, 378762046, 388101660, 396223129, 403490008, 409925287, 415463435, 420842672, 426153633, 430589213, 433788671, 435662918, 436086020, 434546810, 431383912, 426738402, 421072844, 415232614, 410635814, 408195012, 406866013, 404459655, 400112189, 394815576, 390018638, 386834250, 385117880, 383894442, 382938416, 382508371, 381979750, 380413838, 376894727, 371080174, 363772131, 356331474, 348868618, 340921567, 331819794, 322318891, 314017473, 307323809, 300935901, 294153288, 287242694, 281085051, 276118299, 271137792, 264156729, 254259807, 242355038, 230384170, 219807717, 210408148, 200660524, 189186734, 176871226, 165945613, 157527794, 151922214, 148211992, 145615650, 143746279, 142230162]
9061A42230162r89227m76902j38883n62302j145423j579754j761942j412643j139913
9052A33023173j590553k126769k164631k057120k496328l125203l628613l273513
9044A12560443k016032q96855j58384l260j54270j38021L6826K32385j13381n91409
9034A08758042j217263j512456k009544k102932k033462j702387j453779j445849
9026I5280370j870720k069405j973920j496545j145513j049660j114765j143443
9018H3416399j371468j272039j069627j159620j616254k143303k569626l044709
9010F9169753l339480l385293l388385l064367k569613j993363j808786j603274
9002D8017192j332528j227761j282175j399891j300282j384672j419254j325574
$$ y = [142230162, 141240935, 140764033, 140625150, 140062848, 138917425, 137337671, 135575729, 134163086, 133023173, 131432620, 129305851, 127141220, 125084100, 122587772, 119462569, 115833956, 112560443, 110544411, 109647556, 109489172, 109485912, 109331642, 109193621, 109230447, 109462832, 109349451, 108758042, 107540779, 106028323, 104018779, 101915847, 99882385, 98179998, 96726219, 95280370, 93409650, 91340245, 89366325, 87869780, 86724267, 85674607, 84559842, 83416399, 82044931, 80772892, 79703265, 78543645, 76927391, 74784088, 72214462, 69169753, 65830273, 62444980, 59056595, 55992228, 53422615, 51429252, 49620466, 48017192, 46684664, 45456903, 44174728, 42774837, 41474555, 40089883, 38670629, 37345055]
8994C7345055j318729j175192q56494o72588o38833p88945r33332r18769q19052
8985B9223121q84481r21699q81465j008184j011618r22341r24811q98220q08479
8976B0961823n39288m20197n17304l34504k27834K3265K80002L46941J79303K43854
8966A9996061L84382L45402L18567J08221m22624r25685j071246j178656j101139
8957A6453283j012661r14540p78909o41932m58869m40792m20090l19666k49045
8948A1216779r3974L682r4697j2295J73783R5539K048k909q5089k47902m96455
8937A0458510p51384p20408n41776m95442n00921m48935l54699k07028k17342
8928F220575j65632j86415j61429j04975j25884j31534o7120j06264j26821j56242
$$ y = [37345055, 36026326, 34851134, 33994640, 33322052, 32683219, 31894274, 30960942, 30042173, 29223121, 28338640, 27416941, 26535476, 25527292, 24515674, 23593333, 22668522, 21770302, 20961823, 20422535, 20002338, 19485034, 19150530, 18922696, 18945961, 19225963, 19572904, 19752207, 19996061, 20380443, 20725845, 21044412, 21152633, 20730009, 19804324, 18733078, 17554422, 16453283, 15440622, 14526082, 13747173, 13105241, 12646372, 12205580, 11785490, 11465824, 11216779, 11122805, 11126487, 11031790, 11019495, 11193278, 11288817, 11290865, 11287956, 11202867, 10954965, 10458510, 9707126, 8986718, 8444942, 7949500, 7448579, 6999644, 6644945, 6437917, 6220575, 6054943, 5868528, 5707099, 5602124, 5476240, 5344706, 5277586, 5171322, 5044501, 4888259]
8918D888259j14802r8503j38108q0906j23403j00569j75534j67484m8839r7876
8908C742235n011j4191p3754r4870l3234n2408n2133j26016l1815j053o2150m2618
8896C152982p0510j0548n4867r4799N28J929n0856j59128j63797k3222J1352k2058
8884B517006m5781m1839r5400N14j9092m6175n8388P5905o6493j08519M3974l3100
8872B122612r4495m8309O6243M6451M6651J28674K6944l684O3601J08084o9247
8861B393525j09171r8724j08890j49233j66873l5766m4259q6644p6312O6843N5543
8850A640039j15686j07502r145j2359k4477M0528R6432J598M0355J08466r506
8839A648743j363p3285q9384j657n3589m0580j21839N5715j427m4647k1072l4612
$$ y = [4888259, 4773457, 4674954, 4536846, 4455940, 4332537, 4231968, 4056434, 3888950, 3840111, 3742235, 3737224, 3723033, 3649279, 3554409, 3521175, 3468767, 3416634, 3290618, 3258803, 3257750, 3195600, 3152982, 3082472, 3071924, 3017057, 2922258, 2922786, 2924715, 2873859, 2714731, 2550934, 2527712, 2539064, 2517006, 2471225, 2429386, 2333986, 2334500, 2315408, 2269233, 2210845, 2286750, 2220257, 2111738, 2155712, 2122612, 2028117, 1979808, 2046051, 2092502, 2139153, 2267827, 2294771, 2291087, 2354688, 2462772, 2393525, 2284354, 2185630, 2076740, 1927507, 1760634, 1724868, 1680609, 1593965, 1517653, 1584496, 1640039, 1524353, 1416851, 1407706, 1395347, 1370870, 1411398, 1507830, 1509428, 1549783, 1658249, 1648743, 1647380, 1574095, 1484711, 1483054, 1429465, 1388885, 1267046, 1322761, 1321334, 1276687, 1255615, 1221003]
8827A221003r733N0598K5760M952K1771j28630j37404J21005Q7382k1488j52342
8816A082874j05069M9526N7464K0518P1231M0596k2731K5770P2022m1068o066
8805A245067J03399l9742j05764J1508P1072l1960l3341J5212L0179p5042j22201
8794A068387J9866K7512L816O0927M5544l8099j23978n1734L7095O6505J37717
8783A253558J93385P2741j1112J2970K8788J23679P4487j84628r1730R8802J22113
8772A693053j5809j0219Q3539J64635J56566J30324K40339O5710K4048J82719
8762B714905O1724N1263P0455O7070n415j56775j38326O0757N9079Q0926N6420
8751B922083L6385m1070N5460Q9517R0596J05123M3544j4993K3275R9999P6465
$$ y = [1221003, 1211270, 1261868, 1287628, 1292580, 1314351, 1185721, 1048317, 1169322, 1256704, 1235216, 1082874, 977805, 1027331, 1084795, 1105313, 1176544, 1217140, 1194409, 1220179, 1292201, 1251133, 1245067, 1348466, 1308724, 1202960, 1214468, 1285540, 1253580, 1220239, 1235451, 1265630, 1190588, 1068387, 1088253, 1115765, 1119581, 1180508, 1226052, 1187953, 1063975, 1012241, 1049336, 1115841, 1253558, 1446943, 1519684, 1508572, 1521542, 1550330, 1674009, 1748496, 1563868, 1472138, 1570940, 1693053, 1677244, 1667025, 1750564, 1915199, 2071765, 2202089, 2442428, 2508138, 2532186, 2714905, 2776629, 2827892, 2898347, 2965417, 2960002, 2803227, 2664901, 2725658, 2784737, 2865663, 2922083, 2958468, 2917398, 2972858, 3062375, 3152971, 3258094, 3301638, 3286645, 3309920, 3409919, 3486384]
8740C486384P5612l8509L2416L6237J20407N3706M3133L439q5157R5895Q6325
8729C909888M6363N6784J41279J17749N0264J22875J32904N3118N6544L6628K2241
8718D746637Q0780K4903J00701J51115J16297O6766Q1373M5479N9224O4645J23887
8707E661807J0062R448Q6064P6745M3405l0086J62880K3626m6834O7486J69744
8696F234347J23256J31377J7145Q7768Q7426J61233N1902J67260J43686J68501
8686G373901L29523J02060J64328J85879J59938J19203K33877K24429K33230J94529
8676I320897O3017K23200K79318J07312j0874J28158K13133K6895p4960l7497
8666A0238599N9842J13454J48823J50539J92241J87373O2013M2597M4348J04600
$$ y = [3486384, 3561996, 3523487, 3555903, 3592140, 3712547, 3766253, 3809386, 3812825, 3727668, 3823563, 3909888, 3956251, 4013035, 4154314, 4272063, 4322327, 4445202, 4578106, 4631224, 4687768, 4724396, 4746637, 4827417, 4852320, 4953021, 5104136, 5220433, 5287199, 5368572, 5414051, 5473275, 5537920, 5661807, 5671869, 5681317, 5767381, 5844126, 5887531, 5857445, 6020325, 6043951, 5997117, 6064603, 6234347, 6357603, 6488980, 6506125, 6593893, 6681319, 6842552, 6894454, 7061714, 7205400, 7373901, 7703424, 7805484, 7969812, 8155691, 8315629, 8434832, 8668709, 8893138, 9126368, 9320897, 9383914, 9607114, 9886432, 9993744, 9982870, 10111028, 10324161, 10351056, 10276096, 10238599, 10298441, 10411895, 10560718, 10711257, 10903498, 11090871, 11152884, 11195481, 11239829, 11344429]
8656A1344429J75247L62272K78803L40244L52248K92108M51799M27543K73031
8647A4297724K10386N8960P8997K54855L07024K64984K24828L30616L09007K52135
8637A6589516J13402j2542O1632L687r3088k30663l43228l22203k95110l10659
8627A5160744j62215q9860j69883o2773N2575K7952J39595J31359J12100R3721
8617A5233315O7024J10862J76773J37958J05084m642R2967N5886o9929j02148
8607A5803150m23826l39163k54328j88677k79729k66528q9155k27699k22224k27885
8597A3283936j93600o3930n3533j07968r1892j63591j77109m3364n6067j72797
8587A2160085k37651l01921j47714l02788m60196l44721k81378k46459k15280
$$ y = [11344429, 11519676, 11881948, 12160751, 12500995, 12853243, 13145351, 13597150, 14024693, 14297724, 14508110, 14567070, 14646067, 14900922, 15207946, 15472930, 15697758, 16028374, 16337381, 16589516, 16702918, 16690376, 16752008, 16755695, 16662607, 16431944, 16088716, 15766513, 15471403, 15160744, 14998529, 14908669, 14738786, 14676013, 14728588, 14756540, 14896135, 15027494, 15139594, 15233315, 15300339, 15411201, 15587974, 15725932, 15831016, 15826374, 15919341, 15975227, 15905298, 15803150, 15379324, 15040161, 14785833, 14597156, 14317427, 14050899, 13961744, 13734045, 13511821, 13283936, 13090336, 13026406, 12972873, 12864905, 12773013, 12609422, 12432313, 12388949, 12332882, 12160085, 11922434, 11620513, 11472799, 11170011, 10709815, 10365094, 10083716, 9837257, 9621977]
8578I621977l54144k51674k37103l01376k60064k63417k51216l25817l95657k13852
8568F767657k29247k21472k38267l93126k65185l29999k79850j66852j62036k61112
8558D220511j74317j79539j42468o7554j50274j71637j28542r6900r0689m8170
8548B970421r0602k9616j54068j51440p3652k13500r6690l8945K9452k7619j30654
8537A993087k2852m0601r0042l2151j29963l5590L4624o6207P3698J3208l2341
8526A664870j07123j29930j13145L0918n8115r3163n9665l6572m3640p0454l219
8515I80762j712L923P3605j14107j49246l3457m9401j15638q1627j7799O8002
8504E63305J3149L3605n2410l2122Q6026j9898j13625J5603r8025l1227P9279
$$ y = [9621977, 9267833, 9016159, 8779056, 8477680, 8217616, 7954199, 7702983, 7377166, 6981509, 6767657, 6538410, 6316938, 6078671, 5685545, 5420360, 5090361, 4810511, 4643659, 4481623, 4220511, 4046194, 3866655, 3724187, 3656633, 3506359, 3334722, 3206180, 3109280, 3018591, 2970421, 2879819, 2850203, 2696135, 2544695, 2471043, 2257543, 2160853, 2121908, 2151360, 2123741, 1993087, 1970235, 1929634, 1839592, 1807441, 1677478, 1641888, 1676512, 1610305, 1684003, 1697211, 1664870, 1557747, 1427817, 1314672, 1345590, 1287475, 1194312, 1134647, 1098075, 1054435, 983981, 980762, 979050, 982973, 1056578, 942471, 793225, 759768, 710367, 594729, 513102, 495303, 563305, 576454, 610059, 557649, 525527, 611553, 591655, 478030, 493633, 395608, 364381, 443660]
8493D43660r5310O5972P2101Q664L1415l3759j47816O7564Q1143k1029j42111
8482C30494j18095k288P2188N6331O9093j0910j4691o533J287M9561r7264m4082
8470B85091n7486j09954k7149Q0028M1045n7588N9499Q5957j0192j6876N8112
8459C30487k0851q5863n3137j1384m8263L0828J2723l8512j0160n7633L4109P1070
8447A53414n732p3828L0426L8276p1254m5869P1521N2421N5256k3988p9159J9335
8435A20819J2705o2082j4560L2438l8008l2460m5736L5874P0217L4313O1959K1998
8423A97477j02808n7553l7538m2522J00976P6149N3948m6082j30946n5390k2982
8412f7271R1466r821r5911k7403P0400O8228K3843k7048j9087O6695p0575M822
$$ y = [443660, 348350, 414322, 486423, 495087, 526502, 492743, 344927, 412491, 493634, 472605, 330494, 212399, 210111, 282299, 338630, 407723, 396813, 382122, 375589, 376876, 426437, 329173, 285091, 227605, 117651, 90502, 170530, 211575, 153987, 213486, 299443, 289251, 272375, 330487, 309636, 223773, 170636, 159252, 110989, 141817, 154540, 116028, 105868, 48235, 82344, 153414, 147682, 73854, 104280, 142556, 71302, 25433, 96954, 149375, 204631, 180643, 101484, 120819, 133524, 71442, 56882, 89320, 51312, 18852, -26884, 8990, 79207, 113520, 175479, 197477, 94669, 37116, -422, -42944, 58032, 134181, 188129, 142047, 11101, -44289, -67271, 24195, 14374, -81537, -108940, -38540, 29688, 53531, 26483, 7396, 74091, 3516, 8338]
8400H338M4681M5294P2672j2386j06178O281L0996J7792N7244o9982p0838J3207
8388C7121J4964L9693n8114r6667k3595o2753J5704J75703P1973q5924J05633
8377A33738R2022O8594P7454k6811K4322j08304j95484k4129L492n1478m2148
8366d8732L422r6584L1166N7666K8910p1957k9264J4746N342J5532l2172M3995
8354g7930K0099Q7119n63n7029j0983O2285L8349q0484K4723j2009m8403L4122
8342b0704J18264P3993r8033n3j48789q33P8389o1092k0132r1328n7963O7397
8330a60884J21069o720l9764L8252k2403q3988N6937K124M7682O6235k7112k9749
8318c8321k7916J4229O240j30561j25531N6481J39065Q2082M2206p820n8410N1259
$$ y = [8338, 53019, 98313, 170985, 158599, 52421, 58702, 89698, 107490, 164734, 94752, 23914, 37121, 52085, 91778, 33664, -63003, -86598, -149351, -133647, 42056, 114029, 28105, 133738, 225760, 294354, 371808, 344997, 369319, 261015, 65531, 41402, 44894, -6584, -48732, -45310, -141894, -110728, -53062, -24152, -96109, -125373, -110627, -105285, -89753, -121925, -77930, -57831, 29288, 28725, -28304, -39287, 22998, 61347, -19137, 5586, -6423, -54826, -20704, 97560, 171553, 73520, 73467, -75322, -76155, 2234, -58858, -78990, -170318, -228281, -160884, -39815, -46535, -86299, -48047, -70450, -154438, -97501, -95377, -47695, 18540, -8572, -38321, -66237, -52008, -45768, -176329, -301860, -245379, -106314, -24232, 17974, 10154, -48256, 3003]
8306C003o2854P2872R170m5790M2372l5248n4502n1993O9103p4314l3527J35248
8294b6460r021p081K6084M5107Q1765N2902k8526n6924m021O6724l3860j10673
8282c984l5551k4023r0191q4216N2486J23223M9592m6910j64001l9493J59759
8271a03309Q0399j12219L4796J15117R3496l2499j1896r436r5370j7936K7583
8260c1274o5613L827J35630m047k13682K9354n294m9146l3405K6268J27013P8410
8248a959j0698Q0329l8726n9989l8674M7968Q7647R8840m7132r9664l9685l3733
8236e5476J22955N2843O4175j9029M88k3176m8389o1513j02885R4599N8315P7
8224H2984p0762j05495p203k124O6057m4380o1614K19663J04255N7735r8108j06910
$$ y = [3003, -59851, 13021, 22191, -23599, 18773, -16475, -70977, -122970, -53867, -128181, -161708, -26460, -35481, -42562, -16478, 28629, 110394, 163296, 134770, 77846, 73825, 140549, 106689, -3984, -39535, -63558, -153749, -237965, -185479, -62256, -12664, -59574, -223575, -263068, -103309, -22910, -135129, -100333, 14784, 108280, 75781, 63885, 54449, -40921, -58857, -31274, -96887, -93060, 42570, 38523, -175159, -145805, -151099, -200245, -233650, -207382, -80369, -1959, -12657, 67672, 28946, -31043, -69717, -21749, 65898, 164738, 117606, 17942, -21743, -55476, 67479, 120322, 184497, 165468, 165956, 142780, 94391, 32878, -70007, 24592, 82907, 82984, 12222, -93273, -100476, -102600, -36543, -80923, -142537, 77126, 181381, 239116, 141008, 34098]
8212C4098j6599L6102O2012j9959O8300j8769l6626J1582O2956N9588j7296m2172
8200A83217R380K5431n8910j1497n6173J039L7442L6488R38r4279o5768m3141
8188c5833r6140j277J82319J1802R764l0269o2960m5104P0582R0027K5508n2053
8176F6366m085L7374o7007J9880J40079J77389R58k5200l6572m1261K5959q6278
8164B07602J6737J53167Q4812j00310j87071P803p1741j1651j140M1989P8203
8153B18400k6034p2679l0809j20583K3724R867P1998L1923m2213p8305o3063J05076
8141B7302N6477Q7408o008J0485J5186J2877M284n9445P2664N8304k8291N3208
8129C04451J19677r626o9391m9139j0548l4533j49575p7803k9253P499K7507M5718
$$ y = [34098, 17499, 53601, 115613, 95654, 163954, 145185, 108559, 120141, 183097, 242685, 225389, 183217, 192597, 218028, 159118, 147621, 91448, 92487, 129929, 166417, 167355, 73076, 7308, -35833, -131973, -133250, 49069, 60871, 70635, 40366, -22594, -67698, 2884, 92911, 118419, 66366, 62281, 99655, 32648, 52528, 192607, 369996, 370954, 345754, 309182, 267921, 293880, 207602, 224339, 377506, 462318, 362008, 174937, 182740, 110999, 99348, 98208, 140197, 218400, 192366, 119687, 88878, -31705, -7981, 1886, 73884, 105807, 63594, -14711, -77774, 27302, 83779, 171187, 165179, 175664, 190850, 203727, 208011, 148566, 221230, 279534, 251243, 304451, 424128, 414502, 345111, 295972, 285424, 250891, 101316, 23513, -5740, 1759, 29266, 74984]
8117G4984L9632M1653o4736j33971m1828J08655P3462N6552Q434j82396k6869
8106d6428O9037j0969r6429R8624J08703R8869R3785j8928n2608r0141K2622N7579
8094B33716l1889l5764q516R126K8873P5379N5202J5103l0347j3611j04152o6031
8082A27089m8195O2092J97286J34890k11630j00541L3259j1475J1664J47601N9963
8071D02003l5261l8676o3007J12340J72604j7960M468Q5752K6877M606r5886r750
8059E48110m7664j00743k8475R894L2579N1156J23406m993K7304O6970j3047J05120
8047G69617O8062l8965L9143R2409Q7240P5429L7Q2917J95124J51714J702Q5229
8035A609658J47138J41577J72575K91570K03543K79509L40568J57415K25442L01937
$$ y = [74984, 114616, 156269, 91533, -42438, -84266, 24389, 97851, 154403, 162837, -19559, -46428, 22609, 11640, -84789, 13835, 122538, 221407, 315192, 296264, 243656, 153515, 176137, 233716, 201827, 166063, 157547, 166673, 195546, 270925, 326127, 341230, 310883, 297272, 193120, 127089, 78894, 140986, 338272, 473162, 261532, 160991, 194250, 182775, 194439, 342040, 402003, 366742, 328066, 265059, 377399, 550003, 532043, 536511, 622263, 649140, 653746, 557860, 548110, 500446, 399703, 371228, 381122, 413701, 464857, 588263, 583270, 610574, 677544, 664497, 769617, 837679, 798714, 837857, 930266, 1017506, 1092935, 1092972, 1175889, 1371013, 1522727, 1524429, 1609658, 1756796, 1898373, 2070948, 2362518, 2566061, 2845570, 3186138, 3343553, 3568995, 3870932]
8025C870932K69226K37554Q0824O6980N0347j3663M0849L3265k0402j2475Q214
8014D611651J0654n3106j5036N0084l2949j83952j37452P0864K5311l202L7512
8003D380379j1765P1438L0793L9949J18266m9000j13974L307J00390J66357J51222
7992D887362K88680L87985M91461O98026R98686J050414Q90703Q60932Q97295
7983A1451544R48053Q90630K20008p10476j265670j350266j207742j016520q55958
7974G103603o01107m64145l95627l89136l00740k59155k63744k05843j28061j90243
7964C905802j34259j43970p1801q8528j6557P4521p9532k6959J10383p8921j24692
7953C325487n1830k2144J20479J67595J40375k3611J19317J96915K36475P1276
$$ y = [3870932, 4140158, 4377712, 4458536, 4525516, 4575863, 4562200, 4603049, 4636314, 4615912, 4603437, 4611651, 4622305, 4569199, 4554163, 4604247, 4571298, 4387346, 4249894, 4320758, 4346069, 4342867, 4380379, 4368614, 4440052, 4470845, 4510794, 4629060, 4580060, 4466086, 4469393, 4569783, 4736140, 4887362, 5176042, 5564027, 6055488, 6753514, 7752200, 8802614, 9693317, 10554249, 11451544, 12399597, 13290227, 13510235, 12799759, 11534089, 10183823, 8976081, 7959561, 7103603, 6502496, 6038351, 5642724, 5253588, 4952848, 4693693, 4429949, 4224106, 4096045, 3905802, 3771543, 3627573, 3555772, 3467244, 3450687, 3525208, 3445676, 3418717, 3529100, 3450179, 3325487, 3273657, 3251513, 3371992, 3539587, 3679962, 3656351, 3775668, 3972583, 4209058, 4280334]
7943D280334J96110L28901K18755J1461M6720K7066n766j43317k86616l74005
7933D299643m22871l63274k16007k04414k17745k88357j54413j61765j41497k06902
7923A922398o0064K8803q1900q6714j37670j29776O59K3964q7920j76917m2080
7912A172783K7408p2082j11706k2515l6106p6616l2243o6546l6864l4183L5359
7901G46689N0071q0069L7496l0093j14868j2199K1898L2743L419L9426l68k9124
7889F65021r0342K6193p1100j67345L9850O5635P69j03050k7449j13458l1106
7878A93618j0483Q3570M1881R59k5766m4130j5894n3537J21955J38644N4361K6436
7866E11614p4959j34014k2951K5115q6225p3340Q929k7574K7475N642j32740J4169
$$ y = [4280334, 4476444, 4805345, 5024100, 5035561, 5082281, 5109347, 5103581, 4960264, 4673648, 4299643, 3876772, 3513498, 3297491, 3093077, 2875332, 2586975, 2432562, 2270797, 2129300, 1922398, 1862334, 1891137, 1809237, 1722523, 1584853, 1455077, 1455736, 1479700, 1391780, 1214863, 1172783, 1200191, 1128109, 1016403, 993888, 957782, 881166, 848923, 782377, 745513, 711330, 746689, 796760, 716691, 754187, 724094, 609226, 597027, 618925, 651668, 655087, 694513, 694145, 665021, 574679, 600872, 529772, 362427, 402277, 467912, 468681, 365631, 338182, 224724, 193618, 183135, 266705, 308586, 309545, 283779, 239649, 223755, 170218, 292173, 430817, 485178, 511614, 436655, 302641, 279690, 304805, 218580, 145240, 154169, 126595, 154070, 159712, 26972, 41141]
7854D1141n2833M278K5772J55071L191r2536p0584k7338k6190l1155K532J19176
7842E0525M840M1644n5147j36327q7838O9816J55802l4115q959j2694j1411Q579
7830a5285q5097m3592J15302Q0468J4657M1383P413J0309k5623m5192j4716j29993
7818h9966Q7615L2022m7304M7337J3516n3422l0820r1901q9924J7629J08419J59568
7806F2769l0103j43333p8278m8294k2717M4646P4419P0631L6571k9935m7043P4428
7794c6239M1890N1652j28741l4912J12742P3189j5804k3864o3116j4916J5591
7783b2528N9882q1737l4700N2022O3260L0017q4669p2020J38084L5509O575k8429
7771F1266j53820J2953M6993j33r5389o9384n2056O1902O5134J378j2141K7751
$$ y = [41141, -11692, -7414, 18358, 173429, 176620, 84084, 13500, -13838, -40028, -71183, -68651, 50525, 55365, 97009, 41862, -94465, -182303, -112487, 43315, 9200, 241, -12453, -23864, -15285, -100382, -143974, -28672, 51796, 66453, 107836, 115249, 125558, 99935, 54743, 40027, -89966, -2351, 29671, -17633, 29704, 43220, -10202, -41022, -132923, -222847, -205218, -96799, 62769, 32666, -110667, -188945, -237239, -259956, -215310, -140891, -70260, -33689, -63624, -110667, -36239, 5651, 57303, -71438, -106350, 6392, 79581, 63777, 39913, -23203, -38119, -22528, 37354, -44383, -79083, -27061, 36199, 66216, -18453, -90473, 47611, 83120, 89695, 61266, -92554, -79601, -32608, -32741, -128130, -197514, -249570, -187668, -122534, -121156, -133297, -105546]
7759a05546M2707P5792q007K107n7655q7654O6503J67434k7085j76409m4874o5415
7747b18102O3118L2274J2274O9503J21933R7112q694r0105j75675k9067j055J12006
7735a4478J18561r5448n7419n535M4113l6359r6262R560N735q845m1545j6496
7723a94418N8998K5324M7566j05222O722q061N3068P7650N9K3652K4453r1926
7711h2135j06278O9495L1664o7197P6565L6920o404j51273n5412p283K8231J00707
7699a32400k6019J7200J3805N2021L9729M4731j02466j16656j18430N6509J71755
7688a00221Q518j8733N8142r055m1894J2415O2291j0186K7399l9035N3688l5896
7676c2567L4648O1034K597P5172m9942n5710q0647p515k9695j40825q9682n6147
$$ y = [-105546, -62839, 12953, 4946, 7053, -50602, -138256, -71753, 95681, 68596, -107813, -152687, -218102, -154984, -122710, -110436, -40933, 81000, 178112, 169418, 79313, -96362, -125429, -126484, -14478, 104083, 8635, -48784, -54319, -10206, -46565, -142827, -133267, -127532, -136377, -177922, -194418, -135420, -110096, -62530, -167752, -161030, -169091, -116023, -38373, -38314, -14662, 9791, -82135, -188413, -118918, -87254, -154451, -77886, -40966, -47370, -198643, -254055, -261338, -233107, -132400, -158419, -141219, -127414, -75393, -35664, 9067, -93399, -210055, -328485, -271976, -100221, -91703, -110436, -52294, -61349, -103243, -90828, -28537, -38723, -11324, -50359, 3329, -32567, 2081, 63115, 65712, 140884, 90942, 35232, -45415, -52930, -82625, -223450, -313132, -369279]
7664c69279K467L304N1932J30380N1247n7143J07458J27226K8349m0437r2797
7653e7293o8272q1207M0507m6386M3175M9764m4031M5070J4695j20530k2844j0808
7641b58160M1228J45890L5718o5035P1469j4923r9953l0081l1884J7817L397M2687
7629a41830q845K9014N2262N6208M3355K7783n3920l3499J0320K6457j6413O5773
7617E6665k5245p9768L6377o2829K4533n3967o4450j5830n2091J01888O3770j0784
7605h1731n7376Q1733r525o6130R4567k8195r4721l0903j1718N4130R1195N4455
7593d219o3386m7881n2927q394J1212r030M3078Q1089O9695j4595l9275k3656
7581e8289j02071k52672K8289O5328j00527L4435J55194O3944O9189J4958k7301
$$ y = [-369279, -366812, -363508, -311576, -181196, -129949, -187092, -79634, 47592, 75941, 35504, -57293, -125565, -206772, -166265, -212651, -169476, -119712, -163743, -118673, -103978, -224508, -247352, -258160, -216932, -71042, -35324, -100359, -28890, -43813, -143766, -173847, -205731, -187914, -184517, -141830, -150675, -121661, -69399, -13191, 30164, 57947, 4027, -29472, -19152, 7305, -9108, 56665, 31420, -48348, -11971, -74800, -50267, -104234, -168684, -184514, -236605, -134717, -70947, -81731, -139107, -57374, -66899, -133029, -38462, -66657, -161378, -192281, -203999, -149869, -58674, -4219, -67605, -115486, -168413, -176807, -165595, -174625, -131547, -50458, 19237, 4642, -34633, -58289, -160360, -413032, -384743, -319415, -419942, -385507, -230313, -166369, -97180, -82222, -109523]
7570a09523j20058n9294n8148Q6510m4259N4833J19618Q268O4104L4830j11931
7559a35050l4601R0728o928l8491m1261J4611K1939N464q6294o7625m629L8572
7547b43565L8692j1881P7561J31208O020k7592l552j8402j2882k7360O9358N7912
7535C5517r4169q011L4947P3981n125n4509J23898j0704j49998j41250q2737J8894
7523b59266k4292N7276O9314l3932J0386M8370j1956n5568L6k2611m659J192K7898
7510a97812L514P8945m0726Q1180L6206N0692Q4586l0490j02593j9371P3423J972
7498A9526j2897K672j01571j7477k4848k5154R9038J08909m8231q9968o0481P226
7486a43256N7397j9522j2866j05379M886L8289N8437J10149M6936j576o04j3029
$$ y = [-109523, -229581, -288875, -347023, -260513, -304772, -249939, -130321, -122053, -57949, -23119, -135050, -169651, -78923, -85851, -124342, -165603, -150992, -129053, -123589, -209883, -277508, -282137, -243565, -204873, -216754, -139193, -7985, -1965, -29557, -33109, -51511, -64393, -91753, -22395, 35517, -58652, -66663, -31716, 42265, 37140, -17369, 106529, 95825, -54173, -195423, -278160, -259266, -283558, -226282, -156968, -190900, -180514, -132144, -144100, -199668, -199632, -222243, -226902, -225710, -197812, -194298, -115353, -156079, -74899, -38693, 11999, 96585, 66095, -36498, -55869, 17554, 19526, 6629, 9301, -92270, -109747, -134595, -159749, -60711, 48198, -33, -90001, -150482, -143256, -85859, -105381, -118247, -223626, -218740, -180451, -122014, -11865, 35071, 33495, 32891, 19862]
7474A9862j6431j50370l9032N7202M3393k6809K448j3965j19568J7896N3302J00523
7462g1549Q5658M2176Q1287Q0J360n7690p1896l4245P5401l3956n9475O0669Q1505
7449I9325m1144j47370J13798O1233M8787R711p9164j28192r1020n3707J06428
7438a01315J10725O0861j7452n0616r7090j976Q5773k0172l485m2716n6775K8918
7426a05320L8725N0126N4332Q7613r2752j6202o2015p7238n1498J28312o3534
7415a09451r0180J27423Q5689j01693n6923L1358J9829J0714K161j2821J35957
7404D2063n1858n1553l9525j1953o8238k2276J4467L8886N5999j0587L3137j07923
7392a79361j03130n6474N6899j9786P5966M3734j04966l6996J36264J53006k4102
$$ y = [19862, 3431, -146939, -185971, -128769, -85376, -112185, -109737, -123702, -243270, -225374, -172072, -71549, 14109, 56285, 137572, 137652, 139012, 81322, 9426, -24819, 50582, 16626, -42849, 17820, 99325, 58181, -89189, 24609, 85842, 134629, 144340, 65176, -63016, -154036, -207743, -101315, 9410, 70271, 52819, 2203, -94887, -96863, -11090, -31262, -34747, -77463, -134238, -105320, -66595, -16469, 37863, 125476, 32724, 16522, -45493, -122731, -174229, -45917, -109451, -199631, -72208, 13481, -88212, -145135, -113777, -93948, -83234, -81073, -93894, 42063, -9795, -61348, -100873, -112826, -181064, -203340, -188873, -149987, -93988, -104575, -71438, -179361, -282491, -338965, -282066, -301852, -225886, -182152, -287118, -324114, -187850, -34844, -58946]
7381e8946j9164p454N4423L7832j424l062p5588m6270p246m449k2610N6101J07408
7368I551L246m1276J07506J1053p0133j58544J5504J17573m8848O781j1364m0794
7356i9745R4144j08689j45965O5829Q5637Q6465K6027j5673K1892k6003m3508
7345e9589q6263n5458l3224k9366K9045J03079j4060n2794l4483O6934K4336l6714
7333a78557o0748R7620J73438K7175r488m5621m7413j3100k5174O406j52635j21668
7321c49765N7515J60797K02082L1930j5632J7920l636L7261n2465q9753k36678
7310b40424J9813J19495l275M2019j3096N2957K0911J6841j6352m9367O9258j9131
7298c51j0151k5655J15598l2741K1270O3727l7546n9291k1261K5806n8692r3204
$$ y = [-58946, -78110, -85564, -31141, 6691, 5267, 2205, -73383, -119653, -126899, -131348, -153958, -97857, 9551, 12797, -28479, 79027, 90080, 19947, -138597, -123093, -5520, -54368, -47587, -58951, -99745, -5601, -114290, -260255, -194426, -108789, -22324, 3703, -11970, 9922, -16081, -59589, -145852, -201310, -234534, -263900, -234855, -131776, -145836, -198630, -233113, -166179, -141843, -178557, -239305, -141685, 31753, 58928, 49440, 3819, -43594, -56694, -81868, -75462, -228097, -349765, -292250, -131453, 70629, 102559, 86927, 104847, 101211, 138472, 86007, -3746, -240424, -220611, -101116, -104391, -62372, -75468, -22511, -1600, 15241, -1111, -50478, 18780, -351, -10502, -36157, 79441, 46700, 67970, 131697, 94151, 34860, 13599, 39405, -19287, -112491]
7286a12491k438O3384k4057j5845L7964m0135L4370J0136L8134l1766N515n0128
7274h7357l3576m8757k04205J5630N8056l1115K2401J41318O2176n7146l2654
7263a95229Q7409J26547O7814M8971L3998k17999L2999J06117J7010m6255k3615
7252C7767p6900K8760K0239Q579j21575J9273N9927l3431j524p2530N301K5545
7240a00569j7928j8948J02410N3633J8273n8222j12190K2190P9535m2155O3384
7229a0587J20008K6623j05451j35599L9805J01694J23623l1646o9681l6624q0146
7218e7981m3066R2306Q5888l7833n4428n0115m0852P3926l5812k1366j6928K9893
7206g6368L8211K3909P9087j07916n7016J06862J4777q4974j20643j38972L0483
$$ y = [-112491, -114929, -51545, -75602, -91447, -53483, -93618, -59248, -49112, -10978, -42744, -37229, -87357, -120933, -169690, -373895, -358265, -300209, -331324, -308923, -167605, -105429, -162575, -195229, -107820, 18727, 86541, 135512, 169510, -48489, -15490, 90627, 107637, 61382, 37767, -39133, -10373, 9866, 18445, -103130, -83857, -23930, -57361, -58885, -131415, -126114, -100569, -118497, -137445, -35035, 18598, 36871, -21351, -133541, -111351, -31816, -73971, -10587, 109421, 136044, 30593, -105006, -65201, 36493, 160116, 128470, 58789, 22165, -57981, -101047, -8741, 77147, 39314, -15114, -65229, -106081, -32155, -67967, -89333, -106261, -76368, -38157, -14248, 64839, -43077, -100093, 6769, 21546, -63428, -184071, -323043, -292560]
7195b92560J08653K7811O454n0896j8555N8791K2823K9503j27973m3346k1062
7184c00357P1236O0252J1525n3371J7387J48800m823Q6281m011p7637L0923N1431
7172C7636r1360j09874L7576J9544O5264j2596K9248L6152k2451r2575R4571L1375
7160B2510n5396k8312j23860N6177O6238M1098K9764q4135J3952P4927n5407o5333
7148a07777l4436k2375L0825P8340N7704P6835J15302j54567j33225j21449l1801
7137b46624J33219J39084j7935m0252k8007q0336j5374J00479P6193r4793r8042
7126a72388j0116J11159M0554O4854N5798O2708p9843j42072k5029J9718k6743
7115a01400q4188M7046Q6544J2755j04220L1731N8786k9308n2700j007J05266
$$ y = [-292560, -183907, -156096, -149642, -200538, -219093, -160302, -137479, -107976, -235949, -279295, -300357, -229121, -168869, -157344, -210715, -193328, -44528, -49351, 36930, 32919, -44718, -13795, 37636, -53724, -163598, -126022, -106478, -41214, -53810, -24562, 11590, -10861, -103436, -8865, 22510, -32886, -61198, -185058, -128881, -62643, -21545, 8219, -75916, -61964, 12963, -42444, -107777, -142213, -164588, -133763, -55423, 2281, 79116, 194418, 39851, -93374, -214823, -246624, -113405, 25679, 7744, -32508, -60515, -140851, -156225, -55746, 20447, -74346, -172388, -182504, -71345, -30791, 34063, 89861, 152569, 72726, -69346, -94375, -74657, -101400, -185588, -138542, -51998, -39243, -143463, -111732, -52946, -82254, -134954, -135961, -30695]
7104c0695k955n0035L6163q0192R5393N7309P515J3263n7263J8940M0753n631
7092D2565j13933n7508j4233n0937J1948K6514N158J01522k3779k8000J2556k39
7080h8366j67140M3410N6273K0788q451j6282N8459J3659m1742n2850L6683M6394
7068i9165J1324k280K4115p95m0712p3872n2335L8512K2797J6235M9426l5624
7056a42374N155J60720m0081p0116j04842k0177O2991N8571J25987L8567j3793
7045F0608n6046p2263O3036k274o0023N4366N7883l2112L3962R9506r1756Q7015
7033A41902J8206j29590j12185q4399l7655R2697J49782J8150l4796k7102j30000
7022a34990j8444M7168P4585J0442l0545j26912o4572R2609J12537R83r5121r0030
$$ y = [-30695, -33650, -83685, -47522, -127714, -32321, 24988, 32503, 45766, -11497, 7443, 48196, 42565, -71368, -128876, -143109, -194046, -182098, -155584, -150426, -48904, -72683, -100683, -88127, -88366, -255506, -212096, -155823, -135035, -143486, -159768, -101309, -87650, -129392, -182242, -145559, -99165, -87841, -90121, -66006, -66801, -107513, -181385, -233720, -195208, -172411, -156176, -106750, -142374, -137219, 23501, -16580, -86696, -191538, -211715, -148724, -90153, 35834, 74401, 60608, 4562, -67701, -4665, -6939, -66962, -12596, 45287, 13175, 47137, 146643, 54887, 141902, 160108, 30518, -81667, -166066, -203721, -111024, 38758, 56908, 22112, -4990, -134990, -153434, -106266, -31681, -21239, -51784, -178696, -243268, -150659, -38122, -37139, -132260, -222290]
7010b22290j03856N160Q2997k5540k022R3695J13504R6759K8011j11438J0138
6999c4882j1712l2358K1819k4198n4341O8597R3192m7933p8581M6994J0445l2184
6987g5142q8797p547J42237P2385m9001J6153K7305j17223N5522l3684k2841O9915
6975a0718L6815j9413K2612o8049p4575n3884J30607J5057l0082o8421l7144J17642
6963c9553j084J18J00962K0315k0122p5267r787O4624J7978P7527n5562o1979
6951A8170J53112j04847n9730n8249N3754l7917j10347L9441J32361J9423o2858
6940a7687j7587N1613j9241n1032m5250q8389K9467j5180r9661N4683q555J11729
6928a15090Q6805j18887O346J08474K1422L7771J1637k8815P8175O181n9282r0292
$$ y = [-222290, -326146, -320986, -237989, -263529, -265551, -171856, -58352, 38407, 66418, -45020, -34882, -46594, -78952, -57133, -81331, -135672, -67075, 26117, -21816, -100397, -53403, -42958, -75142, -163939, -171486, -29249, 43136, -5865, 10288, 37593, -79630, -24108, -57792, -80633, -10718, 26097, 6684, 29296, -38753, -113328, -167212, -36605, -21548, -51630, -120051, -157195, -39553, -40637, -40519, 60443, 80758, 60636, -14631, -24418, 40206, 58184, 135711, 80149, 18170, 171282, 66435, 6705, -51544, 2210, -35707, -146054, -106613, 25748, 45171, -17687, -35274, 16339, -2902, -53934, -99184, -187573, -158106, -173286, -272947, -218264, -226819, -115090, -28285, -147172, -140826, -32352, -10930, 26841, 38478, 9663, 87838, 94019, 34737, -55555]
6916e5555N6643L4440n5661q0829k0186n0056j4754O9242J0864n9682n2477k5319
6904b43330J04933k4421k9056M4686R9983J0989m3747L4576n712L7269j1107k1733
6892d6670J20085J60223o0906k9639l4855o0020l8460o1702q4479J06999M6929
6881A7505j22602l1184k8675M6272J5150L3017K9631j5359J9079P6167L4226j00176
6869b6949l655J05956l5901n3793q2048k0114Q063R4716J46849l1030O014l1437
6857G6671o9870j60756N6363l902K0399N9897l138P824q6021j01896r2615K4485
6845b72559J47477J15100K9582N4976l7772J3141m0884j2478j3275n1641j9203
6834h7536q682p6763J3587Q5775M7579K4881m9208O6133R772j00892l3380J41982
$$ y = [-55555, 1088, 35528, -20133, -100962, -121148, -171204, -185958, -116716, -105852, -165534, -218011, -243330, -138397, -162818, -191874, -147188, -47205, -36216, -79963, -45387, -51099, -13830, -24937, -46670, 73415, 233638, 172732, 143093, 108238, 48218, 9758, -51944, -136423, -29424, 17505, -105097, -136281, -164956, -118684, -103534, -70517, -40886, -56245, -37166, 39001, 73227, -26949, -30604, 75352, 39451, -14342, -96390, -116504, -108441, -13725, 133124, 102094, 108108, 76671, 6801, -153955, -97592, -101494, -81095, -21198, -24336, -16512, -102533, -204429, -297044, -272559, -125082, -9982, 19600, 74576, 36804, 49945, 9061, -3417, -16692, -68333, -87536, -96218, -172981, -159394, -73619, -26040, -1159, -50367, 15766, 25538, -75354, -108734, 33248]
6822C3248J54712o276o2150p6974r3415o9089j3585j135n165l8319P4234Q991
6810i4923P2825O36k5599m1195Q7298R3887j6107K6087m7557n8251R681M1660
6798D8442R471n1858N3127l5350l2694P4309n795o9317J12652J9482p0340q3495
6786c1366j9821p0291j9942N5294k2421R4132J03313j58910K9584N2586j02589
6775i0431J1744P4616J39208o9991L5550m8907k07270q9912J38163P9442n3895
6764h1683l0187N8832J20860r2253k8048L307p6698K2009M1960j9778m5948q3593
6752b11220n1772K0104J32896J63914O5988l5743m750O436m0049j5147J00615
6741A31272j42536j84393M7653Q3724m8404k1356N0506J35424m4020M705j0983
$$ y = [33248, 187960, 181684, 119534, 42560, -50855, -119944, -133529, -134664, -139829, -178148, -103914, -94923, -22098, -21462, -47061, -88256, -958, 92929, 76822, 102909, 55352, -2899, 6782, 48442, 57913, 6055, 59182, 23832, -8862, 65447, 59652, -9665, 102987, 122469, 52129, -31366, -51187, -121478, -141420, -86126, -108547, -14415, 88898, -70012, -40428, 12158, -90431, -78687, -4071, 135137, 65146, 100696, 51789, -155481, -245393, -107230, -27788, -81683, -111870, -53038, 67822, -24431, -52479, -49172, -125870, -103861, -61901, -81679, -127627, -211220, -262992, -242888, -109992, 53922, 119910, 84167, 79417, 85853, 45804, 30657, 131272, -11264, -195657, -148004, -64280, -112684, -134040, -83534, 51890, 7870, 12575, 1592]
6730A592m9397l3237n6331R2073J00020K0163j486j12699k6856K6393j2563q02
6718e3130J28595J1276k9171P5252m2259p4985m8877j0138L1801R9590o0765k4271
6706B918J3670Q536M1148k8505j46129J1361J06319J17122O435n5493M6345P064
6694A30791r3038m3013Q3646m7521j39243J05173P6794j04499L4519O057o0392
6683e0726J1801M4337K9745l0282J3884m1735K2770q559m2172L5599O4760K3740
6671G3162K1425n9802k9102M3298q1217j8477R0647K1481j6916J8954q8234m6679
6659g1460J13955J65090o1769r4962o4758r2920n8096L2505R5245M0940j2110
6648h340l9946L308J36476o2393k9906j519P5560M2116N0270J1325j45488r7523
$$ y = [1592, -47805, -81042, -137373, -45300, 54720, 74883, 73397, -39302, -66158, -39765, -52328, -53130, 75465, 86741, 57570, 132822, 90563, 15578, -33299, -43437, -11636, 87954, 27189, 2918, 16588, 25124, 66272, 37767, -108362, -97001, 9318, 126440, 132875, 77382, 123727, 130791, 37753, -5260, 78386, 30865, -108378, -3205, 73589, -30910, 3609, 9666, -50726, -38925, 5412, 35157, 4875, 18759, -22976, -206, -8765, -50937, -15338, 49422, 73162, 94587, 34785, 5683, 48981, -32236, -50713, 39934, 61415, 44499, 63453, -24781, -71460, 42495, 207585, 145816, 50854, -13904, -106824, -164920, -132415, -37170, 3770, -8340, -48286, -44978, 91498, 29105, -801, -2320, 73240, 115356, 165626, 176951, 31463, -66060]
6636f6060J7024p2318N1723J6180Q6012j7427n0041j13188k1215Q6841P2473n187
6624a5183M5017P756n1982M124j3246L023K7114n7746j4922O4257J32765l1374
6612I9603p6725m3377J8223J7287L9409j08187n8857M3449J32206K2966O868j3572
6600G9293k837n554N8955P4956q7036j24558k6143m5673q574J430l8442p0047
6588a94230m023J30128L1051K459n0447l2196j1651J0832M4244K0254O867o2668
6576a09380p1018j1376L6140J50927N0211O070l5790r510M5415q555P8916N0840
6564A72890m0185J9744n8145m7895j3358n3564J4158Q6810J26183j04437q7049
6553A5152j156R9533K5173K3770q52l214O1613n860k3915o8895J3391P6407j00825
$$ y = [-66060, -49036, -121354, -69631, -53451, 32561, 15134, -34907, -148095, -169310, -82469, -9996, -15183, 29834, 37590, -14392, -10268, -23514, -20491, 6623, -51123, -66045, -1788, 130977, 99603, 22878, -20499, -2276, 15011, 54420, -53767, -112624, -69175, 63031, 85997, 92865, 79293, 76456, 70902, 129857, 204813, 117777, -6781, -32924, -78597, -87171, -85741, -124183, -194230, -198253, -68125, -37074, -34615, -85062, -117258, -128909, -118077, -73833, -53579, -46712, -109380, -180398, -191774, -155634, -4707, 45504, 51574, 15784, 6274, 51689, 43134, 122050, 172890, 132705, 152449, 94304, 46409, 33051, -20513, -6355, 80455, 206638, 102201, 15152, 13996, 113529, 138702, 162472, 161620, 158406, 220019, 214159, 190244, 121349, 134740, 211147, 110322]
6540A10322j08801l4077N4571N8202l7212k5203j6313r8898n4135M9608J03491
6529A555l322k6132J01280o4763p6506j01286L1483P6082P1230O6786L3406M5171
6517A54984N7488r0918m8981o1530L6059P07m0162J06911R0137k1985j02054n8405
6505B2251p2388j12238m5947J022J00833N4185L929o919J10996j60801j91732
6494b96809M3818J25201P2724m3434O1284R1770r8859j1542J47120L9788j7266
6483A13795L8594q6193j16967J3037J4540M2822r3490o6285l1881j0032Q4708
6472i7352Q5579Q5799l5565n2190o1178j1851K3672k6861L2995N7523p5043P9399
6460D927J02664O3225J2706k5463q1097r0638j4605k8455L8674M3433K7531k1057
$$ y = [110322, 1521, -32556, 22015, 80217, 43005, 17802, 1489, -97409, -151544, -101936, 1555, -1767, -27899, 73381, 8618, -67888, -169174, -137691, -61609, 9621, 76407, 109813, 154984, 212472, 121554, 72573, 11043, 47102, 47809, 7647, 114558, 204695, 182710, 80656, 22251, -50137, -162375, -208322, -207300, -106467, -52282, -48353, -55272, 55724, -105077, -296809, -252991, -127790, -55066, -98500, -37216, 54554, -44305, -55847, 91273, 131061, 113795, 152389, 66196, -50771, -37734, -23194, 19628, -73862, -140147, -172028, -182060, -97352, -11773, 74026, 38461, -13729, -74907, -86758, -63086, -89947, -56952, 571, -74472, 4927, 107591, 170816, 183522, 158059, 76962, -13676, -28281, -56736, -18062, 25371, 52902, 31845]
6448C1845m7366P3491r6152L4729j3803o6657N1386R6828m5954P696l5213j17363
6436a26533p4262j3639O042Q3901J12604O7910K132r7130j3360K6557M6001M7127
6424F7350K3501j5148j1592J8372l2767M7108K2690J2852n0149n7062n6960m1670
6412g3475P9546R2111m3583n4812l4124L8184j6452P4069j5951k3463J2997N1490
6400H6537n3931j7321r7283O9250J15515m6793o757o9203O2307l2696k3975o0593
6388g4943K5833K15908n4396o7341l7182l4695R082q855l5736n7662N26j9520
6376a38981l1735J5718J522k7943N3500O2343n1978n7762j7428L9738o7928j24832
6364c45766L0472J75255J69060q8548j21202m8221R4490Q8216j2276r4552J8813
$$ y = [31845, -15521, 57970, -38182, -3453, -17256, -83913, -32527, 64301, 18347, 26043, -9170, -126533, -200795, -214434, -208392, -124491, -11887, 56023, 58155, -38975, -52335, -25778, 20223, 67350, 90851, 75703, 64111, 82483, 49716, 96824, 119514, 132366, 82217, 25155, -31805, -73475, 6071, 98182, 54599, -213, -34337, 3847, -12605, 61464, 45513, 22050, 35047, 86537, 32606, 15285, -81998, -12748, 102767, 55974, 49217, -19986, 42321, 9625, -14350, -74943, -49110, 166798, 112402, 45061, 7879, -26816, -17734, -26589, -62325, -119987, -119461, -138981, -170716, -154998, -153476, -181419, -127919, -65576, -117554, -175316, -192744, -153006, -220934, -345766, -315294, -140039, 29021, -59527, -180729, -228950, -134460, -46244, -58520, -153072, -134259]
6353a34259J20899J4517r50O517l497r5749K3205K814R033L1682K4774L8633J02560
6340A40179j57761r9156o5368K8738M4898K473J26733R8238j27730Q6326Q4744
6329A62314r4366m6164p15J3664N1345J85534p3112o6899j48200l4466o7679n1028
6317a69772o3958J0477J33805P0645m4173k0465K9211j27066k2490J7651l1657
6306b17792N9276J35657J34904l7097p7605j3391j5906j2248m1323j5059m0679
6295a41263J03625L1758M0802J6704l2435M7711n1295k7733l3566P2350L9385
6284F6043j5724q8475M0322Q137Q4850J6292Q5864k2012p0065p5446q3082J19206
6272F5910L9657j08205l6047J7768R0690N355q373l2186j11699K8872M8300P4219
$$ y = [-134259, -13360, 1157, 207, 6724, 3227, -92522, -69317, -66503, -57470, -25788, -1014, 37619, 140179, -17582, -116738, -182106, -153368, -108470, -105997, 20736, 118974, -8756, 77570, 162314, 67948, 21784, 21069, 34733, 86078, 271612, 198500, 131601, -16599, -51065, -118744, -169772, -233730, -223253, -89448, -18803, -62976, -83441, -54230, -181296, -203786, -186135, -217792, -158516, -22859, 112045, 74948, -2657, -16048, -31954, -44202, -85525, -100584, -141263, -37638, -5880, 34922, 51626, 19191, 66902, 15607, -12126, -45692, 26658, 66043, 50319, -38156, 2166, 10303, 95153, 111445, 197309, 175297, 105232, 29786, -53296, 65910, 105567, -2638, -38685, -20917, 69773, 75128, 66755, 34569, -77130, -48258, 42, 74261]
6260G4261l5738o8253j20871o7156J78348R8008J64986j5460n5581m9316N1904
6249A55132L1993j01752m2467Q6145m5807J6619m3942k63m5507l684k5349j21879
6237a40761R6235P6249q8276l9570L6528N3141J8144J9700j9726N3507R7696j48692
6225A4175r1839k9770M1368Q6070J16726Q0542J3424l7123j60524k04508l9363
6214b10822N6474M5387J00872J3786k7111L3568k6997L381P3683J16834k8951
6203A50104r1805j43925m9569l3798L4045k9836j4724k6945N2519J21862j15297
6192a47369q8500L755M3832P7704n3790n6606Q5360M9356N8515j493J26746P6353
6180A73863l7635j07166j01078o498O1675m805m931m0292J44284J0093p3637N2587
$$ y = [74261, 38523, -29730, -150601, -217757, -39409, 58599, 223585, 208125, 152544, 103228, 155132, 187125, 85373, 42906, 129051, 83244, 99863, 55921, 55658, 10151, 6467, -18882, -140761, -44526, 31723, -56553, -96123, -59595, -6454, 11690, 31390, 11664, 65171, 162867, 14175, -77664, -107434, -66066, 20004, 136730, 217272, 230696, 193573, 33049, -171459, -210822, -154348, -108961, -8089, 5697, -21414, 12154, -14843, -11462, 62221, 179055, 150104, 58299, -85626, -135195, -168993, -134948, -164784, -179508, -206453, -153934, -32072, -147369, -235869, -232114, -188282, -110578, -164368, -220974, -135614, -86258, -27743, -29236, 97510, 173863, 136228, 29062, -72016, -78514, -16839, -21644, -26575, -66867, 77417, 87510, 13873, 66460]
6168F6460R7630l7378m3934j34118o1362M0326N3278R8133j8049l5931J1621j07015
6156g0339K199k7156L4545O7131P2493J06724k5323K4235m1330J5312l1775j21339
6144E377m1793P0333O0047N0105m6572l2034q3974o9164L7350M994O1254K818
6132A8741Q528N1708k4499l4152n5272P5146N4277o8980j05928L6558Q5990M5610
6120H7727o3331J1108M8355k5858P832q8709l9017P546k6871p563l8101O5551
6108f1331J31098m3003O1291J9876L6505M2409l1256m5470J5621J59198q5570
6097A99368o9604j20644j48599j420N9709k3568l1318L71k5008o771R6065N9434
6085a1985p2518O8138M3927J929l133K3270n023L2906l2860Q0660m5651k070J1646
$$ y = [66460, 164090, 126712, 82778, -51340, -112702, -72376, -19098, 79035, 60986, 25055, 36676, -70339, -68140, -95296, -60751, 6380, 78873, 185597, 160274, 184509, 143179, 158491, 126716, 5377, -36416, 33917, 93964, 144069, 97497, 65463, -18511, -87675, -50325, -45331, 15923, 18741, 27269, 78977, 54478, 20326, -34946, 40200, 94477, 25497, -80431, -43873, 42117, 87727, 24396, 35504, 83859, 58001, 65833, -22876, -61893, -54347, -81218, -88781, -126882, -61331, 69767, 26764, 88055, 107931, 144436, 186845, 155589, 110119, 125740, 284938, 199368, 129764, 9120, -139479, -140899, -81190, -104758, -136076, -135705, -160713, -167484, -71419, -11985, -84503, -16365, 27562, 29491, 26358, 49628, 44605, 77511, 44651, 125311, 79660, 77590, 89236]
6072H9236j43391J16254J09175R2759o9780J798p9318j29677J147J6720m3983
6061c9060p0185Q0236M8651J9484J2701J6548K9443m6388k7139q2965N6079J04275
6049A01680l8301o7183n2142k350m2670k9373M4595R9335j2255J3551R4054k9758
6037G9183l888k7034K7422N1301R2885l6001m1717j67317j12960K1286J18144
6026A304M5812M209J23749p2026J4672O1097m9767J2625J078L9057K6458r1611
6014A16657p1940J5804Q766J0506l1298J33104K1582j53091p6893m3629J1844
6003e8588k966K12810R5137j26945j35360l0639J9113N2866p007l0958M1085l6921
5991h373R5196R9346r4445r3362J8581M9295L3670o5106K4411L1819j7822n6094
$$ y = [89236, -54155, 62099, 171274, 264033, 194253, 196051, 116733, -12944, -11797, 4923, -39060, -109245, -29009, 19642, 39126, 51827, 68375, 97818, 51430, 24291, -58674, -2595, 101680, 63379, -3804, -55946, -58296, -100966, -130339, -85744, 13591, 1336, 14887, 108941, 79183, 75295, 48261, 75683, 126984, 219869, 183868, 142151, -25166, -138126, -116840, 1304, 47116, 51325, 175074, 103048, 117720, 178817, 129050, 141675, 142753, 181810, 208268, 116657, 44717, 60521, 69287, 79793, 48495, 181599, 203181, 50090, -26803, -70432, -58588, -61554, 151256, 246393, 119448, -15912, -46551, -27438, 25428, 18421, -12537, 28548, -8373, 86823, 186169, 91724, -1638, 16943, 66238, 99908, 34802, 59213, 91032, 73210, 17116]
5979A7116l7359K7258J28228L6511n0692L2057K8829j5918j31779k5066L0930
5968D0115k9430l1980m2609J2274l6362j8241p0325Q0365O1237M6811J2097o3871
5956c9919k0113K7215j2012P409p6360j29437J14056J53001j1525J1217N7720
5945H1252p2531j00541j7803l6236J8040p8656Q251J35766k5454n993J03365K8688
5933C8148q5399n1633J34874O6331Q4311M0720j57882p1074j46639p857K7182
5922a28918J6810J0645J35476K1064k9336j09009l4264J23986l6137p6265J6577
5911h9371Q5739K8812M8788M4744J2789K5482j11405n8511J37990J36587j09538
5900A52106j75755p0215j8467r023M0355q837P7731J25205m5043r8560r7564p7010
$$ y = [17116, -20243, 7015, 135243, 171754, 121062, 153119, 181948, 166030, 34251, 9185, 40115, 10685, -21295, -63904, -51630, -87992, -106233, -176558, -96193, -34956, 11855, 23952, -39919, -60032, -32817, -44829, -37420, -113780, -243217, -129161, 23840, 12315, 23532, 81252, 8721, -91820, -109623, -145859, -127819, -206475, -198224, -62458, -87912, -93905, 9460, 38148, -47251, -98884, 35990, 102321, 186632, 227352, 69470, -1604, -148243, -156100, -128918, -112108, -101463, 34013, 55077, 25741, -83268, -117532, 6454, -29683, -105948, -89371, -3632, 25180, 73968, 118712, 131501, 156983, 45578, -12933, 125057, 261644, 152106, -23649, -93864, -112331, -121354, -80999, -89836, -12105, 113100, 68057, -30503, -128067, -205077]
5888b05077P2235O4294n9311L7759Q339O411r8432N9852k4521L561J26367O7822
5876E9299Q4973J6905j82858n6815N0204O4303Q2488j5222Q3699K82n875n7042
5864A24341j63271R5903L375n2597j09776l7991Q1621O5546O7083J5704Q2836
5853A72774j2478J6359J9690O11m3587j87009O6584L3290K3922m8245k2697l7745
5841a8531O9314k8012O1930P3941r5679j85414l3096l867m4842q4106N9712O4734
5829a63916j14280k8840J19886L2951N7840j0196O2807K5570L3747R2098J7109
5818A24776j03696j8440j25560j18962J68996J16391M0830K1311j9211K229m2505
5807D6159k3289n4684M437L5295O9340J6142p7794M2635k1125J4204R837O8645
$$ y = [-205077, -132842, -68548, -127859, -90100, -81761, -75350, -173782, -113930, -138451, -134890, -8523, 59299, 144272, 161177, -21681, -78496, -28292, 36011, 118499, 103277, 186976, 187258, 181383, 124341, -38930, 56973, 60348, 7751, -102025, -140016, -58395, 7151, 74234, 89938, 172774, 160296, 176655, 196345, 196956, 153369, -33640, 32944, 66234, 90156, 41911, 19214, -18531, 50783, 22771, 84701, 158642, 62963, -122451, -155547, -159414, -204256, -288362, -228650, -163916, -278196, -307036, -187150, -154199, -96359, -106555, -43748, -18178, 15569, 107667, 124776, 21080, 2640, -122920, -241882, -72886, 43505, 84335, 105646, 86435, 88664, 46159, 22870, -31814, -27377, 7918, 77258, 93400, 15606, 58241, 37116, 51320, 61157, 129802]
5795A29802j41758q1318K9989O865J1866R0990K9820K3256l4506K1192n32k1461
5783F4205r5770j9596R3269J15286l2575o0296l2536p953j11877n5905m9061n252
5771a98061N3244Q3550M0172L6969q8187k393L7134J324k0053J8682Q4030k7031
5759A9380j46382L0902o2201K2287k2235P7021J35206l5725m6188R6125P620o2392
5747A3418j14435k3650Q2209P631k1661n0684o8583l5079J12155R9797p6708k7414
5735a03004J14298m006N3998L8611m1354r3085q4995o5303j39940J26686J21670
5724g6424J03092p9783o4451p790o47J129j24264o741J30024P44J7201J02672
5712e238J27938J08272r0060m4852j187m2767q0672j2259J12659k8184j47370
$$ y = [129802, -11956, -93274, -63285, -56420, -44554, 46436, 76256, 99512, 65006, 86198, 85666, 64205, -31565, -51161, 42108, 157394, 124819, 64523, 31987, 24034, -87843, -143748, -192809, -198061, -144817, -61267, -21095, 15874, -72313, -74706, -37572, -36248, -56301, -37619, 46411, 19380, -127002, -96100, -158301, -136014, -158249, -81228, 53978, 18253, -27935, 68190, 75810, 13418, -101017, -124667, -42458, -34827, -56488, -107172, -175755, -210834, -98679, 1118, -75590, -103004, 11294, 7288, 61286, 99897, 58543, -34542, -119537, -184840, -324780, -198094, -76424, 26668, -53115, -117566, -125356, -126003, -124874, -249138, -255879, -125855, -125111, -107910, -5238, 122700, 230972, 140912, 96060, 94873, 52106, -28566, -40825, 71834, 43650, -103720]
5701a03720M7991O4687J29973N6540l5366r261l52m3909j02438r1255k5847K5088
5689h7869O8721Q5443K2744O8400K811r6548p023m1566K4488k16869m8988R0899
5677a35357J34631O9936n407o5775j39029q540J08617J44348J2147l6981K1316
5666I9906j5550q434k5964l2540j74234N7789J66320Q1523m0859r9063r5229o7523
5654a53858o4264J14019N8161K2974K4021Q869k1049q9651k005J39395M3154K3742
5642A03508j16093o0705O364Q681N6093k3937r029o6178o5514l2205k0006l8750
5630b57771J04989J09215O365m1086J26465R9196O676j89269l9122j1319k72P0598
5618a5335J09627L5951K5645l9608j4788J198o4015O45k3613k0631J3936Q0428
$$ y = [-103720, -55729, 8958, 138931, 195471, 160105, 150844, 150492, 106583, 4145, -87110, -112957, -87869, -19148, 66295, 89039, 157439, 160250, 63702, 56679, 15113, 39601, -177268, -226256, -135357, -726, 69210, 63803, -1972, -141001, -149541, -40924, 103424, 115571, 78590, 99906, 84356, 75922, 49958, 17418, -156816, -99027, 67293, 148816, 107957, 8894, -86335, -153858, -218122, -104103, -45942, -22968, 1053, 9922, -11127, -100778, -102783, 36612, 79766, 103508, -12585, -73290, -66926, -58245, -2152, -26089, -35118, -101296, -166810, -199015, -219021, -257771, -152782, -43567, -37202, -78288, 48177, 147373, 154049, -35220, -74342, -85661, -85933, -15335, 94292, 130243, 155888, 116280, 101492, 102690, 38675, 39320, 15707, -4924, 9012, 89440]
5606H9440J22980N870n2630k45M1787K0751n8307j962R4159m7754j24992p540
5594H1557M4046j4239p1660j37742L4391k4029j4582L8531J600L4564P7468L8904
5582H8809k8576j4876k07280j0707R1035L7314J15286R2409j44569n6768J3515
5571b4408K3756R9459j0137k12718n6268P8264K857p24r8946J6481N5493J69368
5559D2477O0228p1498j8174m2716j41283N6303J41440Q852n9746J09571O7507
5548A52961j21360j2830n7551q540m7578l6409o6205K5753N5007Q6879J2702p7506
5536i4677l6069K6330M7603P7034j47484q2741M6610J373m5035N5708P2876K568
5524g5904n0565K8228j4354M1405J67481P7464R0293l3459j07855r2875p6671
$$ y = [89440, 212420, 218290, 165660, 165415, 207202, 227953, 169646, 167684, 261843, 214089, 89097, 81557, 125603, 111364, 39704, -98038, -63647, -87676, -102258, -63727, -62127, -27563, 49905, 88809, 60233, 45357, -161923, -172630, -81595, -44281, 71005, 163414, 18845, -37923, -24408, -652, 98807, 88670, -124048, -180316, -102052, -99195, -99919, -198865, -182384, -126891, 42477, 102705, 31207, 13033, -29683, -170966, -114663, 26777, 35629, -24117, 85454, 152961, 31601, 18771, -38780, -47320, -94898, -131307, -197512, -171759, -116752, -29873, -17171, -94677, -130746, -104416, -56813, 20221, -127263, -210004, -163394, -162021, -207056, -151348, -78472, -75904, -126469, -98241, -112595, -71190, 96291, 173755, 264048, 230589, 122734, 29859, -46812]
5513d6812k1436J614k3131N2023J6988L0361k610n3127j24P0210J00383j15022
5501I317p25m1884K8328l328K7631l4841k8725m1750R5133R177l1712O3539n7942
5488g782n6288n4729r487P5428J35651p4431k4067m4875L5912L7707k8883j6136
5476c1980n3537N8190k1996m7780M5138j3455l7427J8234J03256m5632q8768J15100
5464f57Q0953N7611p3328j24976o2187J9045J08226J6831L9874J49136q6482o9346
5452E4700m9180J7572L2663o9550L309l7514l9374O4891P4307K3181J6430M959
5440I6394M6892j9404j27555l6996M206L2696M1274q7218Q0335P8731Q0888k2773
5428A67470r9649j8438O2999M0829q8035q4571K0223o0173N3257L472P8410P3021
$$ y = [-46812, -68248, -66634, -89765, -37742, -20754, 9607, 6997, -46130, -46254, 23956, 124339, 9317, 8592, -33292, -4964, -8292, 19339, -15502, -44227, -85977, 9156, 18333, -13379, 50160, -7782, -64070, -118799, -128286, -52858, 82793, 8362, -15705, -60580, -24668, 13039, -15844, -31980, -85517, -27327, -49323, -97103, -51965, -65420, -102847, -84613, 18643, -26989, -115757, -657, 80296, 137907, 64579, -60397, -122584, -103539, 4687, 21518, 61392, 210528, 124046, 54700, 5520, 23092, 55755, -13795, -10486, -48000, -87374, -22483, 51824, 75005, 91435, 96394, 143286, 123882, -3673, -40669, -36463, -3767, 37507, -49711, 30624, 109355, 190243, 167470, 67821, 49383, 112382, 153211, 65176, -19395, 828, -59345, -6088, -2616, 75794, 148815]
5416A48815P7878q058J106l5324n2390l684n662m2399j8609L7660l7496j426m9034
5403A1377R398o8539P2240K5600J9334k3486k1459J8753L76l5707q3274l6488
5391a11875R4539k8028m8445l1174J01414J44447L9535j29411j8035L7379M515
5380E4861m2101j58315P4988Q7877J1056J1886n0652j10892j2585l3737l0864
5369a98478N1715J35439J0468m4390J8737j7510l1576P6971q492j10743M272l128
5357a16715m3626J40339R7143M6513l0144j7216R473J09329L022n4346q6092m2475
5345A5205l2650L8137m7683N238j4584p4417J134J18047M4608J02740m5935o1739
5333D8101o1156J1497l4800j30202q1638J4515Q7293J82345L1630p9811j66036
$$ y = [148815, 226693, 218635, 219741, 184417, 132027, 128343, 122681, 80282, 61673, 99333, 61837, 60411, 11377, 20775, -47764, 24476, 50076, 69410, 45924, 24465, 43218, 43594, 7887, -75387, -111875, -17336, -45364, -93809, -124983, -23569, 120878, 160413, 31002, 12967, 50346, 54861, 12760, -145555, -70567, 17310, 28366, 40252, -10400, -121292, -133877, -167614, -198478, -146763, -11324, -856, -45246, -26509, -44019, -75595, 1376, -7116, -117859, -113587, -116715, -160341, -20002, 77141, 123654, 93510, 76294, 85767, 195096, 198118, 143772, 57680, 15205, -17445, 20692, -26991, -21753, -36337, -110754, -109620, 8427, 53035, 155775, 109840, 48101, -13055, -1558, -36358, -166560, -248198, -233683, -146390, 35955, 67585, -12226, -178262]
5322a78262j7262j8514M0448J8700J6425L9857n1241N3782Q9434Q0188M5167j12094
5310F628q3446l3270k7396j6577O3782L0256j3881M9748O7057O3296p8318j2735
5298A5144O1179Q994k3518l6546j9135J8083J12842M9038j6608q087k3224J8989
5286A57151l0067k2915O7359M6759j74088j29847k3099L623J08432M3375j2454
5275C4229K1588M2774M6440j1932j0879j37395j69031k401J10594j098K6183k1240
5263g2168n3486O3930R637j23493K4999J61995j8455j6118p6250M958L3546j8329
5251g9234j16066J2158J10088O4962L6028n7764j4562j8254p746M3016Q8284k6690
5239C4220m1841K8755J3932k3322n8321K044L7303m472O9134o4803l8646m1299
$$ y = [-178262, -195524, -214038, -173590, -154890, -138465, -98608, -149849, -96067, -6633, 73555, 118722, 6628, -76818, -110088, -137484, -154061, -90279, -60023, -73904, -24156, 42901, 106197, 27879, 15144, 76323, 85317, 61799, 25253, 6118, 24201, 137043, 186081, 169473, 161386, 138162, 157151, 127084, 104169, 171528, 218287, 44199, -85648, -108747, -105124, 3308, 46683, 34229, 55817, 98591, 145031, 133099, 122220, -15175, -184206, -186607, -76013, -77111, -50928, -72168, -125654, -61724, -52087, -175580, -150581, 11414, -7041, -23159, -99409, -94451, -60905, -79234, -195300, -183142, -73054, -8092, 27936, -29828, -44390, -62644, -70390, -27374, 60910, 34220, -7621, 21134, 35066, 11744, -46577, -44533, -7230, -11702, 57432, -7371, -46017, -87316]
5227h7316N4306m5355o6059J9811M6753l4833p0416O0304O2377N4880j0478O9709
5215E3683K7216n5589L1912n1322j12760L9793j6639n2654J5600J51144K706n523
5203B7567K2642j13175M7147k7922o3082J37717O4763o5858r8194p7935p7209
5192b23539Q4051J02202M6819j943M4146j66609R0215o6714q0960j10750J0278
5181b72804N4019J31480J43316k135J7738J00101K8388r0465j50332J1530L9662
5170A0498j3373o2908l4565j5966r5355K0795O5160L8973J2461K7656P4263k4306
5158C333J17477Q8783j30723j30074P543J02258K1004j8841n2263L0834K3186
5147F2517n3817l4269K543r5863M7331N3160J8586m058N449l271N206j15839n2683
$$ y = [-87316, -33010, -78365, -144424, -124613, -77860, -112693, -183109, -122805, -60428, -5548, -16026, 53683, 80899, 25310, 57222, 5900, -106860, -67067, -83706, -136360, -120760, 30384, 33090, 27567, 50209, -62966, -15819, -43741, -106823, 30894, 95657, 29799, -68395, -146330, -223539, -139488, -37286, 9533, 7590, 51736, -114873, -24658, -91372, -172332, -283082, -272804, -218785, -87305, 56011, 53876, 71614, 171715, 200103, 109638, -40694, -29164, 10498, -2875, -65783, -100348, -116314, -211669, -190874, -125714, -86741, -74280, -46624, 27639, 3333, 120810, 209593, 78870, -51204, -43661, 58597, 79601, 60760, 8497, 39331, 62517, 8700, -25569, -23026, -118889, -71558, -18398, 188, -3870, 1579, -1692, 3514, -112325, -165008]
5134a65008k8065L9474N7010J66203L3552j36519L1387J07752p2315n3603J4758
5123e374r8794K1384P7748l1987M5090K4709j27806j469R0041K9476J7516q0657
5111d0123j3880P234J34041L8822j8819k3154J6660m852L0684j0966l8337M7455
5099A24765Q8223m6090K6605N6808m8075p6082J5774P321p5396P8048n6747J2399
5087A07553J6317r5480n6164n1815r1928O2373J39614M032J45616J6237p5570
5076A20785j61598j31413o5368Q4355J50684O3084P5580j06871k7721r4838j11822
5065b05143J28517J64135K2591o9895l2235L6911n4946j09187P6223J16109K1667
5054I4747j5724l3533J4453l5665K7617J13152q902j07059o3806K3493r2793l6192
$$ y = [-165008, -193073, -153599, -96589, 69614, 103166, -33353, -1966, 105786, 33471, -20132, -5374, -104168, -82784, -5036, -37023, 8067, 32776, -95030, -96499, -6458, 23018, 40534, -40123, -54003, -46769, 87272, 126094, 107275, 84121, 100781, 95929, 126613, 115647, 77310, 124765, 212988, 166898, 193503, 250311, 202236, 126154, 141928, 149249, 73853, 151901, 95154, 107553, 123870, 28390, -27774, -79589, -171517, -109144, 30470, 34502, 180118, 196355, 120785, -40813, -172226, -237594, -153239, -2555, 60529, 136109, 29238, 1517, -93321, -205143, -76626, 87509, 110100, 40205, 7970, 44881, -10065, -119252, -43029, 73080, 94747, 79023, 45490, 59943, 24278, 51895, 165047, 156145, 49086, -14720, 8773, -84020, -120212]
5042a20212J746J7183K9493k6708o2315J40565O6041p6189L5036M6706l0490r045
5030A1811r677m5867l3717O1223j08529n6047k088O263L4875N3217l8091m8740
5018a75367J32215R4570q1025j9184P5993q7402n0061q1116J40253J13298M028
5007F6202j4929M8448O2327k413k5904J183o6124m5917j4683L8464j81549j04029
4995b38924M7535K6292N3851o0503m2301m4569N1555P429N8541R5616J19617J38027
4983B12166j4433L969M6116k9487j71998r288J6225n1751O9791J8037L3732L2001
4971A55080J9124n3719k0484r9425j34213j6087Q8231K05590p496p3895M9207
4960A11913O8403p8040p5419J4332Q8174r3506k2284l6384l7828N6177K8107k2248
$$ y = [-120212, -118466, -101283, -71790, -98498, -160813, -20248, 45793, -30396, 4640, 51346, 20856, 11811, 2134, -43733, -77450, -16227, -124756, -180803, -182891, -176628, -141753, -88536, -126627, -175367, -43152, 51418, -29607, -48791, 27202, -60200, -110261, -191377, -51124, 62174, 66202, 51273, 99721, 162048, 159635, 133731, 134914, 68790, 22873, 8190, 46654, -134895, -238924, -191389, -165097, -111246, -171749, -214050, -258619, -207064, -199635, -141094, -45478, 74139, 212166, 197733, 201702, 247818, 218331, 46333, 37045, 53270, 1519, 71310, 89347, 123079, 155080, 174204, 120485, 100001, 576, -133637, -149724, -61493, 144097, 136601, 62706, 111913, 180316, 102276, 26857, 41189, 129363, 35857, 13573, -22811, -60639, -4462, 23645, 1397]
4948A397J3743m771q4184r0688K2606M9230J3401M3574j5167Q013j7075K9477
4936c0444P6440j013L3609M9545J5483j53661q4327N0058o2397K4357J2814O1525
4924h011J1578m094J20488M0523j63984m655N1142P2615m8254j22665k4897r1672
4912a71886k5874J2775R4666N1541p9559m7797J51081O1316j09704M2662j1891
4901c2670r5126L7008J7255M6568M9750K7506m145K76J56025k5630k14944k9535
4889f7662J48783n2251m7317K3727O5438m3688k2485M7632M3977p7742j52901
4878a34489j0357L7674O3396K6541J05569O8799N9442r2278j46304o4458J3751
4867g2714J1381O7230J588J06265J1325N6966J2239k0956j02480q9404r7836k9332
$$ y = [1397, 15140, 10369, -73815, -164503, -141897, -92667, -79266, -35692, -50859, -42846, -59921, -30444, 45996, 44983, 78592, 128137, 143620, -10041, -94368, -44310, -106707, -82350, -69536, -8011, 3567, -527, 119961, 160484, -3500, -8155, 42987, 115602, 67348, -55317, -80214, -171886, -197760, -184985, -90319, -38778, -118337, -166134, -15053, 46263, -63441, -20779, -32670, -127796, -90788, -73533, -26965, 22785, 50291, 46146, 46422, 202447, 176817, -38127, -67662, 81121, 28870, -18447, 5280, 70718, 27030, 4545, 52177, 96154, 18412, -134489, -144846, -107172, -43776, -17235, 88334, 157133, 216575, 124297, -22007, -86465, -72714, -61333, 5897, 7485, 113750, 125075, 182041, 194280, 173324, 70844, -18560, -116396, -145728]
4855a45728O0672O3780K1186n6559j4167q2078K8344Q8906M3401M1386o64j0908
4843C7571r959J8212l4242j00613l594L5776q231m0912l0194K554J303Q1059J3290
4830c7980j16575p8415K2058J24212J05748R2939m6415j9813j6372O2501N721
4819I7609n9325o5170n5669M5570L0454Q077l8545j9539m2516O7331M5548q6942
4807g3117n0378r503K1168j08814J14670R471j19791j5217Q2275J39237M7008
4796C7009L5945k2654P917p513j1699k6663O760M9872J4704l2653O5988Q030j10782
4783A4261o9538O4063j1321L3612J9364k6601K6634L1887K1696k4819O535l5585
4771E0188k07281P4725J91130l3624r0166j4755M5943K3795M5048N4649Q055o4015
$$ y = [-145728, -85056, -21276, -90, -56649, -70816, -152894, -124550, -35644, 7757, 49143, 48479, 37571, 27612, 45824, 11582, -89031, -92625, -56849, -65080, -105992, -136186, -133632, -132329, -51270, -37980, -154555, -232970, -210912, -86700, 19048, 111987, 65572, 45759, 29387, 91888, 97609, 38284, -26886, -82555, -36985, -6531, 1546, -36999, -56538, -99054, -31723, 13825, -73117, -123495, -132998, -111830, -220644, -105974, -96503, -216294, -231511, -149236, -9999, 37009, 72954, 50300, 58217, 50704, 39005, 12342, 19102, 68974, 83678, 51025, 117013, 125043, 14261, -55277, 8786, -2535, 31077, 50441, 23840, 50474, 82361, 104057, 79238, 85773, 50188, -157093, -82368, 108762, 75138, -15028, -29783, 16160, 39955, 85003, 139652, 147707, 83692]
4759H3692j1127m4600r5483q217l175o6660L6915J8365L9324J9303j320l0554
4747f3537l6288J0566l4304J4983N8814K5244j03569k0288N6660J69623R4577
4736A72481m0990n5129K2442j9575k8706j8336j65158r5624Q7301j0653J427L690
4724a46830p4291P8477O4069K2465q1764o5987P1724N8815L5267O9771k3240n7519
4712d9043J6881J02518o5012q2214R3592j9149K8842j06131J05554O8913p8464
4701A6287m9553M4744K5314n3249j48483q4831J13933Q8982K7150Q1229P5249
4690A36772q1364j07432r449N1287j5321k4911l050q5433J60308J48326o8564
4679A01169L0982k5126J330R2929P6161M7779K4048p0473q6986k7975j46388Q6067
$$ y = [83692, 72565, 27965, -67518, -75735, -78910, -145570, -108655, -90290, -50966, -31663, -32983, -63537, -99825, -89259, -123563, -108580, -49766, -24522, -128091, -148379, -91719, 77904, 172481, 131491, 76362, 98804, 79229, 50523, 32187, -132971, -228595, -141294, -151947, -150520, -146830, -221121, -142644, -78575, -56110, -137874, -203861, -132137, -73322, -38055, 31716, 8476, -49043, -32162, 70356, 5344, -76870, 16722, -2427, 26415, -79716, 25838, 94751, 16287, -33266, 11478, 36792, -16457, -164940, -249771, -135838, -46856, -19706, 61523, 136772, 55408, -52024, -61473, -10186, -25507, -50418, -53468, -138901, 21407, 169733, 101169, 132151, 107025, 108355, 201284, 277445, 325224, 349272, 278799, 191813, 163838, 17450, 103517]
4667A03517J54635L6222K9899k5908K8081r7859j66857j11687p183O6938l5727
4656b5929K7731j5926N9208R7665P0497R213P3254j32793p6824l3869k5315q0262
4644e3350O0193L4354o0202K0282l9911K9000O4858j7828m0573L3604J32965N3530
4632B16922q5595j66379m0345N1775l9263J6720M93n5977l3845r030N2143P1380
4620b1001O3832O3807o3223j80671q9052R425j8968L6308k1577K1031J21976K2724
4608e5389K4259O6743M5774j362o1700j05054j26372N9227M8211l783L5951O4369
4596i126m9475J7911J6629l9048j2286L2278J47450m73j02676j2803J9502L3163
4584D1046k9457j7790r8421l9240m0425k7876L0017r407L3340M3612m6839m9030
$$ y = [103517, 258152, 294374, 324273, 298365, 326446, 228587, 61730, -49957, -57140, 9798, -25929, 1802, -14124, 45084, 142749, 213246, 222459, 295713, 162920, 86096, 52227, 26912, -53350, 6843, 41197, -19005, 1277, -38634, -9634, 55224, 37396, -3177, 30427, 163392, 216922, 131327, -35052, -75397, -23622, -62885, -46165, -45672, -101649, -135494, -144524, -92381, -21001, 42831, 106638, 43415, -137256, -226308, -216883, -235851, -199543, -221120, -200089, -78113, -55389, -31130, 35613, 81387, 80025, 18325, -86729, -213101, -153874, -105663, -109446, -73495, -9126, -58601, -40690, -24061, -63109, -75395, -43117, 104333, 103860, 1184, -11619, 7883, 41046, 11589, -6201, -104622, -143862, -184287, -212163, -182146, -191553, -158213, -114601, -161440, -210470]
4572b10470k030J28421J94326K5322j36492m0035o855O9585n2214N353o2886n2482
4560a40457Q384q5201l1196R5650o480N1190j5242J8087K2012L8849K1900n119
4548b7623M1034P122O217K2373M5526k7619R6441L8580o2896n9966q3243k5674
4536b9728p2641K1823k2066r4169m6609O4618M0035m4963P3885O9590M7738K6208
4524C3721l3334M7509J5821n6703q0695R853L6150J33774N1892n2352n0253j17741
4512f2358N8712O6838o1320J2480O4485Q123P681l700k3053Q8726p2617q6183
4500b186L6474j6387K4856Q092Q479o9548o5057R1772L6227l5167l7065k4160
4488d3670r799M3950l7393J9981J15062k0208l3929L517l8944J10178O2875J850
$$ y = [-210470, -212500, -84079, 110247, 135569, -923, -40958, -47813, 21772, -30442, -25089, -87975, -140457, -132073, -217274, -248470, -152820, -159300, -108110, -123352, -105265, -83253, -44404, -22504, -27623, 13411, 20533, 26750, 49123, 94649, 67030, 163471, 202051, 139155, 79189, -4054, -29728, -102369, -80546, -102612, -196781, -243390, -178772, -138737, -183700, -109815, -40225, 7513, 33721, 387, 47896, 63717, 7014, -73681, -63828, -27678, 106096, 157988, 105636, 55383, -62358, -3646, 63192, 1872, 14352, 78837, 86960, 94641, 90941, 67888, 156614, 83997, -2186, 34288, 17901, 42757, 50849, 59328, -10220, -75277, 16495, 52722, 17555, -19510, -43670, -53469, -9519, -46912, -26931, 88131, 67923, 33994, 37511, -1433, 108745, 171620, 173470]
4476A73470m0394r7946N4580j8799n2572M520J24228n123p6744m6314o6842o554
4464e4490J074k2818N4757K4123M9289l1511k5436O4859N086o610K7096n059M8230
4451A28590J8464o8719N4561l0647j06312O9233M7209n6456j17959n7947Q0054
4440c9929p312l0343j2611J56361Q2289r9622m5352J3356n158n1657l7262J58832
4428H1592J57226j72017j05918j9855K6911P8127j2186K8963l4704J8120J6222
4417F2481J2686j55837n9769P5329J41854k907P2627k5750j3129q100K2988q7138
4405C5335j7489P534K1634j01616m0666L5160l6175J728l2848r1320j48473P527
4393c59669J50498N9739m1887N5813l7141j13393j2104R4955J6874M3605O5972
$$ y = [173470, 133076, 35130, 89710, 70911, 18339, 22859, 147087, 141964, 65220, 18906, -47936, -54490, -53416, -76234, -21477, 2646, 51935, 20424, -5012, 59847, 64933, 58323, 85419, 80360, 128590, 147054, 78335, 132896, 102249, -4063, 65170, 112379, 55923, -62036, -119983, -39929, -47241, -77584, -90195, 66166, 148455, 48833, 3481, 16837, 11679, -39978, -77240, 81592, 238818, 66801, -39117, -58972, -32061, 46066, 33880, 62843, 28139, 46259, 62481, 75167, -80670, -140439, -65110, 76744, 73837, 146464, 120714, 107585, 99485, 122473, 35335, 17846, 25380, 47014, -54602, -95268, -60108, -96283, -94555, -127403, -218723, -367196, -359669, -209171, -149432, -191319, -135506, -172647, -286040, -298144, -203189, -186315, -142710, -76738]
4382g6738m4054L2494O726j37380K8902J42274L5062O8934K4469j48584O3452
4371d443R39M007j0730l1383m1642j1320m3166N8334j4706k7595J8533Q9158m2276
4358e6290m0781K5423P5690N5540q5861n3935J12767Q5582K0836j35697j48149
4347a44875N4475P5025J06200M0325n6976K710M5486q6709l949N2928K3513m5023
4335F3130j0570m251R7511j2497n010l5614q1382k0656j9652n57J36900K8080
4323A35432m7639p229Q671j91520j38850P2996O2617M4517N2682l3171q097J10940
4311F1349L4877o774r0659k3860N1209J924L9683p6580n0813J1635o9210N1948
4299f5271l8299M8087J11934j9055r854Q412J253O6541j36676j20674p2059O8393
$$ y = [-76738, -120792, -88298, -81572, -218952, -190050, -47776, -12714, 56220, 80689, -67895, -4443, -3504, 503, -10227, -41610, -83252, -94572, -137738, -79404, -94110, -121705, -103172, -14014, -56290, -97071, -71648, 4042, 59582, -26279, -80214, 32553, 118135, 138971, 3274, -144875, -90400, -15375, 90825, 131150, 74174, 76884, 122370, 35661, 31712, 84640, 108153, 63130, 52560, 48309, 145820, 133323, 128313, 92699, 11317, -9339, -28991, -29548, 107352, 135432, 87793, 80564, 89235, -102285, -241135, -168139, -105522, -61005, -8323, -41494, -49591, 61349, 96226, 89452, -1207, -25067, 26142, 28066, 67749, -8831, -59644, -48009, -117219, -65271, -103570, -55483, 56451, 37396, 27542, 35954, 37207, 103748, -32928, -153602, -225661, -157268]
4287a57268M3074m0311l0932P312J278O2444N7648l3137m2792J17783P2390o0463
4275b974q0137J8727J26198P5114J9607k2645J6762k6242p3452M8264M5946j6164
4263A29004N1601L1856m4933l1642n4681j813J4916K250j2344m6934m5288l6828
4251d4836J20776L8371q2841j32166m9558L2188J46300j3080J8554n4983K0630
4240f45N7950M2948N4373J8754j20459j36494n8047P2102R5373P4173q144l1759
4228F0125o7736L3535l3118n8147N6567p3173r3399j8127J37449R5594L2609l7441
4216C4738k8313l0325Q5431L5093l820j07933K5554P9092l9103k5066o8499P8177
4204C5026J16688L0719l8287m0757o3724K2678j10653k6835J4158O0335R1927
$$ y = [-157268, -114194, -154505, -185437, -178125, -176847, -114403, -56755, -89892, -132684, -14901, 57489, -2974, -83111, -64384, 61814, 136928, 156535, 133890, 150652, 124410, 50958, 99222, 145168, 129004, 180605, 212461, 167528, 135886, 81205, 79392, 94308, 96558, 84214, 37280, -8008, -44836, 75940, 114311, 31470, -100696, -150254, -118066, 28234, 15154, 33708, -21275, -645, 57305, 100253, 154626, 173380, 52921, -83573, -141620, -69518, 25855, 100028, 91884, 60125, -7611, 25924, -7194, -65341, -8774, -81947, -175346, -193473, -56024, 39570, 72179, 34738, 6425, -23900, 61531, 96624, 92804, -15129, 10425, 89517, 50414, 25348, -43151, 35026, 151714, 182433, 144146, 103389, 39665, 62343, -48310, -75145, -60987, -652, 91275]
4193I1275n5868K1724N2753K0356J5307l6379O0795L6130l9182l6485p6022o0993
4181f589p3466J7760J9552k4346j2310L4440L1819l0161L0085p4306J2039J0281
4169f5202q271k2143N5854P2740L971K7056l0968o8496N125J29733N0026j51675
4157b250n9166J24040J07504J7042n0186o4224o9490n4154o6565K5155N5145M7447
4145A0298J14110j30859j12929m7958L1435N9025O5553K9133k5262R2915J01495
4134A86956M5123j19189j53938K1276P9752N5075O9324N2054K8230j97631l2904
4123C4128k349K1087R945o1132N2755O6493o7875p7516j00942j3472k7266M3625
4111a22519O0307J37500K4064j02384J2991p437N951j10253M0520K3648k5541
$$ y = [91275, 35407, 57131, 109884, 130240, 145547, 109168, 169963, 206093, 166911, 130426, 54404, -6589, -80055, -62295, -42743, -67089, -79399, -44959, -13140, -43301, -13216, -87522, -75483, -65202, -73473, -95616, -39762, 32978, 36949, 64005, 33037, -35459, -30334, 99399, 149425, -2250, -61416, 62624, 170128, 187170, 136984, 72760, 3270, -50884, -117449, -92294, -37149, 10298, 124408, -6451, -119380, -167338, -135903, -76878, -11325, 17808, -7454, 85461, 186956, 232079, 112890, -41048, -19772, 59980, 115055, 184379, 236433, 264663, 67032, 34128, 31779, 52866, 62811, 1679, 54434, 120927, 53052, -24464, -125406, -138878, -166144, -122519, -62212, 75288, 99352, -3032, 9959, 2522, 8473, -101780, -61260, -37612, -63153]
4100f3153N6298M1909J7045L0549r1258j2911J18966R7932j17567p9222p1269
4089g2681Q5420m2785j1489K0210P4144n1986K2974o6019K3206q048n1768o02
4077g9424Q4554M4287m6895l1887R3288M5941J6033q1584p4168P4225K9775M2488
4065A16633m0287j215J246q60O0559K3055p3760l371R099J09328L9552j01633
4053A38346r0232o5228K4195j395j6970j2001q388J38462Q3390p1110j03045N8670
4041G4694o0840n8270R5581Q3325j35193n0110M4976n640r1736J09032k3052L0626
4029A3393R8798Q3464R0939L9314q8438o8916L265n6968m5495K3564J2651m4604
4017F0967p6856k859M6720M8615o573l9577r9817K5712R6568J5624P0027K8217
$$ y = [-63153, -6855, 35054, 52099, 82648, -8610, -21521, 97445, 195377, 77810, -1412, -72681, 12739, -30046, -41535, -21325, 52819, 833, 23807, -42212, -19006, -27054, -78822, -79424, 5130, 49417, 2522, -29365, 63923, 109864, 125897, 44313, -29855, 44370, 74145, 116633, 76346, 75131, 76377, 75517, 136076, 159131, 85371, 82000, 91099, 200427, 239979, 138346, 48114, -17114, 7081, 5686, -11284, -23285, -31673, 106789, 190179, 119069, 16024, 74694, 13854, -44416, 51165, 134490, -703, -50813, -5837, -11477, -103213, 5819, -17233, 13393, 112191, 195655, 286594, 325908, 237470, 168554, 171819, 114851, 69356, 92920, 105571, 60967, -15889, -18748, 27972, 76587, 70014, 30437, -69380, -43668, 52900, 68524, 138551, 166768]
4005A66768K2748o528q0932K2243O9929O796o3970j66578p3041K6811J6314J4884
3993d4556M6464K7296K8451q11N8827k4333J6207k1059M9909o367J15397j2620
3981B32805j37054m685L9092j01440M0576M6368p6199l2008Q2605N566o0026M203
3969C9803m1132P1376k642q2578k787L8923l323k9549j05581j94115k9300J15367
3957b25538J47226j2726M0055J9385Q1898J1606n4997p6955P1399M895J7306J25991
3945A49545j34412k4169J02720L4421r7669n5789P7888P4952M361P437q7324j09285
3933e7324Q521m3089P1839J65854J8821n9237K3049p3138j64585q189O1741O4081
3921H344L8710J37904K6966j00612j39336M4970j1422n5352R24m525L1512J12334
$$ y = [166768, 189516, 182988, 102056, 124299, 194228, 201024, 137054, -29524, -102565, -75754, -59440, -44556, 1908, 29204, 57655, 56844, 115671, 91338, 107545, 86486, 136395, 130028, 245425, 232805, 95751, 91066, 130158, 28718, 69294, 115662, 39463, 7455, 90060, 95626, 35600, 39803, -1329, 70047, 67405, -15173, -17960, 20963, 17640, -11909, -117490, -311605, -340905, -225538, -78312, -91038, -50983, -31598, 50300, 61906, 6909, -70046, 1353, 6248, 23554, 149545, 15133, -9036, 93684, 128105, 30436, -25353, 52535, 127487, 131848, 139285, 51961, -57324, -48803, -91892, -20053, 145801, 164622, 105385, 128434, 55296, -109289, -117478, -55737, 8344, 47054, 184958, 211924, 111312, -28024, 16946, 5524, -49828, -48904, -53429, -21917, 90417]
3909I0417P9346J0571M2775l6926j00579L0704o9055K7643n083O9506k6879m7162
3897F5278M1074M9473N9181n7535M2914O2819o2814o8701j23583N9146L5376j01041
3885A587m9821P0185K689J7902M7202L3449K4573n0358L0068Q425m919J1845N1130
3872A93957j2494J024k1243n8226o581R716L2205j58551J4370P6464j23580o3659
3860a16598J574m4088l0894L3576M9597N7068O8565K28490m3597j72609l1681
3849e97K8270n3619Q001M1250j02346k3183r4270j2659R4100J33923l9811l4783
3837e5724M3909q654P167O4606n3539j7689q952n312m922n1858Q1403K2341j1989
3824G87J6531q5483o7219K4867K6490L8453M0823j19676O849Q8482j6980O9570
$$ y = [90417, 169763, 180334, 223109, 186183, 85604, 116308, 47253, 74896, 69813, 139319, 112440, 65278, 106352, 155825, 215006, 157471, 200385, 263204, 200390, 131689, 8106, 67252, 102628, 1587, -48234, 21951, 24640, 42542, 89744, 123193, 147766, 97408, 127476, 135901, 130982, 142827, 193957, 181463, 182487, 161244, 103018, 96437, 106153, 138358, -20193, -5823, 70641, -52939, -116598, -115024, -159112, -190006, -156430, -106833, -49765, 18800, 247290, 203693, 31084, -597, 27673, -25946, -17945, 23305, -79041, -102224, -196494, -209153, -115053, 18870, -20941, -55724, -11815, -20469, -13302, 51304, -2235, -19924, -28876, -34188, -39110, -90968, -9565, 12776, 787, 17318, -68165, -135384, -110517, -84027, -45574, -4751, -124427, -117578, -29096, -46076, 23494]
3812B3494P4952L4623J05276k1371j39233L8685K7651q1205p7481q4485k6372
3801a25466j9546O9365J29314K2222o6384J38595K4566q507j22343p5492N3175
3790A9499J3889m7400j9844m3383P8195J46332O6663j14078r5732J920j0037J05584
3778A01608O0406m0357j6889p0512K731q4543R713m0849L3230L7459l2517j7535
3766e8055Q0992J3191k9339m4439r396q3063r2219O9670R6764L8360n4741m1356
3754a13631l1632J8222K0612r0528R3571J42062O7844N2306m7920q1071m4262
3743a4427P3832M9851m0645o8886Q69J04724j7159n5314j19808Q2272L3960q6014
3731e6745J5987l8021p6394R6118N0959k9641N7878J06920K2336p5296n4077m4227
$$ y = [23494, 98446, 133069, 238345, 216974, 77741, 116426, 144077, 62872, -14609, -99094, -125466, -145012, -75647, 53667, 75889, 9505, 148100, 172666, 164159, 41816, -33676, 19499, 33388, -14012, -33856, -77239, 956, 147288, 213951, 99873, 4141, 6061, -3976, 101608, 162014, 121657, 104768, 34256, 36987, -47556, -37843, -78692, -45462, -8003, -40520, -58055, 22937, 36128, 6789, -37650, -47046, -130109, -222328, -152658, -55894, -17534, -72275, -113631, -145263, -127041, -106429, -196957, -103386, 38676, 106520, 158826, 110906, 29835, -14427, 59405, 109256, 68611, -275, 594, 105318, 88159, 32845, -86963, -4691, 29269, -56745, -40758, -78779, -155173, -59055, -8096, -37737, 20141, 127061, 149397, 74101, 20024, -24203]
3719b4203m8060K844O4923J2681J9009O0483l3656n1607M8629k5855j3214J15096
3707A27070M5271q6334n5030p9349J09971Q8152r4807r802k0102j20654P1345
3696b4269J17498o565r6397K6329k7008l4729j6782q0848m7961N6357J4464r883
3684a29794J27822J0989J3230k6202l6115P126O5229n1892m2585k0647K4035O8912
$$ y = [-24203, -72263, -69419, -4496, 8185, 27194, 87677, 54021, 2414, 51043, 25188, 11974, 127070, 172341, 86007, 30977, -48372, 61599, 149751, 54944, 45142, 25040, -95614, -24269, 93229, 86664, -9733, 16596, -10412, -45141, -61923, -142771, -190732, -134375, -119911, -129794, -1972, 9017, 22247, -3955, -40070, -32944, 32285, -19607, -62192, -82839, -58804, 10108]
$$ [...]
##END NTUPLES=NMR SPECTRUM
##END=
