##TITLE=Analysis number 322469
Compound Code cc 41202
Book Reference 505/17
Project Code adrs
Chemist Name robb
##JCAMPDX= 6.0         $$ Bruker NMR JCAMP-DX V2.0
##DATA TYPE= NMR SPECTRUM
##DATA CLASS= NTUPLES
##ORIGIN= Bruker BioSpin GmbH
##OWNER= nmr
$$ XWIN-NMR		Version 3.5
$$ Wed Sep 27 11:39:21 2006 GMT Daylight Time (UT+1h)  MAYBRIDGE\nmr@NMR_250MHZ
##.OBSERVE FREQUENCY= 250.131544655141
##.OBSERVE NUCLEUS= ^1H
##.ACQUISITION MODE= SIMULTANEOUS (DQD)
##.ACQUISITION SCHEME= undefined
##.AVERAGES= 16
##.DIGITISER RES= 18
##SPECTROMETER/DATA SYSTEM= dpx250
##.PULSE SEQUENCE= zg30
##.SOLVENT NAME= CDCl3
##.SHIFT REFERENCE= (INTERNAL, CDCl3, 0, 16.522)
##AUDIT TRAIL= $$ (NUMBER, WHEN, WHO, WHERE, WHAT)
$$ ##TITLE= Audit trail, XWIN-NMR		Version 3.5
$$ ##JCAMPDX= 5.01
$$ ##ORIGIN= Bruker BioSpin GmbH
$$ ##OWNER= nmr
$$ C:\u/data/dgb/nmr/ADRS/1470/pdata/1/auditp.txt
$$ ##AUDIT TRAIL=  $$ (NUMBER, WHEN, WHO, WHERE, WHAT)
(   1,<2006-09-27 11:38:45.54 +100>,<MAYBRIDGE\nmr>,<NMR_250MHZ>,
      <created by zg, POWCHK disabled, PULCHK disabled
       configuration hash MD5:
       E2 DF 36 D8 04 B2 41 60 5A D7 A3 38 5A 4B D0 FE
       data hash MD5: 64K
       BC 62 1A 92 9B 4F F4 38 D3 26 FF B2 C9 88 19 CA>)
(   2,<2006-09-27 11:39:02.79 +100>,<MAYBRIDGE\nmr>,<NMR_250MHZ>,
      <Start of raw data processing
       ef LB = 0.3 FT_mod = 6 PKNL = 1 SI = 32K 
       data hash MD5: 32K
       A0 13 A0 49 6C 09 45 77 AE A6 01 5A 4E 8D F7 BA>)
(   3,<2006-09-27 11:39:07.30 +100>,<MAYBRIDGE\nmr>,<NMR_250MHZ>,
      <apk 
       data hash MD5: 32K
       EB 91 C5 45 B8 99 2F 07 B3 41 1B A4 DE EC 0B D4>)
(   4,<2006-09-27 11:39:08.45 +100>,<MAYBRIDGE\nmr>,<NMR_250MHZ>,
      <abs ABSG = 5 
       data hash MD5: 32K
       85 DD 56 0E 16 DF E4 2F 47 A7 CC 1C 45 CB 6F 74>)
$$ ##END=
$$ 
$$ hash MD5
$$ C4 D0 08 46 41 AC CC 75 F6 44 F6 87 3D E8 1A 2B
##$RELAX= 
##$RELAX= 
##$RELAX= 
##$RELAX= 
##$RELAX= 
##$RELAX= 
##$RELAX= 
$$ Bruker specific parameters
$$ --------------------------
##$DU= <C:\u>
##$EXPNO= 1470
##$NAME= <ADRS>
##$PROCNO= 1
##$TYPE= <nmr>
##$USER= <dgb>
##$AMP= (0..31)
100 100 100 100 100 100 100 100 100 100 100 100 100 100 100 100 100 100 
100 100 100 100 100 100 100 100 100 100 100 100 100 100 
##$AQSEQ= 0
##$AQ_mod= 3
##$AUNM= <au_zg>
##$AUTOPOS= <16 >
##$BF1= 250.13
##$BF2= 250.13
##$BF3= 250.13
##$BF4= 250.13
##$BF5= 500.13
##$BF6= 500.13
##$BF7= 500.13
##$BF8= 500.13
##$BYTORDA= 1
##$CFDGTYP= 0
##$CFRGTYP= 5
##$CHEMSTR= <none>
##$CNST= (0..31)
1 1 145 1 1 1 1 1 1 1 1 1 1 1 1 1 1 1 1 1 1 1 1 1 1 1 1 1 1 1 1 1 
##$CPDPRG= <>
##$CPDPRG1= <>
##$CPDPRG2= <>
##$CPDPRG3= <>
##$CPDPRG4= <mlev>
##$CPDPRG5= <mlev>
##$CPDPRG6= <mlev>
##$CPDPRG7= <mlev>
##$CPDPRG8= <mlev>
##$CPDPRGB= <>
##$CPDPRGT= <>
##$D= (0..31)
0 1 0 0 0 0 0 0 0 0.06 0 0 0 0 0 0 0.0002 0 0 0 0 0 0 0 0 0 0 0 0 0 0 
0 
##$DATE= 1159353524
##$DBL= (0..7)
120 120 120 120 120 120 120 120 
##$DBP= (0..7)
150 150 150 150 150 150 150 150 
##$DBP07= 0
##$DBPNAM0= <>
##$DBPNAM1= <>
$$ [...]
##$SUBNAM7= <"">
##$SUBNAM8= <"">
##$SUBNAM9= <"">
##$SW= 20.6930455092707
##$SWIBOX= (0..15)
0 0 3 0 0 0 0 0 0 0 0 0 0 0 0 0 
##$SW_h= 5175.983436853
##$TD= 65536
##$TD0= 1
##$TE= 295.16
##$TE2= 300
##$TE3= 300
##$TEG= 300
##$TL= (0..7)
0 120 120 120 120 120 120 120 
##$TP= (0..7)
150 150 150 150 150 150 150 150 
##$TP07= 0
##$TPNAME0= <>
##$TPNAME1= <>
##$TPNAME2= <>
##$TPNAME3= <>
##$TPNAME4= <>
##$TPNAME5= <>
##$TPNAME6= <>
##$TPNAME7= <>
##$TPOAL= (0..7)
0.5 0.5 0.5 0.5 0.5 0.5 0.5 0.5 
##$TPOFFS= (0..7)
0 0 0 0 0 0 0 0 
##$TUNHIN= 0
##$TUNHOUT= 0
##$TUNXOUT= 0
##$USERA1= <user>
##$USERA2= <user>
##$USERA3= <user>
##$USERA4= <user>
##$USERA5= <user>
##$V9= 5
##$VALIST= <valist>
##$VCLIST= <CCCCCCCCCCCCCCC>
##$VD= 0
##$VDLIST= <DDDDDDDDDDDDDDD>
##$VPLIST= <PPPPPPPPPPPPPPP>
##$VTLIST= <TTTTTTTTTTTTTTT>
##$WBST= 1024
##$WBSW= 4
##$XGAIN= (0..3)
0 0 0 0 
##$XL= 0
##$YL= 0
##$YMAX_a= 489724
##$YMIN_a= -474933
##$ZGOPTNS= <>
##$ZL1= 120
##$ZL2= 120
##$ZL3= 120
##$ZL4= 120
##$ABSF1= 16.522
##$ABSF2= -4.171173
##$ABSG= 5
##$ABSL= 3
##$ALPHA= 0
##$AQORDER= 0
##$ASSFAC= 0
##$ASSFACI= 0
##$ASSFACX= 0
##$ASSWID= 0
##$AUNMP= <proc_1d>
##$AZFE= 0.1
##$AZFW= 0.1
##$BCFW= 0
##$BC_mod= 0
##$BYTORDP= 0
##$COROFFS= 0
##$CY= 12.5
##$DATMOD= 1
##$DC= 0
##$DFILT= <>
##$DTYPP= 0
##$F1P= 14.0000005364418
##$F2P= -0.99999901652339
##$FCOR= 0.5
##$FTSIZE= 32768
##$FT_mod= 6
##$GAMMA= 0
##$GB= 0
##$INTBC= 1
##$INTSCL= 1
##$ISEN= 128
##$LB= 0.3
##$LEV0= 0
##$LPBIN= 0
##$MAXI= 10000
##$MC2= 0
##$MEAN= 0
##$ME_mod= 0
##$MI= 0
##$NCOEF= 0
##$NC_proc= -6
##$NLEV= 6
##$NOISF1= 0
##$NOISF2= 0
##$NSP= 0
##$NTH_PI= 0
##$NZP= 0
##$OFFSET= 16.522
##$PC= 1
##$PHC0= 147.8208
##$PHC1= 3.041803
##$PH_mod= 1
##$PKNL= yes
##$PPARMOD= 0
##$PSCAL= 4
##$PSIGN= 0
##$REVERSE= no
##$SF= 250.13
##$SI= 32768
##$SIGF1= 0
##$SIGF2= 0
##$SINO= 400
##$SIOLD= 32768
##$SREGLST= <1H.CDCl3>
##$SSB= 0
##$STSI= 32768
##$STSR= 0
##$SW_p= 5175.98343685301
##$SYMM= 0
##$S_DEV= 0
##$TDeff= 65536
##$TDoff= 0
##$TI= <Analysis number 999999
Compound Code 99
Book Reference 9
Project Code 9>
##$TILT= no
##$TM1= 0
##$TM2= 0
##$TOPLEV= 0
##$USERP1= <user>
##$USERP2= <user>
##$USERP3= <user>
##$USERP4= <user>
##$USERP5= <user>
##$WDW= 1
##$XDIM= 32768
##$YMAX_p= 470411035
##$YMIN_p= -916517
$$ End of Bruker specific parameters
$$ ---------------------------------
##NTUPLES= NMR SPECTRUM
##VAR_NAME=  FREQUENCY,     SPECTRUM/REAL,   SPECTRUM/IMAG
##SYMBOL=    X,             R,               I
##VAR_TYPE=  INDEPENDENT,   DEPENDENT,       DEPENDENT
##VAR_FORM=  AFFN,          ASDF,            ASDF
##VAR_DIM=   32768,         32768,           32768
##UNITS=     HZ,            ARBITRARY UNITS, ARBITRARY UNITS
##FACTOR=    0.157963299565203, 1,           1
##FIRST=     4132.6476996994, 0,             0
##LAST=      -1043.33573715361, 0,           0
##MIN=       -1043.33573715361, -916517,     0
##MAX=       4132.6476996994, 470411035,     0
$$ Real data points
##PAGE= N=1
##DATA TABLE= (X++(R..R)), XYDATA
$$ [...]
$$ plain form
13736 3723 14529 73424 273594 385390 304959 251555 394918 219176 -27438 47808 135765
13725 135765 174009 260499 364521 305557 71250 39113 45152 56973 -35580 -157984 -462479
13714 -462479 -406617 -200877 -41309 242344 492388 844043 947232 764625 459139 516997
13704 516997 284688 45393 -92629 114979 162664 4441 199229 541766 389173 379266
13694 379266 355687 216024 184021 190493 191794 224597 220732 305 -66530 43227 4887
13683 4887 124992 190333 434266 505355 491533 477092 491409 236324 304942 465031 453112
13672 453112 258460 -1626 -70335 -127347 -256453 -334164 -92809 161413 164674 133363 219029
13661 219029 291550 128816 37804 187615 534621 427521 255619 252350 28356 67905
$$ packed form
13736C723J0806N8895K00170J11796q0431n3404J43363j75742k46614P5246Q7957
13725A35765L8244Q6490J04022n8964k34307l2137O039J1821r2553j22404l04495
13714d62479N5862K05740J59568K83653K50044L51655J03189j82607l05486N7858
13704E16997k32309k39295j38022K07608M7685j58223J94788L42537j52593r907
13694C79266k3579j39663l2003O472J301L2803l865k20427o6835J09757l8340
13683D887J20105O5341K43933P1089j3822j4441J4317k55085O8618J60089j1919
13672D53112j94652k60086o8709n7012j29106p7711K41355K54222L261l1311Q5666
13661B19029P2521j62734r1012J49811L47006j07100j71902l269k23994L9549
$$ plain form
13651 67905 106440 121753 245243 339599 372499 371119 214300 215929 168626 287398 438882
13640 438882 522773 541341 545175 442162 148253 181789 253727 100529 157981 405812 593389
13629 593389 556809 337259 277927 290293 568131 601083 544006 462117 505297 538508 432420
13618 432420 368239 330941 190262 206593 239785 98633 171999 242790 182400 -32454 -15549
13607 -15549 23085 -79349 -16159 282464 512220 330123 178114 113411 181749 294474
13597 294474 61151 35223 391702 638743 680737 775537 897434 904281 732133 767460 717615
13586 717615 754955 696529 634976 881298 964360 1056707 1104000 1050503 999934 868356 910060
13575 910060 910614 881041 913268 892390 717153 900086 914106 1024676 1029434 1190266 1052844
$$ packed form
13651F7905L8535J5313J23490R4356L2900j380j56819J629m7303J18772J51484
13640D38882Q3891J8568L834j03013k93909L3536P1938j53198N7452K47831J87577
13629E93389l6580k19550n9332J2366K77838L2952n7077q1889M3180L3211j06088
13618D32420o4181l7298j40679J6331L3192j41152P3366P0791o0390k14854J6905
13607a5549L8634j02434O3190K98623K29756j82097j52009o4703O8338J12725
13597B94474k33323k5928L56479K47041M1994R4800J21897O847j72148L5327m9845
13586G17615L7340n8426o1553K46322Q3062R2347M7293n3497n0569j31578M1704
13575I10060N54k9573L2227k0878j75237J82933J4020J10570M758J60832j37422
$$ plain form
13564 1052844 1291145 1468341 1408265 1359353 1426797 1315660 1287098 1257741 1365259 1402499
13554 1402499 1155031 1032565 1124277 1332577 1213816 1111096 1088051 902888 867786 815384
13544 815384 579028 563234 621853 761339 861525 901962 1005192 1109404 1156901 1242190
13534 1242190 1360395 1260233 1141894 1171165 1089629 1066535 1117074 1339187 1731981 2006594
13524 2006594 2375550 2727498 2830760 2449175 2262684 2114622 2230708 2451252 2202195
13515 2202195 1993215 1882655 1829184 1641422 1633363 1479534 1428997 1551619 1839574 1913242
13505 1913242 1849501 1628907 1496234 1701795 1727304 1810536 1793067 1840952 2120692 2310276
13495 2310276 2608901 2753315 2737917 2869450 2929904 2669264 2488270 2578155 2867086 2992180
$$ packed form
13564A052844K38301J77196o0076m8912O7444j11137k8562k9357J07518L7240
13554A402499k47468j22466R1712K08300j18761j02720k3045j85163l5102n2402
13544H15384k36356j5794N8619J39486J00186M0437J03230J04212M7497Q5289
13534A242190J18205j00162j18339K9271q1536k3094N0539K22113L92794K74613
13524B006594L68956L51948J03262l81585j86491j48062J16086K20544k49057
13515B202195k08980j10560n3471j87762q059j53829n0537J22622K87955P3668
13505A913242o3741k20594j32673K05561K5509Q3232j7469M7885K79740J89584
13495B310276K98625J44414j5398J31533O0454k60640j80994Q9885K88931J25094
$$ plain form
13485 2992180 3260078 3570633 3888130 3791613 3496895 3110130 2895612 2407884 2123908 2112402
13475 2112402 1995522 2224289 2460098 2578759 2682782 2743384 2698506 2720561 2879963 3013549
13465 3013549 2832398 2882435 3256934 3265141 3196174 3229219 3429768 3559690 3859816 4429911
13455 4429911 5165630 6298934 7602276 8720364 9173177 8872452 7815858 6456275 5687440
13446 5687440 5608308 5504485 5373010 5444469 5632801 5748035 5600759 5567098 5383844 5068663
13436 5068663 4782459 4615839 4344918 4094232 4345084 4317907 4304204 4257996 4274217 4369657
13426 4369657 4558963 4713703 4891854 5181203 5530265 5798487 6149712 6328760 6357988 6359621
13416 6359621 6980001 7870932 9287077 11187492 13987990 16538237 18049529 17976741 16452889
$$ packed form
13485B992180K67898L10555L17497r6517k94718l86765k14518m87728k83976j1506
13475B112402j16880K28767K35809J18661J04023O0602m4878K2055J59402J33586
13465C013549j81151N0037L74499Q207o8967L3045K00549J29922L00126N70095
13455D429911P35719J133304J303342J118088M52813l00725j056594j359583p68835
13446E687440p9132j03823j31475P1459J88332J15234j47276l3661j83254l15181
13436E068663k86204j66620k70921k50686K50852k7177j3703m6208J6221R5440
13426D369657J89306J54740J78151K89349L49062K68222L51225J79048K9228J633
13416F359621O20380Q90931J416145J900415K800498K550247J511292p2788j523852
$$ plain form
13407 16452889 14622177 13933036 14226405 15139751 16423651 18107932 19781669 21768500
13399 21768500 24522452 28160742 33592282 41906116 55205734 75356950 103513712 139356104
13391 139356104 179016860 216616858 245839698 258882925 251439782 229254159 197928097
13384 197928097 162659632 132955635 112266567 98161851 88384785 81709567 77681788
13377 77681788 76136304 77645778 83390323 94900569 115302874 147018562 190254190
13370 190254190 241585931 292297456 324870312 324373569 294007769 243387017 184931278
13363 184931278 137088748 106146422 87453546 76040394 68526656 62905358 59079919
13356 59079919 56437300 55255940 55319270 56492635 58173315 59382075 59840161 59832149 59084407
$$ packed form
13407A6452889j830712o89141K93369R13346J283900J684281J673737J986831
13399B1768500K753952L638290N431540Q313834J3299618K0151216K8156762L5842392
13391A39356104L9660756L7599998K9222840J3043227p443143k2185623l1326062
13384A97928097l5268465k9703997k0689068j4104716r777066o675218m027779
13377G7681788j545484J509474N744545J1510246K0402305L1715688M3235628
13370A90254190N1331741N0711525L2572856m96743l0365800n0620752n8455739
13363A84931278m7842530l0942326j8692876j1413152p513738n621298l825439
13356E9079919k642619j181360O3330J173365J680680J208760M58086q012p47742
$$ plain form
13347 59084407 58222532 57639257 57398044 57787478 58953873 61576862 65647488 71676718 80245905
13338 80245905 91043043 103792413 119408795 139449930 165221798 196609190 230981256
13331 230981256 262147028 282379611 285282104 268364737 235616346 196476393 158964835
13324 158964835 128486415 109273481 99227181 94793370 94046320 95958098 100871974 110530001
13316 110530001 126466042 149900249 181015430 217441179 254561423 287224799 307341212
13309 307341212 309158665 292170987 257285353 212845542 170419322 134633895 107351336
13302 107351336 89524102 78397333 71214461 66261025 62545180 59873235 57405320 54754560
13294 54754560 51931817 49200076 46312541 43894067 42247460 41278938 40543640 40252795
$$ packed form
13347E9084407q61875n83275k41213L89434J166395K622989M070626O029230Q569187
13338H0245905J0797138J2749370J5616382K0041135K5771868L1387392L4372066
13331B30981256L1165772K0232583K902493j6917367l2748391l9139953l7511558
13324A58964835l0478420j9212934j0046300m433811p47050J911778M913876R658027
13316A10530001J5936041K3434207L1115181L6425749L7120244L2663376K0116413
13309C07341212J817453j6987678l4885634m4439811m2426220l5785427k7282559
13302A07351336j7827234j1126769p182872m953436l715845k671945k467915k650760
13294E4754560k822743k731741k887535k418474j646607r68522p35298k90845
$$ plain form
13286 40252795 40529706 40831814 40946759 41232048 41829983 42486269 43239786 43787866 43943863
13277 43943863 43835533 43227535 41894660 40516652 39013438 37502493 35993459 34872802
13269 34872802 33928316 33225838 32605515 32412852 32569051 33001528 33683228 34579379 35496109
13260 35496109 36259266 36756945 37152669 37466504 37062323 36029705 34399721 32485142 30454546
13251 30454546 28445631 26701357 25188245 23825036 22683214 21658784 20675236 19838016
13243 19838016 18880919 17996555 17221947 16387382 15946435 15649379 15336360 15042784 14723940
13234 14723940 14392163 13745500 13281328 12487889 12107885 11901184 11614796 11467967 11334303
13225 11334303 11217398 10944080 10639152 10453965 10286650 9747079 9224205 9173805 9166525 8972622
$$ packed form
13286D0252795K76911L02108J14945K85289N97935O56286P53517N48080J55997
13277D3943863j08330o07998j332875j378008j503214j510945j509034j120657
13269C4872802r44486p02478o20323j92663J56199M32477O81700Q96151R16730
13260C5496109P63157M97679L95724L13835m04181j032618j629984j914579k030596
13251C0454546k008915j744274j513112j363209j141822j024430r83548q37220
13243A9838016r57097q84364p74608q34565m40947k97056l13019k93576l18844
13234A4723940l31777o46663m64172p93439l80004k06701k86388j46829j33664
13225A1334303j16905k73318l04928j85187j67315n39571n22874n0400p280j93903
$$ plain form
13215 8972622 8735409 8741297 8643778 8545201 8321518 8132489 8326368 8225236 8001240 7934682
13205 7934682 7793585 7501505 7375367 7363174 7359110 7323925 7300047 7202414 6965640 6689415
13195 6689415 6354995 6228231 6423058 6370555 6334592 6390024 6216327 5957298 5819134 5773136
13185 5773136 5906314 5810408 5647768 5563695 5353790 5300600 5504920 5471974 5339692 5163355
13175 5163355 5098223 5105414 4990337 4917484 5142361 5226888 5168000 5127513 5145805 5376816 5555098
13164 5555098 5522426 5275997 5306053 5439978 5472473 5366015 5595052 5897967 5828816 5889568
13154 5889568 6321045 6437350 6576975 6763651 6828862 6926603 7090736 7216808 7233816 7408843
13144 7408843 7557093 7942422 8387961 8785140 9193116 9993200 11205860 13161165 15792433
$$ packed form
13215H972622k37213N888r7519r8577k23683j89029J93879j01132k23996o6558
13205G934682j41097k92080j26138j2193m064l5185k3878r7633k36774k76225
13195F689415l34420j26764J94827n2503l5963N5432j73697k59029j38164m5998
13185E773136J33178r5906j62640q4073k09905n3190K04320l2946j32282j76337
13175E163355o5132P191j15077p2853K24877Q4527n8888m0487J8292K31011J78282
13164E555098l2672k46429L0056J33925L2495j06458K29037L02915o9151O0752
13154E889568M31477J16305J39625J86676O5211R7741J64133J26072J7008J75027
13144G408843J48250L85329M45539L97179M07976Q00084J212660J955305K631268
$$ plain form
13135 15792433 19452234 24424697 30989061 38516307 45736069 52289837 57739081 61126314
13127 61126314 63911174 68509616 75083898 84340651 94880011 103030589 107793586 107104830
13119 107104830 100663069 91327585 80537930 69827825 61526129 56864873 56249109 58968060
13111 58968060 64100240 71540955 80052857 90173452 100862750 109407297 115565429 119388695
13103 119388695 120039421 120458099 123654991 129370876 137615479 146926339 153715647 156853436
13095 156853436 155404480 147967714 138968083 131634135 125260670 117866010 109165265 101007825
13087 101007825 94200687 89310983 87368444 88266143 91241716 94593077 97477054 100321189
13079 100321189 101586123 100163344 97687702 94635327 90820217 87807518 85298824 82472525
$$ packed form
13135A5792433L659801M972463O564364P527246P219762O553768N449244L387233
13127F1126314K784860M598442O574282R256753J0539360Q150578M762997o88756
13119A07104830o441761r335484j0789655j0710105q301696m661256o15764K718951
13111E8968060N132180P440715Q511902J0120595J0689298Q544547O158132L823266
13103A19388695O50726M18678L196892N715885Q244603R310860O789308L137789
13095A56853436j448956p436766q999631p333948o373465p394660q700745q157440
13087A01007825o807138m889704j942539Q97699K975573L351361K883977K844135
13079A00321189J264934j422779k475642l052375l815110l012699k508694k826299
$$ plain form
13071 82472525 79455710 75323699 69802166 64149398 58434254 53516982 50300956 48599294
13063 48599294 48519087 50245413 53852246 59552113 67864479 77393931 86656860 94889424
13055 94889424 101156506 104168298 105639211 107346847 110583776 116449316 124741654 133486427
13047 133486427 140317746 142109493 137866106 129900872 119703116 109947103 102964912 100005169
13039 100005169 101823048 107714424 116597623 128144066 141995851 157088923 170356170
13032 170356170 180649808 185455167 183327652 177301641 171458999 168443079 169872291 176412904
13024 176412904 185398310 192165879 192623379 184900792 171063649 155328366 140515922 128424029
13016 128424029 119566253 114280550 113683664 117734855 123754685 129335565 133350903 136679202
$$ packed form
13071H2472525l016815m132011n521533n652768n715144m917272l216026j701662
13063D8599294q0207J726326L606833N699867Q312366R529452R262929Q232564
13055I4889424O267082L011792J470913J707636L236929N865540Q292338Q744773
13047A33486427O831319J791747m243387p965234j0197756r756013o982191k959743
13039A00005169J817879N891376Q883199J1546443J3851785J5093072J3267247
13032A70356170J0293638M805359k127515o026011n842642l015920J429212O540613
13024A76412904Q985406O767569M57500p722587j3837143j5735283j4812444j2091893
13016A28424029q857776n285703n96886M051191O019830N580880M015338L328299
$$ plain form
13008 136679202 139249847 141224508 142078005 137952423 129514770 120211096 111642828 104720103
13000 104720103 99763946 96474145 94028609 90650803 84914954 77661453 70336064 63004503
12992 63004503 56762696 52186447 48903639 46415268 44812394 43702994 42611746 42074099
12984 42074099 42328970 42522061 42815782 43166537 43392212 43421008 43524348 43251691 42652344
12975 42652344 41752246 41052084 40484594 40213155 39987389 39890254 39524193 38924868 38065108
12966 38065108 37137056 35824711 34602353 33401551 32367654 31807035 31232790 30919144 30807699
12957 30807699 30506431 30295792 29924415 30138960 30299228 30058679 29484756 28670122 27281086
12948 27281086 25759248 24671843 23769111 23033123 22274619 21555012 20739945 20250030 20227703
$$ packed form
13008A36679202K570645J974661Q53497m125582q437653r303674q568268o922725
13000A04720103m956157l289801k445536l377806n735849p253501p325389p331561
12992F3004503o241807m576249l282808k488371j602874j109400j091248n37647
12984D2074099K54871J93091K93721L50755K25675K8796J03340k72657n99347
12975D2652344r00098p00162n67490k71439k25766r7135l66061n99325q59760
12966C8065108r28052j312345j222358j200802j033897n60619n74245l13646j11445
12957C0807699l01268k10639l71377K14545J60268k40549n73923q14634j389036
12948B7281086j521838j087405r02732p35988p58504p19607q15067m89915k2327
$$ plain form
12939 20227703 20033274 19441891 19166075 18729552 17826079 16836624 16106326 15713456 15172820
12930 15172820 14877022 14436112 14219251 14235064 14282203 14031139 13861900 13929595 13900307 13751350
12920 13751350 13572254 13386324 13182188 12942721 12395165 11924189 11596731 11440526 11245972
12911 11245972 11226182 11062404 10670036 10213183 9950108 10022514 9998506 9730294 9557139 9582798
12901 9582798 9603046 9823618 10056226 10181448 10126787 9859779 9424927 8718960 8341454 8067756
12891 8067756 7838944 7674370 7445414 7173771 7079932 7009943 7107901 7065719 6794889 6488645
12881 6488645 6103831 5773955 5526467 5529708 5491351 5285222 5212143 5255861 5206463 5051854
12871 5051854 4934864 5076561 5146185 5062095 5035455 5130458 5056694 5164624 5441957 5717648
$$ packed form
12939B0227703j94429n91383k75816m36523r03473r89455p30298l92870n40636
12930A5172820k95798m40910k16861J5813M7139k51064j69239O7695k9288j48957
12920A3751350j79096j85930k04136k39467n47556m70976l27458j56205j94554
12911A1245972j9790j63778l92368m56853k63075P2406k4008k68212j73155K5659
12901I582798K0248K20572K32608J25222n4661k67008m34852p05967l77506k73698
12891H067756k28812j64574k28956k71643r3839o9989R7958m2182k70830l06244
12881F488645l84814l29876k47488L241l8357k06129p3079M3718m9398j54609
12871E051854j16990J41697O9624q4090k6640R5003p3764J07930K77333K75691
$$ plain form
12861 5717648 5927800 5914776 5604908 5538044 5527765 5268987 4821988 4453253 4177359 4400804
12851 4400804 4598705 4539746 4318597 4487002 4376590 4219171 4185832 4369010 4457726 4393964
12841 4393964 4243912 4162362 4037480 4124622 4072350 3914136 3734651 3591877 3440091 3406832
12831 3406832 3422442 3712642 3710640 3541953 3457547 3418651 3284474 3347542 3314954 3257065 3542193
12820 3542193 3861232 4002658 3998127 3786888 3428741 3032493 2738350 2584712 2865698 2981612
12810 2981612 2920138 2564172 2447370 2332992 2334396 2014475 1830102 1732219 1754172 1718662
12800 1718662 1780143 1822122 1788890 1581822 1499583 1579560 1683580 1695621 1581014 1492926 1442621
12789 1442621 1508346 1427681 1497907 1522573 1625494 1944376 1895966 1684993 1362206 1381561
$$ packed form
12861E717648K10152j3024l09868o6864j0279k58778m46999l68735k75894K23445
12851D400804J97901n8959k21149J68405j10412j57419l3339J83178Q8716o3762
12841D393964j50052q1550j24882Q7142n2272j58214j79485j42774j51786l3259
12831C406832J5610K90200k002j68687q4406l8896j34177O3068l2588n7889K85128
12820C542193L19039J41426m531k11239l58147l96248k94143j53638K80986J15914
12810B981612o1474l55966j16802j14378J404l19921j84373r7883K1953l5510
12800A718662O1481M1979l3232k07068q2239P9977J04020J2041j14607q8088n0305
12789A442621O5725q0665P0226K4666J02921L18882m8410k10973l22787J9355
$$ plain form
12779 1381561 1461771 1374367 1382303 1598210 1790873 1650425 1747599 1952921 2063474 2038917
12769 2038917 2077791 1826966 1808906 1964205 1891845 2088263 2266691 2432751 2639111 2530698
12759 2530698 2355396 2189481 2196309 2213693 1901974 1659594 1688801 1844335 2035595 1997762
12749 1997762 1879981 2044573 2140191 1979680 1799336 1997396 2202398 2334507 2170146 2133663
12739 2133663 2117025 2368816 2677309 2627564 2549574 2582906 2567577 2324989 1971905 1879815
12729 1879815 1788308 1567724 1627779 1531952 1432259 1574045 1831256 2283321 2657163 2868177
12719 2868177 3068609 2964663 2590842 2149937 1848988 1803999 1658552 1669931 1678675 1555523
12709 1555523 1503225 1392205 1316149 1447910 1477480 1398225 1499377 1672799 1809217 1891214
$$ packed form
12779A381561Q0210q7404P936K15907J92663j40448R7174K05322J10553k4557
12769B038917L8874k50825j8060J55299p2360J96418J78428J66060K06360j08413
12759B530698j75302j65915O828J7384l11719k42380K9207J55534J91260l7833
12749A997762j17781J64592R5618j60511j80344J98060K05002J32109j64361l6483
12739B133663j6638K51791L08493m9745p7990L3332j5329k42588l53084r2090
12729A879815r1507k20584O0055r5827r9693J41786K57211M52065L73842K11014
12719B868177K00432j03946l73821m40905l00949m4989j45447J1379Q744j23152
12709A555523n2298j11020p6056J31761K9570p9255J01152J73422J36418Q1997
$$ plain form
12699 1891214 1872660 1900625 1921237 1654067 1586039 1411194 1301753 1362962 1460865 1562215
12689 1562215 1597217 1652843 1507208 1425857 1454045 1480561 1589183 1553971 1411321 1485797 1369467
12678 1369467 1374359 1481306 1541191 1646650 1777537 1613678 1331034 1219552 1390572 1466786
12668 1466786 1482864 1606409 1592345 1546501 1778128 1808094 1760653 1597735 1381031 1405386
12658 1405386 1573069 1557327 1383766 1495564 1623583 1772893 1770807 1958311 1952626 1931102
12648 1931102 2020264 1983927 1893842 2097070 2006688 1876186 1894706 1822749 1667058 1640772 1492331
12637 1492331 1494011 1557630 1759841 1733492 1499087 1410129 1619122 1741252 2007196 2094071
12627 2094071 1946257 1800805 1837274 1871464 1848697 1862743 1682902 1407487 1479015 1615028
$$ packed form
12699A891214j8554K7965K0612k67170o8028j74845j09441O1209R7903J01350
12689A562215L5002N5626j45635q1351K8188K6516J08622l5212j42650P4476j16330
12678A369467M892J06947N9885J05459J30887j63859k82644j11482J71020P6214
12668A466786J6078J23545j4064m5844K31627K9966m7441j62918k16704K4355
12658A405386J67683j5742j73561J11798J28019J49310k086J87504n685k1524
12648A931102Q9162l6337r0085K03228r0382j30502J8520p1957j55691k6286j48441
12637A492331J680O3619K02211k6349k34405q8958K08993J22130K65944Q6875
12627B094071j47814j45452L6469L4190k2767J4046j79841k75415P1528J36013
$$ plain form
12617 1615028 1593893 1487594 1512455 1626875 1943929 2130825 2269875 2149004 1976384 1718756
12607 1718756 1587996 1631342 1540439 1387911 1304079 1248532 1164071 1045240 1095815 1161042 1040562
12596 1040562 944109 743011 829601 973759 1011963 1028175 1035950 1101675 1093199 902940 1273770
12585 1273770 1552298 1706693 1394883 1134537 1329167 1602041 1806912 1622404 1636498 1630021
12575 1630021 1496202 1438931 1445272 1538304 1290926 996328 1250403 1471239 1601551 1511858
12565 1511858 1563392 1601876 1539251 1920710 2592421 2588950 2098911 1840553 1853898 1888807 1648401
12554 1648401 1436943 1415619 1291667 1244400 1362046 1219963 1221467 1387155 1493497 1469932
12544 1469932 1219942 1230830 1199610 1242464 1348470 1375092 1540221 1724200 1723077 1379027
$$ packed form
12617A615028k1135j06299K4861J14420L17054J86896J39050j20871j72620k57628
12607A718756j30760M3346r0903j52528q3832n5547q4461j18831N0575O5227j20480
12596A040562r6453k01098Q6590J44158L8204J6212P775O5725q476j90259L70830
12585A273770K78528J54395l11810k60346J94630K72874K04871j84508J4094o477
12575A630021j33819n7271O341R3032k47378k94598K54075K20836J30312q9693
12565A511858N1534L8484o2625L81459O71711l471m90039k58358J3345L4909k40406
12554A648401k11458k1324j23952m7267J17646j42083J504J65688J06342k3565
12544A469932k49990J0888l1220M2854J06006K6622J65129J83979j123l44050
$$ plain form
12534 1379027 1279631 1272875 1244753 1404226 1455383 1316753 1086910 1061462 1111616 1489917 1554468
12523 1554468 1533934 1610440 1500933 1367612 1394019 1469251 1393654 1194473 851632 974250
12513 974250 1166895 1377243 1539667 1462331 1236252 1235481 1178919 1068526 836885 966862
12503 966862 1350636 1389116 1148952 1044245 1037941 923039 913630 693298 693417 983072 998868
12492 998868 912594 790730 742466 590062 482054 545332 709109 809148 1071004 1242079
12482 1242079 1308755 1182371 1051368 1020198 1075752 1217184 1320438 1309996 1315906 1165111
12472 1165111 1151314 1195094 1085903 868502 778973 945106 1135144 1226051 1159860 1331993
12462 1331993 1319574 1370084 1476773 1452337 1529742 1639066 1614486 1473677 1607823 1762139
$$ packed form
12534A379027r9396o756k8122J59473N1157j38630k29843k5448N0154L78301O4551
12523A554468k0534P6506j09507j33321K6407P5232p5597j99181l42841J22618
12513I74250J92645K10348J62424p7336k26079p71n6562j10393k31641J29977
12503I66862L83774L8480k40164j04707o304j14902r409k20332J19K89655J5796
12492I98868q6274j21864m8264j52404j08008O3278J63777J00039K61856J71075
12482A242079O6676j26384j31003l1170N5554J41432J03254j0442N910j50795
12472A165111j3797M3780j09191k17401q9529J66133J90038R0907o6191J72133
12462A331993j2419N0510J06689k4436P7405J09324k4580j40809J34146J54316
$$ plain form
12452 1762139 1485405 1510641 1684909 1916422 1967565 1960949 1877204 1944274 1845977 1686073 1695316
12441 1695316 1577612 1585261 1649655 1690549 1817453 2031086 2336407 2351385 2475555 2644137
12431 2644137 2676849 2542237 2271015 2074950 2205937 2268836 2191423 2154378 2321415 2347813
12421 2347813 2571863 2802366 3054018 3179981 3164922 3292458 3496223 3273572 3128637 3119007
12411 3119007 3147165 3362819 3420560 3330137 3506717 3682693 3734699 3581383 3444282 3516255
12401 3516255 3220021 2963676 2770666 2668208 2719010 2670584 2769415 2910077 3054924 3153185
12391 3153185 3277069 3455445 3647518 3921780 4200238 4416214 4561132 5016995 5214846
12382 5214846 5180332 5410462 5883185 5999820 6223164 6386926 6615315 6390298 5935924 5472736
$$ packed form
12452A762139k76734K5236J74268K31513N1143o616q3745O7070r8297j59904R243
12441A695316j17704P649O4394M0894J26904K13633L05321J4978J24170J68582
12431B644137L2712j34612k71222j96065J30987O2899p7413l7045J67037K6398
12421B347813K24050K30503K51652J25963j5059J27536K03765k22651j44935r630
12411C119007K8158K15654N7741r0423J76580J75976N2006j53316j37101P1973
12401C516255k96234k56345j93010j02458N0802m8426R8831J40662J44847R8261
12391C153185J23884J78376J92073K74262K78458K15976J44918M55863J97851
12382E214846l4514K30130M72723J16635K23344J63762K28389k25017m54374m63188
$$ plain form
12372 5472736 5116944 4664355 4420672 4320883 4198601 3984796 4079814 4255933 4266049 4169944
12362 4169944 4033932 4110843 4113292 4208971 4204652 4254007 4405586 4562354 4802593 4945872 5186132
12351 5186132 5678793 6041484 6357097 6884150 7288120 7753957 8154759 8603800 9485971
12342 9485971 10846994 12525231 14036901 15508693 17342115 19934899 24293595 31677752
12334 31677752 43541135 59901346 79632003 99396433 113506283 117608250 111616524
12327 111616524 97413771 80442275 66988457 58382753 53460293 50444607 48274684
12320 48274684 46588395 45637815 45512560 45957501 47533099 50071575 52388869 53481774
12312 53481774 54404781 57995256 66302115 79484647 95690228 110622102 118336907 117062962
$$ packed form
12372E472736l55792m52589k43683r9789j22282k13805R5018J76119J0116r6105
12362D169944j36012P6911K449R5679m319M9355J51579J56768K40239J43279K40260
12351E186132M92661L62691L15613N27053M03970M65837M00802M49041Q82171
12342I485971J361023J678237J511670J471792J833422K592784M358696P384157
12334C1677752J1863383J6360211J9730657J9764430J4109850M101967n991726
12327A11616524j4202753j6971496j3453818q605704m922460l015686k169923
12320D8274684j686289r50580j25255M44941J575598K538476K317294J092905
12312E3481774R23007L590475Q306859J3182532J6205581J4931874P714805j273945
$$ plain form
12304 117062962 109728193 100596816 92996894 89671095 90383950 92957098 94090754 91670299
12296 91670299 85719842 77688769 70116410 66241658 65890079 67623413 69149860 69557365
12288 69557365 69342164 69469821 71063613 74046869 77398535 80100028 81332859 82119814
12280 82119814 84847413 90711940 98617648 106415151 111422840 111039884 104883656 96351901
12272 96351901 89301308 84942648 83256511 83621437 85849602 88965952 90884573 90318542
12264 90318542 88070802 86317251 86940519 91605604 101565355 117210884 136864810 156659540
12256 156659540 170533545 175552454 170947590 158809995 145550642 136895431 134644791
12249 134644791 139045573 148543983 158664593 162242579 157374204 144688308 126656762
$$ packed form
12304A17062962p334769r131377p599922l325799P12855K573148J133656k420455
12296I1670299n950457q031073p572359l874752l51579J733334J526447M07505
12288F9557365k15201J27657J593792K983256L351666K701493J232831P86955
12280H2119814K727599N864527P905708P797503N007689l82956o156228q531755
12272I6351901p050593m358660j686137L64926K228165L116350J918621n66031
12264I0318542k247740j753551O23268M665085R959751J5645529J9653926J9794730
12256A56659540J3874005N018909m604864j2137595j3259353q655211k250640
12249A34644791M400782R498410J0120610L577986m868375j2685896j8031546
$$ plain form
12242 126656762 108922286 96317597 88442635 84209293 83481523 85726351 91408188 100479917
12234 100479917 111546785 120918270 125820301 125672310 122666549 119874650 119749453 121838452
12226 121838452 123221998 120888616 114793450 106700425 98416508 90400336 82971828 77027788
12218 77027788 72907467 69649896 67183850 65666648 65533662 66931717 69576946 72960633
12210 72960633 75870724 77151245 77983080 80449441 86222233 94749572 103310608 108506156
12202 108506156 108216179 103391343 96938188 91713330 88742408 87617671 86867393 85444469
12194 85444469 82404625 79264484 77870131 78551211 79297735 78765067 77421620 76024321
12186 76024321 76008467 77536899 79771318 81664412 82382087 82756115 82626126 82902173 85078227
$$ packed form
12242A26656762j7734476j2604689p874962m233342p27770K244828N681837R071729
12234A00479917J1066868R371485M902031j47991l005761k791899j25197K088999
12226A21838452J383546k333382o095166q093025q283917q016172p428508n944040
12218G7027788m120321l257571k466046j517202j32986J398055K645229L383687
12210G2960633K910091J280521Q31835K466361N772792Q527339Q561036N195548
12202A08506156k89977m824836o453155n224858k970922j124737p50278j422924
12194H5444469l039844l140141j394353O81080P46524n32668j343447j397299
12186G6024321j5854J528432K234419J893094P17675L74028j29989K76047K176054
$$ plain form
12177 85078227 90035302 97238411 104947770 111969167 115277637 112148697 103313466 89210724
12169 89210724 73359879 60682727 52265026 46951997 43200028 40731999 38822813 37154208
12161 37154208 35547332 34397496 33380531 32767412 32642552 32363558 32031483 31990105 32097454
12152 32097454 32352267 32457842 32168788 31560702 30750317 29718475 28648705 27532356 26672177
12143 26672177 26042160 25509422 24811186 24785126 25107260 25891315 27073391 28410183 29907036
12134 29907036 31123061 31763213 31343296 30242715 29323970 28413963 27741890 27941596 28566052
12125 28566052 29501690 30396237 31377354 33106667 34875599 35561254 34975313 33752333 31652006
12116 31652006 29152568 26950196 25271180 23454005 21462639 19787635 18899882 18390571
$$ packed form
12177H5078227M957075P203109P709359P021397L308470l128940q835231j4102742
12169H9210724j5850845j2677152q417701n313029l751969k468029j909186j668605
12161C7154208j606876j149836j016965o13119j24860k78994l32075m1378J07349
12152C2097454K54813J05575k89054o08086q10385j031842j069770j116349q60179
12143B6672177o30017n32738o98236k6060L22134P84055J182076J336792J496853
12134B9907036J216025O40152m19917j100581r18745r10007o72073J99706O24456
12125B8566052R35638Q94547R81117J729313J768932O85655n85941j222980k100327
12116C1652006k499438k202372j679016j817175j991366j675004q87753n09311
$$ plain form
12108 18390571 17867243 17670371 17463988 16922745 16083202 15070687 14101162 13174699 12621900
12099 12621900 12137818 11900509 11863070 11871775 11781055 11824734 11931254 12140581 12800921 13407755
12089 13407755 13766448 13661783 13066433 12280647 11309625 10873171 10832491 10754022 10530361 10216768
12079 10216768 10105895 9868502 9520674 9372022 9457642 9697292 9917176 9376857 9088213
12070 9088213 9035474 8998342 8852312 8511831 8231911 8266167 8216404 8052123 8152443 8176558
12060 8176558 8215225 8329751 8158344 8158973 7958760 7695186 7613704 7551930 7311210 7054312
12050 7054312 6793048 6310925 5966526 5577335 5245060 5163589 4972566 4853814 4910596 4897590
12040 4897590 4850993 4754846 4799412 4831892 4887834 4747272 4429469 4163619 3869128 3731787
$$ packed form
12108A8390571n23328j96872k06383n41243q39543j012515r69525r26463n52799
12099A2621900m84082k37309l7439Q705r0720M3679J06520K09327O60340O06834
12089A3407755L58693j04665n95350p85786r71022m36454m0680p8469k23661l13593
12079A0216768j10873k37393l47828j48652Q5620K39650K19884n40319k88644
12070I088213n2739l7132j46030l40481k79920L4256m9763j64281J00320K4115
12060H176558L8667J14526j71407O29k00213k63574q1482o1774k40720k56898
12050G054312k61264m82123l44399l89191l32275q1471j91023j18752N6782j3006
12040D897590m6597r6147M4566L2480N5942j40562l17803k65850k94491j37341
$$ plain form
12030 3731787 3870145 3776138 3804543 3974382 3910453 3870088 4069845 4067393 3969252 3970173 3934678
12019 3934678 4326696 4779296 4978305 4886917 4560259 4055365 3568026 3293661 3180965 3220872
12009 3220872 3374284 3449193 3351028 3250207 3141172 3162182 3034264 2839753 2715440 2535238
11999 2535238 2756841 2759193 2528212 2497455 2462121 2602480 2582762 2601540 2763514 2688895 2816832
11988 2816832 2713113 2388277 2510407 2796855 2755187 2592030 2683247 2683843 2450604 2125193
11978 2125193 1881123 1702242 1659796 1653395 1661687 1788854 1799717 1674581 1476549 1496583 1559870
11967 1559870 1560960 1539548 1469816 1253163 1173402 1111456 873046 906637 1000676 1009217 1249460
11956 1249460 1354753 1151034 1244053 1412528 1339008 1303299 1225234 1073553 1094440 1207120
$$ packed form
12030C731787J38358r4007K8405J69839o3929m0365J99757k452r8141R21l5495
12019C934678L92018M52600J99009r1388l26658n04894m87339k74365j12696L9907
12009C220872J53412P4909r8165j00821j09035K1010j27918j94511j24313j80202
11999B535238K21603K352k30981l0757l5334J40359j9718J8778J61974p4619J27937
11988B816832j03719l24836J22130K86448m1668j63157R1217N96k33239l25411
11978B125193k44070j78881m2446o401Q292J27167J0863j25136j98032K0034O3287
11967A559870J090k1412o9732k16653p9761o1946k38410L3591R4039Q541K40243
11956A249460J05293k03719R3019J68475p3520l5709p8065j51681K0887J12680
$$ plain form
11946 1207120 1215514 1304146 1362196 1133429 865143 833134 1084431 1062855 901144 987100 806983
11935 806983 698094 854652 906478 963381 1183953 1262128 1103533 931910 1168894 1361758
11925 1361758 1485536 1485713 1096443 861416 722223 715386 717476 766170 773669 654468 605487
11914 605487 688574 536843 504995 639987 594162 405834 354348 405969 511676 651094
11904 651094 468213 282295 284924 582791 736480 566644 249812 367265 627910 728016
11894 728016 705450 850965 978758 1033343 1114332 1265239 1131980 1209989 1201387 1140175 901338
11883 901338 751944 768451 979180 1285136 1193913 998932 784835 821905 840120 871956
11873 871956 924498 794203 966875 1034967 861508 678153 647321 565356 611000 687292 633953
$$ packed form
11946A207120Q394Q8632N8050k28767k68286l2009K51297k1576j61711Q5956j80117
11935H06983j08889J56558N1826N6903K20572P8175j58595j71623K36984J92864
11925A361758J23778J77l89270k35027j39193o837K090M8694P499j19201m8981
11914F05487Q3087j51731l1848J34992m5825j88328n1486N1621J05707J39418
11904F51094j82881j85918K629K97867J53689j69836l16832J17453K60645J00106
11894G28016k2566J45515J27793N4585Q0989J50907j33259P8009q602o1212k38837
11883I01338j49394J6507K10729L05956r1223j94981k14097L7070J8215L1836
11873H71956N2542j30295J72672O8092j73459j83355l0832q1965M5644P6292n3339
$$ plain form
11862 633953 586853 650337 830011 984464 1026494 999214 913095 1073466 1272128 1114935
11852 1114935 904300 922584 899529 910724 648195 387009 463083 492288 437891 443390 536072
11841 536072 559348 729206 756711 675017 707366 734098 632911 643308 566445 400615 504230
11830 504230 705596 789136 821063 1109974 1276987 935854 580824 537846 657573 738051
11820 738051 804068 800061 972915 1211358 1307251 1384772 1231381 1076335 978596 979193 992610
11809 992610 964996 987562 984402 925381 998953 953033 1047612 984550 717230 791286 778276
11798 778276 738653 667493 635926 678923 512353 198839 529977 716368 656931 530535
11788 530535 595844 826408 913197 910300 687162 698473 899413 913571 999832 909661 890006
$$ packed form
11862F33953m7100O3484J79674J54453M2030k7280q6119J60371J98662j57193
11852A114935k10635J8284k3055J1195k62529k61186P6074K9205n4397N499R2682
11841E36072K3276J69858K7505q1694L2349K6732j01187J0397p6863j65830J03615
11830E04230K01366Q3540L1927K88911J67013l41133l55030m2978J19727Q0478
11820G38051O6017m007J72854K38443R5893P7521j53391j55046r7739N97J3417
11809I92610k7614K2566l160n9021P3572m5920R4579o3062k67320P4056j3010
11798G78276l9623p1160l1567M2997j66570l13514L31138J86391n9437j26396
11788E30535O5309K30564Q6789k897k23138J1311K00940J4158Q6261r0171j9655
$$ plain form
11777 890006 737710 553674 605780 411138 391579 585239 615049 599322 472333 569968
11767 569968 598487 361555 222598 254449 109224 32780 63988 254416 386189 239281
11757 239281 445081 416062 299962 383445 605388 750845 759906 747338 687830 650306 479884
11746 479884 486591 593183 605049 447577 278006 334372 394098 439678 420465 519290 553875
11735 553875 423686 422413 407886 348510 314980 355272 454021 554233 758567 852532 890169
11724 890169 738119 534219 332857 286387 157968 93626 170032 255687 171413 200748 169539
11713 169539 208036 203642 218159 243040 367656 263248 127398 54910 236640 442999 447297
11702 447297 472028 564088 462005 446449 570964 360592 391743 452068 551958 513964 405150
$$ packed form
11777H90006j52296j84036N2106j94642j9559J93660K9810j5727j26989R7635
11767E69968K8519k36932j38957L1851j45225p6444L1208J90428J31773j46908
11757B39281K05800k9019j16100Q3483K21943J45457R061j2568n9508l7524j70422
11746D79884O707J06592J1866j57472j69571N6366N9726M5580j9213R8825L4585
11735E53875j30189j273j4527n9376l3530M0292R8749J00212K04334R3965L7637
11724H90169j52050k03900k01362m6470j28419o4342P6406Q5655q4274K9335l1209
11713A69539L8497m394J4517K4881J24616j04408j35850p2488J81730K06359M298
11702D47297K4731R2060j02083j5556J24515k10372L1151O0325R9890l7994j08814
$$ plain form
11691 405150 246819 157113 219410 277184 208263 294279 210723 22177 41461 162033 115784
11680 115784 -87198 -67564 252669 276912 394334 358656 182170 -8171 2712 387690
11670 387690 552033 631935 570369 607927 631411 424606 497155 413597 170850 94691 139754
11659 139754 415525 466615 413465 304025 310453 287537 129389 187699 291063 224844 318087
11648 318087 229634 342116 326895 348123 255596 -35400 -96339 24402 81683 -26572 101914
11637 101914 186240 215715 95524 -61641 -6941 34744 231725 275314 348305 368689 583006
11626 583006 380177 47415 -15032 -17423 31531 -24389 -33429 138244 202025 123029 199554
11615 199554 427175 388946 286030 380881 280165 263995 67804 -26352 -107969 11136
$$ packed form
11691D05150j58331q9706O2297N7774o8921Q6016q3556j88546J9284J20572m6249
11680A15784k02982J9634L20233K4243J17422l5678j76486j90341J0883L84978
11670C87690J64343P9902o1566L7558K3484k06805P2549q3558k42747p6159M5063
11659A39754K75771N1090n3150j09440O428k2916j58148N8310J03364o6219R3243
11648C18087q8453J12482j5221K1228r2527k90996o0939J20741N7281j08255J28486
11637A01914Q4326K9475j20191j57165N4700M1685J96981M3589P2991K0384K14317
11626E83006k02829l32762o2447k391M8954n5920r040J71673O3781p8996P6525
11615A99554K27621l8229j02916R4851j00716j6170j96191r4156q1617J19105
$$ plain form
11605 11136 232880 153081 -11950 -26717 14657 -117703 -82010 -67696 -263581 -402142 -532022
11594 -532022 -538984 -380315 -283747 -191020 -133200 -178095 -101798 82517 -117607 -189707 -127397
11583 -127397 -37501 50272 -29010 -113054 -177693 57057 222593 457304 493990 521808 328771
11572 328771 368989 317191 129189 92799 212695 380569 464453 337530 250805 -1748
11562 -1748 154003 382132 353483 121987 146297 123925 103094 124505 241206 300637 41752
11551 41752 -31291 -112965 -85015 -112083 61681 104393 -109615 -173396 -119129 77691 -141438
11540 -141438 -204973 -64677 207431 404076 375702 202732 70535 104930 150135 129241
11530 129241 107005 26228 -45534 -90580 83427 132785 420467 481801 361586 571611 760147
$$ packed form
11605A1136K21744p9799j65031j4767M1374j32360L5693J4314j95885j38561j29880
11594e32022o962J58669R6568R2727N7820m4895P6297J84315k00124p2100O2310
11583a27397Q9896Q7773p9282q4044o4639K34750J65536K34711L6686K7818j93037
11572C28771M0218n1798j88002l6390J19896J67874Q3884j26923q6725k52553
11562a748J55751K28129k8649k31496K4310k2372k0831K1411J16701N9431k58885
11551D1752p3043q1674K7950k7068J73764M2712k14008o3781N4267J96820k19129
11540a41438o3535J40296K72108J96645k8374j72970j32197L4395M5205k0894
11530A29241k2236q0777p1762m5046J74007M9358K87682O1334j20215K10025J88536
$$ plain form
11519 760147 777527 766036 727338 557459 147556 12785 -70764 -168289 -73696 147024 264240
11508 264240 262328 211202 308594 491909 535741 381436 383954 118678 186057 294327 95125
11497 95125 -92105 -101439 181545 171490 134913 232067 102788 197564 227841 91411 -57199
11486 -57199 -57138 -156663 -237092 -50403 80369 55477 15506 133733 398770 373556 770155
11475 770155 750226 715271 727477 443384 274276 155375 228844 290811 476208 508792 696845
11464 696845 730953 773541 687590 480527 349108 414606 386919 254821 477525 490714 444130
11453 444130 371372 282617 178846 206667 460806 338449 -12615 -150270 137747 354616
11443 354616 414252 358165 421398 494918 405935 533799 394470 338894 208480 100515 90506
$$ packed form
11519G60147J7380j1491l8698j69879m09903j34771q3549r7525R4593K20720J17216
11508B64240j912n1126R7392J83315M3832j54305K518k65276O7379J08270j99202
11497I5125j87230r334K82984j0055l6577R7154j29279R4776L0277j36430j48610
11486e7199O1r9525q0429J86689J30772k4892l9971J18227K65037k5214L96599
11475G70155j9929l4955J2206k84093j69108j18901P3469O1967J85397L2584J88053
11464F96845L4108M2588q5951k07063j31419O5498k7687j32098K22704J3189m6584
11453D44130p2758q8755j03771K7821K54139j22357l51064j37655K88017K16869
11443C54616N9636n6087O3233P3520q8983J27864j39329n5576j30414j07965j0009
$$ plain form
11432 90506 299293 561179 726376 928329 774553 468680 197875 154398 328774 373482
11422 373482 305634 409159 575507 512644 678873 724124 528314 474198 312085 209177
11412 209177 137615 197752 411261 371619 356393 540334 675076 397168 123704 8299
11402 8299 138292 192196 254018 306684 238004 182466 234543 316217 475536 490839 316234
11391 316234 279420 67367 227549 223180 176718 273091 73489 53606 222694 220430 184427
11380 184427 199089 73581 155818 221412 124936 -38587 -78460 -146630 -231486 -150139 220805
11369 220805 332279 135033 181158 483306 485069 312716 291404 394385 320462 284940 257067
11358 257067 145610 416015 528204 301538 173392 164868 156053 120377 216877 206702 84222
$$ packed form
11432I0506K08787K61886J65197K01953j53776l05873k70805m3477J74376M4708
11422C73482o7848J03525J66348o2863J66229M5251j95810n4116j62113j02908
11412B09177p1562O0137K13509l9642j5226J83941J34742k77908k73464j15405
11402H299J29993N3904O1822N2666o8680n5538N2077Q1674J59319J5303j74605
11391C16234l6814k12053J60182m369m6462R6373j99602j9883J69088k264l6003
11380A84427J4662j25508Q2237O5594r6476j63523l9873o8170q4856Q1347L70944
11369B20805J11474j97246M6125L02148J763j72353k1312J02981p3923l5522k7873
11358B57067j11457K70405J12189k26666j28146q524q815l5676R6500j0175j22480
$$ plain form
11347 84222 87476 62419 63901 217131 233056 9723 49276 225826 362146 284806 231172
11336 231172 390785 326853 383814 208743 117010 231197 177807 -17101 -74174 114397
11326 114397 297860 441507 298797 170519 -20885 -33576 220796 462382 457186 491389
11316 491389 337170 412493 590534 926428 1098145 1268995 1332118 1287206 1438731 1910126
11306 1910126 2257567 2608939 3269107 4509730 6753008 10398644 14813240 20154284 25648451
11297 25648451 29615550 30430031 28689438 25051358 19630018 14026653 10176856 7642728
11289 7642728 6000248 4967765 4321072 3858904 3364475 3086743 2939659 2839443 2620535
11280 2620535 2286536 1935559 1810418 1766813 1604835 1504315 1396475 1385459 1471894 1153641
$$ packed form
11347H4222L254k5057J482J53230J5925k23333L9553J76550J36320p7340n3634
11336B31172J59613o3932N6961j75071r1733J14187n3390j94908n7073J88571
11326A14397J83463J43647j42710j28278j91404j2691K54372K41586n196L4203
11316D91389j54219P5323J78041L35894J71717J70850O3123m4912J51525M71395
11306A910126L47441L51372O60168J240623K243278L645636M414596N341044N494167
11297B5648451L967099Q14481j740593l638080n421340n603365l849797k534128
11289G642728j642480j032483o46693m62168m94429k77732j47084j00216k18908
11280B620535l33999l50977j25141m3605j61978j00520j07840j1016Q6435l18253
$$ plain form
11270 1153641 903821 964121 916913 884306 1107585 1220284 1099357 949764 901307 1252646
11260 1252646 1350029 1237168 959781 1026121 1153368 1327193 1409114 1318995 1221287 1520897
11250 1520897 1786881 1944619 2064792 2355534 2688301 2925952 2950202 2804073 2732936 2626929
11240 2626929 2393200 2216937 1948478 1619797 1458074 1512245 1310275 1380036 1528591 1461199
11230 1461199 1328143 1447815 1325983 1024770 866067 843178 911837 966273 965462 953613 951973
11219 951973 1013026 931864 741097 644072 762519 904492 959938 1335420 1479142 1553132
11209 1553132 1701177 1494261 991748 493029 463277 598148 626343 758577 635701 707712
11199 707712 781839 759688 792655 1095481 1104285 1178313 1246781 1140855 1280784 1685480 1821580
$$ packed form
11270A153641k49820O0300m7208l2607K23279J12699j20927j49593m8457L51339
11260A252646R7383j12861k77387O6340J27247J73825Q1921r0119r7708K99610
11250A520897K65984J57738J20173K90742L32767K37651K4250j46129p1137j06007
11240B626929k33729j76263k68459l28681j61723N4171k01970O9761J48555o7392
11230A461199j33056J19672j21832l01213j58703k2889O8659N4436q11j1849j640
11219I51973O1053q1162j90767r7025J18447J41973N5446L75482J43722P3990
11209A553132J48045k06916n02513m98719k9752J34871K8195J32234j22876P2011
11199G07712P4127k2151L2967L02826Q804P4028O8468j05926J39929M04696J36100
$$ plain form
11188 1821580 2243034 2799887 3378132 3914603 4952581 7309134 11123922 15892281 20809126
11179 20809126 24817291 26828089 26512182 25883008 25026237 22631575 17783801 12578990
11171 12578990 9017703 6919488 5824904 5200648 4768963 4202637 3936179 3774090 3493894
11162 3493894 3231423 2928598 2600625 2440137 2377567 2097515 1825486 1693583 1682317 1701867
11152 1701867 1816696 1891266 1753184 1571802 1620071 1644836 1471910 1160327 952820 1120246
11142 1120246 1251491 1268582 1259979 1417651 1309376 1423183 1633656 1632294 1627537 1644986 1978364
11131 1978364 2118132 2051830 2288145 2623215 2574528 2710735 3038953 3119481 3150886 3061218
11121 3061218 2738264 2406162 2474488 2470289 2694333 2490444 1970164 1753229 1514882 1278976
$$ packed form
11188A821580M21454N56853N78245N36471J037978K356553L814788M768359M916845
11179B0809126M008165K010798l15907o29174q56771k394662m847774n204811
11171A2578990l561287k098215j094584o24256m31685n66326k66458j62089k80196
11162C493894k62471l02825l27973j60488o2570k80052k72029j31903j1266J9550
11152A701867J14829P4570j38082j81382M8269K4765j72926l11583k07507J67426
11142A120246J31245J7091q603J57672j08275J13807K10473j362m757J7449L33378
11131A978364J39768o6302K36315L35070m8687J36207L28218Q0528L1405q9668
11121C061218l22954l32102O8326m199K24044k03889n20280k16935k38347k35906
$$ plain form
11111 1278976 1339289 1282108 1240876 1248833 1178489 1043846 1208671 1261045 1102821 1086955 845333
11100 845333 590199 674870 828755 1012518 1103687 991010 875632 845362 995510 855779
11090 855779 504551 341051 424611 656395 722178 623144 583260 555110 365842 384392 570484
11079 570484 555826 487482 732325 665376 523066 142837 5784 223451 408175 490290
11069 490290 487349 403235 499893 419104 301863 259736 236240 355438 449503 503287 458326
11058 458326 351751 511879 535639 277070 49035 106910 308256 493220 621375 509410
11048 509410 552724 503051 490158 380342 512657 464193 387930 553068 619029 559676 572323
11037 572323 465758 356145 214590 250898 376178 689835 813045 708376 539402 268796
$$ packed form
11111A278976O0313n7181m1232P957p0344j34643J64825N2374j58224j5866k41622
11100H45333k55134Q4671J53885J83763R1169j12677j15378l0270J50148j39731
11090H55779l51228j63500Q3560K31784O5783r9034l9884k8150j89268J8550J86092
11079E70484j4658o8344K44843o6949j42310l80229j37053K17667J84724Q2115
11069D90290k941q4114R6658q0789j17241m2127k3496J19198R4065N3784m4961
11058D58326j06575J60128K3760k58569k28035N7875K01346J84964J28155j11965
11048E09410M3314m9673j2893j09816J32315m8464p6263J65138O5961n9353J2647
11037E72323j06565j09613j41555L6308J25280L13657J23210j04669j68974k70606
$$ plain form
11027 268796 77619 -91289 -38979 123705 149739 335183 358572 388223 334877 370936 360599
11016 360599 349827 224787 230373 442838 361731 239307 -1465 -27243 127088 267164
11006 267164 324167 198104 11905 94354 339689 337827 107677 -74935 -134928 109005
10996 109005 389492 408084 250882 332148 173296 -30616 -204603 -114197 -48503 75410
10986 75410 69148 -45003 -44807 91897 208721 173168 256920 323026 316210 294493 242491 296076
10974 296076 162115 63306 171621 179125 259158 367371 212766 85184 181771 39706
10964 39706 -113079 363567 386871 140941 209307 217389 71168 263142 527920 432900 279395
10953 279395 152496 436043 453316 194934 -7447 52366 231551 274846 363697 309339
$$ packed form
11027B68796j91177j68908N2310J62684K6034J85444K3389K9651n3346L6059j0337
11016C60599j0772j25040N586K12465q1107j22424k40772k5778J54331J40076
11006B67164N7003j26063j86199Q2449K45335j862k30150j82612n9993K43933
10996A09005K80487J8592j57202Q1266j58852k03912j73987R0406O5694J23913
10986G5410o262j14151J96J36704J16824l5553Q3752O6106o816k1717n2002N3585
10974B96076j33961r8809J08315P504Q0033J08213j54605j27582R6587j42065
10964C9706j52785M76646K3304k45930O8366Q082j46221J91974K64778r5020j53505
10953B79395j26899K83547J7273k58382k02381N9813J79185M3295Q8851n4358
$$ plain form
10943 309339 384679 82941 -265458 -160347 -62262 -79037 -288204 -509429 -456117 -136586
10933 -136586 -67760 8265 102541 170576 151808 373369 385545 356445 163212 415690 352561
10922 352561 243992 186915 160145 247544 191614 35280 67806 -1984 -122295 -250566 -18200
10911 -18200 207712 127579 96719 164612 228265 249799 210785 32160 -82704 -62723 -4411
10900 -4411 25080 174655 91641 -135188 -25094 163679 372973 480305 441932 352902 351402
10889 351402 346134 348436 293382 171002 97766 -40183 -197386 -87295 -12119 -27908 85481
10878 85481 224190 429308 318554 15834 -120363 79397 250450 391245 291596 25614
10868 25614 -85660 -137611 6244 125146 203903 440576 367651 374285 191431 90862 253094
$$ packed form
10943C09339P5340l01738l48399J05111R8085j6775k09167k21225N3312L19531
10933a36586O8826P6025R4276O8035j8768K21561J2176k9100j93233K52478o3129
10922C52561j08569n7077k6770Q7399n5930j56334L2526o9790j20311j28271K32366
10911a8200K25912q0133l0860O7893O3653K1534l9014j78625j14864J9981N8312
10900d411K9491J49575q3014k26829J10094J88773K09294J07332l8373q9030j500
10889C51402n268K302n5054j22380p3236j37949j57203J10091P5176j5789J13389
10878H5481J38709K05118j10754l02720j36197J99760J71053J40795r9649k65982
10868B5614j11274n1951J43855J18902P8757K36673p2925O634j82854j00569J62232
$$ plain form
10857 253094 537885 672723 594743 512928 564457 409009 332645 535496 235196 -9299
10847 -9299 156307 139630 182535 257888 444064 397122 401935 470139 464940 429599 397420 445158
10835 445158 477594 447689 444584 304923 48251 86894 137552 281189 212947 219753 234801
10824 234801 79502 -80195 6655 78815 235316 371440 328591 252108 269442 80961
10814 80961 65300 261158 254514 6274 -136307 72343 276940 224017 5678 49659 331909
10803 331909 462120 421404 300194 208776 112455 54291 38563 267128 360957 215928 134719
10792 134719 214787 145310 20379 -161060 -106518 97986 -21735 -126709 129051 398307
10782 398307 222069 211119 201315 111195 229266 251818 396705 210864 281624 398083 385062
$$ packed form
10857B53094K84791J34838p7980q1815N1529j55448p6364K02851l00300k44495
10847i299J65606j6677M2905P5353J86176m6942M813O8204n199l5341l2179M7738
10835D45158L2436k9905l105j39661k56672L8643N0658J43637o8242O806J5048
10824B34801j55299j59697Q6850P2160J56501J36124m2849p6483J7334j88481
10814H0961j5661J95858o644k48240j42581K08650K04597n2923k18339M3981K82250
10803C31909J30211m0716j21210r1418r6321n8164j5728K28565R3829j45029q1209
10792A34719Q0068o9477j24931j81439N4542K04504j19721j04974K55760K69256
10782C98307j76238j0950r804r0120J18071K2552J44887j85841P0760J16459j3021
$$ plain form
10771 385062 435142 584524 475822 523657 341811 84971 -41391 170524 323799 408397
10761 408397 412905 313473 -44858 -21056 46039 75557 -59407 -266246 -231748 -199626 -134498
10750 -134498 -48475 -8545 135599 147857 109970 -18506 135158 132422 283216 314174 277954
10739 277954 470752 762359 743320 582971 215355 237029 279338 161758 127551 152104
10729 152104 -762 41541 136081 182207 220619 196063 362697 349605 273695 10620 -92663
10718 -92663 49907 244621 407304 336199 290450 368087 484226 637363 547511 644990 851705
10707 851705 473868 400775 608815 607620 698312 830166 771743 836731 1029685 1157109 948027
10696 948027 510205 260274 238236 206920 312900 419998 519969 468222 415624 474333 405417
$$ packed form
10771C85062N0080J49382j08702M7835j81846k56840j26362K11915J53275Q4598
10761D08397M508r9432l58331K3802O7095K9518j34964k06839L4498L2122O5128
10750a34498Q6023L9930J44144J2258l7887j28476J53664k736J50794L0958l6220
10739B77954J92798K91607j9039j60349l67616K1674M2309j17580l4207K4553
10729A52104j52866M2303R4540M6126L8412k4556J66634j3092p5910k63075j03283
10718i2663J42570J94714J62683p1105m5749P7637J16139J53137q9852R7479K06715
10707H51705l77837p3093K08040j195R0692J31854n8423O4988J92954J27424k09082
10696I48027m37822k49931k2038l1316J05980J07098R9971n1747n2598N8709o8916
$$ plain form
10685 405417 482907 375321 333572 502573 566371 652251 779827 795672 708603 695220 617576
10674 617576 504035 457481 530259 687914 725962 988661 1165005 1186640 1096935 1056106 1091823
10663 1091823 959818 831534 750061 937884 1473772 1966470 2144940 2101585 1807093 1417246
10653 1417246 1175694 1073843 967944 890199 626308 411014 426521 392083 320352 79394
10643 79394 -23113 246376 374389 419785 603708 583126 299982 306593 362225 511042 535052
10632 535052 573363 443486 287128 365085 644208 814966 665349 446576 536906 503466
10622 503466 564845 801156 648400 748826 1021150 1281659 1198505 1134861 1264061 1480111
10612 1480111 1531976 1402157 1178033 1202151 1070863 828730 619701 699616 747920 711678
$$ packed form
10685D05417P7490j07586m1749J69001O3798Q5880J27576J5845q7069j3383p7644
10674F17576j13541m6554P2778J57655L8048K62699J76344K1635q9705m0829L5717
10663A091823j32005j28284q1473J87823N35888M92698J78470m3355k94492l89847
10653A417246k41552j01851j05899p7745k63891k15294J5507l4438p1731k40958
10643G9394j02507K69489J28013M5396J83923k0582k83144O611N5632J48817K4010
10632E35052L8311j29877j56358P7957K79123J70758j49617k18773R0330l3440
10622E03466O1379K36311j52756J00426K72324K60509q3154o3644J29200K16050
10612A480111N1865j29819k24124K4118j31288k42133k09029P9915M8304l6242
$$ plain form
10602 711678 729512 690941 716142 531921 415806 539789 417313 367574 377766 466751 743351
10591 743351 808546 647027 704793 609303 417717 253383 334024 347654 154844 429263
10581 429263 610993 593939 464900 627538 650597 654312 649633 568759 440221 334933 518216
10570 518216 566685 643043 577653 609440 631750 700064 620243 513364 429312 413010 341162
10559 341162 357437 530525 765294 726076 762707 867909 843932 811164 845972 827580 871871
10548 871871 893333 937987 654050 464959 746851 844971 630477 579492 389479 333063
10538 333063 370570 277893 167327 214030 154127 204660 270059 174847 69096 -17022 144753
10527 144753 64106 387732 672858 596978 671872 895986 1089226 1244474 1104119 763855
$$ packed form
10602G11678J7834l8571K5201j84221j16115J23983j22476m9739J0192Q8985K76600
10591G43351O5195j61519N7766r5490j91586j64334Q0641J3630j92810K74419
10581D29263J81730j7054j29039J62638K3059L715m679q0874j28538j05288J83283
10570E18216M8469P6358o5390L1787K2310O8314p9821j06879q4052j6302p1848
10559C41162J6275J73088K34769l9218L6631J05202k3977l2768L4808j8392M4291
10548H71871K1462M4654k83937j89091K81892R8120k14494n0985j90013n6416
10538C33063L7507r2677j10566M6703n9903N0533O5399r5212j05751q6118J61775
10527A44753q0647L23626K85126p5880P4894K24114J93240J55248j40355l40264
$$ plain form
10517 763855 517124 527139 423388 298951 409140 476297 619731 820861 775546 613891
10507 613891 495970 603745 471649 401744 443531 651430 792070 962308 927309 815203
10497 815203 834615 824212 638762 680912 536525 252907 274224 255551 343031 336341 345015
10486 345015 394819 452757 570352 700514 459806 394862 312625 246005 89411 197958
10476 197958 320810 682688 622333 556682 769368 814491 802551 567111 613389 644818 516793
10465 516793 474089 463004 509206 508241 840511 923348 967208 951129 767006 915951 1163695
10454 1163695 1056933 1092048 1264633 1434390 1367679 1216282 1235348 1257171 1225418 1369876
10444 1369876 1505239 1645249 1639625 1387688 1098763 909517 728265 756348 869318 889465
$$ packed form
10517G63855k46731J0015j03751j24437J10189O7157J43434K01130m5315j61655
10507F13891j17921J07775j32096o9905M1787K07899J40640J70238l4999j12106
10497H15203J9412j0403j85450M2150j44387k83618K1317j8673Q7480o690Q674
10486C45015M9804N7938J17595J30162k40708o4944q2237o6620j56594J08547
10476A97958J22852L61878o0355o5651K12686M5123j1940k35440M6278L1429j28025
10465E16793m2704j1085M6202r65L32270Q2837M3860j6079j84123J48945K47744
10454A163695j06762L5115J72585J69757o6711j51397J9066K1823l1753J44458
10444A369876J35363J40010n624k51937k88925j89246j81252K8083J12970K0147
$$ plain form
10434 889465 841858 988273 1233313 1170954 1006055 857278 787154 891024 956099 1056297
10424 1056297 1228166 1252424 1133432 1160345 1201447 1047469 1101560 1175026 1331379 1405294
10414 1405294 1382596 1318236 1402673 1312721 1019889 889785 793120 653393 751999 710180 720805
10403 720805 1090806 1317811 1186540 1148132 1272793 1285437 1252383 991757 1038313 1245374
10393 1245374 1456842 1544881 1547430 1539898 1411604 1324498 1170318 1300455 1504247 1337808
10383 1337808 1041425 813849 864302 1051283 1016969 1078680 1065055 1229298 1611733 1664254
10373 1664254 1675345 1719159 1794498 1548985 1309583 1308096 1373704 1573158 1690486 1851755
10363 1851755 2076874 2161937 2323490 2328168 2283749 2041502 1758697 1766260 1827930 1699387 1475649
$$ packed form
10434H89465m7607J46415K45040o2359j64899j48777p0124J03870O5075J00198
10424A056297J71869K4258j18992K6913M1102j53978N4091P3466J56353P3915
10414A405294k2698o4360Q4437q9952k92832j30104r6665j39727R8606m1819J0625
10403G20805L70001K27005j31271l8408J24661J2644l3054k60626M6556K07061
10393A245374K11468Q8039K549p532j28294q7106j54180J30137K03792j66439
10383A337808k96383k27576N0453J86981l4314O1711j3625J64243L82435N2521
10373A664254J1091M3814P5339k45513k39402j487O5608J99454J17328J61269
10363A851755K25119Q5063J61553M678m4419k42247k82805P563O1670j28543k23738
$$ plain form
10352 1475649 1499719 1286875 1257324 1681239 1751005 1821910 1927586 1857975 1747153 1563551
10342 1563551 1589821 1559286 1514505 1450266 1064521 1012627 1228034 1317902 1434946 1531645 1501398
10331 1501398 1640240 1626894 1625422 1612326 1657729 1672197 1394473 1314251 1645223 1762111 1909854
10320 1909854 2191051 2489895 2782419 2691949 2392099 2335691 2151245 2170938 2232331 2042666
10310 2042666 2048986 2048008 1912792 1722135 1435313 1432252 1499824 1584995 1674270 1715431 1614718
10299 1614718 1534813 1515892 1434086 1386891 1416524 1522909 1513276 1427270 1378812 1512818 1451371
10288 1451371 1092273 1094467 1222352 1261743 1242451 1236571 1164341 1375965 1522823 1346972 1308341
10277 1308341 1415591 1627742 1508478 1430935 1422540 1423888 1405323 1391101 1412985 1536884 1649578
$$ packed form
10352A475649K4070k12844k9551M23915O9766P0905J05676o9611j10822j83602
10342A563551K6270l0535m4781o4239l85745n1894K15407Q9868J17044R6699l0247
10331A501398J38842j3346j472j3096M5403J4468k77724q0222L30972J16888J47743
10320A909854K81197K98844K92524r0470k99850n6408j84446J9693O1393j89665
10310B042666O320r78j35216j90657k86822l061O7572Q5171Q9275M1161j00713
10299A614718p9905j8921q1806m7195K9633J06385r633q6006m8458J34006o1447
10288A451371l59098K194J27885L9391j9292n880p2230K11624J46858j75851l8631
10277A308341J07250K12151j19264p7543q395J348j8565j4222K1884J23899J12694
$$ plain form
10266 1649578 1746367 1879304 1968306 1928037 1812565 1778418 1413759 1315175 1277481 1093534
10256 1093534 1167904 1166673 1228835 1198907 1078970 839088 1124164 1430411 1467577 1337906
10246 1337906 1221015 1166564 1254135 1443583 1823905 1962126 2094741 2140899 2051939 1832884
10236 1832884 1741839 1555005 1278666 1282083 1452793 1575205 1622932 1726839 1898322 1926743
10226 1926743 1640180 1325696 1315625 1136361 1331111 1342942 1501320 1550738 1568665 1451057
10216 1451057 1253850 1370213 1336485 1143923 1131460 1294715 1524026 1637404 1833861 1905507
10206 1905507 1933485 1680431 1501335 1334481 1218056 1400285 1567348 1763327 1850522 1974826
10196 1974826 2081724 2166199 2032557 1741646 1637191 1431041 1282726 1357494 1342780 1196873
$$ packed form
10266A649578R6789J32937Q9002m0269j15472l4147l64659r8584l7694j83947
10256A093534P4370j231O2162k9928j19937k39882K85076L06247L7166j29671
10246A337906j16891n4451Q7571J89448L80322J38221J32615M6158q8960k19055
10236A832884r1045j86834k76339L417J70710J22412M7727J03907J71483K8421
10226A926743k86563l14484j0071j79264J94750J1831J58378M9418J7927j17608
10216A451057j97207J16363l3728j92562j2463J63255K29311J13378J96457P1646
10206A905507K7978k53054j79096j66854j16425J82229J67063J95979Q7195J24304
10196A974826J06898Q4475j33642k90911j04455k06150j48315P4768j4714j45907
$$ plain form
10186 1196873 1088858 1002760 1017591 1055807 1198130 1341069 1253203 1346701 1569798 1468491
10176 1468491 1264084 1643287 1786506 1687099 1564091 1435827 1469846 1558536 1672587 1918875
10166 1918875 1988321 2037645 2115342 2348743 2322121 2316128 2360962 2331275 2106422 2121605 2381059
10155 2381059 2681485 2739875 2590473 2265536 2332989 2290608 2179266 1973386 1904120 2006362
10145 2006362 1915364 1879741 2060482 2238098 2368016 2273591 2038570 1746647 1706473 1883834
10135 1883834 1883349 2094573 2099167 1926523 1861096 1646591 1631737 1904390 2174679 2085605 1930818
10124 1930818 2040247 2269000 2487890 2679853 2893660 3203539 3266494 3340601 3122664 2984085
10114 2984085 3061061 3169015 3180314 3198218 3387976 3662652 3899571 3859726 3799848 3609772
$$ packed form
10186A196873j08015q6098J4831L8216J42323J42939q7866R3498K23097j01307
10176A468491k04407L79203J43219r9407j23008j28264L4019Q8690J14051K46288
10166A918875O9446M9324P7697K33401k6622n993M4834k9687k24853J5183K59454
10155B381059L00426N8390j49402l24937O7453m2381j11342k05880o9266J02242
10145B006362r0998l5623J80741J77616J29918r4425k35021k91923m0174J77361
10135A883834m85K11224M594j72644o5427k14505j4854K72653K70289q9074j54787
10124A930818J09429K28753K18890J91963K13807L09879O2955P4107k17937j38579
10114B984085P6976J07954J1299J7904J89758K74676K36919l9845n9878j90076
$$ plain form
10104 3609772 3649819 3688656 3481762 3317999 3554278 3801335 3903648 4063242 4201520 4118197
10094 4118197 4149308 4122113 4291040 4491535 4692430 4798518 4777314 4795275 4898533 4976839
10084 4976839 4811921 4901938 5065262 5308644 5263945 5212558 5181786 5098691 5404643 5633187
10074 5633187 5949620 6384980 7054192 7702043 8027354 8349862 8788260 9234578 10118935
10065 10118935 11489971 13217893 15165957 17671775 20729508 24270503 27782138 30383796
10057 30383796 32483174 34786425 37015939 38880569 41129181 43438465 44490081 43583322
10049 43583322 41682077 40022320 38899047 38422028 38712043 40582216 44034458 49193614
10041 49193614 55868043 62564555 67212257 69794597 70944204 72815436 77358004 83439662
$$ packed form
10104C609772M0047L8837k06894j63763K36279K47057J02313J59594J38278q3323
10094D118197L1111k7195J68927K00495K00895J06088k1204J7961J03258P8306
10084D976839j64918R0017J63324K43382m4699n1387l0772q3095L05952K28544
10074E633187L16433M35360O69212O47851L25311L22508M38398M46318Q84357
10065A0118935J371036J727922J948064K505818L057733L540995L511635K601658
10057C0383796K099378K303251K229514J864630K248612K309284J051616r06759
10049D3583322j901245j659757j123273m77019K90015J870173L452242N159156
10041D9193614O674429O696512M647702K582340J149607J871232M542568O081658
$$ plain form
10033 83439662 88351919 90165454 89142903 86218045 81952428 78298265 77382033 79089813
10025 79089813 82390206 86119139 89612714 93326203 98298302 103219419 104707565 101507366
10017 101507366 95730585 89344779 85506439 85390980 88733930 93084099 94928126 94156344
10009 94156344 91618246 86976423 81445572 77584008 75366375 73538533 72631111 73587263
10001 73587263 77168439 81176585 84221319 86727633 88310304 88537330 88499783 88168219 86415322
9992 86415322 83642109 82173719 82416335 83669303 85121528 85655634 85719595 87069048 88966493
9983 88966493 90580022 91570886 92555027 94421595 95898747 96838891 98312439 98397177 95902341
9974 95902341 93578103 91258395 87691244 84151024 81556612 80269840 81311162 85419332
$$ packed form
10033H3439662M912257J813535j022551k924858m265617l654163r16232J707780
10025G9089813L300393L728933L493575L713489M972099M921117J488146l200199
10017A01507366n776781o385806l838340j15459L342950M350169J844027p71782
10009I4156344k538098m641823n530851l861564k217633j827842r07422R56152
10001G3587263L581176M008146L044734K506314J582671K27026l7547l31564j752897
9992H6415322k773213j468390K42616J252968J452225N34106O3961J349453J897445
9983H8966493J613529R90864R84141J866568J477152R40144J473548Q4738k494836
9974I5902341k324238k319708l567151l540220k594412j286772J041322M108170
$$ plain form
9966 85419332 91203007 96009824 98215549 97661521 95934733 94260724 93969412 95742488
9958 95742488 99394093 104795013 112511911 122360007 135061580 150317157 162980481 169501093
9950 169501093 170181503 165604748 160453793 157807754 154348641 148429568 139739612 127064879
9942 127064879 113431750 102699520 94893601 90579505 89609386 91049270 94322608 99800165
9934 99800165 107894128 119431509 134416056 151224508 167052642 179104248 186668832
9927 186668832 189288997 186876483 181177667 172573379 163040221 153382460 144714865 138901295
9919 138901295 133628451 125727834 116444059 106573575 97277168 90763801 87868649 86990452
9911 86990452 87308268 87235234 85285128 82280751 79043670 75457855 72931501 71744780 70977135
$$ packed form
9966H5419332N783675M806817K205725n54028j726788j674009k91312J773076
9958I5742488L651605N400920P716898R848096J2701573J5255577J2663324O520612
9950A69501093O80410m576755n150955k646039l459113n919073q689956j2674733
9942A27064879j3633129j0732230p805919m314096r70119J439884L273338N477557
9934I9800165Q093963J1537381J4984547J6808452J5828134J2051606P564584
9927A86668832K620165k412514n698816q604288r533158r657761q667595n813570
9919A38901295n272844p900617r283775r870484r296407o513367k895152q78197
9911H6990452L17816p3034j950106l004377l237081l585815k526354j186721p67645
$$ plain form
9902 70977135 69921418 68052898 65685699 63224227 59677412 54854890 50756572 47549147
9894 47549147 45199735 43319504 41961741 40932341 39623810 38214187 37111311 36215732
9886 36215732 35477361 34885422 34225732 34060766 34077916 34078593 34292778 34540470 34862660 35181466
9876 35181466 35297423 35234700 35104920 34837203 34440792 34037987 33479872 32649870 31850174 31451633
9866 31451633 31133376 30945016 30859856 30433094 29969228 29955494 30212416 30305489 30216870 29501387
9856 29501387 28002285 26226844 24821611 23521605 22188143 21320637 20718438 20249509 19710556
9847 19710556 19220551 18969687 18670649 18402249 18404225 18348935 18073478 17868186 17469661 16828995
9837 16828995 16440483 15935129 15721073 15606045 15306464 14971562 14718358 14155831 13836794
$$ packed form
9902G0977135j055717j868520k367199k461472l546815m822522m098318l207425
9894D7549147k349412j880231j357763j029400j308531j409623j102876q95579
9886C6215732p38371n91939o59690j64966J7150O77K14185K47692L22190L18806
9876C5181466J15957o2723j29780k67717l96411m02805n58115q30002p99696l98541
9866C1451633l18257j88360q5160m26762m63866j3734K56922R3073q8619p15483
9856B9501387j499102j775441j405233j300006j333462q67506o02199m68929n38953
9847A9710556m90005k50864k99038k68400J976n5290k75457k05292l98525o40666
9837A6828995l88512n05354k14056j15028k99581l34902k53204n62527l19037
$$ plain form
9828 13836794 13572418 13429401 13096581 12668195 12298312 11937379 11676844 11389378 11165871
9819 11165871 10890971 11022160 10946995 10801878 10890960 11074140 10859762 10591129 10629738 10632291
9809 10632291 10580962 10570417 10278836 10191436 10029298 9894436 10036719 10014386 9999589 9981224
9799 9981224 10066033 10088133 9924346 9575288 9488796 9366315 9288309 9231266 9317139 9722845 9941783
9788 9941783 10117231 10155686 9849125 9902275 9906457 9870577 9637164 9488767 9391334 9186788 9033111
9777 9033111 9057887 9021361 9006697 8720730 8369620 8256811 8221274 8062430 8173601 8192091
9767 8192091 8228878 8208903 8147538 8189564 8500821 8564058 8568360 8566541 8844629 8941795 9018581
9756 9018581 9044867 9138762 9308375 9773765 10239358 10838169 11309932 11634189 11631020 11682760
$$ packed form
9828A3836794k64376j43017l32820m28386l69883l60933k60535k87466k23507
9819A1165871k74900J31189p5165j45117Q9082J83180k14378k68633L8609K553
9809A0632291n1329j0545k91581q7400j62138j34862J42283k2333j4797j8365
9799I981224Q4809K2100j63787l49058q6492j22481p8006n7043Q5873M05706K18938
9788I941783J75448L8455l06561N3150M182l5880k33413j48397r7433k04546j53677
9777I033111K4776l6526j4664k85967l51110j12809l5537j58844J11171J8490
9767H192091L6787j9975o1365M2026L11257O3237M302j819K78088R7166P6786
9756I018581K6286R3895J69613M65390M65593N98811M71763L24257l169N1740
$$ plain form
9746 11682760 11596016 11185017 10828732 10698283 10624029 10619176 10797948 10981799 11438886 12023975
9736 12023975 12711992 13443652 14520335 15469873 16162496 16146509 15320996 14481605 13773227
9727 13773227 12924754 12383394 12167426 12289343 12296377 12386947 12704488 13163905 13758132 14200343
9717 14200343 14324240 14700837 14746335 14564083 14252587 13953437 14082044 14070966 14317932 14734631
9707 14734631 15246361 16042148 16952401 17758162 18290016 19135430 20241003 22066713 24577496
9698 24577496 27023972 28901791 29909459 30336216 30780837 31569670 32485194 33178095 33292769
9689 33292769 33275658 33452127 33702559 33611363 32887519 32002384 31555368 31435311 31793668 33118319
9679 33118319 34950229 36606634 37840603 38356490 38361550 38180921 38369497 39056640 40402041
$$ packed form
9746A1682760q6744m10999l56285j30449p4254m853J78772J83851M57087N85089
9736A2023975O88017P31660J076683R49538O92623j5987q25513q39391p08378
9727A3773227q48473n41360k15968J21917P034R0570L17541M59417N94227M42211
9717A4200343J23897L76597M5498j82252l11496k99150J28607j1078K46966M16699
9707A4734631N11730P95787R10253Q05761N31854Q45414J105573J825710K510783
9698B4577496K446476J877819J007668M26757M44621P88833R15524O92901J14674
9689C3292769j7111J76469K50432r1196p23844q85135m47016j20057L58357J324651
9679C3118319J831910J656405J233969N15887N060j80629J88576O87143J345401
$$ plain form
9670 40402041 43351453 47972158 53533622 59268560 64763735 69108461 71672220 72870217
9662 72870217 72463466 71577594 71795577 73063312 73888835 74330580 74351734 73317369 71660958
9653 71660958 69309340 66245496 63909009 63966402 66680282 70760457 75064504 78141065
9645 78141065 80134694 80991643 79658344 77097523 75068242 75753198 79947119 87401902
9637 87401902 97848231 108875378 119215865 127175355 130042619 129417976 128290201 128400897
9629 128400897 131958606 138627463 146283228 152062485 152975966 148485725 141402125 133368227
9621 133368227 126190401 123146172 124189674 127736354 130998098 132599933 131915738 128979733
9613 128979733 124223191 119467694 115362494 112682574 112516370 114973253 119632871 126322049
$$ packed form
9670D0402041K949412M620705N561464N734938N495175M344726K563759J197997
9662G2870217m06751q85872K17983J267735Q25523M41745K1154j034365j656411
9653G1660958k351618l063844k336487N7393K713880M080175M304047L076561
9645G8141065J993629Q56949j333299k560821k029281O84956M193921P454783
9637H7401902J0446329J1027147J0340487P959490K867264o24643j127775J10696
9629A28400897L557709O668857P655765N779257R13481m490241p083600q033898
9621A33368227p177826l044229J043502L546680L261744J601835o84195k936005
9613A28979733m756542m755497m105200k679920j66204K456883M659618O689178
$$ plain form
9605 126322049 133905934 140604749 145094517 145792798 143532498 139680802 136059193 135313675
9597 135313675 137768133 142065300 146043460 147692704 146330635 141497857 133854113 125266893
9589 125266893 117598206 111772449 108110837 107169628 109419808 113675095 117904204 120164989
9581 120164989 120495977 120377239 119998195 120226832 121449419 123811603 126438250 127106646 125233013
9572 125233013 120551710 113954489 106795665 100717229 96665140 95420126 95512781 95668647
9564 95668647 95484764 94437700 92681579 90078960 87156070 84968502 83806983 83744594 85113154
9555 85113154 88396051 93404581 98968138 103893009 106202176 104562251 100042691 95197006
9547 95197006 92253791 92426889 94921706 97827565 99414329 98411856 95533972 91761874
$$ packed form
9605A26322049P583885O698815M489768O98281k260300l851696l621609p45518
9597A35313675K454458M297167L978160J649244j362069m832778p643744q587220
9589A25266893p668687n825757l661612r41209K250180M255287M229109K260785
9581A20164989L30988j18738l79044K28637J222587K362184K626647O68396j873633
9572A25233013m681303o597221p158824o078436m052089j245014R2655J55866
9564I5668647j83883j047064j756121k602619k922890k187568j161519o2389J368560
9555H5113154L282897N008530N563557M924871K309167j639925m519560m845685
9547I5197006k943215J73098K494817K905859J586764j002473k877884l772098
$$ plain form
9539 91761874 88326201 86222281 84657913 82951841 80033672 75982580 72503672 69673365
9531 69673365 67129045 65474426 64165870 62793605 61858569 61279821 61333297 61950061 63188925
9522 63188925 65095118 67272471 69788453 72908744 77062670 83039091 91800572 102653654
9514 102653654 112670187 117051757 112478027 102345607 93780807 89787714 89209213 89500181
9506 89500181 88433974 86182535 83790752 82398400 82269753 82328847 81579238 79504118 75994078
9497 75994078 72643532 70162094 69079381 69644932 71135038 72427597 71950788 68879135
9489 68879135 64441714 60370265 57223208 55615295 55502192 56215942 56839023 56057501 54014234
9480 54014234 51828470 50343036 49610449 49466460 49777315 49616357 49353715 49889060 51488459
$$ packed form
9539I1761874l435673k103920j564368j706072k918169m051092l478908k830307
9531F9673365k544320j654619j308556j372265r35036n78748N3476O16764J238864
9522F3188925J906193K177353K515982L120291M153926N976421Q761481J0853082
9514A02653654J0016533M381570m573730j0132420q564800l993093n78501K90968
9506H9500181j066207k251439k391783j392352j28647N9094p49609k075120l510040
9497G5994078l350546k481438j082713N65551J490106J292559m76809l071653
9489F8879135m437421m071449l147057j607913j13103P13750O23081p81522k043267
9480E4014234k185764j485434p32587j43989L10855j60958k62642N35345J599399
$$ plain form
9471 51488459 54436971 57763574 61372844 64908897 67129671 67530411 66813717 66700374 68288069
9462 68288069 72013216 78033969 85357608 93278432 102280761 111323212 119815338 125624399
9454 125624399 125478770 122392052 121420694 119760254 115140656 110632248 105014049 97341386
9446 97341386 90698625 86320267 83087389 81163252 81420737 84952051 91618082 101022951
9438 101022951 112114173 123407462 132632555 135827741 129481798 115223224 101492810
9431 101492810 92363206 87075035 85900235 88677254 92962944 95991964 94322522 86318384
9423 86318384 76386875 69339188 65932802 65386546 66732863 68469631 70049155 71071991
9415 71071991 71602245 72258613 73526565 74602564 74193146 72964730 71677408 71056706 71642873
$$ packed form
9471E1488459K948512L326603L609270L536053K220774M00740p16694j13343J587695
9462F8288069L725147O020753P323639P920824R002329R042451Q492126N809061
9454A25624399j45629l086718r71358j660440m619598m508408n618199p672663
9446I7341386o642761m378358l232878j924137K57485L531314O666031R404869
9438A01022951J1091222J1293289R225093L195186o345943j4258574j3730414
9431A01492810r129604n288171j174800K777019M285690L029020j669442q004138
9423H6318384r931509p047687l406386n46256J346317J736768J579524J022836
9415G1071991N30254O56368J267952J075999m09418j228416j287322o20702N86167
$$ plain form
9406 71642873 72948635 74299507 75363201 76961753 79720063 82711817 85075259 86127585
9398 86127585 86118598 85919523 87135438 90738500 97044980 105452020 114047047 120850411 122323739
9389 122323739 119646475 115516234 107599608 98692626 93652149 92414941 92976581 93191962
9381 93191962 93489704 95785579 101334195 109449011 117584016 122557442 122140202 118717955
9373 118717955 115425742 113291611 112916702 114557822 117087865 119818703 122924061 124243650
9365 124243650 118545496 105248985 92697753 85978877 84347923 85672094 88031454 90012566
9357 90012566 91330176 91655110 91196806 90303086 88446375 86339811 84991809 84329361 84896480
9348 84896480 87584380 91939985 95601982 96870984 94917028 88246739 79129197 72409613
$$ packed form
9406G1642873J305762J350872J063694J598552K758310K991754K363442J052326
9398H6127585q987j99075J215915L603062O306480Q407040Q595027O803364J473328
9389A22323739k677264m130241p916626q906982n040477j237208N61640K15381
9381I3191962K97742K295875N548616Q114816Q135005M973426m17240l422247
9373A18717955l292213k134131l74909J641120K530043K730838L105358J319589
9365A24243650n698154j3296511j2551232o718876j630954J324171K359360J981112
9357I0012566J317610L24934m58304q93720j856711k106564j348002o62448N67119
9348H4896480K687900M355605L661997J269002j953956o670289r117542o719584
$$ plain form
9340 72409613 69423001 68890603 69419843 70027466 69959058 69759200 69922475 71038053 72822773
9331 72822773 75023669 77638586 80533686 84510932 88927143 91762889 91886999 89949825
9323 89949825 86993467 83959255 81498174 80758469 82242864 85410247 90224287 97293910
9315 97293910 106620288 117465223 127197117 133999261 138240237 139982665 140253431 140392376
9307 140392376 137820440 129997286 116420383 100854011 89451586 83485725 81234318 81321926
9299 81321926 83320733 87162762 92098102 96198604 97283731 95622779 93914014 94011937
9291 94011937 97281878 103641556 111079737 116792827 119230258 118241961 115996023 115092428
9283 115092428 114188372 113855586 115953166 120916300 127091756 133902986 141944826 149916843
$$ packed form
9340G2409613k986612n32398N29240O07623o8408j99858J63275J115578J784720
9331G2822773K200896K614917K895100L977246M416211K835746J24110j937174
9323H9949825k956358l034212k461081p39705J484395L167383M814040P069623
9315I7293910R326378J0844935R731894O802144M240976J742428K70766J38945
9307A40392376k571936p823154j3576903j5566372j1402425n965861k251407Q7608
9299H1321926J998807L842029M935340M100502J085127j660952j708765R7923
9291I4011937L269941O359678P438181N713090K437431r88297k245938r03595
9283A15092428r04056l32786K097580M963134O175456O811230Q041840P972017
$$ plain form
9275 149916843 155919969 157848277 153480584 143671860 133729009 127071229 123358556 121600968
9267 121600968 122420975 125836347 130160654 135215757 141945844 150876077 161721489 173407197
9259 173407197 182112628 184882714 182500260 177981866 171614091 163270988 154745769 148115064
9251 148115064 142945261 137981705 135507989 136824532 139513664 140738049 140374901 138172190
9243 138172190 135203466 131720689 126231002 119251420 113033646 109609244 109053709 110254086
9235 110254086 111552237 111357685 109894396 109406858 110922448 112364571 112556064 110868524
9227 110868524 108086624 106628593 107045639 109321201 113872203 120063483 127087874 135390000
9219 135390000 145266903 156616867 168030943 176647472 179944380 178817835 175612284 173612909
$$ packed form
9275A49916843O003126J928308m367693r808724r942851o657780l712673j757588
9267A21600968Q20007L415372M324307N055103O730087Q930233J0845412J1685708
9259A73407197Q705431K770086k382454m518394o367775q343103q525219o630705
9251A48115064n169803m963556k473716J316543K689132J224385l63148k202711
9243A38172190k968724l482777n489687o979582o217774l424402n55535J200377
9235A10254086J298151j94552j463289m87538J515590J442123J91493j687540
9227A10868524k781900j458031M17046K275562M551002O191280P024391Q302126
9219A35390000R876903J1349964J1414076Q616529L296908j126545l205551j999375
$$ plain form
9211 173612909 176660405 186181151 200455390 213994312 221905439 223599172 223110372 226821360
9203 226821360 235153171 245120374 256271630 265308187 269067774 268800339 263089494 252504430
9195 252504430 244813877 243981621 248622995 255201178 258821093 255520050 248519583 245902826
9187 245902826 250256742 258992891 268636397 276678393 285778407 299294412 316855993 335442683
9179 335442683 348390140 347891540 340310943 334272806 332946196 337222055 341717136 342371332
9171 342371332 338512610 330439140 325699195 329473149 338143786 346428224 351340390 353474183
9163 353474183 354379561 354869768 357124737 361553858 366245036 368376865 369219267 374931033
9155 374931033 388883060 410191774 436569786 461259546 470411035 461461117 445183671
$$ packed form
9211A73612909L047496R520746J4274239J3538922P911127J693733m88800L710988
9203B26821360Q331811R967203J1151256R036557L759587k67435n710845j0585064
9195B52504430p690553q32256M641374O578183L619915l301043p000467k616757
9187B45902826M353916Q736149R643506Q041996R100014J3516005J7561581J8586690
9179C35442683J2947457m98600p580597o038137j326610M275859M495081O54196
9171C42371332l858722q073470m739945L773954Q670637Q284438M912166K133793
9163C53474183R05378M90207K254969M429121M691178K131829Q42402N711766
9155C74931033J3952027K1308714K6378012K4689760R151489q949918j6277446
$$ plain form
9148 445183671 426652591 409079620 397264171 392006231 392709756 391178025 382542693 370611278
9140 370611278 356694035 341253969 330946194 328896739 330060225 328671569 322541706 315519008
9132 315519008 310615660 309993222 314862463 324398979 334900246 339488149 330560191 308374649
9124 308374649 283353165 263357279 250111193 242823559 238340804 234119469 230730748 228855910
9116 228855910 229446438 233292189 238068242 240392286 238342664 233167083 225122305 214520455
9108 214520455 204198238 197216107 192965270 190083092 188993708 189733050 191327089 192186692
9100 192186692 191418601 188803516 185510419 182030382 178167495 175474763 174430501 173293950
9092 173293950 172056876 171341460 171561152 172755728 175074103 178831069 183695906 187687435
$$ packed form
9148D45183671j8531080j7572971j1815449n257940P03525j531731q635332j1931415
9140C70611278j3917243j5440066j0307775k049455J163486j388656o129863p022698
9132C15519008m903348o22438M869241R536516J0501267M587903q927958k2185542
9124C08374649k5021484j9995886j3246086p287634m482755m221335l388721j874838
9116B28855910N90528L845751M776053K324044k049622n175581q044778j0601850
9108B14520455j0322217o982131m250837k882178j089384P39342J594039Q59603
9100A92186692p68091k615085l293097l480037l862887k692732j044262j136551
9092A73293950j237074p15416K19692J194576K318375L756966M864837L991529
$$ plain form
9084 187687435 187109714 180376202 169863800 159922968 154280544 152090257 151277009 150958605
9076 150958605 149465014 145679865 141172377 137931998 136650397 136066268 134813572 131462965
9068 131462965 125210122 117080421 110093795 104794893 100835568 98134090 95741607 93237367
9060 93237367 91209912 89809587 88652078 86826457 85323561 85328182 85430636 85360117 85014047
9051 85014047 83364718 81580842 80668415 80447214 79607705 77212511 73647456 69461830 65913167
9042 65913167 63490986 61777116 60463582 59523653 58575412 57536119 56687271 56047083 55606568
9033 55606568 54905248 54012821 53266562 52426791 51728079 51101052 50543517 50255736 49793822
9024 49793822 49354964 48866862 47686332 46089491 44294238 42437646 40802251 39476715
$$ packed form
9084A87687435n77721o733512j0512402r940832n642424k190287q13248l18404
9076A50958605j493591l785149m507488l240379j281601n84129j252696l350607
9068A31462965o252843q129701o986626n298902l959325k701478k392483k504240
9060I3237367k027455j400325j157509j825621j502896M621J02454p0519l46070
9051H5014047j649329j783876r12427k21201q39509k395194l565055m185626l548663
9042F5913167k422181j713870j313534r39929r48241j039293q48848o40188m40515
9033E5606568p01320q92427p46259q39771o98712o27027n57535k87781m61914
9024D9793822m38858m88102j180530j596841j795253j856592j635395j325536
$$ plain form
9016 39476715 37999069 36889851 35940791 34849306 34124907 33661536 33150038 32434358 31523263
9007 31523263 30710843 30126562 29762820 29443418 29160802 28878802 28529087 28165746 27633806
8998 27633806 26826374 26073330 25756093 25778312 25496298 24860437 24308560 23603457 22990070 22451024
8988 22451024 22136701 21732721 21319981 20906256 20510211 20052295 19571842 19212635 18897161
8979 18897161 18493812 18292421 18182118 18173953 17978319 17719090 17470346 16964231 16281370 15756127
8969 15756127 15113331 14822878 14561796 14258094 14194164 13895256 13722619 13381503 13303411 13353612
8959 13353612 13249037 12854904 12585981 12198255 11961100 12113011 12249493 11864912 11346311
8950 11346311 11045169 10734379 10658811 10373320 9817107 9352631 9097215 8932764 8890019 8860879
$$ packed form
9016C9476715j477646j109218r49060j091485p24399m63371n11498p15680r11095
9007C1523263q12420n84281l63742l19402k82616k82000l49715l63341n31940
8998B7633806q07432p53044l17237K2219k82014o35861n51877p05103o13387n39046
8988B2451024l14323m03980m12740m13725l96045m57916m80453l59207l15474
8979A8897161m03349k01391j10303q165j95634k59229k48744n06115o82861n25243
8969A5756127o42796k90453k61082l03702o3930k98908j72637l41116p8092N0201
8959A3353612j04575l94133k68923l87726k37155J51911J36482l84581n18601
8950A1346311l01142l10790p5568k85491n56213m64476k55416j64451m2745k9140
$$ plain form
8940 8860879 8649381 8301827 7930052 7786572 7735602 7572872 7478413 7548427 7680365 7533604
8930 7533604 7218202 7313627 7422941 7563142 7661130 7318683 7031168 6862678 6538491 6303581
8920 6303581 6084041 5981536 5823200 5616011 5597296 5747273 5708079 5719070 6009989 6067243
8910 6067243 5976964 5870834 5902147 5694651 5705420 5870130 5775297 5793418 5783128 6119544 6265065
8899 6265065 6303707 6300305 6341271 6152367 5863176 5512201 5521199 5684732 5563568 5192103 5038218
8888 5038218 4737207 4694919 4854893 4739766 4872050 5016256 4738197 4448681 4294052 4434154
8878 4434154 4570745 4467181 4595630 4850517 4861034 4826126 4948073 5100464 4728281 4368400
8868 4368400 4127954 4051580 3930922 4010401 4028631 4089883 4182268 4281821 4133756 3886650 3906669
$$ packed form
8940H860879k11498l47554l71775j43480n0970j62730r4459P0014J31938j46761
8930G533604l15402R5425J09314J40201R7988l42447k87515j68490l24187k34910
8920F303581k19540j02505j58336k07189j8715J49977l9194J0991K90919N7254
8910F067243r0279j06130L1313k07496J0769J64710r4833J8121j0290L36416J45521
8899F265065L8642l402M0966j88904k89191l50975Q998J63533j21164l71465j53885
8888E038218l01011m2288J59974j15127J32284J44206k78059k89516j54629J40102
8878D434154J36591j03564J28449K54887J0517l4908J21947J52391l72183l59881
8868D368400k40446p6374j20658P9479J8230O1252R2385R9553j48065k47106K0019
$$ plain form
8857 3906669 3847165 3905006 4011940 4045411 4026481 4019063 3961039 3941453 3840898 3981818 4064185
8846 4064185 4148436 4210686 4150694 4211595 4168757 4100771 3937431 3847463 4049149 4247812 4086440
8835 4086440 4012680 4028667 4029314 3964053 4094985 4385231 4483904 4328168 4204122 4368227 4364440
8824 4364440 4364002 4393664 4403357 4640521 4540587 4438570 4475890 4358691 4210781 4168017 4019847
8813 4019847 4010686 3752722 3517106 3571417 3637787 3738454 3623709 3769329 3859832 4094414
8803 4094414 4144046 4031935 3546711 3379481 3310169 3422361 3576253 3497229 3473868 3584869
8793 3584869 3502994 3557998 3747889 3679784 3741308 3855605 3950480 3957852 4078489 4444610 4529307
8782 4529307 4337758 4189668 4081073 3865859 3650167 3616323 3511105 3706139 3849048 3629392
$$ packed form
8857C906669n9504N7841J06934L3471j8930p418n8024j9586j00555J40920Q2367
8846D064185Q4251O2250n9992O0901m2838o7986j63340q9968K01686J98663j61372
8835D086440p3760J5987O47o5261J30932K90246R8673j55736j24046J64105l787
8824D364440m38K9662R693K37164r9934j02017L7320j17199j47910m2764j48170
8813D019847r161k57964k35616N4311O6370J00667j14745J45620R0503K34582
8803D094414M9632j12111m85224j67230o9312J12192J53892p9024k3361J11001
8793C584869q1875N5004J89891o8105O1524J14297R4875P372J20637L66121Q4697
8782D529307j91549j48090j08595k15214k15692l3844j05218J95034J42909k19656
$$ plain form
8772 3629392 3603877 3725545 3794925 3622211 3616440 4062206 4244653 4221629 4214729 4327880 4821733
8761 4821733 5171591 5740927 6458194 6963312 7154901 6995817 6605912 6071157 5414147 5060215
8751 5060215 4944532 4730087 4522506 4399617 4084245 3859209 3737609 3686002 3779659 3925476
8741 3925476 3977488 4096972 4274078 4557912 4793188 5006396 5285785 5379236 5348713 5565448
8731 5565448 5702404 5748000 5752524 5863771 5705427 5362494 5178064 4965286 4789927 4805232
8721 4805232 4952351 5096735 4996015 4830532 4382873 4050793 3840318 3747908 3549368 3343369
8711 3343369 3318994 3541901 3793985 3876672 4161023 4507259 4580538 4683104 4664613 4524879
8701 4524879 4365119 4422373 4474698 4277200 4210055 4381048 4253334 4083733 3942910 3921780
$$ packed form
8772C629392k5515J21668O9380j72714n771M45766J82447k3024o900J13151M93853
8761D821733L49858N69336P17267N05118J91589j59084l89905n34755o57010l53932
8751E060215j15683k14445k07581j22889l15372k25036j21600n1607R3657J45817
8741C925476N2012J19484J77106K83834K35276K13208K79389R3451l0523K16735
8731E565448J36956M5596M524J11247j58344l42933j84430k12778j75359J5305
8721D805232J47119J44384j00720j65483m47659l32080k10475r2410j98540k05999
8711C343369k4375K22907K52084Q2687K84351L46236P3279J02566j8491j39734
8701D524879j59760N7254N2325j97498o7145J70993j27714j69601j40823k1130
$$ plain form
8691 3921780 4032424 4025417 4033535 4248973 4382278 4193631 4053684 3849405 3666394 3650764
8681 3650764 3594916 3724369 3933411 3921997 3840160 3949610 3936098 3864399 3766290 3723716 3637454
8670 3637454 3341210 3245529 3425028 3423365 3619017 3649530 3615964 3522578 3974849 4585036 4817511
8659 4817511 4900841 4703837 4323362 3844702 3493852 3322242 3262490 3225222 3392536 3315006
8649 3315006 3216632 3331863 3722246 3986027 4477200 4970031 5198476 4891715 4092469 3584367
8639 3584367 3288171 3124596 2979502 2837180 2927957 3026023 2979245 2842377 2665536 2674691
8629 2674691 2798187 2676452 2670266 2767720 3076074 3539771 4022991 4315662 4691546 4719127
8619 4719127 4128950 3579474 3165051 2850764 2702836 2521605 2293559 2285868 2263359 2552163
$$ packed form
8691C921780J10644p007Q118K15438J33305j88647j39947k04279j83011j5630
8681C650764n5848J29453K09042j1414q1837J09450j3512p1699r8109m2574q6262
8670C637454k96244r5681J79499j663J95652L0513l3566r3386M52271O10187K32475
8659D817511Q3330j97004l80475m78660l50850j71610n9752l7268J67314p7530
8649C315006r8374J15231L90383K63781M91173M92831K28445l06761p99246n08102
8639C584367k96196j63575j45094j42322R0777R8066m6778j36868j76841R155
8629B674691J23496j21735o186R7454L08354M63697M83220K92671L75884K7581
8619D719127n90177n49476m14423l14287j47928j81231k28046p691k2509K88804
$$ plain form
8609 2552163 2772346 2785330 2781265 2832459 2808061 2635178 2680542 2545542 2819095 2988077 2892421
8598 2892421 2999054 3082837 3379369 3383936 2945045 2717403 2330002 2211639 2391127 2342984
8588 2342984 2238048 2271333 2172425 2025781 2127011 2140548 2041957 2006508 2075884 1853637 1764054
8577 1764054 1819335 2031307 2024892 1763631 1441407 1425405 1384319 1243445 1369299 1349837 1128567
8566 1128567 1145662 1127194 1006945 1048647 997457 917367 820650 908340 1019258 1085881 1319773
8555 1319773 1217412 988816 889814 956564 1195720 1240977 1067043 931487 978890 906692
8545 906692 685846 636747 935712 932694 967234 844812 817226 929519 917820 1008414 797787
8534 797787 794907 805217 640217 453787 514362 645420 750161 642487 579926 694401 573378
$$ packed form
8609B552163K20183J2984m065N1194k4398j72883M5364j35000K73553J68982r5656
8598B892421J06633Q3783K96532M567m38891k27642l87401j18363J79488m8143
8588B342984j04936L3285r8908j46644J01230J3537r8591l5449O9376k22247q9583
8577A764054N5281K11972o415k61261l22224j6002m1086j40874J25854j9462k21270
8566A128567J7095j8468j20249M1702n1190q0090r6717Q7690J10918O6623K33892
8555A319773j02361k28596r9002O6750K39156M5257j73934j35556M7403p2198
8545I06692k20846m9099K98965l018L4540j22422k7586J12293j1699R0594k10627
8534G97787k880J0310j65000j86430O0575J31058J04741j07674o2561J14475j21023
$$ plain form
8523 573378 702511 603201 428673 633656 710706 650816 654922 512381 415770 562914 752962
8512 752962 411980 331939 507997 492742 647429 576449 565024 389590 365005 553513 746070
8501 746070 646832 557198 601072 679816 537846 569487 516847 472761 605249 504645 595415
8490 595415 385203 402759 461297 635406 673993 369609 272735 204365 87575 45666 95535
8479 95535 69191 143552 221433 185479 168496 316478 327165 273471 226350 166488 -26173
8468 -26173 -150904 180764 226416 77074 112013 190530 75416 123838 235869 311450 366845
8457 366845 423158 581379 601017 481838 435377 434139 291189 302777 31132 -154220 -76926
8446 -76926 180364 281112 158926 229132 133269 -82079 -284999 -129667 77430 54503
$$ packed form
8523E73378J29133r9310j74528K04983P7050n9890M106j42541r6611J47144J90048
8512G52962l40982q0041J76058j5255J54687p0980j1425j75434k4585J88508J92557
8501G46070r9238q9634M3874P8744j41970L1641n2640m4086J32488j00604R0770
8490E95415k10212J7556N8538J74109L8587l04384r6874o8370j16790m1909M9869
8479I5535k6344P4361P7881l5954j6983J47982J0687n3694m7121n9862j92661
8468b6173j24731L31668M5652j49342L4939P8517j15114M8422J12031P5581N5395
8457C66845N6313J58221J9638j19179m6461j238j42950J1588k71645j85352P7294
8446g6926K57290J00748j22186P0206r5863k15348k02920J55332K07097k2927
$$ plain form
8436 54503 -5478 -129015 -34097 257427 397495 467403 504244 379052 218332 339225 390920
8425 390920 251268 224600 158815 68645 -80478 26122 161463 219908 290649 309936 18902
8414 18902 10043 111929 206675 293505 284087 80714 94675 33239 228324 56868 -82034
8403 -82034 86076 225808 232259 -185483 -175097 -148091 39263 102614 234749 257407 156609
8392 156609 238741 383432 470760 533856 582119 608360 550505 510096 459207 320306 255438
8381 255438 1169 48660 77396 222327 228788 30710 72970 252818 410202 314636 158224
8370 158224 97690 208434 287180 562607 704133 851707 815957 503275 231672 160556
8360 160556 92489 80051 210297 406870 391551 346463 323330 292029 222551 115753 144878
$$ packed form
8436E4503n9981j23537R4918K91524J40068O9908L6841j25192j60720J20893N1695
8425C90920j39652k6668o5785r0170j49123J06600J35341N8445P0741J9287k91034
8414A8902q859J01886R4746Q6830r418k03373J3961o1436J95085j71456j38902
8403h2034J68110J39732O451m17742J0386K7006J87354O3351J32135K2658j00798
8392A56609Q2132J44691Q7328O3096M8263K6241n7855m0409n0889j38901o4868
8381B55438k54269M7491K8736J44931O461j98078M2260J79848J57384r5566j56412
8370A58224o0534J10744P8746K75427J41526J47574l5750l12682k71603p1116
8360A60556o8067j2438J30246J96573j5319m5088k3133l1301o9478j06798K9125
$$ plain form
8349 144878 82763 81238 208925 448904 536640 315251 374465 443836 339017 317271 330297
8338 330297 274020 272553 169582 179077 214779 369549 424743 412656 410628 186174 193072 296817
8326 296817 438168 453952 589511 735198 615746 558283 483149 290529 186728 123297
8316 123297 215547 185245 28873 273975 530592 572456 482403 399263 439486 29877 55791
8305 55791 -75349 -100073 28332 92397 -70010 124722 467365 290425 32655 44396
8295 44396 -35467 -134018 86016 171038 354819 286591 109006 177217 210314 415944 352755
8284 352755 32632 -104958 185299 196289 68532 200510 178022 293716 189848 11222
8274 11222 48499 -9927 -76394 -49057 -155196 -140932 -99668 -165235 -139708 -27266 161047
$$ packed form
8349A44878o2115j525J27687K39979Q7736k21389N9214O9371j04819k1746J3026
8338C30297n6277j467j02971R495L5702J54770N5194j2087k028k24454O898J03745
8326B96817J41351J5784J35559J45687j19452n7463p5134j92620j03801o3431
8316A23297R2250l0302j56372K45102K56617M1864r0053q3140M0223m09609K5914
8305E5791j31140k4724J28405O4065j62407J94732L42643j76940k57770J1741
8295D4396p9863r8551K20034Q5022J83781o8228j77585O8211L3097K05630o3189
8284C52755l20123j37590K90257J0990j27757J31978k2488J15694j03868j78626
8274A1222L7277n8426o6467K7337j06139J4264M1264o5567K5527J12442J88313
$$ plain form
8263 161047 160219 259747 415910 307641 24459 -58073 61658 139469 70167 140523 102572
8252 102572 203464 240326 163957 108025 78390 269296 273324 239858 323549 88127 1615
8241 1615 60309 26350 -73387 89854 290156 387682 252239 253258 163859 -8061 108688
8230 108688 35324 126055 220779 164992 -52033 -197102 -272635 -326122 -328540 -57109 44351
8219 44351 121526 178115 55170 -203711 -109482 4385 -57048 -32432 39260 53755 -104156
8208 -104156 -274128 -181114 -15788 269152 321220 288274 216236 253197 409121 244027 28188
8197 28188 158908 -7835 -196878 -131779 210567 251721 2424 50397 7381 85460 197636
8186 197636 291163 76087 -28633 -27579 -11310 -168130 -111930 192766 270106 216521 258525
$$ packed form
8263A61047q28R9528J56163j08269k83182q2532J19731P7811o9302P0356l7951
8252A02572J00892L6862p6369n5932k9635J90906M028l3466Q3691k35422q6512
8241A615N8694l3959r9737J63241K00302R7526j35443J019q9399j71920J16749
8230A08688p3364R0731R4724n5787k17025j45069p5533n3487k418K71431J01460
8219D4351P7175N6589j22945k58881R4229J13867o1433K4616P1692J4495j57911
8208a04156j69972R3014J65326K84940N2068l2946p2038L6961J55924j65094k15839
8197B8188J30720j66743j89043O5099L42346M1154k49297M7973m3016P8079J12176
8186A97636R3527k15076j04720J054J6269j56820N6200L04696P7340n3585M2004
$$ plain form
8175 258525 281340 159635 341791 291302 449332 471833 363372 222056 357379 563668
8165 563668 587840 348393 163583 136961 182421 140511 158447 155930 332208 347559 346273
8154 346273 292879 187904 457536 442920 221493 62521 -19588 72758 223182 216974 165727
8143 165727 91325 -121092 220946 631810 630106 321610 306689 276009 308571 245802 254204
8132 254204 171021 228441 162370 20480 218585 401767 302074 110401 180056 164532 11461
8121 11461 -1502 165042 433060 394784 253044 184179 65636 197555 198454 141975 -11063
8110 -11063 41052 -146182 -26642 119032 68801 -178510 -78723 101003 5766 -132022 136066
8099 136066 372623 506865 383244 166495 175616 182624 254880 380510 267541 133694 58883
$$ packed form
8175B58525K2815j21705J82156n0489J58030K2501j08461j41316J35323K06289
8165E63668K4172k39447j84810k6622M5460m1910J7936k517J76278J5351j286
8154C46273n3394j04975K69632j4616k21427j58972q2109R2346J50424o208n1247
8143A65727p4402k12417L42038M10864j704l08496j4921l0680L2562o2769Q402
8132B54204q3183N7420o6071j41890J98105J83182r9693j91673O9655j5524j53071
8121A1461j2963J66544K68018l8276j41740o8865j18543J31919Q99n6479j53038
8110a1063N2115j87234J19540J45674n0231k47311R9787J79726r5237j37788K68088
8099A36066K36557J34242j23621k16749R121P008P2256J25630j12969j33847p4811
$$ plain form
8088 58883 -238393 -388521 -282580 -171212 86166 390037 468063 529549 312982 163106
8078 163106 168787 84112 99962 42931 17241 21469 102232 165982 158963 116506 108254 280511
8066 280511 359484 295520 227009 334936 245677 201742 174006 99370 -19773 -110578 -29935
8055 -29935 -31895 157144 425892 391815 277684 198582 146165 156937 100620 70415 254900
8044 254900 388894 539333 457233 335258 443248 429991 540641 632697 653465 638632 422357
8033 422357 506307 504844 341052 237000 179441 395261 548441 526484 527167 521810 366818
8022 366818 416661 452016 454258 266710 324027 399425 241879 139471 53263 138165 316655
8011 316655 394041 435838 498745 480855 627812 718405 523588 457694 465300 532748 502438
$$ packed form
8088E8883k97276j50128J05941J11368K57378L03871P8026O1486k16567j49876
8078A63106N681q4675J5850n7031k5690M228Q0763O3750p019m2457q252J72257
8066B80511P8973o3964o8511J07927q9259m3935k7736p4636j19143r0805Q0643
8055b9935j960J89039K68748l4077j14131p9102n2417J0772n6317l0205J84485
8044B54900J33994J50439q2100j21975J07990j3257J10650R2056K0768j4833k16275
8033D22357Q3950j463j63792j04052n7559K15820J53180k1957O83n357j54992
8022C66818M9843L5355K242j87548N7317P5398j57546j02408q6208Q4902J78490
8011C16655P7386M1797O2907j7890J46957R0593j94817o5894P606O7448l0310
$$ plain form
8000 502438 802680 1191957 1476467 1354374 1324238 1213767 1298023 1192048 1301261 1388795
7990 1388795 1245500 1186351 1095945 968984 914711 863731 683450 547070 504081 705193
7980 705193 685978 376087 389618 538920 661391 847884 792579 443639 360118 345585 65455
7969 65455 31602 167044 260420 401496 401781 425276 453843 640038 324240 424321 474671
7958 474671 454717 359372 370985 487894 311428 480830 752522 687372 790495 859252 696784
7947 696784 532923 621811 604236 833127 929213 909478 758632 539640 643482 603769 486004
7936 486004 546336 562252 452246 465087 648938 557195 407422 457795 327969 239516 223316
7925 223316 341287 570780 543703 396186 539807 651071 438841 224673 250405 188989
$$ packed form
8000E02438L00242L89277K84510j22093l0136j10471Q4256j05975J09213Q7534
7990A388795j43295n9149r0406j26961n4273n0980j80281j36380m2989K01112
7980G05193j9215l09891J3531J49302J22471J86493n5305l48940q3521j4533k80130
7969F5455l3853J35442R3376J41076K85K3495K8567J86195l15798J00081N0350
7958D74671j9954r5345J1613J16909j76466J69402K71692o5150J03123O8757j62468
7947F96784j63861Q8888j7575K28891R6086j9735j50846k18992J03842l9713j17765
7936D86004O0332J5916j10006J2841J83851r1743j49773N0373j29826q8453j6200
7925B23316J17971K29493k7077j47517J43621J11264k12230k14168K5732o1416
$$ plain form
7915 188989 19478 8798 200251 300659 246447 293697 124843 6521 43823 -2065 134278
7904 134278 308877 192057 82855 254044 383665 416978 433757 660841 594817 275759
7894 275759 236552 436930 359090 116850 96700 136303 168844 111067 239040 293622 188043
7883 188043 29483 -16796 58450 131360 167471 160166 128670 44725 -88550 -243821 19977
7872 19977 211062 52053 -34176 34747 59269 -47782 -20247 105636 52011 60473 202509
7861 202509 69857 -49151 -173562 -231182 -380957 -187606 -68405 117654 60410 94626
7851 94626 -88129 -124016 121784 188982 146270 143647 108831 134382 133449 296034 530466 657053
7839 657053 651625 561805 396456 275684 77551 40765 257588 305055 286992 337661 405033
$$ packed form
7915A88989j69511j0680J91453J00408n4212M7250j68854j18322L7302m5888J36343
7904A34278J74599j16820j09202J71189J29621L3313J6779K27084o6024l19058
7894B75759l9207K00378p7840k42240k0150L9603L2541n7777J27973N4582j05579
7883A88043j58560m6279P5246P2910L6111p305l1496q3945j33275j55271K63798
7872A9977J91085j59009q6229O8923K4522j07051K7535J25883n3625Q462J42036
7861B02509j32652j19008j24411n7620j49775J93351J19201J86059n7244L4216
7851I4626j82755l5887K45800O7198m2712k623l4816K5551r33J62585K34432J26587
7839F57053n428q9820j65349j20772j98133l6786K16823M7467j8063N0669O7372
$$ plain form
7828 405033 168248 -2844 -60777 97469 203594 88458 -72025 -17853 -69378 -79233 -85243
7817 -85243 -9525 194873 243227 233065 195960 159645 304178 130149 34821 42378 85494
7806 85494 89046 -90215 -115774 -135072 -126952 -37915 44920 35832 57776 57784 62010 232732 145274
7793 145274 27086 212344 322764 515676 504749 189495 -59213 215051 395966 125836
7783 125836 -5525 -36078 125429 29528 13979 104935 147877 -55558 919 63867 10388
7772 10388 -16732 106406 49996 -143050 -79842 -6536 135036 213077 219843 357316 397536
7761 397536 182974 -38261 39980 87123 331277 363958 179803 -120598 -54231 -46688 -8091
7750 -8091 120884 31075 36759 21477 -77706 -162485 -234091 -245290 -185111 -46346 -82507 -192573
$$ packed form
7828D05033k36785j71092n7933J58246J06125j15136j60483N4172n1525r855o010
7817h5243P5718K04398M8354j0162l7105l6315J44533j74029r5328P557M3116
7806H5494L552j79261k5559j9298Q120Q9037Q2835r088K1944QM226J70722q7458
7793A45274j18188J85258J10420J92912j0927l15254k48708K74264J80915k70130
7783A25836j31361l0553J61507r5901j5549R0956M2942k03435N6477O2948n3479
7772A0388k7120J23138n6410j93046O3208P3306J41572P8041O766J37473M0220
7761C97536k14562k21235P8241M7143K44154L2681j84155l00401O6367P543L8597
7750h091J28975q9809N684j5282r9183q4779p1606j1199O0179J38765l6161j10066
$$ plain form
7738 -192573 -277539 -170473 -17143 41667 85252 160915 52385 191903 500740 370474
7728 370474 327465 192671 6822 -169469 -208167 -186031 -206384 -254647 -172131 116334 71990
7717 71990 96478 81483 -146857 -156034 -62022 23472 13031 -149722 -236987 -296818 -95577
7706 -95577 161191 22436 -25261 6198 34697 -45780 66892 166692 38319 -162709 -127203
7695 -127203 -125467 -72920 176349 242616 256838 216410 76859 255 -61730 104249 200346
7684 200346 161678 94698 -783 76 -36606 -43329 -89656 -44910 -19562 144215 155786 112727
7672 112727 -60147 -122859 133540 114605 95305 14292 -178673 -107958 -308683 -301949 -263030
7661 -263030 -315454 -208164 -139817 -210729 -303711 -104403 137325 7161 -94462 -69432 -45754
$$ packed form
7738a92573q4966J07066J53330N8810M3585P5663j08530J39518L08837j30266
7728C70474m3009j34794j85849j76291l8698K2136k0353m8263Q2516K88465m4344
7717G1990K4488j4995k28340r177R4012Q5494j0441j62753q7265n9831K01241
7706i5577K56768j38755m7697L1459K8499q0477J12672R9800j28373k01028L5506
7695a27203J736N2547K49269O6267J4222m0428j39551p6604o1985J65979R6097
7684B00346l8668o6980r5481Q59l6682o723m6327M4746K5348J63777J1571m3059
7672A12727j72874o2712K56399j8935j9300q1013j92965P0715k00725O734L8919
7661b63030n2424J07290O8347p0912r2982J99308K41728j30164j01623K5030K3678
$$ plain form
7650 -45754 -44581 62023 121862 -51900 -120700 -175295 -300253 -403896 -393698 -134852 142681
7639 142681 87873 -11728 46118 15338 -44790 -206389 3457 296717 263743 -37464 -348170
7628 -348170 -446180 -476727 -389494 -199060 71613 274993 187611 -58643 13866 161169 175525
7617 175525 111383 200838 238658 127776 -17224 -129774 59684 249280 133941 -42259
7607 -42259 52043 166537 191021 214279 88814 257732 384631 275750 24411 62596 60019
7596 60019 -93614 -13775 142709 251292 256803 355221 557349 613376 345675 107459 62504
7585 62504 4581 90308 120695 78202 -60830 -111078 -66650 40586 -60098 -47175 8185
7574 8185 19430 -48893 -170603 -311230 -296410 -155916 -42723 -55030 13059 146785 -100387
$$ packed form
7650d5754J173J06604N9839j73762o8800n4595j24958j03643J0198K58846K77533
7639A42681n4808r9601N7846l0780o0128j61599K09846K93260l2974l01207l10706
7628c48170r8010l0547Q7233J90434K70673K03380q7382k46254P2509J47303J4356
7617A75525o4142Q9455L7820j10882j45000j12550J89458J89596j15339j76200
7607d2259R4302J14494K4484K3258j25465J68918J26899j08881k51339L8185k577
7596F0019j53633P9839J56484J08583N511R8418K02128N6027k67701k38216m4955
7585F2504n7923Q5727L0387m2493j39032n0248M4428J07236j00684J2923N5360
7574H185J1245o8323j21710j40627J4820J40494J13193j2307O8089J33726k47172
$$ plain form
7563 -100387 -8847 88509 -22192 -75234 -128693 -91070 -70712 -134289 -320274 -95197 -166267
7552 -166267 -215474 -293469 -351676 -379946 -274636 -141613 -164659 -99482 38472 -17444 -62790
7541 -62790 20840 -87167 -260325 -127336 17148 163889 247669 45242 -117263 -60446
7531 -60446 -161799 -321124 -241771 -388022 -200384 -55521 -92742 -79771 -89956 6268 41000
7520 41000 -94779 -97847 85251 270929 459839 380574 4101 70721 94210 -50746 -105489
7509 -105489 -105215 -137006 -170788 -280267 -415230 -283641 -172766 -194194 -196486 -24847 50269
7498 50269 139120 253797 158778 -44320 -42744 23896 -16803 92834 126080 49515 -46860
7487 -46860 -284937 -448625 -344505 -166399 -138943 -76886 -30723 -136733 -146145 -46377 54488
$$ packed form
7563a00387R1540R7356j10701n3042n3459L7623K0358o3577j85985K25077p1070
7552a66267m9207p7995n8207k8270J05310J33023k3046O5177J37954n5916m5346
7541f2790Q3630j08007j73158J32989J44484J46741Q3780k02427j62505N6817
7531f0446j01353j59325P9353j46251J87638J44863l7221J2971j0185R6224L4732
7520D1000j35779l068J83098J85678J88910p9265l76473O6620K3489j44956n4743
7509a05489K74l1791l3782j09479j34963J31589J10875k1428k292J71639P5116
7498E0269Q8851J14677r5019k03098J576O6640m0699J09637L3246p6565r6375
7487d6860k38077j63688J04120J78106K7456O2057M6163j06010r412R9768J00865
$$ plain form
7476 54488 -47339 -272141 -532577 -501594 -354298 -114914 -368689 -420547 -462202 -403788 -298185
7465 -298185 -98843 74906 20251 131965 20907 -138446 -88904 3260 230536 113475
7455 113475 142779 82514 24110 90196 81350 129066 94342 128024 286799 252223 286181 365834
7443 365834 447779 128755 161701 343843 199243 223337 283306 178967 75064 234524
7433 234524 161987 172698 194964 -158954 -348350 -219792 99147 158561 59186 85053 94078
7422 94078 247663 108443 108706 39223 -257020 -330726 -136431 62681 128434 63711 -117539
7411 -117539 -80174 14140 -113510 -306631 -255560 -138193 20129 106238 128456 417167 464409
7400 464409 413696 325899 222340 56069 -10113 127929 233140 50002 -4398 94423 283003
$$ packed form
7476E4488j01827k24802k60436L0983J47296K39384k53775n1858m1655N8414J05603
7465b98185J99342J73749n4655J11714j11058j59353M9542R2164K27276j17061
7455A13475K9304o0265n8404O6086q846M7716l4724L3682J58775l4576L3958P9653
7443C65834Q1945l19024L2946J82142j44600K4094N9969j04339j03903J59460
7433B34524p2537J0711K2266l53918j89396J28558L18939N9414r9375K5867R025
7422I4078J53585j39220K63o9483k96243p3706J94295J99112O5753o4723j81250
7411a17539L7365R4314j27650j93121N1071J17367J58322Q6109K2218K88711M7242
7400D64409n0713q7797j03559j66271o6182J38042J05211j83138n4400R8821J88580
$$ plain form
7389 283003 389214 477430 399586 363352 221251 198928 302531 379054 189254 165886 259323
7378 259323 5898 8596 164834 295199 327070 181922 -8320 165522 90772 134841 15085
7367 15085 -76815 -12484 -78942 217057 209404 171256 10844 -342931 -331644 -194878 -145006
7356 -145006 -15845 46109 -64480 -32813 -26649 -97916 -24160 123243 185877 208236 490
7345 490 -18900 98573 1773 24272 188414 190535 2561 -64456 26215 76425 -351 36307
7333 36307 -47798 11739 28493 -3220 -77360 32389 209916 288010 143678 163732 143950
7322 143950 32065 -39594 -221123 -255115 -232053 -290735 -134648 131997 101921 22470 -19410
7311 -19410 -152373 -12169 -57653 39584 -56118 -69338 128281 210796 -45689 -334616 -312784
$$ packed form
7389B83003J06211Q8216p7844l6234j42101k2323J03603P6523j89800k3368R3437
7378B59323k53425K698J56238J30365L1871j45148j90242J73842p4750M4069j19756
7367A5085r1900O4331o6458K95999p653l8148j60412l53775J1287J36766M9872
7356a45006J29161O1954j10589L1667O164p1267P3756J47403O2634K2359k07746
7345D90j9390J17473r6800K2499J64142K121j87974o7017R0671N0210p6776L6658
7333C6307q4105N9537J6754l1713p4140J09749J77527P8094j44332K0054j9782
7322A43950j11885p1659j81529l3992K3062n8682J56087K66645l0076p9451m1880
7311a9410j32963J40204m5484R7237r5702j3220J97619Q2515k56485k88927K1832
$$ plain form
7300 -312784 -201106 -168587 -362307 -361097 -214357 -82314 -78017 -377573 -546389 -500728 -475415
7289 -475415 -388987 -268401 19992 1478 166189 36822 -16908 -32904 -130182 61572 109938
7278 109938 -172997 -163727 -151557 60138 122764 19312 -64429 -81725 -16486 -219940 -123350
7267 -123350 -85539 -29865 -27858 10990 84339 -37983 -236605 -287600 -109095 -139934 -144710
7256 -144710 -54373 -20523 95969 70946 82728 -43360 -49173 -5503 -95714 196114 229315
7245 229315 90694 207588 245891 108921 159840 478389 430686 201796 179685 218784 2207
7234 2207 -39009 -143687 -77517 95162 182944 55994 -105297 -202417 -206703 -71060 85109
7223 85109 -6686 18405 83431 205926 267389 260956 245754 219770 183201 241570 275845 155992
$$ packed form
7300c12784J11678L2519j93720J210J46740J32043M297k99556j68816M5661K5313
7289d75415Q6428J20586K88393j8514J64711j29367n3730j5996r7278J91754M8366
7278A09938k82935R270J2170K11695O2626j03452q3741j7296O5239k03454R6590
7267a23350L7811N5674K007L8848P3349j22322j98622n0995J78505l0839m776
7256a44710R0337L3850J16492k5023J1782j26088n813M3670r0211K91828L3201
7245B29315j38621J16894L8303j36970N0919L18549m7703k28890k2111L9099k16577
7234B207m1216j04678O6170J72679Q7782j26950j61291r7120m286J35643J56169
7223H5109r1795K5091O5026J22495O1463o433j5202k5984l6569N8369L4275j19853
$$ plain form
7211 155992 135761 56742 -63687 -32555 -106365 -78498 -207421 -103132 258070 314649 194568
7200 194568 109974 306997 257825 -5370 -133894 -113650 -83936 -9646 47082 83767 180096
7189 180096 -55367 -63237 45760 141907 235663 293417 295041 284044 106417 49663 44940 179557
7177 179557 38498 -35579 31805 -192821 -161450 -19656 -75775 -120008 -188959 -110807 -144897
7166 -144897 -319526 -247561 -190918 -337862 -361446 -374674 -275449 -346819 -538772 -424783 -355323
7155 -355323 -49308 -46484 -320589 -386131 -290951 -433358 -42979 40499 24093 7595 -48794
7144 -48794 218218 350565 353031 179189 65091 85248 24661 -60745 -158833 -236861 -208449
7133 -208449 -341843 -246615 -83181 -76696 -21527 84105 229453 70182 -64805 -24997 -29304
$$ packed form
7211A55992k0231p9019j20429L1132p3810K7867j28923J04289L61202N6579j20081
7200A94568q4594J97023m9172k63195j28524K0244K9714P4290N6728L6685R6329
7189A80096k35463p870J08997R6147R3756N7754J624j0997j77627n6754m723J34617
7177A79557j41059p4077O7384k24626L1371J41794n6119m4233o8951P8152l4090
7166a44897j74629P1965N6643j46944k3584j3228R9225p1370j91953J13989O9460
7155c55323L06015K824k74105o5542R5180j42407L90379Q3478j6406j6498n6389
7144d8794K67012J32347K466j73842j14098K0157o0587q5406r8088p8028K8412
7133b08449j33394R5228J63434O485N5169J05632J45348j59271j34987L9808m307
$$ plain form
7122 -29304 32890 65723 110001 159987 139859 368988 451798 89507 -145976 -4457 85573
7111 85573 64380 -32057 -141707 -134528 -127902 -204897 -100484 -116264 237718 328346 317355 249028
7099 249028 59918 96651 168016 320898 134841 -300171 -277183 -211685 -200745 -225514 -197191
7088 -197191 -370876 -131188 119637 -57289 -1797 111491 56457 -160994 -483536 -329151
7078 -329151 -9871 36508 -89449 -55606 22533 36910 7076 6707 -238050 -224644 -181237
7067 -181237 -85419 -106553 -236805 -324452 -304372 16532 253670 39735 -199372 -138990 117733
7056 117733 118564 75454 -76033 -289510 -360371 -451471 -372652 -204921 -100633 60991 145149
7045 145149 242694 175531 45801 -106060 -320246 -195097 -160732 -154709 -315671 -239308 -429332
$$ packed form
7122b9304O2194L2833M4278M9986k0128K29129Q2810l62291k35483J41519R0030
7111H5573k1193r6437j09650P179O626p6995J04413j5780L53982R0628j0991o8327
7099B49028j89110L6733P1365J52882j86057m35012K2988O5498J0940k4769K8323
7088a97191j73685K39688K50825j76926N5492J13288n5034k17451l22542J54385
7078c29151L19280M6379j25957L3843P8139J4377k9834l69k44757J3406M3407
7067a81237R5818k1134j30252q7647K0080L20904K37138k13935k39107O0382K56723
7056A17733Q31m3110j51487k13477p0861r1100P8819J67731J04288J61624Q4158
7045A45149R7545o7163j29730j51861k14186J25149L4365O023j60962P6363j90024
$$ plain form
7034 -429332 -343368 -166113 -157257 -152358 -44541 -23299 7799 -123925 -216042 -266358 -24310
7023 -24310 230837 78909 -170598 -88549 32171 85807 116087 52510 16648 100000 11515
7012 11515 -160542 -284558 -369552 -519505 -367738 -294781 -217492 -133802 -119351 -183555 -65833
7001 -65833 -120059 -54228 36097 -218459 -262913 -210708 -65768 -160571 -132575 -184058 -275219
6990 -275219 -390733 -382363 -169034 -117652 -193375 -92668 111887 159010 15209 -114973 -156626
6979 -156626 -218799 -289728 -378166 -427652 -353263 -318585 -130528 -216730 -249449 -105372 22609
6968 22609 101858 125993 15120 -263092 -414033 -516812 -419498 -143478 78169 73410 330355
6957 330355 333363 331531 281894 381022 233495 9944 84016 316908 198124 -8083 -62798
$$ packed form
7034d29332Q5964J77255Q856M899J07817K1242L1098j31724r2117n0316K42048
7023b4310K55147j51928k49507Q2049J20720N3636L0280o3577l5862Q3352q8485
7012A1515j72057j24016q4994j49953J51767P2957P7289Q3690J4451o4204J17722
7001f5833n4226O5831R0325k54556m4454N2205J44940r4803K7996n1483r1161
6990b75219j15514Q370K13329N1382p5723J00707K04555M7123j43801j30182m1653
6979a56626o2173p0929q8438m9486P4389L4678J88057q6202l2719J44077J27981
6968B2609P9249K4135j10873k78212j50941j02779R7314K76020K21647m759K56945
6957C30355L008j832m9637R9128j47527k23551P4072K32892j18784k06207n4715
$$ plain form
6946 -62798 -37078 -173741 -232920 -432009 -335396 -334419 -125383 30840 27881 -123113 -99661
6935 -99661 -10810 157914 137539 115087 -22086 -11249 112804 87657 17389 79834 206418
6924 206418 339481 269492 -75244 -170783 -170448 -143626 4375 -45713 129818 59121 73086
6913 73086 40900 -23952 -22376 28377 107928 7954 -25979 -132866 -429100 -609937 -626117
6902 -626117 -552381 -37788 312828 310606 237397 217586 117802 -33759 -210089 -232027 -71148
6891 -71148 -229229 -345132 -135366 10592 -18909 43177 202406 370702 196846 232389
6881 232389 86774 -51357 54074 55928 47262 105229 -129662 -286511 -98872 72490 308722
6870 308722 328590 136405 211761 126105 23453 -125293 -83535 76911 -28161 -78361 2058
$$ packed form
6946f2798K5720j36663n9179j99089R6613R77K09036J56223k959j50994K3452
6935i9661Q8851J68724k0375k2452j37173J0837J24053k5147p0268O2445J26584
6924B06418J33063o9989l44736r5539L35K6822J48001n0088J75531p0697J3965
6913G3086l2186o4852J576N0753P9551r9974l3933j06887k96234j80837j6180
6902f26117P3736N14593L50616k222p3209j9811r9784j51561j76330k1938J60879
6891g1148j58081j15903K09766J45958k9501O2086J59229J68296j73856L5543
6881B32389j45615j38131J05431J854q666N7967k34891j56849J87639J71362K36232
6870C08722J9868j92185P5356q5656j02652j48746M1758J60446j05072n0200Q0419
$$ plain form
6859 2058 109419 126112 82603 -84716 -312859 -291098 -312381 -188757 -127232 -48496 247543
6848 247543 27235 -70835 -449 37329 134471 63187 58417 113414 30021 -144411 -162191
6837 -162191 -51672 -52231 -149547 -139716 -198841 -66271 -230414 -301335 -288842 -151543 31368
6826 31368 -115318 13699 -77239 -245083 -260719 -272845 -191583 21389 -18593 47952 -279030
6815 -279030 -391939 -214596 -87978 -68673 -198736 -377243 -239163 52416 -22128 157583
6805 157583 338865 140754 123849 180398 183379 74277 79063 -97008 64619 120756 94824
6794 94824 171276 334349 106803 -145182 -198352 -45880 2054 -93972 5194 164156 155325
6783 155325 213242 88279 104703 269736 289195 169244 1570 27069 -83790 -113397 32980
$$ packed form
6859B058J07361J6693m3509j67319k28143K1761k1283J23624O1525P8736K96039
6848B47543k20308r8070P0386L7778R7142p1284m770N4997q3393j74432j7780
6837a62191J10519n59r7316R831n9125J32570j64143p0921J2493J37299J82911
6826C1368j46686J29017r0938j67844j5636j2126Q1262K12972l9982O6545l26982
6815b79030j12909J77343J26618J9305j30063j78507J38080K91579p4544J79711
6805A57583J81282j98111j6905N6549K981j09102M786j76071J61627N6137k5932
6794I4824P6452J63073k27546k51985n3170J52472M7934r6026R9166J58962q831
6783A55325N7917j24963J6424J65033J9459j19951j67674K5499j10859k9607J46377
$$ plain form
6772 32980 -117492 -207147 -298906 -341555 -239666 -113829 -140060 -200670 63147 -34876 -59019
6761 -59019 -27492 10292 -13027 -149397 -151315 -148803 -72991 -122999 -292048 -368576 -341981 -49002
6749 -49002 92530 97476 103834 100403 188472 200714 248336 250472 126655 243912 261389 34603
6737 34603 -128575 -206017 -91178 84488 142856 147522 -106107 15935 327241 378568 250229
6726 250229 116638 57075 -23382 -55224 -140452 -278662 -253611 201740 455800 307069 287622
6715 287622 163474 254282 244525 231585 181784 -12278 44561 187853 174933 198940 196840
6704 196840 46637 156773 75564 -168731 -161276 -238575 -217387 -163897 -53570 -24411 94074
6693 94074 311005 388832 189651 191740 393493 404239 351029 104931 -150801 -351176 -210834
$$ packed form
6772C2980j50472q9655r1759m2649J01889J25837k6231o0610K63817r8023k4143
6761e9019L1527L7784k3319j36370j918K512P5812n0008j69049p6528K6595K92979
6749d9002J41532M946O358l431Q8069J2242M7622K136j23817J17257J7477k26786
6737C4603j63178p7442J14839J75666N8368M666k53629J22042L11306N1327j28339
6726B50229j33591n9563q0457l1842q5228j38210K5051M55351K54060j48731j9447
6715B87622j24148R0808r757j2940m9801j94062N6839J43292j2920K4007k100
6704A96840j50203J10136q1209k44295P455p7299K1188N3490J10327K9159J18485
6693I4074K16931P7827j99181K089K01753J0746n3210k46098k55732k00375J40342
$$ plain form
6682 -210834 14275 138515 -136801 -163493 -138177 52200 194063 170414 78432 36238 82342
6671 82342 2087 -5837 -91263 -88586 96639 -16793 -357770 -299827 -28426 -8869 -184271
6660 -184271 -240262 -158239 -155168 -215103 -316430 -238801 -11770 84552 -135096 9131 258441
6649 258441 211469 41043 223498 350233 283837 327591 179972 41002 -40514 -121238 -102835
6638 -102835 -147600 -342454 -308992 -253437 -208692 -121382 -320119 -457092 -305052 -151019 -150357
6627 -150357 -103891 -79823 -99520 -24080 -87650 -55102 -42829 -139135 -105858 -57315 -249317
6616 -249317 -256275 -205332 -265688 -372700 -246893 -178523 -102316 93787 299625 327775 47626
6605 47626 149530 296479 110103 -12439 -190616 -177837 -272314 -206253 8200 183665
$$ packed form
6682b10834K25109J24240k75316k6692K5316J90377J41863k3649r1982m2194M6104
6671H2342q0255p924q5426K677J85225j13432l40977N7943K71401J9557j75402
6660a84271n5991Q2023L071n9935j01327P7629K27031R6322k19648J44227K49310
6649B58441m6972j70426J82455J26735o6396M3754j47619j38970q1516q0724J8403
6638a02835m4765j94854L3462N5555M4745Q7310j98737j36973J52040J54033O62
6627a50357M6466K4068j9697P5440o3570L2548J2273r6306L3277M8543j92002
6616b49317o958N0943o0356j07012J25807O8370P6207J96103K05838K8150k80149
6605D7626J01904J46949j86376j22542j78177J2779r4477O6061K14453J75465
$$ plain form
6595 183665 279007 238390 87866 -133089 -9991 202027 215963 71287 10639 -191049
6585 -191049 -312938 -140521 -26818 -25327 -82771 170288 223777 367853 319427 168210 -22028
6574 -22028 -111262 -112354 -90492 -113576 -22114 111305 189775 215659 20208 -300815 -210642
6563 -210642 -83145 -84533 -31094 -41518 44598 67037 255728 460262 185500 -262676 -314293
6552 -314293 -290471 -294440 48096 286117 295314 430861 428152 309367 48666 80299 187130
6541 187130 78342 83683 260477 184284 -62190 -173950 -77762 -222102 -213858 -109606 -58660
6530 -58660 -50631 -128463 -186494 -126718 115398 160012 -35103 -165051 -316249 -393251 -293817
6519 -293817 -237862 -281074 -295163 -336389 -213880 -100617 108348 126816 -75162 -179729 -161900
$$ packed form
6595A83665R5342m0617j50524k20955J23098K12018J3936j44676o0648k01688
6585a91049j21889J72417J13703J491n7444K53059N3489J44076m8426j51217j90238
6574b2028q9234j092K1862k3084R1462J33419P8470K5884j95451l21023R0173
6563b10642J27497j388N3439j0424Q6116K2439J88691K04534k74762m48176n1617
6552c14293K3822l969L42536K38021R197J35547k709j18785k60701L1633J06831
6541A87130j08788N341J76794p6193k46474j11760R6188j44340Q244J04252N0946
6530e8660Q029p7832n8031N9776K42116M4614j95115j29948j51198p7002R9434
6519b93817N5955m3212j4089m1226J22509J13263K08965J8468k01978j04567J7829
$$ plain form
6508 -161900 -99692 -47741 -147575 -157949 -279703 -284460 -161821 -93018 74092 54312 226569
6497 226569 259320 186665 215424 93373 -86986 63582 322345 313026 274817 99360 -67640
6486 -67640 -19511 125752 -6334 -114490 -199444 -354607 -415079 -321584 -267709 -59780 227405
6475 227405 156659 177792 247611 186054 210706 316443 119069 139390 45018 -41423 -48608
6464 -48608 -136179 -74300 209609 363174 262924 -88801 -24348 -142349 -206491 -280411 -217828
6453 -217828 28362 116743 256878 457617 535641 625370 293704 191477 217464 189411 138790
6442 138790 112140 162948 228492 291128 282472 220031 338586 430127 406985 339436 95417
6431 95417 13488 -68429 82287 22720 113078 176747 -119281 -282218 -188830 -140628 -128097
$$ packed form
6508a61900O2208N1951r9834j0374j21754m757J22639O8803J67110j9780J72257
6497B26569L2751p2655K8759j22051j80359J50568K58763r319l8209j75457j67000
6486f7640M8129J45263j32086j08156q4954j55163o0472R3495N3875K07929K87185
6475B27405p0746K1133O9819o1557K4652J05737j97374K0321r4372q6441p185
6464d8608q7571O1879K83909J53565j00250l51725O4453j18001o4142p3920O2583
6453b17828K46190Q8381J40135K00739P8024Q9729l31666j02227K5987k8053n0621
6442A38790k6650N0808O5544O2636q656o2441J18555R1541k3142o7549k44019
6431I5417q1929q1917J50716n9567R0358O3669k96028j62937R3388M8202J2531
$$ plain form
6420 -128097 -138977 -95995 60093 35172 -15730 -124828 -201460 3919 27952 -59021 -169777
6409 -169777 -229248 68685 171175 198098 55322 -28862 22207 56061 173212 26210 35630
6398 35630 6401 100709 -20243 7493 99239 83205 162333 169559 138843 -15886 -137021
6387 -137021 -192659 -113175 47598 -21227 13740 36094 -268462 -627317 -764484 -642711 -465665
6376 -465665 -365942 -208533 -65895 -6109 20686 16069 -8667 -144228 -65216 -8690 14632
6365 14632 -100581 25372 16337 -92218 91084 194137 83820 116933 -190517 -405484
6355 -405484 -234503 22886 122849 251850 182713 -26552 -80340 -164013 -31849 -173069
6345 -173069 -314809 -346225 -267082 -89985 163586 164968 104073 -78224 -181462 -17985 20725
$$ packed form
6420a28097j0880M2982J56088k4921n0902j09098p6632K05379K4033q6973j10756
6409a69777n9471K97933J02490K6923j42776q4184N1069L3854J17151j47002R420
6398C5630k9229R4308j20952K7736R1746j6034P9128P226l0716j54729j21135
6387a37021n5638P9484J60773o8825L4967K2354l04556l58855j37167J21773J77046
6376d65665R9723J57409J42638N9786K6795m617k4736j35561P9012N6526K3322
6365A4632j15213J25953r035j08555J83302J03053j10317L3113l07450k14967
6355d05484J70981K57389R9963J29001o9137k09265n3788q3673J32164j41220
6345a73069j41740l1416P9143J77097K53571J382o0895j82297j03238J63477L8710
$$ plain form
6334 20725 -20460 -189879 -245346 -310344 -458393 -369922 -344501 -481985 -401500 -427166 -359720
6323 -359720 -281266 -181395 40002 96311 77095 87931 -44867 -242073 -296530 -146269 -131944
6312 -131944 -29481 -186054 -209592 -241053 -174853 -221291 -70281 39927 23239 -89290 -297700
6301 -297700 -339819 69056 22689 -108142 -23978 183716 177524 88894 136291 187924 139307
6290 139307 188796 117286 43102 159829 182653 -4633 18518 120660 51138 -131993 -166070
6279 -166070 -265735 -397491 -401765 -299324 -231909 -196605 -102103 94971 35346 -18707 -40753
6268 -40753 6568 145144 44067 52799 63534 -31026 43707 112062 177645 287235 285676 -87702
6256 -87702 -93720 48364 -162 132364 319406 197948 204995 36365 -73455 129689 245547
$$ packed form
6334B0725m1185j69419n5467o4998j48049Q8471K5421j37484Q0485k5666O7446
6323c59720P8454R9871K21397N6309j9216J0836j32798j97206n4457J50261J4325
6312a31944J02463j56573k3538l1461O6200m6438J51010J10208j6688j12529k08410
6301b97700m2119M08875m6367j30831Q4164K07694o192q8630M7397N1633m8617
6290A39307M9489p1510p4184J16727K2824j87286K3151J02142o9522j83131l4077
6279a66070r9665j31756m274J02441O7415L5304R4502J97074n9625n4053k2046
6268d0753M7321J38576j01077Q732J0735r4560P4733O8355O5583J09590j559l73378
6256h7702o018J42084m8526J32526J87042j21458P047j68630j09820K03144J15858
$$ plain form
6245 245547 330443 353379 158510 100371 20920 -90469 -169182 -236064 91038 240954 164003
6234 164003 1701 48419 227450 167788 296218 366629 346076 289515 122881 -101393 -304772
6223 -304772 -180037 -145191 -24984 5088 -74305 -62606 -210890 -215574 -134395 -122461 129959
6212 129959 135850 -104261 -241509 -341618 -116283 74733 83470 94254 40831 48240 162532
6201 162532 -27837 -83002 -66770 -19583 -58627 -71205 -65762 39020 114479 106451 264658
6190 264658 576594 438431 36479 129801 414022 615277 343130 221246 107132 -21466
6180 -21466 -89045 -109238 30611 27300 67555 -64123 -166111 -362817 -486131 -376728 -302560
6169 -302560 -407023 -434030 -194966 26234 125174 -30060 191519 403408 273558 1504
$$ packed form
6245B45547Q4896K2936j94869n8139p9451j11389p8713o6882L27102J49916p6951
6234A64003j62302M6718J79031n9662J28430P0411k0553n6561j66634k24274k03379
6223c04772J24735L4846J20207L0072p9393J1699j48284m684Q1179J1934K52420
6212A29959N891k40111j37248j00109K25335J91016Q737J0784n3423P409J14292
6201A62532j90369n5165J6232M7187l9044j2578N443J04782P5459q028J58207
6190B64658L11936j38163m01952R3322K84221K01255k72147j21884j14114j28598
6180b1466o7579k0193J39849l311M0255j31678j01988j96706j23314J09403P4168
6169c02560j04463k7007K39064K21200R8940j55234K21579K11889j29850k72054
$$ plain form
6159 1504 -122030 51728 88238 177452 258352 57764 31291 -83023 -124014 -219781 -112026
6148 -112026 139817 75954 38914 -29208 69754 209170 136848 -98614 -438403 -589245 -257251
6137 -257251 -90508 -45976 -179195 -209297 -269128 -280389 -171857 -84273 -149227 -306879 -507191
6126 -507191 -307438 -265975 -214465 23104 72530 107749 196885 316692 152016 183911 221853
6115 221853 346183 257913 46028 -142170 -74691 -172644 -337737 -263865 -241222 -34400 47585
6104 47585 65120 206670 126191 3527 -76465 37290 38140 -54661 86793 273752 74520
6093 74520 135896 119031 -14360 -83862 -192783 -78666 86396 92973 -134860 -165472 -125698
6082 -125698 -124979 31815 95598 -117827 -300007 -142788 -60231 -193146 -276354 -211269 -180988
$$ packed form
6159A504j23534J73758L6510Q9214Q0900k00588k6473j14314m0991r5767J07755
6148a12026K51843o3863l7040o8122R8962J39416p2322k35462l39789j50842L31994
6137b57251J66743M4532j33219l0102n9831j1261J08532Q7584o4954j57652k00312
6126e07191J99753M1463N1510K37569M9426L5219Q9136J19807j64676L1895L7942
6115B21853J24330q8270k11885j88198O7479r7953j65093P3872K2643K06822Q1985
6104D7585J7535J41550q0479j22664p9992J13755Q50r2801J41454J86959j99232
6093G4520O1376j6865j33391o9502j08921J14117J65062O577k27833l0612L9774
6082a25698P19J56794O3783k13425j82180J57219Q2557j32915q3208O5085L0281
$$ plain form
6071 -180988 -229038 -367995 -307567 -252155 -299806 -161159 -20245 113331 94558 116279 123063
6060 123063 427671 137375 -124246 -146536 -177087 -267191 -273453 -211238 -236926 -441778 -506875
6049 -506875 -418689 -286789 -291269 -220632 -238735 -348252 -531778 -298787 -265625 -171098 -12131
6038 -12131 -5396 40505 8473 90325 118259 243288 231172 266169 10984 -68797 40742
6027 40742 -93518 -147463 -43070 -51592 150 45980 142176 106035 180726 165768 -11430
6016 -11430 -16071 22390 -153364 -260033 -207248 -185079 -179618 -295882 -154493 -80954 -118367
6005 -118367 -366689 -539458 -547777 -350972 -26514 37080 -48009 -57048 -131594 -53163 155186
5994 155186 258801 185068 46028 192003 321276 224075 130224 276273 405772 229055
$$ packed form
6071a80988m8050j38957O0428N5412m7651J38647J40914J33576j8773K1721O784
6060A23063L04608k90296k61621k2290l0551r0104o262O2215k5688k04852o5097
6049e06875Q8186J31900m480P0637j8103j09517j83526K32991L3162R4527J58967
6038a2131O735M5901l2032Q1852K7934J25029j2116L4997k55185p9781J09539
6027D0742j34260n3945J04393q522N1742M5830R6196l6141P4691j4958j77198
6016a1430m641L8461j75754j06669N2785K2169N461j16264J41389P3539l7413
6005a18367k48322j72769q319J96805L24458O3594q5089r039p4546P8431K08349
5994A55186J03615p3733j39040J45975J29273r7201r3851J46049J29499j76717
$$ plain form
5984 229055 103018 119597 192846 80936 107674 278790 362538 196819 -154683 -432909
5974 -432909 -247198 -377320 -447727 -431310 -481283 -234867 -77089 36314 86342 -40471
5964 -40471 35072 5567 -254120 -233185 -26262 -167417 -269369 -237610 -134896 -184919 -46093
5953 -46093 -47231 -134095 -158673 -172388 -75060 -17869 80854 256008 169167 -79890 -317964
5942 -317964 -357769 -181689 -246399 -319724 -352961 -160898 -308465 -309012 -151650 -122126 -251435
5931 -251435 -309276 -389967 -381284 -316400 -384674 -531382 -475119 -431396 -495470 -372623 -288395
5920 -288395 -170753 -72335 -7596 76863 -5149 -231510 -288658 -100132 144834 -30400 240444
5909 240444 428462 611835 540769 303011 282692 150820 97908 230883 97737 -132604
$$ packed form
5984B29055j26037J6579P3249j11910K6738J71116Q3748j65719l51502k78226
5974d32909J85711j30122p0407J6417m9973K46416J57778J13403N0028j26813
5964d0471P5543k9505k59687K0935K06923j41155j01952L1759J02714n0023J38826
5953d6093j138q6864k4578j3715R7328N7191R8723J75154q6841k49057k38074
5942c17964l9805J76080o4710p3325l3237J92063j47567n47J57362K9524j29309
5931b51435n7841q0691Q683O4884o8274j46708N6263M3723o4074J22847Q4228
5920b88395J17642R8418O4739Q4459q2012k26361n7148J88526K44966j75234K70844
5909B40444J88018J83373p1066k37758k0319j31872n2912J32975j33146k30341
$$ plain form
5899 -132604 -275692 -66554 2631 97976 261145 77261 -243963 -203408 -76250 -12584
5889 -12584 -53962 -93964 -140557 -163535 -131752 -140739 -148348 50114 152553 26723 59280 85328
5877 85328 93953 207223 129474 -94093 -255351 -268586 -395034 -256040 14980 124003 28921
5866 28921 -120479 -320207 -155858 64251 185960 69787 172528 22551 46114 112711
5856 112711 -13096 -93577 -222308 -335444 -344435 -108060 34401 143058 141482 -26088 -342078
5845 -342078 -438727 -217503 -69606 -117877 -16585 14522 63176 49470 149742 4431 -319701
5834 -319701 -457263 -389425 -249888 -498696 -446014 -317368 -225178 -84892 28503 -168082
5824 -168082 -180415 -267995 -320979 -249011 36091 27211 -132366 -60682 -34766 -146844 -230575
$$ packed form
5899a32604j43088K09138O9185R5345J63169j83884l21224M0555J27158O3666
5889a2584m1378m0002m6593k2978L1783q987p609J98462J02439j25830L2557K6048
5877H5328Q625J13270p7749k23567j61258j3235j26448J38994K71020J09023r5082
5866B8921j49400j99728J64349K20109J21709j16173J02741j49977K3563O6597
5856A12711j25807q0481j28731j13136q991K36375J42461J08657j576j67570l15990
5845c42078r6649K21224J47897m8271J01292L1107M8654j3706J00272j45311l24132
5834c19701j37562O7838J39537k48808N2682J28646R2190J40286J13395j96585
5824a68082j2333q7580n2984P1968K85102q880j59577P1684K5916j12078q3731
$$ plain form
5813 -230575 -166313 -29447 -92664 -305328 -323680 -430053 -407894 -130813 -39660 189649 428736
5802 428736 372461 207580 29643 59675 129322 15957 63836 7316 -91268 -30316 -98909
5791 -98909 -222044 -407099 -494961 -312191 -161131 -86254 140073 66793 11085 -247701 -310457
5780 -310457 -71409 -31901 -132843 -285504 -57935 43044 70324 72162 -19482 14358 -38553
5769 -38553 -39483 -116289 -53846 -18749 99053 -17229 -137042 -161565 -112191 91529 132299
5758 132299 -43281 -128536 -95590 -78752 -147822 8524 118990 -57582 2983 3140 -33525
5747 -33525 -106934 -172282 -228365 -251370 -199629 -117673 -8778 40175 -58958 -37836 71410
5736 71410 162610 182906 181533 20092 -32469 -192366 -280924 -303716 -335378 -232894 -2869
$$ packed form
5813b30575O4262J36866o3217k12664j8352j06373K2159K77081R1153K29309K39087
5802D28736n6275j64881j77937L0032O9647j13365M7879n6520r8584O0952o8593
5791i8909j23135j85055q7862J82770J51060P4877K26327p3280n5708k58786o2756
5780c10457K39048L9508j00942j52661K27569J00979K7280J838r1644L3840n2911
5769c8553r30p6806O2443L5097J17802j16282j19813k4523M9374K03720M0770
5758A32299j75580q5255L2946J6838o9070J56346J10466j76572O0565J57l6665
5747c3525p3409o5348n6083k3005N1741Q1956J08895M8953r9133K1122J09246
5736G1410R1200K0296j373j61441n2561j59897q8558k2792l1662J02484K30025
$$ plain form
5725 -2869 117370 14990 -113813 -233202 -375011 -232149 -145393 -178404 -96435 -57159 -34350
5714 -34350 -125001 -183224 -167839 196503 291801 89610 -6876 -182358 -220280 -67867 -15837
5703 -15837 -96095 -119691 -104020 -66588 173322 283249 187756 153807 80039 52533 62983
5692 62983 -159445 -11474 129367 -40490 -99986 -44286 -48961 -10018 -111457 106094 228981
5681 228981 139456 18434 -8771 30083 44063 148886 118556 107995 210251 270626 119058
5670 119058 -26604 -80839 -188133 -195853 -88653 -107354 111523 65514 -69036 -33774 42779
5659 42779 149523 64573 124499 -64056 -144881 -225924 -180574 -6588 150564 -241860 -492391
5648 -492391 -568401 -348721 -104855 48101 68214 154666 21959 -141273 11201 -53058
$$ packed form
5725b869J20239j02380j28803j19389j41809J42862Q6756l3011Q1969L9276K2809
5714c4350r0651n8223J5385L64342R5298k02191r6486j75482l7922J52413N2030
5703a5837q0258k3596J5671L7432K39910J09927r5493l3949p3768k7506J0450
5692F2983k22428J47971J40841j69857n9496N5700m675L8943j01439K17551J22887
5681B28981q9525j21022k7205L8854J3980J04823l0330j0561J02256O0375j51568
5670A19058j45662n4235j07294p720J07200j8701K18877m6009j34550L5262P6553
5659D2779J06744q4950N9926j88555q0825q1043M5350J73986J57152l92424k50531
5648d92391p6010K19680K43866J52956K0113Q6452j32707j63232J52474o4259
$$ plain form
5638 -53058 -178692 -207547 -265020 -160794 -177870 -36509 -40072 -89855 -81147 -177451 -20778
5627 -20778 144298 73524 -206481 -65735 85025 147375 142248 151306 202387 307302 278672
5616 278672 148736 87759 211063 329454 -16352 -288007 -435296 -438825 -468182 -212963
5606 -212963 -14189 16549 -189319 -280824 -176337 -244677 -179024 -187463 -142160 -131919 -23492
5595 -23492 150310 192829 58685 60556 104049 -5929 218426 295791 231608 33531 23222
5584 23222 239548 197843 180824 285928 210110 286036 274737 99882 -5222 94387 266263
5573 266263 300209 219259 6548 102836 210594 210653 244763 240493 113391 52489 248272 283431
5561 283431 19735 -223348 -436743 -412660 -237987 -133469 -229221 -546050 -579692 -266613
$$ packed form
5638e3058j25634k8855n7473J04226j7076J41361l563m9783Q708r6304J56673
5627b0778J65076p0774k80005J40746J50760O2350n127R058N1081J04915k8630
5616B78672j29936o0977J23304J18391l45806k71655j47289l529k9357K55219
5606b12963J98774L0738k05868r1505J04487o8340O5653q439M5303J0241J08427
5595b3492J73802M2519j34144J871M3493j09978K24355P7365o4183j98077j0309
5584B3222K16326m1705j7019J05104p5818P5926j1299j74855j05104R9609J71876
5573B66263L3946q0950k12711R6288J07758N9L4110m270j27102o0902J95783L5159
5561B83431k63696k43083k13395K4083J74673J04518r5752l16829l3642L13079
$$ plain form
5551 -266613 -7319 -232402 -376851 -261544 -232694 -284073 -235360 -28946 -17656 -125676
5541 -125676 -63422 -92741 111078 122320 117266 119686 200847 315588 167245 -142671 -330098
5530 -330098 -354387 -193514 64866 24619 107819 282724 404789 271908 135137 10119
5520 10119 -129914 -202303 133096 313766 211863 301581 377702 234311 151096 160649 16269
5509 16269 -55604 -58214 34772 48088 52228 -90130 -260333 -207008 -96923 -165640 -154301 -103549
5497 -103549 15515 -64276 -45018 72548 101637 102148 241997 239228 96530 68008 151018
5486 151018 80838 -82666 -509807 -691107 -393089 87649 85939 -107129 -166059 -371072
5476 -371072 -248137 -102626 -148225 -217863 -220030 -215812 -100541 -65749 -75140 -82436 -202950 188735
$$ packed form
5551b66613K59294k25083j44449J15307K8850n1379M8713K06414J1290j08020
5541a25676O2254k9319K03819J1242n054K420Q1161J14741j48343l09916j87427
5530c30098k4289J60873K58380m0247Q3200J74905J22065j32881j36771j25018
5520A0119j40033p2389L35399J80670j01903Q9718P6121j43391q3215R553j44380
5509A6269p1873k610R2986J3316M140j42358j70203N3325J10085o8717J1339N0752
5497a03549J19064p9791J9258J17566K9089N11J39849k769j42698k8522Q3010
5486A51018p0180j63504m27141j81300K98018M80738j710j93068n8930k05013
5476c71072J22935J45511m5599o9638k167M218J15271L4792r391p296j20514L91685
$$ plain form
5464 188735 185036 -79214 -164838 -125620 -43204 -101132 144297 318167 244061 329430 291007
5453 291007 83392 64092 59286 90897 234291 376969 362829 284347 46672 -71842 54522
5442 54522 -894 10748 -85951 -130113 -164706 -228589 -104627 8238 132197 -28987 -380
5431 -380 -170857 -218996 -82643 5350 -77212 -185620 -326914 -151926 -159306 -180451 -200990
5420 -200990 -161069 84192 371477 337917 133900 101643 146752 148149 -50945 -304279 -361447
5409 -361447 -329310 -104877 -43896 -154953 -76178 233976 333525 328769 267639 115861 -107446
5398 -107446 -205298 -381001 -240925 -256479 -330352 -183638 -35218 -122684 -138061 -278231 -248967
5387 -248967 -25455 -119181 -298269 -244319 -221390 -161566 -329930 -396508 -197450 5076 56729
$$ packed form
5464A88735l699k64250q5624L9218Q2416n7928K45429J73870p4106Q5369l8423
5453B91007k07615j9300m806L1611J43394J42678j4140p8482k37675j18514J26364
5442E4522n5416J1642r6699m4162l4593o3883J23962J12865J23959j61184K8607
5431c80j70477m8139J36353Q7993q2562j08408j41294J74988p380k1145k0539
5420b00990L9921K45261K87285l3560k04017l2257M5109J397j99094k53334n7168
5409c61447L2137K24433O0981j11057P8775L10154R9549m756o1130j51778k23307
5398a07446r7852j75703J40076j5554p3873J46714J48420q7466j5377j40170K9264
5387b48967K23512r3726j79088N3950K2929N9824j68364o6578J99058K02526N1653
$$ plain form
5376 56729 139412 -62777 -97517 -259443 -368763 -166518 -102660 -103398 -293209 -250468 -257327
5365 -257327 -203466 -66151 -38251 73430 -143066 -188733 -29790 131700 47023 43626 -242593
5354 -242593 -236881 -194534 -145845 -59263 106456 262134 438295 487751 286738 118880 -84313
5343 -84313 9041 79960 -103539 -189078 -249180 -142362 -20668 81629 70611 -97364 -167707
5332 -167707 -201854 -67011 35279 116743 121438 59109 61611 154692 170660 311359 151990
5321 151990 -87084 -100518 -171098 -169652 -58192 139855 -10213 -163845 -39809 22587 -59987
5310 -59987 -121209 -92982 68610 18095 2091 -136797 -302781 -326165 -126220 10256 41803
5299 41803 -109972 -174273 -225338 -134344 124626 88754 -142922 -23976 42665 -150835 -243251
$$ packed form
5376E6729Q2683k02189l4740j61926j09320K02245O3858p38j89811M2741o859
5365b57327N3861J37315K7900J11681k16496m5667J58943J61490q4677l397k86219
5354b42593N712M2347M8689Q6582J65719J55678J76161M9456k01013j67858k03193
5343h4313R3354P0919j83499q5539o0102J06818J21694J02297j1018j67975p0343
5332a67707l4147J34843J02290Q1464M695o2329K502R3081J5968J40699j59369
5321A51990k39074j3434p0580J446J11460J98047j50068j53632J24036O2396q2574
5310e9987o1222K8227J61592n0515j6004j38888j65984k3384J99945J36476L1547
5299D1803j51775o4301n1065R0994K58970l5872k31676J18946O6641j93500r2416
$$ plain form
5288 -243251 -93549 225271 302227 -15576 -247099 -214920 -153468 -88153 7314 -73894 -90895
5277 -90895 -151298 42531 40646 229597 311925 211845 47832 -121302 -126175 -115346 -16588
5266 -16588 199624 107738 119189 24530 -68549 -185335 -201324 -143627 -63947 -121526 -11073
5255 -11073 156750 71423 -14250 -189627 -122141 -62322 -58732 -101215 -269613 -440412 -386203
5244 -386203 -43345 -46730 -62151 -113233 226302 513798 351205 28265 156351 239635 -35842
5233 -35842 140939 131524 73655 73198 34164 -93325 -53142 115543 205996 237578 107298 -71280
5221 -71280 -172456 -153081 -187596 -87931 -92337 -35055 -103577 -32986 32693 -109940 -159502 -93506
5209 -93506 -41930 -155599 -143523 -83401 191064 273843 246015 -3112 -124976 -109625 -280771
$$ packed form
5288b43251J49702L18820P6956l17803k31523L2179O1452O5315R5467q1208j7001
5277i0895o0403J93829j885J88951Q2328j00080j64013j69134m873J0829R8758
5266a6588K16212r1886J1451r4659r3079j16786j5989N7697P9680n7579J10453
5255a1073J67823q5327q5673j75377O7486N9819L590m2483j68398j70799N4209
5244c86203L42858l385j5421n1082L39535K87496j62593l22940J28086Q3284k75477
5233c5842J76781r415n7869m57l9034j27489M0183J68685R0453L1582j30280j78578
5221g1280j01176J9375l4515R9665m406N7282o8522P0591O5679j42633m9562O5996
5209i3506N1576j13669J2076O0122K74465Q2779k7828k49127j21864J5351j71146
$$ plain form
5198 -280771 -296154 -264158 -182202 -18893 -130836 -204970 21168 181927 349062 401700 233688
5187 233688 -105844 -214467 -217007 -111122 -47820 21046 -63459 -13936 -133938 -272358 -312863
5176 -312863 -251979 -199378 -389850 -373319 -14202 205514 216789 141382 180365 272133 162190
5165 162190 -201872 -489442 -407872 -299653 -307836 -275613 -259396 -200926 -291008 -432831 -422333
5154 -422333 -494039 -455002 -375685 -381567 -159739 18460 14841 -44877 -12606 12834 128790
5143 128790 128196 294966 153574 102040 255604 481525 265332 167493 56112 17370 -133623
5132 -133623 -180263 36567 7628 17708 4977 -22513 -26454 -114767 -194252 -218826 -95512
5121 -95512 85614 123324 84673 -119831 -91246 -76103 -125247 73053 -47181 -177372 -190805
$$ packed form
5198b80771j5383L1996Q1956J63309j11943p4134K26138J60759J67135N2638j68012
5187B33688l39532j08623k540J05885O3302O8866q4505M9523j20002j38420m0505
5176c12863O0884N2601j90472J6531L59117K19716J1275p5407L8983R1768j09943
5165A62190l64062k87570Q1570J08219q183L2223J6217N8470r0082j41823J0498
5154d22333p1706L9037P9317n882K21828J78199l619n9718L2271K5440J15956
5143A28790n94J66770j41392n1534J53564K25921k16193r7839j11381l8742j50993
5132a33623m6640K16830k8939J0080j2731k7490l941q8313p9485k4574J23314
5121i5512J81126L7710l8651k04504K8585J5143m9144J98300j20234j30191j3433
$$ plain form
5110 -190805 -137624 -45663 -11328 -14389 50648 61572 -83523 -18655 -138486 -210469 80224
5099 80224 277437 94723 123510 261614 29412 -285052 -272968 99387 283768 100916
5089 100916 108380 70035 88283 80822 154266 107604 -62255 -280259 -279314 -237080 -75890 -81829
5077 -81829 -55195 559 -22335 -126202 -16358 173596 25220 -198267 -244699 -204408 -227326
5066 -227326 -363450 -329015 -223438 -93969 -67778 -62691 21928 179631 329713 252233 354360
5055 354360 348537 150893 180917 112585 58363 12305 80435 -60288 -184236 -144749 -10752
5044 -10752 15504 -58278 35412 35887 71072 31283 2046 -153218 -156260 -6159 303450 396474
5032 396474 296381 103994 98707 126705 -96217 -41967 40188 122981 185445 79253 62345
$$ packed form
5110a90805N3181R1961L4335l061O5037J0924j45095O4868j19831p1983K90693
5099H0224J97213j82714K8787J38104k32202l14464J2084L72355J84381j82852
5089A00916P464l8345J8248p461P3444m6662j69859k18004R45M2234J61190n939
5077h1829K6634N5754k2894j03867J09844J89954j48376k23487m6432M0291k2918
5066b27326j36124L4435J05577J29469K6191N087Q4619J57703J50082p7480J02127
5055C54360n823j97644L0024o8332n4222m6058O8130j40723j23948L9487J33997
5044a0752K6256p3782R3690M75L5185l9789k9237j55264l042J50101L09609R3024
5032C96474j00093j92387n287K7998k22922N4250Q2155Q2793O2464j06192j6908
$$ plain form
5021 62345 -14435 -47456 -121494 -144668 -31647 -3507 60403 -79992 -146148 112121 170198
5010 170198 -35049 163068 193320 45404 -3645 2387 153980 184154 177745 -3800 -49858
4999 -49858 152154 117733 -29499 -182485 -117148 -119999 -325810 -384203 -397767 -361973 -223794
4988 -223794 -139423 -171905 -18308 40972 -118620 2359 275130 270666 186943 57120 55170
4977 55170 -94492 -163825 -86468 -126878 -24831 318115 282075 -146418 -186345 -185195 -140908
4966 -140908 -143366 -309164 -159145 -23471 -92225 -33424 1140 12409 11677 -7388 -256380
4955 -256380 -314509 -186655 -206430 -27518 -67956 -68980 176743 190371 189367 212135 484742
4944 484742 430497 331976 157066 77069 95557 -13819 -95217 13176 161063 61581 -39874
$$ packed form
5021F2345p6780l3021p4038k3174J13021K8140O3910j40395o6156K58269N8077
5010A70198k05247J98117L0252j47916m9049O032J51593L0174o409j81545m6058
4999d9858K02012l4421j47232j52986O5337k851k05811n8393j3564L5794J38179
4988b23794Q4371l2482J53597N9280j59592J20979K72771m464q3723j29823j950
4977E5170j49662o9333P7357m0410J02047L42946l6040m28493l9927J150M4287
4966a40908k458j65798J50019J35674o8754N8801L4564J1269p32j9065k48992
4955b56380n8129J27854j9775J78912m0438j024K45723J3628j004K2768K72607
4944D84742n4245r8521j74910p9997J8488j09376q1398J08393J47887r9482j01455
$$ plain form
4933 -39874 -33628 88969 178290 441182 392868 323101 178192 74938 96596 207101 15526
4922 15526 74085 181153 81007 -7523 189694 437282 431688 251255 78370 -79271 -101097
4911 -101097 -175274 -337145 -87495 148489 262855 189464 90600 -37712 -160635 -137516
4901 -137516 -327934 -571902 -433025 -282576 -116499 -69223 7687 6601 -86532 -117931 -166507
4890 -166507 -372358 -414620 -232708 -222003 -329063 -333053 -208090 -19639 110460 230285
4880 230285 125344 -48151 -317540 -221870 -185972 -351746 -277729 -149223 -315661 -288405
4870 -288405 86802 215370 129264 -184750 -247033 -176474 -30720 -57441 110482 118138 84417
4859 84417 -17216 -168244 -76581 82654 62709 -64084 -243206 -262531 -316151 -237742 -204280
$$ packed form
4933c9874O246J22597Q9321K62892m8314o9767j44909j03254K1658J10505j91575
4922A5526N8559J07068j00146q8530J97217K47588n594j80433j72885j57641k1826
4911a01097p4177j61871K49650K35984J14366p3391r8864j28312j22923K3119
4901a37516j90418k43968J38877J50449J66077M7276P6910j086r3133l1399m8576
4890a66507k05851m2262J81912J0705j07060l990J24963J88451J30099J19825
4880B30285j04941j73495k69389R5670L5898j65774P4017J28506j66438K7256
4870b88405L75207J28568q6106l14014o2283P0559J45754k6721J67923P656l3721
4859H4417j01633j51028R1663J59235j9945j26793j79122j9325n3620P8409L3462
$$ plain form
4848 -204280 -125472 -194694 -175552 -179026 -194595 -126967 -13723 -17454 114507 39528 3380 -29947
4836 -29947 -116575 -130262 -17498 144193 176262 106910 136780 -152077 -244460 -32890 232215
4825 232215 297652 141957 272920 195151 121791 -40542 -168638 -373414 -551050 -512797
4815 -512797 -248230 -58235 108979 74061 30909 43448 145765 20161 -210853 -187151
4805 -187151 -116342 -118877 -243535 -301034 -396561 -333974 -191128 -160732 -104750 -151662 -116229
4794 -116229 -282521 -426230 -391610 -357375 -56997 14412 66074 38187 19225 -103080 -136949
4783 -136949 -91657 -187915 -441379 -443404 -304009 -297090 9259 128375 11568 78252 209807
4772 209807 140406 -49017 -143539 53840 97717 69453 191291 243350 261377 140788 -127169
$$ packed form
4848b04280P8808o9222J9142l474j5569O7628J13244l731J31961p4979l6148l3327
4836b9947q6628j3687J12764J61691L2069o9352K9870k88857r2383K11570K65105
4825B32215O5437j55695J30963p7769p3360j62333j28096k04776j77636L8253
4815e12797K64567J89995J67214l4918m3152J2539J02317j25604k31014K3702
4805a87151P0809k535j24658n7499r5527O2587J42846L0396N5982m6912L5433
4794a16229j66292j43709L4620L4235L00378P1409N1662k7887j8962j22305l3869
4783a36949M5292r6258k53464k025J39395O919L06349J19116j16807O6684J31555
4772B09807o9401j89423r4522J97379M3877k8264J21838N2059J8027j20589k67957
$$ plain form
4761 -127169 -101012 -131936 -369827 -218606 -97242 -165829 -254268 -239606 -63505 -67542 -18684
4750 -18684 155884 146784 -69268 -203897 -38207 88483 181591 77748 -64153 -207653
4740 -207653 -179764 -57763 -92477 -307613 -245072 -116138 -270859 -379906 -472837 -339764
4730 -339764 -448083 -595892 -347741 -167907 -32354 -151 -105812 -21721 27907 22872 130643
4719 130643 226404 163221 132640 318696 316334 25061 -191268 -233740 -338132 -391724 -266276
4708 -266276 -259596 -219922 -104883 134854 197776 77633 128054 -27344 -68369 32216 107918
4697 107918 57802 215534 285117 50125 -208367 -220863 -183486 -165014 -188037 -108374 41901
4686 41901 127154 34530 -77640 15301 84902 -31671 -178616 -128411 -144216 -196894 -448211
$$ packed form
4761a27169K6157l0924k37891J51221J21364o8587q8439J4662J76101m037M8858
4750a8684J74568r100k16052j34629J65690J26690R3108j03843j41901j43500
4740b07653K7889J22001l4714k15136O2541J28934j54721j09047r2931J33073
4730c39764j08319j47809K48151J79834J35553L2203j05661Q4091M9628n035J07771
4719A30643R5761o3183l0581J86056k362k91273k16329m2472j04392n3592J25448
4708b66276O680L9674J15039K39737O2922j20143N0421j55398m1025J00585P5702
4697A07918n0116J57732O9583k34992k58492j2496L7377J8472k3023P9663J50275
4686D1901Q5253r2624j12170R2941O9601j16573j46945N0205j5805n2678k51317
$$ plain form
4675 -448211 -264513 -47033 139818 242458 156731 88648 112735 147412 31683 -220512
4665 -220512 -271490 -117813 -175165 -189020 -23543 47925 -114512 -152523 -79787 -127270 -152670
4654 -152670 -134874 -173091 -141076 61565 124950 34459 -179091 -373939 -448490 -348153 -319087
4643 -319087 15865 405728 420725 84827 45493 123322 20249 -75474 80587 162348 126805
4632 126805 102876 148242 124187 89430 164411 72869 -117701 -62382 211360 -13015 -120495
4621 -120495 -78149 -73617 68209 161879 175243 73557 -16467 -164713 -104762 -6265 169803
4610 169803 553667 581944 274141 48231 -8443 -85539 -6964 -127179 -130481 117238 133106
4599 133106 219361 339833 225652 151904 199879 257381 140616 15270 2760 -68008 -31575
$$ packed form
4675d48211J83698K17480J86851J02640q5727o8083K4087L4677j15729k52195
4665b20512n0978J53677n7352j3855J65477P1468j62437l8011P2736m7483k5400
4654a52670J7796l8217L2015K02641O3385r0491k13550j94848p4551J00337K9066
4643c19087L34952L89863J4997l35898l9334P7829j03073r5723J56061Q1761l5543
4632A26805k3929M5366k4055l4757P4981r1542j90570N5319K73742k24375j07480
4621a20495M2346M532J41826R3670J3364j01686r0024j48246N9951R8497J76068
4610A69803L83864K8277l07803k25910n6674p7096P8575j20215l302K47719J5868
4599A33106Q6255J20472j14181p3748M7975N7502j16765j25346j2510p0768L6433
$$ plain form
4588 -31575 118376 68687 55370 108216 -19667 -135522 61707 104091 5941 237509 332428
4577 332428 154322 59301 -166552 -136432 -163024 -311453 -416802 -276911 -158065 -265958
4567 -265958 -565872 -694311 -618783 -543202 -143610 61391 301226 377629 53512 -55647
4557 -55647 -56104 -25112 -237221 -398898 -274305 -259093 -41311 -62546 27423 45921 -235395
4546 -235395 -345536 -107658 -110931 -340857 -363169 -233995 -258623 -271212 -137531 88375 139372
4535 139372 179552 291965 111845 -83465 -23229 67366 117650 101289 -81033 -13137 64357
4524 64357 183644 382283 503582 313649 90255 -27426 -55762 -423 99030 61356 -49341
4513 -49341 -134642 -57893 27508 -37449 -2379 98138 -60879 61466 -60255 -61107 50266
$$ packed form
4588c1575J49951m9689j3317N2846j27883j15855J97229M2384r8150K31568R4919
4577C32428j78106r5021k25853L0120k6592j48429j05349J39891J18846j07893
4567b65958k99914j28439P5528P5581L99592K05001K39835P6403l24117j09159
4557e5647m57L0992k12109j61677J24593J5212K17782k1235Q9969J8498k81316
4546b35395j10141K37878l273k29926k2312J29174k4628j2589J33681K25906N0997
4535A39372M0180J12413j80120j95310O0236R0595N0284j6361j82322O7896P7494
4524F4357J19287J98639J21299j89933k23394j17681k8336N5339R9453l7674j10697
4513d9341q5301P6749Q5401o4957L5070J00517j59017J22345j21721q52J11373
$$ plain form
4502 50266 196112 110467 -62542 -192964 34744 259668 207685 153996 196141 -7104 90192
4491 90192 182466 125487 194049 91888 -125664 -85613 -26055 -32601 -85102 -37385 145809
4480 145809 212705 62774 -233737 -222054 -4327 166197 109610 -7679 -126689 -263866
4470 -263866 -175275 -103730 -263932 -301871 -214516 -123669 -35963 -13466 -7051 80247 87812 -41388
4458 -41388 -56888 -154211 -223713 -157400 -125059 72238 234095 323094 305594 113826 -226
4447 -226 -53132 -216201 -224007 -196777 -191665 -218438 -282404 -223483 38228 -88673 -170158 -160758
4435 -160758 -148604 -211395 -356123 -165000 112191 106946 66481 57086 166006 85027 212061
4424 212061 128900 -14516 -85101 -118545 -167603 -205706 -122640 -52562 70253 -184761 -399213
$$ packed form
4502E0266J45846q5645j73009j30422K27708K24924n1983n3689M2145k03245R7296
4491I0192R2274n6979O8562j02161k17552M0051N9558o546n2501M7717J83194
4480A45809O6896j49931k96511J1683K17727J70524n6587j17289j19010j37177
4470b63866Q8591P1545j60202l7939Q7355R0847Q7706K2497O415Q7298P565j29200
4458d1388j5500r7323o9502O6313L2341J97297J61857Q8999j7500j91768j14052
4447b26n2906j63069p806K7230N112k6773o3966N8921K61711j26901q1485R400
4435a60758J2154o2791j44728J91123K77191n245m0465r395J08920q0979J27034
4424B12061q3161j43416p0585l3444m9058l8103Q3066P0078J22815k55014k14452
$$ plain form
4413 -399213 -281096 135442 368977 194297 -12118 -115086 -291528 -206902 -268062 -207959
4403 -207959 -24180 -141479 -151218 18248 -166522 -137813 75405 219475 154564 121347 153487
4392 153487 345961 165727 128770 271859 118328 118054 -26061 137460 176801 -6991 -203748
4381 -203748 -313206 -114443 107607 52513 29049 248129 360047 200791 -246282 -415094
4371 -415094 -165817 -173585 12909 152098 196898 44797 -200025 -67640 81656 -18535
4361 -18535 6077 14073 -27088 -29969 -85178 131538 180446 255080 -9830 -257352 -194431 -161062
4349 -161062 -95749 -172399 -259870 -129977 -20669 103444 201448 293894 249958 10222 -47673
4338 -47673 -3477 -126177 -175849 -63739 -71786 90112 82800 -11092 -94471 110329 118292 9033
$$ packed form
4413c99213J18117M16538K33535j74680k06415j02968j76442Q4626o1160O0103
4403b07959J83779j17299r739J69466j84770K8709K13218J44070o4911l3217L2140
4392A53487J92474j80234l6957J43089j53531k74j44115J63521L9341j83792j96757
4381b03748j09458J98763K22050n5094k3464K19080J11918j59256m47073j68812
4371d15094K49277p768J86494J39189M4800j52101k44822J32385J49296j00191
4361a8535K4612P996m1161k881n5209K16716M8908P4634k64910k47522O2921L3369
4349a61062O5313p6650q7471J29893J09308J24113R8004R2446m3936k39736n7895
4338d7673M4196j22700m9672J12110q047J61898p312r3892q3379K04800P963j09259
$$ plain form
4326 9033 -85130 -24333 16923 140910 295635 329446 195160 107831 222488 -127154 -230210
4315 -230210 -98402 -153351 -165851 -54652 -1240 49936 -143774 -257166 -142160 -138252 -236738
4304 -236738 -83465 -37074 13986 18302 -88477 -97314 -125923 31245 116299 130354 5702
4293 5702 -79522 -43374 -98237 50141 40897 55583 -134363 -223599 -164786 -207333 -175642 189484
4281 189484 404741 270355 232600 151841 63254 87910 136894 133498 155746 81098 -99357
4270 -99357 -121506 150744 390065 656475 686229 418983 199335 203244 224468 62228 71588
4259 71588 179844 165902 -101637 -130132 231743 297799 139886 -5522 -8121 45969 21508
4248 21508 -664 -375274 -358597 -331793 -64351 103324 75907 176622 136567 236303 204062
$$ packed form
4326I033r4163O0797M1256J23987J54725L3811j34286q7329J14657l49642j03056
4315b30210J31808n4949j2500J11199N3412N1176j93710j13392J15006L908r8486
4304b36738J53273M6391N1060M316j06779q837k8609J57168Q5054J4055j24652
4293E702q5224L6148n4863J48378r244J4686j89946q9236N8813m2547L1691L65126
4281A89484K15257j34386l7755q0759q8587K4656M8984l396K2248p4648j80455
4270i9357k2149K72250K39321K66410K9754k67246k19648L909K1224j62240R360
4259G1588J08256j3942k67539k8495L61875O6056j57913j45408k599N4090k4461
4248B1508k2172l74610J6677K6804K67442J67675k7417J00715m0055R9736l2241
$$ plain form
4237 204062 4601 -104356 -84829 -63460 17475 107996 48378 -126743 -190742 -50147 139872
4226 139872 -22845 -99691 38861 252694 82219 -206577 -265451 -102069 -27408 12878
4216 12878 134250 185117 134287 98949 75236 -5147 -169523 -213818 -257025 -59072 43745
4205 43745 -103537 -253729 -71386 13397 -39427 -61370 -45604 -252857 -270400 -199554 -320163
4194 -320163 -342576 -114001 161215 97209 174893 301751 121395 311653 384791 189121
4184 189121 12027 -114056 -338192 -337031 -82776 96374 -106464 -379870 -340314 -245183
4174 -245183 -307066 -86182 82413 -41583 167779 -38405 -200733 -192749 11222 157767
4164 157767 247535 83255 99043 160032 83951 -417403 -89543 174074 99727 -122524 -306117
$$ packed form
4237B04062j99461j08957J9527K1369Q0935R0521n9618j75121o3999J40595J90019
4226A39872j62717p6846J38552K13833j70475k88796n8874J63382P4661M0286
4216A2878J21372N0867n0830l5338k3713q0383j64376m4295m3207J97953J02817
4205D3745j47282j50192J82343Q4783n2824k1943J5766k07253j7543P0846j20609
4194c20163k2413K28575K75216o4006P7684J26858j80356J90258P3138j95670
4184A89121j77094j26083k24136J161K54255J79150k02838k73406L9556R5131
4174b45183o1883K20884J68595j23996K09362k06184j62328P984K03971J46545
4164A57767Q9768j64280J5788O0989p6081n01354L27860K63617p4347k22251j83593
$$ plain form
4153 -306117 -284580 -200768 -114966 -281673 -419494 -420569 -280376 -322411 -472253 -435733 -85326
4142 -85326 -11166 -130493 -146600 -97063 -15768 -8498 -68188 -211536 -331671 -421463 -322562
4131 -322562 -345924 -372388 -268645 -34241 -39831 -111634 -214090 -224755 -179379 -7763 -23421
4120 -23421 47558 110147 157366 63062 5673 -61111 85921 58061 -73186 25825 192104
4109 192104 23465 37563 48901 -137578 -66341 66919 112651 211533 -5483 -67777 148007
4098 148007 459162 494360 321906 260763 171985 36024 97366 374461 406848 319390 -63505
4087 -63505 -211727 -142268 -73141 -49662 -198888 -175193 91007 154094 135997 42840 -120037
4076 -120037 -264530 -317655 -156958 -237798 -292822 -50935 135708 194117 -26554 -92047 -41396
$$ packed form
4153c06117K1537Q3812Q5802j66707j37821j075J40193m2035j49842L6520L50407
4142h5326P4160j19327j6107M9537Q1295P270n9690j43348j20135q9792R8901
4131c22562k3362k6464J03743K34404n590p1803j02456j0665M5376J71616j5658
4120b3421P0979O2589M7219r4304n7389o6784J47032k7860j31247R9011J66279
4109A92104j68639J4098J1338j86479P1237J33260M5732R8882k17016o2294K15784
4098A48007L11155L5198j72454o1143q8778j35961O1342K77095L2387q7458l82895
4087f3505j48222O9459O9127K3479j49226K3695K66200O3087j8097r3157j62877
4076a20037j44493n3125J60697q0840n5024K41887J86643N8409k20671o5493N0651
$$ plain form
4065 -41396 19486 225061 162880 166372 209221 243173 186291 129085 65490 -102966 -45411 -70704
4053 -70704 68151 118296 369908 470737 366286 127427 -10395 18502 144125 162945
4043 162945 31606 5876 -77875 -2628 -17333 -67282 38238 238309 153546 -55445 -66048
4032 -66048 162319 144559 139273 164865 261491 135472 -3961 129232 166157 -53627 36359
4021 36359 159224 -68190 -43045 59310 -153631 -240160 -191032 -150827 -268716 -294515 -234634
4010 -234634 -210704 -157357 -235223 -303102 -310015 -274506 -357579 -160771 19037 -48047 -37063
3999 -37063 27811 11423 61364 78432 -128956 -196591 -337123 -322961 -232826 -51844 78381
3988 78381 273886 520174 445205 204065 -27592 -17546 -137478 -248276 13952 168925
$$ packed form
4065d1396O0882K05575o2181L492M2849L3952n6882n7206o3595j68456N7555k5293
4053g0704J38855N0145K51612J00829j04451k38859j37822K8897J25623J8820
4043A62945j31339k5730q3751P5247j4705m9949J05520K00071q4763k08991j0603
4032f6048K28367j7760n286K5592R6626j26019j39433J33193L6925k19784Q9986
4021C6359J22865k27414K5145J02355k12941q6529M9128M0205j17889k5799N9881
4010b34634K3930N3347p7866o7879o913L5509q3073J96808J79808o7084J0984
3999c7063O4874j6388M9941J7068k07388o7635j40532J4162R0135J80982J30225
3988G8381J95505K46288p4969k41140k31657J0046j19932j10798K62228J54973
$$ plain form
3978 168925 150440 27934 -91074 -155710 -63234 72563 244798 114158 -41939 77809
$$ packed form
3978A68925j8485j22506j19008o4636R2476J35797J72235j30640j56097J19748
$$ [...]
##END NTUPLES=NMR SPECTRUM
##END=
