##TITLE=Analysis number 322484
Compound Code cc 41413
Book Reference 467/78/2
Project Code adrs
Chemist Name benw
##JCAMPDX= 6.0         $$ Bruker NMR JCAMP-DX V2.0
##DATA TYPE= NMR SPECTRUM
##DATA CLASS= NTUPLES
##ORIGIN= Bruker BioSpin GmbH
##OWNER= nmr
$$ XWIN-NMR		Version 3.5
$$ Thu Sep 28 09:18:46 2006 GMT Daylight Time (UT+1h)  MAYBRIDGE\nmr@NMR_250MHZ
##.OBSERVE FREQUENCY= 250.131544655141
##.OBSERVE NUCLEUS= ^1H
##.ACQUISITION MODE= SIMULTANEOUS (DQD)
##.ACQUISITION SCHEME= undefined
##.AVERAGES= 16
##.DIGITISER RES= 18
##SPECTROMETER/DATA SYSTEM= dpx250
##.PULSE SEQUENCE= zg30
##.SOLVENT NAME= CDCl3
##.SHIFT REFERENCE= (INTERNAL, CDCl3, 0, 16.522)
##AUDIT TRAIL= $$ (NUMBER, WHEN, WHO, WHERE, WHAT)
$$ ##TITLE= Audit trail, XWIN-NMR		Version 3.5
$$ ##JCAMPDX= 5.01
$$ ##ORIGIN= Bruker BioSpin GmbH
$$ ##OWNER= nmr
$$ C:\u/data/dgb/nmr/ADRS/1520/pdata/1/auditp.txt
$$ ##AUDIT TRAIL=  $$ (NUMBER, WHEN, WHO, WHERE, WHAT)
(   1,<2006-09-28 09:18:14.31 +100>,<MAYBRIDGE\nmr>,<NMR_250MHZ>,
      <created by zg, POWCHK disabled, PULCHK disabled
       configuration hash MD5:
       E2 DF 36 D8 04 B2 41 60 5A D7 A3 38 5A 4B D0 FE
       data hash MD5: 64K
       8B 3C 26 BD C0 90 4E 5D C5 14 B3 44 C0 7C 12 EA>)
(   2,<2006-09-28 09:18:35.31 +100>,<MAYBRIDGE\nmr>,<NMR_250MHZ>,
      <Start of raw data processing
       ef LB = 0.3 FT_mod = 6 PKNL = 1 SI = 32K 
       data hash MD5: 32K
       EC C7 74 81 D6 F8 35 15 C9 14 4F D8 AB A9 1B CC>)
(   3,<2006-09-28 09:18:37.17 +100>,<MAYBRIDGE\nmr>,<NMR_250MHZ>,
      <apk 
       data hash MD5: 32K
       0D B2 81 AD D1 EB D8 65 6B D7 92 5F 13 80 FE 07>)
(   4,<2006-09-28 09:18:37.89 +100>,<MAYBRIDGE\nmr>,<NMR_250MHZ>,
      <abs ABSG = 5 
       data hash MD5: 32K
       88 29 AB FF 35 D7 90 FA FE 9D 46 76 33 90 BC BF>)
$$ ##END=
$$ 
$$ hash MD5
$$ F2 37 CF 1C D0 CC 0D 9E E6 63 AB B9 63 BB 59 04
##$RELAX= 
##$RELAX= 
##$RELAX= 
##$RELAX= 
##$RELAX= 
##$RELAX= 
##$RELAX= 
$$ Bruker specific parameters
$$ --------------------------
##$DU= <C:\u>
##$EXPNO= 1520
##$NAME= <ADRS>
##$PROCNO= 1
##$TYPE= <nmr>
##$USER= <dgb>
##$AMP= (0..31)
100 100 100 100 100 100 100 100 100 100 100 100 100 100 100 100 100 100 
100 100 100 100 100 100 100 100 100 100 100 100 100 100 
##$AQSEQ= 0
##$AQ_mod= 3
##$AUNM= <au_zg>
##$AUTOPOS= <19 >
##$BF1= 250.13
##$BF2= 250.13
##$BF3= 250.13
##$BF4= 250.13
##$BF5= 500.13
##$BF6= 500.13
##$BF7= 500.13
##$BF8= 500.13
##$BYTORDA= 1
##$CFDGTYP= 0
##$CFRGTYP= 5
##$CHEMSTR= <none>
##$CNST= (0..31)
1 1 145 1 1 1 1 1 1 1 1 1 1 1 1 1 1 1 1 1 1 1 1 1 1 1 1 1 1 1 1 1 
##$CPDPRG= <>
##$CPDPRG1= <>
##$CPDPRG2= <>
##$CPDPRG3= <>
##$CPDPRG4= <mlev>
##$CPDPRG5= <mlev>
##$CPDPRG6= <mlev>
##$CPDPRG7= <mlev>
##$CPDPRG8= <mlev>
##$CPDPRGB= <>
##$CPDPRGT= <>
##$D= (0..31)
0 1 0 0 0 0 0 0 0 0.06 0 0 0 0 0 0 0.0002 0 0 0 0 0 0 0 0 0 0 0 0 0 0 
0 
##$DATE= 1159431490
##$DBL= (0..7)
120 120 120 120 120 120 120 120 
##$DBP= (0..7)
150 150 150 150 150 150 150 150 
##$DBP07= 0
##$DBPNAM0= <>
##$DBPNAM1= <>
$$ [...]
##$SUBNAM7= <"">
##$SUBNAM8= <"">
##$SUBNAM9= <"">
##$SW= 20.6930455092707
##$SWIBOX= (0..15)
0 0 3 0 0 0 0 0 0 0 0 0 0 0 0 0 
##$SW_h= 5175.983436853
##$TD= 65536
##$TD0= 1
##$TE= 295.16
##$TE2= 300
##$TE3= 300
##$TEG= 300
##$TL= (0..7)
0 120 120 120 120 120 120 120 
##$TP= (0..7)
150 150 150 150 150 150 150 150 
##$TP07= 0
##$TPNAME0= <>
##$TPNAME1= <>
##$TPNAME2= <>
##$TPNAME3= <>
##$TPNAME4= <>
##$TPNAME5= <>
##$TPNAME6= <>
##$TPNAME7= <>
##$TPOAL= (0..7)
0.5 0.5 0.5 0.5 0.5 0.5 0.5 0.5 
##$TPOFFS= (0..7)
0 0 0 0 0 0 0 0 
##$TUNHIN= 0
##$TUNHOUT= 0
##$TUNXOUT= 0
##$USERA1= <user>
##$USERA2= <user>
##$USERA3= <user>
##$USERA4= <user>
##$USERA5= <user>
##$V9= 5
##$VALIST= <valist>
##$VCLIST= <CCCCCCCCCCCCCCC>
##$VD= 0
##$VDLIST= <DDDDDDDDDDDDDDD>
##$VPLIST= <PPPPPPPPPPPPPPP>
##$VTLIST= <TTTTTTTTTTTTTTT>
##$WBST= 1024
##$WBSW= 4
##$XGAIN= (0..3)
0 0 0 0 
##$XL= 0
##$YL= 0
##$YMAX_a= 321850
##$YMIN_a= -568389
##$ZGOPTNS= <>
##$ZL1= 120
##$ZL2= 120
##$ZL3= 120
##$ZL4= 120
##$ABSF1= 16.522
##$ABSF2= -4.171173
##$ABSG= 5
##$ABSL= 3
##$ALPHA= 0
##$AQORDER= 0
##$ASSFAC= 0
##$ASSFACI= 0
##$ASSFACX= 0
##$ASSWID= 0
##$AUNMP= <proc_1d>
##$AZFE= 0.1
##$AZFW= 0.1
##$BCFW= 0
##$BC_mod= 0
##$BYTORDP= 0
##$COROFFS= 0
##$CY= 12.5
##$DATMOD= 1
##$DC= 0
##$DFILT= <>
##$DTYPP= 0
##$F1P= 14.0000005364418
##$F2P= -0.99999901652339
##$FCOR= 0.5
##$FTSIZE= 32768
##$FT_mod= 6
##$GAMMA= 0
##$GB= 0
##$INTBC= 1
##$INTSCL= 1
##$ISEN= 128
##$LB= 0.3
##$LEV0= 0
##$LPBIN= 0
##$MAXI= 10000
##$MC2= 0
##$MEAN= 0
##$ME_mod= 0
##$MI= 0
##$NCOEF= 0
##$NC_proc= -3
##$NLEV= 6
##$NOISF1= 0
##$NOISF2= 0
##$NSP= 0
##$NTH_PI= 0
##$NZP= 0
##$OFFSET= 16.522
##$PC= 1
##$PHC0= 149.8542
##$PHC1= 6.888692
##$PH_mod= 1
##$PKNL= yes
##$PPARMOD= 0
##$PSCAL= 4
##$PSIGN= 0
##$REVERSE= no
##$SF= 250.13
##$SI= 32768
##$SIGF1= 0
##$SIGF2= 0
##$SINO= 400
##$SIOLD= 32768
##$SREGLST= <1H.CDCl3>
##$SSB= 0
##$STSI= 32768
##$STSR= 0
##$SW_p= 5175.98343685301
##$SYMM= 0
##$S_DEV= 0
##$TDeff= 65536
##$TDoff= 0
##$TI= <Analysis number 999999
Compound Code 99
Book Reference 9
Project Code 9>
##$TILT= no
##$TM1= 0
##$TM2= 0
##$TOPLEV= 0
##$USERP1= <user>
##$USERP2= <user>
##$USERP3= <user>
##$USERP4= <user>
##$USERP5= <user>
##$WDW= 1
##$XDIM= 32768
##$YMAX_p= 385428960
##$YMIN_p= -72012
$$ End of Bruker specific parameters
$$ ---------------------------------
##NTUPLES= NMR SPECTRUM
##VAR_NAME=  FREQUENCY,     SPECTRUM/REAL,   SPECTRUM/IMAG
##SYMBOL=    X,             R,               I
##VAR_TYPE=  INDEPENDENT,   DEPENDENT,       DEPENDENT
##VAR_FORM=  AFFN,          ASDF,            ASDF
##VAR_DIM=   32768,         32768,           32768
##UNITS=     HZ,            ARBITRARY UNITS, ARBITRARY UNITS
##FACTOR=    0.157963299565203, 1,           1
##FIRST=     4132.6476996994, 0,             0
##LAST=      -1043.33573715361, 0,           0
##MIN=       -1043.33573715361, -72012,      0
##MAX=       4132.6476996994, 385428960,     0
$$ Real data points
##PAGE= N=1
##DATA TABLE= (X++(R..R)), XYDATA
$$ [...]
18488A705262l3710k7803m4248m3100k5119j2618l3881m7382l9802k5539l0593
18477A341467m9847o3747o0544m8959l8397j1459J958k1930j8369m521j3486l0346
18465I81820k4949k2529l1685m9135k6102k3759m7016k8239j3221j7792j1187
18454F86206o458q434q80k4410j0081j334k7695k9417j6672M694r474j4824j1203
18441E30018j7182j8082l1417j6321J2005J9149J5463J720j9098k8325j9256j7958
18429D10716j2612j3044j6768K169l461j0165j3538l397J7820J365N951m4j6186
18416C48806Q474J7651k002r128Q43j5372j6633J655j3791j9385k6557J427p686
18403B68302L742J6739k234j9683q070n620j309j2985J1386J2875j5868l173l723
$$ plain form
18488 1705262 1671552 1643749 1599501 1556401 1531282 1518664 1484783 1437401 1397599 1372060 1341467
18477 1341467 1291620 1227873 1167329 1118370 1079973 1068514 1070472 1048542 1030173 1025652 1012166 981820
18465 981820 956871 934342 902657 853522 827420 803661 756645 728406 715185 697393 686206
18454 686206 679748 671314 670434 646024 635943 634609 606914 577497 560825 565519 556045 541221 530018
18441 530018 512836 494754 463337 447016 459021 478170 493633 495353 476255 447930 428674 410716
18429 410716 398104 385060 368292 370461 367000 356835 343297 339900 357720 359085 365036 364992 348806
18416 348806 357280 374931 372929 363801 364644 349272 332639 334294 320503 301118 274561 275988 268302
18403 268302 272044 288783 286549 266866 258796 253176 251867 238882 250268 263143 247275 244102 240379
18390B40379R95j3119p493J0538J2624k3322k2686J2388L198L280k3854q495J5752
18377B00185J2445j323o848J2259P848O392L1066K5473L2697J9458K3669N4107
18365D17428K9479K450k5754n0641m5831j5841m0930k6541k5645j9965K9l802
18353A94436q96M819Q557M0018N5644L7318M4947L2878R680J4054j0904l9191
18341C91360l6232l7828k5277k8956l1189p586r321M32Q46l275J5142J4853k0494
18328B22475j5610M828K318J0196m580R697j7297n744p228j0481j918q412n615
18315A72629J2240j3361q5J4026m1q076r03J688j3287n59K1986M639m111j6130
18301A70655q058r653L20P145l414j6488R889L2315K7103o626R806J7546K718
$$ plain form
18390 240379 241374 228255 220762 231300 243924 220602 197916 210304 213502 216782 192928 184433 200185
18377 200185 212630 211307 204459 216718 224566 230958 262024 287497 320194 339652 363321 417428
18365 417428 446907 449357 423603 372962 327131 311290 270360 243819 218174 198209 198238 194436
18353 194436 193540 198359 206916 246934 302578 339896 384843 417721 427401 441455 430551 391360
18341 391360 355128 317300 292023 263067 231878 224292 214971 215403 216249 212974 228116 242969 222475
18328 222475 206865 211693 214011 224207 219627 229324 212027 206283 199055 188574 186656 178244 172629
18315 172629 184869 171508 171423 185449 185408 177332 176429 178117 164830 164271 186257 190896 186785 170655
18301 170655 162597 152944 153264 160409 156995 140507 150396 182711 209814 203188 212994 230540 233258
18288B33258l774K1154R445p308O901J0090o432j9626J7589L4573K6504N751L025
18275C31150j6630K0978L9409J7344K7380L1525L8470J513k4340k00J5226j609
18263D80216m538n314n963j6109q05J2872r154j7404k0261j6871n902m892R30
18250C86805K699l266M726K690J021L1274Q896N271J8667J9392R984K3299L5383
18237E46841N9855O0705O6175N0722M5695N3730O9738N8441R7426J05055J19959
18226A334342J25371J73149K53036L09252L95076O16796Q98610J326194J830541
18217G262367K276950K654415K945627L104258L052059K662505K076022J605240
18209B7639443J169737M55179p61222k020894k661154k596277k348680k409045
$$ plain form
18288 233258 229484 250638 260083 252775 259676 269766 263334 243708 261297 295870 322374 328125 331150
18275 331150 314520 335498 374907 392251 419631 451156 489626 491139 466799 466599 481825 480216
18263 480216 475678 470364 464401 448292 447487 460359 451205 433801 413540 396669 390767 385875 386805
18250 386805 389504 386238 390964 393654 394675 425949 434845 440116 458783 478175 488159 511458 546841
18237 546841 606696 667401 733576 784298 829993 883723 953461 1011902 1109328 1214383 1334342
18226 1334342 1459713 1632862 1885898 2195150 2590226 3207022 4105632 5431826 7262367
18217 7262367 9539317 12193732 15139359 18243617 21295676 23958181 26034203 27639443
18209 27639443 28809180 29264359 28503137 26482243 23821089 21224812 18876132 16467087
18201A6467087k631429k625461k196177j588401j052532o78439m65425l49736
18193D879487k76686k00618j62983j55249j38140j01598r6539q9313p3230q2643
18183C502488o5180k4120O416N603K8993K3275N8109Q8474O9478R9450J63759
18172C956745K10525L01215M19229N85671R49520J490058K217426L091891L961794
18163A7184074M680911N217812N571953N539786M971481L950639L008679K275217
18155E2400552J103713q99998l267772m760052m879191m429307m350591m743729
18147B6173625m837364m192162l098889k073238j359560r13892o68617n24196
18139H505707m25257l50137l07613k84695k73207k52932k45196k24493k14089
$$ plain form
18201 16467087 13835658 11210197 9014020 7425619 6373087 5694648 5229223 4879487
18193 4879487 4602801 4402183 4239200 4083951 3945811 3844213 3747674 3658361 3585131 3502488
18183 3502488 3437308 3413188 3419604 3425207 3454200 3477475 3535584 3624058 3693536 3792986 3956745
18172 3956745 4167270 4468485 4887714 5473385 6422905 7912963 10130389 13222280 17184074
18163 17184074 21864985 27082797 32654750 38194536 43166017 47116656 50125335 52400552
18155 52400552 53504265 52604267 49336495 44576443 39697252 35267945 30917354 26173625
18147 26173625 21336261 17144099 14045210 11971972 10612412 9698520 9029903 8505707
18139 8505707 8080450 7730313 7422700 7138005 6864798 6611866 6366670 6142177 5928088
18130E928088j68394j31432j40444j12221j14342j27372j03501n7038j7673R774
18120D965445O5983J57814L17640O10507J188821K128213L163537L386706K633488
18111A8618154K090511J202430m45825n584692n423649k728043j380143q01346
18103E547397n07911l55833k61743k16980j49979q9016j04125j26449j11788j08089
18093C515484j11459o9712o4453n1763m3860k6294j6309o477K192o992O530K583
18081C129470m4824l7462j2141O422K7730N342K0170R510m6355q3878j23816q3607
18069B766561n8364m2466n7724j03227p0606l3580l8777l1191j8652k154K6603
18058B336423L4640L1361O7238Q3049P0425Q8278Q1332Q4566J35246J83631K07120
$$ plain form
18130 5928088 5759694 5628262 5487818 5375597 5261255 5133883 5030382 4973344 4955671 4965445
18120 4965445 5031428 5189242 5506882 6117389 7306210 9434423 12597960 15984666 18618154
18111 18618154 20708665 21911095 21465270 15880578 10456929 7728886 6348743 5547397
18103 5547397 5039486 4683653 4421910 4204930 4054951 3965935 3861810 3735361 3623573 3515484
18093 3515484 3404025 3334313 3269860 3218097 3174237 3147943 3131634 3125157 3127349 3120357 3126887 3129470
18081 3129470 3084646 3047184 3035043 3041465 3069195 3074537 3094707 3104217 3057862 2973984 2850168 2766561
18069 2766561 2708197 2665731 2608007 2504780 2434174 2400594 2361817 2330626 2311974 2309820 2336423
18058 2336423 2371063 2402424 2469662 2552711 2623136 2711414 2792746 2877312 3012558 3196189 3403309
18047C403309K88587M00354N51196Q35752J312907J974073K767084L659606M550306
18038A9743174N053227N036350M215830K964136J297331j028880j711202k151131
18030C3418835k158318m27659J012681J951147K409402J902158Q51584j280084
18022C7679746l188422l906368n049969m886744l857322l134009k197523j402234
18014A0057155r24497o16942m39413l52326k98857k63710k17735j89674j99774
18005F554227j95443j80479j80751j80340j66361j26894r0171o1749j9753j4194
17995E338092N134K0885L8936J28706L02769N18391Q50099J287650J796391K307159
17985A2594212K615823K688837K367984J720314Q95546m09627r40870j151407
$$ plain form
18047 3403309 3691896 4092250 4643446 5479198 6792105 8766178 11533262 15192868 19743174
18038 19743174 24796401 29832751 34048581 37012717 38310048 37281168 35569966 33418835
18030 33418835 31260517 30832858 31845539 33796686 36206088 38108246 38959830 37679746
18022 37679746 34491324 30584956 25534987 20648243 16790921 13656912 11459389 10057155
18014 10057155 9132658 8515716 8076303 7723977 7425120 7161410 6943675 6754001 6554227
18005 6554227 6358784 6178305 5997554 5817214 5650853 5523959 5433788 5372039 5352286 5338092
17995 5338092 5343226 5364111 5403047 5531753 5834522 6352913 7203012 8490662 10287053 12594212
17985 12594212 15210035 17898872 20266856 21987170 22882716 22473089 21532219 20380812
17977B0380812j334242m57009L92349R42570J338975J166750O36700m44908j674406
17968B0947591k083245k783058k869558k268936j900171j387816q77062n77564
17960F200181l86167k98507k36886k33645k00876j96270j70249j39769j26550
17951D211262j22761j42417j30538j21993j06906j12079o7999m7364m7580m7657
17941C263968p1156q0541q4951j26769j24719o6101o9963o7742m8579n2327p9825
17930B391295j17569j06062r5665n9946n5529l2156n5077l3236l5052m1228l3159
17919A726616l2939k2630k6178m7324n6384k6189m0168l3692j286k0199m9295
17908A370332k4155l0552k0329j5557j2945k8013j4973M944K0867k866l328O227
$$ plain form
17977 20380812 19046570 18589561 18981910 19924480 21263455 22430205 23066905 22621997 20947591
17968 20947591 18864346 16081288 13211730 10942794 9042623 7654807 6777745 6200181
17960 6200181 5814014 5515507 5278621 5044976 4844100 4647830 4477581 4337812 4211262
17951 4211262 4088501 3946084 3815546 3693553 3586647 3474568 3406569 3359205 3311625 3263968
17941 3263968 3192812 3112271 3027320 2900551 2775832 2709731 2639768 2572026 2523447 2471120 2391295
17930 2391295 2273726 2167664 2071999 2012053 1956524 1924368 1869291 1836055 1801003 1759775 1726616
17919 1726616 1693677 1671047 1644869 1597545 1541161 1514972 1474804 1441112 1439826 1419627 1370332
17908 1370332 1346177 1315625 1295296 1279739 1266794 1238781 1223808 1228752 1249619 1246753 1243425 1249652
17896A249652J7994L57k2266k5330O288J9936L1409q98k7570m4787m1410l0609
17884A132766j9033l1640j5429m0395o7775l6303k8356l7879l3195m1847k0749
17873G60165k1116r707j4468m019m462n27j632k3344j5007M616l7393l4323M163
17860F02946M10N906m307P649P316r103j2746J7545J8066R924K1099J2132K4911
17847G01748K1556m078l171j1160k940j7766j2313j657J0611K2707O567m5393
17835F64711l5472M581J2981K0027K0402R055K8179K7806L9171P2975P3856N4839
17823I93111R2751J21261J20326J15212J14937Q6848P8864O5659M4914M4085P8248
17812A956216J01412J25827J86155K68123L60201M81633O58142Q60795J172709
$$ plain form
17896 1249652 1267646 1268003 1245737 1220407 1226695 1246631 1278040 1277142 1249572 1204785 1163375 1132766
17884 1132766 1113733 1082093 1066664 1026269 958494 922191 893835 855956 822761 780914 760165
17873 760165 739049 729342 714874 710855 706393 705866 704234 680890 665883 670499 633106 598783 602946
17860 602946 603356 609262 604955 612604 619920 610817 598071 615616 633682 643606 664705 676837 701748
17847 701748 723304 719226 716055 704895 701955 684189 671876 670219 680830 703537 710104 664711
17835 664711 629239 633820 646801 666828 687230 696285 724464 752270 791441 864416 938272 993111
17823 993111 1085862 1207123 1327449 1442661 1557598 1644446 1723310 1788969 1833883 1877968 1956216
17812 1956216 2057628 2183455 2369610 2637733 2997934 3479567 4137709 4998504 6171213
17803F171213J716100K552532L796106N323185O845780P932311Q163098P112643
17795D9612968M605625Q71488l079755o414689q154145q118629o701280m583010
17787A8038573k676140j312435l68133M50209J376179K582170M139289N825551
17779B8055263P295169Q122254P850661O140910K922351j226454n179328q055350
17771D5925476r029578q367728o529227m470823k897675j917997j317677r70780
17763A0423991p25281n41110m39857l84976l42436k88363k52087k41677k29518
17754F978686k01390j71206j95974j87777j97214k27307k38346k43530k53367
17745E062575k14560j98770j74366j44245j60188j32598j12451j15576j09172
$$ plain form
17803 6171213 7887313 10439845 14235951 19559136 26404916 34337227 42500325 49612968
17795 49612968 54218593 55090081 52010326 45595637 37441492 29322863 22621583 18038573
17787 18038573 15362433 14049998 13681865 14132074 15508253 18090423 22229712 28055263
17779 28055263 35350432 43472686 51323347 57464257 60386608 59160154 53980826 45925476
17771 45925476 36895898 28528170 21998943 17528120 14630445 12712448 11394771 10423991
17763 10423991 9698710 9157600 8717743 8332767 7990331 7701968 7449881 7208204 6978686
17754 6978686 6777296 6606090 6410116 6222339 6025125 5797818 5559472 5315942 5062575
17745 5062575 4848015 4649245 4474879 4330634 4170446 4037848 3925397 3809821 3700649
17736C700649r4253r6736r4272r1616r2904p2988p8153q2226q9428q7300o2559
17725B758214n9204p8775p0377m3084l9646m8686n5352l9038m3825m2985m8499
17714B188743m7451m0750l7982m8334l9024k5058l5101l4568l5951k4924j0112
17703A809488o664Q637m43j9473o164o494p788k9640m9914n4394o8767o2043o9466
17690A436875p5879n9075n0273m6955n3475n7325k0551n570m5366k0786k1591
17679I80029l2968l4354k3960k0535j5477j4663j0705k0033l8741k9085k4854
17668G14654k3909L127j6027n744l28j1210P11j2071j9206j7016k079K555k4161
17655E89296l3174k8646L178K8096K0992L389l489O927M1471K0771k7505j4440
$$ plain form
17736 3700649 3606396 3509660 3415388 3323772 3230868 3157880 3079727 2997501 2908073 2820773 2758214
17725 2758214 2699010 2620235 2549858 2506774 2467128 2418442 2363090 2324052 2280227 2237242 2188743
17714 2188743 2141292 2100542 2062560 2014226 1975202 1950144 1915043 1880475 1844524 1819600 1809488
17703 1809488 1802824 1811461 1811018 1791545 1785381 1778887 1771099 1741459 1691545 1637151 1568384 1506341 1436875
17690 1436875 1360996 1301921 1251648 1204693 1151218 1093893 1073342 1067772 1022406 1001620 980029
17679 980029 947061 912707 888747 868212 852735 838072 827367 807334 768593 739508 714654
17668 714654 690745 693872 677845 672101 671773 660563 661274 649203 629997 612981 610902 613457 589296
17655 589296 556122 527476 530654 558750 579742 583131 579642 586569 628040 648811 621306 606866
17643F06866k0447j3485k6849k6519k9122o419M566k1490l8131l6504j0314j7547
17631C64605p591j0911j1972p948J3408L668j7628j5287k0918j4538j005j8187
17619B55696k7730N32J1321J6116K775j0343k0833J916j4738j0713j0709O936
17607B00226P343j6485J199J5645K482p77r307n318l800Q948j0097k5366k2000
17594A42693r957j815J4703m912k3979P00o7j3271J2439M881j7389P566J9382
17581A30974l763q218j1134m517J096p855j015j8338j0685J3615J5556J7503k610
17568A10609k313J6556j8631r23m236k1427j1349K664J0354m073j604p193N184
17555G3618M356k411p97j2810j7371l671J0017M3316J3080o812J8224L0026M2821
$$ plain form
17643 606866 586419 572934 546085 519566 490444 484025 488591 467101 428970 392466 382152 364605
17631 364605 357014 346103 334131 326183 339591 343259 325631 310344 289426 274888 273883 255696
17619 255696 227966 228498 239819 255935 258710 248367 227534 229450 214712 203999 193290 200226
17607 200226 207569 191084 192283 207928 210410 209633 200326 195008 191208 200156 190059 164693 142693
17594 142693 132736 130921 145624 140712 116733 117433 117366 104095 116534 121415 104026 111592 130974
17581 130974 127211 118993 107859 103342 104438 96583 95568 77230 66545 80160 95716 113219 110609
17568 110609 108296 124852 106221 105298 101062 79635 68286 70950 81304 77231 75627 68434 73618
17555 73618 77974 75563 74766 61956 44585 40914 50931 94247 107327 100515 118739 148765 191586
17542A91586K8656J202K537O903J213l7576j6498j476m204J2022J1931J1649l191
17529B04754o561p942j6522l0897j7255J0009j6480r215j4045l5335m129o690
17517D9692l924r267N9r462J1001k748J9343J4134k045J690j9129k9407l377J4684
17503C1244n638k075j476N516J3021J2415O588L96l692P869L346K7371K5610J4894
17489A35389K669J9196K0364J3040j0446j5398K362m858l569J6618m157k5101
17477A46109J5721K8617j3189j2253j8743k9735j4884p982n194J14j8207j2182
17465E8192m379J8669J3004J749J5707J90k1237k8432M666K1116j5570J006K897
17452F7578j469J1818l691J3778R92K408K1404K8427J1275M58k172l1955j4448
$$ plain form
17542 191586 220242 221444 223981 230884 232097 194521 178023 176547 172343 184365 196296 207945 204754
17529 204754 198193 190251 173729 142832 125577 135586 119106 109891 95846 60511 56382 49692
17517 49692 45768 36501 36560 27098 38099 35351 54694 68828 66783 68473 49344 19937 16560 31244
17503 31244 25606 23531 22055 27571 40592 53007 59595 59991 56299 64168 67514 94885 120495 135389
17489 135389 138058 157254 177618 190658 180212 164814 167176 162318 158749 175367 171210 146109
17477 146109 161830 190447 177258 165005 146262 116527 101643 93661 88467 88581 70374 58192
17465 58192 53813 72482 85486 87235 102942 103132 81895 53463 58129 79245 63675 64681 67578
17452 67578 66109 77927 74236 88014 89006 91414 112818 141245 152520 152978 150806 118851 104403
17439A04403j4951j2816r943m569J3842K6486K4973K3033J5065K7847J9267L0971
17427B43608K7042L7685M0966K4234P53M946j3952q201N238J642k497J9313j3116
17414C67661k2755j5839j3207r200J0455J7837J3907Q811K4868k52k5717j3259
17402C43310j8598j9828p688j5240l6309n2552l8915k0625k783J1282Q157O081
17390A56292P019J9463K9421K6881M2464J1471j4833O518N068n180k9101j5003
17378B40480m8070n5642k2305k3237r066N943N78q705q739Q51k1645P779M033
17365F2255j2047j2124n47K5500N694l1413J1581N805m857j466j3781j3901q435
17352A2264J5882K9778J182n114L517o858j8225k1190J919R029R374J277p163
$$ plain form
17439 104403 89452 76636 66693 62124 75966 102452 127425 150458 165523 193370 212637 243608
17427 243608 270650 308335 349301 373535 374288 379234 365282 357081 362319 363961 361464 380777 367661
17414 367661 344906 329067 315860 306660 317115 334952 348859 357670 382538 382286 356569 343310
17402 343310 324712 304884 297196 281956 245647 193095 154180 133555 130772 142054 150211 156292
17390 156292 163311 182774 212195 239076 281540 293011 278178 284696 289764 284584 255483 240480
17378 240480 192410 136768 114463 91226 82160 88103 88681 79976 71237 72088 50443 58222 62255
17365 62255 50208 38084 37537 63037 68731 37318 48899 54704 49847 48381 34600 20699 12264
17352 12264 28146 57924 59106 53992 57509 50651 32426 11236 13155 22184 31558 32835 25672
17339B5672M271M652k4250k758K4030L655N441m992j8117j2611J3905K0208r784
17326B9322j0892L742l089J5905J3200n710j9801k4802K3512m95j5092O140K1009
17313C2949P560l23l626j6826j7045J7329r34j371J8798Q230q844P33l009l904
17299B9717M809P553j1519j4479j362J3339j1266j5498Q481k232m174K6947P742
17286C8058k2528m430J959Q158k034N72n958P571J5151J5588q188j9858j8917
17273E144O511r982k1770K26J0190J5418j396J3071P920j0863r571K687J1720
17260A9305k059j3276j6333R178l52q637p297J3452j0416K57r104L31N201K1139
17246A389N853j1823l500K212L2370N114l1197l976J5277l230p547o707N501p304
$$ plain form
17339 25672 29943 34595 10345 7587 31617 35272 40713 35721 17604 4993 18898 39106 29322
17326 29322 18430 22172 19083 34988 48188 42478 22677 -2125 21387 20892 5800 11940 32949
17313 32949 40509 40186 36560 19734 2689 20018 19084 17713 36511 44741 35897 36630 33621 29717
17299 29717 34526 42079 30560 16081 14719 28058 16792 1294 9775 7543 3369 30316 38058
17286 38058 15530 11100 13059 21217 19183 19755 13797 21368 36519 52107 43919 24061 5144
17273 5144 11655 1673 -20097 -19871 -9681 5737 4341 17412 25332 14469 4898 7585 19305
17260 19305 17246 3970 -12363 -3185 -3537 -12174 -19471 -6019 -16435 -16178 -25282 -24951 -19750 1389
17246 1389 7242 -4581 -8081 -5869 26501 31615 418 -3558 11719 8489 942 -5765 -264 -7568
17232g568L094J3735J3483o850P016L3877J3858k077K774L4672K8640L5213M0678
17219B10545J4161K8232O180N570k1395l1145m9849k2098n643Jk0268q677Q922
17206A14536J1736Q479J0094K0361L5058M2281N4183L4449J7241j9432l2930j9176
17194B76880l9502n9534m3441m0130k6552o78m114Q638k257j4363o212r506j9903
17181A9326J431K1598K1735j1508j6499L894r651r851L913M319m9j4042Q844k571
17167B0889J9478J3928M723p828R210L421L611J0817p364j8148j5088k1500j1622
17154D527r24K778J5170m775J336j0942R812n6M729J3225n302o386P224J2806
17140D3222n636J2841m545k7773J7904K1450q640j3971K6307P474j0878j0386
$$ plain form
17232 -7568 -4474 9261 22744 15894 22910 56787 70645 68568 71342 106014 134654 169867 210545
17219 210545 224706 252938 259118 264688 243293 212148 162299 140201 134558 134559 114291 105614 114536
17206 114536 126272 134751 144845 165206 200264 242545 296728 331177 348418 328986 296056 276880
17194 276880 237378 177844 134403 94273 67721 67043 62929 71567 69310 54947 48735 39229 19326
17181 19326 20757 42355 64090 52582 36083 39977 30326 20475 24388 28707 28658 14616 23460 20889
17167 20889 40367 54295 59018 51190 60400 63821 67432 78249 70885 52737 37649 16149 4527
17154 4527 3603 6381 21551 16776 18112 7170 16982 16926 21655 34880 29578 23192 30416 43222
17140 43222 37586 50427 45882 18109 36013 57463 48823 34852 61159 68633 57755 47369
17128D7369O071n274K976j007k2677j3529J3100P337M288j1954J9613R417p92
17115E4938R178R988j3765k2386O374M723J0836n513N88o489j458j5073K0804
17102E2745R93q044j7250r006k148R130k262j8813k1918J1873l670J9706K0067
17089C1403l83M353L591k4458m679L838p115m713R263J1773j7180l015J2949J7621
17075C3248Q038L393p197r473q235Q153J8971K0422P682k2712j3623p619o194
17062B4854l941j2215Q895L4338J0295n965j7758k203r824J42P475l912J2747
17049D2928o782Q511l517P578J0494o705n534l02J4359O751J1028o798j1867L768
17035F3912K5482J3376k8961j6168j2302j7616k01J076o80J541J6560n874K306
$$ plain form
17128 47369 53440 48166 51142 50135 27458 13929 27029 34366 38654 26700 46313 55730 54938
17115 54938 64116 74104 60339 37953 44327 49050 59886 54373 54961 48472 47014 31941 52745
17102 52745 53738 45694 28444 19438 17290 26420 24158 5345 -16573 -4700 -8370 11336 31403
17089 31403 31020 35373 38964 14506 9827 13665 6550 1837 11100 22873 5693 2678 15627 33248
17075 33248 41286 44679 37482 28009 19774 27927 46898 67320 75002 52290 38667 31048 24854
17062 24854 20913 8698 17593 51931 62226 56261 38503 36300 26476 26618 34093 30181 42928
17049 42928 36146 44657 41140 48718 59212 52507 46973 46671 61030 67781 78809 72011 60144 63912
17035 63912 89394 102770 73809 57641 45339 27723 27522 28598 27918 29459 46019 40145 42451
17022D2451l464J1927K158j8456q520K5427J6532R958N900n080k679p315j9197
17009D9642j203L800o865n453O283L207J4440K190m65M633j5117k2582M463j1556
16995B5417J1023P356J1521j725j777k84l101j217K8235J5692J553l90K4803J4372
16981A31478j2130q052j9916L697J3218P167j370j6325j7502M710J4240J829N778
16968A06822R26R494J0758k05N093n84j2546n648J123j1467j363J1405N069K383
16954A21260j785m126l695O579M029J4505J3505n432j7617J3498J6902Q127j00
16941A65650o587J450M33n338J7058L026j5320q005j084L2416J0893R143J0647
16928B14382J2356J223p78J4422L9241M0678N1175O4805P1683P0961M1439M5139
$$ plain form
17022 42451 38987 50914 53072 34616 26096 51523 68055 78013 83913 78833 76154 68839 49642
17009 49642 48439 52239 45374 39921 46204 49411 63851 66041 65576 70209 55092 32510 36973 25417
16995 25417 36440 43796 55317 53592 51815 51531 48430 47213 75448 91140 92693 92303 117106 131478
16981 131478 119348 111296 91380 95077 108295 115462 114092 97767 80265 84975 99215 101044 106822
16968 106822 107748 117242 128000 127795 132888 132304 119758 114110 115233 103766 102403 113808 118877 121260
16954 121260 119475 115349 111654 118233 122262 136767 150272 144840 127223 140721 157623 165750 165650
16941 165650 159063 160513 160946 155608 172666 175692 160372 152367 151283 183699 194592 203735 214382
16928 214382 226738 227961 227183 241605 280846 321524 372699 437504 509187 580148 621587 666726
16916F66726q700k6050R737O92K53k2780n4393n9379l8905l3381j1006K717K1549
16903D47080L1194N8544P9611P4884N6901N0191N3831j0618r463J0478J4572K3022
16891H80227k213l8775k2001K5503L4261N0026O3678N5063O0809O8067Q9915J16700
16879A381260J22494J16608J19794J47816J84772J97557K50750K88836L84255
16870C194142N86301Q51337J257410J960821L103469M619524N946029O331123
16862B7850156N984309N597116M859121K300349j336294k157699r41737n54628
16854D1600693k257380o068429q038853n966359l140110j272308L6384J321909
16846A6215547K871469M515228N532710N543976N179461M752300L458982J43312
$$ plain form
16916 666726 658026 631976 641713 642405 642658 619878 565485 506106 467201 433820 422814 425531 447080
16903 447080 478274 536818 616429 691313 748214 798405 852236 841618 832155 842633 857205 880227
16891 880227 878014 839239 817238 842741 877002 927028 990706 1045769 1106578 1174645 1264560 1381260
16879 1381260 1503754 1620362 1740156 1887972 2072744 2270301 2521051 2809887 3194142
16870 3194142 3780443 4631780 5889190 7850011 10953480 15573004 21519033 27850156
16862 27850156 33834465 39431581 44290702 46591051 45254757 43097058 42155321 41600693
16854 41600693 39343313 33274884 25236031 19269672 16129562 14857254 14893638 16215547
16846 16215547 19087016 23602244 29134954 34678930 39858391 44610691 48069673 48212985
16838D8212985k481485k004699r76584j384168m082941p611437p648123n065464
16830A6958084k935805j785756j193007q55310o47356n10473m41600l86000l40294
16821G862483l17039l19334l33262l08715k59512k44824k31234k37203j91537
16812E419823j72167j65896j47715j34279j15930j23337j29890j39013j45765
16803D145831j34669j41896j37245j34997j20528q2767o1084r4828p4185q3819
16793C079813j01437n6720n8625o3209o0265n9306p3707n5469m7933n8595o6750
16782B377797o9398o3771m1938o8780m3145l2208k7773j8405m5704o5386n8875
16771A842414o5717n1826n4135m0226m0627m3512j8749k6290k9632l3545m8050
$$ plain form
16838 48212985 45731500 43726801 42750217 41366049 37283108 29671671 22023548 16958084
16830 16958084 14022279 12236523 11043516 10188206 9540850 9030377 8588777 8202777 7862483
16821 7862483 7545444 7226110 6892848 6584133 6324621 6079797 5848563 5611360 5419823
16812 5419823 5247656 5081760 4934045 4799766 4683836 4560499 4430609 4291596 4145831
16803 4145831 4011162 3869266 3732021 3597024 3476496 3393729 3332645 3237817 3163632 3079813
16793 3079813 2978376 2921656 2863031 2799822 2739557 2680251 2606544 2551075 2503142 2444547 2377797
16782 2377797 2308399 2244628 2202690 2133910 2090765 2058557 2030784 2012379 1966675 1901289 1842414
16771 1842414 1776697 1724871 1670736 1630510 1589883 1546371 1527622 1501332 1471700 1438155 1390105
16760A390105n0500n0866l6219q241k4654k9091m2789l0758j6126m1003l5525
16749A024333L979j9024j5921j1426j5347k6011l4707k6817j9010k3877j5065
16738H21107l8788k8216p308q071k6397k4142q038j3640j9670l0475k9359j2743
16726E74260k7270J6153K3657n483p880j5920r271j3358p548j7119q972j0713
16714D90536k3798k3528L962Q712j2754k9832j1446r129j8465j2600MJ8058j671
16701C78049j5587k5331k3205j0412l608M526j4942l77K903k0457O343J1756j8526
16688B71132k1328j4689N726M052O782P860j8091k8753j9501K3592J6668n402
16676B28048O303j5821j9469j0819j7047o945j4029R801J6296k824l812o470K49
$$ plain form
16760 1390105 1339605 1288739 1252520 1244279 1219625 1190534 1147745 1116987 1100861 1059858 1024333
16749 1024333 1028312 1009288 993367 981941 966594 940583 905876 879059 860049 836172 821107
16738 821107 782319 754103 746795 738724 712327 688185 680147 666507 646837 616362 587003 574260
16726 574260 546990 563143 586800 581317 573437 557517 548246 534888 527340 510221 501249 490536
16714 490536 466738 443210 447172 455884 443130 413298 401852 392723 374258 361658 361662 379720 378049
16701 378049 362462 337131 313926 303514 299906 304432 289490 289113 292016 271559 277902 289658 271132
16688 271132 249804 235115 240841 244893 251675 259535 241444 212691 193190 216782 233450 228048
16676 228048 234351 218530 199061 188242 171195 164250 150221 160022 176318 173494 169682 163212 163461
16663A63461j1002j3547j9777p895J6808l430j6441P92p644p680K285J0497K171
16650A08598J706o687J9631Q100n395j7510j6505J4634j0231n662l576J676k2352
16637F6427j3343J4458M35j9267k498O255o275p177n782o56O429j3202j0162J5254
16623C0896M748J2107q959r124p641j430K2033J5001J0460m325r399J4796L81
16610F9544k6148Q940L816j5441R129o566j4919j4560R453J7222J6466r086j0113
16597C7737J0150P42l165p293j2503n859p546K055Q598M894Q552R011j6408M241
16583C3206N555k963j6263k4313n943K2797M306J4428k9952L195J9182o314m996
16570A1925O088m184Q359R664q165j8335j6647J1126l389J1834J9294k123j8519
$$ plain form
16663 163461 152459 138912 119135 111240 128048 124618 108177 108969 101325 93645 95930 106427 108598
16650 108598 110304 103617 123248 131348 125953 108443 91938 106572 96341 90679 87103 88779 66427
16637 66427 53084 67542 67977 48710 46212 52467 46192 39015 33233 32577 39006 25804 15642 30896
16623 30896 35644 47751 38792 29668 22027 20597 42630 57631 68091 63766 54367 69163 69544
16610 69544 43396 52336 56152 40711 49840 43274 28355 13795 23248 40470 56936 47850 37737
16597 37737 47887 48629 45464 38171 25668 19809 12263 14318 22916 27810 36362 45373 28965 33206
16583 33206 38761 35798 19535 -4778 -10721 12076 16382 30810 858 4053 23235 16921 11925
16570 11925 18013 13829 22188 31852 23687 5352 -11295 -169 -3558 8276 27570 25447 6928
16557F928j0198j4159k586m514J453N330O335R479j02P31j5788j2789J1161J7318
16543a401J3481o408o459r083j247P379N826n497k621j308P779L5316M000k5468
16529A4289q412J1307J9447M751k05l679J013n624o206j1324j0237j4096K654
16516f322Q043J4975m513j9392m750J6847q086P764j0668N140J556J2491L408
16503A6493m102J0067j5332j5909J890J5322R132r191j3746j783p319Q925l12
16490e865K697R713j4720m724j679k200j0570q586j581J5370L817J763j1213J3308
16476a4470N808j661j114o561M838K0559J67L579P51p975p75O700J665j9295R327
16461A543R598k3861k1932J5549J0237p145K418L780Q464P52J1588n99j0065J870
$$ plain form
16557 6928 -3270 -17429 -20015 -24529 -23076 -17746 -11411 -1932 -2034 -1303 -17091 -29880 -18719 -1401
16543 -1401 12080 5672 -787 -9870 -11117 -3738 2088 -3409 -6030 -7338 441 35757 39757 14289
16529 14289 5877 17184 36631 41382 41177 37498 38511 32887 26681 15357 5120 -8976 -6322
16516 -6322 1721 16696 12183 -7209 -11959 4888 -3198 4566 -6102 -962 594 13085 16493
16503 16493 12391 22458 7126 -8783 -6893 8429 17561 8370 -5376 -7159 -14478 -5553 -5865
16490 -5865 -3168 6545 -8175 -12899 -14578 -16778 -27348 -35934 -37515 -22145 -18328 -16565 -27778 -14470
16476 -14470 -8662 -10323 -11437 -17998 -13160 7399 7566 11145 11896 3921 3146 9846 11511 -7784 1543
16461 1543 11141 -12720 -34652 -19103 -8866 -16011 -13593 -9813 -1349 -597 10991 10392 327 2197
16447B197r717J0251k871p373k200N703p00M839k88j7259l190L463R826L773o822
16432a0368O110J3613L922k2300k7014l40K1880L1594p32l679k491l700J5109
16419B1604q834j4287j319m464l382l121j1549J0309Q706J1252q279o494n109
16406a4967J3513P854N140p239j5090j2162Q204o537j6422J5417J330q893j1547
16393d1399N573M488J076J7349Q774p341r967k787R361n194K321k267o352J688
16379b4677n163L798J7829M731N731N659J0637M538j3958j3441j4278J2609P231
16366A246l456P799p346l0595R926N080j868Q789n895j1822N548m848n646n102
16352c8190P179K9804L096L711J1528k465J7026j504j5890j6899k557M718O7j584
$$ plain form
16447 2197 -7520 2731 -140 -7513 -9713 -4010 -4710 129 -159 -17418 -20608 -17145 -7319 -3546 -10368
16432 -10368 -4258 9355 13277 -9023 -36037 -36377 -14497 17097 16365 12686 10195 6495 21604
16419 21604 12770 -1517 -2836 -7300 -10682 -13803 -25352 -15043 -6337 4915 -3364 -9858 -14967
16406 -14967 -1454 6400 11540 4301 -10789 -22951 -14747 -21284 -37706 -22289 -20959 -29852 -41399
16393 -41399 -35826 -31338 -30262 -12913 -4139 -11480 -21447 -24234 -14873 -20067 -17746 -20013 -26365 -24677
16379 -24677 -29840 -26042 -8213 -3482 2249 7908 18545 23083 9125 -4316 -18594 -5985 1246
16366 1246 -2210 5589 -1757 -32352 -22426 -17346 -19214 -10425 -16320 -28142 -22594 -27442 -33088 -38190
16352 -38190 -31011 -1207 1889 5600 17128 14663 31689 30185 14295 -2604 -5161 -443 -376 -1960
16338a960o90j0341j748J2946L006l351r045n08l752P990J3190J528p101m186
16324d022r031J7503K5353n081O458j012O692M154O194l363K2547L5288M5455
16311A47135L6863J9477J5857J3128o800O903o061j7834j8136k0813l3556j9387
16299A16776j9343r60m596K477J6841J9407L1225M0611Q433K5169J4976J3230
16287B64246n74k7592k4817j9245o796k2951k5921l7976l7893k0886n416r004
16275B5175J358J852J9761J1108l2229j9411n281J3874N178J1932m424k3225q16
16262D852L399J1186J1123O237l19j4631k5561l868N071N287R22j0349L52R169
16248B870L400J725o3R129M365P208n148m158J5915r94j5596j8418n777J876m692
$$ plain form
16338 -1960 -2650 -12991 -14739 -1793 1213 -2138 -11183 -11691 -15443 -7453 5737 7265 164 -4022
16324 -4022 -13053 4450 29803 24722 31180 30168 36860 41014 47208 43845 66392 101680 147135
16311 147135 183998 203475 219332 232460 225660 232563 226502 208668 190532 169719 136163 116776
16299 116776 97433 96473 91877 94354 111195 130602 161827 202438 210871 236040 251016 264246
16287 264246 263672 236080 211263 192018 185222 162271 136350 98374 60481 39595 34179 25175
16275 25175 26533 28385 48146 59254 27025 7614 2333 16207 21385 33317 28893 5668 4852
16262 4852 8251 19437 30560 36797 36478 21847 -3714 -7582 -2511 2776 3698 -6651 -6299 2870
16248 2870 6270 7995 7932 17061 21426 28634 23486 19328 35243 34249 18653 235 -5542 -3666 -8358
16233h358J0829J6K085J6809M262p042j6907j21j2238L267k0889m881k704p495
16219d3367M183J3419K0962j5836j6269K1285J3955P442M14j6548o927Q579J216
16206g492o97N93l815J790J1198N090L516J887l576o851J0747r228n965o174N122
16191c855n859j767J87L275l031j2112k4195o15K1014N911j1844o228J1843K373
16177b4903j5980J6994Q510M982l500n162Q822l15q87O020J7739j1589L20l474
16163b423j1699m685k0119m500P26N746R525J4039M684n51J3058O72l404M908
16149E977j4508J0185J337j8570k1724l912Q662J8646J6438j037k66J2656k938
16136A0946J113n792k547p168l516l296O556M777r110q651K593j1729l295J453
$$ plain form
16233 -8358 2471 2487 4572 21381 25643 18601 1694 1573 -10665 -7398 -28287 -33168 -35872 -43367
16219 -43367 -39184 -25765 -4803 -20639 -36908 -15623 -1668 5774 6188 -10360 -17287 -8708 -7492
16206 -7492 -8189 -7596 -11411 -9621 1577 6667 10183 12070 8494 1643 12390 3162 -2803 -8977 -3855
16191 -3855 -9714 -11481 -11294 -8019 -11050 -23162 -47357 -47972 -26958 -21047 -32891 -39119 -27276 -24903
16177 -24903 -40883 -23889 -15379 -10397 -13897 -19059 -10237 -10552 -11439 -5419 12320 731 1051 -2423
16163 -2423 -14122 -18807 -38926 -43426 -42700 -36954 -27429 -13390 -8706 -9257 3801 4473 1069 5977
16149 5977 -8531 1654 2991 -15579 -37303 -41215 -32553 -13907 2531 1494 1228 13884 10946
16136 10946 12059 6267 3720 -3448 -6964 -10260 -3704 1073 -8037 -16688 -14095 -25824 -29119 -27666
16122b7666q01J3836J1605L469P9p088q804L202M806R244P123R148R104k529j243
16107B3485M481k4113M734J1056m034K956r944j1663j197L548j537K8397L202
16094B9371m110K74J578l953j5063P008J74O860r531j5167l433p119J4315j904
16080g00j0262o186q696J3098R384J5110j4405j6096J5495J5347O344j8017k9943
16067b9527l015q61J653M930K0602J4850q785k266p738m720Q358j8414K65K5781
16053A113N021m050j8639j7043o20J2912J9210j812k5371j1266p199N457K0734
16040b1553K7139J3296j8404K827m605N816K894m0j3637j3564j3220j0954M138
16027c9867K865k471J6219J4285r976J5366K56J1623k833p771l270J1600m602
$$ plain form
16122 -27666 -28467 -14631 -3026 443 522 -6566 -15370 -12168 -7362 1882 9005 18153 27257 24728 23485
16107 23485 27966 3853 8587 19643 15609 18565 8621 -3042 -4239 -691 -2228 26169 29371
16094 29371 25261 25535 27113 23160 8097 15105 15279 22139 12608 -2559 -5992 -13111 1204 -700
16080 -700 -10962 -17148 -25844 -12746 -3362 11748 -2657 -18753 -3258 12089 18433 416 -29527
16067 -29527 -32542 -33403 -31750 -26820 -6218 8632 -153 -2419 -10157 -14877 -6519 -24933 -24668 1113
16053 1113 6134 2084 -16555 -33598 -34218 -21306 -2096 -3908 -29279 -40545 -47744 -42287 -21553
16040 -21553 5586 18882 478 3305 -1300 4516 7410 7370 -6267 -19831 -33051 -44005 -39867
16027 -39867 -37002 -39473 -23254 -8969 -18945 -3579 -3323 8300 5467 -2304 -5574 6026 1424
16014A424k514K089r211j480m730R145O458J1027k1867k1460J4824K1234q786
16001c847R582j3971p844j0547j4747k1418p234J6254J0991J7927O906k3607j6387
15988e7942K9725L0077J8784j858l0980r005O084Q477L261K385M142m540J1457
15975A0067l252k69o632j9063R059K1233j6118j565N309j3890j1865O00p460N900
15961b7946J8155Q367K0005k111k9662j4705j261K1480O925M199J5152j3109j1946
15948f457Q30n852j5420K28r688k050O174k28P907J0164l894q448J0374j3153
15934b9513p758L5862M896j3426J7521M156N69j5546k113K545o281K259L496j0623
15920a3956j0848p008L411j2040R990O357M45n07j1443J3058J4156p20j5477R208
$$ plain form
16014 1424 -1090 999 -8212 -9692 -14422 -5277 1181 12208 -9659 -31119 -16295 4939 -3847
16001 -3847 5735 -8236 -16080 -26627 -41374 -62792 -70026 -53772 -42781 -24854 -17948 -41555 -57942
15988 -57942 -28217 1860 20644 18786 -12194 -21199 -15115 -6638 -3377 -992 3150 -1390 10067
15975 10067 6815 6546 -86 -19149 -10090 11143 -4975 -6540 -1231 -15121 -26986 -26386 -33846 -27946
15961 -27946 -9791 -1424 18581 16470 -13192 -27897 -29158 -7678 -753 3446 18598 5489 -6457
15948 -6457 -5627 -11479 -26899 -26671 -36359 -38409 -32235 -32463 -24556 -14392 -18286 -26734 -16360 -29513
15934 -29513 -37271 -1409 3487 -9939 7582 11738 12307 -3239 -5352 -2807 -9088 -6829 -3333 -13956
15920 -13956 -24804 -31812 -28401 -40441 -30451 -24094 -23649 -24156 -35599 -22541 -8385 -9105 -24582 -15374
15906a5374j0113m931P315m168J5457J5608q976P457N001o088l11k358k515j8220
15892b2216k607K2682O941J9715L225j3303j2628n567q604N63O028r498p281j1833
15878c4383P918J7329O766q614Q264J3674j0784J795M264o844N318k2592k9249
15865d7138K594J7445J869O52N607R456o505J914r055l361J2932J3563m903m853
15851i783p129n369K669N96m652j6436k69M341P738R477K5139q375j294o51R651
15836E653j5669O876N041j721K996Q449K257R070L316q73r551r891j0690J1241
15822F504Q315j2431j5457k742o898K4024O08j0908j5746L157n627L895j3504
15809c6810l958O552J7757Q207O053m851L50N590j7086k0901J8469R921L714j501
$$ plain form
15906 -15374 -25487 -30418 -23103 -27271 -11814 3794 -5182 2275 7276 1188 877 -1481 -3996 -22216
15892 -22216 -24823 -2141 4800 24515 27740 14437 1809 -3758 -12362 -11799 -5771 -15269 -22550 -34383
15878 -34383 -26465 -9136 -2370 -10984 -2720 10954 170 1965 6229 -615 4703 -17889 -47138
15865 -47138 -44544 -27099 -25230 -24578 -18971 -9515 -16020 -14106 -23161 -26522 -13590 -27 -4930 -9783
15851 -9783 -16912 -22281 -19612 -19016 -23668 -40104 -40373 -36032 -28294 -18817 6322 -2053 -3347 -3998 5653
15836 5653 -10016 -3140 1901 180 3176 11625 13882 22952 26268 25395 15844 5953 -4737 6504
15822 6504 14819 2388 -13069 -15811 -22709 1315 1923 -8985 -24731 -21574 -27201 -23306 -36810
15809 -36810 -40768 -34216 -16459 -8252 -2199 -7050 -6700 -1110 -18196 -39097 -20628 -10707 -6993 -8494
15795h494j4199J6799O295j5436p756l429k369k386J5231p162l771O916o243J9174
15781f830O849k0617J906J0584j4854J575l88L569M15M717R85r762N08J9262p44
15766b825Q077R89J6610j65r690q943K959r836j6868K910op907K922M43k710l127
15750b7167k525l002J7455N814J4474N765r107J6591L717o832j8394q993l538
15737a5742J6996J5447N54q443k899j1722J1395N614p177o628k087k375j5369
15724b2436j1308J5370K0348J841n183o982j0108j6640p036L2093J9963K75J215
15711A1412l0437r909J5153J0693l465j7938j346J1598Q348j394j821Q485Q866
15698H245j3818O010J7443k727k2216k161J0225n258o488Q160q096k0126J6296
$$ plain form
15795 -8494 -22693 -5894 401 -15035 -22791 -26220 -28589 -30975 -15744 -22906 -26677 -19761 -26004 -6830
15781 -6830 19 -20598 -18692 -8108 -22962 -21387 -21775 -18206 -17791 -13074 -12089 -21851 -21343 -2081 -2825
15766 -2825 5252 6241 22851 22686 12996 4053 7012 -2824 -19692 -16782 -16788 -24695 -21773 -21330 -24040 -27167
15750 -27167 -29692 -32694 -15239 -9425 5049 10814 1707 18298 22015 15183 -3211 -12204 -15742
15737 -15742 1254 16701 17255 8812 5913 -5809 5586 11200 4023 -2605 -4692 -7067 -22436
15724 -22436 -33744 -18374 1974 3815 -1368 -8350 -18458 -35098 -42134 -10041 9922 10197 11412
15711 11412 -19025 -28934 -13781 -3088 -6553 -24491 -25837 -14239 -5891 -7285 -9106 -621 8245
15698 8245 -5573 437 17880 15153 -7063 -9224 1001 -4257 -10745 -2585 -10681 -30807 -14511
15685a4511K1994J2731K92o450j1021j9125J1062J042o646P972J4159k093J352
15672A0758k82p638k0652N578J8049j2963L369p149m257J4585J297m281O874J1856
15658A5144J4584q948l4780R57Q965q623j1396M171o169j3112J7319o41P474L127
15644a1928q520Q22m029j0558L932j0383p707P448K0231K4085r020j7000p158
15631b9785K2877J6835J0110j1267o857K412k334k1104R639P720q486k85J2561
15618B036k841J788n449R27O023k857k6168r895k425J2204J455J8790M047j3345
15604a5710n803J0161r087m644L139J810r283J0427J6899Q851N154J1400J488
15591B4802k842n622P91l335j0284j1160o147R911k799k7935j3515j348o215J5357
$$ plain form
15685 -14511 7483 20214 20506 14056 3035 -16090 -5028 -3986 -10632 -2660 11499 9406 10758
15672 10758 10476 2838 -17814 -12236 5813 -7150 -3781 -10930 -15187 -602 695 -3586 3288 15144
15658 15144 29728 20780 -14000 -13043 -4078 -12701 -24097 -19926 -26095 -39207 -21888 -22529 -15055 -11928
15644 -11928 -20448 -19626 -23655 -34213 -30281 -40664 -48371 -40923 -20692 3393 -5627 -22627 -29785
15631 -29785 -6908 9927 20037 8770 1913 4325 1991 -19113 -9474 -1754 -10240 -10525 2036
15618 2036 -805 983 -4466 -3539 2484 -373 -26541 -36436 -38861 -26657 -25202 -6412 -2365 -15710
15604 -15710 -21513 -11352 -20439 -25083 -21944 -20134 -29417 -18990 -2091 6760 11914 23314 24802
15591 24802 21960 16338 17129 13794 3510 -7650 -13797 -3886 -6685 -34620 -48135 -49483 -55698 -40341
15577d0341j344P332K9168o185j4127M391J9180P858j2106J3563p390m991J4570
15564I578p608m135Q719k540j6160n44j7694p68N82k074L710J4128Q670O095P711
15549G670J4764j1915m491n696q286k795J0988j3423j4555O243L533O91n788M209
15535a8851l486k662k2116o68K886J7976J0189p131j3649J4118L672N280K872
15522a1570J468N859n456j2577N422j6101J0591k267R624n708p708J0108k453
15509b0768O375p292K257J2170J808m435r58j9K0930r018l934N141m74J4369Q808
15494B4960o035k6682L236k3749n741J3619K6849J868k1832l090J7053N451o151
15481b44m831l92R042K4260L924j7653j2015j3751m569N064Q200m810Q563j5173
$$ plain form
15577 -40341 -41685 -34353 -5185 -11370 -25497 -21106 -1926 5932 -6174 7389 -1 -4992 9578
15564 9578 1970 -2165 6554 4014 -12146 -12690 -30384 -31152 -30570 -32644 -28934 -14806 -6136 -41 7670
15549 7670 22434 10519 6028 332 -7954 -10749 239 -13184 -27739 -21496 -17963 -17272 -23060 -18851
15535 -18851 -22337 -24999 -47115 -47783 -44897 -26921 -16732 -23863 -37512 -23394 -19722 -14442 -11570
15522 -11570 -10102 -4243 -9699 -22276 -16854 -32955 -22364 -24631 -15007 -20715 -28423 -18315 -20768
15509 -20768 -14393 -21685 -19428 -7258 -5450 -9885 -10843 -10862 10068 1050 -2884 2257 1783 16152 24960
15494 24960 18925 -7757 -4521 -28270 -34011 -20392 6457 8325 -13507 -16597 456 5907 -244
15481 -244 -5075 -5467 3575 27835 31759 14106 2091 -11660 -16229 -11165 -2965 -7775 788 -14385
15467a4385k745j504Q705P824J3008j0826q442J3027J1960j3158k0271j3545Q231
15454b2121q7M678o916J1591K0019N060j8302k3791o592R114p615j9204O877J1834
15440c5455J3901p818J267K0344J9977r47l7285q1R396o174P9J648j5723J334
15426c5537J7002m173M635o052J0446Q968L504j88N857K519L50j8852j8079p210
15412c6810m134J5804K1391K1612n512j6688K049J3799n448j4535j6945M761k347
15399b3003l266N218L845J9106J7950K346p241r560J583p529J3419Q88o487L670
15385A0939p897j8844n006l071K480j9401j1325M162P694J9219j0359l618Q538
15372b6489P084j253P919J3996M930K278l6m703Q165R848R696j1009P82o962j1151
$$ plain form
15467 -14385 -17130 -18634 -9929 -2105 10903 77 -8365 4662 16622 3464 -16807 -30352 -22121
15454 -22121 -22208 -17530 -24446 -12855 7164 12224 -6078 -29869 -36461 -27347 -34962 -54166 -47289 -35455
15440 -35455 -21554 -29372 -28105 -7761 12216 11269 -26016 -26097 -16701 -22875 -22796 -21148 -36871 -35537
15426 -35537 -18535 -22708 -18073 -24125 -13679 -4711 -1207 -1395 4462 6981 7331 -11521 -29600 -36810
15412 -36810 -40944 -25140 -3749 17863 12351 -4337 -2288 11511 6063 -8472 -25417 -20656 -23003
15399 -23003 -26269 -21051 -17206 1900 19850 22196 14955 5395 6978 -551 12868 13756 7269 10939
15385 10939 3042 -15802 -20808 -23879 -21399 -40800 -52125 -47963 -40269 -21050 -31409 -35027 -26489
15372 -26489 -19405 -20658 -12739 1257 6187 8465 8429 3726 11891 21739 31435 20426 21208 14246 3095
15357C095K403k331Q73l745j7421J9702J8286J2592j2661L15r568K745r387p960
15343c062J3791j4517m487R428o114m473M493l159Q030j0729k946r64J0640p102
15329a1171j054n592J0847J6001J493p811P862k464j739o135j2557p806J671K389
15315a6066J1534P436o022j944K11j2415o354j865N448M473J9615j1118n038j1917
15301b4022L300J8715j3078j071J1739P142Q04l176l786R452j4414j678K22o117
15287a5968O512j905J900l395J266j0664n464o61k040L891n390j0755J575J6677
15273b4421p396J121K0702Q648J5116p650O945m136k6430m014J4450J9877J956
15260A4768k929j2745M145J47o542J3962N815j653l70N417j4597k0003O29n815
$$ plain form
15357 3095 5498 3167 4040 295 -17126 2576 20862 33454 20793 21108 11540 14285 4898 -3062
15343 -3062 10729 -3788 -8275 1153 -4961 -9434 -4941 -8100 -70 -10799 -13745 -14709 -4069 -11171
15329 -11171 -12225 -17817 -6970 9031 10524 2713 10575 8111 6372 237 -12320 -20126 -18455 -16066
15315 -16066 -4532 2904 -3118 -5062 -4851 -17266 -23620 -25485 -20037 -15564 4051 -7067 -12105 -24022
15301 -24022 -20722 -2007 -15085 -16156 -4417 2725 3529 353 -3433 6019 -8395 -10073 -9851 -15968
15287 -15968 -9456 -11361 -9461 -12856 -11590 -22254 -27718 -28379 -30419 -26528 -31918 -42673 -41098 -24421
15273 -24421 -31817 -30696 -9994 -1346 13770 6120 13065 8929 -17501 -21515 -7065 12812 14768
15260 14768 11839 -906 3239 3386 -3156 10806 16621 14968 14598 20015 5418 -14585 -13956 -19771
15246a9771p15L0108M457O088k132j8633K685j1802k110K7756J0102j3583j1108
15233A342N323j1018q161k707m686J3147M895j9399p6j5961P07J9582m915k6274
15219d8201J9921m761L173m691L250J4659J2818m485J941K9956L058q148j2442
15206F048q552K292j6665Q060P787j2933k0574q786J7470l240m51R30r889k051
15192d0554J996J113J5724P248l968K0888J3514q240K3904j8533j5172L322j1014
15179i772L923J9340Q317k3042k329o031j5617P227K81O915k231J013O031P410
15165A435j205j666j4743k4035p77M475J2807k205Q201K7782J006j3663R344M345
15151A1101j5799k613j3747R284j590j6341l966L428N421K276j368K826M701j770
$$ plain form
15246 -19771 -20486 9622 14079 20167 18035 -598 2087 -9715 -11825 15931 26033 12450 1342
15233 1342 6665 -4353 -12514 -15221 -19907 -6760 -1865 -21264 -21340 -37301 -36594 -17012 -21927 -48201
15219 -48201 -28280 -33041 -29868 -34559 -31309 -16650 -3832 -8317 -6376 23580 26638 18490 6048
15206 6048 -2504 -212 -16877 -8817 -1030 -13963 -34537 -43323 -25853 -29093 -29544 -28614 -38503 -40554
15192 -40554 -38558 -37445 -21721 -14473 -18441 2447 15961 7721 31625 13092 -2080 1242 -9772
15179 -9772 -5849 13491 21808 -1234 -3563 -9594 -25211 -17984 -17703 -10788 -13019 -12006 -5975 1435
15165 1435 230 -1436 -16179 -40214 -40991 -36516 -23709 -25914 -17713 10069 11075 -2588 6756 11101
15151 11101 -4698 -7311 -21058 -11774 -13364 -29705 -33671 -30243 -24822 -22546 -23914 -21088 -16387 -18157
15137a8157r40j4561m679O681K806R220J7009p197l839j136j9069j1407R448J5982
15123a9839q369j494J983J0245J4604J2328N906j7202k1560o029p613R547J1540
15110a5953M898R107j2335J396K1189J6229l912k4185Q517M969j5355j2730K587
15097a5578m547j8191j917j1629q743J9515K7762K0001K0539J941k1811j8626
15085a1284j908J721J1503j970p518j2999k736J4489J9367j5887p278K964L461
15072h075J884N79j2770j0165J76N515J0130J9549R545J6662J1346n831j3423
15059B5122j3474m678n342Q356J41j1039Q304R122m157k7016k3485J5633R861
15046a2652K1244J1700m799L5453p361l3369k4636L244J7936p961j2464J942p060
$$ plain form
15137 -18157 -19097 -33658 -38337 -31656 -28850 -19630 -2621 -9818 -13657 -14793 -33862 -45269 -35821 -19839
15123 -19839 -28208 -29702 -27719 -17474 -2870 9458 15364 -1838 -23398 -29427 -37040 -27493 -15953
15110 -15953 -11055 -1948 -14283 -12887 8302 24531 20619 -3566 4951 9920 -5435 -18165 -15578
15097 -15578 -20125 -38316 -40233 -51862 -60605 -41090 -13328 6673 27212 29153 7342 -11284
15085 -11284 -13192 -11471 32 -1938 -9456 -22455 -25191 -10702 8665 -7222 -14500 -11536 -8075
15072 -8075 -6191 -5612 -18382 -28547 -28371 -22856 -12726 6823 16368 33030 44376 38545 25122
15059 25122 11648 6970 1628 9984 10125 -914 7390 16512 12355 -14661 -38146 -22513 -12652
15046 -12652 8592 20292 15493 50946 43585 10216 -14420 -11176 6760 -1201 -13665 -11723 -18783
15033a8783r371R071P089K0146N385P111k528n706m090j4446p029m045j2529J954
15019b7771L8743J4553l1980k5168K12j955J2615M285n623r725o721N36K7385
15006a0614n203p209m801J057J0078j0195j2043J1470J7871k584k5991J2643J1466
14993a4055L115R31O915j429M205j2707J3086k430j8466J946j189J1531K555J1463
14979E471j912N530R701j6079k2137M557p999q892j4261m724K4887J0733m041
14966a9166j0783n209R50J9271j1738j8606K0024Q689M092J697j691r056j5358
14953c6884q536j280Q117r746J2744Q972j133R325J2723P609r883r92o975o369
14939b2308M889m877K8J6092r562l804J5011N765L688r091J1439M421P004p20
$$ plain form
15033 -18783 -28154 -19083 -11994 8152 13537 20648 18120 12414 8324 -6122 -13151 -17196 -29725 -27771
15019 -27771 10972 25525 -6455 -31623 -31411 -33366 -20751 -16466 -22089 -31814 -38535 -37999 -10614
15006 -10614 -15817 -23026 -27827 -26770 -16692 -26887 -38930 -27460 -9589 -12173 -38164 -25521 -14055
14993 -14055 -10940 -10009 -3094 -4523 -318 -13025 61 -2369 -20835 -18889 -20078 -8547 -5992 5471
14979 5471 3559 9089 18790 2711 -19426 -14869 -22868 -31760 -46021 -50745 -25858 -15125 -19166
14966 -19166 -29949 -35158 -34208 -14937 -26675 -45281 -25257 -16568 -12476 -10779 -12470 -21526 -36884
14953 -36884 -45420 -46700 -38583 -48329 -35585 -26613 -27746 -18421 -5698 1911 -7972 -8964 -15939 -22308
14939 -22308 -17419 -22296 -22268 -6176 -15738 -19542 -4531 1234 4922 -4169 7270 11691 18695 17975
14925A7975L751M785q766q322J502q642J2396L998j9753j702q028j766K426J298
14911h848J4151j2485q314k388j1622R555J4330J263O758K6158n280j5978k3334
14898a6034k7707j9882K805J8902J4931l044J6110J2321L193K834j2803o549K2640
14885G717k988j7175O259K983l642K607K309j8649k99J8944m431n493K880Q662
14871c16L572j6186j0826J444M704J0958J8327O077j0376k5452j0143J6692L1956
14858B0431J4140n992j3059J3122n121j924q907k3736J747j3069j243Q431K2248
14845G068J1495j5879q391R138J633j2873j9195J1913J6018J3887l973l382n587
14832A872k501k6668n476m414K232Q650L633J6607p750p71K4730j6837k1697j1685
$$ plain form
14925 17975 21726 26511 17745 9423 10925 2283 14679 18677 -1076 -2778 -10806 -12572 -10146 -8848
14911 -8848 5303 -7182 -15496 -17884 -29506 -19951 -5621 -4358 2400 28558 23278 7300 -16034
14898 -16034 -43741 -63623 -60818 -41916 -26985 -30029 -13919 -1598 1595 4429 -8374 -14923 7717
14885 7717 4729 -12446 -6187 -3204 -6846 -4239 -1930 -20579 -20878 -1934 -6365 -11858 -8978 -316
14871 -316 3256 -12930 -23756 -22312 -17608 -6650 11677 17754 7378 -18074 -28217 -11525 20431
14858 20431 34571 28579 15520 28642 23521 21597 12690 -11046 -9299 -22368 -23611 -15180 7068
14845 7068 18563 2684 -5707 3431 5064 -7809 -27004 -15091 927 14814 10841 7459 1872
14832 1872 -629 -27297 -32773 -37187 -34955 -26305 -22672 -6065 -13815 -14586 10144 -6693 -28390 -40075
14818d0075J2229m190j2104K872J8445J3616o972n947J4451N010M703N046J740
14805H824j4613K797M005k4590o566J8393O069p601q879l797n603J4579K0573
14792C591J393P138R237m7k871l267q575k1227p207j7524j385J0808R748k491
14778b2679J9325J075j7150O233m011K823R448q307j3429L06q154K829J7673J6144
14764B126M264J455J4632j0876q956j9395n672J426j3334j4291O609L042J3238
14751b5732K6981J2840J349j0758l511J344p070J113O894p167P162M438j1274
14738c391k3485J1614J9969n795j9654j2617R279R099O054J2942k155q47R61J3924
14724A5898n322n569j7738K868P609p362q427n477J3875J5567j3157n594j8736
$$ plain form
14818 -40075 -27846 -32036 -44140 -41268 -22823 -9207 -16179 -22126 -7675 -2665 2038 7084 8824
14805 8824 -5789 -2992 1013 -23577 -30143 -11750 -5681 -13282 -22161 -25958 -31561 -16982 3591
14792 3591 4984 12122 21359 21312 18441 15174 6599 -14628 -21835 -39359 -40744 -29936 -20188 -22679
14778 -22679 -3354 -2279 -19429 -13196 -17207 -14384 -4936 -13243 -26672 -26366 -34520 -31691 -14018 2126
14764 2126 6390 7845 22477 11601 2645 -16750 -22422 -20996 -34330 -48621 -42012 -38970 -25732
14751 -25732 1249 14089 15438 4680 1169 2513 -4557 -3444 3450 -3717 3445 7883 -3391
14738 -3391 -26876 -15262 4707 -1088 -20742 -33359 -24080 -14981 -8927 4015 1860 1013 1974 15898
14724 15898 10576 5007 -12731 -9863 -2254 -9616 -18043 -23520 -9645 5922 -7235 -12829 -31565
14711c1565N416J9601J1894K811j4575j2915r925j466p041J0432J6770R224p794
14698i133O758J1502L248j3270O499J0378j1124j5289N377K728j2040P887L865
14685b614q716N778j4762J967J2499P306P588P204o229P614M133l765k2779j4651
14671a9427o17K1394R214j1165J114m628j6927r994J7906j4987j165L369J7246
14658h667Q831p621O304J3167J335k5733j0422L773J6074O016m290j8675O650
14645a3258J9643Q363K080o277j0029k361k799O352J3470j3734l588p443k30m329
14631a4140P156N951m437L462P676M500Q218k256p849j6707n997N570J6940r577
14617a490j1155p197O959J761L725r692k069K2029j210n863m971R814J7187j829
$$ plain form
14711 -31565 -26149 -6548 5346 8157 -6418 -19333 -29258 -30724 -37765 -27333 -10563 -1339 -9133
14698 -9133 -2375 9127 12375 -895 5604 15982 4858 -10431 -5054 -2326 -14366 -6479 -2614
14685 -2614 -11330 -5552 -20314 -18347 -5848 1458 9046 16250 10021 17635 21768 18003 -4776 -19427
14671 -19427 -20044 1350 10564 -601 513 -4115 -21042 -31036 -13130 -28117 -29282 -25913 -8667
14658 -8667 164 -7457 -1153 12014 13349 -12384 -22806 -19033 -2959 3057 -1233 -19908 -13258
14645 -13258 6385 14748 16828 10551 522 -1839 -4638 1714 15184 1450 -2138 -9581 -9811 -14140
14631 -14140 -6984 -1033 -5470 -2008 5668 10168 18386 16130 8281 -8426 -14423 -8853 8087 -1490
14617 -1490 -12645 -19842 -12883 -11122 -7397 -17089 -19158 2871 1661 -4202 -9173 641 17828 15999
14603A5999n334J0931n863q336O704n842O719j1642o325j9930k1063R868m532
14590c8646J0327J8249j650q335J0306K6950j6319n814L725j2674n232p1j818
14577b1002K067J857J6102K176J9509j4639N568j4220q532J1245J2870J53j2747
14564D07o815L7106M293q370j5922J934j706o962j0198J2002p104Q334k08j7023
14550a0232J0662O179k2592k2723J901J1075R264N892P348P190o844m32N1p628
14536a0889k633P42J0702K15Q231N980J1346l267P249q467k1920J028P226j9830
14522a4287j1870J2433N475R584k989P366P271R076p49j3303l0008j7000p276
14509d6277K6348K1786K13j906m994J2880q492j3715j2234p384n820j351K1823
$$ plain form
14603 15999 10665 21596 15733 7397 14101 8259 14978 3336 -2989 -22919 -43982 -34114 -38646
14590 -38646 -28319 -10070 -11720 -20055 -9749 17201 882 -4932 -1207 -13881 -19113 -19184 -21002
14577 -21002 -18935 -17078 -976 1200 20709 6070 11638 -2582 -11114 131 13001 13154 407
14564 407 -6408 30698 34991 26621 10699 12633 10927 3965 -6233 5769 -1335 6999 6791 -10232
14550 -10232 430 6609 -15983 -38706 -36805 -25730 -16466 -10574 -3226 3964 -2880 -3312 -3261 -10889
14536 -10889 -13522 -12780 -2078 -1863 6368 12348 23694 20427 27676 19209 -2711 -1683 5543 -14287
14522 -14287 -26157 -13724 -8249 1335 -1654 5712 12983 22059 21310 8007 -22001 -39001 -46277
14509 -46277 -19929 1857 2070 164 -4830 8050 -442 -14157 -26391 -33775 -39595 -40946 -19123
14496a9123Q08m858J4008K499M481Q897n134J492k0181j1572O864J0804p792j1642
14482c0449M415J8566O338K84R256p326P27J050m778O703M214O159j3609m162
14468b612J4080P244J1438M149n675p25k2521k472J3993K904j0825N155J5250
14455B9383K982r433J0307J2410m998j8651Q808P579k423K267j5668j6294j4256
14442g987k632J3417J0169m674O973j7946r820M321l289p23j4401k2587J2817
14429c6362K1563R553J7810J5592j3598j682J4631j3194m655j920p004n93m911
14416d770O967r562J4921j453o325m595j9368J9019J0153j5750J4610j600p514
14403e267j4047p253P486J2944J6694j0143q531K52j7209P117R405M946P079p987
$$ plain form
14496 -19123 -18315 -23173 -9165 -6666 -2185 6712 1578 3070 -17111 -28683 -21819 -11015 -18807 -30449
14482 -30449 -26034 -7468 -1130 -846 8410 1084 1811 2861 -1917 4786 9000 15159 1550 -2612
14468 -2612 11468 18712 30150 34299 28624 27899 5378 2906 16899 19803 8978 14133 29383
14455 29383 32365 22932 33239 45649 40651 22000 30808 38387 35964 38231 22563 6269 -7987
14442 -7987 -10619 2798 12967 8293 15266 -2680 -12500 -8179 -11468 -12191 -26592 -49179 -36362
14429 -36362 -14799 -5246 12564 28156 14558 12876 27507 14313 9658 7738 734 141 -4770
14416 -4770 2197 -7365 7556 6103 -222 -4817 -24185 -5166 4987 -10763 3847 2247 -5267
14403 -5267 -19314 -26567 -19081 -6137 10557 414 -8117 -7865 -25074 -17957 -8552 -3606 3473 -4514
14389d514M900K2852o838k7257r828M791p104L179J7432L0702k204p248r954q664
14375B45L625k2398l974K428P86n878L514K984N106K0320J4076k4839m293J3666
14361E368J1843K0427j7221l3120Q484J2926J0195r815J974J5612J0131p910K898
14348C1792j9728O690j8936r383J4922J9858j1640r261O065R178J961m268O517
14335B3767K460k6865r669O976j2476k163N533J1488J6816J143J0340J9861M398
14322E1609m3208r635K499j4431k871O12J7479k903j1652o023k341j1129m150
14309c6144P121K757p82J7225Q554q701q232k94p34j3845J540J4277K424J279
14295a3555n004r948J3998r587J2017n413r835M74O601p449O568o593n458j103
$$ plain form
14389 -4514 386 23238 16400 -10857 -20685 -15894 -22998 -19819 -2387 28315 26111 18863 8909 245
14375 245 3870 -18528 -22502 -20074 -19288 -25166 -21652 -18668 -13562 6758 20834 -4005 -8298 5368
14361 5368 17211 37638 20417 -12703 -4219 8707 18902 9087 11061 26673 36804 28894 31792
14348 31792 12064 18754 -182 -9565 5357 25215 13575 4314 10379 19557 21518 17250 23767
14335 23767 26227 -638 -10307 -3331 -15807 -17970 -12437 -949 15867 17010 27350 47211 51609
14322 51609 8401 -1234 1265 -13166 -16037 -15425 2054 -849 -12501 -18524 -20865 -31994 -36144
14309 -36144 -29023 -26266 -27048 -9823 -1269 -9970 -18202 -18496 -19230 -33075 -31535 -17258 -14834 -13555
14295 -13555 -18559 -28507 -14509 -24096 -12079 -17492 -27327 -26853 -20252 -27701 -21133 -27726 -33184 -34287
14281c4287p391J5389M312j620j987l024r078q61J2359M912R12q887J8354k111
14267a3008j1986N891K321M839K2784j3901l286J0089L01j763K520O966j1262
14254E05j2416m760j494Q612J7671M809r461M139r753j6499l922J4541L742N380
14240A094m082j4269j3155J8092J2400L169Q039O300m330j00J522o101r264j456
14226b141K578j642Q969o569j3208M52N575q868k499K195n386J1366O313L02j0071
14211a2634j8949q050K663J1038q924j331Q351o919k088R856J0536k040N300j756
14197a4947J9678k202J9200l717l581n330j9202K974J9467J6355M489L338j5112
14184B1410k6387j114k222p836Q353Q37k047J0327N647J538N530J9024l835J991
$$ plain form
14281 -34287 -41678 -26289 -21977 -23597 -25584 -28608 -37686 -38547 -26188 -21276 -20364 -29251 -10897 -13008
14267 -13008 -24994 -19103 -16782 -11943 10841 -3060 -6346 3743 4044 2281 4801 11767 505
14254 505 -11911 -16671 -18165 -9553 8118 12927 3466 7605 -2148 -18647 -22569 -8028 -4286 1094
14240 1094 -2988 -17257 -30412 -12320 80 3249 11288 17588 13258 13158 14680 8579 -685 -2141
14226 -2141 437 -1205 7764 1195 -12013 -11561 -5986 -14854 -17353 -15158 -20544 -9178 -2865 -2563 -12634
14211 -12634 -31583 -39633 -36970 -25932 -34856 -36187 -27836 -34755 -36843 -26987 -16451 -18491 -13191 -14947
14197 -14947 4731 2529 21729 18012 14431 9101 -10101 -7127 12340 28695 33184 36522 21410
14184 21410 -4977 -6091 -8313 -16149 -7796 -6959 -9006 1321 6968 8506 14036 33060 29225 31216
14170C1216Q30j6449j6569l916N223J2048p748n570J4838k4676k5056N646J8469
14157a1714L603P227j9205l67R883J7989K365j2540M8n823L030o900j3011j597
14143b7012M845L1909K7574j4182k2673J1293m053N096J0577j2328m560P864o610
14130G740L960m511O534P075O799l074q612k758O924l244k0247q348K0180M947
14116A3365m756p858J4804J86o806k515L623k964M783n443L60N895k294o237J2190
14101A6333P938l930o745r78r72j0267n458q506J491N769j4955k0724j0831K7795
14087b4040K3280j5030L975J9904P896j8787p49N981m184k384n99J2267L588n639
14073E479J0242p931j7206j615M142QP376Q487j401j2235j5331j5241M396J6537
$$ plain form
14170 31216 32046 15597 -972 -4888 335 12383 4635 -935 13903 -10773 -35829 -30183 -11714
14157 -11714 -8111 -884 -20089 -20456 -10573 7416 9781 -2759 -2711 -8534 -5504 -12404 -25415 -27012
14143 -27012 -22167 9742 37316 23134 461 11754 7701 12797 23374 11046 6486 14350 7740
14130 7740 11700 7189 13723 20798 27597 24523 15911 13153 20077 16833 -3414 -11762 8418 13365
14116 13365 8609 751 15555 15741 8935 6420 10043 7079 11862 6419 6779 12674 10380 4143 16333
14101 16333 24271 20341 13596 12618 11646 1379 -4079 -12585 -11094 -5325 -20280 -41004 -51835 -24040
14087 -24040 -760 -15790 -11815 8089 15985 -2802 -3551 2430 -1754 -4138 -4737 7530 11118 5479
14073 5479 15721 7790 -9416 -11031 -6889 -6881 495 8982 7581 -4654 -19985 -35226 -30830 -14293
14059a4293M912m600o605J2249L470o502R515J4271o289j485n75q88j9969K454
14045a4335K114R706Q400o672M586J2909K413j7726n896J684J5K497P968q251
14031e88m330k792j802Q589J1892J9220R440j3907j5246N437P600j8195j4385
14018i067k193J4163r258Q444N708m34J7171j279j7047p101M690r70P699O971
14004A7497R90Q764N185k329L160p83j1587R78o259j8120K236j976P189k7716
13990b2771j3581K1776J6181j4430J2370L320R39o074j8813j5150P133J2834J475
13977a4791J489q032j6046L232j5011n139K1103J5179J0273j4101J8874K5667
13965B2697o280k0232K22N587J2514N003j1235j7384M157K5925M611l898J398
$$ plain form
14059 -14293 -9381 -13981 -20586 -8337 -4867 -11369 -1854 12417 6128 4643 4068 3180 -16789 -14335
14045 -14335 -12221 -2515 5885 -787 3799 16708 19121 1395 -4501 -2817 -2802 -305 7663 -588
14031 -588 -4918 -7710 -9512 -923 10969 30189 39629 25722 10476 15913 23513 5318 -9067
14018 -9067 -11260 2903 -6355 2089 7797 7363 24534 23255 6208 -893 3797 2827 10526 17497
14004 17497 18487 27251 32436 30107 33267 32484 20897 21875 15616 -2504 -268 -2244 4945 -22771
13990 -22771 -36352 -14576 1605 -12825 -455 2865 3804 -2270 -21083 -36233 -29100 -16266 -14791
13977 -14791 -13302 -21334 -37380 -34148 -49159 -54298 -33195 -18016 -7743 -21844 -2970 22697
13965 22697 16417 -3815 -3593 1994 14508 19511 8276 -9108 -4951 20974 25585 21687 23085
13952B3085r873O444j4054m970q116O734r476j4290p249q302j206J8798M708J4847
13938b920j311K2l490Q039P685p736k2605R591k808R105R031J44P971L923K008
13923A6649J1250M554n639j7625l923J6519q03N248m209j3745j2693J0561p129
13910i85j1902l724J308J522O329J0479M430m411L010P196j4859n866k140m370
13896a3983N820M301j6872j6405J76Q646J0746K141P979K60J0448q20J597l536
13882D98j934m404J2001r216P098o298O324J3331j250N74j1608j1264M969J7109
13868A5930J230L039k356j3540p238P805K0088N467j6284j6888r949L422p488
13855a6762J2958K4269Q789l303j3201j7711k2564R360J0232l826M997Q932j1433
$$ plain form
13952 23085 13212 19656 5602 632 -7484 -750 -10226 -24516 -31765 -40067 -41273 -22475 -17767 -2920
13938 -2920 -4231 -4209 -7699 340 8025 289 -22316 -12725 -15533 -6428 2603 2747 10718 14641 16649
13923 16649 27899 32453 26814 9189 5266 21785 20982 26230 22021 8276 -4417 6144 -985
13910 -985 -12887 -16611 -15303 -13781 -7452 3027 7457 3046 6056 13252 -1607 -7473 -9613 -13983
13896 -13983 -8163 -3862 -20734 -37139 -36963 -28317 -17571 -15430 -7451 -7191 3257 2437 4034 498
13882 498 -1436 -5840 6161 -3055 4043 -2255 4069 17400 16150 16724 5116 -6148 -1179 15930
13868 15930 17160 20199 17843 4303 -2935 4870 24958 30425 14141 -2747 -12696 -9274 -16762
13855 -16762 -3804 20465 29254 25951 12750 -4961 -27525 -18165 -7933 -11759 -6762 2170 -9263
13842i263j1064L947k655M2K3173K5349l05k0167l754j78j2544j3671O541J6847
13828B298k234j7624O217K3746J2990k9001j4583P114J4327O201J1045q993j3453
13815a950M049j41K4511P445j4703q493n883L852K757p258j9929j0033j734O454
13801b1056Q423N142J1878K215r497R0K0442N289k2750p9J2153k7253k0646J3509
13787b2140O515N390J5575L410L790P922j0373l636j1923N735j2195J3079J7305
13774A8454o987r5p116j6416L327J2996m464j5905q584L562Q560R742j4932K5094
13760G236P092j2300n119O793M745j1890r177O6j4474j0026N093K8204K0661J3408
13746C0312r146q739J4905Q316j3396J0357Q622q560k5809M824o3j9699J1595
$$ plain form
13842 -9263 -20327 -16380 -19035 -18993 4180 29529 29224 9057 5303 5125 -7419 -21090 -14549 2298
13828 2298 64 -17560 -11343 12403 25393 -3608 -18191 -11077 3250 9451 20496 11503 -1950
13815 -1950 2099 1958 26469 33914 19211 10718 4835 8687 11444 4186 -15743 -25776 -27510 -21056
13801 -21056 -12633 -7491 4387 6602 -2895 -2805 17637 22926 176 97 12250 -15003 -35649 -22140
13787 -22140 -15625 -10235 5340 8750 12540 20462 10089 6453 -5470 265 -11930 1149 18454
13774 18454 11467 11372 4256 -12160 -8833 4163 -301 -16206 -24790 -21228 -12668 -2926 -17858 7236
13760 7236 14328 2028 -3091 3702 8447 -3443 -12620 -12554 -27028 -37054 -31961 -3757 16904 30312
13746 30312 21166 12427 27332 35648 22252 32609 41231 32671 6862 11686 11623 -8076 3519
13733C519J9100m483p240P85j2630m012J0818k0641m231J7214K2361N967n096
13720B1431K655l6276q433J0798J1193n580j465P65j042m13O710Q775m055J0673
13706A5736q85m787M80q248P291K032n759N32k275j151j1607k8483J3318K3082
13692g24O667J70q343P079K2771p142j911O092k042J227j225j1242j4239q780
13678a1642L258P128M180j1040m591N930J2633m684r799J9369R914R00J0568Q758
13664D0882l439r000J291r644j3604m733J0002q304Q547P662M340K999m358j6137
13650F504j5452k780j609Q356O075k11L902N341j4485j399j390J209K4351R83
13636A9395l510o596j1531j1675J823M23K110l443l631k201O6q12Q674P592M504
$$ plain form
13733 3519 22619 18136 10896 11681 -949 -4961 5857 -14784 -19015 -1801 20560 26527 21431
13720 21431 24086 -12190 -20623 -9825 1368 -4212 -5677 -4912 -5954 -6367 343 9118 5063 15736
13706 15736 14851 10064 10544 2296 9587 11619 5860 6392 4117 2966 -8641 -37124 -23806 -724
13692 -724 5943 6113 -2230 4849 27620 20478 18567 24659 22617 23844 22619 11377 -2862 -11642
13678 -11642 -8384 -1256 2924 -8116 -12707 -6777 5856 1172 -8627 10742 20656 21556 32124 40882
13664 40882 37443 28443 29734 20090 6486 1753 11755 3451 11998 19660 24000 26999 22641 6504
13650 6504 -8948 -11728 -13337 -4981 1094 883 4785 10126 -4359 -5758 -7148 -5939 18412 19395
13636 19395 15885 9289 -2242 -13917 -12094 -11671 -9561 -13004 -16635 -18836 -18770 -19582 -10908 -3316 1188
13621A188Kr753m12J1850K2843P00M765k1813j9660J1279k167N302J1924K5168
13607D1216P780j6962j9190r613k3530m820K594K1667O952R248J6097n785p893
13594A7761j9435j1848Q368J9156p11n640J5696p18J1530m95r847K403k478N863
13580B9605O924L870k2440j3984N415j0994K173J3926J2263Q492j1796n833J4344
13567C1965r869n092j6019K152J6534o680J919O875M65n811k1217p450k064O337
13553g955L1677K939j5521m386j9961l67M0058K4713K312J4486j1573k8347K258
13540C0333j0692k6238m766J4566J0820J2233N623K104k1632j3008J3154M494
13528A6991r92J6278J0559K478j7914j8666O120K2826J523o971R65K087L729k3250
$$ plain form
13621 1188 1190 -8563 -8975 2875 25718 26418 31183 9370 -10290 989 -1178 4124 16048 41216
13607 41216 48996 32034 12844 3231 -20299 -25119 -22525 -858 6094 15342 31439 25654 17761
13594 17761 -1674 -13522 -5154 14002 13291 7651 23347 22629 34159 33664 23817 26220 23742 29605
13580 29605 36529 40399 17959 3975 9390 -1604 569 14495 26758 35250 23454 17621 31965
13567 31965 22096 17004 985 3137 19671 12991 14910 21785 22250 16439 -4778 -12228 -14292 -7955
13553 -7955 23722 26661 11140 6754 -13207 -13574 26484 51197 53509 67995 56422 28075 30333
13540 30333 19641 -6597 -11363 3203 14023 26256 31879 33983 12351 -657 12497 16991
13528 16991 15999 32277 42836 45314 27400 8734 14854 37680 39203 32232 33197 35284 39013 15763
13514A5763j4194j0965p591J8708K9829K400N335o321j7816P578l018n481j7664
13501c437k169J3791L159O090j4631Q210K536j4567j628J1232L813j2511j4272
13488a4384M446J4874Q44r500M763J2042n578r906K2152N324j395K180k270n9
13474B3533l287P951j3638K646J0550k721j4564j232P835M979Q982j0838O065
13461B6261j1663r641q815J6188K822M413R003J2694j3130k2576k510K4278K1211
13448D8535j3620j9064k362J5500R640q366j4760r992M067p508j624J4528O719
13435B1693M334k2849j5913l444J5671J714K323j1308j6055K336O790J7645J4568
13422A7505Q608M089J2852R990j0819j3055k8744j9471K341J5995J2580P632J9864
$$ plain form
13514 15763 1569 -9396 -16987 1721 31550 33950 39285 32964 15148 22726 19708 14227 -3437
13501 -3437 -5606 8185 11344 17434 2803 11013 13549 -1018 -2646 8586 12399 -112 -14384
13488 -14384 -9938 4936 5780 -3720 1043 13085 7507 -2399 19753 25077 23682 25862 23592 23533
13474 23533 20246 28197 14559 17205 27755 25034 10470 9238 17073 22052 31034 20196 26261
13461 26261 14598 4957 -3858 12330 15152 19565 28568 41262 28132 5556 3046 27324 48535
13448 48535 34915 15851 13489 28989 38629 30263 15503 5511 9578 2070 446 14974 21693
13435 21693 26027 3178 -12735 -16179 -508 1206 3529 -7779 -23834 -21498 -14708 2937 17505
13422 17505 26113 30202 43054 53044 42225 29170 426 -19045 -16704 -709 11871 19503 39367
13409C9367L0894J4613k2536j7821k494P76m118j3895R280k534M06j5062k501
13396A4375P199N907J573l608l648p704J656J6940J6904k0670j3459J0316O294
13383C2075j7766o009J7580J0501j1094q77o711j0817J1894n612j0277R435j641
13370A0681m611l88j288O277Q835p700L05l306J0018j36J7181J6610M646n142
13356E1982M708j0181j2692N33p193j5815J7191K325j0944J1408R136r734N477
13343C6201J5926j0026Q356Q322j4464Q267J8521o306r832k137J540j925q412
13330D4031M08Q368L935l510p97J5808J9179r90L571N24k442q551J2275L341J2195
13315A07345K6537J6299K8787N2791P9988R0513R5839J14811J40309J27190Q7396
$$ plain form
13409 39367 70261 84874 62338 44517 42023 42799 38681 24786 34066 31532 31938 16876 14375
13396 14375 21574 27481 29054 25446 21798 14094 15750 32690 49594 28924 15465 25781 32075
13383 32075 14309 8300 25880 36381 25287 24410 17699 6882 18776 13164 2887 12322 10681
13370 10681 6070 5682 4394 10671 19506 11806 12111 8805 18823 18687 35868 52478 57124 51982
13356 51982 56690 46509 33817 34350 27157 11342 28533 30858 19914 31322 40458 30724 36201
13343 36201 52127 42101 50457 58779 44315 52582 71103 64797 54965 52828 54368 52443 44031
13330 44031 44439 52807 56742 53232 52435 68243 87422 86432 90003 90527 88085 79534 91809 95150 107345
13315 107345 133882 150181 178968 231759 311747 402260 498099 612910 753219 880409 967805
13304I67805N4964K3781k3206q9955j19728r7816j23339j32855r3991n9251m6036
13293B60373k6313j6268o911j0772m710j4093l5153n656M156N540J502l8583k662
13280A10450J5726J1194N57j2481k2502p726K302O035q463k0881Q650J6531r594
13267H9798n467N523L152j5308j304J2076k512r452O339J4585K0852O207q247
13254A16242j6364p881j1234m552M606m305o26M767j5331r276l626j1787m109
13241C6524M622o8M516K4808m501j3650p290J4008j377j3193r210J0684J3077
13228E8950j703j0683n057J5759n407K0863R24q436k0290j9638L220R435K032
13215C9969M683k743k762l084J0618j5029J5242J4578K985L48q622K260K4913
$$ plain form
13304 967805 1022769 1046550 1023344 933389 813661 715845 592506 459651 365660 306409 260373
13293 260373 234060 217792 210881 200109 195399 181306 146153 140497 144653 150193 151695 113112 110450
13280 110450 126176 137370 137927 125446 102944 95218 97520 103555 95092 74211 82861 99392 89798
13267 89798 84331 89854 93006 77698 76394 88470 85958 76506 82845 97430 118282 124489 116242
13254 116242 99878 91997 80763 76211 80817 76512 75886 80653 65322 56046 52420 40633 36524
13241 36524 41146 41078 45594 70402 65901 52251 44961 58969 57592 44399 35189 45873 58950
13228 58950 57247 46564 41507 57266 51859 72722 73646 65210 44920 25282 28502 37937 39969
13215 39969 44652 41909 39147 36063 46681 31652 46894 61472 64457 64805 56183 58443 83356
13202H3356m080j3876O68L202p168P053j2528p276k6441l3N544J4851K3047J5842
13188H2161n481K7956L3784p559k1490r899k4930j7064J4753J6799N196o201k869
13175H5156q148P99Q637O334k0974q429P676J32P697Q686k0039k644J0309j0264
13161F4928K143J3247M357k8993n482R360J871J5879n920m308J701K295j6004
13148E5074J4522J9553p608J0275J2448p392o550O612R741K582M204J1071P025
13135A31557J5901J2128k117O876L029L329J0157j973r933r675j9565j860J074
13122A38928j837J236r183j8959k0555K7371M750r313n839K122J4502O978K605
13109A32806j471o714O836N739j9176J7696K9318K80K884J165j0747k2612j3401
$$ plain form
13202 83356 79276 65400 66068 69270 62102 69155 56627 49351 22910 22877 28421 43272 66319 82161
13188 82161 76680 104636 138420 130861 109371 99472 74542 57478 72231 89030 94226 88025 85156
13175 85156 77008 77807 86444 92778 71804 63375 71051 71183 78880 87566 67527 64883 75192 64928
13161 64928 67071 80318 84675 55682 50200 59560 61431 77310 71390 67082 68783 71078 55074
13148 55074 69596 89149 81541 91816 104264 96872 90322 96934 106675 109257 113461 124532 131557
13135 131557 147458 159586 157469 164345 167374 170703 180860 178887 168954 159279 139714 137854 138928
13122 138928 137091 138327 129144 110185 89630 117001 121751 112438 106599 108721 123223 130201 132806
13109 132806 131335 124621 131457 137196 118020 135716 165034 165314 168198 169363 158616 136004 122603
13096A22603Q26l1685M069K1121l618j3367L974j106J4133J5128R618J866p063
13083A36499m979k099n149p288K903k186K5158J9647J3848j1564K494L1163J7861
13070B16308J911j4055N639l027j0770J3311L5440K8898J025r936O31L2447N2200
13057C50022Q9031J14664J38216K30425L08017L18715K74096K13354Q3040j28229
13047A991351l52119m06388l27370j77675j21577q6924n7950k7895o224j8642
13037D08587j8120k0756j8328k1467l4675k2303p039k2587j3420J1059j3497j1176
13025B16278R729J803r506R61j0417M418J0870P919k473M779J6866J9638J2729
13012B83594R487K788J2326p19J9133L4466J6587j4293L863R650o575o418j2558
$$ plain form
13096 122603 123429 91744 95813 116934 113316 99949 103923 102817 116950 132078 141696 143562 136499
13083 136499 131520 129421 124272 116984 119887 117701 142859 162506 176354 164790 167284 198447 216308
13070 216308 218219 204164 209803 206776 196006 209317 244757 273655 274680 264744 265375 297822 350022
13057 350022 439053 553717 691933 922358 1230375 1549090 1823186 2036540 2119580 1991351
13047 1991351 1639232 1232844 905474 727799 606222 519298 461348 433453 427229 408587
13037 408587 390467 369711 351383 329916 295241 272938 265899 243312 229892 240951 227454 216278
13025 216278 226007 227810 218304 219265 208848 213266 224136 232055 229582 234361 251227 270865 283594
13012 283594 293081 295869 308195 307476 326609 361075 377662 363369 367232 376882 370307 363889 351331
12999C51331J9400P416k9596j359M687J0809O444j7358j7692o033K928K5636J7650
12986C74263k1118j7800j9856J2537J9642r942j2835K330k811M754L433j356K875
12973C34116j5612K780J2040J7529n882Q7J1948j1914J9018Q806K2351j287K44
12960C94224j745k015O411J4834J342L853K416N734K3221J5691k699l640J9587
12947D77214q756N69R975j612K834J8471J6337J9840M1444L1776J4137q21j925
12934F19483J4562J6554J1167J0363J4251K4629J6176K4949L1973P4424R2238
12923I50769J02603R8446R0528J12028J19883J43865J88948K41569K54430K12543
12913B515612J68630R9299P0981K2155l3276j357J6716K6133R5489K27575L70724
$$ plain form
12999 351331 370731 378147 348551 347192 351879 362688 369132 351774 334082 328049 330977 356613 374263
12986 374263 353145 335345 315489 328026 347668 337726 324891 327221 324410 329164 332597 331241 334116
12973 334116 318504 321284 333324 350853 344971 345058 357006 345092 364110 372916 395267 393980 394224
12960 394224 392479 390464 396875 411709 413051 416904 419320 425054 448275 463966 461267 457627 477214
12947 477214 468458 469027 479002 477390 480224 498695 515032 534872 576316 608092 622229 621408 619483
12934 619483 634045 650599 661766 672129 686380 711009 727185 752134 784107 858531 950769
12923 950769 1053372 1151818 1242346 1354374 1474257 1618122 1807070 2048639 2303069 2515612
12913 2515612 2684242 2783541 2854522 2876677 2843401 2842044 2858760 2884893 2980382 3207957 3578681
12902C578681M97939O55638P92516Q79167R82695J065582J150816J294059J515772
12893A2412865J948844K704529M062629O396816R884589J4171915J8410816K2207422
12885I2200425K5017443K5841337K2243306J5071392P485178k17639p686435j6576086
12877A63378921k1540974k3224523k2999526k1284189j7480789j1449003o863580
12870C8536337m269071k863403k119313j711383j476127j367697j368219j336432
12862B2024692j306205j248825j172170j067704r38899p98501o87401o31619n86173
12853A3587195n47278m98018m40646m12071l65889l48643l21155l05148k97422
12844A0050925k75180k88208k63129k63553k56601k43879k51429k45929k37289
$$ plain form
12902 3578681 4076620 4732258 5524774 6403941 7386636 8452218 9603034 10897093 12412865
12893 12412865 14361709 17066238 21128867 27525683 37410272 51582187 69993003 92200425
12885 92200425 117217868 143059205 165302511 180373903 187859081 187641442 179955007 163378921
12877 163378921 141837947 118613424 95613898 74329709 56848920 45399917 38536337
12870 38536337 34267266 31403863 29284550 27573167 26097040 24729343 23361124 22024692
12862 22024692 20718487 19469662 18297492 17229788 16290889 15492388 14804987 14173368 13587195
12853 13587195 13039917 12541899 12101253 11689182 11323293 10974650 10653495 10348347 10050925
12844 10050925 9775745 9487537 9224408 8960855 8704254 8460375 8208946 7963017 7725728
12835G725728j97896j98476j94516j93601j78811j50626j56948j57380j16090
12826F181384j10259j19763j08349j19664j15639j24074j07254r2824p9451r7787
12816E106320j12064j01991r9027r5348j25361j64528j67759j34845j20682j06288
12806C878427q1268o4942o6275m8519l5156p2810j03863j14256q4156o7088q3535
12795C056559l8550m0361m7906p3808q1713o8998n2527l6945m9836m9255l8432
12784B478228o0887n6173n4493o1272o7956p7465n3110k5503m9485n1642l1623
12773A888619n3257l2007l9786l9764l4891l0642m6128n8571l8027m2594l5187
12762A437765l5026l5311k6463j6207j4231j4484j4377l0779j6300l5286l2650
$$ plain form
12835 7725728 7527832 7329356 7134840 6941239 6762428 6611802 6454854 6297474 6181384
12826 6181384 6071125 5951362 5843013 5723349 5607710 5483636 5376382 5283558 5204107 5106320
12816 5106320 4994256 4892265 4793238 4697890 4572529 4408001 4240242 4105397 3984715 3878427
12806 3878427 3797159 3732217 3665942 3617423 3582267 3509457 3405594 3291338 3207182 3140094 3056559
12795 3056559 3018009 2977648 2929742 2855934 2774221 2705223 2652696 2615751 2565915 2516660 2478228
12784 2478228 2417341 2361168 2306675 2245403 2177447 2099982 2046872 2021369 1971884 1920242 1888619
12773 1888619 1835362 1803355 1763569 1723805 1688914 1658272 1612144 1553573 1515546 1472952 1437765
12762 1437765 1402739 1367428 1340965 1324758 1310527 1296043 1281666 1250887 1234587 1199301 1166651
12751A166651j8847r429J9091R596R769J8287J5684K8882K3803M157O318L234
12739A277196L628k3876m8669m9128n8736k7076o785j8107o725j9080l154K0389
12727A039877J757j7574J608m257m478R71n699j688l1603m0676k8587j2960j310
12714H95381k3928q914j9700R030j343r065J152Q461J7064R040L582L72j2952
12701H68180j6535L474L8725L2907k61l1699k2193K893J9962M9412K9632K3124
12689I97621K9491J1173k116k8396j5274j4170l0902l4588M028l931j1182j1927
12677H89827J2633L1617M4687J0426K4198J0871J0901M0038L9050J9295j2364
12666A121179j834J4291K3908K5285j0134k1282P673J9467J2545J3039L8743N5467
$$ plain form
12751 1166651 1147804 1138375 1157466 1167062 1176831 1195118 1210802 1239684 1263487 1267644 1273962 1277196
12739 1277196 1280824 1256948 1208279 1159151 1100415 1073339 1066554 1048447 1041722 1022642 1019488 1039877
12727 1039877 1041634 1024060 1025668 1021411 1016933 1017904 1012205 1010517 978914 938238 909651 896691 895381
12714 895381 871453 862539 842839 851869 850526 841461 842613 851074 868138 877178 880760 881132 868180
12701 868180 851645 855119 893844 926751 926490 894791 872598 875491 895453 944865 974497 997621
12689 997621 1027112 1038285 1036169 1007773 992499 978329 947427 912839 916867 912936 901754 889827
12677 889827 902460 934077 978764 989190 1013388 1024259 1035160 1075198 1114248 1133543 1121179
12666 1121179 1119345 1133636 1157544 1182829 1172695 1151413 1159086 1178553 1191098 1204137 1242880 1298347
12654A298347P7495J06563J00817J22940J37137J34453J23098J14178J02410J06739
12644B424177J29627J94091K32553K52355L02442M23235O52993R46152J232177
12635F789802J374773J398835J406638J367019J211074J104677J369105K116003
12627A8137926L175994M382769N976958Q567077J3274577K2050596L6136589N2779149
12619A64481635O3719825O3221252N2580309L5534288N891651l9738028p6395663
12612B69295269q2993453n9206062l3300791j8612012j1285378p433844n240558
12605E1223171m061907l436468l108763k881628k564438k176581j798992j500185
12597B9694209j272362j157347j111179j151852j177827j147771j035901r42207
$$ plain form
12654 1298347 1375842 1482405 1583222 1706162 1843299 1977752 2100850 2215028 2317438 2424177
12644 2424177 2553804 2747895 2980448 3232803 3535245 3958480 4611473 5557625 6789802
12635 6789802 8164575 9563410 10970048 12337067 13548141 14652818 16021923 18137926
12627 18137926 21313920 25696689 31673647 40240724 53515301 75565897 111702486 164481635
12619 164481635 228201460 291422712 344003021 379537309 385428960 345690932 269295269
12612 269295269 186301816 127095754 93794963 75182951 63897573 56463729 51223171
12605 51223171 47161264 43724796 40616033 37734405 35169967 32993386 31194394 29694209
12597 29694209 28421847 27264500 26153321 25001469 23823642 22675871 21639970 20697763
12589B0697763q96197p73684o89639o16947n41845m91433m85170m68130m49846
12580A5284872m32346m23449m07399m07569m07089m06397m05147l47378l29540
12571A1718558l08718k82442k69619k49431k59597k56191k76678k58232k41188
12562I316462k07916j85014j59135j36929j32557j39061j57909j68607j39589
12553G889745j39611j52361j80339j95268k06264j95340j95958j84656j66600
12544F273348j64643j55797j70939j36920j14585j31176j39000j39349j20812
12535E000127j22921j26713j31647j05005q7024r4143p8981p2527p1321p0229
12525D039616l4484m3868l8671j3322Q856J6461Q5849J64050K39985K86063K88254
$$ plain form
12589 20697763 19801566 19027882 18338243 17721296 17179451 16688018 16202848 15734718 15284872
12580 15284872 14852526 14429077 14021678 13614109 13207020 12800623 12395476 12048098 11718558
12571 11718558 11409840 11127398 10857779 10608348 10348751 10092560 9815882 9557650 9316462
12562 9316462 9108546 8923532 8764397 8627468 8494911 8355850 8197941 8029334 7889745
12553 7889745 7750134 7597773 7417434 7222166 7015902 6820562 6624604 6439948 6273348
12544 6273348 6108705 5952908 5781969 5645049 5530464 5399288 5260288 5120939 5000127
12535 5000127 4877206 4750493 4618846 4513841 4426817 4332674 4253693 4181166 4109845 4039616
12525 4039616 4005132 3961264 3922593 3909271 3918127 3934588 4020437 4184487 4424472 4710535 4998789
12514D998789K20638M9033j92194l94059n06392m86252l61422k43306j61444j13768
12504B809623j12018q4123q2614r4974o3908q6216r0811m8370l7192n1812m8130
12493B009455k8006l5626m5736n1272n5063n1449j5798l7306l0979m5165l6001
12482A577054k7601k8053m1153n6579k6568l2700n437j0902k3836j3140j4844
12471A296241j6431k2759l233j3976j3889k3137j0767j5543k4956j1067J1568
12460A152051P3381P6221P6388J10956J20716J14086R0810P1349L5389R875n1867
12449A879355j23143j51914j63212j42438j08426q5765p5447o3843l1988n155
12439I28024l3039k4460k8083k3591l3533j4672l744K54k2041m269k2386k6313
$$ plain form
12514 4998789 5219427 5268460 5076266 4682207 4175815 3689563 3328141 3084835 2923391 2809623
12504 2809623 2697605 2613482 2530868 2435894 2371986 2285770 2194959 2146589 2109397 2057585 2009455
12493 2009455 1981449 1945823 1900087 1848815 1793752 1742303 1726505 1689199 1658220 1613055 1577054
12482 1577054 1549453 1521400 1480247 1423668 1397100 1364400 1358963 1348061 1324225 1311085 1296241
12471 1296241 1279810 1257051 1253818 1239842 1225953 1202816 1192049 1176506 1151550 1140483 1152051
12460 1152051 1225432 1301653 1378041 1488997 1609713 1723799 1814609 1885958 1921347 1931222 1879355
12449 1879355 1756212 1604298 1441086 1298648 1190222 1104457 1029010 965167 933179 928024
12439 928024 894985 870525 842442 818851 785318 770646 766902 767156 745115 740846 718460 692147
12427F92147l517L5236M0833P754l7318m2024k0877l8670j9331J2481J4835L8325
12415F79874K1108K7935n015m1234p9341m4158m5123k1150k2457m2245q309P304
12403D27189n908p303k0565k4617j9703J1826J3900l191j5125j0019k4481j3408
12391C08595J7742Q017J825R332K934j5817j2517j4773j2157n461L8312K9448
12379C55480j6731k5046j6344J6055J235j8519n2971l9726l755O596J6071k23
12367B22122m858k317Q770J0129M683P475k1253m0093j9508J4638N246J356J1129
12354A97519L980J3024O250m549k658l4157k1535P915o22k2448m247Q330L568
12341A50370p46p722L060j0707p785k0860j9251l697O683K2562O245j5411p626
$$ plain form
12427 692147 688630 723866 764699 772453 735135 693111 672234 633564 614233 626714 641549 679874
12415 679874 700982 728917 723902 682668 603327 559169 514046 492896 470439 428194 419885 427189
12403 427189 421281 413978 393413 368796 349093 360919 374819 371628 356503 346484 322003 308595
12391 308595 326337 334354 336179 345511 348445 332628 320111 305338 293181 287720 326032 355480
12379 355480 338749 313703 297359 313414 314649 296130 243159 203433 199678 206274 222345 222122
12367 222122 217264 214947 223717 233846 238529 246004 224751 184658 165150 179788 185034 186390 197519
12354 197519 201499 214523 220773 216224 213566 179409 157874 165789 165167 142719 138472 146802 150370
12341 150370 149624 141902 144962 134255 126470 105610 86359 82662 89345 111907 118152 102741 95115
12328I5115J2541l1456r26K1975J6622j3510j3033q16k4019m4060p423O198J0429
12315B7637r060j108j4754k3502k4565j0111K4441M2828N5764N6746M7854M675
12303A76845m106k137q139p055l3260j3565o017L560J8751R958K253m249K050
12290A34889m868j0683O45M097j9470N211K449L37j0522p128k0674K136q086k0643
12276D7690j7042l399J1689o25J0748K1414o89N37N430r121O611O165j0850k899
12262F5659o38r287m831K0663K8843o493k8044j0382n334j60J7720k500j9968
12249D5248k1253j7557O868P927J1044K159j9604j9518j8279l036K6814K8429
12237B9242J3579j4072j1588o368j4360Q718J5702P06p13p7J0244O869j135l647
$$ plain form
12328 95115 107656 76200 75274 97249 113871 100361 87328 86512 62493 18433 11010 17208 27637
12315 27637 18577 17469 2715 -20787 -45352 -55463 -31022 11806 67570 124316 172170 176845
12303 176845 172739 170602 162463 155408 122148 108583 102566 106126 124877 134835 137088 132839 134889
12290 134889 130021 119338 119983 124080 104610 109821 112270 112607 102085 94957 74283 76419 68333 47690
12276 47690 30648 27249 38938 38313 49061 70475 69786 70323 75753 66632 73243 79408 68558 65659
12262 65659 65021 55734 50903 71566 100409 93916 65872 55490 50156 49996 67716 65216 45248
12249 45248 23995 6438 13306 21233 32277 34436 14832 -4686 -22965 -26001 813 29242
12237 29242 42821 28749 17161 10793 -3567 5151 20853 21559 20846 20769 31013 37882 36747 33100
12223C3100J667R645N176q45m958j0372K923R119L679k5254l593J1796j6605K025
12209A7503K8223m55l881j2010j2475r498j2645l751R681K40N277O197K4901J7376
12195E4683O630K709J9804J1927J3377J7185L0181K2435N900N659K7609K4007
12183B42106M1246P0560J53989K29824L22139L34654L01938K25660Q4862j34823
12173A872155l50547m27337l48370j92159r6781q7056m8221m8226k1424j7996
12163B34038m1059k5832k4233k0934M879k4632J3206R974L820K9516j4284J262
12151A45721P469M521J4688k0406R26k2908k66P717q003o240J5555n303k7401
12138A06070J260j0639j0648p645N268N160J713J0129l950j5296j1700o832J9851
$$ plain form
12223 33100 34767 44412 49588 48743 43785 33413 36336 45455 49134 23880 20287 32083 15478 17503
12209 17503 45726 45271 41390 29380 16905 7407 -5238 -8989 692 932 6209 12406 37307 54683
12195 54683 61313 64022 83826 95753 109130 126315 156496 178931 184831 190490 218099 242106
12183 242106 283352 353912 507901 737725 1059864 1394518 1696456 1922116 2006978 1872155
12173 1872155 1521608 1094271 745901 553742 456961 369905 321684 273458 252034 234038
12163 234038 192979 167147 142914 121980 126859 102227 115433 125407 129227 158743 144459 145721
12151 145721 153190 157711 172399 151993 152919 130011 129745 137462 129459 123219 138774 133471 106070
12138 106070 107330 96691 86043 78398 83666 88826 90539 100668 96718 81422 69722 62890 82741
12125H2741p558p5q399j1375o920K7318L0631j3185j4812p267n642o647p727o739
12111D4344N72j2542M726K78j1056q368l797J5670K3941q167j8029j721q792M471
12097B1530J336p556J4834J3218m999k1428j0369K263r472m863o004j7879L166
12084b6223K5055J7257K886P048K9725L708l936m781j0158o636j4172k5125k655
12071h007R942J589j918J6224j3397N804J5158j2627J3442M473M940o681o122
12058B2820J4388P88j0191r260Q442L2932j723j4156p032l024j4561M880J1899
12045C6202N584l256j4464j085n494Q19J2362J010P02M770j1562O480j8772q24
12031A2472o280j1087K78O374m776L532r568o956K2695L3035J812q542k7455j8399
$$ plain form
12125 82741 75183 75108 66709 55334 48414 75732 106363 93178 78366 71099 65457 58810 51083 44344
12111 44344 44916 32374 37100 37378 26322 17954 14157 29827 53768 45601 27572 25851 17059 21530
12097 21530 22866 15310 30144 43362 38363 16935 6566 8829 -643 -5506 -11510 -29389 -26223
12084 -26223 -1168 16089 18975 26023 55748 59456 55520 50739 40581 33945 19773 -5352 -8007
12071 -8007 1935 3524 1606 17830 4433 10237 25395 12768 26210 30683 35623 28942 22820
12058 22820 37208 37996 27805 18545 26987 59919 58196 44040 37008 33984 19423 24303 36202
12045 36202 41786 38530 24066 22981 17487 18306 30668 31678 32380 37150 25588 32068 13296 12472
12031 12472 6192 -4895 -4617 1757 -3019 513 -9055 -16011 6684 39719 41531 32989 5534 -12865
12017a2865k192K3717J5075j5149p198J93k237j5990K929L2024O18m599J2312
12004B6638J1397q056j8349r339p027J6757N260J3188o191k6331k639J1144J1843
11991A8295K295J517R789N178m387J4962J2518L347j3957j2804j0648j3382J935
11978A4658k058o57j5226Q555J6372K513l180k819M79l799j8995k33O643K2534
11964B4787J9595P76P331K162q421l0827N76J5440J677M352j03K606N800j4145
11950C1606j0045K031k34n401k143P455r956p631K4852K2378j364j5651k6128
11937I769j0168k4651M098Q746j207L0499N289J731j0763k2424N849K0782K1485
11924C9035q576k5719O127Q917o467j898o96k054R9j1635Q84R873j2017O351J0097
$$ plain form
12017 -12865 -15057 8660 23735 8586 1388 1581 -656 -16646 -13717 18307 18925 14326 26638
12004 26638 38035 29979 11630 2291 -4736 12021 17281 30469 24278 -2053 -4692 6452 18295
11991 18295 20590 22107 31896 37074 32687 47649 60167 63514 49557 36753 26105 12723 14658
11978 14658 12600 11943 -3283 5272 21644 24157 20977 18158 18637 14838 -4157 -4390 2253 24787
11964 24787 44382 45158 52489 54651 46230 15403 15979 31419 33096 37448 37345 39951 45751 31606
11950 31606 21561 23592 23358 17957 15814 23269 13313 5682 30534 52912 51548 35897 9769
11937 9769 -399 -25050 -20952 -12206 -13413 17086 22375 24106 13343 -9081 -3232 17550 39035
11924 39035 30459 4740 10867 19784 13317 11419 10723 8669 8768 -2867 -1983 7890 -4127 2224 12321
11909A2321J4057j3589l4507l339L516J2909M45l218J3971J0953M355j4935k1584
11896a8645J166K1170K5225K1606r087q318Q827J5550j4757r282j0844j0410L450
11883A5651J445q89r415l089R130J6366J3230N382O190j1021j5629R754m92o711
11869B9902k1122J4849r091p809j9370p465K6203J5588r214o763j1173j6354L01
11856b1518k7003k040n426K4973K5584j454L367J1594J3174m270k867m949j4075
11843d910J549Q979r329p271M500K1979P189p190k3510J68j1996p678J1909j6606
11829c2217R429K748L110L941j400P976p968J1859n148J6483Q383k5579q98j3598
11815b2879k071N96N993L306n891J4656L245Q954K6006k069j1987l391p596N671
$$ plain form
11909 12321 26378 12789 -21718 -25057 -21541 -8632 -8187 -11405 2566 13519 17874 2939 -18645
11896 -18645 -17479 3691 28916 50522 41435 33117 41944 57494 42737 33455 22611 12201 15651
11883 15651 17096 16207 6792 3703 12833 29199 42429 47811 54001 42980 27351 37105 36613 29902
11869 29902 8780 23629 14538 6729 -12641 -20106 6097 21685 12471 5708 -5465 -21819 -21518
11856 -21518 -48521 -50561 -55987 -31014 -5430 -6884 -3517 8077 21251 16981 14114 9165 -4910
11843 -4910 -3361 5618 -3711 -10982 -6482 15497 22686 15496 -8014 -7846 -19842 -27520 -15611 -32217
11829 -32217 -22788 -20040 -16930 -12989 -14389 -6413 -14381 -2522 -7670 8813 17196 -8383 -9281 -22879
11815 -22879 -24950 -24354 -18361 -15055 -20946 -6290 -3045 5909 31915 29846 17859 14468 6872 12543
11801A2543J3037j5003k2671J300n168j991j7315k492J955J7280N419J4108J1206
11788A2208J6206K904Q16k611m000j95M28k0754N667J4539k1319j9380J0830N371
11774G10K47K999J4165R549j303p047j1099r069Q227O278M123j371j2735O055
11760I729J4013j2665k644Q715j0606M92m265L599j206L344j49n379M763L438
11746A1179j415J292J1914k1209k724P125K3542o853m3J1889L301j1961Q443J9981
11732E4461P076j2269j7600j0716r671j5783j0110K520J1428q544j5900R812R733
11719e563O164J4259Q153o467j8680k1687Q26J4327N861J130O568j8250n191L308
11705a5242Q922P787k190k083L499j1640j4880J300R899o568k395J9588m352k2140
$$ plain form
11801 12543 25580 10577 -12094 -10794 -15962 -17953 -35268 -37760 -35805 -18525 -13106 1002 12208
11788 12208 28414 31318 32134 29523 25523 25328 25756 5002 10669 25208 3889 -15491 -4661 710
11774 710 957 3956 18121 27670 26367 19320 8221 -848 7379 13657 17780 16409 3674 9729
11760 9729 23742 11077 8433 17148 6542 7034 2769 6368 5162 8506 8357 2978 7741 11179
11746 11179 9764 11056 22970 1761 -963 6162 29704 22851 22808 34697 37998 26037 34480 54461
11732 54461 61537 49268 31668 20952 11281 -4502 -14612 -12092 -664 -9208 -25108 -15296 -5563
11719 -5563 601 14860 23013 16546 -2134 -23821 -22995 -8668 -2807 -1677 4891 -13359 -18550 -15242
11705 -15242 -6320 1467 -723 -2806 693 -10947 -25827 -24527 -14628 -21196 -23591 -4003 -8355 -30495
11691c0495o868K4496K3439j409J0222l49J640R213j346L748j0750j4299k3527
11678a6285O857l131m476j3440P108J9650M836N31O727J91L358J2541M040j5747
11664A2760j5439n488k2353J6313J9669J6715Q830n303J535m492M17p184o922
11651I058Q921j2858m426l032j3261n905p348P112l145n890m453J8387Q307J4304
11637E771l221O29J1799r06k6248o894J1605J3411l704Q270l213K6481R27k6011
11623H696j3492K162J1083m830j4123j2859o823P201J2258N492o274L629M090
11610c790K4466m834j5290Q93k0896j3988L655J1452o675Q782K4152O929j471
11597A3385m022j0347p595k5106P473O509M173K191o294J7665J027j8276p332
$$ plain form
11691 -30495 -37363 -12867 10572 9163 19385 19036 20676 29889 28543 32291 21541 7242 -16285
11678 -16285 -9428 -12559 -17035 -30475 -23367 -3717 1119 1650 8377 8568 11926 24467 28507 12760
11664 12760 -2679 -8167 -30520 -14207 5462 22177 31007 25704 27239 22747 23164 15980 9058
11651 9058 17979 5121 695 -2337 -15598 -21503 -28851 -21739 -24884 -30774 -35227 -16840 -8533 5771
11637 5771 2550 3179 14978 14072 -12176 -19070 -7465 5946 2242 10512 7299 33780 34707 8696
11623 8696 -4796 -2634 8449 3619 -10504 -23363 -30186 -22985 -10727 -5235 -11509 -7880 -3790
11610 -3790 20676 15842 552 1445 -19451 -33439 -29784 -18332 -25007 -16225 7927 14856 13385
11597 13385 9363 -984 -8579 -33685 -26212 -19703 -15530 -13339 -19633 -1968 -941 -19217 -26549
11584b6549N038l017K001J2772K2284J3843k623j2852J8931J1992k4091j1989
11572E740p23J317J1027j2743p639J0954K187j869J42J1840j7526o775n143j0942
11558b0153j6071N384J1728J555K2659m462k2557j758N674R540P908k064j2490
11545a5107Q233j1646j3488K2599J1798j8729j1183J0637J6473J0813j1695m405
11533e700L873n5M408R779q624j1482P4J1877m901L259O604j5445n302J0288m663
11518f010j5649J0270N678j7401K099J2519j0521J6342K0735R868j2233r479l1967
11505b5749j9903J2729J240j968Q494j230l519J6241L225j1104r576O877P836
11492a6407R93R606o085k260J3619q575l531j966M886j7225p766J4965J8511j0759
$$ plain form
11584 -26549 -21511 -24528 -22527 -9755 12529 26372 23749 10897 29828 41820 17729 5740
11572 5740 5017 6334 17361 4618 -3021 7933 10120 8251 8393 20233 2707 -4068 -9211 -20153
11558 -20153 -36224 -30840 -19112 -17557 5102 640 -21917 -23675 -18001 -8461 -553 -2617 -15107
11545 -15107 -6874 -18520 -32008 -9409 2389 -16340 -27523 -16886 -413 10400 -1295 -5700
11533 -5700 -1827 -1882 2526 12305 3681 -7801 -7727 4150 -751 2508 9112 -6333 -11635 -1347 -6010
11518 -6010 -21659 -11389 -5711 -23112 -21013 -8494 -19015 -2673 18062 27930 15697 6218 -25749
11505 -25749 -45652 -32923 -31683 -33651 -25157 -26387 -29906 -13665 -10440 -21544 -31120 -24243 -16407
11492 -16407 -15414 -5808 -11893 -14153 -534 -9109 -12640 -14606 -9720 -26945 -34711 -19746 -1235 -11994
11478a1994P566O006l139j6788n118J180j9012O103J7849m09j1785J86K5943j0444
11464a3856m972j0629j5828J6257Q537l860R838K6289m6j3768p400j0644m711
11451b4793J2573L771J5521o478k532J2731Q517M369j8007P06R740K942n795n838
11437G427J05K525j4603K673j575j2443j858J2840p07r984j6615l485J6035N020
11423a4645N188J1334K499j936n254o36m706P254P285q676J5794Q326k1196j3826
11409a3195K3J9067J4282k570j0858k0252k793l664K7433K8176K017l4798k0687
11396a7819P526J77o481L146P743J0051r838r982K451M885K1925j2340j2905M161
11382g300Q850N937j6480N952J2899m27J0193j3140l28m275j0063j6684J4316
$$ plain form
11478 -11994 -4428 1578 -1561 -18349 -23467 -22287 -41299 -35196 -17347 -17756 -29541 -29355 -3412 -13856
11464 -13856 -18828 -29457 -45285 -29028 -20491 -24351 -14513 11776 11730 -2038 -9438 -20082 -24793
11451 -24793 -12220 -8449 7072 594 -1938 10793 19310 23679 5672 6378 16118 19060 13265 7427
11437 7427 7532 10057 -4546 -1873 -3448 -15891 -17749 -4909 -5616 -15600 -32215 -35700 -19665 -14645
11423 -14645 -9457 1877 4376 2440 -2814 -3450 -8156 -902 6383 -2293 13501 21827 631 -13195
11409 -13195 -13172 5895 20177 17607 6749 -13503 -16296 -19960 7473 35649 37666 2868 -17819
11396 -17819 -10293 -10116 -16597 -13451 -5708 4343 -5495 -15477 -13026 -8141 13784 1444 -11461 -7300
11382 -7300 1550 7487 -8993 -3041 9858 9431 19624 6484 6156 1881 -8182 -24866 -10550
11369a0550K7381P208n21k2453j1832N47L729n52K21J6145Q220j6285k2042j5469
11355c6253O767K3350O698j0899l411q166J1658K9897m458j2810q408r496J871
11342a3660K036m491R524M054R751j0903j714R241K771l403m212N474K121j2429
11328e840M775M83N070p853R48o162k321m438L160j5174j677K1096K6837Q489
11314B7393l926J117j2918j2305M099j2963k030r1j2895J894O139Q88K563R231
11300c804J1232P91j9379k2937J8178J3801L657K202q722j4205N496K4527M935
11287A5772m239j0083j8481o97o533o93N439j720m569K2964j3746o19J9916J7924
11273B0635R62k8738j9293R870p188o160J9620J1735K802J8993j4533j9323J327
$$ plain form
11369 -10550 16831 24039 23518 1065 -10767 -10220 -6491 -7043 -6822 9323 17543 1258 -20784 -36253
11355 -36253 -29486 -6136 562 -10337 -13748 -21914 -10256 19641 15183 2373 -6035 -15531 -13660
11342 -13660 -11624 -16115 -6591 -2537 7214 -3689 -5403 3838 6609 3206 -1006 4468 6589 -5840
11328 -5840 -1065 -582 4488 -3365 -2417 -8579 -10900 -15338 -12178 -27352 -29029 -7933 18904 27393
11314 27393 23467 24584 11666 -639 3460 -9503 -11533 -11624 -24519 -22625 -16486 -15598 -13035 -3804
11300 -3804 7428 8219 -11160 -34097 -15919 -2118 1539 3741 -4981 -19186 -13690 10837 15772
11287 15772 11533 1450 -17031 -17728 -24261 -24954 -19515 -21235 -25804 -2840 -16586 -17205 2711 20635
11273 20635 21597 -7141 -26434 -16564 -23752 -29912 -10292 1443 4245 23238 8705 -10618 -9291
11260i291J6065M247m624n4l928q96k11M238J3992j8620l3736j6131Q920m901
11246d4930l951J0094P950l871k502R436J4581J3922j5369Q414L996q25j7263
11233b0318r77J0124j4601J5316K9147k386j7270j8218J1256N148j020p232p096
11220a8127j403J5272N453k559P92L090J3152l76K060Q029m708j205j0814r383
11206g27k951r765j1207n313n330J6248J5861l319O242j3383m018J4971J8653
11193A5962N457k270j2924P18k544m525m915L754r264J903L642q619r810R436
11179a3999K1455L53r02K604j0759n922J0506j5192q159M884N002j8410q478M798
11165c2219K6920J3779j5648r901J2166K687J5791N779q053j0664O043P731p420
$$ plain form
11260 -9291 6774 11021 6397 6343 2415 1519 1308 5546 19538 918 -32818 -48949 -40029 -44930
11246 -44930 -48881 -38787 -30837 -34708 -37210 -27774 -13193 729 -14640 -6226 -2230 -3055 -20318
11233 -20318 -21295 -11171 -25772 -10456 18691 16305 -965 -19183 -7927 -2779 -3799 -11031 -18127
11220 -18127 -19530 -4258 1195 -1364 -572 2518 15670 15294 17354 25383 20675 19470 8656 -727
11206 -727 -3678 -13443 -24650 -29963 -35293 -19045 -3184 -6503 -261 -13644 -17662 -2691 15962
11193 15962 21419 19149 6225 6943 4399 -126 -5041 -1287 -10551 -8648 -5006 -13625 -23435 -13999
11179 -13999 7456 7809 6907 9511 -1248 -7170 3336 -11856 -20015 -15131 -10129 -28539 -37017 -32219
11165 -32219 -5299 8480 -7168 -17069 -4903 -2216 13575 19354 11301 637 6680 14411 6991
11152F991j2877j0986Q664R910m567P931j1584k1749J0244k877K175N201K401
11139a1123j350P472k245Q025o456j8503O310J1063J5373J0962j0503j1730K204
11126e01J0939l64J416j2434j0975j2972P716J9623L9099n806j4208K393p083
11113A6843J0873j6718j4062M133l835J0539o9J2459J5504M857k6634j9844j5944
11100b1898p942o782J5400K6354N606m414j66K3667o899k3352N819J749N263j5297
11086b892p736m296J7717L165j9462j3982L540J2962R877l277J0907J8263P07
11073B5493k503p638j0989j2435j4289K443l281q477K1835K1418o351M089J2541
11060B1856M245k867K134j8084j3088K952K852j4595j2159J7202K596J3375J491
$$ plain form
11152 6991 -5886 -16872 -8208 1702 -2865 5066 -6518 -28267 -18023 -20900 -18725 -13524 -11123
11139 -11123 -12473 -5001 -7246 779 -5677 -24180 -17870 -6807 8566 19528 9025 -2705 -501
11126 -501 10438 10074 11490 -944 -11919 -24891 -17175 2448 41547 35741 21533 23926 16843
11113 16843 27716 10998 -3064 1069 -2766 7773 7704 20163 35667 40524 13890 -5954 -21898
11100 -21898 -29840 -36622 -21222 5132 10738 6324 6158 29825 22926 -426 5393 7142 12405 -2892
11086 -2892 -10628 -14924 2793 5958 -13504 -27486 -23946 -10984 -1107 -4384 6523 24786 25493
11073 25493 22990 15352 4363 -8072 -22361 -19918 -23199 -31676 -9841 11577 5226 9315 21856
11060 21856 26101 23234 25368 7284 -5804 -2852 0 -14595 -26754 -9552 -6956 6419 7910
11047G910j2971k594J0620N973j1536J04J4438j189j8763j4709R673o439k735
11034b2218j0785M095n308O427j693j0483J40K1691K3705m56j6242k038J7074
11021C909L939J9954K693o954N910p624j6626j7667Q805K3452J5457k0215j2652
11008B381j003o370P557J6114M055l141p469p466K802q602j1487M767O829M442
10994C409P012k992k974n001J0726R583O854p389j08j213k059p875j2945J3614
10980H642L1961O193m712j0603l052k6958n780r109m102J3617R062n427j0411
10967a0679J867j2709q573N105N627J2753o441o774k995j6698J2997Rk1715J2605
10953c5621N716J1531P299J0704P132j4491J3218O460R345M728N357J4164j7621
$$ plain form
11047 7910 -5061 -7655 2965 8938 -2598 -2494 11944 10755 -8008 -22717 -13044 -19483 -22218
11034 -22218 -33003 -28908 -34216 -27789 -29482 -39965 -39825 -18134 5571 5115 -11127 -13165 3909
11021 3909 7848 27802 30495 23541 29451 21827 5201 -12466 -3661 19791 35248 15033 2381
11008 2381 1378 -4992 2565 18679 22734 19593 12124 4658 7460 -1142 -12629 -7862 -1033 3409
10994 3409 10421 7429 4455 -546 10180 19763 26617 19228 19120 17907 15848 7973 -4972 8642
10980 8642 40603 46796 42084 31481 28429 1471 -4309 -13418 -17520 -3903 5159 -268 -10679
10967 -10679 -8812 -21521 -30094 -24989 -19362 -6609 -13050 -19824 -22819 -39517 -26520 -26511 -48226 -35621
10953 -35621 -29905 -18374 -11075 -371 6761 -7730 5488 11948 21293 26021 31378 45542 27921
10940B7921j5422l797Q721o905j1000L48n589n200J7515O911J3576r447l934j0535
10926C163j7903R484J8033L082j1019j9199K427J5898o269q78o946j1792Q586
10913a3333J2979R634q84k527p259J5369J8742P194j4903o736j0131n374j1776
10900i005M206L640J6168J347L631l161j312M073J773J8975P274K145j0549j8602
10886B0603k3245J762J035r444M556L163J5096K662P548M049P76p314j5911O12
10872E948r19j1492r392J089M995K430j2484J4623J9363k1589j7486J0727L743
10859a0444j3876L329P052J9925J6441M975r160J633L431M641j4101k2115J1418
10846C149P930P908q390m451n106r124M282m778O374L629J315j667j8402l902
$$ plain form
10940 27921 12499 8702 17423 10518 -482 -134 -5723 -10923 6592 13503 27079 17632 13698 3163
10926 3163 -14740 -5256 12777 15859 4840 -14359 -11932 3966 -2303 -3181 -10127 -21919 -13333
10913 -13333 -354 9280 8396 5869 -1390 13979 32721 39915 25012 18276 8145 2771 -9005
10900 -9005 -4799 -1159 15009 16356 19987 16826 15514 19587 21360 40335 47609 49754 39205 20603
10886 20603 -2642 -880 155 -9289 -4733 -1570 13526 16188 23736 27785 28561 21247 5336 5948
10872 5948 5029 -6463 -15855 -14766 -9771 -7341 -19825 -5202 14161 -7428 -24914 -14187 -10444
10859 -10444 -24320 -20991 -13939 5986 22427 27402 18242 19875 23306 27947 13846 -8269 3149
10846 3149 11079 18987 10597 6146 1040 -8084 -3802 -8580 -2206 1423 2738 1071 -17331 -21233
10832b1233O724J5908P168j0990j6563n014M155P027K7203k736k4855j0690J2272
10819a1624J3914r504K437q334j6056l9L699k245K6078k867N138j606j019N58
10805a470Q754r381J0675P060m159j3238o295P33j7758r782J3732J581J718J0418
10791g412K1698R546j3544r76J989O020J4820J0063k3961L641j960j3627o758
10778d61J7122L167M013P120k3003p913J874j0173N994K288N514o060j8290M333
10764a4475J3208l753j5508O03k244k1180J0236K2878K5155J2986J7356k4104
10752B1158k2650k609J1633p296r070n801n716J1004K429j450J0354R604P729
10739A9319O408q403k0461l5516k1066K1022J3633M612j4306m349J98K1737N209
$$ plain form
10832 -21233 -14509 1399 8567 -2423 -18986 -24000 -19845 -12818 14385 11649 -13206 -23896 -11624
10819 -11624 2290 -7214 -4777 -13111 -29167 -29206 -25507 -27752 -1674 -4541 597 -1009 -2028 -1470
10805 -1470 7284 -2097 8578 15638 11479 -1759 -8054 -7321 -25079 -34861 -21129 -19548 -17830 -7412
10791 -7412 14286 23832 10288 9312 11301 17321 32141 42204 18243 21884 19924 6297 -461
10778 -461 16661 19828 23841 30961 7958 45 1919 -8254 -2260 28 5542 -518 -18808 -14475
10764 -14475 -1267 -5020 -20528 -19925 -22169 -43349 -33113 -10235 14920 27906 45262 21158
10752 21158 -1492 -4101 7532 236 -8834 -14635 -20351 -9347 -6918 -8368 1986 11590 19319
10739 19319 25727 17324 -3137 -38653 -59719 -38697 -25064 -20452 -34758 -39107 -38909 -17172 -11963
10726a1963j0306j1210j3709j6967K9726J8396J2234k232J5573j347j996k1375
10714a5176k4402j0J7486N849K616P792P832R40J2554m322j0498P061q269j6634
10700a7181N485j327J481Q206J7820J2694k0081j18j0010J9850J1493j0970j6764
10687E78n29j786P148k099M511k641k8708j142j85N569R615m708J3890m181q898
10672a3566K7958J8760r17k2337j9605j5012L360J3621Q218j917J7901m98k4700
10659h734j0836K2172M290j841j6247J4544Q468p708J3616L766k405q875j0225
10646a5K020P947Q173j1852l072j7421r38K890L272J6240j909q314L129Q692Q720
10631A7562p186j7310O579j0617j46J4253J3383L157p030j6859P06J0829J6409
$$ plain form
10726 -11963 -22269 -33479 -47188 -64155 -34429 -16033 -3799 -6031 9542 8195 6199 -15176
10714 -15176 -39578 -39588 -22102 -16253 -13637 -5845 1987 2927 15481 11159 661 7722 -547 -17181
10700 -17181 -11696 -13023 -11542 -3336 14484 27178 7097 6979 -3031 16819 28312 17342 578
10687 578 49 -1737 5411 3312 7823 5182 -23526 -24668 -24853 -19284 -9669 -14377 -487 -4668 -13566
10672 -13566 14392 33152 32235 9898 -9707 -24719 -21359 -7738 480 -1437 16464 15966 -8734
10659 -8734 -19570 2602 6892 5051 -11196 3348 11816 4108 17724 21490 19085 10210 -15
10646 -15 2005 9952 18125 6273 3201 -14220 -15158 -12268 -8996 7244 5335 -2979 150 8842 17562
10631 17562 10376 -6934 -355 -10972 -11118 3135 16518 19675 12645 -4214 -3508 7321 23730
10618B3730K28j0387m684q387l27J0328P804j2429m19J5044j4154l0003p193P628
10604b3221R769o086m248J5910R023k157K7716j5966q314N87O197O961K291j822
10590A6640L318R33j3322K140J9671j5976m234J0678M002l490N108k1502j7874
10577a3908Q286O767P653j706o961J2481O927J1523L745k2215O957J8034k0784
10564A6799m809l581j7788j3313K0698J3264r552K65K7896M045j1380j6615Q2
10551F011K366J2494L395M081j1567k209k609R989M614j9027K8L0766K1229k3963
10537C5598j7864l426j6996J4857k682j7572M05j982J554k945L561L606M88N865
10523B467o2l185L960n396m52K493Q57j5513K704Q655J5676o892p697J2991p175
$$ plain form
10618 23730 23958 13571 8887 500 173 10501 18305 5876 5457 20501 6347 -23656 -30849 -23221
10604 -23221 -13452 -19538 -23786 -7876 1147 -1010 26706 10740 2426 3013 9210 16171 18462 16640
10590 16640 19958 20891 7569 9709 29380 13404 9170 19848 23850 20360 25468 3966 -13908
10577 -13908 -5622 1145 8798 7092 131 12612 19539 31062 34807 12592 19549 37583 16799
10564 16799 11990 8409 -9379 -22692 -1994 11270 1718 1983 29879 33924 22544 5929 6011
10551 6011 8377 20871 24266 28347 16780 14571 11962 21951 26565 7538 7566 38332 59561 35598
10537 35598 17734 14308 -2688 12169 9487 -8085 -7680 -9662 -8108 -11053 -7492 -3886 -3398 2467
10523 2467 2405 -780 3180 -2216 -2668 -175 682 -14831 -12127 -3472 12204 5312 -2385 10606 3431
10508C431k122K263P044M388L127Q206j4424j8586N195J4968L416n303j0705r622
10494h724K3105J499o095r576R782N636j2292r897o445r792l946K0965N592j7194
10480a7382J558J6150M946O249j1235J2020j9987j3653K4206P772j5055q886J4522
10467A225J3733K244J2290K360m801j0086J8889J0147j1698j3020m604l109J1417
10454B4987O697J0613q378j1057j8526p727R38L7J1804R449p826l533m295J3125
10440A6308J4449O51J573j4864j6049k412J365j676J4365J9075m627M954J1757
10427D4869j2816j6649j7707o012j1447K463J0006K1953l317j574l516q887Q959
10414F325P648m247r338k902j865J8215j8912r402Q606K2581J6351j6766j6480
$$ plain form
10508 3431 1309 3572 10616 15004 18131 26337 11913 -6673 -1478 13490 16906 11603 898 -8724
10494 -8724 14381 15880 9785 209 9991 15627 3335 -6562 -13007 -22799 -26745 -5780 -188 -17382
10480 -17382 -15824 326 5272 11521 286 12306 -7681 -21334 2872 10644 -4411 -13297 1225
10467 1225 14958 17202 29492 31852 27051 16965 35854 46001 34303 21283 16679 13570 24987
10454 24987 31684 42297 33919 22862 4336 -3391 -2453 -2416 9388 18837 11011 7478 3183 16308
10440 16308 30757 31408 32981 18117 2068 -344 1021 -655 13710 32785 28158 33112 44869
10427 44869 32053 15404 -2303 -8315 -19762 -17299 -7293 14660 11343 9769 6253 -2634 6325
10414 6325 13973 9726 388 -2514 -4379 13836 -5076 -14478 -5872 16709 33060 16294 -186
10401a86k623L539J5928m946j4367n071J1823j1882k948R38j2633K0338P665M586
10387A0161R056j7135k0954R742R991j720k519j8447n355R432R239o896j1456
10374b6861K325J3385k114J996K4919J2072N696o874N923l62k734j542l003p19
10360B2107j617j2270j7485q556j2461J8071J4975J2169J638O982j0561j362J3183
10347B4813J2464k912J44J9842J3500l720n266N208K5264J1157J508j5310l5012
10334E1680Q28L4725J9271j6235P531K0956k4007k3016M198L874J0593q129o35
10321H1634R921m09L780K3842K2576J7197L9872L2701P1853J01839J51340J92231
10309G48377K18569K18455J82406J08700J9439l8725n0328k397K4485O276m8317
$$ plain form
10401 -186 -2809 730 16658 11712 -2655 -7726 4097 -7785 -10733 -9795 -22428 -2090 5575 10161
10387 10161 19217 2082 -18872 -9130 861 -859 -3378 -21825 -27180 -17748 -8509 -15405 -26861
10374 -26861 -24536 -11151 -13265 -11269 13650 25722 31418 24544 30467 30105 27371 25829 22826 22107
10360 22107 20490 8220 -9265 -17821 -30282 -12211 2764 14933 16571 23553 12992 11630 24813
10347 24813 37277 34365 34509 54351 67851 64131 58865 64073 89337 100494 102002 86692 51680
10334 51680 52508 87233 106504 90269 97800 118756 94749 71733 75931 79805 90398 82269 81634
10321 81634 91555 91146 94926 118768 141344 158541 198413 231114 302967 404806 556146 748377
10309 748377 966946 1185401 1367807 1476507 1495946 1457221 1406893 1404496 1428981 1435257 1386940
10298A386940j47252k24344k55120k08179j14208p6689n0113l3530l4197j5984
10288B27324p701k948P031M763j1617k1205k07P976k4520m0587j0392o005J2540
10275A34452K5982j3183l6497j0101j838K064J7447m671J1934k121j6532m618
10263A02318Q703m158N907j5201p207k108k871j1557J7027J038j1666R962N310
10250I5497J1711J1855J4218o667L117P535K1828K9537L1197J7349N893j846J1075
10237B52299o893l0654j3859r198j9739j7547j6032k1984k5510l628j2770k3400
10225E1085j514K7268j1868j5784j201n501r617J0122l337M861L1777J1150K120
10212H9561o916Q206j330p339K62l855N140q462J7765J0924l479K145j9454k5454
$$ plain form
10298 1386940 1239688 1015344 760224 552045 437837 361148 311035 277505 243308 227324
10288 227324 219623 216675 223706 228469 216852 195647 195440 203416 178896 138309 127917 121912 134452
10275 134452 160434 147251 110754 100653 98815 100879 118326 113655 125589 123468 106936 102318
10263 102318 111021 106863 112770 97569 90362 88254 85383 73826 90853 91891 80225 90187 95497
10250 95497 107208 119063 133281 126614 129731 137266 159094 188631 219828 237177 243070 241224 252299
10237 252299 245406 214752 200893 191695 171956 154409 138377 116393 90883 87255 74485 51085
10225 51085 49571 76839 64971 49187 47986 42485 32868 42990 39653 44514 76291 87441 89561
10212 89561 82645 90851 89521 82182 82444 78589 83729 75267 93032 103956 100477 102622 83168 57714
10198E7714o186J7187n084k4546k0296n816M180J2727j6415l255L108q700N7O349
10184A1024k887J1450J7122k357j3687l291N967j0799l777Q147j3732M279J3018
10171B0477J5821r287k331N053p022Q278j558r703o720k0299k914J9621j914J637
10157I139J6072J1199J0541P480R825J872m1349k9207j419l727N649J1020P614
10144A4709O790j2796J6825Q480j0929J759j2574k547L973J7543P3k0590j7824
10131g108J1611K0253J9819m050j3636j2814J0517L5174R288j5967k1460j5545
10119A6082J1772J4948k937n977j379k694P785J4260j2082j8269j1721r976Q041
10106G853J1605j607r571R384n32j5976k4898J6880J7583l433k916M928J2054
$$ plain form
10198 57714 51528 68715 63631 39085 18789 12973 17153 29880 13465 10210 13318 4618 4675 11024
10184 11024 8137 19587 36709 34352 20665 17374 23341 12542 8765 16912 3180 7459 20477
10171 20477 36298 27011 24680 29733 22711 30989 29431 19728 13008 -7291 -10205 9416 7502 9139
10157 9139 25211 36410 46951 54431 64256 66128 24779 -4428 -5847 -9574 -3925 7095 14709
10144 14709 21499 8703 25528 34008 23079 24838 12264 9717 13690 31233 31306 10716 -7108
10131 -7108 4503 24756 44575 40525 26889 14075 24592 59766 69054 53087 31627 16082
10119 16082 27854 42802 39865 33888 32509 29815 37600 51860 39778 21509 9788 -188 7853
10106 7853 19458 17851 8280 17664 17132 1156 -23742 -6862 10721 7288 4372 9300 21354
10093B1354r148M556j0098M20M827Q277p108l885j2743J325P073P356N558j2628
10079E136J1043K950m851K239J6195P23J1662L021j525j2383J4363J7752j0183
10066E6142m156M1050M4564N5822K9529Q43N444j5900p7388n3882k234p712q960
10053F3162j775p436k341o264R84j2464l462J1591N402k4821l065K5842O006n102
10039D6257K024M842q820J687j3579p713j0224j1016o233o093J1433K5974K5360
10026E3899j1171n163K481j5915J3350N353l135k3589l389m719Q681P186R732
10013C3601o509j1474Q228q891R561j1285m283L236r581L420q995N748J9331K957
9999B5064J2465L801j9995j6834k0116J385L3528j1644k3934j81R926J027J832
$$ plain form
10093 21354 12206 16762 6664 7084 11911 20188 13080 9195 -3548 -2223 4850 12206 17764 5136
10079 5136 16179 19129 14278 16517 32712 33435 45097 48118 46593 34210 48573 66325 56142
10066 56142 51986 93036 137600 193422 222951 223794 229238 213338 135950 82068 79834 72122 63162
10053 63162 61387 53951 51610 45346 46330 33866 30404 41995 47397 22576 19511 45353 51359 46257
10039 46257 48281 53123 44303 45990 32411 24698 14474 3458 -2775 -8868 2565 28539 53899
10026 53899 42728 37565 40046 24131 37481 42834 39699 16110 12721 8002 16683 23869 33601
10013 33601 27092 15618 23846 14955 24516 13231 8948 12184 2603 6023 -2972 2776 22107 25064
9999 25064 37529 41330 21335 4501 -15615 -14230 19298 7654 -16280 -16461 -6535 -5508 -3676
9986c676K3969Q075j1761Q308m67j271K528Q8m742K6529J2856J40j8406k7829
9972A4341j6596J1662J702N886j9490m410K0602j443k0721M853K3773J1669j3856
9959A7972l350o490O620L192k3095p3J2843l033O632L0507J1414j9971j6861k4635
9945h328K255L4614L773L511N5k0507K262q85N221j4402r867r967j0595O686J0032
9930f142R433o640P204J222o461r657J8686J3349Q06p876K5M19m837j0314J267
9915D84o235N253M421J7922O52o392M860O427l029J1205J708j5774q174M227R285
9900B6840K955Q048j2037j0587o378J284k423k150p367l799O769j647q196j593
9886a0281K773J1943P412J4606O478j1212Q06K719K822q895j2278q886K6032J8354
$$ plain form
9986 -3676 20293 28368 16607 24915 24448 23177 25705 25793 21051 47580 60436 60576 42170 14341
9972 14341 -2255 9407 11109 16995 -2495 -6905 13697 12254 -8467 -3614 20159 31828 17972
9959 17972 14622 8132 14752 17944 -5151 -5224 7619 4586 11218 41725 53139 33168 16307 -8328
9945 -8328 -6073 28541 32314 35825 35880 15373 17635 16750 21971 7569 -2298 -12265 -22860 -16174 -6142
9930 -6142 3291 -3349 3855 5077 -1384 -11041 7645 20994 21800 13924 13949 14368 9531 -783 484
9915 484 -5751 -498 3923 21845 22497 16105 20965 27392 24363 35568 37276 21502 13328 17555 26840
9900 26840 29795 37843 25806 15219 8841 10125 7702 5552 -1815 -5614 1155 -492 -8688 -10281
9886 -10281 -7508 4435 11847 26453 32931 21719 22525 25244 28066 19171 6893 -1993 24039 42393
9872D2393k953M987J3397j994j3331j3095j2471k1604j1425J901J1134m240L72
9859f929J8376J7228Q76Q203K6665L1460O192J0396J4551J7551J2629K830k0671
9846A39357j8701k0583l1365k0541j8334K0405M943l423j820o374r958J5551L966
9833E3123q834j8115m865o448J47r535J1731J5187o660j0205j9741Q452J7308
9820B1545K404j735j4427J5336m818O816K3597o12j8430n637n221N414l522L889
9806B4599q096Q18K541Q820j2547Q575R180P799J9516k2217o020J2590j5396j0261
9792A9901p633k015J2268J5019p886j9094o20J8399J0926j4904n489Q249P872
9779C4993k1851m865m006O031j07L454O010m010J131m536J1950O591J4788J3958
$$ plain form
9872 42393 39440 44427 57824 55830 42499 29404 16933 -4671 -16096 -14195 -3061 -7301 -6929
9859 -6929 11447 28675 29551 37754 64419 95879 102071 112467 127018 144569 157198 160028 139357
9846 139357 120656 100073 68708 48167 29833 50238 55181 51758 49938 43564 33606 49157 53123
9833 53123 44289 26174 21309 14861 15008 5473 17204 32391 25731 15526 -4215 4237 21545
9820 21545 23949 22214 7787 23123 18305 25121 48718 48106 29676 24039 18818 24232 20710 24599
9806 24599 16503 17321 19862 28682 16135 24710 33890 41689 61205 38988 32968 45558 30162 19901
9792 19901 12268 10253 22521 37540 29654 10560 9940 28339 39265 24361 18872 27121 34993
9779 34993 13142 8277 4271 10302 10195 13649 19659 15649 16780 12244 24194 30785 45573 59531
9765E9531O242j289k5560m440N408j694j3080J8889O69m873M333J1335J1561k570
9751F4462j8938l0961J2943J1871j0072J1431p054n055J2347Q27j4214L402L75
9738C1364j1568j8582R659J8874J0504j217J003k9277q202L82k921j1601R055
9725b527K1208o28m311j2453R54o131J4173J3113L556J8022M856j1401k745o699
9711B8987k561n452n607Q002q100r89J4596M150Q679j1261k5182j19j39M868J1089
9696B0961n724O56O283R49j1473N721o715J1901L1810J3117Q558k8305k5686j3397
9682H656J7422L1993m187j4377L806M913M548O57O433p81l790j8351n001M947
9668C6888K1752j4846k881K2408J7131j1099k5655j4409o422k970j781k0669K271
$$ plain form
9765 59531 65773 64484 38924 34484 39892 38198 25118 44007 44676 39803 44136 55471 67032 64462
9751 64462 45524 14563 27506 39377 29305 40736 33682 28627 40974 41801 27587 30989 31364
9738 31364 19796 1214 10873 29747 40251 39034 40037 10760 2558 2940 19 -11582 -2527
9725 -2527 18681 18053 13742 1289 2243 -3888 10285 23398 26954 44976 49832 38431 35686 28987
9711 28987 26426 20974 15367 23369 15269 14280 28876 33026 41705 30444 5262 5143 5004 9872 20961
9696 20961 15237 15893 22176 23125 11652 17373 10658 22559 54369 67486 76044 47739 22053 8656
9682 8656 26078 58071 53884 39507 43313 48226 52774 53431 59864 59083 55293 36942 31941 36888
9668 36888 58640 43794 40913 63321 80452 69353 43698 29289 22867 19897 18116 -2553 -282
9655b82J9542J1434Q817j1733p267J5549K8176l782r924j2095o954k2968o102
9642B411K4981J3022N80j0518J0751J8885M040l261j8214k000J717j0974J1725
9629D3145k3J63j3362j404J4017R798k2387N765J5170n491J6228J1603p829k3426
9615D1967k0338J783K1411q772m030o692l726K4209P63q311j7586R885L990J2372
9601D6925J2432Q325j9128J018J6276j1109k2315j8470M524J7864O628J0371J3971
9588F7312J0218j0007j3534O361m919j7955q573J2724J3827J1345K5446P728M81
9575A00454p745j2446N795L380k9920p841J0386K438o761j3716P124J511O816
9562E9475J8747r384k3195r651J973j2452j0247L502J2569O909O627J1081O792
$$ plain form
9655 -282 19260 30694 39511 27778 20511 36060 64236 60454 50530 38435 31481 8513 2411
9642 2411 27392 40414 40994 30476 41227 60112 64152 60891 42677 40677 42394 31420 43145
9629 43145 43122 43285 29923 28519 42536 52334 29947 35712 50882 45391 61619 73222 65393 41967
9615 41967 21629 23412 44823 36051 32021 25329 21603 45812 46575 38264 20678 30563 34553 46925
9601 46925 59357 67682 48554 49572 65848 54739 32424 13954 18478 36342 42970 53341 67312
9588 67312 77530 67523 53989 60350 55431 37476 28903 41627 55454 66799 92245 99973 100454
9575 100454 92709 80263 86058 89438 59518 51677 62063 64501 57740 44024 51148 52659 59475
9562 59475 78222 68838 45643 35992 37965 25513 15266 18768 31337 38246 44873 55954 62746
9549F2746p681m139k033J1058K537N071k0j3145p727J563J1326J2152R096p449
9535G3355l5938j422J6484J700P88K03M248N411r365q134l344q678j054L733J3019
9520E1006J883j2237j4331n789J1953R520N06K183k367l019j2858J8951K5897
9507G1298N013j5754k2943k780O051l314N467J2405M491n125m098j311j2419J605
9493C8586J785L719K4447J1617J0943r82l0622L455J4360j2696j0825j616O197
9480E8368k092P757M833J7914l050M958o470k6631j8402j058J7739J1946o037
9467E9775j1180j4818J6926K3003k17Q928k0439J556K6507J7281P307k7577j6729
9454G0323Q821R802k3506J957J1701m680k5710l876j975J0226K3626J1537j986
$$ plain form
9549 62746 55065 50926 48893 59951 62488 67559 67539 54394 46667 48230 59556 71708 80804 73355
9535 73355 37417 35995 52479 54179 54967 55170 59418 64829 55464 47330 43986 35308 34254 37987 51006
9520 51006 52889 40652 26321 20532 32485 42005 42511 44694 42327 39308 26450 45401 71298
9507 71298 76311 60557 37614 34834 40885 37571 43038 55443 59934 54809 50711 49400 36981 38586
9493 38586 40371 44090 68537 80154 91097 90115 59493 62948 77308 64612 53787 52171 58368
9480 58368 56276 64033 68866 86780 83730 88688 82218 55587 37185 36127 53866 65812 59775
9467 59775 48595 33777 50703 73706 73489 82417 61978 63534 90041 107322 114629 87052 70323
9454 70323 79144 88946 65440 67397 79098 74418 48708 44832 42857 53083 76709 88246 86260
9441H6260J342o717j0161q847l928L658k798L36J4051p22j0349o742J1217J0475
9427G7075m335n303J3816J1858o623M1J399j7888j0426r89J0216J1075O415M357
9413I0688J1262n338k7542J469J8592J0663p673o109p093n552k471L183J5480
9400H9559L681l686P637J0478n130q774j013j5652K625J7005j377P347J3341k8148
9386H7893j8723M051k135J0810J5546r178j4763J1314N849r282J4521J4510J5012
9373A25425L500M394k7315j6361n12j3983l526k118P243Q576N861o04j1060r755
9359F9765k215J5034o240O683J2398P288j5438l726R232K841J5698J5940k53n369
9345A21638o173j2507K299L627j1697j7746o56J4451J6250R386m385j3624r117
$$ plain form
9441 86260 87602 80885 70724 61877 57949 61607 58809 59145 73196 72474 62125 55383 66600 77075
9427 77075 72740 67437 81253 93111 86488 86529 87928 70040 59614 58625 68841 79916 86331 90688
9413 90688 101950 96612 69070 70539 89131 99794 92121 86012 78919 73367 70896 74079 89559
9400 89559 93240 89554 97191 107669 102539 93765 92752 77100 79725 96730 95353 102700 116041 87893
9386 87893 69170 73221 71086 81896 97442 88264 73501 84815 90664 81382 95903 110413 125425
9373 125425 128925 133319 106004 89643 89131 75148 71622 69504 76747 85323 91184 90580 79520 69765
9359 69765 67550 82584 76344 83027 95425 102713 87275 83549 92781 95622 111320 127260 127007 121638
9345 121638 115465 102958 105257 108884 97187 79441 78785 93236 109486 118872 114487 100863 91746
9332I1746L854J8980J9356m763o700m659j455P285n245M101n159p799j713K174
9318A10003K421R117K3000j2705k1362j1950R090m364J9848K3259J6584R271K0091
9305A92303J7672q671j4614j6293p083L212J658n581p103L305J529j0670P352
9292A57016L0471J4890J5847N251l089J2865n810k1520J1274k793K5958L031j7594
9279B25797l020L686K9074j350j413L6984L9498L7855K7603L1227L5133J9851
9267D80925J5178k3812n4349m9081k3115o565P728j7911l0180p293Q371L329N826
9254C09051R773j3020N401K3446J4079o275J239k52q938k917l3542k1053j0910
9241B66082j01m459P012J2488M24j0695K3760N3989L7703K6792J5912J119k5079
$$ plain form
9332 91746 95600 114580 133936 129173 122473 117814 116359 123644 118399 122500 117341 109542 107829 110003
9318 110003 112424 121541 144541 131836 110474 98524 107614 103250 123098 146357 162941 172212 192303
9305 192303 209975 201304 186690 170397 163314 166526 168184 162603 155500 158805 160334 149664 157016
9292 157016 187487 202377 218224 223475 220386 233251 227441 205921 217195 214402 240360 243391 225797
9279 225797 222777 226463 255537 254187 252774 289758 329256 367111 394714 425941 461074 480925
9267 480925 496103 472291 417942 368861 345746 339181 346909 328998 298818 291525 299896 303225 309051
9254 309051 318824 305804 311205 334651 348730 342455 343694 343442 334504 331587 298045 276992 266082
9241 266082 265981 261522 268534 281022 281446 270751 294511 348500 386203 412995 428907 430026 404947
9228D04947j9229k5351j1099l219k5938K697k189n142J4960J0257j4365n067k0957
9215C00305k4526J4338J5697Q265P732J683q120j2082n180j1019m693J4452J2650
9202C09502M846q478j1536M428j042J2491J2909J0552P521k691j2763J7197j0316
9189C32620K744M88j2134J5488J5973j778m991k951M693p697N58J7403L4204Q071
9175D02691l2875l384K7869J036j7016j0086N009M681k720p447J1347N068N990
9162C90163Q67J7980K6906O53j95o712j6097J2172K0610p042k698j3386l088N928
9148D26061J1681M169J5861L028J832J1372K1188J6245k025j3883K797L842J0244
9135E12412p424K632J4956L710j3368o285K9613J9946j9929j9975K5815J0930
$$ plain form
9228 404947 385718 360367 349268 346049 320111 322808 320619 315477 330437 340694 326329 321262 300305
9215 300305 275779 290117 305814 314079 321811 323494 315374 303292 298112 287093 282400 296852 309502
9202 309502 314348 305870 294334 298762 297720 310211 323120 333672 341193 338502 325739 342936 332620
9189 332620 335364 335852 323718 339206 355179 353401 348410 345459 350152 342455 343013 360416 394620 402691
9175 402691 369816 366432 394301 395337 378321 368235 373244 377925 375205 367758 379105 384173 390163
9162 390163 391030 409010 435916 436569 436374 429662 413565 425737 446347 439305 436607 423221 420133 426061
9148 426061 437742 441911 457772 460800 462632 474004 495192 511437 509412 495529 498326 502168 512412
9135 512412 504988 507620 522576 526286 512918 506633 536246 556192 536263 516288 542103 553033
9123E53033N123L679J7911J4284p432q359J7662N902K822o381J4611J0027K2116
9110F44998L0120J4329j3826P951K3589L5567J6136j4870j489J5074K4917K6037
9098H08533K3665N916k268M821K7213L2501J798P99J4493K2050N704J5046J0033
9085I70304R856K5354J7468K8747J5748m22N103K6120K6933K3837K6102J9907
9073A195057K8477R128K3463L1606J9324J5995J5910J8252L8975K9297L4056P709
9061A467249L3975M1419J6990M2042L5150M0504L2085K4743L0341N5231N0280
9050A870009J0939K9868M9324M0433N8630P1322N4270L7023N3722P2666P0749
9039B418955N4885P0592O6444P8537N9468Q1919Q7826P6080P1731R1670R3794
$$ plain form
9123 553033 558156 561835 579746 594030 586598 578239 595901 601803 604625 598244 612855 622882 644998
9110 644998 675118 689447 675621 683572 707161 742728 758864 743994 742505 757579 782496 808533
9098 808533 832198 838114 835846 840667 867880 900381 902179 902978 917471 939521 945225 960271 970304
9085 970304 980160 1005514 1022982 1051729 1067477 1067055 1072158 1098278 1125211 1149048 1175150 1195057
9073 1195057 1223534 1232662 1256125 1287731 1307055 1323050 1338960 1357212 1396187 1425484 1459540 1467249
9061 1467249 1501224 1542643 1559633 1601675 1636825 1677329 1709414 1734157 1764498 1819729 1870009
9050 1870009 1880948 1910816 1960140 2000573 2059203 2130525 2184795 2221818 2275540 2348206 2418955
9039 2418955 2473840 2544432 2610876 2689413 2748881 2830800 2918626 2994706 3066437 3158107 3251901
9028C251901J06064J06536J06730J27773J28707J19135J30366J37689J43830J65084
9018D523815J60946J75304K00113K13030K32149K28993K40338K63128K76146L06379
9008F820341L07218L35199L87002M30303M56081M57191N06348N59848N85823O44993
8998A1490347P13520P66821Q43190R31806J000656J121149J228328J354446J497285
8989B0947548J646000J815267K002866K193678K424411K659049K887954L140080
8981C9716853L371143L593000L725129L830773L844514L696523L461539L079481
8973F8318955K504391J808249J028244J98351o39840j399851k052978k585519
8965F7180002k935728l141486l240212l220608l137667l017138k865488k678485
$$ plain form
9028 3251901 3357965 3464501 3571231 3699004 3827711 3946846 4077212 4214901 4358731 4523815
9018 4523815 4684761 4860065 5060178 5273208 5505357 5734350 5974688 6237816 6513962 6820341
9008 6820341 7127559 7462758 7849760 8280063 8736144 9193335 9699683 10259531 10845354 11490347
8998 11490347 12203867 12970688 13813878 14745684 15746340 16867489 18095817 19450263 20947548
8989 20947548 22593548 24408815 26411681 28605359 31029770 33688819 36576773 39716853
8981 39716853 43087996 46680996 50406125 54236898 58081412 61777935 65239474 68318955
8973 68318955 70823346 72631595 73659839 73858190 73218350 71818499 69765521 67180002
8965 67180002 64244274 61102788 57862576 54641968 51504301 48487163 45621675 42943190
8957D2943190k479860k279101k099293j933581j780313j660876j523076j418429
8949B7768661j312702j200860j105893j039341r62108r30075q46028p87631p07833
8940A8876190o88328o64734o22555n98465n32417n06748m99725m79292m45238
8931A3838688m23430l99225l84094l47333l48495l38135l26323l04630k59156
8922A0707867k73362k67599k47844k37497k36847k27359j87448j87391k09556
8913H632964j43863r7665l5960J5316O6395Q2590L8950p181j02585k94831n05969
8902G648161m86894l75635k89917k23755j92670j54189j48831j24916j06460j11134
8892E433760r8356j17063j23836q2664r0416r4378r4216j12680j17243j32867
$$ plain form
8957 42943190 40463330 38184229 36084936 34151355 32371042 30710166 29187090 27768661
8949 27768661 26455959 25255099 24149206 23109865 22147757 21217682 20371654 19584023 18876190
8940 18876190 18187862 17523128 16900573 16302108 15769691 15262943 14763218 14283926 13838688
8931 13838688 13415258 13016033 12631939 12284606 11936111 11597976 11271653 10967023 10707867
8922 10707867 10434505 10166906 9919062 9681565 9444718 9217359 9029911 8842520 8632964
8913 8632964 8489101 8391436 8355476 8370792 8437187 8519777 8558727 8551546 8448961 8154130 7648161
8902 7648161 7161267 6785632 6495715 6271960 6079290 5925101 5776270 5651354 5544894 5433760
8892 5433760 5335404 5218341 5094505 5011841 4921425 4827047 4732831 4620151 4502908 4370041
8882D370041j08578r8178r9284j09743r1739p9305p0225n7416o2618q4205p0952
8871C437798n8151p6133o9995o2075n5093q0728q1765o3052m0722n4693o4031
8860B731360o5932n5864m7922n5381l8995n9686m9087k9378l3809k3911j9563
8849B251832m8770p6868l3750m7312k8977k2579l2961m4946l2698m6998m7027
8838A788946l2873r947k6486l6689l7570l1367j2251j6866l3573k5839j7235m1450
8826A466800l0234l1569j7744j5991k4698k3352j3041j014m720j5125l2424k7046
8814A229842k9877j6599k8334k9288j6692j8258n623j06k1366k8688k4732j8556
8802I91723r401j095l1419j1981l0772q420j8245K808q124j6684j5839j5989l926
$$ plain form
8882 4370041 4261463 4163285 4064001 3954258 3862519 3783214 3712989 3655573 3592955 3508750 3437798
8871 3437798 3379647 3303514 3233519 3171444 3116351 3035623 2953858 2890806 2850084 2795391 2731360
8860 2731360 2665428 2609564 2561642 2506261 2467266 2407580 2358493 2329115 2295306 2271395 2251832
8849 2251832 2203062 2126194 2092444 2045132 2016155 1993576 1960615 1915669 1882971 1835973 1788946
8838 1788946 1756073 1746126 1719640 1682951 1645381 1614014 1601763 1584897 1551324 1525485 1508250 1466800
8826 1466800 1436566 1404997 1387253 1371262 1346564 1323212 1310171 1309157 1304437 1289312 1256888 1229842
8814 1229842 1199965 1183366 1155032 1125744 1109052 1090794 1085171 1085065 1063699 1035011 1010279 991723
8802 991723 982322 981227 949808 937827 907055 898635 880390 883198 875074 858390 842551 826562 822636
8789H22636j2718k4147j5144j949k999j5775L287K076j0949j4804q798p861m300
8776G08555k6402k1445k8064q930J4484j6567k7484N122m860k8629r593j3893
8764E42294p815K527J3210o587j1724m398L188j2617j6964o618k0900j1043l335
8751D59218j7119r318j2485J256J880O425J170j1080q381n322P798J0445j0065
8738D14422j5072j5324k283o263j3873p493J0157m328J334L659k5889j489Q735
8725C46293k351j6453p352k911J516q632P720J5155J4303k0299o56p632r715J743
8711C10729q548j4335l823J3421q747j1713J702J9065N620j61n800k3055j8195
8698B56160J1360J2112J364k879j1832m368l893r030M515L236l947j36J5863m856
$$ plain form
8789 822636 809918 785771 770627 768678 765679 749904 753191 755267 744318 729514 720716 712855 708555
8776 708555 682153 660708 632644 623714 638198 621631 594147 599269 594409 565780 556187 542294
8764 542294 534479 537006 550216 543629 531905 527507 530695 518078 501114 494496 473596 462553 459218
8751 459218 442099 432781 420296 421552 423432 429857 431027 419947 411566 406244 414042 424487 414422
8738 414422 399350 384026 381743 375480 361607 354114 364271 359943 361277 364936 339047 337558 346293
8725 346293 343942 327489 320137 317226 318742 310110 317830 332985 347288 326989 326333 318701 308986 310729
8711 310729 302181 287846 284023 297444 288697 276984 278686 297751 303371 303210 297410 274355 256160
8698 256160 267520 279632 280996 278117 266285 261917 258024 248994 253509 256745 252798 252662 268525 263669
8684B63669N518P205n213j0267j0107j4085P09n342j4570j9120q988r28j296J8319
8670B05504K976q114j0727J321L327J2424m772J2407J5919R287O053J3149j3800
8657B44954k4817J4504R437j9529j8793j6122j0725J1768L5873M250N536R492
8645B45828j550m97r937k1578Q537m949r753J743J3550j2563k8008Q430J1579
8632B00832J9586Q131j2527k572J6478J0252o934l9186j726K7871j1085k4599
8620A84521q803R927R903j2229k3381O749J3155J0585J7013M927M752k0705k4038
8607A72376j6568M321J2536L257J7381o771j5281j2491j0103r766J6061O01j781
8594A53772j1478k8706j5525J9097K6470P378J6233M615k7447k4487K841j0804
$$ plain form
8684 263669 269187 276392 271179 260912 250805 236720 237429 232087 217517 198397 189409 188481 187185 205504
8670 205504 208480 200366 189639 190960 194287 206711 201939 214346 230265 239552 245605 258754 244954
8657 244954 220137 234641 244078 224549 205756 189634 178909 190677 226550 230800 236336 245828
8645 245828 244278 243781 233844 212266 220803 215854 206101 207844 221394 208831 180823 189253 200832
8632 200832 220418 228549 216022 213450 229928 240180 233246 194060 192334 220205 209120 184521
8620 184521 175718 185645 195548 183319 159938 166687 179842 190427 207440 212367 217119 196414 172376
8607 172376 155808 160129 172665 175922 193303 186532 171251 158760 148657 138891 154952 155553 153772
8594 153772 142294 113588 98063 117160 143630 151008 167241 171856 144409 119922 122763 111959
8582A11959k407O08R448K7769K1p438J5925J707r975O458j098r893j0810r841
8568A22433j7752K809j2453j1347J2486q527j151L196r703J2791K9686Q187j1646
8555A19009j4528n261j0248j2041L978K1377l355R153N010j259m691k2039J5108
8542A00213K6086L605J162O620l087O300j6034j8451q519j0864N853Q489J7600
8529A18973R196p335R041R960J0970j2289m047j8786J58r935j0673o416j5069
8516G3748r218J3926R227r357p388j1272P554p1Q483K601R941M572J0559j568
8502A01737P38Q574j5224K350K2035K48K718j6020k5873J5877q893j1750O1K6572
8488A03150J8772M411k26j2024j8161k3210k0335j1717N659M225R509R729O909
$$ plain form
8582 111959 109552 110160 119608 147377 147398 139960 155885 157592 147617 154075 152977 143084 132274 122433
8568 122433 104681 107490 95037 83690 96176 87649 86498 89694 79991 92782 122468 130655 119009
8555 119009 104481 99220 88972 76931 80909 102286 98931 108084 113094 111835 107144 85105 100213
8542 100213 126299 129904 131066 137686 134599 140899 124865 106414 97895 87031 92884 101373 118973
8529 118973 128169 120834 129875 139835 150805 138516 134469 115683 115841 105906 95233 88817 73748
8516 73748 64530 78456 87683 78326 70938 59666 67220 67149 75632 78233 88174 92746 103305 101737
8502 101737 102475 111049 95825 98175 120210 120458 123176 107156 81283 97160 88267 76517 76578 103150
8488 103150 121922 126333 126107 114083 95922 72712 52377 40660 46319 50544 60053 69782 76691
8475G6691K372j005j1262R265K3151o019k687q213r335j6303k586P21J8584J5337
8461H8711J101K256r407j9528M834Q558Q480j9375m669j7537j533M527J8467Q506
8447G3391k1736k4107N949K1111l953k8602j0675J2825k662J8356P030J2J7049
8434F3988P639n588k456M34K070P108K6283k020o422J5084j2014k7120k0766O138
8420E2358j1084j6781J7319k227l179n377P997k057o179O393J420n717J231M32
8406C4549l146j1426Q493N316N824M637K6375L274L88m899k1876k2845J641n60
8392B5745J3009l978k326n317O500K0582J7469O55k6347j0002l682O136K2783
8379F1227M075k0186k4317J619J0630J5466J6446q29M617l719k275o36P446K5700
$$ plain form
8475 76691 79063 78058 66796 76061 99212 93193 90506 82293 72958 56655 54069 54790 73374 88711
8461 88711 89812 92068 82661 63133 67967 76525 85005 65630 60961 43424 41891 46418 64885 73391
8447 73391 51655 27548 33497 54608 50655 22053 11378 24203 21541 39897 46927 46939 63988
8434 63988 71627 66039 63583 64017 66087 73195 99478 97458 91036 106120 94106 66986 46220 52358
8420 52358 41274 24493 41812 39585 36406 31029 39026 36969 30790 37183 38603 32886 34117 34549
8406 34549 31403 19977 28470 33786 39610 44247 70622 73896 74284 69385 47509 24664 26305 25745
8392 25745 38754 34776 32450 27133 33633 54215 71684 72339 45992 35990 32308 38444 61227
8379 61227 65302 45116 20799 22418 33048 48514 64960 64131 68748 65029 62754 62118 69564 95264
8365I5264j5566p377N935p234j8226j6727r879J0736K7228l597j1757l728l546
8352D1526J6281j695j9320j4401q406J1635P065K3121L276J49k302k9471j3727
8339A3731Q335M875J5737k964N388R00j0567J0371R300j5453j9203L540J021J213
8325B6224q820K404J3780O094k1151K62J2827K1488o342j2968J3918O431q915
8312D5232n564j8883J0093R483O211P222m5m052j0607k1553N107K8371o146m560
8298D0309k3015J9602J3664k3043l125j3088o844J4668J3239K45j1789R97P743
8285B9563J2880m406j3724j5544m831K8662O909j1294J4234P022j9447J826O857
8272C8707l315m423j1783J6487j821P19O418l394j1565K97P356j98j4425K0503
$$ plain form
8365 95264 79698 72321 78256 71022 52796 36069 26190 36926 64154 60557 48800 45072 41526
8352 41526 57807 56112 36792 22391 13985 25620 32685 55806 59082 59231 56929 27458 13731
8339 13731 22066 26941 42678 39714 45102 46002 35435 45806 55106 39653 20450 23990 25011 26224
8325 26224 17404 19808 33588 39682 18531 18793 31620 53108 46766 33798 47716 54147 45232
8312 45232 39668 20785 30878 40361 46572 53794 53749 49697 39090 17537 22644 51015 44869 40309
8298 40309 17294 36896 50560 27517 24392 11304 4460 19128 32367 32612 20823 21820 29563
8285 29563 42443 38037 24313 8769 3938 32600 39509 28215 42449 49471 30024 31850 38707
8272 38707 35392 30969 19186 35673 33852 34571 40989 37595 26030 26327 33683 33485 19060 39563
8258C9563M317q201L543J1701J1274n676k4813k941Q552Q633J4482R369j3561
8245E6242j7820k756l433j9881J0731J6464q035R842L773k853j13J3940K552J2330
8231G0983j0163j4482Q236L311j0119J1027O225r435q731k0147J3153m952J2731
8218D7637j5116k0822q720m618M040j3036n820K9195K730N541J5703J329o842
8205C1201Q126K26R40O222j3695j0530j0412p900J5934o677K4407N407J1470l121
8191E1598n033q594j5523m042R465K1730K8053j2774k8261K72L744r019k065k1818
8177G733j2663N022N258N841K1406J2201J5669o248j9147j3289J234J7909K4784
8164F5710j5214j4576j643P718r360n38K0487J566j736J3696j5553k9002j1363
$$ plain form
8258 39563 43880 35679 39222 50923 62197 56521 31708 28767 37319 45952 60434 69803 56242
8245 56242 38422 35666 32233 12352 23083 39547 31512 41354 45127 42274 42161 56101 58653 70983
8231 70983 60820 46338 54574 57885 47766 58793 65018 55583 46852 26705 39858 34906 47637
8218 47637 32521 11699 2979 -1639 2401 -10635 -16455 12740 15470 21011 36714 38043 31201
8205 31201 39327 39553 40493 46715 33020 22490 12078 4178 20112 13435 37842 43249 54719 51598
8191 51598 46565 37971 22448 18406 27871 49601 77654 64880 36619 36891 40635 31616 29551 7733
8177 7733 -4930 92 5350 11191 32597 44798 60467 54219 35072 21783 23017 40926 65710
8164 65710 50496 35920 34277 41995 32635 32097 52584 54150 52414 66110 50557 21555 10192
8151A0192Q536K3738K600l143k1632j592K4251j3599j1896q019K140l42L261P170
8137B1665k193J3421M166K929O595j3923q472J2203n426j3212J958N632P073j1822
8123B0594K07r392q66L741M664R461k755j1918K672O794n347j1579J422J45j2822
8108d979P151J674j0233J8940K5652J4250j6330j6589M196Q545R820l679o690
8095C1728R88m06m765j5758o297l658m533K5662J0202j4974j2639p590M758J8918
8081B1636J5306j3459j228k797j1559j9689j0159J2429L2315J0884K979m248J8050
8068E0460J1543k1915J1409R421p760p162p708J270q427j6335L202M632K071M462
8054B9163o571K541r250q058j2345M035J5341r953J0756J5186j2549j556K396
$$ plain form
8151 10192 18728 42466 45066 41923 20291 18699 42950 29351 17455 9436 11576 11234 14495 21665
8137 21665 19472 32893 37059 39988 46583 32660 24188 36391 30965 17753 19711 25343 32416 20594
8123 20594 20801 11409 10543 14284 18948 28409 25654 13736 16408 23202 17855 6276 7698 7843 -4979
8108 -4979 2172 3846 -6387 12553 38205 52455 36125 19536 23732 32277 42097 38418 31728
8095 31728 32716 32310 27545 11787 5490 1832 -2701 22961 33163 18189 5550 -2040 2718 21636
8081 21636 36942 23483 22255 19458 7899 -11790 -21949 -9520 22795 33679 36658 32410 50460
8068 50460 62003 40088 51497 60918 53158 45996 38288 39558 31131 14796 17998 22630 24701 29163
8054 29163 22592 25133 15883 7825 -4520 -485 14856 4903 15659 30845 18296 16740 19136
8041A9136J0997J850J2206m258o00l363M264R630n395j8858J396l128j3317J405
8027A1965P4J2667J0151J9823K029l85j3002j1196m574l922L012P886j747M91
8013C3272k02J002J901k769K171L497L629j608O036M314o893j3462k919p863R429
7998B9535K304j2462K22J7160N101p903j209J8162L27k208P880J2309J231m040
7984F6409O902k056j1690j4261q284J1839O492k310j0180k708J362J342n387n108
7970C2362K6803M831j8324o206m622J505J4384J8742j2801k4899k075n330k2367
7957B003J83J5995J1186J277j2590P467N475K009Q081l274Q074l384J782j4464
7943B9820J1952P175R51q764j8533q69M981j4175O234L0691J4052k3917k928o421
$$ plain form
8041 19136 30133 31983 44189 39931 39331 35968 40232 49862 44467 25609 27005 23877 10560 11965
8027 11965 12039 24706 34857 54680 56709 56324 43322 32126 27552 23630 26642 34528 32781 33272
8013 33272 33070 34072 35973 33204 35375 38872 42501 40893 46929 51243 44350 30888 27969 20106 29535
7998 29535 31839 19377 19599 36759 41860 33957 32748 50910 51237 49029 56909 69218 70449 66409
7984 66409 73311 71255 59565 45304 37020 48859 55351 53041 42861 40153 41515 42857 37470 32362
7970 32362 59165 63996 45672 39466 34844 36349 50733 69475 56674 31775 29700 24370 2003
7957 2003 2186 18181 29367 30644 18054 25521 30996 33005 41086 37812 45886 42502 44284 29820
7943 29820 41772 48947 49898 41134 22601 21732 26713 12538 18772 49463 63515 39598 36670 30249
7929C0249j0030m837J6200Q154j0509j7699j2624L108N199n804q492M836Q869
7916F620J2471J4144Q851N79J779n590l89j5549q37M626J8469J4902j02j2464
7902D7510K919j409k6677j1972J3382P32k2104o583J388j4473J7541P528r26M216
7888A1072J4065m697l684J4017r131j2070j2302j6278J0236J4929J2135P820J0949
7875C7061P851m741k2195J8083k939j0747j8797m668M333J4523J1935p095p642
7862A4962L965J178n545o360N603L498p068J551K352O050R600K350q407o496K89
7847A7522R40r318k978n598o579J4801l348k3455K562Q806m942j0110R032N808
7833f857J2535K1004m302m347k1630j8234q836J1610J8958l192R68O238J260J8497
$$ plain form
7929 30249 20219 15382 31582 39736 29227 11528 -1096 2012 7211 1407 -7085 -2249 6620
7916 6620 19091 33235 42086 42665 44444 38854 38465 22916 22079 26705 45174 60076 59974 47510
7902 47510 50429 49020 22343 10371 23753 24485 2381 -4202 -2814 -17287 254 7782 6856 11072
7888 11072 25137 20440 16756 30773 21642 9572 -2730 -19008 -8772 6157 18292 26112 37061
7875 37061 44912 40171 17976 36059 33120 22373 3576 -1092 3241 17764 29699 22604 14962
7862 14962 18927 20105 14560 8200 13803 17301 10233 11784 14136 20186 29786 32136 23729 17233 17522
7847 17522 18462 9144 6166 568 -6011 8790 5442 -18013 -15451 -6645 -11587 -21697 -12665 -6857
7833 -6857 5678 26682 22380 18033 -3597 -21831 -30667 -19057 -99 -3291 -2323 3915 5175 23672
7819B3672P997k4577k995M315R54n551L7L0018l88j4123j096j9377k3916P043
7805a7987O113N833j181M411N112j1325K076k284K332N075j0250J712O394K2554
7791A8585P314j5615k968n618N383n476J1995r665j4501j5652J020P403K1173
7778C378J3316j6167P083R84O961M895K255k835m149j3049j6492P67J0404J3613
7764A0964K817j087r036k858J6791J8369j0668j6672j3986j5780N878M261k029
7751a3036l255J2046J1059J6403K431k0684j7839k361j44J0535j254P858Q785
7738A0544J3543O917j0194r516L457k646k38N271M65k479k88M919L067p106Q507
7723B4223o119m657Q385p500j2433k06J6041P890n801k193L942k582j2107j9374
$$ plain form
7819 23672 31669 7092 4097 8412 9366 3815 3852 33870 33482 19359 18263 -1114 -25030 -17987
7805 -17987 -11874 -6041 -7222 -2811 2301 -9024 -6948 -9232 -6900 -1825 -12075 -10363 -3969 18585
7791 18585 25899 10284 7316 1698 7081 1605 13600 3935 -10566 -26218 -25198 -17795 3378
7778 3378 16694 527 7610 8594 15555 20450 22705 19870 15721 2672 -13820 -13053 -2649 10964
7764 10964 13781 12694 3658 800 17591 35960 25292 8620 -5366 -21146 -15268 -11007 -13036
7751 -13036 -16291 -4245 6814 23217 25648 4964 -12875 -15236 -15380 -4845 -6099 1759 10544
7738 10544 24087 31004 20810 11294 14751 12105 11867 17138 17603 15124 14836 19755 22822 15716 24223
7723 24223 18104 13447 21832 14332 1899 1693 17734 25624 19823 17630 21572 18990 6883 -12491
7709a2491R510k28k060N87J063K3959J38m180j591j997j6916j9773l206j164Q02
7694b7547K704J3155N2R360k533j1092k092L640K3690j833j4351J2306J0921j174
7680A5206M62o026j9108K1194K4782o288j5203j8965k8610m95L0333J7206l748
7667A0740K979j7923j6394J3989L012M30k477J728K079j98P865j926J5999N347
7653B5250J2964l279k4904r453J5577n680O321r582r161j0131k941K213J575K9848
7639A8617Q143N264K7048k1606j7177j4690q029j7711K0077K7527j365j2639r026
7626D433O120N561o700j2232j3550Q150m451o059P479l798K4166J0508R875j9327
7612A0175l0778j687J2538j332L8J6965K1809j3831l340l605j5596J2334K443
$$ plain form
7709 -12491 -2981 -3209 -5269 -4682 -3619 20340 20478 16298 14707 12710 -4206 -23979 -27185 -28349 -27547
7694 -27547 -24843 -11688 -11636 -2276 -4809 -15901 -17993 -14353 9337 7504 -6847 5459 16380 15206
7680 15206 15668 9642 -9466 11728 36510 30222 15019 -3946 -32556 -33051 -2718 14488 10740
7667 10740 13719 -4204 -20598 -6609 -3597 -3167 -5644 -3916 -1837 -2035 5830 3904 19903 25250
7653 25250 38214 34935 10031 578 16155 10475 16796 7214 -1947 -12078 -15019 -12806 -11231 18617
7639 18617 26760 32024 59072 37466 20289 5599 -2430 -20141 -64 27463 26098 13459 4433
7626 4433 10553 16114 9414 -2818 -16368 -8218 -12669 -18728 -11249 -15047 9119 19627 29502 10175
7612 10175 -20603 -22290 -9752 -11084 -11046 5919 27728 13897 10557 6952 -8644 3690 6133
7599F133l5622r739J7804M63j4184q443J0939L5907K4663j7098k4048Q381R809
7586D965K4967O107j3490r341p93n356O869k1553j5641J821N199K1581K763Q087
7572A6185M264o359o225m871P73r38q854L580j880o102k806o226J8728J8902p02
7557A7469j4095m931J588N3K743N78L747P975m795j8377j5805r61k465m638J4298
7542a7616K9107R931L311j1055m477J4973K071k7549r064O45K116q591J0241P57
7528e200k634l073K1802L756m587r47J6620L181K045j5851j053j3n177r286P873
7513G456J5274j2736k3343J8112J3042q364p582N914j714j0507r637j0568r542
7500c4195j3724q665J3404L861j455L2069J2428L899J2891m671j8015J1708j687
$$ plain form
7599 6133 -29489 -39228 -21424 -20961 -35145 -43588 -32649 3258 27921 10823 -13225 -4844 4965
7586 4965 29932 36039 22549 13208 12415 7059 13928 -7625 -23266 -21445 -16246 5335 8098 16185
7572 16185 20449 14090 7865 2994 3767 2829 -6025 -2445 -4325 -10427 -13233 -19459 -731 18171 17469
7557 17469 3374 -1557 31 84 2827 3405 7152 15127 10332 -8045 -23850 -24811 -27276 -31914 -17616
7542 -17616 11491 21422 24733 13678 9201 24174 26245 -1304 -10368 -9723 -7607 -16198 -5957 -5200
7528 -5200 -7834 -10907 10895 14651 10064 9117 25737 28918 30963 15112 14059 14046 8869 -417 7456
7513 7456 22730 9994 -13349 4763 17805 9441 1859 7773 6059 -4448 -14085 -24653 -34195
7500 -34195 -47919 -56584 -43180 -39319 -40774 -8705 3723 7622 20513 15842 -2173 9535 7848
7487G848O023J456j7239j8182J9698J72k99k043P85k322N533N890j45J3580J816
7472B2571J1456r932k3962k1151l252R541P490o063P788N808L01O973N18K123
7458A0209J4379k380j9371r946J3100J4095n832k6832L919O307j5322m661R323
7445a3012L502k779n583K051J4402J178n590L755k909M492j345j8105K560o110
7431b3493j7575J994m582J8089O329j1247O749L7801J1785p647o605q782O836
7418I652j0771n698K3077N523j8461k0661k877K6305K2420p623m968M498j0583
7405I833J3548m73k0151k738O195Q394M031j479r663N876n313m169n897M775J2142
7390A4911J2503j4653p210K2069J0403L448l568r559j2376k2333p838k902M137
$$ plain form
7487 7848 13871 15327 -1912 -20094 -396 -224 -523 -2566 -1781 -4103 1430 7320 7175 20755 22571
7472 22571 34027 24095 133 -21018 -24270 -14729 -7239 -13302 -5514 294 595 7568 8086 10209
7458 10209 24588 22208 2837 -7109 5991 20086 14254 -12578 -8659 -2352 -17674 -22335 -13012
7445 -13012 -9510 -12289 -17872 -15821 -1419 -241 -5831 -2076 -4985 -493 -1838 -19943 -17383 -23493
7431 -23493 -41068 -39074 -43656 -25567 -19238 -30485 -23736 14065 25850 18203 11598 2816 9652
7418 9652 -1119 -6817 16260 21783 3322 -17339 -20216 6089 28509 20886 15918 20416 9833
7405 9833 23381 22908 2757 19 6214 14608 18639 17160 7497 13373 8060 3891 -2006 2769 14911
7390 14911 27414 12761 5551 27620 38023 41471 37903 28344 15968 -6365 -14203 -17105 -12968
7377a2968Q23J96J0302r416j0229j599M364j2334K691J6795J7937J5929M395p246
7363A9640l445j7890n853N447J3362m308o757q2N846j0408k1025j7795l793J4213
7349c2848O026m497j0222l566j4529Q968J1398J2894k14L670k869q433J8133K707
7335a3382P050J2332K461j3432M176j3771J0309o413o665J7454J1921O47j218
7322A1469j1633J28J7513m195L973J779k194k2696J638M311R654p90j6824J513
7308f354p312j1284J6841l020k3126J2182K2590k520j1320J953J0673J4669j171
7295A2801k3409L209R342m351K093J3753N764j648L434n176M289k380j211j2198
7281D312J0197l531j0905k1509j3920M258J8766q390L510P947j3966Q335J1954
$$ plain form
7377 -12968 -12145 -11949 -1647 -11063 -21292 -22891 -18527 -30861 -28170 -11375 6562 22491 26886 19640
7363 19640 16195 -1695 -7548 -2101 11261 6953 196 114 5960 -4448 -25473 -43268 -47061 -32848
7349 -32848 -26822 -31319 -41541 -45107 -59636 -50668 -39270 -26376 -26590 -22920 -25789 -34222 -16089 -13382
7335 -13382 -6332 6000 8461 -4971 -795 -14566 -4257 -10670 -17335 119 12040 12687 11469
7322 11469 -164 -36 17477 13282 17255 19034 16840 -5856 -4218 93 9747 8957 -7867 -6354
7308 -6354 -13666 -24950 -8109 -11129 -34255 -22073 517 -2003 -13323 -11370 -697 13972 12801
7295 12801 -10608 -7399 1943 -2408 -315 13438 19202 17554 20988 15812 20101 17721 16510 4312
7281 4312 14509 10978 73 -21436 -35356 -31098 -12332 -20722 -17212 -9265 -23231 -14896 -2942
7268b942L433j0085j0024J0438k388p051J3759r37p583kJ3079Q359j7840Q582
7254a202L586j4627j2090j976J9218P014k17k406K357j5184q528O35j6883R899
7240c0404r536k078K277j379J5679K376O39J1475J1336Q173N245j5183j6201J3514
7226d067Q442m931P335K089J911r43k2012m46J8175P066j761o563Q871K0702J1453
7211D5321l6989j0173R135J5292j2758j7909N96J4416L036j5764j6615O005L663
7198a2744J5760R915j1679M451p319j9267n41L108K609j4870k2217K1356J1035
7185b0403n207J2508O509P125k349j3580j7885l765P310J4110j382K975k686k783
7171a9503M599m136J164O50J5882J80l202N331r962j719p895J757L5082K1786
$$ plain form
7268 -2942 491 -9594 -19618 -9180 -11568 -18619 -4860 -5797 -13380 -13382 -303 8056 -9784 -1202
7254 -1202 2384 -12243 -24333 -26309 -7091 -77 -294 -2700 -343 -15527 -24055 -23420 -40303 -30404
7240 -30404 -39940 -42018 -39741 -41120 -25441 -23065 -22426 -10951 385 8558 13803 -1380 -17581 -4067
7226 -4067 4375 -556 6779 8868 10779 9836 -12176 -12622 5553 12619 10858 4295 13166 33868 45321
7211 45321 8332 -1841 7294 22586 9828 -8081 -7485 6931 9967 -5797 -22412 -16407 -12744
7198 -12744 3016 12931 1252 5703 -1616 -20883 -21424 -18316 -15707 -30577 -52794 -31438 -20403
7185 -20403 -25610 -13102 -6593 532 -1817 -15397 -33282 -37047 -29737 -15627 -17009 -14034 -16720 -19503
7171 -19503 -14904 -19040 -17876 -17226 -1344 -1164 -4366 965 -8997 -10716 -18611 -16854 18228 40014
7157D0014j9049j4325o557j0764j3556J4049Q553O889Q679o898o425K990J265
7144D865n255j2116l97j1611l70J3303J662Q524K2369m856L540K15j3257j0663
7130d047j5061j178K786O535j598J5262J1796J457j6669o56L569O300l925p705
7116c134j7686j3862K662K5107N78j814m88j2212m611l680Q760J1940Q628J5853
7102A6041Q779n949p533r532O229N828k3585J514K567O786j2151j0558l897N271
7088b0190J4356J0231l641J9778J8507p218j9049j7852O176R023q807l360K1683
7075A9637k11J1867O040k4028k1245J1504l900k467l470P713j3269rJ3321j454
7061B9k600J5862j954o109k1065L899J2341J457O806K794l372m445j49p380o465
$$ plain form
7157 40014 20965 6640 83 -10681 -24237 -10188 -1635 5254 13933 7035 610 3600 4865
7144 4865 -390 -12506 -12903 -24514 -24884 -11581 -9919 -1395 20974 16118 19658 19873 6616 -4047
7130 -4047 -19108 -20286 -17500 -10965 -12563 2699 14495 15952 -717 -1373 2196 8496 4571 -3134
7116 -3134 -20820 -34682 -32020 -6913 -6335 -8149 -8637 -20849 -25460 -29140 -20380 -8440 188 16041
7102 16041 24820 18871 11338 1806 8035 13863 -9722 -8208 -5641 1145 -11006 -21564 -25461 -20190
7088 -20190 -5834 4397 756 20534 39041 31823 12774 -5078 1098 10121 1314 -2046 19637
7075 19637 19426 31293 37333 13305 -7940 3564 -336 -2803 -6273 1440 -11829 -11838 1483 29
7061 29 -2571 13291 11337 5228 -15837 -11938 403 1860 8666 11460 8088 3643 3494 -3886 -10351
7046a0351J7992l368p538j3821k869k224j1651L368k096N58K3770K5289o319j4587
7032c847j2512j9404l048J2394O498j832N011J5283J6057p211o834K1797P451
7019B9803j5308j5608k4671r491J6000K515n337O467m241j5927J3688J6377l408
7006i141j2379j8945j2217l493P4m440J2362P505O314M756k470r284J705J1602
6992b8051k740m298O508k6146j5124J7735K0450K1955J5151j012p052k092N346
6979F30k138R051l466k1481Q619M275k0893n47j1002l319J3537J7523K2853j3918
6965b76j5496P460P271K523k1701k262N220K518o053Q520L141J4303m585K0071
6951B0654k3414j9112J777J6741J5379j270J543O107n32J0483k1799o760j7264
$$ plain form
7046 -10351 7641 4273 -3265 -17086 -19955 -22179 -33830 -30462 -32558 -32000 -8230 17059 10740 -3847
7032 -3847 -16359 -35763 -38811 -26417 -19919 -21751 -16740 -1457 14600 7389 555 22352 29803
7019 29803 14495 -1113 -25784 -35275 -19275 -16760 -22097 -15630 -19871 -35798 -22110 -5733 -9141
7006 -9141 -21520 -40465 -52682 -56175 -56101 -60541 -48179 -40674 -34360 -29604 -32074 -41358 -39653 -28051
6992 -28051 -30791 -35089 -28581 -54727 -69851 -52116 -31666 -9711 5440 4428 -2624 -4716 630
6979 630 -1508 7543 4077 -17404 -8785 -4510 -25403 -25950 -36952 -40271 -26734 -9211 13642 -276
6965 -276 -15772 -8312 -1041 1482 -20219 -22481 -17261 -14743 -20796 -12276 -9135 5168 583 20654
6951 20654 -2760 -21872 -20095 -3354 12025 10755 12298 18405 17873 28356 6557 -203 -17467
6938a7467j3716N851J2200o233j1353j5954J5177J8726j4281l934K5310o652m042
6925a6368L93Q183o534j3572P501K1825K733m346m504J3510N275j6080l335K704
6911b615p150l200q044q281R049j903N459j7440j696J5056J5681j3202J3419M399
6897d68j7180N52r308K703K445j4672Q106Q909J264K3250J5102o914n327j2331
6883c869R185J8324O142j2887N544K0961n14j3601k52N34j308M091j3710j1924
6869F716j137J9685N321j4818k694r564j0022J1391R446j0349J0054Q475J808
6856B4312j6024k9451J3072J2644J5562J0228M082o116J6703P147o222j4344l0197
6843A396j0914O923J635J3842J6288m445j0788k1265O334Q397N488q91r310p078
$$ plain form
6938 -17467 -31183 -25332 -13132 -19365 -30718 -46672 -31495 -12769 -27050 -30984 -5674 -12326 -16368
6925 -16368 -15975 -7792 -14326 -27898 -20397 1428 4161 -185 -4689 8821 14096 -1984 -5319 -2615
6911 -2615 -9765 -12965 -21009 -29290 -20241 -22144 -16685 -34125 -35821 -20765 -5084 -18286 -4867 -468
6897 -468 -17648 -17096 -26404 -23701 -21256 -35928 -27822 -18913 -17649 5601 20703 13789 8462 -3869
6883 -3869 5316 23640 29782 16895 22439 43400 42886 29285 29033 29567 28259 32350 18640 6716
6869 6716 5579 25264 30585 15767 13073 3509 -6513 4878 14324 3975 14029 22504 24312
6856 24312 8288 -21163 -8091 4553 20115 30343 34425 28309 45012 52159 45937 31593 1396
6843 1396 -9518 -2595 -960 12882 29170 24725 13937 -7328 -994 7403 12891 12000 2690 -4388
6829d388J7702M582p099J8400O731k1355j4219q966J0189O656K21j1633J351j4349
6815a6177J398K646j0454J4524R736n54o419J7384Q582J2233m131r944k478Q0
6801A6426j3495j1865k733j001O069o939j6291M42K286K9833J2067J5129n643
6788B4285j4994l13R833n23j0021O828Q669J833J0780j1405L821k3660l359J5932
6774A7706k15L151J4469L253N17l532n609r654m054j1983M025R835n503m496J299
6759I209J3271k259J0072p698l63p022l157p658J0229K03m761M716q224j0237
6745c679j3208l724J1608O692m977j6703L154N002J9754K6517J2675l704j8031
6732B1376o284r164l2056j5219J3353K477J6196Q263l632k4171J3311J2457O4
$$ plain form
6829 -4388 13314 17896 10797 29197 35928 14573 354 -8612 1577 8233 8454 -3179 -1828 -16177
6815 -16177 -14779 -12133 -22587 -8063 1673 1119 -5300 12084 20666 32899 28768 18824 16346 16426
6801 16426 2931 -8934 -11667 -12668 -6599 -13538 -29829 -29387 -27101 2732 14799 29928 24285
6788 24285 9291 8978 18811 18288 8267 15095 23764 25597 36377 24972 28793 5133 1774 17706
6774 17706 17491 20642 35111 38364 38881 35349 29740 20086 16032 4049 8074 17909 12406 7910 9209
6759 9209 22480 20221 30293 22595 22232 15210 12053 4395 14624 14827 10066 14782 6558 -3679
6745 -3679 -16887 -20611 -9003 -2311 -7288 -23991 -20837 -15835 3919 30436 43111 39407 21376
6732 21376 15092 5928 -26128 -41347 -27994 -25517 -9321 -1058 -4690 -28861 -15550 -3093 -3029
6719c029J2253J5431j189J2392k360j9784j7479K6242J697j1046m701m237M511
6706H701r320m653N583J1251j2725j3612o608m826p598J5079K1697K647r91P140
6692A1765R802j6226k31n39r57n6j8130q125J3233J4751J3204j006M815q479j9058
6677e237N02Q855K916j5563j124J5737K266k0013j6589J1142J6613p145j696J1570
6663B234N493R400K1081n193k0845K118O955j3159k222M218j3747J4172R902k3129
6649b722q050j0524q655N744L099n994l244J6127Q492O546q172j1748K181J5469
6635a451r232j3504j1433j3694j8373J088K3462K9311N753m814m303j2211Q66
6622b8535Q25o038j0663K3201J2326M608P556J5730Q14R705m092j2982o464P098
$$ plain form
6719 -3029 9224 24655 23466 35858 33498 13714 -3765 22477 24174 13128 8427 4190 8701
6706 8701 -619 -5272 311 11562 -1163 -14775 -21383 -26209 -33807 -18728 2969 5616 4625 11765
6692 11765 21567 5341 5110 4571 3614 3558 -14572 -22697 -9464 5287 18491 17485 22300 13821 -5237
6677 -5237 -4735 4120 7036 -8527 -9651 6086 8352 -11661 -28250 -17108 -495 -7640 -9336 2234
6663 2234 7727 17127 38208 33015 12170 14288 21243 8084 5862 10080 -3667 10505 20407 -2722
6649 -2722 -10772 -21296 -29951 -24207 -21108 -27102 -30346 -14219 -5727 819 -7353 -19101 -16920 -1451
6635 -1451 -10683 -24187 -35620 -49314 -67687 -66599 -43137 -13826 -8073 -12887 -17190 -29401 -28535
6622 -28535 -27710 -33748 -44411 -21210 -8884 -4276 3280 19010 19824 29529 25437 12455 5991 13089
6608A3089R614J0376k2336l3401n920p178N070M897J2294Q508M663n105J030Q430
6594D031J0050j532n690q591J6398k370p848j2141K369k718o766J6809Q458o678
6580C781j1270j3504r220Q708K6242J037j1550q844N303o658o606j1152M792J8681
6566a0260O464J2160o345Q898p405j0535r059K816N118J2258J78J8912p844k3143
6552g787j6435L017l084m478J7246j074j7205N262J4526j224J2320m516K680J5113
6538A4361K439o231p109j0281J755P753O875r401j2684n646q654R818Q472j845
6524a0378N180n626j0944p222n419R248P879M823J2243J055p329j2721L379K09
6510a5623Q551K0137N805q258q650k325Q547Q93J1583M216j658j9103P878j1566
$$ plain form
6608 13089 22703 33079 10743 -22658 -28578 -35756 -30686 -25789 -13495 -4987 -324 -5429 -4399 4031
6594 4031 14081 12549 6859 -1732 14666 12296 4448 -7693 -5324 -8042 -14808 2001 10459 3781
6580 3781 -7489 -20993 -30213 -21505 4737 5774 -5776 -14620 -9317 -15975 -22581 -33733 -28941 -10260
6566 -10260 -3796 8364 2019 10917 3512 -7023 -16082 -13266 -8148 4110 4288 23200 15356 -7787
6552 -7787 -24222 -21205 -24289 -28767 -11521 -12595 -29800 -24538 -10012 -11236 1084 -3432 -752 14361
6538 14361 16800 10569 3460 -6821 -5066 2687 9562 161 -12523 -18169 -26823 -17005 -8533 -10378
6524 -10378 -5198 -10824 -21768 -28990 -34409 -25161 -17282 -12459 -216 839 -6490 -19211 -15832 -15623
6510 -15623 -7072 13065 18870 10612 1962 -363 8184 9077 20660 24876 23218 4115 11993 427
6496D27J2533K3963M22k598j7941l978J1516K3585o138j7793l2383m779P613M16
6482e135J2357o976j6020J2586k394m913R377j4648k2837K191K0764J6727O58
6469A737O56Q474j2273l640m285j4863q100L380R796J4413p0o385J5440k010k62
6454B008p429R336N315N634j934n004k0017r71N706k223J2623L24j0411O345j6789
$$ plain form
6496 427 12960 36923 37345 34747 16806 12828 24344 47929 41791 23998 -8385 -13164 -5551 -5135
6482 -5135 7222 246 -15774 -3188 -5582 -10495 -1118 -15766 -38603 -36412 -15648 1079 1737
6469 1737 2393 10867 -1406 -5046 -9331 -24194 -32294 -28914 -19118 -4705 -4775 -11160 4280 2270 2008
6454 2008 -5421 3915 9230 14864 12930 7926 -12091 -13062 -7356 -9579 3044 3368 -7043 -698 -17487
$$ [...]
##END NTUPLES=NMR SPECTRUM
##END=
