##TITLE=Analysis number 322515
Compound Code cc 41416
Book Reference 467/70/1
Project Code adrs
Chemist Name benw
##JCAMPDX= 6.0         $$ Bruker NMR JCAMP-DX V2.0
##DATA TYPE= NMR SPECTRUM
##DATA CLASS= NTUPLES
##ORIGIN= Bruker BioSpin GmbH
##OWNER= nmr
$$ XWIN-NMR		Version 3.5
$$ Thu Sep 28 13:22:56 2006 GMT Daylight Time (UT+1h)  MAYBRIDGE\nmr@NMR_250MHZ
##.OBSERVE FREQUENCY= 250.131544655141
##.OBSERVE NUCLEUS= ^1H
##.ACQUISITION MODE= SIMULTANEOUS (DQD)
##.ACQUISITION SCHEME= undefined
##.AVERAGES= 16
##.DIGITISER RES= 18
##SPECTROMETER/DATA SYSTEM= dpx250
##.PULSE SEQUENCE= zg30
##.SOLVENT NAME= CDCl3
##.SHIFT REFERENCE= (INTERNAL, CDCl3, 0, 16.522)
##AUDIT TRAIL= $$ (NUMBER, WHEN, WHO, WHERE, WHAT)
$$ ##TITLE= Audit trail, XWIN-NMR		Version 3.5
$$ ##JCAMPDX= 5.01
$$ ##ORIGIN= Bruker BioSpin GmbH
$$ ##OWNER= nmr
$$ C:\u/data/dgb/nmr/ADRS/1660/pdata/1/auditp.txt
$$ ##AUDIT TRAIL=  $$ (NUMBER, WHEN, WHO, WHERE, WHAT)
(   1,<2006-09-28 13:22:31.48 +100>,<MAYBRIDGE\nmr>,<NMR_250MHZ>,
      <created by zg, POWCHK disabled, PULCHK disabled
       configuration hash MD5:
       E2 DF 36 D8 04 B2 41 60 5A D7 A3 38 5A 4B D0 FE
       data hash MD5: 64K
       7C 3D 57 E5 22 07 54 DA F3 16 A0 61 2E F6 46 58>)
(   2,<2006-09-28 13:22:44.41 +100>,<MAYBRIDGE\nmr>,<NMR_250MHZ>,
      <Start of raw data processing
       ef LB = 0.3 FT_mod = 6 PKNL = 1 SI = 32K 
       data hash MD5: 32K
       3B AB CE 69 45 F2 C3 9D 93 20 A0 64 97 CB 4D 6E>)
(   3,<2006-09-28 13:22:46.31 +100>,<MAYBRIDGE\nmr>,<NMR_250MHZ>,
      <apk 
       data hash MD5: 32K
       72 37 65 7E E9 EE FD E6 7E 83 A7 CE 0D 8F C9 CC>)
(   4,<2006-09-28 13:22:47.11 +100>,<MAYBRIDGE\nmr>,<NMR_250MHZ>,
      <abs ABSG = 5 
       data hash MD5: 32K
       D6 1C 02 44 A4 87 DA 22 57 CF 2E BE EB 88 1B F5>)
$$ ##END=
$$ 
$$ hash MD5
$$ 3E F4 3C 6F 42 40 87 80 9C A0 35 10 70 AD EE 64
##$RELAX= 
##$RELAX= 
##$RELAX= 
##$RELAX= 
##$RELAX= 
##$RELAX= 
##$RELAX= 
$$ Bruker specific parameters
$$ --------------------------
##$DU= <C:\u>
##$EXPNO= 1660
##$NAME= <ADRS>
##$PROCNO= 1
##$TYPE= <nmr>
##$USER= <dgb>
##$AMP= (0..31)
100 100 100 100 100 100 100 100 100 100 100 100 100 100 100 100 100 100 
100 100 100 100 100 100 100 100 100 100 100 100 100 100 
##$AQSEQ= 0
##$AQ_mod= 3
##$AUNM= <au_zg>
##$AUTOPOS= <50 >
##$BF1= 250.13
##$BF2= 250.13
##$BF3= 250.13
##$BF4= 250.13
##$BF5= 500.13
##$BF6= 500.13
##$BF7= 500.13
##$BF8= 500.13
##$BYTORDA= 1
##$CFDGTYP= 0
##$CFRGTYP= 5
##$CHEMSTR= <none>
##$CNST= (0..31)
1 1 145 1 1 1 1 1 1 1 1 1 1 1 1 1 1 1 1 1 1 1 1 1 1 1 1 1 1 1 1 1 
##$CPDPRG= <>
##$CPDPRG1= <>
##$CPDPRG2= <>
##$CPDPRG3= <>
##$CPDPRG4= <mlev>
##$CPDPRG5= <mlev>
##$CPDPRG6= <mlev>
##$CPDPRG7= <mlev>
##$CPDPRG8= <mlev>
##$CPDPRGB= <>
##$CPDPRGT= <>
##$D= (0..31)
0 1 0 0 0 0 0 0 0 0.06 0 0 0 0 0 0 0.0002 0 0 0 0 0 0 0 0 0 0 0 0 0 0 
0 
##$DATE= 1159446150
##$DBL= (0..7)
120 120 120 120 120 120 120 120 
##$DBP= (0..7)
150 150 150 150 150 150 150 150 
##$DBP07= 0
##$DBPNAM0= <>
##$DBPNAM1= <>
$$ [...]
##$SUBNAM7= <"">
##$SUBNAM8= <"">
##$SUBNAM9= <"">
##$SW= 20.6930455092707
##$SWIBOX= (0..15)
0 0 3 0 0 0 0 0 0 0 0 0 0 0 0 0 
##$SW_h= 5175.983436853
##$TD= 65536
##$TD0= 1
##$TE= 295.16
##$TE2= 300
##$TE3= 300
##$TEG= 300
##$TL= (0..7)
0 120 120 120 120 120 120 120 
##$TP= (0..7)
150 150 150 150 150 150 150 150 
##$TP07= 0
##$TPNAME0= <>
##$TPNAME1= <>
##$TPNAME2= <>
##$TPNAME3= <>
##$TPNAME4= <>
##$TPNAME5= <>
##$TPNAME6= <>
##$TPNAME7= <>
##$TPOAL= (0..7)
0.5 0.5 0.5 0.5 0.5 0.5 0.5 0.5 
##$TPOFFS= (0..7)
0 0 0 0 0 0 0 0 
##$TUNHIN= 0
##$TUNHOUT= 0
##$TUNXOUT= 0
##$USERA1= <user>
##$USERA2= <user>
##$USERA3= <user>
##$USERA4= <user>
##$USERA5= <user>
##$V9= 5
##$VALIST= <valist>
##$VCLIST= <CCCCCCCCCCCCCCC>
##$VD= 0
##$VDLIST= <DDDDDDDDDDDDDDD>
##$VPLIST= <PPPPPPPPPPPPPPP>
##$VTLIST= <TTTTTTTTTTTTTTT>
##$WBST= 1024
##$WBSW= 4
##$XGAIN= (0..3)
0 0 0 0 
##$XL= 0
##$YL= 0
##$YMAX_a= 421792
##$YMIN_a= -587628
##$ZGOPTNS= <>
##$ZL1= 120
##$ZL2= 120
##$ZL3= 120
##$ZL4= 120
##$ABSF1= 16.522
##$ABSF2= -4.171173
##$ABSG= 5
##$ABSL= 3
##$ALPHA= 0
##$AQORDER= 0
##$ASSFAC= 0
##$ASSFACI= 0
##$ASSFACX= 0
##$ASSWID= 0
##$AUNMP= <proc_1d>
##$AZFE= 0.1
##$AZFW= 0.1
##$BCFW= 0
##$BC_mod= 0
##$BYTORDP= 0
##$COROFFS= 0
##$CY= 12.5
##$DATMOD= 1
##$DC= 0
##$DFILT= <>
##$DTYPP= 0
##$F1P= 14.0000005364418
##$F2P= -0.99999901652339
##$FCOR= 0.5
##$FTSIZE= 32768
##$FT_mod= 6
##$GAMMA= 0
##$GB= 0
##$INTBC= 1
##$INTSCL= 1
##$ISEN= 128
##$LB= 0.3
##$LEV0= 0
##$LPBIN= 0
##$MAXI= 10000
##$MC2= 0
##$MEAN= 0
##$ME_mod= 0
##$MI= 0
##$NCOEF= 0
##$NC_proc= -3
##$NLEV= 6
##$NOISF1= 0
##$NOISF2= 0
##$NSP= 0
##$NTH_PI= 0
##$NZP= 0
##$OFFSET= 16.522
##$PC= 1
##$PHC0= 149.8543
##$PHC1= 6.89307
##$PH_mod= 1
##$PKNL= yes
##$PPARMOD= 0
##$PSCAL= 4
##$PSIGN= 0
##$REVERSE= no
##$SF= 250.13
##$SI= 32768
##$SIGF1= 0
##$SIGF2= 0
##$SINO= 400
##$SIOLD= 32768
##$SREGLST= <1H.CDCl3>
##$SSB= 0
##$STSI= 32768
##$STSR= 0
##$SW_p= 5175.98343685301
##$SYMM= 0
##$S_DEV= 0
##$TDeff= 65536
##$TDoff= 0
##$TI= <Analysis number 999999
Compound Code 99
Book Reference 9
Project Code 9>
##$TILT= no
##$TM1= 0
##$TM2= 0
##$TOPLEV= 0
##$USERP1= <user>
##$USERP2= <user>
##$USERP3= <user>
##$USERP4= <user>
##$USERP5= <user>
##$WDW= 1
##$XDIM= 32768
##$YMAX_p= 493681847
##$YMIN_p= -801649
$$ End of Bruker specific parameters
$$ ---------------------------------
##NTUPLES= NMR SPECTRUM
##VAR_NAME=  FREQUENCY,     SPECTRUM/REAL,   SPECTRUM/IMAG
##SYMBOL=    X,             R,               I
##VAR_TYPE=  INDEPENDENT,   DEPENDENT,       DEPENDENT
##VAR_FORM=  AFFN,          ASDF,            ASDF
##VAR_DIM=   32768,         32768,           32768
##UNITS=     HZ,            ARBITRARY UNITS, ARBITRARY UNITS
##FACTOR=    0.157963299565203, 1,           1
##FIRST=     4132.6476996994, 0,             0
##LAST=      -1043.33573715361, 0,           0
##MIN=       -1043.33573715361, -801649,     0
##MAX=       4132.6476996994, 493681847,     0
$$ Real data points
##PAGE= N=1
##DATA TABLE= (X++(R..R)), XYDATA
$$ [...]
18454H76124R653M6122O5832N3579J06653R5846P2611Q5799N5306M6352O7758
$$ 876124 885777 931899 997731 1051310 1157963 1253809 1326420 1412219 1467525 1513877 1581635
18443A581635J03747J45492J83613K84787L63105M66027O92005J113461J837072
$$ 1581635 1685382 1830874 2014487 2299274 2662379 3128406 3820411 4933872 6770944
18434F770944K697004L065498K940978K844142K963360K884646K312032Q04443
$$ 6770944 9467948 12533446 15474424 18318566 21281926 24166572 26478604 27283047
18426B7283047j522933k053511j867468o69900N34047J308772J778984J589879
$$ 27283047 25760114 23706603 21839135 21169235 21703282 23012054 24791038 26380917
18418B6380917Q12233j403129l566249m381824m305218k922529j706838j064044
$$ 26380917 27193150 25790021 22223772 17841948 13536730 10614201 8907363 7843319
18410G843319o80276n01700l99321l26687k92064k09476j54038j33045o5368j07765
$$ 7843319 7163043 6661343 6262022 5935335 5643271 5433795 5279757 5146712 5081344 4973579
18400D973579r3121o5706k9291J1273K5976M3717P6035R9247N7966R5857J25535
$$ 4973579 4880458 4814752 4785461 4796734 4822710 4866427 4942462 5041709 5099675 5195532 5321067
18389E321067J79541K96289L47607M69229O79253R98908J560288K525747M093985
$$ 5321067 5500608 5796897 6144504 6613733 7292986 8291894 9852182 12377929 16471914
18380A6471914N981404O997875O849548O576083O762271O595394N336799K259699
$$ 16471914 22453318 29451193 36300741 42876824 49639095 56234489 61571288 63830987
18372F3830987k940665m530036m203786j736282J056216K923525M087485L838991
$$ 63830987 60890322 56360286 52156500 50420218 51476434 54399959 58487444 62326435
18364F2326435K059537k768987q238450j0421925j0515429p504789m503435k756974
$$ 62326435 64385972 61616985 53378535 42956610 32441181 24936392 20432957 17675983
18356A7675983j852520j353271j067908r31036q07997o54761n18435m31287m00241
$$ 17675983 15823463 14470192 13402284 12471248 11663251 11008490 10490055 10058768 9658527
18347I658527l58158l60366l47731l51993l34114l24052l26830k82485k54095
$$ 9658527 9300369 8940003 8592272 8240279 7906165 7582113 7255283 6972798 6718703
18338F718703k11567j52528j32651j47697j50543j34054j75582j97918k00367
$$ 6718703 6507136 6354608 6221957 6074260 5923717 5789663 5614081 5416163 5215796
18329E215796j56670q7972r5697o2635p3388n6391j6840J4601l811n64K7819M1757
$$ 5215796 5059126 4971154 4875457 4812822 4739434 4683043 4666203 4680804 4676993 4676429 4704248 4746005
18317D746005K3988N5977O5326O4558J14194J24012J46422K07386K71693M10035
$$ 4746005 4769993 4825970 4891296 4955854 5070048 5194060 5340482 5547868 5819561 6229596
18307F229596N44547P17050J054155J549851K388796L625103M752334N202336
$$ 6229596 6774143 7491193 8545348 10095199 12483995 16109098 20861432 26063768
18299B6063768N396574O647486R159984J0477015Q441985M161027J719963L251376
$$ 26063768 31460342 38107828 47267812 57744827 66186812 70347839 72067802 75319178
18291G5319178M865157K190487l970927q967103q981259o224049n030557o089495
$$ 75319178 80184335 82374822 78403895 69436792 60455533 54231484 49200927 43111432
18283D3111432p525910p250758n424271l561750k345925j628449j163087r10987
$$ 43111432 35585522 28334764 22910493 19348743 17002818 15374369 14211282 13300295
18275A3300295q11105p17191o41857n59985m92685m09184l74851l78337m07023
$$ 13300295 12489190 11771999 11130142 10570157 10077472 9668288 9293437 8915100 8508077
18266H508077l51265k83399k37853k16654k35081k36687j84404j20279j36538
$$ 8508077 8156812 7873413 7635560 7418906 7183825 6947138 6762734 6642455 6505917
18257F505917q4402p8347o1010K1408J37087K14805L29299N32176Q44540J365078
$$ 6505917 6421515 6343168 6282158 6303566 6440653 6655458 6984757 7516933 8361473 9726551
18247I726551J905404K199617K238471K629025L710649M466309L761567J929651
$$ 9726551 11631955 13831572 16070043 18699068 22409717 26876026 30637593 32567244
18239C2567244O13455J076876K022110J221894j407995l822047m118138k875092
$$ 32567244 33180699 34257575 36279685 37501579 36093584 32271537 28153399 25278307
18231B5278307k173915k549848l263193l255852k501955j656519j082147p66831
$$ 25278307 23104392 20554544 17291351 14035499 11533544 9877025 8794878 8028047
18223H028047n33921m22068l43133l00247l26008l09549k78078k23482k09192
$$ 8028047 7494126 7072058 6728925 6428678 6102670 5793121 5515043 5291561 5082369
18214E082369k09993k54065k42312j82982j76021j09474j24651j40636j37878
$$ 5082369 4872376 4618311 4375999 4193017 4016996 3907522 3782871 3642235 3504357
18205C504357j04190q3029j03298r8342p8660p2562m3773k1869o577k7800k4925
$$ 3504357 3400167 3317138 3213840 3115498 3036838 2964276 2920503 2898634 2892057 2864257 2839332
18194B839332O555M626m065k0295m8039m3406k6711o4495j22539j18442j20746
$$ 2839332 2845887 2850513 2846448 2826153 2778114 2734708 2707997 2643502 2520963 2402521 2281775
18183B281775j32147q5660n1097n6470n7163n3797n1123k8390l9559l3691l7513
$$ 2281775 2149628 2063968 2012871 1956401 1899238 1845441 1794318 1765928 1726369 1692678 1655165
18172A655165o3511o7499o9508q0345l4351M82n1511o5975n2244k1907l2128m9961
$$ 1655165 1591654 1524155 1454647 1374302 1339951 1340433 1288922 1222947 1170703 1148796 1116668 1066707
18160A066707l6249m5810n4332j9093l453j5733k5003j1826j5457j5494k2098
$$ 1066707 1030458 984648 930316 911223 907770 892037 867034 855208 839751 824257 802159
18149H02159K1591N1900M9245o11J2483j1264K9342N1362L1057N3564P0573N7412
$$ 802159 823750 875650 924895 924284 936767 925503 954845 1006207 1037264 1090828 1161401 1218813
18137A218813J8185J9907K0477j8081J4130K1840k7099j4176m4502J7031M1340
$$ 1218813 1236998 1256905 1277382 1259301 1273431 1295271 1268172 1253996 1209494 1226525 1267865
18126A267865P4360J06891J41118J93099K18779K86996M09923O16163R84498J758579
$$ 1267865 1342225 1449116 1590234 1783333 2002112 2289108 2699031 3315194 4299692 6058271
18116F058271L094210M253479L555260J766138K062736M246178L643964j69961
$$ 6058271 9152481 13405960 16961220 18727358 20790094 25036272 28680236 28510275
18108B8510275m575042p740902n565405k960217j588149r04325n70031m01344
$$ 28510275 23935233 16194331 10628926 7668709 6080560 5176235 4606204 4204860
18100D204860l44850k81616k93755j95849j31541j54662j30547j38909j38705
$$ 4204860 3860010 3578394 3284639 3088790 2957249 2802587 2672040 2533131 2394426
18091B394426j42557r2597q2458q2668p2134p8161m3775o6108r1242l7189m8227
$$ 2394426 2251869 2159272 2076814 1994146 1922012 1843851 1800076 1733968 1642726 1605537 1557310
18080A557310p2982o4006p4077k5073k8857j7470k1203n9666k2651o471j2254
$$ 1557310 1484328 1420322 1346245 1321172 1292315 1274845 1253642 1193976 1171325 1164854 1152600
18069A152600k3432j9571l8447p608j1744L019Q464m568l2348j8947L150J2150
$$ 1152600 1129168 1109597 1071150 1063542 1051798 1054817 1063281 1058713 1026365 1007418 1010568 1022718
18057A022718k2728k80r014q392r560k9334m218Q284K058j3770K2309r227k1184
$$ 1022718 999990 999710 990696 982304 972744 943410 939192 947476 949534 935764 958073 948846 927662
18044I27662J942k5572k817l587J1813j345L361l0786K941J182M9422K2299l483
$$ 927662 929604 904032 901215 897628 909441 908096 911457 880671 883612 884794 934216 956515 953032
18031I53032J8101m732M228k632k137L7092M9242p173l909L932M6589Q0235R0013
$$ 953032 971133 966401 970629 967997 965860 1002952 1052194 1045021 1041112 1045044 1091633 1171868 1261881
18018A261881J14115J26892J75763J63423J25145J53397J80205J61250J32571
$$ 1261881 1375996 1502888 1678651 1842074 1967219 2120616 2300821 2462071 2594642
18009B594642O5893P2425O4511L1305O6184Q4936J07265J49212K31584L49076
$$ 2594642 2660535 2732960 2797471 2828776 2894960 2979896 3087161 3236373 3467957 3817033
17999C817033M87512O51762R33678J302974J848922K751914M072647N631932P121810
$$ 3817033 4304545 4956307 5889985 7192959 9041881 11793795 15866442 21498374 28620184
17990B8620184Q175753Q555815Q423929P765938O303944L485560p05577n372466
$$ 28620184 36795937 45351752 53775681 61541619 67845563 71331123 70625546 65253080
17982F5253080q955963j0444898r627729p419755m895233k775318j213804N3402
$$ 65253080 56297117 45852219 36224490 28804735 23909502 21134184 19920380 19973782
17974A9973782J326330K835575M628257O381415P695113Q317039Q332074P831737
$$ 19973782 21300112 24135687 28763944 35145359 42840472 51157511 59489585 67321322
17966F7321322O522815L909005j46107m992444r147080j1260778j0923209q937900
$$ 67321322 73844137 77753142 77607035 72614591 63467511 52206733 41283524 32345624
17958C2345624o428616m326123k936060k107265j587622j246789r61010p61858
$$ 32345624 25917008 21590885 18654825 16547560 14959938 13713149 12752139 11990281
17950A1990281o69515n87104m90801m26700l71534l28243l06154l06832k60033
$$ 11990281 11320766 10733662 10242861 9816161 9444627 9116384 8810230 8503398 8243365
17941H243365k85454k76874k74220l00048k99771k91090l30261l17658k81341
$$ 8243365 7957911 7681037 7406817 7106769 6806998 6515908 6185647 5867989 5586648
17932E586648k81065k31715j63622j59519j43001j44989j17237j11213j34557
$$ 5586648 5305583 5073868 4910246 4750727 4607726 4462737 4345500 4234287 4099730
17923D099730j05541j32816r7054o9369q1370p3774p1809q3938n2569m3073n5184
$$ 4099730 3994189 3861373 3764319 3694950 3613580 3539806 3467997 3384059 3331490 3288417 3233233
17912C233233n8031p6013p9277n8117m6650q1320n7484j11864p1742m8515q5773
$$ 3233233 3175202 3099189 3019912 2961795 2915145 2833825 2776341 2664477 2592735 2544220 2458447
17901B458447p8907m4312k3555n1965n3664k0331n1977m4769m469J402M209J6216
$$ 2458447 2379540 2335228 2311673 2259708 2206044 2185713 2133736 2088967 2084498 2085900 2090109 2106325
17889B106325J7683l4834j4428m836j02886j44459j53803j35601j13146q0473
$$ 2106325 2124008 2089174 2074746 2069910 1967024 1822565 1668762 1533161 1420015 1339542
17879A339542p1608n8310j3282n748j6363n1850m7925M243J2500q239j9348p751
$$ 1339542 1267934 1209624 1196342 1190594 1174231 1122381 1074456 1078699 1091199 1082960 1063612 1055861
17867A055861n0212j1459j8720k5976o1115o166l12k6997o7947j5111M708j1663
$$ 1055861 1005649 994190 975470 949494 888379 882213 881901 854904 786957 771846 776554 764891
17855G64891n76n436J3370j7032n3291l1130k0281O684O695o889K4117J1434M215
$$ 764891 764315 758879 772249 755217 701926 670796 650515 657199 663894 657005 681122 692556 696771
17842F96771j4150q64n7629o4881l3816J4110J1264k1371l504j4947j2529j0383
$$ 696771 682621 681757 624128 559247 525431 539541 550805 529434 525930 510983 498454 488071
17830D88071l8358j2952m4544k1310j3288k4404m3507L152n539p877k077k4157
$$ 488071 449713 436761 392217 370907 357619 333215 289708 292860 287321 279444 277367 253210
17818B53210m871K7042J7998k3130m594J5584n328J8962J8870p041l3772J5018
$$ 253210 248339 275381 293379 270249 265655 281239 275911 294873 313743 306702 272930 287948
17806B87948l1881j9262N881K8623P782J5461L2972L6499J178K4340J3472J6030
$$ 287948 256067 236805 242686 271309 279091 294552 327524 364023 365201 389541 403013 419043
17794D19043J1000l3626L337m61M6912M9343L3266M5979N1393R5240Q4937N3834
$$ 419043 430043 396417 399754 399293 446205 495548 528814 574793 626186 721426 806363 860197
17782H60197K5081k3800q435k3577l6340m9844n1962o1783m9960m1447M332k2238
$$ 860197 885278 861478 853043 829466 793126 743282 691320 629537 579577 538130 542462 520224
17770E20224k5676j3108L0666Q972j0203L2458L2921M467o884m0994r0298p4158
$$ 520224 494548 481440 512106 521078 510875 543333 576254 580721 573837 532843 442545 368387
17758C68387m1172m3751l1923k0981l0502j4370J5565k0413k2728J9088k81O849
$$ 368387 327215 283464 251541 230560 200058 185688 201253 180840 158112 177200 176919 183768
17746A83768K5315M68l4722M119J1577M930J671o443J8624l723J3403N0826J5453
$$ 183768 209083 209551 174829 178948 190525 195455 197126 190683 209307 205584 218987 269813 285266
17733B85266O528K3468J8853J6276K7108J9414R607q383J9244j4740o7419j0844
$$ 285266 291794 315262 334115 350391 377499 396913 406520 398137 417381 402641 335222 324378
17721C24378j2529j5855o942k6978k4179j9283R349l9149k5355l4446j6168J062
$$ 324378 311849 295994 289052 262074 237895 218612 227961 188812 163457 129011 112843 113905
17709A13905J1725j8803L288j3649l0338k7574M0794N142m844l967k2736q07J0566
$$ 113905 125630 106827 110115 96466 66128 38554 79348 84490 79646 75679 52943 52136 62702
17696F2702j206O48K989J6255j813K46K180j6788l2621N268L7532N472j6269l131
$$ 62702 61496 62144 65133 81388 79575 79821 82001 65213 32592 37860 75392 80864 64595 61464
17682F1464N035p758k9042l8513K364J5366R041o274K2454K4902j5312N566J8901
$$ 61464 66499 58741 29699 -8814 -6450 8916 17957 11683 34137 59039 43727 49293 68194
17669F8194j2602j3124k2853M429J0290Q794R759r362n350j7158j5640j0105n162
$$ 68194 55592 42468 19615 24044 34334 43128 52887 43525 38175 21017 5377 -4728 -9890
17656i890n406L5201K2464j4968K8721J0984j1389j5400k0916q700K2581J5106
$$ -9890 -15296 19905 42369 27401 56122 67106 55717 40317 19401 10701 33282 48388
17644D8388J2710N556j2813K1252p136o993J7996J7199J1832J8171Q306n075j8818
$$ 48388 61098 66654 53841 75093 67957 60964 78960 96159 107991 126162 134468 129393 110575
17631A10575N989p036n1991n316K261R949N677j1084k078k009L502l1506r514
$$ 110575 116564 109528 57537 52221 54482 64431 70108 59024 56946 54937 58439 26933 17419
17618A7419l680J897L727k0504J7539p68L129K2051J8093K6314j2356K3551L4224
$$ 17419 13739 15636 19363 -1141 16398 15630 18759 40810 58903 85217 72861 96412 130636
17605A30636r25K5532K9388K3487L0463P387J5540K6414N5440O2355M3223L984
$$ 130636 129711 155243 184631 208118 238581 245968 261508 287922 343362 405717 448940 452924
17593D52924J0930J8106n261N796k7800l13p99L697m966k557l0053j2023K4587
$$ 452924 463854 481960 476699 482495 454695 454382 453583 457280 452314 449757 419704 407681 432268
17580D32268K4931P384m943P461M6024j2063m0164k4943l2640l7323l4354k1787
$$ 432268 457199 464583 459640 467101 513125 501062 460898 435955 403315 365992 331638 309851
17568C09851l9480m1619j7297l733p041K2691k298L3512N0824L0500J8326K2201
$$ 309851 270371 228752 211455 207722 200681 223372 221074 254586 305410 335910 354236 376437
17556C76437J8131j3265j5298k9290j596M512j5407m0813n2070p0296m4667q128
$$ 376437 394568 381303 366005 336715 335119 339631 324224 283411 231341 161045 116378 108250
17544A08250j6946n39r845j953J0768k156k1371j736R997N654q000J6958J9753
$$ 108250 91304 90765 80920 78967 89735 87579 66208 64472 74469 80123 72123 89081 108834
17531A08834J0777M793Q778j1356J9326o995j9314J0965J011j9802r551o81j8581
$$ 108834 119611 124404 133182 121826 141152 134157 114843 125808 126819 107017 97466 96785 78204
17518G8204o2741K3030K3322k3400j5479j5003K0550J8150L186j4753r390k0314
$$ 78204 15463 38493 61815 38415 22936 7933 28483 46633 49819 35066 25676 5362
17506E362R564N738J5505p496j4669m564O206j8105O445R003J7453O628j1001
$$ 5362 14926 20664 36169 28673 14004 9440 15646 -2459 3986 12989 30442 37070 26069
17493B6069j4161l9322n215K765J8280p69J8656L9936J2751O028k3298k943J3733
$$ 26069 11908 -27414 -32629 -29864 -11584 -12353 6303 46239 58990 65018 41720 38777 52510
17480E2510J2153J6775j3937k1457p370N270Q774r186j7748N65J3863K7445j2760
$$ 52510 64663 81438 67501 46044 38674 43944 52718 43532 25784 26349 40212 67657 54897
17467E4897l5658k7176J6306N6233n310k2152K997L757q738m0115R110P932m38
$$ 54897 19239 -7937 8369 64602 59292 37140 40137 43894 35156 -4959 4151 12083 11645
17454A1645j9688m180L8794K6443M3628J628J0055K8230L9329N287l3596j671
$$ 11645 -8043 -12223 26571 53014 96642 98270 108325 136555 175884 181171 147575 145904
17442A45904k1090j4896l5632O55r86P918n094j0546j5550q783k3420k6816K2482
$$ 145904 124814 109918 74286 74941 73955 81873 76779 66233 50683 41900 18480 -8336 14146
17429A4146j7033k438K8045l899P581j8382j4709L678J4700K9059J2391Q196P404
$$ 14146 -2887 -5325 22720 18821 26402 8020 -6689 -3011 11689 40748 53139 61335 68739
17416F8739J947j4012J6792J1541k3367o121K6331M4367L8878K6329M7124O3965
$$ 68739 70686 56674 73466 85007 61640 55519 81850 126217 165095 191424 238548 302513
17404C02513L1827K0596O668j3252K1454j2082m9281l4512o2634o5556l0718P909
$$ 302513 334340 354936 361604 348352 369806 357724 308443 273931 211297 145741 115023 122932
17392A22932q24j691M795K7594J3829M7440O3926L0823L7801N4100L4726K0364
$$ 122932 122108 120417 125212 152806 166635 214075 278001 308824 346625 400725 435451 455815
17380D55815n950m5830m9215n2798n9372m8300k6961J756j7390k6157k2417J912
$$ 455815 449865 404035 354820 302022 242650 194350 167389 169145 151755 125598 103181 105093
17368A05093j2777k4896J6592q212k9815R103J0072j2904J506J5699l535j2618
$$ 105093 92316 67420 84012 75800 45985 55088 65160 52256 53762 69461 65926 53308
17356E3308m487l410K4064M5983j1840m2189k2515j6002J5175p42k8574k0371
$$ 53308 48821 45411 69475 115458 103618 61429 38914 22912 38087 37345 8771 -11600
17344a1600L5363Q770P349J4218o679m933K2354j0028m0889M661J4313M030j2139
$$ -11600 23763 32533 39882 54100 47421 42488 64842 54814 13925 18586 32899 36929 24790
17331B4790p617K1373J2172R751l5371k007L4233Q448p751j9894J7214K1385j9119
$$ 24790 17173 38546 50718 60469 25098 23091 57324 65772 58021 38127 55341 76726 57607
17318E7607j7959K630J0069J0212j3145n804M7897k722l4946J1762k288j1567
$$ 57607 39648 42278 52347 62559 49414 43610 91507 88785 53839 65601 63313 51746
17306E1746j5290J5359j6516l5521K8711N0172Q531l8866j7103J009j6645j1921
$$ 51746 36456 51815 35299 -222 28489 78661 87192 48326 31223 32232 15587 3666
17294C666j4705r704J0031K4813M1933P58k774Q541P277k7835m562K111J3914
$$ 3666 -11039 -20743 -10712 14101 56034 56792 54018 62559 69836 42001 37439 39550 53464
17281E3464L1806j6000j5955L637j1395r693K7334N520J4342Q439R161K633k0789
$$ 53464 85270 69270 53315 56952 45557 35864 63198 68718 83060 91499 100660 103293 82504
17268H2504m613l4710j2052L2061J109L059k3682l9153L0052L2423K9161j4697
$$ 82504 77891 43181 31129 63190 64299 67358 43676 4523 34575 66998 96159 81462
17256H1462K3381J6149j5326L912M367m2969k6213q40n201j3698L0763J5138j160
$$ 81462 104843 120992 105666 109578 113945 70976 44763 43923 38722 25024 55787 70925 69765
17243F9765l0349k0651K385J5562L1833L098K5573p094k5177n759k6966j9674
$$ 69765 39416 18765 21150 36712 68545 71643 97216 90122 64945 59186 32220 12546
17231A2546M6246m103j0273J8621J6028J7944k082k6440j3816n530l849J0317
$$ 12546 58792 54689 44416 63037 79065 97009 94927 68487 54671 49141 45292 55609
17219E5609r062q940l712k243k7437m4365m1784m087j371J315L8871K4752P753
$$ 55609 46547 37607 33895 31652 4215 -40150 -81934 -86021 -87392 -86077 -47206 -22454 -14701
17206a4701L541j0959J6120R751L673l3051J3341L3270k0089k978r91j319K051
$$ -14701 -11160 -22119 -5999 3752 7425 -25626 -12285 20985 896 -2082 -3073 -4392 -2341
17193b341K656l7080k8877k7457J8536L1034q173J9770k444k908L0965J0231r37
$$ -2341 315 -36765 -65642 -93099 -74563 -43529 -51702 -31932 -34376 -37284 -6319 3912 2975
17180B975L3505L2570k5733m9185j1797M5808J2517J5974L461J8640j1901j3546
$$ 2975 36480 69050 43317 -5868 -17665 28143 40660 56634 60095 78735 66834 53288
17168E3288K2275M36n601N611k2080j0093L0208J9900K829l556O422O509M605
$$ 53288 75563 75999 70398 76009 53929 43836 74044 93944 96773 93217 99639 106148 110753
17155A10753j2291J3982K6005P671j3045m5625P13P336M1401L0808J5617R256
$$ 110753 98462 112444 138449 146120 133075 87450 88163 95499 136900 167708 183325 192581
17143A92581j6426J1833p350k5591N249J1578K3461K9714k2009J4608N9J220O654
$$ 192581 176155 187988 180638 155047 160296 171874 195335 225049 203040 217648 217707 218927 225581
17130B25581L8936J5613J3262M7695J8456n1637l4822r608l38m0391k3300j1991
$$ 225581 264517 280130 293392 341087 359543 307906 273084 263476 263138 222747 199447 187456
17118A87456j0193o507M651k342n323m03L5105M6875R418j9727j8603l95M756
$$ 187456 177263 170756 175407 173065 167742 167339 202444 249319 258737 239010 220407 220012 224768
17105B24768K2764L8170N634j1971J4806n398l0610k4224j2115L2078M2858j899
$$ 224768 247532 285702 291336 279365 294171 288773 258163 233939 221824 253902 296760 294861
17093B94861J7983J5963n980J1178L3574J347j4303q965J552k4629K5705J6880
$$ 294861 312844 328807 322827 334005 367579 368926 354623 345658 347210 322581 348286 365166
17081C65166q11o953P998L6179K0204J480k2572m4419K1408L0747j511j6426M6713
$$ 365166 364355 357402 365400 401579 421783 423263 400691 356272 377680 408427 406916 390490 437203
17068D37203N2314o153K9858N9867L9548r987r188L714k1163L2859L5364P4368
$$ 437203 489517 483364 513222 573089 612637 602650 593462 597176 576013 608872 644236 718604
17056G18604P7857K9642J9514O3925O2289N5370R1881J24897J53633J72675J46589
$$ 718604 796461 826103 845617 909542 971831 1027201 1119082 1243979 1397612 1570287 1716876
17045A716876J38773J10862J64130K15133K09745J92207J82969K23754L15307
$$ 1716876 1855649 1966511 2130641 2345774 2555519 2747726 2930695 3154449 3469756
17036C469756M29743N27287N99466Q53039J233136J824047K834320M366981N900621
$$ 3469756 3899499 4426786 5026252 5879291 7112427 8936474 11770794 16137775 22038396
17027B2038396O303569N513973N706579P983732R532983P159293J352243m120512
$$ 22038396 28341965 33855938 39562517 47546249 57079232 64238525 65590768 61470256
17019F1470256m286735j186502p57837l736246p646001r123692o948193l868432
$$ 61470256 57183521 55997019 55239182 51502936 43856935 34733243 27785050 23916618
17011B3916618j477304M69074K446457M341784N212530M720554M557494O430610
$$ 23916618 22439314 22908388 25354845 29696629 34909159 39629713 44187207 50617817
17003E0617817Q440390P106148K034721l765983n174469k362590j149322l449615
$$ 50617817 59058207 66164355 68199076 64433093 59258624 56896034 55746712 52297097
16995E2297097p286731r502746q132149n398764l413979k201502j493101j114772
$$ 52297097 45010366 35507620 27375471 21976707 18562728 16361226 14868125 13753353
16987A3753353r04475q17428p14168n96715n52030m91378m43937m38901m07886
$$ 13753353 12848878 12031450 11317282 10720567 10168537 9677159 9233222 8794321 8386435
16978H386435l85646l92539l57514k76918k58475k28486k37977k35934k34006
$$ 8386435 8000789 7608250 7250736 6973818 6715343 6486857 6248880 6012946 5778940
16969E778940j70317j74516k15951k34362j96440j44098j46540j74912j71450
$$ 5778940 5608623 5434107 5218156 4983794 4787354 4643256 4496716 4321804 4150354
16960D150354j50492j40821j17115j30311j23501o1062o2501p5772q9987q2419
$$ 4150354 3999862 3859041 3741926 3611615 3488114 3427052 3364551 3288779 3198792 3116373
16950C116373q4238p5172p7606q2080r1827j04150q3044p9427o5407o6443q7714
$$ 3116373 3032135 2956963 2879357 2797277 2705450 2601300 2518256 2438829 2373422 2306979 2219265
16939B219265n3521m0689q7444r1568m9965k7524m0065l3316n0575l5249l2635
$$ 2219265 2165744 2125055 2037611 1946043 1896078 1868554 1828489 1795173 1744598 1709349 1676714
16928A676714m6373m1959o0888k2951k6791m8608k7875o9828o2642l2526k9737
$$ 1676714 1630341 1588382 1527494 1504543 1477752 1429144 1401269 1331441 1268799 1236273 1206536
16917A206536m0672n1980l3994n8427k3490p987k1194r943m169k2373j4998j9347
$$ 1206536 1165864 1113884 1079890 1021463 997973 989986 968792 958849 954680 932307 917309 897962
16905H97962j6427m4720k132o975l7665l7378J7155J2205m6703l0778q619l5159
$$ 897962 881535 836815 834683 827708 790043 752665 769820 782025 735322 704544 695925 660766
16893F60766n9822k059j0642j6805l1615l7558m239K8537j1298j1142k2746l7852
$$ 660766 600944 598885 588243 571438 539823 502265 498026 526563 515265 504123 481377 443525
16881D43525j4563K0658J1366j2344r147m5455j6498P638j3713m8988m2429l0569
$$ 443525 428962 449620 460986 448642 439495 394040 377542 385180 371467 322479 280050 249481
16869B49481j3266k920n99k310R296N015j6368j7834r743J517O002N218j84M300
$$ 249481 236215 233295 232696 230386 239682 244697 228329 210495 200752 202269 208271 213489 213305 217605
16855B17605l2957k9369r525m37K3320K8726n663j3108n860L2410K2543Q099j1012
$$ 217605 184648 155279 145754 145317 168637 197363 191700 178592 172732 205142 227685 235784 224772
16842B24772j7297k7567p858K7342m642j0884p714L1473O2348k275j5431k5877
$$ 224772 207475 179908 172050 199392 194750 183866 176152 207625 269973 267698 252267 226390
16830B26390j0262m200k0456o31Q797l4344j2766L9470M5323k7366k0952n417
$$ 226390 216128 211928 191472 190841 199638 165294 152528 191998 237321 209955 189003 183586
16818A83586j0463p254p939J8007L9994J1645J1277l655n0284k0266j7109J1701
$$ 183586 173123 165869 157930 175937 215931 227576 238853 235198 184914 164648 147539 159240
16806A59240P322k431j2230Q29k390l0376k586N255j412k3055K5426J3129L002
$$ 159240 166562 164131 151901 152730 150340 119964 117378 122633 121221 98166 123592 136721 139723
16793A39723K0885J3509k775p580L7338L6145M0929K9528M7758L5778M5406J2968
$$ 139723 160608 174117 171342 163762 201100 237245 278174 307702 355460 391238 436644 449612
16781D49612J4886j4686m3062l0946n8497l4441m2828l5772m020p448n894M972
$$ 449612 464498 449812 406750 375804 317307 282866 240038 204266 200246 192798 186904 191876
16769A91876J5399M2766L0374K4015K7664N3396J0011J1560l5581j2086J7473
$$ 191876 207275 250041 280415 304430 332094 385490 395501 407061 371480 359394 376867
16758C76867j0691l8636l0110l9102l1949k8732k8924l1547k3435o501J566l0587
$$ 376867 366176 327540 297430 258328 226379 197647 168723 137176 113741 107240 108806 78219
16746G8219J8590L7920l411q985l699k7095r523j219l254n651M597j1872O294
$$ 78219 96809 134729 131318 122333 118634 91539 82016 80797 77543 71892 76489 64617 70911
16733G0911j2942M408j6410N476l559J0535J0807q06m1540K903K0712J75O296
$$ 70911 57969 62377 45967 51443 47884 58419 69226 68420 26880 29783 50495 50670 56966
16720E6966j4046j8062q246l157K714n332K3792O011J714L44K9157k8809k7153
$$ 56966 42920 24858 16612 13455 16169 10837 34629 40640 42354 42698 71855 43046 15893
16707A5893k5421K237P83M359J8583j6677j4926j5520K2017L3736j516k08j8731
$$ 15893 -9528 -7291 -6508 -2149 16434 -243 -15169 -30689 -8672 25064 23548 23340 4609
16694D609j1303J3824J1846Q645N258P527M0P659k6900k8942P397J8495L3708
$$ 4609 -6694 7130 18976 27621 32879 40406 40446 48105 21205 -7737 -340 18155 51863
16681E1863l213l113K385r173k5331J0576M5499J7305l4891r904k1733r294N716
$$ 51863 48650 45537 47922 38749 13418 23994 69493 86798 51907 42003 20270 10976 16692
16668A6692J6179r431j7001l1842n448J6548j4209j4426L6449K3765K1142J2275
$$ 16692 32871 23440 6439 -25403 -30851 -14303 -28512 -42938 -6489 17276 38418 50693
16656E0693k4662j2045J6966K6994j2772j3955K0703L0528j556l6526j2851j0116
$$ 50693 26031 13986 30952 57946 45174 31219 51922 82450 80894 44368 31517 21401
16644B1401l1669k4139Q515K1712K5229j8959K410R332n55J1600j1075k285M268
$$ 21401 -10268 -34407 -25892 -4180 21049 2090 4500 13832 13277 24877 13802 11517 15785
16631A5785J979m662j211J1428j4759J0577j5314r83P797K2635J915j9876L057
$$ 15785 17764 13102 11891 23319 8560 19137 3823 2840 10637 33272 35187 15311 18368
16618A8368k2756k0549N013j3979O70J3745K6318J90q292k4485J3836J3335l751
$$ 18368 -4388 -24937 -19924 -33903 -33233 -19488 6830 7020 -1272 -25757 -11921 1414 -2337
16605b337R546R555K508l6773R658J6951n110l0745J5696K1986L177k5593k5783
$$ -2337 7209 16764 19272 -17501 -7843 9108 3998 -26747 -11051 10935 14112 -11481 -37264
16592c7264P615o090j9276J6608K3351K6857J4359n631m243j4119o762k0461k6379
$$ -37264 -29649 -35739 -55015 -38407 -15056 11801 26160 20529 16286 2167 -4595 -25056 -51435
16579e1435K2606J1818n383J9113L8133j4815J5864j845p2l4195k7207r702J2020
$$ -51435 -28829 -17011 -22394 -3281 34852 20037 35901 34056 33984 -211 -27418 -37120 -25100
16566b5100L6154J3398k400k4053N816M750j8702j955j3031k8693J7493K6370
$$ -25100 11054 24452 22052 -2001 3815 8565 -10137 -12092 -25123 -53816 -36323 -9953
16554i953L1298j4854m865J8432j2279J219J1968p9L372m02j2419k953J9878k0358
$$ -9953 21345 6491 1626 20058 7779 8998 20966 20887 24259 23857 11438 8485 28363 8005
16540H005n737K1627J0538M595k7405l3424N421K5039M389k7053R290j7978m3354
$$ 8005 2268 23895 34433 39028 11623 -21801 -16380 8659 13048 -14005 -4715 -22693 -66047
16527f6047K0201N0R921K5461O209J1395k7454o669p323M585O733J59K8323P252
$$ -66047 -45846 -45796 -35875 -10414 -4205 7190 -20264 -26933 -34256 -29671 -22938 -22779 5544 12796
16513A2796j0437l0047r014K4440M217O783M523j8223l046j6750m655r39r750
$$ 12796 2359 -27688 -36702 -12262 -8045 -1262 3261 -14962 -18008 -34758 -39413 -40352 -50102
16500e0102o87j4065J2151L4579p453j2137p475K052N648P633M4828J892l4124
$$ -50102 -50789 -64854 -52703 -18124 -25577 -37714 -45189 -43137 -37489 -29856 14972 16864 -17260
16487a7260r338Q564J1787P071j95J9438j2248L969M6335K3175k1145j9793j8067
$$ -17260 -26598 -18034 -6247 824 629 20067 7819 11788 58123 81298 60153 40360 22293
16474B2293j2712L725J235J4305K2189M1274N5729J6547K4235J4239P810q76K8510
$$ 22293 9581 13306 14541 28846 51035 92309 148038 164585 188820 203059 210869 209993 238503
16461B38503K8888J9576J5834j8284q296j0651m3502l4264j1714k2334p884r630
$$ 238503 267391 286967 302801 284517 276221 265570 222068 187804 176090 153756 145872 136242
16449A36242j7951K3706M3356N2461K788k2476M8564P5374J5435j8581n0839l6992
$$ 136242 118291 141997 185353 237814 240602 218126 266690 342064 357499 338918 288079 251087
16437B51087j0354o518k3821k8015m2340p1380p5367q978N1636K5247M08j8993
$$ 251087 240733 234215 210394 182379 140039 68659 -6708 -15686 35950 61197 61605 42612
16425D2612j5910Q863J2264p678J8442K6079J2342l1715j5314p160j6156O746
$$ 42612 26702 35565 47829 40151 58593 84672 97014 65299 49985 42825 26669 33415
16413C3415J5533l0250K7682J5951r481j712j1803l7257k3219L9867k0552P477
$$ 33415 48948 18698 46380 62331 52850 51138 39335 2078 -21141 18726 -1826 5651
16401E651Q215j989K949J8468K6780J4877j8298P045J1553m0206j3844O146j3729
$$ 5651 13866 11877 14826 33294 60074 74951 56653 63698 75251 35045 21201 27347 13618
16388A3618Q78Q30j477L318o003j5901k796L931O297l316j2576j6238R835J8584
$$ 13618 14496 15326 13849 17167 11164 -4737 -7533 -3602 2695 -621 -13197 -29435 -19600 -1016
16374a016J4061R053L51N20J6543K252k1592j1760L2466k4075l4521J0576K2417
$$ -1016 13045 22098 22449 22969 39512 41764 20172 8412 40878 16803 -17718 -7142 15275
16361A5275J9695M90M560j4842j2542j5120J753l193J4428K1767r033j678r409
$$ 15275 34970 35460 40020 25178 12636 -2484 -731 -3924 10504 32271 23238 21560 12151
16348A2151j0615j4214J0294M440M309P735J2821J0304l661j8061k3038j9862
$$ 12151 1536 -12678 -2384 2056 6365 14100 26921 37225 33564 15503 -7535 -27397
16336b7397O032j2985q088J2845J3982J2341j5093l420J9838j5250j5148J5618
$$ -27397 -21365 -34350 -42438 -29593 -15611 -3270 -18363 -21783 -1945 -17195 -32343 -16725
16324a6725q81J8755o9j8077j5466J2752k0819o0189o042K1400M1598L5763J3432
$$ -16725 -17606 1149 1080 -16997 -32463 -19711 -40530 -100719 -106761 -85361 -43763 -8000 5432
16311E432J7872k4179k5540L58J91N836O774l2837r505j1756n078M199Q253K8109
$$ 5432 23304 -875 -26415 -26057 -25866 -20030 -13256 -46093 -55598 -67354 -72432 -68233 -59980 -31871
16297c1871L4477J4451K6539O528r217k6137j565J5757J8214m312l8512l407J9833
$$ -31871 2606 17057 43596 50124 40907 14770 13205 28962 47176 42864 4352 945 20778
16284B0778k816j1532j975p828Q37j147N847j7650j0640O232N960K8281n746m582
$$ 20778 17962 6430 4455 -3373 -2536 -3683 2164 -15486 -26126 -19894 -13934 14347 8601 4019
16270D019j375j3491J1533J3045j4366k552J0887l891k806P375k0529j7528L9622
$$ 4019 2644 -10847 686 13731 -635 -3187 7700 3809 1003 8378 -12151 -29679 9943
16257I943J4497j3150p418j4749o063l0577r502J7557K6068K9550J4204j0973
$$ 9943 24440 11290 3872 -10877 -16940 -47517 -57019 -39462 -13394 16156 30360 19387
16245A9387k4235j5065J8875K234k0820l3615l924K5886L0270J9509J692j563
$$ 19387 -4848 -19913 -1038 1196 -19624 -53239 -57163 -31277 -1007 18502 20194 18631
16233A8631m593K6651J7274J5181l2323k374L740K024n533M600k6092k6894q000
$$ 18631 14038 40689 57963 73144 40821 38447 42187 44211 38678 43278 17186 -9708 -17708
16220a7708k7908O360K9143K6929Q363K3714j6960N459q396k9496l311m096j3089
$$ -17708 -45616 -39256 -10113 16816 25179 48893 31933 37392 28996 -500 -3811 -7907 -20996
16207b0996n154J3938N703K5537M3502K1549k3157k5351k8750N699K7286J0708
$$ -20996 -26150 -12212 -6509 19028 62530 84079 60922 35571 6821 12520 39806 50514
16195E0514j6328p593j1755l1130j9435k35K0095m385j4626K1602k0891l232K2336
$$ 50514 34186 26593 14838 -16292 -35727 -35962 -15867 -20252 -34878 -13276 -34167 -37399 -15063
16182a5063Q89l5688J4144n422Q605J5980J5549r868j1125J5391j2088P438J308
$$ -15063 -14174 -49862 -35718 -41140 -32535 -16555 -1006 -10874 -21999 -6608 -18696 -11258 -9950
16169i950J0024J2352n314Q210M260l0835k4029J2138R084K0355L3720j4053j5496
$$ -9950 74 12426 7112 15322 19582 -11253 -35282 -23144 -14060 6295 40015 25962 10466
16156A0466P038P638k2199k5931j5756J3356K7066J4601k5807j7867K1576J7085
$$ 10466 17504 25142 2943 -22988 -38744 -25388 1678 16279 -9528 -27395 -5819 11266
16144A1266k0682j8674M961o206k4249k4186J127K5430L256J8463L0992J720n1430
$$ 11266 -9416 -28090 -23129 -29335 -53584 -77770 -76643 -51213 -47957 -29494 1498 3218 -48212
16131d8212j4552M3846N382O793j9103j8794J9399j0367l6519K324L0755K4432
$$ -48212 -62764 -18918 -13536 -6743 -25846 -44640 -25241 -35608 -72127 -69803 -39048 -14616
16119a4616J9456j0453r607j8966r356R998N33L455J4868r104m858J0535J4882
$$ -14616 4840 -5613 -15220 -34186 -43542 -33544 -33011 -29556 -14688 -23792 -28650 -18115 -3233
16106c233j3032J7104n684k1037K4754L682j1717j3024K7003O789J7368l1638
$$ -3233 -16265 839 -4845 -25882 -1128 2554 -9163 -22187 4816 11605 28973 -2665
16094b665p2252j0071J6957K2270J4460J22K5579J7716R114o69k4329J7561J4640
$$ -2665 -74917 -84988 -68031 -45761 -31301 -31179 -5600 12116 21230 20561 -3768 13793 28433
16081B8433O059j8862j9846k7253k0909O036J6640O872K5544j2960j5941L366
$$ 28433 34492 15630 -4216 -31469 -52378 -46342 -29702 -22830 2714 -10246 -26187 -22821
16069b2821K1780K2396J890J3766K455j8378p675j0944K1193K3543j5700l3894
$$ -22821 -1041 21355 23245 37011 39466 21088 13413 2469 23662 47205 31505 -2389
16057b389K1212J8055k7393j3869K1912J2364l4361k5267J5502r969r164R48K3552
$$ -2389 18823 36878 9485 -4384 17528 29892 -4469 -29736 -14234 -24203 -33367 -32419 -8867
16044h867l299l6934M4765P341j7221M240j3386M482M5239K7878o392j3819k7507
$$ -8867 -12166 -49100 -4335 3006 -14215 -9975 -23361 -18879 26360 54238 47846 34027 6520
16031F520q641m462L953l8512j1830N150J5397J0168K2970L5929k0830k5668N4588
$$ 6520 -2121 -6583 -2630 -41142 -52972 -47822 -32425 -22257 713 36642 15812 -9856 44732
16018D4732p112j0946j0038J1542O871j6156l1023j5315K0235m423J9061J7163
$$ 44732 37620 26674 16636 28178 35049 18893 -12130 -27445 -7210 -11633 7428 24591
16006B4591j760k9801J8349J3435q483k0587j9739R740l3473l0407K7259Q597
$$ 24591 22831 -6970 11379 24814 16331 -4256 -23995 -14255 -47728 -78135 -50876 -42279
15994d2279j9155P621j5732N7012J0048l9221J0280L5263r534l3568q972N986
$$ -42279 -61434 -53813 -69545 -12533 -2485 -41706 -31426 3837 -5697 -39265 -48237 -42251
15982d2251Q504L902L534K4095M1353j5560l0447j5580j6324P875l274O963L7429
$$ -42251 -33747 -29845 -26311 -2216 39137 23577 -6870 -22450 -38774 -30899 -34173 -27210 10219
15969A0219M0167j4004k3368j7437N338k49l747k1228J8201J3242N147k5361R752
$$ 10219 50386 36382 13014 -4423 915 666 -3081 -24309 -6108 7134 12281 -13080 -3328
15956c328j0571P526K3603k762J542J3086l1452k9014K923R951K1825r298L4435
$$ -3328 -13899 -6373 17230 14468 16010 29096 -2356 -31370 -28447 -18496 3329 -5969 28466
15943B8466j4546q038K3624j426k4047K052K3522K7883j297k1655J1540N161P151
$$ 28466 13920 5882 29506 28080 4033 6085 29607 57490 56193 34538 46078 51239 58390
15930E8390j6211k0255J1720j2732k8505O6267M1018j9738k5601l9179j4017J0451
$$ 58390 42179 21924 33644 20912 -7593 58674 99692 79954 54353 15174 1157 11608
15918A1608K1099r966K2028j2923j5865j4163j3224l8555K2243L4765k2279K445
$$ 11608 32707 22741 44769 31846 15981 1818 -11406 -49961 -27718 7047 -15232 -12787
15906a2787j1332n437J3149K8534Q591q684r878r767P512p151O345J1232k3338
$$ -12787 -24119 -29556 -16407 12127 20718 12034 2156 -7611 -99 -7250 -905 10327 -13011
15893a3011j4623J2795j111J2180j6792m5651K0130L673L230k238L6960Q259l2703
$$ -13011 -27634 -14839 -15950 -3770 -20562 -66213 -46083 -42410 -39180 -41418 -4458 3801 -28902
15880b8902q451k258N953J8792J5676K0766k0264l5262j0524L853J0483Q081L038
$$ -28902 -37353 -39611 -33658 -14866 810 21576 1312 -33950 -44474 -40621 -30138 -22057 -19019
15867a9019K3731J1011J7601J6849K5555k6361l8649J8589K418j4188J6226N206
$$ -19019 4712 15723 33324 50173 75728 49367 10718 29307 31725 17537 33763 38969
15855C8969m907l0377k5570R404j1339L6739L0781J7577k9828m044K1057l255
$$ 38969 34062 3685 -21885 -12481 -23820 12919 43700 61277 31449 27405 48462 45207
15843D5207k3217l1109j4378r268Q728P03M0110p657l464p296R113M0510N708
$$ 45207 21990 -9119 -23497 -32765 -24037 -23334 16776 9119 5655 -1641 7472 47982 53690
15830E3690m341j3717J0918n063j3636L153n936l536k3288m822j8018k5249J4658
$$ 53690 49349 35632 46550 41487 27851 31004 25068 21532 -1756 -6578 -24596 -49845 -35187
15817c5187M26o771k117J7406P568P68Q849J6356J2770j1258l089j7495k2573
$$ -35187 -34761 -41532 -43649 -26243 -18675 -17907 -9058 7298 20068 8810 5721 -11774 -34347
15804c4347L2072K3754J4874j4294k5374O087J424K315n499J5454N721k4182q312
$$ -34347 -2275 21479 36353 22059 -3315 2772 4196 6511 1012 16466 22187 -1995 -10307
15791a0307N573j1937L0023O857k7062K8772J2235L367J1486j9616n236k0765
$$ -10307 -4734 -16671 13352 20209 -6853 21919 34154 37521 49007 29391 24155 3390
15779C390l8449K1287N679k9869k3074K3080K6331n87k705k286O479P571j2857
$$ 3390 -35059 -13772 -8093 -37962 -61036 -37956 -11625 -12212 -14917 -17203 -10724 -3153 -16010
15766a6010J1235L835n070K3282N213o268j1402k125k7986J1777R422J2828l5881
$$ -16010 -4775 -940 -6010 17272 22485 16217 4815 2690 -25296 -13519 -4097 8731 -27150
15753b7150j6581k075J6040K1835r560J1771O386Q619j5154J9K4445K3207j4488
$$ -27150 -43731 -45806 -29766 -7931 -17491 -5720 666 9285 -5869 -5850 18595 41802 27314
15740B7314k6540k7539J698K4335J4791K866J5244j2075K0002j2983n7M143j6573
$$ 27314 774 -26765 -25067 -732 14059 16925 32169 20094 40096 27113 27056 31199 14626
15727A4626k310L4357L913j688r536j4409j5270J0967J8332j2952k1419O177o51
$$ 14626 12316 46673 50586 48898 39362 24953 9683 20650 38982 26030 4611 10788 10137
15714A0137r752O448N932l3613J6036M874K3304J0159Q893k2894j3097N90k1925
$$ 10137 385 6833 12765 -20848 -4812 62 23366 33525 42418 19524 6427 7017 -14908
15701a4908L723l0528r441J9202n818J4674J2798j6491K122l428r862L0350J2014
$$ -14908 -11185 -41713 -51154 -31952 -37770 -23096 -10298 -26789 -24667 -28095 -37957 -7607 4407
15688D407J2567k1384k8820K310J1404l173L801q656n469j3145m411K5380O844
$$ 4407 16974 -4410 -33230 -30920 -19516 -22689 -18888 -27544 -33013 -46158 -50569 -25189 -18345
15675a8345J7716K8974q93j2261r917j3115L340R90N741J8980K3059J1939j7091
$$ -18345 -629 28345 27452 15191 5274 -7841 -4501 -3511 2230 21210 44269 56208 39117
15662C9117j7954J3585n2091q38P123k7394J251J5119J0395R875L323N614K9634
$$ 39117 21163 34748 -17343 -18181 -11058 -38452 -37201 -22082 -11687 -1812 1511 7125 36759
15649C6759M2708k154k8651j3624j244O412j6586j4968r923N993j690j8651n280
$$ 36759 79467 77313 48662 35038 33794 40206 23620 8652 -1271 4722 3032 -15619 -20899
15636b0899R426K9601N323j0279l486R326R918R200K170q877m258K3785n775k4371
$$ -20899 -11473 18128 23451 13172 9686 19012 28930 38130 40300 31423 27165 50950 45175 20804
15622B0804m0437o858N692O219K201L9989J4330l047j1556K0556k5530j9751l0057
$$ 20804 -19633 -26491 -20799 -14580 -12379 27610 41940 38893 27337 47893 22363 2612 -27445
15609b7445J0999K1221K4678J2315r054n093r352j3389l3822M98K701j7034k783
$$ -27445 -16446 4775 29453 41768 32714 27621 18269 4880 -28942 -28444 -25743 -42777 -45560
15596d5560K3099M2757K3720P916k183m3723p142M1653Q308q479R459P453j5676
$$ -45560 -22461 20296 44016 51932 49749 6026 -1116 40537 48845 40366 49825 57278 41602
15583D1602j1564j0206M75L863J5975q630j5349J2014n989M622k384P67k1673
$$ 41602 30038 19832 20307 24170 40145 31515 16166 28180 22191 26813 24429 25196 3523
15570C523k5372K6836k7572j6897K7554J6892Q385j6421k9586o074K2801J8516
$$ 3523 -21849 4987 -22585 -39482 -11928 4964 13349 -3072 -32658 -38732 -15931 2585
15558B585J2187l4954L202K846M502L6429p410j2920p073j5965o805l7882O069
$$ 2585 14772 -20182 -16980 -14134 -9632 26797 19387 6467 -606 -16571 -23376 -61258 -55189
15545e5189M0377r94l5387K7640M7437J6073k6189l452N586Q930m2738P358k930
$$ -55189 -14812 -15806 -51193 -23553 23884 39957 13768 10316 15902 24832 -17906 -10548 -13478
15532a3478r589J1234K9898M0880j0466l6828r466O150j1164J1764K4463r678
$$ -13478 -23067 -11833 18065 58945 48479 11651 2185 8335 -2829 8935 33398 23720
15520B3720r652j7947O054J4893J7382L244O900j7641n072p32L398J8987q990
$$ 23720 14068 -3879 2175 17068 34450 37694 44594 26953 21881 21149 24547 43534 34544
15507C4544k1279j8442j9866R047J5956J7207J5431O49n903o119o729L0046l878
$$ 34544 13265 -5177 -25043 -15996 -40 17167 32598 33247 27344 21225 14496 44542 40664
15494D0664l1835r400J5511M552o102j7004k1441m530P049o279L2783K2337l424
$$ 40664 8829 -571 14940 19492 13390 -3614 -25055 -29585 -22536 -28815 3968 26305 22881
15481B2881j0209j8027J2026K2821K7119j5692l256j5125j8163J3902j1559j2228
$$ 22881 12672 -5355 6671 29492 56611 40919 37663 22538 4375 18277 6718 -5510
15469e510j0943k1679K3750J9962P555k6680K594J1781K6966P580j1988j454J2093
$$ -5510 -16453 -38132 -14382 5580 13135 -13545 -10951 830 27796 35376 23388 21934 34027
15456C4027l2879j8141K606J9125K4526o351J1309L029k8810k0847j5885q765
$$ 34027 1148 -16993 -14387 4738 29264 22913 34222 37251 8441 -12406 -28291 -37056
15444c7056N218J5221L143K9993j415k6212m313J6513j0906j16K9326j6062r187
$$ -37056 -31838 -16617 -13474 16519 15104 -11108 -15421 1092 -9814 -9930 19396 3334 -5853
15431e853Q314L2375L7004r123k6093k8433j5282L1692R563k3065k684k5733k0011
$$ -5853 2461 34836 71840 62717 36624 8191 -7091 24601 34164 11099 8415 -17318 -37329
15418c7329K1308J071k544j4137J853J8188O765M539j6337J8547J3254l0931j2520
$$ -37329 -16021 -14950 -17494 -31631 -29778 -11590 -4825 -286 -16623 1924 15178 -15753 -28273
15405b8273K376p97l233J920K835J6595M0218k325N906q612l0640l534J4431R139
$$ -28273 -25897 -26694 -29927 -28007 -25172 -8577 31641 29316 35222 26610 -4030 -7564 6867 16006
15391A6006k6336P124k3014j4393m112K162O773K7512K229N012o77J8590M702
$$ 16006 -10330 -3206 -26220 -40613 -44725 -42563 -35790 -8278 -6049 -1037 -1714 16876 21578
15378B1578j3457n47j2156k3129o726K096K2434K2315j4155j5852L9566L8292
$$ 21578 8121 7574 -4582 -27711 -34437 -32341 -9907 12408 -1747 -17599 21967 60259
15366F0259l1035k1956J2255L237n045J94J1005J5200j5592k4332j3040r579j6965
$$ 60259 29224 7268 19523 22760 17715 17909 28914 44114 28522 4190 -8850 -18429 -35394
15353c5394k5933J1538L5274N338K4418K3487j0667n073j8152r133k3059j4932
$$ -35394 -61327 -49789 -14515 -9177 15241 38728 28061 22988 4836 -4297 -27356 -42288
15341d2288L0310N200R551J3518K528j2465N370K061r361l3027l4691k4234L3204
$$ -42288 -11978 -6778 2773 16291 18819 6354 11724 13785 4424 -28603 -63294 -87528 -54324
15328e4324M6807J8379k7293l2751o264M166L9031L0474k4730k5547N362P184
$$ -54324 -7517 10862 -16431 -49182 -55446 -51280 -12249 18225 -6505 -32052 -26690 -19506
15316a9506m163K7908l430q421J4691K4749K3146n771J2251j3290m4130o768O524
$$ -19506 -23669 4239 809 -7612 7079 31828 54974 49203 61454 48164 4034 -2734 3790
15303C790K5199J3022J7679J718q705m8385j255J2937k1030j378K446N478n939
$$ 3790 28989 42011 59690 61408 52703 4318 3063 16000 -5030 -6408 -3962 1516 -4423
15290d423j8674k5978Q252J5062N04L104j4404J715M241k073J9937J2126R746
$$ -4423 -23097 -49075 -40823 -25761 -25257 -22153 -36557 -34842 -30601 -32674 -12737 -611 9135
15277I135K4509L1277J9129k1201j4735j5194q901n774j9688J1483J6032r342
$$ 9135 33644 64921 84050 62849 48114 32920 24019 18245 -1443 10040 26072 16730
15265A6730j4172k7384m928K4204M827J4752J2868j5607j6414k259j6604k8841
$$ 16730 2558 -24826 -29754 -5550 -723 14029 26897 11290 -5124 -7383 -23987 -52828
15253e2828J8149J4057j372N718m306q742l505j248K3273o963k0036Q996J4740
$$ -52828 -34679 -20622 -21994 -16276 -20582 -29324 -32829 -34077 -10804 -17767 -37803 -28807 -14067
15240a4067J113k1164j3674K436N4143K8818J1844L039J795l5248j5665N656P912
$$ -14067 -12954 -34118 -47792 -45356 8787 37605 49449 52488 54283 19035 3370 9026 16938
15227A6938o972Q276K6275l8521l6923k7879j0616J999K8786J1111K6498J5373
$$ 16938 9966 18242 44517 5996 -30927 -58806 -69422 -67423 -38637 -27526 -1028 14345
15215A4345k6597k0317k7L7256R856l7171l990K2263j6519K4639N9j1172l4441
$$ 14345 -12252 -32569 -32596 4660 14516 -22655 -26645 -4382 -20901 3738 3797 -7375 -41816
15202d1816j0613J6872j5303K0576K9153J1208K206J6409K1858o134m1600l0288
$$ -41816 -52429 -35557 -50860 -30284 -1131 10077 12283 28692 50550 44416 2816 -27472
15190b7472J3302K807j0044P703j8617K7253J2447l436j7534j8458J034K0882
$$ -27472 -14170 -11363 -21407 -13704 -32321 -5068 7379 3943 -13591 -32049 -31015 -10133
15178a0133K9235L3364K2280l5127l9446m8262j4858J4396K6064o083J0177N310
$$ -10133 19102 52466 74746 39619 173 -48089 -62947 -48551 -22487 -28570 -18393 -13083
15166a3083O523J3595o990K31k3154p168J6074n552j2148j707Q686K022R775J3716
$$ -13083 -6560 7035 45 276 -22878 -30046 -13972 -19524 -31672 -33379 -24693 -22671 -12896 820
15152H20K2626j9327n813j4604l754K8274J3216J4196J2412J6873l3132n6747
$$ 820 23446 4119 -1694 -16298 -20052 8222 21438 35634 48046 64919 31787 -24960
15140b4960k1517K9494K5917L883n940k1707j148K0302j9913k5707J997K0439
$$ -24960 -46477 -16983 8934 12817 6877 -14830 -15978 4324 -15589 -41296 -39299 -18860
15128a8860K2597R289K1941j8349M660L255O233J3101j588l9830k2206Q382J2931
$$ -18860 3737 13026 34967 16618 21278 24533 30766 43867 42279 2449 -19757 -11375 1556
15115A556l6775q540R05P750J1034J0389K7507j6663j1272j1700l4072J1478J8730
$$ 1556 -35219 -43759 -42854 -35104 -24070 -13681 13826 -2837 -14109 -25809 -59881 -48403 -29673
15102b9673K949N815k5746j5972j7889K861J9587L5643J244k7346J2084j604M372
$$ -29673 -26724 -20909 -46655 -62627 -80516 -77655 -58068 -22425 -21181 -48527 -36443 -38047 -33675
15089c3675R940j2137j9109p874L0996K0035J1280J0249K078k1887q007K8315
$$ -33675 -23735 -35872 -54981 -62855 -31859 -11824 -544 9705 11783 -10104 -18111 10204
15077A0204p601j3400J1991K618l2035J687k7644O715K4579P213j9385N30J7064
$$ 10204 2603 -10797 1194 3812 -28223 -26536 -54180 -47465 -22886 -15673 -35058 -34528 -17464
15064a7464J4547K527m731k4686k5530P987J4985j6415O05K4891J2482O407j593
$$ -17464 -2917 -390 -5121 -29807 -55337 -47350 -32365 -48780 -48175 -23284 -10802 -4395 -5988
15051e988n173n802J8015j0968L242n672j5341j6630j0060K2466K3377L7612o221
$$ -5988 -11161 -16963 1052 -9916 -6674 -12346 -27687 -44317 -54377 -31911 -8534 29078 22857
15038B2857n0291j9753K824R713r30N121L1238L0555L7269k1850l6393j6357J159
$$ 22857 -27434 -47187 -44363 -34650 -35580 -30459 779 31334 68603 46753 10360 -5997 -4838
15025d838K7637j3828k0144M697j823j3947o378r153L8547J8880j6540J2490l1621
$$ -4838 22799 8971 -11173 -6476 -8299 -22246 -28624 -37777 770 19650 3110 15600 -16021
15012a6021j0637m760o422j1661M192j8078L314L0412K7407M0234L529k7580J679
$$ -16021 -26658 -31418 -37840 -49501 -45309 -63387 -60073 -29661 -2254 37980 41509 13929 15608
14999A5608r479L197j5572k804r163J7495l867K000p080j3751N541m395r42J9498
$$ 15608 6129 9326 -6246 -9050 -18213 -718 -4585 -2585 -9665 -23416 -17875 -22270 -23212 -3714
14985c714K4182j679K267K978k1329J503l34K0416K7534r437k0243j0692q828
$$ -3714 20468 18789 21056 24034 2705 4208 3874 24290 51824 42387 22144 11452 2624
14972B624L879j0730j1798N358L9423j298K4519K603k5534k0175P308m176j2209
$$ 2624 6503 -4227 -16025 -10667 28756 27458 51977 54580 29046 8871 16179 12003 -206
14959b06J1008K269j9029L48k3823R951L7545K298j8283O668J647n811j0281M295
$$ -206 10802 13071 -5958 -5610 -29433 -19482 18063 20361 2078 8746 10393 4582 -5699 -1404
14945a404j5994n219J3o161p150j9464k0846R156L3400K4430j6019k8896J9998
$$ -1404 -17398 -22617 -22604 -28765 -35915 -55379 -76225 -67069 -33669 -9239 -25258 -54154 -34156
14932c4156m86j2514l0489k740K8573J9842N6656K9632Q843j4090k5839j7113
$$ -34156 -34642 -47156 -77645 -80385 -51812 -31970 24686 54318 63161 49071 23232 6119
14920F119j8046l891R273L0497r539m2032j6216L0564l224j3354O519J8907K1206
$$ 6119 -11927 -15818 -6545 23952 14413 -27619 -43835 -13271 -16495 -29849 -23330 -4423 16783
14907A6783k7566l2089J2721K6525k6339o686K7948K4978K8034j3283n5491J1748
$$ 16783 -10783 -42872 -30151 -3626 -29965 -36651 -8703 16275 44309 31026 -24465 -12717
14895a2717L4104j262p654j5088p12m312j6094L16k0867N166J3770K7552K1852
$$ -12717 21387 20125 12471 -2617 -3329 -7641 -23735 -23419 -44286 -39120 -25350 2202 24054
14882B4054j9048k7178O799J8239L0139m879J7588K815k687k4514O874j9295j9221
$$ 24054 5006 -22172 -15373 2866 33005 28126 45714 48529 45842 21328 28202 8907 -10314
14869a0314k6343q523J9033l748R388M798K6086J4853K3174j1476l9171j9043
$$ -10314 -36657 -45180 -26147 -29895 -20507 -15709 10377 25230 48404 36928 -2243 -21286
14857b1286n208J919J6349r089r505K6811k287l5799l440j2359N894L9961K1861
$$ -21286 -26494 -24575 -8226 -17315 -26820 -9 -2296 -38095 -41535 -53894 -48000 -8039 13822
14844A3822j4535k6937Q671N431l977o390P202o004k8966q578K3711J0570J8175
$$ 13822 -713 -27650 -18979 -13548 -17525 -23915 -16713 -22717 -51683 -60261 -36550 -25980 -7805
14831g805J2925k1617k3504o827J1066J9986k819l118k6908k6345J3877K1496
$$ -7805 5120 -16497 -40001 -46828 -35762 -15776 -18595 -21713 -48621 -74966 -61089 -39593
14819c9593J2359J5958m223Q346K93l369K6716L0299n852j3123K6771p519k0431
$$ -39593 -27234 -11276 -15499 -7153 -6860 -10229 16487 46786 40934 27811 54582 47063 26632
14806B6632j3260L480J600Q648r209j9460j7592J4179M2400J5402l7016n880L7592
$$ 26632 13372 16852 18452 27100 17891 -1569 -19161 -4982 37418 52820 15804 9924 47516
14793D7516o583j195m677j0225J58l581j4964j5708o158o207J7077J5466j1189
$$ 47516 40933 39738 35061 24836 24994 21413 6449 -9259 -15417 -21624 -4547 10919 -270
14780b70o689N692j6808O875J1756p762l4840o120K8027J3029k1878j9801J3380
$$ -270 -6959 -1267 -18075 -11200 556 -7206 -42046 -48166 -20139 -7110 -28988 -48789 -35409
14767c5409j4041J8167J6931J0935K1559J1343j1894j2401r484j093O582q04m642
$$ -35409 -49450 -31283 -14352 -3417 18142 29485 17591 5190 -4294 -5387 1195 391 -4251
14754d251j854J3641J8492l0889J859r315J0205L5037j5705j9287o379k723K6083
$$ -4251 -6105 7536 26028 -4861 -3002 -12317 -2112 32925 17220 -2067 -8446 -11169 14914
14741A4914L935m357J5871K5683R470k3101j7743j6551j6596O141K2588Q125Q629
$$ 14914 18849 14492 30363 56046 65516 42415 24672 8121 -8475 -2334 20254 28379 37008
14728C7008O773R185k1423j6994k1651L675L3333K2110k2388k0587j852N097n952
$$ 37008 43781 52966 31543 14549 -7102 -3427 29906 52016 29628 9041 7189 12286 6334
14715F334R941m257P754j4050J817J2643j922k8749L059K3753K502j6445l1224
$$ 6334 16275 12018 19772 5722 7539 20182 18260 -10489 -7430 16323 18825 2380 -28844
14702b8844r252r000M1048P383j1420J2038K179j1750o335l8357K6726J9904J2115
$$ -28844 -38096 -47096 -6048 1335 -10085 1953 4132 -7618 -13953 -52310 -25584 -5680 6435
14689F435j0885p138l1240k3844j147M519J042J0242L3463J7405j656j2994O854
$$ 6435 -4450 -11588 -42828 -66672 -67819 -63300 -62258 -52016 -18553 -1148 -2804 -15798 -8944
14676h944j319K4781k061k546k2457n263J0674L0139J1155m33k8845J792p600
$$ -8944 -10263 14518 12457 9911 -12546 -17809 -7135 23004 34159 33726 4881 6673 -927
14663i27j519K0095M852k5770j2932p547J7311L069N509J1477j1535j843J8642
$$ -927 -2446 17649 22501 -3269 -16201 -23748 -6437 -3368 2141 13618 2083 240 18882
14650A8882r956l5659l3065J3141J5396j2373J5323J7038J8441J0988N389k2430
$$ 18882 8926 -26733 -59798 -46657 -31261 -43634 -28311 -11273 7168 18156 23545 1115
14638A115j2203J1453R173k6309j5629M333k3940J6693r077r640J625K9651M4656
$$ 1115 -11088 365 9538 -16771 -32400 -28067 -52007 -35314 -44391 -54031 -52406 -22755 21901
14625B1901M582k7542k0201j2052q362m262R607J9238l88j39J0800j54r656j4701
$$ 21901 26483 -1059 -21260 -33312 -41674 -45936 -36329 -17091 -17479 -17618 -6818 -6972 -16628 -31329
14611c1329m49J3060o59J0073q7R419k4356K477n789J1432L5218o238j3174J3403
$$ -31329 -31778 -18718 -19377 -9304 -9391 28 -24328 -21851 -27640 -16208 19010 12772 -402 13001
14597A3001k166m3129L576J9992p454M958N1665O470n944k7367m2262J5682R991
$$ 13001 10835 -32294 -28718 -8726 -16180 -11222 40443 46913 40969 13602 -28660 -12978 -2987
14584b987L653k7604j3826P154J7211K7763K8137j850k3125j0793p559k4860o761
$$ -2987 666 -26938 -40764 -33610 -16399 11364 39501 37651 14526 3733 -3826 -28686 -35447
14571c5447J0875J2272J1055q824j9728L730P411j3244k2448n674J7928K8828
$$ -35447 -24572 -12300 -1245 -10069 -29797 -26067 -18656 -31900 -54348 -60022 -42094 -13266
14559a3266P230M0094p615J5979m0862m4342J4015L0917L085K782l4307O943j5915
$$ -13266 -6036 34058 26443 42422 1560 -42782 -28767 2150 5235 8017 -26290 -19347 -35262
14546c5262j7386k066O668N870R498J4038l93Q226J613j9847k635j2825r37l4057
$$ -35262 -52648 -54714 -48046 -42176 -32678 -18640 -19033 -10807 -9194 -29041 -31676 -44501 -45438 -79495
14532g9495j37J2567j352J5241O186K1271l216N01j4124K396K3778m310O409N511
$$ -79495 -79632 -67065 -68417 -53176 -46990 -25719 -28935 -28434 -42558 -40162 -16384 -20694 -14285 -8774
14518h774k260M2j8985O652J3897J4629j7113j3989j089O169J3308M982j5204
$$ -8774 -11034 -10992 -29977 -23325 -9428 5201 -11912 -25901 -26990 -20821 -7513 -2531 -17735
14505a7735r21j7791N623K4454k555K551K0838K1224J6970m8434j1634l037l594
$$ -17735 -18656 -36447 -30824 -6370 -8925 -6374 14464 35688 52658 4224 -7410 -10447 -14041
14492a4041j493P176k5929P350K652J9665K3415J1052Q67K6253o306j0092J4529
$$ -14041 -15534 -8358 -34287 -26937 -24285 -4620 18795 29847 30714 56967 50661 40569 55098
14479E5098j9954k6562k424K6143P120J93k6541p14N545K1762q19P023j7923m1292
$$ 55098 35144 8582 6158 32301 39421 39614 13073 12359 17904 39666 38847 45870 27947 -13345
14465a3345o0216m892K3874P520P238p674J8867J4999m1043J2916K848j3364L805
$$ -13345 -73561 -78453 -54579 -47059 -39821 -47495 -28628 -13629 -54672 -41756 -38908 -52272 -48467
14452d8467m702j269J835o917J2538j5115K1868L990M19j2225L6089J8339M8593
$$ -48467 -53169 -54438 -52603 -59520 -46982 -62097 -40229 -36239 -35820 -48045 -11956 6383 54976
14439E4976K6503k7548m0754k2405m663O0l539k7240j1832k994L160l601M1043
$$ 54976 81479 53931 13177 -9228 -13891 -13831 -17370 -44610 -56442 -59436 -56276 -59877 -18834
14426a8834K3111J4980Q996n859j4375r251q40n322J3849k624J6695J5952j5579
$$ -18834 4277 19257 28253 22394 8019 -1232 -2072 -7394 6455 3831 20526 36478 20899
14413B0899k5869J0920l1401k3841J6389K0592l095K1073r407P359N482J3744
$$ 20899 -4970 5950 -25451 -49292 -32903 -12311 -15406 5667 -3740 3619 9101 22845
14401B2845R525r729j1970j3726l3752j8037J595J6713J5285j1872j763M0052
$$ 22845 32370 22641 10671 -3055 -36807 -54844 -53249 -36536 -21251 -33123 -34886 5166
14389E166K240j8970J5747o849J2086k6307j5890J2195K1159K0079R53l6385P226
$$ 5166 7406 -11564 4183 -2666 9420 -16887 -32777 -20582 577 20656 21609 -14776 -7550
14376g550M147j271j4007P747O666j7922J4623J9996K9381K1613k3239j4604j3830
$$ -7550 -3403 -4674 -18681 -10934 -4268 -22190 -7567 12429 41810 63423 40184 25580 11750
14363A1750K6732N703l0251j2970k7640R564M3636o158l2853j0957n2183J2458
$$ 11750 38482 44185 13934 964 -26676 -17112 26524 20366 -12487 -23444 -75627 -63169
14351f3169J2856M6568J7062j7331j257l997K86J0914J9038J0296k8481M050J4506
$$ -63169 -50313 -3745 13317 -4014 -5271 -9268 -8982 1932 20970 31266 2785 6835 21341
14338B1341m1745r184O947O378K1879j0579J3063L3922l1402l2181k723k076J1273
$$ 21341 -20404 -29588 -22641 -16263 5616 -4963 8100 42022 10620 -21561 -24284 -26360 -15087
14325a5087l867J1135J7682L413k1244j0809O51m275J1143m297J6271O337J8301
$$ -15087 -18954 -7819 9863 13276 -7968 -18777 -18126 -22401 -11258 -15555 716 7053 25354
14312B5354L180Q965m1975q088j0706j2606Q904Q008L982J1578P037n311o19k0309
$$ 25354 28534 37499 -4476 -12564 -23270 -35876 -26972 -18964 -14982 -3404 3633 -1678 -2297 -22606
14298b2606j505j7746L0402J1150J1508J8997j7512n242j519n448l583j538K4622
$$ -22606 -24111 -41857 -11455 -305 11203 30200 12688 7446 5927 479 -3104 -4642 19980
14285A9980J3332k1436j7207J9204p762l0108Q370J0393L400j892J3499Q565J7146
$$ 19980 33312 11876 -5331 13873 6111 -23997 -15627 -5234 -1834 -3726 9773 18338 35484
14272C5484r207p793J4980j5675N658J7498n785M593m858j007r124j5217N866
$$ 35484 26277 18484 33464 17789 23447 40945 35160 39753 34895 33888 24764 9547 15413
14259A5413J9624P724k2076p779k4967J1675K4958l549j5805K0220j6837j6334
$$ 15413 35037 42761 20685 12906 -12061 -386 24572 21023 5218 25438 8601 -7733
14247g733J7169M418k3841n209N402J5063L742j6053k431J2379k0166k5750k0889
$$ -7733 9436 13854 -9987 -15196 -9794 5269 9011 -7042 -9473 2906 -17260 -43010 -63899
14234f3899k393K6088N7724l428k1266r276L1307L931J1719J5079k2926m1652
$$ -63899 -66292 -40204 17520 14092 -7174 -16450 14857 18788 30507 45586 22660 -18992
14222a8992j4171J7123P81l567L194K3731L5541P358K4491r124q504q985k4997
$$ -18992 -33163 -16040 -15259 -18826 -15632 8099 43640 50998 75489 66365 57861 48876 23879
14209B3879k2609J0825L0707L284j4894l6625j4O123j7872j665J3735l889j3728
$$ 23879 1270 12095 42802 46086 31192 -5433 -5447 676 -17196 -18861 -5126 -9015 -22743
14196b2743P227k962L744j0672k3732m929p534K3499K0030j0180j3395J926J5046
$$ -22743 -15516 -18478 -14734 -25406 -49138 -54067 -61601 -38102 -18072 -28252 -41647 -39721 -24675
14183b4675J3851K1604r677n629j5194J4719j0813j7652K602L6071N112q602o446
$$ -24675 -10824 10780 1103 -4526 -19720 -5001 -15814 -33466 -30864 5207 10319 1717 -4729
14170d729p192k2676j8382J7329p62N570l895J9585o492o731j4899n873L8521
$$ -4729 -11921 -34597 -52979 -35650 -36412 -30842 -34737 -15152 -21644 -28375 -43274 -49147 -10626
14157a0626J2360q23j1171p165J580J6591J3338l6090L949j6388k6790J9975K2747
$$ -10626 1734 911 -10260 -17425 -15845 746 14084 -22006 -18057 -34445 -61235 -41260 -18513
14144a8513J7397M627L49Q376k7159k0061N278J6207K5364J4323n689l9677p956
$$ -18513 -1116 3511 3860 12236 -14923 -34984 -29706 -13499 11865 26188 20499 -19178 -27134
14131b7134J9226O635j0062J180l344l5702j2202l1221M906L7009J5755N411j3005
$$ -27134 -7908 -1273 -11335 -10155 -13499 -49201 -61403 -92624 -87718 -50709 -34954 -29543 -42548
14118d2548L1699J6217L4388K6265l0694l9708J0182J4072j6709j783R3j7111
$$ -42548 -10849 5368 39756 66021 35327 -4381 5801 19873 3164 1381 1474 -15637
14106a5637O220J8198J3513L811q67m7056k2520J1788Q514K6792J3055j7082Q80
$$ -15637 -9417 8781 22294 26105 25238 -21818 -44338 -32550 -24036 2756 15811 -1271 -391
14093c91o187m668K5203p983j7662J1581K6080k742j5376M882j1766j7877l641
$$ -391 -6578 -11246 13957 5974 -11688 -107 25973 23231 7855 12737 971 -16906 -20547
14080b0547O025k395J1740O864k3335j4726k4272K549L0424M7792R004j2239L138
$$ -20547 -14522 -16917 -5177 1687 -21648 -36374 -60646 -58097 -27673 20119 29123 16884 20022
14067B0022r024O97K4265K398k244k5529m0597n91R577m642P573k316l490r733
$$ 20022 10998 11695 35960 38358 36114 10585 -30012 -30603 -21026 -25668 -18095 -20411 -23901 -33634
14053c3634l7315J9201K1875K1812O715k1763J1667L3621o407p478j6345q961
$$ -33634 -70949 -51748 -29873 -8061 -1346 -23109 -11442 22179 15772 8294 -8051 -17012
14041a7012j0866K210q710K6472K3115J3175J9579j6752k2270l6697J8619Q251
$$ -17012 -27878 -25668 -34378 -7906 15209 28384 47963 31211 8941 -27756 -9137 -886
14029h86K8845J0384j5458P149p68k6871j4286O760J5312l4139k4150K6501r550
$$ -886 27959 38343 22885 30034 29266 2395 -11891 -5131 10181 -23958 -48108 -21607 -31157
14016c1157J844q158j2712k1973K879K4815M8690j4325j7747m613L0428L0958
$$ -31157 -29313 -37471 -50183 -72156 -69277 -44462 4228 -10097 -27844 -32457 -2029 28929
14004B8929m0739k0006k2306J82J8406l182Q288J8117k0891k199J6414j0104N10
$$ 28929 -11810 -31816 -54122 -53940 -35534 -38716 -30428 -12311 -33202 -35401 -18987 -29091 -28581
13991b8581K8202M8493k9432k9368j8530K0476P025q610j8712J8207k140J8232
$$ -28581 -379 48114 18682 -10686 -29216 -8740 -1715 -10325 -29037 -10830 -12970 5262
13979E262l288k1327J81J6006J1612J216r615j7439j0485M452O62J232k16j5415
$$ 5262 1974 -19353 -19172 -3166 8446 9662 47 -17392 -27877 -23425 -22763 -21531 -21747 -37162
13965c7162j5313J3788m394K5961J4432N248o2879l535J7788J877q68L3961M5550
$$ -37162 -52475 -38687 -43081 -17120 -2688 2560 -60319 -63854 -46066 -44189 -45057 -11096 34454
13952C4454k2585m1906K2276K624j1807j4608J3899J1087k1368k3956m687K9070
$$ 34454 11869 -30037 -7761 -5137 -16944 -31552 -17653 -6566 -27934 -51890 -56577 -27507
13940b7507L5073J78K125O655Q327J7143o061J336j7998j1891j4487o344L0028
$$ -27507 7566 7744 9869 16524 24851 41994 35933 37269 19271 7380 -7107 -13451 16577
13927A6577P669l104j4301j6935m08J7015r105k2865k8957p222l776J3707L6161
$$ 16577 24246 21142 6841 -10094 -10502 6513 -2592 -25457 -54414 -61636 -65412 -51705 -15544
13914a5544O007j6412j074o374k4801n649O481r377Q843K6910J9054K4170j1450
$$ -15544 -9537 -25949 -27023 -33397 -58198 -63847 -57366 -66743 -57900 -30990 -11936 12234 784
13901G84k9149k2748L1604J7739n831r029j5972m529k646P800Q737j1918L255
$$ 784 -28365 -51113 -19509 -1770 -7601 -16630 -32602 -37131 -39777 -31977 -23240 -35158 -31903
13888c1903J9623M673J0002M7149J841m2492j7080J2560N117j0110O589R434J9243
$$ -31903 -12280 -7607 2395 49544 51385 8893 -8187 4373 9490 -620 5969 15403 34646
13875C4646r553P043o093j5972j0897j8480K286N974j2091L090O470J6893q353
$$ 34646 25093 32136 26043 10071 -826 -19306 -17020 -11046 -23137 -20047 -13577 3316 -5037
13862e037r644l2785j3213J815J1946K4137P777J1923J12K4038j3354j0926R400
$$ -5037 -14681 -47466 -60679 -58864 -46918 -22781 -15004 -3081 -2969 21069 7715 -3211 6189
13849F189l255O820J073L603k528J3251j0419J4012j2852J2826o464p688k1798
$$ 6189 2934 9754 10827 14430 11902 25153 14734 28746 15894 28720 22256 14568 -7230
13836g230o231j5254M279J6028K7296K2638l8362l8544N151N930J473j1188J3719
$$ -7230 -13461 -28715 -24436 -8408 18888 41526 3164 -35380 -30229 -24299 -22826 -34014 -20295
13823b0295J8747J9504J0472p368j71j7545K02L023j6858l8734J1379J5184j0573
$$ -20295 -1548 17956 28428 21060 20889 3344 3546 6569 -10289 -49023 -37644 -22460 -33033
13810c3033K9309j2561q387K732p575J509J8812L6918K8913j0628m7422j734J9468
$$ -33033 -3724 -16285 -24672 -21940 -29515 -28006 -9194 27724 56637 46009 -1413 -3147 16321
13797A6321J7123k7686R20J5379j4078j5470L70j5150K927M7787k926k0392K6517
$$ 16321 33444 5758 6678 22057 7979 -7491 -7121 -22271 -19344 28443 25517 5125 31642
13784C1642L987l1835q320n081J7381j1500j6462l699J5353R759J556J2775k8825
$$ 31642 35629 3794 -4526 -9607 7774 -3726 -20188 -23887 -8534 1225 2781 15556 -13269
13771a3269k5030N215K5383P010J8030Q322j8138K3142j5578Q218l5527p118j5994
$$ -13269 -38299 -33084 -7701 -691 17339 25661 7523 30665 15087 23305 -12222 -19340 -35334
13758c5334J0767o208r550j967J1144K5986Q465K5085L4866j2341l3126K070O497
$$ -35334 -24567 -30775 -40325 -42292 -31148 -5162 3303 28388 63254 50913 17787 19857 26354
13745B6354k8418j0521P994o41j1289J4545L2700J6178j0832J5623J1087r277
$$ 26354 -2064 -12585 -4591 -5232 -16521 -1976 30724 46902 36070 51693 62780 53503
13733E3503q079P352j1354p093j9372k3230l7434p281J5746M1048J7197j7848
$$ 53503 45424 52776 41422 34329 14957 -8273 -45707 -52988 -37242 3806 21003 3155
13721C155n0374M171J7485m333K2940J8125k5703M432J9836k8626R558M3698l69
$$ 3155 -47219 -43048 -25563 -29896 -6956 11169 -14534 -10102 9734 -18892 -9334 34364 33995
13708C3995j5796k836k1842l5307j6844J1511L1488K7128r735J7694J6033j4080
$$ 33995 18199 15363 -6479 -41786 -58630 -47119 -15631 11497 1762 19456 35489 21409
13696B1409K5856K5396r81k8484k9647N724Q361r418n799L6k7309K1644O446J408
$$ 21409 47265 72661 71680 43196 13549 19273 27634 18216 12417 12453 -14856 6788 13234 14642
13682A4642J518l0699J3460J1271j0908n880k683q914J6395J4118L201n180o137
$$ 14642 16160 -14539 -1079 10192 -716 -6596 -9279 -18193 -1798 12320 15521 10341 4204
13669D204j4104j261J8214J1266J9144K3350j7127q109N136j7460j8604M052j4633
$$ 4204 -9900 -11161 7053 18319 37463 60813 43686 35577 40713 23253 4649 8701 -5932
13656e932N230p624p597K7880m522p448l064j0981r549j4696J2007K1771J3311
$$ -5932 -702 -8326 -15923 11957 7435 -13 -3077 -14058 -23607 -38303 -26296 -4525 8786
13643H786M399k8530J7562j0541j4950o165O89o866J927q918R963o932J0138j68
$$ 8786 13185 -15345 2217 -8324 -23274 -29439 -28750 -35616 -33689 -42607 -32644 -39576 -29438 -29606
13629b9606K283j5639J1968j179K6894J7945K303q767M952j0698l6653L217K3153
$$ -29606 -27323 -42962 -30994 -32173 -5279 12666 14969 6202 11154 456 -36197 -32980 -9827
13616i827K6243j4809k3654j4380k1592J137P137J735L2534L0239p722j1896j9747
$$ -9827 16416 1607 -22047 -36427 -58019 -56882 -49745 -48010 -15476 14763 7041 -4855 -24602
13603b4602K017J9364L2623o157M865O959k0342n633M793l9061j1140l549m792
$$ -24602 -22585 -3221 29402 23245 28110 35069 14727 9094 13887 -25174 -36314 -39863 -44655
13590d4655J0903J0106p510p860j804L6349J605p697j9060O725J1415J8594k534
$$ -44655 -33752 -23646 -31156 -39016 -40820 -4471 -2866 -10563 -29623 -22898 -11483 7111 4577
13577D577p709m480q155n59K2532j5012j6829k0380J3492J7578l833l7211k1598
$$ 4577 -3132 -7612 -15767 -16326 6206 -8806 -25635 -46015 -32523 -14945 -18778 -55989 -77587
13564g7587j523K2181J3897J3271K5535L7293M3564p876j7316KJ1705k1670l9050
$$ -77587 -79110 -56929 -43032 -29761 -4226 33067 76631 68755 51439 51441 63146 41476 2426
13551B426j9097L7208j8568m3153Q771O784J9519J9810j8631j4944n487L5176
$$ 2426 -16671 20537 1969 -41184 -32413 -25629 -6110 13700 -4931 -19875 -25362 9814
13539I814K1889j9117j2096J8164j2362o390J42q103k0390K2669q473n405K124
$$ 9814 31703 12586 490 18654 6292 -98 44 -8059 -28449 -5780 -14253 -19658 -17534
13526a7534M801r093j5435o090r36K3005J5597J7097k0647j1570J3252j8600j5344
$$ -17534 -12733 -21826 -37261 -43351 -44287 -21282 -5685 11412 -9235 -20805 -7553 -26153 -41497
13513d1497J9329J5600K1385j3190j2429k7785J2043J8073M1148k238Q424J1529
$$ -41497 -22168 -6568 14817 1627 -10802 -38587 -26544 -8471 32677 30439 38863 50392
13501E0392J743m6029L265o880k7984J0806L2237M0730j3149l0570Q172r524l4664
$$ 50392 52135 6106 9371 2491 -25493 -14687 17550 58280 45131 14561 22733 13209 -21455
13488b1455n6J0460m1420l3161L1898K3650K1097k8585j8312J5770N2319K4821
$$ -21455 -21511 -11051 -52471 -85632 -53734 -30084 -8987 -37572 -55884 -40114 12205 37026
13476C7026O134j0619J0375p45m6781k4936N1754M680k8871r232R279p081j6406
$$ 37026 43160 32541 42916 42171 -4610 -29546 22208 26888 -1983 -11215 -1936 -9017 -25423
13463b5423M2932j62o179j3188k3185l5756L6836K7380p488j0079j6626j7537
$$ -25423 17509 17347 11168 -2020 -25205 -60961 -24125 3255 -4233 -14312 -30938 -48475
13451d8475J4200K9275M017J5655K0494j4855J1607m437m0275o447R79k0113j6383
$$ -48475 -34275 -5000 -983 14672 35166 20311 31918 27481 -12794 -19241 -18262 -38375 -54758
13438e4758K2061K1028J9564J3851j2554j1260n528M413J7332J1409j0836m0387
$$ -54758 -32697 -11669 7895 21746 9192 -2068 -7596 -3183 14149 25558 14722 -25665
13426b5665P205L8575M780n794j1062j1932J3194j2161J1115J4844r046J295q906
$$ -25665 -18460 20115 24895 19101 8039 -3893 9301 -2860 8255 23099 14053 15348 6442
13413F442k5059N453M8859R849K554J9213j0134j1842k3835n3458q49K0089J5262
$$ 6442 -18617 -13164 35695 45544 48098 67311 57177 45335 21500 -31958 -32807 -12718 2544
13400B544j6216p401N065J0034L930L895M951M7066o2M762n870K129K5050n280
$$ 2544 -13672 -21073 -16008 -5974 -2044 1851 6802 53868 53806 58568 52698 54827 79877 74597
13386G4597k1768k066L737k001J0112M339l444J1327J5109k1648l0706p838k4383
$$ 74597 52829 50763 54500 52499 62611 66950 63506 74833 89942 68294 37588 29750 5367
13373E367P411J1327K28K3022J4629j607p684O611J5601k8823k0574K2604O126
$$ 5367 12778 24105 24333 47355 61984 60377 52693 59304 74905 46082 25508 48112 54238
13360E4238j3306J3699q533l4419P271K0287j1365j3936j5953L103J3830j315
$$ 54238 40932 54631 46098 11679 18950 39237 27872 13936 -2017 1086 14916 13601
13348A3601K4266K3085q776k5396k4624N126j4232P621Q01K4014q935p304m679
$$ 13601 37867 60952 52176 26780 2156 7282 -6950 671 1472 25486 16551 9247 4568
13335D568j1074K030K3238J0069l466M845j2113l6534k5529O118O714j4809p63
$$ 4568 -6506 -4476 18762 28831 25365 30210 18097 -18437 -43966 -37848 -31134 -45943 -46706
13322d6706P051p240L5614M1741p430m067k365l911J6079l963m1143q75K7489
$$ -46706 -39655 -46895 -11281 30460 23030 18963 16598 12687 28766 24803 -16340 -17215 10274
13309A0274N187P432J4797k5066J5778J2308j0638k9305l8851j7444p978L3066
$$ 10274 15461 22893 37690 12624 28402 40710 30072 767 -38084 -55528 -63506 -30440
13297c0440L316K3426L3326R789N936R628l3028k0490o596Q453j4556J2964J6507
$$ -30440 -27124 -3698 29628 39417 45353 54981 21953 1463 -5133 3320 -11236 1728 18235
13284A8235J3569O392r384n3993J3633L5126Q227j611j5626l729K2920O193O150
$$ 18235 31804 38196 28812 -25181 -11548 23578 31805 30194 14568 10839 33759 39952 46102
13271D6102L513O559p394J9060J5587J9099q785n240L392m143j5202l596j5293
$$ 46102 49615 56174 48780 67840 83427 102526 93741 88501 91893 87750 72548 68952 53659
13258E3659j2492j4256j5063J0773j4812j2387o885L524M925R217K6440K5874
$$ 53659 41167 26911 11848 22621 7809 -4578 -11463 -7939 -3014 6203 32643 58517
13246E8517L1885j5540k5708n559j3262l9780P467K0043J7683j966q693J3986
$$ 58517 90402 74862 49154 43595 30333 -9447 -1980 18063 35746 33780 25087 39073
13234C9073L3013k5471k4959Q380M768j4685J1675J7197K0057j4858j3555k2496
$$ 39073 72086 46615 21656 30036 34804 20119 31794 48991 69048 54190 40635 18139
13222A8139J0684Q825O773j2680k1737l418J0354L356o06J9521K8686J1216l0325
$$ 18139 28823 37648 44421 31741 10004 6586 16940 20296 19690 39211 67897 79113 48788
13209D8788O595R744L7583K693l415j9853r498K422j1434k1021J2502J4865j2368
$$ 48788 55383 65127 102710 105403 101988 82135 72637 75059 63625 42604 55106 69971 57603
13196E7603M657R874j070Q99J1870M805O945k5252k9794J1303P974j1750J1966
$$ 57603 62260 72134 71064 71963 83833 88638 95583 70331 40537 51840 59814 48064 60030
13183F0030k396l0400j9079K0449L5338K0834P057k1470j1869m1044J1473J9959
$$ 60030 57634 27234 8155 28604 63942 84776 91833 70363 58494 17450 28923 48882
13171D8882J5150K1578n74L3342L4460l949K0375N0919L8349N249j9551l0204
$$ 48882 64032 85610 85036 118378 152838 148889 169264 220183 258532 263781 244230 214026
13159B14026l2400l6402k0224l3865m7864l3289m572L1852K4508K6127j789o690
$$ 214026 181626 145224 125000 91135 43271 9982 5410 37262 61770 87897 86108 79418
13147G9418J8725m96m0510j3617M2304L8104l851L4768K4696m7284n0919j945
$$ 79418 98143 97647 57137 43520 85824 123928 120077 154845 179541 132257 81338 79393
13135G9393J2396j2798N646K0439J9406P20K7180O0619Q2150Q3325J35678K23666
$$ 79393 91789 78991 84637 105076 124482 125202 152382 213001 295151 378476 514154 737820
13123G37820L13384L37824K96263K39427K74370K91109K13492n2494l73426n20338
$$ 737820 1051204 1389028 1685291 1924718 2199088 2490197 2703689 2651195 2277769 1757431
13113A757431m97294l48516k10248j13408j08083p2401k0731o246m2916K603N835
$$ 1757431 1260137 911621 701373 587965 479882 407481 386750 380504 337588 340191 346026
13102C46026k9593n9213j3131j8118k532n01k161k2105j1219N020L753j3137J7332
$$ 346026 316433 257220 244089 225971 223439 222938 220777 198672 187453 192473 196226 183089 200421
13089B00421K4343k1335l1985j3696j1673j3808P006M2587o804k9683N698J6127
$$ 200421 224764 203429 171444 157748 146075 132267 139273 181860 175056 145373 151071 167198
13077A67198L5492M791l8021j2798K039K4376p675r792l2785j6622j7908R703
$$ 167198 202690 207481 169460 156662 158701 183077 175402 165610 132825 116203 98295 107998
13065A07998L425J0032j1089k821j6595j3168j336j7420j0841K7511J1490K8045
$$ 107998 111423 121455 110366 107545 90950 77782 76446 59026 48185 75696 87186 115231
13053A15231L237k6779l088J8003k7361J8718J2308K735J4744m0259k3651j3464
$$ 115231 118468 91689 88601 106604 79243 97961 110269 113004 127748 87489 63838 50374
13041E0374M535L7956k779j2188q701n521q278L416O689n549J2344K483P050O16
$$ 50374 54909 92865 90086 77898 69197 63676 55398 58814 65503 59954 72298 74781 81831 82447
13027H2447J1821J7400q312j5003j2848j8247k8166J1137K9583J2434r406J6199
$$ 82447 94268 111668 103356 88353 75505 57258 29092 40229 69812 82246 72840 89039
13015H9039o28j2414M30j543l5315k8895r399m28K5459n931J7093J6123N697k2881
$$ 89039 88411 75997 76427 74884 39569 10674 1275 847 26306 20375 37468 53591 59288 36407
13001C6407k5614q963M484j5807k2296j9514K9394J7412K2743L332J7885J3990
$$ 36407 10793 1830 6314 -9493 -31789 -51303 -21909 -4497 18246 21578 39463 53453
12989E3453L4248L3012o683K1408J0094J4720K1585K8443j5428m8880k8253L80
$$ 53453 87701 120713 114030 135438 145532 160252 181837 210280 194852 145972 117719 118099
12977A18099J786J490K2783j9973k0734j9652K7824Q945l5234p680j2920o416
$$ 118099 119885 121375 144158 124185 103451 83799 111623 120568 85334 77654 64734 58318
12965E8318J9177L7683M6963j1225l6906j5955j0902Q539J6366L291J868L0020
$$ 58318 77495 115178 162141 150916 114010 98055 87153 95692 112058 115349 117217 147237
12953A47237L8623L7525j6631k5691k7200j8535q524j2428L277K7898K9779N3168
$$ 147237 185860 223385 206754 181063 153863 135328 126804 114376 117653 145551 175330 228498
12941B28498M7589j003j5855j6908J5265M4946J1935J5494p537k7220o864k8612
$$ 228498 276087 275084 259229 242321 257586 302532 314467 329961 322424 295204 288340 259728
12929B59728j6794J6353J4370m0093k9903j7433j5542K534L723r416J4613K5574
$$ 259728 242934 259287 273657 233564 203661 186228 170686 173220 176943 167527 182140 207714
12917B07714K0877J4630k2490m5636l553j7566k7608K957L9197K4417p395r100
$$ 207714 228591 243221 220731 175095 171542 153976 126368 129325 168522 192939 185544 176444
12905A76444J5573M3733K2366m148K174k9091l5056p770j7923l8642j0817R621
$$ 176444 192017 235750 258116 253968 256142 227051 191995 184225 166302 127660 116843 126464
12893A26464l4445O689j5983j7633k2897K2296N3555R214o296k7418m5707k5592
$$ 126464 92019 98708 82725 65092 42195 64491 118046 127260 120964 93546 47839 22247
12881B2247j6362r95J7467l5042q4367r3623r8344j11560q3244p9705r8194p9553
$$ 22247 5885 4890 22357 -12685 -97052 -190675 -289019 -400579 -483823 -563528 -661722 -741275
12869g41275o0374R0848K29787K07151J62424R2312J6539K7946L1868K2580k0642
$$ -741275 -801649 -710801 -481014 -273863 -111439 -19127 -2588 25358 57226 79806 59164
12858E9164j14K5335J9745J5678Q648J1985J8472J6613J5786k628K4550L6221
$$ 59164 59050 84385 104130 119808 128456 140441 158913 175526 191312 188684 213234 249455
12846B49455P340N30r528l9393l2222k5030K7650Q045k0903P971J8280L0157L0751
$$ 249455 256795 257325 247797 208404 176182 151152 178802 186847 165944 173915 192195 222352 253103
12833B53103Q373j3107n766P07r544n197L579J973J616J7368M5877L1643K5764
$$ 253103 261476 248369 242603 243310 233766 228569 232148 234121 235737 253105 298982 330625 356389
12820C56389K989m003L8222L264L8827P7649P1344J50018J65838J31792M3116
$$ 356389 359378 355375 393597 396861 435688 513337 584681 734699 900537 1032329 1075445
12809A075445k5518o7154p4167l1912l4892m3542l5796l3429m9008j2939m954
$$ 1075445 1049927 982773 908606 876694 841802 798260 762464 729035 680027 667088 662134
12798F62134m3719j6629J4914j113m926P357J8299J8294K2134K748M125l9840
$$ 662134 618415 601786 616700 615587 610661 618018 636317 654611 676745 679493 683618 643778
12786F43778l1055J897J2336m346l7566L1627J1105R382K1621L2253K2216K7524
$$ 643778 612723 614620 626956 622610 585044 616671 627776 637158 658779 691032 713248 740772
12774G40772K1414M6827N1770K4741P044M880K3766K4036K1643R645J7508K4151
$$ 740772 762186 809013 860783 885524 892568 897448 921214 945250 966893 976538 994046 1018197
12762A018197j114M597K5361J939k9722m4962k6918K1911M9546M4752L039j4449
$$ 1018197 1017083 1021680 1047041 1048980 1019258 974296 947378 969289 1018835 1063587 1066626 1052177
12750A052177K420M0308N1730N0793K6434J9532L1269j3860k3990j3099j0349
$$ 1052177 1054597 1094905 1146635 1197428 1223862 1243394 1274663 1260803 1236813 1223714 1213365
12739A213365j6205P960J2589K9002L6184J8239O9646R7651N1015O8525J03071
$$ 1213365 1197160 1205120 1217709 1246711 1282895 1301134 1370780 1468431 1519446 1587971 1691042
12728A691042J36759J13158Q3223J02182N8385Q6504O9021K9128J759N6340J18596
$$ 1691042 1827801 1940959 2024182 2126364 2184749 2271253 2340274 2369402 2371161 2427501 2546097
12717B546097J37739J12589J41794J54720J94316K22701K41789K69612K73631
$$ 2546097 2683836 2796425 2938219 3092939 3287255 3509956 3751745 4021357 4294988
12708D294988K89651L25143M01032M96371N78972O48684P36763Q69954J122777
$$ 4294988 4584639 4909782 5310814 5807185 6386157 7034841 7771604 8641558 9764335
12699I764335J381102J656864K067021K616976L261695L981724M979232O487889
$$ 9764335 11145437 12802301 14869322 17486298 20747993 24729717 29708949 36196838
12691C6196838Q894179J2945615K0264167L3174749N0757682O3591616O1282233
$$ 36196838 45091017 58036632 78300799 111475548 162233230 225824846 287107079
12684B87107079M9596090M6858268N4182076M7214724Q723610n1019411r3761972
$$ 287107079 336703169 383561437 437743513 484958237 493681847 442662436 348900464
12677C48900464r9160840p3297365m3606388k4977356j5054836r868569p306032
$$ 348900464 249739624 176442259 132835871 107858515 92803679 82935110 75629078
12670G5629078o179907n595197n092611m531141m028750l622866l214556k799091
$$ 75629078 69449171 63853974 58761363 54230222 50201472 46578606 43364050 40564959
12662D0564959k494317k252973k021765j769545j580235j429091j361890j255829
$$ 40564959 38070642 35817669 33795904 32026359 30446124 29017033 27655143 26399314
12654B6399314j207885j095880j038377r63911q45275p62302o61492o21842n92007
$$ 26399314 25191429 24095549 23057172 22093261 21247986 20485684 19824192 19202350 18610343
12645A8610343n90966n88991n86596n85519n21226n22490m67873m26121l48217
$$ 18610343 18019377 17430386 16843790 16258271 15737045 15214555 14746682 14320561 13972344
12636A3972344l06116k53165k53262k78636k74921k82222l05370k86421k91066
$$ 13972344 13666228 13413063 13159801 12881165 12606244 12324022 12018652 11732231 11441165
12627A1441165l32110l21211l23114l56490l45432l01680k98734k91759k67873
$$ 11441165 11109055 10787844 10464730 10108240 9762808 9461128 9162394 8870635 8602762
12618H602762k34184k02565k09114k32014k02243j81314k16737k39274k01909
$$ 8602762 8368578 8166013 7956899 7724885 7522642 7341328 7124591 6885317 6683408
12609F683408j85771j81471j73502j68931j87732j47089j02805j12405j04448
$$ 6683408 6497637 6316166 6142664 5973733 5786001 5638912 5536107 5423702 5319254
12600E319254p4789m1387k2624o4476q2586j6921N7901J06738J41317J44749J10455
$$ 5319254 5244465 5203078 5180454 5115978 5033392 5016471 5074372 5181110 5322427 5467176 5577631
12589E577631Q6268J44960J81581J41163j22116m07718n77289n29058l34935j97291
$$ 5577631 5663899 5808859 5990440 6131603 6009487 5601769 5024480 4495422 4160487 3963196
12579C963196j26932n1261K8591J11242K17282K64372K52347K02172K33783J98948
$$ 3963196 3836264 3785003 3813594 3924836 4142118 4406490 4658837 4861009 5094792 5293740
12569E293740J22191o4900l73867n56465n77344m37996k63044j82167j04939q1297
$$ 5293740 5415931 5351031 4977164 4420699 3843355 3405359 3142315 2960148 2855209 2773912
12559B773912q7456q7694j75546k37213l14081k20233p9500j4214K9790J5767
$$ 2773912 2686456 2598762 2423216 2186003 1871922 1651689 1572189 1557975 1587765 1603532
12549A603532p4104o6103n2359k8398o8555r9358m7973q766n5812l5614m0914
$$ 1603532 1529428 1463325 1410966 1382568 1314013 1214655 1166682 1157916 1102104 1066490 1025576
12538A025576j5939n027l0460l3378k8832n1505o9433o2413j8407k4507k5405
$$ 1025576 1009637 1004610 974150 940772 911940 860435 791002 728589 710182 685675 660270
12527F60270j7100P522k4415k4841j2800j0650m907p882M748q418l8426N582j0057
$$ 660270 643170 650692 626277 601436 588636 577986 573079 565197 569945 561527 523101 528683 518626
12514E18626k673l8963l6851J513k7044K2517K2985L1711K7802L647n005q769
$$ 518626 515953 476990 440139 441652 414608 437125 460110 491821 519623 523270 518265 509496
12502E09496k4698L0567M5460N0714R3982J27890J02578Q2350J17933J26599J11071
$$ 509496 484798 515365 560825 611539 705521 833411 935989 1018339 1136272 1262871 1373942
12491A373942K7427r4606j43981j69920j31197j28107p4311n0363j6880n633p907
$$ 1373942 1401369 1306763 1162782 992862 861665 733558 659247 608884 592004 586371 578464
12480E78464r924K900k692L001r857K1246J5458k4490j2438k5062o3993l6154
$$ 578464 568540 571440 568748 571749 561892 583138 598596 574106 561668 536606 472613 436459
12468D36459o56Q98m0152l5143j9967J2959J838l3005j9529J8939j341q964m224
$$ 436459 435803 436701 396549 361406 341439 354398 356236 323231 303702 322641 321300 312336 308112
12455C08112N565M1173K3965k1811l0957k5375p306p704k3105K3654J3927n6735
$$ 308112 313677 354850 378815 357004 326047 300672 293366 285662 262557 286211 300138 243403
12443B43403k5096M434O567n283K1588K233j6500J240o002p623J6207L3421J001
$$ 243403 218307 222741 229308 224025 245613 247846 231346 232586 226584 218961 235168 268589 269590
12430B69590J0489j4312j1483k2715J1842K0974M245m008k3K371k513j3524k8607
$$ 269590 280079 265767 254284 231569 243411 264385 268630 264622 264599 266970 264457 250933 222326
12417B22326o878j2693l9933k2213K5490J3453j2272K3777k1759J0772n020k2941
$$ 222326 215448 202755 162822 140609 166099 179552 167280 191057 169298 180070 175050 152109
12405A52109K0192J3866o560j5132j3783K190J4432n001k3822J4151J7006k9735
$$ 152109 172301 186167 179607 164475 150692 152882 167314 162313 138491 152642 169648 139913
12393A39913o0626k1738j9304j0243k601L709O719J2356J5810O906l1495m0608
$$ 139913 79287 57549 38245 28002 25401 29110 35829 48185 63995 70901 39406 -1202
12381a202k2073j3354j7217J1432P70L1455Q002K4783L4854L7226M0706M7156
$$ -1202 -23275 -36629 -53846 -42414 -41644 -10189 -2187 22596 57450 94676 135382 182538
12369A82538J5755k3360l9081n759k781j1934l6866l698J7857O733n393J0607
$$ 182538 198293 174933 135852 130093 127312 115378 78512 74814 92671 99404 94011 104618
12357A04618P296J4737K6164j1086l0000j0146k0498q539k385q233j3628q217
$$ 104618 111914 126651 152815 141729 111729 101583 81085 72546 70161 61928 48300 40083
12345D0083L235k1325K6553J7188K870J4590j1537n978N854j6799m29j8010M273
$$ 40083 43318 21993 48546 65734 68604 83194 71657 65679 71533 54734 54305 36295 40568
12332D0568L243k7582r682J0641k829N266L4328M6621m775j5893m0849k248K1381
$$ 40568 43811 16229 6547 17188 14359 19625 53953 100574 95799 79906 39057 36809 58190
12319E8190J7547J5977J9939r536l8441m9943o40K8566M0223R534K4107J3444
$$ 58190 75737 91714 111653 102117 63676 13733 13093 41659 81882 91416 115523 128967
12307A28967k4379l0275l1807Q028K270l394K3839L3742O082j6674n7099K0429
$$ 128967 104588 74313 42506 50534 52804 49410 73249 106991 113073 96399 39300 59729
12295E9729J7725n275k1482L071Q247r556J0571J158j4618j0249j4663J8761K2421
$$ 59729 77454 72179 50697 53768 62015 52459 63030 64188 49570 39321 24658 43419 65840
12282F5840J5029o817j4374L672J3258K2016m809j0038o671M187o576l8137j0797
$$ 65840 80869 74052 59678 63350 76608 98624 93815 83777 77106 81293 74717 36580 25783
12269B5783L0639J5186j0631k6235j7705J9815L2772j7493K99L5871O287k1548
$$ 25783 56422 71608 60977 34742 17037 36852 69624 52131 52430 88301 94588 73040
12257G3040k17J0455k8510R868J7306M4066L6275K5848L9056N1500Q0333J12511
$$ 73040 72823 83278 54768 64636 81942 126008 162283 188131 227187 278687 359020 471531
12245D71531J47851K22648L37018L03083K52522K57502K98700K35578L2871k55084
$$ 471531 619382 842030 1179048 1482131 1734653 1992155 2290855 2526433 2559304 2304220
12235B304220m61163m98506l85233k39885j38914q9024k9856n0312m0407q704
$$ 2304220 1843057 1344551 959318 719433 580519 491495 461639 411327 370920 362216
12225C62216n905j2154m9828l8476j3018p23j2364j5007o548m5629p073J3338
$$ 362216 356311 344157 294329 255853 242835 242112 229748 214741 208193 162564 155491 168829
12213A68829L755l3235j2901q438J8667m690k7315l562K0519m864k6291n940M759
$$ 168829 172584 139349 126448 118010 136677 131987 104672 101110 121629 116765 90474 84534 89293
12200H9293N489J0481o445k1503l598J5349j7649n304k7735j7495P463N7856K0547
$$ 89293 94782 105263 98818 77315 73717 89066 71417 66113 38378 20883 28346 86202 106749
12187A06749R812l261J1164j6420l6681O917M36J3363p980k9618p973Q413l5705
$$ 106749 116561 113300 124464 108044 71363 78280 78716 92079 84099 54481 46508 54921 19216
12174A9216j9717j0301J26O102K3444J4900j1735J1109J3054m174l1649r236P387
$$ 19216 -501 -10802 -10676 -4574 18870 33770 22035 33144 46198 42024 10375 1139 8526
12161H526J3273L9666J5401l6863j8008R160j7208P943m041j2481K6523L0936
$$ 8526 21799 61465 76866 40003 21995 31155 13947 21890 17849 5368 31891 62827
12149F2827K7682m135j3336J6990K3953o495l1824K628j8764j4399j0070j6245
$$ 62827 90509 86374 73038 90028 113981 107486 75662 78290 59526 45127 35057 18812
12137A8812n87K2685l3433k3284o88L8074L3654J4516k2639j6477Q130m8171m93
$$ 18812 18225 40910 7477 -15807 -16495 21579 55233 69749 47110 30633 38763 -9408 -9901
12124i901L2524m280j2045R957K924k602J5824o261M315j2839j801k6705J2132
$$ -9901 22623 18343 6298 16255 19179 16577 32401 26140 30455 17616 15815 -10890 1242
12111A242n263L3816K0758L905j1689k8058m834R919L700K7810l108m2141n604
$$ 1242 -4021 29795 50553 54458 42769 14711 9877 19796 23496 51306 48198 6057 453
12098D53J7482Q793J9791l6921N35Q073k0427k3733R267J1361k9175O978J8252
$$ 453 17935 26728 46519 9598 10133 18206 -2221 -25954 -16687 -5326 -34501 -27523 -9271
12085i271J7800L924L363k4712k1110K86K7834O549k764J429Q759n877L724J4568
$$ -9271 8529 12453 15816 -8896 -30006 -29720 -1886 4663 1899 3328 12087 6210 9934 24502
12071B4502J0025l3337j6666j5145q555J8576K8703j3289N08K2708P476j0874
$$ 24502 34527 1190 -15476 -30621 -39176 -20600 8103 -5186 -4678 18030 25506 14632
12059A4632k2965q506J053O992M6733K0784j6775l0857r920J5853K0547P928l7716
$$ 14632 -8333 -16839 -15786 -8794 37939 58723 41948 11091 1171 17024 37571 45499 7783
12046G783k6953k021l336J9346M4917J2304k1749j9030L074P904K9212L711l0185
$$ 7783 -19170 -21191 -24527 -5181 39736 52040 30291 11261 14335 22239 51451 55162 24977
12033B4977k2130K5545K707l2467J8564k743p377k422J97K3004P132L1299J9430
$$ 24977 2847 28392 31099 -1368 17196 14453 7076 4654 4851 27855 34987 66286 85716
12020H5716J2677Q126r004L5032L7191K7886R5332Q8761J02903J08155R4038R4247
$$ 85716 98393 106519 97515 132547 169738 197624 292956 381717 484620 592775 686813 781060
12008G81060R4671N5003k8196j02927j48195j61681j39375r1756m3127k5201l4065
$$ 781060 875731 930734 902538 799611 651416 489735 350360 258604 215477 190276 156211
11997A56211j1561l5074J1929J1724o165n892K0595J0748k3608k1088l746Q645
$$ 156211 144650 109576 121505 133229 127064 121172 141767 152515 128907 107819 104073 112718
11985A12718K6032q088k8702P550K4419j195R783K9814m590J9489L2635M9469
$$ 112718 138750 130662 101960 109510 133929 132734 142517 172331 167741 187230 219865 269334
11973B69334N0598N4718J10315J24799J39748J40431J53293J40495J21286P2412
$$ 269334 319932 374650 484965 609764 749512 889943 1043236 1183731 1305017 1377429
11963A377429L0202m7094p0326j15997j35002q7132q5120j07173j02897r5782
$$ 1377429 1407631 1360537 1290211 1174214 1039212 952080 866960 759787 656890 561108
11953E61108p4362n6562n3616n8782m7252n855l95j259J7259r018N687m4809j4049
$$ 561108 486746 430184 376568 317786 270534 264679 264284 263025 280284 271266 276953 232144 218095
11940B18095L063q064p858q550K406k547l2252M637K0066k1771r654L3545L6577
$$ 218095 221158 213094 205236 196686 199092 196545 164293 168930 188996 167225 157571 191116 227693
11927B27693k955K8320N7952Q8881Q3370J06884J10543J12742P8965L6780m507
$$ 227693 224738 253058 311010 399891 483261 590145 700688 813430 892395 929175 924668
11916I24668o7067j12699j12954j18546o8709q4357m9877l3756m4790n0228l5547
$$ 924668 857601 744902 631948 513402 444693 360336 310459 276703 231913 181685 146138
11905A46138J167j4762J0465L646k5786m1683k0847L875J6402J5155j2276j5062
$$ 146138 147305 132543 143008 146654 120868 79185 58338 62213 78615 93770 81494 66432
11893F6432N111k213K4547K5833n460k7981J3217l893j818k9244m012N532J6945
$$ 66432 71543 69330 93877 119710 114250 86269 99486 95593 93775 64531 60519 66051 82996
11880H2996j943j8917l855j03J5054N679j0804J662R683j8579k4925L3047Q262
$$ 82996 81053 62136 58281 58178 73232 78911 68107 69769 79452 60873 35948 68995 77257
11867G7257k6474k429j5324k8797J7982J6646J3959J134k963k2892j2026K4379
$$ 77257 50783 48354 33030 4233 22215 38861 52820 53954 50991 28099 16073 40452
11855D0452m896j1685J3479J8998o481l0537k6298L1530K5133J4525j9196n269
$$ 40452 35556 23871 37350 56348 49867 19330 -6968 24562 49695 64220 45024 39755
11843C9755k8574l390K6673K7572m600j7466j131j2885j0904j1058J4858j7788
$$ 39755 11181 7791 34464 62036 57436 39970 38839 25954 15050 3992 18850 1062
11831A062j1421n145L779J5540J7058J069P933k0148m603K3818J5774j4693j6449
$$ 1062 -10359 -15504 -11725 3815 20873 21942 29875 9727 5124 28942 44716 30023 13574
11818A3574L4589K3672k2697j9543k5001q196J4172Q229N678l214k5800j8380
$$ 13574 48163 71835 49138 29595 4594 -3602 10570 18799 24477 21263 -4537 -22917
11806b2917Q790J8456K2917j3032k4478j8472L0716J8645j1911J0100j5668K0625
$$ -22917 -14127 4329 27246 14214 -10264 -28736 1980 20625 8714 18814 3146 23771
11794B3771J9607j7653R20j392j5093J9131K5480J7868j4116k5414P888M478j3763
$$ 23771 43378 25725 26645 25253 10160 29291 54771 72639 58523 33109 40997 45475 31712
11781C1712p096J7255K9935k2785j4877K824J5021k4386j1596J9473j793N327
$$ 31712 24616 41871 71806 49021 34144 36968 51989 27603 16007 35480 33687 39014
11769C9014j4281j0640N516J1663l207J4016k6740k3504j2755R722o273K0939
$$ 39014 24733 14093 19609 31272 28065 42081 15341 -8163 -20918 -11196 -17469 3470
11757C470N4965J535j4471l8878j9529j40N741J9730O883l6321j1102L229J0594
$$ 3470 58435 59970 45499 6621 -12908 -13048 -7307 12423 19306 -17015 -28117 -24888 -14294
11744a4294O867M3695N131j6716j4065R76L277p081J8217Q871j8929j2366j709
$$ -14294 -7427 36268 41399 24683 10618 11594 14871 7790 26007 34878 15949 3583 1874
11731A874j8872J5229m209k4876J539P734J8993K0338m696q021R844j6079p712
$$ 1874 -16998 -1769 -5978 -30854 -29315 -21581 -2588 17750 13054 5033 14877 -1202 -8914
11718h914O947k720R35O898k0852K607l543J5849L1464Q799K752r452j8334k440
$$ -8914 -1967 -4687 -3752 3146 -17706 -15099 -18642 -2793 28671 37470 40222 30770 12436 9996
11704I996J2820m9998j918O581q3j7242M426J8304L7526o5r775L0635o140k4018
$$ 9996 22816 -27182 -29100 -22519 -22602 -39844 -35418 -17114 20412 20347 10572 41207 35067 11049
11690A1049j2369k2706k0372j4248J0225Q412J2951L7307J6814j4146J8837m481
$$ 11049 -1320 -24026 -44398 -58646 -48421 -40009 -27058 10249 27063 12917 31754 27273
11678B7273j79K583L098J5228m2652k2621J247K6234k663J4322M106j880l5808
$$ 27273 27094 29677 32775 48003 5351 -17270 -16023 10211 7548 21870 25976 24096 -11712
11665a1712k3115j4959j5325J2084R929J3027J8689n706J9555K2344M362j1668
$$ -11712 -34827 -49786 -65111 -53027 -43098 -30071 -11382 -17088 2467 24811 29173 17505
11653A7505O250p294j7398J5149j3789k3564k81K0109Q077j5028K0612J8726K1418
$$ 17505 23755 16461 -937 14212 423 -23141 -23422 -3313 4764 -10264 10348 29074 50492
11640E0492n53k5597k3400n261K6354j6082p717r297n828l571K0710J1509J2589
$$ 50492 49939 24342 942 -4319 22035 5953 -1764 -11061 -16889 -20460 250 11759 24348
11627B4348k4894J2356K1472q06k5813j9284P231J8494R368J1575j9100L35m321
$$ 24348 -546 11810 33282 32476 6663 -12621 -5390 13104 22472 34047 14947 15282 10961
11614A0961k8624J394L0710J1357k6860k0643k4718J1656K1948J801k482J4926
$$ 10961 -17663 -16269 14441 25798 -1062 -21705 -46423 -34767 -12819 -11018 -13500 1426
11602A426k638R956J0296k2305k3066J262j381M723l417Q217K3404J3807J4550
$$ 1426 -1212 8744 19040 -3265 -26331 -25069 -26450 -21727 -25144 -16927 6477 20284 34834
11589C4834j9564j6227q099j0473k24O0866P420j6947r504k0748k5528j3212L776
$$ 34834 15270 -957 -9056 -19529 -19753 41113 48533 31586 22082 1334 -24194 -37406 -33630
11576c3630J184j1835J3939J5914l778L495K4376J1751j2929O615J649l2630q526
$$ -33630 -32446 -44281 -30342 -14428 -18206 -14711 9665 21416 8487 15102 16751 -15879 -24405
11563b4405K5813J2245J8372J8676j9850j2865M9l3811J3898P727r50J3056L0775
$$ -24405 1408 13653 32025 50701 30851 17986 18035 -15776 -1878 5849 4899 17955 48730
11550D8730j0714l375L7858L7195J3462n6353l089l5305l1999j0610K6081K8278
$$ 48730 38016 34641 72499 109694 123156 66803 63714 28409 -3590 -14200 11881 40159
11538D0159Q298J74O405r760k0153k6121k12K8647J5298o541Q736J0053j6591
$$ 40159 48457 48631 55036 45276 25123 -998 -1210 27437 42735 36194 44930 54983 38392
11525C8392k1774L6541K1446R071k3083k0079J772q633k1206j6953O357K1803
$$ 38392 16618 53159 74605 83676 60593 40514 42286 33653 12447 -4506 1851 23654
11513B3654q47m225q765m562P711K1103J2239L19K9261O183k6883m1679P113l80
$$ 23654 22807 18582 9817 5255 12966 34069 46308 46627 75888 82071 55188 13509 20622 20242
11499B0242k3594O315K2331J1631l9102l4027q914R011L343P345K3035J7417P679
$$ 20242 -3352 2963 25294 36925 -2177 -36204 -45118 -36107 -32764 -25419 -2384 15033 22712
11486B2712J7508M691R05R542q108j3409K774Q187l8127l8040K3539R36q101K7000
$$ 22712 40220 44911 45816 55358 47250 33841 36615 44802 6675 -31365 -7826 -6890 -14991 12009
11472A2009K0778r14K59j9469j8032J0315k0J5345M808J3196k8536m0749l0747
$$ 12009 32787 31873 32132 12663 -5369 4946 4926 20271 25079 38275 9739 -31010 -61757
11459f1757k205M0629K7266K6806N092L317j0044m4357l5092K1908J9874k8037
$$ -61757 -63962 -23333 3933 30739 35831 39148 29104 -15253 -50345 -28437 -8563 -36600
11447c6600P437K1221k013O955j3696L1258J9759j7435k5040J2122j1228j5467
$$ -36600 -29163 -7942 -9955 -3000 -16696 14562 34321 16886 -8154 3968 -7260 -22727
11435b2727P823K6810N677q458p805k0645K2505n589l0296K509L0947L920O824
$$ -22727 -14904 11906 17583 9125 1320 -19325 3180 -2409 -32705 -30196 751 4671 11495
11422A1495k1463K6315n76l592j2161J2317J3488j9484J0952K5510j9202j4195
$$ 11495 -9968 16347 15771 12179 18 12335 25823 6339 17291 42801 23599 9404
11410I404r016R315l322k5606J7686K5525K3550M14l6850k4637J4594J901l1848
$$ 9404 388 9703 6381 -19225 -1539 23986 47536 47950 11100 -13537 1057 2958 -28890
11397b8890J0394K5984L0328K3212l086k0841O561k5424k2724r256l14J3318J6421
$$ -28890 -18496 7488 37816 61028 57942 37101 43662 18238 -4486 -13742 -14056 -738 15683
11384A5683k7031l652k6416Q852J085K445k816K979Q733L3433K0319m1440o555
$$ 15683 -11348 -15000 -41416 -32564 -31479 -29034 -31850 -28871 -20138 13295 33614 -7826 -14381
11371a4381N701j1968J3414O2586K227j3778j9374p452j9715J322Q587J3101K0142
$$ -14381 -8680 -20648 -7234 55352 57579 43801 24427 16975 -2740 -1418 7169 20270 40412
11358D0412j4204K731J3517J3118n618p458M12q428j2320J989k541k6037k6760
$$ 40412 26208 28939 42456 55574 49956 42498 42910 34482 22162 24151 21610 -4427 -31187
11345c1187k1604P497j929K9301J9379n929L996J8168j0915l3207R748J5022j7142
$$ -31187 -52791 -45294 -47223 -17922 1457 -4472 -476 17692 6777 -26430 -16682 -1660 -18802
11332a8802L5202J6888j0979q388l157k3409Q799K0603M638o819J3740r70k0872
$$ -18802 16400 33288 22309 13921 10764 -12645 -3846 16757 21395 14576 28316 27346 6474
11319F474k4835j0945r437N388j544l222M943O178L1125M768k3366K9052J7955
$$ 6474 -18361 -29306 -38743 -33355 -34899 -38121 -33178 -27000 4125 8893 -14473 14579 32534
11306C2534M0818k726k0723m3942m7886j3752L7016J3805J0025m925j1100J201
$$ 32534 73352 70626 49903 5961 -41925 -55677 -18661 -4856 5169 244 -10856 -9655
11294i655k7882Q894K8347K0697J0700R396l1077j9116l576J3262L153m141k592
$$ -9655 -37537 -28643 -296 20401 31101 40497 9420 -9696 -13272 -10 3143 -998 -3590
11281c590J4950M642j3420p00J1269J0176j0413p653N243J2259n068l4160j7488
$$ -3590 11360 16002 2582 1882 13151 23327 12914 5261 10504 22763 17695 -16465 -33953
11268c3953K8415j9434n192J2756k1369j5313J4555M852K2916L2104r551j3255
$$ -33953 -5538 -24972 -30164 -17408 -38777 -54090 -39535 -34683 -11767 20337 10786 -2469
11256b469J2986Q719q125k1097j3160O28K3925j7098j0215J2865N452J5293N102
$$ -2469 10517 19236 11111 -9986 -23146 -22518 1407 -15691 -25906 -13041 -7589 7704 12806
11243A2806j4301j2008N327J592J0479q051Q779N250N032O20P333j412L1070k5599
$$ 12806 -1495 -13503 -8176 -6584 3895 -4156 4623 9873 14905 15525 22858 21446 52516 26917
11229B6917l8098J1830k155O445q195P885n283q084J6034N502j8883J8193K6514
$$ 26917 -11181 649 -1506 4939 -3256 4629 -654 -8738 7296 12798 -6085 12108 38622
11216C8622K3944k7391k4031k6885K0819K8897J0505l8466l6320N324J0747k4579
$$ 38622 62566 35175 11144 -15741 5078 33975 44480 6014 -30306 -24982 -14235 -38814
11204c8814K0028L998R615K5975P391j9616K870J9278K1394k462l7000j3127N617
$$ -38814 -18786 -14788 -5173 20802 28193 8577 11447 30725 52119 49657 12657 -470 5147
11191E147l881J7864k66K880J4190j228J3456K0433O346K966m6800l4609k1250
$$ 5147 1266 19130 18864 21744 35934 34706 48162 68595 74941 77907 31107 -3502 -24752
11178b4752J0227J4683J360R336k09j6456k1782M232P880K2820j537J164j0371
$$ -24752 -14525 158 1518 10854 10645 -5811 -27593 -23361 -15481 7339 5802 6966 -3405
11165c405j9461N591k265J0872L463j3688O88J4749K888J6183P817n532J7471
$$ -3405 -22866 -17275 -19540 -8668 -5205 -18893 -18205 -3456 -568 15615 23432 17900 35371
11152C5371j7866o412j7320o782L2401N237K1534K1227o511j3511J6257L4468
$$ 35371 17505 11093 -6227 -13009 19392 24629 46163 67390 60879 47368 63625 98093
11140I8093j3363m1358j6297Q902O928R037K7397K2939L0463K7667L2419N5500
$$ 98093 84730 43372 27075 35977 42905 51942 79339 102278 132741 160408 192827 248327
11128B48327J03355J09126J26678K02783K42978K65805L16375L84208N07433N33358
$$ 248327 351682 460808 587486 790269 1033247 1299052 1615427 1999635 2507068 3040426
11118C040426M13186K16592J00386K23085K96354K4443l64287n39609m31358k83736
$$ 3040426 3453612 3670204 3770590 3993675 4290029 4314472 3950185 3410576 2979218 2695482
11108B695482k56786l52881m37483l74819k43501j65213j04028q6755p3271n2757
$$ 2695482 2438696 2085815 1648332 1273513 1030012 864799 760771 674016 600745 547988
11098E47988l3134l1485k8111j2908k417o224o882l2635l9660l9854r131j3235
$$ 547988 514854 483369 455258 442350 439933 433709 426827 394192 354532 314678 305547 292312
11086B92312j0749p139Q518J6350j2344j3872o436j1404O651o133k9800K033r559
$$ 292312 281563 274424 282942 299292 286948 273076 266640 255236 261887 255754 225954 227987 218428
11073B18428R554O563m1039q061j9289p379J1098n32j0681j8379j3881J1147k3694
$$ 218428 227982 234545 193506 185445 166156 158777 169875 169343 158662 140283 126402 137549 113855
11060A13855k0410J4442O712k7220K0078J2391l88J660J2511J0547j8643J4982
$$ 113855 93445 107887 114599 87379 107457 119848 119460 121120 133631 144178 125535 140517
11048A40517o275j3977m263k055q967R976k1831l1958j7989j3927K0146L9652
$$ 140517 134242 120265 116002 113947 104980 114956 93125 61167 43178 29251 49397 89049
11036H9049n641k5326j4473J9443j0814Q629n556j199j1104r363j8761J3552J3703
$$ 89049 83408 58082 43609 63052 52238 60867 55311 54112 43008 33645 14884 28436 42139
11023D2139j7179j5967O910p400j890J0155J0623O257J54j5358l762M934J0200
$$ 42139 24960 8993 15903 8503 6613 16768 27391 33648 33802 18444 14682 19616 29816
11010B9816j9691m198p75J065J2936K5732l8056j7622L3878J1001J0366N721r490
$$ 29816 10125 5927 5152 6217 19153 44885 6829 -10793 23085 34086 44452 50173 40683
10997D0683J998r218k0316l3164m342K0621K1998j915J4338J0518l9956l2263
$$ 40683 42681 33463 13147 -20017 -24359 -3738 18260 16345 30683 41201 1245 -31018
10985c1018K836j76J2711j113M9810L3548l2724j6335K2999J1534m455k854k5978
$$ -31018 -28182 -28358 -15647 -16760 33050 66598 33874 17539 40538 52072 47617 44763 18785
10972A8785O469J3508j0089l576l396q631l1297j1417N30q462J2498K2971J1210
$$ 18785 25254 38762 28673 25097 21701 13070 -18227 -29644 -29114 -37576 -25078 -2107 9103
10959I103j4704Q752K309j9919L910M563k0375n442k7634K3228J0774J255l2907
$$ 9103 -5601 3151 5460 -14459 -10549 -5986 -26361 -31803 -59437 -36209 -25435 -24180 -57087
10946e7087L026K8008L1388K116q261j3389j4521L4363M035k7310l0261j5792
$$ -57087 -54061 -26053 5335 7451 -810 -14199 -28720 5643 9678 -17632 -47893 -63685
10934f3685K5437J1976K2348k1199K7244J3817k928k4456j0395J6480Q437N120
$$ -63685 -38248 -26272 -3924 -25123 2121 15938 13010 -11446 -21841 -5361 3076 8196
10922H196L0996J1541j1684k1761j515J0185o740m240R286J1294K5814J2320J131
$$ 8196 39192 50733 39049 17288 15773 25958 19218 14978 24264 35558 61372 73692 74823
10909G4823k3802l69o282L2393L4501k474K6813K3525L4453J7035L6269J3312
$$ 74823 51021 50652 44370 76763 111264 108790 135603 159128 193581 210616 246885 260197
10897B60197K9926K1537J0790k3639l6472m8609m1576j9038j9856k3757j2989
$$ 260197 290123 311660 322450 298811 262339 213730 172154 153116 133260 109503 96514
10886I6514j0119n028l3736l7256J2300J5767K423l959J6323j2282J5289J655
$$ 96514 86395 81367 47631 10375 22675 38442 40865 36906 53229 40947 56236 57891
10874E7891N746j2331k0786k0025j4889J2082K6248J5919j4648p261O2N077J8669
$$ 57891 63637 51306 30520 10495 -4394 7688 33936 49855 35207 27946 28008 33085 51754
10861E1754k3411k2831K522l137p827J5079M4531Q456O994j6072K0726M12l6388
$$ 51754 28343 5512 8034 4897 -2930 12149 56680 65136 72130 56058 76784 77196 40808
10848D0808k6580K6346K8048M6327L5285K1450j4668j800j7121p1608k0093J5449
$$ 40808 14228 40574 68622 114949 150234 171684 157016 155216 138095 66487 46394 61843
10836F1843n5592k3451j3444K488J0804J5516L2277j2050j8092R290j1912o599
$$ 61843 6251 -17200 -30644 -28156 -17352 -1836 30441 18391 299 9589 -2323 -8922
10824h922o029N576K921J283K2379M56J711o646j8354j2148j4269k32l3361J664
$$ -8922 -14951 -9375 -6454 -5171 17208 17664 19375 12729 -5625 -17773 -32042 -32274 -65635 -63971
10810f3971K1482J0262J2232J0835l982j1098j500K7734J6687m712J0999k5013
$$ -63971 -42489 -32227 -19995 -9160 -13142 -24240 -25740 1994 18681 13969 24968 -45
10798d5o717j0179K3682J0621k1451n473M1637N561P298k033j6248J058k7276
$$ -45 -6762 -16941 6741 17362 -4089 -9562 32075 37636 44934 42901 26653 27711 435
10785D35j0266K6756k8533r139j000j636K1774J7949N597R015J0952j7407q841
$$ 435 -9831 16925 -11608 -20747 -21747 -23383 -1609 16340 21937 30952 41904 24497 15656
10772A5656K031n981j6484n821o4o077J1074J1157K830P986j5362j9241k6346
$$ 15656 17687 11706 -4778 -10599 -10663 -16740 -5666 5491 8321 16307 945 -18296 -44642
10759d4642J5671M1935K336q436O458J4209r536j6270J8909p955r851j8006J0322
$$ -44642 -28971 12964 15300 6864 13322 27531 17995 1725 20634 12679 2828 -15178 -4856
10746d856K5998o545k2060J4717K8907J5155P289k5168k7483k4655k5419K3470
$$ -4856 21142 14597 -7463 7254 36161 51316 58605 33437 5954 -18701 -44120 -20650
10734b0650L0161K5139q469n41j0659j9346Q21j5957j7432r493L357M9864P140
$$ -20650 9511 34650 26181 25640 14981 -4365 -3544 -19501 -36933 -46426 -43069 6795 13935
10721A3935L839l2562j4109P033J5380K5473J208p31l617J2046l532k1724l8463
$$ 13935 17774 -14788 -28897 -21864 -6484 18989 20197 19466 15849 27895 24363 2639 -35824
10708c5824j2346L4630o672J436K814O211M642k512k398j4841J3264K0097J811
$$ -35824 -48170 -13540 -20212 -18776 -15962 -9751 -5109 -7621 -10019 -24860 -11596 8501 10312
10695A0312k6165J0400P980k4850P170L4105l1647k2904J8223j4154m1619k28
$$ 10312 -15853 -5453 2527 -22323 -15153 18952 -12695 -35599 -17376 -31530 -73149 -73377
10683g3377K9117K8607N0P971o874o267J6468J9743j0912R91J959L5671K541j3699
$$ -73377 -44260 -15653 -15603 -7632 -14506 -20773 -4305 15438 4526 5517 7476 43147 45688 31989
10669C1989k2638m3126R956P456L0127O682R715j6777o294J1955K7358j2687J3483
$$ 31989 9351 -33775 -23819 -16363 13764 20446 30161 13384 7090 19045 46403 33716 47199
10656D7199K0574k5689m890M237j3813k7597j1801m77K464J8298K3165Q104l424
$$ 47199 67773 42084 37194 41431 27618 21 -11780 -12257 -9793 8505 31670 39774 36350
10643C6350O345q705J3084l6710j1686r997K1066K4488K6062J4035l0764j3903
$$ 36350 42695 33990 47074 10364 -1322 -11319 9747 34235 60297 74332 43568 29665
10631B9665J9297l845j6058o81K48j0840m914j1188n127P001J8397P641J2736
$$ 29665 48962 45117 29059 28378 28626 17786 12872 1684 -3443 3558 21955 29596 42332
10618D2332r00j0024q085l909j4806K1670M51M593O894k2814k7746P417K7471
$$ 42332 41432 31408 23323 19414 4608 26278 26729 31322 38216 15402 -12344 -4927 22544
10605B2544o405k0228L877k386j3929p036r549K040p240j2519J4726L7342n736
$$ 22544 16139 -4089 -212 -2598 -16527 -23563 -33112 -31072 -38312 -50831 -36105 1237 -4499
10592d499p964J5997L1221j0968n107K3057K766k9885j1952L324K0086J7294J4169
$$ -4499 -12463 3534 34755 23787 18680 41737 44503 14618 2666 5990 26076 43370 57539
10579E7539O057n393l950j3396k9314j9219O985J8602q446o462j6838J3718p837
$$ 57539 63596 58203 54253 40857 11543 -7676 -691 17911 9465 3003 -13835 -117 -7954
10566g954j464J4038k0159l2516J3547L0361J6768M999J7959M358L062n403k129
$$ -7954 -9418 4620 -15539 -48055 -34508 -4147 12621 17620 35579 39937 42999 37596 35467
10553C5467J0756l07O979k226j2307r863k2909j5241K0285J1203k9185j2205K5188
$$ 35467 46223 45916 52895 50669 38362 28499 5590 -9651 10634 21837 -7348 -19553 5635
10540E635J2820n826l516l303K6231q376j5987J4839K0337L643k770j5142J690
$$ 5635 18455 12629 9113 5810 32041 23665 7678 22517 42854 46497 43727 28585 30275
10527C0275j1162k345O313j8372j5676p685J0177j3131j6326l2872K0817K9063
$$ 30275 19113 16768 23081 4709 -10967 -18652 -8475 -21606 -37932 -70804 -49987 -20924
10515b0924J6431n2J4867K9125K6837k4186k9994P161r822J4800N50N385o868
$$ -20924 -4493 -4545 10322 39447 66284 42098 12104 19265 9443 24243 24793 30178 23310
10502B3310O219r379k9226J0736L804k4091J627K9294J3939k7055M336J3792l613
$$ 23310 29529 20150 -9076 1660 5464 -18627 -17000 12294 26233 -822 3514 17306 13693
10489A3693k3433k722m0331j1526L2105j174k0513k0861J1089K4846K3975J8028
$$ 13693 -9740 -12462 -52793 -64319 -32214 -33388 -53901 -74762 -63673 -38827 -14852 3176
10477C176Q946J5220K2279O0k898m6426n161K1677J3654Q120J3508M108O802j2511
$$ 3176 12122 27342 49621 49681 46783 357 -4804 16873 30527 38647 52155 56263 63065 50554
10463E0554o1264l5587R320j8133J9344M0279K0757K0039K0205j0336J522J8156
$$ 50554 -10710 -46297 -36977 -55110 -35766 4513 25270 45309 65514 55178 56700 74856
10451G4856R886J0400J0766j8430n353l2847k450p506q603R632J1836J8153K4597
$$ 74856 84742 95142 105908 87478 82125 49278 46828 39322 30719 40351 52187 70340 94937
10438I4937r761n866L937j7702j6324M7845J9822M7979M3994O2567O1550K0411
$$ 94937 85176 79310 83247 65545 49221 97066 116888 164867 208861 271428 332978 353389
10426C53389K7057M0610M5074L4934q309k977k532k2696j9542k6974j7860j1922
$$ 353389 380446 421056 466130 501064 492755 489778 487246 464550 445008 418034 400174 388252
10414C88252n2129l3914m0697l4504l7137j0959m1791l0647j0136L5115K4700
$$ 388252 336123 302209 261512 227008 189871 178912 137121 106474 96338 131453 156153
10403A56153j5494o599J4246k2373j2507R89j5524j6795k682J9677O105j7175
$$ 156153 140659 134060 148306 125933 113426 114415 98891 82096 79414 99091 105196 88021
10391H8021J3117m345K6319J5340K7660j0368J1446K7251L2343J8247M8022N8573
$$ 88021 101138 96793 123112 138452 166112 155744 167190 194441 226784 245031 293053 351626
10379C51626R1400N5751N0585P4913R9191J07537Q9683n269K8884M8210j3565
$$ 351626 443026 498777 549362 624275 723466 831003 920686 915417 944301 992511 978946
10368I78946m705k7361j9556n7639o2324p6284o5656o5316m0110o6348m5956n1076
$$ 978946 974241 946880 927324 869685 807361 731077 665421 600105 559995 493647 447691 396615
10356C96615o2472n2695l9704m0657k1683M6776r432j7504k5728l8890l701R884
$$ 396615 334143 281448 241744 201087 179404 226180 216748 199244 173516 134626 130925 140809
10344A40809q836j6864k4825J3477J5612m661j8153j0949J9353K4480P007m749
$$ 140809 131973 115109 90284 103761 119373 114712 96559 85610 104963 129443 136450 131701
10332A31701J1059N2910N1408L5288K5556N1339P2765N4218M4048M2565L6943
$$ 131701 142760 195670 247078 282366 307922 359261 432026 486244 530292 572857 609800
10321F09800N0889L8068J9020L301J972k4554n9427l6928j7851k3282l7853p5485
$$ 609800 660689 698757 717777 721078 723050 698496 639069 602141 584290 561008 523155 447670
10309D47670n8641o1348o9909m4794l3422l4457L73L8744j2777J3265j7370j4801
$$ 447670 389029 327681 257772 212978 179556 145099 145472 184216 171439 184704 167334 152533
10297A52533J2230P805L660k9340k0749L1723J5624K2475M3247N9320Q2416R9695
$$ 152533 164763 172568 176228 146888 126139 157862 173486 195961 239208 298528 380944 480639
10285D80639J73468K15204K02360J57893J63654K04220K38242J53859j7749j73809
$$ 480639 654107 869311 1071671 1229564 1393218 1597438 1835680 1989539 1971790 1797981
10275A797981j28766j4511P2203J9251j53645k86843k67531k47548j35607r6093
$$ 1797981 1669215 1654704 1726907 1746158 1592513 1305670 1038139 790591 654984 558891
10265E58891m6871m8621l7151j9113n7547j4067j7943k1804j2084l690k8677J569
$$ 558891 512020 463399 426248 407135 349588 335521 317578 295774 283690 280000 251323 252892
10253B52892m6810n3217k515Q689Q692J07n206j8114Q199L278N630l4329k4399
$$ 252892 206082 152865 150350 159039 167731 167838 162632 144518 152717 155995 161625 127296 102897
10240A02897j360P281O883k613J1875j9474k2216L392L2568q019n416q511j2101
$$ 102897 101537 108818 115701 113088 124963 105489 83273 86665 119233 111214 105798 97287 85186
10227H5186o719r091j0917j848L0180r585k3562Q334n206o659j2868M334J388
$$ 85186 78467 69376 58459 56611 86791 77206 53644 61978 56772 50113 37245 41579 42967
10214D2967J3395K6218o99k8824k1663K13j7016K529J7304L1738P014l3169j3710
$$ 42967 56362 82580 81881 53057 31394 31607 14591 17120 34424 66162 73176 40007 26297
10201B6297J275j5336L7923Q875J0878k0120k6610m186N117O255P0P05l770J7758
$$ 26297 27572 12236 50159 59034 69912 49792 23182 18996 24113 30368 30438 31143 27373 45131
10187D5131l448k2264n24J3899P849o527o343j6956L5480k886M174Q231j5381
$$ 45131 41683 19419 18895 32794 40643 34116 27773 10817 46297 43411 47585 55816 40435
10174D0435J8288k6238k5125k7092Q925J1952J8247J3018K521j6380k3710p338
$$ 40435 58723 32485 7360 -19732 -10807 1145 19392 32410 34931 18551 -5159 -12497
10162a2497K3077J2687j8530l741k7793L096L4875J3113k0612j1975q087L3766
$$ -12497 10580 23267 4737 996 -26797 -23701 11174 24287 3675 -8300 -16387 17379
10150A7379L7620J283j0855J664J0988q748j0441j0009k681j6335R504L1833J6677
$$ 17379 54999 56282 45427 47091 58079 49331 38890 28881 26200 9865 19369 51202 67879
10137F7879J2415k6098n5752P090N352k2169p44j51J0533O606L043j0892R437
$$ 67879 80294 54196 -1556 5534 10886 -11283 -12027 -12178 -1645 4961 8004 -2888 6549
10124F549J4818k2444k4436l1819J2877o3j1506K7831K7250j23k1421P591J4353
$$ 6549 21367 -1077 -25513 -57332 -44455 -44518 -56024 -28193 -943 -1066 -22487 -14896 -543
10111e43K5197N231J0536J119J7461p756o465r887j3154p551L866j7602l731j1654
$$ -543 24654 29885 40421 41540 59001 51245 44780 34893 21739 14188 18054 452 -3279 -14933
10097a4933J8521L9940J9249j7011m5141k0274q724P854L508m023J2525J804o663
$$ -14933 3588 43528 62777 45766 625 -19649 -28373 -20519 -17011 -21034 -8509 -6705 -13368
10084a3368k4097j6118N700J6782j2193j4363L645L3923n629J6339K3743J4012
$$ -13368 -37465 -53583 -47883 -31101 -43294 -57657 -54012 -20089 -25718 -9379 14364 28376
10072B8376J318n902m865O864R566N856r863p101j8177r521N198J9881L4242J6524
$$ 28376 29694 23792 18927 25791 35357 41213 31350 24249 6072 -3449 1749 21630 55872 72396
10058G2396j1803K993N968M5091J8404m465J0664O407K509j8609k6034m2518l2975
$$ 72396 60593 63586 69554 114645 133049 128584 139248 145655 148164 129555 103521 61003 28028
10045B8028K4348j2839j2012k4669J084J7355q929k5939l5250J010L3675K9200
$$ 28028 52376 39537 27525 2856 3940 21295 12366 -13573 -48823 -47813 -14138 15062
10033A5062J2259r192k7589J1360L0796j6206R651n9j4335k480N805j5913k3042
$$ 15062 27321 18129 -9460 1900 32696 16490 26141 26082 11747 9267 15072 -841 -23883
10020b3883j2636n449j1787j583M617J2214J8023K4145o179K8008J8469m400Q867
$$ -23883 -36519 -41968 -53755 -55338 -50721 -38507 -20484 3661 -2518 25490 43959 39559 48426
10007D8426L623l3154k4342K6810j0640k1959K4555q305K5298j4908q894L8364
$$ 48426 52049 18895 -5447 21363 10723 -11236 13319 5014 30312 15404 6510 44874
9995D4874L109J1318l5892m9024M786R077k8979J2245L4300J5406J8801k2818
$$ 44874 47983 59301 23409 -25615 -20829 -11752 -40731 -28486 5814 21220 40021 17203
9983A7203k0243k4212o465N086J6670j6721j2698j4292L8084J6016j7988k6279
$$ 17203 -3040 -27252 -33717 -28631 -11961 -28682 -41380 -55672 -17588 -1572 -19560 -45839
9971d5839J9254K4153k184K6776J1806j8704k7458P68J7539m931r504j1572n109
$$ -45839 -26585 -2432 -4616 22160 33966 15262 -12196 -11428 6111 1180 -8324 -19896 -25005
9958b5005J426J0372K9586Q924O888J2300q696q693K852o069J6066J3336m4968
$$ -25005 -23579 -13207 16379 25303 32191 44491 35795 27102 29954 23885 39951 53287 8319
9945H319m158j0632J7071N143j0558j0606J3043J7985K0569J4103k48o576N53
$$ 8319 4161 -6471 10600 15743 5185 -5421 7622 25607 46176 60279 60031 53455 54008
9932E4008m801j1670k7898q567J5971K5694m168k5528m810o178j4444j3431K7558
$$ 54008 49207 37537 9639 1072 17043 42737 38569 13041 8231 2053 -12391 -25822 1736
9919A736J8957P690o692M2236N3276j2550l4721k4486J107R509J7841K8715J6554
$$ 1736 20693 28383 21691 63927 117203 104653 69932 45446 46553 56062 73903 102618 119172
9906A19172R824L7250K9188L0242J0448N242k3101J4650p784k5518j955q111m7808
$$ 119172 128996 166246 195434 225676 236124 241366 218265 232915 225131 199613 197658 189547 141739
9893A41739k2903l0572m7355k6049n7N054P785R876J7728J345K1434N290j0106
$$ 141739 118836 88264 40909 14860 14803 19857 27642 37518 55246 56591 78025 83315 73209
9880G3209j7437M072J2753P187J5541j3781l419k3348k0703M881K4809J4199l763
$$ 73209 55772 59844 72597 79784 95325 81544 78125 54777 34074 38955 63764 77963 74200
9867G4200K6814N5075Q872M0528O7826Q9872O5788R5467J23962J64810J54461
$$ 74200 101014 156089 164961 205489 273315 363187 428975 524442 648404 813214 967675
9856I67675J05893R5954J32037O3716k6180j06450k21407k18109j20462o1456
$$ 967675 1073568 1169522 1301559 1365275 1339095 1232645 1011238 793129 672667 611211
9846F11211l6955m7149p0826m5513n6466m0990l8537m0460j1392L0414K4923k740
$$ 611211 574256 527107 456281 410768 354302 313312 274775 234315 222923 253337 278260 275520
9834B75520k1168l373k8852j88j3653r256j1483m375q310m32j3629K9414m287
$$ 275520 254352 250979 222127 221939 208286 199030 187547 183172 174862 174430 160801 190215 185928
9821A85928J4515J5796J186M7334N9746P6324O1155O0084Q3335L3984J1869M6361
$$ 185928 200443 216239 217425 264759 324505 400829 461984 522068 605403 639387 651256 697617
9809F97617L6623K4521j8710o3966k4071k0162M284K4460j4357k2152P4l0402
$$ 697617 734240 758761 740051 676085 652014 631852 636136 660596 646239 624087 624161 593759
9797E93759p7085p0394j0845n1855n1358l1341m3823k1340l3779o678J1593j8936
$$ 593759 516674 446280 435435 383580 332222 300881 257058 235718 201939 195261 206854 187918
9785A87918j5722j2013K119J7744P032r060p482j1601m312K1758o371j1112m8943
$$ 187918 172196 160183 162302 180046 187078 178018 170536 158935 154623 176381 170010 158898 109955
9772A09955l311J3572J3720L1819L4423K8373L8117L5502L7338K025K1072N2622
$$ 109955 106644 120216 133936 165755 200178 228551 266668 302170 339508 341533 362605 415227
9760D15227N2393M8256N2926k0934o126n2066l7766k8161n0059l0796j1495j7008
$$ 415227 467620 515876 568802 547868 541742 489676 451910 423749 373690 342894 331399 314391
9748C14391l5889j3540k951m7930k0385k5699k1239r477q994l0273J0409j1555
$$ 314391 278502 264962 262011 214081 193696 167997 146758 137281 128287 98014 108423 96868
9736I6868m846J2528m963l361m515j837J7763K8837j458l0722j2043o048j3872
$$ 96868 92022 104550 99587 96226 91711 89874 107637 136474 135016 104294 92251 86203 72331
9723G2331j3387o073j3297M397Q710J1650K2485L6483m207k6780j9206J9156O0116
$$ 72331 58944 52871 39574 43971 52681 64331 86816 123299 119092 92312 73106 92262 152378
9710A52378J385N228j4414p856K312K159k0322j1711J5726J7063j8346j2572j2855
$$ 152378 153763 158991 144577 136721 139033 141192 120870 109159 124885 141948 123602 111030 98175
9697I8175k0334k6043j8919J4168J7236j1037l1072j4178K8050L7646j113l8964
$$ 98175 77841 51798 32879 47047 64283 53246 22174 7996 36046 73692 72579 33615
9685C3615j3870J7975k1340p440j1522p961l011k1340N259J6080R878j7541J0224
$$ 33615 19745 37720 16380 8940 -2582 -10543 -13554 -34894 -29635 -13555 -3677 -21218 -10994
9672a0994J0622J6855J1889J65k639k5683L1834l607j692P185j6139j7073N5592
$$ -10994 -372 16483 28372 28537 25898 215 32049 28442 26750 33935 17796 723 56315
9659E6315j6254l2810o025N397n411k0036J988K6578Q842K6091j8423k808j7138
$$ 56315 40061 7251 1226 6623 1212 -18824 -16836 9742 18584 44675 26252 23444 6306
9646F306J6822k3528n1779J1359K9108o360j4672Q034K1014K5542j9811M329K1027
$$ 6306 23128 -400 -52179 -40820 -11712 -18072 -32744 -24710 -3696 21846 2035 6364 27391
9633B7391j7056j9068Q310k709j4113k2914j1236N2549P5516J4444R38j8457p3345
$$ 27391 10335 -8733 -423 -3132 -17245 -40159 -51395 1154 76670 91114 92052 73595 250
9620B50k0075K7076k5701r600J5580n22J6692L018j3467j1211j2389j6485J7307
$$ 250 -19825 7251 -18450 -28050 -12470 -12992 3700 6718 -6749 -17960 -30349 -46834 -29527
9607b9527J0788k2850J0797L8019j3846K379M666p400m264l567M6974L735J2519
$$ -29527 -18739 -41589 -30792 7227 -6619 -4240 426 -6974 -11238 -14805 32169 35904 48423
9594D8423P902j5466k2481k59J2159l4734l2270p406K350p3J0555L1703K4462
$$ 48423 56325 40859 18378 18119 30278 -4456 -36726 -44132 -41782 -41855 -31300 403 24865
9581B4865J1551l8219l160J1386j7217J582J6739K0126j8471l3907K1882Q422
$$ 24865 36416 -1803 -4963 6423 -10794 -9212 7527 27653 9182 -24725 -2843 5579
9569E579k4816j1340q498l4676J3736P0851J8221K0562J8587K0960N955j9172
$$ 5579 -19237 -30577 -39075 -73751 -60015 10836 29057 49619 68206 89166 95121 75949
9557G5949n2271k8296j609k3248J3999K1875p296j554M0857j534l734J6019j9586
$$ 75949 23678 -4618 -6227 -29475 -15476 6399 -897 -2451 38406 36872 33138 49157 29571
9544B9571k3707l427L1448J2917j8724m8J6489o974k6781k6151o354O590m436
$$ 29571 5864 2437 33885 46802 28078 28030 44519 37545 10764 -15387 -21741 -15151 -19587
9531a9587Q53k598K4314L229k4724K4433K925j1787p535m102J2832j30Q758m456
$$ -19587 -18734 -21332 2982 6211 -18513 5920 8845 -2942 -10477 -14579 -1747 -1877 6881 2425
9517B425k7015J4852M1235j0986Q69L766l2443o959j7983k5318M075R831L105
$$ 2425 -24590 -9738 31497 20511 21380 25146 -7297 -14256 -32239 -57557 -53482 -43651 -40546
9504d0546n74o19J7718K5194K0512j1939l4453k4186j487p848j7486j830K0907
$$ -40546 -41120 -41739 -24021 1173 21685 9746 -24707 -48893 -50380 -58228 -75714 -77544 -56637
9491e6637L4482K1160k9825k0171O133j6312O639J0020N947J4724J0236J2409
$$ -56637 -22155 -995 -30820 -50991 -44858 -61170 -54531 -44511 -38564 -23840 -13604 -1195
9479a195J9207j1212o2545K5403K6350r803Q914J4996p06l2266n591j6295k1018
$$ -1195 18012 6800 -55745 -30342 -3992 -13795 -4881 10115 9409 -22857 -28448 -44743 -65761
9466f5761J4766N2307J2051j6588k351J4116L0300j2632J54j1935Q55M147P713
$$ -65761 -50995 1312 13363 -3225 -5576 8540 38840 26208 26362 14427 15282 19429 27142
9453B7142j8226K3246O894k9114r981J7345L3497P417j0290j7208l2147j6729
$$ 27142 8916 32162 39056 9942 -39 17306 50803 58220 47930 30722 -1425 -18154
9441a8154K932K3261j090m3572j3374L5929K3952n333K2641K779o087m992j4582
$$ -18154 -15222 8039 6949 -36623 -49997 -14068 9884 4551 27192 29971 23884 18892 4310
9428D310J1258o332r336J1408l0059k5954K3711N992q302J7490l009l09P865m89
$$ 4310 15568 9236 -100 11308 -18751 -44705 -20994 -15002 -23304 -5814 -8823 -9132 -1267 -1756
9414a756J3056j3485p085K2700L1363j5562k271J4623P172k6009J6544J1511j4314
$$ -1756 11300 -2185 -9270 13430 44793 29231 26960 41583 48755 22746 39290 50801 36487
9401C6487j3265m248J3824J9925J0063k5423j0195R998j330k6856r752j6984O056
$$ 36487 23222 18974 32798 52723 62786 37363 27168 37166 35836 8980 -772 -17756 -11700
9388a1700M5698J2273k4486J7563j9252j6726j4665P118j1334j813J0433K1878
$$ -11700 33998 46271 21785 39348 20096 3370 -11295 -4177 -15511 -17324 -6891 14987
9376A4987N57k6598J1111N634J9166k9770M42l00J2693K0933j5581j8073J0261
$$ 14987 15544 -11054 57 5691 24857 -4913 -4471 -4771 7922 28855 13274 -4799 5462
9363E462j2865k9367j979J1483J1009M602P771k343k5205k2606j5823J5031J5881
$$ 5462 -7403 -36770 -38749 -27266 -16257 -11655 -3884 -6227 -31432 -54038 -69861 -54830 -38949
9350c8949K550J738k999N7112P173l0800l1118k446j1472r39J2743L099O521J8717
$$ -38949 -36399 -34661 -37660 19452 26625 -4175 -35293 -37739 -49211 -50150 -37407 -34308 -27787 -9070
9336i070L0079J0882J983o180j5302Q688j0561k2917R685j3396L846j3711m538
$$ -9070 21009 31891 33874 27694 12392 21080 10519 -12398 -2713 -16109 -12263 -25974 -30512
9323c0512j7825k535J5646K0938K7306j391k4195O452j4698k384K4396r83m828
$$ -30512 -48337 -50872 -35226 -14288 13018 11627 -12568 -6116 -20814 -23198 1198 215 -4613
9310d613J8368k1808j8616Q729K9269L0558j6148j9018K814K3317J4719m238K4859
$$ -4613 13755 -8053 -26669 -17940 11329 41887 25739 6721 9535 32852 47571 43333 68192
9297F8192K9550k6982l1302j380J1283m321j3820l927q834j6747J5013K6635N161
$$ 68192 97742 70760 39458 38078 49361 45040 31220 27293 18459 1712 16725 43360 48521
9284D8521j286R98R241K488n4645m2467j5621K7374K146L782K538L7526L6626
$$ 48521 47235 48233 57474 59962 5317 -37150 -52771 -25397 -23251 -19469 -16931 20595 57221
9271E7221l5200L558j0921k3117j935j4971o844K7678L0635K682K189p021j7813
$$ 57221 22021 25579 14658 -8459 -10394 -25365 -32209 -4531 26104 28786 30975 23954 6141
9258F141q724L382J7132J2843K0034L524j436K3975l2121j4974j3038J0001M9759
$$ 6141 -2583 799 17931 30774 50808 54332 52896 76871 44750 29776 16738 26739 76498
9245G6498j415l295k636j0330J191n403L121m010n644J5541N836J6645j8366k5713
$$ 76498 75083 71788 69152 58822 60013 54610 57731 53721 48077 63618 69454 86099 67733 42020
9231D2020K5340J3342L0669J0352l413k9639j3851m047r561j0691l6257j4339
$$ 42020 67360 80702 111371 121723 118310 88671 74820 70773 61212 50521 14264 -75
9219g5K1225J2301p32J4353J0209N053L63J0013r165N991L329m557N950j9191
$$ -75 21150 33451 32719 47072 57281 62334 62697 72710 63545 69536 72865 68308 74258 55067
9205E5067L933O970M183J3703l764J4490K7649L264K507K4700K988r740K4578
$$ 55067 59000 65970 70153 83856 80092 94582 122231 125495 128002 152702 155690 145950 170528
9192A70528J8343k2671l18K0848K1195K1320j8250k6579K8454L9705M2819M0331
$$ 170528 188871 166200 165882 186730 207925 229245 210995 184416 212870 252575 295394 335725
9180C35725K8079M0013L5790N3481M8490N1487P0121R0138Q7567J16202J41182
$$ 335725 363804 403817 439607 493088 541578 593065 663186 753324 840891 957093 1098275
9169A098275J94101K42061K95529M00382N08031P35410J049952J456538J917880
$$ 1098275 1292376 1534437 1829966 2230348 2738379 3473789 4523741 5980279 7898159
9160G898159K247177K204532J899115J704785J698989J186630j78506j865402
$$ 7898159 10145336 12349868 14248983 15953768 17652757 18839387 18660881 16795479
9152A6795479k996359k998847k391512j683426j152076q22078o44506m67085l36265
$$ 16795479 13799120 10800273 8408761 6725335 5573259 4751181 4106675 3639590 3303325
9143C303325l08258k24495k28338j76566j28051j30427j27914j23714j01900j06359
$$ 3303325 2995067 2770572 2542234 2365668 2237617 2107190 1979276 1855562 1753662 1647303
9133A647303o8206n2082n4585n2615n7708q4636q3894n6062l9959j2627m3754
$$ 1647303 1579097 1527015 1472430 1419815 1362107 1277471 1193577 1137515 1097556 1084929 1041175
9122A041175n9926k5499j3067m4655q809j9113j3808j8052o1890n6839j8446J314
$$ 1041175 981249 955750 942683 898028 889219 870106 856298 838246 776356 719517 701071 702385
9110G02385l4626k9823m6022J744J7735k5502m5748k0336k4456j5048j1918j5278
$$ 702385 667759 637936 591914 593658 611393 585891 540143 519807 495351 480303 468385 453107
9098D53107m520l1696j8183m678R095l0998J9100k25k8286L324J035l2645l9345
$$ 453107 448587 416891 398708 394030 403125 372127 391227 391002 362716 366040 367075 334430 295085
9085B95085j2518p053j4381r303J0402K4944n283k5083q72J4354P211r958l1492
$$ 295085 282567 275514 261133 251830 262232 287176 281893 256810 255938 270292 277503 267545 236053
9072B36053k354R150R968K1J2351k2808k1735m248n573K3237l0128j7544N977
$$ 236053 233699 242849 252817 252838 265189 242381 220646 216398 210825 234062 203934 186390 192367
9059A92367J536J218k3087l1435j624j0462k5174J5823p523k5560J0543P371j290
$$ 192367 193903 195121 172034 140599 138975 128513 103339 119162 111639 86079 96622 103993 102703
9046A02703J900J518r84L6922j7218l5727Q063p3l3279o563M099j6474J2956L8655
$$ 102703 104603 106121 105137 142059 124841 89114 97177 97104 63825 57262 61361 44887 57843 96498
9032I6498J8664J3182M127j983k8769j6497k1459k158n922j7791K6526N478j9565
$$ 96498 115162 128344 132471 130488 101719 85222 63763 61605 55683 37892 64418 69896 50331
9019E0331p668J394K3748J0119Q097J335L422j6214l4442k5194P60J9977r776
$$ 50331 42663 44057 67805 77924 86021 87356 90778 74564 40122 14928 15688 35665 25889
9006B5889j7314j8356l673M333J5519j5407K0369K334J4359K659J1953J502m5693
$$ 25889 8575 -9781 -13454 -9121 6398 -9009 11360 13694 28053 30712 42665 44167 -1526
8993a526R013K1505J4223r101r065k264N975l5160j784J4879J3704L886k2860
$$ -1526 7487 28992 43215 34114 25049 22785 28760 -6400 -8184 6695 20399 24285 1425
8980A425o907k480L4127N2178J3404k4910q591l7271%K217q461J1639L1534J6122
$$ 1425 -5482 -7962 26165 78343 91747 66837 58246 20975 20975 23192 14731 26370 57904 74026
8966G4026K5448L7750m2001o5837R551J0200k1626j1930L005j448j6882L23m616
$$ 74026 99474 137224 95223 29386 38937 49137 27511 15581 18586 17138 256 579 -4037
8953d037K0688Q300J857J9456J4951l3168k2525Q855K812j7041m5114j2996J1187
$$ -4037 16651 24951 26808 46264 61215 28047 5522 14377 17189 148 -44966 -57962 -46775
8940d6775K7278J9386J9106K8322j0946p259L036q220K2297l22j8515N084J3718
$$ -46775 -19497 -111 18995 47317 36371 29112 32148 23928 46225 45903 27388 32472 46190
8927D6190J9877K7976j4918k1371j3693J106N392N83O901j4567k0100J6486J871
$$ 46190 66067 94043 79125 57754 44061 45167 50559 51142 58043 43476 23376 39862 41733
8914D1733j9414j0069l270p587J3872p875K1949Q726r449J5906L4269J8685O468
$$ 41733 22319 12250 8980 1393 15265 7390 29339 38065 28616 44522 78791 97476 103944
8901A03944k4641J2766l519k827j0286J1115n8961m9762R051J9125J649J4934
$$ 103944 79303 92069 88550 85723 75437 86552 27591 -22171 -13120 6005 7654 22588
8889B2588K6317j0007r475J7476K0923m627j7969k6966M187Q916j1480L280J1867
$$ 22588 48905 38898 29423 46899 67822 63195 45226 18260 22447 31363 19883 23163 35030
8876C5030q561m241L2441J0367k5938j6768K2393J8791L4111J6275P377l4261
$$ 35030 26469 22228 54669 65036 39098 22330 44723 63514 97625 113900 121277 87016
8864H7016k1595N188J0844K3128P242l1372m8869r98P864l455L153L37n923j4630
$$ 87016 65421 70609 81453 104581 111823 80451 31582 30584 38448 34993 38146 38483 32560 17930
8850A7930j6515l009J0087K3522J4552R047j2061l4664J4L5767K035k931j0054
$$ 17930 1415 -1594 8493 32015 46567 55614 43553 8889 8903 44670 46705 43774 33720
8837C3720r724P029K6965r676k6258q75K4003P909J9569N843k4273j1277L257
$$ 33720 23996 31025 57990 48314 22056 21181 45184 53093 72662 78505 54232 42955 46212
8824D6212k713K2888L9134J0302J0230l721P137k0039n679j8706k7881K006J7943
$$ 46212 43499 66387 105521 115823 126053 122332 129469 109430 103751 85045 57164 59170 77113
8811G7113K5755k4432k2211j0283j0435J467j4547J0665j3808l4291K707j391
$$ 77113 102868 78436 56225 45942 35507 36974 22427 33092 19284 -15007 -12300 -13691
8799a3691R280K4455R824k6702J2014P569J3619J7810N401p474k7065l1721k759
$$ -13691 -4411 20044 29868 3166 15180 22749 36368 54178 59579 52105 25040 -6681 -9440
8786i440J3313k098J9652J6759J2330K2226r454K802K4691l702J5690K7679J710
$$ -9440 3873 1775 21427 38186 50516 72742 63288 66090 90781 87079 102769 130448 132158
8773A32158J7523L3365r350m050j7176L006n291p8165l2791J0405J5515j0904
$$ 132158 149681 183046 173696 169646 152470 155476 150185 72020 39229 49634 65149 54245
8761E4245j1646k2831O53j0968J7802K6741N039j4571K0925K903L238J3970j4634
$$ 54245 42599 19768 20421 9453 27255 53996 59035 44464 65389 68292 71530 85500 70866
8748G0866N768J4886L696j8326q247K4220L7292L2897L8546O7274P8337K0272
$$ 70866 76634 91520 95216 76890 68643 92863 130155 163052 201598 268872 347209 367481
8736C67481K3214M1095M9991p744n9422j09740r4501l4530j0983j1735k2311n634
$$ 367481 390695 431790 481781 474037 414615 304875 210374 175844 164861 153126 130815 125181
8724A25181J9615r086j8908l5336j9455NM123Q904j4758K8729K7897k3395l9302
$$ 125181 144796 135710 116802 81466 62011 62016 66139 75043 60285 89014 116911 93516 54214
8711E4214j2805J2971o641j6728l527J2436K077J1939K154j6409n723Q553J0118
$$ 54214 41409 54380 47739 31011 27484 39920 41997 53936 56090 39681 33958 42511 52629
8698E2629j3684k583P154J626j3262j5309k3507j5221K0901M3624n54l3221p149
$$ 52629 38945 36362 43516 45142 31880 16571 -6936 -22157 -1256 42368 41814 8593 1444
8685A444p191m77K6017J7651J3770j0088l0983l227q232K9853L4982j8457k5325
$$ 1444 -5747 -6224 19793 37444 51214 41126 10143 6916 -1316 28537 63519 45062 19737
8672A9737l4461J115K7920K4417j0498j4186P448K7319L695o046J3929J3668J6304
$$ 19737 -14724 -13609 14311 38728 28230 14044 21492 48811 52506 46460 60389 74057 90361
8659I0361K6873M1060P314J0847J3821O7564M6492k524m6844o8693j8158n031
$$ 90361 117234 158294 165608 176455 190276 257840 304332 301808 254964 186271 168113 163082
8647A63082j8716j3130j4094j4111L1515K1097Q569k1787p30k1270j0341j6152
$$ 163082 144366 131236 117142 103031 134546 155643 164212 142425 141695 120425 110084 93932
8635I3932r447K0294M656j5153R489J5917J2307k658J2464K0583n130N580J2450
$$ 93932 84485 104779 109435 94282 103771 119688 131995 129337 141801 162384 157254 162834 175284
8622A75284K5626N47p621L0166L7301J6261r435j8185M1661L7141N2955M2280
$$ 175284 200910 201457 193836 224002 261303 277564 268129 249944 291605 328746 381701 423981
8610D23981J1206M2235M2306j1823n3147j03956q9043o3347m6273R08R933j1847
$$ 423981 435187 477422 519728 507905 454758 350802 261759 198412 152139 153047 162980 151133
8598A51133l568K1277J3170k3010n144j9754k2094j845k5755n483l614k221L886
$$ 151133 147565 168842 182012 159002 153858 134104 112010 110165 84410 78927 75313 73092 76978
8585G6978Q15J5620j7440k2367j8861n098k3989J3377L1384k0265j8225k691J3449
$$ 76978 77793 93413 75973 53606 34745 29647 5658 19035 50419 30154 11929 9238 22687
8572B2687p290J5194J5234J4210L1575J0631J78O223L3188O1829Q102m2561l9856
$$ 22687 15397 30591 45825 60035 91610 102241 102419 108642 141830 203659 211761 169200 129344
8559A29344m8910k5693l8523q150L8061L3082o078p409m368m2517j6919L1373
$$ 129344 80434 54741 16218 8068 46129 79211 73133 65724 61356 18839 1920 33293
8547C3293K5312J3984j9067J6336K6108J1221l6126q693j7735k6873j819M84j056
$$ 33293 58605 72589 53522 69858 95966 107187 71061 62368 44633 17760 15941 16425 15369
8534A5369O23k0115j069l02J2393K7705K749m051N539l352J9974n373k8045J7626
$$ 15369 15992 -4123 -5192 -5494 6899 34604 37353 33302 38841 35489 55463 50090 22045 39671
8520C9671m347L028p323N828k0438k7259Q884m883o194L4392J7754J9401O44k7472
$$ 39671 35324 38352 31029 36857 16419 -10840 -1956 -6839 -13033 21359 39113 58514 59158 31686
8506C1686k6656k966j246k192N502K3459j2619P897J3352R166J8167j9793k8905
$$ 31686 5030 2064 818 -1374 4128 27587 14968 22865 36217 45383 63550 43757 14852
8493A4852j2748o353j4117q50J53K0298p831K5889k2389l0243J8479J571j5017
$$ 14852 2104 -4249 -18366 -19216 -19063 1235 -6596 19293 -3096 -33339 -14860 -13289 -28306
8480b8306j226K8602L8499O871j6534j7001j276J4220P000k4088o092J1541o682
$$ -28306 -29532 -930 37569 44440 27906 10905 9629 23849 30849 6761 669 12210 5528
8467E528p10l079N870p778k0189j6630K868R763K4229j3361j4655J7018q699K3959
$$ 5528 4818 1739 7609 -169 -20358 -36988 -34120 -24357 -128 -13489 -28144 -11126 -19825 4134
8453D134L974k369k046j8376l6802l6821O110K6339K3702R110K021k2495j4323
$$ 4134 8108 5739 3693 -14683 -51485 -88306 -82196 -55857 -32155 -23045 -21024 -43519 -57842
8440e7842J5394k35J7364l156K2369K9541k5678L137N159k0566J7996J0779j0752
$$ -57842 -42448 -42683 -25319 -28475 -6106 23435 -2243 894 6053 -14513 3483 14262 3510
8427C510j3289l0346l184M6153M1347p449k1412o57K8482K391k1375l327J3388
$$ 3510 -9779 -40125 -43309 2844 44191 36742 15330 14673 43155 45546 24171 20844 34232
8414C4232R866l5628j9118K0681J8324o950k1788l1342L46L1254K0834J6533Q803
$$ 34232 44098 8470 -10648 10033 28357 21407 -381 -31723 -31377 -123 20711 37244 46047
8401D6047O356J1170j4828j3381j6541J5168J2329k1195l4328J6269M947R078
$$ 46047 52403 63573 48745 35364 18823 33991 46320 25125 -9203 7066 12013 21091
8389B1091o075j0752l609l81k5001j473K6685J4466K5359j7481k8460N998J6926
$$ 21091 15016 4264 655 274 -24727 -26200 485 14951 40310 22829 -5631 367 17293
8376A7293j2028O972n818j7487m933K201O517o550K9456Q891O472N3939L1206
$$ 17293 5265 12237 6419 -11068 -16001 -13800 -7283 -13833 15623 24514 30986 84925 116131
8363A16131n81k1175n0320j5361j1091K8942j6331k6435P886K530j2361n002m724
$$ 116131 115550 94375 44055 28694 17603 46545 30214 3779 11665 14195 1834 -3168 -7892
8350g892P203o028l1255p635L1059O505j5267O048M5749J6657o338o397j5765
$$ -7892 -689 -6717 -37972 -45607 -14548 -8043 -23310 -17262 28487 45144 38806 32409 16644
8337A6644J0648J0637J28j8310j2810j7499j8740L9267L868M082J1082l3932k6121
$$ 16644 27292 37929 38057 19747 6937 -10562 -29302 9965 13833 17915 28997 -4935 -31056
8324c1056L0174M228Q157J601j0668J4953J900p254L055k973R585J3437k9556
$$ -31056 -882 3346 11503 13104 2436 17389 19289 12035 15090 12117 21702 35139 5583
8311E583l8178j2272K7400j3607m153K1236Q461O876l288k8610j3734J8432j6610
$$ 5583 -32595 -44867 -17467 -31074 -35227 -13991 -5530 1346 -1942 -30552 -44286 -25854 -42464
8298d2464J7368K5205P720k2782k8442J2972q328l487K7152K3908M805L291j8291
$$ -42464 -25096 109 7829 -14953 -43395 -30423 -38751 -42238 -15086 8822 13627 16918 -1373
8285a373m449J5423q565q720q504j406K9471J8224j2022l3745N466L8326j7004
$$ -1373 -5822 9601 1036 -7684 -16188 -17594 11877 30101 18079 -15666 -10200 28126 11122
8272A1122l1230j8145k1058K0233J0991L9713J3489k5841q461k3956n090L8559
$$ 11122 -20108 -38253 -59311 -39078 -28087 11626 25115 -726 -9187 -33143 -38233 326
8260C26r445L074K8071J8075j1369j6141j3207N642k683J6415J6792K26k6947
$$ 326 -9119 -6045 22026 40101 28732 12591 -616 5026 2343 18758 35550 35776 8829
8247H829O973m682l0397k2413k5260K9468N0341J8629r842k3609k097j0162j8183
$$ 8829 15802 11120 -19277 -41690 -66950 -37482 12859 31488 21646 -1963 -4060 -14222 -32405
8234c2405P437L0684L072L227L3159j6816m2048R84L4571o013Q048j5811l8041
$$ -32405 -24968 5716 8788 12015 45174 28358 -13690 -12706 21865 15852 23900 8089 -29952
8221b9952R377Q340K5260Q493L553K2276k2896j7729n759K2973J5679m8124l2521
$$ -29952 -20575 -12235 13025 21518 25071 47347 24451 6722 963 23936 39615 -8509 -41030
8208d1030J4948M7211K2563K9534K1466k5165j9507K179o476j8306J763J0202
$$ -41030 -26082 21129 43692 73226 94692 69527 50020 52199 45723 27417 29180 39382
8196C9382j3188p582J7299j6814j6339J0550P271N262k6228m8565k5705J2512
$$ 39382 26194 18612 35911 19097 2758 13308 20579 25841 -387 -48952 -74657 -62145
8184f2145K3879L4346Q7j4587P014K0418O873M348p353l287R731K724m292k5468
$$ -62145 -38266 -3920 -3833 -18420 -11406 9012 15885 20233 12880 9593 19324 22048 17756 -7712
8170g712J8567n758J553J5822j6648k1676O622K6410l594k727J2642K0549k9459
$$ -7712 10855 5097 6650 22472 5824 -15852 -9230 17180 13586 10859 23501 44050 14591
8157A4591k4010O213Q487R348j2875j8352l494j4122j564L8213K8237k2645o048
$$ 14591 -9419 -3206 5281 14629 1754 -16598 -20092 -34214 -35778 2435 30672 8027 1979
8144A979J4541k1188k6951Q306J3760L1503J6795q458k1011R763J6111j9117j9156
$$ 1979 16520 -4668 -31619 -23313 -9553 21950 38745 30287 9276 19039 35150 16033 -3123
8131c123k4951j5215R000p743r544K0648J5643J8426o671Q637r174J1054J1032
$$ -3123 -28074 -43289 -34289 -42032 -51576 -30928 -15285 3141 -3530 5107 -4067 6987 18019
8118A8019R420K0721K4342p14l6720j4859J1645Q484o979q98R219j5419J101L5103
$$ 18019 27439 48160 72502 71788 35068 20209 31854 40338 33359 32461 41680 26261 27362 62465
8104F2465l0930n5375m5048j966j5830L2877P1210N046j0706m2566j5863n85J8297
$$ 62465 31535 -23840 -68888 -70854 -86684 -53807 17403 22449 11743 -30823 -46686 -47271 -28974
8091b8974j1641N5J7153J5150M7852k271q217r818m927o269K5663m559j4064P930
$$ -28974 -40615 -40560 -23407 -8257 39595 37324 29107 19289 14362 8093 33756 29197 15133 23063
8077B3063j478M541O27O312k614J3439j6192j7710L0153k287r394j2718m2049
$$ 23063 21585 26126 26753 33065 30451 43890 27698 9988 40141 37854 28460 15742 -26307
8064b6307l4503P63K7455K4201M9274Q162k2119j9839J6638K648J2749K812L933
$$ -26307 -60810 -60047 -32592 -8391 40883 49045 26926 7087 23725 26373 39122 41934 45867
8051D5867R730k3712l1730l652j25P769M46J5428q490O545J7452P582r456p960
$$ 45867 55597 31885 155 -3497 -3622 4147 4593 20021 11531 18076 35528 43110 33654 25694
8037B5694k403l2888L967J7041J973J3636j289J907J9585k5590j9477j481K959
$$ 25694 23291 -9597 -5630 11411 13384 27020 25731 27638 47223 21633 2156 675 3634
8024C634j6669r377Q215J0231L9527N783N136n143j5689J2706m303j2434N81J0470
$$ 3634 -13035 -22412 -14197 -3966 35561 41344 46480 41337 25648 38354 34051 21617 22198 32668
8010C2668K6860J8508j3329m6603k8101L4834j3010J2143J8604j0521l7591L963
$$ 32668 59528 78036 64707 18104 -9997 24837 11827 23970 42574 32053 -5538 -1575
7998a575j8074j939L3934L8278Q7l0457l0878J2987l2856k2641L416M2766J6362
$$ -1575 -19649 -21588 12346 50624 50711 20254 -10624 2363 -30493 -53134 -49718 -6952 9410
7985I410l499j4935L1791J2718J828l6131j3249J5733K9637R783l6562L493M4221
$$ 9410 5911 -9024 22767 35485 37313 1182 -12067 3666 33303 43086 6524 10017 54238
7972E4238M328l3175j6677K472j110J6181N566M703L515l9420L4809L4685j9185
$$ 54238 58566 25391 8714 11186 10076 26257 31823 36526 40041 621 35430 70115 50930
7959E0930J8531J5256k4640m9801k7444J494K110J1249Q704J6601J3748J680j4966
$$ 50930 69461 84717 60077 10276 -17168 -15674 -13564 -2315 6389 22990 36738 38418 23452
7946B3452k7580N589j6040j8779q809j4335K0247L0068k374j211M308J0647M204
$$ 23452 -4128 1461 -14579 -33358 -42167 -56502 -36255 -6187 -8561 -9772 -5464 5183 9387
7933I387O015L032P425n846j8083j4371n683k0537J4149K3933R693k0217m139
$$ 9387 15402 18434 25859 20013 1930 -12441 -18124 -38661 -24512 -579 9114 -11103 -15242
7920a5242j0304n169J5112J0232O816J45J4789J9954K914o420l3488O841K1923
$$ -15242 -25546 -30715 -15603 -5371 1445 1590 16379 36333 39247 32827 -661 6180 28103
7907B8103l470k2197J0728K180L5043J31l1875p128k2928k8105J9041J4702j6287
$$ 28103 24633 2436 13164 15344 50387 50518 18643 11515 -11413 -39518 -20477 -5775 -22062
7894b2062m465j5327q523K3289j7573M847M207K0592K5257K2549q3M832J9184
$$ -22062 -26527 -41854 -50377 -27088 -44661 -39814 -35607 -15015 10242 32791 32708 37540 56724
7881E6724m76j4184n6804l322K7968M951k7776R238L3837J5986M994j7431q671
$$ 56724 56248 42064 -14740 -18062 9906 14857 -12919 -3681 30156 46142 51136 33705 25034
7868B5034j4893m1149k5877N121J7755K0668q732O625J7466j18K5869j0404k8227
$$ 25034 10141 -31008 -56885 -51764 -34009 -13341 -22073 -15448 2018 1900 27769 17365 -10862
7855a0862j8156J5416L2444L789L892r56K848J4850k999k0283M287k4713J1361
$$ -10862 -29018 -13602 18842 22631 26523 25567 28415 43265 40266 19983 24270 -443 10918
7842A0918L5920j526j1051K637j0703m669m449j7422j1004P728L1895J8838j8358
$$ 10918 46838 45312 34261 36898 26195 21526 17077 -345 -11349 -3621 28274 47112 28754
7829B8754k2360P477J8791r476n6689j7705O591J7921j3266j5272P820K7417Q866
$$ 28754 6394 13871 32662 23186 -33503 -51208 -44617 -26696 -39962 -55234 -47414 -19997 -11131
7816a1131k4018r319J00N972P368Q208P012J0561L8223j5613k9474j4642k4314
$$ -11131 -35149 -44468 -44368 -38396 -31028 -22820 -15808 -5247 32976 17363 -12111 -26753 -51067
7803e1067J1809K0561k009m821j0047L477K8041J9682P00j1255K855N305l0509
$$ -51067 -39258 -18697 -20706 -25527 -35574 -32097 -4056 15626 16326 5071 7926 13231 -17278
7790a7278j7673k822j5352K4815L4970K0700j5219k891o247j8396J426L0706l056
$$ -17278 -34951 -37773 -53125 -28310 6660 27360 12141 9250 3003 -15393 -13967 16739 13683
7777A3683k775o58K161j747M5265j2204k3013k4535q428m089P811J8652J9272
$$ 13683 10908 10250 12411 10664 55929 43725 20712 -3823 -12251 -16340 -8529 10123 29395
7764B9395k0859j4340q190J7908J8005k011j9311l2318j6052q456K936j667P913
$$ 29395 8536 -5804 -13994 3914 21919 19908 597 -31721 -47773 -56229 -53293 -54960 -47047
7751d7047J9715K2780J2463j3607k5980J5633K2700k4779k3111L2600P437k6828
$$ -47047 -27332 -4552 7911 -5696 -31676 -16043 6657 -18122 -41233 -8633 -1196 -28024
7739b8024j6002J7657K4235Q264J7284K478j4386r97K7376j9686k8064j7796K518
$$ -28024 -44026 -26369 -2134 6130 23414 25892 11506 10509 37885 18199 -9865 -27661 -25143
7726b5143nO260Q955o605l041O358l240r866k3727K8931o719j5642k9454l400
$$ -25143 -25148 -18888 -9933 -16538 -19579 -13221 -16461 -26327 -50054 -21123 -27842 -43484 -72938 -76338
7712g6338P842L4848K2562P894j6694j0025p918Q650J5125k507J572J4401L4659
$$ -76338 -68496 -33648 -11086 -3192 -19886 -29911 -37829 -29179 -14054 -16561 -14989 -588 34071
7699C4071L069k8287j4126k3852l3675k6505L3537P915J1677K9014J7694j4573
$$ 34071 37140 8853 -5273 -29125 -62800 -89305 -55768 -47853 -36176 -7162 10532 -4041
7687d041J0530j1493P444j0923k7962j0666J785k388J1860K0671J3671k3771j4740
$$ -4041 6489 -5004 2440 -8483 -36445 -47111 -45326 -47714 -35854 -15183 -1512 -25283 -40023
7674d0023K4406j2526J311N220J3357J1723r008J0482p24j9824k2519j977K3526
$$ -40023 -15617 -28143 -26832 -21612 -8255 3468 -5540 4942 4218 -15606 -38125 -40102 -16576
7661a6576m253q643j0010J1659j169R662J9608q222m871J4807L2021j388k2686
$$ -16576 -20829 -29472 -39482 -27823 -28992 -19330 278 -7944 -12815 1992 34013 32625 9939
7648I939l5755l7087l206P303r843J0593K7597J1614j5548j3891J7843k3538j0077
$$ 9939 -25816 -62903 -66109 -58806 -68649 -58056 -30459 -18845 -34393 -48284 -30441 -53979 -64056
7635f4056Q274L5865K1185j460j983O775l0388J4874k419L621K9941J692R028
$$ -64056 -55782 -19917 1268 -192 -2175 4600 -25788 -10914 -13333 -9712 20229 21921 30949
7622C0949J3398l816r595r989j8024r796k0650O525K9352M5705j3662k9780J618
$$ 30949 44347 40531 30936 20947 2923 -6873 -27523 -20998 8354 54059 40397 10617 12235
7609A2235K697q644J5062j6143M337P693K440Q413J9254j2104l1562k7741P306
$$ 12235 14932 6288 21350 5207 9544 17237 19677 28090 47344 35240 3678 -24063 -16757
7596a6757J5793k9946m077N810M5161K4078k7911m2535l3004K111K9098N462L451
$$ -16757 -964 -30910 -34987 -29177 15984 40062 12151 -30384 -63388 -61277 -32179 -26717 -23266
7583b3266l099n84O142j3677J5277L6870p277m8401K7557Q969L5561J2100K795
$$ -23266 -26365 -26949 -20807 -34484 -19207 17663 10386 -38015 -10458 -1489 34072 46172 48967
7570D8967n125j4142K329k509L208J952P397q126j3504k0964j7200j8343j8970
$$ 48967 43842 29700 32029 29520 32728 34680 42077 33951 20447 -517 -17717 -36060 -55030
7557e5030k2251K6516L9169L9960k4113l6168J0641P336J5445N219L596k6940
$$ -55030 -77281 -50765 -11596 28364 4251 -31917 -21276 -13940 1505 6724 10320 -16620
7545a6620J1648J0859Q163k1638k1191J1609J311j5203N149J5898k8639R718K9712
$$ -16620 -4972 5887 14050 -7588 -28779 -17170 -15859 -31062 -25913 -10015 -38654 -28936 776
7532G76m930k6603o673K1931K8818r470J9425J8598k7101k5243p904J1154M97
$$ 776 -4154 -30757 -37430 -15499 13319 3849 23274 41872 14771 -10472 -18376 -7222 -6725
7519f725j8657N67o921k506J9773K7850R929j857J3762O08J4533k550j7988r994
$$ -6725 -25382 -24815 -31736 -34242 -14469 13381 23310 21453 35215 35823 50356 47806 29818 19824
7505A9824m569K3716K5134l590l6280N36r580j7471K4645k2200J144J5439j3608
$$ 19824 15255 38971 64105 60515 24235 24771 15191 -2280 22365 165 1309 16748 3140
7492C140o715m305K4769J1457j0102j3065J1305j1322O067l924j1173R089J5152
$$ 3140 -3575 -7880 16889 28346 18244 5179 16484 5162 11229 7305 -3868 5221 20373
7479B0373n932k5007k0929K238j4327k6464L199M8790J559O553M4925k3484r26
$$ 20373 14441 -10566 -31495 -29257 -43584 -70048 -66849 -18059 -16500 -9947 34978 11494 10568
7466A0568m110L2512j0510k6553j7001p435J5600j1271r836j3374n18L404K1286
$$ 10568 6458 38970 28460 1907 -15094 -22529 -6929 -18200 -28036 -41410 -41928 -38524 -17238
7453a7238J493m273o048J3805R35l1546J1407J805K5634l066m976j7496K428R250
$$ -17238 -15745 -20018 -26066 -12261 -11326 -42872 -31465 -29660 -4026 -7092 -12068 -29564 -27136 -17886
7439a7886l523N909J060L582j6081O870K3359o56Q738j2984m535K0121k0039m585
$$ -17886 -21409 -15500 -14440 -10858 -26939 -20069 3290 2634 11372 -1612 -6147 13974 -6065 -10650
7425a0650o435q087o894m93m720P386L0344J8787J0294K2959J0571k3575k6292
$$ -10650 -17085 -25172 -32066 -32559 -37279 -29893 451 19238 29532 52491 63062 39487 13195
7412A3195j9163j3043J1962O023k5285j1825J3794m766O614k639j452K7969j0504
$$ 13195 -5968 -19011 -7049 -1026 -26311 -38136 -24342 -29108 -22494 -25133 -26585 1384 -9120
7399i120M369q664j265K8183Q906m985p658J337j5585p497j5593o52K507N628
$$ -9120 -4751 -13415 -14680 13503 22409 17424 9766 11103 -4482 -11979 -27572 -28224 -25717 -20089
7385b0089p241k64k025K2893l734L5409K2984K4967j1400P828j4537l4758l5433
$$ -20089 -27330 -27594 -29619 -6726 -10460 24949 47933 72900 61500 69328 54791 20033 -15400
7372a5400r652q580m708J5405J1076L602J7730J8508n582j1057l3717L533J6506
$$ -15400 -25052 -33632 -38340 -22935 -11859 -8257 9473 27981 22399 11342 -22375 -18842 -2336
7359b336q570j8420j1788J8659j6345P575K5233k2563m150R656j6786o414q34
$$ -2336 -10906 -29326 -41114 -22455 -38800 -31225 -5992 -28555 -32705 -23049 -39835 -46249 -47083
7346d7083J1265j189O856R662N582K8650J4645j1991k5197n313j5941M571K9718
$$ -47083 -35818 -37007 -30151 -20489 -14907 13743 28388 16397 -8800 -14113 -30054 -25483 4235
7333D235K7939R892o7861n7124N403q896K0512k789R440K5671K3600O900n831
$$ 4235 32174 42066 -25795 -82919 -77516 -86412 -65900 -68689 -59249 -33578 -9978 -3078 -8909
7320h909M906j8032J1789K561j295m309N96P490J8685j9487k7515j3609J6612
$$ -8909 -4003 -22035 -10246 -7685 -8980 -13289 -12693 -5203 13482 -6005 -33520 -47129 -30517
7307c0517K3452J2709m234o238Q506J3104J2559J5655j3977p243k2990R242K2561
$$ -30517 -7065 5644 1410 -4828 3678 16782 29341 44996 31019 23776 786 10028 32589
7294C2589j6519k903J1029j7858j5817j079J2494L2899L085l1713j8960k2033
$$ 32589 16070 13167 24196 6338 -9479 -10558 1936 34835 37920 6207 -12753 -34786
7282c4786r937J8057K9762J3776K9942L449r1j7645m510j160J2097l0356j7535
$$ -34786 -44723 -26666 3096 16872 46814 50263 50172 32527 28017 26857 38954 8598 -8937
7269h937J1821R931J6109n1068k0556j8642N179P814j707n004K0454K3048n01
$$ -8937 2884 12815 28924 -22144 -42700 -61342 -56163 -48349 -50056 -55060 -34606 -11558 -12059
7256a2059n542j8565o908J0899p475K9805M8545j1118k9821k8852J6758l285j1704
$$ -12059 -17601 -36166 -43074 -32175 -39650 -9845 38700 27582 -2239 -31091 -14333 -17618 -29322
7243b9322R059J4017k756r77J5865J6136J7629l877k0635l1978j4210l4095J7751
$$ -29322 -20263 -6246 -9002 -9979 5886 22022 39651 35774 15139 -16839 -31049 -65144 -47393
7230d7393J2764P455J4342J8620j0126J7476L9294M444m1245k3766J0274J1769
$$ -47393 -34629 -27174 -12832 5788 -4338 13138 52432 56876 15631 -8135 2139 13908
7218A3908M11J9455r310l9190J5170K7136p078j6177o287J9872L374J0574j9061
$$ 13908 14319 33774 24464 -14726 444 27580 20502 4325 -1962 17910 21284 31858 12797
7205A2797l1422n1086r822n346L4781J9258N903q255J17K3366J3120M737j9263
$$ 12797 -18625 -69711 -79533 -84879 -50098 -30840 -24937 -33192 -33075 -9709 3411 8148 -11115
7192a1115k5191m0489J5750P169L4041K7910L055j2200j3066P587j3646j542J6111
$$ -11115 -36306 -76795 -61045 -53876 -19835 8075 11130 -1070 -14136 -6549 -20195 -21737 -5626
7179e626J5164J1503k0249j3145K369l9322k602L4058N6795q178k134l47l1542
$$ -5626 9538 21041 792 -12353 -9984 -49306 -51908 -17850 38945 30767 28633 28286 -3256
7166c256l1881j0458K6275J9838m036p034k4240K0876L182K3998R291j6961k1505
$$ -3256 -35137 -45595 -19320 518 -3518 -10552 -34792 -13916 -10734 13264 22555 5594 -15911
7153a5911J0924l624p076K2789R910j3542j1939P972m727N344m419l969k2696
$$ -15911 -4987 -8611 -15687 7102 17012 3470 -8469 -497 -5224 120 -4299 -8268 -30964
7140c0964k2813K1550L9795J1815k3774k6415N353j9201L5M256J1689o413o786
$$ -30964 -53777 -32227 7568 19383 -4391 -30806 -25453 -44654 -44619 -40363 -28674 -35087 -41873
7127d1873K0535J3303j0421j1484L0364j559J7692L673r790j2777j6793j3505
$$ -41873 -21338 -8035 -18456 -29940 424 -1135 16557 20230 10440 -2337 -19130 -32635
7115c2635J8197M388K701j4236k1446n889J4539J6095J5418N28q325k5810p811
$$ -32635 -14438 -10050 -7349 -21585 -43031 -48920 -34381 -18286 -2868 -2340 -10665 -36475 -44286
7102d4286K9754r76k0660J5428J5743N374j3132J5872J5177j8704j2837Q75K5204
$$ -44286 -14532 -15508 -36168 -20740 -4997 377 -12755 3117 18294 -410 -13247 -12372 12832
7089A2832L0l7331L476j4582j0498m192L715L023j805q998J5811M2609K9691J7883
$$ 12832 12862 -24469 -20993 -35575 -46073 -50265 -46550 -43527 -45332 -54330 -38519 4090 33781 51664
7075E1664n33k1013j7358J9981N175j5944L594J3655J4592k9696l3343j3128J4992
$$ 51664 51131 30118 12760 32741 37916 21972 25566 39221 53813 24117 -9226 -22354 -7362
7062g362M2749N193j2381k4120O261k2364J5924K0322k1617m2073j7112L2073
$$ -7362 35387 40580 28199 4079 10340 -12024 3900 24222 2605 -39468 -56580 -24507
7050b4507L0424n756k8759J3850L2899k0330K3800j604J0998M709q2548l3105
$$ -24507 5917 161 -28598 -14748 18151 -2179 21621 20017 31015 35724 -46824 -79929
7038g9929k6937K5001J1623P860L5333k747k4498J3788J2484J7388K0774K5198
$$ -79929 -106866 -81865 -70242 -62382 -27049 -29796 -54294 -40506 -28022 -10634 10140 35338
7026C5338o371l5057k8339O780L3679N346j3256j1821n36N776j6179l5141J8226
$$ 35338 28967 -6090 -34429 -27649 6030 11376 -1880 -13701 -14237 -8461 -24640 -59781 -41555
7013d1555K4839j407l413p091K444j3220l696k7779k9340r423M5940L0406J1616
$$ -41555 -16716 -18123 -21536 -28627 -26183 -39403 -43099 -70878 -100218 -109641 -63701 -33295 -21679
7000b1679o319K9049j0771J46L1255K526j8480k6857j9580q990j3083o336M0797
$$ -21679 -27998 1051 -9720 -9574 21681 24207 5727 -21130 -40710 -49700 -62783 -69119 -28322
6987b8322J1726M6k24r71M87k1575l709J0029q362J654J274R500L635Q162J3562
$$ -28322 -16596 -16550 -16774 -17745 -17258 -38833 -42542 -32513 -40875 -39221 -37947 -28447 -24812 -16650 -3088
6972c088o575O822o439M533P018k9137k028M686j3560K8244R514Q386p557j4197
$$ -3088 -9663 -2841 -9280 -4747 2271 -26866 -28894 -24208 -37768 -9524 -10 8376 819 -13378
6958a3378J6247K0426K049l9883m605L0061q177p371j6017j364p7j4024O108J1695
$$ -13378 2869 23295 25344 -14539 -19144 10917 2740 -4631 -20648 -22012 -22089 -36113 -30005 -18310
6944a8310J0734K1365k4465l7984l4012J7756L1011J9722J6599j7781q103k4778
$$ -18310 -7576 13789 -10676 -48660 -82672 -64916 -33905 -14183 2416 -15365 -23468 -48246
6932d8246j5915l922L5192j8838q358J4158J5286K0467J3784q139J4535k5618
$$ -48246 -64161 -68083 -32891 -51729 -60087 -45929 -30643 -10176 3608 -4531 10004 -15614
6920a5614j8685L1076K1620M091m270J827o976Q348j4234l5779l0384J1179J0359
$$ -15614 -34299 -3223 18397 22488 18218 20045 13069 21417 7183 -28596 -58980 -47801 -37442
6907c7442R599j0268o95k5408J3833K9963Q41m353k670N276J6176K1761P719J8941
$$ -37442 -27843 -38111 -38806 -64214 -50381 -20418 -19577 -23930 -26600 -21324 -5148 16613 24332 43273
6893D3273k65m3723k9511n402K065l394J1962L1221K822j3109P098J0634K2900
$$ 43273 43008 -715 -30226 -35628 -33563 -36957 -24995 6226 9048 -4061 3037 13671 36571
6880C6571L0119m5234k0817Q075q7K3408q920k9466j9186J2781n367K0584n7K1899
$$ 36571 66690 21456 639 8714 8627 32035 23115 -6351 -25537 -12756 -18123 2461 2404 24303
6866B4303o124J8097k265m2447m4914J4740J3599K0593R443Q939J7048r842k4842
$$ 24303 18179 36276 34011 -8436 -53350 -38610 -25011 -4418 5025 13964 31012 21170 -3672
6853c672j2368j5262j8200J3035K3017k2287j7026J9375J2547k5273j2886K7958
$$ -3672 -16040 -31302 -49502 -36467 -13450 -35737 -52763 -33388 -20841 -46114 -59000 -31042
6841c1042O816o768N750J1408M590j1933q859L6886j7453k7237M0771K9797p496
$$ -31042 -24226 -30994 -25244 -13836 -9246 -21179 -30038 6848 -10605 -37842 2929 32726 25230
6828B5230j1446L388J629j0714l0156L6712J4175j8524R603p273L511J0739Q580
$$ 25230 13784 17172 18801 8087 -22069 14643 28818 10294 19897 12624 16135 26874 35454
6815C5454j1135j7678k5997k1360j1781J5220L2727J3452j399n430J6170J3571
$$ 35454 24319 6641 -19356 -40716 -52497 -37277 -4550 8902 7503 2073 18243 31814
6803C1814K0805l0097m0513L875L652l2979j2366Q802J4834n107J5742J162K1639
$$ 31814 52619 22522 -17991 -14116 -10464 -43443 -55809 -47007 -32173 -37280 -21538 -20376 1263
6790A263L5225J7719q752m2065m4236O760Q45r677J8124J808k503J3029K1096
$$ 1263 36488 54207 45455 3390 -40846 -34086 -33241 -42918 -24794 -22986 -25489 -12460 8636
6777H636q148j4963K6603k0503j2625L3661J4077n477r763J3158j6359J8608L7198
$$ 8636 488 -14475 12128 -8375 -21000 12661 26738 21261 11498 24656 8297 26905 64103
6764F4103j3909j1827q677k9553k606J7246R253j743R202k4625l7012j6081J9869
$$ 64103 50194 38367 29690 137 -2469 14777 24030 22287 31489 6864 -30148 -46229 -26360
6751b6360M8521j0526n963J8874k1706r779J4568K5011m88P997j2382k5627j5429
$$ -26360 22161 11635 5672 24546 2840 -6939 7629 32640 32152 40149 27767 2140 -13289
6738a3289j6081K2046L2894k872q254k6846k9507R538j6464m204M5479M3086j1927
$$ -13289 -29370 -7324 25570 22698 14444 -12402 -41909 -32371 -48835 -53039 -7560 35526 23599
6725B3599j7285k9087K355K2078J989j339j5631K0663J6228J1574m725k5944k8891
$$ 23599 6314 -22773 -20418 1660 3649 2310 -13321 7342 23570 35144 30419 4475 -24416
6712b4416K5206L3779r979l0982r984K0268o540m51J6635Q533r01n180j608O109
$$ -24416 790 34569 24590 -6392 -16376 3892 -2648 -3099 13536 22069 21168 15988 14380 20489
6698B0489r933O260j5945p486j7540J868K362K6856J6189j291L795J0311J71j1663
$$ 20489 10556 16816 871 -6615 -24155 -22287 -19925 6931 23120 21829 25624 35935 36106 24443
6684B4443n601j3230j952j9373K126L38j711n94j3542j0765L909L2626j9111q430
$$ 24443 18842 5612 3660 -15713 -13587 -13249 -14960 -15554 -29096 -39861 -35952 -3326 -22437 -30867
$$ [...]
##END NTUPLES=NMR SPECTRUM
##END=
