##TITLE=Analysis number 320660
Compound Code cc 42201
Book Reference 458/160
Project Code adrs
Chemist Name stevem
##JCAMPDX= 6.0         $$ Bruker NMR JCAMP-DX V2.0
##DATA TYPE= NMR SPECTRUM
##DATA CLASS= NTUPLES
##ORIGIN= Bruker BioSpin GmbH
##OWNER= nmr
$$ XWIN-NMR		Version 3.5
$$ Tue Jul  4 13:50:45 2006 GMT Daylight Time (UT+1h)  MAYBRIDGE\nmr@NMR_250MHZ
##.OBSERVE FREQUENCY= 250.131544655141
##.OBSERVE NUCLEUS= ^1H
##.ACQUISITION MODE= SIMULTANEOUS (DQD)
##.ACQUISITION SCHEME= undefined
##.AVERAGES= 16
##.DIGITISER RES= 18
##SPECTROMETER/DATA SYSTEM= dpx250
##.PULSE SEQUENCE= zg30
##.SOLVENT NAME= DMSO
##.SHIFT REFERENCE= (INTERNAL, DMSO, 0, 16.522)
##AUDIT TRAIL= $$ (NUMBER, WHEN, WHO, WHERE, WHAT)
$$ ##TITLE= Audit trail, XWIN-NMR		Version 3.5
$$ ##JCAMPDX= 5.01
$$ ##ORIGIN= Bruker BioSpin GmbH
$$ ##OWNER= nmr
$$ C:\u/data/dgb/nmr/ADRS/2280/pdata/1/auditp.txt
$$ ##AUDIT TRAIL=  $$ (NUMBER, WHEN, WHO, WHERE, WHAT)
(   1,<2006-07-04 13:50:05.16 +100>,<MAYBRIDGE\nmr>,<NMR_250MHZ>,
      <created by zg, POWCHK disabled, PULCHK disabled
       configuration hash MD5:
       E2 DF 36 D8 04 B2 41 60 5A D7 A3 38 5A 4B D0 FE
       data hash MD5: 64K
       98 03 6B F1 3E AD C6 CB 46 85 6A 00 0C FB BD A7>)
(   2,<2006-07-04 13:50:28.58 +100>,<MAYBRIDGE\nmr>,<NMR_250MHZ>,
      <Start of raw data processing
       ef LB = 0.3 FT_mod = 6 PKNL = 1 SI = 32K 
       data hash MD5: 32K
       25 5F A1 F3 4D C0 C4 53 C4 55 7F 33 FC C8 44 A0>)
(   3,<2006-07-04 13:50:33.49 +100>,<MAYBRIDGE\nmr>,<NMR_250MHZ>,
      <apk 
       data hash MD5: 32K
       B0 6D AC 79 62 19 22 81 7B CD 28 C3 8A 6F 9C D7>)
(   4,<2006-07-04 13:50:34.78 +100>,<MAYBRIDGE\nmr>,<NMR_250MHZ>,
      <abs ABSG = 5 
       data hash MD5: 32K
       85 E6 06 49 52 C0 E3 B3 C7 58 68 16 0A 50 98 88>)
$$ ##END=
$$ 
$$ hash MD5
$$ 7C F7 2A 20 E4 9E 26 76 E7 84 94 38 01 56 64 D4
##$RELAX= 
##$RELAX= 
##$RELAX= 
##$RELAX= 
##$RELAX= 
##$RELAX= 
##$RELAX= 
$$ Bruker specific parameters
$$ --------------------------
##$DU= <C:\u>
##$EXPNO= 2280
##$NAME= <ADRS>
##$PROCNO= 1
##$TYPE= <nmr>
##$USER= <dgb>
##$AMP= (0..31)
100 100 100 100 100 100 100 100 100 100 100 100 100 100 100 100 100 100 
100 100 100 100 100 100 100 100 100 100 100 100 100 100 
##$AQSEQ= 0
##$AQ_mod= 3
##$AUNM= <au_zg>
##$AUTOPOS= <34 >
##$BF1= 250.13
##$BF2= 250.13
##$BF3= 250.13
##$BF4= 250.13
##$BF5= 500.13
##$BF6= 500.13
##$BF7= 500.13
##$BF8= 500.13
##$BYTORDA= 1
##$CFDGTYP= 0
##$CFRGTYP= 5
##$CHEMSTR= <none>
##$CNST= (0..31)
1 1 145 1 1 1 1 1 1 1 1 1 1 1 1 1 1 1 1 1 1 1 1 1 1 1 1 1 1 1 1 1 
##$CPDPRG= <>
##$CPDPRG1= <>
##$CPDPRG2= <>
##$CPDPRG3= <>
##$CPDPRG4= <mlev>
##$CPDPRG5= <mlev>
##$CPDPRG6= <mlev>
##$CPDPRG7= <mlev>
##$CPDPRG8= <mlev>
##$CPDPRGB= <>
##$CPDPRGT= <>
##$D= (0..31)
0 1 0 0 0 0 0 0 0 0.06 0 0 0 0 0 0 0.0002 0 0 0 0 0 0 0 0 0 0 0 0 0 0 
0 
##$DATE= 1152017404
##$DBL= (0..7)
120 120 120 120 120 120 120 120 
##$DBP= (0..7)
150 150 150 150 150 150 150 150 
##$DBP07= 0
##$DBPNAM0= <>
##$DBPNAM1= <>
$$ [...]
##$SUBNAM7= <"">
##$SUBNAM8= <"">
##$SUBNAM9= <"">
##$SW= 20.6930455092707
##$SWIBOX= (0..15)
0 0 3 0 0 0 0 0 0 0 0 0 0 0 0 0 
##$SW_h= 5175.983436853
##$TD= 65536
##$TD0= 1
##$TE= 296.16
##$TE2= 300
##$TE3= 300
##$TEG= 300
##$TL= (0..7)
0 120 120 120 120 120 120 120 
##$TP= (0..7)
150 150 150 150 150 150 150 150 
##$TP07= 0
##$TPNAME0= <>
##$TPNAME1= <>
##$TPNAME2= <>
##$TPNAME3= <>
##$TPNAME4= <>
##$TPNAME5= <>
##$TPNAME6= <>
##$TPNAME7= <>
##$TPOAL= (0..7)
0.5 0.5 0.5 0.5 0.5 0.5 0.5 0.5 
##$TPOFFS= (0..7)
0 0 0 0 0 0 0 0 
##$TUNHIN= 0
##$TUNHOUT= 0
##$TUNXOUT= 0
##$USERA1= <user>
##$USERA2= <user>
##$USERA3= <user>
##$USERA4= <user>
##$USERA5= <user>
##$V9= 5
##$VALIST= <valist>
##$VCLIST= <CCCCCCCCCCCCCCC>
##$VD= 0
##$VDLIST= <DDDDDDDDDDDDDDD>
##$VPLIST= <PPPPPPPPPPPPPPP>
##$VTLIST= <TTTTTTTTTTTTTTT>
##$WBST= 1024
##$WBSW= 4
##$XGAIN= (0..3)
0 0 0 0 
##$XL= 0
##$YL= 0
##$YMAX_a= 321155
##$YMIN_a= -469585
##$ZGOPTNS= <>
##$ZL1= 120
##$ZL2= 120
##$ZL3= 120
##$ZL4= 120
##$ABSF1= 16.522
##$ABSF2= -4.171173
##$ABSG= 5
##$ABSL= 3
##$ALPHA= 0
##$AQORDER= 0
##$ASSFAC= 0
##$ASSFACI= 0
##$ASSFACX= 0
##$ASSWID= 0
##$AUNMP= <proc_1d>
##$AZFE= 0.1
##$AZFW= 0.1
##$BCFW= 0
##$BC_mod= 0
##$BYTORDP= 0
##$COROFFS= 0
##$CY= 12.5
##$DATMOD= 1
##$DC= 0
##$DFILT= <>
##$DTYPP= 0
##$F1P= 14.0000005364418
##$F2P= -0.99999901652339
##$FCOR= 0.5
##$FTSIZE= 32768
##$FT_mod= 6
##$GAMMA= 0
##$GB= 0
##$INTBC= 1
##$INTSCL= 1
##$ISEN= 128
##$LB= 0.3
##$LEV0= 0
##$LPBIN= 0
##$MAXI= 10000
##$MC2= 0
##$MEAN= 0
##$ME_mod= 0
##$MI= 0
##$NCOEF= 0
##$NC_proc= -4
##$NLEV= 6
##$NOISF1= 0
##$NOISF2= 0
##$NSP= 0
##$NTH_PI= 0
##$NZP= 0
##$OFFSET= 16.522
##$PC= 1
##$PHC0= 158.0023
##$PHC1= 7.257633
##$PH_mod= 1
##$PKNL= yes
##$PPARMOD= 0
##$PSCAL= 4
##$PSIGN= 0
##$REVERSE= no
##$SF= 250.13
##$SI= 32768
##$SIGF1= 0
##$SIGF2= 0
##$SINO= 400
##$SIOLD= 32768
##$SREGLST= <1H.DMSO>
##$SSB= 0
##$STSI= 32768
##$STSR= 0
##$SW_p= 5175.98343685301
##$SYMM= 0
##$S_DEV= 0
##$TDeff= 65536
##$TDoff= 0
##$TI= <Analysis number 999999
Compound Code 99
Book Reference 9
Project Code 9>
##$TILT= no
##$TM1= 0
##$TM2= 0
##$TOPLEV= 0
##$USERP1= <user>
##$USERP2= <user>
##$USERP3= <user>
##$USERP4= <user>
##$USERP5= <user>
##$WDW= 1
##$XDIM= 32768
##$YMAX_p= 492395686
##$YMIN_p= -335163
$$ End of Bruker specific parameters
$$ ---------------------------------
##NTUPLES= NMR SPECTRUM
##VAR_NAME=  FREQUENCY,     SPECTRUM/REAL,   SPECTRUM/IMAG
##SYMBOL=    X,             R,               I
##VAR_TYPE=  INDEPENDENT,   DEPENDENT,       DEPENDENT
##VAR_FORM=  AFFN,          ASDF,            ASDF
##VAR_DIM=   32768,         32768,           32768
##UNITS=     HZ,            ARBITRARY UNITS, ARBITRARY UNITS
##FACTOR=    0.157963299565203, 1,           1
##FIRST=     4132.6476996994, 0,             0
##LAST=      -1043.33573715361, 0,           0
##MIN=       -1043.33573715361, -335163,     0
##MAX=       4132.6476996994, 492395686,     0
$$ Real data points
##PAGE= N=1
##DATA TABLE= (X++(R..R)), XYDATA
$$ [...]
16468A21776l1885J1841j0877p217q060l7425l5164J2788P751k9818k7149L1355
16456b084J242j1463j3372O0669Q9082n2788m1931l1176p5570N1159L2927k1794
16444a5099P4819L9178J627j6575k3311N6279j5033j09239l4312J19069O0684
16433A38087j07644j7272j7071j4252L5485o8020j447l2609p478j6369N8531N8128
16421H069k9015j1100j9184L7439J53270n5666p924K976o2143l2446n8323O9671
16409d376N4978q7288m7396M7661J30123M1813J0820l6705r7712p2930K3856M259
16397c2897l1030J1149P1548j4259Q907o6956j526K9980k110l1636m2866p4018
16385a75714P0818P8119p7873k7300M0800j8878j6887j0445N1105k8734j8356
$$ plain form
16468 121776 89891 101732 90855 83638 75578 38153 2989 15777 23528 -6290 -33439 -2084
16456 -2084 -842 -12305 -25677 34992 124074 71286 29355 -1821 -77391 -26232 6695 -15099
16444 -15099 59720 98898 100525 83950 60639 116918 101885 -7354 -41666 77403 138087
16433 138087 30443 13171 -3900 -18152 17333 -50687 -52134 -84743 -92221 -108590 -50059 8069
16421 8069 -20946 -32046 -51230 -13791 139479 83813 75889 78865 16722 -15724 -74047 -4376
16409 -4376 50602 -36686 -84082 -36421 93702 135515 146335 109630 11918 -61012 -37156 -32897
16397 -32897 -63927 -52778 18770 4511 13418 -53538 -55064 -25084 -27194 -58830 -101696 -175714
16385 -175714 -104896 -26777 -104650 -131950 -91150 -110028 -126915 -137360 -86255 -114989 -133345
16374a33345R5387O5707J7504l1480Q8220J7023o5156m0339m5777l5035k2682
16363h9973J0531r147r630l1534L7904K9666K1356o813P388j1834P7678O063L8308
16350F9963l755J8729j1006K4266N2755J5587j39290m3693n7978J8361M5093j7698
16338b8666k5927M0592L8188L2802N1739n2379k8519P801n2017N1064n1505k319
16326a9146R2049q145r6168m9p1378M1928O7154J5827m3602n6914M2553K6835
16314i056J7106N0771J0407L0478J6827K4565p9674n7064K3161m8647p903o5998
16302i5027O1878q718P3812k1109l5345N3542o9374k9997p937j2330K2701L3601
16290c4303L1257K1369k3640M8433P7556q661m2195j14342j6881N3044l5280m3432
$$ plain form
16374 -133345 -37958 27749 45253 13773 101993 119016 53860 13521 -32256 -67291 -89973
16363 -89973 -79442 -88589 -98219 -129753 -91849 -62183 -40827 -47640 -40252 -52086 25592 31655 69963
16350 69963 66208 84937 73931 98197 150952 166539 27249 -16444 -74422 -56061 -10968 -28666
16338 -28666 -54593 -14001 24187 56989 108728 56349 27830 35631 -16386 34678 -16827 -19146
16326 -19146 72903 64758 -31410 -31459 -102837 -60909 6245 22072 -21530 -78444 -35891 -9056
16314 -9056 8050 58821 69228 99706 116533 141098 61424 4360 27521 -21126 -29029 -95027
16302 -95027 -33149 -41867 31945 10836 -24509 29033 -40341 -70338 -78275 -90605 -67904 -34303
16290 -34303 -3046 18323 -5317 43116 120672 112011 69816 -44526 -61407 -8363 -43643 -87075
16278h7075J7999R0259J1080n112J04K2177j6970m7271Q5989Q1403q3671J353
16266G0265M1123j01091k5709j3912O16m0111O0872L5790o6387J1128K3662K8375
16254B4621M0989n3359P9338o524n4739r0411l995J52554j2825j16769j0478j4425
16242f6023M884j1852Q610M5756K6001n7597j1917R5320J0381m3156k3123N6892
16230C4176M8900L48j20752l9965m9110n3666L5149J7541J9116K8558o9477l4258
16218a83440n190M9381J9417k1541P1708P3162L0443n154j2801l650K2197M5701
16206H0233O5111n7481j10569m549R3257P3544J0529p7246J7541K169R470p4474
16194B7535j00580n330M0808Q4087m3173n6878J7998N2029p2576j30263J5418
$$ plain form
16278 -87075 -69076 21183 32263 27151 27255 49432 32462 -14809 71180 152583 68912 70265
16266 70265 111388 10297 -15412 -29324 -28708 -68819 -7947 27843 -38544 -27416 -3754 24621
16254 24621 65610 12251 91589 85065 30326 -60085 -64080 88474 75649 -41120 -51598 -66023
16242 -66023 -61139 -72991 -64381 -18625 7376 -50221 -62138 33182 43563 407 -22716 34176
16230 34176 83076 83424 -37328 -77293 -126403 -180069 -144920 -127379 -108263 -79705 -149182 -183440
16218 -183440 -188630 -139249 -119832 -141373 -69665 3497 33940 28786 15985 12335 34532 80233
16206 80233 145344 87863 -22706 -27255 66002 139546 150075 72829 90370 92539 102009 27535
16194 27535 -73045 -78375 -37567 46520 3347 -53531 -35533 16496 -56080 -186343 -170925
16183a70925O973j751N1967M1671N6822O2915o7104J1517j2380O07M3451P042
16171C0805q907K9484j5902r2471j5721l7294l8358O0727J6419j5882J3397N4925
16159a8778N6815l6786q3169M2536k7671k3493m9018l6489n2839N9777J21129
16148d7986N7856O1396J4878j08810l8629L77k2039R8927N839M1669K637m3027
16136B3088p7650k2980K2002L5594P5152l186k8163k0375j9799M343K811J1684
16124B521J3596m4937p7911J4225M6367J04068N0770m3706m2777N865j740M6100
16112G2441L5237M7924l9845q5131r2721M8806j2633L1088K7021K9208l1096q5749
16100e5450l7149P9261N4511J1634K752M3054o1675j8034l8816L3740m747l5930
$$ plain form
16183 -170925 -163952 -165703 -113736 -72065 -15243 47672 -19432 -7915 -20295 -19688 23763 30805
16171 30805 21898 51382 35480 -56991 -72712 -110006 -148364 -87637 -71218 -87100 -73703 -18778
16159 -18778 38037 1251 -81918 -39382 -67053 -90546 -139564 -176053 -228892 -169115 -47986
16148 -47986 9870 71266 86144 -22666 -61295 -60918 -82957 15970 21809 63478 66115 23088
16136 23088 -54562 -77542 -55540 -19946 55206 52020 23857 3482 -16317 -11974 -9163 2521
16124 2521 16117 -28820 -106731 -92506 -46139 57929 108699 64993 22216 28081 26341 72441
16112 72441 107678 155602 115757 30626 -62095 -13289 -25922 5166 32187 61395 30299 -55450
16100 -55450 -92599 -13338 41173 52807 55559 98613 36938 18904 -19912 13828 9081 -26849
16088b6849n4719m4158k1838m407k2651Q540l0514J12674l3123l2022M3839J20055
16076A4827L9816M5913K5335p7242n9972M095M2283K7253k7699m2320J0222N6310
16064E8821o495m0622L8478K0661M979P157O3074j5264j13969o7428J9820Q2057
16052E1269J0841j02831p0922k2979J9218P7838m983R72R9400j2003j2272L9493
16040G3041j29392k1255L4862J6991j9337J1866N92o4773l1693j1661O7143J6372
16028e7244N5592p0207m8630j0025P151l5875l3277J22860Q0122P91j0744L25
16016H39Q0775O4564k5131j73186n9898k0728M3451Q3032M2627n3357p3505Q5052
16004e465M3432M1763j2278o1702j7514K1868R621k1212k3709K497P831M3938
$$ plain form
16088 -26849 -81568 -125726 -147564 -151971 -174622 -166082 -196596 -83922 -117045 -149067 -105228 14827
16076 14827 54643 100556 125891 48649 -11323 -7228 35055 62308 34609 -7711 2511 58821
16064 58821 52326 11704 50182 70843 75822 82979 146053 130789 16820 -50608 -30788 51269
16052 51269 62110 -40721 -111643 -134622 -115404 -37566 -42549 -41577 57823 45820 33548 73041
16040 73041 -56351 -77606 -42744 -25753 -45090 -33224 -32632 -97405 -129098 -140759 -73616 -57244
16028 -57244 -1652 -71859 -120489 -130514 -123363 -159238 -192515 -69655 10467 11258 514 839
16016 839 81614 146178 121047 -52139 -112037 -132765 -89314 -6282 36345 -17012 -90517 -5465
16004 -5465 37967 79730 67452 5750 -11764 10104 19725 -1487 -25196 -22699 -14868 29070
15992B9070j6350O6775k9125r3914M278k1560M3328k6541R596L2444M2101o37
15980C9465p0241o0869k0332O3913J36045L9658k8190m7182q8596m7826K3776
15969f0379N0983J2032j665o9797n947R2644N5594l3402j5986j2355N9978n6370
15957A5330k4723n0858L9535j8680l6685j6899j2468M8414n5856K5577Q5964J6509
15945A5160n1677M6433l3462l150n3943q656P7851K9664j4013j0725p2536m4743
15933a23797m8503M0894M4506j8566Q6255j2045K1387l804l6032j3637n5018l3389
15921a51749m0003K6252M1575N3066O0185J2912l9827k4675j3725L1553k0799
15910f5235k2061k84P0172N3667n7598k3566J04263L7077q6397p9261L3235J2621
$$ plain form
15992 29070 12720 79495 50370 -43544 -39266 -60826 -17498 -44039 -34443 -1999 40102 39465
15980 39465 -30776 -91645 -111977 -48064 87981 127639 99449 52267 -36329 -84155 -60379
15969 -60379 -9396 2636 971 -68826 -74773 17871 73465 40063 24077 11722 71700 15330
15957 15330 -9393 -60251 -20716 -39396 -76081 -92980 -105448 -57034 -112890 -87313 -1349 15160
15945 15160 -36517 9916 -23546 -26696 -80639 -89295 -11444 18220 4207 -6518 -79054 -123797
15933 -123797 -172300 -131406 -86900 -105466 -19211 -31256 -9869 -13673 -49705 -63342 -118360 -151749
15921 -151749 -191752 -165500 -123925 -70859 -10674 2238 -37589 -62264 -75989 -44436 -65235
15910 -65235 -87296 -87580 -17408 36259 -21339 -44905 59358 96435 10038 -69223 -35988 -23367
15898b3367j2506N9556N3715r4768o8535N1196R9916p544j1429n7073o2465k3579
15886i6883Q6176L6790m0402l3585n3998N2606N2170r3698j01072k8130J6454
15875b03572J64569J08671N677j2616N6092j9053l4868j9920j27540m4834M513
15864a22881p922P5773O5716N7865k2412j69451n188k8109j4330J51781M0458
15853B1300P259J4873l2695m2807j90K0701m7617K2970M379M4847M2764J5132
15841G0916r8335j5698J1012J9620l4846n1260N7841K9736m3337Q5943M4989n2155
15829B4426l1188m6184N5435N326k9841l7742j0189k9217p253q137J1477K1687
15817h1400P7598L1410j8015J4466K9614M5827l1282K439l4147l6759n3109j6673
$$ plain form
15898 -23367 -35873 23683 77398 -17370 -85905 -34709 65207 57663 46234 -10839 -73304 -96883
15886 -96883 -10707 26083 -14319 -47904 -101902 -49296 2874 -90824 -191896 -220026 -203572
15875 -203572 -39003 69668 75345 62729 118821 99768 64900 44980 -82560 -127394 -122881
15864 -122881 -130803 -55030 10686 68551 46139 -123312 -128500 -156609 -170939 -19158 21300
15853 21300 28559 43432 10737 -32070 -32260 -11559 -59176 -36206 -31827 13020 55784 70916
15841 70916 -27419 -43117 -32105 -12485 -47331 -98591 -40750 -11014 -54351 31592 76581 24426
15829 24426 -6762 -52946 2489 7815 -22026 -59768 -69957 -99174 -106427 -114564 -103087 -81400
15817 -81400 -3802 27608 9593 24059 53673 99500 68218 70657 36510 -249 -53358 -70031
15805g0031o887L153N5928J13455J7208o9717j09845M1936N3514p201N064K7738
15793E4315j7287j1264p5952R021P3248O0786O4680o8865j74822o5676M2552L960
15781a05304l0618P72M3759J29040j2736k6020o8789l2469J6240K0721J464l3805
15769i7745K1914K5705o8604q5836P5947J45226R1147j13262n8079q8245J1450
15758a40382N7357k3846P5334M9926N3584n1585K7101r9566j4993r7326o2149
15747b26545R5541J54216M9533m3122n2671R3114L5978K7517J1674K5417L0823
15736B01475K2367j47537J2545K4353m2439n9217l3835k0105N7372L5969K9218
15725H0166Q6678q6400m2928N032O7317o703j03703L122L5099O2923l5959l253
$$ plain form
15805 -70031 -76918 -73765 -17837 95618 112826 43109 -66736 -24800 28714 21513 26577 54315
15793 54315 37028 25764 -50188 -41167 32081 92867 157547 88682 -86140 -151816 -109264 -105304
15781 -105304 -135922 -135150 -91391 37649 24913 -1107 -69896 -102365 -86125 -65404 -63940 -97745
15769 -97745 -75831 -50126 -118730 -204566 -128619 16607 107754 -5508 -63587 -151832 -140382
15758 -140382 -83025 -106871 -31537 18389 71973 20388 47489 -52077 -67070 -164396 -226545
15747 -226545 -131004 23212 72745 29623 -23048 70066 106044 133561 145235 170652 201475
15736 201475 223842 76305 88850 113203 70764 11547 -22288 -42393 14979 50948 80166
15725 80166 166844 80444 37516 42548 109865 103162 -541 2581 37680 100603 64644 61391
15713F1391l7204l0595j1600k6127r2960L06l7246J1352L9645l064N8631L7853
15701b9618Q7006K4490p1172J9296J4642j5080m6462N5450K8986n266o4363r6971
15689i9062L3061J70462P5231k4853m9605q6622j4366J2509R326P3775r279j5429
15677G5148m7376n3174m9514p889J05926O613n1362K5746L6030k0036K2656l4998
15665G770k2662l8842L599p680m3329o841n190N0679P3501j2144L4501m8257m5699
15652f0594M2085P8169p937j20995K1802L5925Q4248m9815Q2661Q7524j21815
15641G1258q9369k9075N7621K8360Q0355n050m6816N9626k9290l9534N054Q963
15629G2103j0538o9825M9418R368L6044K2883k5758K3015k3412k1689o945k172
$$ plain form
15713 61391 24187 -6408 -18008 -44135 -137095 -136789 -174035 -162683 -123038 -126102 -67471 -29618
15701 -29618 57388 81878 10706 30002 44644 29564 -16898 38552 67538 62272 -2091 -99062
15689 -99062 -66001 104461 179692 154839 105234 18612 4246 16755 26081 99856 90577 75148
15677 75148 27772 -25402 -74916 -82805 23121 29734 -21628 4118 40148 20112 42768 7770
15665 7770 -14892 -53734 -50135 -57815 -101144 -107985 -113175 -62496 11005 -1139 33362 -14895 -60594
15652 -60594 -18509 59660 51723 -69272 -47470 -11545 72703 22888 105549 193073 71258
15641 71258 -18111 -47186 10435 38795 119150 114100 67284 126910 97620 58086 63140 72103
15629 72103 61565 -8260 41158 50526 86570 109453 83695 106710 83298 61609 54664 52492
15617E2492K1334O6348Q6016n2596j05628J919q527k79n4131k7844J0804k3774
15605c3866n9583j8403J01186J32735P1488j02462j67089k3899J19502Q6246m4496
15594F1359l626N719q2957k8297r2029nJ20685J5282n378K9909L0408K9110l2050
15581D8130K1309k2527j22378j2910k7234P2401L8632n5987L3957r840k8698L9139
15569b6006k960N4222K2483m675L5366j5315L2937J3029q4529o22L96L7835J8485
15556H0646R5721k4450M0680q842q5544k8300l9164l2292O499L0890j8647k1568
15544d371l2950n5112J4559M7955J3144k8368l6653K9854M9494m3624n6204Q4307
15532a7969J11487k331q0073Q887O897O275m2294k9702O3822K9597L2617l6296
$$ plain form
15617 52492 73826 140174 226190 173594 67966 69885 61358 61079 6948 -20896 -10092 -33866
15605 -33866 -93449 -111852 -10666 122069 193557 91095 -75994 -99893 19609 105855 61359
15594 61359 57733 63452 -19505 -47802 -139831 -139836 -19151 -3869 -9247 20662 51070 80180 48130
15581 48130 69439 46912 -75466 -88376 -115610 -43209 -4577 -60564 -26607 -36447 -65145 -26006
15569 -26006 -28966 25256 47739 43064 78430 63115 96052 109081 24552 23930 24326 62161 80646
15556 80646 176367 151917 192597 183755 98211 69911 30747 -1545 4954 35844 17197 -4371
15544 -4371 -37321 -92433 -77874 -29919 -16775 -45143 -81796 -51942 -2448 -46072 -102276 -17969
15532 -17969 93518 91187 11114 20001 26898 33173 -9121 -38823 24999 54596 87213 50917
15520E0917p5567N6507O9260n8507L2460m2505l0611J8746n2190N1217Q0467K6239
15508A26433l0488m6373n9153N2896J5753n4940J7795J3619j4966M498k7856N687
15496B905K7485r526j5850l0495N5326L9074j9246p1626n7393l4725j7187l454
15484a34712P3098L4303Q120L1313L2765J1399N282o6253l2948R175o280K2054
15472a2684j3681k2502j0917M6277K5380j1852J5561N4357m2059p2159r2001l2870
15460a69150q16L9168Q3224l1056L3041L7259L3525K7819j6390q576L1104k6568
15448C2584j4471Q7877L0815p7647o9591J13919O1586j55102p5080j4348L8665
15437d0793o2507j15426J36571P1411j5795n7570P2129O8273k6187q8703N4190
$$ plain form
15520 50917 -24650 31857 101117 42610 75070 32565 1954 20700 -31490 19727 100194 126433
15508 126433 95945 49572 -9581 43315 59068 4128 21923 35542 20576 25074 -2782 2905
15496 2905 30390 20864 5014 -25481 29845 68919 49673 -21953 -79346 -114071 -131258 -134712
15484 -134712 -61614 -27311 -19191 12122 44887 56286 61568 -4685 -37633 -28458 -34738 -12684
15472 -12684 -26365 -48867 -59784 -13507 11873 21 15582 69939 27880 -44279 -136280 -169150
15460 -169150 -169966 -130798 -47574 -78630 -45589 -8330 25195 53014 36624 28048 59152 32584
15448 32584 18113 105990 136805 59158 -10433 103486 165072 9970 -65110 -79458 -40793
15437 -40793 -103300 -218726 -82155 -10744 -26539 -84109 -11980 56293 30106 -58597 -4407
15426d407q0097K6832p7384m7757J5512L419J15496M5047j3283j3480j805M5228
15414A3321P2942Q918L3680N0775l8067k2397l6855m7914l2045k5053O4694O1767
15402A03766J2028l6932k5499O0260o70l6331j3106k4096N3923N694o482n9364
15390C3191o0587p2890m6326R3043Q3776J6752K5977L8555l072R1767p1493j54236
15378b5543K9065L8157k2532l2520r8756N2293J00732O3685q729K613J5030o6594
15366D6901K5268n8628q1841r756N7866J2123K3799j553o4625l8789J1578K4467
15354e3190K260J515r530o1680K6465N6825Q7581M5006m6470l526O1640J7874
15342A24770j607r3195p1679L9789Q0246l5899j58823l5754O2716Q2779n3204
$$ plain form
15426 -4407 -84504 -57672 -135056 -182813 -167301 -163882 -48386 -3339 -16622 -30102 -31907 13321
15414 13321 86263 95181 128861 179636 141569 119172 82317 34403 2358 -22695 41999 103766
15402 103766 115794 78862 53363 113623 112953 76622 63516 39420 93343 99037 92555 33191
15390 33191 -27396 -100286 -146612 -53569 30207 46959 72936 111491 108419 200186 128693 -25543
15378 -25543 3522 41679 19147 -13373 -112129 -59836 40896 104581 95852 98465 113495 46901
15366 46901 72169 13541 -68300 -78056 -20190 -8067 15732 14179 -50446 -89235 -77657 -53190
15354 -53190 -50930 -49415 -58945 -120625 -94160 -37335 50246 95252 48782 45256 106896 124770
15342 124770 123163 29968 -41711 -1922 78324 42425 -116398 -152152 -89436 -6657 -59861
15331e9861j5528o398k9404m186k20M9020L7930k9718K9112l389k7816P9996P657
15318B7195n9690j9148m7101l0870J6090O4113K581l9928N2989j6504L1595k0570
15306c9248J9697k3599m591o109l7293q166J35651l0932j17192P0213L1251l3120
15294d3438L8220q0524m8863N727L2379P291J3348K735q5710p64J17637P4807
15282C2845l7217L3780J030k4682j2682Q5657L830l4753p5859n6673m172O8267
15270b0629k721p7010j3551L2315J8729Q7212m622j06956j12J05521L8638r430
15258D7384j7329n708Q0594m2671p0704j4405k6459j5957J7731n7166l5658N8879
15246h1469P423K0815N6655K5891Q0235p1300M633n7223o4084j6882k3096l0980
$$ plain form
15331 -59861 -75389 -81787 -111191 -115377 -115597 -66577 -28647 -58365 -29253 -32642 -60458 19538 27195
15318 27195 -32495 -51643 -98744 -129614 -113524 -49411 -46830 -86758 -33769 -50273 -18678 -39248
15306 -39248 -19551 -43150 -47741 -53850 -91143 -99309 36342 5410 -111782 -41569 -10318 -43438
15294 -43438 -5218 -85742 -134605 -128878 -96499 -89208 -75860 -73125 -158835 -159599 -41962 32845
15282 32845 -4372 29408 30438 5756 -6926 78731 82561 47808 -28051 -84724 -88896 -20629
15270 -20629 -23350 -100360 -113911 -81596 -62867 24345 19723 -87233 -87345 18176 56814 47384
15258 47384 30055 24347 104941 62270 -8434 -22839 -49298 -65255 -47524 -104690 -140348 -81469
15246 -81469 -74046 -53231 3424 29315 109550 38250 42883 -14340 -78424 -95306 -118402 -149382
15234a49382K0253M8488Q4194Q361K034J826J4073m6625p7245N6004L4127K3426
15222A9534o592R643j41016k6167k5879J123o651O3545K5436k0610N3655Q1164
15210B7185N7737l5561o3546k0934N9273Q307K0831j7340j0121O29q678o7091
15198d9309L0127J3064P4605O0544l9247p4060q0296q6168n7293K4117L6514Q0549
15186f6853K9057o6230p2279O6974J20717M9076n8810J5182J6661l430r7606L0582
15174c6959O1970O800j1701k1832l7848m9262N5242j7838N7787l3471m3705O9693
15162a124j1243M2935R873k9175J3075L5205r701Q651p858k7501q9441l2735M642
15149i4397N1700R1962p7336m8005k6729n5271O6023O774l5497O3075J8960r071
$$ plain form
15234 -149382 -129129 -80641 3553 11914 13948 15774 29847 -16778 -94023 -38019 -3892 19534
15222 19534 12942 22585 -118431 -144598 -170477 -169354 -176005 -112460 -87024 -107634 -53979 27185
15210 27185 84922 49361 -14185 -35119 24154 32461 53292 35952 25831 26460 17782 -49309
15198 -49309 -19182 -6118 68487 129031 89784 15724 -64572 -150740 -208033 -183916 -147402 -66853
15186 -66853 -37796 -104026 -176305 -109331 11386 60462 1652 16834 33495 30065 -67541 -36959
15174 -36959 25011 31811 20110 -1722 -39570 -88832 -33590 -51428 6359 -27112 -70817 -1124
15162 -1124 -12367 30568 40441 11266 24341 59546 49845 58496 50638 23137 -66304 -99039 -94397
15149 -94397 -42697 49265 -28071 -76076 -102805 -158076 -92053 -85279 -120776 -57701 -38741 -47812
15137d7812O2452K6416j8144j3922O3347J5313K1289m9913r9606m4970P7271l1545
15125c9824p0221o5763N71Q3224R6110k5869j2438k2168l2124P8334J637p8701
15113h7232L9597N1805N4348M0196k9120p0056l4931L7878l2940J4312k2820l3186
15101g2149p114l0488J0584P0396N2812J3773P1819k7720j34272L6646M2519M83
15089B7289j0421k1669j6729l4117j5256L4443k5064j0626q941M4299N7923N4754
15077G5885m9305l7781J2763K6350J469j05853j09519J1441J8463M3418P1516
15066d1153O0330O5404k4872j38304o1405m0172J27996J72779L6666j92102j1801
15055d6634K092K5578N7386L25o369r6052k4493O6527K9366k0984L2420J3012
$$ plain form
15137 -47812 14640 41056 22912 8990 72337 87650 108939 59026 -40580 -85550 -8279 -39824
15125 -39824 -110045 -175808 -175237 -92013 4097 -21772 -34210 -56378 -88502 -10168 -8531 -87232
15113 -87232 -47635 4170 58518 98714 69594 -462 -35393 2485 -30455 -16143 -38963 -72149
15101 -72149 -79263 -109751 -99167 -28771 24041 37814 109633 81913 -52359 -15713 26806 27289
15089 27289 16868 -4801 -21530 -55647 -70903 -36460 -61524 -72150 -81091 -36792 21131 75885
15077 75885 26580 -11201 1562 27912 29381 -76472 -185991 -174550 -156087 -112669 -41153
15066 -41153 19177 84581 59709 -78595 -140000 -180172 -52176 120603 157269 -34833 -46634
15055 -46634 -44542 -18964 38422 38747 32378 -63674 -88167 -21640 7726 -13258 19162 32174
15043C2174k1131n8937M159j7022j2628O4758J14056J1549q0891L9603J4001n1101
15031C8590j160K5050n5092K5810j8778o9076m4992O0902O7059N0441o3927l7250
15019b2423m898P756j0613P598K8615n60l399o284N7705l2888r2074j1600O2154
15006b0911K3522n2105L2014K9018J1305m3634n8904j0901J0981l1394j0329J16162
14994e176K8932N899q5241J3606l3547R575L3467k3385R4548K9930o7875j8590
14982a7857l4376K4640M0844N3436P4000m9055r5389j0555J9731Q136P1229m2856
14970D1928l197M7364j0000l7659K6166K3188l9044j3067j7524P6393J7195j15816
14958d073j15819J8565Q2762N6331P7260O3782K1836j21096q7608j3095K2146
$$ plain form
15043 32174 11043 -47894 -43735 -60757 -73385 -8627 105429 116978 36087 75690 89691 38590
15031 38590 37430 62480 7388 33198 14420 -54656 -99648 -38746 28313 78754 14827 -22423
15019 -22423 -27321 -19565 -30178 -22580 6035 5475 2076 -4208 53497 20609 -71465 -83065 -20911
15006 -20911 2611 -49494 -17480 11538 22843 -20791 -79695 -90596 -79615 -111009 -121338 -5176
14994 -5176 23756 29655 -55586 -41980 -75527 -65952 -32485 -55870 38678 68608 733 -17857
14982 -17857 -52233 -27593 13251 66687 140687 91632 -3757 -14312 5419 13555 84784 41928
14970 41928 38731 86095 76095 38436 64602 87790 48746 35679 18155 94548 111743 -4073
14958 -4073 -119892 -101327 -18565 37766 115026 178808 200644 79548 -8060 -21155 991
14947I91L68o78n0944p5271p7719M2413K5519J0852o0264R234M0657m510k5704
14934a65056m718J19349Q2230m4534j14880o5640K8210R5143N6327O4737o636
14923D4532m2226K2520j3642l9066L3225O1818N3397k3140k6771m1287l0744r450
14911a0834l2257M3588P3857N2238j1326j9896j6117m5349L9216L3247j02994
14900C373j6374n6212l5797O3018L1816n8837n5734K7059O7819j16789k8675L8971
14888a36362R6048J20744k5159r4018K3634N4668o3474J3285M2589o393K0022
14877D5584l7350l5530k9474L4375J37020P3864L6825m8006j27005n6457j0138
14866a6292n0003K6545R370M5009L677M3108P6745q0778L1092m478j7767J828
$$ plain form
14947 991 1359 681 -50263 -125534 -203253 -160840 -135321 -124469 -184733 -175499 -134842 -139352 -165056
14934 -165056 -169774 -50425 31805 -12729 -127609 -193249 -165039 -69896 -13569 51168 44532
14923 44532 2306 24826 11184 -27882 5343 67161 120558 97418 70647 29360 -1384 -10834
14911 -10834 -43091 497 74354 126592 115266 95370 79253 33904 73120 106367 3373
14900 3373 -13001 -69213 -105010 -41992 -10176 -69013 -124747 -97688 -29869 -146658 -175333 -136362
14888 -136362 -40314 80430 55271 -38747 -15113 39555 -23919 -10634 31955 25562 45584
14877 45584 8234 -27296 -56770 -22395 114625 188489 225314 177308 50303 -6154 -16292
14866 -16292 -66295 -39750 -30380 14629 18306 61414 138159 57381 88473 83995 66228 68056
14854F8056P0829L1600j25710M2003O7238k476n0620j27178j01734J05338O3512
14843D0858M7700K6724q9121r232O2048J0377k6120l7347q5579O161q23K9220
14831b5134k9072m8121J03478L7361m9421o1945p52k6549J16801K2280r1766O7544
14819A4704Q0470L8089O8808R320q3123j69753q4584O7347J2431q480J12214j4602
14807D2841K677o1924k6143l7813l2023k5627m1274k831Q5625N4417l1559l4419
14795a08053K7095O1991R2591o5037k8960r6407l6689N6289M0096m378q6376n9696
14783b07534L259P3184O1936P7211n4030r980j1974K946k1847J08950r438k1983
14771i300L2790J8369P6101k0123q6176o6138m5394o304k1333K6537l1138Q4785
$$ plain form
14854 68056 138885 170485 44775 86778 154016 151540 100920 -26258 -127992 -22654 40858
14843 40858 88558 115282 26161 16929 78977 89354 63234 25887 -59692 -53531 -54354 -25134
14831 -25134 -54206 -102327 1151 38512 -10909 -72854 -73606 -100155 16646 38926 -52840 14704
14819 14704 95174 133263 202071 211391 128268 -41485 -126069 -58722 -46291 -54771 57443 42841
14807 42841 45518 -16406 -42549 -80362 -112385 -138012 -179286 -182117 -96492 -42075 -73634 -108053
14795 -108053 -80958 -18967 73624 8587 -20373 -116780 -153469 -97180 -57084 -61462 -147838 -207534
14783 -207534 -204275 -131091 -69155 8056 -45974 -55954 -67928 -64982 -86829 22121 12683 -9300
14771 -9300 23490 41859 117960 97837 11661 -54477 -99871 -106175 -127508 -100971 -132109 -47324
14759d7324r259K9956Q0776q1536l9799j2450j5989M9786j3033p8519j52517P4553
14747b15355L9764K3808R0701M6965j8724M8120K4519n7531n18l9410M1710J3936
14735b015J286r529r2835J5908O9293O9836o7653l4022m9811o2971k9941J49140
14723d3314M6480m3433l9888J5983P467j1350J9793K3792P2025K238P9237q768
14711A20262l7065L7733k4007j11267j12484K7488N5920m1798n158L5177m0510
14700i5709k8631J4479M3716j624L1380k4588M5100J16576q916q8000l2813J6367
14688a2663M0087M6467n1305K6087K4612j13332p5018Q6305O9001k0262L0191
14677E0170n5845p2214k2211j7643N1779M9815k4419L6989k6056j5664M532P4998
$$ plain form
14759 -47324 -56583 -26627 54149 -27387 -67186 -79636 -95625 -45839 -58872 -137391 -289908 -215355
14747 -215355 -175591 -151783 -61082 -14117 -32841 15279 39798 -17733 -18251 -57661 -15951 -2015
14735 -2015 -729 -10258 -103093 -87185 -17892 51944 -15709 -49731 -99542 -162513 -192454 -43314
14723 -43314 3166 -40267 -80155 -64172 -56705 -68055 -48262 -24470 47555 49793 129030 120262
14711 120262 83197 120930 96923 -14344 -126828 -99340 -43420 -85218 -90376 -55199 -95709
14700 -95709 -124340 -109861 -66145 -67769 -36389 -60977 -15877 100699 91783 3783 -29030 -12663
14688 -12663 27424 73891 22586 48673 73285 -40047 -115065 -28760 40241 19979 50170
14677 50170 -5675 -77889 -100100 -117743 -65964 -16149 -40568 -3579 -29635 -45299 -40767 34231
14665C4231j0405o4656J1014P1369l6068o7010L4951N95K359K5023l543n3653
14653e5793n6033m0091k7857J8511O1114m7069p2261R0244K9792l0144n918L7149
14641i8356R477L5706j3076m1290K9339M1221n4662N9477L5243l5052l7220P897
14629f1296O1771M0321k1960o2457R837M7093K9545J2695l1815n8107k217k3619
14617f0209n1633M342J00241o9980l7891P8106K8561k8068j8147o6144L5449O9223
14605a6150l1021m5641l1569K454j1314M309K7224n0301l7660P2081L6954k4581
14593a05215k7248J07174Q3977L3877M7617j1077p0425J8037J4719r3705k1127
14582b3396m9485L4101j023k5208j275J7509J9316N6957l2451q1847L9550J737
$$ plain form
14665 34231 23826 -40830 -29816 41553 5485 -61525 -26574 -25979 -23620 1403 -2140 -55793
14653 -55793 -111826 -151917 -179774 -161263 -100149 -147218 -219479 -129235 -99443 -129587 -135505 -98356
14641 -98356 -88879 -53173 -66249 -107539 -78200 -36979 -91641 -32164 3079 -31973 -69193 -61296
14629 -61296 475 40796 18836 -43621 -33784 13309 42854 55549 23734 -34373 -36590 -60209
14617 -60209 -111842 -107500 -7259 -77239 -115130 -37024 -8463 -36531 -54678 -120822 -85373 -16150
14605 -16150 -47171 -92812 -124381 -121927 -133241 -128932 -101708 -152009 -189669 -117588 -80634 -105215
14593 -105215 -132463 -25289 58688 92565 140182 129105 58680 76717 91436 -2269 -23396
14582 -23396 -72881 -38780 -39803 -65011 -66286 -48777 -29461 27496 -4955 -86802 -47252 -45515
14570d5515K8921K0035K8110P1208n5250n5095m1196N006L9440M1285l3142p9573
14558g5766m596J3550Q007q670M9704L6593j18506n9575L9058j5941J6563L4545
14546h5034R6970K8050L8884P1712M8601k2591l7211J8037l1852k8154N679l0120
14534G2971o6192j030J0017L350P9280N6710k8981j03468p177M5716m9218J79
14522A2157O4166Q3753K345q8684o4215j4978n7693k3750J6985o7087o0696J3222
14510a84475n5979J1224J4684R3892L0399J5388n922K1492R39K8281K768q722
14498c6031J342L9154K3800l0916m7865o8370m3242M1791M0203J08004n1772J2639
14486a1263o4180J4548L440k6384k6539n9734m4969J6118M7871Q9077J4345l2358
$$ plain form
14570 -45515 -16594 3441 31551 102759 47509 -7586 -48782 -43776 -4336 36949 3807 -75766
14558 -75766 -80362 -66812 -58805 -67475 -17771 18822 -99684 -159259 -120201 -136142 -119579 -85034
14546 -85034 11936 39986 78870 150582 199183 176592 139381 157418 125566 97412 103091 72971
14534 72971 6779 5749 15766 19116 98396 155106 126125 22657 15480 61196 11978 12157
14522 12157 76323 160076 162421 73737 9522 -5456 -63149 -86899 -69914 -137001 -197697 -184475
14510 -184475 -240454 -229230 -214546 -120654 -90255 -74867 -80789 -59297 -58358 -30077 -27309 -36031
14498 -36031 -34689 4465 28265 -2651 -50516 -118886 -162128 -120337 -80134 27870 -23902 -11263
14486 -11263 -75443 -60895 -57455 -83839 -110378 -170112 -215081 -198963 -151092 -62015 -47670 -80028
14474h0028K0539L3134l7761k1848L6778l881l7960l097L5269J18169m122p381
14462D7811o749q49m982m7101p55L2981O644j4573M471n5457n465K4985j2605
14449c1644m592N494K3577m504K8887K83K0584m7160l5820J5474J9314r2897o1814
14436a64818O1874Q9832j681l8525m8517m5767k4983J02759L3735J8840N0525
14425C3274J920j28254l7259J8482J5396J089L2203L6872O9191L9288q3023Q960
14413H139O2053j9125o6954l0093n1694L5258J3885K2109l9966j7814j0790M645
14401i0347k9366R49K6353N1800j353O0088J12848j5150j63920r0185l3498K4855
14389a46926M3320M1773l5297m3610J1520K4866p5117L7385N0890K6094m9525
$$ plain form
14474 -80028 -59489 -26355 -64116 -85964 -49186 -53067 -91027 -94124 -58855 59314 55192 47811
14462 47811 41062 40213 35231 -11870 -12625 20356 27000 12427 16898 -38559 -44024 -19039 -31644
14449 -31644 -36236 -30742 -7165 -11669 17218 17501 38085 -9075 -44895 -29421 -10107 -103004 -164818
14436 -164818 -102944 -13112 -14793 -53318 -101835 -147602 -172585 -69826 -36091 -17251 33274
14425 33274 35194 -93060 -130319 -111837 -96441 -95352 -63149 -26277 42914 82202 -821 8139
14413 8139 70192 51067 -15887 -45980 -97674 -62416 -48531 -26422 -66388 -84202 -94992 -90347
14401 -90347 -119713 -118764 -92411 -40611 -41964 18124 130972 115822 -48098 -138283 -171781 -146926
14389 -146926 -103606 -61833 -97130 -140740 -129220 -104354 -179471 -142086 -91196 -65102 -114627
14378a14627P575n803q457M5787k9340J6784N2749J9R066R0510o624q149j0830
14365C8660L0835L2245Q056n8553r3O5131n1825m6320j11807n6228j9247j5509
14353a84655J029L0216P0878O1853J30340N2380n6455j26280p6838L8007K6744
14342c2781r044J2110L0659L4269N5564j7756o2729N214O0182K583n5769J10429
14330A32931k0861j44798q1127O8167N0341L8297q2959O3730N0413J9869m4853
14319D9150K9732P1352l8355L2035j0856j19908R637m5079O8184k0481K7810M840
14307E8061K3018K7891M083k6856p7479m6052K0557j2962n2974Q944P0240J08184
14295A04655K2498n4780m828M7930j080P964J883l5208q7p1446o9337N7495J03956
$$ plain form
14378 -114627 -107052 -112855 -121312 -75525 -104865 -88081 -35332 -35313 -26247 64263 57639 49490 38660
14365 38660 69495 101740 109796 51243 51150 116281 64456 18136 -93671 -149899 -169146 -184655
14353 -184655 -183626 -153410 -82532 -20679 109661 162041 105586 -20694 -97532 -59525 -32781
14342 -32781 -41825 -29715 944 35213 90777 73021 10292 15506 75688 78271 22502 132931
14330 132931 112070 -32728 -113855 -45688 4653 42950 -40009 23721 74134 94003 49150
14319 49150 78882 150234 111879 143914 133058 13150 22787 -22292 45892 25411 53221 58061
14307 58061 81079 108970 113053 86197 8718 -37334 -16777 -29739 -82713 -73769 -3529 104655
14295 104655 127153 72373 67545 115475 114395 122359 124242 89034 88947 17501 -51836 5659 109615
14282A09615m927m0868m5030n8701M247k4362n791P5402M1025l8179p356k1961
14270a6886Q656m0970N384N992Q9471L8396q2080q5563L1397m6997l8326P7938
14258e3588L1946k4085L6682l1254k0323J02554l1387r9872k9469P2781J9113
14247b6902K5586N9979N4234l4349m9224J4832n608n4883r0438m1019N4227J1463
14235h2102J6924k8329O9156J15336N4574r3848j20242L6211K6922J6613k3475
14224a2260J067l8136M5626l5945l0997k2910Q489J2149R945m5061n5297L2061
14212a31269R9130l353j4515L6476M4704M54M6048p8716p0247J3511j6187J5030
14200e8934Q0575R8827J7419M3440K3388m1825p2614m5729n449o7843o0868j3060
$$ plain form
14282 109615 104688 63820 18790 -39911 -35664 -60026 -65817 9585 50610 12431 5075 -16886
14270 -16886 -8230 -49200 -43816 -37824 51647 90043 7963 -77600 -46203 -93200 -131526 -53588
14258 -53588 -21642 -45727 -9045 -40299 -60622 41932 10545 -89327 -118796 -46015 -26902
14247 -26902 -1316 58663 112897 78548 29324 44156 38548 -16335 -106773 -147792 -93565 -82102
14235 -82102 -65178 -93507 -24351 90985 145559 51711 -68531 -32320 -5398 11215 -12260
14224 -12260 -11193 -49329 -3703 -39648 -70645 -93555 -85066 -72917 -62972 -108033 -163330 -131269
14212 -131269 -32139 -35492 -50007 -13531 31173 31627 77675 -1041 -71288 -57777 -73964 -58934
14200 -58934 21641 120468 137887 181327 204715 162890 90276 44547 39098 -28745 -89613 -102673
14188a02673R3832M2795k8809K7729N058Q52j3352j9482q459M7793J180m5955
14176E09k3606k0894N8675L3611Q489J489n8258r5382J7287q3356r3582J52190
14164a02828R7199Q2519M4351n9799K5443K4092q2889m4395o691Q0187L9219J2956
14152A09364J4385j38656j0874M375m2094q5799l700M2417K1585M1632O1558J6745
14140C0938m5885j00787L0862P0212j2829o1452n5840J7589L6236K6678j6593
14129h0871o710k1729N8852J31995J7010n5962M1390J6624n0656p3063J5030m6264
14117e4354K6093O6330L2081L1661K7205p3669p1748n1734K6281J6799K3982n9332
14105f0405m7061m3141J2152Q0692J7826J8087N346m1227m013K7093J7532J9765
$$ plain form
14188 -102673 -8841 33954 5145 32874 37932 38784 25432 5950 -2509 45284 46464 509
14176 509 -23097 -43991 14684 48295 56784 58273 15 -95367 -78080 -161436 -255018 -102828
14164 -102828 -5629 76890 121241 61442 86885 110977 28088 -16307 -22998 57189 96408 109364
14152 109364 123749 -14907 -25781 -21406 -63500 -149299 -152999 -110582 -88997 -47365 14193 30938
14140 30938 -14947 -115734 -84872 -14660 -27489 -88941 -144781 -127192 -90956 -64278 -80871
14129 -80871 -87581 -109310 -50458 81537 98547 42585 83975 100599 49943 -23120 -8090 -54354
14117 -54354 -28261 38069 70150 101811 129016 55347 -16401 -68135 -41854 -25055 -1073 -60405
14105 -60405 -107466 -150607 -138455 -57763 -39937 -21850 -16504 -57731 -61744 -34651 -17119 2646
14093B646J1153k2321q5044n9422Q7022P0819J9937K7997n3830j483K8681l6612
14081a0457M68r322m1500P1834k2774J2664n4555n5319j6581P6033N1972O0497
14069F2960k3884r0041K2573K5340n1688N929M6141j3979q7108m2081L3966J05277
14057f595J21539m6369j03850k5742M361j1189R181j9883r876O5729p5566K7667
14045g0593P1297L5139q3733r966J0534N5835O7925P1182p4841r6697o1568M1097
14033d4389M5845l3365r992M3739N9781r3935K2798m0904L6803L3221l9211O224
14021a3385K4005J8924O9881p3468J1329q0650j2182L6919n4809L0350Q1371N1080
14009H9365p5560r8964l4979O889J02102L6088o8477o6939J7060K0611N9022K8203
$$ plain form
14093 2646 13799 -8522 -93566 -152988 -65966 4853 24790 52787 -1043 -2526 26155 -10457
14081 -10457 -9989 -19311 -60811 11023 -11751 913 -53642 -108961 -125542 -49509 2463 62960
14069 62960 39076 -50965 -28392 -3052 -54740 -48811 -2670 -16649 -103757 -145838 -111872 -6595
14057 -6595 114944 68575 -35275 -61017 -56656 -67845 -58664 -78547 -88423 -22694 -98260 -70593
14045 -70593 704 35843 -47890 -57856 -47322 8513 76438 147620 72779 -23918 -85486 -44389
14033 -44389 1456 -31909 -41901 1838 61619 -32316 -9518 -50422 -13619 19602 -19609 -13385
14021 -13385 10620 29544 99425 25957 37286 -43364 -55546 -18627 -73436 -43086 38285 89365
14009 89365 13805 -85159 -120138 -113249 -11147 24941 -43536 -110475 -93415 -72804 -13782 14421
13997A4421L2433K3854j00495k2657Q522l0362q0637q068N3636M7114l0430r5349
13985a88018m3292R3831R6451P1910P7395L2451n7030m8878M5094n6896n7735
13974c4717J9129K5439M152l1340K445M5542m492P4218j08758M4663J07361O5919
13962B09561q1897p7919j743j8947n9827J8108O975o3298K8676J14630L215j0165
13950F7369o9615n4682N0443J00345q257m5304n5612j5315P4995P869l3080j13244
13938i4088q6781j8160k9309m3816O6129Q7086P1065J21798L3757l5877j5265
13927E6539N484q1413l5265N1101p0119m6405M7550L3796J10677K3918m3532m3296
13915I035n1978j9084j2376k6729Q194O6678M2856l241k8520O974m8885J1233
$$ plain form
13997 14421 46854 70708 -29787 -52444 -43922 -74284 -154921 -162989 -109353 -62239 -92669 -188018
13985 -188018 -231310 -137479 -41028 30882 108277 140728 83698 34820 79914 23018 -34717
13974 -34717 -15588 9851 14003 -17337 -14892 30650 26158 100376 -8382 36281 143642 209561
13962 209561 127664 49745 48002 29055 -30772 -12664 -5689 -68987 -40311 74319 77534 67369
13950 67369 -2246 -56928 -6485 93860 85603 40299 -15313 -30628 44367 52236 19156 -94088
13938 -94088 -180869 -199029 -228338 -272154 -206025 -118939 -47874 73924 107681 71804 56539
13927 56539 62023 -19390 -54655 -3554 -73673 -120078 -72528 -38732 71945 95863 52331 9035
13915 9035 -42943 -62027 -74403 -101132 -92938 -26260 16596 13355 -15165 -8191 -57076 -45843
13903d5843k8477m381O592l3941o9748Q2818J44741O5668o3600r3072O6244J4318
13891D1319M5317q000j28250p5322q2556j7431L8071M4150Q1986R3805N1803K0759
13879A05651m2468N567M1139K3846j17984o6701R7485M2221j8359n5835j444M942
13867A8060O8496m6144k2898M8580Q3353j06376p5658o2007o8209J6499Q9695
13856e6609N425R750Q036M0824q421j05302L8196Q878k3724P429m2660M4866P4065
13843G53L7679M4114q1652p8342J3314o0395K8253J3895l3517K1334N7992N4753
13831A8181j3062k6116o5897R8420n0690o8971m9675K9943M7040Q346L420M5774
13819b3287j6714N5511K8098m3863k9468j5904n0455K0804k648L6065L4766j9101
$$ plain form
13903 -45843 -74320 -78701 -72109 -106050 -175798 -92980 51761 117429 53829 -39243 27001 41319
13891 41319 86636 78636 -49614 -124936 -207492 -224923 -186852 -142702 -60716 33089 84892 105651
13879 105651 63183 68750 109889 133735 15751 -50950 46535 88756 70397 14562 13118 18060
13867 18060 86556 40412 17514 66094 149447 43071 -32587 -94594 -162803 -146304 -56609
13856 -56609 -51184 -41434 -33398 7426 -995 -106297 -68101 -59223 -82947 -75518 -118178 -73312 753
13843 753 38432 82546 894 -77448 -64134 -124529 -96276 -82381 -115898 -94564 -36572 18181
13831 18181 5119 -20997 -86894 11526 -39164 -108135 -157810 -127867 -80827 -72481 -69061 -23287
13819 -23287 -40001 15510 43608 -255 -29723 -45627 -96082 -75278 -77926 -41861 -7095 -26196
13807b6196K7401O3468M9401M8562K0435j01603n356n6126Q689j7917o6579o001
13795f1822P945K5884J7228m6972M3398L3483o0921o2222L6692K0062L9324J2903
13783D982K2253J435J7124j4742p724N435J1155M3630L9793j2500p3584K9165
13771F6422n6795M6815N7649o5576l7532K5819m3097K3864L8717m1441n7618J6800
13759b5973J08734o7977O36J4605M2670K2879p4415o9332O8974N2643k6857L6303
13747H2890l1554q775L1216N129K0756j01228l1588M5740J9536m5361j4508l1216
13735e8963P751K5798J0575l1684N0228p9983k8514J2568K787o288M1239N5178
13723F92K0835o923l941l3463j1384K1575Q1590k403l3920p3983M5763O7587Q775
$$ plain form
13807 -26196 1205 64673 114074 162636 183071 81468 76112 19986 28675 10758 -55821 -61822
13795 -61822 -53877 -27993 -10765 -57737 -14339 19144 -41777 -103999 -67307 -47245 -7921 4982
13783 4982 27235 28670 45794 31052 23328 28763 39918 83548 123341 110841 37257 66422
13771 66422 9627 56442 114091 48515 10983 36802 -6295 17569 56286 14845 -42773 -25973
13759 -25973 82761 14784 15420 30025 72695 95574 21159 -48173 20801 73444 46587 82890
13747 82890 51336 42561 73777 78906 99662 -1566 -33154 12586 32122 -13239 -27747 -58963
13735 -58963 -51212 -25414 -14839 -46523 3705 -76278 -104792 -92224 -89437 -95725 -54486 692
13723 692 21527 14604 10663 -22800 -34184 -12609 68981 66578 32658 -41325 4438 72025 80800
13710H0800j334q2564r8165Q1591J02232K3286k4353j04397q6704R209N3135N034
13698d2230N3780L9916n7281J2314L9181J0712j24229j3000J3843m1976o1737
13687a70707l3401Q0745M9131k0853j434m2661K7167M0080Q756N265p2433J5576
13675a14769L0643L9651R9813L2367n56M2207k6088k7005l7680j15595o2281N133
13663a34160N1993J2595L321J8698J3588K3821n347K0721K3790O85n7718n6849
13651h4862O2410K0023K8444j16928J3125l4343r7305J9092J03254J37496N8493
13640A08899O165n0722p4967k9267J12609o530n694M1197J2696n2998n9437K3273
13628B5224J9504p3289p6622l5354O7611j2644M96P1519J04581n9683p2671j6222
$$ plain form
13710 80800 79466 -3098 -101263 -19672 82560 105846 81493 -22904 -109608 -100399 -47264 -42230
13698 -42230 11550 51466 -5815 6499 45680 56392 -67837 -80837 -66994 -108970 -170707
13687 -170707 -204108 -123363 -74232 -95085 -96519 -139180 -112013 -71933 -63177 -57912 -130345 -114769
13675 -114769 -84126 -44475 55338 87705 87149 129356 103268 76263 38583 -77012 -139293 -134160
13663 -134160 -82167 -69572 -66251 -47553 -33965 -10144 -15491 5230 29020 29705 -28013 -84862
13651 -84862 -22452 -2429 26015 -90913 -77788 -112131 -209436 -190344 -87090 50406 108899
13640 108899 115064 64342 -10625 -39892 72717 66187 60493 101690 114386 61388 1951 25224
13628 25224 44728 -28561 -105183 -140537 -72926 -85570 -85074 -13555 91026 31343 -41328 -57550
13616e7550Q121J9032K2093n2799O752j8045J346n962j0151K4617N0973k0443
13604c2016K6270m0590l1862j980P9630J3386l8297P0455O6345k4770j28372n5617
13592i7418M9556j4898L9422K4645N1778O647l96l3106q7688J812n6553Q8771
13580b7428N7051J25658o4059j13840L6597P2654L2248l7237p2641m198r956p323
13568a2474m504M8003J4181l575k7489J2612m5800M485n764p4394N9260P4877
13556C9418J3060M834J952o7796j474n9586J3545J27326K1003j24614K6343K5421
13544A9432J7191L8415k2090j20576l0477K5135O4212o319m6634m2500o515O033
13532a04693J44O7581L3000o169M5084j0725k0416O0120m5196L8003R005j42041
$$ plain form
13616 -57550 -49429 -30397 -8304 -61103 -54351 -72396 -71050 -77012 -87163 -62546 -11573 -32016
13604 -32016 -5746 -46336 -78198 -80178 -548 12838 -25459 44996 111341 86571 -41801 -97418
13592 -97418 -47862 -62760 -23338 1307 53085 59732 59336 26230 -61458 -59646 -116199 -27428
13580 -27428 29623 155281 91222 -22618 13979 86633 118881 81644 9003 4805 -5151 -12474
13568 -12474 -16978 31025 45206 41631 14142 26754 -19046 -14561 -20325 -94719 -35459 39418
13556 39418 52478 57312 59264 -8532 -10006 -69592 -56047 71279 92282 -32332 -5989 19432
13544 19432 36623 75038 52948 -67628 -98105 -72970 -8758 -15077 -61711 -104211 -110726 -104693
13532 -104693 -104549 -36968 -3968 -10137 34947 24222 3806 63926 18730 56733 65738 -76303
13520g6303j10818O1J18079P1917R921j07745k2924J01728R7235l2675N6288n7503
13508D7261o2922N174n2998M3125L4166j1099l4638O0890l5198j2740l2209l2574
13496h3762n008m5875K8330Q3003R2241L6767O6697m30j53357j15129Q3117J23074
13484A09668k1338k2781L8463l1231n3319o0650O3180K0107m2578l5303Q2800
13473D7018J744n3829n9808k0063r991k1112m8687L9654L8690L0240m9211n0521
13461a55876j1782J0029J2093L0731n297O9207N9521k9891l96j8398n8177K4841
13449g3395p5825n7332k2285L0114R9421O2857M3337J0406k250j8723r4313m0285
13437a38273K6553J01149L6565N4591o3187k6427l5417n1638Q7836K4401n1412
$$ plain form
13520 -76303 -187121 -187060 -68981 2936 12857 -94888 -117812 -16084 81151 48476 104764 47261
13508 47261 -15661 -10487 -63485 -20360 13806 2707 -31931 28959 -6239 -18979 -51188 -83762
13496 -83762 -88770 -134645 -106315 -23312 68929 105696 172393 171963 18606 -96523 -13406 109668
13484 109668 88330 65549 104012 72781 19462 -41188 21992 42099 -479 -35782 47018
13473 47018 48762 -5067 -64875 -84938 -94929 -116041 -164728 -125074 -86384 -56144 -105355 -155876
13461 -155876 -167658 -157629 -145536 -114805 -120102 -50895 8626 -21265 -21661 -40059 -98236 -73395
13449 -73395 -149220 -206552 -228837 -198723 -99302 -36445 6892 17298 15048 -3675 -97988 -138273
13437 -138273 -111720 -10571 25994 80585 17398 -9029 -44446 -96084 -8248 16153 -35259
13426c5259j955P517P3388L5938j0700m4707m7229j5650O507k7661J9864J597
13414c8350l4267l167q896N2460K0304k1889K0401l8749J5051p090O6882k8724
13402f034n6635l0359l3671P997K0960Q3924Q63J5643m1208l0419O7618J5094
13390A3773q452k1964p3480J7438M0259m1527n326r112J9028L8764l829K8311
13378f117J4818K5041n2796j1009J4758K2191j5694n0599j2409l5041J10474R2380
13366I5997m8941k1400j0928J7870Q0605M0840p4332l6899j5995n1598M3450L4987
13354E3656k6874o3138p1327m5787j8962O4346J15198O4204J2046M246q0738k2750
13342a5880J771L8073M0829N9126l958k9399j0169n5876N0512K051o3730j1340
$$ plain form
13426 -35259 -37214 -29697 43691 79629 68929 24222 -23007 -38657 -32150 -59811 -39947 -38350
13414 -38350 -72617 -75784 -84680 -32220 -11916 -33805 -13404 -52153 -37102 -44192 22690 -6034
13402 -6034 -62669 -93028 -126699 -118702 -97742 -13818 -12955 2688 -38520 -68939 -1321 13773
13390 13773 5321 -16643 -90123 -72685 -32426 -73953 -79279 -88391 -69363 -30599 -34428 -6117
13378 -6117 8701 33742 -19054 -30063 -15305 6886 -8808 -59407 -71816 -106857 3617 95997
13366 95997 47056 25656 14728 32598 113203 154043 79711 42812 26817 -24781 18669 53656
13354 53656 26782 -36356 -107683 -153470 -172432 -108086 7112 71316 83362 87608 6870 -15880
13342 -15880 -14109 23964 64793 123919 119961 90562 80393 24517 75029 77080 13350 2010
13330B010p215M5054J7995m2989K1805O6826J0381l8028n40M3153J0858o6643
13318F2667m6254m6216M567O2054R5403N158k6375r6311o6721K4235O0424Q2602
13306A15233j6864m1429J5101O9752K2128l5012N569P70j28010j1041M0292L3230
13294F9719M885O6391P338j03361k9957L1064o689m391K7055P2294r578m9107
13282G5663o2295n5197l3066m0924Q4090O1160q0821j050P5633J2143L64M6334
13270H2034R9545n9548m0225j04496q8817m6873q539k0880j1238M5190J10549
13259d3298R9271m2170l7708o6350N2502J2000m0183R604K9241Q8217J31312j4145
13247A78293l1661m193l7090k8962P2592l8429n4459j3213k8547m6236L0039K7623
$$ plain form
13330 2010 -5205 39849 57844 14855 36660 103486 113867 75839 75299 118452 129310 62667
13318 62667 16413 -29803 -25236 36818 132221 137379 111004 14693 -52028 -27793 32631 115233
13306 115233 98369 56940 72041 141793 163921 128909 134478 135248 7238 -3803 36489 69719
13294 69719 74604 140995 148333 44972 15015 46079 39390 34999 62054 134348 124770 75663
13282 75663 13368 -41829 -74895 -115819 -31729 29431 -51390 -52440 23193 35336 35700 82034
13270 82034 181579 122031 81806 -22690 -111507 -158380 -166919 -187799 -199037 -153847 -43298
13259 -43298 55973 13803 -23905 -90255 -37753 -25753 -65936 -56332 -27091 61126 192438 178293
13247 178293 146632 142439 105349 76387 148979 110550 56091 42878 14331 -31905 -1866 25757
13235B5757O107K6822l2215n1221R470K4670j2789j19762l4422N0457J1272K2761
13223g3093N2962k5898k5946P5900k8131q1006l3342P494M4065O4509J2622o3605
13211g3469m2333m0013J28120P5665O7464L0719o8001n8196o4981q0106k8902
13200a54033O2096Q5789J1580m1103L0605r8269o0335R9180R3115K9340J9954
13189G7919n3330n6851l2440M6599L9842l5775k6409M438j0498j7211j3794P6249
13177a261Q670j6800n5716L9539Q536l490O8989K0567p2851r1418J6808L2076
13165d6351m1811J6507O0136L5587n5402p2626m5168L2433l429n2064j014l4117
13153b07319K9889R9491M5659k4823N5195n7644o8075m8817j3795M8595J27592
$$ plain form
13235 25757 31864 58686 26471 -24750 -15280 9390 -3399 -123161 -157583 -107126 -95854 -73093
13223 -73093 -20131 -46029 -71975 3925 -24206 -105212 -138554 -131060 -86995 -22486 -9864 -73469
13211 -73469 -115802 -155815 -27695 47970 115434 146153 78152 19956 -45025 -125131 -154033
13200 -154033 -91937 -6148 5432 -35671 -5066 -103335 -163670 -64490 28625 57965 77919
13189 77919 24589 -32262 -64702 -18103 21739 -14036 -40445 -36007 -46505 -63716 -77510 -1261
13177 -1261 7409 -9391 -65107 -25568 -17032 -20522 48467 69034 -3817 -95235 -78427 -46351
13165 -46351 -88162 -71655 -11519 24068 -31334 -103960 -149128 -116695 -120124 -172188 -173202 -207319
13153 -207319 -177430 -77939 -32280 -57103 -1908 -59552 -127627 -176444 -190239 -141644 -14052
13142a4052Q3125q1913j12969N3080R1685p2837m022k1759j0320N3481K982l3350
13130f6869j5001J6539L1346J09917L2214j06241M8388R0506o018o3367j05591
13119c4177k47M2219J7035O3756m6439j0283N0310R381J3448L9289L7932j7231
13107A64993j39739r786J9407J6500L145p3873L3055L4251N0232L2732N916j56582
13095a9749j73383m5654J72270R8341o371K3742L9809q966l6180m2721K868k4014
13083b0008L3942m3894l8780K4672k0247O5717M7048j8660k3428m5449M159j3241
13071d8169J3553J8049m5259m91P6589O0698M6444p2535o7556r7714j7726O965
13059a27152L1442Q0768J01139J7397n1881l6183k9015k6930M3315j3369m1431
$$ plain form
13142 -14052 69073 -12840 -125809 -72729 18956 -53881 -57903 -79662 -89982 -36501 -33519 -66869
13130 -66869 -81870 -65331 -33985 75932 108146 1905 50293 140799 134781 71414 -34177
13119 -34177 -34424 7795 24830 88586 42147 31864 82174 91555 105003 144292 182224 164993
13107 164993 25254 15468 34875 51375 54520 -19353 13702 47953 98185 130917 136833 -19749
13095 -19749 -193132 -238786 -66516 31825 25454 49196 89005 80039 43859 1138 4006 -20008
13083 -20008 13934 -29960 -68740 -44068 -64315 1402 48450 29790 6362 -39087 -34928 -48169
13071 -48169 -34616 -16567 -61826 -62317 14272 74970 121414 48879 -18677 -116391 -134117 -127152
13059 -127152 -95710 -14942 86197 103594 51713 15530 -13485 -40415 2900 -10469 -51900
13048e1900J8559M3458J285j3082j4891K7105l5112Q4732J05199o4602n4007K347
13036D9091q3686l8955L2179J27659L5447j40300m4403Q2477N1033K2790j1692
13025H1640O8101l6931n1983Q214L6957j9573L601L0565m3632k3304q5161R450
13013b2056M1969k3968L5492L7781j12773l6090J09867p3459J0521l2824L4026
13002c1514O0082p752q800J7380j9678n2716j1571P2185m6751M6265k9712o9102
12990h1684O5159N2342p2021k5977K7006P1895M1836o8945l0100N1834N0458J3015
12978I4818K9956M9570q6713r8125l8515J1065N7123J1745n1767j8399k2506R0827
12966B9079K1107m3971J8197J1880K2075k6426l5613L8833k4225j5492M3883j15186
$$ plain form
13048 -51900 -33341 10117 11402 -1680 -16571 10534 -24578 60154 165353 100751 46744 49091
13036 49091 -34595 -73550 -41371 86288 121735 -18565 -62968 19509 70542 93332 81640
13025 81640 149741 112810 60827 69041 105998 86425 90026 120591 76959 53655 -31506 -22056
13013 -22056 19913 -4055 31437 69218 -43555 -79645 30222 -43237 -32716 -65540 -31514
13002 -31514 28568 20816 12016 29396 9718 -42998 -54569 17616 -29135 17130 -12582 -81684
12990 -81684 -16525 35817 -36204 -62181 -35175 36720 78556 9611 -20489 31345 81803 94818
12978 94818 124774 174344 87631 -10494 -49009 -37944 19179 30924 -20843 -39242 -61748 29079
12966 29079 50186 6215 24412 36292 58367 31941 -3672 35161 10936 -4556 39327 -75859
12954g5859q7055R3561n786R52O3643p0559p1785N2238P2631m38k1368L2480Q191
12941i154k5563R209J2660K5168M1694L726n4000o7367L4123j3560m5046Q815
12929g9295K2844R08P4624P826K4488K1925m548M7630J3442N5720n6529m9152
12917G9883n8692M2930n3932l6815N531l454M1787N2053J0822O1054m9118m1365
12905E0684J5889K6360L6429J17267k6406r7486n5507j3736o7521j622M2421L0602
12893E7374J9979n9031l8762l1025q4316L866O1212j08l9158J3709k3523K0047
12881i9736j2760m6918R1601P8047m0456O7530J28880o2085q4379n4387N6515
12870B1852Q8400K8732j10152m8872q9098o1931L4765N6127L0153n81o0293J2652
$$ plain form
12954 -75859 -162914 -69353 -75139 -74187 -10544 -81103 -152888 -100650 -28019 -28457 -49825 -17345 -9154
12941 -9154 -34717 -25508 -12848 12320 54014 57740 3740 -63627 -29504 -43064 -88110 -79295
12929 -79295 -56451 -55543 19081 26907 51395 73320 68772 116402 129844 185564 129035 79883
12917 79883 21191 64121 10189 -26626 -21095 -24549 17238 69291 80113 141167 92049 50684
12905 50684 66573 92933 129362 246629 220223 122737 67230 53494 -14027 -15649 26772 57374
12893 57374 77353 18322 -20440 -51465 -135781 -131915 -70703 -70811 -109969 -96260 -119783 -99736
12881 -99736 -112496 -159414 -67813 10234 -30222 37308 166188 104103 19724 -34663 21852
12870 21852 110252 138984 28832 -20040 -109138 -171069 -136304 -80177 -50024 -50605 -110898 -98246
12858i8246R6487O6562q8983j05260L0571N6379M3222j129k8852J9174j9742J5608
12846a4209J5482L4573K9545m91J2703L2566j3671j00881k9809k0558l6913l1082
12834a22745M7743R4722K3161P603p3223o1634K8042N751k4997R3478K8327j46257
12822a00029j9367R0677Q165M7716Q5325K0879o8155o5399o688Q178l0868L0873
12810A307p403o935N8566q2913k5746J159M465K8654n2281J9387L5910j1283j5041
12797e2154R483k3294l1624o7527l9503j0984J3329L9740J30295O8193L4642m7857
12785B2739p07M9954K3901J5835L5420M7931l6431j22373k8173R7163l8188m0667
12773B6404m7288K6312N1132l496l766P993Q5416m842n5716K5825N0952p4640
$$ plain form
12858 -98246 -1759 64803 -24180 -129440 -98869 -42490 732 -397 -29249 -10075 -29817 -14209
12846 -14209 1273 35846 65391 64900 77603 110169 96498 -4383 -34192 -54750 -91663 -122745
12834 -122745 -75002 19720 42881 50484 -22739 -84373 -56331 -50580 -75577 17901 46228 -100029
12822 -100029 -119396 -28719 -20554 27162 112487 133366 65211 -188 -6876 1302 -29566 1307
12810 1307 -6096 -13031 45535 -37378 -63124 -61965 -57500 -28846 -81127 -61740 -25830 -37113 -52154
12797 -52154 -42671 -65965 -97589 -165116 -204619 -215603 -202274 -162534 -32239 35954 70596 22739
12785 22739 22032 71986 95887 111722 147142 195073 158642 36269 8096 105259 67071 26404
12773 26404 -20884 5428 56560 53064 49298 57291 142707 137865 82149 107974 158926 84286
12761H4286p2418L0030l0753q9172n9785M5859R1917L3157J518M7419j9933k3133
12749C8992k8194M5085N2322M4046n9018j07508l9780K7264M2118l3494o154L8446
12737A4125l4585q3422O5806R8220l3865m4106R540J2814O0491J8504L4516q8926
12725B9112p9117O7780N2673o3174j867j0155Q575K7132J517j56880o5361K6315
12713a63450M8790L6192j643J9331J6484P358k8290p0160K1016N3856l729J3461
12701e0784k0806R6333K9862k6203L4049n9419R583K9130K8239O8709O2342n1044
12689A49991m1740P885p4242j07964m604P6134j5632p901J9097J4521O14L6601
12677E2760j0662p0700l8062n417k3531P259O7333K3383Q204l8604l5517M9695
$$ plain form
12761 84286 11868 41898 11145 -78027 -137812 -91953 -36 33121 34639 82058 62125 38992
12749 38992 10798 55883 108205 152251 93233 -14275 -54055 -26791 15327 -18167 -24321 14125
12737 14125 -20460 -103882 -38076 60144 26279 -17827 -8287 4527 65018 83522 118038 29112
12725 29112 -50005 17775 70448 7274 5407 -4748 3827 30959 32476 -124404 -189765 -163450
12713 -163450 -114660 -78468 -80111 -60780 -44296 -36938 -65228 -135388 -114372 -60516 -64245 -50784
12701 -50784 -71590 24743 54605 28402 62451 3032 12615 41745 69984 138693 201035 149991
12689 149991 108251 116136 41894 -66070 -70674 5460 -10172 -18073 1024 15545 16159 52760
12677 52760 42098 -28602 -66664 -72081 -95612 -88353 -21020 2363 10567 -28037 -63554 -13859
12665a3859M1854o6032M3894O4684J2805K611L5045m416p6356n9218P1994R2885
12653A45891k892m4180n835k7721o059K02Pl4546J9720M3677K8750q3208n4327
12640b0521k8691m269O6624J98486j65q9596J9777N8887k787L8654K867Q37J094
12627B41197m0739p7952M909K3242N656J5842o4295K3428j5386l6162J7989K0467
12615A18196J7085j43546m0117j5300J7004O9763P8219O9637L5748r2247p039
12604A07403R2646L0544p3098p4026j0264j5508O745P1909l3154n2598k63J2042
12592F2378K2634O2858p0463n6396O5128P874j5621j661K5046N9015J7738J3501
12580A92031o7965j15396K0514M3905j1413m8213n3020M6712j3073O508n1321
$$ plain form
12665 -13859 27995 -38037 5857 70541 83346 85957 121002 116586 40230 -18988 53006 145891
12653 145891 142999 98819 92984 65263 59204 59406 59413 24867 44587 88264 117014 33806 -20521
12640 -20521 -49212 -53481 13143 211629 211464 121868 141645 200532 197745 236399 239266 240103 241197
12627 241197 200458 122506 127415 150657 156313 172155 107860 131288 115902 79740 97729 118196
12615 118196 135281 -8265 -48382 -63682 -46678 23085 101304 170941 206689 114442 107403
12604 107403 200049 230593 157495 83469 73205 57697 64442 136351 103197 50599 50336 62378
12592 62378 85012 147870 77407 21011 86139 94013 78392 76731 101777 160792 178530 192031
12580 192031 124066 8670 29184 73089 61676 13463 -39557 7155 -5918 590 -50731
12569e0731M9581O9840J8555L0940K3685K9906j0930n0430n4854o3846M2291L5251
12557F9258l6160l6597J755J7238l0606p773J307O2837M4099J08574K9522o5485
12545A57969q4477K3190K2518p6932N1652j6K7223j149o9283K3467O4174L755
12533A42091q5075o4714M9171J657K189k3982L4746M8445J5279O1616q0109P472
12521A08786N4644j9420q720k5403m3053j3534l8110O1213O9549k1106r0992n7416
12509b3562N791M489j8567J24351O2689L6736P169K7451j495j16644j824O1163
12497A67747l4201M8481k4745K8509J6380j4298p4617J4576P1069L5334l5127
12486A99108j0932k220L9144K3754j7508q6589j1689M6936K5721l1735j1547L5792
$$ plain form
12569 -50731 -1150 68690 87245 118185 141870 171776 160846 110416 55562 -8284 34007 69258
12557 69258 33098 -3499 -1744 15494 -15112 -22885 -21578 41259 85358 193932 223454 157969
12545 157969 73492 96682 119200 42268 93920 93904 121127 119978 50695 74162 138336 142091
12533 142091 57016 -7698 41473 43130 45319 21337 56083 104528 119807 181423 101314 108786
12521 108786 163430 144010 135290 109887 66834 53300 15190 76403 145952 124846 33854 -23562
12509 -23562 -17771 -13282 -31849 92502 155191 191927 199096 226547 225052 108408 106584 167747
12497 167747 133546 182027 157282 185791 202171 187873 113256 127832 198901 234235 199108
12486 199108 188176 185956 225100 248854 231346 144757 133068 180004 205725 173990 162443 198235
12474A98235j8397j2340J12476k6941j20671l4020j885k4073m722j7324N927O8886
12462A25151N4082j6166l3974k7172O341L7065L4869Q664l1482n2269l0319O872
12450H1662l2904o816J14696O5430N628q5572p1132j5401j625M8700N6179M4047
12438B02892J5477K2969r0518k6804L4144P3611L0637o4500k7517K2884J1382
12427B04657j9358o0724N0384M8426l3294q6152p1976P5480J47895R949K2687
12416B87974N871n6128p6857k2237J8284O375n2550n3810J0853M5871J09763k7070
12404A96339r2748m0244Q5135J3546K8052j8942p1125M8223K5936l8573j9485
12393A16114M3057m1228Q4723K1658j7091j854j5486j06031l1428L9988r2019
$$ plain form
12474 198235 179838 167498 279974 253033 132362 98342 96457 72384 67662 50338 56265 125151
12462 125151 179233 163067 129093 101921 108262 145327 180196 188860 157378 105109 74790 81662
12450 81662 48758 41942 156638 222068 227696 142124 70992 55591 53966 102666 158845 202892
12438 202892 218369 241338 150820 124016 158160 231771 262408 197908 170391 193275 204657
12427 204657 185299 124575 174959 223385 190091 103939 31963 107443 255338 265287 287974
12416 287974 293845 237717 160860 138623 156907 163282 110732 56922 67775 113646 223409 196339
12404 196339 103591 63347 148482 162028 190080 171138 100013 148236 174172 135599 116114
12393 116114 159171 117943 202666 224324 207233 205379 189893 83862 52434 92422 403
12382D03R677n1122P5358P1882n4943J6766J22846O0886j2607q7211m2713j5749
12370I3473O8910M9109o130N6442K9844p8398n448n6460k37m5321r706r301P3269
12357A60046N7370K797o1812o4023J1268M8603j5115K4973L9913K4299M6348o2686
12345B11981k6972P9784k7697q6465j5194O3631Q2903m2255P944R7094N7881n7377
12333C45258o6124j15176R2546J00728l1778q6282k4536M2842p621r6409j3668
12322A39780J11961O9356l570p799L0583M3172q659J2878N323o1894r7508J2089
12310B45712P6736Q0481p1634m3124m9927j0060Q7714Q507L1060J6796Q2394O1320
12298E15975P3442o0604j43396m4030Q045J8277J6428p307m276L6358L7190j10715
$$ plain form
12382 403 10080 -41042 34316 106198 51255 68021 190867 251753 239146 151935 109222 93473
12370 93473 162383 211492 205362 261804 291648 213250 207802 151342 151105 105784 96078 86777 160046
12357 160046 217416 220213 158401 94378 105646 154249 139134 164107 204020 228319 274667 211981
12345 211981 185009 264793 237096 150631 135437 199068 281971 239716 247660 344754 402635 345258
12333 345258 279134 163958 256504 357232 325454 239172 214636 257478 249857 153448 139780
12322 139780 251741 321097 317527 309728 340311 383483 374824 387702 393025 331131 233623 245712
12310 245712 322448 402929 331295 288171 238244 228184 315898 324405 355465 372261 454655 515975
12298 515975 589417 528813 385417 341387 349432 367709 384137 376830 372554 408912 446102 335387
12286C35387n6551n5849N6603K2672j1114m0217o482J8611N7721K914J9630j11706
12274B31619k8991l712q940M5031O5075N8667N0797N2402j4406k7890J2163J5213
12262D47028j0119K2002P5931J6537n9344p6352m1964m8450j06066N5974N1851
12251C27028O2768J34893j3185n033k8951m8840m5634K9358P308m2990j9605P0480
12239D27597n2375l7648O1339k0690M3054M9420M783L897N3376R3954r840N6586
12227F73453M1050J09543j7464j39754r4189p55J0581k9964j968P3228p785k5342
12215E90634L4044l5432l3772P1108N0362J4052l1155N5725m3973m9887r3025
12204E28681m4337P2752R2903M5529o5121j1438k023P025m2561O3718M3075L0871
$$ plain form
12286 335387 278836 222987 279590 302262 291148 250931 244449 263060 320781 323695 343325 231619
12274 231619 202628 198916 189976 235007 300082 358749 409546 461948 447542 419652 431815 447028
12262 447028 436909 458911 534842 551379 492035 415683 373719 325269 219203 275177 327028
12251 327028 389796 524689 511504 506471 477520 428680 383046 412404 419712 376722 357117 427597
12239 427597 375222 337574 398913 378223 421277 470697 475480 479377 532753 626707 616867 673453
12227 673453 714503 824046 806582 666828 572639 571884 582465 552501 550533 623761 615976 590634
12215 590634 624678 589246 555474 626582 676944 690996 659841 715566 671593 621706 528681
12204 528681 484344 557096 649999 695528 630407 618969 616946 623971 581410 645128 688203 719074
12192G19074q1957K1437M6772j2490j0552L0020L8308L4039j5728j8665K531n4843
12180F97946l15j2679o6658J3052j929M656O4979K6281n4487P6678J06360K3802
12168H77686k6433p6087J2242J3082K0096J03526N6445M6791N0749n7740j14667
12157I05690N621P2767m22k2834J1580J04566J25804L3277Q0283M527l3416l232
12145A284211N860L6167j7848M5363n7346r7356n0342O9374J1208j0277n5997
12134A163017l3720p783K5160K5178L6561J1253m671J06967K832o8082Q95R7652
12122A355259j5865Q561r750R6727J7772O0559N8397q922p4799J04289J42588
12111A734816P1171r527J49560J10155J69716J35597J12959m492j3374J4016J16344
$$ plain form
12192 719074 637117 658554 705326 692836 682284 712304 750612 784651 768923 750258 752789 697946
12180 697946 697631 684952 618294 631346 629417 634073 699052 725333 670846 747524 853884 877686
12168 877686 851253 775166 787408 800490 820586 924112 980557 1027348 1078097 1020357 905690
12157 905690 911311 984078 983656 960822 972402 1076968 1202772 1236049 1316332 1320859 1287443 1284211
12145 1284211 1290071 1326238 1308390 1353753 1296407 1199051 1148709 1218083 1229291 1219014 1163017
12134 1163017 1129297 1121514 1146674 1171852 1208413 1219666 1214995 1321962 1324794 1256712 1257607 1355259
12122 1355259 1339394 1347955 1338205 1434932 1452704 1513263 1571660 1562738 1487939 1592228 1734816
12111 1734816 1805987 1796460 1946020 2056175 2225891 2361488 2474447 2469955 2456581 2470597 2586941
12100B586941Q3218O9325j26435k60532j27522p7893q3411l7457q824k0638j20971
12089A875801p8045M5846R5178J00002K5264m4050Q3247O2631N5881j0429N3038
12078B264364n4124m0747k7464L0691N5690L4686L5973r351J33819J51033J08432
12067B683002J37597R6994R3424K8538J88538L49179J55540J115R891J47160Q2876
12056C973854P6377j3733j70741k93808j88054k7956K2159J6326l7213R563R0781
12045C457555N1533o725J779J07885L6626q1040N1614J67019O039j3763O0217
12034C838739J14592N1199J47194J25019N8322o963K3137O8448J35917J21692
12024D677296J21041J68802P7295n0424M6431J42436K18477J34635J55340K05408
$$ plain form
12100 2586941 2670159 2739484 2613049 2352517 2224995 2147102 2063691 2026234 2017410 1996772 1875801
12089 1875801 1797756 1843602 1938780 2038782 2064046 2019996 2103243 2165874 2221755 2211326 2264364
12078 2264364 2210240 2169493 2142029 2172720 2228410 2263096 2299069 2289718 2423537 2574570 2683002
12067 2683002 2820599 2917593 3011017 3039555 3228093 3577272 3732812 3733927 3743818 3890978 3973854
12056 3973854 4050231 4036498 3865757 3571949 3383895 3355939 3378098 3394424 3357211 3366774 3457555
12045 3457555 3509088 3502363 3504142 3612027 3648653 3567613 3619227 3786246 3792285 3778522 3838739
12034 3838739 3953331 4004530 4151724 4276743 4335065 4328102 4351239 4419687 4555604 4677296
12024 4677296 4798337 4967139 5044434 4994010 5040441 5182877 5401354 5535989 5691329 5896737
12014E896737P7371K4848J47574M6142j6586j8610J2069J85272K4214L0165J73411
12003F582607J40274O9158J51581J84809J29604N1171O4583J15761J89258J26972
11993G805778K15621K39274J08907J04128J24231J23605J74276J86688K19539
11984I302047J92480K31210J56995J51869J91534J69266J28413K29372K03097
11975A0956283J78502K75414K20490N1922J12488J78011K48429K32615K16768
11966A2670922J87218K96298K26008Q3858N4122J14076K67267L43400J52686O3330
11956A4459185J39396K23057K04328J82988J49861J48646R3590R0838J10494J18485
11946A5920868K5511P2927J06798J21930Q7608P068L4906l5937J8984J00521M8354
$$ plain form
12014 5896737 5974108 5998956 6146530 6192672 6176086 6157476 6169545 6354817 6379031 6409196 6582607
12003 6582607 6722881 6792039 6943620 7128429 7258033 7309204 7373787 7489548 7678806 7805778
11993 7805778 8021399 8260673 8369580 8473708 8597939 8721544 8895820 9082508 9302047
11984 9302047 9494527 9725737 9882732 10034601 10226135 10395401 10523814 10753186 10956283
11975 10956283 11134785 11410199 11630689 11682611 11795099 11973110 12221539 12454154 12670922
11966 12670922 12858140 13154438 13380446 13464304 13518426 13632502 13899769 14243169 14395855 14459185
11956 14459185 14598581 14821638 15025966 15208954 15358815 15507461 15601051 15691889 15802383 15920868
11946 15920868 15946379 16019306 16126104 16248034 16335642 16342710 16377616 16341679 16360663 16461184 16509538
11935A6509538l6886r382j6754r9900j16709n4358p6881l0052J4644j58665q6409
11924A5838186o3548j46667j42669j44899j56638j12581r3482o7221j46462j29716
11914A4634303j38712k78326j70591j76261j96781j93115j06762k09090k26194
11905A2938471j22303j64237r6998j27370k75810l22633j07964o0089j76407k16321
11895A1268339j88045j93124j92033k33720k01259k10823j53971r7543j08989
11886I688832j71605j58105j09081j40695j08178n9807j44756k77198j78936j06483
11876H233988j71358j05778r5311k08534j36738r4673j89979r5256r6166r2144
11866F948051l0458j31962j46631l8051p0497j29409j91111r3095k9200r9881
$$ plain form
11935 16509538 16472652 16463270 16446516 16346616 16229907 16175549 16098668 16068616 16083260 15924595 15838186
11924 15838186 15774638 15627971 15485302 15340403 15183765 15071184 14977702 14910481 14764019 14634303
11914 14634303 14495591 14217265 14046674 13870413 13673632 13480517 13373755 13164665 12938471
11905 12938471 12816168 12651931 12554933 12427563 12151753 11829120 11721156 11661067 11484660 11268339
11895 11268339 11080294 10887170 10695137 10461417 10260158 10049335 9895364 9797821 9688832
11886 9688832 9517227 9359122 9250041 9109346 9001168 8941361 8796605 8519407 8340471 8233988
11876 8233988 8062630 7956852 7861541 7653007 7516269 7421596 7231617 7136361 7040195 6948051
11866 6948051 6917593 6785631 6639000 6600949 6530452 6401043 6209932 6116837 6087637 5987756
11856E987756j36350j34121n0669r9595N273l152j29507j46036p2488l8024n5912
11845E127175j01549l5306j44991j76649j48009l862l5411o0128n3108j67862
11835D200300j02763j2643M398l1227O6091j0933r8740n0798j19587j14804j39297
11824C589997n9079n3380J3776K4300k6855l2051n9806j04588j44029o0487m4485
11813C043313M8661L1728n9453o1037j48794j18860j9578L3760M3546K5221j02478
11802B716029p9321M7764k6197m6727q5409l5277o3124p9947K8679Q594N4403
11791B439467P1180M0042k02574j70554n9182Q9665k5163n6642p3052K967L5634
11780B091788l2047r970j4810l7260n1060j10800q9300j8653j3507L9632k0893
$$ plain form
11856 5987756 5851406 5717285 5666616 5567021 5572294 5569142 5439635 5293599 5221111 5183087 5127175
11845 5127175 5025626 4990320 4845329 4668680 4520671 4516809 4481398 4421270 4368162 4200300
11835 4200300 4097537 4084894 4089292 4058065 4124156 4113223 4014483 3963685 3844098 3729294 3589997
11824 3589997 3530918 3477538 3491314 3515614 3488759 3456708 3396902 3292314 3148285 3087798 3043313
11813 3043313 3091974 3123702 3064249 3003212 2854418 2735558 2715980 2749740 2793286 2818507 2716029
11802 2716029 2636708 2684472 2658275 2611548 2526139 2490862 2427738 2347791 2376470 2385064 2439467
11791 2439467 2510647 2550689 2348115 2177561 2118379 2208044 2182881 2126239 2053187 2056154 2091788
11780 2091788 2059741 2049771 2034961 1997701 1946641 1835841 1746541 1727888 1714381 1754013 1733120
11769A733120l5312k5456P559Q3169K9107n838q6354j31795j15588K5800N2522
11758A530934J3513n8089J6695r4909n7956N2364l3468J949k1360N216n0184k4807
11746A279898N6677M3934N8090P3641r4715o6940k3830M6112l9736m2792l484
11735A286855p5258p7653m8588l9734P6558M9582M0928L2982q8103L3653J742
11724A192964r3030j39936o7797R3959R5093K8838M0456O7189m1421q9763J610
11713A088162l4981p4903j2207J03911Q3779j1443m6543l7453R1199q5743p6352
11702I87426L9351r708p1256m1166o7792k0406N0722N7346J17946k6150n2382
11691I63931o0916N0533O3380o3370k6998j5177l6576K5492k3607R172j5281l8628
$$ plain form
11769 1733120 1697808 1672352 1679911 1763080 1792187 1786349 1699995 1568200 1452612 1478412 1530934
11758 1530934 1544447 1486358 1503053 1408144 1350188 1402552 1369084 1371033 1349673 1354889 1304705 1279898
11746 1279898 1336575 1380509 1438599 1512240 1417525 1350585 1326755 1372867 1333131 1290339 1286855
11735 1286855 1211597 1133944 1085356 1045622 1122180 1171762 1212690 1245672 1157569 1191222 1192964
11724 1192964 1099934 959998 892201 986160 1081253 1110091 1150547 1217736 1176315 1086552 1088162
11713 1088162 1053181 978278 966071 1069982 1153761 1142318 1095775 1058322 1149521 1063778 987426
11702 987426 1026777 1017069 945813 904647 836855 816449 867171 924517 1042463 1016313 963931
11691 963931 903015 953548 1016928 953558 926560 911383 874807 900299 876692 885864 870583 831955
11679H31955K2721Q3623q6947M0435K0611j03099j72305R856J32216P6136r2611
11668G62591q8263n2473P0624N6511m6744l6135J8132J9312j4116l3083q0309
11657E76047J8962N6887n505j4839N2644L3784J2999l6635m5006J727K8616l3482
11645F46199j4877j32009j02165O1308J28809L1205o4221o2865K2466J42854L8911
11634F95615n0410o966R341o4401r1647j16392j06255L3930P1912M3239L5538
11623D53504J0312M5539k0347n1793o9788L6154j9456P6773O3662J1280J2480
11612E48320q1898l9546j2599n5582m981N045j3723K4545p0722p4877M5547K9375
11600B98904o73K9207l6501n6091K6182J07027M1521O956m3282n8060m145l889
$$ plain form
11679 831955 854676 938299 851352 891787 912398 809299 636994 646850 779066 855202 762591
11668 762591 674328 621855 692479 748990 702246 666111 684243 703555 689439 656356 576047
11657 576047 595009 651896 646391 631552 684196 717980 730979 694344 649338 651065 679681 646199
11645 646199 631322 499313 397148 458456 587265 618470 554249 491384 513850 656704 695615
11634 695615 645205 638239 647580 583179 491532 375140 268885 302815 374727 417966 453504
11623 453504 463816 509355 489008 437215 367427 403581 384125 460898 524560 535840 548320
11612 548320 466422 426876 414277 358695 353714 358759 345036 369581 298859 223982 269529 298904
11600 298904 298231 327438 290937 234846 261028 368055 409576 416532 373250 315190 311045 307156
11588C07156N1452M4922N415J6846K7259N1745j3925q1103q9671m7915L2587K4704
11576C29472P2321J7369o2190l6806O3880q1259n4389r4157m6863Q4053O1075
11565B52506o7266m0376J62919K930o9560M1330l654j0283J110l2748m6448L385
11553A93845N8055m49k9408l5687j6282Q1245n58l2442k9452l1750O84M2298N0971
11540B51070K3263K548k6631K3291L3632Q4394P0057O867r6722k2175p185o7323
11528B75086l9602M2950m9490n8301K1641P089q3980l9083P9703P0079n5244Q006
11516A78854P3678j2484k6175n2796K8264Q902m2706M2694m382m3981k9414q625
11504A11829J817N467N3625N1699r071r772n7684j6044o9058P0345Q4491Q7273
$$ plain form
11588 307156 358608 403530 408945 425791 453050 504795 490870 409767 320096 272181 304768 329472
11576 329472 401793 419162 356972 320166 384046 302787 248398 154241 107378 191431 252506
11565 252506 185240 144864 307783 310713 241153 282483 278829 268546 269656 236908 190460 193845
11553 193845 251900 251451 222043 186356 170074 251319 250761 218319 188867 157117 157801 200099 251070
11540 251070 274333 276881 250250 273541 307173 391567 461624 468491 371769 349594 342409 275086
11528 275086 235484 278434 228944 170643 192284 199373 115393 76310 156013 226092 170848 178854
11516 178854 252532 240048 213873 161077 189341 198243 155537 198231 193849 149868 120454 111829
11504 111829 113646 119113 172738 224437 215366 205594 147910 131866 62808 133153 217644 304917
11492C04917K2511j2305j876j10938p7302K7454J564M0183R8557r137p4897l8964
11480A69767N966l3768j2075J06146L8322p9046q2381n296L7910k513L7663P8081
11468B58776m3850o8341j649R930l2096J00698R821k5822j976k9150l4878K7623
11456A69086L8281K6638j185L2029j989j6696Q476m6911j19759m0542m9418J5265
11444A3275N5521M5282M1286O7827p9893J4918j8032L9995j8099l6016K2619N9448
11432B08131J0393q4733J8815N5465o2693j25527q7170J5940J31821M6821J1343
11421A38606N1613r021l8514l9117L1812N8470j3513M5859N8567k3090j01530
11410A60142K2722j3466j8157J705K0748l1103R6919j19924j1791M3292l8498
$$ plain form
11492 304917 327428 315123 313247 202309 125007 152461 154025 194208 292765 283628 208731 169767
11480 169767 175733 141965 129890 236036 274358 195312 112931 107635 145545 143032 180695 258776
11468 258776 214926 146585 144936 154866 122770 223468 233289 207467 205491 176341 141463 169086
11456 169086 207367 234005 232820 264849 262860 246164 254640 207729 87970 47428 -1990 13275
11444 13275 68796 114078 155364 223191 143298 158216 140184 180179 162080 126064 148683 208131
11432 208131 218524 133791 152606 208071 145378 19851 -67319 -51379 80442 127263 138606
11421 138606 190219 181198 142684 103567 135379 193849 180336 226195 284762 261672 160142
11410 160142 182864 169398 151241 152946 173694 142591 239510 119586 107795 151087 112589
11399A12589O279j7245j3373r4456O2162J25618j12081j71780j1252Q3941J39396
11388A09798Q0288K2539l3024m4969J3975P6328R7553m0641p5969q5555K0624
11377A40947N632L2150o4910p2141p0804J0336k4963k6242J3189J15445Q4214
11366A42853n410o9146k9771p092p3260k5076q5877L6394K14823J73873N6950
11355C29261q0276m7618k3578K3985K6468o1909j24733l4951N0152K9155L4426
11344A20382k7320L4161r827l0626J9602k2214P0302N6275M0769R286J4817J8729
11332B94336j34987j9636J41009L2120m1130M7767k0172j3861N0719M1433M3538
11321D21136j1151K0369N7270J35251P0317J42817J26760K79945M54556M95295
$$ plain form
11399 112589 118868 101623 88250 -6206 55956 181574 69493 -102287 -113539 -29598 109798
11388 109798 190086 212625 179601 134632 148607 224935 322488 281847 205878 120323 140947
11377 140947 146579 178729 113819 41678 -29126 -18790 -43753 -69995 -56806 58639 142853
11366 142853 137443 68297 38526 31434 -41826 -66902 -152779 -116385 98438 272311 329261
11355 329261 248985 201367 177789 201774 228242 166333 41600 6649 56801 85956 120382
11344 120382 93062 127223 117396 86770 106372 84158 154460 210735 251504 260790 275607 294336
11332 294336 159349 139713 280722 312842 271712 319479 299307 285446 336165 377598 421136
11321 421136 409985 430354 487624 622875 693192 836009 962769 1242714 1697270 2192565
11311B192565K75306P9265r204M5997j0846k137r7774k82935l82548m00325k46185
11300A161179j98314j18469j09437o8233j27958k0709J4568k7315j7363k5568
11290D62381J5164o55j07862J3722M7611l4133j3147r1074q0641k0193k7003M9149
11278B13319P4762p0693j02133K4350J09267j48579p2509M4491N5060N8715l4218
11267A51832m8814K3743J0192j7097m0276m1829l4356q540P5637L6379M2848r757
11255A39962J4041j5668N2716J5090L1159j4636m0979P7707K0502p388m9710o730
11243B16066o1369l8615L3344J3489j2466p3772J2255k9936m2965k0549n4951
11232e9469l3915K9170L5693Q377M4046k6151p8286l0432P7557M6500P9039J05736
$$ plain form
11311 2192565 2467871 2547136 2537932 2583929 2573083 2570946 2473172 2190237 1807689 1407364 1161179
11300 1161179 962865 844396 734959 666726 538768 518059 532627 505312 487949 462381
11290 462381 477545 476890 369028 382750 430361 396228 383081 292007 211366 191173 164170 213319
11278 213319 288081 217388 115255 139605 248872 100293 27784 72275 127335 186050 151832
11267 151832 103018 126761 136953 119856 79580 37751 3395 -5145 70492 106871 149719 139962
11255 139962 154003 138335 191051 206141 237300 222664 181685 259392 279894 272506 222796 216066
11243 216066 154697 116082 149426 162915 150449 76677 88932 58996 16031 -4518 -59469
11232 -59469 -93384 -64214 -28521 -20144 23902 -2249 -80535 -110967 -33410 13090 92129 197865
11220A97865N7262o1623j17044m0546p5967o7758m154L1665M9074K1957j6484
11209b5753n9039m7354N6460M7744J42008J3013o0154j33874J465M1301l6575
11198f0758K8426P9816K3345J7279n7140m5079L6655M4619r6213m8006J8290R969
11186d8797K4284m1529N4235p1718n0191L2159L8529K8361O468J344L9123Q214
11174B0482N8319L9012m5688J5782j7502k9996L2025l3111p1201m5087K1595L3598
11162b1772m3417n3481Q6367N9352R7527J30220p5023n7889J27090J13097L895
11151C65966l5364m1129k4118P978K7439m6439j9308j4315L5728j8163k5963n2889
11139A59423p3841l0757K126r8897p6247n0046k5108Q3789M3368J0094o2598m4300
$$ plain form
11220 197865 255127 193504 76460 35914 -40053 -107811 -111965 -80300 -31226 -9269 -25753
11209 -25753 -84792 -132146 -75686 -27942 114066 127079 66925 -66949 -65484 -24183 -60758
11198 -60758 -32332 47484 70829 88108 30968 -14111 22544 67163 -29050 -77056 -58766 -48797
11186 -48797 -24513 -66042 -11807 -83525 -133716 -101557 -63028 -34667 -28199 -26855 12268 20482
11174 20482 78801 117813 72125 87907 70405 40409 72434 39323 -31878 -76965 -55370 -21772
11162 -21772 -65189 -118670 -32303 27049 124576 254796 179773 121884 248974 362071 365966
11151 365966 330602 289473 265355 273333 300772 254333 235025 220710 256438 238275 212312 159423
11139 159423 85582 54825 56951 -41946 -118193 -168239 -193347 -109558 -66190 -56096 -118694 -162994
11127a62994j1767N5987O6987K120j61n68M9775r0132n4796K1989l8098k8471
11115a90129K1031N4558l552Q7318L8684m3109L460M3546r950l3967m3059l5226
11103a10395L6141L5078l8505J1003N7680O2422J7742j986P6203j4106j7517P3525
11091A87285L2107L1864J744M0171o380p328J5428j5987o3534n6080l7777M1687
11079A63200M0020M5056m2982o0779j2374l5110m7218n3594M7815J14319Q6494
11068B44847J9078p680r153m6938O4749j4341p0096n3029j2536j2519M4911L5645
11056A82938L7407J4822l4142o0134O1457J24299M7514o2961K2401O3832P1747
11045D69180p7171k1183R8596n29j0665M624Q8119K9592N6383M9633l6409j5617
$$ plain form
11127 -162994 -174761 -118774 -51787 -49667 -49828 -50396 -621 -90753 -145549 -123560 -161658 -190129
11115 -190129 -169098 -114540 -118092 -30774 7910 -35199 -31739 11807 1857 -32110 -75169 -110395
11103 -110395 -74254 -39176 -77681 -66678 -8998 53424 71166 69180 145383 131277 113760 187285
11091 187285 219392 251256 253000 293171 286791 279463 294891 278904 215370 159290 121513 163200
11079 163200 203220 248276 205294 144515 132141 97031 49813 -3781 44034 158353 244847
11068 244847 263925 256245 247092 200154 264903 250562 180466 127437 114901 102382 147293 182938
11056 182938 220345 235167 201025 140891 202348 326647 374161 311200 333601 397433 469180
11045 469180 392009 370826 469422 468893 458228 462852 550971 580563 636946 686579 650170 634553
11033F34553Q934l8593k1442l8262n7991K8287Q0149Q9229l4587o2261q231L4080
11021F13865K8565k2789L5420L2708O8049K4545J1483J81438N2853N9l0568M66
11009I96094j8166m3009k945K1791r436m918L020l8126N172j01434J6150N57J3789
10996H38539Q389p6686r9933n3404K0733J8313n4379p786O7269O4932l9008Q973
10984F95952m6176N0100j9405L8138k0943j514Q9010n5525p3220l4250J59299
10973G81466K7991l3459N5347k5721Q8538J27077J7460r8134l5903R7481P5224
10962A077367m889Q0606O0318l0166L5766M7155M6241N9047K5319R5703N1751
10951A544218J18791K11028J04234Q8469R1930J25459J75077K01236J60274J12736
$$ plain form
11033 634553 643487 604894 583452 545190 487199 515486 595635 684864 650277 588016 579785 613865
11021 613865 642430 619641 655061 687769 755818 780363 791846 973284 1026137 1026196 995628 996094
11009 996094 977928 934919 931974 953765 944329 939411 942431 904305 909477 808043 824193 824750 838539
10996 838539 846928 770242 670309 616905 637638 655951 601572 593786 661055 725987 686979 695952
10984 695952 649776 699876 680471 718609 697666 696152 785162 729637 656417 622167 781466
10973 781466 809457 775998 831345 805624 894162 1021239 1038699 940565 904662 1002143 1077367
10962 1077367 1072478 1153084 1213402 1183236 1219002 1266157 1312398 1371445 1396764 1492467 1544218
10951 1544218 1663009 1874037 1978271 2066740 2158670 2284129 2459206 2660442 2820716 2933452
10941B933452J49747J70550J64254K40051L84184L85964M81684L93987K96716
10932E600589M37861N10658N63828O54091O34592P49996R21439J088158J168501
10923A2329713J120950J169635J398042J496699J697926J932056K026196K245374
10915B5416591K902203L766047M826314O004619P496936R726118J2950312J7576480
10907I0665620K4586519L5280300N1313572P2810331Q9944398P4983675L3173298
10900D72757713P484880m02936K825209R600524J30296l9068631q4947968q6946772
10892B81432315o4308339m4338186l0532202k1511084j5499211j1620044r049382
10885H4573867p207989n869892m843536m128150l546148l018470k698474k435109
$$ plain form
10941 2933452 3083199 3253749 3418003 3658054 4042238 4428202 4909886 5303873 5600589
10932 5600589 6038450 6549108 7112936 7767027 8401619 9151615 10073054 11161212 12329713
10923 12329713 13450663 14620298 16018340 17515039 19212965 21145021 23171217 25416591
10915 25416591 28318794 32084841 36911155 42915774 50412710 60138828 73089140 90665620
10907 90665620 115252139 150532439 201846011 274656342 364600740 439584415 472757713
10900 472757713 480242593 479839657 482664866 492265390 492395686 453327055 368379087 281432315
10892 281432315 217123976 172785790 142253588 120742504 105243293 93623249 84573867
10885 84573867 77365878 71495986 66652450 62524300 58978152 55959682 53261208 50826099
10877E0826099k278720k330624k175560k085216k070913j896114j785340j980216
10869C4223396k004972j687879j602074j453770j220371j104128j057994r73895
10861B3118313q64921q66886q24700q25462o60396n84569p30430o69074n96292
10852A6495583n82027n27226n52325n14774m71870m16929m16168l42726k82601
10843A2388937m22339l46780k83740l26195l73437l34285l22203k74838k55006
10834I450114k22410k82366k72160j88227l20236k23133j09431k34236l23868
10825G274047k36366j00169j10761l04918k01532j59466k50447j37853j30933
10816E641602k31708j18712j58680j35625j10793j50263p2714j64719p7956l1072
$$ plain form
10877 50826099 48547379 46216755 44041195 41955979 39885066 37988952 36203612 34223396
10869 34223396 32218424 30530545 28928471 27474701 26254330 25150202 24092208 23118313
10861 23118313 22253392 21386506 20561806 19736344 19075948 18491379 17760949 17091875 16495583
10852 16495583 15913556 15386330 14834005 14319231 13847361 13430432 13014264 12671538 12388937
10843 12388937 11966598 11619818 11336078 11009883 10636446 10302161 9979958 9705120 9450114
10834 9450114 9227704 8945338 8673178 8484951 8164715 7941582 7832151 7597915 7274047
10825 7274047 7037681 6937512 6826751 6521833 6320301 6160835 5910388 5772535 5641602
10816 5641602 5409894 5291182 5132502 4996877 4886084 4735821 4663107 4498388 4420432 4389360
10806D389360r1746j74012j07202p8271k1883j23351j53137j06864L143k7517
10796C508520J069q4687j16336j65245p9506j5809L7149K3928l2898j22677p6975
10785B876533m004Q0159O8520j0658j826R9481Q0120m8142P6J01502r4344q1818
10773C065599q8161m9528o0627r4881j56635j95052j97668j13878j54478o8157
10763A886534l1387k5729j456r1561p5937K2668m5022j90333j02984N8464K836
10752A406093K6611l3227r4029n6281k9299k7417L3138j0772k5496j23177l6542
10741A029602J3853M3578L6780o6582k3518J8806n9328n7158k576o696r7468n5693
10729G73600q0075m4718K3994L4878M8400m1780J5359l9134l4222L2763p7156
$$ plain form
10806 4389360 4297614 4123602 4016400 3938129 3916246 3792895 3639758 3532894 3536037 3508520
10796 3508520 3509589 3424902 3308566 3143321 3063815 3048006 3085155 3109083 3076185 2953508 2876533
10785 2876533 2872529 2952688 3021208 3010550 3008724 3108205 3188325 3140183 3140259 3241761 3147417 3065599
10773 3065599 2977438 2927910 2867283 2772402 2615767 2420715 2223047 2109169 1954691 1886534
10763 1886534 1855147 1829418 1827962 1736401 1660464 1683132 1638110 1447777 1344793 1403257 1406093
10752 1406093 1432704 1399477 1305448 1249167 1219868 1192451 1225589 1214817 1189321 1066144 1029602
10741 1029602 1043455 1087033 1123813 1057231 1033713 1052519 993191 936033 933457 926761 829293 773600
10729 773600 693525 648807 672801 707679 756079 714299 729658 690524 656302 689065 611909
10718F11909r346M6843k447L7331N112j56018o0701P604O4757K6968p607L2445
10706E96850P8417k6089p129n262n8494N7773j5095p618r030M0666K8782Q177
10694F81948K3859k5752k4755M7710P9367k6380q1863m8867O0612R0118o1976
10683G14021l5669L7921M9782k9255P243p3822L1026P0117O9500J17482L6220
10672I94566q2340j76732L0837R8958n7040j26548K168K3708J8490J15380L0719
10661H72166o3740J7196P3558J22925L1731L2193R1715J61214J35095m1127o6581
10650A366345q5199P1719J20529L0312l0107J5230M2599P6226J28137J65540J46646
10639B047977J40431K59161M11381L48323K33186K95880L29002L91160M92495
$$ plain form
10718 611909 602563 649406 646959 684290 689402 533384 472683 480287 545044 572012 564405 596850
10706 596850 675267 649178 642049 636787 578293 636066 620971 613353 604323 644989 673771 681948
10694 681948 705807 680055 655300 703010 782377 755997 674134 625267 685879 775997 714021
10683 714021 678352 716273 766055 736800 744043 670221 701247 771364 840864 958346 994566
10672 994566 912226 735494 766331 865289 808249 681701 683869 707577 726067 841447 872166
10661 872166 808426 825622 899180 1022105 1053836 1086029 1177744 1338958 1474053 1432926 1366345
10650 1366345 1281146 1352865 1473394 1503706 1473599 1488829 1531428 1607654 1735791 1901331 2047977
10639 2047977 2188408 2447569 2858950 3207273 3440459 3736339 4065341 4456501 4948996
10630D948996M92124M59802N33304Q07755J192142J619667K173861K806228L668193
10621A8702072M655211N060045M790957L869498K889189K453268K626421K841486
10613D7888147K702514K473507K832768M425476O787389Q030336P083030M903022
10605H7126189L057275K532725K901449L319992K448474N53344J34668K492172
10597A04566288O176067Q119531O752895L560682J223670N71465Q44576N25033
10589A32340207j916224n741931p653059n821284k176497J86691k6660j355116
10581A07836127k249663k318271j906904k290735m119301o682095p851915o625697
10573G3791546m547014k902145k291412k395528k648577k613925k494399k877719
$$ plain form
10630 4948996 5441120 5900922 6434226 7241981 8434123 10053790 12227651 15033879 18702072
10621 18702072 23357283 28417328 33208285 37077783 39966972 42420240 45046661 47888147
10613 47888147 50590661 53064168 55896936 60322412 67109801 75140137 82223167 87126189
10605 87126189 90183464 92716189 95617638 98937630 101386104 101939448 102074116 104566288
10597 104566288 110742355 118861886 125614781 129175463 130399133 130970598 131815174 132340207
10589 132340207 130423983 124682052 117028993 111207709 109031212 109217903 109191243 107836127
10581 107836127 105586464 103268193 101361289 99070554 94951253 88269158 80417243 73791546
10573 73791546 69244532 66342387 64050975 61655447 59006870 56392945 53898546 51020827
10565E1020827l740589m740478n205737m947949m031593l154751k396534j859961
10557B0943235j473971j167672j002556r48489q43225p12094o80715o34746o45491
10548A2834276n46658m84960l94293m14984m25314l50224l40045l58225l56848
10539I162725l18237l69614k49989k39845k75128j36363j86629k76551k74662
10530F835707k03657k13214r0988j63743k08791j78185k05862j60069j53951j36369
10520E120878j52858r2283r0081j85676j29172m9529o1614j46027j33823j08707
10510C971108m0598j23260k11875j55455m4378m2947j62884k2826L4883m3935
10500C157833k02538l8080Q6602O7981K1649q763N886M2050J14877P4057J95890
$$ plain form
10565 51020827 47280238 42539760 37334023 32386074 28354481 25199730 22803196 20943235
10557 20943235 19469264 18301592 17299036 16350547 15507322 14795228 14114513 13479767 12834276
10548 12834276 12287618 11802658 11408365 10993381 10568067 10217843 9877798 9519573 9162725
10539 9162725 8844488 8474874 8224885 7985040 7709912 7573549 7386920 7110369 6835707
10530 6835707 6632050 6418836 6327848 6164105 5955314 5777129 5571267 5411198 5257247 5120878
10520 5120878 4968020 4875737 4785656 4599980 4470808 4421279 4359665 4213638 4079815 3971108
10510 3971108 3930510 3807250 3595375 3439920 3395542 3352595 3189711 3166885 3201768 3157833
10500 3157833 2955295 2917215 3003817 3071798 3093447 3084684 3090570 3132620 3247497 3321554 3517444
10489C517444L04576L70526K83257J25518M0162l6833K4877q2965o8640j57583
10479D320339k99323m54933m09897l66628k31195m4169o4422j21569j33958r7542
10469B096703m9969k9m8114m8574j0915q0993j8229o8748p1837j09904r2406l0431
10457A466554N6047O958J297j2979r2099l7520o2411l3664j3789o2165j23834
10446A092395L2073l6442q3523n6040K2202l8937K0818o4967o1089p4690p4670
10435F77130O3056J7486k1587O4976m6867m0074o7099l5974k2509P193k3865K1828
10423E93694n896p5339q365N4235O4311o0689j8255K2124q6403k1099J862R7853
10411E58033J5297j14680m4178N3109o507n2000j00993M6034P9048Q7928K4151
$$ plain form
10489 3517444 3822020 4192546 4475803 4601321 4641483 4604650 4629527 4546562 4477922 4320339
10479 4320339 4021016 3566083 3156186 2789558 2558363 2514194 2449772 2328203 2194245 2096703
10469 2096703 2046734 2046705 1998591 1950017 1939102 1858109 1839880 1771132 1699295 1589391 1496985 1466554
10457 1466554 1522601 1529559 1530856 1517877 1425778 1388258 1325847 1292183 1278394 1216229 1092395
10446 1092395 1124468 1088026 1004503 948463 970665 931728 952546 887579 826490 751800 677130
10435 677130 740186 757672 736085 801061 754194 714120 647021 611047 588538 595731 571866 593694
10423 593694 587798 512459 504094 558329 622640 561951 543696 565820 479417 458318 460180 558033
10411 558033 573330 458650 414472 467581 461074 409074 308081 354115 433163 521091 545242
10400E45242k1803k5022o4783O0918k8571R679M3644J42739l4337q0554M6350
10389E93502k3239q4515l2269Q2726P3104j2299j51580n9796P6485P9211J4610
10378E55940J791m242o2573q3795k9020O5622Q7972O4898n555p9337m0427N1809
10366E23083L9292j6768k4498K2468m3504l2943L1210J0421k8773o3722l9206
10355C77060Q949N0839N1848k0856k5209P6780m6488o1284L7487m2995j07877
10344B98254l848O6297M4647L8386o0854M3556j2546k6123l8127j2977j7148J1696
10332C31213N7235O1313j22875k6906L6545j828P2143K3106k8550p6244k3266
10321C01886J0277q532M6753L5402j1383J5985L7221l9736l5121n1728j24402
$$ plain form
10400 545242 523439 498417 433634 494552 465981 475660 519304 662043 627706 547152 593502
10389 593502 570263 485748 453479 536205 609309 597010 445430 385634 462119 541330 555940
10378 555940 557731 553489 490916 407121 378101 443723 531695 596593 591038 511701 471274 523083
10366 523083 562375 545607 521109 543577 500073 467130 498340 508761 479988 416266 377060
10355 377060 386009 436848 488696 467840 442631 519411 472923 411639 449126 406131 298254
10344 298254 294406 360703 405350 443736 382882 426438 413892 387769 349642 336665 319517 331213
10332 331213 388448 449761 326886 299980 336525 334697 406840 429946 401396 325152 301886
10321 301886 312163 303631 350384 385786 374403 390388 427609 387873 352752 301024 176622
10310A76622j0365K3440M0721K4446Q1272k4713N0501L8928J3877n6637n032p3217
10298B79843j2180p4333o2727m1919m0467N5656J01283O1344o2162N9678N106
10287B69122l2030J4302o4053Q4741J3283m6534l1370l6556l7815K233J28773
10276B64096R3434N2639k6094o5891p5539n5924M3477k6613n8629p4518k0869
10265D9569L7525N338L0894J02614K0556M5351j6074k5116O0389M1089L1604j3269
10253C70470j4194o0629l6671r3008j2156K3583M1025M14K5895j1765p9073m1092
10241A12799N8850P2195k812K5279m3901l1722K3457M566l3820N7802j5027J9189
10229B46855j581p0583k8920M1491L4503L7054Q0229j00306j46539p1133K2877
$$ plain form
10310 176622 166257 189697 230418 254864 336136 311423 361924 400852 414729 358092 353060 279843
10298 279843 267663 193330 130603 88684 48217 103873 205156 266500 204338 264016 269122
10287 269122 237092 251394 187341 272082 285365 238831 207461 170905 133090 135323 264096
10276 264096 357530 410169 384075 318184 242645 186721 230198 203585 144956 70438 49569
10265 49569 87094 92432 123326 225940 246496 291847 275773 250657 311046 352135 383739 370470
10253 370470 356276 295647 258976 165968 153812 177395 218420 218834 244729 232964 153891 112799
10241 112799 171649 243844 241032 266311 222410 190688 214145 218711 184891 242693 227666 246855
10229 246855 245274 174691 145771 187262 221765 258819 339048 238742 92203 21070 43947
10218D3947M0170p771L7285l981n5045J5928L2622Q6396R4259J5278m7501m612
10206B46975o2345j19354L1546Q8346M3180l0905m410J9954q0423m0767P0532
10195A62329J31277O8273l2866m818P8687p2326j59272Q584Q2372M4707P5396
10184C82343N2419n2163N029L0415l722o5059o2513J6370R1897J25586J03991
10173F24593p8431k9756O6137k4138M7833K2417n0948j2817P1613L9019j176l1017
10161F43329J04770P2080k4965L1771N4231J7870k1570K9254M0412l7j21100j21461
10149G04584j4369j3885n0252k5874L5165L9457p0874l1847r610N2545j8858K8268
10137F24450L1766r6332o1292M6854o4572J0222R2303o038j01244j19237m0432
$$ plain form
10218 43947 84117 76346 113631 109650 54605 70533 103155 189551 283810 299088 251587 246975
10206 246975 184630 65276 96822 185168 228348 197443 193033 212987 132564 91797 162329
10195 162329 293606 361879 329013 324195 402882 330556 171284 179868 262240 306947 382343
10184 382343 434762 382599 387628 418043 414321 349262 286749 303119 395016 520602 624593
10173 624593 546162 516406 582543 558405 606238 628655 577707 564890 636503 675522 674346 643329
10161 643329 748099 820179 795214 826985 881216 899086 877516 906770 947182 947145 826045 704584
10149 704584 690215 676330 626078 600204 635369 674826 603952 572105 562495 615040 596182 624450
10137 624450 656216 559884 498592 545446 480874 491096 583399 577361 476117 356880 316448
10126C16448P856p2438q0057M0753N7979l1510k1040l2677j7401k647j0106K7760
10114A82920L5481K9376J9513N4295l7893r6737m514K189n1517r1963q065K8173
10102F1258N2421L6680k1837N210M0678m0308Q997O7508J3808m6608J8435j9585
10090A76657N9069Q1098m9111k6753Q577o6058n4043o3213l742o6984J1463j8588
10078a1628l3728J6590M1720m317L765M278m4113k616M4512R5906L1201k9419
10066A12151o7322k7056p7494L7843K4644K1149M3551k3946Q5117M2836K2071
10055A93544K7734l269o3876o9802j8714P7659j925m7557M8435P7872k3842k1843
10043A74416m4395p5344J6953N1524Q603j3201J9999m368n9568l7351J6710N2314
$$ plain form
10126 316448 324304 251866 171809 212562 270541 239031 217991 185314 167913 165266 155160 182920
10114 182920 218401 247777 267290 321585 283692 186955 182441 184630 133113 41150 33085 61258
10102 61258 113679 150359 128522 133732 174410 134102 143099 210607 224415 177807 196242 176657
10090 176657 235726 316824 267713 240960 249537 183479 129436 66223 62481 -4503 6960 -11628
10078 -11628 -45356 -28766 12954 8637 12402 16680 -27433 -30049 14463 110369 141570 112151
10066 112151 44829 17773 -59721 -21878 2766 23915 67466 43520 128637 171473 193544
10055 193544 221278 218009 154133 84331 65617 143276 141351 93794 142229 220101 196259 174416
10043 174416 130021 54677 71630 123154 131757 118556 138555 134187 74619 37268 53978 106292
10031A06292L5170Q499J7963j9496M729N4144j3166n009o9619J4882K9689K9575
10019A93653n319l6284O3388R1490m9641o6774q4452m4038q126M0235K4710n6983
10007F1859m6604J56481O9583L5550p8881R913o5448o5880j3261l4561l2425j0743
9995a4417Q157j9167O0052P0731L6132l6007o70l9131n7477K7968R50q741J07604
9982A35984L8757J4556q4528o6362k9549O1495K398p9234O0483n4385j10565P0693
9970d0257M9268J0415K6474m8792M9087L3617p9812j2115N3034O7409L0863J3233
9958A52424j26336l8464L2571L2721P626J4632m111L6044J0968L4344k5178p1770
9946E5471K4635n804r527j5317J00722M6395j11325l1151M0452J04332J75195
$$ plain form
10031 106292 141462 149961 167924 148428 153157 207301 194135 189126 119507 134389 164078 193653
10019 193653 188334 152050 215438 306928 257287 190513 106061 62023 53897 94132 118842 61859
10007 61859 15255 171736 241319 276869 197988 207901 142453 76573 63312 28751 -3674 -14417
9995 -14417 -6260 -25427 34625 105356 141488 105481 104811 65680 8203 36171 37121 28380 135984
9982 135984 174741 189297 104769 38407 8858 70353 72751 -6483 54000 -385 -110950 -40257
9970 -40257 9011 19426 45900 -2892 46195 79812 0 -12115 40919 108328 139191 152424
9958 152424 26088 -12376 20195 52916 60542 75174 71063 107107 118075 152419 127241 55471
9946 55471 80106 74302 64775 49458 150180 196575 85250 54099 94551 198883 374078
9935C74078J36538l3861k3935J7646l1206J78059Q8324p4272j62309r1032n9658
9924C18372o9949K153n3049n8066n2129l4525P7293N5553Q009n1584j3914N1859
9912A80023l5247r8682o1074k8544K3925K7980J1573k4375m9444R4970O08Q3936
9900A25649p5913j37449j2642M7934P8248J00983p0208p6328K2753R1253N1273
9889A45553K0700K953O9205O8441m9539j48274o08K5640K698j22388k2722J19789
9877A11448N7327K1110J07893j8707j11192j26900m0793O3238k6693M3787m2908
9866C7610p5171j8246j3105K5026K8470L8298M3839J5500j8934m2270l1348R332
9854i99N7892N0122j2932o4744l5179n7250j073K8508N3058L9282J58550N0781
$$ plain form
9935 374078 510616 476755 452820 470466 439260 617319 705643 631371 469062 378030 318372
9924 318372 248423 250576 197527 139461 87332 52807 130100 185653 193662 142078 128164 180023
9912 180023 144776 46094 -14980 -43524 -19599 8381 19954 -4421 -53865 41105 41713 125649
9900 125649 49736 -87713 -100355 -52421 25827 126810 56602 -19726 3027 94280 145553
9889 145553 166253 169206 238411 306852 257313 109039 108431 134071 136769 14381 -8341 111448
9877 111448 168775 189885 297778 279071 167879 40979 186 63424 36731 80518 37610
9866 37610 -37561 -55807 -68912 -43886 -15416 22882 66721 82221 63287 21017 -10331 -999
9854 -999 56893 107015 94083 29339 -5840 -63090 -64163 -35655 17403 56685 215235 266016
9842B66016o1644j16888j18874J1005Q4037L3444o8091M6758K636o325k9291k3912
9830A8871J9948K7646j4875N6968k301p1740J2009J19835k6963j2813P8141j18988
9818H5738k72L5426r851o638k8494j6804k2143n2499k0493k8O0517J20593o269
9805A38783k6964R203L3121p0653q7767N3556M8301k4143R087J0734j2767l1501
9793D8990N2095j3537k5152l1355k0150j9103n2848R0717R8807k3973j9070K1412
9781A06833n2637j4567j0181m9482J4633J03682M4162K2247K1095j09742m3756
9770C2287p962J1945l1842M4983J9551m5375o5646l8491O5707P0961O5561J7537
9758A39216k5273o8239j5143r0020J3599Q1717n8205k8135J0830K9177P2501M1199
$$ plain form
9842 266016 204372 87484 -31390 -20385 63652 97096 29005 75763 78399 72074 42783 18871
9830 18871 38819 66465 51590 108558 106257 34517 46526 166361 139398 126585 204726 85738
9818 85738 85466 120892 111041 104403 75909 59105 36962 -15537 -36030 -36058 24459 145052 138783
9805 138783 111819 121022 154143 83490 -4277 49279 97580 73437 82524 93258 80491 48990
9793 48990 101085 87548 62396 31041 10891 -8212 -61060 29657 128464 104491 85421 106833
9781 106833 54196 39629 29448 -20034 -5401 98281 142443 164690 185785 76043 32287
9770 32287 24325 36270 4428 49411 68962 23587 -42059 -80550 -14843 56118 121679 139216
9758 139216 113943 45704 30561 -59459 -45860 35857 -22348 -50483 -39653 -10476 62025 103224
9746A03224O9553p7126p930N0046l8476m2644j2663L1981K5365P0915K8732o722
9734A94255l5084M3246J1961q2551m7428R927Q159J9480n4460l2710p404M818
9722C2209O8071M3j3690l8246L6434J27821m7744r6833J1477P5463K4108r1500
9710H7613K2887L9132N0414j5778J4857L20n4531N5025l1250r8641l6983K7636
9698F0701p003m18o9725m2175P9083Q1765k8734M7796N379K5437P482K1012j9261
9685A61339j4791m8767K7096k5180j59219k5593L5677J6000q1835J8746J07445
9674A0918J15392L509q4872j882N7511J8731l9660O0512n892Q369K9016L5084
9662B06736M3354K0284k2589L1606J05476k8441l9053n4463j244M3380M9869k4072
$$ plain form
9746 103224 172777 95651 87721 137767 99291 56647 43984 75965 101330 172245 200977 194255
9734 194255 159171 202417 214378 131827 84399 94326 102485 121965 67505 34795 27391 32209
9722 32209 100280 100323 86633 48387 84821 212642 164898 68065 79542 155005 179113 87613
9710 87613 110500 149632 200046 184268 199125 199445 144914 199939 168689 70048 33065 60701
9698 60701 53698 53280 -16445 -58620 20463 102228 73494 121290 126669 152106 159588 180600 161339
9685 161339 146548 97781 124877 99697 -59522 -85115 -49438 -33438 -115273 -96527 10918
9674 10918 126310 129819 44947 43065 100576 119307 79647 140159 134267 142636 171652 206736
9662 206736 250090 270374 247785 279391 384867 356426 317373 262910 261666 305046 354915 330843
9650C30843p8342q8467j6568O2310M0197n7334j47899m5526l3719M4634l824j7569
9638a1264K7195m5571O6036K7986k4515l0413K6254l0436L7323O3468r6764q3834
9626g4535L3588J23545N0089j00006j12781k4325N8727Q9400M4910o3704J8401
9615D3309Q7853L931p1686n1823J207o0821k3991N3113L1336J8846j03924N0437
9603b2213M8983j06685j21766M513M3259M3667R7141l567M4594K6122J14674l1057
9591A37665j0113r7366q814q174m6703n1326L4621R67j3136P0002J01175k2725
9579H6073p554m0128j23690j21939m037O5123N4295Q0131K7910l0069P5483J1705
9567G3303m2460p2949l7307K9031O0534K4858m036n837k1614j5617k1039J0220
$$ plain form
9650 330843 252501 164034 147466 209776 249973 192639 44740 -786 -34505 10129 6305 -11264
9638 -11264 15931 -29640 36396 64382 39867 9454 35708 5272 42595 106063 9299 -74535
9626 -74535 -40947 82598 132687 32681 -80100 -104425 -45698 43702 88612 24908 43309
9615 43309 131162 135093 63407 11584 12791 -48030 -72021 -18908 12428 31274 -72650 -22213
9603 -22213 26770 -79915 -201681 -197168 -153909 -110242 -13101 -16668 27926 54048 168722 137665
9591 137665 127552 30186 21372 13198 -33505 -84831 -50210 -49243 -62379 7623 108798 86073
9579 86073 78519 38391 -85299 -207238 -211275 -146152 -91857 -11726 16184 -13885 61598 73303
9567 73303 30843 -42106 -79413 -50382 10152 35010 30974 25137 3523 -12094 -33133 -22913
9555b2913M6020J6708k645P0914R918r7261j9072N9294Q2486P864k2494o7821
9543F0998m4358k0332L456J9281L3513R9929p642M8915l5574k7326l1842k9571
9531F9447j17360m1953N2375l1100P9674J10514Q4763m3180l7717J6391N2702
9520A94556o0858r3292L0167K3171N7782P306k9886k2627K340l1145l3025N2234
9508I6723o964j33808J0602R6291J7730n667o4663n7223J0680K2503M5050K8741
9496E9995k9392l1741P7006n7214P307L7037Q1249q3078m2417K860M1544m3815
9484A9341l2436O744n4895O4442k485j3993p7744l0357Q0160K6983J1191Q844
9472E795j6944N4716N928J6098m4887p0188J7470L8722L8192J5027J0601J574
$$ plain form
9555 -22913 23107 39815 37170 108084 118002 20741 1669 60963 143449 151313 128819 60998
9543 60998 16640 -3692 -236 19045 52558 152487 144845 193760 158186 130860 99018 69447
9531 69447 -47913 -89866 -37491 -68591 11083 121597 206360 163180 125463 141854 194556
9520 194556 133698 40406 70573 93744 151526 158832 128946 106319 108659 77514 44489 96723
9508 96723 89759 -44049 -33447 62844 80574 74907 10244 -46979 -36299 -13796 31254 59995
9496 59995 30603 -1138 75868 18654 25961 62998 144247 61169 18752 21612 63156 19341
9484 19341 -13095 -6351 -61246 3196 711 -13282 -91026 -121383 -41223 -14240 -3049 5795
9472 5795 -11149 43567 49495 65593 20706 -49482 -32012 6710 44902 59929 70530 72104
9460G2104j38106l7599K5890N0357L6749Q933n2416Q2191P2216k8607k4124m6445
9448B1143M5791J430n2866O2394k3044m4382M8174n429p1032k5625r576K3250
9436b9772j5791J8728M2812k7056m9922k1433m2463l2415O3558J01130R692O294
9424B3362m8792K5650K6519Q4464K10l3354n629j25571j894R8719k7067n5342
9412c8725p287L1145k8357L3578j9424K7083L4552n7952j1922J5324M1259q2054
9400f2780p8934J8139L2822P2495J0179l7090Q8297M1915N2586P052q9680l6109
9388A8892Q7234P0887J8073l5543J7043p73m9788o369m241j35542j2874J15200
9376H2199L4689j6848q56l3907o5945L8208K1508J260k4763N899P1563R3742l1829
$$ plain form
9460 72104 -66002 -103601 -77711 -27354 9395 18328 -34088 48103 120319 91712 67588 21143
9448 21143 66934 68364 15498 77892 54848 10466 58640 53211 -17821 -43446 -53022 -29772
9436 -29772 -45563 -26835 15977 -11079 -61001 -82434 -124897 -157312 -93754 7376 17068 23362
9424 23362 -25430 220 26739 111203 111413 78059 72430 -53141 -55035 43684 16617 -38725
9412 -38725 -46012 -14867 -43224 -9646 -29070 -1987 32565 -25387 -37309 -21985 19274 -62780
9400 -62780 -141714 -123575 -90753 -18258 -8079 -45169 43128 85043 137629 144681 55001 18892
9388 18892 106126 177013 195086 159543 176586 175813 126025 119656 115415 -20127 -33001 82199
9376 82199 116888 100040 99184 65277 -668 37540 59048 60308 35545 41444 113007 206749 174920
9363A74920m6966k3216R668L1167o2727j74282j8635L4504l3567R7510N8168L9720
9351H6264K9491j8074n8875o1459M9558J1035O256n9959j24314n8173J00117K1048
9339g7085l762M3399P5054P5369Q7874p3599j47154J7988J8838J098M6045l6270
9327B7795q8385l2779R6782N1705k3418K2514m98L6309p1271p6783L6346N0039
9315B8356L1225m866K7369J7410P330j4579j8310M371m8036L2563o9254N7143
9303E0722K5134j47951n6696P5692N7250j2562M4514k7474j3307o106J4971L534
9291G721l0722J6217J593l7878Q4898P2289r4786j06955j8501P0715N7953J703
9279B4247M7223O7593q480n6494n9915l1588L6703N3168j3566n4226q3403O936
$$ plain form
9363 174920 127954 104738 114406 145573 82846 -91436 -110071 -75567 -109134 -11624 46544 86264
9351 86264 115755 97681 38806 -22653 26905 37940 44196 -15763 -140077 -198250 -98133 -77085
9339 -77085 -80847 -37448 37606 112975 200849 127250 -19904 -1916 16922 18020 64065 27795
9327 27795 -60590 -93369 3413 55118 31700 54214 53716 90025 18754 -58029 -21683 28356
9315 28356 59581 54715 82084 99494 106824 92245 73935 78306 30270 62833 -6421 50722
9303 50722 75856 -72095 -128791 -53099 4151 -8411 36103 8629 -4678 -10784 4187 7721
9291 7721 -23001 -6784 -5191 -43069 41829 114118 19332 -87623 -106124 -35409 22544 24247
9279 24247 71470 139063 130583 74089 14174 -17414 19289 72457 58891 4665 -78738 -71802
9267g1802N8390K2833l7358K2395J9967M6345l0305k4967q5712n008J59963O9929
9255A44670N27O378l3231m7953R2930N6679o3703l2482l3351o0082L1968K5797
9243H8147o9540m3454P7616n1077m9735M6941O7401k1578N8665l3724o1687j7764
9231i789j9961O2923n6785q1736J7615Q2094k8815O809N6529P1439J01619J9048
9219B20990j19572j03319o1974N088l6426L6104R5257N634m7426m2306l4527K5609
9207e6868J4235K6903M1724o4702o5100j3884R0550O8754n618K1685l3056r6004
9195g1381q2061l8021L7595J50105N1496j6643M0317L7263M5940m6628j05470
9184B512o6955k5051M8755N9652n472p6656j6791M8927R5575L6623r3378o5119
$$ plain form
9267 -71802 -13412 9421 -27937 -5542 14425 60770 30465 5498 -80214 -85222 74741 144670
9255 144670 145197 151575 118344 70391 163321 220000 156297 123815 90464 30382 62350 88147
9243 88147 18607 -24847 52769 1692 -48043 -1102 66299 44721 103386 69662 7975 -9789
9231 -9789 -29750 33173 -23612 -105348 -87733 -5639 -34454 -27645 28884 100323 201942 220990
9219 220990 101418 -1901 -63875 -58787 -95213 -59109 36148 41782 -5644 -47950 -82477 -56868
9207 -56868 -42633 -15730 25994 -38708 -103808 -117692 -27142 41612 35994 57679 24623 -71381
9195 -71381 -153442 -191463 -153868 -3763 47733 31090 71407 108670 154610 107982 2512
9184 2512 -64443 -89494 -40739 18913 13441 -63215 -80006 -31079 64496 101119 7741 -57378
9172e7378o7677J2438j4171R6112O8206p1915j10869n431P1375Q891q3460j2286
9160a66165R2718K5995r974N0161O9797N4947n3043o6141r322l3730M6213L0396
9148C1852n9106j2955M487M0045N3381k6400q896R0767N2835n3109K760l7414
9136G8247m7157q5752K4325l652Q907r249l4829N2427J4544j7910j09639M9810
9124g9928N097M4364J7695o8043j3982o793K2195K4825r026P6787j5881j4685
9112a7375n0605J6137k5021O6601K3599O3942m8016o3321L769J03229K0616O0219
9100A53774m1350m5120k8386j8923l6781P7389P4069j3241q2837K7358Q8854K8644
9088A83450p6687n6746K257J8660J8885L3871L51q3890n1846n532n1556k4145
$$ plain form
9172 -57378 -125055 -112617 -126788 -30676 37530 -34385 -145254 -150685 -79310 -70419 -153879 -166165
9160 -166165 -73447 -47452 -57426 -7265 62532 117479 64436 -1705 -11027 -44757 1456 31852
9148 31852 -27254 -40209 -35722 4323 57704 31304 22408 113175 166010 112901 115661 78247
9136 78247 31090 -54662 -30337 -33989 -25082 -34331 -69160 -16733 -2189 -20099 -129738 -79928
9124 -79928 -74831 -30467 -12772 -80815 -94797 -101590 -79395 -54570 -63596 13191 -2690 -17375
9112 -17375 -67980 -51843 -76864 -10263 13336 77278 29262 -34059 -30290 72939 93555 153774
9100 153774 112424 67304 38918 19995 -16786 60603 134672 121431 38594 65952 154806 183450
9088 183450 106763 50017 52274 70934 89819 123690 124041 40151 -11695 -17227 -68783 -92928
9076i2928N4658N9463L1350n3815J3237J6375m488l5042N4438J0391l3857J6433
9064C6215k7363j01023L0692N132N165j4305K5267P3375L9238J8334n9659j26868
9052i5800n3050J3647P2091J25470O039N8317J1453o4360o9539M5339J1652l2152
9040B9107O7271M9602m5641j14072M4191M3523J044n1678K3865k3292q7288k4780
9028h8148Q8574N1116Q9649j6880j22048l9361K4663O6256N8718O27m0138Q4348
9016A57376p1694k4033q2984l0932K5349J9571O8981P1465l1933J7691p1342n0906
9004c391R5782L4o0853M989J5915m7382n2935k8275J850J5774L4156P3252L604
8991E2520p3446L2887N3657P391O2667J9233n5964j03318l2883j5154j4233j8168
$$ plain form
9076 -92928 -38270 21193 52543 -1272 11965 28340 23852 -11190 43248 53639 19782 36215
9064 36215 8852 -92171 -61479 -56347 -51182 -65487 -40220 33155 72393 90727 31068 -95800
9052 -95800 -148850 -135203 -63112 62358 68397 126714 138167 73807 4268 49607 61259 29107
9040 29107 96378 145980 100339 -13733 30458 73981 75025 23347 47212 23920 -63368 -88148
9028 -88148 426 51542 141191 124311 2263 -37098 -12435 53821 112539 113166 73028 157376
9016 157376 85682 61649 -21335 -52267 -26918 -7347 61634 133099 101166 118857 47515 -3391
9004 -3391 92391 92425 31572 36561 52476 5094 -47841 -76116 -74266 -58492 -24336 48916 52520
8991 52520 -20926 11961 65618 73009 135676 154909 98945 -4373 -37256 -52410 -66643 -84811
8979h4811N8615K4776J9600j2923L5112Q9329J3430o0743p2075j2641K04M1427
8967C9300j5027J4976K9073q280L9802L2500L7639l7842m075m6718o7112j17789
8955a03553o1641R0927l3563o6638O8725N2685L2116P1840K1409l7273r0033l475
8943e8474l4035K3025Q0178j7493l1143L3260O7746m3199p3590K8962N4042o647
8931B2632j5099l3687m4822p104O2495k2621m4897J3021K1267l329p110N2517
8919f737n9635k1043L3721J5331J9455J4016P5372j832l1145o1073O9827M1401
8907H7658M0476k5688J3314J1922p4535r0726o1298M2974N6580m327j4136K9766
8895A1980K4358r034n4815O2048Q1360L3730M6145j2226q3269j0400L7312p6317
$$ plain form
8979 -84811 -26196 -1420 18180 5257 40369 129698 143128 82385 10310 -2331 -2127 39300
8967 39300 24273 39249 68322 60042 99844 132344 169983 132141 128066 81348 14236 -103553
8955 -103553 -165194 -74267 -107830 -174468 -105743 -53058 -20942 50898 72307 35034 -54999 -58474
8943 -58474 -92509 -69484 10694 -6799 -37942 -4682 63064 19865 -53725 -24763 29279 22632
8931 22632 7533 -26154 -70976 -78080 -15585 -38206 -83103 -70082 -48815 -52144 -59254 -6737
8919 -6737 -66372 -87415 -53694 -38363 -18908 -4892 70480 68648 37503 -23570 46257 87658
8907 87658 128134 102446 115760 127682 53147 -37579 -98877 -55903 677 -3650 -17786 11980
8895 11980 36338 27304 -27511 34537 115897 149627 195772 183546 100277 89877 127189 50872
8883E0872m5117J9156j4209J0398j7813N2588J3526n1254m183l0034l6177J1363
8871d0884K3437J12580J12214L9511l3818p3840l3236L8074K9056j37422r2120
8860e6448L1067J9564l334K4777k5901n9689m3868K3936N6934l7443Q044K2317
8848d0044L4784N0830n4592k4442N720Q5434R521R551N9620j7304j13981l384
8836A713K80q0836R559J02922N0326j9079J35753m6404m5288j22726p8386K7912
8824f4254N0786K0045N3617r122n1133j3387N2934k5230J7385Q8419L805M3661
8812A67526O687k9362l7213j11311j6614N1340J15493o0235m8199K3455p8289
8801a6722n4136M6654M9751l020j7197N5379m9037j2734K1098K7098j4240L9857
$$ plain form
8883 50872 5755 24911 10702 21100 3287 55875 69401 18147 13964 -16070 -52247 -40884
8871 -40884 -17447 95133 207347 246858 213040 139200 105964 144038 173094 35672 -56448
8860 -56448 -25381 -5817 -9151 15626 -10275 -69964 -113832 -89896 -32962 -70405 -62361 -40044
8848 -40044 -5260 45570 -9022 -33464 -27744 57690 67211 76762 136382 119078 5097 1713
8836 1713 1993 -78843 -69284 33638 83964 64885 200638 154234 108946 -13780 -92166 -64254
8824 -64254 -13468 6577 60194 51072 -61 -13448 39486 14256 31641 120060 123865 167526
8812 167526 174213 144851 107638 -3673 -20287 31053 146546 86311 38112 61567 -16722
8801 -16722 -70858 -24204 25547 22527 5330 60709 11672 -1062 20036 47134 32894 72751
8789G2751J4224m2546m3660M4519m9185n1294l0142j6300p718J09845k1717o9060
8777i0283k9876N9751j34L5Q9571M5020L2736J9435l6661k4540K9858k7994J315
8764F8233Q948M1880n1731p7877o6144N671R0787R5967p0629q4169O2826K1268
8752D5030p540Q6n908l9145l3871n4010P9279P0798N2842M9287k0940j19360j37158
8739a20610R897O5916J02192j7914M7616J00657k6406o1202q7280k6176J3954
8728F44L5499n123n0253L445M8351l67O7610N550p9290o3650l931l130P8615j3893
8714B0077q9974o3754R7396J15500m719j04689k9386M1872m6773n7875J6462L7236
8702f8627J03283K6612o056l8464J6508N3879J2115m6725k3375L9292l6789O863
$$ plain form
8789 72751 86975 44429 769 45288 -3897 -55191 -85333 -101633 -109351 494 -21223 -90283
8777 -90283 -120159 -60408 -60542 -60507 29064 74084 106820 126255 89594 65054 94912 66918 68233
8764 68233 77181 119061 67330 -10547 -76691 -71020 19767 115734 45105 -39064 23762 45030
8752 45030 37490 37576 31668 -7477 -41348 -95358 -16079 54719 107561 156848 135908 16548 -120610
8739 -120610 -110713 -44797 57395 39481 87097 187754 161348 100146 12866 -13310 644
8728 644 36143 31020 -19233 -15788 32563 32196 99806 105356 26066 -37584 -41515 -44645 33970 20077
8714 20077 -69897 -133651 -36255 79245 74526 -30163 -59549 -17677 -64450 -122325 -105863 -68627
8702 -68627 34656 61268 55212 16748 33256 87135 99250 52525 29150 68442 31653 38516
8690C8516L0762m7318l3714O2440L5685j9533R136q2691o0949K8441L115K2355
8678a3755R4093m7861K1153o753J6184l9469k8661Q2610M1427o6740M1530L0702
8666A24460p116m1382K370m8907K912L1280Q926l9940N677q4255j5312M7414Q653
8653e220N0240J0808N1046p6415k9412L1475l411l4496P5734L5184k9015q8294
8641a1776M0420N2119o6765m5775k26K4903j4334N2990k8199j08678l9080K6081
8629a18320Q7667M3578J0009K580N8150l3005L4134j4145q968n1098p4219K176
8617f1461J03572j6204J4929l9369l0410K8487k2771l0885L4065J4896J4846J30777
8605A40472q1086n2241n9394n8420J7404O8483K1207M2930J49800O2287J5170
$$ plain form
8690 38516 69278 21960 -11754 50686 86371 66838 75974 -6717 -67666 -39225 -36110 -13755
8678 -13755 80338 32477 53630 46877 63061 23592 -5069 77541 118968 52228 93758 124460
8666 124460 117344 75962 78332 29425 32337 63617 72543 32603 38280 -45975 -61287 -13873 -5220
8653 -5220 45020 55828 106874 30459 1047 32522 29111 -5385 70349 105533 76518 -11776
8641 -11776 28644 80763 13998 -31777 -32003 -7100 -21434 31556 3357 -105321 -144401 -118320
8629 -118320 -30653 12925 22934 25514 83664 50659 84793 70648 61680 10582 -63637 -61461
8617 -61461 42111 25907 40836 1467 -28943 -456 -23227 -54112 -20047 -5151 9695 140472
8605 140472 59386 7145 -52249 -110669 -93265 -24782 -3575 39355 189155 251442 266612
8594B66612l6960j12084O83l510j7319l9100j2835j9527R697m4259l8173J0245
8582c6530P5484J2680N5721M1141k4476r4823N5202r019k7880N8993J33831L0697
8570B71021j47692n0238K0751k8939n4848j5801m4554r070R5704M9611j42175
8559e6230q299m8991n0388Q0407l7215P7395J02773J29706m2188j4719j03470
8548B8781n893J12612J3014p9943K6801J04415m6491j17544K5563P2524O2419
8537A96258k1315q0897L0810k3896n8655j873K762M1223L4610q0368q176L930
8525C4413J6037q575o5014L6487M4644K6803L8342n1412q0354j03788L809J41776
8513C3168O7013k4186m4306j4705n3891p7948M9776O9607q073Q1272P3044L3084
$$ plain form
8594 266612 229652 117568 118251 114741 97422 58322 45487 25960 35657 -8602 -46775 -36530
8582 -36530 38954 51634 107355 148496 124020 29197 84399 75380 47500 106493 240324 271021
8570 271021 123329 73091 93842 64903 10055 -5746 -50300 -59370 36334 85945 -56230
8559 -56230 -64529 -113520 -163908 -83501 -120716 -43321 59452 189158 146970 132251 28781
8548 28781 22888 135500 148514 68571 95372 199787 153296 35752 61315 133839 196258
8537 196258 174943 94046 124856 100960 42305 40432 43194 84417 119027 38659 30483 34413
8525 34413 50450 41875 -23139 13348 57992 84795 123137 71725 -8629 -112417 -108608 33168
8513 33168 100181 75995 31689 16984 -36907 -114855 -65079 4528 -3545 77727 150771 183855
8501A83855P930L0109k5751p7362j9224J7181m0297j753J8698o621l1785n1456
8489C524j2100M7580K8128O932l27j5870j1112Q0008M7137M333J461p8181j08646
8476g133J6680J8043j8994r3627q741J11425m268L7638r917j19437m4359q889
8464a31579L5211J10355P7047j7675o7969o7763k3290r396j5436L4968L0266k935
8452d8196k3382q4857L3020K6771j8471N8840L4474L0473p050L7888P6166m0271
8440G5405J9133K5105o9588m3276J924k8193j0250K5227k3671p6659m9259j539
8428a55641J0788L4183P8557Q9379n1346j5532N1819k675q5379o2958M9235O3714
8416D144M773j7993n0805m5571J21344m825k5470n1370j30447O6680L5368J1024
$$ plain form
8501 183855 191785 221894 196143 118781 99557 116738 76441 74688 93386 86765 54980 3524
8489 3524 -8576 39004 67132 74064 73737 57867 46755 126763 173900 178233 179694 101513 -7133
8476 -7133 9547 27590 8596 -85031 -93772 17653 13385 51023 41106 -78331 -122690 -131579
8464 -131579 -96368 13987 91034 73359 5390 -62373 -85663 -95059 -110495 -75527 -45261 -48196
8452 -48196 -71578 -156435 -123415 -96644 -115115 -56275 -21801 8672 1622 39510 115676 75405
8440 75405 94538 119643 50055 6779 8703 -19490 -29740 -4513 -28184 -104843 -154102 -155641
8428 -155641 -144853 -110670 -32113 57266 5920 -9612 42207 39532 -45847 -108805 -59570 4144
8416 4144 8917 -9076 -59881 -105452 15892 11067 -14403 -65773 -196220 -129540 -94172 -83148
8404h3148J9862Q7614Q8590k4341m6736J8688O7869J6249n7533l0614j6422L4116
8392G4194M2370M8734K768k0311m9412o6068O6359J6512n7982K1377r917n854
8380F2770r1481o3579J21543J7052j8654O4947l0984N0466k2812p3905K583K3889
8368D1835j8779N3571K7860n3893m657P23k8055M8744K5737j7497K4061p525J13213
8355B05338J9433o6128K11724L54982L21545J35128n0291l9066o2522L7040J44100
8344A211283J2947j95783k83052k65860j78483r9847n3646p380N9671N1471N0929
8333C02250K704q1193q9970j6026L9975J0533l7964j480K0702l1490J0118l2609
8321I5550J6568J25463m7831m1501j0816N0177O4196M423j03133J06969J30369
$$ plain form
8404 -83148 -63286 24328 112918 88577 41841 60529 128398 144647 87114 56500 40078 74194
8392 74194 116564 165298 168066 147755 98343 32275 98634 115146 57164 78541 68624 62770
8380 62770 -28711 -92290 29253 46305 27651 92598 61614 112080 89268 15363 17946 41835
8368 41835 23056 76627 104487 50594 45937 46660 18605 67349 93086 75589 99650 92125 205338
8355 205338 224771 158643 370367 725349 1046894 1182022 1131731 1092665 1030143 1067183 1211283
8344 1211283 1224230 1028447 745395 479535 301052 201205 147559 140179 199850 251321 302250
8333 302250 304954 223761 133791 117765 157740 168273 130309 128829 149531 118041 128159 95550
8321 95550 112118 237581 189750 148249 137433 187610 251806 256229 153096 260065 390434
8310C90434K06791K87999M88827O67335L39944L9731j45866j80437J2561J61169
8300B268488N2522l77118n80977m78109k57239j62479o4777L5109L2110p6172
8290C91358o5523o6393j12407n2386J05758L3312O901n868K9449r046q9179n7579
8278A08397O7012Q6209L194q984N4901N9982L3351r7678j16226j8732J6691J6657
8266B04774K3739Q9497J99854L02760J93815P4110J064j3386l8847J07264O1697
8255A206341m8390k99312k68999j24344r9534j16332m4640J3456l86m2760q344
8244A66756n7319j21717K4308O8847l306M744k3003k6622Q6970R9183M612l8055
8232A85398l6499k2313m4850M743O2579N4780p4466p6426J4889P4129N272j19541
$$ plain form
8310 390434 597225 885224 1374051 2041386 2381330 2421061 2275195 2094758 2107319 2268488
8300 2268488 2321010 1943892 1362915 884806 627567 465088 400311 435420 467530 391358
8290 391358 325835 259442 147035 94649 200407 233719 240620 234752 264201 255155 165976 108397
8278 108397 175409 261618 264812 255828 310729 370711 404062 306384 190158 171426 188117 204774
8266 204774 228513 318010 517864 820624 1014439 1088549 1089613 1076227 1037380 1144644 1206341
8255 1206341 1157951 858639 589640 465296 365762 249430 204790 218246 217860 175100 166756
8244 166756 109437 -12280 12028 80875 77569 82313 59310 32688 119658 218841 223453 185398
8232 185398 148899 126586 81736 86479 149058 203838 129372 52946 67835 141964 147236 27695
8220B7695j05964r276N7951J07156M0752o1107o287K5421J6540j6608O8508j8089
8208A26692p6411o8859O7987N0994k2329K0435j825q6786n7866n4990M0004J89529
8196A26575O2961o7051j0533j2219L0784K3541q4168l3518p8803K9465K3923m8636
8184c7679Q9309M1793N1025M6767o110l0516m78O242q6953N7764o0752m0703p0621
8171d0912K2330P4433M8368L7346L7113n3012p3195l3039k8027l6732J2778j7853
8159e0402N9647k9498r7046L2565K1436j1803m591m4598L6463P5799j6227l9355
8147f7610n4245L9525n7374K0608P1197L3444r692k0757r857K1947K4541n5650
8135f3923J9057k6252M6858J31850L0717j02936n8184m589l0431n1075m7369J1615
$$ plain form
8220 27695 -78269 -87545 -29594 77562 118314 57207 50920 76341 92881 76273 144781 126692
8208 126692 50281 -18578 49409 100403 78074 98509 96684 9898 -47968 -102958 -62954 126575
8196 126575 189536 122485 111952 99733 130517 154058 69890 36372 -42431 -12966 10957 -37679
8184 -37679 51630 93423 144448 191215 185105 154589 154111 160353 73400 131164 70412 29709 -40912
8171 -40912 -18582 55851 104219 141565 178678 125666 52471 19432 -8595 -45327 -32549 -50402
8159 -50402 9245 -20253 -117299 -84734 -63298 -75101 -79692 -124290 -87827 -12028 -28255 -67610
8147 -67610 -121855 -82330 -139704 -119096 -47899 -14455 -24147 -44904 -54761 -32814 -8273 -63923
8135 -63923 -44866 -71118 -24260 107590 138307 35371 -22813 -27402 -57833 -108908 -156277 -144662
8123a44662L5389L1159O4787K6624l325K5357n8442L9438K4995o8134j7553o7623
8111a11990P5840O6294q3770p8569j4208J05813R683l1254R427r4252L9798L0546
8099g6642Q9421R217l3275N0827P4861l6976q9449q2564j8056L0027N3369k248
8087c1488o8575J0833J4832O1328o5090M2327L1004l5384l4736M1176k2617m0428
8075i6818q8685J13677J31441k5326O674l6887j0727J525M5098M0092q0435N8733
8063E8362K2840n4285j5901j4015M0581J3326j07546J2863n1092L6071J01782
8052D2986J12707m5446p9954P0646m7762j05329j9161J0707O754P7753K2084o7914
8040b1929j0845N3537N412l3635j686K7757L5120l905l6499P0026l7861J9466
$$ plain form
8123 -144662 -109273 -78114 -13327 13297 9972 35329 -23113 16325 41320 -26814 -44367 -111990
8111 -111990 -36150 30144 -53626 -132195 -146403 -40590 -30907 -62161 -52734 -146986 -107188 -76642
8099 -76642 12779 21996 -11279 39548 114409 77433 -12016 -94580 -112636 -82609 -29240 -31488
8087 -31488 -100063 -89230 -74398 -13070 -78160 -35833 -4829 -40213 -74949 -33773 -56390 -96818
8075 -96818 -185503 -71826 59615 34289 40963 4076 -6651 -5126 39972 80064 -371 58362
8063 58362 81202 26917 11016 -2999 37582 50908 -56638 -43775 -94867 -58796 42986
8052 42986 155693 110247 30293 100939 53177 -52152 -71313 -60606 -53852 23901 45985 -21929
8040 -21929 -32774 20763 26175 -7460 -9146 18611 53731 49826 13327 83353 45492 64958
8028F4958o9601K1333P4983n5451n4714k3644L334m5053N5504K786j2999J0497
8016b8067J01390k164j1860L4089k6857o2229K0400J22003L3599q4911n7882l3871
8004C640m1228k330R063q19j7880M7417M941j842O3511N010K7442k5013M2642
7991A14554K2855p8366L0128P9556Q1483r0056o5148j8774q4541j7794l7697J5271
7979d8529J8807R8910K9445J9830J6318P2386Q0047n473k5224j4651l1375K8635
7967B39126K231l0855o2869l1154r9846N760K6434K6936N7165n2026p9288k6232
7955b4618Q87q3489P4183Q9895L881o2567Q9722O0550J8669n8841k2907o9307
7943A6058k3858k0700o620K1724O0789L7547r1410j4945O7165l2453l6874O2109
$$ plain form
8028 64958 -4643 16690 91673 36222 -18492 -42136 -38802 -83855 -28351 -25565 -38564 -28067
8016 -28067 73323 71159 59299 93388 66531 4302 24702 146705 180304 95393 37511 3640
8004 3640 -37588 -39918 -30855 -31674 -49554 -2137 2804 962 64473 69483 96925 71912 114554
7991 114554 137409 59043 89171 168727 250210 160154 95006 76232 -8309 -26103 -63800 -48529
7979 -48529 -29722 69188 98633 118463 134781 207167 287214 281741 256517 241866 210491 239126
7967 239126 241357 210502 147633 116479 16633 22393 48827 75763 132928 80902 1614 -24618
7955 -24618 -23731 -107220 -33037 56858 60739 -1828 87894 148444 167113 108272 85365 16058
7943 16058 -7800 -28500 -35120 -13396 47393 84940 -6470 -21415 45750 13297 -23577 38532
7931C8532J69494n914q8056k1437l4486r1843n8318q317M990o6050L0699O2801
7919f7905L8048J07684L4268j5475p4052J6481k288m7683J08149j9775j10510
7908c3058L5606O3582o4609j9374J39873Q0664j10760r0409Q211N3059j9008o1499
7896a7722m4123n9833j3456P000m223L5886Q2212J7923Q4045r954m1847R510M4547
7883H9965j1414q4847p5853K899M9630P5709p641k9370K340O9586j07246n6716
7871h2958m3029L595j7710K1221M8530k1192j9929P860P3528P4368j7583m8613
7859b1912J9715n3188r7608n8843K1146N8058M0908M0335K4658j7831l5657P5608
7847d611P1384n2616M9004L3545K2907J6791l6379o6006M7853L4155k4906o7823
$$ plain form
7931 38532 208026 202112 114056 92619 58133 -33710 -92028 -100345 -95355 -161405 -130706 -67905
7919 -67905 -29857 77827 112095 96620 22568 39049 36761 -10922 97227 77452 -33058
7908 -33058 2548 66130 1521 -17853 122020 202684 91924 1515 9726 62785 43777 -17722
7896 -17722 -61845 -121678 -135134 -128134 -132357 -96471 -14259 3664 87709 77755 35908 45418 89965
7883 89965 78551 -6296 -82149 -79250 -29620 46089 38448 9078 11418 81004 -26242 -82958
7871 -82958 -125987 -122392 -140102 -118881 -70351 -91543 -111472 -103612 -30084 44284 26701 -21912
7859 -21912 -2197 -55385 -152993 -211836 -190690 -132632 -91724 -51389 -26731 -44562 -80219 -4611
7847 -4611 66773 14157 63161 96706 119613 136404 100025 34019 81872 116027 91121 23298
7835B3298P812J1351q226L5770j4609J4258K7975o368n4579K2200m2006K1627
7823C8503Q3991M1062l7952r5523L8062M8887n1147n414N9781P592o5520l0533
7811C1789K5162M6946n2908N5849j5977o7437n1756k5845k7169J7457R0115K0872
7799D7098L9542r5841l2561L8964k3295q9361k0675J10880O4249L2640L5171k2018
7787H4793m0517k7047l0031k1214K3604O906r8931N181J00229P2255K0304n7225
7775C8307m4763o4359K4170O1282j0721N8207l2146o8064L9841O385n6025L3784
7763a4102K9333q5379K9161p758J6248r6358j3419K6860M1550L0506k3650n191
7751g2199R2357O220J6467k0290j3549q4152K0197Q1918L3135Q484l1958k4089
$$ plain form
7835 23298 31110 42461 34235 70005 55396 69654 97629 91261 36682 58882 16876 38503
7823 38503 122494 163556 125604 30081 68143 117030 65883 60469 120250 127842 62322 31789
7811 31789 56951 103897 50989 106838 90861 23424 -28332 -54177 -81346 -63889 26226 47098
7799 47098 86640 -9201 -41762 -2798 -26093 -115454 -136129 -25249 39000 71640 106811 84793
7787 84793 44276 17229 -12802 -34016 -10412 -3506 -102437 -97256 2973 75228 95532 38307
7775 38307 -6456 -70815 -46645 14637 3916 62123 29977 -38087 1754 8139 -47886 -14102
7763 -14102 15231 -70148 -40987 -48745 -32497 -128855 -142274 -115414 -73864 -43358 -67008 -72199
7751 -72199 20158 26378 42845 22555 9006 -75146 -54949 26969 60104 68588 36630 12541
7739A2541k4363p8423L6213R1580J9774p7964l0206Q198k737k7674M8239L2039
7727G217R3517n2710n3107k0259j5535K2235M5465J627l2608n3839l9531O524
7715i1004R0797M7394J9103m7473l2678n7168J9442O4076O7092N468m1045K7141
7703G1145m8322l7999M1148R984J6308k3931q3494P5817J1391J7195N9415L9329
7691A47986p9275r0442m5895j7423o0434J0037K9427p4554L6321J34411j1469
7680b1310p3955k3218R0845Q2745j7769n7862j6791Q4077j8310L2753M4964n7939
7668D8230o0559j5876j7972j6018J9416j3860l6546L5896m5255m6805N9047Q2500
7656g802M1868j9740O853n2521n3206M710N647j2174N4510J6303P8333K0166j35428
$$ plain form
7739 12541 -11822 -90245 -54032 37548 57322 -20642 -50848 -42650 -45387 -73061 -24822 7217
7727 7217 100734 48024 -5083 -25342 -40877 -18642 26823 28450 -4158 -57997 -97528 -91004
7715 -91004 -207 47187 66290 18817 -13861 -71029 -51587 12489 79581 85049 44004 71145
7703 71145 22823 -15176 25972 35956 52264 28333 -55161 20656 32047 49242 108657 147986
7691 147986 68711 -21731 -67626 -85049 -145483 -135446 -106019 -180573 -144252 -9841 -21310
7680 -21310 -95265 -118483 -27638 55107 37338 -20524 -37315 46762 28452 61205 106169 48230
7668 48230 -12329 -28205 -46177 -62195 -42779 -56639 -93185 -57289 -102544 -149349 -90302 -7802
7656 -7802 34066 14326 21179 -31342 -84548 -79838 -74191 -86365 -31855 -15552 62781 82947 -52481
7643e2481j14000l2951m9329R1350R1751Q220j02709L2156R3605k2353n2373L356
7631a05758O8852K72m4029j0327Q7654N8350o6520M771l4135l8082K7702P6634
7619B5384m7909k3177n695l6205k0782O1768L9000k680M0712J8599k511k3586
7607B2918q6271m2574j4707j936J9019n2962L7095O2275M166K7691n647m9346
7595h0279J228R5635N9520p6843j53115K1074O0408n3742k0206M8041R694N450
7583h3135M6516k8517n9157m2100k435K6140j0804Q3446L9121L4461j15028M4695
7571f6797J46487J8679J5514n1776l4211J6535L2066l1376l3382J5814q0673m4970
7559i8090K7187L7956M7820k4348j1072j8809M0945j1196k08M1511r772j6565
$$ plain form
7643 -52481 -166481 -199432 -248761 -157411 -65660 -57440 -160149 -127993 -34388 -56741 -109114 -105758
7631 -105758 -36906 -36634 -80663 -90990 -3336 55014 -11506 -6735 -40870 -78952 -51250 25384
7619 25384 -22525 -45702 -51397 -87602 -108384 -46616 -7616 -10296 30416 49015 46504 22918
7607 22918 -63353 -105927 -120634 -122570 -103551 -156513 -119418 -57143 -52977 -25286 -30933 -80279
7595 -80279 -79051 16584 76104 -739 -153854 -132780 -72372 -126114 -146320 -98279 -88585 -83135
7583 -83135 -36619 -65136 -124293 -166393 -168828 -142688 -153492 -70046 -30925 3536 -111492 -66797
7571 -66797 79690 98369 113883 62107 27896 44431 76497 45121 11739 27553 -53120 -98090
7559 -98090 -70903 -32947 14873 -9475 -20547 -39356 1589 -9607 -9815 31696 21924 5359
7547E359o7133q1748R5578M7759r9430O7357L5969m2158k9004j3741O099M0582
7535c4511N4094K6080p1070j45874l7440O706N5363J7052N7662M6673o048k0382
7523e1695N49Q2290O9849K0665j32918o8901j9025K0196M1703J60003Q9181p2327
7511A39570j14740m7696K1974n8844o3001R1328L0081j3948J2090j0090k4660
7500c7936J981K422n2512m7375N4407P9103O8715N504k5760r9879r8804O5309
7488h4825J02816n4979R3852j2373l4985k7028K3451O7289M9983K4733m8743o6442
7476C2749M894l240J0329o3648J018M992J824M1879o7876m9459K8270O4836O3006
7463F9574N723M9947p1350l261L244o4908l2142K957R8397M5683o4080j07149
$$ plain form
7547 5359 -61774 -143522 -47944 -185 -99615 -32258 3711 -38447 -67451 -81192 -75093 -34511
7535 -34511 19583 45663 -25407 -171281 -208721 -202015 -146652 -129600 -71938 -25265 -31313 -51695
7523 -51695 -51146 31144 100993 121658 -11260 -80161 -99186 -78990 -37287 122716 211897 139570
7511 139570 24830 -22866 -892 -59736 -122737 -31409 -1328 -15276 -3186 -13276 -37936
7500 -37936 -35955 -33533 -86045 -133420 -79013 90 68805 74309 48549 -51330 -150134 -84825
7488 -84825 17991 -36988 56864 44491 9506 -17522 5929 73218 123201 147934 99191 32749
7476 32749 37643 34403 44732 -18916 -17898 -12906 -11082 30797 -37079 -86538 -58268 6568 69574
7463 69574 75297 125244 53894 50633 53877 -11031 -43173 -40216 58181 103864 39784 -67365
7451f7365J21346j8190K7320k5279n2910m7560l0927P203L5588M8376M0228L3377
7439G1207J0894k9373l4813K9360J2932k1119l2837L8359O7166q887q8721q5867
7427g1699M9200K9449j10134K101N0053Q4824J7123m4008o074j5495K9255P2099
7415H6694M4126P016m7943l6231L5642J39663L6439q5729q7033j19966p8271m8585
7403a54178j2173M1367L6382N5411k1622K39j2443m0764Q4413M6126J0435k4151
7391I042J9321q8626L388J8851P7908P9265O2256l6403j18791r7518J5932M9254
7379f121q453j418L0658K904r3284l9387Q2859O9549j6962q5066l3837J8757l4870
7366a14671j20822K8195K0607K1342P0928Q2136l2185k4572O214l6618M7154N6973
$$ plain form
7451 -67365 53981 35791 63111 37832 -15078 -62638 -93565 -86362 -50774 -2398 37830 71207
7439 71207 82101 52728 17915 47275 60207 39088 6251 44610 111776 102889 14168 -71699
7427 -71699 -22499 6950 -103184 -101083 -51030 33794 50917 6909 835 -14660 14595 86694
7415 86694 130820 137836 89893 53662 89304 228967 265406 179677 92644 -27322 -105593 -154178
7403 -154178 -166351 -124984 -88602 -33191 -54813 -54574 -67017 -107781 -23368 22758 33193 9042
7391 9042 28363 -60263 -56875 -38024 39884 119149 181405 145002 26211 -71307 -55375 -6121
7379 -6121 -14574 -15992 14666 17570 -75714 -115101 -32242 37307 20345 -64721 -98558 -79801 -114671
7366 -114671 -235493 -207298 -186691 -165349 -94421 -12285 -44470 -69042 -62828 -99446 -52292 4681
7354D681M0899m5631n3701m3422k9757n7743R0878M4753K23J9900m8000J8405
7342e8515k9915K2836k3886q7938m9971R2160R0439L4941k228Q15q0126n8501
7330a49889K3711O6157M3188m441k7564L876K7601O8448j799m0392o3705n1296
7318a06105R4519N9211L869o8750m5667n9979L827Q7487L7047l551P1503k9515
7306D3896j0093j3874J9580M3075k0218K7668N7823j6711r053j01301o6288L4879
7294a0617p007p6876M0390N3953K0914r428j2825M5488O5817k8599l7194n6940
7282a2924o130M3268M5141K0633p1615O57n1650n9474P9433J23776j5716j24956
7270b9557m3096J2066k7694P1551P1774o7867k6637k9172n2580K6397j159n5145
$$ plain form
7354 4681 45580 -51 -53752 -97174 -126931 -184674 -93796 -49043 -48820 -28920 -76920 -58515
7342 -58515 -88430 -65594 -89480 -177418 -227389 -135229 -44790 -9849 -12077 -11262 -91388 -149889
7330 -149889 -126178 -60021 -16833 -21274 -48838 -44962 -17361 51087 49288 8896 -54809 -106105
7318 -106105 -11586 47625 51494 -17256 -62923 -122902 -119075 -31588 5459 1908 73411 43896
7306 43896 33803 19929 39509 82584 62366 90034 147857 131146 122093 20792 -45496 -10617
7294 -10617 -17624 -94500 -54110 -157 20757 11329 -1496 43992 109809 81210 44016 -12924
7282 -12924 -19054 24214 69355 89988 18373 19030 -32620 -92094 -12661 111115 95399 -29557
7270 -29557 -72653 -60587 -88281 -16730 55044 -12823 -39460 -68632 -121212 -94815 -95974 -151119
7258a51119P4966O7326j5592q3968K7178Q5604L315R133j6808k9300K1296k015
7246i984l8607n35O072k6472J5947O3861p628K6673n0366J7511K0067k8201l2819
7233d4481Q8749q389l3855k1963j0971r612Q5980j1682p8159o8041j779l8682
7221a52885n935R144k850k8894l968J02165K9004k1454J34884L8339m2725o1141
7209f316k1447J4986Q6417P1081M18n4634Q610K6932l7748r7694r7785n551M9865
7196f2866O1394j7584J8570l0754N3180N1941M4161k0712Q869J4018n5492o2200
7184B525k837l9000M948O3037j9468k8098p4447q674J06214n3603l786Q6189M3553
7171G6553o223k6450r7882M912J9956M767p764P3443k6468q7070L6910m6762q3415
$$ plain form
7258 -151119 -76153 -8827 -24419 -108387 -81209 4395 7710 16843 35 -29265 -7969 -9984
7246 -9984 -48591 -49126 -43054 -69526 -53579 10282 2654 29327 -21039 -3528 16539 -11662 -44481
7233 -44481 44268 35879 2024 -19939 -30910 -40522 45458 33776 -44383 -112424 -114203 -152885
7221 -152885 -158820 -149676 -152526 -181420 -185388 -83223 -54219 -75673 59211 97550 54825 -6316
7209 -6316 -27763 -12777 73640 144721 145139 90505 99115 126047 88299 -9395 -107180 -112731 -62866
7196 -62866 -1472 -19056 -486 -31240 21940 73881 118042 97330 106199 120217 64725 2525
7184 2525 -312 -39312 -34364 28673 9205 -18893 -93340 -102014 4200 -49403 -53189 33000 76553
7171 76553 70330 43880 -54002 -49090 -29134 -24367 -32131 41312 14844 -72226 -35316 -82078 -165493
7158a65493n504M1581L7588J39804k0417p0446m1908K8203j1505k3471r189L3300
7146f7457K0388J02641N2463l4788m7614p0275m8535K8609L6217J7065n00l8407
7134e0193j6909O1968M782J2563m7589n8926K9712P114N5504K6137j0075j23681
7122a09593k7443Q2589Q7102K0402p7260j34807M162M5595j1372n0506J7849P8107
7110g5175P655j181j0297L0117j1163j4399q3282J5780L2422J7774R3582N7768
7098E9601J9071m3718q0045l7647J5762k4460L2092K3228N3296o3589m0967n0485
7086a37861R4469o120P3268N7220q962m1010K5285L0905m6926j4515p7457j2473
7074f4177J10817k5009m9523J848q3774k3974N7913J7058r023K8457L3268N195
$$ plain form
7158 -165493 -170997 -129416 -91828 47976 27559 -42887 -84795 -56592 -68097 -91568 -100757 -67457
7146 -67457 -47069 55572 108035 73247 25633 -44642 -93177 -64568 -28351 -11286 -11786 -50193
7134 -50193 -67102 -5134 -352 12211 -35378 -94304 -64592 -57478 -1974 24163 14088 -109593
7122 -109593 -137036 -54447 32655 53057 -24203 -159010 -154848 -109253 -120625 -171131 -153282 -75175
7110 -75175 -67520 -68701 -78998 -48881 -60044 -74443 -157725 -141945 -109523 -91749 1833 59601
7098 59601 78672 34954 -45091 -82738 -66976 -91436 -59344 -36116 17180 -46409 -87376 -137861
7086 -137861 -43392 -49512 23756 80976 72014 31004 56289 87194 40268 25753 -51704 -64177
7074 -64177 46640 21631 -27892 -26044 -109818 -133792 -75879 -58821 -67844 -39387 -6119 -924
7062i24j8894k6519k852O9388o3352N2562P0409j8994J0153N8723K8578l9565
7050A18713J4662j8818M7413m0800p248p2771J9196J7009l7934K3493j5663l0319
7038A6933p6518j4332P0226j2872m4842k457Q2159P7493L8425o4005j39051k9540
7026i8381N843R459j6434k2261j0754l3911N6928Q3940M8645K0899k9441m0973
7014b6441J9607K8066j9724j7748J0799n7095Q488M7896L6395l5959o68m7909
7002e4293m381M6820K4724J6609k0125k3980l1816N0749p0195M1636L306K0727
6990b19l7841m1565L8224N648r2348j9432L8482R3060j9947J4085J03596L4667
6978A16410p368m3981K316j26997o147J14356P5512p0802q6682q3477P219N7583
$$ plain form
7062 -924 -19818 -46337 -49189 20199 -43153 9409 79818 60824 70977 129700 158278 118713
7050 118713 133375 114557 161970 121170 113922 41151 60347 77356 39422 62915 47252 16933
7038 16933 -59585 -73917 -3691 -16563 -61405 -63862 18297 95790 134215 70210 -68841 -98381
7026 -98381 -92538 -83079 -99513 -121774 -132528 -166439 -109511 -25571 23074 43973 14532 -26441
7014 -26441 -6834 21232 1508 -16240 -5441 -62536 -54048 -6152 30243 -5716 -6384 -54293
7002 -54293 -58674 -11854 12870 29479 9354 -14626 -46442 4307 -65888 -24252 -20946 -219
6990 -219 -38060 -79625 -41401 -35753 -128101 -147533 -109051 -15991 -35938 -21853 81743 116410
6978 116410 109042 65061 67377 -59620 -65767 48589 124101 53299 -33383 -116860 -109641 -52058
6966e2058K9061M5191O5237O8979l4701o2054m3035Q674K5146N725P0161J6166
6954A42492j6950r6748k6766O7816J3536j05678m1954P764N0817Q973j0773M0361
6942C2890l5648j6198m9623m6676q262O3434J6317q452J4468m0675l2611J6253
6930i4783L4114l6203L2561n2330m3157N5522J4297O8961M1192k0872l5283j2775
6918d8756j3782n5689n3425j9675N5073J01785K9008N6013J2427o1509l6618P518
6906b7630O8077L1942j05860p3016j0024j1385M6822O727L632M3418n0393L0043
6894d7647N8015P9633O3091k6818m4783j54201k4193N3254j8005k341J6545N054
6882d2396j5379L8753n8616k1752j6536L6425j7849M2403J08276j3610l2491m881
$$ plain form
6966 -52058 -22997 22194 87431 156410 121709 59655 16620 25294 50440 56165 126326 142492
6954 142492 125542 28794 2028 69844 83380 -22298 -64252 -56488 -5671 3302 -7471 32890
6942 32890 -2758 -18956 -68579 -115255 -123517 -60083 -43766 -52218 -37750 -78425 -111036 -94783
6930 -94783 -60669 -96872 -64311 -116641 -159798 -104276 -89979 -21018 20174 -698 -35981 -48756
6918 -48756 -62538 -118227 -171652 -191327 -136254 -34469 -5461 50552 62979 1470 -35148 -27630
6906 -27630 40447 72389 -33471 -106487 -116511 -127896 -81074 -74347 -70715 -27297 -77690 -47647
6894 -47647 10368 90001 153092 126274 81491 -72710 -96903 -43649 -61654 -63995 -47450 -42396
6882 -42396 -57775 -19022 -77638 -99390 -115926 -79501 -97350 -54947 53329 39719 7228 2347
6870B347p0640o2772J9469M0639R5129L6770K5778p1477l0801M1854J8298K8142
6858G2736L6237o5278L4667J1214j69020o2661P5896J02138M2287q6423l5280
6847d3487p8764K0503O3214Q7540m4054o5173L121K6709M682Q5492J747l7294
6835B4236L8644R207L7313j5316r2433o1872k4564l1549O7569R7245N4833k8986
6823G4327n9282L7971m4971o0574n9891Q0358J7863p2454o733O4759k1967N5997
6811E403J20494O748Q6728r8231n4507J9658M6754m2053n5896m9350p0290j04647
6799a89189p3441M3397J65909O8552k8557m0695j6574j6250N4570K0480M8159
6788C6361N0594j07833r3636j4740o841J04574Q5831K1860o388o8014r6703L4570
$$ plain form
6870 2347 -68293 -131065 -111596 -70957 24172 60942 86720 15243 -15558 26296 44594 72736
6858 72736 108973 43695 78362 89576 -79444 -142105 -66209 35929 78216 -8207 -43487
6847 -43487 -122251 -101748 -38534 49006 4952 -60221 -57100 -30391 -25709 59783 61530 24236
6835 24236 62880 72087 109400 94084 1651 -60221 -84785 -116334 -48765 48480 103313 74327
6823 74327 15045 53016 8045 -52529 -112420 -32062 -14199 -86653 -93386 -28627 -50594 5403
6811 5403 125897 132645 219373 121142 66635 86293 133047 90994 35098 -14252 -84542 -189189
6799 -189189 -262630 -219233 -53324 15228 -13329 -54024 -70598 -86848 -32278 -11798 36361
6788 36361 86955 -20878 -114514 -129254 -136095 -31521 54310 76170 69782 1768 -94935 -60365
6776f0365K0963Q899N0289j9391l1297R278j17053r0422M1825P4429M9691p1372
6764a34526P3518Q5888o0304j64865m5188R7580M8629K3027J9931L6178R8592
6753G8460n1246L2964k180k7698l1539o7457Q1080J8145O3323j279m8277o7808
6741b3512k6209k4343L1806J9444k441N3020O8804n3990q1241K4756J4146j4260
6729a4020n1307m8200L3520K9606O909j4029j4778M6850l1707p287j1666L9193
6717c6916R1177l8103p0963o1732m8728P9225K4484J6036L9082r779N214N1900
6705D0897l3207p3322M6220M9505q3858r4175n296J0947K4461O6186j0659j12483
6693a74784J7406l957p378P3447K7709L4436J2291q495L9667O8211l5434l5784
$$ plain form
6776 -60365 -39402 -30503 19786 395 -30902 -21624 -138677 -229099 -187274 -112845 -63154 -134526
6764 -134526 -61008 24880 -35424 -200289 -245477 -147897 -99268 -76241 -56310 -20132 78460
6753 78460 27214 60178 57998 30300 -1239 -68696 12384 30529 93852 92573 44296 -23512
6741 -23512 -49721 -74064 -42258 -22814 -25255 27765 96569 42579 -38662 -13906 240 -14020
6729 -14020 -65327 -113527 -80007 -50401 -43492 -57521 -72299 -25449 -57156 -64443 -76109 -36916
6717 -36916 54261 16158 -54805 -116537 -165265 -86040 -61556 -45520 -6438 -16217 -11003 40897
6705 40897 7690 -65632 -19412 30093 -53765 -147940 -153236 -142289 -117828 -51642 -62301 -174784
6693 -174784 -157378 -161335 -168713 -95266 -67557 -33121 -20830 -29325 10342 78553 43119 7335
6681G335N6367P3941p1925K954P1832k395o5875j05748q0229o237Q8909N2835
6669B1764l1585l1113P3547K5483j06107j09085K3863J12241O5149k589p4008
6658c2440P5479J6582k7103o733K6964N3507N5397n9507o3722K8940j5121n4399
6646b156k5208J5780n649m896m6969J3205k9675N629J8872O443n8673l9544Q7879
6633f4962L0350K2749N701k2438K1434n5876N4783l3709j17366k1029N933K2705
6621a51725K7239O4440Q3536m3401k2242j1020o0113O2543J29159K7569k41m2426
6609F3318n550n6253k4254q428J02832M9653o8069p4500k0165n2124J3619O7138
6597a2783J31m4016q7316l4602L6663J27567Q3942N3385j5040Q658L0434o2921
$$ plain form
6681 7335 63702 137643 65718 68672 140504 138109 72234 -33514 -113743 -119980 -31071 21764
6669 21764 -9821 -40934 32613 58096 -48011 -157096 -133233 -20992 44157 41568 -32440
6658 -32440 43039 59621 32518 25785 52749 106256 161653 102146 38424 67364 52243 -2156
6646 -2156 -27364 -11584 -17233 -22129 -69098 -55893 -85568 -79939 -61067 -54624 -113297 -152841 -64962
6633 -64962 -34612 -11863 -6162 -28600 -7166 -63042 -8259 -41968 -159334 -180363 -174430 -151725
6621 -151725 -124486 -60046 23490 -19911 -42153 -53173 -113286 -50743 78416 105985 105744 63318
6609 63318 57768 1515 -22739 -31167 71665 121318 53249 -21251 -41416 -93540 -79921 -12783
6597 -12783 -12652 -56668 -143984 -178586 -141923 -14356 69586 122971 107931 116589 147023 84102
6585H4102n6499Q712k4725p0235M4245k3747l4193l9283N6378J50348m0209l2486
6573B2408N8966k8219n1834l5045P865N8260l0717J0815m5150m5451l592J00330
6561A8636p151n0875l2805j3277j1039P1889O7637P3384l2476m7011n4169m8295
6549f5552O2579L4886o8844k6476m751m473j992K6361p5911k9638N553M3452L7413
6536f7393K2317J347J2799k2423J4951l2639j1241N0178J4655L9842m7102o7102
6524i1811l7510k5915O34L9659J3389P8610J2899j0466j7742n9451k2061K1637
6512i8128P8073K3960k5623Q122M2749k8577p584L150Q1747p0986j37683r794
6500a40574k5127r05J7424J2421N2510N7646k4881N3211k6504p2931l2N2110J1599
$$ plain form
6585 84102 27603 36315 11590 -58645 -14400 -38147 -72340 -111623 -55245 95103 54894 22408
6573 22408 81374 53155 1321 -33724 -25859 32401 1684 12499 -32651 -78102 -81694 18636
6561 18636 11485 -39390 -72195 -85472 -96511 -24622 43015 116399 83923 36912 -17257 -65552
6549 -65552 -2973 31913 -36931 -63407 -68158 -72631 -74623 -48262 -124173 -153811 -148258 -104806 -67393
6536 -67393 -45076 -43729 -30930 -53353 -38402 -71041 -82282 -32104 -17449 22393 -24709 -91811
6524 -91811 -129321 -155236 -154602 -114943 -101554 -22944 -10045 -20511 -38253 -97704 -119765 -98128
6512 -98128 -20055 3905 -21718 -13596 29153 576 -7008 -3858 77889 6903 -130780 -140574
6500 -140574 -165701 -166606 -149182 -136761 -84251 -26605 -51486 1725 -24779 -97710 -97742 -45632 -34033
6487c4033p1113L0116m3824J2536K6338o974J3282N8027o183j02182P6826P6784
6475B9600k9723j5667J4323j8697P0750n7067q5510L0586L6096M1197j3091p1193
6463f8396J3860J7696q1212p6639J7421Q0535J6257P1976Q7425J47l1878k9090
6451A8102J0814L1779j96p158q2286l8172R0298j9204p1648o3777M5383P0302
6439a5763K0320j12850m1826P156L8058N5022N4872K3050L1438r1638p3273p0657
6427a76091l068j0638M8129Q6447O4183k423m3883n8496M8353R010k9168M3454
6415b4191q073o7155o9244L9409J32433R8780m2438r0203j2374k3184k784j7893
6403h6917L2697K8277L5267P3372n2833p3866R527M668j6223K3741M1693O2199
$$ plain form
6487 -34033 -105146 -75030 -118854 -106318 -79980 -86954 -73672 -15645 -21828 -124010 -47184 29600
6475 29600 -123 -15790 -1467 -20164 50586 -6481 -91991 -61405 -25309 15888 2797 -68396
6463 -68396 -54536 -36840 -118052 -194691 -177270 -96735 -80478 -8502 78923 79070 47192 18102
6451 18102 28916 60695 60499 53341 -28945 -67117 23181 3977 -67671 -131448 -86065 -15763
6439 -15763 4557 -108293 -150119 -142963 -104905 -49883 4989 28039 59477 -32161 -105434 -176091
6427 -176091 -179159 -189797 -141668 -55221 8962 6539 -37344 -95840 -47487 -38477 -67645 -24191
6415 -24191 -32264 -99419 -168663 -129254 3179 101959 59521 -30682 -43056 -66240 -69024 -86917
6403 -86917 -54220 -25943 9324 82696 29863 -44003 -34476 -29808 -46031 -22290 19403 81602
6391H1602P4193m884p4230k4111r9309r586k0639K4752L8562n6133j0676J07162
6379B6703n8992J082j0931k403j7462J00149J0113K2714l5829l7540p3431J0703
6367f5124j1782M2495O1593K5587L3413l9696q6262J5093O1236L9373j0996J2733
6355G7663n1653R991Q4221k4139m6249l2566M3839O1824o0062j7208N8544l2624
6343G1581j5726J4134j29890p7441P0281O459M0345K7029r8231K9783M9254M3386
6331C0964k123k5603k3573n8006m8280K1641J0230r731l543R0515P7335p0186
6319a0360k4991k4172m276N5375M123l6058L0272O5834k9894q2804n4761p686
6307a19398p0646l3357J9698R032l1796O8794J17756m9247o1651J8509M2102L7712
$$ plain form
6391 81602 155795 150911 76681 52570 -46739 -56325 -76964 -52212 -13650 -69783 -80459 26703
6379 26703 -32289 -31207 -42138 -44541 -62003 38146 48259 70973 35144 -2396 -75827 -65124
6367 -65124 -76906 -34411 27182 52769 86182 46486 -39776 -24683 36553 75926 64930 77663
6355 77663 26010 36001 120222 96083 49834 17268 61107 122931 62869 45661 104205 71581
6343 71581 55855 69989 -59901 -137342 -67061 -60602 -20257 6772 -91459 -61676 -12422 30964
6331 30964 28841 3238 -20335 -78341 -126621 -104980 -94750 -104481 -108024 -17509 59826 -10360
6319 -10360 -35351 -59523 -63799 -8424 -4301 -40359 -10087 55747 25853 -56951 -111712 -119398
6307 -119398 -190044 -223401 -203703 -194671 -226467 -157673 -39917 -89164 -150815 -132306 -90204 -52492
6295e2492K0724Q3241P9125O3540m4473r2594j9654l3727j02626r1267L7351O8706
6283h4146K1478q2615j7261P5716j2477N7673N6889K6033K1756m2448j5407J18124
6271A23315J39653o5893j83349m9172M8002j7655L9581J4051n3262l1923m0400
6260g7052k8175m504O4530J07005M5356n4519m4514q973O153o7359n9545n3086
6248a74683j7126R5608m2492j3610k5470O9241L5352n505P2879O4937M1562K280
6236A02973L52k1602o7828n023j3379j4795q6689N4814J51740N3930k6919O002
6224A33576m2431j4568o3219r3213K1701j5582J00696J2816r9982j32864o636
6213a99706M4014R8863J7276M3784L7189R402j156m0103k5650k154o4177P156
$$ plain form
6295 -52492 -31768 51473 130598 194138 149665 57071 37417 3690 -98936 -190203 -152852 -84146
6283 -84146 -62668 -145283 -162544 -86828 -99305 -41632 15257 41290 63046 20598 5191 123315
6271 123315 262968 197075 13726 -35446 12556 -5099 34482 48533 -4729 -36652 -77052
6260 -77052 -105227 -109731 -45201 61804 107160 52641 8127 -846 5307 -62052 -121597 -174683
6248 -174683 -191809 -96201 -138693 -152303 -177773 -108532 -73180 -78685 -5806 59131 100693 102973
6236 102973 103325 81723 13895 8872 -4507 -19302 -105991 -51177 100563 154493 127574 133576
6224 133576 91145 76577 13358 -79855 -58154 -73736 26960 39776 -60206 -193070 -199706
6213 -199706 -155692 -56829 -39553 4231 41420 50822 49666 9563 -16087 -18241 -82418 -75262
6201g5262M1267l6732j4618k9516o7558P1619J5856O7311J4543J0805K5270p6932
6189e3947o5046J1119L406M6488N3362J8017l5794o6864j7520Q2878R6666M0957
6177A13722m3971r6725p5927o7868K1496O5989O0728k7449k8184L2428P3946r8022
6165f9837n9962k0498R9275L5280N3899j07363j5611L5169L3701J8243M5579m7130
6153G45o9655J4382K1113P236m7863m5635K5968P3067j01506n8502K1838M7256
6141a11556P1046M3898k2429j61827q0176J16190Q4087L3183K0517O4816R3892
6130A51641M835j1129K8715l3253j9579K9418r2783m3284n9168l884O6811j1197
6118G143l0292J3384l2680j9245L9509J869o7214L4683m692J2873l1018q1407
$$ plain form
6201 -75262 -33995 -70727 -85345 -114861 -182419 -110800 -94944 -27633 -13090 -2285 22985 -53947
6189 -53947 -118993 -107874 -104468 -57980 -4618 13399 -22395 -89259 -106779 -23901 72765 113722
6177 113722 69751 -26974 -102901 -170769 -149273 -83284 -22556 -50005 -78189 -45761 28185 -69837
6165 -69837 -129799 -150297 -51022 -15742 38157 -69206 -84817 -49648 -15947 2296 47875 745
6153 745 -68910 -54528 -33415 -26179 -74042 -119677 -93709 -20642 -122148 -180650 -158812 -111556
6141 -111556 -40510 3388 -19041 -180868 -261044 -144854 -60767 -27584 -7067 57749 151641
6130 151641 156476 145347 174062 140809 121230 150648 57865 14581 -44587 -48471 18340 7143
6118 7143 -23149 -9765 -42445 -61690 -22181 -20312 -87526 -52843 -57535 -44662 -75680 -157087
6106a57087J29787R6719m2473r2830k7935O7016k3634j1781M98K9700K718k2799
6094e2101j13824N855Q9898J52268j2860p1829J545m7208Q9266O1553M558J1913
6082A19034l2167m2050o5375L2400O5381l1086k9937L725l8648N030l5818n6204
6070a05715M179L0719N215O9031P4417J2033M0770L9795p7955J447l62p031o8964
6057A7579m1021j6541J420m8622N1650J18003r572l5L2934o903p9227p4024j6145
6044g0504p6712R7375L0135o7064N449J1127L331M5946l7939j5464n1272o4577
6032a90169N3973K0944M2782k1827n5814m9162Q9304J49939L5451k4595p6776
6021b5950p2380l9494m1578l6052j9235j5679O0470M7707R6652L7008K4167q4121
$$ plain form
6106 -157087 -27300 69419 26946 -65884 -93819 -26803 -50437 -62218 -61720 -32020 -29302 -52101
6094 -52101 -165925 -160070 -70172 82096 69236 -2593 -1048 -48256 41010 102563 107121 119034
6082 119034 86867 44817 -20558 11842 77223 46137 16200 19925 -18723 -13693 -49511 -105715
6070 -105715 -101536 -70817 -65602 3429 77846 89879 130649 170444 92489 93936 93574 86543 17579
6057 17579 -23442 -39983 -38563 -87185 -35535 82468 72896 72861 105795 98892 19665 -54359 -70504
6044 -70504 -147216 -49841 -19706 -86770 -81321 -70194 -66863 -20917 -58856 -74320 -125592 -190169
6032 -190169 -136196 -115252 -72470 -94297 -150111 -199273 -109969 39970 75421 50826 -25950
6021 -25950 -98330 -137824 -179402 -215454 -234689 -250368 -189898 -142191 -45539 -8531 15636 -68485
6009f8485j03600M5849Q7316k0234M3094k1622o210J19304Q5356M8255m0506j17063
5997E1454m1874q459M240L2122Q594j9043O5534m7989n5532M7094m726K9604K8020
5984H9039n3040J8108k38m1660J003j5129J2965L0672n2694q4564J31624P1513
5972A07599p4734j14760L3607L6376m8334n7893J7356m3783n2184r8915l9498
5961c35163J14091J26498M6087K0028K0358m863J8610n0739l9165j0017p4498
5950a68773J6941R9707L028m83M0232N5614q5258o3762P7863R7184J5632M7489
5938A35414n9382j22703m7684j5362J20259P7746p9j18833n5595j4896O5934k9301
5926f4482j9244Q2808o1757L9664J09114r712n1026l5575K7550j4489Q310k7971
$$ plain form
6009 -68485 -172085 -126236 -38920 -59154 -16060 -37682 -43892 75412 160768 209023 168517 51454
5997 51454 9580 1121 5361 37483 46077 27034 92568 44579 -10953 36141 31415 61019 89039
5984 89039 35999 54107 53869 12209 13212 -1917 11048 41720 -10974 -95538 36086 107599
5972 107599 32865 -81895 -48288 -11912 -60246 -118139 -100783 -144566 -196750 -295665 -335163
5961 -335163 -221072 -94574 -48487 -28459 -8101 -12964 5646 -45093 -84258 -94275 -168773
5950 -168773 -151832 -52125 -49097 -49580 -9348 46266 -38992 -102754 -24891 72293 87925 135414
5938 135414 76032 -46671 -94355 -109717 10542 88288 88209 -30624 -86219 -101115 -35181 -64482
5926 -64482 -83726 -918 -62675 -23011 86103 76391 25365 -10210 17340 2851 11161 -16810
5914a6810o8490j6563J7316P6383N5153j07598j461L5634K3132k1662k0500r715
5902e5181n9921J3563Q9143J03627Q8137n2300n5721K0287N9766m3407r2784j13948
5890i8739q4456n2339n2016N1117R7222L6956K8248L7595l3966j927K4469j77
5878d8013K3454O2502j18916q9055J29355P1407P3497r3585r9125N0411J22560
5867H4492o0641j03697J1289N6735K2482l748O7991M8147j11669r5403n1740j4610
5855a50372O9632P8338L2629J25878k3391q6055J9846r73L1564J784J3223l4587
5843G7516j25341j35932L8413M584m1642J25649K827N559j7333m9135j91N4151
5831f0875P157J884K6784K2798l426j6461O3241k0507r1803J05596L5092L851
$$ plain form
5914 -16810 -85300 -101863 -84547 -8164 46989 -60609 -62070 -26436 -3304 -24966 -45466 -55181
5902 -55181 -115102 -101539 -12396 91231 179368 127068 71347 91634 151400 107993 15209 -98739
5890 -98739 -183195 -235534 -287550 -236433 -139211 -102255 -74007 -36412 -70378 -72305 -47836 -48013
5878 -48013 -24559 37943 -80973 -170028 -40673 30734 104231 10646 -88479 -38068 84492
5867 84492 23851 -79846 -68557 -11822 10660 6912 74903 123050 11381 -84022 -135762 -150372
5855 -150372 -80740 -2402 30227 156105 132714 46659 66505 65532 97096 98880 112103 77516
5843 77516 -47825 -183757 -145344 -140760 -182402 -56753 -53926 -48367 -65700 -114835 -115026 -60875
5831 -60875 -53718 -51834 -25050 -2252 -5678 -22139 41102 20595 -71208 34388 69480 73331
5819G3331j21635m7013J06147P9906J3708J4295q4193K1907o2398k2270J9891
5808h324q6602j1121K8802J8041N8149Q0434N2167l879O1791l2331j06445p0665
5796a9983O305L9899j8681M567n9119Q5707M7986j8845n4831k880n2120l6810
5784g8805N2062m6341K5330l9816m1397K0924J2626k1720K7784k0070k1305j4652
5772a45380N7876M6334K7206Q6036O50j7508m4549J5908l1435m9551L8257j0620
5760b6776m1949K2725p5434k2998P2196K1816K7315O5267o3906n2964q1440k9353
5748a85501P8334O867L8071O3062n3783n8183L3336M5419J6462n552j6768M5933
5736G697M186j8999j0870o061O9579M2341q4448n4735l7160k040N8272O1353J04933
$$ plain form
5819 73331 -48304 -95317 10830 90736 104444 118739 34546 56453 -5945 -28215 -8324
5808 -8324 -94926 -106047 -77245 -59204 -1055 79379 131546 127667 189458 157127 50682 -19983
5796 -19983 -13678 26221 7540 12107 -47012 38695 86681 67836 13005 10125 -41995 -78805
5784 -78805 -26743 -73084 -47754 -87570 -128967 -108043 -95417 -117137 -89353 -109423 -130728 -145380
5772 -145380 -87504 -41170 -13964 72072 72722 55214 10665 26573 -4862 -54413 -16156 -26776
5760 -26776 -68725 -46000 -121434 -144432 -72236 -50420 -23105 42162 -21744 -74708 -156148 -185501
5748 -185501 -107167 -100300 -62229 833 -52950 -111133 -77797 -32378 -15916 -21468 -38236 7697
5736 7697 11883 -7116 -17986 -24047 45532 87873 3425 -51310 -88470 -90510 -32238 29115 134048
5723A34048j7453q4850m0606K3959n1528j6145l5170o2608J28609M3268m4092
5712b2568k0185m9905q3780J8372J4265L5268N0055P0641N8284k4970q2296j404
5700c8223L4201O7835j2165p4944q4920j4651J12888O9488l0217o5242n213o1489
5688a02652L3768K3907l6495K700R0686K5270m6794k6420J4963q406j2373M8353
5676F507n2787o845j6895K1788K9533M5760j9008l7156j8288O1000Q6135l314
5664I6430o026k3545O3623J0141j2192j4298k5890k7399j1122k2081k0668l8918
5652c1945M6985K8363r5189j5738K9662l5537n0468m9254l6972N3539L4339q0509
5640b02724O8243R5315J39910j3757o5850k529p3973N2018R1193L991p3592j18214
$$ plain form
5723 134048 116595 31745 -8861 15098 -36430 -52575 -87745 -150353 -21744 21524 -22568
5712 -22568 -42753 -92658 -176438 -158066 -143801 -108533 -58478 12163 70447 45477 -36819 -38223
5700 -38223 -4022 63813 51648 -23296 -108216 -122867 -9979 59509 29292 -35950 -41163 -102652
5688 -102652 -68884 -44977 -81472 -78772 11914 37184 -9610 -36030 -21067 -29473 -41846 6507
5676 6507 -46280 -53125 -70020 -48232 -18699 27061 8053 -29103 -47391 13609 99744 96430
5664 96430 90404 66859 130482 140623 128431 114133 88243 60844 49722 27641 6973 -31945
5652 -31945 15040 43403 -51786 -67524 -37862 -73399 -123867 -173121 -210093 -156554 -122215 -202724
5640 -202724 -134481 -39166 100744 86987 21137 18608 -55365 -3347 87846 91837 18245 -99969
5628i9969n317K769k9453k3985N4918l1930M9769L7408M20j3681k0724N5230M6187
5615B1642R371o6858J4355q5013j10743P0878J8420m2257M2008L7191N0113P0143
5603B9250L689M8703J4271j4598k0627J1360L9986l1037n2046o4633k2042j0516
5591f8240O8239P2190r91m2133m3832J5551m0012l6950m9664q173N3135P4390
5579f490O5677k0463j9206m0681o828l5570P8684K7750o997k1058q0849J8002
5567d8029Q6618l3179q4703q5701j5912M824M4220P8005J00285O8210n3139j9137
5555D2362K0994n5156o8543l095L3769m8400K1944j1448n4045m5975P9543R4745
5543F695L1812r1712p1607j5536k1328J8125J18234O6388l0676P4458l4376j7150
$$ plain form
5628 -99969 -105286 -102517 -131970 -155955 -101037 -132967 -83198 -45790 -45370 -59051 -79775 -24545 21642
5615 21642 31013 -35845 -21490 -106503 -217246 -146368 -127948 -170205 -128197 -91006 -40893 29250
5603 29250 32939 81642 95913 81315 60688 72048 112034 80997 28951 -35682 -57724 -68240
5591 -68240 -1 72189 71198 29065 -14767 784 -39228 -76178 -125842 -134015 -80880 -6490
5579 -6490 59187 38724 19518 -21163 -27991 -63561 15123 42873 35876 14818 -66031 -48029
5567 -48029 38589 5410 -79293 -164994 -180906 -176082 -131862 -53857 46428 114638 61499 42362
5555 42362 63356 8200 -60343 -63438 -29669 -78069 -56125 -67573 -121618 -167593 -88050 6695
5543 6695 38507 -53205 -124812 -140348 -161676 -143551 -25317 41071 10395 84853 50477 33327
5531C3327Q4132J7895n7651l6638k2650K2608l7044L7363N7755l9144o8997K6473
5519A7429q834o2268j5503l7491r907k2553l814Q7580Q3215K9814l4053j08257
5507h4642k1990k1106R0806k2783l5472O7770m9344o584p6988K6396P849Q8119
5495c7969J2141R372j2815n276k3158p5832K2022K5943P306J3711N8260K8483
5483B2188P7282M7596q5674n7739L2762q6403n067k2286m8744j5732R8783j1082
5471e4116k2278j8837L1725L4559j9145L7610P8224j4261n8616k3953M1977J02173
5459A15062N4168o2918m1023J685j15588n7882L9472P8676L6771n7713j2054q085
5447b9429o2J2535K3051p338m5903j54715p327R4304O4525K9193L2810M1155M1317
$$ plain form
5531 33327 117459 135354 77703 41065 18415 41023 3979 41342 99097 59953 -9044 17429
5519 17429 8595 -53673 -69176 -106667 -116574 -139127 -142941 -55361 27854 57668 23615 -84642
5507 -84642 -106632 -127738 -36932 -59715 -95187 -27417 -76761 -83345 -160333 -133937 -126088 -37969
5495 -37969 -25828 -16456 -29271 -34547 -57705 -133537 -111515 -85572 -78266 -64555 -6295 22188
5483 22188 99470 147066 61392 3653 36415 -49988 -55055 -77341 -126085 -141817 -43034 -54116
5471 -54116 -76394 -95231 -63506 -28947 -48092 -10482 67742 53481 -5135 -29088 12889 115062
5459 115062 169230 106312 65289 66974 -48614 -106496 -67024 11652 48423 -9290 -21344 -29429
5447 -29429 -29491 -16956 6095 -1243 -47146 -201861 -209188 -114884 -50359 -21166 11644 52799 94116
5434I4116m7159K4268L1646J6127l5383m6086j0605o3244m5882j0167j0354K5331
5422g7392k5723o682J28191O3120R379k9692o751J40K9278L1655q392m1987j12695
5409d7551J1153k860n5033J7624M0596R9682o403k3733K72k3285k4194m8338m1614
5396a03684N2963m8070o6692N6635K7547N8781N8352K8492n0949r0197O8652M7193
5384C9023O0660m2202K6048L5680Q639m0816o8747k5565k7427m4174j5136K9892
5372f4125p383J3240k5373J15919K244p3279p3435m009J8866M4933L5975j8500
5360c4927m6370n920N5996J64229q2431j04254L9780R0543M7023q8018j15802
5349h0151Q7794P0408k4846j1268L2086M440j5293p3818l5967M4431M1576M9456
$$ plain form
5434 94116 46957 71225 102871 118998 83615 37529 26924 -36320 -82202 -92369 -102723 -77392
5422 -77392 -103115 -109797 18394 81514 90893 61201 54450 54590 83868 115523 107131 65144 -47551
5409 -47551 -36398 -39258 -94291 -76667 -36071 63611 57208 33475 33747 10462 -13732 -62070 -103684
5396 -103684 -50721 -98791 -165483 -108848 -81301 -22520 35832 64324 13375 -76822 -8170 39023
5384 39023 99683 57481 83529 119209 127848 87032 18285 -7280 -34707 -78881 -94017 -64125
5372 -64125 -71508 -58268 -83641 32278 34522 -38757 -112192 -116201 -97335 -52402 -16427 -34927
5360 -34927 -81297 -87217 -31221 133008 50577 -53677 -13897 76646 123669 35651 -80151
5349 -80151 7643 78051 53205 41937 74023 78463 63170 -10648 -46615 -2184 39392 88848
5337H8848K9446k1516k2326n4542o6174k0889K0564Q927j5478k8622k9015N4830
5325e5947K073M4534k0144k0250L822K5817o707m6076J1897M8534K7866j927L2296
5312D5788k6565n5835n5665K5368J18545l8115n4686r2851l6985Q2463R2206k1713
$$ plain form
5337 88848 118294 96778 74452 19910 -46264 -67153 -46589 -37662 -53140 -81762 -110777 -55947
5325 -55947 -53874 -9340 -29484 -49734 -45912 -20095 -26802 -72878 -60981 -12447 15419 13492 45788
5312 45788 19223 -36612 -92277 -66909 51636 13521 -41165 -134016 -171001 -88538 3668 -18045
$$ [...]
##END NTUPLES=NMR SPECTRUM
##END=
