##TITLE=Analysis number 320856
Compound Code cc 42209
Book Reference 458/164
Project Code adrs
Chemist Name stevem
##JCAMPDX= 6.0         $$ Bruker NMR JCAMP-DX V2.0
##DATA TYPE= NMR SPECTRUM
##DATA CLASS= NTUPLES
##ORIGIN= Bruker BioSpin GmbH
##OWNER= nmr
$$ XWIN-NMR		Version 3.5
$$ Thu Jul 13 11:54:11 2006 GMT Daylight Time (UT+1h)  MAYBRIDGE\nmr@NMR_250MHZ
##.OBSERVE FREQUENCY= 250.131544655141
##.OBSERVE NUCLEUS= ^1H
##.ACQUISITION MODE= SIMULTANEOUS (DQD)
##.ACQUISITION SCHEME= undefined
##.AVERAGES= 16
##.DIGITISER RES= 18
##SPECTROMETER/DATA SYSTEM= dpx250
##.PULSE SEQUENCE= zg30
##.SOLVENT NAME= CDCl3
##.SHIFT REFERENCE= (INTERNAL, CDCl3, 0, 16.4492)
##AUDIT TRAIL= $$ (NUMBER, WHEN, WHO, WHERE, WHAT)
$$ ##TITLE= Audit trail, XWIN-NMR		Version 3.5
$$ ##JCAMPDX= 5.01
$$ ##ORIGIN= Bruker BioSpin GmbH
$$ ##OWNER= nmr
$$ C:\u/data/dgb/nmr/ADRS/2680/pdata/1/auditp.txt
$$ ##AUDIT TRAIL=  $$ (NUMBER, WHEN, WHO, WHERE, WHAT)
(   1,<2006-07-13 11:53:44.08 +100>,<MAYBRIDGE\nmr>,<NMR_250MHZ>,
      <created by zg, POWCHK disabled, PULCHK disabled
       configuration hash MD5:
       E2 DF 36 D8 04 B2 41 60 5A D7 A3 38 5A 4B D0 FE
       data hash MD5: 64K
       5F 4C 48 C4 9D 54 A7 24 35 CC 24 C4 30 04 80 98>)
(   2,<2006-07-13 11:54:00.60 +100>,<MAYBRIDGE\nmr>,<NMR_250MHZ>,
      <Start of raw data processing
       ef LB = 0.3 FT_mod = 6 PKNL = 1 SI = 32K 
       data hash MD5: 32K
       46 69 71 C0 26 43 74 80 E1 D2 07 EA B1 ED 0D 55>)
(   3,<2006-07-13 11:54:02.24 +100>,<MAYBRIDGE\nmr>,<NMR_250MHZ>,
      <apk 
       data hash MD5: 32K
       3E 5E 59 C5 10 4A A3 68 B5 E7 7E 16 74 BE 1B 78>)
(   4,<2006-07-13 11:54:03.00 +100>,<MAYBRIDGE\nmr>,<NMR_250MHZ>,
      <abs ABSG = 5 
       data hash MD5: 32K
       08 10 5F F3 1B 64 F3 FB 7E B7 55 87 81 B5 22 D7>)
$$ ##END=
$$ 
$$ hash MD5
$$ E4 E9 34 6A D0 78 7F 00 F0 0D A9 B4 40 95 3B AD
##$RELAX= 
##$RELAX= 
##$RELAX= 
##$RELAX= 
##$RELAX= 
##$RELAX= 
##$RELAX= 
$$ Bruker specific parameters
$$ --------------------------
##$DU= <C:\u>
##$EXPNO= 2680
##$NAME= <ADRS>
##$PROCNO= 1
##$TYPE= <nmr>
##$USER= <dgb>
##$AMP= (0..31)
100 100 100 100 100 100 100 100 100 100 100 100 100 100 100 100 100 100 
100 100 100 100 100 100 100 100 100 100 100 100 100 100 
##$AQSEQ= 0
##$AQ_mod= 3
##$AUNM= <au_zg>
##$AUTOPOS= <12 >
##$BF1= 250.13
##$BF2= 250.13
##$BF3= 250.13
##$BF4= 250.13
##$BF5= 500.13
##$BF6= 500.13
##$BF7= 500.13
##$BF8= 500.13
##$BYTORDA= 1
##$CFDGTYP= 0
##$CFRGTYP= 5
##$CHEMSTR= <none>
##$CNST= (0..31)
1 1 145 1 1 1 1 1 1 1 1 1 1 1 1 1 1 1 1 1 1 1 1 1 1 1 1 1 1 1 1 1 
##$CPDPRG= <>
##$CPDPRG1= <>
##$CPDPRG2= <>
##$CPDPRG3= <>
##$CPDPRG4= <mlev>
##$CPDPRG5= <mlev>
##$CPDPRG6= <mlev>
##$CPDPRG7= <mlev>
##$CPDPRG8= <mlev>
##$CPDPRGB= <>
##$CPDPRGT= <>
##$D= (0..31)
0 1 0 0 0 0 0 0 0 0.06 0 0 0 0 0 0 0.0002 0 0 0 0 0 0 0 0 0 0 0 0 0 0 
0 
##$DATE= 1152788022
##$DBL= (0..7)
120 120 120 120 120 120 120 120 
##$DBP= (0..7)
150 150 150 150 150 150 150 150 
##$DBP07= 0
##$DBPNAM0= <>
##$DBPNAM1= <>
$$ [...]
##$SUBNAM7= <"">
##$SUBNAM8= <"">
##$SUBNAM9= <"">
##$SW= 20.6930455092707
##$SWIBOX= (0..15)
0 0 3 0 0 0 0 0 0 0 0 0 0 0 0 0 
##$SW_h= 5175.983436853
##$TD= 65536
##$TD0= 1
##$TE= 296.16
##$TE2= 300
##$TE3= 300
##$TEG= 300
##$TL= (0..7)
0 120 120 120 120 120 120 120 
##$TP= (0..7)
150 150 150 150 150 150 150 150 
##$TP07= 0
##$TPNAME0= <>
##$TPNAME1= <>
##$TPNAME2= <>
##$TPNAME3= <>
##$TPNAME4= <>
##$TPNAME5= <>
##$TPNAME6= <>
##$TPNAME7= <>
##$TPOAL= (0..7)
0.5 0.5 0.5 0.5 0.5 0.5 0.5 0.5 
##$TPOFFS= (0..7)
0 0 0 0 0 0 0 0 
##$TUNHIN= 0
##$TUNHOUT= 0
##$TUNXOUT= 0
##$USERA1= <user>
##$USERA2= <user>
##$USERA3= <user>
##$USERA4= <user>
##$USERA5= <user>
##$V9= 5
##$VALIST= <valist>
##$VCLIST= <CCCCCCCCCCCCCCC>
##$VD= 0
##$VDLIST= <DDDDDDDDDDDDDDD>
##$VPLIST= <PPPPPPPPPPPPPPP>
##$VTLIST= <TTTTTTTTTTTTTTT>
##$WBST= 1024
##$WBSW= 4
##$XGAIN= (0..3)
0 0 0 0 
##$XL= 0
##$YL= 0
##$YMAX_a= 326420
##$YMIN_a= -456951
##$ZGOPTNS= <>
##$ZL1= 120
##$ZL2= 120
##$ZL3= 120
##$ZL4= 120
##$ABSF1= 16.44923
##$ABSF2= -4.243942
##$ABSG= 5
##$ABSL= 3
##$ALPHA= 0
##$AQORDER= 0
##$ASSFAC= 0
##$ASSFACI= 0
##$ASSFACX= 0
##$ASSWID= 0
##$AUNMP= <proc_1d>
##$AZFE= 0.1
##$AZFW= 0.1
##$BCFW= 0
##$BC_mod= 0
##$BYTORDP= 0
##$COROFFS= 0
##$CY= 12.5
##$DATMOD= 1
##$DC= 0
##$DFILT= <>
##$DTYPP= 0
##$F1P= 14.0000005364418
##$F2P= -0.99999901652339
##$FCOR= 0.5
##$FTSIZE= 32768
##$FT_mod= 6
##$GAMMA= 0
##$GB= 0
##$INTBC= 1
##$INTSCL= 1
##$ISEN= 128
##$LB= 0.3
##$LEV0= 0
##$LPBIN= 0
##$MAXI= 10000
##$MC2= 0
##$MEAN= 0
##$ME_mod= 0
##$MI= 0
##$NCOEF= 0
##$NC_proc= -3
##$NLEV= 6
##$NOISF1= 0
##$NOISF2= 0
##$NSP= 0
##$NTH_PI= 0
##$NZP= 0
##$OFFSET= 16.44923
##$PC= 1
##$PHC0= 167.6722
##$PHC1= 7.245148
##$PH_mod= 1
##$PKNL= yes
##$PPARMOD= 0
##$PSCAL= 4
##$PSIGN= 0
##$REVERSE= no
##$SF= 250.130018199511
##$SI= 32768
##$SIGF1= 0
##$SIGF2= 0
##$SINO= 400
##$SIOLD= 32768
##$SREGLST= <1H.CDCl3>
##$SSB= 0
##$STSI= 32768
##$STSR= 0
##$SW_p= 5175.98343685301
##$SYMM= 0
##$S_DEV= 0
##$TDeff= 65536
##$TDoff= 0
##$TI= <Analysis number 999999
Compound Code 99
Book Reference 9
Project Code 9>
##$TILT= no
##$TM1= 0
##$TM2= 0
##$TOPLEV= 0
##$USERP1= <user>
##$USERP2= <user>
##$USERP3= <user>
##$USERP4= <user>
##$USERP5= <user>
##$WDW= 1
##$XDIM= 32768
##$YMAX_p= 277037769
##$YMIN_p= -231569
$$ End of Bruker specific parameters
$$ ---------------------------------
##NTUPLES= NMR SPECTRUM
##VAR_NAME=  FREQUENCY,     SPECTRUM/REAL,   SPECTRUM/IMAG
##SYMBOL=    X,             R,               I
##VAR_TYPE=  INDEPENDENT,   DEPENDENT,       DEPENDENT
##VAR_FORM=  AFFN,          ASDF,            ASDF
##VAR_DIM=   32768,         32768,           32768
##UNITS=     HZ,            ARBITRARY UNITS, ARBITRARY UNITS
##FACTOR=    0.157963299565203, 1,           1
##FIRST=     4114.44624781613, 0,            0
##LAST=      -1061.53718903688, 0,           0
##MIN=       -1061.53718903688, -231569,     0
##MAX=       4114.44624781613, 277037769,    0
$$ Real data points
##PAGE= N=1
##DATA TABLE= (X++(R..R)), XYDATA
$$ [...]
$$ plain form
16617 -41732 -14523 -19278 -84497 -127743 -110736 -85145 -15105 -13506 -14241 3781 -23592 -32844 40873
16604 40873 24702 19349 29481 32004 -16241 -46328 -46884 -22474 -10857 -7178 9457 -28227 -83082
16591 -83082 -83704 -92873 -59088 -47718 -74765 -68609 -46045 -27955 -21386 -17607 31262 28333 -17800
16578 -17800 -57239 -77438 -109102 -120715 -81976 -46841 32075 44035 26690 -28439 -65378 -82558
16566 -82558 -70012 -116733 -112214 -118106 -107712 -75321 -83739 -55975 -68806 -82043 -91042 -73855
16554 -73855 -82162 -54382 -51066 -18365 2872 41794 5041 -72654 -45828 -65640 -96362 -76827
16542 -76827 -48554 -64634 -72267 -58791 -37496 -6057 18270 -37952 -147315 -155306 -144424 -90267
16530 -90267 -87621 -113064 -46537 -14818 8823 10941 14580 33898 21939 18229 24635 27238 84882
$$ packed form
16617d1732K7209m755o5219m3246J7007K5591P0040J599p35J8022k7373r252P3717
16604D0873j6171n353J0132K523m8245l0087n56K4410J1617L679J6635l7684n4855
16591h3082o22r169L3785J1370k7047O156K2564J8090O569L779M8869k929m6133
16578a7800l9439k0199l1664j1613L8739L5135P8916J1960j7345n5129l6939j7180
16566h2558J2546m6721M519n892J0394L2391q418K7764j2831j3237q999J7187
16554g3855q307K7780L316L2701K1237L8922l6753p7695K6826j9812l0722J9535
16542g6827K8273j6080p633J3476K1295L1439K4327n6222j09363p991J0882N4157
16530i0267K646k5443O6527L1719K3641K118L639J9318j1959l710O406K603N7644
$$ plain form
16517 84882 109758 86025 26474 -30745 -17219 -24021 -38123 -95390 -89928 -107769 -158382 -88200
16505 -88200 -20634 -18045 -11762 -55982 -78360 -55564 -45540 -7794 -19765 30313 68905 61279
16493 61279 69797 88533 70982 45497 9343 -36740 -3198 53076 82780 22727 -1313 -5643
16481 -5643 17015 60297 40411 39209 38238 33747 43839 72166 77711 32347 49615 16935 -25841
16468 -25841 -75145 -102931 -150092 -152828 -119394 -65661 -62208 -100718 -57075 -14941 -1976 -54234
16456 -54234 -110906 -68241 -32123 -26324 -39864 -13521 18056 53180 78115 89083 26333 -30315
16444 -30315 -61768 -124386 -163254 -140105 -68078 23993 -15408 -66930 -113407 -110679 -54287 -22336
16432 -22336 -6673 -35932 -8941 51597 77542 65286 -42535 -68190 -79745 -77478 -54907 12794
$$ packed form
16517H4882K4876k3733n9551n7219J3526o802j4102n7267N462j7841n0613P0182
16505h8200O7566K589O283m4220k2378K2796J0024L7746j1971N0078L8592p626
16493F1279Q518J8736j7551k5485l6154m6083L3542N6274K9704o0053k4040m330
16481e643K2658M3282j9886j202r71m491J0092K8327N545m5364J7268l2680m2776
16468b5841m9304k7786m7161k736L3434N3733L453l8510M3643M2134J2965n2258
16456e4234n6672M2665L6118N799j3540K6343L1577L5124K4935J0968o2750n6648
16444c0315l1453o2618l8868K3149P2027R2071l9401n1522m6477K728N6392L1951
16432b2336J5663k9259K6991O0538K5945j2256j07821k5655j1555K267K2571O7701
$$ plain form
16420 12794 30053 53359 28159 31777 71229 -15529 -34173 -14869 -1049 -27960 -9564 46404
16408 46404 53533 31974 12826 -14302 4818 22745 -7653 -55371 -33745 -12495 -24946 -15589
16396 -15589 11855 -29134 -51235 -13538 -6759 -48719 -59649 -48831 -14213 -37585 -17130 6254
16384 6254 25996 -20258 -34319 32225 73740 52099 -10335 -47398 -292 17616 4036 9387
16372 9387 -9795 -14802 -34212 -5513 32155 63962 53676 83831 17106 -54163 -82469 -121385
16360 -121385 -103673 -68877 5514 19390 19171 36010 21895 72679 40714 13090 49688 71644
16348 71644 66681 71240 36800 -6901 -29259 -54766 -58244 -66444 -54451 -22281 -21616 1806 30614
16335 30614 2712 -7618 5762 -33687 -24588 -71089 -106924 -82683 -100993 -138526 -183312 -128034
$$ packed form
16420A2794J7259K3306k5200L618L9452q6758j8644J9304J3820k6911J8396N5968
16408D6404P129k1559j9148k7128J9120J7927l0398m7718K1626K1250j2451R357
16396a5589K7444m0989k2101L7697O779m1960j0930J0818L4618k3372K0455K3384
16384F254J9742m6254j4061O6544M1515k1641o2434l7063M7106J7908j3580N351
16372I387j9182n007j9410K8699L7668L1807j0286L0155o6725p1269k8306l8916
16360a21385J7712L4796P4391J3876k19J6839j4115N0784l1965k7624L6598K1956
16348G1644m963M559l4440m3701k2358k5507l478q200J1993L2170O65K3422K8808
16335C0614k7902j0330J3380l9449R099m6501l5835K4241j8310l7533m4786N5278
$$ plain form
16323 -128034 -32357 17416 46294 -38275 -60497 -39592 -75051 -26388 -31501 -40472 -35898 6444
16311 6444 44030 55227 107383 148230 167492 183931 156198 121948 33402 -36023 -49508 -3299
16299 -3299 52924 61329 67046 21610 -17596 -25421 -6000 -10360 25058 67753 44972 79454 85203
16286 85203 94495 76194 11601 -11275 -10714 -34107 -114407 -121691 -78734 -31309 -17131 38646
16274 38646 78657 47993 43131 55817 51031 59293 71065 13152 55611 59981 75754 41629
16262 41629 -31889 -3221 14036 -29435 -66084 -12938 21411 -24476 11219 -14304 12454 43550
16250 43550 39605 27099 57811 47262 63844 76697 119122 138008 72350 47685 50537 95193
16238 95193 137842 164720 152740 112342 48398 -6142 17143 25558 33266 2032 -27207 -67934
$$ packed form
16323a28034R5677M9773K8878q4569k2222K0905l5459M8663n113q971M574M2342
16311F444L7586J1197N2156M0847J9262J6439k7733l4250q8546o9425j3485M6209
16299c299N6223Q405N717m5436l9206p825J9421m360L5418M2695k2781L4482N749
16286H5203R292j8301o4593k2876N61k3393q0300p284M2957M7425J4178N5777
16274C8646M0011l0664m862J2686m786Q262J1772n7913M2459M370J5773l4125
16262D1629p3518K8668J7257m3471l6649N3146L4349m5887L5695k5523K6758L1096
16250D3550l945j2506L0712j0549J6582J2853M2425J8886o5658k4665K852M4656
16238I5193M2649K6878j1980m0398o3944n4540K3285Q415P708l1234k9239m0727
$$ plain form
16226 -67934 -58404 22909 47376 72535 66429 17715 17183 22012 22626 21056 43252 15364 -66392
16213 -66392 -33451 14610 19449 56738 90250 52736 60680 146779 132348 178433 206890 160572
16201 160572 79625 100489 113026 91554 66823 39738 93800 60478 -15452 -27080 -26686 -51383
16189 -51383 -44958 -26571 -14752 26730 45768 42776 -14027 -29557 16645 -13018 -8041 52182
16177 52182 62870 20935 -52159 2489 52629 45483 -35836 -50586 -27163 -14582 37285 47069
16165 47069 34085 119276 116005 110423 162803 166278 137749 97084 89857 69617 37012 -21426
16153 -21426 -37288 -20229 26459 40399 22751 7216 20463 5406 6454 29766 4376 -19861
16141 -19861 -10372 -13556 -67441 -63962 -7348 83052 91594 125506 89028 87591 132727 88949 -30265
$$ packed form
16226f7934R530Q1313K4467K5159o106m8714n32M829O14j570K2196k7888q1756
16213f6392L2941M8061M839L7289L3512l7514P944Q6099j4431M6085K8457m6318
16201A60572q0947K0864J2537k1472k4731k7085N4062l3322p5930j1628L94k4697
16189e1383O425J8387J1819M1482J9038k992n6803j5530M6202k9663M977O0223
16177E2182J0688m1935p3094N4648N0140p146q1319j4750K3423J2581N1867R784
16165D7069j2984Q5191l271n582N2380L475k8529m0665p227k0240l2605n8438
16153b1426j5862J7059M6688J3940j7648j5535J3247j5057J048K3312k5390k4237
16141a9861R489l184n3885L479N6614R0400Q542L3912l6478j437M5136m3778j19214
$$ plain form
16128 -30265 -73976 -44030 -28034 -12803 -2037 -27993 55962 45994 15795 72799 92503 66229
16116 66229 38757 6559 -40316 -40575 16 50340 58241 53748 20888 33782 54375 26981
16104 26981 -25386 -91337 -53631 18612 51906 71012 53355 77457 151328 251240 252758 184987
16092 184987 175427 156984 105701 61677 49528 85936 103586 81652 79441 56914 38816 27255
16080 27255 55654 51747 2897 -14017 -18003 5857 -23069 -17241 -56720 -60681 -58226 -33877 -21123
16067 -21123 -1622 -64874 -108176 -92108 -79540 -127980 -139235 -68863 -1827 53682 7941 4599
16055 4599 49218 12864 -27726 -25601 -3174 -27142 -105465 -139544 -122896 -94125 -74019 -43832
16043 -43832 -12187 36792 86335 86433 72875 5290 -19384 -55226 5963 62231 106123 90034
$$ packed form
16128c0265m3711K9946J5996J5231J0766k5956Q3955r968l0199N7004J9704k6274
16116F6229k7472l2198m6875k59M0591N0324P901m493l2860J2894K0593k7394
16104B6981n2367o5951L7706P2243L3294J9106j7657K4102P3871R9912J518o7771
16092A84987r560j8443n1283m4024j2149L6408J7650k1934k211k2527j8098j1561
16080B7255K8399l907m8850j6914l986K3860k8926N828l9479l961K455K4349J2754
16067b1123J9501o3252m3302J6068J2568m8440j1255P0372O7036N5509m5741l342
16055D599M4619l6354m0590K125K2427k3968p8323l4079J6648K8771K0106L0187
16043d3832L1645M8979M9543R8j3558o7585k4674l5842O1189N6268M3892j6089
$$ plain form
16031 90034 43449 67682 6253 -59857 -61307 -12392 15283 8950 -20235 -76014 -38897 -69642
16019 -69642 -115620 -90972 -54513 -78086 -85637 -58728 -63125 -17979 -27886 -64322 -105075 -11703
16007 -11703 54425 27999 -4638 8045 42001 56606 57592 62000 49948 57433 63656 5462 -9291
15994 -9291 4234 -7016 -26620 -22239 -9942 22766 16166 54391 54648 64847 26092 -44410 -72854
15981 -72854 -133820 -104350 1823 29669 -22953 -85751 -75083 -53315 -18196 31256 74407
15970 74407 54518 43602 29618 -15976 -51915 -83755 -81581 -130435 -116536 -88549 -112109 -102062
15958 -102062 -28804 22303 72652 11799 -13097 -36907 -27693 -95624 -98017 -72728 -60980 3489
15946 3489 88790 26093 -68821 -82240 -134699 -152198 -93614 -83731 -65932 -59426 -47489 44
$$ packed form
16031I0034m6585K4233o1429o6110j450M8915K7675o333k9185n5779L7117l0745
16019f9642m5978K4648L6459k3573p551K6909m397M5146r907l6436m0753R3372
16007a1703O6128k6426l2637J2683L3956J4605R86M408j2052P485O223n8194j4753
15994i291J3525j1250j9604M381J2297L2708o600L8225K57J0199l8755p0502k8444
15981g2854o0966K9470J06173K7846n2622o2798J0668K1768L5119M9452M3151
15970G4407j9889j0916j3984m5594l5939l1840K174m8854J3899K7987k3560J0047
15958a02062P3258N1107N0349o0853k4896k3810R214o7931k393K5289J1748O4469
15946C489Q5301o2697r4914j3419n2459j7499N8584R883J7799O506J1937M7533
$$ plain form
15934 44 35159 89336 99592 19851 -307 5186 40370 24910 37417 49895 53569 -9569 -56666
15921 -56666 22026 61487 41113 -34894 -54477 -21412 -7073 -657 -32265 -22838 -20969 -18970
15909 -18970 -32113 -4271 -34744 -60997 -88671 -102212 -95921 -78660 -65751 -64293 -35179 -82580
15897 -82580 -123213 -100547 -93429 -84786 -51026 -22255 56290 27081 21357 -1392 -6773 535 6333
15884 6333 -14221 -6435 -36967 -10807 4805 -4462 17213 64711 32640 43725 45380 28842
15872 28842 43038 78352 -10331 -34548 -11495 19639 36183 2225 -22644 -37365 14001 74150
15860 74150 72537 21696 -30930 -30895 -17934 -61701 -40434 -72756 -106699 -78351 -422 46199
15848 46199 -13350 -125931 -180023 -131425 -68053 -59181 -36804 -4312 6277 -36138 -62951 -79257
$$ packed form
15934D4L5115N4177J0256p9741k0158N493L5184j5460J2507J2478L674o3138m7097
15921e6666P8692L9461k0374p6007j9583L3065J4339O416l1608R427J869J999
15909a8970j3143K7842l0473k6253k7674j3541O291J7261J2909J458K9114m7401
15897h2580m0633K2666P118Q643L3760K8771P8545k9209n724k2749n381P308N798
15884F333k0554P786l0532K6160J5612r267K1675M7498l2071J1085J655j6538
15872B8842J4196L5314q8683k4217K3053L1134J6544l3958k4869j4721N1366O0149
15860G4150j613n0841n2626L5J2961m3767K1267l2322l3943K8348P7929M6621
15848D6199n9549j12581n4092M8598O3372Q872K2377L2492J0589m2415k6813j6306
$$ plain form
15836 -79257 -74819 -91130 -38568 -32482 -39619 -27056 58190 86584 105404 94265 63004 4883
15824 4883 -41309 -22008 -28000 -35112 43110 17270 -47392 -74128 -73308 -47017 -29646 -44692 29387
15811 29387 18192 -57016 -60901 -45352 -13091 -40237 -53796 -65947 -16602 -17870 -69524 -74616
15799 -74616 -55368 -50816 -76252 -69860 -78589 -78509 -17753 -54629 -52030 -11966 151 -38633 -45633
15786 -45633 -106728 -90437 -6962 -5565 -57425 -64089 -63451 -72541 -57808 -49253 -55348 -68977 -61508
15773 -61508 -54584 -34854 -26897 -42796 -44826 -112298 -92057 -100812 -79351 -28126 39772 25053
15761 25053 -58461 -70756 -118063 -78412 -40773 -44001 -14790 -17467 -19512 -847 -6034 -387 -13214
15748 -13214 8571 9468 -28037 -28607 -22002 -36614 -75415 -55146 47665 127107 124582 60901 32609
$$ packed form
15836g9257M438j6311N2562O086p137J2563Q5246K8394J8820j1139l1261n8121
15824D883m6192J9301n992p112P8222k5840o4662k6736Q20K6291J7371j5046P4079
15811B9387j1195p5208l885J5549L2261k7146j3559j2151M9345j268n1654n092
15799g4616J9248M552k5436O392q729Q0O0756l6876K599M0064J2117l8784p000
15786d5633o1095J6291Q3475J397n1860o664O38r090J4733Q555o095j3629P469
15773f1508O924J9730P957j5899k030o7472K0241q755K1461N1225O7898j4719
15761B5053q3514j2295m7307L9651L7639l228K9211k677k045J8665n187N647j2827
15748a3214K1785Q97l7505n70O605j4612l8801K0269J02811P9442k525o3681k8292
$$ plain form
15735 32609 81392 73041 -31893 -25372 6588 -13943 -19708 29445 54451 63999 56011 31820
15723 31820 59433 87884 57145 33501 41094 22215 7978 -50800 -47072 -73312 -41013 -9791
15711 -9791 2531 19173 13382 -17663 -19341 20087 -29689 -95807 -92657 -91602 -61604 -64718 -46062
15698 -46062 -24888 -5889 -35213 -25209 -47611 -85666 -71389 -59581 -25488 57377 152730 205891
15686 205891 152283 54341 75722 137594 121617 51798 97387 98531 99770 76477 -24838 -40470
15674 -40470 62825 122882 100368 -10840 -66025 -44712 8723 17167 -34527 16125 57788
15663 57788 51073 13134 -30687 -75216 -53932 -13560 -45342 -42500 1132 49104 36507 -8468
15651 -8468 -28816 -39499 -62704 -60211 -79131 -64035 9244 -29883 -11486 38080 22166 77738
$$ packed form
15735C2609M8783q351j04934O521L1960k0531n765M9153K5006R548p988k4191
15723C1820K7613K8451l0739k3644P593j8879j4237n8778L728k6240L2299L1222
15711i791J2322J6642n791l1045j678L9428m9776o6118L150J055K9998l114J8656
15698d6062K1174J8999k9324J0004k2402l8055J4277J1808L4093Q2865R5353N3161
15686B05891n3608r7942K1381O1872j5977o9819M5589J144J239k3293j01315j5632
15674d0470J03295O0057k2514j11208n5185K1313N3435Q444n1694N0652M1663
15663E7788o715l7939m3821m4529K1284M0372l1782K842M3632M7972j2597m4975
15651h468k0348j0683k3205K493j8920J5096P3279l9127J8397M9566j5914N5572
$$ plain form
15639 77738 80392 9045 -25196 -26130 30128 61227 39648 3497 -31343 -46345 -67097 -98355
15627 -98355 -82043 -77287 -87572 -22554 -23752 -17709 -43581 -40309 15972 -18041 -46132 -29672
15615 -29672 -19675 34977 15308 5574 8762 16633 14118 57455 69654 72277 68711 76216 46485
15602 46485 -14272 -62724 -46099 -3586 24733 64730 69262 49185 45755 64140 55329 44427
15590 44427 2513 11429 7748 -18968 5862 -18921 -56610 -100585 -60250 -37056 -44648 -36541
15578 -36541 2151 28786 34582 74777 62717 56203 60667 85645 121247 110607 94395 75664
15566 75664 33401 10993 -65140 -72885 -50560 -21364 7094 70159 41018 -15687 -66126 4189
15554 4189 30905 -12512 -26068 -22693 9294 40403 81165 52228 15748 -50736 -98767 -83744
$$ packed form
15639G7738K654p1347l4241r34N6258L1099k1579l6151l4840j5002k0752l1258
15627i8355J6312M756j0285O5018j198O043k5872L272N6281l4013k8091J6460
15615b9672R997N4652j9669r734L188P871k515M3337J2199K623l566P505k9731
15602D6485o0757m8452J6625M2513K8319L9997M532k0077l430J8385q811j0902
15590D4427m1914Q916l681k6716K4830k4783l7689m3975M0335K3194p592Q107
15578c6541L8692K6635N796M0195j2060o514M464K4978L5602j0640j6212j8731
15566G5664m2263k2408p6133p745K2325K9196K8458O3065k9141n6705n0439P0315
15554D189K6716m3417j3556L375L1987L1109M0762k8937l6480o6484m8031J5023
$$ plain form
15542 -83744 -59648 -3197 49413 11119 9697 27676 12722 -43396 -79752 -11952 49140 10519
15530 10519 -80669 -59261 -29628 -31361 -15091 -30839 -68091 -656 492 5598 -54247 -34305
15518 -34305 -33835 -31450 31692 -4469 -9585 -17792 -59210 -34302 51227 50660 46624 46707 -1880 -33918
15504 -33918 24177 23289 60282 50092 -15511 -50071 -25838 -27747 -53235 -63012 -72657 -83633 -39460
15491 -39460 -47078 8903 35836 22538 39000 57365 73050 29495 -40323 -27841 -15793 -52730
15479 -52730 -54034 -34818 -53466 -5028 -7191 -59076 -112992 -128127 -131418 -105889 -114308 -16775
15467 -16775 -12277 -17733 -28473 -111664 -96506 -29255 -4235 30640 36798 62836 -487 -64116
15455 -64116 -67148 -22303 -6556 13653 21268 -7514 -34961 -75173 -75666 -27256 24469 30407 10163
$$ packed form
15542h3744K4096N6451N2610l8294j422J7979j4954n6118l6356O7800O1092l8621
15530A0519r1188K1408K9633j733J6270j5748l7252O7435J148N106n9845J9942
15518c4305M70K385O3142l6161n116q207m1418K4908Q5529n67m036Q3m8587l2038
15504c3918N8095q88L6993j0190o5603l4560K4233j909k5488r777r645j0976M4173
15491c9460p618N5981K6933j3298J6462J8365J5685m3555o9818J2482J2048l6937
15479e2730j304J9216j8648M8438k163n1885n3916j5135l291K5529q419R7533
15467a6775M498n456j0740q3191J5158O7251K5020L4875O158K6038o3323o3629
15455f4116l032M4845J5747K0209P615k8782k7447m0212m93M8410N1725N938k0244
$$ plain form
15442 10163 1164 1987 7644 -18383 -3512 5976 15899 28819 14998 -48852 -17832 -30709 -10731
15429 -10731 49594 36012 51862 34870 33935 62175 32619 14876 -53934 -31595 -6006 -8306
15417 -8306 -57569 -86289 -48883 24003 5570 45906 53617 30208 11056 25992 1076 -20835
15405 -20835 -39568 -14119 -32678 10149 16566 12534 5034 31368 17762 -32658 -50821 -77801
15393 -77801 -44030 -35512 -50189 -72861 -5825 -4546 1396 -18102 -52777 -120588 -118846 -64890
15381 -64890 -22517 -33524 -22786 -9380 2667 -17060 -22052 -43157 -37696 1915 30622 10855
15369 10855 -47899 -56060 -75930 -50537 -49870 -50785 -1977 -38299 -65530 -36761 -14574 20617 5836
15356 5836 26693 22913 3913 -22885 -10677 -71318 -45256 -37638 -109086 -114382 -86967 -97756
$$ packed form
15442A0163q999Q23N657k6027J4871R488R923J2920j3821o3850L1020j2877J9978
15429a0731O0325j3582J5850j6992r35K8240k9556j7743o8810K2339K5589k300
15417h306m9263k8720L7406P2886j8433M0336P711k3409j9152J4936k4916k1911
15405b0835j8733K5449j8559M2827O417m032p500K6334j3606n0420j8163k6980
15393g7801L3771Q518j4677k2672O7036J279N942j9498l4675o7811J742N3956
15381f4890M2373j1007J0738J3406J2047j9727m992k1105N461L9611K8707j9767
15369A0855n8754q161j9870K5393O67r15M8808l6322k7231K8769K2187L5191j4781
15356E836K0857l780j9000k6798J2208o0641K6062P618p1448n296K7415j0789
$$ plain form
15344 -97756 -39465 8046 -56490 -113588 -192045 -209954 -181071 -146643 -66393 -31456 -29068 -28314
15332 -28314 -21850 -81758 -104210 -92562 -73753 -13297 -33606 -102791 -143857 -134483 -124516 -67409
15320 -67409 -9011 31275 37242 2997 -23060 -50224 -46080 -90521 -58057 -40330 -41730 -15682
15308 -15682 6834 10573 35657 -61032 -131758 -114525 -98573 -103740 -98914 -97511 -103134 -70674 -83579
15295 -83579 -48122 4309 73740 44132 -61260 -101793 -87724 411 -16059 -21865 7840 18904
15283 18904 4927 34253 73833 40142 -66498 -60932 -4811 -10480 17313 32782 25558 16749
15271 16749 39141 11941 -26094 -15059 6505 8720 68301 50387 -42366 -26151 15810 -3012
15259 -3012 -11335 -49516 -12127 -623 -42771 -43739 -67051 4053 -18923 -16445 14618 -34956 -19729
$$ packed form
15344i7756N8291M7511o4536n7098p8457j7909K8883L4428Q0250L4937K388P54
15332b8314O464n9908k2452J1648J8809O0456k0309o9185m1066R374R967N7107
15320f7409N8398M0286N967l4245k6057k7164M144m4441L2464J7727j400K6048
15308a5682K2516L739K5084r6689p0726J7233J5952n167M826J403n623L2460j2905
15295h3579L5457N2431O9431k9608j05392m0533J4069Q8135j6470n806K9705J1064
15283A8904j3977K9326L9580l3691j06640N566N6121n669K7793J5469p224q809
15271A6749K2392k7200l8035J1035K1564K215N9581j7914r2753J6215M1961j8822
15259c012q323l8181L7389J1504m2148r68k3312P1104k2976K478L1063m9574J5227
$$ plain form
15246 -19729 35980 47037 -10139 -38831 -45390 -42964 35671 62015 58630 3815 -37195 -22355
15234 -22355 -81840 -103231 -96542 -37505 -52124 -125391 -133676 -77885 -22047 394 30151 72330
15222 72330 120385 81473 31813 -576 23546 -8811 -2445 -15835 -52273 -73848 -75798 -33974
15210 -33974 -41233 -78938 -58503 -32358 1933 -47799 -42403 -38364 -10393 22727 10453 -31368
15198 -31368 -74724 -58860 -26436 -10653 -50056 -24713 -57956 -88685 -51092 -7756 25688 -15551
15186 -15551 637 56148 96180 85767 51348 47275 60521 57801 74584 99242 60292 31123
15174 31123 19117 1063 -4642 -6451 -63594 -75684 -64466 -43406 -62214 -23534 556 29779
15162 29779 3241 -70866 -88009 -39992 13514 2343 24493 -15838 -30596 -13397 -5579 63471
$$ packed form
15246a9729N5709J1057n7176k8692o559K426P8635K6344l385n4815m1010J4840
15234b2355n9485k1391O689N9037j4619p3267q285N5791N5838K2441K9757M2179
15222G2330M8055l8912m9660l2389K4122l2357O366j3390l6438k1575j950M1824
15210c3974p259l7705K0435K6145L4291m9732N396M039K7971L3120j2274m1821
15198c1368m3356J5864L2424J5783l9403K5343l3243l0729L7593M3336L3444m1239
15186a5551J6188N5511M0032j0413l4419m073J3246k720J6783K4658l8950k9169
15174C1123j2006j8054n705j809n7143j2090J1218K1060j8808L8680K4090K9223
15162B9779k6538p4107j7143M8017N3506j1171K2150m0331j4758J7199P818O9050
$$ plain form
15150 63471 115389 121540 126345 144142 121530 171840 319278 310623 305677 344308 285697 183147
15138 183147 136601 114479 136605 145637 114166 85517 86704 74289 84788 97211 129543 136053
15126 136053 109233 120748 169065 134836 103466 21790 -7641 -77205 -57585 -25192 -53719
15115 -53719 -64412 -54128 -27663 19372 28542 15463 63068 57586 82583 79528 81482 58718
15103 58718 34076 10249 24533 21179 13006 37401 -51365 -86924 -68569 -25955 -25912 -84113 -112934
15090 -112934 -33594 25128 19396 -21894 -58294 -71171 -43983 -73516 7228 16196 -36018 -76215
15078 -76215 -90482 -69177 -51644 10918 -23917 -24617 31468 80864 141850 101308 49865 52367
15066 52367 44583 41824 97797 178943 136423 81476 65728 30097 746 -64822 -67876 -37960
$$ packed form
15150F3471N1918O151M805J7797k2612N0310J47438q655m946L8631n8611j02550
15138A83147m6546k2122K2126R032l1471k8649J187j2415J0499J2423L2332O510
15126A36053k6820J1515M8317l4229l1370q1676k9431o9564J9620L2393k8527
15115e3719j0693J0284K6465M7035R170j3079M7605n482K4997l055J954k2764
15103E8718k4642k3827J4284l354q173K4395q8766l5559J8355M2614M3n8201k8821
15090a12934P9340N8722n732m1290l6400j2877K7188k9533Q0744Q968n2214m0197
15078g6215j4267K1305J7533O2562l4835p00N6085M9396O0986m0542n1443K502
15066E2367p784k759N5973Q1146m2520n4947j5748l5631k9351o5568l054K9916
$$ plain form
15054 -37960 -68219 -92115 -44096 -32512 -39543 -31513 65097 101058 83766 95903 115462 122058
15042 122058 186106 215352 188828 140731 124824 166969 178465 176904 188880 219636 234612 229467
15030 229467 131552 88250 83544 107704 107874 95835 139073 145530 85812 49856 98718 130946
15018 130946 117669 106733 114309 126631 162247 162915 139304 122165 121705 162549 185633 212679
15006 212679 201371 217958 360279 564132 859803 1194868 1523634 1483660 936086 556288
14996 556288 367557 258836 178663 126289 131569 154939 164672 121332 138545 126854 89086
14985 89086 70807 123733 108056 95376 124031 177395 162218 99597 74777 45745 64465 96574
14973 96574 -4240 -99120 -106994 6141 7458 64752 73537 97003 90092 63422 73272 92420
$$ packed form
15054c7960l0259k3896M8019J1584p031Q030R6610L5961j7292J2137J9559O596
15042A22058O4048K9246k6524m8097j5907M2145J1496j561J1976L0756J4976n145
15030B29467r7915m3302m706K4160J70j2039M3238O457n9718l5956M8862L2228
15018A30946j3277j0936P576J2322L5616O68k3611j7139m60M0844K3084K7046
15006B12679j1308J6587J42321K03853K95671L35065L28766l9974n47574l79798
14996E56288j88731j08721q0173n2374N280K3370R733m3340J7213j1691l7768
14985H9086j8279N2926j5677j2680K8655N3364j5177o2621k4820k9032J8720L2109
14973I6574j00814r4880p874J13135J317N7294Q785K3466o911k6670R850J9148
$$ plain form
14961 92420 74022 -4929 -47609 -43306 -9874 23560 -62093 -85117 -42894 14366 1119 -15372
14949 -15372 -18251 14744 92344 131478 53568 28120 39422 56365 21495 -21454 14979 25064
14937 25064 24542 41356 119824 43310 -35534 -23877 77406 155837 216572 192080 207990 192228
14925 192228 300286 413076 467503 473586 443520 415672 364390 309817 207890 173791 216656
14914 216656 229880 236751 145418 109582 132084 104317 117751 89964 76074 100260 159802 256000
14902 256000 240036 242423 208135 157413 130344 171003 220209 207860 161418 115034 122821 129087
14890 129087 162490 195135 217637 194405 245287 289318 307917 285499 256248 278985 297689
14879 297689 401921 486720 471532 457384 479081 462249 350774 306606 372792 373796 353272
$$ packed form
14961I2420j8398p8951m2680M303L3432L3434q5653k3024M2223N7260j3247j6491
14949a5372k879L2995P7600L9134p7910k5448J1302J6943l4870m2949L6433J0085
14937B5064n22J6814P8468p6514p8844J1657J01283P8431O0735k4492J5910j5762
14925A92228J08058J12790N4427O083l0066k7848n1282n4573j01927l4099M2865
14914B16656J3224O871r1333l5836K2502k7767J3434k7787j3890K4186N9542R6198
14902B56000j5964K387l4288n0722k7069M0659M9206j2349m6442m6384P787O266
14890A29087L3403L2645K2502k3232N0882M4031J8599k2418k9251K2737J8704
14879B97689J04232Q4799j5188j4148K1697j6832j11475m4168O6186J004k0524
$$ plain form
14868 353272 315501 289505 310276 336319 228862 180073 186030 200968 240911 260900 275881
14857 275881 287085 270030 205003 167087 176876 186699 183521 214677 265041 329066 341335 297683
14845 297683 277284 268860 215073 189094 167839 169009 118521 103242 158262 177601 192976 167002
14833 167002 186618 195792 210632 202929 211142 202573 178560 195513 229378 216224 165002 232333
14821 232333 275046 283959 315441 351112 293494 235399 248425 229093 235662 299295 292833 215609
14809 215609 215724 193676 205400 235152 195456 128390 170812 202709 180441 170592 188159 197141
14797 197141 170724 123346 99375 125463 144583 172248 129708 113785 106579 136718 151023 162369
14785 162369 200708 211251 216261 166558 141936 143811 148330 142304 170729 169907 168134 181273 157296
$$ packed form
14868C53272l7771k5996K0771K6043j07457m8789N957J4938L9943J9989J4981
14857B75881J1204j7055o5027l7916R789R823l178L1156N0364O4025J2269m3652
14845B97683k0399q424n3787k5979k1255J170n0488j5279N5020J9339J5375k5974
14833A67002J9616R174J4840p703Q213q569k4013J6953L3865j3154n1222O7331
14821B32333M2713Q913L1482L5671n7618n8095J3026j9332O569O3633o462p7224
14809B15609J15k2048J1724K9752l9696o7066M2422L1897k2268r849J7567Q982
14797A97141k6417m7378k3971K6088J9120K7665m2540j5923p206L0139J4305J1346
14785A62369L8339J0543N010m9703k4622J875M519o026K8425q22j773J3139k3977
$$ plain form
14772 157296 93903 73649 116149 149721 165357 199206 228117 183824 210159 231334 282255
14761 282255 300666 286282 262708 239175 219445 212741 265997 264956 256271 259143 236782 206330
14749 206330 139430 108734 76099 86845 87687 137145 150396 144887 171858 174455 108061 97929
14737 97929 73005 31203 19492 -16656 -3034 51680 66706 116041 109942 67603 -1971 -30682
14725 -30682 -36339 2971 -56056 -40018 -26519 5549 35658 68754 23036 11389 39059 27715
14713 27715 -36723 -45706 -40331 -12399 70570 68388 45681 35107 50473 53024 -7974 -8845 21493
14700 21493 41052 71903 124143 114785 -5368 -52445 -55574 -5169 -16084 -49158 -97038 -81982
14688 -81982 -55506 -50896 -64995 -81222 -50595 34523 53904 8963 -27769 -16418 37383 81437
$$ packed form
14772A57296o3393k0254M2500L3572J5636L3849K8911m4293K6335K1175N0921
14761B82255J8411j4384k3574k3533j9730o704N3256j041q685K872k2361l0452
14749B06330o6900l0696l2635J0746Q42M9458J3251n509K6971K597o6394j0132
14737I7929k4924m1802j1711l6148J3622N4714J5026M9335o099m2339o9574k8711
14725c0682n657L9310n9027J6038J3499L2068L0109L3096m5718j1647K7670j1344
14713B7715o4438q983N375K7932Q2969k182k2707j0574J5366K551o0998q71L0338
14700B1493J9559L0851N2240r358j20153m7077l129N0405j0915l3074m7880J5056
14688h1982K6476M610j4099j6227L0627Q5118J9381m4941l6732J1351N3801M4054
$$ plain form
14676 81437 43039 -45572 -49515 -81552 -105735 -86371 -44529 -19843 48374 40636 -18864 -84632
14664 -84632 -89878 -56775 -7053 6484 -24362 -62340 -77508 -53337 -92024 -149124 -125628 -94592
14652 -94592 -61549 -33728 27019 62778 42331 58184 38364 8106 -6602 -10355 6646 -23326
14640 -23326 -6829 -32868 -38369 -16252 -34442 -23309 300 -27089 -70855 -63723 -51961 -51730
14628 -51730 -80536 -137030 -111503 -68956 -27800 -24108 -26559 21528 -19165 -82334 -34607 31696
14616 31696 71246 64118 -27199 -77405 -104222 -108886 -46636 -8495 26640 -24783 -40051 -15249
14604 -15249 -40908 -40773 -32433 -59710 -37168 11164 -7676 -48394 -59802 -72429 -90917 -44425
14592 -44425 -25824 17513 63958 28312 -36835 -90317 -118623 -68061 -1682 29690 21130 45043
$$ packed form
14676H1437l8398q8611l943l2037k4183J9364M1842K4686O8217p738n9500o5768
14664h4632n246L3103M9722J3537l0846l7978j5168K4171l8687n7100K3496L1036
14652i4592L3043K7821O0747L5759k0447J5853j9820l0258j4708l753J7001k9972
14640b3326J6497k6039n501K2117j8190J1133K3609k7389m3766P132J1762K31
14628e1730k8806n6494K5527M2547M1156L692k451M8087m0693o3169M7727O6303
14616C1696L9550p128r1317n0206k6817m664O2250L8141L5135n1423j5268K4802
14604a5249k5659J35Q340k7277K2542M8332j8840m0718j1408j2627j8488M6492
14592d4425J8601M3337M6445l5646o5147n3482k8306N0562O6379L1372q560K3913
$$ plain form
14580 45043 66655 63626 87513 90150 71520 95412 47073 24303 15089 14110 21541 -25339 -27343
14567 -27343 -32453 -21256 -21200 -26918 -81977 -88848 -47502 -120842 -93406 -82508 -57672 -1856 22771
14554 22771 83835 71297 82729 196742 259926 249186 225360 193803 174512 160247 56447
14543 56447 2840 17405 32944 62739 106845 153869 142899 127195 133741 77120 11527 -10614
14531 -10614 -17700 -66508 -100903 -109582 -50579 18383 8190 38386 82855 75756 95703 105721
14519 105721 64644 30951 51182 42697 21738 30351 57720 98183 23812 -63683 -94321 -41975
14507 -41975 61338 -5436 -688 -6186 -7916 -30711 13350 43156 9779 -53713 -92057 -75765
14495 -75765 -31454 5929 52574 52635 20021 -22131 -50749 -96213 -72272 -96012 -71803 -47996
$$ packed form
14580D5043K1612l029K3887K637j8630K3892m8339k2770r214r79P431m6880k004
14567b7343n110J1197N6n718n5059o871M1346p3340K7436J0898K4836N5816K4627
14554B2771O1064j2538J1432J14013O3184j0740k3826l1557j9291j4265j03800
14543E6447n3607J4565J5539K9795M4106M7024j0970j5704O546n6621o5593k2141
14531a0614p086m8808l4395q679N9003O8962j0193L0196M4469p099J9947J0018
14519A05721m1077l3693K0231q485k0959Q613K7369M0463p4371q7495l0638N2346
14507d1975J03313o6774M748n498j730k2795M4061K9806l3377o3492l8344J6292
14495g5765M4311L7383M6645O1l2614m2152k8618m5464K3941k3740K4209K3807
$$ plain form
14483 -47996 -12297 -14922 -22904 10901 13760 -61784 -44246 -33616 -22031 1656 75535 104470
14471 104470 116476 168607 159674 124792 102718 61632 54133 28686 99272 96110 97808 71573
14459 71573 78070 86757 46116 66047 76856 52018 9730 31075 65895 35202 19448 46501
14447 46501 95365 59347 495 18433 50174 65100 58880 33539 50207 79446 122921 171493
14435 171493 173860 97599 23681 16273 48533 84742 103806 102114 129401 118222 88652 61943
14423 61943 48000 45000 89773 94059 118339 160993 175623 212316 247963 266238 172402 114721
14411 114721 89084 88599 86806 148854 91949 133594 213066 268979 281516 279166 245098 250267
14399 250267 244217 214781 227021 179134 173160 159020 226947 261977 295011 279497 273002 303507
$$ packed form
14483d7996L5699k625p982L3805K859p5544J7538J0630J1585K3687P3879K8935
14471A04470J2006N2131q933l4882k2074m1086p499k5447P0586l162J698k6235
14459G1573O497Q687m0641J9931J0809k4838m2288K1345L4820l0693j5754K7053
14447D6501M8864l6018n8852J7938L1741J4926o220k5341J6668K9239M3475M8572
14435A71493K367p6261p3918p408L2260L6209J9064j692K7287j1179k9570k6709
14423F1943j3943l000M4773M286K4280M2654J4630L6693L5647J8275r3836n7681
14411A14721k5637m85j793O2048n6905M1645P9472N5913J2537k350l4068N169
14399B50267o050k9436J2240m7887n974j4140O7927L5030L3034j5514o495L0505
$$ plain form
14387 303507 253143 243864 267977 282961 296220 274545 307571 371767 382001 396977 408300 446671
14375 446671 478302 516094 527705 579365 601337 597907 579255 617582 704471 759742 836305 933210
14363 933210 953723 971967 1006436 1082614 1146296 1237920 1376825 1509375 1658923 1803093 1943254
14352 1943254 2139322 2314694 2566637 2847948 3152286 3458566 3922202 4418442 4938245
14343 4938245 5530483 6301431 7236351 8240487 9359337 10573876 12081943 13860509 15866050
14334 15866050 18062233 20477328 23069720 25751460 28497521 31187141 33709313 35883293
14326 35883293 37678003 39047231 39928660 40284045 40161622 39717421 39080340 38288329 37443286
14317 37443286 36537905 35705653 34964334 34377197 33945597 33627770 33483998 33560368 33727828
$$ packed form
14387C03507n0364r279K4113J4984J3259k1675L3026O4196J0234J4976J1323L8371
14375D46671L1631L7792J1611N1660K1972l430j8652L8327Q6889N5271P6563R6905
14363I33210K0513J8244L4469P6178O3682R1624J38905J32550J49548J44170J40161
14352A943254J96068J75372K51943K81311L04338L06280M63636M96240N19803
14343D938245N92238P70948R34920J004136J118850J214539J508067J778566K005541
14334A5866050K196183K415095K592392K681740K746061K689620K522172K173980
14326C5883293J794710J369228Q81429L55385j22423m44201o37081p92011q45043
14317C7443286r05381q32252p41319n87137m31600l17827j43772P6370J67460
$$ plain form
14308 33727828 34134925 34786370 35532820 36435070 37463902 38587720 39751760 40926542 42071154
14299 42071154 43108532 43907976 44360746 44387298 43983792 43090370 41661421 39826501 37540228
14290 37540228 35005966 32406571 29775696 27268973 24910679 22742005 20825703 19076183
14282 19076183 17492316 16105292 14863083 13770401 12767527 11983217 11289220 10644410
14274 10644410 10111337 9568189 9012313 8517127 8138839 7713734 7392499 7172615 6934069
14265 6934069 6666749 6362282 6091315 5907140 5705564 5504082 5233442 5063099 4955675
14256 4955675 4744066 4568458 4386580 4247174 4202726 4091827 3912842 3780110 3624337 3490277
14246 3490277 3382930 3317299 3161402 2997098 2924915 2839369 2736907 2671125 2627826 2573035
$$ packed form
14308C3727828M07097O51445P46450R02250J028832J123818J164040J174782J144612
14299D2071154J037378P99444M52770K6552m03506q93422j428949j834920k286273
14290C7540228k534262k599395k630875k506723k358294k168674j916302j749520
14282A9076183j583867j387024j242209j092682j002874p84310o93997o44810
14274A0644410n33073n43148n55876m95186l78288m25105l21235k19884k38546
14265F934069k67320l04467k70967j84175k01576k01482k70640j70343j07424
14256D955675k11609j75608j81878j39406m4448j10899j78985j32732j55773j34060
14246C490277j07347o5631j55897j64304p2183q5546j02462o5782m3299n4791
$$ plain form
14236 2573035 2509354 2473753 2434248 2315253 2277976 2292368 2140139 2053712 2019922 1929046 1905364
14225 1905364 1888187 1886187 1784355 1778840 1720931 1642041 1672277 1654513 1615812 1571303 1544140
14214 1544140 1466296 1389508 1346888 1398857 1458073 1405428 1312741 1222568 1170385 1181859 1195463
14203 1195463 1174137 1122524 1099212 1071578 1043237 988615 952406 949819 913613 900933 881215
14192 881215 814360 795764 773215 772014 764013 705978 718440 711670 706546 693769 668274 706654
14180 706654 687401 698956 725364 709282 634576 580538 572935 647467 625571 588777 588180 584411
14168 584411 551350 488497 469653 449957 374999 389465 467424 521693 519529 483308 485603 493126
14156 493126 485211 445747 473454 445467 444869 447308 478588 455421 414753 379148 338473 396484
$$ packed form
14236B573035o3681l5601l9505j18995l7277J4392j52229q6427l3790r0876k3682
14225A905364j7177k000j01832n515n7909p8890L0236j7764l8701m4509k7163
14214A544140p7844p6788m2620N1969N9216n2645r2687r0173n2183J1474J3604
14203A195463k1326n1613k3312k7634k8341n4622l6209k587l6206j2680j9718
14192H81215o6855j8596k2549j201q001n8035J2462o770n124j2777k5495L8380
14180G06654j9253J1555K6408j6082p4706n4038p603P4532k1896l6794n97l769
14168E84411l3061o2853j8844j9696p4958J4466P7959N4269k164l6221K295P523
14156D93126p915l9464K7707k7987n98K439L1280k3167m0668l5605m0675N8011
$$ plain form
14144 396484 330849 302558 332023 342990 395418 410494 299899 225244 238860 237824 232955 237167
14132 237167 314344 289732 236274 200117 152858 169069 174505 171777 194497 258979 200807 165892
14120 165892 122592 86325 118197 104681 43045 83739 197779 181324 149547 206251 250852
14109 250852 242019 169115 185512 190593 181181 204504 193608 175438 120357 109638 86118 113279
14097 113279 145564 187627 216063 180000 155206 142480 118997 132813 106460 99162 64025 123804
14085 123804 139816 171402 164202 128505 78137 79712 130184 154879 171643 176475 162114 122981
14073 122981 88058 47340 24463 11280 -24474 13247 38836 34343 85862 104442 111970 70122
14061 70122 37947 21037 -23510 23168 55113 83059 107940 81472 101823 95848 74549 135073
$$ packed form
14144C96484o5635k8291K9465J0967N2428J5076j10595p4655J3616j036m869M212
14132B37167P7177k4612n3458l6157m7259J6211N436k728K2720O4482n8172l4915
14120A65892m3300l6267L1872j3516o1636M0694J14040j6455l1777N6704M4601
14109B50852q833p2904J6397N081r412K3323j0896j8170n5081j0719k3520K7161
14097A13279L2285M2063K8436l6063k4794j2726k3483J3816k6353p298l5137N9779
14085A23804J6012L1586p200l5697n0368J575N0472K4695J6764M832j4361l9133
14073A22981l4923m0718k2877j3183l5754L7721K5589m493N1519J8580P528m1848
14061G0122l2175j6910m4547M6678L1945K7946K4881k6468K0351n975k1299O0524
$$ plain form
14049 135073 120691 105755 66825 113660 135117 91430 26187 35716 73720 76171 62632 23013
14037 23013 14207 60484 51513 70184 64165 82482 94460 129178 127953 95808 41240 60492
14025 60492 45323 -2674 36725 73387 75188 46043 34442 -60 -27055 -81082 -90199 -23815
14013 -23815 21942 13032 19360 -322 -780 22285 16312 4987 14841 15730 60961 50138 26157
14000 26157 21860 28846 37199 17897 31678 64147 87247 128099 185037 211662 231000 171514
13988 171514 83475 26954 57161 48334 48704 51216 56566 64471 73699 47474 31664 -12467 -12862
13975 -12862 -8252 22508 2184 -8161 32166 119621 123434 123539 163758 200638 160012 14457
13963 14457 9487 470 4284 -44830 -51808 -21189 34282 115664 104410 84619 91049 138997 149445
$$ packed form
14049A35073j4382j4936l8930M6835K1457m3687o5243R529L8004K451j3539l9619
14037B3013q806M6277q971J8671o019J8317J1978L4718j225l2145n4568J9252
14025F0492j5169m7997L9399L6662J801k9145j1601l4502k6995n4027r117O6384
14013b3815M5757q910O328j9682m58K3065n973j1325R854Q89M5231j0823k3981
14000B6157m297O986Q353j9302J3781L2469K3100M0852N6938K6625J9338n9486
13988A71514q8039n6521L0207q827L70K512N350P905R228k6225j5810m4131l95
13975a2862M610L0760k0324j0345M0327Q7455L813J05M0219L6880m0626j45555
13963A4457m970r017L814m9114o978L0619N5471Q1382j1254j9791O430M7948J0448
$$ plain form
13950 149445 153828 204176 233685 165759 98897 95385 149074 173864 74282 77872 99228 93971
13938 93971 50108 -25473 -28959 -24396 -4034 4221 -36391 -15714 71593 89723 78329 99507
13926 99507 148688 131160 129652 138342 84210 -8451 -54441 5731 97731 71933 62586 55383
13914 55383 -4814 26441 59397 48591 38564 99786 181269 246299 268412 275339 243240 197679
13902 197679 168097 189193 216914 240694 197687 147000 106990 112092 126859 182451 219649 166558
13890 166558 215798 255690 230389 214154 226438 182366 134179 127307 92087 95948 99944 107762
13878 107762 112425 127593 91301 42242 30073 92921 134981 151838 124565 112384 106160 177041
13866 177041 257409 212557 215763 257437 310752 299558 235990 274684 299003 261084 249849 264641
$$ packed form
13950A49445M383N0348K9509o7926o6862l512N3689K4790r9582L590K1356n257
13938I3971m3863p5581l486M563K0362Q255m0612K0677Q7307J8130j1394K1178
13926I9507M9181j7528j508Q690n4132r2661m5990O0172R2000k5798r347p203
13914E5383o0197L1255L2956j0806j0027O1222Q1483O5030K2113O927l2099m5561
13902A97679k9582K1096K7721K3780m3007n0687m0010N102J4767N5592L7198n3091
13890A66558M9240L9892k5301j6235J2284m4072m8187o872l5220L861L996P818
13878A07762M663J5168l6292m9059j2169O2848M2060J6857k7273j2181o224P0881
13866A77041Q0368m4852L206M1674N3315j1194o3568L8694K4319l7919j1235J4792
$$ plain form
13854 264641 220662 254965 281411 292903 330396 301967 328000 360899 417358 467482 393984
13843 393984 333174 268667 268061 282183 311637 304644 280282 277271 267567 290940 277428 290806
13831 290806 305125 312277 320775 301420 266343 201193 229027 194604 165365 215592 243242 205460
13819 205460 196798 167228 93100 65907 101282 54889 -21380 -6175 18481 66845 36811 45464
13807 45464 66446 31686 39561 7946 26097 80316 51210 12529 10951 -13749 12872 27700
13795 27700 -7603 -26612 -19572 -65283 -42734 5507 35756 8476 -14112 13226 9890 -2368
13783 -2368 20858 3460 19259 4516 -50241 -35106 13371 9307 -5266 52950 62502 65545
13771 65545 121712 116505 28456 -46211 -86416 -109224 -73781 -33734 -33883 -65693 -54519 -13721
$$ packed form
13854B64641m3979L4303K6446J1492L7493k8429K6033L2899N6459N0124p3498
13843C93984o0810o4507o06J4122K9454o993k4362l011r704K3373j3512J3378
13831B90806J4319P152Q498j9355l5077o5150K7834l4423k9239N0227K7650l7782
13819B05460q662k9570p4128k7193L5375m6393p6269J5205K4656M8364l0034Q653
13807D5464K0982l4760P875l1615J8151N4219k9106l8681j578k4700K6621J4828
13795B7700l5303j9009P040m5711K2549M8241L0249k7280k2588K7338l336j2258
13783b368K3226j7398J5799j4743n4757J5135M8477m064j4573N8216R552L043
13771F5545N6167n207q8049p4667m0205k2808L5443M0047j49l1810J1174M0798
$$ plain form
13759 -13721 45353 42402 -27455 -49252 -42990 -72117 -18757 -12897 -44551 -70474 -78525 -70454 -2947
13746 -2947 20767 23470 18117 21907 10003 -44246 -42631 -7880 -19617 -71128 2425 20140 -23950
13733 -23950 -18365 -14429 -6175 7446 -39467 -29334 -30987 -39898 -81891 -73990 -61037 1885 46310
13720 46310 47566 24690 18119 -45444 -44362 -47249 -65059 -50598 -33085 -58952 -52956 -11773 -5096
13707 -5096 10608 -36990 -52611 -20179 13100 -19469 -54055 -58376 -3141 50708 73995 27328
13695 27328 -17911 -33896 -14846 -62118 -24510 39882 16370 -1908 1214 6769 15341 32439
13683 32439 86544 93533 83793 57097 57640 30164 5830 -19584 -28218 4518 40602 586 21447
13670 21447 95054 131801 118391 19403 -6092 -28658 -100416 -173573 -135904 -47386 -8135 -11605
$$ packed form
13759a3721N9074k951o9857k1797O262k9127N3360N860l1654k5923q051Q071O7507
13746b947K3714K703n353L790j1904n4249J615L4751j1737n1511P3553J7715m4090
13733b3950N585L936Q254J3621m6913J0133j653q911m1993P901J2953O2922M4425
13720D6310J256k2876o571o3563J082k887j7810J4461J7513k5867N996M1183O677
13707e096J5704m7598j5621L2432L3279l2569l4586m321N5235N3849K3287m6667
13695B7328m5239j5985J9050m7272L7608O4392k3512j8278L122N555Q572J7098
13683C2439N4105O989r740k6696N43k7476k4334k5414q634L2736L6084m0016K0861
13670B1447P3607L6747j3410r8988k5495k2566p1758p3157L7669Q8518L9251l470
$$ plain form
13658 -11605 37704 70917 33582 56511 111194 68300 -1828 -48020 -99122 -60192 -14580 2628
13646 2628 54997 43598 33723 39502 97161 115612 98094 37650 19357 -2847 -5357 -8511 -35462
13633 -35462 -45917 -13880 47399 93011 72165 101642 53360 20951 44977 38488 53863 48542
13621 48542 17269 -23200 -43773 -22016 -31434 -14966 28544 26372 26653 19637 -9169 -28684 5449
13608 5449 50897 87508 49989 -42649 -29597 -31011 -34860 -14139 -28325 -91199 -105505 -40193
13596 -40193 -51418 -32343 1626 68394 49787 -60297 -166133 -121881 -107444 -64704 -22666
13585 -22666 -8006 -46393 -67024 -65305 -56226 -16393 -33441 -99447 -49169 -12980 -31681 -32867
13573 -32867 -60933 -37134 55249 19999 -32215 -41235 -36573 -36622 -98465 -148238 -77909 20035 -21882
$$ packed form
13658a1605M9309L3213l7335K2929N4683m2894p0128m6192n1102L8930M5612J7208
13646B628N2369j1399r875N779N7659J8451j7518o0444j8293k2204k510l154k6951
13633c5462j0455L2037O1279M5612k0846K9477m8282l2409K4026o489J5375n321
13621D8542l1273m0469k0573K1757r418J6468M3510k172K81p016k8806j9515L4133
13608E449M5448L6611l7519r2638J3052j414l849K0721j4186o2874j4306O5312
13596d0193j1225J9075L3969O6768j8607j10084j05836M4252J4437M2740M2038
13585b2666J4660l8387k0631J719R079L9833j7048o6006N0278L6189j8701j186
13573c2867k8066K3799R2383l5250n2214r020M662m9o1843m9773P0329R7944m1917
$$ plain form
13560 -21882 -30274 -25699 -20231 30769 36337 66282 14661 -7758 24888 -7257 -80988 -61674
13548 -61674 -57005 8424 27139 57532 9541 -68154 -125122 -131396 -113172 -60343 32166 26585
13536 26585 55349 16922 2100 -55626 -60214 -36739 -57813 -52586 -2577 -26274 24166 75379
13524 75379 25324 -19260 -60792 -98864 -123925 -108979 -94866 -66972 -44132 -31775 -5862 -1200
13512 -1200 1271 -2819 -51793 -56098 -75756 -43319 -77153 -31500 20646 14477 -16124 -14838 -25042
13499 -25042 -77957 -97081 -45752 -50332 -51542 11990 35400 -14183 -19600 -16630 25343 35381
13487 35381 67874 55043 -17576 -57730 -25362 -36890 -62465 -122369 -131171 -83576 -55951 -6611
13475 -6611 23889 -22770 -67547 -57999 22171 -11959 -21530 -11169 -46154 -36536 50304 64229
$$ packed form
13560b1882q392M575N468N1000N568K9945n1621k2419L2646l2145p3731J9314
13548f1674M669O5429J8715L0393m7991p7695n6968o274J8224N2829R2509n581
13536B6585K8764l8427j4822n7726m588K3475k1074N227N0009k3697N0440N1213
13524G5379n0055m4584m1532l8072k5061J4946J4113K7894K2840J2357K5913M662
13512a200K471m090m8974m305j9658L2437l3834M5653N2146o169l0601J286j0204
13499b5042n2915j9124N1329m580j210O3532K3410m9583n417K970M1973J0038
13487C5381L2493j2831p2619m0154L2368j1528k5575n9904q802M7595K7625M9340
13475f611L0500m6659m4777R548Q0170l4130r571J0361l4985R618Q6840J3925
$$ plain form
13463 64229 48956 15117 -57754 -94756 -140277 -133810 -49017 35647 88762 52054 10941 -12775
13451 -12775 -420 -10221 73780 67576 -20485 3562 47529 30697 19550 23857 24459 -8062 -15413
13438 -15413 -38265 -77874 -63881 -9384 -22560 -41818 -43241 -37021 -27709 -2900 -646 20260
13426 20260 -23627 -74473 -65914 -11754 25949 -25988 -62536 -83454 -98445 -142549 -94852 -55468
13414 -55468 -19655 26199 71217 49513 80166 33165 -22593 -47161 -126887 -114623 -112363 -146040
13402 -146040 -94886 -31105 -29794 35343 32740 -17733 12703 46767 47453 30712 52350 76227
13390 76227 47325 32811 -6378 -45641 -42175 -69460 -104775 -64955 -53143 -71156 -44574 -29162
13378 -29162 -16393 -38787 3983 26032 25253 6487 37412 -9487 -55969 -35517 -4714 16702
$$ packed form
13463F4229j5273l3839p2871l7002m5521O467Q4793Q4664N3115l6708m1113k3716
13451a2775J2355r801Q4001o204q8061K4047M3967j6832j1147M307O02l2521p351
13438a5413k2852l9609J3993N4497j3176j9258j423O220R312K4809K254K0906
13426B0260m3887n0846Q559N4160L7703n1937l6548k0918j4991m4104M7697L9384
13414e5468L5813M5854M5018k1704L0653m7001n5758k4568p9726J2264K260l3677
13402a46040N1154O3781J311O5137k603n0473L0436L4064O86j6741K1638K3877
13390G6227k8902j4514l9189l9263L466k7285l5315L9820J1812j8013K6582J5412
13378b9162J2769k2394M2770K2049p79j8766L0925m6899m6482K0452L0803K1416
$$ plain form
13366 16702 -8404 -23104 -49993 -91954 -104774 -131272 -104187 -108625 -107614 -108815 -48175 -2140
13354 -2140 -33729 -1371 -13040 -61062 -52157 -74556 -29877 13862 47630 11470 -4712 -33550
13342 -33550 -109038 -119076 -84060 -60938 -27727 8921 31880 -8202 -20711 -15339 -43368 -18471
13330 -18471 28633 -48114 -74948 -37910 -8538 -2166 -25211 -26290 -41277 -38608 -111667 -97758
13318 -97758 -84999 -54495 -70853 -74035 -6069 28156 35938 54497 87759 76581 103198 63979
13306 63979 -71123 -81148 -44014 3858 -18763 -50433 -19187 14419 -1172 18411 53087
13295 53087 79527 34516 -8437 -28592 -55899 -45507 31318 70564 74771 47972 71090 70994
13283 70994 41457 32971 -28502 -7406 -25038 -51008 -52607 -65128 -83075 -76103 -57345 -12311
$$ packed form
13366A6702k5106j4700k6889m1961j2820k6498K7085m438J011j201O0640M6035
13354b140l1589L2358j1669m8022Q905k2399M4679M3739L3768l6160j6182k8838
13342c3550p5488j0038L5016K3122L3211L6648K2959m0082j2509N372k8029K4897
13330a8471M7104p6747k6834L7038K9372O372k3045j079j4987K669p3059J3909
13318i7758J2759L0504j6358l182O7966L4225P782J8559L3262j1178K6617l9219
13306F3979j35102j0025L7134M7872k2621l1670L1246L3606j5591J9583L4676
13295E3087K6440m5011m2953k0155k7307J0392P6825L9246M207k6799K3118r6
13283G0994k9537q486o1473K1096j7632k5970j599j2521j7947O972J8758M5034
$$ plain form
13271 -12311 19388 48265 -16769 -66181 -109442 -106051 -132742 -146365 -127653 -82790 -12452 3653
13259 3653 -21740 -72017 -41601 -57023 -96651 -101501 -83025 -80652 13633 61849 55220 -4399
13247 -4399 -33269 -58992 -84630 -35386 14754 40411 33709 18068 -30725 -21891 -54998 -73968
13235 -73968 -28764 -3883 5553 50852 4614 -43015 -15161 -47671 -27308 -18141 -36040 -25247
13223 -25247 11521 58974 101093 95482 84092 56383 -7390 -32618 -49423 -90413 -106684 -80253
13211 -80253 -74182 -51232 5126 14284 1419 37363 39908 54477 18169 -10379 -41783 -14364
13199 -14364 6419 -6163 -61609 -67077 -49633 -21219 -45732 -31656 -22076 -56356 -87206 -53916
13187 -53916 -46392 -40028 1904 -9408 -22791 -51937 -1281 5410 -19133 -30674 -54783 -16525
$$ packed form
13271a2311L1699K8877o5034m9412m3261L391k6691j3623J8712M4863P0338J6105
13259C653k5393n0277L0416j5422l9628m850J8476K373R4285M8216o629n9619
13247d399k8870k5723k5638M9244N0140K5657o702j5641m8793Q834l3107j8970
13235g3968M5204K4881R436M5299m6238m7629K7854l2510K0363R167j7899J0793
13223b5247L6768M7453M2119n611j1390k7709o3773k5228j6805m0990j6271K6431
13211h0253O071K2950N6358R158j2865L5944K545J4569l6308k8548l1404K7419
13199a4364K0783j2582n5446n468J7444K8414k4513J4076R580l4280l0850L3290
13187e3916P524O364M1932j1312j3383k9146N0656O691k4543j1541k4109L8258
$$ plain form
13175 -16525 61186 66004 52556 43330 43093 21288 18369 -18709 -44153 -21267 19767 88646 111920
13162 111920 54495 52018 49686 46643 -14168 -89310 -73117 -52927 -4394 75407 49127 8388
13150 8388 16176 8192 -17526 -36640 -2368 -645 -2605 -48295 -10569 37632 42598 23708 40336
13137 40336 34787 -2863 58514 72220 -27801 -67486 -53495 -54766 -20612 -49763 -55032 -85473
13125 -85473 -6848 39571 -9221 -5675 24415 -1834 -19317 -48602 -65293 -13253 183 -37565
13113 -37565 -53814 -74747 -64553 5010 38815 6935 8665 -24927 -34993 -8232 76416 35339
13101 35339 -3100 -20358 -32736 -53769 -89297 -70096 -94430 -74536 -51946 -59397 -32286 -37067
13089 -37067 -28256 -37281 -100689 -158736 -145938 -60155 -27814 12068 -13654 -86573 -122536 -92053
$$ packed form
13175a6525P7711M818j3448r226k37k1805k919l7078k5444K2886M1034O8879K3274
13162A11920n7425k477k332l043o0811p5142J6193K0190M8533P9801k6280m0739
13150H388P788p984k5718j9114L4272J723j960m5690L7726M8201M966j8890J6628
13137D0336n549l7650O1377J3706j00021l9685J3991j271L4154k9151n269l0441
13125h5473P8625M6419m8792L546L0090k6249j7483k9285j6691N2040J3436l7748
13113c7565j6249k0933J0194O9563L3805l1880J730l3592j0066K6761Q4648m1077
13101C5339l8439j7258j2378k1033l5528J9201k4334J9894K2590p451K7111m781
13089c7067Q811r025o3408n8047J2798Q5783L2341L9882k5722p2919l5963L0483
$$ plain form
13077 -92053 -82555 -72961 -27516 -21627 -19898 2816 19121 53588 43701 43166 50512 14013 -45308
13064 -45308 -81883 -104945 -99234 -3335 4603 -10546 5463 -42406 -62418 -79081 -92946 -88040
13052 -88040 -1795 50029 89612 131025 95826 24156 -6419 -15156 -13970 -54533 -81645 -85619
13040 -85619 -52887 -2526 -13182 15138 95414 84585 105650 -8396 -108287 -78588 47479
13029 47479 86105 67799 39596 7733 -31851 -131743 -143504 -148306 -153700 -114636 -93032 -104858
13017 -104858 -93813 -88361 -43142 -26073 -37913 -60887 -56500 -62698 -52027 1710 -16 -76084
13005 -76084 -99182 -79251 -151307 -154326 -99018 -90851 -51947 -16915 49465 85587 88376 135225
12993 135225 153547 95551 58012 44309 43636 24327 -10537 -8483 67887 83609 19218 -55176
$$ packed form
13077i2053R498R594M5445N889J729K2714J6305L4467r887n35P346l6499n9321
13064d5308l6575k3062N711R5899P938j5149J6009m7869k0012j6663j3865M906
13052h8040Q6245N1824L9583M1413l5199p1670l0575q737J186m0563k7112l974
13040h5619L2732N0361j0656K8320Q0276j0829K1065j14046r9891K9699J26067
13029D7479L8626j8306k8203l1863l9584r9892j1761m802n394L9064K1604j1826
13017a04858J1045N452M5219J7069j1840k2974M387o198J0671N3737j726p6068
13005g6084k3098J9931p2056l019N5308Q167L8904L5032O6380L6122K789M6849
12993A35225J8322n7996l7539j3703o73j9309l4864K054P6370J5722o4391p4394
$$ plain form
12981 -55176 -31553 -37636 -31044 -33729 -54079 -65764 -53418 -2477 50700 35127 -16416 -32343
12969 -32343 -17086 -58422 -71840 -58878 -57089 -32446 14875 37512 44407 62190 18354 10693
12957 10693 -55195 -70894 -85266 -66014 -3832 -50337 -80571 -39379 -42923 -36629 15270 59223
12945 59223 31693 58445 45807 -944 10430 84523 132572 138540 103465 111574 54794 66180
12933 66180 68262 45238 71203 64051 -41992 -62092 -18306 16611 -27506 -13007 11960 52960
12921 52960 27119 16661 41235 84574 94566 107852 129736 142144 102294 99715 22080 1162
12909 1162 -10905 -829 14673 10056 -9783 -55396 -109720 -119084 -34636 -35194 -78755 -58711 -42306
12896 -42306 -111395 -126401 -113990 -113701 -75562 -51399 -1619 -29907 -59715 -114256 -97975 -52894
$$ packed form
12981e5176K3623o083O592k685k0350j1685J2346N0941N3177j5573n1543j5927
12969c2343J5257m1336j3418J2962J789K4643M7321K2637O895J7783m3836p661
12957A0693o5888j5699j4372J9252O2182m6505l0234M1192l544O294N1899M3953
12945E9223k7530K6752j2638m6751J1374P4093M8049N968l5075Q109n6780J1386
12933F6180K082k3024K5965p152j06043k0100M3786L4917m4117J4499K4967M1000
12921E2960k5841j0458K4574M3339R992J3286K1884J2408l9850k579p7635k0918
12909A162j2067J0076J5502m617j9839m5613n4324r364Q4448n58m3561K0044J6405
12896d2306o9089j5006J2411K89L8139K4163M9780k8288k9808n4541J6281M5081
$$ plain form
12884 -52894 -42712 -65423 -53122 -56326 20419 37101 30935 57303 48115 66464 27630 -50726
12872 -50726 -17489 -30654 -89022 -88747 -52855 -28521 -11634 -34966 -63959 -133172 -165585 -146686
12860 -146686 -67175 -36598 15340 60290 24085 -1497 -26746 -56317 -41178 -59018 -104372
12849 -104372 -136574 -114594 -98435 -25004 14445 -55303 -111442 -146644 -105297 -46112 -12855
12838 -12855 24828 -19242 -38906 -13407 -22947 -30017 -15141 -42822 -73421 -59477 13431 70767
12826 70767 53245 63235 67794 54961 3128 -21209 5154 61643 14168 -39329 -56504 -6802
12814 -6802 27567 8779 -29799 -24153 27368 126162 70409 -4171 10341 -27855 -46089 -61691
12802 -61691 -34136 20873 71993 44594 58913 65553 7035 21765 33123 53169 -9672 -25265
$$ packed form
12884e2894J0182k2711J2301l204P6745J6682o166K6368r188J8349l8834p8356
12872e0726L3237j3165n8368K75L5892K4334J6887k3332k8993o9213l2413J8899
12860a46686P9511L0577N1938M4950l6205k5582k5249k9571J5139j7840m5354
12849a04372l2202K1980J6159P3431L9449o9748n6139l5202M1347N9185L3257
12838a2855L7683m4070j9664K5499r540p070J4876k7681l0599J3944P2908N7336
12826G0767j7522R990M559j2833n1833k4337K6363N6489m7475n3497j7175M9702
12814f802L4369j8788l8578N646N1521R8794n5753p4580J4512l8196j8234j5602
12802f1691K7555N5009N1120k7399J4319O640n8518J4730J1358K0046o2841j5593
$$ plain form
12790 -25265 -12356 -14672 24097 12056 12346 9293 -9390 5282 -22094 12687 24819 10767
12778 10767 -38303 -50839 -67179 -132795 -135751 -119588 -106151 -94754 -59571 -53108 -38741 -55416
12766 -55416 -24701 24801 46646 53851 79295 80856 43811 1598 39464 34959 111367 74484
12754 74484 20441 32359 50403 18722 18319 15788 34822 17219 23660 65127 91920 54749
12742 54749 19499 -13824 -11309 -197 -79249 -28027 -5348 14437 -21388 -51549 -76034 -100546
12730 -100546 -68831 -48513 27991 53767 59104 94775 85349 21732 -27988 -2410 44099 77477
12718 77477 87150 23429 8527 16472 -21617 22848 106338 147241 186813 205863 182737 183302
12706 183302 158528 169281 188819 208684 174715 186766 117331 41427 50683 130678 176015 157877
$$ packed form
12790b5265J2909k316L8769j2041K90l053j8683J4672k7376L4781J2132j4052
12778A0767m9070j2536j6340o5616k956J6163J3437J1397L5183O463J4367j6675
12766e5416L0715M9502K1845P205K5444J561l7045m2213L7866m505P6408l6883
12754G4484n4043J1918J8044l1681m03k531J9034j7603O441M1467K6793l7171
12742E4749l5250l3323K515J1112p9052N1222K2679J9785l5825l0161k4485k4512
12730a00546L1715K0318P6504K5776N337L5671r426o3617m9720K5578M6509L3378
12718G7477R673o3721j4902P945l8089M4465Q3490M0903L9572J9050k3126N65
12706A83302k4774J0753J9538J9865l3969J2051o9435p5904R256P9995M5337j8138
$$ plain form
12694 157877 130647 98564 61360 62834 55587 44479 17055 35058 37055 19995 17527 64415
12682 64415 81517 61830 55602 70908 49279 46182 70875 57365 -16256 -28051 -37826 -84401
12670 -84401 -72618 -16495 13443 58222 16260 -13097 19096 -53453 -76813 -25300 -18620 47544
12658 47544 88821 62720 -12218 -65088 -100809 -52304 -45955 -26254 1653 51092 93745 101924
12646 101924 133965 136279 89626 43399 68665 95506 84832 78181 80819 72598 41327 25103
12634 25103 66665 58079 9499 -14065 10020 28791 56906 84277 96074 62787 42248 75416
12622 75416 44512 34091 49823 53810 7977 -79284 -46947 26549 -22871 -105421 -61207 -38153
12610 -38153 27719 92024 110172 142269 116180 115756 68173 21687 23675 9393 45464 21593
$$ packed form
12694A57877k7230l2083l7204J474p247j1108k7424J8003J997j7060k468M6888
12682F4415J7102j9687o228J5306k1629l097K4693j3510p3621j1795r775m6575
12670h4401J1783N6123K9938M4779m1962k9357L2193p2549k3360N1513O680O6164
12658D7544M1277k6101p4938n2870l5721M8505O349J9701K7907M9439M2653Q179
12646A01924L2041K314m6653m6227K5266K6841j0674o651K638q221l1271j6224
12634B5103M1562q586m8580k3564K4085J8771K8115K7371J1797l3287k0539L3168
12622G5416l0904j0421J5732L987m5833q7261L2337P3496m9420q2550M4214K3054
12610c8153O5872O4305J8148L2097k6089m24m7583m6486J988j4282L6071k3871
$$ plain form
12598 21593 22789 47680 42088 21511 31283 56287 -146 11940 25472 29397 35525 22944 65294
12585 65294 131770 129739 112867 33664 -24621 -23997 23519 20362 53610 36071 2537 -38249
12573 -38249 -13422 -64650 -7351 81951 59691 34520 -1585 -2564 33059 37294 53828 70049
12561 70049 76959 58412 -8164 -87006 -33411 -6084 36749 50141 84763 62573 33557 -34207
12549 -34207 -109248 -86007 -19025 54166 78681 53908 79090 60580 14322 85088 141101 142660
12537 142660 131979 92897 64458 106681 100706 76916 77580 57011 2044 22927 53182 67300
12525 67300 87219 63840 40491 36613 37175 52453 65266 46650 55802 56523 20029 -41158 -44052
12512 -44052 -30438 -6306 -15010 -58776 -5457 17400 -19032 -1426 84305 108751 88244 84569
$$ packed form
12598B1593J196K4891n592k0577R772K5004n6433J2086J3532L925O128j2581M2350
12585F5294O6476k031j6872p9203n8285O24M7516l157L3248j7539l3534m0786
12573c8249K4827n1228N7299Q9302k2260k5171l6105r79L5623M235J6534J6221
12561G0049O910j8547o6576p8842N3595K7327M2833J3392L4622k2190k9016o7764
12549c4207p5041K3241O6982P3191K4515k4773K5182j8510m6258P0766N6013J559
12537A42660j0681l9082k8439M2223n975k3790O64k0569n4967K0883L0255J4118
12525F7300J9919k3379k3349l878N62J5278J2813j8616R152P21l6494o1187k894
12512d4052J3614K4132q704m3766N3319K2857l6432J7606Q5731K4446k0507l675
$$ plain form
12500 84569 68236 42988 41739 31703 35557 45098 63234 63702 75360 70406 77903 86260 33548
12487 33548 62267 94540 107652 188665 174346 148479 156976 147161 169244 215982 232204 297023
12475 297023 362984 308544 280733 294917 340976 366075 419793 393926 313723 291248 276603
12464 276603 267977 277826 224883 179842 240879 357745 327894 308167 335908 362541 361612 369283
12452 369283 412638 443093 512823 537619 521204 488319 528880 575386 570619 641604 695033 646015
12440 646015 684047 735109 686026 655873 615766 583981 544701 489238 446150 466925 478599
12429 478599 369705 318864 315677 341018 326204 324776 313640 333988 295870 270248 274769 305465
12417 305465 247230 224437 263888 288953 329944 390373 362023 330890 366325 397258 372318
$$ packed form
12500H4569j6333k5248j249j0036L854R541J8136M68J1658m954P497Q357n2712
12487C3548K8719L2273J3112Q1013j4319k5867Q497r815K2083M6738J6222O4819
12475B97023O5961n4440k7811J4184M6059K5099N3718k5867q0203k2475j4645
12464B76603q626R849n2943m5041O1037J16866k9851j9727K7741K6633r29P671
12452C69283M3355L0455O9730K4796j6415l2885M0561M6506m767P0985N3429m9018
12440F46015L8032N1062m9083l0153m0107l1785l9280n5463m3088K0775J1674
12429D78599j08894n0841l187K5341j4814j428j1136K0348l8118k5622M521L0696
12417C05465n8235k2793L9451K5065M0991O0429k8350l1133L5435L0933k4940
$$ plain form
12406 372318 372603 437772 449008 418292 404149 402615 333009 256371 225606 237874 207933 171451
12394 171451 139472 127095 130225 150035 149881 166482 127926 81637 75026 56523 47084 85384
12382 85384 131189 91183 87837 66642 88196 59270 123504 161505 87323 82873 130463 150485
12370 150485 224384 194568 125440 28900 -24341 26576 16600 8355 46452 36036 11918 45521
12358 45521 127181 132773 130838 113420 98338 100276 122003 110754 34158 8238 -7409 -44864
12346 -44864 37512 72531 35592 -8451 -38312 -39077 -19300 -19 -14192 -30130 26233 67728
12334 67728 14989 -54844 -45697 13982 6 9411 -12655 -21791 -38552 -57194 8249 -6474
12322 -6474 36831 78341 97748 12445 -44189 -19050 23771 24319 14703 5236 2821 38254 75914
$$ packed form
12406C72318K85O5169J1236l0716j4143j534o9606p6638l0765J2268k9941l6482
12394A71451l1979j2377L130J9810j54J6601l8556m6289o611j8503r439L8300
12382H5384M5805m0006l346k1195K1554k8926O4234L8001p4182m450M7590K0022
12370A50485P3899k9816o9128r6540n3241N0917r976q245L8097j0416k4118L3603
12358D5521Q1660N592j935j7418j5082J938K1727j1249p6596k5920j5647l7455
12346d4864Q2376L5019l6939m4043k9861p65J9777J9281j4173j5938N6363M1495
12334F7728n2739o9833R147N9679j3976R405k2066r136j6761j8642O5443j4723
12322f474M3305M1510J9407q5303n6634K5139M2821N48r616r467k415L5433L7660
$$ plain form
12309 75914 33568 -27003 -5306 10260 13947 39282 7135 -29292 -41069 -43046 -90592 -53494
12297 -53494 -4054 -35459 -34349 -4315 -8332 -17957 -929 11854 61855 54367 13197 3916 -3792
12284 -3792 -31780 -31773 8533 32426 33297 39703 -22550 -75730 -89168 -34016 -27873 -48339 -91741
12271 -91741 -48289 28641 33942 2142 7658 36392 28845 26561 -14005 -8884 10239 -5637 -48845
12258 -48845 -75672 -19559 82944 85755 24153 42582 83546 82643 40308 1875 21461 7011
12246 7011 44042 69232 47734 16292 -14689 37133 65211 -14409 -31592 -42665 -58255 -74450
12234 -74450 -28471 -47376 -38481 -51467 -46930 -66302 -78624 -93078 -54360 -34469 1512 17132
12222 17132 27830 45917 28313 33472 65283 45497 29092 17340 -55010 -16089 16646 -24198
$$ packed form
12309G5914m2346o0571K1697J5566L687K5335l2147l6427j1777j977m7546L7098
12297e3494M9440l1405J110L0034m017r625J7028J2783N0001p488m1170r281p708
12284c792k7988PM0306K3893Q71O406o2253n3180j3438N5152O143k0466m3402
12271i1741M3452P6930N301l1800N516K8734p547k284m0566N121J9123j5876m3208
12258d8845k6827N6113J02503K811o1602J8429M0964r03m2335l8433J9586j4450
12246G011L7031K5190k1498l1442l0981N1822K8078p9620j7183j1073j5590j6195
12234g4450M5979j8905Q895j2986M537j9372j2322j4454L8718J9891L5981J5620
12222A7132J0698J8087j7604N159L1811j9786j6405j1752p2350L8921L2735m0844
$$ plain form
12210 -24198 -46410 -26416 17279 51967 52771 87921 67387 -23290 -10545 10975 -27949 -42928
12198 -42928 31964 21777 -41580 -50430 15642 14650 44086 74124 79861 89879 68794 30732
12186 30732 -20539 -30978 -448 10487 22782 39170 -22424 -66425 -57221 -33260 -82570 -79729
12174 -79729 -23870 11623 20949 23968 613 -2029 -1719 -47841 -103695 -65893 -48685 -84008 -52291
12161 -52291 -22700 -62442 -93489 -84072 -96269 -27592 11552 78680 42783 49100 57284 38981
12149 38981 -7923 -24011 -1313 -4475 -108960 -141954 -95460 -41136 -70973 -78781 -29453 -44288
12137 -44288 -31140 -25321 -69939 -104461 -51726 -3795 -10162 -30044 -24198 -8038 12877 33000
12125 33000 6123 -688 29956 -36422 25001 45070 76572 39650 -18803 -6314 6147 -5067
$$ packed form
12210b4198k2212J9994M3695L4688Q04L5150k0534r0677J2745K1520l8924j4979
12198d2928P4892j0187o3357q850O6072r92K9436L0038N737J0018k1085l8062
12186C0732n1271j0439L0530J0935J2295J6388o1594m4001R204K3961m9310K841
12174g9729N5859L5493R326L019k3355k642L10m6122n5854L7802J7208l5323L1717
12161e2291K9591l9742l1047R417j2197O8677L9144O7128l5897O317Q184j8303
12149C8981m6904j6088K2698l162j04485l2994M6494N4324k9837p808M9328j4835
12137d4288J3148N819m4618l4522N2735M7931o367j9882N846J6160K0915K0123
12125C3000k6877o811L0644o6378O1423K0069L1502l6922n8453J2489J2461j1214
$$ plain form
12113 -5067 583 263 3559 25703 18125 22857 -17344 -54331 -76113 36368 -5566 -62437 -64774
12100 -64774 -87038 -52227 4395 84219 38539 -5641 -4462 36168 33635 29568 -6048 1375
12088 1375 26451 30868 15867 -20469 -17841 23775 10024 -52026 -54221 1419 26181 -10675
12076 -10675 3347 -19753 -54499 -20461 -23505 -57753 -106888 -1849 94539 85405 61981 -2628
12064 -2628 21030 8249 -9703 -62822 -64432 -516 8599 47822 124295 109943 22364 -1616
12052 -1616 -8034 33709 110700 110946 70361 98930 76946 -42865 -17427 3079 -51849 -47121
12040 -47121 -78909 -128393 -150201 -94900 -106024 -120316 -84722 -53757 -71111 -47887 17412 30816
12028 30816 -12997 -47734 -15276 -10265 -26108 -47018 -38445 -26607 289 -19771 -9566 -29998
$$ packed form
12113e067N650l20L296K2144p578M732m0201l6987k1782J12481m1934n6871k337
12100f4774k2264L4811N6622P9824m5680m4180J179M0630k533m067l5616P423
12088A375K5076M417j5001l6336K628M1616j3751o2050k195N5640K4762l6856
12076a0675J4022k3100l4746L4038l044l4248m9135J05039R6388r134k3424o4609
12064b628K3658j2781j7952n3119j610O3916R115L9223P6473j4352q7579k3980
12052a616o418M1743P6991K46m0585K8569k1984j19811K5438K0506n4928M728
12040d7121l1788m9484k1808N5301j1124j4292L5594L0965j7354K3224O5299J3404
12028C0816m3813l4737L2458N011j5843k0910Q573J1838K6896k0060J0205k0432
$$ plain form
12016 -29998 -16385 -1185 -30997 -24899 26060 11826 -31974 -28981 -33510 -34773 -45064 -38143 -66661
12003 -66661 -61349 -16723 17803 66970 108596 110520 81683 18814 -17904 41599 75741 96202
11991 96202 114345 -22115 -37460 59806 49685 61262 22675 -6111 -19531 -51173 -56310 19171
11979 19171 52756 18827 -25159 5881 48174 3353 -18600 2759 -21005 -65215 -56333 -54762
11967 -54762 -74858 -43373 3119 48126 63931 86111 109286 109711 112136 54546 11811 33299
11955 33299 71044 42920 -40179 -47514 -20622 -42917 -44927 -17960 -48404 -35719 -25465 -6343
11943 -6343 -60009 -87893 -37811 -35217 -29848 -32917 -35172 -68015 -42728 2205 11188 40908 13586
11930 13586 -31430 -52046 -30835 -25447 -11822 -428 -2388 -18503 191 -38632 -71076 -140736
$$ packed form
12016b9998J3613J5200k9812O098N0959j4234m3800K993m529j263j0291O921k8518
12003f6661N312M4626L4526M9167M1626J924k8837o2869l6718N9503L4142K0461
11991I6202J8143j36460j5345R7266j0121J1577l8587k8786j3420l1642n137P5481
11979A9171L3585l3929m3986L1040M2293m4821k1953K1359k3764m4210Q882J571
11967e4762k0096L1485M6492M5007J5805K2180K3175M25K425n7590m2735K1488
11955C3299L7745k8124q3099p335K6892k2295k010K6967l0444J2685J0254J9122
11943f343n3666k7884N0082K594N369l069k255l2843K5287M4933Q983K9720k7322
11930A3586m5016k0616K1211N388J3625J1394j960j6115J8694l8823l2444o9660
$$ plain form
11918 -140736 -138566 -85681 -66954 19829 28538 -19405 -30489 -49508 -45460 3946 47030 32733
11906 32733 -5480 -1054 -45996 -16162 13167 -3057 -23830 -18442 -30334 -7935 -47367 -72842
11894 -72842 -48297 -62135 -104252 -62152 -55449 -86298 -55218 -14489 -8749 24564 44652 13791
11882 13791 -38762 -10407 5003 65773 86069 57582 -12944 -31010 -43645 -61773 -77895 -15648
11870 -15648 26734 51198 14352 1937 -20981 4268 37132 51119 91650 69281 60303 39311
11858 39311 11251 -25502 -63230 -62496 -42432 -7164 -40168 -15072 45520 25654 -5522 -21974
11846 -21974 7714 27043 54790 39564 -18757 -17488 -9462 13567 27217 -38969 -72198 -83637
11834 -83637 -93548 -86914 -80370 -48142 -9521 -24980 -1329 8257 38415 8357 -64167 -136548
$$ packed form
11918a40736K170N2885J8727Q6783Q709m7943j1084j9019M048M9406M3084j4297
11906C2733l8213M426m4942K9834K9329j6224k0773N388j1892K2399l9432k5475
11894g2842K4545j3838m2117M2100O703l0849L1080M0729N740L3313K0088l0861
11882A3791n2553K8355J5410O0770K0296k8487p0526j8066j2635j8128j6122O2247
11870a5648M2382K4464l6846j2415k2918K5249L2864J3987M0531k2369q978k0992
11858C9311k8060l6753l7728P34K0064L5268l3004K5096O0592j9866l1176j6452
11846b1974K9688J9329K7747j5226n8321J269Q026K3029J3650o6186l3229j1439
11834h3637r911O634O544L2228L8621j5459K3651R586L0158l0058p2524p2381
$$ plain form
11822 -136548 -148726 -128526 -88535 20547 103007 67492 64725 75405 -20417 -53619 -9360
11811 -9360 16789 33166 -7370 -48209 -20333 6813 36066 11378 -14363 18720 56557 38521
11799 38521 21477 -55036 -83177 -79873 -87147 -142956 -164032 -135047 -70425 -11385 1284 -30513
11787 -30513 -33188 -39461 -46348 -34896 -68031 -118542 -144389 -83690 -38531 -36784 -17252 -3171
11775 -3171 24037 31497 1660 -15292 -97297 -127678 -127820 -107774 -137891 -176963 -110810 -10516
11763 -10516 17178 241 -9915 -51513 -12477 -11730 -57430 -38101 38367 66204 46861 6058
11751 6058 -6980 28060 -34236 -60777 -42958 -25053 -11381 2894 14913 -30526 -20419 9921
11739 9921 -26913 -20914 -61265 -71070 -23376 -4705 10145 32584 19156 22509 1478 -39616
$$ packed form
11822a36548j2178K0200L9991J09082Q2460l5515k767J0680r5822l3202M4259
11811i360K6149J6377m0536m0839K7876K7146K9253k4688k5741L3083L7837j8036
11799C8521j7044p6513k8141L304p274n5809k1076K8985O4622N9040J2669l1797
11787c0513k675o273o887J1452l3135n0511k5847O0699M5159J747J9532J4081
11775c171K7208P460k9837j6952q2005l0381j42K0046l0117l9072O6153J00294
11763a0516K7694j6937j0156m1598L9036P47m5700J9329P6468K7837j9343m0803
11751F058j3038L5040o2296k6541J7819J7905J3672J4275J2019m5439J0107L0340
11739I921l6834N999m0351r805M7694J8671J4850K2439j3428L353k1031m1094
$$ plain form
11727 -39616 -47808 -20306 -47949 -21834 -25650 -24672 -13672 -23666 12531 20817 47806 82828 81000
11714 81000 87746 59099 24711 25554 30054 -1459 -2873 17056 84468 62060 31687 45179 74752
11701 74752 49854 -7440 24415 38994 2909 24165 47199 141680 124118 85739 75904 89859
11689 89859 77099 44275 74262 9447 -36564 -46866 -65796 -20006 37773 71838 38470 -7079
11677 -7079 -27889 -58103 14923 118078 91731 92906 97502 69818 98324 40075 23590 66978
11665 66978 35996 23507 52457 89912 61766 48750 15109 13831 62334 26635 -6139 -56479
11653 -56479 -37511 15419 37271 37140 19506 -26764 -61026 -438 -4417 16336 22507 -1969
11641 -1969 46889 36507 22748 42220 62751 59723 18536 14451 -4443 11226 54651 68539
$$ packed form
11727c9616q192K7502k7643K6115l816R78J1000r994L6197Q286K6989L5022j828
11714H1000O746k8647l4388Q43M500l1513j414J9929O7412k2408l0373J3492K9573
11701G4752k4898n7294L1855J4579l6085K1256K3034R4481j7562l8379r835J3955
11689H9859j2760l2824K9987o4815m6011j0302j8930M5790N7779L4065l3368m5549
11677g079k0810l0214P3026J03155k6347J175M596k7684K8506n8249j6485M3388
11665F6978l0982j2489K8950L7455k8146j3016l3641j278M8503l5699l2774n0340
11653e6479J8968N2930K1852j31j7634m6270l4262O0588l979K0753O171k4476
11641a969M8858j0382j3759J9472K0531l028m1187m085j8894J5669M3425J3888
$$ plain form
11629 68539 43500 54201 42880 47601 79398 65415 -23600 -64637 -37748 69163 108302 108865
11617 108865 43890 -19772 6504 36614 88768 66519 36822 14633 17808 8662 -48471 -6192
11605 -6192 54409 37098 25342 -24586 -9980 23495 14207 -31874 -7858 25369 2162 48875
11593 48875 105929 118697 53926 7293 14857 22454 93449 119729 97271 84876 79167 55336
11581 55336 25682 -26714 -64440 -46591 -11448 22497 21710 -10876 -14852 -52191 -79170 -24311
11569 -24311 16428 22535 63273 40060 51979 97072 78238 56667 70086 49656 -11139 -69267
11557 -69267 -56102 -27128 13196 -4631 -47851 8699 33707 5169 -38272 -52701 -13251 22765
11545 22765 -17699 -25933 -51921 -51547 -49155 -118168 -148749 -141956 -36644 -42678 -57694 -43567 12735
$$ packed form
11629F8539k5039J0701j1321M721L1797j3983q9015m1037K6889J06911L9139N63
11617A08865o4975o3662K6276L0110N2154k2249k9697k2189L175r146n7133M2279
11605f192O0601j7311j1756m9928J4606L3475r288m6081K4016L3227k3207M6713
11593D8875N7054J2768o4771m6633P564P597P0995K6280k2458j2395n709k3831
11581E5336k9654n2396l7726J7849L5143L3945p87l2586l976l7339k6979N4859
11569b4311M0739O107M0738k3213J1919M5093j8834k1571J3419k0430o0795n8128
11557f9267J3165K8974M0324j7827m3220N6550K5008k8538m3441j4429L9450L6016
11545B2765m0464q234k5988L74K392o9013l0581O793J05312o034j5016J4127N6302
$$ plain form
11532 12735 14983 -1861 -29892 -44693 -110942 -165099 -123611 -128335 -146794 -83979 -4018 -36562
11520 -36562 -65021 -33925 28474 15047 49605 37142 34064 30610 25630 38936 58348 39830
11508 39830 12265 -34736 -70172 -60346 -23597 -2758 -5022 -26428 -51104 -29956 -18079 -55397
11496 -55397 -37922 -12357 -67917 -87704 -26574 -3853 -83437 -8168 48726 38534 -21702 -17286
11484 -17286 -50140 -63215 -103879 -84686 -78552 -16454 -11470 11059 -10696 -32170 -51516 -24684
11472 -24684 32857 11186 9287 16827 -5022 -74008 -52543 -22638 12071 25742 -3616 -20336
11460 -20336 -37623 -6167 50828 75664 95046 117855 108350 133540 202224 284370 315994 255072
11448 255072 252393 172359 140800 128777 88573 49739 9886 -9790 -37942 -27425 32443 35099
$$ packed form
11532A2735K248j6844k8031j4801o6249n4157M1488m724j8459O2815P9961l2544
11520c6562k8459L1096O2399j3427L4558j2463l078l454m980J3306J9412j8518
11508C9830k7565m7001l5436R826L6749K0839k264k1406k4676K1148J1877l7318
11496e5397J7475K5565n5560j9787O1130K2721p9584P5269N6894j0192o0236M416
11484a7286l2854j3075m0664J9193O134O2098M984K2529k1755k1474j9346K6832
11472b4684N7541k1671j899P540k1849o8986K1465K9905L4709J3671k9358j6720
11460b0336j7287L1456N6995K4836J9382K2809r505K5190O8684Q2146L1624o0922
11448B55072k679q0034l1559j2023m0204l8834l9853j9676k8152J0517N9868K656
$$ plain form
11436 35099 -30444 -29718 36273 47152 18546 43935 21466 -8792 -26976 -10630 33803 35322
11424 35322 75761 120738 81376 35811 16066 20688 -12816 13030 14796 5047 18226 -9210
11412 -9210 16985 70409 118464 179394 234705 246654 331340 405912 484621 459254 333601 208992
11400 208992 147696 127773 136910 127841 137835 69708 45003 90762 70823 33396 76373 99844
11388 99844 138300 142023 128327 128747 130723 135557 100586 84679 101221 117869 67141 48432 123777
11375 123777 189383 178266 135289 75266 97545 145330 105846 107311 85714 31014 28487 89949
11363 89949 137207 204723 269030 374087 471697 535320 528134 379020 224436 104363 79361
11352 79361 101034 152226 186895 135207 42456 38050 60047 69268 76376 84354 95096 172969
$$ packed form
11436C5099o5543P26O5991J0879k8606K5389k2469l0258j8184J6346M4433J519
11424C5322M0439M4977l9362m5565j9745M622l3504K5846J766r749J3179k7436
11412i210K6195N3424M8055O0930N5311J1949Q4686P4572P8709k5367j25653j24609
11400B08992o1296j9923R137r069R994o8127k4705M5759j9939l7427M2977K3471
11388I9844L8456L723j3696M20J976M834l4971j5907J6542J6648n0728j8709P5345
11375A23777O5606j1117m2977o0023K2279M7785l9484J465k1597n4700k527O1462
11363H9949M7258O7516O4307J05057R7610O3623p186j49114j54584j20073k5002
11352G9361K1673N1192L4669n1688r2751m406K1997R221P108P978J0742P7873
$$ plain form
11340 172969 258546 330891 425792 555582 744516 1024897 1251291 1388743 1452070 1399306
11330 1399306 1204605 982510 772679 607084 431194 313536 273373 263711 291881 289393
11320 289393 236355 174647 149525 116505 109439 127735 167050 205719 276825 243755 241170 212778
11308 212778 177415 158350 176275 192956 150694 129705 138206 108730 100844 82077 108747 88947
11296 88947 80027 63250 68014 101556 91222 78463 65447 96969 144045 120405 40925 -49309
11284 -49309 -35322 19694 84421 70656 15050 -44098 -83941 -67210 -29509 19024 -11646 -9883
11272 -9883 25318 -47321 -54633 -32339 -77867 -17990 30771 16488 32762 68954 68116 32153
11260 32153 27011 42101 77919 90567 80517 55825 -23412 -53953 -18492 -6740 -27618 -43147
$$ packed form
11340A72969Q5577P2345R4901J29790J88934K80381K26394J37452O3327n2764
11330A399306j94701k22095k09831j65595j75890j17658m0163r662K8170k488
11320B89393n3038o1708k5122l3020p066J8296L9315L8669P1106l3070k585k8392
11308B12778l5363j9065J7925J6681m2262k0989Q501k9476p886j8767K6670j9800
11296H8947q920j6777M764L3542j0334j2759j3016L1522M7076k3640p9480r0234
11284d9309J3987N5016O4727j3765n5606n9148l9843J6731L7701M8533l0670J763
11272i883L5201p2639p312K2294m5528N9877M8761j4283J6274L6192q38l5963
11260C2153n142J5090L5818J2648j0050k4692p9237l0541L5461J1752k0878j5529
$$ plain form
11248 -43147 -10463 8154 20159 83143 99084 80649 75722 49954 41237 87897 73976 29937
11236 29937 24384 28958 27918 32271 105039 33646 -21939 -19472 -31411 -23008 39609 25566 10349
11223 10349 39470 38331 49049 63576 48033 10182 -46539 -39696 16207 17483 10253 14277 -37023
11210 -37023 -76528 -47383 34045 16551 45318 27398 70085 73375 38612 8630 -2451 -33899
11198 -33899 -10599 38691 30489 -41047 -51959 -42965 1810 12091 16052 43200 52308 16195
11186 16195 372 -1972 1174 91056 193706 190774 159342 160055 147880 119222 55579 -5819
11174 -5819 -16841 54584 155826 122281 72449 35367 27117 -3224 60100 137864 162042 138316
11162 138316 120411 90679 43620 69186 127963 95822 32304 66572 74180 81860 103548 92669
$$ packed form
11248d3147L2684J8617J2005O2984J5941j8435m927k5768q717M6660j3921m4039
11236B9937n553M574j040M353P2768p1393n5585K467j1939Q403O2617j4043j5217
11223A0349K9121j139J0718J4527j5543l7851n6721O843N5903J276p230M024n1300
11210c7023l9505K9145Q1428j7494K8767j7920M2687L290l4763k9982j1081l1448
11198c3899K3300M9290q202p1536j0912Q994M4775J0281L961K7148R108l6113
11186A6195j5823k344L146Q9882J02650k932l1432P13j2175k8658o3643o1398
11174e819j1022P1425J01242l3545m9832l7082q250l0341O3324P7764K4178k3726
11162A38316j7905k9732m7059K5566N8777l2141o3518L4268P608P680K1688j0879
$$ plain form
11150 92669 4144 -28175 21944 67803 14323 -12468 -22507 34049 107649 100685 64456 52044
11138 52044 27501 -5530 20792 42803 40833 35385 47709 6761 20659 15847 16001 83720 125032
11125 125032 102084 82329 55364 29251 24605 65091 9686 -31873 -696 -8527 -49168 -18315
11113 -18315 -50175 -50936 -74132 -50935 -44189 -14504 23026 32404 5058 6357 -4586 10845 38887
11100 38887 98442 106399 113392 73303 108462 116244 105080 114041 89910 53167 69994 19918
11088 19918 5992 -16205 32685 104474 130604 79531 55456 39729 24515 2325 5402 -37516
11076 -37516 -26660 10401 14220 -22990 39408 75078 82429 63256 93958 96240 82646 71176
11064 71176 44270 87328 94912 118846 44752 33839 51371 103020 58969 58994 123410 192802
$$ packed form
11150I2669q8525l2319N0119M5859n3480k6791j0039N6556P3600o964l6229j2412
11138E2044k4543l3031K6322K2011j970n448J2324m0948J3898m812J54O7719M1312
11125A25032k2948j9755k6965k6113m646M0486n5405m1559L1177p831m0641L0853
11113a8315l1860p61k3196K3197O746K9685L7530R378k7346J299j0943J5431K8042
11100C8887N9555P957O993m0089L5159P782j1164Q961k4131l6743J6827n0076
11088A9918j3926k2197M8890P1789K6130n1073k4075j5727j5214k2190L077m2918
11076c7516J0856L7061L819l7210O2398L5670P351j9173L0702K282j3594j1470
11064G1176k6906M3058P584K3934p4094j0913J7532N1649m4051K5O4416O9392
$$ plain form
11052 192802 213143 222575 270636 225197 166854 156300 116611 127442 102754 158455 70756 -17019
11040 -17019 -4269 26516 24176 95956 114148 75836 52293 70819 119601 138820 105613 50801
11028 50801 80915 165390 179560 179967 147244 128908 147984 231182 249964 266402 278558 275017
11016 275017 292947 228393 211010 239878 246405 232004 282010 393694 489546 588252 822930
11005 822930 1211588 1629764 2062140 2406890 2506293 2008841 1392838 982696 733377 669661
10995 669661 609788 621245 628219 655048 647176 588795 605503 595164 538201 588530 594004 581917
10983 581917 545985 515141 442023 411832 406003 516334 602909 559328 578245 592691 600131 655608
10971 655608 713316 767875 841531 898468 932978 950868 1051853 1192528 1246795 1224778 1248863
$$ packed form
11052A92802K0341R432M8061m5439n8343j0554l9689J0831k4688N5701q7699q7775
11040a7019J2750L0785k340P1780J8192l8312k3543J8526M8782J9219l3207n4812
11028E0801L0114Q4475J4170M07l2723j8336J9076Q3198J8782J6438J2156l541
11016B75017J7930o4554j7383K8868O527j4401N0006J11684R5852R8706K34678
11005H22930L88658M18176M32376L44750R9403m97452o16003m10142k49319o3716
10995F69661n9873J1457O974K6829p872n8381J6708j0339n6963N0329N474j2087
10983E81917l5932l0844p3118l0191n829J10331Q6575m3581J8917J4446P440N5477
10971F55608N7708N4559P3656N6937L4510J7890J00985J40675N4267k2017K4085
$$ plain form
10960 1248863 1217355 1170521 1160356 1248516 1335811 1411454 1611380 1801750 2112787 2513010
10950 2513010 3015322 3483061 4009862 4471561 4857293 5077463 5191774 5373192 5575152
10941 5575152 5878914 6433893 7310619 8427814 9879526 11847488 14548440 18412186 24102276
10932 24102276 32891671 46627755 67293759 96322960 133459227 176227610 220829209
10925 220829209 257808472 277037769 273910966 237595816 188509651 140584007 101510328
10918 101510328 75994222 60154653 50026852 43073928 37909489 33844872 30590142
10911 30590142 27970971 25728931 23896742 22403708 21175235 20207296 19413637 18727757
10903 18727757 18233696 17798016 17409297 17047123 16534674 15912600 15297924 14691113 14189155
$$ packed form
10960A248863l1508m6834j0165Q8160Q7295P5643J99926J90370L11037M00223
10950B513010N02312M67739N26801M61699L85732K20170J14311J81418K01960
10941E575152L03762N54979Q76726J117195J451712J967962K700952L863746N690090
10932B4102276Q789395J3736084K0666004K9029201L7136267M2768383M4601599
10925B20829209L6979263J9229297l126803l6315150m9086165m7925644l9073679
10918A01510328k5516106j5839569j0127801o952924n164439m064617l254730
10911C0590142k619171k242040j832189j493034j228473r67939p93659o85880
10903A8727757m94061m35680l88719l62174n12449o22074o14676o06811n01958
$$ plain form
10894 14189155 13744404 13335757 12853749 12353347 11855921 11342539 10864424 10415447 10000287
10885 10000287 9564665 9153393 8851631 8570542 8312304 8068194 7856038 7669922 7434225
10876 7434225 7198392 7026819 6891727 6672863 6501223 6370683 6138645 5898166 5718040
10867 5718040 5597593 5372532 5187649 5100634 5014678 4858544 4706704 4554024 4425119 4303706
10857 4303706 4159963 4057611 4015227 3908535 3872525 3828101 3685318 3558051 3501591 3430338
10847 3430338 3343116 3313814 3261685 3157284 3136503 3040675 2946819 2855450 2752902 2699962 2579137
10836 2579137 2509589 2507908 2466782 2435607 2362545 2295011 2254052 2211760 2142292 2137055 2089068 2018781
10824 2018781 2015015 2006629 1981747 1921146 1830653 1773511 1695421 1645824 1617893 1619961 1619270 1579691
$$ packed form
10894A4189155m44751m08647m82008n00402m97426n13382m78115m48977m15160
10885A0000287m35622m11272l01762k81089k58238k44110k12156j86116k35697
10876G434225k35833j71573j35092k18864j71640j30540k32038k40479j80126
10867E718040j20447k25061j84883q7015q5956j56134j51840j52680j28905j21413
10857D303706j43743j02352m2384j06692l6010m4424j42783j27267n6460p1253
10847C430338q7222k9302n2129j04401k0781r5828r3856r1369j02548n2940j20825
10836B579137o9548j681m1126l1175p3062o7534m0959m2292o9468n237m7987p0287
10824B018781l766q386k4882o0601r0493n7142p8090m9597k7931K068o91l9579
$$ plain form
10812 1579691 1540508 1485298 1442993 1439434 1407401 1391543 1328538 1339434 1351393 1316793 1267662
10801 1267662 1175582 1106364 1146961 1199156 1188482 1152731 1106473 990160 924358 953972 1000327
10790 1000327 992065 952271 915535 913326 939710 904605 894695 882457 902216 883309 829755 816242
10778 816242 807179 766789 790565 753254 747931 713392 709189 728853 699485 717475 677893 682355
10766 682355 739767 712971 775863 801164 784018 719248 706928 650755 680066 681948 681856 707219
10754 707219 657703 611269 531322 417160 446355 529740 509192 412727 362481 293861 258010
10743 258010 291666 390604 415198 432824 432701 494044 504714 453184 403188 393103 395656 383816
10731 383816 324707 230875 213987 200148 146468 149688 164712 208231 292788 276290 285052 243491
$$ packed form
10812A579691l9183n5210m2305l559l2033j5858o3005J0896J1959l4600m9131
10801A267662r2080o9218M0597N2195j0674l5751m6258j16313o5802K9614M6355
10790A000327q262l9794l6736k209K6384l5105r910j2238J9759j8907n3554j3513
10778H16242r063m0390K3776l7311n323l4539m203J9664k9368J7990l9582M462
10766F82355N7412k6796O2892K5301j7146o4770j2320n6173K9311J882r2K5363
10754G07219m9516m6434p9947j14162K9195Q3385k0548r6465n0246o8620l5851
10743B58010L3656R8938K4594J7626j23O1343J0670n1530m9996j0085K553j1840
10731C83816n9109r3832j6888j3839n3680L220J5024M3519Q4557j6498Q762m1561
$$ plain form
10719 243491 269693 264557 278205 259755 186779 190518 198275 196430 221586 300683 305427 318868
10707 318868 270252 242808 234398 258109 276426 277187 285314 203289 145679 115268 152861 167568
10695 167568 194485 128778 148457 112530 96716 148422 115974 68792 60617 104768 102752 132632
10683 132632 164494 191520 193355 213011 185946 240864 235803 165943 131370 165572 152192 190801
10671 190801 265220 232749 164059 192870 180338 183142 178884 174442 117601 111315 134527 167035
10659 167035 177454 119232 106511 114088 68167 32327 36738 94428 79294 96893 114271 84050
10647 84050 112489 66715 73005 154137 143336 85908 66071 53964 -11512 -5263 36183 1748
10635 1748 5677 -16568 9326 89561 142839 114791 118502 68378 25291 1072 -19734 -66067
$$ packed form
10719B43491K6202n136J3648j8450p2976L739P757j845K5156P9097M744J3441
10707C18868m8616k7444q410K3711J8317P61Q127q2025n7610l0411L7593J4707
10695A67568K6917o5707J9679l5927j5814N1706l2448m7182q175M4151k016K9880
10683A32632L1862K7026J835J9656k7065N4918n061o9860l4573L4202j3380L8609
10671A90801P4419l2471o8690K8811j2532K804m258m442n6841o286K3212L2508
10659A67035J0419n8222j2721P577m5921l5840M411N7690j5134J7599J7378l0221
10647H4050K8439m5774O290Q1132j0801n7428j9837j2107o5476O249M1446l4435
10635A748L929k2245K5894Q0235N3278k8048L711n0124m3087k4219k0806m6333
$$ plain form
10623 -66067 -67376 -30336 22478 57355 111643 63754 68688 116452 92732 67838 43966 26653
10611 26653 94241 106369 89210 130079 144008 178240 183750 170352 134688 104557 72750 77220
10599 77220 65812 -4990 -53135 -54512 35315 87437 131923 120354 98611 89999 100949 52743
10587 52743 66665 64051 -19933 -1994 92805 176109 163968 127830 190498 177545 114344 98572
10575 98572 47503 71288 55233 -33799 -32583 39118 102758 111919 117115 70080 85920 140950
10563 140950 153483 47892 20073 34550 58195 101134 94172 128702 135832 91806 15107 88045
10551 88045 50929 33118 69219 125696 125729 92147 54478 17467 81425 124288 114976 97074
10539 97074 143255 159322 118844 133033 101453 83823 14684 22931 16440 40836 118878 161821
$$ packed form
10623f6067j309L7040N2814L4877N4288m7889M934M7764k3720k4894k3872j7313
10611B6653O7588J2128j7159M0869J3929L4232N510j3398l5664l0131l1807M470
10599G7220j1408p0802m8145j377Q9827N2122M4486j1569k1743q612J0950m8206
10587E2743J3922k614q3984J7939R4799Q3304j2141l6138O2668j2953o3201j5772
10575I8572n1069K3785j6055q9032J216P1701O3640R161N196m7035J5840N5030
10563A40950J2533j05591k7819J4477K3645M2939o962L4530P130m4026p6699P2938
10551H8045l7116j7811L6101N6477L3l3582l7669l7011O3958M2863r312j7902
10539I7074M6181J6067m0478J4189l1580j7630o9139Q247o491K4396P8042M2943
$$ plain form
10527 161821 131650 120357 116678 196606 250539 169452 164796 243643 289086 312125 395211 490702
10515 490702 635965 800390 997025 1243565 1415443 1540943 1523444 1324446 1040098 747131
10505 747131 570900 492709 424177 324453 241422 256457 309780 305317 258903 304154 262005
10494 262005 202107 136854 143445 175724 143068 88122 41837 118335 166885 191345 182904 191139
10482 191139 143340 167870 172131 85544 28753 8060 12123 20198 48787 52918 58355 61688 42287
10469 42287 58933 38207 7323 16590 -46765 -58957 -16250 5621 -4296 31186 43436 21886
10457 21886 52799 97701 97399 112728 91985 31400 7306 26465 8784 30235 73489 93089
10445 93089 92727 36145 -7002 -69761 -38237 56366 95770 52965 57673 67773 31086 -50446
$$ packed form
10527A61821l0171j1293l679P9928N3933q1087m656P8847M5443K3039Q3086R5491
10515D90702J45263J64425J96635K46540J71878J25500j7499j98998k84348k92967
10505G47131j76231p8191o8532r9724q3031J5035N3323m463m6414M5251m2149
10494B62005n9898o5253O591L2279l2656n4946m6285P6498M8550K4460q441Q235
10482A91139m7799K4530M261q6587n6791k0693M063Q075K8589M131N437L333j9401
10469D2287J6646k0726l0884R267o3355j2192M2707K1871r917L5482J2250k1550
10457B1886L0913M4902l02J5329k0743o0585k4094J9159j7681K1451M3254J9600
10445I3089l62n6582m3147o2759L1524R4603L9404m2805M708J0100l6687q1532
$$ plain form
10433 -50446 -8227 9527 14831 21798 33944 70138 85804 72858 72088 74109 95010 162101 146708
10420 146708 121940 131724 141252 55976 27778 -11155 -45133 -20351 54074 39725 17861 3295
10408 3295 11958 55336 75351 96425 60735 46682 88873 87822 84575 41896 21855 13811 -4481
10395 -4481 -11899 26264 30350 52181 111558 135188 98676 59527 62777 30595 10003 18226 9097
10382 9097 31943 22681 4658 20163 67779 63482 82078 123307 101050 83803 90230 63433
10370 63433 83565 73690 69988 54259 29338 33393 50415 45339 28688 6834 -52 43084 44037
10357 44037 44041 45677 45522 46041 52524 77038 62925 61756 64593 81676 43842 -47872 -91419 -37423
10343 -37423 -5063 69893 103654 37145 39119 80883 100996 81020 52527 10878 20684 25113
$$ packed form
10433e0446M2219J7754N304O967J2146L6194J5666j2946p70K021K0901O7091j5393
10420A46708k4768R784R528q5276k8198l8933l3978K4782P4425j4349k1864j4566
10408C295Q663M3378K0015K1074l5690j4053M2191j051l247m2679k0041q044j8292
10395d481p418L8163M086K1831N9377K3630l6512l9149L250l2182k0592Q223r129
10382I097K2846r262j8023J5505M7616m297J8596M1229k2257j7247O427k6797
10370F3433K0132r875l702j5729k4921M055J7022n076j6651k1854o886M3136R53
10357D4037MJ636j55N19O483K4514j4113j169K837J7083l7834r1714m3547N3996
10343c7423L2360P4956L3761o6509J974M1764K0113j9976k8493m1649R806M429
$$ plain form
10331 25113 13569 61762 70946 85705 87886 101513 118170 96212 26260 -32504 -14716 -9411
10319 -9411 19165 109477 119226 32871 -35780 -30342 23152 71429 49972 31824 23058 6566
10307 6566 27175 80495 165653 192920 277295 372646 426219 449802 371866 318925 315274 253225
10295 253225 131934 44628 43492 48758 54399 93823 157475 101534 44401 -9217 -16552 -27793
10283 -27793 64530 107813 79955 107450 129211 168648 133143 145660 164651 96603 120556 136197
10271 136197 161584 108803 87752 29448 -5868 26341 71358 74810 77074 97475 75562 61182
10259 61182 135203 149667 64870 9606 -14071 -12668 -7356 10361 43537 61464 38706 -24193
10247 -24193 -1561 41385 33620 77972 109020 64744 49954 77636 66019 -9457 -39746 -18290
$$ packed form
10331B5113j1544M8193R184J4759K181J3627J6657k1958o9952n8764J7788N305
10319i411K8576R0312R749q6355o8651N438N3494M8277k1457j8148q766j6492
10307F566K0609N3320Q5158K7267Q4375R5351N3573K3583p7936n2941l651o2049
10295B53225j21291q7306j136N266N641L9424O3652n5941n7133n3618p335j1241
10283b7793R2323M3283k7858K7495K1761L9437l5505J2517J8991o8048K3953J5641
10271A36197K5387n2781k1051n8304l5316L2209M5017L452K264K0401k1913j4380
10259F1182P4021J4464q4797n5264k3677J403N312J7717L3176J7927k2758o2899
10247b4193K2632M2946p765M4352L1048m4276j4790K7682j1617p5476l0289K1456
$$ plain form
10235 -18290 67798 80738 54480 37102 56438 81686 115785 135506 212469 213485 146531 112260
10223 112260 76246 72716 102801 165121 153171 80407 1003 17088 48752 122694 155765 262725
10211 262725 334824 367546 402679 487856 499264 456649 413841 426463 431754 346083 321598 339296
10199 339296 289666 259542 204705 96048 64012 96274 63817 40523 63179 135460 141748
10188 141748 107018 167428 213126 166047 130166 90802 130897 132932 99304 59760 34170 49797
10176 49797 13372 11602 120339 166905 110433 60867 59105 48072 88899 105892 89957 86560
10164 86560 134033 108676 111992 103374 47382 21270 41797 71446 78663 100300 154862 133082
10152 133082 116200 179400 207843 151663 128420 139580 130518 160510 252769 261161 208862 79894
$$ packed form
10235a8290Q6088J2940k6258j7378J9336K5248L4099J9721P6963J016o6954l4271
10223A12260l6014l530L0085O2320j1950p2764p9404J6085L1664P3942L3071J06960
10211B62725P2099L2722L5133Q5177J1408m2615m2808J2622N291q5671k4485J7698
10199C39296m9630l0124n4837j08657l2036L2262l2457k3294K2656P2281O288
10188A41748l4730O0410M5698m7079l5881l9364M0095K035l3628l9544k5590J5627
10176D9797l6425j770J08737M6566n6472m9566j762j1033M0827J6993j5935l397
10164H6560M7473k5357L316q618n5992k6112K0527K9649P217K1637N4562k1780
10152A33082j6882O3200K8443n6180k3243J1160r062K9992R2259Q392n2299j28968
$$ plain form
10140 79894 -23601 9200 7416 -1224 20042 90173 80754 38756 71051 119732 159220 172030
10128 172030 168543 192336 164729 115371 82527 77315 97117 186425 239819 239201 168133 157966
10116 157966 185401 200327 236926 214720 228104 222145 177946 150606 94300 143115 190520 225403
10104 225403 276107 269758 244199 251638 279475 337866 432743 405799 420342 447528 437781 444590
10092 444590 449848 451091 458468 483766 495052 508327 499323 553345 554734 606765 631875 687268
10080 687268 770573 742753 718530 742454 845894 927161 1014931 1105311 1112200 1139635 1183342
10069 1183342 1178000 1268231 1394652 1502183 1579583 1673832 1780790 1888557 2007330 2118506
10059 2118506 2282645 2492099 2594931 2731523 2868667 2987813 3072385 3215307 3378344 3491874
$$ packed form
10140G9894j03495L2801j784q640K1266P0131r419m1998L2295M8681L9488J2810
10128A72030l487K3793k7607m9358l2844n212J9802Q9308N3394o18p1068j0167
10116A57966K7435J4926L6599k2206J3384n959m4199k7340n6306M8815M7405L4883
10104B25403N0704o349k5559P439K7837N8391R4877k6944J4543K7186r747O809
10092D44590N258J243P377K5298J1286J3275r004N4022J389N2031K5110N5393
10080F87268Q3305k7820k4223K3924J03440Q1267Q7770R0380O889K7435M3707
10069A183342n342R0231J26421J07531P7400R4249J06958J07767J18773J11176
10059B118506J64139K09454J02832J36592J37144J19146Q4572J42922J63037J13530
$$ plain form
10049 3491874 3646666 3815982 4009823 4162500 4288190 4411936 4524519 4667374 4889341
10040 4889341 5073188 5233568 5373255 5481558 5667038 5834827 5963237 6116376 6240117
10031 6240117 6432355 6733433 6944607 7148625 7422377 7657766 7860043 8033186 8216199
10022 8216199 8431565 8640794 8831414 8967274 9194833 9401433 9646110 9796992 9880182 9982752
10012 9982752 10102139 10254541 10384190 10463015 10519303 10580851 10664189 10714946 10676933 10709169 10708527
10001 10708527 10694022 10709879 10632616 10590558 10518158 10528641 10526512 10515783 10503609 10461461 10326791
9990 10326791 10205441 10203918 10153162 10046151 9989162 9965789 9968522 10026130 10176006 10278928 10270517
9979 10270517 10172568 9945581 9601254 9315271 9081949 8925873 8805302 8678192 8596374 8467866
$$ packed form
10049C491874J54792J69316J93841J52677J25690J23746J12583J42855K21967
10040D889341J83847J60380J39687J08303J85480J67789J28410J53139J23741
10031F240117J92238L01078K11174K04018K73752K35389K02277J73143J83013
10022H216199K15366K09229J90620J35860K27559K06600K44677J50882Q3190J02570
10012I982752J19387J52402J29649P8825N6288O1548Q3338N0757l8013L2236o42
10001A0708527j4505J5857p7263m2058p2400J0483k129j0729j2174m2148j34670
9990A0326791j21350j523n0756j07011n6989k3373K733N7608J49876J02922q411
9979A0270517r7949k26987l44327k85983k33322j56076j20571j27110q1818j28508
$$ plain form
9969 8467866 8323692 8137604 7981520 7843772 7763260 7673716 7489907 7312962 7139358 7040143
9959 7040143 6882114 6706839 6570654 6439375 6266615 6122087 6019428 5891331 5800738 5720563
9949 5720563 5589426 5461298 5304887 5231039 5106342 4998129 4876240 4783638 4692465 4541047
9939 4541047 4525300 4512036 4375529 4273211 4181336 4066378 4009205 3947207 3847802 3723826 3687123
9928 3687123 3603760 3570324 3510296 3393088 3318778 3243623 3195615 3163566 3083667 2979650 2938449
9917 2938449 2958014 2970677 2885561 2837441 2830845 2780997 2701568 2643082 2618302 2568124 2502420 2453399
9905 2453399 2401185 2392989 2301843 2254873 2233184 2219170 2134738 2074780 2060443 2053310 2049129 2020118
9893 2020118 1989736 1960398 1948682 1895661 1860997 1841975 1833310 1809401 1765119 1723188 1689807 1639494
$$ packed form
9969H467866j44174j86088j56084j37748q0512q9544j83809j76945j73604r9215
9959G040143j58029j75275j36185j31279j72760j44528j02659j28097r0593q0175
9949E720563j31137j28128j56411p3848j24697j08213j21889r2602r1173j51418
9939D541047j5747j3264j36507j02318r1875j14958n7173o1998r9405j23976l6703
9928C687123q3363l3436o0028j17208p4310p5155m8008l2049p9899j04017m1201
9917B938449J9565J2663q5116m8120o596m9848p9429n8486k4780n0178o5704m9021
9905B453399n2214q196r1146m6970k1689j4014q4432n9958j4337p133m181k9011
9893B020118l0382k9338j1716n3021l4664j9022q665k3909m4282m1931l3381n0313
$$ plain form
9881 1639494 1557177 1519939 1561703 1580408 1525877 1438580 1402327 1452369 1429792 1453767 1449129 1401600
9869 1401600 1353630 1290251 1292603 1217874 1181606 1166515 1210814 1191719 1132170 1112299 1142810 1179786
9857 1179786 1195025 1179726 1180054 1128129 1113943 1086317 1066212 1019481 980332 988710 1011406 947828
9845 947828 899322 930025 894930 835544 832831 844206 806588 825282 822898 810099 744066 732452
9833 732452 742681 717295 665912 606747 557238 568038 635530 614591 598793 612729 596425 548407
9821 548407 553107 554990 572342 594012 572614 577465 572950 515688 471113 500393 551875 554289 543743
9808 543743 560321 568159 570310 543774 402548 357960 405930 469897 471696 471677 547718 605599 524605
9795 524605 455530 473194 465713 507811 473084 402380 380047 392150 415060 482986 547651 570045
$$ packed form
9881A639494q2317l7238M1764J8705n4531q7297l6253N0042k2577K3975m638m7529
9869A401600m7970o3379K352p4729l6268j5091M4299j9095n9549j9871L0511L6976
9857A179786J5239j5299L28n1925j4186k7626k0105m6731l9149Q378K2696o3578
9845I47828m8506L0703l5095n9386k713J1375l7618J8694k384j2799o6033j1614
9833G32452J0229k5386n1383n9165m9509J0800O7492k0939j5798J3936j6304m8018
9821E48407M700J883J7352K1670k1398M851m515n7262m4575K9280N1482K414j0546
9808E43743J6578P838K151k6536j41226m4588M7970O3967J799j9P6041N7881q0994
9795E24605o9075J7664p481M2098l4727p0704k2333J2103K2910O7926O4665K2394
$$ plain form
9783 570045 559775 536194 475640 417572 482312 473379 432739 386125 360515 399724 496641 502207
9771 502207 451360 380158 396771 426369 388964 377613 419697 340671 338973 372337 408927 482369
9759 482369 513479 532048 514327 527389 452951 414155 409898 359280 349772 330191 331088 282538
9747 282538 301601 345210 342270 293988 333769 294326 216670 184470 222409 279240 310981 342522
9735 342522 326153 324454 315612 349647 312901 253868 242785 236912 245567 240841 293082 325241 258503
9722 258503 227545 172926 138956 143494 126572 138206 129148 184711 187378 155876 184550 212843
9710 212843 214120 137799 143638 141649 174006 180053 218901 221962 244647 211100 204365 182435 132981
9697 132981 115010 170498 201285 176392 200515 191929 176414 149240 99974 141534 171579 168651
$$ packed form
9783E70045j0270k3581o0554n8068O4740q933m0640m6614k5610L9209R6917N566
9771E02207n0847p1202J6613K9598l7405j1351M2084p9026j698L3364L6590P3442
9759D82369L1110J8569j7721J3062p4438l8796m257n0618r508j9581Q97m8550
9747B82538J9063M3609k940m8282L9781l9443p7656l2200L7939N6831L1741L1541
9735C42522j6369j699q842L4035l6746n9033j1083n873Q655m726N2241L2159o6738
9722B58503l0958n4619l3970M538j6922J1634r058N5563K667l1502K8674K8293
9710B12843J277p6321N839j989L2357O047L8848L061K2685l3547o735k1930m9454
9697A32981j7971N5488L0787k4893K4123q586j5515k7174m9266M1560L0045k928
$$ plain form
9685 168651 143547 156522 191579 197629 193423 194550 170778 110168 88913 117835 178218 191097
9673 191097 208751 173415 108066 78919 156708 258074 212376 133609 127277 146959 114646 19293
9661 19293 -8402 32107 112796 232271 198821 122142 86727 103601 98866 100008 147433 222062
9649 222062 253029 185154 171924 194254 169466 142388 157581 166643 173733 136899 106481 140295
9637 140295 141650 158446 129048 77543 72905 45396 96022 117633 85707 88727 93754 118318
9625 118318 105679 89828 102436 148258 139401 126943 72976 63189 147354 129460 37473 -12558
9613 -12558 62621 150563 191724 247250 204175 116421 73477 49878 66969 134198 105631 163159
9601 163159 230606 236642 245976 204937 185836 138751 122002 130854 205462 251522 300871 236823
$$ packed form
9685A68651k5104J2975L5057O050m206J127k3772o0610k1255K8922O0383J2879
9673A91097J7654l5336o5349k9147P7789J01366m5698p8767o332J9682l2313r5353
9661A9293k7695M0509Q0689J19475l3450p6679l5415J6874m735J142M7425P4629
9649B22062L0967o7875j3230K2330k4788k7078J5193R062P090l6834l0418L3814
9637A40295J355J6796k9398n1505m638k7509N0626K1611l1926L020N027K4564
9625A18318j2639j5851J2608M5822q857j2458n3967r787Q4165j7894r1987n0031
9613a2558P5179Q7942M1161N5526m3075q7754m2944k3599J7091O7229k8567N7528
9601A63159O7447O036R334m1039j9101m7085j6749Q852P4608M6060M9349o4048
$$ plain form
9589 236823 149790 174749 271884 286731 370325 409495 377769 364836 328723 287083 313852 293610
9577 293610 205820 245992 306588 325548 361721 366398 386876 411289 442776 483913 460193 453235
9565 453235 459408 454654 458731 486507 461297 433988 464072 438172 463741 470327 441374 399661
9553 399661 345669 337472 352918 376723 349348 338175 366446 342217 329914 381584 423017 412592
9541 412592 372291 347736 372080 345187 348918 309974 278700 258505 252799 298937 304632 268975
9529 268975 264381 257495 216539 183004 148824 211252 249997 275479 319144 362333 409714 406458
9517 406458 398250 410775 418558 432415 428578 389269 374486 370594 374933 367344 312531 198713 211773
9504 211773 145267 166819 196879 259560 239672 193878 211895 205041 141281 112773 120335 133816
$$ packed form
9589B36823q7033K4959R7135J4847Q3594L9170l1726j2933l6113m1640K6769k0242
9577B93610q7790M0172O0596J8960L6173M677K0478K4413L1487M1137k3720o958
9565D53235O173m754M077K7776k5210k7309L0084k5900K5569O586k8953m1713
9553C99661n3992q197J5446K3805k7375j1173K8271k4229j2303N1670M1433j0425
9541D12592m0301k4555K4344k6893L731l8944l1274k0195n706M6138N695l5657
9529B68975m594o886m0956l3535l4180O2428L8745K5482M3665M3189M7381l256
9517D06458q208J2525P783J3857l837l9309j4783l892M339p589n4813j13818J3060
9504B11773o6506K1552L0060O2681j9888m5794J8017o854o3760k8508P562J3481
$$ plain form
9492 133816 195535 203536 172638 208497 242150 255501 255248 250244 260965 231931 258575 330302
9480 330302 318465 265178 269815 316586 362303 436558 463795 464944 474080 462807 445604 425906
9468 425906 374980 327280 287667 353677 413502 433720 412294 385551 319590 273501 178415 187902
9456 187902 231794 238284 221677 192462 228418 279656 274585 219418 214673 224358 227289 200837 208858
9443 208858 206630 157285 165874 211380 196972 163852 160114 119873 172812 198894 206925 215411 287743
9430 287743 284844 324152 362306 405473 421477 453774 495650 468320 507838 579917 546787 494095
9418 494095 495574 463966 383620 397502 364499 320882 207335 189209 218803 135101 68544 6457
9406 6457 -1102 -30723 15534 -1391 19991 73339 115961 83946 79226 86092 138688 134499 124696
$$ packed form
9492A33816O1719Q001l0898L5859L3653J3351k53n004J0721k9034K6644P1727
9480C30302j1837n3287M637M6771M5717P4255K7237J149R136j1273j7203j9698
9468D25906n0926m7700l9613O6010N9825K0218k1426k6743o5961m6089r5086R487
9456A87902M3892O490j6607k9215L5956N1238n071n5167m745R685K931k6452Q021
9443B08858k228m9345Q589M5506j4408l3120l738m0241N2939K6082Q031Q486P2332
9430B87743k899L9308L8154M3167J6004L2297M1876k7330L9518P2079l3130n2692
9418D94095J479l1608q0346J3882l3003m3617j13547j8126K9594q3702o6557o2087
9406F457p559k9621M6257j6925K1382N3348M2622l2015m720O866N2596m189r803
$$ plain form
9393 124696 126216 134591 115627 67598 70651 93735 122002 155923 160426 159775 139429 167925 201499
9380 201499 208208 220315 188153 270880 364926 378582 333154 256914 215232 264857 291018 287915
9368 287915 277365 288842 272390 246094 200514 147671 103684 54211 55898 88567 41560 62355
9356 62355 107521 104402 96548 117193 107774 87369 63626 64145 37030 24933 50910 76532 96534
9343 96534 91519 80238 83037 103993 182385 184507 118469 76879 72116 43485 48354 125783 161805
9330 161805 162852 220139 280933 251325 220144 189284 180236 144760 68534 96237 71346 64273
9318 64273 90401 130377 164371 180578 237898 203992 183091 201928 215022 190898 145589 142867
9306 142867 137121 143975 249687 312413 336140 398806 442662 472401 501235 510135 535989 503671
$$ packed form
9393A24696J520Q375j8964m8029L053K3084K8267L3921M503o51k0346K8496L3574
9380B01499O709J2107l2162Q2727R4046J3656m5428p6240m1682M9625K6161l103
9368B87915j0550J1477j6452k6296m5580n2843m3987m9473J687L2669m7007K0795
9356F2355M5166l119p854K0645r419k0405k3743N19k7115j2097K5977K5622K0002
9343I6534n015j1281K799K0956P8392K122o6038m1590m763k8631M869P7429L6022
9330A61805J047N7287O0794k9608l1181l0860r048l5476p6226K7703k4891p073
9318F4273K6128L9976L3994J6207N7320l3906k0901J8837J3094k4124m5309k722
9306A42867n746O854J05712O2726K3727O2666M3856K9739K8834Q900K5854l2318
$$ plain form
9294 503671 388125 358770 406163 404407 359284 372757 370113 406658 399207 403205 434392 497272
9282 497272 540022 514614 543571 561058 570656 553482 519613 568919 551504 554601 512761 464263
9270 464263 362287 376284 422008 508589 654823 755066 829050 942815 1039894 1175382 1254078
9259 1254078 1208705 1102658 917635 802067 643683 608332 644981 680015 694283 697967 707531
9248 707531 720008 710257 694750 704655 705456 691431 741168 789688 807418 779460 749912 710398
9236 710398 698591 682306 640620 635811 645454 678901 690286 694034 669052 684038 723655 778515
9224 778515 862757 926325 981355 945627 860077 894207 853117 805912 778375 765991 803400 827251
9212 827251 836672 859443 883645 900877 937750 1020427 1068993 1126562 1118400 1142813 1177609 1231337
$$ packed form
9294E03671j15546k9355M7393j756m5123J3473k644L6545p451L998L1187O2880
9282D97272M2750k5408K8957J7487R598j7174l3869M9306j7415L097m1840m8498
9270D64263j01976J3997M5724Q6581J46234J00243P3984J13765R7079J35488P8696
9259A254078m5373j06047j85023j15568j58384l5351L6649L5034J4268L684R564
9248G07531J2477r751j5507R905Q01j4025M9737M8520J7730k7958k9548l9514
9236G10398j1807j6285m1686m809R643L3447J1385L748k4982J4986L9617N4860
9224G78515Q4242O3568N5030l5728q5550L4130m1090m7205k7537j2384L7409K3851
9212H27251R421K2771K4202J7232L6873Q2677M8566N7569q162K4413L4796N3728
$$ plain form
9200 1231337 1271728 1350103 1413152 1546679 1645397 1627124 1708620 1841125 1923578 2046737 2231829
9189 2231829 2372221 2521796 2620972 2776329 2953188 3098313 3212742 3408822 3679224 3951135
9179 3951135 4140601 4358254 4590599 4788389 5109437 5388565 5635653 5810314 6008964 6147308
9169 6147308 6241171 6256242 6254444 6205263 6153110 6056713 5923000 5757287 5579418 5469319 5372503
9158 5372503 5124506 4875138 4721841 4583052 4391116 4242740 4044872 3870699 3731532 3639691
9148 3639691 3462427 3268591 3165667 3087568 2998304 2871084 2687505 2608279 2498122 2371606
9138 2371606 2275265 2198757 2126541 2074751 2014207 2018441 1991761 1901454 1910730 1850363 1767403 1738989
9126 1738989 1729119 1696679 1639355 1514394 1483391 1455484 1493731 1520191 1439348 1369519 1299443
$$ packed form
9200A231337M0391P8375O3049J33527R8718j8273Q1496J32505Q2453J23159J85092
9189B231829J40392J49575R9176J55357J76859J45125J14429J96080K70402K71911
9179C951135J89466K17653K32345J97790L21048K79128K47088J74661J98650J38344
9169F147308R3863J5071j798m9181n2153r6397j33713j65713j77869j10099r6816
9158E372503k47997k49368j53297j38789j91936j48376j97868j74173j39167r1841
9148C639691j77264j93836j02924p8099q9264j27220j83579p9226j10157j26516
9138B371606r6341p6508p2216n1790o0544M234k6680r0307R276o0367q2960k8414
9126A738989r870l2440n7324j24961l1003k7907L8247K6460q0843o9829p0076
$$ plain form
9115 1299443 1294351 1230071 1188046 1214999 1206828 1144741 1084707 1096527 1088268 1097151 1093751 1012198
9103 1012198 942096 873855 840376 733323 715619 767576 770197 790510 814708 738365 654279
9092 654279 687608 700471 756456 808158 766926 730638 693265 629688 598506 598448 560083 584700
9080 584700 609704 594653 585855 529706 510753 515268 488487 443523 416765 429077 429654 407179
9068 407179 330319 305356 361010 310970 329487 388248 404314 353338 301043 356768 360954 306110
9056 306110 304579 268829 250486 324020 374811 416524 383069 336050 306759 305475 367624 359339
9044 359339 318709 347309 287298 281586 307491 309383 265897 264852 272428 220600 199752 218308
9032 218308 206584 212516 234741 274964 293162 274819 228202 186967 213333 204792 180445 168925
$$ packed form
9115A299443n092o4280m2025K6953q171o2087o0034J1820q259Q883l400q1553
9103A012198p0102o8241l3479j07053j7704N1957K621K0313K4198p6343q4086
9092F54279L3329J2863N5985N1702m1232l6288l7373o3577l1182n8l8365K4617
9080E84700K5004j5051q798n6149j8953M515k6781m4964k6758J2312N77k2475
9068D07179p6860k4963N5654n0040J8517N8761J6066n0976n2295N5725M186n4844
9056C06110j531l5750j8343P3534N0791M1713l3455m7019k9291j284O2149q285
9044C59339m0630K8600o0011n712K5905J892m3486j045P576n1828k0848J8556
9032B18308j1724N932K2225M0223J8198j8343m6617m1235K6366q541k4347j1520
$$ plain form
9020 168925 141630 124835 105923 154153 193051 211501 247978 239464 206838 154609 170578 190743
9008 190743 209605 233308 157126 81329 69466 111811 144380 126143 151486 187671 189978 181017
8996 181017 179248 123196 102589 62576 19799 -24469 -8393 27061 57221 87240 70113 108536
8984 108536 161067 127888 144914 141241 128739 142802 149193 139495 123902 138979 120341 65315
8972 65315 50087 87033 101286 121325 142755 112539 150485 194254 188521 160131 151643 165176
8960 165176 151230 72961 56940 66602 31895 47394 76042 77398 40896 80886 119215 113801
8948 113801 103718 84674 65879 43835 32780 25548 -12928 35598 30836 21835 -38120 -46772
8936 -46772 4828 24444 51701 23645 39573 82448 88173 44634 61766 57810 81168 118320
$$ packed form
9020A68925k7295j6795j8912M8230L8898J8450L6477q514l2626n2229J5969K0165
9008A90743J8862K3703p6182p5797j1863M2345L2569j8237K5343L6185K307q961
8996A81017j769n6052k0607m0013m2777m4268J6076L5454L0160L0019j7127L8423
8984A08536N2531l3179J7026l673j2502J4063O391r698j5593J5077j8638n5026
8972F5315j5228L6946J4253K0039K1430l0216L7946M3769n733k8390q488J3533
8960A65176j3946p8269j6021R662l4707J5499K8648J356l6502L9990L8329n414
8948A13801j0083j9044j8795k2044j1055p232l8476M8526m762r001n9955q652
8936d6772N1600J9616K7257k8056J5928M2875N725m3539J7132l956K3358L7152
$$ plain form
8924 118320 92948 92718 97942 56994 83622 80541 12232 20864 62709 83534 105281 152915 150791
8911 150791 161233 181885 100839 17393 -7251 3315 76197 75758 62117 77154 53351 34890
8899 34890 49370 104311 145545 177927 210793 193498 127131 90825 149476 187218 232086 348682
8887 348682 342141 319992 295010 329109 479774 649557 987465 1503131 2158310 2889756 3457497
8876 3457497 3446615 2825384 2038130 1430961 1079186 839817 697522 600630 487103 435864
8866 435864 433131 392359 383613 332967 297296 276897 272559 256160 200710 222132 252046 233452
8854 233452 259440 276388 284469 282704 239634 221076 162084 114143 91485 161085 108537 29340
8842 29340 38474 33057 70893 101653 37715 98765 135815 88047 81142 6298 13132 40391 71507
$$ packed form
8924A18320k5372k30N224m0948K6628l081o8309Q632M1845K0825K1747M7634k124
8911A50791J0442K0652q1046q3446k4644J0566P2882m39j3641J5037k3803j8461
8899C4890J4480N4941M1234L2382L2866j7295o6367l6306N8651L7742M4868J16596
8887C48682o541k2149k4982L4099J50665J69783L37908N15666O55179P31446N67741
8876C457497j0882o21231p87254o07169l51775k39369j42295r6892j13527n1239
8866D35864k733m0772q746n0646l5671k0399m338j6399n5450K1422K9914j8594
8854B33452K5988J6948Q081j765m3070j8558n8992m7941k2658O9600n2548p9197
8842B9340R134n417L7836L0760o3938O1050L7050m7768o905p4844O834K7259L1116
$$ plain form
8829 71507 84680 61797 79541 80784 97033 107669 87146 63673 60728 69880 156066 119899
8817 119899 76868 53095 59493 90517 141841 139092 20391 2541 -8877 27129 28672 45929
8805 45929 94206 80086 77435 70644 72443 49040 39703 13585 -1160 49178 94427 82909 81008
8792 81008 59419 67792 40868 38183 72139 95662 85058 55965 48514 40321 35848 20299 67121
8779 67121 102938 91466 42817 83150 87594 60864 64544 74713 78551 121144 111763 44481 39679
8766 39679 60168 47615 107326 134208 120857 78795 67971 17348 26472 45213 -6631 -28026
8754 -28026 -20790 1006 55147 109961 111070 51103 32227 104612 200292 196852 152657 76859
8742 76859 73740 37198 61347 35756 24362 49682 73810 38014 41970 34928 36469 39826 -18399
$$ packed form
8829G1507J3173k2883J7744J243J6249J0636k0523k3473k945R152Q6186l6167
8817A19899m3031k3773O398L1024N1324k749j18701j7850j1418L6006J543J7257
8805D5929M8277j4120k651o791J799k3403r337k6118j4745N0338M5249j1518j901
8792H1008k1589Q373k6924k685L3956K3523j0604k9093p451q193m473j5549M6822
8779F7121L5817j1472m8649M0333M444k6730L680J0169L838M2593r381o7282m802
8766C9679K0489j2553N9711K6882j3351m2062j0824n0623R124J8741n1844k1395
8754b8026P236K1796N4141N4814J109n9967j8876P2385R5680l440m4195p5798
8742G6859l119l6542K4149k5591j1394K5320K4128l5796L956p042J541L357n8225
$$ plain form
8729 -18399 -21994 21015 30846 44851 53886 62422 14333 24677 21073 -51103 -32750 -1577 16752
8716 16752 50501 47729 61163 50691 20968 -27599 -36433 39595 36889 8654 39663 8799
8704 8799 41457 62902 43040 80500 135048 116061 86212 71912 12353 16877 46438 80091
8692 80091 66974 18102 43496 102086 107723 86199 57344 18320 20153 93487 124527 159265
8680 159265 182432 179801 120106 72000 33243 20618 11623 -4583 15381 22585 47149 74422
8668 74422 81077 145168 133482 115203 72098 129024 195734 205401 183018 174206 163443 130034
8656 130034 41162 25381 41019 49476 91740 160820 127842 85797 117938 129269 89706 77106
8644 77106 61478 63193 90944 158827 149884 92149 30681 -17210 -11043 -7982 27065 53559 39790
$$ packed form
8729a8399l595M3009R831J4005R035Q536m8089J0344l604p2176J8353L1173J8329
8716A6752L3749k772J3434j0472k9723m8567q834P6028k706k8235L1009l0864
8704H799L2658K1445j9862L7460N4548j8987k9849j4300n9559M524K9561L3653
8692H0091j3117m8872K5394N8590N637k1524k8855l9024J833P3334L1040L4738
8680A59265K3167k631n9695m8106l8757j2625q995j6206J9964P204K4564K7273
8668G4422O655O4091j1686j8279m3105N6926O6710R667k2383q812j0763l3409
8656A30034q8872j5781J5638Q457M2264O9080l2978m2045L2141J1331l9563j2600
8644G7106j5628J715K7751O7883q943n7735o1468m7891O167L061L5047K6494j3769
$$ plain form
8631 39790 8906 -13988 11704 51179 103595 104107 97201 70502 103592 99695 95343 181952 131889
8618 131889 141419 129880 133883 160602 177726 224400 247792 207606 196411 233167 302874 373213
8606 373213 452256 547756 670937 749349 684004 536213 431841 381079 395287 388068 356986
8595 356986 381654 406688 385239 318230 245870 149360 124600 129915 100767 124873 108278 155037
8583 155037 167265 163473 157613 163027 146381 132552 73002 90032 107037 139578 145428 124159
8571 124159 83989 52807 30076 65457 55753 144097 204567 253671 314023 401372 464830 600300
8559 600300 814991 986238 1052313 892199 661970 439925 335984 265112 220311 165700
8549 165700 109564 91149 152206 222356 212956 143505 96631 112529 125149 120482 135726 177142
$$ packed form
8631C9790l0884k2894K5692L9475N2416N12o906k6699L3090l897m352Q6609n0063
8618A31889R530j1539M003K6719J7124M6674K3392m0186j1195L6756O9707P0339
8606C73213P9043R5500J23181P8412o5345j47791j04372n0762J4208p219l1082
8595C56986K4668K5034k1449o7009p2360r6510k4760N315k9148K4106j6595M6759
8583A55037J2228l792n860N414j6646j3829n9550J7030J7005L2541N850k1269
8571A24159m0170l1182k2731L5381r704Q8344O0470M9104O0352Q7349O3458J35470
8559F00300K14691J71247O6075j60114k30229k22045j03941p0872m4801n4611
8549A65700n6136j8415O1057P0150r400o9451m6874J5898J2620m667J5244M1416
$$ plain form
8537 177142 165708 145248 187804 230491 206418 161664 137254 152420 172960 164644 123104 89487
8525 89487 112138 165317 153231 125511 148843 134296 117817 117812 181448 214746 335804 468817
8513 468817 589383 682364 679495 578724 402307 308614 265523 197957 170348 149995 181584
8502 181584 215009 185418 166196 189632 188185 126892 120699 35199 -9647 77939 125737 107046
8490 107046 83980 68333 42917 102735 206093 199178 193762 173849 132318 146733 128696 127057
8478 127057 154425 121671 85027 124497 151862 194020 119723 33114 6858 31980 78509 99785
8466 99785 144167 126498 91981 87242 115433 69677 -16780 -63469 -59123 -47181 20120 57092
8454 57092 46561 43844 79358 77518 97929 101676 55567 63864 137068 85833 20486 34893 31707
$$ packed form
8537A77142j1434k0460M2556M2687k4073m4754k4410J5166K0540q316m1540l3617
8525H9487K2651N3179j2086k7720K3332j4547j6479nO3636L3298J21058J33013
8513D68817J20566R2981k869j00771j76417r3693m3091o7566k7609k0353L1589
8502A81584L3425k9591j9222K3436j447o1293o193q5500m4846Q7586M7798j8691
8490A07046k3066j5647k5416N9818J03358o915n416j9913m1531J4415j8037j639
8478A27057K7368l2754l6644L9470K7365M2158p4297q6609k6256K5122M6529K1276
8466I9785M4382j7669l4517m739K8191m5756q6457m6689M346J1942O7301L6972
8454E7092j0531k717L5514j840K0411L747m6109Q297P3204n1235o5347J4407l186
$$ plain form
8441 31707 74053 64568 90190 85189 41875 -22047 -17956 -21520 -46840 33745 75220 123450 120089
8428 120089 94749 72516 102159 105992 17176 -66843 -9558 17371 28157 60830 41344 26008
8416 26008 26089 46958 65992 73089 53429 57291 55464 23633 22183 26787 75173 1024 21358
8403 21358 36475 21883 -2925 -36883 -81046 -130319 -99225 -13711 49541 59736 44558 50542
8391 50542 50188 22868 -6730 -6758 37234 84349 46910 -23236 -33508 -39545 -19348 -13836 22008
8378 22008 117972 104532 56225 56982 78906 124834 143961 99494 21709 10267 14372 26300
8366 26300 -44886 -44658 -5055 80317 61174 63083 74481 95501 76313 96543 72119 50012
8354 50012 41378 48072 30499 76337 87103 94960 165676 156852 119724 88420 91696 85493 34275
$$ packed form
8441C1707M2346r485K5622n001m3314o3922M091l564k5320Q0585M1475M8230l361
8428A20089k5340k2233K9643L833q8816q4019N7285K6929J0786L2673j9486j5336
8416B6008Q1K0869J9034P097j9660L862j827l1831j450M604M8386p4149K0334
8403B1358J5117j4592k4808l3958m4163m9273L1094Q5514O3252J0195j5178N984
8391E0542l54k7320k9598k8M3992M7115l7439p0146j0272o037K0197N512L5844
8378B2008R5964j3440m8307P57K1924M5928J9127m4467p7785j1442M105J1928
8366B6300p1186K28L9603Q5372j9143J909J1398K1020j9188K0230k4424k2107
8354E0012q634O694j7573M5838J0766P857P0716q824l7128l1304L276o203n1218
$$ plain form
8341 34275 44002 26486 -45085 -46095 -49456 -34321 -57508 -90977 -117865 -57857 48525 114195
8329 114195 117828 59461 88301 105033 99492 68077 51825 47740 9758 -58531 -109759 -111619
8317 -111619 -41444 58648 131413 91308 57672 34569 45292 24734 45953 85499 48567
8306 48567 -19240 3184 -9718 49144 178562 198878 209447 177632 101873 24353 110179 150391
8294 150391 175914 94159 104952 83091 34683 14816 15041 27359 38328 50917 83508 128335
8282 128335 169269 124219 109386 141968 151965 188688 191972 159288 109149 20769 -7652 -44519
8270 -44519 -69243 -97497 -119667 -36208 -10572 -63050 -25185 24686 19126 -8759 -67987 -80457
8258 -80457 -50505 -61672 -32259 -53468 -60068 -557 18082 4122 -42491 -50777 -56623 -7944
$$ packed form
8341C4275R727j7516p1571j010l361J5135k3187l3469k6888O0008J06382O5670
8329A14195L633n8367K8840J6732n541l1415j6252m085l7982o8289n1228j860
8317a11619P0175J00092P2765m0105l3636k3103J0723k0558K1219L9546l6932
8306D8567o7807K2424j2902N8862J29418K0316J0569l1815p5759p7520Q5826M0212
8294A50391K5523q1755J0793k1861m8408j9867K25J2318J0969J2589L2591M4827
8282A28335M0934m5050j4833L2582R997L6723L284l2684n0139q8380k8421l6867
8270d4519k4724k8254k2170Q3459K5636n2478L7865M9871n560k7885n9228j2470
8258h0457K9952j1167K9413k1209o600N9511J8639j3960m6613q286n846M8679
$$ plain form
8246 -7944 3704 -7155 -3532 10681 442 -21678 -55261 49611 102059 63156 50384 67321
8234 67321 102713 120225 87395 46664 -1047 19803 8002 30593 81051 48099 57903 74434
8222 74434 68289 52878 45416 -1133 -84657 -31800 -15448 -58020 -53395 30564 -18782 -39854
8210 -39854 70906 110884 25841 18664 30404 12610 19208 -7383 64060 113177 128291 71427
8198 71427 71502 26852 -51399 -100703 -113261 -97595 -106223 -124904 -134998 -136355 -124501 -121620 -105818
8185 -105818 -71046 -18420 23485 51516 57796 74122 63922 35930 53700 33343 35349 77627
8173 77627 73311 96214 94361 77534 34675 15579 16821 18338 11504 -8781 17559 67783 101596
8160 101596 116695 116917 108074 61640 58152 19573 26195 104541 139712 115701 40814 27996 -35787
$$ packed form
8246g944J1648j0859L623J4213j0239k2120l3583J04872N2448l8903j2772J6937
8234F7321L5392J7512l2830m0731m7711K0850j1801K2591N0458l2952R804J6531
8222G4434o145j5411p462m6549q3524N2857J6352m2572M625Q3959m9346k1072
8210c9854J10760L9978q5043p177J1740j7794O598k6591P1443M9117J5114n6864
8198G1427P5m4650p8251m9304j2558J5666q628j8681j0094j357J1854K881J5802
8185a05818L4772N2626M1905K8031O280J6326j0200k7992J7770k0357K006M2278
8173G7627m316K2903j853j6827m2859j9096J242J517o834k0285K6340N0224L3813
8160A01596J5099K22q843m6434l488l8579O622P8346L5171k4011p4887j2818o3783
$$ plain form
8147 -35787 -13375 49930 62965 69634 64320 30929 41938 105977 136720 125452 90497 106625
8135 106625 113947 57628 -4405 -14618 -6666 44026 71883 -982 -2667 39293 102593 103792
8123 103792 141870 112061 78469 92366 129676 151809 156677 211860 335075 443935 593283
8112 593283 796726 913597 919579 841508 676236 495215 383878 329189 338875 325531 242992
8101 242992 205629 137932 127434 176489 199654 170275 170728 214588 208763 190311 108860 94756
8089 94756 104706 84063 -5036 -40129 -1352 83709 113896 71387 36153 11728 6978 70395
8077 70395 71303 5282 81814 150218 184162 181983 204437 317178 482547 645702 933063 1298864
8065 1298864 1681395 1939095 2006237 1817940 1415304 990681 703612 513817 432868 401276
$$ packed form
8147c5787K2412O3305J3035O669n314l3391J1009O4039L0743j1268l4955J6128
8135A06625P322n6319o2033j0213P952N0692K7857p2865j685M1960O3300J199
8123A03792L8078k9809l3592J3897L7310K2133M868N5183J23215J08860J49348
8112E93283K03443J16871N982p8071j65272j81021j11337n4689R686j3344q2539
8101B42992l7363o7697j0498M9055K3165k9379M53M3860n825j8452q1451j4104
8089I4756R950k0643q9099l5093L8777Q5061L0187m2509l5234k4425m750O3417
8077G0395R08o6021P6532O8404L3944k179K2454J12741J65369J63155K87361L65801
8065A298864L82531K57700O7142j88297m02636m24623k87069j89795q0949l1592
$$ plain form
8055 401276 320773 269607 318522 307550 276695 220906 206085 240396 256400 232249 220686 225645
8043 225645 239557 212334 189561 162837 110871 72104 111593 162565 162433 157061 190374 158978
8031 158978 168399 147327 99960 119193 174536 234338 290874 228980 224345 417141 582853 650668
8019 650668 734143 769392 829587 878451 848295 694081 506876 406661 329501 239549 204613
8008 204613 112189 193206 270233 296364 250405 227989 206427 215777 182283 184350 201197 189481
7996 189481 206687 213332 150799 123055 93429 68743 60564 112396 138441 131910 182325 104339
7984 104339 -16831 -5207 40974 86246 89959 103511 114353 101496 79720 90889 55595 88291
7972 88291 163866 175967 141238 139840 138958 107587 100668 104666 69316 54581 68552 82309 90795
$$ packed form
8055D01276q0503n1166M8915j0972l0855n5789j4821L4311J6004k4151j1563M959
8043B25645J3912k7223k2773k6724n1966l8767L9489N0972j32n372L3313l1396
8031A58978R421k1072m7367J9233N5343N9802N6536o1894m635J92796J65712O7815
8019F50668Q3475L5249O0195M8864l0156j54214j87205j00215p7160q9952l4936
8008B04613r2424Q1017P7027K6131m5959k2416k1562R350l3494K067J6847j1716
7996A89481J7206O645o2533k7744k9626k4686q179N1832K6045o531N0415p7986
7984A04339j21170J1624M6181M5272L713J3552J0842j2857k1776J1169l5294L2696
7972H8291P5575J2101l4729j398q82l1371o919L998l5350j4735J3971J3757Q486
$$ plain form
7959 90795 113596 24694 -25347 43255 101275 116150 134854 132563 191076 186866 213536 153942
7947 153942 92684 108439 126524 105903 41355 23946 5788 -14888 -10067 24017 106673 108240
7935 108240 54079 2205 15204 4945 9269 27862 37691 14905 -73215 -63915 -16618 14713
7923 14713 48123 73118 101615 108088 59014 43430 58249 87933 71032 46141 -9084 14507
7911 14507 70508 52634 34317 36439 8340 36322 36889 7424 -3400 575 33204 45434 27430
7898 27430 -15857 7955 61070 94924 75727 61544 33839 36020 69909 121885 131997 71992
7886 71992 -6027 -49445 -49085 -8762 -36535 -43612 28341 70548 32636 -818 39085 27317
7874 27317 -12834 -40450 -80656 -54579 9569 -8617 -4148 30104 42691 100122 98401 103828
$$ packed form
7959I0795K2801q8902n0041O8602N8020J4875J8704k291N8513m210K6670n9594
7947A53942o1258J5755J8085k0621o4548j7409j8158k0676M821L4084Q2656J567
7935A08240n4161n1874J2999j0259M324J8593R829k2786q8120R300M7297L1331
7923A4713L3410K4995K8497O473m9074j5584J4819K9684j6901k4891n5225K3591
7911A4507N6001j7874j8317K122k8099K7982N67k9465j0824L975L2629J2230j8004
7898B7430m3287K3812N3115L3854j9197j4183k7705K181L3889N1976J0112o0005
7886G1992p8019m3418L60M0323k7773p077P1953M2207l7912l3454L9903j1768
7874B7317m0151k7616m0206K6077O4148j8186M469L4252J2587N7431j721N427
$$ plain form
7862 103828 94608 22307 11901 -15664 31469 38679 22630 27501 7580 -32751 -56982 -73588
7850 -73588 -75116 -48202 -60947 -38536 -63904 -107281 -77219 -34056 10470 -12208 -28022 -11212
7838 -11212 7575 16805 -868 -1463 31109 80925 71718 28528 38007 49567 32537 2908 10396
7825 10396 -28498 -38104 -19186 16280 41160 21036 -10271 -11601 -70492 -146308 -66327 -62752
7813 -62752 -20389 32522 56324 39010 55994 17171 16932 -261 18542 66551 58041 8296
7801 8296 -53418 -9422 29980 -19877 -23001 -48516 -23268 11170 -32237 -53568 -5194 -21999
7789 -21999 -16593 16949 45316 23708 6576 51010 47007 -14363 -72471 -105240 -81836 -87041
7777 -87041 -23894 -13536 -56061 -81168 -28902 -10711 -49780 -52535 -69087 -38325 -45955 -16873
$$ packed form
7862A03828r220p2301j0406k7565M7133P210j6049M871j9921m0331k4231j6606
7850g3588j528K6914j2745K2411k5368m3377L0062M3163M4526k2678j5814J6810
7838a1212J8787R230j7673n95L2572M9816r207m3190R479J1560j7030k9629P488
7825A0396l8894r606J8918L5466K4880k0124l1307j330n8891p5816P9981L575
7813f2752M2363N2911K3802j7314J6984l8823k39j7193J8803M8009q510m9745
7801H296o1714M3996L9402m9857l124k5515K5248L4438m3407k1331M8374j6805
7789b1999N406L3542K8367k1608j7132M4434m003o1370n8108l2769K3404n205
7777h7041O3147J0358m2525k5107N2266J8191l9069k755j6552L0762p630K9082
$$ plain form
7765 -16873 17583 -9567 17668 30027 63522 128079 102108 3131 -59906 -5545 -13846 17418
7753 17418 36654 8416 -19695 -47070 -27905 -24516 2455 -34911 -79340 -30798 -28356 -2913
7741 -2913 35065 58824 67645 55099 -29127 -96329 -85795 -14655 -3081 -7254 -1939 -5846 28534
7728 28534 18983 4079 4083 -42380 -137993 -112904 -93053 -49393 13652 25668 -22249 -48193 -61134
7715 -61134 -18770 -25634 -76275 -86273 -111415 -92015 -62400 -802 -13748 -67601 -91821 -7787
7703 -7787 15660 -38554 -101356 -138401 -103625 -81810 -58218 13037 46520 -41534 -49245 -55546
7691 -55546 -86156 -105328 -138790 -112454 -109039 -99078 -42589 -18026 36547 49835 3861 -28655
7679 -28655 -14550 21881 15806 -38623 -78197 -69391 -42906 -9777 37406 45927 15349 -12479
$$ packed form
7765a6873L4456k7150K7235J2359L3495O4557k5971r8977o3037N4361q301L1264
7753A7418J9236k8238k8111k7375J9165L389K6971l7366m4429M8542K442K5443
7741b913L7978K3759Q821j2546q4226o7202J0534P1140J1574m173N315l907L4380
7728B8534r551j4904Mm6463r5613K5089J9851M3660O3045J2016m7917k5944j2941
7715f1134M2364o864n0641r998k5142J9400K9615O1598j2946n3853k4220Q4034
7703g787K3447n4214o2802l7045L4776K1815K3592P1255L3483q8054p711o301
7691e5546l0610j9172l3462K6336L415R961N6489K4563N4573J3288m5974l2516
7679b8655J4105L6431o075n4429l9574Q806K6485L3129M7183Q521l0578k7828
$$ plain form
7667 -12479 16934 84248 106595 86467 -522 -29030 -33246 -49952 -44008 -9070 -2457 -27499
7655 -27499 26824 49136 19002 4375 32645 63327 51779 -32830 -58485 -83955 -70036 -49044
7643 -49044 23586 -12589 -88924 -83469 -36830 -63381 -68129 -68611 -34700 -17941 -34527 -40354 16337
7630 16337 13153 23452 8613 -63203 -88059 -98655 -71444 -96053 -75652 -54066 -48744 -31027
7618 -31027 -40219 -60021 -29844 11640 -26599 6282 28267 8245 -22809 -49631 -68795 -60593
7606 -60593 -42340 -76025 -60220 -50503 -57727 -74770 -60327 -62456 -59650 -100174 -65009 -33412 -64040
7593 -64040 -86524 -136110 -156372 -227205 -172349 -81181 -115200 -110260 -77625 -53845 5899 23849
7581 23849 22536 27185 -9684 -8543 -35890 -80029 -92638 -31157 -6939 25253 4450 9341 21608
$$ packed form
7667a2479K9413O7314K2347k0128q6989k8508m216j6706N944L4938O613k5042
7655b7499N4323K2312l0134j4627K8270L0682j1548q4609k5655k5470J3919K0992
7643d9044P2630l6175p6335N455M6639k6551m748m82L3911J6759j6586n827N6691
7630A6337l184J0299j4839p1816k4856j0596K7211k4609K0401K1586N322J7717
7618c1027r192j9802L0177M1484l8239L2881K1985k0022l1054k6822j9164Q202
7606f0593J8253l3685J5805R717p224j7043J4443k129K806m0524L5165L1597l0628
7593f4040k2484m9586k0262p0833N4856R1168l4019M940L2635K3780N9744J7950
7581B3849j313M649l6869J141k7347m4139j2609O1481K4218L2192k0803M891J2267
$$ plain form
7568 21608 8361 -53429 -65378 -53059 -46034 25189 34517 -8485 -72534 -14671 -14002 -17933 -11580
7555 -11580 27832 20119 9415 23053 74416 20569 -50633 -88514 -56178 -68541 -53101 -83450
7543 -83450 -86759 18000 87503 31114 -44710 -12663 -8890 -46263 -53118 -52674 -50870 -40217 -17525
7530 -17525 -31399 -47103 -115016 -72652 -968 -60024 -90191 -49904 -79625 -106392 -143170 -88539
7518 -88539 -24030 -27013 -48421 -103772 -87130 -24961 -20425 -40989 -2548 4624 -7196 -59176
7506 -59176 -104025 -68381 -37641 -1457 7966 -43069 -9927 12742 37808 73961 31368 -9130
7494 -9130 2484 10175 -7921 -38934 43675 57190 -93554 -61758 -17346 -70102 -67258 -64172
7482 -64172 -34985 57868 39461 25042 46849 43503 23932 55141 54640 -18377 -28927 -34391 -51019
$$ packed form
7568B1608j3247o1790j1949J2319P025P1223R328m3002o4049N7863O69l931O353
7555a1580L9412p713j0704J3638N1363n3847p1202l7881L2336j2363J5440l0349
7543h3450l309J04759O9503n6389p5824L2047L773l7373o855M44J804J0653K2692
7530a7525j3874j5704o7913M2364P1684n9056l0167M0287k9721k6767l6778N4631
7518h8539O4509k983k1408n5351J6642O2169M536k0564L8441P172j1820n1980
7506e9176m4849L5644L0740L6184R423n1035L3142K2669K5066L6153m2593m0498
7494i130J1614P691j8096l1013Q2609J3515j50744L1796M4412n2756K844L086
7482f4172K9187R2853j8407j4419K1807l346j9571L1209n01p3017j0550n464j6628
$$ plain form
7469 -51019 13368 11727 26951 49827 45927 48624 19159 10586 -44398 -109280 -66103 -25140 -35711
7456 -35711 -30026 -51419 -60832 -18967 -14834 -19371 -43599 -43958 -22203 -23404 -51561 -83288 -42610
7443 -42610 -69785 -76025 -104821 -106282 -6016 20963 4749 48384 54978 37658 -19817 -12014
7431 -12014 18196 46972 62390 -406 -54763 -50554 -38201 -87410 -99801 -64185 14271 36303
7419 36303 1191 4714 12218 18503 -16263 -29939 873 38313 41718 23505 -8675 -42774 -44069
7406 -44069 21474 -9644 -25585 -9435 -37358 -10222 -9280 -58839 -55392 -34747 -38842 13499 -17289
7393 -17289 -27741 -64030 -81217 -63367 -8623 27249 8161 566 4094 70909 58581 25718
7381 25718 -5838 -23204 -43579 -66523 -61197 -31126 -4943 -2148 20301 18464 34177 20061
$$ packed form
7469e1019O4387j641J5224K2876l900K697k9465q573n4984o4882M3177M0963j0571
7456c5711N685k1393r413M1865M133m537k4228l59K1755j201k8157l1727M0678
7443d2610k7175o240k8796j461J00266K6979j6214M3635O594j7320n7475P803
7431a2014L0210K8776J5418o2796n4357M209J2353m9209j2391L5616P8456K2032
7419C6303l5112L523P504O285l4766j3676L0812L7440L405j8213l2180l4099j295
7406d4069O5543l1118j5941J6150k7923K7136R42m9559L447K0645m095N2341l0788
7393a7289j0452l6289j7187J7850N4744L5872j9088p595L528O6815j2328l2863
7381B5718l1556j7366k0375k2944N326L0071K6183K795K2449j837J5713j4116
$$ plain form
7369 20061 -8627 2942 8906 -1903 -23146 -36765 -11312 -9729 31996 13912 5410 22693
7357 22693 -14857 -23874 20861 16972 -78816 -101458 -135530 -142263 -139105 -120415 -76296 -14068 -4825
7344 -4825 -42223 -101673 -58149 16437 12163 55579 44931 10099 -35765 -7538 2607 6289
7332 6289 -15942 8340 98271 115203 119323 47859 -68744 -70385 -56498 -36597 -70061 -79519
7320 -79519 -88501 -75208 -61158 6183 15642 42333 22719 -28814 1988 7697 -47620 -96395
7308 -96395 -108181 -86747 -10506 19441 -54679 -18821 30833 -7588 -44622 -49285 -66106 -26753
7296 -26753 -23280 3051 5341 -9149 -44384 -100399 -116759 -96125 -81788 -31520 -46795 8052
7284 8052 -1084 -11577 -23360 -21318 -41286 -107308 -103045 -53692 -73034 -128893 -150701 -166659 -181888
$$ packed form
7369B0061k8688J1569N964j0809k1243j3619K5453J583M1725j8084q502J7283
7357B2693l7550r017M4735l889r5788k2642l4072o733L158J8690M4119O2228R243
7344d825l7398n9450M3524P4586m274M3416j0648l4832m5864K8227J0145L682
7332F289k2231K4282Q9931J6932M120p1464j16603j641J3887J9901l3464r458
7320g9519q982J3293J4050O7341R459K6691j9614n1533L0802N709n5317m8775
7308i6395j1786K1434P6241K9947p4120L5858M9654l8421l7034m663j6821L9353
7296b6753L473K6331K290j4490l5235n6015j6360K0634J4337N0268j5275N4847
7284H052r136j0493j1783K042j9968o6022M263M9353j9342n5859k1808j5958j5229
$$ plain form
7271 -181888 -173807 -159716 -125129 -60582 -57015 -56460 -37526 12479 30351 44705 623 21497
7259 21497 18098 -6669 -50199 -61994 -39275 9244 31946 35875 12619 14848 14519 22534 -24773
7246 -24773 -62039 -35176 15127 -6323 -43134 -9712 19595 25266 -28319 -74266 -126490 -127381
7234 -127381 -81694 -92932 -58713 -8658 -36740 -25966 20579 -40804 -122301 -102643 -81909 -66645
7222 -66645 -34700 11658 14280 53790 110424 117574 140044 140753 64299 2254 -37823 -47038 -38961
7209 -38961 -4568 -14416 -42777 -114156 -119225 -96180 -63362 -49320 -76287 -46255 -60748 -85900
7197 -85900 -121339 -69313 -45506 -12803 -17244 -11057 -21727 -33804 16116 9710 -14005 -8181 -22285
7184 -22285 -37268 -13684 35177 68294 24480 -34655 -32522 -43516 -132216 -135386 -45119 -47376
$$ packed form
7271a81888Q081J4091L4587O4547L567N55J8934N0005J7872J4354m4082K0874
7259B1497l399k4767m3530j1795K2719M8519K2702L929k3256K229l29Q015m7307
7246b4773l7266K6863N0303k1450l6811L3422K9307N671n3585m5947n2224q91
7234a27381M5687j1238L4219N0055k8082J0774M6545o1383q1497J9658K0734J5264
7222f6645L1945M6358K622L9510N6634P150K2470P09p6454o2045m0077r215Q077
7209c8961L4393r848k8361p1379n069K3045L2818J4042k6967L0032j4493k5152
7197h5900l5439N2026K3807L2703m441O187j0670j2077M9920o406k3715N824j4104
7184b2285j4983K3584M8861L3117m3814n9135K133j0994q8700l170R0267k257
$$ plain form
7172 -47376 -29565 -47729 -99677 -74231 -79404 -68389 -5995 60753 54552 -11745 -13889 -4091 22077
7159 22077 71049 29642 -7522 29564 10117 -21968 -61794 -91908 -60432 -18577 -7592 -43148
7147 -43148 -94373 -156127 -195226 -209255 -162550 -65650 -12180 -19131 -37725 -85490 -74346 -51584
7135 -51584 -58141 -26543 -29718 -88432 -87770 -105364 -122123 -138985 -163043 -167655 -130312 -62133 -75154
7122 -75154 -60264 -5703 7744 48238 63726 82924 -2986 -18754 -11145 -23891 -34544 -7873
7110 -7873 -4863 31371 47850 45392 14450 -6731 22272 10677 -15122 -13570 4803 14857 -73209
7097 -73209 -85702 -70396 -100771 -71022 23687 79217 -35965 -58694 12221 40891 9987 -195
7085 -195 4398 -10800 11619 -4388 487 4473 42226 97587 116736 46275 -55822 -122132 -177333
$$ packed form
7172d7376J7811j8164n1948K5446n173J1015O2394O6748o201o6297k144R798K6168
7159B2077M8972m1407l7164L7086j9447l2085l9826l0114L1476M1855J0985l5556
7147d3148n1225o1754l9099j4029M6705R6900N3470o951j8594m7765J1144K2762
7135e1584o557L1598l175n8714O62j7594j6759j6862k4058m612L7343O8179j3021
7122g5154J4890N4561J3447M0494J5488J9198q5910j5768P609j2746j0653K6671
7110g873L010L6234J6479k458l0942k1181K9003j1595k5799J552J8373J0054q8066
7097g3209j2493J5306l0375K9749R4709N5530j15182k2729P0915K8670l0904j0182
7085a95M593j5198K2419j6007M875L986L7753N5361J9149p0461j02097o6310n5201
$$ plain form
7072 -177333 -157137 -114610 -137605 -97301 -49585 -69436 -91618 -106647 -111159 -143960 -141804 -138570
7060 -138570 -115728 -42268 -63646 -80492 -24889 -26320 -26103 -15587 -83473 -107410 -37877 -27786
7048 -27786 -56965 -77566 -28309 -6445 -40281 -129950 -171319 -119951 -92806 -98052 -76682 -36055
7036 -36055 -26802 -1615 -8934 6651 44059 40305 2863 -32112 -78710 -83734 -82743 -116335 -109684
7023 -109684 -61255 -18261 14384 60359 54033 57108 62058 57653 18504 -15232 -16994 -19000 36329
7010 36329 40536 83500 31512 -17504 -66310 -127667 -104284 -50692 3273 -61715 -28437 -60668
6998 -60668 -59135 25581 67181 27234 14531 -21960 -40507 -8069 -31827 -14526 -48849 -110263
6986 -110263 -129052 -90864 375 13773 -49987 -88499 -83863 -96029 -58564 -9484 809 25812
$$ packed form
7072a77333K0196M2527k2995M0304M7716j9851k2182j5029m512l2801K156L234
7060a38570K2842P3460k1378j6846N5603j431K17J0516o7886k3937O9533J0091
7048b7786k9179k0601M9257K1864l3836q9669m1369N1368K7145n246K1370M0627
7036c6055R253K5187p319J5585L7408l754l7442l4975m6598n024R91l3592O651
7023a09684M8429M2994L2645M5975o326L075M950m405l9149l3736j762k006N5329
7010C6329M207M2964n1988m9016m8806o1357K3383N3592N3965o4988L3278l2231
6998f0668J533Q4716M1600l9947j2703l6491j8547L2438k3758J7301l4323o1414
6986a10263j8789L8188R1239J3398o3760l8512M636j2166L7465M9080J0293K5003
$$ plain form
6974 25812 52024 -27317 -60486 -82922 -16896 -27617 -46976 -68492 -65264 -23016 4988 36829
6962 36829 67463 45814 -1086 41411 21352 -25141 -38580 -19392 -68306 -44141 10399 44853
6950 44853 53552 -8620 -770 17452 59711 71071 33808 -34002 -34678 -32412 -53359 -55309 -65219
6937 -65219 -48992 -42097 -66008 -47729 -70922 -33803 -17788 -33830 -63798 -68971 -83791 -65692
6925 -65692 -2409 78755 78160 29118 4154 1100 30218 33067 10393 77883 78996 16533 -52808
6912 -52808 -79618 -72768 -102126 -59677 -52391 -18481 7177 -16904 -58318 -30228 -16567 -41946
6900 -41946 -56455 -85471 -46334 -62535 -95010 -51232 -20705 -17435 8652 22000 -389 -81019
6888 -81019 -101155 -32070 21338 44207 933 -8893 -43160 -76836 -95496 -117708 -104445 -9256
$$ packed form
6974B5812K6212p9341l3169k2436O6026j0721j9359k1516L228M2248K8004L1841
6962C6829L0634k1649m6900M2497k0059m6493j3439J9188m8914K4165N4540L4454
6950D4853Q699o2172P850J8222M2259J1360l7263o7810o76K266k0947j950r910
6937f5219J6227O895k3911J8279k3193L7119J6015j6042k9968n173j4820J8099
6925f5692O3283Q1164n95m9042k4964l054K9118K849k2674O7490J113o2463o9341
6912e2808k6810O850k9358M2449P286L3910K5658k4081m1414K8090J3661k5379
6900d1946j4509k9016L9137j6201l2475M3778L0527L270K6087J3348k2389q0630
6888h1019k0136O9085N3408K2869m3274r826l4267l3676j8660k2212J3263R5189
$$ plain form
6876 -9256 7295 -21779 -69735 -95125 -83668 -114139 -89755 -64762 -38805 23966 47435 35290
6864 35290 -13516 -67572 -55955 -48253 -80439 -88389 -104772 -82113 -97027 -33781 20625 35886
6852 35886 -35974 -74243 -116080 -98446 -84845 -66816 -68529 -53046 -28550 -48749 -52554 -13268
6840 -13268 46071 15828 -12859 23076 -34988 -47716 -33382 -34315 -23242 -45570 -14614 -17667
6828 -17667 23415 29463 -13603 33501 26292 8971 -49650 -34981 -12259 33454 7387 -69803
6816 -69803 -72219 6196 15252 -29097 -64699 -49183 -55755 -10571 -13128 -37247 -114193 -163010 -185971
6803 -185971 -118174 -123042 -96389 -30974 -48684 -23236 -38771 -22672 -55133 -97664 -77903 -44468
6791 -44468 -58084 -51945 5439 124257 113137 59106 52484 105376 26360 -30043 14978 4579
$$ packed form
6876i256J6551k9074m7956k5390J1457l0471K4384K4993K5957O2771K3469j2145
6864C5290m8806n4056J1617P702l2186p950j6383K2659j4914O3246N4406J5261
6852C5886p1860l8269m1837J7634J3601J8029j713J5483K4496k0199l805L9286
6840a3268N9339l0243k8687L5935n8064j2728J4334r33J1073k2328L0956l053
6828a7667M1082O048m3066M7104p209j7321n8621J4669K2722M5713k6067p7190
6816f9803k416P8415R056m4349l5602J5516o572M5184k557k4119p6946m8817k2961
6803a85971O7797m868K6653O5415j7710K5448j5535J6099l2461m2531J9761L3435
6791d4468j3616O139N7384J18818j1120n4031o622N2892p9016n6403M5021j0399
$$ plain form
6779 4579 -7558 -7285 -10808 1082 27283 33632 45190 60053 20688 19597 -3120 -35915 4647
6766 4647 8000 -4324 -22756 -20023 -17030 -28974 -40441 -41709 -29583 55924 46214 -19708 -45432
6753 -45432 48424 108523 99255 137361 160088 159655 213042 239212 247703 247914 250888 224440 186637
6740 186637 150052 109813 131910 125098 136251 154567 209768 172954 150293 169666 248778 346211
6728 346211 397747 527711 748429 1118224 1613631 2290595 3060234 3672211 3787303 3133732
6718 3133732 2147914 1437306 996303 742212 660581 617209 605716 528584 445319 395516 384956
6707 384956 350886 312138 331984 332588 344449 280694 245175 251306 273228 364083 351769 346232
6695 346232 315216 265653 197251 197821 175712 199911 169754 133480 161117 165234 132066 152376
$$ packed form
6779D579j2137K73l523J1890K6201O349J1558J4863l9365j091k2717l2795M0562
6766D647L353j2324j8432K733K993j1944j1467j268J2126Q5507r710o5922k5724
6753d5432R3856O0099r268L8106K2727m33N3387K6170Q491K11K974k6448l7803
6740A86637l6585m0239K2097o812J1153J8316N5201l6814k2661J9373P9112R7433
6728C46211N1536J29964K20718L69795M95407O76964P69639O11977J15092o53571
6718C133732r85818p10608m41003k54091q1631m3372j1493p7132q3265m9803j0560
6707C84956l4070l8748J9846O04J1861o3755l5519O131K1922R0855j2314n537
6695C46232l1016m9563o8402N70k2109K4199l0157l6274K7637M117l3168K0310
$$ plain form
6683 152376 151165 210365 265771 216568 97307 53369 35981 29414 45290 92960 134559 131269
6671 131269 105167 87982 101225 16912 5896 8685 26770 30181 50171 7732 -38711 -41397
6659 -41397 -24974 6801 -13870 -36246 -26141 9347 45011 58579 33256 1331 -14268 -36053
6647 -36053 -70925 -42999 8855 -46413 -87383 -69015 -96265 -91187 -19102 -14148 -75020 -136545
6635 -136545 -123983 -77153 -54602 -36954 -65277 -2610 17898 -13788 13051 96119 73231 57917
6623 57917 52042 42591 38422 19643 -31908 28920 71557 52947 10260 -68589 -76552 -77151 -91294
6610 -91294 -60446 -2067 -17473 -7988 16108 68286 66063 65097 81901 50930 45459 39068 37360
6597 37360 24540 -40591 -45804 -45592 -45446 -62478 -66008 -19869 5417 19958 -42192 -79340 -61196
$$ packed form
6683A52376j211N9200N5406m9203j19261m3938j7388o567J5876M7670M1599l290
6671A31269k6102j7185J3243q4313j1016K789J8085L411J9990m2439m6443k686
6659d1397J6423L1775k0671k2376J0105L5488L5664J3568k5323l1925j5599k1785
6647c6053l4872K7926N1854n5268m0970J8368k7250N078P2085M954o0872o1525
6635a36545J2562M6830K2551J7648k8323O2667K0508l1686K6839Q3068k2888j5314
6623E7917n875r451m169j8779n1551O0828M2637j8610m2687p8849p963n99j4143
6610i1294L0848N8379j5406R485K4096N2178k223r66J6804l0971n471o391j708
6597C7360j2820o5131n213K12J46j7032l530M6139K5286J4541o2150l7148J8144
$$ plain form
6584 -61196 -52568 -82909 -87792 -23458 -19282 -41871 -108090 -141913 -113820 -46620 -4941 -14451 -42913
6571 -42913 -64427 -68832 -66970 -139725 -164641 -69469 -88756 -113102 -76809 -20732 -22020 -71126
6559 -71126 -82398 -59275 -19118 -23785 22535 5467 6807 32182 1174 -8453 -32695 -41005 -36429
6546 -36429 -30188 -8426 -13933 -38398 -27014 -28424 -11568 33860 58619 4571 -67928 -33312
6534 -33312 -37986 -66809 -52652 -27233 2781 2260 -27803 -32374 26106 64979 67148 76728 58949
6521 58949 88456 113458 98732 67524 84846 46131 -15073 40889 87233 134910 39692 11581
6509 11581 31220 87255 126717 113137 62675 29929 -4496 84908 86714 64457 23638 38501
6497 38501 29756 47185 42743 29 -19581 36098 58581 50953 -92 -82287 -81157 -29437 -82179
$$ packed form
6584f1196Q628l0341m883O4334M176k2589o6219l3823K8093O7200M1679r510k8462
6571d2913k1514m405J862p2755k4916R5172j9287k4346L6293N6077j288m9106
6559g1126j1272K3123M0157m667M6320j7068J340K5375l1008r627k4242q310M576
6546c6429O241K1762n507k4465J1384j410J6856M5428K4759n4048p2499L4616
6534c3312m674k8823J4157K5419L0014n21l0063m571N8480L8873K169R580j7779
6521E8949K9507K5002j4726l1208J7322l8715o1204N5962M6344M7677r5218k8111
6509A1581J9639N6035L9462j3580n0462l2746l4425Q9404J806k2257m0819J4863
6497C8501q745J7429m442m2714j9610N5679K2483p628n1045q2195J130N1720n2742
$$ plain form
6484 -82179 -131634 -111587 -111209 -62161 -20406 -53022 -142822 -82548 -14195 -4321 4158 30072 40210
6471 40210 66842 20044 -77076 -58775 -37129 -112 26727 11209 -46973 -72052 -58341 -39549
6459 -39549 -43036 -15894 -37092 -45301 -26860 -23047 -22768 -12587 -10518 -1541 -56878 -101030 -71892
6446 -71892 -60470 -38895 -36005 -101071 -90324 -58803 -44597 -15087 -38285 -30458 27082 15779
6434 15779 -12748 -34624 11637 28878 107811 85462 46369 30812 4108 -44415 -100596 -94826
6422 -94826 -57908 -2021 -4130 -23534 55399 150905 73169 -35063 -50726 45074 28530 -56252
6410 -56252 -42579 -41432 -71571 3798 66194 78706 82994 66379 38125 -23439 -111643 -73817
6398 -73817 38016 16917 -1610 -12092 -17016 -21883 13476 31642 45371 29456 46907 13833
$$ packed form
6484h2179m9455K0047L78M9048M1755l2616q9800O0274O8353R874Q479K5914J0138
6471D0210K6632m6798r7120J8301K1646L7017K6839j5518n8182k5079J3711J8792
6459c9549l487K7142k1198q209J8441L813K79J0181K069Q977n5337m4152K9138
6446g1892J1422K1575K890o5066J0747L1521J4206K9510k3198P827N7540j1303
6434A5779k8527k1876M6261J7241P8933k2349l9093j5557k6704m8523n6181N770
6422i4826L6918N5887k109j9404P8933R5506p7736j08232j5663R5800j6544q4782
6410e6252J3673J147l0139P5369O2396J2512M288j6615k8254o1564q8204L7826
6398g3817J11833k1099j8527j0482m924m867L5359J8166J3729j5915J7451l3074
$$ plain form
6386 13833 52059 60055 76774 76332 149365 189413 167672 99434 57083 60587 36978 13310 24180
6373 24180 36805 25367 54457 30774 45474 59234 132923 146292 45285 -29907 -69959 -53761
6361 -53761 -53485 -10577 21299 -2070 -38590 -84873 -106508 -29683 104964 115179 42296 -10313
6349 -10313 -31417 22687 17422 2873 -66557 -43978 -45015 -59950 -127830 -101078 -80256 -66662
6337 -66662 -78626 -54051 -33760 -3816 -19003 -40002 -76451 -91987 -113818 -105692 -50661 21108
6325 21108 55013 51289 11263 7737 85051 102593 75224 -2587 5579 -5972 17351 9358 -7100
6312 -7100 -38459 -2589 62585 98332 81452 17403 -14382 479 57931 25428 1087 -3964
6300 -3964 -1188 -12913 -11583 -22295 -55319 -96860 -94252 -49316 -74774 -57404 -93386 -84207 -15063
$$ packed form
6386A3833L8226P996J6719m42P3033M0048k1741o8238m2351L504k3609k3668J0870
6373B4180J2625j1438K9090k3683J4700J3760P3689J3369j01007p5192m0052J6198
6361e3761K76M2908L1876k3369l6520m6283k1635P6825J34647J0215p2883n2609
6349a0313k1104N4104n265j4549o9430K2579j037j4935o7880K6752K0822J3594
6337f6662j1964K4575K0291K9944j5187k0999l6449j5536k1831Q126N5031P1769
6325B1108L3905l724m0026l526P7314J7542k7369p7811Q166j1551K3323p993j6458
6312g100l1359L5870O5174L5747j6880o4049l1785J4861N7452l2503k4341n051
6300c964K776j1725J330j0712l3024m1541K608M4936k5458J7370l5982R179O9144
$$ plain form
6287 -15063 -82255 -87536 -15815 27711 14125 39640 35357 -5305 -55438 -35623 67886 97701
6275 97701 136077 79201 13251 -1403 10287 57700 34796 -124 -19034 -23888 -48127 -56806
6263 -56806 -52910 -66209 -88464 -128742 -84102 -84530 -48148 -48560 -23254 -16139 -76171 -101374 -34339
6250 -34339 -10283 -24896 -10058 -73011 -106587 -75898 -115979 -101204 -36865 1558 34337 16314
6238 16314 -9044 -14326 32289 33739 -13070 -27511 27907 48270 57535 53481 -12450 -95592 -75690
6225 -75690 -74938 -8639 11389 28614 22389 18185 14058 -28065 -21757 25400 67887 61701 80921
6212 80921 41039 -67834 -94008 -100662 -21096 16449 13545 60995 12528 -12654 -64120 -992
6200 -992 33578 1799 -44442 6420 24671 -657 9381 -8212 -59310 -106323 -111835 -132664
$$ packed form
6287a5063o7192n281P1721M3526j3586K5515m283m0662n0133J9815J03509K9815
6275I7701L8376n6876o5950j4654J1690M7413k2904l4920j8910m854k4239q679
6263e6806L896j3299k2255m0278M4640m28L6382m12K5306P115o0032k5203O7035
6250c4339K4056j4613J4838o2953l3576L0689m0081J4775O4339L8423L2779j8023
6238A6314k5358n282M6615J450m6809j4441N5418K0363R265m054o5931q3142J9902
6225g5690P52O6299K0028J7225o225m204m127m2123O308M7157M2487o186J9220
6212H0921l9882j08873k6174o654P9566L7545k904M7450m8467k5182n1466O3128
6200i92L4570l1779m6241N0862J8251k5328J0038j7593n1098m7013n512k0829
$$ plain form
6188 -132664 -140886 -153817 -139099 -139108 -57337 -15479 -40670 -27657 -54629 -50702 -72039 -127690 -86952
6175 -86952 -1104 66166 33248 -1124 -13700 -4479 -2548 -14849 -71811 -61492 -65219 -84450
6163 -84450 -79903 -24862 42491 43862 35859 7915 -54864 -79490 -90503 -74297 -89076 -117292
6151 -117292 -134213 -110414 -63240 -55075 -51138 -3501 -52788 -39897 -22826 -27842 -43721 -41717
6139 -41717 -11626 946 68621 39932 -5579 22384 14599 35395 19652 49639 14391 -14760
6127 -14760 -57120 -113931 -96798 -20554 -4534 32859 26098 41781 16380 35208 -30606 -39055
6115 -39055 20273 22599 35974 51130 94164 61089 16015 -8986 -15178 -2530 8780 -30594
6103 -30594 -81115 -63177 6710 12338 -6848 -92592 -78610 -78255 -44914 12534 27983 50719
$$ packed form
6188a32664q222j2931J4718rQ1771M1858k5191J3013k6972L927k1337n5651M0738
6175h6952Q5848O7270l2918l4372j2576R221J931j2301n6962J0319l727j9231
6163h4450M547N5041O7353J371q003k7944o2779k4626j1013J6206j4779k8216
6151a17292j6921K3799M7174Q165L937M7637m9287J2891J7071n016j5879K004
6139d1717L0091J2572O7675k8689m5511K7963p785K0796j5743K9987l5248k9151
6127a4760m2360n6811J7133P6244J6020L7393o761J5683k5401J8828o5814q449
6115c9055N9328K326J3375J5156M3034l3075m5074k5001o192J2648J1310l9374
6103c0594n0521J7938O9887N628j9186q5744J3982L55L3341N7448J5449K2736
$$ plain form
6091 50719 38406 -15650 -21316 -30065 -41872 -71714 -62109 3714 -2610 35745 35109 17044 70279
6078 70279 26945 -20802 -28067 5125 29030 -49371 -54779 -62157 -54260 -54800 -76841 -101567 -128312
6065 -128312 -85703 -83362 -89620 -70079 -10034 16360 -80297 -60950 -81505 -94439 -83934 -26523
6053 -26523 -15947 -13767 -39131 865 77270 83729 100745 57029 34830 2403 -43567 -103449
6041 -103449 -132006 -146339 -123854 -56931 -39251 -38101 29447 21596 58620 50580 12379 1038
6029 1038 -9477 2337 36914 88650 64993 14587 7691 13743 41219 15310 -31123 -26079 -18527
6016 -18527 -77 -13699 -15585 -30949 -24815 19649 23222 17836 -46951 -42237 -47012 -78738 -49360
6003 -49360 -34582 -9005 -18228 -21544 -77756 -45501 8972 -12455 -74228 -54364 -55661 -30440
$$ packed form
6091E0719j2313n4056n666q749j1807k9842R605O5823o324L8355o36j8065N3235
6078G0279m3334m7747p265L3192K3905p8401n408p378P897n40k2041k4726k6745
6065a28312M2609K341o258J9541O0045K6394r6657J9347k0555j2934J0505N7411
6053b6523J0576K180k5364L9996P6405O459J7016m3716k2199l2427m5970n9882
6041a03449k8557j4333K2485O6923J7680J150O7548p851L7024q040l8201j1341
6029A038j0515J1814L4577N1736k3657n0406o896O052K7476k5909m6433N044P552
6016a8527J8450j3622j886j5364O134M4464L573n386o4787M714m775l1726K9378
6003d9360J4778K5577r223l316n6212L2255N4473k1427o1773J9864j297K5221
$$ plain form
5991 -30440 33746 11205 -17757 -53021 -48848 -57013 -20006 -6842 13368 17914 -32192 -7808
5979 -7808 -33709 -94664 -89624 -87041 -95381 -100020 -149608 -174712 -104153 -20819 -30280 -82672 -78299
5966 -78299 -39997 37220 5684 10305 6046 -26049 -46427 -44548 -24805 -48509 -55963 -19064 14228
5953 14228 34579 14790 43138 59510 35210 22092 85462 74392 69609 39657 -22434 -67602
5941 -67602 -54804 -60040 -76401 -55756 -30311 -74685 -106707 -108729 -96417 -41658 7141 41095
5929 41095 30943 23932 3370 82928 62352 -39228 -27500 9317 -40126 -33709 -37147 -37647 -68433
5916 -68433 -21383 46469 22252 -55855 -151153 -102450 -52497 20734 56452 76019 63525 56514
5904 56514 76523 99336 78550 15122 -17073 -39070 -24144 -24531 -17038 -27062 -30827 -64554 -75532
$$ packed form
5991c0440O4186k2541k8962l5264M173q165L7007J3164K0210M546n0106K4384
5979g808k5901o0955N040K583q340m639m9588k5104P0559Q3334r461n2392M373
5966g8299L8302P7217l1536M621m259l2095k0378J879J9743k3704p454L6899L3292
5953A4228K0351j9789K8348J6372k4300j3118O3370j1070m783k9952o2091m5168
5941f7602J2798n236j6361K0645K5445m4374l2022k022J2312N4759M8799L3954
5929D1095j0152p011k0562P9558k0576j01580J1728L6817m9443O417l438n00l0786
5916f8433M7050O7852k4217p8107r5298M8703M9953P3231L5718J9567j2494p011
5904E6514K0009K2813k0786o3428l2195k1997J4926l87P493j0024l765l3727j0978
$$ plain form
5891 -75532 -42032 14652 41355 -15963 -28744 36509 -12485 -72387 -39148 -8272 -14119 -13088
5879 -13088 20026 28330 73813 51228 4130 1266 3553 -30215 -45543 -20038 28024 -10177
5867 -10177 -74740 -45152 -7409 -3080 40998 87225 95559 47966 70191 10618 -20698 -24161
5855 -24161 -24860 2100 -3775 30002 2828 -48149 -61569 -11374 -4197 38061 15777 -13924 -16447
5842 -16447 -47425 -57341 -58551 6426 96992 67357 58146 18724 -14828 1846 16225 60273
5830 60273 75028 33289 738 681 69109 49864 25382 23479 7898 18096 15821 36696 21036
5817 21036 -5559 -80139 -63569 622 -2608 -42463 -22777 32238 14268 -35090 -69932 -15834
5805 -15834 4676 21632 -2675 -5686 -5911 -1889 -707 -36158 -112586 -104866 -150294 -159230 -114247
$$ packed form
5891g5532L3500N6684K6703n7318j2781O5253m8994n9902L3239L0876n847J031
5879a3088L3114Q304M5483k2585m7098k864K287l3768j5328K5505M8062l8201
5867a0177o4563K9588L7743M329M4078M6227Q334m7593K2225n9573l1316l463
5855b4161o99K6960n875L3777k7174n0977j3420N0195P177M2258k2284k9701k523
5842a6447l0978r916j210O4977R0566k9635r211l9422l3552J6674J4379M4048
5830F0273J4755m1739l2551n7O8428j9245k4482j903j5581J0198k275K0875j5660
5817B1036k6595p4580J6570O4191l230l9855J9686N5015j7970m9358l4842N4098
5805a5834K0510J6956k4307l011k25M022J182l5451p6428P720m5428q936M4983
$$ plain form
5792 -114247 -105461 -91211 -102880 -55124 -39987 -21309 23365 38119 -43565 -51581 9164 -39736
5780 -39736 -73330 -42337 -15397 13890 17143 -14471 -86785 -120630 -101205 -84945 -28193 5903
5768 5903 35249 52397 54834 51949 49089 68551 123315 105304 46634 14473 -5814 -36913 -62368
5755 -62368 -12616 -26430 -28708 -46284 -57601 -25349 32746 -62565 -68503 -11577 203 16343
5743 16343 13037 5850 -42274 -52110 -6866 32126 70294 28018 -35499 -117908 -184544 -171833
5731 -171833 -160258 -129777 -61553 -20940 -78860 -91754 -108836 -81515 -49693 -58995 -82687 -142818
5719 -142818 -127802 -91035 -104107 -36733 -14537 10671 16827 -16181 -59940 -82951 -102968 -95076
5707 -95076 -123283 -113660 -73762 -102810 -93103 -92155 -108343 -73585 -16642 -25504 -62119 -45816 6453
$$ packed form
5792a14247Q786J4250j1669M7756J5137J8678M4674J4754q1684q016O0745m8900
5780c9736l3594L0993K6940K9287L253l1614p2314l3845J9425J6260N6752L4096
5768E903K9346J7148K437k885k860J9462N4764j8011n8670l2161k0287l1099k5455
5755f2368M9752j3814k278j7576j1317L2252N8095r5311n938N6926J1780J6140
5743A6343l306p187m8124r836M5244L8992L8168m2276o3517q2409o6636J2711
5731a71833J1575L0481O8224M0613n7920j2894j7082K7321L1822r302k3692o0131
5719a42818J5016L6767j3072O7374K2196K5208O156l3008m3759k3011k0017P892
5707i5076k8207R623L9898k9048R707R48j6188L4758N6943q862l6615J6303N2269
$$ plain form
5694 6453 19405 -24950 -20768 -32387 -47922 -13344 -19348 -26511 -5471 -36381 -53920 -83890 -78728
5681 -78728 -60956 -76435 -130226 -95955 -88461 -100329 -106035 -45915 -72102 -108718 -107279 -66322
5669 -66322 -8052 -1169 -80997 -57718 -47584 -5723 -32735 -39991 -32780 -75548 -87500 -114068
5657 -114068 -69925 -62072 -81698 -38431 627 -87255 -136497 -124287 -115507 -122532 -91168 -57890
5645 -57890 -27404 19221 -46432 -147548 -75495 9827 18182 -9744 -72582 -77599 -81271 -54957
5633 -54957 -23991 -25998 -46299 -94296 -63517 -73433 -57943 26943 41978 27728 25821 -15643
5621 -15643 7052 -24203 -19234 -3840 -449 16812 24586 -50541 -80155 -69580 -53424 -67309
5609 -67309 -92017 -68158 -65058 -7268 33691 13565 -66633 -79752 -122973 -151445 -130674 -55532
$$ packed form
5694F453J2952m4355M182j1619j5535L4578o004p163K1040l0910j7539k9970N162
5681g8728J7772j5479n3791L4271P494j1868n706O0120k6187l6616J439M0957
5669f6322N8270O883p9828K3279J0134M1861k7012p256P211m2768j1952k6568
5657a14068M4143P853j9626M3267L9058q7882m9242J2210Q780p025L1364L3278
5645e7890L0486M6625o5653j01116P2053Q5322Q355k7926o2838n017l672K6314
5633e4957L0966k007k0301m7997L0779r916J5490Q4886J5035j4250j907m1464
5621a5643K2695l1255M969J5394L391J7261P774p5127k9614J0575J6156j3885
5609f7309k4708K3859L100N7790M0959k0126q0198j3119m3221k8472K0771P5142
$$ plain form
5597 -55532 -12450 -22545 4619 19638 47365 -3451 -26475 -11683 -70550 -91794 -28443 -21474
5585 -21474 -6494 -30210 3380 -8214 -46162 -53946 -68062 -81081 -79915 -61527 -72282 -73216 -67818
5572 -67818 -79571 -58660 -17748 -5747 -15464 8118 32210 -28187 -53685 -69314 -54731 -67171
5560 -67171 -105712 -129895 -19181 22917 25801 29484 -9891 -39111 -13565 -68156 -46021 34239
5548 34239 40207 -3044 14217 16238 45252 98095 88156 44652 17913 -9692 -77478 -58455
5536 -58455 -25871 25309 3951 -23316 -81613 -104529 -52657 29438 -11035 -28366 -38905 -28742
5524 -28742 1695 -15990 -37056 -23960 -39755 -32409 19022 18577 -13293 11836 55089 33920
5512 33920 7302 -24635 -10377 -7328 3796 -5512 6605 -9578 3170 -17275 -29162 -23271
$$ packed form
5597e5532M3082j0095K7164J5019K7727n0816k3024J4792n8867k1244O3351O969
5585b1474J4980k3716L3590j1594l7948p784j4116j3019J166J8388j0755r34N398
5572f7818j1753K0911M0912J2001r717K3582K4092o0397k5498j5629J4583j2440
5560f7171l8541k4183J10714M2098K884L683l9375k9220K5546n4591K2135Q0260
5548C4239N968m3251J7261K021K9014N2843r939m3504k6739k7605o7786J9023
5536e8455L2584N1180k1358k7267n8297k2916N1872Q2095m0473j7331j0539J0163
5524b8742L0437j7685k1066J3096j5795P346N1431m45l1870K5129M3253k1169
5512C3920k6618l1937J4258L049J1124r308J2117j6183J2748k0445j1887N891
$$ plain form
5500 -23271 -6812 -30186 -5440 -39909 -47687 33190 41216 -12740 -46984 -42988 -43972 -62890 -16806
5487 -16806 -13034 -44822 -80452 -106328 -63113 -46831 -25168 -34920 -81510 -65059 -35303 -32334
5475 -32334 -19362 16322 -30979 -25245 -31469 -22235 29977 70604 67404 31698 -40952 -67153 -75378
5462 -75378 -93714 -33877 -29412 16206 897 -15839 -48798 -58775 -97100 -147797 -96715 -81912
5450 -81912 -95290 -30625 -72251 -49189 -49203 -87672 -48746 15352 14027 -2048 -72760 -131524 -161110
5437 -161110 -178075 -140625 -67475 -61003 -39401 -71283 -723 21434 22700 20037 26547 15338
5425 15338 -19849 -9876 21298 23809 20702 56344 76165 46582 -47013 -62614 -76353 -55717
5413 -55717 -50395 -25543 -17978 -42139 -34023 1444 -9529 -13509 -23284 -2863 16405 12638 44544
$$ packed form
5500b3271J6459k3374K4746l4469p778Q0877Q026n3956l4244L996r84j8918M6084
5487a6806L772l1788l5630k5876M3215J6282K1663r752m6590J6451K9756K969
5475c2334J2972L5684m7301N734o224R234N2212M0627l200l5706p2650k6201q225
5462g5378j8336N9837M465M5618j5309j6736l2959r977l8325n0697N1082J4803
5450h1912j3378O4665m1626K3062j4l8469L8926O4098j325j6075p0712n8764k9586
5437a61110j6965L7450P3150O472K1602l1882P0560K2157J266k663O510j1209
5425A5338l5187R973L1174K511l107L5642J9821k9583r3595j5601j3739K0636
5413e5717N322K4852P565k4161Q116L5467j0973l980r775K0421J9268l767L1906
$$ plain form
5400 44544 51968 25052 42503 41691 29877 61992 58006 16930 -5844 -18197 -57686 -95383 -65150
5387 -65150 21526 37735 37697 -28168 -85140 -64818 -25761 -12883 36252 46733 -47400 -56075 -81162
5374 -81162 -64068 -111812 -134397 -149813 -123961 -94967 -94714 -66189 -43410 -20460 -16123 -25080 -56383
5361 -56383 -91439 -103876 -89550 -39922 -59202 -96724 -83847 -98225 -108123 -71166 28613 66277
5349 66277 81406 35739 -24512 -75658 -71329 -50996 5282 -13591 -21141 -36466 -55528 -3494
5337 -3494 25164 -24 -40932 -62403 -54581 -38170 -24459 -31972 -115099 -146878 -107771 -51602
5325 -51602 5718 66390 58698 60769 39108 40335 53269 63026 -12877 -68111 -32386 29865 65366
5312 65366 92061 54493 -3415 -41370 -94417 -107188 -80375 -35697 -32059 -11185 -78718 -48563
$$ packed form
5400D4544P424k6916J7451q12j1814L2115l986m1076k2774j2353l9489l7697L0233
5387f5150Q6676J6209l8o5865n6972K0322L9057J2878M9135J0481r4133q675k5087
5374h1162J7094m7744k2585j5416K5852K8994K53K8525K2779K2950M337q957l1303
5361e6383l5056j2437J4326M9628j9280l7522J2877j4378r898L6957R9779L7664
5349F6277J5129m5667o0251n1146M329K0333N6278j8873p550j5325j9062N2034
5337c494K8658k5188m0908k1471P822J6411J3711p513q3127l1779L9107N6169
5325e1602N7320O0672p692K071k1661J227J2934R757p5903n5234L5725O2251L5501
5312F5366K6695l7568n7908l7955n3047j2771K6813M4678L638K0874o7533L0155
$$ plain form
5300 -48563 -15598 58072 14501 -91043 -74035 -18863 -7623 -773 23651 23914 32841 53049
5288 53049 6555 -37594 1979 -463 11750 -7919 -12082 -29353 10069 78172 57942 59364
5276 59364 120880 87604 52525 46109 -2505 -27266 -11669 -46752 -64444 -63484 -11657 20620
5264 20620 -37681 -73188 -96581 -101222 -60372 -27677 -59050 -99404 -75472 -65296 -80395 -72650
5252 -72650 -39550 -29191 -10454 38751 34800 20879 -30565 -27310 -61925 -77728 -93143 -96627
5240 -96627 -64996 -48916 -76413 -27668 -1613 8783 -31121 -44305 -44750 -50043 -23713 40305
5228 40305 66234 34250 28634 11805 -10642 -22522 -11402 -7867 2428 -23000 -19013 -4100
5216 -4100 -64705 -28103 21133 69840 34881 2160 -11311 -57073 -66482 -85675 -21157 14751
$$ packed form
5300d8563L2965P3670m3571j05544J7008N5172J1240O850K4424K63Q927K0208
5288E3049m6494m4149L9573k442J2213j9669m163j7271L9422O8103k0230J422
5276E9364O1516l3276l5079o416m8614k4761J5597l5083j7692R60N1827L2277
5264B0620n8301l5507k3393m641M0850L2695l1373m0354K3932J0176j5099P745
5252g2650L3100J0359J8737M9205l951j3921n1444L255l4615j5803j5415l484
5240i6627L1631J6080k7497M8745K6055J0396l9904j3184m45n293K6330O4018
5228D0305K5929l1984n616j6829k2447j1880J1120L535J0295k5428L987J4913
5216d100o0605L6602M9236M8707l4959l2721j3471m5762r409j9193O4518L5908
$$ plain form
5204 14751 28587 -14543 7643 49484 6174 -10428 7123 81850 108267 77435 58600 16664
5192 16664 41685 77722 95625 62295 28499 15539 -56975 -90824 6644 96104 74637 59940
$$ packed form
5204A4751J3836m3130K2186M1841m3310j6602J7551P4727K6417l0832j8835m1936
5192A6664K5021L6037J7903l3330l3796j2960p2514l3849R7468Q9460k1467j4697
$$ [...]
##END NTUPLES=NMR SPECTRUM
##END=
