##TITLE=317097
cc 43204
467/4
adrs
benw
##JCAMPDX= 6.0         $$ Bruker NMR JCAMP-DX V2.0
##DATA TYPE= NMR SPECTRUM
##DATA CLASS= NTUPLES
##ORIGIN= Bruker BioSpin GmbH
##OWNER= nmr
$$ XWIN-NMR		Version 3.5
$$ Wed Jul 12 09:03:43 2006 GMT Daylight Time (UT+1h)  MAYBRIDGE\nmr@NMR_250MHZ
##.OBSERVE FREQUENCY= 250.131544655141
##.OBSERVE NUCLEUS= ^1H
##.ACQUISITION MODE= SIMULTANEOUS (DQD)
##.ACQUISITION SCHEME= undefined
##.AVERAGES= 3
##.DIGITISER RES= 18
##SPECTROMETER/DATA SYSTEM= dpx250
##.PULSE SEQUENCE= zg30
##.SOLVENT NAME= CDCl3
##.SHIFT REFERENCE= (INTERNAL, CDCl3, 0, 16.522)
##AUDIT TRAIL= $$ (NUMBER, WHEN, WHO, WHERE, WHAT)
$$ ##TITLE= Audit trail, XWIN-NMR		Version 3.5
$$ ##JCAMPDX= 5.01
$$ ##ORIGIN= Bruker BioSpin GmbH
$$ ##OWNER= nmr
$$ C:/u/data/dgb/nmr/ADRS/15690/pdata/1/auditp.txt
$$ ##AUDIT TRAIL=  $$ (NUMBER, WHEN, WHO, WHERE, WHAT)
(   1,<2006-02-08 11:19:17.94 +000>,<MAYBRIDGE\nmr>,<NMR_250MHZ>,
      <created by zg, POWCHK disabled, PULCHK disabled
       terminated by command 'halt'
       configuration hash MD5:
       84 BC 41 DB A1 6E 1D 46 DA 25 12 A5 C1 ED C5 3A
       data hash MD5: 64K
       9D A8 3B F9 A8 5C A9 01 95 ED 3C 10 B2 4D 39 46>)
(   2,<2006-02-08 11:19:24.52 +000>,<MAYBRIDGE\nmr>,<NMR_250MHZ>,
      <Start of raw data processing
       ef LB = 0.3 FT_mod = 6 PKNL = 1 SI = 32K 
       data hash MD5: 32K
       77 8A BB 8A 96 60 7C F6 82 F9 77 D0 2B BD 08 69>)
(   3,<2006-02-08 11:19:26.38 +000>,<MAYBRIDGE\nmr>,<NMR_250MHZ>,
      <apk 
       data hash MD5: 32K
       4C D1 F3 79 DB D1 24 36 38 E5 CC DD 61 24 24 BC>)
(   4,<2006-02-08 11:19:27.30 +000>,<MAYBRIDGE\nmr>,<NMR_250MHZ>,
      <abs ABSG = 5 
       data hash MD5: 32K
       48 BB D6 57 EB 3C 6D D3 E2 DB AB 34 49 B6 B4 21>)
$$ ##END=
$$ 
$$ hash MD5
$$ 1E D5 57 97 E6 73 A2 3B 05 67 08 C2 3E 1B 25 9F
##$RELAX= 
##$RELAX= 
##$RELAX= 
##$RELAX= 
##$RELAX= 
##$RELAX= 
##$RELAX= 
$$ Bruker specific parameters
$$ --------------------------
##$DU= <C:\Restored>
##$EXPNO= 15690
##$NAME= <ADRS>
##$PROCNO= 1
##$TYPE= <nmr>
##$USER= <dgb>
##$AMP= (0..31)
100 100 100 100 100 100 100 100 100 100 100 100 100 100 100 100 100 100 
100 100 100 100 100 100 100 100 100 100 100 100 100 100 
##$AQSEQ= 0
##$AQ_mod= 3
##$AUNM= <au_zg>
##$AUTOPOS= <9 >
##$BF1= 250.13
##$BF2= 250.13
##$BF3= 250.13
##$BF4= 250.13
##$BF5= 500.13
##$BF6= 500.13
##$BF7= 500.13
##$BF8= 500.13
##$BYTORDA= 1
##$CFDGTYP= 0
##$CFRGTYP= 5
##$CHEMSTR= <none>
##$CNST= (0..31)
1 1 145 1 1 1 1 1 1 1 1 1 1 1 1 1 1 1 1 1 1 1 1 1 1 1 1 1 1 1 1 1 
##$CPDPRG= <>
##$CPDPRG1= <>
##$CPDPRG2= <>
##$CPDPRG3= <>
##$CPDPRG4= <mlev>
##$CPDPRG5= <mlev>
##$CPDPRG6= <mlev>
##$CPDPRG7= <mlev>
##$CPDPRG8= <mlev>
##$CPDPRGB= <>
##$CPDPRGT= <>
##$D= (0..31)
0 1 0 0 0 0 0 0 0 0.06 0 0 0 0 0 0 0.0002 0 0 0 0 0 0 0 0 0 0 0 0 0 0 
0 
##$DATE= 1139397554
##$DBL= (0..7)
120 120 120 120 120 120 120 120 
##$DBP= (0..7)
150 150 150 150 150 150 150 150 
##$DBP07= 0
##$DBPNAM0= <>
##$DBPNAM1= <>
##$DBPNAM2= <>
##$DBPNAM3= <>
$$ [...]
##$SUBNAM6= <"">
##$SUBNAM7= <"">
##$SUBNAM8= <"">
##$SUBNAM9= <"">
##$SW= 20.6930455092707
##$SWIBOX= (0..15)
0 0 3 0 0 0 0 0 0 0 0 0 0 0 0 0 
##$SW_h= 5175.983436853
##$TD= 65536
##$TD0= 1
##$TE= 293.16
##$TE2= 300
##$TE3= 300
##$TEG= 300
##$TL= (0..7)
0 120 120 120 120 120 120 120 
##$TP= (0..7)
150 150 150 150 150 150 150 150 
##$TP07= 0
##$TPNAME0= <>
##$TPNAME1= <>
##$TPNAME2= <>
##$TPNAME3= <>
##$TPNAME4= <>
##$TPNAME5= <>
##$TPNAME6= <>
##$TPNAME7= <>
##$TPOAL= (0..7)
0.5 0.5 0.5 0.5 0.5 0.5 0.5 0.5 
##$TPOFFS= (0..7)
0 0 0 0 0 0 0 0 
##$TUNHIN= 0
##$TUNHOUT= 0
##$TUNXOUT= 0
##$USERA1= <user>
##$USERA2= <user>
##$USERA3= <user>
##$USERA4= <user>
##$USERA5= <user>
##$V9= 5
##$VALIST= <valist>
##$VCLIST= <CCCCCCCCCCCCCCC>
##$VD= 0
##$VDLIST= <DDDDDDDDDDDDDDD>
##$VPLIST= <PPPPPPPPPPPPPPP>
##$VTLIST= <TTTTTTTTTTTTTTT>
##$WBST= 1024
##$WBSW= 4
##$XGAIN= (0..3)
0 0 0 0 
##$XL= 0
##$YL= 0
##$YMAX_a= 69728
##$YMIN_a= -86969
##$ZGOPTNS= <>
##$ZL1= 120
##$ZL2= 120
##$ZL3= 120
##$ZL4= 120
##$ABSF1= 16.522
##$ABSF2= -4.171173
##$ABSG= 5
##$ABSL= 3
##$ALPHA= 0
##$AQORDER= 0
##$ASSFAC= 0
##$ASSFACI= 0
##$ASSFACX= 0
##$ASSWID= 0
##$AUNMP= <proc_1d>
##$AZFE= 0.1
##$AZFW= 0.1
##$BCFW= 0
##$BC_mod= 0
##$BYTORDP= 0
##$COROFFS= 0
##$CY= 12.5
##$DATMOD= 1
##$DC= 0
##$DFILT= <>
##$DTYPP= 0
##$F1P= 14.0000005364418
##$F2P= -0.99999901652339
##$FCOR= 0.5
##$FTSIZE= 32768
##$FT_mod= 6
##$GAMMA= 0
##$GB= 0
##$INTBC= 1
##$INTSCL= 1
##$ISEN= 128
##$LB= 0.3
##$LEV0= 0
##$LPBIN= 0
##$MAXI= 10000
##$MC2= 0
##$MEAN= 0
##$ME_mod= 0
##$MI= 0
##$NCOEF= 0
##$NC_proc= -6
##$NLEV= 6
##$NOISF1= 0
##$NOISF2= 0
##$NSP= 0
##$NTH_PI= 0
##$NZP= 0
##$OFFSET= 16.522
##$PC= 1
##$PHC0= 100.0283
##$PHC1= 5.378102
##$PH_mod= 1
##$PKNL= yes
##$PPARMOD= 0
##$PSCAL= 4
##$PSIGN= 0
##$REVERSE= no
##$SF= 250.13
##$SI= 32768
##$SIGF1= 0
##$SIGF2= 0
##$SINO= 400
##$SIOLD= 32768
##$SREGLST= <1H.CDCl3>
##$SSB= 0
##$STSI= 32768
##$STSR= 0
##$SW_p= 5175.98343685301
##$SYMM= 0
##$S_DEV= 0
##$TDeff= 65536
##$TDoff= 0
##$TI= <Analysis number 999999
Compound Code 99
Book Reference 9
Project Code 9>
##$TILT= no
##$TM1= 0
##$TM2= 0
##$TOPLEV= 0
##$USERP1= <user>
##$USERP2= <user>
##$USERP3= <user>
##$USERP4= <user>
##$USERP5= <user>
##$WDW= 1
##$XDIM= 32768
##$YMAX_p= 328800833
##$YMIN_p= -373343
$$ End of Bruker specific parameters
$$ ---------------------------------
##NTUPLES= NMR SPECTRUM
##VAR_NAME=  FREQUENCY,     SPECTRUM/REAL,   SPECTRUM/IMAG
##SYMBOL=    X,             R,               I
##VAR_TYPE=  INDEPENDENT,   DEPENDENT,       DEPENDENT
##VAR_FORM=  AFFN,          ASDF,            ASDF
##VAR_DIM=   32768,         32768,           32768
##UNITS=     HZ,            ARBITRARY UNITS, ARBITRARY UNITS
##FACTOR=    0.157963299565203, 1,           1
##FIRST=     4132.6476996994, 0,             0
##LAST=      -1043.33573715361, 0,           0
##MIN=       -1043.33573715361, -373343,     0
##MAX=       4132.6476996994, 328800833,     0
$$ Real data points
##PAGE= N=1
##DATA TABLE= (X++(R..R)), XYDATA
$$ [...]
28009a52323k4553P2411k1274L9786R347N5729L9396k390Q2233K712m1768o5490
27997f184n0014L8515P0382k3543R2732K6109j32807o5672j0268O9808j151m6270
27985c8363J6810m3417O7533N6066r170q6430L6140N3219p3916q425L0962j7206
27973a6197J3699P3291j4320l6882m3157l9758L6157L2032J13243l1965j06105
27962a9962j6830N8537O4488j10811m9091p2425K6124K0427P5425J47772k938
27951A20716o0804j15803q5104K0198l6599R9882Q3299Q0970j8391K8342P5258
27940A91964k8023j6007J9184m7182k7912N0313K8061r1984m9152k9515p9383
27929g9636R243r176Q070N2660J76873J55659o8613j53504K3378k4913m3164O7629
$$ y = [-152323, -176876, -104465, -125739, -85953, -76606, -20877, 18519, 16129, 98362, 101074, 59306, -6184, -56198, -17683, 52699, 29156, 121888, 147997, 15190, -50482, -60750, 9058, 7907, -38363, -21553, -64970, 2563, 58629, 49459, -36971, -831, 52388, -21528, -29953, 1009, -16197, -2498, 70793, 56473, 19591, -23566, -63324, -27167, 4865, 118108, 86143, -19962, -36792, 21745, 86233, -24578, -73669, -146094, -119970, -99543, -24118, 123654, 120716, 59912, -55891, -140995, -120797, -157396, -57514, 25785, 106755, 88364, 116706, 191964, 163941, 147934, 167118, 119936, 92024, 142337, 170398, 78414, 29262, -253, -79636, -70393, -79569, -71499, -18839, 158034, 313693, 245080, 91576, 114954, 90041, 46877, 114506]
27917A14506m6734o8841J47181Q657j52205m8196k0545k0879J25694J47708K8140
27906B14486r9506j27403j08167J241P1684K8142j02476q418P9623k3861j0831
27895h5486J1046L5588p2231M4100J7293p3097n407J01017L2822P96N5315J14519
27883A76275o0759n1266j14296M8364K6050l9471k8386L7474M0280k7764n1368
27872d4867j1123O1859j0981O3940j1602j8838k3661P2367k0646K8371J130m1680
27860D4269M4084k942q9821j29214j8976R8513J37216K1327k9935q318l4183K4562
27848E6582J00508J0656p1511k513n3473j00045o0740J40117P162o1339N6177
27837B1581K0994P163M3699N340k7158j3445m4428K2745J2222l9800l0136P9165
$$ y = [114506, 67772, -1069, 146112, 154769, 2564, -45632, -66177, -87056, 38638, 186346, 214486, 114980, -12423, -120590, -119349, -47665, -19523, -121999, -130417, -50794, -74655, -85486, -74440, -38852, -111083, -66983, -49690, -122787, -128194, -27177, 5645, 6441, 61756, 176275, 115516, 64250, -50046, -1682, 24368, -15103, -43489, -6015, 34265, 6501, -44867, -55990, 5869, -5112, 58828, 47226, 28388, 4727, 77094, 56448, 84819, 85949, 44269, 88353, 85411, -4410, -133624, -152600, -54087, 83129, 104456, 74521, 66203, 32020, 56582, 157090, 167746, 96235, 93722, 40249, -59796, -120536, 19581, 26743, -34596, 21581, 42575, 49738, 93437, 98777, 71619, 58174, 13746, 36491, 48713, 8913, -21223, 57942]
27825E7942J16876r8572j26584j8672R155J35107L88m2260m8939O4216M2393L650
27813I4700k3804L1774J4439k0112o3698O6206R491l8660Q792j2128J995m716
27801F4279L0300O5510L389m1748r5739p5042l1690N9963N2403O8232M626J5637
27789A20120k9721o1316m4054p8884L5455P7358l9023k9749M2909J8623n4709
27778d2991n3347K5222N9636m357P0196M5245l8720l1854p2926k0323n2043J7740
27766i8522j6682o313J34303L7645o7968o6327l298n5736p141m2170K6181N6759
27754a09269N8565j1983M5287N5096Q8307j16287n5285J5716p5975k7071J32040
27743h59L2524N8457O9304n8051q1475Q9412p1102o0973K105m5452j5538M9520
$$ y = [57942, 174818, 76246, -50338, -69010, -59855, 75252, 75640, 33380, -15559, 48657, 91050, 94700, 70896, 102670, 117109, 96997, 33299, 99505, 108996, 70336, 79128, 67000, 68995, 64279, 94579, 160089, 163478, 121730, 25991, -49051, -80741, -20778, 31625, 99857, 104483, 120120, 90399, 29083, -14971, -93855, -58400, 18958, -20065, -49814, -6905, 11718, -42991, -96338, -71116, -11480, -15837, 54359, 99604, 60884, 29030, -43896, -64219, -116262, -98522, -115204, -121517, 12786, 50431, -17537, -83864, -87162, -142898, -150039, -192209, -166028, -109269, -50704, -62687, -17400, 37696, 126003, 9716, -45569, -29853, -105828, -132899, -859, 31665, 90122, 159426, 101375, 19900, 109312, 38210, -22763, -20658, -66110, -81648, -32128]
27731c2128P2660M5191j3685p5316K3602J15683n4338m9918n0040K2843J1744
27720A6298k3725K649l2517m4034l2683M2561N2639N348O788j4667J5358k6698
27708c2683p4551N8661k2110J9686P4652J1515k1419Q1625L3140R640k2765p4259
27696D1132J0915R4696K2150N6516m5386j49577j5959K0091J955n1311r0401l526
27684a08705J15915L5106M3284K4936r5565q3078j0260L4217k5834P9432Q5534
27673I4982j8039J282k2447j667o3367J8739L8908p5304l4064L7472M2739L9348
27661E8582K2358j1992p5048j15644l7325J03604J22762Q7286n05j17264j30863
27650i4049l7555J1860J19383K368M9905Q2488l4209r9316p7974k0567j4128J000
$$ y = [-32128, 40532, 85723, 72038, -3278, 20324, 136007, 81669, 31751, -18289, 4554, 16298, -7427, -4778, -37295, -81329, -114012, -71451, -18812, -13464, -6676, -21343, -5985, -32683, -107234, -48573, -70683, -50997, 23655, 35170, 13751, 95376, 128516, 138156, 115391, 41132, 52047, 146743, 168893, 225409, 180023, 30446, 14487, 34578, 36533, -14778, -105179, -108705, 7210, 42316, 85600, 110536, 14971, -68107, -78367, -44150, -69984, 9448, 94982, 76943, 78225, 55778, 54111, -9256, 9483, 48391, -26913, -60977, -23505, 19234, 58582, 80940, 68948, -6100, -121744, -159069, -55465, 67297, 154583, 154078, 36814, -94049, -131604, -119744, -361, 2007, 51912, 134400, 100191, 875, -77099, -97666, -111794, -110794]
27638a10794m4647K9123P8846p240m342J11648k1350q0279N8611N1959m7641m8375
27626c4481k4551l9002N083k3053j0648L218R3149Q4959L7245p149n9276j18274
27614i2780k3994n1480j4223m479J38856Q9801n3462k3365J18414l848m8983P250
27602C7707J5061L4307k1457R882Q8906j19200n9652j03488J8710L5865J3723
27591d9636L9272J4899K9386J05220j391j22145p5829L7325J04885j00035j00779
27580a18828j6616J9272r7967k0789P6075J37758N362m3883m7631m0436K6531
27569a21152J22617M6266k0525j4709O98K011K5076L7493O0819k306j9356O4391
27557A81323l1560o2443j13692n9924L4618q5786m5117P9973N4712o5313M2608
$$ y = [-110794, -155441, -126318, -47472, -54712, -59054, 52594, 31244, -49035, 9576, 61535, 13894, -34481, -59032, -98034, -92951, -116004, -126652, -123434, -30285, 54674, 91919, 84770, 25494, -92780, -116774, -168254, -182477, -186956, -48100, 41701, -11761, -35126, 83288, 79440, 30457, 37707, 52768, 87075, 65618, 75500, 164406, 45206, -14446, -117934, -99224, -63359, -49636, -10364, 4535, 33921, 139141, 137750, 15605, -60224, -22899, 81986, -18049, -118828, -135444, -116172, -214139, -234928, -158853, -21095, -15733, -59616, -107247, -147683, -121152, 1465, 47731, 27206, 12497, 13195, 15206, 40282, 77775, 138594, 136288, 116932, 181323, 149763, 87320, -26372, -86296, -51678, -137464, -182581, -102608, -47896, -113209, -70601]
27546g0601L6930j4365J01704j5061j6973j28277m2227O4706J28j9200N9775O3346
27534A9885p8542k7436J0781J2823r473J4034l5186N1899P8246q819O2684l775
27522H7121j10409o6866m0300J1764m751m478M0979J8212P6790q0161m2374Q7907
27510b6566O6322j4683n5121K0325K4442Q1374Q883K3036K7006j17415j28602
27499i0999n6942J1343O004J19331N6845j3857n5341N018L4923O8664J63762O6175
27487C14926r3363m6975j14978L2197J680j20367l3447L5415P0216o391m2596
27476c683N7450p738j4663o3295m9544J3088M8683J9117J5581k2735l4109n6478
27464i8326N803R7507L8233l2051L502K5873m6671K5088J9840k0837P708P0347
$$ y = [-70601, -33671, -48036, 53668, 38607, 21634, -106643, -148870, -84164, -84036, -103236, -43461, 19885, -58657, -86093, -75312, -62489, -71962, -57928, -93114, -41215, 37031, 28212, 90896, 87121, -23288, -90154, -130454, -118690, -123441, -127919, -86940, -68728, 8062, -72099, -114473, -26566, 39756, 25073, -30048, -9723, 14719, 96093, 104976, 128012, 155018, 37603, -90999, -147941, -136598, -130594, -11263, 45582, 31725, -23616, -18598, 16325, 84989, 248751, 314926, 221563, 174588, 59610, 91807, 93487, -26880, -60327, -24912, 45304, 38913, -3683, 53767, 46029, 31366, -31929, -81473, -68385, -19702, -585, 14996, -7739, -41848, -98326, -92523, 4984, 43217, 11166, 14668, 40541, -6130, 18958, 38798, 17961, 25669, 96016]
27452I6016P7416L5593r4106q1918R34l4563R875L5897O5712k5188j05691J1626
27440h397l7139k1377J4092P9439O2268p4736o4139k7535k6503K0529j4836O9464
27428b8870N4346J23804J06321J819q4326o1837o9671k8184J1074l924n5891o3951
27416i9290r3633N3522J45048O4602Q7945r5084r8980k3101k8609j644K8569Q2240
27404B1585R3269O4861j26755j14455j27532N7810N9874N5183P9316J3548l5287
27393D1417m6976k8788J3760J8087J2324r4784J5352j3739O3534J9015r1686m6340
27381a38824J1615m2442L022K9401j6936o593q2067J08076J31904L1054M2964
27370G1174n033l7145M7174P035n5996j01811n1257j4391O8153L9242O1405K7506
$$ y = [96016, 173432, 209025, 114919, 33001, 33935, -628, 9247, 45144, 110856, 85668, -20023, -8397, -45536, -66913, -52821, 26618, 88886, 14150, -49989, -77524, -104027, -83498, -98334, -28870, 25476, 149280, 255601, 257420, 173094, 111257, 41586, 13402, 24476, 20552, -35339, -99290, -192923, -139401, 5647, 70249, 158194, 63110, -35870, -58971, -87580, -89224, -60655, 21585, 114854, 179715, 52960, -61495, -189027, -131217, -71343, -16160, 63156, 76704, 41417, -5559, -34347, -20587, -2500, 9824, -84960, -69608, -83347, -19813, -798, -92484, -138824, -127209, -169651, -166629, -137228, -154164, -160757, -242824, -134748, -2844, 28210, 71174, 66141, 28996, 76170, 83205, 27209, -74602, -125859, -140250, -72097, -32855, 28550, 56056]
27358E6056P8525N4896l1490p1984O576l7263M0244M887j72326k187N981K2352
27346d5733L1615J9231O3393k5611r7305q6404M3238R7870J2422l7814O1857J23143
27334A59902p406o7463j22408J3131M1710L1317K1460m8287p7311J5305R4238
27323E4188L3112n2514K9571Q9221P3170m1582o5575j07702n6681R3288L7935
27312H6431j19483p0032l8788J717R9846J28261R8793j0126q3962j6277m5629
27301C0751k9694m4981o9845L2354k0962j6964O3840J7981j48266p4316R6844
27290a63258R2414O1046P9306r325p8810j10980K7502J20633M3646J0720r480
27279F3414k3689j9453M6578J2525j6456l2383n2599p0288K8714J02261j8150
$$ y = [56056, 134581, 189477, 157987, 86003, 92579, 55316, 95560, 100447, -71879, -74066, -68085, -45733, -14118, 5113, 68506, 42895, -54410, -140814, -97576, 294, 12716, -25098, 36759, 159902, 152496, 85033, -37375, -24244, 17466, 48783, 70243, 21956, -55355, -40050, 54188, 87300, 34786, 64357, 153578, 226748, 185166, 119591, 11889, -44792, 48496, 86431, -33052, -103084, -141872, -140155, -40309, 87952, 186745, 176619, 92657, 76380, 30751, 1057, -43924, -113769, -81415, -102377, -119341, -55501, -37520, -185786, -260102, -163258, -70844, -9798, 69508, 60183, -18627, -129607, -102105, 18528, 62174, 72894, 63414, 39725, 20272, 66850, 79375, 62919, 30536, -22063, -92351, -63637, 38624, 20474]
27268B0474j9121j03657o9523M6264P0900K886L5444J9217L0147O7611M2266K6211
27256A69119q2669n2370L4538m7819j08322l6313l3133J26681J10262m0584o1198
27245b1808l799N0217K1733o3687m9057L1043K4665n2264J4945M1609p0438l5961
27233a12802L6845m6773N6372Q7730l0028p9929N4852K8560j4003J21463O4426
27222A66713o6808l6981M760j44180j01561p3671O4845P1577J8219K3965J6121
27211e7001R9031J03242R012L597r2673k8182M5826K7480m2553K8551N2808K1672
27199A70810k1646l3624r785k2717r2008m5036K1908r6049j00462J3539J03389
27188a11681M6625J1434k5193J26838O5578k8175M096o8349n335j9529N9331j1973
$$ y = [20474, 1353, -102304, -171827, -125563, -54663, -51777, -16333, 2884, 33031, 100642, 142908, 169119, 86450, 34080, 68618, 20799, -87523, -123836, -156969, -30288, 79974, 39390, -21808, -25607, 24610, 46343, -17344, -66401, -35358, -10693, -62957, -48012, -6403, -76841, -112802, -75957, -122730, -66358, 21372, -8656, -88585, -33733, -5173, -19176, 102287, 166713, 99905, 62924, 67684, -76496, -178057, -251728, -186883, -115306, -97087, -73122, -57001, 42030, 145272, 154284, 157881, 65208, 37026, 82852, 110332, 67779, 96330, 149138, 170810, 149164, 115540, 105755, 83038, -8970, -54006, -32098, -128147, -228609, -215070, -111681, -65056, -53622, -78815, 48023, 113601, 85426, 89522, 21173, 15838, -3691, 55640, 43667]
27176D3667n1644J4552J8574m0417j4667J8374o0756L4281o301O3663q0548n5358
27164a16580O4895M5022r304L1473l9675N3562J5987o7103k35L8814n9185M1285
27152a044k9236l6957n6190L7838k2943N7519O5451o2886l9511N1973J8897q7987
27140a05076P6670l5754j1369k1548j2529O9577P2830O3417j07175j29825N4610
27129h6172j6741M8168M2884J26057k3013l6571m0728J595j6313J0912K4583n787
27117B8874K8696J6206k9824m5730o3250M326K0080O8847q7138k9106K573k3825
27105a09271q274M588Q1600O7149l7358M7538R8294M0501M0003P1786p9773j17296
27093I9487l8696q7574k9406P019j2526k8628N8034l3448r988P7163J4075m3705
$$ y = [43667, -7977, 6575, 25149, -15268, -29935, -11561, -72317, -38036, -44337, 19326, -61222, -116580, -51685, -6663, -15967, 15506, -24169, 29393, 45380, -21723, -21958, 16856, -42329, -1044, -30280, -67237, -123427, -85589, -108532, -51013, 14438, -48448, -87959, -35986, -17089, -105076, -28406, -64160, -75529, -97077, -109606, -40029, 32801, 96218, -10957, -140782, -86172, -102913, -54745, -11861, 114196, 91183, 54612, 13884, 15479, -834, 10078, 34661, 28874, 57570, 73776, 43952, -1778, -65028, -60702, -40622, 28225, -58913, -88019, -85446, -109271, -117545, -112957, -31357, 35792, -1566, 45972, 144266, 184767, 224770, 296556, 216783, 99487, 60791, -26783, -56189, -49170, -61696, -90324, -32290, -65738, -75726, 1437, 15512, -28193]
27081b8193Q9219p2464n2243P9160N4893M6945J023l938r281L5699o3211j8346
27069E9263L0095j02216o2733M8167P4132Q092L893p9351o0123j5478N1344L4319
27057a0596J3020n088l2370K1415N2526J49036l9794m2490o3898q4380L1215j1027
27045b2431n3418J09891o6819m98L2793J6278L9476j6714n566k5846K4693k4701
27033G138k267N2039L6579L728m3945p7522l3772p3433M7408m5226j0192M4108
27021i5357Q623R7016N5872j1221l3450q3990Q6762J03955p5047p4933l3443q336
27009f3549k9445k3490K3720L4732L8142R3945o063j51254J5920P6699O9967R576
26997H8900n8849q4526Q0440q856R622M0693m3836m3874L3172k9773o7098L0271
$$ y = [-28193, 61026, -11438, -63681, 15479, 70372, 117317, 118340, 114402, 105121, 140820, 77609, 59263, 89358, -12858, -75591, -27424, 46708, 54800, 58693, -20658, -80781, -96259, -44915, -10596, 2424, -2664, -35034, -13619, 38907, 187943, 148149, 105659, 41761, -42619, -11404, -22431, -75849, 34042, -32777, -33275, -482, 15796, 55272, 38558, 32992, 7146, 31839, 7138, 4871, 56910, 93489, 97217, 53272, -24250, -58022, -131455, -84047, -129273, -139465, -95357, -86734, 10282, 66154, 54933, 21483, -62507, 24255, 128210, 53163, -21770, -55213, -63549, -92994, -116484, -92764, -58032, -19890, 74055, 67992, -83262, -67342, 9357, 79324, 88900, 30051, -54475, 25965, 17109, 26731, 67424, 23588, -20286, 12886, -16887, -83985, -53714]
26985e3714n7760j39681N192P4862O2954J6597P1281J9558R4552o7168m361L7048
26973E9360N5505Q630o6381l6761p5923n7149M554j2968Q6218J0306o9300o281
26961a00190O961N5057P2896n7059j2535L3448Q116N2118P6725q7126q8320j1583
26949e1492K7671N513o1628m794J2193L0939Q6189K1362m5069O6027P5712k0215
26937A42408r1302j7545O144N9481M8593L1416q2955n3446N125k1736m1037m7440
26925f2294K8211K4738M1558p126P5079n8565m2300p4554O1591N1149L3981r9547
26913b8079J4690Q2426k5012p7381q2201J0829L6182o3204k461O2998P5028k2350
26901a8535K1778Q3886J2718j00212m849M2381p1925l6561J0324K0089K1386k1327
$$ y = [-53714, -111474, -251155, -245963, -171101, -108147, -91550, -20269, -711, 93841, 26673, 22312, 59360, 114865, 123495, 57114, 20353, -55570, -112719, -108165, -121133, -34915, -24609, -93909, -100190, -93229, -38172, 34724, -22335, -34870, -1422, 6694, 58812, 135537, 48411, -39909, -51492, -23821, -18308, -79936, -84730, -72537, -41598, 44591, 65953, 20884, 86911, 162623, 142408, 51106, 33561, 39705, 99186, 147779, 179195, 96240, 42794, 47919, 26183, -14854, -62294, -34083, -9345, 32213, 25087, 100166, 41601, -699, -75253, -13662, 37487, 71468, -28079, -13389, 69037, 44025, -33356, -115557, -104728, -68546, -131750, -134211, -71213, 3815, -18535, 3243, 87129, 99847, -365, -5214, 37167, -34758, -71319, -60995, -40906, -19520, -40847]
26889d0847M6637l5772m6621J9804Q445j2836p054m5763N7053k0305m616n4235
26877a36110k5343n8814L4753J81436K4732m8352r1567R4280O611j7001L5679
26866C04j18105k1253L4904L9237N5493L3151L1228n1534l9914n517M515L3425
26854d066M1173m2451j38549l8369j601M9719N2809O1117J46890L3830j6707o4706
26842G9089o8461j6176L1196O6504j28755l1721o55n5193J62893J00432k8719
26831A10434M51m4022j09960j43824K8247L2959M7304J5707O2090J14006Q9816
26820B03208r3635j15851k1311K3570j0864q2815j9662r759J6107K6203j4972
26809i9781K3955m3383j0691P8182J06671l488l3579q6121N1321R0036m6732k0155
$$ y = [-40847, 5790, -29982, -76603, -56799, -48354, -61190, -68244, -114007, -56954, -77259, -81875, -136110, -161453, -220267, -185514, -4078, 20654, -27698, -119265, -24985, -18374, -35375, 304, -117801, -139054, -104150, -64913, -9420, 23731, 54959, 3425, -36489, -42006, -37491, -4066, 37107, -5344, -143893, -182262, -183863, -134144, -81335, -20218, 126672, 160502, 143795, 79089, 10628, -5548, 25648, 92152, -36603, -68324, -68979, -124172, 38721, 139153, 110434, 110885, 66863, -43097, -186921, -158674, -125715, -78411, -62704, -614, 113392, 203208, 109573, -6278, -27589, -4019, -14883, -97698, -117360, -127119, -111012, -84809, -99781, -75826, -119209, -129900, -51718, 54953, 51465, 17886, -68235, -16914, 73122, 26390, 6235]
26797F235J24255l9788j38185Q6051Q5465k075o4232m7655M6787r2813j56013
26786a91968M8444J29217J24528L2786Q7981K7507j27980k6152n6896r6314j04158
26775a53005k473p913J3757J32257J02827o328p9867n1399M0403R273j077M6037
26763D2492j4911k8717N7717l0298r288L541O1256l5320q3769m157o415O0845
26751A2976q3848n9619l9265L0133O8523j1655J3615q8206l3671J13325J5067
26740f2625j217L7092K6640k6627L8748j4672q8399p3150L1320l7450n959j7439
26728a93738P9993O7297K5923p5335k9251O4721M3810k3086o7269j39754o828
26717b53517P8653O9055K4089L7812n248o1751Q673O7439R0511l5407o2327L5802
$$ y = [6235, 130490, 90702, -47483, 38568, 124033, 121958, 57726, 10071, 56858, -35955, -191968, -143524, -14307, 110221, 143007, 230988, 258495, 130515, 104363, 47467, -48847, -153005, -155478, -163391, -149634, -17377, 85450, 79122, -745, -52144, -11741, -2468, -3545, 42492, 27581, -1136, 56581, 26283, 16995, 20536, 81792, 46472, -37297, -41454, -47869, 12976, -70872, -130491, -169756, -139623, -71100, -82755, -69140, -157346, -191017, -77692, -62625, -63842, -26750, -110, -26737, 12011, -2661, -91060, -164210, -132890, -170340, -176299, -193738, -113745, -46448, -20525, -95860, -125111, -60390, -16580, -39666, -106935, -246689, -253517, -174864, -105809, -81720, -43908, -49156, -110907, -102234, -34795, 55716, 20309, -42018, -6216]
26705f216K3324j7940m9290o972O0374J3344l6180K3424K1096j5194j25355p6473
26693a92058l4377J24462J49302o5354j10112k1379R5568j0004q5882L9442k0693
26682a31085l9574m7815m025J01067P0773N6717J3937k3013M4852j643K0522r8455
26670c7742l4366R696L5129L2553K0995K2415O8788J6320q6308m1655N7225J1993
26658G5043l8149p178r8251K9146o4442K7642P0795l884q793k4713k43o3182L1490
26645g4719P074n3964o5885P9475J08127M3528O7421r7945k7100J1115J1385m8935
26633d0423j9288k6765p3915L8630N5822J28837N5532r7745r2522R0181J7696
26622C6040K4887k36R622L8487k3281k7411n6181q4472N9948R4708M3826k7570
$$ y = [-6216, 17108, -832, -50122, -57094, 3280, 16624, -19556, 3868, 24964, 9770, -115585, -192058, -226435, -101973, 47329, -18025, -128137, -149516, -53948, -63952, -149834, -110392, -131085, -170659, -218474, -222499, -121432, -50659, 6058, 19995, -3018, 41834, 40191, 60713, -37742, -72108, -62412, -27283, 5270, 26265, 48680, 117468, 133788, 47480, 5825, 63050, 75043, 36894, 29716, -68535, -39389, -103831, -76189, -5394, -9278, -18071, -42784, -43027, -106209, -74719, -67645, -121609, -187494, -108019, 108, 43636, 111057, 13112, -13988, -2873, 8512, -40423, -59711, -86476, -160391, -121761, -65939, 62898, 118430, 20685, -71837, 18344, 36040, 60927, 60691, 70313, 108800, 85519, 58108, 1927, -82545, -22597, 72111, 115937, 88367]
26610H8367n0607K9661N0768o3509j19019N6925J5969k3755n0965J6892k1874
26599g1147k1929J38226R728l819k0287L4907n7009n2593K6560o8521l255O3766
26587b5373K0906m0555K9200m0448L39K5217M3857J6227K0486k9902o9038m5516
26575i4600o372J7671N5365j911l1160Q8502O6694m083m4853k7651P1442o5842
26563B3202o674J38655L702m4314j14416j7905L3264J24062K4348J0063q2815
26552I1172m0012p8841l8651l3529R8967P0913P376l346n0964p6691m1360J820
26540i3146J0372j731L2299O9528L7276j9792K5630n4075r7646o8681O2097q035
26528a05904m7314M0615P2794P3083q7215K7325M9884l942k7172J670J9354L4600
$$ y = [88367, 37760, 67421, 118189, 54680, -64339, -7414, 8555, -15200, -66165, -49273, -71147, -93076, 45150, 54878, 51059, 30772, 65679, 8670, -43923, -17363, -85884, -89139, -25373, -4467, -45022, -15822, -56270, -55931, -30714, 13143, 29370, 49856, 19954, -49084, -94600, -100972, -83301, -27936, -29847, -61007, 27495, 94189, 90106, 45253, 17602, 89044, 23202, 16528, 155183, 158885, 114571, 155, -17750, 15514, 139576, 163924, 173987, 91172, 51160, -27681, -66332, -99861, -894, 70019, 77395, 74049, 23085, -53606, -94966, -93146, -82774, -84505, -52206, 17322, 54598, 34806, 60436, 6361, -91285, -159966, -97869, -105904, -153218, -112603, -39809, 33274, -53941, -26616, 23268, 19326, -7846, -6176, 13178, 47778]
26516D7778r113J884K938m1497j9883M1839j6075m7794J0242o5226N8818J05107
26504F9018n0839q8749J7067M5731J4273K014l6524P7196j3406o1497J3819L1862
26492A9965K8636j04980L3870K1216k3683n3710l1016K3969n1500J2531J11394
26481a3308J63126n2163j45239L0805J27072k8490n8227P0075o319J0078J6714
26470A14124p8139k9965m1661J4726K8095m489n2136j05665J26792M7914J095
26459B0691q3075k0143O2634J4294P3981L9510j03396l0206M4062K973l4178N6318
26447D3465P1482j01673J7135N6202J5953m7451l3129m6531J4015O4761M36p7511
26435b2846J01453o929o6450K6964N3681M1146N408j9889j6268k9567P9659K9321
$$ y = [47778, 38665, 40549, 43487, 1990, -17893, 23946, 7871, -39923, -29681, -94907, -36089, 69018, 18179, -70570, -53503, -7772, 6501, 8515, -28009, 49187, 35781, -25716, -11897, 19965, 48601, -56379, -22509, -1293, -24976, -78686, -109702, -85733, -137233, -124702, -13308, 149818, 97655, -47584, -16779, 110293, 81803, 23576, 93651, 87332, 97410, 114124, 35985, 6020, -35641, -20915, 7180, 2691, -49445, -155110, -28318, 19596, 20691, -62384, -82527, -19893, -5599, 68382, 107892, 4496, -25710, 18352, 21325, -12853, 43465, 114947, 13274, 30409, 86611, 102564, 55113, 21984, -24547, -10532, 54229, 54665, -22846, 78607, 71678, 5228, 32192, 85873, 127019, 132427, 112538, 96270, 66703, 146362, 175683]
26423A75683m3897k2928O133M2793k9731j54969r3297J8057N4313M0163k7298
26412c4978L0807Q8082J4003k1667m1157q9930N8778p0134J6746O6665N5808L5954
26400A08977M1092j24748j09018P7281J24044O4394L1157r1084k4161q2815l2689
26389a7570R1863L7212N024L4523n7627j10981j8866J851r0445J7913J12634O6878
26377G2409l1631L3380r718M7977O4545n5664j16690n6974o9379K1616P1182m6452
26365g5399N9047O3016o413M7832L3403P592k9556N8213n6218J1373J2263R318
26353A34471l4928j42470j3496j8704r8044k5604k3494J37511N0503K493J8430
26342a3332k1844J6064p361N649J3583o6267j9231J0126Q4801M0356L363p9115
$$ y = [175683, 131786, 108858, 114991, 157784, 128053, -26916, -120213, -102156, -47843, -7680, -34978, -4171, 83911, 97914, 76247, 35090, -54840, 3938, -66196, -49450, 17215, 73023, 108977, 150069, 25321, -83697, -6416, 117628, 182022, 213179, 122095, 97934, 15119, -17570, 74293, 111505, 116529, 151052, 93425, -17556, -36422, -34571, -125016, -107103, 5531, 72409, 40778, 74158, 64440, 112417, 176962, 121298, 4608, -52366, -121745, -100129, -28947, -75399, -16352, 46664, 40251, 88083, 121486, 129078, 99522, 157735, 101517, 112890, 125153, 134471, 99543, -42927, -56423, -75127, -173171, -198775, -222269, -84758, -34255, -31762, -13332, -35176, -19112, -26473, -20824, -7241, -73508, -92739, -82613, 2188, 42544, 45907, -33208]
26330c3208j44374m2572o8627j0475O3766J36093O4396J12787j8749N024k4012
26319D0049M3827K3269o7835j05678m0839Q2860o7436m3266K264r861k3410Q9688
26307g6368L6010n647O708m581N2311K599K9955p197l362j09394q9166K3899J08204
26294c6029M9527J8458N6724K0997J8131J0404o1667q7093j9627R6255K0739l8126
26282D8693L6096J9673Q3819n3303p0146L2112N6887j9628q8105j12261k5599
26271i1762J09187J0342m8432n1192k5021J2736o625M2108L9967k3204l9246K3729
26259d7413k12j673R512P2260K8659o5363j23531o90J05111n00q7150n4427L7302
26246a28115J34266J14738N7362l2901l8739j18164O7748N0591O7824r2119j76036
$$ y = [-33208, -177582, -220154, -288781, -299256, -235490, -99397, -35001, 77786, 59037, 64061, 40049, 83876, 107145, 39310, -66368, -107207, -24347, -91783, -135049, -132785, -142646, -166056, -76368, -40358, -46005, -39297, -43878, 8433, 11032, 40987, 33790, 30428, -78966, -168132, -144233, -36029, 13498, 31956, 88680, 109677, 127808, 138212, 76545, -10548, -30175, 66080, 86819, 48693, 84789, 104462, 188281, 134978, 64832, 96944, 153831, 134203, 46098, -66163, -91762, 17425, 27767, -20665, -71857, -96878, -84142, -90767, -48659, -8692, -31896, -71142, -47413, -47625, -49298, -39786, 32474, 61133, -4230, -127761, -128451, -23340, -23840, -110990, -165417, -128115, 6151, 120889, 178251, 145350, 106611, -11553, 56195, 106786, 174610, 82491, -93545]
26235i3545m1377m8293K8084L4559L5901K7124M8061M3213n4779j9479k3679m9741
26223a13951L9182L4552m1572O276j1448p3008L5051N5424P8932J0695o8778m194
26211e2839J00002J13284J552j15506j23871K137N5080J406q3186R1843P3312
26200F3214j9854m0655r2479k3549J54578L0200L8514K803r2086j2153r548k0213
26188b1228q7993r2048L7257K8055K9694M8996Q2548r035m2390l7672J35980N9126
26176A31290q4188o9702j1114k8524K5662O9453J26066l3358j07716o0633k830
26165d5594l0351k1071q973l419j5311k1942j814K1974j0992L7709K248O0390
26153c7146L6612l418J4049q3773O8759J55166l6796j16371R038L1063N5156k4489
$$ y = [-93545, -134922, -183215, -155131, -120572, -84671, -57547, -9486, 33727, -21052, -40531, -64210, -113951, -74769, -40217, -81789, -75513, -86961, -159969, -124918, -69494, 9438, 20133, -48645, -52839, 47163, 160447, 161999, 46493, -77378, -75241, -20161, -18755, -101941, -10098, 63214, 43360, 2705, -89774, -113323, 41255, 71455, 109969, 112772, 20686, 8533, -1015, -21228, -109221, -201269, -164012, -135957, -106263, -57267, 25281, 16246, -26144, -63816, 72164, 131290, 47102, -22600, -33714, -62238, -36576, 32877, 158943, 125585, 17869, -42764, -45594, -75945, -97016, -105989, -109408, -124719, -146661, -148475, -126501, -137493, -99784, -97536, -37146, -534, -3952, 10097, -73676, -4917, 150249, 113453, -2918, 6120, 37183, 92339, 67850]
26141F7850m731K5306m8605k1701p2310P4517k9932k9735M2365R5203O3961M8131
26129B10319o6661p6191O997P5120o0265j63034m9280K6665K0143L6305N0038
26118A0156o988J8344k75K235K3533o3256o6593M2742n3838L2565J8793m8827
26106i1409k6211L160J00933J24027O4668p4870j68229j9493J1523J6507L8746
26095b0648L7069L232J9282J2963R4645l5192J6320n5825l3940k2294L6662m5411
26083F863k7221M1144J2244q0843O7897J5962K5251l9516J8855j9828n5834Q4153
26071D9127O8038O5261j12472k943K5587r619q7397L9174P2215q1814q8168K3131
26059c9880J26375j14418r5967O8034P0247L0050j0257k3872m9355N3814P1823
$$ y = [67850, 63119, 88425, 39820, 18119, -54191, 20326, -9606, -39341, 3024, 98227, 162188, 210319, 143658, 67467, 74464, 149584, 89319, -73715, -122995, -96330, -76187, -39882, 10156, 3168, 21512, 21237, 23472, 47005, -16251, -82844, -40102, -93940, -61375, -42582, -91409, -117620, -114460, -13527, 110500, 175168, 100298, -67931, -87424, -75901, -59394, -20648, 16421, 19653, 38935, 51898, 146543, 111351, 127671, 71846, 37906, 15612, 52274, 6863, -20358, 20786, 33030, -47813, 20084, 36046, 61297, 21781, 40636, 20808, -35026, 49127, 117165, 182426, 69954, 67011, 92598, 82979, -4418, 34756, 106971, 25157, -63011, -39880, 86495, -27923, -123890, -55856, 14391, 44441, 34184, 10312, -39043, 14771, 86594]
26048H6594j3679r2595j22680r579J05160P837n9274J10214J0165m6110q681j1287
26036d3915J40422r599P077M374j04494o9640N9823M873K7106J6249j332M905
26024C5849j48956n9845N2897J06098j726l0529l5532K2328r428m3216m6840l4071
26012a92971l1460j2483O4057O0282k7601O7818n6398j47419k5355M6161J17249
26001a38120J0897q114O9615M8970L5679p9451j10948P5321L1154l9601n9N5716
25989d8941k2024l1523J1902l4697q361P191M6067p6977l5090M9678Q9182J4346
25977c9247r0902l0069L5769J07879L3018r5926n0694R4855P7611l2601j6170
25966f477o609r4614J4704m2471l4235J1363J54378M5506k6236P0191q9417k4843
$$ y = [86594, 72915, -19680, -142360, -151939, -46779, -38942, -98216, 11998, 22163, -23947, -32628, -43915, 96507, 86908, 93985, 98359, -6135, -75775, -15952, -11079, 16027, 32276, 30944, 35849, -113107, -172952, -120055, -13957, -15683, -46212, -81744, -59416, -68844, -112060, -158900, -192971, -224431, -236914, -172857, -112575, -140176, -72358, -128756, -276175, -301530, -255369, -138120, -127223, -135337, -65722, -16752, 18927, -60524, -171472, -96151, -64997, -104598, -104657, -48941, -70965, -102488, -90586, -125283, -133644, -126453, -80386, -157363, -192453, -142775, -53593, -39247, -130149, -160218, -124449, -16570, 16448, -79478, -130172, -35317, 42294, 9693, -6477, -13086, -107700, -92996, -135467, -169702, -158339, -3961, 41545, 15309, 85500, -3917, -28760]
25954b8760O1878n3780J3008K0882l6598j2920k8137R078R4765R5923m2986p2999
25942A9354P119M9852m68l9046J6489L4967j2018j8964k2853K474N305k4133n517
25929A2561K4381p3979j07739K4933J08312J165Q1114M6025J0103p5484r21L2922
25917H3393R4860M4179k8999l5144j06382p2987M9989J23457Q1506n7848j45324
25906C0700j2794M2715m9590O3733N9294q0291o4484O0628l2785n5281j6903j7825
25894g2883R1375j1958j0890k8231O494R4081R4569J3319k7730r0067n7974M279
25882D384N1695K7498l7139n8122j652P4165P3026o4419n2951j16417l2555O6180
25870f6307N8313r5013J0752P2876p6344j8560l365O5267N8262K3547r634J1041
$$ y = [-28760, 33118, -20662, -7654, 13228, -23370, -36290, -64427, -55349, 39416, 135339, 92353, 19354, 26473, 76325, 75857, 36811, 53300, 88267, 76249, 57285, 34432, 36906, 42211, 18078, 12561, 36942, -37037, -144776, -119843, -11531, -10366, 70748, 116773, 126876, 51392, 50471, 83393, 178253, 222432, 193433, 158289, 51907, -21080, 28909, 152366, 233872, 176024, 30700, 17906, 60621, 11031, 74764, 134058, 53767, -10717, 49911, 17126, -38155, -55058, -72883, 18492, 6534, -4356, -32587, -26093, 67988, 162557, 175876, 148146, 58079, 105, 4384, 56079, 83577, 46438, -11684, -13336, 60829, 133855, 69436, 16485, -99932, -132487, -66307, -7994, -103007, -92255, -19379, -95723, -114283, -117648, -52381, 5881, 29428, 19794, 30835]
25858C0835j13075n4671N4280l1869r7446N5350k7087Q6023Q5358k6074m3379
25847h1755M8796o8158q669J4371j1966L4370J6006O523K6741N2333k5734j04306
25835a01448J8083J15771J7883m4570k6355O662j6056m5765L702J11836n2882
25824a3139j0046k3353o300k9742O4558J24446j7061j18999p3850l1591J6577
25813a18500N9734K6578O3895j569K2379o0664l0601P2374j40L39R920n3021L5462
25800B6186l8009k6935R6827K999l5372o8023j9094K2390p592K5007k9119m9888
25788a00623L6899l0887M4938O379r6117O3871j7237L2519p3299n8043J26101
25777f5499K1823M6102p268m6290j8690J1495K4251J5905J25661N3580k9774m7233
$$ y = [30835, -82240, -136911, -82631, -114500, -211946, -156596, -183683, -97660, -12302, -38376, -81755, -32959, -101117, -109786, -95415, -107381, -73011, -57005, -50482, -23741, 28592, 2858, -101448, -83365, 32406, 50289, 5719, -20636, -13974, -30030, -75795, -72093, 39743, -13139, -23185, -46538, -52838, -82580, -18022, 106424, 89363, -29636, -103486, -135077, -118500, -58766, -32188, 31707, 30138, 52517, -8147, -38748, 33626, 33486, 33825, 43745, -9276, 26186, -11823, -38758, 58069, 61068, 25696, -42327, -61421, -39031, -46623, -21616, -50735, -100623, -63724, -94611, -49673, -43294, -139411, -75540, -92777, -60258, -133557, -191600, -65499, -43676, 2426, -4842, -51132, -69822, -58327, -34076, -18171, 107490, 161070, 131296, 84063]
25765H4063j39541q9505r311M7173q208J8082R5593L4648r4021K9637Q9690j6560
25753D1740j6269L5454m5641o0811M065P9431J2548m5229O5935J5959r7573p4878
25741h5269K7521P3421Q9326N8574J4944n2662L0509M5676q7013k0079l7981j2257
25729D4710N8077J0586o8341p577P330k3492L6630L150M123J6208Q552l1334K2570
25716H1192m6593o1756k3851N2327K4276L2535P5804n5936O733L5564j9457j02397
25704a559Q617M4443N7285m4587n0734p2919j7148o481P2078M5871j9553L582
25692A8895n5984N9153o7083r5116M9485L6209L2553J9796O8037O9329m6834j09850
25680b1410l8733L3189M9222J8341j1464Q1251J9376j0420J1420o7072K3293M7326
$$ y = [84063, -55478, -144983, -154294, -107121, -115329, -97247, -1654, 32994, -61027, -31390, 58300, 41740, 25471, 60925, 15284, -45527, -41462, 37969, 50517, 5288, 71223, 87182, -10391, -85269, -57748, 15673, 104999, 163573, 178517, 125855, 156364, 202040, 115027, 94948, 56967, 44710, 102787, 113373, 45032, 37455, 44785, 21293, 57923, 61073, 65196, 81404, 89956, 58622, 81192, 34599, -27157, -51008, 1319, 25595, 58130, 133934, 77998, 84731, 120295, 100838, -1559, 7058, 51501, 108786, 64199, 13465, -59454, -76602, -83083, -11005, 34866, 15313, 18895, -37089, 22064, -45019, -140135, -90650, -54441, -21888, -2092, 65945, 135274, 88440, -21410, -60143, -26954, 22268, 40609, 29145, 110396, 129772, 119352, 130772, 63700, 86993, 134319]
25668A34319k0316o6384q0222M189K1792J13252L7595q2021j2654K8679K8511
25657A06740k4984o8457j9950M7335N6827k0785r5273k075L2376o0762j01073
25646a50081l2088N0496o741M255m8345P5745O4253P1551M2248m9478L6770j5961
25634D2624R485l5645L5625K045q5026J9771M0162J5996l3650n3385J8993K4026
25622A021j5531M0330M7677N5661O8703j24362o0142n3368j04324k7743J29459
25611d2619N1639N3910N4547n526q4293n8910m8683p2097o547r6500K7230J06868
25599a20981J2726k6947o9667O1974K5863m2076Q6260Q9225L8237k1333p1106
25588c7825k1271q8589m3599J02438j05930m9840J32217N8505L6813N158K7606
$$ y = [134319, 114003, 47619, -32603, -28414, -6622, 106630, 144225, 62204, 49550, 78229, 106740, 81756, 13299, -6651, 40684, 97511, 76726, -18547, -20622, 11754, -49008, -150081, -182169, -131673, -138414, -134159, -182504, -106759, -42506, 29045, 71293, 21815, 58585, 42624, 52109, 16464, 52089, 54134, -30892, -11121, 29041, 45037, 11387, -41998, -23005, 1021, -14510, 25820, 73497, 129158, 197861, 73499, 13357, -40011, -144335, -172078, -42619, 9020, 62930, 117477, 111951, 27658, -31252, -79935, -152032, -158579, -255079, -227849, -120981, -108255, -135202, -204869, -142895, -117032, -159108, -72848, 16377, 54614, 33281, -37825, -59096, -147685, -191284, -88846, -194776, -244616, -112399, -53894, -17081, -11923, 15683]
25577A5683j8634L0014L843K3779N555p2219L5504N1641p7448O571L0600K7291
25565F2180k6991K3994j588o2776n4179R1636m5667j10738K2176k3068J2905k6696
25553a38812j5362P4271M1402k4169q751p599J69l836R210n2074l6303l0179M9487
25540a42546N957j1488L6599n0525k5896k2137M7301M3783O1899J17708K3128
25529H3783k0121l9003J8248j22251K9014N4623K7142k8010N5128M0543R8445
25518A97541o0890o584P8643L2605o4305m1955M339J0277J7207K2468l2931j56294
25506A21k7813L18J0955M2905N665k826m9858q119M3795r038L2783O9003k9553
25493G8338l0761N0878M0292j1191n7379o02j20950J8580J9998L0860K8928N5532
$$ y = [15683, -2951, 27063, 30906, 54685, 60240, -11979, 23525, 75166, -2282, 4289, 34889, 62180, 35189, 59183, 57595, -5181, -59360, 32276, -13391, -124129, -101953, -125021, -112116, -138812, -154174, -79903, -38501, -62670, -71421, -79020, -78851, -82687, -73477, -125551, -161854, -192033, -142546, -136589, -148077, -111478, -162003, -187899, -210036, -162735, -118952, -57053, 60655, 83783, 63662, 24659, 42907, -79344, -50330, 4293, 31435, 3425, 58553, 99096, 197541, 136651, 130067, 208710, 241315, 177010, 135055, 139394, 149671, 166878, 189346, 156415, 121, -27692, -27374, -16419, 26486, 32151, 29325, -20533, -28652, 15143, 6105, 38888, 107891, 78338, 47577, 98455, 138747, 127556, 70177, 69575, -51375, -32795, -12797, 18063, 46991, 102523]
25481A02523k5956N5514n3477R503m504j90o9321m4972m6418m8886R509J36118
25469A9443r480j42293k3066M6206O6305L9742O2595k1419n4507r695L4876N6973
25457F5680K7121J18794L2920p1571j14431k9499m368p0788o5100m8483Q8161
25446g1564J93436J36422p022k2577k4905q5263o9481q844J0002L757J0911l0710
25434C4162J252M8554m654r2211J0127K3192L892n9805N1943M2759p2407j6817
25422c0013q712J4072l2686Q4871K4079l430n3788M2925P4952o7078o6053O379
25410a4482k8338M6321l9598n131R2777P1958o6591k1487J1598M9326Q0164j761
25398A74756J4988j74764j14969K6986J16673m9480l3653k9396j769O3015N1236
$$ y = [102523, 76567, 132081, 78604, 88107, 83603, 83413, 14092, -30880, -77298, -126184, -116675, 19443, 9963, -132330, -155396, -109190, -42885, -3143, 59452, 38033, -16474, -26169, 8707, 65680, 92801, 211595, 244515, 172944, 58513, 29014, 24646, -46142, -111242, -159725, -71564, 121872, 258294, 251272, 228695, 203790, 118527, 49046, 40202, 50204, 53961, 64872, 34162, 35414, 83968, 79314, -12897, -2770, 20422, 24314, -35491, 16452, 59211, -13196, -30013, -38725, -24653, -57339, 27532, 51611, 48181, -5607, 37318, 112270, 45192, -20861, -14482, -42820, 3501, -36097, -41228, 51549, 123507, 56916, 35429, 47027, 96353, 176517, 174756, 189744, 14980, -99989, -73003, 43670, -5810, -39463, -68859, -70628, -7613, 43623]
25387D3623l8872l207J8741L6339p8899P723Q738p9709r635n8547L1845K8020
25375i3840k7279L3935L678j7465R3048j7071M5835J1903l5537k315J00957R752
25363A05601J9336L6833o4507l1856o0894K7727k5172p755n8914m7675r016j8254
25351a34546J5816R4204j4982q0199P211L3434P2340M154o5003j9705o2877M8418
25339a01735P3899k773l2870p3992q564j9992o8240J6772P2909j0393l4181J33437
25327e5723J7440N625P9209J0343j7485n6184n2054J23019L0279K7889L9902q6184
25315F6076j44986j7268l6060O8557J59931j8221j33920K125O921J7276O295R7295
25303G4021K3228o4586m9738n3432k7604L0276j644r405J02844j5780k1144J1730
$$ y = [43623, 4751, 1544, 20285, 56624, -22275, -14552, -5814, -85523, -95158, -153705, -121860, -93840, -121119, -87184, -83506, -100971, -7923, -24994, 20841, 32744, -2793, -5108, 95849, 105601, 124937, 161770, 97263, 65407, 4513, 32240, 7068, -687, -59601, -107276, -116292, -134546, -118730, -24526, -39508, -119707, -112496, -79062, -6722, -2568, -67571, -87276, -150153, -101735, -27836, -30609, -63479, -137471, -146035, -166027, -234267, -217495, -144586, -154979, -189160, -55723, -38283, -32658, 46551, 56894, 39409, -16775, -68829, 54190, 84469, 112358, 152260, 66076, -78910, -96178, -132238, -63681, 96250, 78029, -55891, -53766, -46845, -29569, -23274, 74021, 97249, 32663, -17075, -70507, -98111, -67835, -69479, -78884, 23960, 8180, -12964, -1234]
25291a234j0222R7323o3347j1393N0063K7611m583J9794k8490j4697p3949J9964
25279F840K8201j3730p1382l7507j3434p4307R4841J9702j05916J08321K0602
25268c7769j5723J9037K5769j08913j22708o087L9510J19803J41961J20358l3615
25257A41623q7283p9246J610O1834N2171p0014m3840l1976n325k3951q8312l6798
25245b09507L9494N2000m6087k0105M3101K084j5380J09526Q2382M3101K7912
25234A08521q9834k353m1575k384j1355r58m7530M9102J26965p0715o0883k6651
25222f9650k3185n705J35498o2316l5926q9476o2914N6650J37444J5660k2772
25211b6692M8982n095m9287J12L9370O2324O0692L8034P4429o7945j28473j34891
$$ y = [-1234, -11456, 85867, 22520, 11127, 61190, 88801, 84218, 104012, 75522, 60825, -13124, 6840, 35041, 21311, -50071, -87578, -101012, -175319, -80478, -60776, -166692, -58371, -37769, -53492, -34455, -8686, -117599, -240307, -246394, -206884, -87081, 54880, 175238, 141623, 54340, -24906, -23296, 38538, 90709, 20695, -23145, -55121, -60446, -84397, -172709, -209507, -170013, -118013, -164100, -184205, -141104, -139020, -154400, -44874, 37508, 80609, 108521, 18687, 16334, -25241, -27625, -38980, -39938, -87468, -38366, 88599, 17884, -42999, -69650, -92835, -98540, 36958, -25358, -61284, -150760, -213674, -157024, -19580, -3920, -26692, 22290, 17195, -32092, -31980, 7390, 69714, 130406, 168440, 242869, 174924, 46451, -88440]
25199h8440n4433R0489N4379o5212j2713J36616N0267k2458p4134p6284M0481
25188b1442P8508q1120k1563M2352L9867J7914p2366L5430o3185q1907P3806K7174
25176b6532M8425R6413n9145j12294K895K292J309K6153p3130j8685N4111N007
25164e3181P3354J01505N6356m057k1227l3080q8999k1189k3869l9098r0615N948
25152a38152k8607R9595J95044N5712p6382k567j04481j12955o1618P2928J71242
25141F9759N007j8941q6508q9228m2854l317j3548R5399J01750j7746L7000k9186
25129G587j09408m0919j5672J15478J08581o4290N1785L0686O1388p5004p4609
25118d397J0356J4484Q4130k2811N8354K4081r8455k523J5973k8204p4867J7865
$$ y = [-88440, -142873, -52384, 1995, -63217, -75930, 60686, 110953, 88495, 14361, -61923, -21442, 57066, -24054, -45617, -3265, 36602, 54516, -17850, 17580, -45605, -127512, -53706, -26532, 21893, 118306, 59161, -53133, -50238, -47946, -46637, -20484, -93614, -112299, -58188, -53181, 20173, 121678, 178034, 173977, 152750, 119670, 30671, 9482, -14387, -53485, -144100, -138152, -166759, -67164, 127880, 183592, 107210, 104643, 162, -112793, -174411, -101483, 69759, 74766, 55825, -30683, -119911, -162765, -166082, -179630, -84231, 17519, -227, 36773, 7587, -101821, -142740, -158412, -42934, 65647, 1357, 53142, 83828, 145216, 70212, -4397, 5959, 20443, 104573, 81762, 140116, 164197, 65742, 63219, 79192, 50988, -23879, -6014]
25106f014L7810m5420n7625p3988k665L1042L9138R3748J24397j9417j21770l0329
25094c1093L2860N0131J14056J933j39427J732M1817p7870N883n1077k7660K9613
25082d9102N8966M7168o8136k7719R1243J36832L6281j02848j20652p0869l1709
25071a00545P3246R3780l0612L5180J726L5517N6018m5593p7284o5291O0r036
25059c2834q362P2192J01363j3411n837o4017p3457m2045Q8715J1149p1432q9053
25047a27029j2435Q9174J03586n2280K6653m1580n6335l9493J07953J4123O584
25036A8921K7432J4458m670J19268N2746q8137r1807l4991J9773Q6790q7788o0931
25024b8936o9238L6854N4652N09K2369J102n4910R594N7624L1978r6085J2348
$$ y = [-6014, 31796, -13624, -71249, -145237, -147902, -116860, -77722, 16026, 140423, 121006, -764, -31093, 1767, 51898, 165954, 167887, 28460, 30192, 72009, -5861, 22, -51055, -78715, -49102, 9864, 57032, -11104, -38823, 52420, 189252, 225533, 122685, 2033, -68836, -100545, -27299, 66481, 35869, 71049, 72775, 108292, 164310, 118717, 41433, -23858, -23798, -32834, -41196, 30996, 132359, 118948, 113111, 49094, -24363, -66408, 22307, 33456, -37976, -127029, -139464, -50290, 53296, 1016, 27669, -13911, -70246, -109739, -1786, 12337, 18921, 46353, 60811, 56141, 175409, 228155, 140018, 48211, 13220, 32993, 119783, 31995, -28936, -98174, -61320, -6668, -6159, 16210, 17312, -37598, -28004, 29620, 61598, -34487, -22139]
25012b2139o826j3824M1249J15304P1851J6656l1370L2838M4237l4513j14329
25001I9134j0420P9513L2580o5776p561J0084p0676L7183M7221N1008l4598n8673
24989A09019l6789p5008K6054L0035m5344m0327Q0782j1214l3288J9771l7952
24978a4261j1391J9143O3779R9237j14430m5330J2363o5158k9480J9799J8961
24967d6768l0334l8962j1207P8560O6203k7150k1277J9687r5092l9803m7277N6152
24955a37268J01007K0619j4379j6050K8655m1685J2111Q1076l0433L2126k5249
24944A0530j2898O958n9462N927N5771m2626p5328m8909k4798J8456j6920J27888
24932e5411P8220r016L0283o9777l6091J1064k913k7804N6501k0784n2914J9259
$$ y = [-22139, -28965, -42789, -1540, 113764, 185615, 202271, 170901, 203739, 247976, 213463, 99134, 88714, 168227, 200807, 135031, 127470, 137554, 66878, 104061, 151282, 202290, 167692, 109019, 72230, -2778, 23276, 53311, 7967, -32360, 48422, 37208, 3920, 23691, -14261, -25652, -6509, 57270, 156507, 42077, -3253, 9110, -56048, -85528, -65729, -46768, -77102, -116064, -127271, -48711, 17492, -9658, -30935, -11248, -106340, -146143, -193420, -137268, -36261, -15642, -30021, -46071, -17416, -59101, -46990, 34086, 3653, 35779, 10530, -2368, 4590, -54872, -48945, 6826, -35800, -111128, -160037, -184835, -166379, -183299, -55411, 22809, 13793, 44076, -25701, -61792, -50728, -53641, -81445, -24944, -45728, -98642, -79383]
24920g9383L4887N4268L4213k056m8611R656l2973q2011q9577P6198Q0572R072
24908c5745M645N3Q8342r4500L490J05740K7575n0287j35576o374o4002M7675
24896a08964P0498k1650M6331R3220o950k530K5090n9570J7512m3600R6056N2442
24884A57885q4758k9136J8335o4727L2813L5289l0272k5813J2833n3787j6112
24873d7450m4504m3422N8555J5348J2791J0238q155O3285j816p2145R593M7901
24861B19j2425J4541L2999K75n3370m2024o707j4169J4447m3295L098J13759Q855
24848A6203j8120M5489O7576j8884n2957K3997L1609K8755J03175r3946j04870
24837B8027o6920L1558P5583o3464l6408N3292L9627k7847O4628j8186j236Q9234
$$ y = [-79383, -44496, 9772, 43985, 41929, -6682, 2974, -29999, -112010, -201587, -125389, -44817, -35745, -31100, -31047, 57295, -37205, -33715, 72025, 99600, 49313, -86263, -92637, -156639, -108964, -38466, -60116, -13785, 79435, 72485, 69955, 95045, 35475, 52987, 9387, 105443, 157885, 73127, 43991, 62326, -2401, 30412, 65701, 35429, 9616, 22449, -31338, -47450, -91954, -135376, -76821, -61473, -48682, -38444, -46599, 16686, 14870, -57275, -47682, 219, -12206, 2335, 35334, 35609, -17761, -59785, -66492, -80661, -66214, -109509, -106411, 7348, 16203, -1917, 43572, 111148, 92264, 39307, 63304, 94913, 123668, 226843, 132897, 28027, -38893, -7335, 68248, 4784, -31624, 21668, 61295, 33448, 98076, 79890, 78654, 167888]
24825A67888L45r3153n7377K9474j8234J457j8203l4412M4275r698Q1494k1710
24813G2146o5365n6719k9368J22262p7064o2280p1003n9708R6179n9242L6039
24802a54123K3310L2707o3050j4591K1327p988k013Q3326M0053M1653J11288K3864
24790A35763j40030j44625O1688J60187K3306m3305Q0730M271j08001o7041j7077
24779e4134o2114J07345Q3933q764q6909n3580p777k6564M2439l122R3635l1620
24767g232r5554J6435J14387O0453p0609j2752J6906l324N473L2836J24060J675
24755A82754p4961o2216o8616m0955j3196k9010J3335R8419N803j02544j02908
24744a94095L3840L3050O7947O9528M2984o6634l7387j4359o5523O474J35370
$$ y = [167888, 168233, 75080, 17703, 47177, 28943, 30400, 12197, -22215, 22060, 12362, 93856, 72146, 6781, -49938, -79306, 42956, -34108, -96388, -167391, -227099, -130920, -190162, -154123, -130813, -98106, -161156, -175747, -154420, -162408, -164421, -81095, -41042, 611, 111899, 135763, -4267, -148892, -87204, 72983, 96289, 52984, 133714, 137985, 29984, -37057, -54134, -116248, -8903, 75030, 66266, -20643, -74223, -82000, -108564, -66125, -69247, 24388, -7232, -102786, -86351, 28036, 88489, 17880, 5128, 22034, 18710, 24183, 57019, 181079, 182754, 107793, 45577, -23039, -63994, -77190, -106200, -92865, 5554, 11357, -91187, -194095, -160255, -127205, -59258, 10270, 53254, -13380, -50767, -65126, -130649, -124175, 11195]
24733A1195j2144K2773j44452k8741O2503N3902J9151j00652N4143Q2079l9301
24722a9544p3726O271l0507R101j2645P1243M2408j4410L3282L9252o4248m783
24710a8306O725o6147o0394j1064M6539O7785k0384j03683J7146J01140K3147
24699a7496j04134j2034Q377M5392L4437j4089K4441J2202M5230o0495r2011j2916
24687a43096l2069l286Q0524O8798q7127l9869Q7570Q2809p6742m4140p4453Q1509
24675i9572M8055P8488k7612o0753L4973n0870p1385O2034Q6916K3022j503o2510
24663d0717M3433J9519k0980J8708J1893n3337J4865o659R193P511Q2479Q2334
24651A68242o9400o2089j3470k9687q2497r192q980k1178P9924N2200j2342n648
$$ y = [11195, -949, 21824, -122628, -151369, -88866, -34964, -15813, -116465, -62322, 19757, -19544, -93270, -86999, -117506, -108405, -121050, -49807, -7399, -21809, 11473, 50725, -13523, -18306, -11581, -77728, -138122, -149186, -102647, -34862, -55246, -158929, -141783, -40643, -17496, -121630, -133664, -125287, -79895, -45458, -59547, -35106, -22904, 22326, -38169, -130180, -143096, -175165, -178451, -97927, -29129, -116256, -156125, -68555, 14254, -62488, -106628, -181081, -99572, -51517, 26971, -641, -61394, -26421, -77291, -148676, -86642, 274, 23296, 21793, -40717, 2716, 22235, 1255, 19963, 31856, -21481, -6616, -13275, -4082, 3429, 85908, 168242, 98842, 36753, 23283, -6404, -88901, -98093, -107073, -128251, -48327, 3873, -8469, -14117]
24639a4117j5481k3144J5477K2281K4862L7842J12854m4503q7113m7480P8011
24628E9489M4382Q3282J77987j11855r2075j8275j83325m461r158j3449P6137
24617H679l4990N2903J5740o2668m7883l9657N6968N3633L383J2866O956P8194
24605A04124O5911M4505j8687n6435k17399o393O0968o1840l963j8938K4279M0247
24593d3621m0848m6821o0577k9945o4482Q587O1343L7625k9327N3308O1907J31919
24581C9068K9541o6334m9795K9848j8323k1332m916N6876l8435j3862P1016J8970
24569C2322o066K7801J8446K3120J2821n1056q155M2869n0099L3613k7324K9613
24557G7905M9398m4242r1860p7934r010n5092K0291R0107J4899M8622p456k0030
$$ y = [-14117, -29598, -52742, -37265, -14984, 9878, 47720, 160574, 116071, 28958, -18522, 59489, 103871, 187153, 365140, 253285, 161210, 142935, -40390, -44851, -54009, -67458, 8679, -26311, 26592, 42332, -20336, -68219, -107876, -50908, 2725, 6108, 18974, 25930, 104124, 170035, 214540, 195853, 139418, -77981, -84374, -23406, -85246, -89209, -108147, -83868, -43621, -84469, -131290, -191867, -221812, -286294, -277707, -216364, -178739, -208066, -154758, -92851, 39068, 68609, 2275, -47520, -17672, -35995, -57327, -62243, -5367, -43802, -57664, 13352, 32322, 26256, 54057, 72503, 95623, 108444, 57388, 49233, 92102, 42003, 75616, 48292, 77905, 127303, 83061, -8799, -86733, -95743, -150835, -130544, -40437, -25538, 23084, 15628, -4402]
24545d402O9397M3767n3767J1439o1252l3422J14946l8040k7259J1981N3472p7938
24533H922k1290M9284O1462r338K1456K7431m9714l9696k9520r788j8801N1987
24521D2395k4769r5363l2495n9973M785J4169L628j356p138m8282j5336N3838
24509a65897L9031R2576K9456l0963R0581j4317p3072P5756P5460M42N4003J9202
24497A92258Q751Q6034k6365l3698k3686K41j12668j21664m3592P3301O255o852
24485a685J7587q9615p8108M2337L3779k7948O9997n1720K1095Q2923k3672k3996
24473b9026M389J8004l0125j9896L6069L8082J619M2692J11046p7288q7019j2451
24461c904m0063m4060j4289N6065R9059n9701p3368J25653Q9701K8267j4952j50638
$$ y = [-4402, 64995, 108762, 54995, 66434, 5182, -28240, 86706, 48666, 21407, 33388, 86860, 8922, -12368, 36916, 98378, 89040, 110496, 137927, 88213, 48517, 18997, 9209, -9592, 42395, 17626, -77737, -110232, -170205, -165420, -151251, -147623, -148979, -156117, -204399, -219735, -165897, -126866, -34290, -4834, -35797, 54784, 40467, -32605, 43151, 118611, 119053, 173056, 192258, 201009, 287043, 260678, 226980, 203294, 203535, 90867, -30797, -74389, -1088, 5167, -1685, 15902, -73713, -151821, -109484, -75705, -103653, -33656, -85376, -64281, 18642, -5030, -29026, -24637, -6633, -36758, -56654, -20585, 17497, 19116, 61808, 172854, 95566, 8547, -3904, -43967, -88027, -102316, -46251, 52808, -6893, -80261, 45392, 135093, 163360, 148408, -2230]
24449b230j78671R809J59123J8105p6668r1936o9346N2024R5371Q2657J8058O6626
24437H2922j3937r2120p9133R3547N0562j01223o8454L7488l9312k0145k2338
24426a72143K7246L8080m5787J8124k4486k8018J4470L3742N7004j4426M4086
24415e2108K7011M7697j5263o0540J5999J733L7234j1373L6895O9611K6839n4755
24403F8980p9325j46316Q3273J04957o9719m2870R2139J39998k8221o9867k5623
24392B7406L4223k2491k1686o0095o5168J8749P1574K9475M1653j3049l3875N7146
24380F3862N798m9719N4698K2237q4198o5739M122J00650k076L311o3654J4139
24368C431k8915m6605L4356l6061M6448J23736j11363r7840J384m8935k6383L3149
$$ y = [-2230, -180901, -171092, -11969, 6136, -70532, -162468, -231814, -179790, -84419, -1762, 16296, 82922, 68985, -23135, -102268, -8721, 41841, -59382, -127836, -90348, -129660, -149805, -172143, -144897, -106817, -152604, -134480, -158966, -186984, -172514, -138772, -81768, -96194, -52108, -25097, 22600, 7337, -53203, -37204, -35471, 1763, -9610, 27285, 96896, 123735, 68980, -10345, -156661, -73388, 31569, -38150, -81020, 11119, 151117, 122896, 53029, 27406, 61629, 39138, 17452, -42643, -107811, -89062, -17488, 11987, 53640, 40591, 6716, 63862, 69660, 19941, 74639, 96876, 12678, -53061, -48939, 51711, 49635, 52946, -10708, 3431, -25484, -72089, -37733, -73794, -27346, 96390, -14973, -112813, -111429, -160364, -186747, -153598]
24356a53598J51919O5321o3978k801L4667K0863J5392K6624K306J4832L1827m8427
24344I4947O420p1687J908N5251J3717K4108J1430l8725l4026j7203j6000k8392
24332A748J3809O3116l9360q0194J8981R2462l812j48551j336Q4808k0036M4971
24320B6606O1482R40Q16N3115L2452q9440J0439l1579l7396N5219K5181j45011
24308c7176l4843O3818L8177J1534k7988N639n3366j30940P8916Q9525J17615
24297A20911k1700p5519l834L0475N455o8008o3355O6097j0578J5525N7227P985
24285F0681k9803j01793J6857R1569J26464p9526q2003j6171j20432l4500L0809
24274a37848O06L9575O6842N0882k4675m7960Q242M5146N3373k7883r5793q2935
$$ y = [-153598, -1679, 63642, -336, -3137, 31530, 52393, 67785, 94409, 96715, 111547, 143374, 94947, 101367, 29680, 31588, 86839, 100556, 124664, 136094, 97369, 63343, 46140, 30140, 1748, 15557, 78673, 39313, -40881, -21900, 70562, 66750, -81801, -83137, 1671, -18365, 26606, 88088, 89028, 89844, 142959, 175411, 85971, 96410, 64831, 27435, 82654, 107835, -37176, -72019, -8201, 29976, 41510, 13522, 19161, -34205, -165145, -86229, 3296, 120911, 99211, 23692, 19858, 50333, 55788, -12220, -75575, -9478, -20056, -4531, 52696, 60681, 30878, -70915, -54058, 37511, 163975, 84449, 2446, -13725, -134157, -168657, -137848, -137242, -97667, -30825, 20057, -4618, -52578, -44336, 810, 54183, 26300, -69493, -152428]
24262a52428J9742R8202P5335J8339M1325j39168p5027P0550L8509j4703q0136
24251i9460q3931J25254J04678O2517n2809q9204j01758o1170L5738Q894Q770
24240a42481O6259M338l415m2172K1567K5699L6778N0113m1980l6579l4052k0253
24228a16178J3880J24505O9842L029o732K7310o7676n8755N884Q7953l6987r3077
24216d7002o2327K4230J72621O1159k0773o26q1951J8238N5219P127L0828n6146
24204A00597o0260J2617q2073p942Q3646k0404R453k304l0553k8191m8352l033
24192g6799l1637j3059J17269J70650M4262n1349j75858l4835P5194K544k3248
24181C134M6649l4259J3995J622n4437L2281K3362N813L3099M4284l4948M6701
$$ y = [-152428, -132686, -34484, 40851, 59190, 100515, -38653, -113680, -43130, -4621, -19324, -99460, -183391, -58137, 46541, 109058, 56249, -32955, -134713, -195883, -160145, -151251, -142481, -76222, -71884, -75299, -117471, -95904, -70205, -33427, 16686, -25294, -61873, -95925, -116178, -102298, 22207, 92049, 95078, 88346, 115656, 47980, -10775, -4891, 83062, 46075, -47002, -109329, -85099, 87522, 148681, 127908, 127282, 45331, 63569, 118788, 125915, 156743, 100597, 40337, 52954, -29119, -37061, 46585, 26181, 35634, 33330, 2777, -25414, -73766, -76799, -108436, -121495, -4226, 166424, 210686, 159337, -16521, -51356, 23838, 26382, 3134, 49783, 15524, 29519, 31141, -23296, 8985, 32347, 38160, 71259, 115543, 80595, 127296]
24169A27296M2882m5505p2457L3490m4530O0737P4244O2099k0368p5774l6278
24158A05836j550J4977n5848k5325l3391L9457n8518j6663N9080r808l1382J4384
24146A249n7865K5610O5183Q8649j5101o9457N438J13528K1719j29488l6484P5269
24134H8250o2935j11818n012N1885q583N1509J78155j6401p9940Q129L2785K5065
24122A51089o4167o6874Q811p641k9358n9350n4979l7865P6116j3333J3042J43940
24110E9431L7907K9901K1039j17896L1570K6388o880m4167m9308k0332o3053O8880
24098b6520J16672k463q1492q2295J51397J06628J8364q6419p3945K1250P7569
24087A38746L1180m7260N0733j2942p0259Q017J8503K070J7384N4738m0067j22150
$$ y = [127296, 170178, 124673, 52216, 85706, 41176, 101913, 176157, 238256, 217888, 142114, 105836, 104286, 119263, 63415, 38090, 4699, 44156, -14362, -31025, 28055, 18247, -13135, 1249, -56616, -31006, 34177, 122826, 107725, 38268, 43706, 157234, 178953, 49465, 12981, 88250, 25315, -86503, -91515, -39630, -48213, 3296, 181451, 165050, 85110, 93239, 126024, 151089, 86922, 20048, 28859, 21218, -8140, -67490, -122469, -160334, -84218, -97551, -84509, 59431, 97338, 127239, 148278, 30382, 61952, 88340, 81460, 37293, -12015, -32347, -95400, -26520, 90152, 87689, 6197, -76098, 75299, 181927, 200291, 113872, 39927, 61177, 138746, 169926, 122666, 173399, 160457, 90198, 98215, 116718, 118788, 136172, 190910, 150843, 28693]
24075B8693k2634k3200J2874J398j8778R9930M0992M3664K5477M4322j02104o0704
24063F9930o0115p972K8664M0106L5900k2834k7729J9637L5473Q85r4728o5724
24051d8507n855j1040k848M9898j6556l5678L7569R31j6192o98p1165p1021j5962
24038b07124J38985m2654L5290M1231L0930J6190J5526P0118Q7442P31m1311m1822
24026A03532m6590m9080L1207Q7837j47425r0906M0993R4188Q7424p0033n1067
24015i920p3722N2186L3882k3314N4562J08497m1165n8134N2297L8308L8522J3104
24003A85103K3926P409j00068m3897K7475n297m0487L2046J59789M437j29035
23992A21401l7608J5426M3720j2368j24779p03K3132N6861O5693J0673r2774o3480
$$ y = [28693, 6059, -17141, -4267, -2869, -21647, 78283, 119275, 162939, 188416, 232738, 130634, 69930, 9815, 1843, 30507, 70613, 106513, 83679, 55950, 75587, 111060, 111945, 17217, -48507, -54362, -65402, -68250, -18352, -34908, -70586, -33017, -32086, -48278, -48976, -120141, -191162, -207124, -68139, -110793, -75503, -34272, -3342, 12848, 28374, 98492, 185934, 186665, 145354, 103532, 56942, 7862, 39069, 126906, -20519, -111425, -70432, 23756, 111180, 41147, -9920, -83642, -31456, 2426, -20888, 33674, 142171, 101006, 42872, 95169, 133477, 171999, 185103, 209029, 216438, 116370, 72473, 99948, 94651, 54164, 86210, 245999, 250436, 121401, 83793, 99219, 142939, 130571, 5792, 5089, 28221, 85082, 150775, 161448, 68674, 5194]
23980E194M3224k2426K0614M105L9408K8246M4216o7624L5244J10139n3337r3921
23968I3082q782j0489P0899J9712k7503J9396k2431n6001J8261P9186r765N9589
23956B25154k6049r7072m8404k1259l5413o365N0076m0439l2650j6745o5945L6687
23944g8424J9879J8540o4936K07N405J14243N4278J0708o8832j22939K4331K0421
23932f7119q9930P2520J09619K891J3154l6786m2046j4735l2980N291M2840O8622
23920C1341r554L5294p9319j02803j41182M8231J16908J20846O9036l5203l4260
23909A9335m7191p1278o0578L4010Q6198k0661O7388k1120J6395m5104P8688N252
23897D1334j6531n7837L7109K5386P3501p7823L4159K6626l8459O110j1111J352
$$ y = [5194, 48418, 25992, 46606, 50711, 90119, 118365, 162581, 94957, 130201, 240340, 187003, 93082, 84300, 73811, 144710, 164422, 136919, 156315, 133884, 77883, 96144, 175330, 165565, 225154, 199105, 102033, 53629, 32370, -3043, -9408, 40668, 229, -32421, -49166, -115111, -78424, -58545, -40005, -104941, -104734, -99329, 14914, 69192, 79900, 11068, -111871, -87540, -67119, -157049, -84529, 25090, 27981, 41135, 4349, -37697, -52432, -85412, -80121, -37281, 31341, 21787, 57081, -22238, -125041, -266223, -217992, -101084, 19762, 88798, 53595, 19335, -27856, -99134, -159712, -125702, -39504, -60165, 7223, -13897, 2498, -42606, 36082, 41334, 24803, -33034, 4075, 29461, 102962, 25139, 59298, 85924, 47465, 53575, 42464, 43816]
23885D3816l8071K8246K5898j1933K2406p1222m9010o4474j1797N0703P9949J1257
23873A5768n2993M2833J05427N3265j6187o4501n1983M236l6948n8555J8148J05371
23861F3881P7346P6567R905l7341p3364L2960j219K6169P6982p363n1663p305
23849A85555p069m1004j12620o7291K665l0953J04504R0694P4230p975j09500
23838H1236j01216K4166P9350k269L7163o2945m0295J5297J05868J4710j5451
23827A35614J8648q3892o354M2604Q9786n9968j0524k2646Q2818N0161q3612j13543
23815C9092p178J1139N0156J04011n356j14193p8357M5076O409r6360r5963L2553
23803a08971K13305P0180o3599m6538m8620K0912P9073m6755m82n1185K1567r577
$$ y = [43816, 5745, 33991, 59889, 47956, 70362, -860, -49870, -114344, -126141, -75438, 4511, 15768, -37225, 5608, 111035, 164300, 148113, 83612, 31629, 35865, -1083, -59638, -41490, 63881, 141227, 217794, 227699, 190358, 116994, 149954, 148735, 174904, 251886, 244523, 192860, 185555, 178486, 137482, 24862, -42429, -39764, -70717, 33787, 124481, 198711, 190736, 81236, -19980, 4186, 83536, 81267, 118430, 55485, 15190, 30487, 136355, 151065, 135614, 154262, 70370, 64016, 106620, 196406, 136438, 125914, 103268, 186086, 236247, 152635, 39092, 31914, 43053, 93209, 197220, 191864, 77671, -686, 44390, 50799, -45561, -141524, -108971, 104334, 174514, 110915, 64377, 15757, 36669, 115742, 68987, 68505, 17320, 38887, 29310]
23791B9310L692m1131J7030J08882l8071j23852j1179L3760k2924N2284J09419
23780A17220j4943J7480K7766O614K0779R331M3695J4258j01579j11131r0765
23769f1275K9526M1854M3632m4201m8634n800M5547J42M5495o2240j05139L3956
23757h7137P0624M8187j3154Q4554Q7744o737m5775l6337O6152K8251m3392K3927
23745A76907k6349M9198M4153J1662n9089q3470k3852k0078j3632j1870p7015
23734c3435k8079j5953L5239O8549M0426N3106j1870j8004J5226n7234l5709l111
23722I151m0230J1373L1153K2941P3957j4537j3375P875J0276N8694j1994j08183
23710C7101m4481J6687M9817J11751L8655k2085m2451p3264K8367N7516N074q3694
$$ y = [29310, 33002, -8129, 8901, 117783, 79712, -44140, -55319, -21559, -44483, 7801, 117220, 102277, 119757, 147523, 154137, 174916, 184247, 227942, 242200, 140621, 29490, -61275, -31749, 10105, 53737, 9536, -39098, -44898, 649, 791, 46286, -15954, -121093, -87137, -16513, 31674, 18520, 103074, 190818, 184081, 138306, 101969, 168121, 196372, 152980, 176907, 150558, 199756, 243909, 255571, 196482, 113012, 89160, 69082, 55450, 43580, -33435, -61514, -77467, -42228, 26321, 66747, 119853, 107983, 89979, 105205, 47971, 12262, 9151, -31079, -19706, 11447, 34388, 108345, 93808, 80433, 88308, 98584, 157278, 145284, 37101, -7380, 9307, 59124, 170875, 209530, 187445, 144994, 71730, 100097, 157613, 162687, 78993]
23698G8993n4444L5401o7052L0031P2111k0756o2859j3942m3638l7593P8004o70
23686f414P216m5719K8688M6050L1448p2438k95M4130O2157M6614o699o1471K8563
23673A01830Q7075o0212m2684L7619l2200l1141L4859m5165l7688l4339l3581
23662e5627N5164R7950M3866j0502l2303k0502k7329O9248J6129N016L7760j5199
23650A63671K8878l8223m3976O193k0118r5796P9959j0493l7826M3919L1674j177
23638A06685m4758N3719K3262r427n1031j7832L4279R5303q7493j36823O8881
23627C4765O8373n2250M421L8306N5990k6277L5921L0901n0788l8165R332J4954
23615A25483o7209p4666J178J0787L3859m4267l5927k8810M9719K7479j1415K4274
$$ y = [78993, 24549, 59950, -7102, 22929, 95040, 74284, 11425, -2517, -46155, -83748, -5744, -6414, 802, -44917, -16229, 29821, 61269, -11169, -11464, 32666, 94823, 141437, 134738, 73267, 101830, 188905, 128693, 86009, 123628, 91428, 60287, 95146, 49981, 12293, -22046, -55627, -463, 97487, 141353, 130851, 98548, 78046, 50717, 119965, 136094, 141110, 178870, 163671, 192549, 154326, 110350, 116543, 96425, 629, 80588, 70095, 32269, 76188, 107862, 106685, 61927, 115646, 138908, 129481, 78450, 60618, 94897, 190200, 102707, -34116, 34765, 103138, 50888, 55309, 93615, 149605, 123328, 159249, 190150, 139362, 101197, 110529, 125483, 58274, -16392, -15214, -4427, 29432, -14835, -50762, -79572, -29853, -2374, -13789, 10485]
23603A0485N3883P258J1949m270o6758j02963o1079M3783J8460l8781K8920R3177
23591e936P7599N8291o373l2150q7526P3073j3414n3398r872m0154j4237K1410
23579c2687J077j2458O5330J0632M2763P4646L9418o1174j01958j02866K9797
23568d7480n0693N9848O6504K4860k7797P595K4288m3335N6998Q3396N2233n308
23556B01109p5768r2175k9858k6194q522K9790L4172N1330L0866l2065n9694p1645
23544d8654J5947j385l0328L4055Q2481J9333k5815K0751O1166j62254q7567p5062
23532a97332J9908O0125J15744R1783O8555n2906l0489k7908O0828R9434q123
23521A99619n5525o8333k0762L1517n544Q8934k4774j4291j9971J4781j40366
$$ y = [10485, 64368, 71626, 83575, 79305, 12547, -90416, -151495, -107712, -89252, -128033, -99113, -5936, 71663, 129954, 123581, 91431, 3905, 76978, 63564, 10166, 294, -39860, -54097, -32687, -31610, -44068, 21262, 31894, 74657, 149303, 188721, 127547, 25589, -77277, -47480, -98173, -38325, 28179, 53039, 25242, 32837, 57125, 13790, 70788, 154184, 206417, 201109, 125341, 33166, 3308, -22886, -31408, -1618, 32554, 83884, 114750, 82685, 22991, -48654, -32707, -34092, -64420, -30365, 52116, 71449, 45634, 66385, 127551, -34703, -122270, -197332, -177424, -117299, -1555, 90228, 158783, 105877, 75388, 47480, 108308, 207742, 199619, 144094, 75761, 54999, 86516, 80972, 169906, 145132, 130841, 110870, 125651, -14715]
23510a4715n1989k1059M156Q0078N1497N2352j03663n9195J3086r3388P9124P1118
23498G402m7440N2958R3973m8744l1361j6596J8499N3671n0640j33830j09036
23487b11144J53J30299Q0077K2968o131p4575P3207J5783j746j3953k7465M0269
23475B7742l5580J8873O8416j2301J8501O6256J2192Q5464P7142L791o8941q1612
23463A79943q8892k6641J2725P527o846L359N3397l521o7401n5384n2896O2804
23451A8174P7043L4227K2448j1103j5742j01819r2290L1946O7589K5011p270L7092
23439H5306p8017j8220r576m9184k9200R6473Q4807K5483o986m0592l7363r5800
23427g2869L6701R2165R5569M2902l8407K4866j49334m0392K9976O5638J4813
$$ y = [-14715, -66704, -87763, -83607, -3529, 47968, 100320, -3343, -62538, -49452, -142840, -63716, 7402, -40038, 12920, 106893, 58149, 26788, 10192, 28691, 82362, 31722, -102108, -211144, -210991, -80692, -615, 22353, 16222, -58353, 14854, 30637, 28891, 14938, -12527, 27742, -7838, 11035, 79451, 67150, 85651, 151907, 164099, 249563, 326705, 330496, 261555, 179943, 91051, 64410, 77135, 84662, 77816, 81175, 134572, 131051, 63650, 8266, -44630, 18174, 95217, 129444, 151892, 140789, 125047, 23228, -69062, -37116, 30473, 55484, 48214, 85306, 7289, -10931, -20507, -69691, -98891, -2418, 82389, 107872, 100886, 60294, 22931, -72869, -36168, 55997, 151566, 194468, 156061, 180927, 31593, -8799, 21177, 86815, 101628]
23416A01628L295p6268O9630l1094J0249k9689j58935J3996J24611K8489J9591
23405G5503j1286n6529m9286K2262L2040L8405K5668r5836K9440j0674M4935L544
23393D8186j1144K6074o0525q5493k6656J8798l9467N5055M0561N9619Q2168J7472
23381A24648k3788j12986L3707J5895O701L7571R673n957K2558Q5014n2938L0791
23369A70889j5035j4586k6936M7174j67118l0205J99668j513k1775n0347k4905
23358F5311N582o3785O5648m409j27970M15J13570O7999K5759L2553K4988o9209
23346A36452p5380q7013k2451M0468q276o1876k6468J1359L1993l0062K5673J21947
23334E6366j2861m0464j0016j5843j4374l5672O1453j7750l1953P1157J6247J5028
$$ y = [101628, 104923, 28655, 98285, 67191, 77440, 47751, -111184, -97188, 27423, 55912, 75503, 64217, 7688, -41598, -19336, 12704, 51109, 76777, -19059, 10381, -293, 44642, 48186, 37042, 63116, 2591, -82902, -109558, -90760, -130227, -75172, -34611, 25008, 107176, 124648, 100860, -12126, 21581, 37476, 44177, 81748, 91421, 85464, 108022, 193036, 140098, 170889, 155854, 141268, 114332, 161506, -5612, -35817, 163851, 162338, 140563, 90216, 65311, 70893, 7108, 72756, 68347, -59623, -59208, 54362, 122361, 148120, 180673, 205661, 136452, 61072, -25941, -48392, -7924, -16200, -78076, -104544, -93185, -61192, -91254, -65581, 56366, 43505, 3041, -6975, -22818, -37192, -72864, -11411, -29161, -61114, 10043, 26290, 41318]
23322D1318N3024P9462k9151q0184k0383n4416J03122K5808m1750j2277o9023
23311d450o711p624j0544N4143R4879m2120r0053L286N167R1924M2258p501r4854
23298B7800J7566J9319m65l5456P3817L8829j7916p543l8956L2142l5911J1741
23286H4967o6081L3596m9212p327o0062m0827n3299N4166J7946n513j1401p8960
23274a82007J48867J04185J4161P844P086r3918k5422K8867J48381k1952j12797
23263B3295r9089j1075J415l5790J4077N1470m2925p5878J5851J65928M1040j7736
23251C0583j46099j8626J90716J21086J13126N5290l1077j46812j31017N8891
23241I6061J21437j8748j81371j4368J01793m581n4702J301M0394k125M7451n7110
$$ y = [41318, 94342, 173804, 144653, 64469, 44086, -10330, 92792, 118600, 76850, 64573, -4450, -11161, -18785, -29329, 24814, 119693, 77573, -12480, -9194, -4027, 87897, 130155, 122654, 27800, 45366, 64685, 64220, 28764, 102581, 141410, 123494, 115951, 76995, 109137, 73226, 84967, 18886, 52482, 3270, -4057, -64119, -104946, -158245, -104079, -86133, -91646, -103047, -182007, -33140, 71045, 85206, 93050, 100136, 6218, -19204, 9663, 158044, 136092, 23295, -75794, -86869, -85454, -121244, -107167, -55697, -98622, -174500, -158649, 7279, 48319, 30583, -115516, -134142, 56574, 177660, 290786, 346076, 314999, 168187, 37170, 96061, 217498, 198750, 17379, 3011, 104804, 100223, 45521, 46822, 87216, 85091, 132542, 75432]
23229G5432L384p9352k0642j6967N0164O7599l8331M46n3946Q9818J32568J1113
23217B21286q4471M1738M0066L0677p5783q5953o4406j1303J0109j1465n475Q9091
23205I4111R5511O5655l4478o1755j19778l5158Q7441O0939l6646N7174j9259
23194A53757n4649k9178k5532L9902O9269m6742m990L4046n3311l3784j7068j9321
23182A2399P2407K4558m6914j02987j2682Q1105Q5455M1485j9734N3455o7111
23171A21436k5971M0749M107J33j6598k3884k2515O1028J0324m6022q3422n4257
23159c4892R8995J08584m4506j31805k7312M1400k0000L7937N9250k2115j11341
23148d5805l0307J9364l2593m4321O3997J17915k7889J1383L6429q6542L0731
$$ y = [75432, 78816, -536, -21178, -38145, 12019, 79618, 41287, 41733, -12213, 77605, 210173, 221286, 136815, 178553, 218619, 249296, 173513, 87560, 23154, 11851, 21960, 10495, 5020, 94111, 189622, 255277, 220799, 159044, 39266, 4108, 91549, 152488, 115842, 173016, 153757, 99108, 69930, 44398, 84300, 153569, 106827, 101837, 135883, 82572, 48788, 31720, 12399, 84806, 109364, 62450, -40537, -53219, 27886, 113341, 154826, 135092, 188547, 121436, 95465, 136214, 140321, 140454, 123856, 99972, 77457, 138485, 148809, 102787, 19365, -34892, 64103, 172687, 128181, -3624, -30936, 10464, -9536, 28401, 87651, 65536, -45805, -76112, -56748, -89341, -133662, -69665, 48250, 20361, 31744, 68173, -18369, 12362]
23137A2362J24748L997N5086L8127q0139j04884j6900m6066K9682L0282P4443
23126A20738p051o1738n7240k0808L9150K0241o1165k7169J2533O7944j6853K4104
23114C2686N1348J9032n9155j7328N1264O7393p7157P8672J235P360j30359r5778
23102g0787O8126J6911P1735J8848J2416K4861m3055j03263o7582M6451l2251
23091e7590L545J19813O7466R961o4816M231K3036J2268L0002j19686m7584N9019
23079C9665p088K4104Q790p1003k9884J25414J04543J1578Q0875J2699j34399
23068A65294j01596R0301o6625p7430r581P1036K8258k4240j17148l9744J6484
23057f4991N0776K3343m3696N2425J5930L554L9500Q100J1194J12627q549o7222
$$ y = [12362, 137110, 141107, 196193, 234320, 154181, 49297, 32397, -13669, 16013, 46295, 120738, 113687, 51949, -5291, -26099, 13051, 33292, -27873, -55042, -42509, 25435, 8582, 32686, 84034, 103066, 43911, 26583, 77847, 145240, 68083, 146755, 147990, 155350, 24991, -70787, -2661, 14250, 85985, 104833, 117249, 142110, 99055, -4208, -71790, -25339, -57590, -54045, 65768, 133234, 143195, 78379, 82610, 105646, 117914, 147916, 28230, -19354, 39665, 32577, 56681, 65471, -5532, -35416, 89998, 194541, 206119, 286994, 299693, 165294, 63698, 153999, 87374, 9944, 363, 71399, 99657, 75417, -41731, -81475, -64991, -14215, 9128, -34568, 17857, 33787, 37341, 76841, 84941, 96135, 208762, 200213, 132991]
23045A32991j19985M0877J10767K4660J7354K0379q2932r015Q7399M5468j9463
23034B48500j10971j31995k3187K9878o0701k223J00332J4440n8114o0996p1200
23023a26237l0889m69N2120N6997K4193Q0397o5022j5122P7895R0546j8338r7128
23011B8943q3128N0329L5707l424J1829n0241j20037j1966N4960J862m250O3269
22999b6147Q4332J1641q9306J1053K9979J7270Q6290r1352K7304J11934k0170
22988A52828m7190q6921l4564K7295K8158P2045L4381l339M2482L7163J97708
22977D20046L34277M62362K97104L4661j59337k38766l27463k59687k02706j05303
22967B55188j5297N8113n1525n1688l9330j18140m5376J1944K9354L5804R059
$$ y = [132991, 13006, 53883, 164650, 189310, 206664, 227043, 144111, 135096, 222495, 267963, 248500, 137529, 5534, -17653, 12225, -48476, -50699, 49633, 64073, 5959, -55037, -126237, -157126, -157595, -105475, -48478, -24285, 56112, -8910, -24032, 53863, 144409, 126071, 28943, -54185, -3856, 31851, 28427, 40256, -9985, -130022, -141988, -87028, -85166, -89416, -26147, 58185, 69826, -19480, -8427, 21552, 38822, 125112, 33760, 61064, 172998, 152828, 105638, 18717, -15847, 11448, 39606, 111651, 146032, 142693, 185175, 222338, 420046, 754323, 1216685, 1513789, 1548450, 1389113, 1150347, 822884, 563197, 360491, 255188, 239891, 298004, 246479, 194791, 155461, 37321, -8055, 3889, 33243, 69047, 78106]
22956G8106k0833j8714L348J9473j6372J3151m2170k0648J24642r2745L217J6373
22944D6828n3174p7459O9940O5311j7806k4616m6217k6397M1959K1951n2111M5224
22932f567P651j22584r0235O5179R7090M5521J2122K7958M9559l3421O8829j4387
22920A06715N3124o4865n6325m2077m8164M2685r660M8189L5072j16914l4062
22909h6282J40139P3126p0589P9541P1876p4969q6342n0031j8118m7966q081K370
22897g5326q3071J68867J50565K6015k6219q7958N341o7490L1786p694j07624
22886g2808J1646O6486L2282J8772o3208q2258M098J0749L8093M4348Q6849L9838
22874A34887J28458N8320n8872n1024k1872k0644l3625M2074N4819q3193q3461
$$ y = [78106, 57273, 38559, 41907, 61380, 45008, 58159, 15989, -4659, 119983, 27238, 30455, 46828, -6346, -83805, -13865, 51446, 33640, 9024, -37193, -63590, -21631, 320, -51791, -6567, 1084, -121500, -211735, -146556, -49466, -3945, 8177, 36135, 85694, 52273, 121102, 106715, 159839, 94974, 38649, -3428, -51592, -8907, -18567, 29622, 64694, -52220, -86282, 53857, 126983, 56394, 135935, 207811, 132842, 46500, -3531, -21649, -69615, -77696, -75326, -158397, 10470, 161035, 187050, 160831, 72873, 78214, 10724, 42510, 34816, -72808, -61162, 5324, 37606, 56378, -6830, -89088, -84990, -74241, -36148, 8200, 95049, 134887, 263345, 321665, 262793, 211769, 189897, 169253, 135628, 177702, 232521, 149328, 65867]
22863F5867r1987O6987J0830r1652O2020M6791l0963P7482r16j2814j0441l9678
22851E1526j2711K3779O069K6443L7886J6936l5791n5385l5542q409O2019R4012
22839A70832L1360j19648j21015m655m4955J8425M1142q6626R7128L8213p4818
22828e4617r756Q7696k3040N909l2380o7924P826P8096Q536J309j8351K2409K7865
22815C3578Q4957R1226J2348k5560J3172o2518p2274o4638r8244j1360J04908
22804E595k147M2580M7859o7305o3844O2640J12876o9804r063n5750J1870k4033
22792h526O0295R635n1302m4164J3155P2005p1738l2247J3744l9443J2103L6066
22780c0417O0510k6963n3480P577L8214M8793L7275M9930o3840l5212O7966P0387
$$ y = [65867, -26120, 40867, 51697, -39955, 22065, 68856, 37893, 115375, 114459, 101645, 91204, 51526, 38815, 62594, 68663, 95106, 132992, 149928, 114137, 58752, 23210, 14801, 76820, 170832, 202192, 82544, -38471, -43126, -88081, -69656, -28514, -115140, -18012, 20201, -54617, -64373, 23323, 283, 6192, -26188, -94112, -86286, -8190, 346, 1655, -16696, 5713, 33578, 118535, 209761, 222109, 196549, 209721, 147203, 74929, 10291, -87953, -99313, 5595, 3448, 46028, 93887, 26582, -37262, 25378, 138254, 68450, 59387, 3637, 15507, -8526, 51769, 61404, 10102, -34062, -20907, 51098, -20640, -52887, -39143, -78586, -66483, -30417, 30093, 3130, -50350, -42773, -4559, 44234, 81509, 131439, 67599, 32387, 100353, 170740]
22768A70740K5376k5538o2016r640l1289j30085m6131K5451r1619P0970O9106
22757c4675j5078k8626L7226R3819o0799m8969L1424n3456m9987R3730J00073
22746F4682j8671R420k9666J4611m7137N0201O3410j34900p247R4113Q5319K7536
22734A71671l5009j23469p7496J12551L2929l5870r6984J1723N6397o9448p0038
22723a23043O3841J6349K8134m3213l2452J70306j9839Q367m085k2017N9307J6511
22711A18166J3729k8774q7516O9594l4661L2620k6873l3571N4789J4199o4562
22700B7140o3429J9380J40266J06061o202j8360p076j14568K5936m0277o4386
22689D485J6394L3882J2162m2743o0250J8462K3214n318O065L0005o9261J07981
$$ y = [170740, 196116, 170578, 108562, 98922, 67633, -62452, -108583, -83132, -174751, -103781, -34675, -49753, -78379, -41153, 52666, -8133, -57102, -25678, -79134, -129121, -35391, 64682, 46011, 55431, 25765, 40376, -6761, 43440, 106850, -28050, -35297, 58816, 144135, 171671, 136662, 13193, -64303, 48248, 81177, 45307, -51677, -39954, 16443, -53005, -123043, -59202, -42853, -14719, -57932, -90384, 79922, 60083, 68450, 64365, 42348, 101655, 118166, 131895, 103121, 15605, 85199, 50538, 83158, 56285, 22714, 77503, 91702, 27140, -36289, -16909, 123357, 229418, 223216, 204856, 197780, 83212, 109148, 68871, 4485, 20879, 54761, 66923, 24180, -36070, -17608, 5606, 288, 6353, 36358, -32903, 75078]
22677G5078M3424p1970K1788J05916R1646j5262o7379R79k5067l8239L7766N630
22665A64310M8236Q0019m0829n9076k6090n3673L7190r048n7751m2305Q5753J2277
22653A39013k1875R8304k3467r2814q7603N6207l779m3718K1022j4431P8195J16558
22641B21612O1140m3572r9125J0613L3164n7824P181k4860k3093m422L8620P4139
22629A93573j08812q2402j1121O2941m8708L0691Q764j18213l6317J8786K9231
22618f1587J01165J18424L7131O4034N9394r9989j82081j29537k9342l8444o4843
22607b25675n826L4570j7654k7980j478M3487l7301l1956o5510L2432M6841M0903
22595b15147N2616k0162j5787M5699j3061R268J03466o663j19348k6482R9000
$$ y = [75078, 118502, 46532, 68320, 174236, 265882, 250620, 183241, 184220, 159153, 120914, 158680, 164310, 212546, 292565, 251736, 192660, 166570, 112897, 150087, 141039, 83288, 40983, 126736, 139013, 117138, 215442, 191975, 99161, 11558, 67765, 63986, 20268, 41290, 26859, 105054, 221612, 282752, 239180, 140055, 150668, 183832, 126008, 133189, 108329, 85236, 80814, 119434, 193573, 84761, 2359, -8762, 54179, 5471, 36162, 44926, -73287, -109604, -90818, -61587, 39578, 158002, 195133, 259167, 318561, 218572, 36491, -93046, -122388, -160832, -225675, -231501, -196931, -214585, -242565, -244043, -200556, -237857, -269813, -335323, -302891, -256050, -215147, -162531, -182693, -198480, -152781, -165842, -156574, -53108, -59771, -179119, -205601, -106601]
22584a06601m5239r2302j884J7410J0777J66047O0731j9259O3948L0696L6132
22573A20456Q7544R0257m5940p5747o2430k0814o693j4823n3101n4655O6595J79174
22561B09823O0844m9586j22321j32610j4453q8720q6073L765l1087j3132K9157
22550b34393J6347M1636J65052J82656Q4638M227r1182l0893J4097N4509J7130
22539B23824n8653n6217L1186J0636n2280r498K2253N5323N2165k6665L866j44339
22527E1601j19783q2830Q1031K6966m8727L5212k6072Q7265l7948M6896m758r607
22515g54n468J25814J7632o7672j08040Q1246P6211P3860N6778j6684J00053J56190
22503D89166P0813K60484M80173L25531J04698j41410m01868m56223k73090j66693
$$ y = [-106601, -151840, -244142, -246026, -228616, -217839, -51792, 8939, -10320, 53628, 84324, 120456, 208000, 298257, 252317, 176570, 114140, 93326, 86633, 71810, 18709, -35946, 30649, 209823, 270667, 221081, 98760, -33850, -48303, -137023, -223096, -219331, -250418, -263550, -234393, -218046, -176410, -11358, 171298, 255936, 260163, 168981, 138088, 152185, 206694, 223824, 165171, 108954, 140140, 150776, 98496, 88998, 111251, 166574, 218739, 192074, 195940, 51601, -68182, -151012, -69981, -43015, -91742, -56530, -82602, 4663, -33285, 13611, 8853, -754, -6222, 119592, 137224, 69552, -38488, 42758, 118969, 192829, 249607, 232923, 332976, 489166, 559979, 820463, 1300636, 1626167, 1730865, 1589455, 1187587, 731364, 458274, 291581]
22493B91581j20513r5897O1926Q10l1765K4427P1041R4190l4144l7124K5333K6059
22481B75924J373k5857q8004k0058k0l5233M3094Q905M3435J12929K3058N0839
22469C90385N7764M0322L8235j275M70j05475o1455j70098j60197l2228J75991
22458A72439K62730K76731N1909J84926Q0771j2108J2821P1803J33938M6752N2520
22447A335232N4782J57755J59018J73219J63624J09425J74371L15538O56433R75982
22437D275379J316158J716392J999757K349757K824061L792236M790702O816334
22429B9880776J0823992J9360529L8204668O9445212Q1370844N3475297J4418310
22422C16979628l4271179p2625956p6475672n2654899k7658351j5100634r439217
$$ y = [291581, 171068, 75171, 137097, 137907, 106142, 130569, 201610, 295800, 261656, 224532, 249865, 275924, 277297, 251440, 163436, 143378, 143358, 108125, 151219, 160124, 203559, 316488, 339546, 390385, 448149, 488471, 526706, 525431, 525901, 420426, 358971, 188873, 28676, -3552, 172439, 435169, 711900, 763809, 948735, 1029506, 1017398, 1030219, 1102022, 1235960, 1282712, 1335232, 1390014, 1547769, 1706787, 1880006, 2043630, 2153055, 2327426, 2642964, 3299397, 4275379, 5591537, 7307929, 9307686, 11657443, 14481504, 18273740, 23064442, 29880776, 40704768, 60065297, 98269965, 167715177, 249086021, 302561318, 316979628, 282708449, 210082493, 133606821, 80951922, 53293571, 38192937, 28753720]
22415B8753720o546818m986102l519673k280716j454657p69168n34581m31824
22407H230181n67922q55303q12396n93860m86321l76713m76637l28446k40338
22398C492245k12510k66625j60488j91784k57081k11982j36677j73900q7017J766
22388A795947R173n3071q6606j66105k06362j17779j10248j17119j18989l4112
22378G94729n6066L1945L9789K18997J70921K28073J76721M1600r7879j39096
22368A409734k14422k11445j70043n0277J06987N2744P7041j18588j7576q9913
22358G74242j27413n3689j22964J0135J32305m8240l1397J18633P2026J79802
22348I03440N01188M80709J93811k3605l11371m87816m24754k35638m2438n746
$$ y = [28753720, 22206902, 17220800, 13701127, 11420411, 9965754, 9196586, 8662005, 8230181, 7662259, 6806956, 5994560, 5400700, 4914379, 4537666, 4061029, 3732583, 3492245, 3279735, 3013110, 2852622, 2660838, 2403757, 2191775, 2055098, 1881198, 1794181, 1795947, 1805120, 1752049, 1665443, 1499338, 1292976, 1175197, 1064949, 947830, 828841, 794729, 738663, 770608, 810397, 1029394, 1200315, 1428388, 1605109, 1646709, 1548830, 1409734, 1195312, 983867, 813824, 763547, 870534, 923278, 1000319, 881731, 864155, 774242, 646829, 593140, 470176, 480311, 612616, 564376, 532979, 651612, 723638, 903440, 1404628, 1885337, 2079148, 2055543, 1744172, 1256356, 831602, 595964, 553526, 547780]
22338E47780k2204o2281l602j31740q6304p4999k1472P5661p27N9161L2165l359
22326C08079n3800n9168j55K9368k2324j2504p495K3839k395R649p8574q049p252
22313A19219p6682p0844J570O5837q6938j6307J7490O0913O5920k1615k6436k879
22301B9248P0166M9701J1559L7972J18138N335l496Q8285L7990j21185j05609
22290B18104p4073m4791Q604n7323o5930L653N7998R5227k5255n5688p3481N1847
22278C8892J23232K7118j30967j14422q8688j7170Q2480P2951k8630m8957M6792
22267c7369R8907J3756J7778O2141j5440k9124P549p5062L5831r240L2990J34130
22255B36847K8327m8616r353K3138K9612p184p1783M982O5660Q5418j2734j04261
$$ y = [547780, 525576, 463295, 459693, 327953, 241649, 166650, 145178, 220839, 220112, 279273, 311438, 308079, 254279, 195111, 194956, 224324, 202000, 189496, 182001, 205840, 203445, 213094, 134520, 126471, 119219, 42537, -28307, -26737, 39100, -47838, -64145, -46655, 14258, 80178, 58563, 32127, 29248, 99414, 149115, 160674, 198646, 316784, 322119, 318623, 406908, 444898, 323713, 218104, 144031, 99240, 107844, 50521, -15409, -11756, 46242, 141469, 116214, 60526, -12955, 38892, 162124, 189242, 58275, -56147, -144835, -162005, -79525, -6574, -35204, -84161, -37369, 61538, 75294, 93072, 155213, 139773, 110649, 118198, 43136, 78967, 69727, 102717, 236847, 265174, 216558, 207205, 230343, 259955, 252771, 180988, 185970, 251630, 337048, 324314, 220053]
22243B20053n6142K518M7194K2873J29164O002r0942j32537j31831j48570j28565
22232b60783J0463K8371N7960J30513J13219p1363l4037k4876r299M0660o5350
22221h4522L4177l0171l8326R1498P5923p5288O5707R1085o249m1999n4092K6799
22209E4542K6148J3316k9990J05378r587o5157o2309m2331l2825o0370K659K7299
22197g3227P0695q826l5772L7661m922n2452J5894J8310o57q8283M5324Q521L5095
22184c2639J4697O494K0218K7505o6400o1730l4984M9099R4228O1873k6947j2910
22172C8504M7994J3651n221M4953K4350q2493J736P5866J17222J11218L9032n9276
22160C67536j18630l8011l3348m7113p4280j6552j0387r464o585j6139O0502o1458
$$ y = [220053, 163911, 166429, 213623, 236496, 365660, 371662, 280720, 148183, 16352, -132218, -260783, -250320, -221949, -163989, -33476, 79743, 8380, -25657, -50533, -59832, -19172, -84522, -50345, -80516, -118842, -27344, 48579, -26709, 38998, 130083, 123834, 81835, 27743, 54542, 80690, 94006, 64016, 169394, 159807, 94650, 32341, -9990, -42815, -103185, -100526, -73227, -2532, -11358, -47130, -9469, -14391, -66843, -50949, -32639, -33296, -121579, -76255, -67734, -32639, -17942, -11448, 8770, 36275, -30125, -91855, -126839, -77740, 16488, 78361, 51414, 38504, 86498, 100149, 94928, 139881, 164231, 81738, 83474, 159340, 276562, 387780, 426812, 367536, 248906, 210895, 177547, 130434, 56154, 39602, 29215, 19751, 13166, -2973, 57529, -3929]
22148c929r4499N7823L8418L6785K2452q8739q1742P5991j0915L846j8569N1548
22136a1530O8757p517o6554l2492l063j2478o3674K6013J03809k6363m3761l9042
22124a07895P9636m9586j9460J02845k243m6691J7907Q4873L6569N2463J07535
22113B55953o4402q8201r5315p2151n4054K4971J46075L831j31387j4335p912
22102i6927R9759l4792p6772M5326K6495k2159M917J5028R722j0078J35440Q7938
22090A83897l0641J734l8503k1343n9892R868Q562k1507L0088j9178r4367j1596
22078f2878J1571N222P1546j7815L973j1397N4001k5265J4701M5398J2611n1722
22066D9946p0323K9267O1214M4384L8497J5169k3620p5178n2499k8119r5942k5018
$$ y = [-3929, -98428, -40605, -2187, 34598, 57050, -31689, -113431, -37440, -48355, -44509, -63078, -11530, 57227, 49710, -16844, -49336, -52399, -64877, -128551, -102538, 1271, -25092, -68853, -107895, -28259, -77845, -97305, 5540, 3297, -43394, -25487, 59386, 95955, 148418, 255953, 191551, 103350, 8035, -64116, -118170, -93199, 52876, 56707, -74680, -89015, -96927, 2832, -31960, -108732, -63406, -36911, -59070, -54153, -39125, -29403, -39481, 95959, 183897, 153256, 154990, 116487, 95144, 35252, 45120, 53682, 32175, 62263, 43085, -51282, -62878, -51307, -46085, 25461, 7646, 11619, 222, 54223, 28958, 43659, 89057, 101668, 49946, -20377, 8890, 70104, 114488, 152985, 168154, 144534, 69356, 16857, -11262, -107204, -132222]
22054a32222Q2705R5828k9583n7282k6568O3360j4693L9990P6536J18372j24841
22043I1602o1838n5592N3507M4231K7886n1436p1165K5729l7036N099P9691l893
22031D6785q4804o7694L0897R3123K6813j2751l0358k6749K8960n8279o816r024
22019f9897N0588P5695L8531o9068n8347k715O243J8140O784l7496k3257N8241
22007f558Q4461m7447k2569M8914J7801J6713j6939K3307q9161k8261o8432J6984
21995g1187J24797J06809p3964n4316Q2070N122q1126j09597n5648j8596K6472
21984a19164K9725n4258J611R602Q83n7528n5032P1316O0217p407l323Q3271q5761
21971a25848l9719K3611o3778L0386Q6088P9560k6487j7915k9652r6782r4747
$$ y = [-132222, -49517, 46311, 16728, -40554, -67122, -3762, -18455, 21535, 98071, 216443, 91602, 29764, -25828, 27679, 71910, 99796, 48360, -22805, 2924, -34112, -29013, 50678, 46785, -38019, -105713, -74816, 18307, 45120, 32369, 2011, -24738, 4222, -54057, -60873, -69897, -19309, 56386, 94917, 25849, -32498, -35213, -28970, -10830, -4046, -41542, -64799, -6558, 77903, 30456, 7887, 56801, 74602, 91315, 74376, 97683, 8522, -19739, -88171, -71187, 53610, 160419, 86455, 32139, 114209, 119331, 38205, -71392, -127040, -145636, -119164, -89439, -143697, -142086, -132484, -131601, -189129, -244161, -172845, -112628, -120035, -123358, -40087, -125848, -165567, -141956, -205734, -175348, -89260, -9700, -36187, -54102, -83754, -180536, -275283]
21960b75283J11748j3989J8538J22419N1195K3915n1973r5002M0459Q8150M6954
21949F7131K8846N7436J8095l5958k1509k2649o5829J6868M4842k9850j11723
21938e4300j35900m068J27932P8002m3679L6290P3531K9326n0905o545r9758P923
21926d2151J8684n5542k6809k9418m4867L6641L9571P3732L6091j40787k8017
21915a62872P3937L7054o9584n3989P5334K4485n9200J05139P1920N0335p4646
21904A7913q4120K7434j2770N0690J44008o7707j07562L6513R6739J3351l5660
21893G8829J7858P861k8750m0268P68m9969l5950L9244j136l4706L5523L7368
21881B6672J33151M5726O0579M218j32249r2887n1692n5945l764J16389J9918
$$ y = [-275283, -163535, -177524, -158986, -36567, 14628, 38543, -13430, -108432, -67973, 20177, 67131, 95977, 153413, 171508, 135550, 114041, 91392, 25563, 42431, 87273, 57423, -54300, -190200, -194268, -66336, 11666, -32013, 4277, 77808, 107134, 56229, 49684, -50074, -42151, -23467, -79009, -105818, -135236, -180103, -143462, -103891, -30159, 5932, -134855, -162872, -88935, -51881, -121465, -175454, -100120, -75635, -134835, -29696, 42224, 92559, 17913, -66207, -38773, -51543, -853, 143155, 75448, -32114, 4399, 101138, 114489, 78829, 96687, 104548, 75798, 35530, 36298, -13671, -49621, -10377, -11513, -46219, -10696, 26672, 159823, 205549, 266128, 270346, 138097, 45210, -6482, -62427, -66191, 50198, 70116]
21870G0116O0962N7320O8526J31895L17317L50536L59652K08047j93259l40489
21860A090623l00418k62866j38881j23898j44340p3364K409j27483o5998O4407
21850g9809N4191L0163P4621L0876n6764R8182m780k6068O0043L504j8652p2871
21838I2636P010K1454n7600l5146J6943r937P859l5361J918j6101l901r6219j09498
21825b15943P395L7663M6945M2806O6848J7820q9872M5791q1751l4515L9N7133
21813i9641n8777M3784M0616l8162L0867P559m5287l2481J35557l6526k2619N8880
21801a6230K5894L014o7043k6604N2303N0279K2423o5724p6207K7171K3136m9389
21789i6977J134M5006n1098m985O1361K5522j27303l6939J30008P3958o5128l768
$$ y = [70116, 131078, 188398, 256924, 388819, 706136, 1056672, 1416324, 1624371, 1431112, 1090623, 790205, 527339, 388458, 264560, 120220, 46856, 49265, -78218, -144216, -79809, -25618, 4545, 79166, 110042, 53278, 151460, 146680, 120612, 180655, 184159, 165507, 92636, 99646, 121100, 63500, 28354, 45297, 35360, 43219, 7858, 9776, -6325, -10226, -106445, -215943, -208548, -170885, -123940, -81134, -14286, 3534, -86338, -40547, -122298, -156813, -156774, -99641, -158418, -114634, -74018, -112180, -81313, -73754, -119041, -151522, -15965, -52491, -75110, -16230, 9664, 12678, -54365, -80969, -28666, 21613, 44036, -21688, -97895, -70724, -47588, -96977, -95843, -50837, -101935, -106920, -45559, -20037, -147340, -184279, -54271, 19687, -45441, -49209]
21777d9209N6245L9517j0388o6352l0996m1436o9443N8845J03455K7809l4064
21766a6017K8943n9225o2374M8247R0413l4267J3744L487m1670q218j4615j18259
21754a69811N2755L7491L8406O2402K9350o4632R573O6466l3818j03064K9784
21743d5098J09814P1451l4303j1364l6168p033j57921p4992L420N7044J23132
21732b018J2446l4042L3445n215J03503R5385q7877j54646p5379P3001J17822
21721G6425M0069n3278o9797K7565R0336j5420K6685K6188J2273r1933j07011
21710c7898m441l9210K1857m2872p0198J2537J4798o227N4500K8545L8567k746
21698c2788K932L9543k7588O303l9101o0077K7596K3024n2989p8298j04632P2900
$$ y = [-49209, 7036, 46553, 36165, -30187, -61183, -102619, -172062, -113217, -9762, 18047, -16017, 12926, -46299, -108673, -60426, 29987, -4280, 9464, 12951, -28719, -36937, -51552, -169811, -117056, -79565, -41159, 21243, 50593, -14039, -4466, 62000, 28182, -74882, -45098, 64716, 136167, 101864, 90500, 54332, 47299, -110622, -185614, -182194, -125150, -2018, 10428, -23614, 9831, 4616, 108119, 203504, 115627, -39019, -114398, -41397, 76425, 116494, 63216, -6581, 20984, 111320, 95900, 122585, 148773, 161046, 69113, -37898, -42339, -81549, -59692, -102564, -172762, -160225, -145427, -151654, -97154, -68609, -30042, -32788, -29856, 9687, -17901, -11598, -50699, -110776, -83180, -60156, -113145, -191443, -296075, -223175]
21686b23175J03207L9415J05339l4842l2196K0678r1075P940K9409L5941M0963
21675A604L8713O36p1138J1228L574m8633l8602Q5474J19503L0356j23943q4218
21663g5446J04803N8699k0642n7302n2128K763n4530M8809p184n6920L0735M6299
21651c2044p4671o0288J3434N6153l0586P4530J7918P6618K6568l8864r6301O9861
21639B328k9215j6713J9993R810j7349o4767N0849Q3234P5167P1086j2666k7137
21627A44620r0291p381l1353Q3715k0957n8226M5193j8595Q751q3778M2256M8495
21615F2449j8871L7166q5732j31869R596Q5046Q644K548P521j6894l5293K6873
21603d8816n6044r5008J6122K6880N2182R9755P2227o2756j26801J0669k0945
$$ y = [-223175, -119968, -80553, 24786, -10056, -42252, -21574, -112649, -104709, -75300, -39359, 1604, 40317, 40953, -30185, -18957, -15383, -64016, -102618, -17144, 102359, 132715, 8772, -75446, 29357, 88056, 67414, 10112, -42016, -39253, -93783, -44974, -52158, -109078, -78343, -32044, -106715, -167003, -153569, -97416, -128002, -53472, -35554, 41064, 67632, 28768, -67533, 2328, -26887, -43600, -23607, -13797, -31146, -95913, -45064, 38170, 113337, 184423, 171757, 144620, 54329, 46948, 15595, 99310, 78353, 20127, 65320, 46725, 55476, -28302, 13954, 62449, 43578, 80744, -4988, -136857, -127261, -42215, -33571, -31023, -23502, -40396, -75689, -48816, -104860, -199868, -183746, -156866, -104684, -4929, 67298, 4542, -122259, -111590, -132535]
21592a32535K030O0757O9036k4104q3577m4633N5890L3566r741K3420K7645J4129
21580h117p473L4897R0275J4240j55990q6540J0867m3483L4877N9984O8485N58
21568A2580R1194m6204j52700K3579N5710n0185k8717J2840M845J26338O3596
21557A12876n2597K3587j0792l9107l8162k9827J2496P584j3367k1364k1932l2497
21545a03102L8705P9652l7546r210k0801p6897m7458K7636R126Q376O3972m5389
21533a12936p8939N3935R2233r6047k534N2571l7433P846N2852j2675N9987R9669
21521G8529j2746p7872k4148k3812l9770n6722J5395q271J5050J0545l889k9733
21509a57444N9423J19444j30835p3020M4201O4706O6314p1639m9210J62202K6950
$$ y = [-132535, -130505, -69748, -712, -24816, -108393, -153026, -97136, -63570, -73311, -49891, -22246, -8117, -15590, 19307, 109582, 123822, -32168, -118708, -107841, -151324, -116447, -56463, 12022, 12580, 103774, 57570, -95130, -71551, -15841, -66026, -94743, -81903, -77058, 49280, 112876, 60279, 83866, 73074, 33967, -4195, -34022, -21526, -13942, -27309, -48673, -70605, -103102, -64397, 15255, -22291, -31501, -52302, -129199, -176657, -149021, -139895, -131519, -67547, -112936, -191875, -137940, -45707, -141754, -144288, -91717, -129150, -121304, -68452, -81127, -21140, 78529, 65783, -12089, -36237, -60049, -99819, -156541, -141146, -149417, -134367, -123822, -127711, -157444, -98021, 21423, -109412, -182432, -138231, -73525, -7211, -78850, -128060, 34142, 61092]
21498F1092n4390j35772l0664K1469J3971N7175m9563J03232J50o5594j0081p70
21486h9745L0209O415m7368l0015N4371n502N4285J23248n4361j06093q640L0191
21474d3005m0715l4865r0473p2459K0552N4648P6959J4175K8676R5584O1831n7771
21462A3137l0543o475R5046M0072j22645k256N7949Q5495j7882j04910p5545R6482
21450B7925K9485K1963o6237l4987J4403k2107j96072r0236J34062O8986k8680
21439a41495n5075Q939J64776K17288l6920j95602m67O851j30283k8138R2536
21428i7590N8396N0031m7474r1309q343N0362Q0169k213M7202K8075L6869Q682
21416A12857o1605r7335k6034o1198l2893M6134N7077M1788M364P825O2654K5036
$$ y = [61092, 6702, -129070, -159734, -138265, -124294, -67119, -116682, -13450, -13300, -78894, -88975, -89745, -59536, -53121, -100489, -130504, -76133, -81635, -27350, 95898, 41537, -64556, -73196, -43005, -83720, -118585, -209058, -281517, -260965, -206317, -129358, -115183, -86507, 9077, 70908, 13137, -17406, -23881, 71165, 111237, -11408, -13664, 44285, 129780, 111898, 6988, -68557, 27925, 57410, 79373, 13136, -21851, -7448, -29555, -225627, -315863, -181801, -112815, -141495, -196570, -187631, -22855, 194433, 157513, -38089, -38556, -31705, -161988, -190126, -97590, -39194, 10837, -36637, -127946, -136289, -85927, -5758, -7971, 39231, 67306, 104175, 112857, 51252, -46083, -72117, -133315, -166208, -120074, -62997, -21209, -16845, -9020, 53634, 78670]
21404G8670j13270M7150J7139q241K7128l0245j17299j49447N5995L8601J5647
21393a38172O6440K127o4419J6529L7917l3695N9128k9568L2544Q2418M9334m4484
21381C6099m2644o7377K2360J78636j0220k41233q1454O4548M4809M3819j2988
21370f5645l5960M5217o8013Q548M1575m7651k7665J0974m1659M2041K3029l77
21358a15586R8810K469q0771l3448j7777L7769N9319K2989K3391j911L5239j5463
21346A5030P3538O7k0730n4417n1230M0161O6150l9906j8697N7562P1688j8168
21334A21048j18078k5628m9721M1794O2252p5011k7022o8932K5869Q3171J2406
21323a7852N7202J0704p861o9593q6160N4097K1248K5412J2857J3734M2983q73
$$ y = [78670, -34600, 12550, 29689, 21448, 48576, 18331, -98968, -248415, -192420, -153819, -138172, -71732, -69605, -134024, -117495, -79578, -113273, -54145, -83713, -51169, 31249, 80583, 36099, -6545, -73922, -51562, 127074, 116854, -124379, -205833, -141285, -96476, -52657, -65645, -101605, -56388, -124401, -115853, -74278, -121929, -149594, -138620, -180279, -138238, -115209, -115586, -16776, -14307, -95078, -128526, -146303, -108534, -49215, -26226, -2835, -4746, 30493, 15030, 88568, 88635, 67905, 13488, -37742, 2419, 68569, 28663, 9966, 67528, 139216, 121048, 2970, -22658, -72379, -30585, 31667, -43344, -70366, -139298, -113429, -30258, -17852, 39350, 50054, 42193, -27400, -113560, -59463, -38215, -12803, 54, 13788, 56771, 55898]
21311E5898j06163p2132J8499l0254J061j4742N4101M1758L2535o3365J1197N9115
21299a2492L8660o397o1975r0975K2587M097r7924j5683O6891P2251P6873j826
21287e913m0368n5614p5738N1616O7751M7398m0060o8528o1357n0603J09367P4503
21275d7546M2799m1077L3778N7588K8901n4964j43312l7387J17673l0815M3857
21264c0505M2675p9651o3534K033q2394j2574J16011k036n0254O366J44547L0164
21252B0848o4174j3160q7689n0013J7319M3264Q8722M3938k6773J6419K2928j1578
21240E1j25016q7362J33017J19962N4745M18k3770R437N540q7728j27820P052
21228a21474L1441J5319N4208M6196Q8124L7585j7816j55332l2524l4416k860
$$ y = [55898, -50265, -122397, -103898, -134152, -133091, -147833, -93732, -51974, -19439, -82804, -71607, -12492, 26168, 19771, -42204, -133179, -110592, -106495, -204419, -220102, -153211, -80960, -4087, -5913, -46281, -101895, -177633, -126017, -58266, -10868, -50928, -119456, -180813, -231416, -122049, -47546, -4747, -45824, -12046, 45542, 74443, 19479, -123833, -161220, -43547, -74362, -30505, 12170, -67481, -131015, -128982, -211376, -223950, -107939, -109975, -160229, -153863, -9316, 20848, -43326, -56486, -144175, -194188, -176869, -133605, -44883, -945, -27718, -11299, 11629, 51, -124965, -212327, -79310, 40652, 95397, 95815, 72045, 81482, 87022, -706, -128526, -121474, -90033, -74714, -20506, 25690, 113814, 151399, 133583, -21749, -54273, -88689, -91549]
21217i1549J2202R4010j4865k0949K4009r6280o0806N3395n3273Q7645j669j2654
21205h0784M5865N6827O3686o4010o6878j9194M8554o7125l4051N8684L9982O6192
21193D7748J4106O1646k7513J1211J8988m7884n6565k9198J8328r1373k3772m7526
21181a51804n4797P8019O6139P6345J01579N5895k5906m4336m1064q1569N462
21170a6037M33j901R8636O4410j24522j3163J2253m1726Q755L1235K365J8119
21158C8857j8110J7436k3033n2800k7595p7954n6393l7997J90432J7025o2177
21147i2309l2121L848j6294J00145K6114m5051M2262J293m5365k4096L0026J1325
21135d0223k027M801l0334O271O0075M364j2239o8470r1270J8132J17000K8941
$$ y = [-91549, -79347, 14663, -202, -21151, 2858, -93422, -154228, -100833, -154106, -66461, -68130, -80784, -34919, 21908, 85594, 21584, -45294, -64488, -15934, -83059, -117110, -58426, -18444, 47748, 61854, 123500, 95987, 107198, 126186, 78302, 21737, -7461, 10867, -80506, -104278, -151804, -206601, -128582, -62443, 13902, 115481, 171376, 145470, 101134, 60070, -21499, -16037, -15604, -17505, 81131, 145541, 21019, 7856, 20109, -21617, -12862, 18373, 20738, 38857, 20747, 38183, 15150, -37650, -65245, -143199, -199592, -237589, -47157, -30132, -92309, -124430, -120582, -136876, -36731, -10617, -55668, -13406, -12113, -57478, -81574, -51548, -40223, -42250, -37449, -67783, -61512, -1437, 2927, -9312, -77782, -169052, -150920, -33920, -4979]
21123d979k7276l888K9211M6633q2975j0503O4631M0445M5694P1762m782q8965
21111G5008l5909M4321k2536M9636o3723n0180L1858O9619K8168j43307j31029
21100a48074Q5691J40441L1093L8687n5235k9830N820j19825r2372O2971J3909
21089f6724l3203J72474J2038k387n3484p1545J8197q3685k5190K1361j5592J15758
21077a1982R826J9675L6660M5718m4990j17257p0058J1953J16401Q8595o3930
21066B0611j04794R6369J720P4181n4829q4154M1022J4999n2406k7576o7795n717
21054a48369P3357P2544J4942k7471k9014L8261M7568m8652R603k0149J1093j3548
21042a9835p799j0002j6011n129Q1968N4666L2636L6355K3028r0884n8907j0632
$$ y = [-4979, -32255, -36143, -6932, 39701, -43274, -53777, 10854, 51299, 96993, 168755, 163973, 75008, 39099, 83420, 60884, 110520, 46797, -3383, 28475, 98094, 126262, -17045, -148074, -62383, 78058, 109151, 147838, 92603, 62773, 68593, -51232, -143604, -80633, -66724, -99927, 72547, 84585, 82198, 28714, -42831, -24634, -108319, -133509, -112148, -127740, -11982, -2156, 17519, 54179, 99897, 54907, -62350, -132408, -120455, -4054, 84541, 20611, -84183, 12186, 13906, 88087, 33258, -50896, -9874, 5125, -47281, -74857, -142652, -148369, -75012, -2468, 12474, -14997, -44011, -5750, 41818, -6834, 2769, -17380, -6287, -19835, -27634, -37636, -53647, -58776, 23192, 77858, 110494, 146849, 169877, 78993, 20086, 9454]
21030I454r7061m1028m6786l4903j6541J6209R6666J06476j2476K0153J26699
21019A26862L7405r8598r1337k5289J13431L5756L8367M5218n5149l6603o1118
21008B8945l6447M6848O5005M525n5264p1190L5992o06k9985k488n3053l2953
20996a00671N3464R8477j666r064K0815R3710P6919K6383k9213q9436j03817p5536
20984c9635L0496K8046j1053k4128k1284m5576p406J5615q2001K4349O1106l292
20972g4763J6152N0671J9421m7005L0456L5405P4P8787j9016m0312j5992m7735
20960a3857N915N8163K6941O6746J9044l4501l0294j37389p5238m6006O4932M2850
20948e2694l2413q4019O1321k9240j7181R304j8777J8187j6058N5780O2154P39
$$ y = [9454, -87607, -128635, -175421, -210324, -226865, -210656, -113990, -7514, -19990, 163, 126862, 164267, 65669, -25668, -50957, 62474, 98230, 136597, 181815, 126666, 90063, 28945, -7502, 39346, 104351, 108876, 53612, -17578, 18414, 17808, -12177, -14665, -67718, -100671, -47207, 51270, 49604, 40540, 61355, 155065, 231984, 258367, 229154, 139718, 35901, -39635, -9139, 18907, 7854, -16274, -37558, -83134, -90540, -74925, -156926, -132577, -71471, -74763, -58611, -7940, 11481, -35524, -5068, 30337, 30411, 109198, 90182, 49870, 33878, -13857, -7942, 50221, 77162, 143908, 162952, 128451, 98157, -39232, -114470, -160476, -95544, -52694, -85107, -169126, -107805, -137045, -154226, -144922, -163699, -145512, -161570, -105790, -43636, -42897]
20936d2897k0386m159Q754n3861N1722J5785M0681L3873k3716n4275r7565K7877
20924a18167l1746j879J61701J32038O1262j14347m2365J6652l8488m3673N1809
20913C2797m410P4720o4650q4708O4483O010j515l8689j0103r0043k6202Q90j9056
20900a60476M3243P8244K5732k5267m2396n47N3159M9717m5056K1970j5117o3272
20888h0066R5056m9932p4581l5978l664m7573j3095k6264N5160j8239P5002J00810
20876b3364J4330n4408j37355p0901m52K2198Q5160o2848j5983J6741P2642N7835
20864i6405K8833l0246o0134r87l7726J7167R4368M1371M8213J7685M7643l7452
20852C2330R51j18950o6347j1728Q6515N8986l0132M8363K2329p2297m3270L1987
$$ y = [-42897, -63283, -67442, -58688, -112549, -60827, -45042, -4361, 29512, 5796, -48479, -146044, -118167, -149913, -151792, 9909, 141947, 203209, 88862, 46497, 63149, 24661, -19012, 32797, 28387, 103107, 38457, -46251, 18232, 24242, 22727, -15962, -26065, -116108, -142310, -141420, -160476, -117233, -38989, -13257, -38524, -80920, -81467, -28308, 21409, -23647, -1677, -16794, -80066, 14990, -34942, -109523, -145501, -149165, -196738, -209833, -236097, -180937, -199176, -124174, -23364, -9034, -63442, -200797, -271698, -272150, -249952, -164792, -227640, -243623, -226882, -154240, -96405, -67572, -97818, -157952, -158939, -196665, -179498, -85130, -43759, 4454, 22139, 69782, 32330, 33281, -85669, -152016, -163744, -77229, -18243, -48375, -12, 22317, -49980, -93250, -61263]
20840f1263l7842n3449m5727J36273J44762J00427J7432n6759p526p1549J1740
20829G6519M2786p059j31803j79036k278P1870O6524L7849J8523j50J7892m3250
20817c1613q7336R4447J41138M6618n7411P518l0051j38783n7247M4905M2594
20806b5221k7719Q0811l5709j19291M3912j3143R8020j7397o5867J585N5201O7379
20794D2561o3586q5566P965R1628n2642J3933J903o8154q8799n6718N02P6146
20782a80827L087R0746P2941k3481l326m6459m3287K7373L1173n4178j9924N5341
20770i0821L2749L1168n5602r2571j808J37607j6145k7358N9011j6054P8304j10138
20758g1658k3406M7496k2384N7580k3472r6735k0117Q4464M3503o0584K1002O2724
$$ y = [-61263, -99105, -152554, -198281, -62008, 82754, 183181, 200613, 143854, 136328, 64779, 76519, 119305, 112246, -19557, -198593, -200871, -129001, -62477, -24628, -6105, -6255, 11637, -31613, -118949, -24502, 116636, 163254, 105843, 113361, 83310, -55473, -112720, -67815, -25221, -52940, 27871, -7838, -127129, -83217, -96360, 1660, -15737, -81604, -80019, -24818, 42561, -21025, -106591, -98626, -6998, -59640, -45707, -43804, -111958, -200757, -257475, -256973, -180827, -177740, -86994, -14053, -37534, -40860, -87319, -130606, -103233, -72060, -126238, -146162, -90821, -58072, -26904, -82506, -175077, -176885, -39278, -55423, -82781, -23770, -39824, 38480, -71658, -95064, -47568, -69952, -12372, -35844, -132579, -152696, -68232, -24729, -85313, -64311, -1587]
20746a587n7550N5492P171M71m916J6420M504k8750R5903O8226k3882o3448q7307
20733a9253k4953K4770n0509o564M9529J44862O190j37246r7322k0272m1236o9523
20721b41527k629O777k1284J07117R7132J36388o928o3708m1938q2941J33854
20710B0313m6455L0124r9478j1729N6168p0023r1065L6391R9217l7325o3268Q486
20698a68644N8859J16516M2521n3292k4662M7477j7720L5715n4566o1341K4305
20687e4832l1399p4221P6714J03936m652l8311l8407j07460j2761n0073n0685
20676b82151M7191R6923J18857l2746o6496m7312q9322Ok4733L6105P3183J28887
20664d1608O4416j50826l3526O1531M2028k4786o5664K8917O5761l271n8602m6381
$$ y = [-1587, -59137, -3645, 3526, 3997, -919, 15501, 20005, -8745, 87158, 155384, 131502, 68054, -19253, -44206, -19436, -69945, -76509, -26980, 117882, 124072, -13174, -110496, -130768, -172004, -241527, -244156, -237379, -258663, -151546, -54414, 81974, 75046, 11338, -30600, -113541, 20313, -26142, 3982, -95496, -107225, -51057, -121080, -212145, -175754, -76537, -113862, -177130, -168644, -109785, 6731, 49252, -4040, -28702, 18775, 1055, 36770, -17796, -79137, -54832, -86231, -160452, -83738, 20198, 15546, -22765, -61172, -168632, -181393, -231466, -282151, -234960, -138037, -19180, -51926, -118422, -165734, -255056, -255050, -279783, -243678, -170495, -41608, 22808, -128018, -161544, -100013, -57985, -82771, -148435, -119518, -53757, -57028, -115630, -162011]
20652a62011j5433J0993m9120N1790J33831R3976K5765p3248O0364J32690j08263
20641A01334r8129R7258r975n1941j4068N3210o9294m1801M6216m5991l2480J10853
20629D5192j0040o2503j15348o5656M7461O7782k4256j4569j4262J09150J11798
20618G4749j01214m3522O0147O3229K5960J3490r2116K630l7432q8504Q0367l1828
20606g4044r4436M2651N6884l6199N4082N8143p3304q3761j19082M6212Q5237
20595a37617L4679L1561N3919O7132J9774N6340j01266l8847L907l8754R2537
20584D3365J0664J06866N4211j4174r5272n8315q5801n2447J0334M2215m4875
20573h3229J06436J8388n3463m2739N826j7474L6462K2972l0931k8102L413N046
$$ y = [-162011, -177444, -166451, -215571, -163781, -29950, 64026, 89791, 16543, 76907, 209597, 101334, 3205, 100463, 90488, 38547, 24479, 77689, 8395, -33406, 12810, -33181, -65661, 45192, 35152, -27351, -142699, -208355, -160894, -93112, -117368, -131937, -146199, -37049, 74749, -26465, -69987, -9840, 53389, 79349, 92839, 723, 3353, -34079, -122583, -42216, -74044, -168480, -125829, -68945, -105144, -51062, 7081, -66223, -149984, -269066, -222854, -137617, -102938, -71377, -17458, 49674, 69448, 125788, 24522, -14325, -10418, -49172, 43365, 54029, 160895, 215106, 200932, 105660, 47345, -38456, -90903, -80569, -38354, -83229, 23207, 41595, -11868, -54607, -48781, -66255, -29793, -6821, -37752, -65854, -62441, -57395]
20561e7395P6359M9040o9561j28625L196J6857R168j8419O8167J16847l1337j45153
20549a10856l1765m0461Q0380K3031k974r972L6695P4133R3263j1717j3580l2718
20537E3459l341n7274M4830Q7859O780l7716k7177m3212j18913J4160R7104L1649
20525D8208j17734j6220K6940K9449n6328q673K7604L4049J5626L5067K5533p8014
20513c4493l4161J6636N1435l4418j0279k3783o363J35747L704n3719N901L5830
20501E2037o8565o1830J02569M943q7105J2716p8324L518K2639k2861N8485m5928
20489a07706q1122M1819P7915Q1935M5041J7493j170n7603k3716r2517p6582J01229
20477g4984M0298n9531L622J1140l4899l4073m4282j9360p1938N6973J24873j4839
$$ y = [-57395, 18964, 68004, -1557, -130182, -126986, -110129, -100961, -119380, -51213, 65634, 34297, -110856, -142621, -183082, -102702, -79671, -82645, -92617, -55922, 18211, 111474, 99757, 86177, 53459, 50118, -7156, 37674, 125533, 132313, 94597, 67420, 24208, -94705, -80545, 16559, 48208, -69526, -85746, -58806, -29357, -85685, -94358, -66754, -32705, -17079, 17988, 43521, -34493, -68654, -52018, -583, -35001, -45280, -69063, -75426, 60321, 64025, 10306, 16207, 52037, -16528, -78358, 24211, 29154, -57951, -45235, -123559, -120041, -97402, -120263, -61778, -107706, -188828, -147009, -69094, 12841, 57882, 75375, 74205, 16602, -7114, -99631, -176213, -74984, -34686, -94217, -90595, -79455, -114354, -148427, -192709, -212069, -284007, -227034, -102161, -117000]
20465a17000l5095N4172M3547q9281P6294l2468J41774Q0244q7898r3493L8249
20454b0955N6392J5382K9504J2665O853k1139p8216o2526j13272p1884K3910M7726
20442a75560R5019L7731k451M5805n644j2588j31450j9999M7746J05234n837o0507
20430h2501q6674m276P1358L4846l4949K1079L8684J3014k6452k5397J47771m4467
20418B2036p1896K0725J7765k1210o973M454l8629j5502L5119Q5296l7043j22884
20406a28742N503K9734j2147J5250Q8171J56804j636l1229j06939P8399p1584
20395B1584j01357L2446j6810r845J1998M1o2029l2791o2869k0302k6108M8692
20383b17350J17784N5198m7844j05066n480n4367k0738O9535P3501Q1565P6169
$$ y = [-117000, -152095, -97923, -54376, -143657, -67363, -99831, 41943, 122187, 34289, -59204, -20955, 35437, 50819, 80323, 92988, 99841, 78702, 486, -62040, -175312, -247196, -223286, -175560, -80541, -42810, -45261, 544, -5100, -17688, -149138, -169137, -121391, -16157, -21994, -82501, -169175, -173451, -102093, -67247, -102196, -81117, -42433, -29419, -55871, -81268, 66503, 22036, -49860, -29135, -11370, -32580, -39553, -35099, -73728, -89230, -54111, 31185, -5858, -128742, -123239, -93505, -105652, -90402, -2231, 154573, 152937, 121708, 14769, 93168, 21584, -79773, -47327, -64137, -73982, -61984, -61943, -123972, -156763, -219632, -239934, -266042, -217350, -99566, -44368, -92212, -197278, -202758, -257125, -277863, -208328, -134827, -53262, 22907]
20372B2907L8867j58K757M8728K2910q9843o4521m9169j4750R1968R2434q3402
20360A8728o7483J9228n200m4242Q3340J30608o66p705m6877j1331j4196l9112
20348A5092m9356o0723o234j4650K4362O150n0885n7581N7454J35410N2327o835
20336D4531n6643r6112q5090k3014R9340Q2324p1036M2490p0434k3814O0247J06279
20324I068M7694j36033r3194M3929j01399J3817J45790R2379n070r0433n1509
20313a24961k5620j3191J7219j1937O859l7213K9025Q3187R509p340P3912O0471
20301E9920p9885P51M4352J1776M1369k0216m0556l4346p4243m5441J74493L8991
20289G6965j0528j49108j02312O5466R1137r010R0642R836l8159j5830l1623q971
$$ y = [22907, 61774, 61616, 64373, 113101, 136011, 46168, -18353, -67522, -82272, 9696, 102130, 18728, -48755, -29527, -34727, -78969, 4371, 134979, 134313, 126608, 79731, 68400, 54204, 15092, -34264, -94987, -101221, -115871, -91509, -85359, -136244, -193825, -136371, -961, 51366, 44531, -12112, -108224, -193314, -216328, -116988, -34664, -105700, -63210, -133644, -157458, -97211, 9068, 56762, -79271, -172465, -128536, -229935, -216118, -70328, 22051, 16981, -73452, -124961, -150581, -163772, -146553, -158490, -151631, -188844, -159819, -76632, -67123, -74463, -551, 59920, -19965, -19214, 25138, 36914, 78283, 58067, 17511, -16835, -91078, -136519, 37974, 76965, 66437, -82671, -184983, -119517, -28380, -37390, 53252, 63088, 24929, 9099, -22524, -31495]
20277c1495J2283l4392q7856q6722Q4850P9753r363N3631O0741L6405k0899j7275
20265C9661j3159k5113o221J1471m6352k4273P352Q3870M5554k6479j6965j5148
20253A4198Q8769n2856o39O8013l1427n4060O9033M1797p6265j57280k6275J1608
20241a05384L7697K9907K480m9601l4672Q7775N2573N6224j1852k5885q1586J2411
20229b9913J1508R5235Q2013j8971P54K0656l9569k4682L07J2743k1417n680J1480
20216I4464m3335M337n5561j14892L9245j2747N2992M0313J03229J7136j4158
20205A11023j01284k2627r6505j8746j080O6503k3091N4200o5729m7990N635p7230
20193b16921k9720K3560J11558P951k6334J07584N1964n9980r506j2666J2271
$$ y = [-31495, -19212, -53604, -141460, -228182, -143332, -63579, -72942, -19311, 41430, 77835, 56936, 39661, 26502, 1389, -4832, 6639, -39713, -63986, -56634, 27236, 72790, 46311, 29346, 14198, 102967, 50111, 49472, 117485, 86058, 31998, 101031, 142828, 66563, -90717, -116992, -105384, -67687, -37780, -35300, -84901, -119573, -31798, 20775, 76999, 65147, 39262, -42324, -29913, -18405, 76830, 158843, 139872, 140626, 161282, 121713, 97031, 97338, 110081, 88664, 82984, 94464, 51129, 55466, -95, -114987, -75742, -88489, -35497, 4816, 108045, 125181, 111023, 9739, -12888, -109393, -128139, -129219, -62716, -85807, -31607, -97336, -145326, -139691, -216921, -246641, -223081, -111523, -103572, -129906, -22322, 29642, -30338, -39844, -52510, -40239]
20182d0239R0439K2355K2434j27907o4761n0335q086J35419K9394o6525m0731
20171i8543L8158j6308Q466N666k4849l184O4087J05436p6540q9339j4769M0577
20159f1142m9478L7253N5428M5351L2551N603O566K5926k9026o7230l4872p2493
20147a05563j62323K5576J90263P4151j7081J5922j9009J5597N2093o5126P1087
20136G5587J13813k4533l9933m7407p4476q2658J0933Q4900L1524M3337K2018
20125A13105q2598r772j31216l2158P3964P6951J09536k012l8885m9973k3894
20114C048j3050N7634n6339j07734L6678N8681J589M5611M6193q947L7782Q8433
20102A89579o6157o0146L211N8037l5760p0734j4149j0505k1920j3549j5523P4433
$$ y = [-40239, 50200, 72555, 94989, -32918, -97679, -148014, -156100, -20681, 8713, -57812, -98543, -60385, -76693, -68227, -62561, -87410, -90594, -26507, 78929, 2389, -86950, -101719, -61142, -110620, -73367, -17939, 27412, 59963, 65566, 72132, 98058, 69032, 1802, -33070, -105563, -267886, -242310, -52047, 22104, 5023, 20945, 1936, 17533, 69626, 4500, 75587, 189400, 164867, 124934, 77527, 3051, -79607, -68674, 16226, 47750, 91087, 113105, 30507, 20735, -110481, -142639, -68675, 8276, 117812, 115800, 76915, 26942, 3048, -10002, 47632, -8707, -116441, -79763, -21082, -19493, 26118, 72311, 63364, 101146, 189579, 123422, 63276, 66487, 124524, 88764, 18030, 3881, -6624, -28544, -42093, -57616, 16817]
20090A6817J42682j22969k34909k3394O5515O4628l4228K774N7608O4731O1477
20079F0732k1255k5861J9671p83l5463o1981J06064n8850l8302L1006K5233L9390
20067C9601m0467r0076k7731M8643k2826j131N0140m635q5312J1876N2304Q2207
20055A2593J1704l6256l76K0501R1631M0046j30058j17130O99m8379O8399J03110
20043A6484m9676j2365l771n5615o4209Q799P310J6061j1827Q2343J53419k0853
20031F6100j03192M3509R5363l3304k6916n6976P4343P4356m9196r4700q9987
20020a00600n8323N4804J22219P0057k1543j739R9718K9938j09583j09442p5724
20009a00218J9955K8773q7718q430J06422R9621J29605o3468j24346P3401J5053
$$ y = [16817, 159499, 36530, -198379, -221773, -156258, -91630, -125858, -123084, -65476, -745, 60732, 39477, 13616, 33287, 32504, -2959, -64940, 41124, -17726, -56028, -25022, 211, 39601, -866, -90942, -118673, -70030, -92856, -93987, -43847, -48482, -133794, -121918, -69614, 12593, 24297, -11959, -12335, 8166, 99797, 139843, 9785, -107345, -106646, -155025, -86626, 16484, -33192, -45557, -49328, -104943, -169152, -160353, -153043, -136982, -148809, -66466, 86953, 66100, -37092, 6417, 101780, 68476, 41560, -15416, 58927, 133283, 84087, -10613, -100600, -158923, -104119, 18100, 88157, 66614, 64875, 164593, 194531, 84948, -24494, -100218, -80263, -51490, -139208, -147638, -41216, 58405, 188010, 124542, 196, 73597, 88650]
19998H8650K0379O5860n1921j07266j5713R5745o9012J2002j5972N6826R1244
19987A70822j4353N6155q1868q5341J040M386j1183k2225l3991k9744l7940p5064
19975a59306L6625J95314J03052o2648j06942p4147r179J0414k4191j6282l2858
19964a40148P532Q2586k1130n2202L7719j5830N0798p258l2712l2770O373M8931
19952f8111r399q836P153o489K6144M9058q115l8939k6604N2285l4484j2979N1614
19939b7702K1643q7928J4071Q2324R0260j00264j16950O62M4389J8815J9804O164
19927c4712p3883m2867P7931K8708k9590j4624k0544k445k683K7012J02485j0555
19915D233p2336p2835j698K7464N5939J2753P8717O8279q958r4310K8269m2004
$$ y = [88650, 109029, 174889, 122968, 15702, -11, 95734, 26722, 38724, 22752, 79578, 170822, 156469, 212624, 130756, 45415, 46455, 50841, 39658, 17433, -16558, -46302, -84242, -159306, -122681, 72633, 175685, 113037, 6095, -68052, -77231, -66817, -91008, -107290, -140148, -132616, -50030, -71160, -123362, -85643, -101473, -50675, -57933, -90645, -123415, -117042, -68111, -77510, -86346, -79193, -85682, -59538, -10480, -18595, -57534, -84138, -31853, -66337, -79316, -27702, -6059, -93987, -79916, 2408, 92668, -7596, -124546, -123884, -79495, -60680, -40876, -34712, -108595, -151462, -73531, -44823, -74413, -89037, -109581, -112026, -114709, -87697, 14788, 4233, -68103, -140938, -142636, -115172, -59233, -46480, 32237, 100516, 91558, -2752, 25517, -16487]
19903a6487j43456q592O5739O2701N8681k3914p3891N4378P9820R088l6821j7881
19891I365k9921o4377k8799O8026L8049Q3581L5429p9931o4870K2169m9620o9085
19879a29984P9837j6984j5654m8322M3912j3561j9112n5384P0559o517J835m3383
19867a52758P9917N7987n0570o9344J21555m9516m593N5333K6669p7240n292P1118
19855C266J9451o5112j7661K3297j52367L467p2634l5037K3184J17172N0803j125
19843a03296O3140P6862j10162n5326q613m4684n8123L637J91362J5499p8580
19832a08284p0R8898p6319j20923q9611j758L4383J12241J5599n954J4435K9719
19820i7644o563m4474L8130P1406m3569L1448j6678p3370m5050J2911J02097N9316
$$ y = [-16487, -159943, -168535, -102796, -40095, 18586, -5328, -79219, -24841, 54979, 64067, 27246, 9365, -20556, -84933, -113732, -45706, -7657, 75924, 111353, 31422, -33448, -11279, -60899, -129984, -50147, -67131, -82785, -131107, -87195, -100756, -119868, -175252, -104693, -111210, -109375, -152758, -72841, -14854, -65424, -134768, -13213, -62729, -67322, -11989, 14680, -62560, -67852, 3266, 22717, -42395, -60056, -36759, -189126, -185659, -258293, -293330, -270146, -152974, -102171, -103296, -40156, 36706, -73456, -128782, -137395, -182079, -240202, -236565, -45203, -29704, -108284, -108354, -9456, -85775, -206698, -296309, -298067, -263684, -151443, -135844, -141798, -127363, -97644, -104207, -148681, -110551, -39145, -82714, -51266, -67944, -141314, -186364, -173453, -71356, -12040]
19808a2040l3929l0590J6457J61436J07786M0844n8797j18504m090L3182p0296
19797C1459l2386l2215k3798j8937K9260J366l5760m0480M2721N7971O9345J0944
19785E9490p7456L8277J18007J0302J9770J870p5279j06312p9937r8646k7625
19774b17539R2736L0416M1840P4233J25272k6801j11143P676m9043p4542M0977
19763f5918J43066P3233k0687r5980q7128j9368j5934J5463p2275Q827J5266l8322
19751a59757Q3535j051o4149n5395P7747M2163K7221K7260R9755J06556p6664
19740A07221j10364m2434l8019J6534O2360l6406j14047k4072J16807K0384m3857
19729h5893P6030P875j23528M8404K3281m9954L2190J5053m471m5112l2121l9866
$$ y = [-12040, -45969, -76559, -60102, 101334, 209120, 249964, 191167, 72663, 68573, 101755, 31459, -927, -33142, -56940, -75877, -46617, -45251, -81011, -121491, -78770, -20799, 48546, 59490, -17966, 20311, 138318, 148620, 168390, 170260, 94981, -11331, -91268, -189914, -217539, -124803, -94387, -52547, 21686, 146958, 120157, 9014, 16690, -32353, -106895, -65918, 77148, 150381, 129694, 33714, -53414, -72782, -88716, -73253, -145528, -136701, -121435, -159757, -76222, -77273, -141422, -196817, -119070, -76907, -49686, -22426, 77329, 183885, 107221, -3143, -45577, -83596, -67062, -4702, -41108, -155155, -179227, -62420, -42036, -85893, -9863, -1988, -125516, -77112, -53831, -103785, -71595, -56542, -61013, -106125, -138246, -178112]
19717a78112N2363L5405K7664O4661l4241o4634M7946P4409P8001n5050n4785
19706f373J402R7326M9234o8672l7030M3818o9072q209k860q0796l9154K5376
19694i5010j6173L5966K8542O4495l1317l3369K6588L7527J6520n9573J38072
19683A12268R6040p0944j55490j9692O3518m8589j9247k6558l0219J7420J82445
19672A00952L1283r6184r6466j2619L0732p5670m3208l3180k6453O9799Q0657
19661g0357L1620J2690m5110M1147J4564p3272J6498p4803o9918O0102Q1744K6022
19649d9073O6212O1674J0595j71704K684R5941P4286L209j3873o0647p5465O0545
19637D384N7834n1982p382k0910o2665m376Q5492n5942j3709K2538o7675j9569
$$ y = [-178112, -125749, -90344, -62680, 1981, -32260, -96894, -48948, 25461, 103462, 48412, -6373, -4971, 92355, 141589, 72917, 35887, 79705, 10633, 2424, -436, -81232, -120386, -95010, -111183, -75217, -46675, 17820, -13497, -46866, -20278, 17249, 33769, -25804, 112268, 208308, 137364, -18126, -37818, 25700, -22889, -42136, -68694, -98913, -81493, 100952, 132235, 36051, -60415, -73034, -42302, -117972, -161180, -194360, -220813, -151014, -70357, -38737, -26047, -71157, -30010, -15446, -88718, -72220, -147023, -216941, -156839, -75095, -49073, 17139, 78813, 89408, -82296, -79612, 16329, 90615, 93824, 79951, 19304, -56161, 4384, 62218, 10236, 2854, -18056, -80721, -85097, 395, -55547, -69256, -46718, -114393, -133962]
19625a33962N1606Q499N0913K2098q3448q1392k5199M1557L5913O6858j3970K7851
19613c2676k742k5241l6773r0100J7188J01984N0704k3007r778L2045L2064j932
19601A1736n276j2599n0246J4737N5779L0309N6201K4087o037r9730K8050k076
19589D4935k9338M719K9708J14914l6820r0260R9286J9318l8260r4287p2486j05661
19577a54232K4908J40997n8813k1423K1136j9561j02938k0998O4187M4009p267
19566h9995K5887j2128l4683o643J04263J08878O7968m7560n61o3371K2960M4285
19554A19300p4750P0321J72033k2668k6338r4396k712K5294o6693N4554j964p9741
19542G2240r896k7636n946P8632J9833k3807J3194O0529N8006j02399j00700K2427
$$ y = [-133962, -82356, -73857, -22944, -846, -84294, -165686, -190885, -149328, -113415, -46557, -60527, -32676, -35418, -60659, -97432, -187532, -170344, -68360, -17656, -40663, -50441, -18396, 13668, 11736, 6460, -6139, -56385, -41648, 14131, 44440, 100641, 124728, 118691, 18961, 47011, 44935, 15597, 20316, 50024, 164938, 128118, 37858, 137144, 156462, 118202, 23915, -48571, -154232, -129324, 11673, -47140, -68563, -47427, -66988, -169926, -190924, -126737, -82728, -89995, -64108, -76236, -110919, -117562, -13299, 95579, 163547, 115987, 115426, 52055, 75015, 119300, 44550, 114871, 286904, 264236, 237898, 143502, 140790, 166084, 99391, 153945, 151981, 72240, 62344, 34708, 28762, 107394, 127227, 103420, 116614, 177143, 235149, 132750, 32050, 54477]
19530E4477k9793k9161k4431P6276P2797K9156O0794j13988J820k5598m0938k5366
19518F045l8536K4622O2458J06104J5385m3840L4883J4639N2818Q4665J2291k2452
19506C09082M470q512p9907K0237Q2479m6958l6606j346J75749j0265J3007j1332
19494D10098r0992l4918n0588n4542p5152n3450l3597L0157k8740K4073N9055
19483A01404K6573l4870j00462K6054J7391l8603P1881j364K995o5568p0130L2688
19471c2011l4004m8976j7057J7963o4820O9895N6633o0237l9441k3666j2074R2969
19459i4826M1067Q7825L1439L6747j8772j2482m7545j02121L6117o766j5746M6013
19447a9050N5039M056j07480K79N7448j293n5063N9333O6198m9441m7784l3904
$$ y = [54477, 24684, -4477, -28908, 47368, 120165, 149321, 210115, 96127, 97947, 72349, 31411, 6045, -32491, -7869, 54589, 160693, 176078, 132238, 167121, 181760, 234578, 319243, 331534, 309082, 313552, 305040, 225133, 245370, 327849, 280891, 244285, 242939, 418688, 408423, 421430, 410098, 319106, 284188, 233600, 179058, 103906, 50456, 16859, 47016, 18276, 42349, 101404, 127977, 93107, -7355, 18699, 36090, -2513, 69368, 68004, 70999, 5431, -64699, -32011, -66015, -114991, -132048, -114085, -178905, -109010, -52377, -112614, -152055, -175721, -187795, -94826, -53759, 34066, 65505, 102252, 83480, 70998, 23453, -78668, -42551, -49317, -65063, -19050, 35989, 40045, -67435, -67156, -9708, -11001, -66064, -6731, 59467, 10026, -37758, -71662]
19435g1662l0702R6447R3725m1645m3748k9761k5371J7817o6033n006Q0635P9564
19423E4260m579q9750q3982M9146K438k4049N0014O9796J64903L4654l0286n6427
19411A36138N8072l3293o8930J8388J7145k1347k4543k6447o4220K5434R199K0487
19399D6083m2993j28578n0740P8947J29640P6956o6580p2354p3449l3114K5332
19388a10850J2989N2572L1427m7224k4235l2532l8368J7533J22533K3800J6325
19377B3970k1854K0560m3801J4591O674Q110o4593K3221N6023Q36Q9591L576K64
19364A17168J5412r6970m5339j3985n3254m4484L935N0062P2853l9174p3102k9220
19352a36098O4996L9461J1068K6039q1935o5280K4629M3914O763N2455J4635M6061
$$ y = [-71662, -102364, -5917, 87808, 46163, 2415, -27346, -52717, -34900, -100933, -105939, -25304, 54260, 49681, -40069, -124051, -74905, -72467, -96516, -46502, 23294, 188197, 222851, 192565, 136138, 194210, 160917, 91987, 110375, 127520, 106173, 81630, 55183, -9037, 16397, 25596, 46083, 3090, -125488, -176228, -97281, 32359, 109315, 42735, -29619, -103068, -136182, -110850, -97861, -45289, -13862, -61086, -85321, -117853, -156221, -138688, -16155, 7645, 23970, 2116, 22676, -21125, -6534, 140, 8250, -56343, -33122, 22901, 23737, 113328, 116904, 117168, 132580, 35610, -9729, -23714, -76968, -121452, -117517, -67455, 5398, -33776, -106878, -136098, -71102, -31641, -20573, 5466, -76469, -141749, -117120, -73206, -66443, -13988, 647, 46708]
19340D6708Q4159l0769q869k3051k9965j7262M613Q1066o5163k0565o1093j02095
19328a42286j5766J73077J13934n4962j00487j00654l4810L438m923n7314n7858
19317b78611n6746Q5203R7770J02776L723m8729J07489k4611l7993Q1764P7484
19306A09519N581M344n8314K5629N4215n8602j3816j08059o9846K5248L1306j2108
19294f4903J10013O7860j2102l962o5823O7706m4784J6423J10285J31860p8455
19283B34118O0280Q238j3884Q2489L589n182M1896O6167p2750R9039M4872P5834
19271F24706L1526M7676p6075q1299j7146r1910m1936N8282Q0119q4100o5818
19260C84025N0173j54j144L290J4263Q3430K6578O8564j6560l5024k9276J34782
$$ y = [46708, 130867, 100098, 91229, 68178, 38213, 20951, 25564, 106630, 41467, 20902, -40191, -142286, -158052, 15025, 128959, 73997, -26490, -127144, -161954, -158516, -163439, -220753, -278611, -335357, -250154, -152384, -49608, -45885, -94614, 12875, -11736, -49729, 32035, 109519, 115100, 119444, 61130, 86759, 140974, 82372, 68556, -39503, -109349, -84101, -52795, -64903, 45110, 112970, 100868, 96906, 31083, 98789, 54005, 70428, 180713, 312573, 234118, 294398, 302636, 288752, 371241, 374830, 369648, 411544, 477711, 404961, 504000, 548872, 624706, 656232, 703908, 627833, 546534, 529388, 437478, 395542, 453824, 533943, 449843, 384025, 434198, 434044, 432900, 436190, 450453, 533883, 560461, 629025, 612465, 577441, 548165, 682947]
19248F82947L7397j3562J1523J5391N665J1705J9716o551j26453j67603j25180
19237C44995m6723J17818m0258n7327j11927l9523N7190K8126N3026m7735r0587
19226A67075r9689K7456O3407M5917J8730l5475l8025m9090j03493p4190O9391
19215g986K5539r292k5043l4244k2122M0346j5005j13969M2459M3896O0225O581
19203h615O4720M3922p5096J6164M0357K275M986N4788p8078K1216Q1107O43k8956
19190A39433j14305j06264l040K693M8557N3146J02041K3737m8107m7743N24K3158
19178G3830K8659K183J2957l0109k1347N4686N677L1106r148m8141k7712J08214
19166A80855m9728n3406n2394m16Q686k506l683K4584k843P4276q3274J9182q5827
$$ y = [682947, 720344, 706782, 718305, 733696, 739361, 751066, 770782, 764231, 637778, 470175, 344995, 298272, 416090, 375832, 318505, 206578, 167055, 224245, 252371, 305397, 257662, 167075, 67386, 94842, 158249, 204166, 222896, 187421, 149396, 100306, -3187, -77377, -7986, 17553, 8261, -16782, -51026, -73148, -32802, -47807, -161776, -119317, -75421, -15196, -8615, 56105, 100027, 24931, 41095, 81452, 83727, 88713, 143501, 65423, 86639, 167746, 168389, 139433, 25128, -81136, -84176, -81483, -32926, 20220, 122261, 145998, 97891, 50148, 50672, 73830, 102489, 104672, 117629, 87520, 66173, 120859, 126536, 157642, 148494, 100353, 72641, 180855, 131127, 77721, 25327, 24911, 33597, 31091, 27408, 51992, 49149, 123425, 40151, 59333, -26494]
19153b6494j22015L9409R5064o5084J7459J57707N2992l4532j1398l0928l1441
19142D0739n4212J6175J3433K6218k9512L085R6967l684l2527K8789Q6828l0397
19130A61902J4297m9214p1333J8597L8320p4098o2815j0253J06545Q262M94j02358
19118b1654M9265J43163N0616n1658M2118R2726j4633j5800N9804m9985j4550
19107B69412l6261k3053n2540l9037m4469M2791M7460R7588k7700n3761J1769
19096A92199j2202o978k0642l2009J1469R8830K1839m1818l521k7620o7876n9529
19084E2142L5748Q6978Q67k8186J9081K2268p635J01703O6577L6507L3438L3178
19072D52666M8258J24733J34758J83728K30377J10516J05054J87728K36194K30602
$$ y = [-26494, -148509, -109100, -14036, -79120, -61661, 96046, 149038, 114506, 103108, 72180, 40739, -13473, 2702, 16135, 42353, 12841, 15926, 112893, 109209, 76682, 105471, 192299, 161902, 176199, 126985, 55652, 74249, 112569, 38471, -24344, -34597, 71948, 80210, 80704, -21654, 27611, 170774, 221390, 169732, 211850, 304576, 289943, 274143, 333947, 283962, 269412, 233151, 210098, 157558, 118521, 74052, 116843, 164303, 261891, 234191, 180430, 192199, 179997, 173019, 152377, 120368, 131837, 230667, 252506, 210688, 207167, 179547, 111671, 52142, 87890, 174868, 175735, 147549, 166630, 188898, 181263, 282966, 349543, 386050, 419488, 452666, 500924, 625657, 760415, 944143, 1174520, 1285036, 1390090, 1577818, 1814012, 2044614]
19062B044614J95222J20461J06425J26548K89979K29014L49279O24914Q92950
19053D979406J335076K332161L615913M495392M446981M661039M217727J585552
19045C1669247l87702j71098J320859K687331M156206O137203N959784L340540
19037E4712370R37542k448099n323036n695693l922745k212888j272934M67556
19029C5242073J183229j323620l933483m653907m710900m662987l988739k775583
19021A0376083j717061j102493p02352n70900l43644j37123o3381j18667o4391
19012E556071n4078l7925M9990J92965M14487O02719R73868J640863K852821M475373
19002A6667154N408068N192773N680312N151421J622672r01551l34447J528803
$$ y = [2044614, 2239836, 2360297, 2466722, 2593270, 2883249, 3112263, 3461542, 4086456, 4979406, 6314482, 8646643, 12262556, 16757948, 21204929, 25865968, 30083695, 31669247, 31281545, 31110447, 32431306, 35118637, 39274843, 45412046, 51371830, 54712370, 55649912, 53201813, 47878777, 42183084, 38260339, 36047451, 34774517, 35242073, 36425302, 35101682, 31168199, 26514292, 21803392, 17140405, 13151666, 10376083, 8659022, 7556529, 6854177, 6283277, 5939633, 5802510, 5739129, 5620462, 5556071, 5501993, 5464068, 5514058, 5707023, 6121510, 6724229, 7698097, 9338960, 12191781, 16667154, 22075222, 27267995, 32948307, 38099728, 39722400, 38820849, 38486402, 40015205]
18994D0015205K985258M938633P532263P281821M107269J284244k906480o686013
18986E8552200p024704m870377k934326j743087L84090J415297j647359m782476
18978C7349258n665784o021573o165807n176277l508040k337102j562142j117635
18970E794898q09841n17174l06995j95055k79525k89571l23455k27755k01556
18961B643971j58263o4219k27718l03888j53715k31973j99767j2801O788p7490
18951A220925j95152j35250j69284q6498p834n2404j00239p5219N243J2016j4027
18940D02277k9768p9232m5399N5462N158Q174K9704J5972n7497M2694N1283q2914
18928C15914o9343j4031J00196O7023r697M028m6104j0923l6641J0091j5934n7141
$$ y = [40015205, 43000463, 47939096, 55471359, 62753180, 66860449, 68144693, 65238213, 58552200, 51527496, 46657119, 43722793, 41979706, 42363796, 43779093, 42131734, 37349258, 31683474, 25661901, 19496094, 14319817, 10811777, 8474675, 6912533, 5794898, 4985057, 4467883, 4160888, 3965833, 3686308, 3396737, 3073282, 2845527, 2643971, 2485708, 2421489, 2193771, 1889883, 1736168, 1504195, 1304428, 1291627, 1298415, 1220925, 1025773, 890523, 721239, 634741, 626907, 574503, 474264, 399045, 404288, 416304, 402277, 372509, 293277, 247878, 303340, 308498, 316672, 346376, 362348, 304851, 347545, 398828, 315914, 246571, 232540, 332736, 399759, 390062, 394090, 347986, 337063, 300422, 310513, 294579, 237438]
18916B37438N4853N4197m5857O4438J00558J1895o5518o7175p1989j0520m0176
18905B22144j5810P1801k7750L1763M3129J9575l236K8896m1956n8506K1221L4266
18893C25537K5j9889k7323j8666l0327N7683o411o9338N4398J24075m6531m721
18881C38512k1264j5080K0427l129K3140O7821k7939q0377j9854J24239o2147
18870C44349k5278m426n0721l5391N6013L4840N4517j1241m0865L7839N686J5271
18858C80593j0628n1384k1624M6771n246L208j1190K557r669J3661m4855K4382
18846C16576M5742R3434R5053J04208N158J25460O9327o6441j5101r580o5258
18835F98578j0690J24539L4333K6750J02012P374n8366k9037m2368L9685K4635
$$ y = [237438, 292291, 346488, 300631, 365069, 465627, 477522, 412004, 344829, 272840, 262320, 222144, 206334, 278135, 250385, 282148, 325277, 344852, 341616, 370512, 328556, 270050, 291271, 325537, 325562, 305673, 278350, 259684, 229357, 287040, 280629, 211291, 265689, 389764, 343233, 338512, 317248, 302168, 322595, 319466, 342606, 410427, 382488, 302111, 282257, 406496, 344349, 319071, 314645, 263924, 228533, 284546, 319386, 373903, 362662, 321797, 359636, 365322, 380593, 369965, 318581, 296957, 343728, 338482, 341690, 330500, 333057, 323388, 337049, 292194, 316576, 362318, 455752, 550805, 655013, 660171, 785631, 854958, 788517, 773416, 763836, 698578, 687888, 812427, 846760, 873510, 975522, 982896, 924530, 895493, 853125, 892810, 917445]
18824I17445p2383j9983O4876j1943P928O783L7827j3099O5478m8488j06729J8052
18812H45764J63260J50076L2546J60400P6601K7218O9301N3422J29665J91083
18802A899336J57081J27364J28333K91067L60193L68694L25356M51662N37781
18793D646867O71671Q51752J123015J509916K251644L605636M666369M381856
18785B3708726L829053N205752Q135122P557229K657524L86733L597359O387229
18777F1464727L497525K55686Q29268M277355O868583P432453N724026L265431
18769I3615054Q68153N75246J79385j260624m694284p094806p275760m841058
18761G0071306j426965m51770l824109o271290l586612l3552k197381o775190
$$ y = [917445, 845062, 825079, 889955, 878012, 885940, 892723, 930550, 917451, 982929, 934441, 827712, 845764, 1009024, 1159100, 1191646, 1352046, 1428647, 1455865, 1525166, 1578588, 1708253, 1899336, 2056417, 2183781, 2312114, 2603181, 2963374, 3332068, 3657424, 4109086, 4646867, 5318538, 6170290, 7293305, 8803221, 11054865, 14660501, 19326870, 23708726, 27537779, 32743531, 40878653, 48435882, 51093406, 51480139, 55077498, 61464727, 64962252, 65217938, 66047206, 70324561, 77193144, 84625597, 90349623, 93615054, 94483207, 95058453, 95237838, 93977214, 89282930, 82188124, 74912364, 70071306, 68644341, 68192571, 64368462, 58097172, 54510560, 54477008, 52279627, 45504437]
18753D5504437p866905n382045l812189m367750m570259l723228k522137j607942
18745A1651982j191253r70176p07336p08041o93601m95026n08750m64282m32278
18736E481239m70008m10763l96618l27081j83792k53677k32600k56048j06312
18727B844340j60404k24942k98739k14177o0326n2044j42526n5310l1619m6310
18717A557943j33762n7435j3324l1193k5785n7320j8198L1085J3680O1722p2647
18706A254766l2144N2542r6111r3412p0489p2477j25710k1930R9500Q9468K1086
18695A005089l3372q0630j81p1690j4815N5479M1867P5898l5360p0889P9186o860
18683I43722j9826N9777L7751K9147k1808m2541m3011P8151L6144K270k228q1959
$$ y = [45504437, 37637532, 32255487, 28443298, 24075548, 19505289, 15782061, 13259924, 11651982, 10460729, 9490553, 8783217, 8075176, 7381575, 6886549, 6377799, 5913517, 5481239, 5011231, 4600468, 4203850, 3876769, 3692977, 3439300, 3206700, 2950652, 2844340, 2683936, 2458994, 2160255, 1946078, 1885752, 1833708, 1691182, 1635872, 1604253, 1557943, 1424181, 1366746, 1353422, 1322229, 1296444, 1239124, 1220926, 1252011, 1265691, 1327413, 1254766, 1222622, 1275164, 1179053, 1085641, 1015152, 942675, 816965, 795035, 894535, 984003, 1005089, 971717, 891087, 890906, 819216, 804401, 859880, 901747, 977645, 942285, 871396, 950582, 943722, 923896, 983673, 1021424, 1050571, 1028763, 986222, 943211, 1021362, 1057506, 1059776, 1057548, 975589]
18671I75589j83472l0406J6106L7908L4917N7645L6599L3291l396P6497O900M3671
18659A101849M9398R8722j2872n3160P481J2028j513Q8486J21667q279O6919J40328
18647A611054M373M2969O014L0696O5205J06529J06771J84158J77208N0915J58296
18636B544188J01106J82981K07835K05193J58799J41627J31493K21823K92837
18627D187882J89862K80710K25557L03534K97555L79586N51433O57959P69820
18618G843898J013897J242759J348508J582999J895945K366551L005320L957403
18610B4257280M964917O178486P338862Q283926Q418513P986230P071118O109595
18602H0608927N800188N998516O201404N788482M671082K914670J226667K54008
$$ y = [975589, 792117, 761711, 777817, 815725, 850642, 908287, 944886, 978177, 974781, 1051278, 1058178, 1101849, 1151247, 1249969, 1237097, 1183937, 1191418, 1203446, 1201933, 1290419, 1412086, 1403807, 1470726, 1611054, 1615427, 1658396, 1664410, 1695106, 1760311, 1866840, 1973611, 2157769, 2334977, 2385892, 2544188, 2645294, 2828275, 3036110, 3241303, 3400102, 3541729, 3673222, 3895045, 4187882, 4377744, 4658454, 4884011, 5187545, 5485100, 5864686, 6416119, 7074078, 7843898, 8857795, 10100554, 11449062, 13032061, 14928006, 17294557, 20299877, 24257280, 29222197, 35400683, 42739545, 51023471, 59441984, 67428214, 74499332, 80608927, 86409115, 92407631, 98609035, 104397517, 109068599, 111983269, 113209936, 113463944]
18594A13463944N96885J970335L110463K065457j86342l903355p766958j1539241
18586I7811188j3402508j4516452j3875079j1981809r254632o789457m797627
18579B3193624l440037k501636j915110j549253j242499r61429p17223o26274
18571A0240163n40744l05401q3367j63992j09037j32695j61648k57831l49981
18562H135467l81320l81954l93689k25602k17393j59267P2463L36043N26059P39421
18552H050228P83584J192708J765408K606808M077430O769087J0431399J4284498
18544D9961150J7244381J6672570J3775061Q832930K577055m551189j0098925
18537I4413033j4606768j6862420j6192897j3288937r611800o316069l937133
$$ y = [113463944, 114060829, 116031164, 119141627, 121207084, 121020742, 117117387, 109350429, 97811188, 84408680, 69892228, 56017149, 44035340, 34780708, 27991251, 23193624, 19753587, 17251951, 15336841, 13787588, 12545089, 11583660, 10866437, 10240163, 9699419, 9394018, 9310651, 9146659, 9037622, 8904927, 8743279, 8485448, 8135467, 7754147, 7372193, 6978504, 6752902, 6535509, 6376242, 6448705, 6784748, 7310807, 8050228, 8833812, 10026520, 11791928, 14398736, 18476166, 25245253, 35676652, 49961150, 67205531, 83878101, 97653162, 106486092, 109063147, 104511958, 94413033, 79806265, 62943845, 46750948, 33462011, 23850211, 17534142, 13597009]
18530A3597009k554545j791538j183812p35912n17269m36408j89189j59917j51515
18521E876904m4893n6157J5918n4165o5263j16512k65567k20797m02348k69597
18511D397523j70058j60605n2406J10628L09329L19004M97222N61541O76127Q48375
18501G336680J210794K009170L339311N258231P543392R568302R655676Q100189
18493E4021745N390481J998281j860077n257511p758858r393312r366459p884759
18485A9889531n806031l942326k461004j410132r15821o76785n19926l70031k97284
18476C490191q1554r351j5477o0125j16524j24667K2044J9286k5907j13443j75554
18465B808919k09303j61028j42660j33208j43391j38191j29294j79489j48379
$$ y = [13597009, 11042464, 9250926, 8067114, 7331202, 6813933, 6377525, 6188336, 6028419, 5876904, 5832011, 5775854, 5791772, 5737607, 5672344, 5555832, 5290265, 5069468, 4667120, 4397523, 4227465, 4066860, 4014454, 4125082, 4434411, 4753415, 5250637, 5812178, 6488305, 7336680, 8547474, 10556644, 13895955, 19154186, 26697578, 36265880, 45921556, 54021745, 59412226, 61410507, 59550430, 54292919, 46534061, 37140749, 27774290, 19889531, 14083500, 10141174, 7680170, 6270038, 5354217, 4677432, 4157506, 3787475, 3490191, 3408637, 3399286, 3383809, 3323684, 3207160, 3082493, 3104537, 3123823, 3097916, 2984473, 2808919, 2599616, 2438588, 2295928, 2162720, 2019329, 1881138, 1751844, 1572355, 1423976]
18456A423976j77890j50617p6322o8853j0850n3369l1542M0726Q0078O1050j06524
18445I29863r8537R903L0328P5380J088j19169m2399O6082j29692p0050K0958
18434F73755M903N6165L2066k7672r830J6085O4022K056k6100L3420N8591r816
18422H67645L0693K1781J7325p148J19807N3763o0894n7804j13440k3673K2507
18411H70562K1564l6632j08194k8056j022O0064L3822L1718O0826J26126K8708
18400A059486r6046q9369j75831q8403M5864j5553O4260J03696P8389J2284o8379
18389H30398j8244o9685o2430k8517M1330m1747m0822q6988L0947N9518J19698
18378G33458L7258l12l0886k497P0811M9313K2850m2409J0794P1982N2925J50262
$$ y = [1423976, 1246086, 1095469, 1019147, 950294, 939444, 886075, 854533, 895259, 975337, 1036387, 929863, 831326, 841229, 871557, 946937, 948025, 828856, 786457, 852539, 722847, 652797, 673755, 678658, 734823, 766889, 739217, 729387, 745472, 809494, 811550, 785450, 818870, 877461, 867645, 898338, 920119, 937444, 930296, 1050103, 1103866, 1042972, 985168, 871728, 848055, 870562, 892126, 855494, 747300, 719244, 718222, 778286, 812108, 843826, 904652, 1030778, 1059486, 963440, 874071, 698240, 609837, 655701, 640148, 704408, 808104, 886493, 898777, 830398, 812154, 742469, 680039, 651522, 692852, 651105, 610283, 523295, 554242, 613760, 733458, 770716, 770404, 739518, 737021, 807832, 857145, 879995, 837586, 848380, 920362, 973287, 1123549]
18366A123549R6626j0539O4230O7003k5282K7658M6199P9307J42550j6110J03488
18355A698679R5998R0091K30761J28730J48824K11733K25915K90071M03084N29424
18345D053310Q01087J236236J848677K926832M712327N152577L356610K622919
18337B6710575N083325P212967L249843n97046M28602L414930K016142N64856
18329D8084194L928829P066500J387159l844043j653144L854484Q56957n216531
18321E4464405n398596j476356j631177l463475j614218J435117j382273n690203
18313C5243224n999162l075952k589133m256829m645141l499694k137718j328926
18305G710669r62541n64401l10520k68059j45444K6356M0166J37712K17433N14207
$$ y = [1123549, 1220175, 1209636, 1273866, 1340869, 1315587, 1343245, 1389444, 1468751, 1611301, 1595191, 1698679, 1794677, 1884768, 2115529, 2244259, 2393083, 2604816, 2830731, 3120802, 3523886, 4053310, 4854397, 6090633, 7939310, 10866142, 15578469, 20731046, 24087656, 26710575, 31793900, 39006867, 42256710, 41659664, 42088266, 45503196, 47519338, 48084194, 52013023, 59079523, 60466682, 56622639, 54969495, 58823979, 59680936, 54464405, 49065809, 47589453, 45958276, 42494801, 40880583, 42315700, 40933427, 35243224, 29244062, 26168110, 23578977, 19322148, 14677007, 11177313, 9039595, 7710669, 6748128, 6183727, 5873207, 5605148, 5459704, 5486060, 5526226, 5663938, 5881371, 6395578]
18295F395578P53563J189829K014061L147724K938373J785255K070946M279801
18287B4575130M323731P44224r94015Q75877K276968O80479P49099L765453L671771
18278D0668717q77732k577559Q23790K864163j435087m274338k626325o51702
18270C1913927j799534k228154k68040O52508k328335m085832l158446j506365
18262A7191729k158892l073734l006614j983154j226187q20424n78716m00771
18254C943237l88794l11906k99053l64833j91449j38752r0600j69928j09065j80038
18244A698819k09869j69784K5112l550k6716l7168r6721p7384j24085o4640m2125
18233H71889L1729p613O2097n6458j30367J6283j9948M7874l0527n0148l0190
$$ y = [6395578, 7149141, 8338970, 10353031, 13500755, 16439128, 18224383, 20295329, 24575130, 28898861, 29643085, 28649070, 29524947, 31801915, 32482394, 33231493, 36996946, 40668717, 39790985, 37213426, 38037216, 40901379, 39466292, 35191954, 32565629, 31913927, 30114393, 27886239, 27618199, 28270707, 25942372, 21856540, 18698094, 17191729, 15032837, 11959103, 8952489, 6969335, 5743148, 4922724, 4344008, 3943237, 3554443, 3242537, 2943484, 2578651, 2387202, 2248450, 2157850, 1987922, 1878857, 1698819, 1488950, 1319166, 1344278, 1340728, 1314012, 1276844, 1180123, 1102739, 978654, 914014, 871889, 903618, 896005, 958102, 901644, 771277, 787560, 767612, 815486, 784959, 734811, 704621]
18222G04621J2118m4890o8520M1242R5004M3005P973K3755n30o9329k6162r7131
18210F21156n8237N944l9278n5464J2496P0609J31009K7259p2748j6782k3620
18199F02344L7440o9194m8778M6913J0431P7737m9812m1861l3113J7353O0161
18188F09621l7596O9521j4227L631J18264L6139K1989J04811j24391j43583n4842
18177E89337l9933k6215l9083n9882k9604O6298J04555k0730k1683J2222q9793
18166D45489l9942R5160J08313M0849p8714m1017L099P1283N7072M540J402M2557
18154G10091R5533M9848R9255L2060J987j7909k4949O0968l4560j8448j4643R6021
18142A035254K9273j01194j04295r9914J6419Q5707L4025l4106l4758L5469m2025
$$ y = [704621, 716739, 671849, 603329, 644571, 739575, 782580, 790553, 814308, 813778, 744449, 718287, 621156, 562919, 568863, 529585, 474121, 486617, 557226, 688235, 715494, 642746, 625964, 602344, 639784, 570590, 521812, 568725, 579156, 656893, 607081, 565220, 532107, 549460, 609621, 572025, 641546, 627319, 630950, 749214, 785353, 807342, 912153, 787762, 644179, 589337, 549404, 523189, 484106, 424224, 394620, 460918, 565473, 544743, 523060, 535282, 445489, 405547, 500707, 609020, 649869, 571155, 530138, 533237, 604520, 661592, 666132, 667534, 710091, 805624, 855472, 954727, 986787, 988774, 970865, 945916, 1006884, 972324, 953876, 939233, 1035254, 1064527, 963333, 859038, 759124, 775543, 861250, 895275, 861169, 826411, 861880, 819855]
18131H19855p1612k1711m6272j06495n4191N7030K4341J50060Q2516K48L9032
18120H72801J26720K85916L29309M38316M48476N14940M91385O38443Q62118J326325
18110F334749K256207L869102P224170J5311086L2034225L0090348q568989l0263720
18102E8287178k6887273j2808730o457369l651491k057078j346564r30769p72169
18094C375735n68162l35516j52800m3766o4840j10700q7763j79332k61053j69511
18084A402292r2756J9143n5625j08752R374j9628M473j7151k9898l0906o7705
18073A012861j10513L6680R2123J28341J68975k6858l8946o2716m1508n3568m8277
18062A056594j17320p6226j31690j47840m6245j9312m7627P879J1980P837p886
$$ y = [819855, 748243, 726532, 680260, 573765, 519574, 576604, 600945, 751005, 833521, 833769, 872801, 999521, 1285437, 1614746, 2053062, 2501538, 3016478, 3507863, 4146306, 5008424, 6334749, 8590956, 12460058, 19684228, 34995314, 67029539, 97119887, 88550898, 58287178, 31399905, 18591175, 12133806, 8482315, 6425237, 5078673, 4147904, 3375735, 2807573, 2472057, 2319257, 2275491, 2210651, 2099951, 2012188, 1832856, 1571803, 1402292, 1309536, 1328679, 1273054, 1164302, 1173676, 1154048, 1158521, 1141370, 1111472, 1080566, 1012861, 902348, 939028, 1031151, 1159492, 1328467, 1301609, 1262663, 1199947, 1158439, 1104871, 1056594, 939274, 863048, 731358, 583518, 537273, 517961, 470334, 478213, 490193, 498030, 490144]
18051D90144p3102k3138n7786n6007O5138r102J5064n6091k7809k2842k6029j999
18039B16441J26875o8116J0979l4390p5078N4253J36227o2325q796N6040N7232
18028D09342L9132O0855m6095m2109R6860J32961J65069K1407O5141J83718J29600
18017A215881J8959N8319l3178l1879j41137j26857j31112j15330l7032O1494
18007G38128L104j0490m7269j7455J053j06122q1132o1587o3518o260Q7581k4953
17995D11080M2391M9515L809J0457K0534k4350k3795K2146q558k678L4714K0539
17983E55804p78m4642l6735L0028J2076O2799L4517N2851l4114J1331j7269l7848
17971E88020N1356J31241M8707N7908K0294N6505N0526k5739j22438r9402j7736
$$ y = [490144, 417042, 393904, 336118, 280111, 345249, 336147, 351211, 295120, 267311, 244469, 218440, 216441, 343316, 275200, 286179, 251789, 176711, 230964, 367191, 304866, 296070, 352110, 409342, 448474, 509329, 463234, 421125, 517985, 650946, 816015, 837422, 902563, 1086281, 1215881, 1234840, 1293159, 1259981, 1228102, 1086965, 960108, 828996, 713666, 676634, 738128, 741232, 730742, 683473, 666018, 667071, 560949, 479817, 418230, 354712, 348452, 436033, 411080, 453471, 502986, 506795, 517252, 537786, 513436, 489641, 511787, 503229, 500551, 535265, 555804, 555026, 510384, 473649, 503677, 515753, 578552, 613069, 665920, 631806, 643137, 625868, 588020, 639376, 770617, 819324, 877232, 897526, 954031, 1004557, 978818, 856380, 756978, 739242]
17960G39242K898p6912J9063L8084r326j3774M1489J00732J17128J29643J07900
17949A196167R5324N4969k5104r6592k5172J41051J35823M1013J24597J13074
17939A755150K7681l418n9273m3929l9436N010L36L8413J25236J7421j03106K9176
17927A749261O4083p0548l6127L6818J71589J60403K7327J01900R8747K172j53253
17916B152372j40074J3717J30749J34266J32552p9697O3088K59196J01456K8207
17906B795832J07276K20102J74441J22305Q4407J53091J97972J68701K22759L58423
17896D605309L79591K82058L01585M25488M78608O00718Q34577J005633J160762
17887A0074329J325327J792066K216519K829360L907632N318894P136958R111154
$$ y = [739242, 742140, 665228, 684291, 722375, 713049, 699275, 740764, 841496, 958624, 1088267, 1196167, 1291491, 1346460, 1321356, 1224764, 1199592, 1340643, 1476466, 1517479, 1642076, 1755150, 1782831, 1779413, 1720140, 1676211, 1636775, 1641785, 1642121, 1680534, 1805770, 1823191, 1720085, 1749261, 1813344, 1742796, 1706669, 1743487, 1915076, 2075479, 2102806, 2204706, 2303453, 2305625, 2152372, 2012298, 2026015, 2156764, 2291030, 2423582, 2343885, 2406973, 2666169, 2767625, 2795832, 2903108, 3123210, 3297651, 3419956, 3504363, 3657454, 3855426, 4024127, 4246886, 4605309, 4984900, 5266958, 5568543, 5994031, 6472639, 7073357, 7907934, 8913567, 10074329, 11399656, 13191722, 15408241, 18237601, 22145233, 27464127, 34601085, 43712239]
17879D3712239J0976010J1437210R578048O160167L734741M220750O764090R109836
17871A05693091R000724N459790j61912n570783q622461q050494n355846l334202
17863H9057907m044923p037714j0308537j1417701j0425828q382005o453071m697914
17855B6290214l269936k408337j892459j553450j137264q75655o91603m91423
17847A3970087l74642m32892l52760k32803k66301k81223l82946l15014j34426
17838A1197080k37568l99111k41540m48253m61768l60014l80593l76964m08779
17829G882490l88717l27813m20934m73548m00562k48254n6818k66607k35936j63772
17819D899529r3133m2308n0072L2990j29453k03060k23577j91087j89008l12720
$$ y = [43712239, 54688249, 66125459, 75703507, 81863674, 85598415, 89819165, 96583255, 105693091, 114693815, 120153605, 119991693, 114420910, 105798449, 97747955, 92392109, 89057907, 85012984, 77975270, 67666733, 56249032, 45823204, 37441199, 30988128, 26290214, 23020278, 20611941, 18719482, 17166032, 16028768, 15153113, 14461510, 13970087, 13595445, 13162553, 12809793, 12576990, 12310689, 12029466, 11646520, 11331506, 11197080, 10959512, 10560401, 10318861, 9870608, 9408840, 9048826, 8668233, 8291269, 7882490, 7493773, 7165960, 6745026, 6271478, 5870916, 5622662, 5565844, 5299237, 5063301, 4899529, 4806396, 4764088, 4714016, 4747006, 4617553, 4414493, 4190916, 3999829, 3810821, 3498101]
17809C498101k68582j61148j31280j45551j77125j79415j49953m3272n3042n102
17799B183631k7585q3039o9062J8843K2867k6504j4751J14797j1262j00864j735
17788B005336o2344L0841J7925l6493j41711j3848O349o9922R3114L9536R216
17777A877999q3887l9298l2964j1447o0948M3390J6308j09027j88649j56361j1415
17766A243701L8026l47P9855K2606o6010j38280m923p0283p6281m3597N5377J0398
17754A050242m6777O2208k825l8935l2636k9103M8770j7351j65543K8892M8734
17743I05676l1567P459O1076K5681j14550n7974q2008M456J3801K0551j10031
17732F42570j05042L8521Q6984n9532j78375m9800q6073P5628M2633J69m6581
$$ y = [3498101, 3229519, 3068371, 2937091, 2791540, 2614415, 2435000, 2285047, 2241775, 2188733, 2183631, 2156046, 2073007, 2003945, 2022788, 2045655, 2019151, 2004400, 2119197, 2107935, 2007071, 2005336, 1942992, 1973833, 1991758, 1955265, 1813554, 1799706, 1806055, 1736133, 1829247, 1868783, 1877999, 1794112, 1754814, 1721850, 1710403, 1649455, 1692845, 1709153, 1600126, 1411477, 1255116, 1243701, 1281727, 1281380, 1361235, 1383841, 1317831, 1179551, 1174628, 1104345, 1028064, 984467, 1039844, 1050242, 1003465, 1065673, 1062848, 1023913, 991277, 962174, 1010944, 993593, 828050, 856942, 905676, 874109, 881568, 942644, 968325, 853775, 795801, 713793, 718249, 732050, 752601, 642570, 537528, 576049, 663033, 603501, 425126, 375326, 289253, 364881, 407514, 407683, 361102]
17721C61102J90R1671K1899l8852n4825N3917q044k5256p288o9429O991Q411N5548
17708C96035R6978j0690l1107K0040O9670k7612K333M6464N9592o0894j29720
17697D31089J2492M8406J3143K6868P6543j12907n3226M8846J3609K8676o466
17686E27073O649N6749l6629j19720n6440j7355k3916O5149L0368m582r2528J0299
17674C45117M8381q0531o7343Q1808J01567l339m033n7067q7278K4603Q5787n5424
17662C32248n4966L9013J5032M9299J8095k290l5417k244N0732r543p8945p560
17650C13454m2544j00163j5820O4254J08218O518k0700K5508K5017m7661k1005
17639B95076N4763P5010J5154q5415O8847J14303m200m3781J27032Q725M6204
$$ y = [361102, 361292, 452963, 474862, 436010, 381185, 435102, 427058, 401802, 394514, 325085, 332076, 340487, 396035, 493013, 482323, 451216, 471256, 540926, 513314, 515647, 562111, 621703, 560809, 431089, 443581, 491987, 505130, 531998, 608541, 495634, 442408, 491254, 504863, 533539, 527073, 533722, 590471, 553842, 434122, 377682, 360327, 336411, 401560, 431928, 427346, 334818, 345117, 393498, 312967, 245624, 327432, 428999, 425660, 421627, 364560, 277282, 301885, 387672, 332248, 277282, 316295, 331327, 380626, 398721, 396431, 361014, 358770, 409502, 399959, 321014, 313454, 270910, 170747, 154927, 219181, 327399, 333917, 313217, 338725, 363742, 316081, 295076, 349839, 424849, 440003, 354588, 423435, 537738, 533538, 489757, 616789, 625514, 671718]
17628F71718o7005l4924M3736P5649l216P0974j637r1858o1201m60l8725l5830
17616E27221R1466N8424p80p1412q5669L9637J51187O3946l0975q8103J0123J07926
17604G72991J8248R646m6193j3066L282M8912J42647J25117K8142J6154M0137
17593A146017P0810J20107J63705J40859J05970J67932J15131n059J65692K02301
17583B393465J95200K92882L56861K32719L32456L04735K38003K60134L32724
17574D939179M49386N46488O94144P70845R10373J012119J256806J688600K328905
17565A4596845L251290M441524O054045P907861J0045481J1055485R638953N954989
17557G2946473J853480k78754R94404M925671R944542J3190613J2016959N464340
$$ y = [671718, 604713, 569789, 613525, 689174, 685958, 756932, 755295, 663437, 602236, 601776, 563051, 527221, 618687, 677111, 676331, 604919, 519250, 558887, 710074, 774020, 743045, 654942, 665065, 772991, 791239, 800885, 754692, 741626, 744908, 793820, 936467, 1061584, 1089726, 1105880, 1146017, 1216827, 1336934, 1500639, 1641498, 1747468, 1915400, 2030531, 2025472, 2191164, 2393465, 2588665, 2881547, 3238408, 3471127, 3803583, 4108318, 4346321, 4606455, 4939179, 5388565, 5935053, 6629197, 7400042, 8310415, 9322534, 10579340, 12267940, 14596845, 17848135, 22289659, 28343704, 36251565, 46297046, 57352531, 66991484, 72946473, 74799953, 74521199, 75515603, 80441274, 90385816, 103576429, 115593388, 121057728]
17549A21057728l915339j1291193j3367973j0796616o076317j885781k3273j474414
17541G2226822n224677q780902j0259948r535072p718372n772179m232562l136066
17533A7567044k414398j974998j497257j140346q52338p79251o37455o22811n78929
17524G069261n34751m76536l19094k66348k31016l28159l64302k88453l08264
17515C952338k64377k36155j86321k19333j14379j08979j62795j00146j33970
17506B425883k02084k27129j61906q0571l5228j99276j44033n8001j3436l943
17496A300276M4951j5536N141j11436j10510j37937L7591k7550M580l3211j1163
17485I45196N1872j02742j4924j06302k3662J08830L4435n1386j42295r2899P589
$$ y = [121057728, 117142389, 105851196, 92483223, 81686607, 75610290, 73724509, 73701236, 72226822, 67002145, 58221243, 47961295, 38426223, 30707851, 24935672, 20703110, 17567044, 15152646, 13177648, 11680391, 10540045, 9687707, 8908456, 8271001, 7648190, 7069261, 6534510, 6057974, 5738880, 5472532, 5241516, 4913357, 4549055, 4260602, 3952338, 3687961, 3451806, 3265485, 3046152, 2931773, 2822794, 2659999, 2559853, 2425883, 2223799, 1996670, 1834764, 1754193, 1718965, 1519689, 1375656, 1317655, 1304219, 1300276, 1345227, 1329691, 1334832, 1223396, 1112886, 974949, 1012540, 984990, 989570, 956359, 945196, 997068, 894326, 879402, 773100, 749438, 858268, 892703, 841317, 699022, 606123, 613712]
17474F13712k1329j9762j15516p4052J1953J9076P883L0624m8541L5629M6416
17463D86093J0074O1218j0409r9477q6898r741J36258M8519M6788j4633o0460
17452E07332o1983j21191n6950N5854N1260n1968l2908p843K2643l0604o190R1954
17440C59406J16570J70573R9495p99j37916k21395p1683J89386K6673j00001l6869
17429C93440j00485Q5401Q3501j609P717k7989j06942r0591J7952K6532p750L5122
17417C14299n7781L2010N6213j3387l7927l6953j2901q4048j4770p1736j9005
17406E4014N8010R3930J2521J1577J6861J3332M305L4710l3991J9448P1551O0454
17394D16722j03802M2793R5081j2663o5970j5697o4526o1905K3569J08569J8799
$$ y = [613712, 592383, 572621, 457105, 383053, 395006, 414082, 421965, 452589, 404048, 439677, 486093, 496167, 557385, 546976, 447499, 360601, 350860, 487118, 535637, 582425, 567792, 507332, 445349, 324158, 267208, 323062, 374322, 322354, 289446, 281603, 304246, 273642, 267452, 359406, 475976, 646549, 746044, 745245, 607329, 385934, 314251, 503637, 530310, 430309, 393440, 292955, 378356, 461857, 460248, 467965, 439976, 333034, 242443, 260395, 286927, 279177, 314299, 256518, 288528, 344741, 331354, 293427, 256474, 243573, 159525, 144755, 73019, 54014, 112024, 205954, 218475, 230052, 246913, 260245, 264550, 299260, 265269, 284717, 356268, 416722, 312920, 355713, 450794, 438131, 372161, 356464, 291938, 230033, 253602, 362171, 380970]
17383C80970M007Q170O2549J2950k6966K7231R752l2613m440R155j5951q4050
17371C50764J1609L5306K939k1719M4021N5930M6541o9139O847p9310p2135j08346
17359B03308n8009K5108r1825o583l198p190Q9053l5473r3684M5107M5023k119
17347A09518j0275M4440K4997o3399j22048J3981M3696K2224J7825j09261q2011
17336a10313o4359q2504J14296J23311J09022j4956l3509K4094L8762N7671j1165
17325A50350q767j2718J39321J3216q1187p1447l1237R967M4604j8279P608l4860
17313A06571k3384q5634L4866J5676J02822N3732m0379K3470O862m461J16497
17302C06638J0540j84701p7510J2304Q3934N9153K4123M1451k4899r1119p28J20733
$$ y = [380970, 384977, 393147, 455696, 468646, 441680, 468911, 478663, 446050, 441610, 450765, 434814, 350764, 362373, 397679, 400618, 378899, 422920, 478850, 525391, 456252, 463099, 383789, 311654, 203308, 145299, 170407, 78582, 71999, 68801, 61611, 150664, 115191, 21507, 66614, 111637, 109518, 99243, 143683, 168680, 105281, -16767, -2786, 40910, 63134, 80959, -28302, -110313, -174672, -257176, -142880, -19569, 89453, 74497, 40988, 65082, 103844, 161515, 150350, 141583, 128865, 268186, 281402, 200215, 128768, 97531, 107498, 152102, 133823, 141431, 106571, 83187, -2447, 32419, 48095, 150917, 204649, 164270, 187740, 194602, 190141, 306638, 317178, 132477, 54967, 67271, 151205, 210358, 234481, 275932, 251033, 159914, 159186, 279919]
17290B79919o1451n2508J2454j15137N2531k0620M0833j7406L9090N9626J6334
17279B33665Q854k9016Q0454J29067q4394J6611J22538J35788N3736k9622p2991
17268E64690m4535J833J39339J8193k5666O806j7588o5656l0696l8661o2407j365
17256D44287o3152j2309o8401o3424p4709m2908J2578M9387K7730L5164k5209
17245B19034p8710p6158M8936L4955j47229j22175j5369Q8552R2438K0394J12791
17234A77459J04730M0369o8691q5231q2213l9563M4653p7321L0509K2045Q1663
17223A48409M651p5991n0555O7566L8379J04859N1223j6673J2821J7211j15771
17212A86129j29617j060R9488O437L9409J1199m8924j62673k8479R3733L7516
$$ y = [279919, 218468, 165960, 178414, 63277, 115808, 95188, 136021, 118615, 157705, 217331, 233665, 242519, 213503, 293957, 423024, 338630, 355241, 477779, 613567, 667303, 637681, 564690, 520155, 521988, 661327, 679520, 653854, 660660, 643072, 577416, 546720, 508059, 445652, 444287, 381135, 368826, 300425, 237001, 162292, 119384, 131962, 181349, 209079, 244243, 219034, 140324, 64166, 113102, 148057, 828, -121347, -136716, -48164, 44274, 64668, 177459, 282189, 322558, 253867, 168636, 86423, 46860, 91513, 14192, 44701, 66746, 148409, 153060, 77069, 26514, 94080, 132459, 237318, 288541, 271868, 284689, 301900, 186129, 56512, 55452, 154940, 161377, 200786, 211985, 163061, 388, -28091, 65642, 103158]
17201A03158R2211Q7836k4704k8723n2859j35187j1683L1132p8356j5374M7256
17190A4707m6550n4433N7985R5818k4969M1020K0269j15871o2411Q3735O1953
17179G1253K0865n8783L0311K2882l949o73p7727o5198P2186k0061J1289l4534
17167c2139M3425q9426J15040P6425l9223j19365M3191L0898k3988n5968J49J626
17155d9355O1415R6026J1009j7463k1507k7783M3818J1220Q862N386M6887m1244
17143A27271j9301l8963l6295p5476n784j4856J0921N951o7776j13966O1375M1292
17131a25607Q9663O3677k1530j4514L7476K2161L1317O5920M5175m5777j19727
$$ y = [103158, 195369, 283205, 258501, 229778, 176919, 41732, 30049, 61181, -17175, -32549, 14707, -31843, -86276, -28291, 67527, 42558, 83578, 103847, -12024, -74435, 9300, 71253, 92118, 33335, 63646, 86528, 82579, 81906, 4179, -61019, 11167, -8894, 2395, -32139, 11286, -78140, 36900, 113325, 74102, -45263, -2072, 28826, 4838, -51130, -50981, -49355, 12060, 108086, 119095, 101632, 80125, 52342, 96160, 107380, 116242, 121628, 168515, 127271, 107970, 69007, 32712, -42764, -48548, -63404, -52483, -46532, -114308, -228274, -166899, -125607, -35944, 27733, 6203, -8311, 29165, 51326, 82643, 148563, 193738, 147961, 28234]
$$ [...]
##END NTUPLES=NMR SPECTRUM
##END=
