##TITLE=Analysis number 321636
Compound Code cc 44201
Book Reference 468/145
Project Code adrs
Chemist Name colinb
##JCAMPDX= 6.0         $$ Bruker NMR JCAMP-DX V2.0
##DATA TYPE= NMR SPECTRUM
##DATA CLASS= NTUPLES
##ORIGIN= Bruker BioSpin GmbH
##OWNER= nmr
$$ XWIN-NMR		Version 3.5
$$ Mon Aug 21 09:03:05 2006 GMT Daylight Time (UT+1h)  MAYBRIDGE\nmr@NMR_250MHZ
##.OBSERVE FREQUENCY= 250.131544655141
##.OBSERVE NUCLEUS= ^1H
##.ACQUISITION MODE= SIMULTANEOUS (DQD)
##.ACQUISITION SCHEME= undefined
##.AVERAGES= 16
##.DIGITISER RES= 18
##SPECTROMETER/DATA SYSTEM= dpx250
##.PULSE SEQUENCE= zg30
##.SOLVENT NAME= DMSO
##.SHIFT REFERENCE= (INTERNAL, DMSO, 0, 16.522)
##AUDIT TRAIL= $$ (NUMBER, WHEN, WHO, WHERE, WHAT)
$$ ##TITLE= Audit trail, XWIN-NMR		Version 3.5
$$ ##JCAMPDX= 5.01
$$ ##ORIGIN= Bruker BioSpin GmbH
$$ ##OWNER= nmr
$$ C:\u/data/dgb/nmr/ADRS/1220/pdata/1/auditp.txt
$$ ##AUDIT TRAIL=  $$ (NUMBER, WHEN, WHO, WHERE, WHAT)
(   1,<2006-08-21 09:02:38.63 +100>,<MAYBRIDGE\nmr>,<NMR_250MHZ>,
      <created by zg, POWCHK disabled, PULCHK disabled
       configuration hash MD5:
       E2 DF 36 D8 04 B2 41 60 5A D7 A3 38 5A 4B D0 FE
       data hash MD5: 64K
       A7 F3 83 A7 FD 10 BD 0C F2 4C CA C4 97 E6 5B 08>)
(   2,<2006-08-21 09:02:53.69 +100>,<MAYBRIDGE\nmr>,<NMR_250MHZ>,
      <Start of raw data processing
       ef LB = 0.3 FT_mod = 6 PKNL = 1 SI = 32K 
       data hash MD5: 32K
       66 C2 0F AE 59 D6 F6 D4 EE 37 D9 00 B1 40 44 2D>)
(   3,<2006-08-21 09:02:55.41 +100>,<MAYBRIDGE\nmr>,<NMR_250MHZ>,
      <apk 
       data hash MD5: 32K
       20 EC DE 24 26 40 01 6E B2 3C 90 42 EF 99 E4 C5>)
(   4,<2006-08-21 09:02:56.30 +100>,<MAYBRIDGE\nmr>,<NMR_250MHZ>,
      <abs ABSG = 5 
       data hash MD5: 32K
       10 24 F4 32 7E 5E C7 90 FB BB 30 E9 D7 0D 44 B5>)
$$ ##END=
$$ 
$$ hash MD5
$$ F6 84 C3 4B 04 2B 0E 53 C7 B1 12 56 68 7E FD 3C
##$RELAX= 
##$RELAX= 
##$RELAX= 
##$RELAX= 
##$RELAX= 
##$RELAX= 
##$RELAX= 
$$ Bruker specific parameters
$$ --------------------------
##$DU= <C:\u>
##$EXPNO= 1220
##$NAME= <ADRS>
##$PROCNO= 1
##$TYPE= <nmr>
##$USER= <dgb>
##$AMP= (0..31)
100 100 100 100 100 100 100 100 100 100 100 100 100 100 100 100 100 100 
100 100 100 100 100 100 100 100 100 100 100 100 100 100 
##$AQSEQ= 0
##$AQ_mod= 3
##$AUNM= <au_zg>
##$AUTOPOS= <27 >
##$BF1= 250.13
##$BF2= 250.13
##$BF3= 250.13
##$BF4= 250.13
##$BF5= 500.13
##$BF6= 500.13
##$BF7= 500.13
##$BF8= 500.13
##$BYTORDA= 1
##$CFDGTYP= 0
##$CFRGTYP= 5
##$CHEMSTR= <none>
##$CNST= (0..31)
1 1 145 1 1 1 1 1 1 1 1 1 1 1 1 1 1 1 1 1 1 1 1 1 1 1 1 1 1 1 1 1 
##$CPDPRG= <>
##$CPDPRG1= <>
##$CPDPRG2= <>
##$CPDPRG3= <>
##$CPDPRG4= <mlev>
##$CPDPRG5= <mlev>
##$CPDPRG6= <mlev>
##$CPDPRG7= <mlev>
##$CPDPRG8= <mlev>
##$CPDPRGB= <>
##$CPDPRGT= <>
##$D= (0..31)
0 1 0 0 0 0 0 0 0 0.06 0 0 0 0 0 0 0.0002 0 0 0 0 0 0 0 0 0 0 0 0 0 0 
0 
##$DATE= 1156147357
##$DBL= (0..7)
120 120 120 120 120 120 120 120 
##$DBP= (0..7)
150 150 150 150 150 150 150 150 
##$DBP07= 0
##$DBPNAM0= <>
##$DBPNAM1= <>
$$ [...]
##$SUBNAM7= <"">
##$SUBNAM8= <"">
##$SUBNAM9= <"">
##$SW= 20.6930455092707
##$SWIBOX= (0..15)
0 0 3 0 0 0 0 0 0 0 0 0 0 0 0 0 
##$SW_h= 5175.983436853
##$TD= 65536
##$TD0= 1
##$TE= 295.16
##$TE2= 300
##$TE3= 300
##$TEG= 300
##$TL= (0..7)
0 120 120 120 120 120 120 120 
##$TP= (0..7)
150 150 150 150 150 150 150 150 
##$TP07= 0
##$TPNAME0= <>
##$TPNAME1= <>
##$TPNAME2= <>
##$TPNAME3= <>
##$TPNAME4= <>
##$TPNAME5= <>
##$TPNAME6= <>
##$TPNAME7= <>
##$TPOAL= (0..7)
0.5 0.5 0.5 0.5 0.5 0.5 0.5 0.5 
##$TPOFFS= (0..7)
0 0 0 0 0 0 0 0 
##$TUNHIN= 0
##$TUNHOUT= 0
##$TUNXOUT= 0
##$USERA1= <user>
##$USERA2= <user>
##$USERA3= <user>
##$USERA4= <user>
##$USERA5= <user>
##$V9= 5
##$VALIST= <valist>
##$VCLIST= <CCCCCCCCCCCCCCC>
##$VD= 0
##$VDLIST= <DDDDDDDDDDDDDDD>
##$VPLIST= <PPPPPPPPPPPPPPP>
##$VTLIST= <TTTTTTTTTTTTTTT>
##$WBST= 1024
##$WBSW= 4
##$XGAIN= (0..3)
0 0 0 0 
##$XL= 0
##$YL= 0
##$YMAX_a= 274901
##$YMIN_a= -439233
##$ZGOPTNS= <>
##$ZL1= 120
##$ZL2= 120
##$ZL3= 120
##$ZL4= 120
##$ABSF1= 16.522
##$ABSF2= -4.171173
##$ABSG= 5
##$ABSL= 3
##$ALPHA= 0
##$AQORDER= 0
##$ASSFAC= 0
##$ASSFACI= 0
##$ASSFACX= 0
##$ASSWID= 0
##$AUNMP= <proc_1d>
##$AZFE= 0.1
##$AZFW= 0.1
##$BCFW= 0
##$BC_mod= 0
##$BYTORDP= 0
##$COROFFS= 0
##$CY= 12.5
##$DATMOD= 1
##$DC= 0
##$DFILT= <>
##$DTYPP= 0
##$F1P= 14.0000005364418
##$F2P= -0.99999901652339
##$FCOR= 0.5
##$FTSIZE= 32768
##$FT_mod= 6
##$GAMMA= 0
##$GB= 0
##$INTBC= 1
##$INTSCL= 1
##$ISEN= 128
##$LB= 0.3
##$LEV0= 0
##$LPBIN= 0
##$MAXI= 10000
##$MC2= 0
##$MEAN= 0
##$ME_mod= 0
##$MI= 0
##$NCOEF= 0
##$NC_proc= -4
##$NLEV= 6
##$NOISF1= 0
##$NOISF2= 0
##$NSP= 0
##$NTH_PI= 0
##$NZP= 0
##$OFFSET= 16.522
##$PC= 1
##$PHC0= 135.4916
##$PHC1= 9.585178
##$PH_mod= 1
##$PKNL= yes
##$PPARMOD= 0
##$PSCAL= 4
##$PSIGN= 0
##$REVERSE= no
##$SF= 250.13
##$SI= 32768
##$SIGF1= 0
##$SIGF2= 0
##$SINO= 400
##$SIOLD= 32768
##$SREGLST= <1H.DMSO>
##$SSB= 0
##$STSI= 32768
##$STSR= 0
##$SW_p= 5175.98343685301
##$SYMM= 0
##$S_DEV= 0
##$TDeff= 65536
##$TDoff= 0
##$TI= <Analysis number 999999
Compound Code 99
Book Reference 9
Project Code 9>
##$TILT= no
##$TM1= 0
##$TM2= 0
##$TOPLEV= 0
##$USERP1= <user>
##$USERP2= <user>
##$USERP3= <user>
##$USERP4= <user>
##$USERP5= <user>
##$WDW= 1
##$XDIM= 32768
##$YMAX_p= 468130388
##$YMIN_p= -403932
$$ End of Bruker specific parameters
$$ ---------------------------------
##NTUPLES= NMR SPECTRUM
##VAR_NAME=  FREQUENCY,     SPECTRUM/REAL,   SPECTRUM/IMAG
##SYMBOL=    X,             R,               I
##VAR_TYPE=  INDEPENDENT,   DEPENDENT,       DEPENDENT
##VAR_FORM=  AFFN,          ASDF,            ASDF
##VAR_DIM=   32768,         32768,           32768
##UNITS=     HZ,            ARBITRARY UNITS, ARBITRARY UNITS
##FACTOR=    0.157963299565203, 1,           1
##FIRST=     4132.6476996994, 0,             0
##LAST=      -1043.33573715361, 0,           0
##MIN=       -1043.33573715361, -403932,     0
##MAX=       4132.6476996994, 468130388,     0
$$ Real data points
##PAGE= N=1
##DATA TABLE= (X++(R..R)), XYDATA
$$ [...]
22547 792 16046 -8295 -59307 -26117 -19168 -38320 -3804 94900 133197 84918 50482 -4577
22535 -4577 -67855 3812 36786 58059 67046 6067 -64516 -86931 -98909 -104651 -74902 -34319
22523 -34319 -11365 -11221 -10742 -37233 -32134 -24896 44915 58275 63960 40205 69239 38996 73612
22510 73612 113655 119839 77052 27306 -37162 -54772 -121700 -134458 -108870 -57145 -35222 23754
22498 23754 57477 67533 57813 75858 146621 121953 95866 101182 60007 63236 13118 -40842
22486 -40842 -58639 -49776 -6740 1794 -87623 13337 54396 53981 -7824 -48050 -65463 -40103
22474 -40103 -54639 -37286 -22097 -24761 -19765 -27090 35533 51141 42955 27630 -5705 10702
22462 10702 -14612 1723 23668 59558 72310 10361 -40415 -79042 -71484 -31043 4941 63543
22450 63543 72723 89777 45818 13935 7964 -62236 -72815 -83886 -41275 -5470 -1127 -53218
22438 -53218 -26254 20137 31578 23688 9658 -25802 -61898 -57562 -2553 64860 104022 108657
22426 108657 174992 207880 108825 108019 150977 118188 73702 120033 23666 -77569 -90353 -83447
22414 -83447 -36862 -41803 -1484 24985 4641 -2655 19460 15680 609 -28882 -57695 -111710
22402 -111710 -161128 -106261 -79318 -75577 -85069 -92453 -94969 -108428 -95380 -100726 -88586 -18339
22390 -18339 -42735 -101781 -112806 -138583 -130703 -104952 -113035 -133343 -70287 -105740 -142987 -136953
22378 -136953 -136983 -59163 -47252 -55144 -100718 -106223 -11039 44900 10759 -38556 42703 125888
22366 125888 123031 210000 222294 221567 158668 134387 90643 66694 57932 22790 30668 3164
22354 3164 27106 633 37085 -3764 -5043 38029 40180 83802 99959 87914 10082 -65988
22342 -65988 -78398 -33499 27606 72068 30722 34318 44264 86449 73351 99710 50910 18293
22330 18293 55427 -45071 -60519 10217 46432 69425 480 -25980 -13672 41106 92017
22319 92017 31937 7750 17422 52164 55382 43550 1392 -96843 -113604 -128201 -137058 -122338
22307 -122338 -105680 -122691 -63344 -69073 -24777 -26127 -44245 -64868 -66331 -64092 -7501 11500
22295 11500 55037 38190 -37969 11353 46946 34899 34886 55616 66374 40148 -21686 -19456
22283 -19456 -25070 -84074 -106581 -105674 -99720 -45045 42853 56304 -6498 -69430 -39567 -8222
22271 -8222 14372 -5340 6982 26058 -21967 24100 41323 -30397 -77123 -79164 -112993 -123071
22259 -123071 -38528 -11545 -77163 -112924 -98174 -100287 -72813 -107428 -137667 -179387 -152823 -106295
22247 -106295 -92151 -56412 -40560 71655 71960 -1980 20736 27205 18470 -2047 31770 94528
22235 94528 -19775 -74916 -70186 -99658 -92303 7722 138312 145827 46148 -6175 -31674 -94805
22223 -94805 -54470 -40074 -55226 -75441 -63601 -38490 -41921 -81829 -101628 -63612 -91812 -79177
22211 -79177 -52339 -8049 -88558 -116519 -91986 -130650 -141054 -159692 -131984 -79102 -82135 -81751
22199 -81751 -87300 -142664 -143366 -85075 -68500 -110155 -48933 -118045 -193375 -183615 -119233 -111783 -85718
22186 -85718 -87062 -65573 -88828 -92201 -72737 -101859 -135698 -83607 -65313 -8059 -38815 -39520
22174 -39520 -77913 -71319 -108101 -76964 -11687 19473 74918 88779 51303 19328 54631 43952
22162 43952 22972 -12043 1462 -18659 -28335 -35760 -38775 50753 179 -84629 -165723 -110747
22150 -110747 -4614 6098 38549 75609 126736 125147 49233 34907 -34422 -25621 64727 79587
22138 79587 78327 -8526 -67479 -59441 11857 -26367 -37449 -19779 -20984 -51679 -68779 -67983 -80291
22125 -80291 -79402 -31895 21986 89192 105322 79843 41483 -4536 -13566 -39669 -22019 45474
22113 45474 75195 23773 16894 6284 -1669 -819 33262 13764 -4719 33706 -3215 -30079
22101 -30079 9554 74267 88221 80207 88510 23447 -47351 -51246 -31033 -82645 -89021 -144401
22089 -144401 -171140 -100858 -98052 -82918 -45855 23177 42888 23880 -42209 -81716 -14884 84549
22077 84549 112257 8298 -78859 -142984 -102711 -96747 -120599 -123752 -91690 -46746 30741 80783
22065 80783 92098 52025 54953 117752 176933 127681 52833 54462 35696 37409 27645 -6621
22053 -6621 19136 74194 95041 37236 -63682 -33899 12089 3602 -68213 -66677 -61157 -71402
22041 -71402 -66913 39215 59955 21398 -11789 -58438 -154410 -193437 -211187 -117351 -130803 -159986
22029 -159986 -124206 -43316 63236 56217 57139 57106 103272 118038 12788 -80141 -79980 -35440 -40188
22016 -40188 -66493 -68954 -25374 38558 125707 126476 69710 26229 -8955 -3389 65195 31978
22004 31978 -13620 -37230 -79426 -35854 -14418 47488 38043 -4405 -97714 -121839 -109563 -34397
21992 -34397 66055 30691 -26534 -14263 -69774 -5264 64528 -8021 19890 53315 29005
21981 29005 1765 -51347 19494 88703 43639 5164 -11180 -21129 -2982 -27995 -48856 -8921
21969 -8921 3931 3470 25877 11724 9581 7188 29670 41935 47028 28869 24465 28311 -6240
21956 -6240 9045 45404 39634 100215 95755 53267 -34544 -48392 -42858 -35719 -32829 -69101 -115577
21943 -115577 -39214 12685 31876 41949 40187 -32606 -65339 -82198 -33406 9454 58226 -20667
21931 -20667 -54192 2432 -16499 -45527 -15853 5846 15636 -23742 -58648 -2324 31822 74020
21919 74020 97528 97321 93616 46286 -15648 -65949 -101225 -44029 -17527 76190 50654 46897
21907 46897 9302 -8437 -3173 -95580 -103381 -90935 -109704 -52064 -30305 9613 75197 100493
21895 100493 53105 20548 18025 -33965 -9160 51880 24623 -12834 -66609 -96178 -67973 -28365
21883 -28365 -2312 22287 23572 27461 -2596 -40008 -2758 22713 42480 13533 -41683 -22713
21871 -22713 -9556 -49134 -45822 -52114 -47899 -15601 -18462 -43192 -31783 25988 76679 56348
21859 56348 5920 -65678 -107807 -44697 -27765 57007 77398 69242 62168 -17888 -100214 -76795
21847 -76795 -60203 -14325 1146 19564 -34912 -16123 -33668 -72355 -90974 -62425 -33841 -8010
21835 -8010 31088 8342 20835 -6373 -84994 -56055 546 -19678 -37906 30232 46303 49932
21823 49932 106713 55818 -23197 29099 91441 32483 42215 26685 -13103 -31410 -37438 -46145
21811 -46145 -4073 5381 -95172 -131948 -120747 -45505 7932 -9826 -17970 49838 123643 72448
21799 72448 21002 73381 115678 53641 -49927 -71672 -1307 14127 37642 79618 43550
21788 43550 4719 -35282 -25182 -9227 23186 43808 58676 90445 73146 61170 22092 -5475
21776 -5475 -45651 -58297 -95558 -88211 -69239 -134598 -40714 1754 -83004 -77258 -50595 -75069
21764 -75069 -57301 -59741 -89745 -70551 -60860 -101082 -156751 -99668 -34955 15947 16280 52178
21752 52178 62880 66333 46001 26306 35629 -41022 -37853 -18150 -24953 -85599 -81438 -114172 -93913
21739 -93913 -40005 15402 25745 17420 4390 1821 -44258 -52325 -90241 -83140 -8350 13731
21727 13731 -29448 -34767 -67650 -62982 -17890 35472 -10448 -99828 -111945 -42625 -17892 -76015
21715 -76015 -96029 -82307 -131035 -86189 -53359 -71902 -49471 -45795 -24655 -87337 -114936 -129603
21703 -129603 -83213 -76945 -28321 -13393 36366 55734 47388 -54463 -141957 -72712 24046 25757
21691 25757 81580 84376 46472 17204 60436 122595 127808 49758 38010 -7064 -20939 -19641
21679 -19641 42367 75632 40675 35442 -61411 -69401 -37737 -5275 23758 23949 53780 46156 -11478
21666 -11478 -14994 -17477 4170 45272 21006 -28813 -12634 -72173 -114908 -126711 -146813 -34484
21654 -34484 14943 58960 44458 -18219 -17391 -31246 -13124 43828 5833 -10512 2125 -38428
21642 -38428 -55894 -55366 -51818 -42954 -100945 -138081 -111138 -77550 -4495 31813 -38647 -107137
21630 -107137 -89870 -106783 -131577 -160586 -98923 -56796 -34265 -40879 -68766 -54088 -63332 -73257
21618 -73257 -58591 -6717 20934 62897 100598 31351 -26500 -57069 -57174 -86777 -153497 -151854
21606 -151854 -45277 -13559 -47400 927 92281 109333 86077 98260 37302 74084 116648
21595 116648 94243 54926 41455 21514 68772 119952 112421 76958 71538 54916 -50160 -52728
21583 -52728 -36488 -6356 27488 5882 21034 40274 121770 127560 70288 38263 28915 42399
21571 42399 35906 -42182 -100809 -126160 -76235 -101382 -125826 -22303 62915 31369 -12838 -69424
21559 -69424 -85655 19670 104116 69217 33440 21115 -24560 -85166 -82398 -51958 -30567 -40480
21547 -40480 -16064 -5225 36873 18312 44529 52831 29835 33932 -6300 -44465 -21232 -17638
21535 -17638 45100 58888 28204 -41105 -26971 -29688 -50372 17353 55219 80596 46087 -19450
21523 -19450 -29035 52018 115885 106150 100257 64720 62884 106226 104158 -9445 20149 34153
21511 34153 -16152 -53814 -10834 27196 21026 -4380 2986 -55385 -65182 -114048 -106816 -48109
21499 -48109 -83695 -28959 58779 16004 7044 -1561 -14965 -18254 -5373 8425 8340 -15260 -23232
21486 -23232 51273 82039 87884 3385 -36195 -11213 42731 60408 64045 73601 65341 33259
21474 33259 -27191 -82519 -66861 -28679 -11988 10552 75181 25694 32802 29945 23571 36526
21462 36526 -21536 -89095 -99015 -126982 -105409 -62908 -36720 23855 9394 32214 -1325 -10682
21450 -10682 -37271 -8881 8351 -27279 -89745 -62640 83413 76872 35194 27576 -34216 -16161
21438 -16161 -33870 -93145 -75443 6025 81981 15594 -52237 -101817 -72237 -11868 -9554 863
21426 863 -25111 -57613 -60227 -44225 -81560 -97082 -47474 -36907 -58498 -20474 -25898 15470
21414 15470 102291 116421 83338 6550 -81851 -95928 -119799 -137368 -91562 -46563 -114734 -146215
21402 -146215 -105986 -67482 -91623 -109224 -74904 -28749 821 -43442 -47007 10305 20100 35663
21390 35663 -43688 -78682 -116463 -95587 6125 46287 72019 54556 46501 32543 -17648 -29780
21378 -29780 -24636 -15118 -667 -65849 -83055 -45034 -44079 -11242 17752 -117 -16096 6287
21366 6287 10997 -29917 18180 -2791 -45316 7936 1264 11389 44642 55783 118926 38920
21354 38920 -70283 -34077 34391 32127 15440 32928 48389 24349 -30801 -44804 -58050 -54156
21342 -54156 -41654 -40940 -29259 -80789 -99655 -62248 -87863 -64575 -76387 -81803 -54373 -21087
21330 -21087 24300 23121 38380 -27642 -17447 7910 43810 31133 -33784 -46896 -70504 -101592
21318 -101592 -52275 -13969 -3894 5430 -4309 -19535 -20497 -13802 803 42746 73601 56188
21306 56188 62190 1300 -42158 -57451 -58831 -47590 -38948 -32391 -34536 21922 78688 64501 13545
21293 13545 -27036 -64145 -94045 -96575 -99271 -80594 -104714 -59576 -49984 -74090 -121614 -54135
21281 -54135 -7349 -36725 -102751 -140849 -77962 -12949 -2042 -48389 28036 54186 20356 12498
21269 12498 42678 27541 7399 -54213 -76633 -60845 -25628 -37313 -82168 -66151 -85420 -72794
21257 -72794 -62618 -82897 -68659 -70594 -90955 -90576 -118721 -65523 3710 25580 -16168 -59590
21245 -59590 -23610 9870 -12929 20980 28410 -19437 -31402 -68089 -80650 -57295 -52352 -73951
21233 -73951 -63527 12509 12057 28660 -16210 -16033 2559 23778 885 2772 52121 43868 39940
21220 39940 1654 -8105 -13271 -6579 -16781 8263 -60513 -122874 -63024 -20503 -6638 -45987
21208 -45987 -54597 -47282 -58759 -15867 -13883 -42023 -84086 -73643 -30719 -48671 5362 47388
21196 47388 86 -18442 5790 -13522 -24696 24158 29518 -54768 -49907 -10731 -42869 -43972
21184 -43972 15797 15554 -20427 25391 33811 27062 48651 -427 -70984 -62427 30869 59786 -11972
21171 -11972 -2194 -21525 22239 36584 -4790 -50100 -53393 -82350 -74475 -74050 -84512 -105831 18340
21158 18340 61445 65741 81963 61821 -21058 -82492 -65 -186 -18993 -90035 -55947 8984
21146 8984 -21201 -142647 -144872 -104624 -27028 32048 17207 59947 71450 58277 148509 110437
21134 110437 37994 61411 98506 76513 23868 -33538 -41843 -21075 8959 2166 14442 -31961
21122 -31961 -21022 -56086 -37979 17984 59617 15113 16838 -27849 -645 30747 61137 28705
21110 28705 21260 1367 -40518 -55530 1325 13219 -59674 -78944 -89762 -99656 10130 55495
21098 55495 62540 26971 30817 3886 -26066 -25813 30040 -6148 -15281 2606 -3880 -16475 -42718
21085 -42718 -103550 -99807 -60756 -20327 15261 -13688 -67534 -47428 -16381 -26795 55140 55255
21073 55255 10712 47734 30549 -24954 -75265 -147316 -89717 -53856 -16103 19094 86878 124062
21061 124062 122130 185315 130488 99438 44149 19035 -17831 22979 42815 46467 7289 -1518
21049 -1518 -22856 -3668 2070 -68696 -86141 -37571 -13449 11263 61813 70226 109738 102222
21037 102222 59960 36475 32910 11759 -9637 31842 78691 32633 -22034 -89685 -111525 -85687
21025 -85687 -32565 -47258 -57500 -9352 -9297 -17925 -3858 -13379 -21276 -3286 -12403 -73101 -65964
21012 -65964 -65616 -71437 -76421 -56277 24075 51047 105429 114587 96238 125191 170003 157126 119649
20999 119649 85360 34042 -25537 -13595 14058 71292 72059 50890 60224 30812 -30824 -22312
20987 -22312 -1676 27371 76757 32540 3030 -17526 9829 54483 42918 -12295 -37135 -35733
20975 -35733 -9462 67445 48023 -51437 -64264 -17125 -29465 9200 65223 87319 56345 -55110
20963 -55110 -71386 -44370 -15002 -19601 7097 77753 93439 23075 -70930 -90150 -33141 -28809
20951 -28809 -13946 30182 363 -41682 -18803 -35666 -44831 3391 38084 21545 -9787 -1014
20939 -1014 -31322 -38947 -32426 -52822 -24778 44931 56864 -15822 -69504 -42102 -57213 -77054
20927 -77054 -80741 -84965 -106022 -89791 -128593 -190334 -180956 -95471 -99233 -75185 -38426 -53588
20915 -53588 -61322 -14607 14348 -9381 41902 93871 19259 -16558 -22516 32684 158973 76931
20903 76931 23149 -25569 -54779 -109345 -78660 -70077 -34151 3010 55719 67368 73796 44393
20891 44393 -15251 38732 75575 40305 -20669 25091 72558 33885 93631 45370 16592 -22142
20879 -22142 -23270 -9463 9745 62325 82142 22844 54208 70140 -46467 -110956 -103028 -114746
20867 -114746 -98497 -37625 32057 11069 -40274 -54441 -55332 -63309 -11009 -24205 -42635 -23600
20855 -23600 -56210 -50707 -39395 -52604 -52425 -88920 -54287 42099 135786 191035 92698 47033
20843 47033 45830 -13885 -65854 -50698 -50700 29307 569 -40239 -54475 -75323 -24565 -147 19422
20830 19422 -10654 -67133 -39931 28902 29998 -12495 -100734 -91704 -69649 -70314 -93864 -72630
20818 -72630 -56626 -55596 -70975 -53301 4506 33668 26015 22163 -25216 -16035 89668 90445 31227
20805 31227 12210 16377 7110 -55868 -20998 -75683 -129869 -142284 -129471 -104480 -56880 -72896
20793 -72896 -67683 -52625 -76481 -119048 -105167 -95227 -14954 13350 -32247 29695 135312 99633
20781 99633 -1993 -77074 -68124 -33858 -23232 -11611 -29585 -54264 -78856 -15209 86150
20770 86150 40840 -24587 29145 3298 -27039 -59299 8508 -14241 -64769 -46520 -9367 -5617
20758 -5617 9509 -79075 -153858 -116738 -90871 -48428 -2469 38041 1365 -18233 -14554 -50025
20746 -50025 -65613 -115267 -97069 -35215 37425 7383 -71000 -70115 -20690 27551 38281 -27408
20734 -27408 -6945 42113 20020 15435 -48956 7915 40228 -28681 -65164 -58540 -26226 -26005
20722 -26005 -28681 31155 61384 53216 53866 -9599 -3634 -12351 -42309 -52438 -32601 6945 -8621
20709 -8621 -13865 20916 21199 10465 -59443 -28272 11153 26326 48635 -4374 8343 112966
20697 112966 163313 100153 65945 31551 -3228 47502 55313 9214 7549 623 -53475 2676
20685 2676 52339 132415 168736 182166 184648 143437 76585 14434 29512 13961 69022 97354
20673 97354 82814 75807 91099 48770 100330 142228 212037 209142 203200 160049 128867 83105
20661 83105 66621 59902 81441 99030 78283 54252 29684 -276 -14883 6335 29633 -1755
20649 -1755 -29683 -6740 -30074 -60476 -56344 -93551 -72441 -85622 -68607 -68561 -105915 -76704 30999
20636 30999 63259 16772 23531 106863 144944 129292 35839 21714 25673 -1604 -38924 -27619
20624 -27619 -22897 40658 78851 101123 92930 49839 43508 24582 9183 4418 11781 16983 41106
20611 41106 110891 106928 54649 66668 75042 74121 33707 85691 168188 123888 152025 119265
20599 119265 30973 4403 63022 77012 20934 -25051 -28205 1368 35960 74201 63261 38928
20587 38928 67028 87818 37696 6903 13381 98284 16929 1762 79991 116958 131636 130486
20575 130486 71359 60322 67925 29398 -10259 -69445 -104320 -85384 -59604 -69377 -46454 20883
20563 20883 -4070 -3948 -838 274 17879 24928 12810 5114 -6876 13182 52630 34758 9480
20550 9480 37936 72507 36274 22295 45402 21862 -8423 -9668 -5099 7011 33198 -12491
20538 -12491 -31611 -28408 29812 69599 78292 217 -34804 -29413 -5265 4194 -15125 -20919 -11790
20525 -11790 -33650 -70514 -87437 -99742 -21405 99151 134396 115713 67360 11975 32537
20514 32537 -44797 -95479 -115113 -35046 24093 34012 -14476 -15183 49097 29321 -73136 -120161
20502 -120161 -62261 47886 43773 621 -11468 68450 67950 80110 90932 101891 84955 60114
20490 60114 41775 45917 40225 37892 76064 -6589 -45061 28929 55307 112111 91648 87627
20478 87627 25466 101150 95517 76754 50165 40309 34910 38692 25662 -47183 -99437 -160957
20466 -160957 -227974 -170872 -139674 -146544 -100834 -47480 -52659 -96527 -64507 -27361 -24500 -47752
20454 -47752 -76741 -30783 25081 57179 72694 50228 -4994 -35296 -18014 -28356 -20945 46343
20442 46343 83756 142315 113501 79459 94103 114384 54551 -10360 -3266 65506 109847 60983
20430 60983 -33637 -96803 -77417 -30155 17375 36014 22809 9048 14785 -27314 -24103 -11068
20418 -11068 22920 -15404 -36624 6012 28675 9528 -24410 20250 90920 66154 39817 -11481
20406 -11481 -38151 -12678 -25727 3658 68706 112933 80064 140743 187866 198940 160753 185831
20394 185831 168716 108974 135513 167350 119789 5668 -56660 -20004 21399 109808 145346
20383 145346 111226 94424 29144 -9299 38500 23390 47900 44644 54946 56919 79440 55134
20371 55134 87593 62731 61555 47185 1919 -6267 -9115 -53045 -97921 -75785 -42554 -58622
20359 -58622 -20097 -13334 40148 98864 91138 55326 -14008 -19584 -12490 -9951 44357 52020 78607
20346 78607 19876 -31610 -3928 24344 52891 67971 109168 122571 108134 75553 82489 -19671
20334 -19671 -92210 -73226 -23507 -44988 -14655 -20515 31678 99917 91509 102964 67167 -8715
20322 -8715 23522 -26743 -34569 -5435 -69629 -80456 -89429 -43785 -23569 -11553 30903 38538
20310 38538 37544 56422 106132 54652 74663 84584 164658 124089 85995 95616 74774 41076
20298 41076 72315 33893 -11092 17090 45271 -2027 27025 99755 123615 29045 -28540 -32679
20286 -32679 -37661 -10461 6508 -26116 -3888 -18355 -20511 22472 -5014 -75905 -18055 45409
20274 45409 10418 -44191 -21746 21165 25441 43390 453 3452 -62894 -73187 -25253 -5495
20262 -5495 -51160 -34532 22626 18804 42413 33017 18589 35917 32735 30887 13518 20503 44889
20249 44889 43035 35971 41313 -61586 -144475 -123544 -116089 -109392 -141031 -166066 -105444 10150
20237 10150 46860 11649 -49180 -103707 -69957 -21749 -41035 -85930 -41662 -25111 3476 -47278
20225 -47278 -39126 -67405 -50372 810 -6043 13423 -22156 -37532 -18740 18106 6938 20097
20213 20097 2117 -33450 -30853 -8124 -32675 -56345 -21641 -18575 -58060 7374 128398 153653
20201 153653 76245 92452 83956 25436 -16054 -39407 -62281 21511 85923 109838 97632 126238
20189 126238 152731 133361 114712 115821 143933 147132 88185 115794 103758 87909 -3914 -54013
20177 -54013 23843 78067 36382 21520 1461 22857 48201 82544 79406 59691 30416 16182
20165 16182 26840 57384 82167 13998 -35136 19457 58716 76606 74203 32717 -1513 16878
20153 16878 45925 28232 -15576 13138 34482 -4736 -9480 46492 64203 28480 -19821 16676
20141 16676 45668 30408 18654 -29711 -22297 48749 75330 74078 140265 158003 152454 152441 198710
20128 198710 212316 140362 112757 131686 21292 -23361 -25166 23291 85587 98036 49696
20117 49696 82927 57957 26730 29216 30809 34139 91808 144569 99955 19603 -24799 41569
20105 41569 77796 60087 95354 170578 144488 119523 123201 64295 43941 64856 100464 97513
20093 97513 51786 47496 -21226 -54432 -87712 -28016 -8117 10180 427 14070 24367 -13223
20081 -13223 -68101 1623 30008 -38749 -25064 11470 -33740 -11103 56709 117135 48903 32906
20069 32906 23412 3545 34901 35168 79464 136264 115393 113459 58808 89621 86251 66437 82094
20056 82094 128642 129636 136517 174500 120024 99891 51296 21363 67686 90702 68867 105987
20044 105987 91083 69217 95148 45199 24379 26768 -9963 27058 25154 -15027 -31870 -18732
20032 -18732 -45976 -35894 -14570 -47687 -73947 -10641 -41941 -52001 17011 47940 80540 19481
20020 19481 -5952 -9960 -23259 -12259 23794 22293 54831 79460 35049 14636 -15330 41341
20008 41341 17490 35663 95723 120325 78968 -57861 -29205 60251 97839 47561 -57706
19997 -57706 -42988 14669 46882 116839 164740 151428 135798 160006 126427 105185 72947 57343
19985 57343 77934 96768 142037 98412 75161 56263 26538 60325 21103 -7562 74686 154969
19973 154969 159373 148247 191615 220313 175223 139636 114322 72550 52543 67558 81414 66584
19961 66584 102238 81199 67517 20136 26249 102830 139877 140390 153327 129531 94920 6085
19949 6085 5343 60789 89851 82432 71237 75367 146498 167083 205941 199836 211853 263309 268621
19936 268621 256100 234838 255509 265896 238108 301527 364743 421471 499493 567428 591061
19925 591061 580815 579656 635524 659768 610434 612223 609915 678964 665840 587636 513554 521886
19913 521886 493420 431760 405800 456924 432707 356359 342339 363524 252430 244983 312963
19902 312963 287304 245861 222548 246015 254703 234018 190322 120790 58809 68923 118372 149897
19890 149897 140296 131921 143275 138764 131459 175454 131140 123860 129270 142297 160119 104201 79126
19877 79126 92864 27201 14704 59107 86851 76542 142026 173451 188759 194322 136271 98713
19865 98713 17841 -4294 43995 123132 204285 147188 133591 181578 206095 141681 115173 104920
19853 104920 67793 93092 158519 161613 180575 146140 92352 87415 133054 155084 139688 137989
19841 137989 183695 176099 176317 130293 103680 36045 69946 109339 106562 120726 85470 136184
19829 136184 101741 88275 93377 44649 -1527 34062 68548 109445 20129 -27820 -7197 86107
19817 86107 106360 148242 209944 197639 187907 219817 193403 147712 88149 100948 139621 218043
19805 218043 120094 24629 70762 88489 88802 130715 142092 137957 185377 216219 198428 213851
19793 213851 207562 144620 111635 117870 68016 30057 47474 25890 68337 120077 124232 106411
19781 106411 97460 52630 28952 44601 17504 26587 135826 79969 45235 77157 76664 131685
19769 131685 182346 110281 70640 102663 162575 174571 122118 86896 61629 34528 34022 69
19757 69 -23532 -72911 -93641 -61704 -21555 17765 -47290 -49724 28386 14123 98809 158273
19745 158273 136316 98252 117284 120895 95465 71540 106636 210515 214497 98756 16573
19734 16573 20363 42501 43831 27131 68538 62092 84520 41029 48243 -5765 -54405 31852
19722 31852 85273 132361 152228 115175 53933 -9272 -48511 22115 478 -25218 -8507 -29780
19710 -29780 14293 61786 55997 48596 -25860 -34732 10153 66989 105147 96183 86407 86581 62706
19697 62706 19015 -26137 -28980 29218 70191 60892 58539 114764 85802 39636 84408 103342
19685 103342 116259 137803 138651 175906 150489 93516 120100 108683 99850 107210 136103 161125
19673 161125 131355 108815 -10888 7470 103983 107012 147821 179964 171201 113826 138588 198527
19661 198527 191261 162012 202121 242062 236872 198842 221836 229343 161393 111239 47313 51263
19649 51263 90818 179374 171432 108721 153658 217545 170978 139441 157806 196447 167846 158330
19637 158330 172555 238667 184907 91720 32366 85193 158072 155734 190491 168708 199424 256024
19625 256024 212446 244785 246641 212896 137142 114998 194457 208781 160055 135999 132421 102005
19613 102005 90497 98011 89679 101333 104118 130690 115898 50478 55740 65882 200131 287358
19601 287358 265323 231565 203658 129187 74815 156112 168467 134397 92661 92361 85625 62359
19589 62359 79005 167077 195677 150458 157516 198424 223459 225803 180902 151344 176323 145303
19577 145303 68230 64253 165685 175360 172341 296181 263863 243402 280472 263315 248012 220423
19565 220423 198752 204745 258503 287589 261140 299169 248565 255994 303058 360864 384408 365235
19553 365235 379288 400639 454104 425381 436305 492398 488202 484039 493347 499490 453743 391786
19541 391786 423118 415128 435014 410012 408031 457170 532554 544740 448450 348636 354687 329809
19529 329809 359901 390262 354279 304187 263508 305439 336586 347871 391314 461381 425423
19518 425423 398755 408073 449920 434346 322054 261207 274835 323960 451485 578352 623547
19507 623547 646827 591547 563249 614371 669549 637968 580274 591592 541177 542410 552885 551238
19495 551238 535372 514132 538805 563876 540055 493075 573440 671928 669331 692874 680608 647249
19483 647249 613316 687918 679371 679163 740922 847271 926991 969420 866865 783860 795141 885132
19471 885132 858589 887350 996970 1033019 1011801 1011261 1040828 983845 1066125 1104287 1124379 1216908
19459 1216908 1302824 1286921 1236817 1336695 1362327 1384903 1411114 1539053 1631237 1687803 1725789
19448 1725789 1833624 1969018 2148606 2324712 2465932 2615706 2767845 2959831 3231740
19439 3231740 3475716 3754359 4086862 4504405 4939659 5419237 5997105 6716586 7482226
19430 7482226 8365618 9457492 10748070 12452702 14674813 17718186 21865328 26996873
19422 26996873 32365754 37343051 42867626 50076633 59065509 67940642 74800950 80609080
19414 80609080 87108889 93626519 98798084 102113188 104628271 107421320 108449373 106091094
19406 106091094 101809418 97894247 94849945 90599601 83348229 74868852 67309996 61139731
19398 61139731 55401638 49131117 42853755 37403093 32993651 29299810 26160317 23500059
19390 23500059 21340145 19528402 17960014 16584986 15390249 14265717 13373211 12639707
19382 12639707 11879284 11234878 10612459 10055194 9524307 9044151 8559452 8118017 7723818
19373 7723818 7339625 7002137 6679925 6445617 6196134 5949997 5742552 5537992 5307568
19364 5307568 5115278 4985100 4800668 4620805 4484509 4309468 4152213 4035426 3879140
19355 3879140 3723503 3659877 3558529 3456083 3373731 3275676 3162380 3044875 3011811 2911509
19345 2911509 2865622 2810971 2681449 2595291 2553350 2442755 2377738 2339751 2303509 2227176 2140807
19334 2140807 2082798 2073278 2060574 2088043 2088330 1973675 1868717 1813604 1794356 1704407 1655371
19323 1655371 1637191 1662544 1713654 1771282 1727353 1675149 1699452 1721822 1709875 1742599 1672884
19312 1672884 1613661 1560618 1553087 1543801 1532426 1435478 1351707 1337324 1282454 1237921 1196845 1146194
19300 1146194 1107339 1063320 1057614 1074196 995998 897251 797762 770268 778170 731236 707141 611617
19288 611617 635668 625329 558639 453221 423781 478421 474589 392003 376989 400541 387101
19277 387101 289425 268795 253097 265199 284999 279721 340334 392681 367059 342291 335159 341151
19265 341151 324590 278930 361173 427826 466608 488258 459839 412249 446531 469120 421993
19254 421993 428334 501312 460561 416788 472222 480846 441259 534737 590933 542798 473814 399068
19242 399068 413080 410636 398465 408657 426667 354602 283240 283584 335306 347152 304688 252108
19230 252108 228129 300921 353409 328935 304667 279900 251525 307794 280520 285833 280264 299618
19218 299618 325236 367362 326816 284296 273725 342085 411208 404648 439325 521604 491537 500239
19206 500239 562019 600797 675038 797439 821521 862487 908920 902485 869193 839969 793423
19195 793423 771953 810092 824276 746111 582127 505691 510637 495264 431661 405727 447671
19184 447671 394501 363027 350658 333102 301037 207672 157129 210996 295549 283764 294405
19173 294405 382789 394234 287688 300591 374848 315671 287418 297748 377985 376220 443806
19162 443806 473067 513005 533662 521878 477974 526035 576141 658800 720424 714582 686469 650526
19150 650526 705360 792104 797076 756404 714315 763122 736333 713163 680668 715498 744931 804616
19138 804616 777106 661381 622920 649768 577363 530995 472034 381665 351175 363570 319705
19127 319705 268903 240503 241473 225860 151170 111510 80637 111583 160798 157551 102237 130579
19115 130579 173774 196972 102576 97581 162638 236602 280224 287962 282634 222639 214757 190288
19103 190288 195553 160842 172094 204603 211327 195932 273786 269767 172719 122848 155058 164677
19091 164677 196715 204031 199802 159114 163335 192461 147009 109338 86474 32581 21822 68111
19079 68111 116075 154444 131667 137243 111616 79241 63305 107038 27592 46412 132582 163148
19067 163148 160093 173741 177157 253304 254262 235301 220513 259712 250182 157447 110998 146297
19055 146297 140043 143236 88304 64206 122502 116348 157850 189360 217091 235974 166107 144726
19043 144726 175351 166836 71541 35850 24096 82044 91109 76873 102483 125049 93362 106880
19031 106880 103716 104388 165702 189743 132928 110359 111137 105872 89036 194103 299805 269702
19019 269702 214008 231056 162869 139865 148933 106602 115774 179793 186269 218620 236670 266640
19007 266640 247520 219044 205238 180751 174975 266673 279183 199815 175270 142751 168714 197556
18995 197556 198349 218551 200791 212094 182861 115514 86824 103478 195359 224806 259940 197854
18983 197854 139340 167651 143482 83774 69637 81162 148771 200883 196325 204534 201157 188180
18971 188180 172364 194290 200778 206480 168933 210705 213075 244954 260937 195943 217258 269489
18959 269489 329429 406424 407132 331470 246528 272832 291623 240092 227300 279868 317707 320843
18947 320843 255360 239483 264237 311646 310220 283376 286627 282578 293680 324676 318208 341185
18935 341185 342493 338075 358338 408944 490439 487380 422589 367431 324326 309972 373880 365589
18923 365589 285030 239080 277913 332805 359850 404400 337237 255101 261527 359225 402184 385496
18911 385496 322305 302138 356774 382188 439515 482754 509514 531402 505254 576751 641332
18900 641332 722366 785311 774147 698888 644577 726727 797544 807269 790489 809079 801811 762570
18888 762570 733307 700020 713617 711076 736732 708504 623319 610060 589164 563459 530977 519963
18876 519963 519530 518506 458450 387888 424384 504793 509587 476854 503142 524960 576982 460122
18864 460122 403526 438118 467123 524613 608318 558893 504159 523670 485821 489218 531925 554143
18852 554143 578800 514550 458248 498156 560396 522979 508454 502958 537276 623010 693209 659627
18840 659627 668407 801125 864165 863508 930475 882821 873430 856450 837352 849173 814766 746828
18828 746828 803761 841579 897414 876376 822341 751417 796909 814509 830055 855729 817466
18817 817466 917792 1046232 1029478 1003396 978483 1003232 1036593 1160957 1302316 1324971 1194452
18806 1194452 1111080 1095384 1087634 1081914 1031507 979294 998330 1044250 1058420 1030410 1078736 1102836
18794 1102836 1107625 1160251 1221549 1206171 1193661 1193039 1276643 1378147 1401531 1450107 1545585 1606480
18782 1606480 1707356 1809427 1935551 2021936 2127721 2238961 2298576 2345753 2412037 2542922
18772 2542922 2778868 2996750 3279369 3663846 4191983 4805623 5761745 7175887 9363979
18763 9363979 12095235 14214962 15090859 15610476 16466605 17439942 17717148 17424872 17730055
18754 17730055 18460198 18494839 17807113 17156765 16848390 16328166 14906756 13124997 11637020
18745 11637020 10423746 9451504 8585746 7920266 7380989 7020977 6845205 6656251 6563217
18736 6563217 6500028 6424080 6417384 6536811 6652939 6749699 6907693 7072355 7305058 7675000
18726 7675000 8076678 8480383 8859622 9371313 10108218 11020991 11999187 13138552 14552958
18717 14552958 16398754 18838288 22069130 26432115 32677620 41962554 54865920 68556830
18709 68556830 77552984 82193233 86604555 92364926 96958963 98266943 99937449 105045174
18701 105045174 109504812 108742435 105467538 103579406 102470918 98031207 89160907 80220443
18693 80220443 73880010 70432880 69451364 71676672 78293683 89236741 100387751 108003418
18685 108003418 114467347 123845322 135782680 143230193 140697594 132791484 125534301 119415956
18677 119415956 110830773 98237649 84690155 73062224 63620762 55624235 48682821
18670 48682821 42964282 38241586 34393647 31362758 28929015 26885184 25112154 23552773
18662 23552773 22240663 21106179 20059590 19127941 18250308 17421568 16679986 16019073 15259631
18653 15259631 14481106 13834560 13275314 12887793 12504352 12146310 11918322 11732227 11552887
18644 11552887 11453973 11486216 11584167 11740853 12015458 12566086 13388828 14646076 16698986
18635 16698986 19359140 21442477 22568068 23710119 25591388 27772315 28490360 27154474
18627 27154474 25412043 24192910 23101044 21321362 18883347 16566427 14716912 13256118
18619 13256118 11998574 10979367 10162189 9538760 9004358 8591679 8293011 8022824 7798367
18610 7798367 7671900 7656929 7627297 7608488 7646697 7674501 7679037 7639316 7699742 7787461 7897663
18599 7897663 7997789 8101125 8303638 8514028 8777683 9100747 9401381 9839220 10555437
18590 10555437 11498092 12701720 14320519 16483132 19504623 23710439 29748452 38470701
18582 38470701 49848181 62173253 72710794 80069178 84003033 85809884 85425906 81822969
18574 81822969 75073015 66473953 58141167 51205577 45699982 41581191 38997145 37933794
18566 37933794 38778321 41988616 48177519 57623420 68912116 79118489 86367176 90149379
18558 90149379 91648860 90972641 87069057 79930332 70476360 60832322 52237314 44804254
18550 44804254 38548122 33274379 28905816 25366170 22518310 20240973 18401157 16916580
18542 16916580 15757251 14839278 13960695 13222790 12604961 11997702 11590381 11151684 10659440
18533 10659440 10160411 9747053 9311043 8824513 8260093 7884559 7587875 7189484 6804329
18524 6804329 6557991 6311147 5992127 5743855 5528575 5279836 5107207 4959713 4737065
18515 4737065 4624854 4433749 4279078 4211715 4053496 3923201 3894808 3807765 3575114 3375871
18505 3375871 3282957 3200641 3126256 3030601 2902333 2810626 2704438 2585660 2580435 2555498 2505539
18494 2505539 2483347 2411873 2292819 2266301 2237622 2217792 2185427 2140715 2040866 1940710 1907929
18483 1907929 1812629 1790237 1744577 1702688 1700614 1713579 1627673 1553047 1514733 1507229 1479717 1420759
18471 1420759 1382032 1385566 1378837 1329502 1230448 1184632 1167412 1187006 1093879 1035632 1048639 1045742
18459 1045742 1000444 1003464 982528 999650 914575 845301 825300 790864 728547 649422 566843
18448 566843 548010 587725 626071 627937 597778 507568 507734 541278 550073 528568 474105 471945
18436 471945 451768 447878 463636 466252 408133 341018 316136 292734 268904 254277 207789 198345
18424 198345 236736 302020 275298 236096 213470 163520 116079 46110 87524 62939 73995
18413 73995 119335 67414 67375 181670 185468 214118 182243 197030 248223 263561 259342 234291
18401 234291 174577 149508 96833 64795 147978 194940 176659 131524 116039 155320 144969
18390 144969 186076 189869 188061 182607 129711 51260 36913 16710 43319 73733 107044 142309
18378 142309 117046 113306 138431 147637 85366 116795 168553 141283 160815 147394 165813 98028
18366 98028 -8332 -31804 -5786 65834 92268 31972 40964 72857 1256 24463 82861 112713
18354 112713 86454 14419 2095 -21643 -40976 -51819 3167 57555 119717 125695 35871 6471
18342 6471 39075 31648 -17837 -28063 -4304 56995 103877 74941 143590 158463 144029 169930
18330 169930 136266 88204 73579 3525 -77790 -80364 -88687 -19853 -16797 -28836 -48820 -37811
18318 -37811 -58086 4883 19351 -11056 -38471 21247 42346 45994 70115 109630 55521 30152
18306 30152 -2097 -52 43559 14006 15730 15321 30628 -55195 -16113 93530 56054 -14186
18294 -14186 -50437 -24308 34649 -1699 -51433 -47180 -48462 -41804 38719 91770 39718 -62089
18282 -62089 -87535 -126624 -104386 -16992 -31993 -58035 -54738 -29734 -20979 -37237 -95999 -74659
18270 -74659 -28904 -18160 -52971 27475 17624 -86487 -64254 -9146 -11752 15617 -38088 -32491
18258 -32491 33464 -9208 -102641 -148153 -48183 87000 122952 132171 122469 128578 166338 171483
18246 171483 153251 139806 126593 74319 34195 45603 32630 10794 48653 131608 244217
18235 244217 325082 332407 248730 237701 267165 288514 294243 284220 234070 200221 231735 294915
18223 294915 253243 214311 160751 148280 167465 201351 129143 85124 131081 77544 24426
18212 24426 17621 87845 144420 135608 88312 35589 -36701 -51897 -45783 -2382 11982 -11154
18200 -11154 -13691 62485 164884 216571 276854 325392 325480 320338 349490 403418 439282 519290
18188 519290 602160 712645 785945 833089 756238 740240 794713 806580 737554 768508 821318
18177 821318 892647 836498 712656 632199 553573 512299 434420 363136 321365 274009 223093
18166 223093 184673 187072 214528 219528 202488 148817 78009 108903 170017 133500 114506 127946
18154 127946 91225 68743 51074 67547 28716 8435 882 36004 10321 59190 90092 39788
18142 39788 -51003 -64029 -41150 -21536 47220 78985 89661 131505 167601 219995 249301 221546
18130 221546 267348 330398 331631 314488 319383 321797 234332 179924 153550 162578 110031 139000
18118 139000 198754 158717 47858 17915 -7415 -38883 -77350 2087 -27823 -79247 -44589
18107 -44589 -10401 -19201 17570 -44055 -87929 -131567 -148981 -167502 -102673 -51087 -49310 -36943
18095 -36943 -9430 51748 37341 -21866 -79171 -73556 -77840 -77466 -31187 -21764 -26283 8443 32708
18082 32708 32402 75300 108000 13681 -53728 -54436 -57211 -112084 -92546 -27687 -16271 -87401 -47592
18069 -47592 -41197 -20217 -62260 -55358 -16451 -66942 -62149 -23395 -41334 -13747 11885 -30231
18057 -30231 8598 -31632 -4007 8310 -28170 -9331 103896 54844 -21821 -55589 -88556
18046 -88556 -82368 -62069 -107200 -169321 -215478 -149705 -114383 -118359 -104955 -69325 -19093 -35294
18034 -35294 -76823 -74005 -80614 -22095 1552 -33546 -81763 -99016 -123174 -104798 -148659 -186851
18022 -186851 -109610 -84009 -64028 -69052 -167535 -108263 -53433 -58592 -36943 -94685 -64499 -58672
18010 -58672 -47440 -39182 -107168 -138595 -73844 6176 81130 130528 118044 35818 72040 116058
17998 116058 113630 151853 254039 305381 307637 327426 328872 291070 271372 307775 322983 247966
17986 247966 181615 193965 209957 222465 256337 246241 190176 223244 308049 310107 337534 359349
17974 359349 331482 305669 338798 343612 307480 284910 244985 205610 156778 137634 86084 63290
17962 63290 78850 96469 61548 41487 75805 111228 58013 -19189 -33739 15308 51785 59124
17950 59124 28823 45213 87276 112198 83276 54967 -20116 -94809 -62377 34385 74545 20422
17938 20422 -34249 -67897 4714 18600 -65810 -109121 -92828 -45019 68008 100151 38160
17927 38160 -1312 33999 -9078 -21188 6651 -23446 -34592 -9172 -19345 -43368 -76730 -29579
17915 -29579 -58116 -13480 34680 -34353 -28448 -92089 -143708 -52063 -751 31304 10916 9748
17903 9748 20967 -22708 12656 29331 222 -49601 -42399 -74322 -63271 -18110 -20422 -19632 1764
17890 1764 -18254 -27286 -10697 6948 -27304 -71282 -108937 -134733 -123993 -61700 11590 -7453
17878 -7453 -20989 16927 33702 26392 7022 -8564 -14692 -1258 -7125 20905 -5641 14153
17866 14153 4626 -43413 -60018 -71903 -55922 -46038 -121759 -158811 -147627 -115234 -52453 -1231
17854 -1231 -4029 -46025 -57465 -86756 -117036 -85348 -7328 -10145 -72413 -94717 -78507 -81831
17842 -81831 -69145 -52899 -76063 2467 87780 55027 -14251 15161 38463 53208 14224 12088
17830 12088 258 -5710 -38982 -82044 -139387 -92594 -70908 -100499 -141659 -163043 -159606 -111168
17818 -111168 -98813 -124809 -82763 -77940 -71338 -23524 6211 9571 23724 -24131 -16833 -13811
17806 -13811 -31476 9574 -9573 -46428 -13548 -15230 -46987 -50964 -71826 -57193 -110037 -150604
17794 -150604 -136988 -81267 -1717 36368 -48711 -99314 -95338 -48069 -3718 5974 35062 13267
17782 13267 14665 -79264 -91249 -41726 39057 22789 30752 49646 11441 15989 -4051 -50891
17770 -50891 -120816 -154575 -131062 -72058 -20067 -25876 -12841 -37298 -81574 -36747 -45437 -37457
17758 -37457 -6956 15663 -17325 -14556 10253 -37483 -123492 -97829 -65250 -89736 -49470 -40459
17746 -40459 -68263 -21255 3652 -3606 16728 -58401 -44961 -80319 -107704 -67518 -56065 -82082
17734 -82082 -75189 -66045 -55962 -113691 -82002 -26209 2814 -26160 -3087 -3599 8827 10235 19900
17721 19900 57952 74746 8643 8088 -2610 -11486 49082 65288 61893 70883 76340 67702 -34860
17708 -34860 -11384 -8697 -72157 -154354 -105862 -54148 -17586 12247 -10695 53602 91391 77320
17696 77320 -1754 -66137 5220 49872 24265 -14753 -8818 38139 65988 67294 -44400 -66241
17684 -66241 -34102 -11922 -2508 -46775 -83770 -114231 -78759 1530 56483 39921 -17282 -83481
17672 -83481 -176453 -190104 -118211 -25144 -11373 -5079 -33364 -75594 -142627 -120309 -38716 -9599
17660 -9599 -37737 -28743 7597 -21469 -96041 -77619 -44216 -9809 -47066 -65899 -35096 -65193
17648 -65193 -26357 -38026 -83028 -145648 -105356 -27659 57132 77249 61817 15372 -43400 -34503
17636 -34503 -5445 -4456 -74380 -73008 -8764 3188 20695 6787 29087 40371 6943 34348
17624 34348 -15243 -129327 -109440 -71417 -94654 -96872 -57192 -76046 -83990 -119590 -153836 -178845
17612 -178845 -131801 -24851 10629 -80 24235 6239 -53766 -47812 -84957 -80942 -11684 4213
17600 4213 -24035 -18593 27448 36878 56690 -26693 -82754 -83638 -94324 -106109 -64525 -21934 -60833
17587 -60833 -99066 -123694 -153938 -197684 -165939 -43029 29395 44147 36477 -31358 -73826 -61400
17575 -61400 -30607 -11002 47214 38408 35192 31950 1384 -30556 -41035 -22339 -33663 -11087
17563 -11087 -52766 -83837 -106755 -103315 -68265 17125 53735 23128 31233 22801 -33710 -69796
17551 -69796 -5928 -29460 -17942 30799 65349 87962 73344 27134 10029 -7657 -19386 -5843
17539 -5843 -59340 -77565 -68316 -93895 -109194 -97531 -5165 32263 17417 -29066 -78627 -60783
17527 -60783 -21043 -37879 -29022 -21604 14252 12095 8473 47283 -6213 -45712 -37888 -58383 -98285
17514 -98285 -98159 17459 61313 41754 47722 36159 -26322 -49346 -49991 -30686 59274 50621 50944
17501 50944 26961 90096 107703 115548 71255 26799 13083 -28087 -8672 61134 110124 171038
17489 171038 219554 247457 247077 250263 261017 275938 282652 329117 348267 389202 390909 423617
17477 423617 405387 324701 295100 260475 187118 183474 169843 106205 88609 167502 290537
17466 290537 331705 327032 354077 355446 340271 309554 245566 231558 198294 201114 182684 145142
17454 145142 103773 107358 166480 195539 121566 111304 44012 8840 37557 81545 131887 102046
17442 102046 73282 33924 12341 19408 -24563 -32472 -6439 4491 7789 -82170 -49248 64363
17430 64363 81639 55667 40209 49613 47232 16472 -19901 -40850 -53336 33746 97988 71378
17418 71378 14556 33816 4528 41607 47543 -13807 -74168 -104764 -116347 -86586 -28537 -22457
17406 -22457 1025 37438 20196 -51367 -28452 31971 34290 21644 35639 492 -48851 -21887
17394 -21887 32401 24322 -61319 -75690 -12134 -16673 -13325 -4765 27938 38588 6238 -8633
17382 -8633 30087 39470 48622 30227 52790 53626 77297 103382 48104 28527 53827 -37282 -113841
17369 -113841 -106278 -83690 -138710 -115474 -66738 -3024 24800 45823 74636 56004 92782 69172
17357 69172 33838 -21081 -23919 2572 -26727 -72147 -53585 -54760 -48639 26805 34020 -1019
17345 -1019 -8976 9371 -67114 -65399 10780 10130 7855 2389 -59527 -8185 36867 29288 -5953
17332 -5953 20771 36207 -11894 26740 74188 -9257 -62809 -84008 -125145 -120284 -45628 20504
17320 20504 35092 105460 75953 39588 37430 -6993 -50081 -21705 97673 77559 42183 29255
17308 29255 26500 90787 118449 125056 169436 130219 30916 -20243 -15427 7456 46501 34418
17296 34418 1642 -13071 -47087 -69594 -81309 -107455 -7523 26696 33504 45744 46285 -22912
17284 -22912 -57131 31378 84586 7810 -85987 -32560 13678 10574 -87912 -55562 -24368 -31806
17272 -31806 25380 113036 107367 45273 70206 48567 26551 15851 -667 2991 -28526 22129
17260 22129 669 53604 54398 -18164 -76058 -83765 -48101 -56866 -46811 33641 13991 -8825
17248 -8825 -46751 -126088 -19638 -1024 -8015 44536 68613 39107 -5473 -28015 -41997 -33356
17236 -33356 4794 25347 26783 -8853 59160 77237 96800 105708 86761 144864 108802 54612
17224 54612 14560 -5993 -15592 -20262 -52539 -20650 -19143 -62327 -40045 30084 41744 -8665
17212 -8665 -2090 -6617 -52430 -101530 -84435 -24061 -21165 -51190 -42098 -76915 -14830 -1730 18466
17199 18466 36621 4176 -2384 -36112 -57053 -16885 7995 47417 80105 38542 3306 -21059
17187 -21059 16597 -3772 -50144 -88121 -38781 -25823 66643 131909 141592 92617 63193 55902
17175 55902 77745 56004 81353 71470 40476 37589 -5328 -26715 5475 70520 92836 87362
17163 87362 110146 84177 45910 -19053 -44791 3563 1045 -31155 -65498 -49279 16627 84930
17151 84930 38609 22650 3090 20035 64943 75369 61794 106616 122590 123546 133136 102464
17139 102464 78668 74110 91274 136199 199062 199642 133317 130596 167823 189864 140334 68820
17127 68820 62632 58428 40466 60672 153715 197647 151739 85359 90634 130612 164295 116579
17115 116579 112122 144769 153240 59696 -26800 42951 14063 29327 110336 153136 155030 153585
17103 153585 132308 149611 181903 86691 37738 59790 54034 48101 14602 52328 93296 79940
17091 79940 118125 161442 141999 129935 148900 176797 189762 155683 184569 179760 205948 182365
17079 182365 158642 159427 190404 195570 164411 172348 228532 208839 155664 143475 159890 190162
17067 190162 184512 215793 214051 238082 264223 301876 307540 300425 282688 290127 303649 305071 274825
17054 274825 265896 216922 173578 226441 332998 386253 396105 400497 424362 485164 544506 493958
17042 493958 461376 423036 372408 338700 390611 387239 305197 243370 306722 287286 292908 336866
17030 336866 336395 366781 415243 507576 520323 445220 390170 399300 408548 395516 360689 386555
17018 386555 419274 446777 405656 437702 471300 411076 376187 388560 454776 448452 340199
17007 340199 387147 494541 585330 577114 515522 531358 499926 549197 523971 535456 567416
16996 567416 620241 685691 647094 673901 699620 639212 606541 623312 666365 684630 698403
16985 698403 757890 791104 790111 806469 776562 845593 973424 997792 1047786 1120729 1177885 1235129
16973 1235129 1265421 1276298 1317078 1341998 1413062 1508303 1699598 1874684 1936656 2013499 2242808
16962 2242808 2480788 2665520 2860243 3071651 3294042 3517720 3819550 4211239 4583484
16953 4583484 4976800 5499243 6191593 6951010 7745319 8704853 9992904 11749230 14152528
16944 14152528 17646984 22862383 30748155 40662040 48308539 52606103 56984354 63856470
16936 63856470 72376840 78120628 77576038 73525019 70148984 68298973 65804512 60043712
16928 60043712 52835356 47241355 44000722 42538266 43217226 47058818 53856479 60009693
16920 60009693 62856176 65163908 69714452 76491522 81952623 81679145 76916496 72098967
16912 72098967 68954060 65791563 59624625 51111992 43390633 37414913 32574121 28359378
16904 28359378 24836427 22026600 19797227 18043990 16526710 15224855 14184967 13241003
16896 13241003 12372630 11623246 10966820 10416484 9931569 9453059 8990183 8558146 8164658
16887 8164658 7771667 7436575 7110933 6840970 6518245 6217583 5931440 5682429 5487945
16878 5487945 5267619 4962241 4767021 4592896 4502620 4410031 4242700 4082655 3919270 3754951
16868 3754951 3611520 3494561 3400605 3293247 3233686 3129111 2960712 2856023 2792017 2660627
16858 2660627 2616204 2504533 2400679 2310819 2252318 2225361 2161238 2014269 1996764 1944628 1904123
16847 1904123 1891229 1882629 1838611 1828754 1778211 1693584 1626252 1504436 1430896 1429111 1460817 1405359
16835 1405359 1388581 1352511 1296876 1221926 1231958 1256984 1244031 1159057 1139013 1043291 941219
16824 941219 942353 984053 974709 934796 876043 781683 751241 778562 781553 777852 741359 772817
16812 772817 806210 725634 707457 709409 704655 631849 590958 536183 526365 508994 473857 418320
16800 418320 385629 365792 345028 374041 429247 444108 405451 313397 302282 283880 256019
16789 256019 232382 225780 223918 220121 183423 154641 116711 97845 59224 53899 10883 49905
16777 49905 88258 88296 149707 169128 210388 187580 184728 156181 89929 64766 148322 124038
16765 124038 150223 110122 57211 39959 95854 92827 69903 129797 99153 40536 23859 42481
16753 42481 92173 95156 131269 99659 7724 18507 14995 77659 70294 61287 56196 118327 103282
16740 103282 70975 162559 127561 47253 29478 130859 70688 78744 87284 95835 60382 42332
16728 42332 25563 36935 61979 117751 23474 6095 39384 145583 188453 185281 146550 178461
16716 178461 178135 123463 53023 39825 69258 58980 104856 103540 38118 35378 -7159 59144
16704 59144 112841 63318 108802 88469 130266 144357 103817 66994 47922 54917 56677 11577
16692 11577 34063 110944 137805 161743 149945 133334 85160 79521 88108 85423 11833 -72555
16680 -72555 -2081 5810 -73526 -45385 -35638 -61191 -82367 -65129 -76915 4072 27093 36481
16668 36481 64951 75695 46815 30752 50775 34661 -1308 -18024 -27971 16083 3464 36005
16656 36005 62482 121198 183931 189461 175479 75759 3119 -17489 5319 35747 1770 3848
16644 3848 -33136 -64155 -15605 73728 66134 -32762 -63555 -36632 -28566 -7098 -25212 -66114
16632 -66114 -111314 -56408 -54237 -24287 -10044 -21968 2354 33672 7365 -36531 -110456 -84849
16620 -84849 -32455 -33803 -41127 79976 126030 100340 29906 16169 16029 19230 13848 41901 18444
16607 18444 -36991 -35170 -46677 -48970 -56563 -87254 -54622 -258 -43688 -134367 -182830 -126516
16595 -126516 -104880 -94205 -50809 -14544 -29494 -86994 -79056 -98389 -54607 -4288 -13929 18729
16583 18729 49527 43145 6121 -29267 -51224 -65050 -61149 -17973 -13164 -85620 -72028 -88401
16571 -88401 -128301 -128611 -128140 -120087 -75601 -72013 -38841 -19681 -45238 37772 23192 -57744 -45587
16558 -45587 -25399 -57952 -36796 -17944 -7392 -7532 -34784 -48381 -16728 808 31467 39046
16546 39046 28 -61715 -87801 -81005 -68241 -29237 -27332 -85410 -27367 -1047 -51147 -45433
16534 -45433 -27857 -51892 -42809 -28586 -47072 -21647 -71674 -63235 -11733 -5960 -73986 -36304
16522 -36304 -43812 -80501 -58795 -16479 5847 42416 -14295 -83271 -41502 98695 106659 88640
16510 88640 97688 100875 98442 76606 -4243 13986 -28100 -57845 -68288 -21968 -37364 -39937
16498 -39937 -7484 -79851 -98885 -103919 -133850 -137929 -183215 -55746 19621 -73746 -67378 -20072
16486 -20072 -28133 -93935 -131287 -151124 -160910 -130932 -104741 -102259 -84875 -19213 31404 48042
16474 48042 -11471 -22712 57298 92138 52131 -73911 -127677 -95950 -72894 -121702 -139526
16463 -139526 -96884 -82526 -122362 -133505 -121109 -87363 -1704 -13032 -37236 -47419 -76865
16452 -76865 -26008 -14849 -64745 -103406 -132594 -61041 -10903 -2399 -1588 -28020 -92291 -125950
16440 -125950 -103073 -127352 -29365 43592 92765 81262 42480 39341 41382 49052 74160 129179
16428 129179 134353 152360 129674 97124 50412 12175 -19805 -26299 -58624 -86754 -139668 -114579
16416 -114579 -69679 -98995 -190936 -139077 -87461 -91247 -33793 -33873 -31402 -5289 13268 -2651
16404 -2651 -87285 -29672 28283 13500 25598 29988 51150 30928 -54256 -100063 -87071 -48888
16392 -48888 -16913 -26444 27422 96657 28083 13120 93893 240322 227795 190282 222612 254948
16380 254948 311743 332789 354951 316483 281463 256182 265769 260291 239026 145361 137273 193898
16368 193898 191645 120034 142913 185405 260759 316950 335852 315258 299729 261972 258277 290943
16356 290943 337980 311379 224908 200711 198344 224193 266674 200966 117252 72896 20495 25455
16344 25455 -25062 9746 46630 -15005 -54954 -54151 -91864 -90008 -16248 -3225 -53946 -56753
16332 -56753 -65462 -13277 10 7048 7594 32145 19436 -96556 -163670 -101896 -85841 -111437
16320 -111437 -51215 -8885 13127 46589 44506 63700 40003 23085 -34006 1188 23911 6948
16308 6948 49429 92054 100463 -54548 -72405 -21033 -51210 -34362 -44002 -57593 -56997 -49300 -60399
16295 -60399 -82136 -27680 -49787 -14552 60250 64472 22175 -52445 -119699 -116348 -113954 -103162
16283 -103162 -58237 5757 -20668 -17280 -48959 -97488 -52855 -35102 -88836 -97691 -128913 -97587
16271 -97587 -93028 -61012 -103144 -142270 -113404 -57119 8945 -56480 -77800 -104004 -78783 -135241
16259 -135241 -158134 -168045 -162623 -178776 -203129 -247906 -216405 -194287 -200404 -82958 -4816 17595
16247 17595 -6138 42157 46042 -8759 -48648 -115945 -146157 -135850 -178832 -198118 -126681 -119594
16235 -119594 -132472 -94552 -73731 -90662 -67445 -34980 -1174 -16781 -29256 -60846 -48819
16224 -48819 13929 71645 -3545 -41143 16241 -28165 -65474 -70733 18412 109886 120182 90625
16212 90625 -28249 -126285 -145454 -59746 -10908 -36334 49496 145356 149484 104161 36839 15893
16200 15893 -19156 -51099 -111649 -98002 -59194 -12455 -33660 -78527 -83811 -83689 -141814 -142146 -85287
16187 -85287 -50845 -107288 -126659 -55178 -5856 38990 15490 -54413 -18629 -18236 -48330 -56651
16175 -56651 -112370 -56491 -21875 -17737 -94748 -94774 -59006 -5824 57679 72615 68347 9003 -73298
16162 -73298 -53130 -74253 -77787 -51459 -36655 -17950 -27913 50584 88570 125186 63025 2379
16150 2379 -8077 43059 62118 14810 -47754 -32082 12246 15956 -9838 -24922 7442 -18900
16138 -18900 -59263 -33830 -15696 -32291 16252 -24435 -61341 -28399 -32116 -48621 -124628 -155319
16126 -155319 -156500 -62950 -102652 -145263 -72887 17441 -13115 -34147 -57120 -58420 -46358 -61473
16114 -61473 -72195 -97384 -106594 -85496 -123168 -106983 -120568 -158224 -129295 -127913 -39235 11172
16102 11172 33609 43665 16868 -10788 -31392 -14456 -30062 -45799 -57410 -75937 -156659 -141334
16090 -141334 -89112 -65287 -36053 -69119 -116422 -141487 -184982 -134223 -160263 -110722 -17903
16079 -17903 -1649 -525 5049 -59794 -120453 -66581 -50048 -82209 -103632 -114259 -46469 -17157
16067 -17157 -38644 -64473 -55341 -38864 10083 -9464 -76114 -85457 -72015 -94312 -68597 -11121
16055 -11121 -47265 -133794 -73473 -71482 -99822 -90208 -44766 34759 60568 -53011 -159205 -119627
16043 -119627 -55538 -98418 -93442 13493 45060 9717 39583 90875 95700 97565 31142 -15077
16031 -15077 2153 -11934 25607 26150 -15235 3763 -14119 -43137 -36192 -53702 9015 -15039
16019 -15039 -7998 13985 133 -26402 -63361 -82646 -125684 -139082 -172880 -106448 20262 26824
16007 26824 -44970 -102437 -119908 -77677 -113290 -152541 -139548 -57240 -1503 -27 3728 9320
15995 9320 52155 38200 -6468 -42605 -91693 -121053 -37420 34923 -5086 -66471 -79060 -61618
15983 -61618 -70366 -50187 -59368 -61825 -30485 -28080 -56972 -60124 -69831 -73837 -39867 -132130 -171729
15970 -171729 -139922 -104670 1357 766 2949 -29609 -54597 -63608 -61308 -88552 -81521 -1097
15958 -1097 -60698 -116368 -75091 -78478 -95114 -110739 -101988 -59177 -59469 -60041 -32698 -2766 -23852
15945 -23852 20553 -40666 -108033 -58283 -44655 -20532 -47499 -84658 -129185 -74860 20487 20600
15933 20600 -31445 -20963 -1838 11680 43231 58788 52842 -11755 -69925 -158363 -113806 -14837
15921 -14837 -34360 -50999 -96706 -97238 -83986 -79530 -59759 -108949 -113139 -129537 -91690 -58512
15909 -58512 -122708 -173201 -117481 -48047 19931 40215 13115 7058 -8420 -56674 -84287 -53549
15897 -53549 27518 70947 120532 83552 22990 -9813 -34306 -20462 -11033 -916 -13999 -88568
15885 -88568 -134387 -130714 -50631 -8358 -45562 -128213 -120986 -111327 -52345 -499 -35368 -60090
15873 -60090 -66257 -14445 34789 8674 -20723 -16370 16380 25889 96256 150876 110072 40577
15861 40577 172215 150208 19132 -17125 -5311 -28019 -83852 -77196 -87155 -58534 -25842 -55419
15849 -55419 -53916 -7661 -1611 -39224 -36485 -110924 -147381 -69564 -47513 -8009 -26794 9669
15837 9669 11646 -37789 336 3732 51272 65291 36126 -35371 -21476 -43620 -76178 -39494
15825 -39494 -26513 40670 -19633 -34675 -6335 -60828 -80516 -107863 -63535 -75433 -58298 -107987
15813 -107987 -124857 -87838 -63977 -175628 -120966 -34297 10214 15949 19020 -14827 -76531 -100196
15801 -100196 6517 16334 -55035 -9122 -22911 -25384 -52813 -77156 630 9606 20297 12181
15789 12181 13698 -43256 -14786 8539 -28125 -41265 -98285 -117617 -100992 -122020 -70749 -73954
15777 -73954 -95818 -36018 -21707 -36337 -84277 -113368 -107137 -74650 -87675 -102643 -96421 -114055
15765 -114055 -105135 -129167 -177629 -117648 -106947 -153356 -93211 -91307 -121667 -101191 -85388 -97203
15753 -97203 -59893 -25068 7261 -4286 27037 53114 2350 1446 -107530 -144417 -92531 -86599
15741 -86599 -14339 32276 -9512 -42549 -44792 -19710 37203 112084 66164 -71038 -109244 -60054
15729 -60054 -38379 36307 39965 -49016 -59814 -18713 11981 -20588 -34359 -47574 -84356 -33447
15717 -33447 -31424 -37387 -9681 40438 76811 105251 125441 116155 107532 -2438 25647 87882
15705 87882 94897 89895 -6540 -20262 -48496 -16286 3141 65159 32847 -3721 -36611 64396
15693 64396 44240 -46200 -65812 -64722 -3982 -12110 8846 52019 83545 60926 60911 69973 62750
15680 62750 27232 4271 22559 66369 -522 -23395 -17449 17396 5490 -20862 -51314 -55492
15668 -55492 -80931 -46827 -32593 -45381 -64494 -150320 -111844 2134 4716 -21023 -79568 -106802
15656 -106802 -95458 -74375 -119030 -149714 -136630 -120995 -104011 -57173 -47571 9728 79033 20737
15644 20737 -22882 -49516 -46274 -34769 7738 6981 -9314 -13747 -18932 -55897 -115691 -75821 -2903
15631 -2903 37238 46469 26592 20646 29916 42100 15518 -10770 -38685 -77530 -156158 -177005
15619 -177005 -145978 -79938 -49101 -45293 12515 44724 52575 40770 -5301 -41062 -82983 -55603
15607 -55603 -53132 34672 48419 27270 65361 151609 146273 120492 117356 67787 52814 -22546
15595 -22546 -95704 -68527 -26471 -45817 -85301 -55301 -42482 -15461 -39142 -66065 -91869 -130447
15583 -130447 -75194 -102291 -163548 -112717 -119708 -56045 -5321 27691 46688 54524 5383 26377
15571 26377 42884 -79107 -113398 -60654 -8520 38994 89605 80307 62911 23932 -33807 -28509
15559 -28509 -29281 -66208 -78283 -50485 -44057 -102427 -103421 -102538 -78313 -49354 -29213 -43566 -74847
15546 -74847 -13924 50933 33323 -2572 -39129 -110099 -129682 -86649 -27031 -32242 -5608 66112
15534 66112 40257 -5847 -8750 542 31630 25638 5260 -32108 -50818 -40957 -50291 5306 -29237
15521 -29237 -99684 -126369 -71484 2240 7418 -70677 -85698 -22655 -31265 -47050 -36103 -47940
15509 -47940 -15300 -10251 -47859 -17958 -9052 -14689 6861 40747 69990 62587 28693 21007 44565
15496 44565 48771 46176 12798 14378 28622 -30043 -93606 -85768 -35112 -52690 -45014 8167 -71263
15483 -71263 -69413 -106010 -121685 -42089 -46932 -18413 -72449 -175055 -162048 -167895 -125691 -85775
15471 -85775 -87374 -25968 -30039 6084 7370 4432 -8784 43588 114792 80698 -654 -33648
15459 -33648 -20669 -51884 13156 34048 30902 -42757 -32543 -25588 -49422 -40671 -32075 2613
15447 2613 1344 26769 -24049 -84969 -115882 -146435 -114856 -43934 -56343 -21609 7132 -16249
15435 -16249 -130883 -189906 -183470 -90840 -86110 -44586 -23988 -7959 9216 -9957 48384 75392
15423 75392 82027 -34811 -65735 -104551 -79404 17450 31415 -15538 -79858 -214624 -160666
15412 -160666 -40137 -49936 -63562 -37145 -62683 -58300 -61660 -58684 -58829 -41647 -55106 -43466
15400 -43466 -26571 -21191 -63213 -16079 -22082 20245 14884 2404 11188 54620 8043 -31861
15388 -31861 -60710 -73817 -98503 -86461 -129283 -159097 -130764 -110322 -115113 -98590 -94909 -153066
15376 -153066 -179059 -112364 -28320 110075 145034 112722 35901 46663 85201 46436 7671
15365 7671 -28891 -28979 -23064 60306 81895 107595 111393 87580 133959 157919 82669 50076 54176
15352 54176 -9149 -63146 -23244 27084 24817 21914 7309 -5990 20942 22893 27560 -42893
15340 -42893 -45301 3327 -4031 -56888 -11934 -66758 -56907 -101738 -46549 -71332 -141265 -64595
15328 -64595 -48202 -111245 -75372 -26543 -19038 -35267 -42537 -130399 -72844 -50389 -34052 -8728
15316 -8728 -29903 -10090 74932 37741 -48487 -76360 -84245 -11643 76405 38595 8959 5605
15304 5605 -4749 -22664 -28310 37725 15613 -58864 -80509 -104412 -100912 -56092 -132277 -125854
15292 -125854 -49161 10195 24252 -22212 -109558 -31212 8003 -990 -64280 -52421 -29596 -32647
15280 -32647 -29559 23619 -369 -35716 20858 -5541 14454 13370 27779 -2092 -72261 -36657
15268 -36657 -31569 -116550 -111280 -73015 -133419 -118248 -82166 -7058 52769 79581 53473 -53311
15256 -53311 -51480 4633 2269 36176 -7793 17830 5332 10288 -39412 -54274 -41454 -20029
15244 -20029 22316 56303 80253 53288 -4508 -77115 -82468 -56170 -98022 -81445 -82024 -52910
15232 -52910 -15031 41708 101998 38933 45205 48656 -28673 -45811 -109049 -61071 -3811 -20325
15220 -20325 18471 49597 20794 10939 15398 33320 -32933 8420 43268 37239 37968 57058 91646
15207 91646 96346 103118 100457 35600 -37459 23320 36459 60922 16552 30192 13093 10413
15195 10413 3708 7516 -26044 -28911 -18104 -53236 -20244 -30290 -48442 -13243 -40400 -76440
15183 -76440 -119673 -135179 -92553 -9643 52952 105766 74147 70803 53461 70981 49854 33733
15171 33733 26542 -48520 -86991 -103368 -83402 -28936 -24352 -2742 17710 53638 102752 48536
15159 48536 11058 -31951 -49325 -71284 -45221 -20084 -53188 -74515 -72052 -51064 -38659 -30971
15147 -30971 -26953 28602 58703 80621 57254 -35938 -27470 28012 -19203 -80831 -58941 -25269
15135 -25269 -16277 14646 39464 -4688 -13379 -19171 -8337 8976 -29928 -58201 -100712 -131590
15123 -131590 -128276 -150673 -135428 -98922 -78424 -26466 -247 9312 -48052 -70961 438 71446
15111 71446 70053 59635 27414 -23764 -32283 -25106 -50863 -6705 73927 51562 95414 105214
15099 105214 60179 41320 12131 -22013 -41569 -29993 -24054 -83278 -134739 -152393 -88696 -101460
15087 -101460 -50730 -21076 -75206 -95283 -52000 -18129 -73661 -40732 -22402 -55901 -65603 -5692
15075 -5692 7255 -2346 14173 -8124 4638 14352 22647 41562 -2019 -7421 17810 114181 134606
15062 134606 25985 21812 19330 26345 19123 -6518 -36560 -57928 -138227 -83470 -1883 3031
15050 3031 -15318 -3359 52949 31836 -1556 39235 63273 927 -63129 -49696 -34860 -17609
15038 -17609 19780 8366 23523 57198 -41419 -90433 -80313 -72813 18734 50234 16519 1219
15026 1219 -29021 -35666 -7347 -49024 -75851 -36364 16871 -9195 -15842 -42471 -92276 -84889
15014 -84889 -83693 -17297 -44378 -11480 6756 -20083 -56421 -19342 -38923 -122880 -149682 -134907
15002 -134907 -42619 -22801 44984 45354 42290 30877 -17795 -48409 -43176 11882 68115 45090
14990 45090 867 20721 -14609 -89977 -125794 -122944 -105611 -56298 -54304 67797 97196 45416
14978 45416 50557 85323 104588 92389 57954 20069 38078 14163 -10579 1093 -21556 -19557
14966 -19557 -24006 958 -13050 -20970 -46698 -85932 -127540 -96686 -96413 -78353 -54960 -59530 -44337
14953 -44337 -61803 -49213 -9409 -16754 -25488 -65158 -108838 -111618 -85518 -70989 -112172 -134142
14941 -134142 -86371 75 102041 115071 67836 9915 -51551 6309 -61417 -69943 -30500
14930 -30500 -19237 -69161 -78835 -81385 -58175 3696 13892 54401 43660 53628 85099 110924
14918 110924 61609 34927 32122 87999 70359 54200 54918 -19760 -105113 -59903 4472 28354
14906 28354 59446 36576 65977 105720 142515 127075 79983 -18778 -47006 -18340 49466 81946
14894 81946 60344 -23784 -42051 -3508 7291 40981 42870 48211 98419 141087 79555 38511
14882 38511 -4325 -7845 31310 29693 10941 13929 80315 100108 120424 96793 25714 17529
14870 17529 9005 -8438 -24033 -65010 -29120 -41673 -6133 53917 99755 77984 87409 84033
14858 84033 24372 13269 8017 37586 23966 -30784 -34202 -13524 -53506 -75004 -73538 9012
14846 9012 23952 -61047 -105184 -55317 -36059 -43077 -50269 -9954 -9033 -21751 -29917 -32649 -28369
14833 -28369 3157 -8446 -65018 -65328 -81208 -104979 -94321 -65357 -85683 -18850 62086 66948
14821 66948 55928 50659 39379 -9550 -15384 -61643 -79865 -92899 -59839 -54797 -80431 -53392
14809 -53392 -98030 -142333 -34994 33200 64609 42141 33209 46755 28452 34961 43676 70461
14797 70461 5224 -109044 -64391 -2137 -13812 -70746 -88210 -123731 -93744 -15169 -8193 -15364
14785 -15364 -1752 -9137 -80945 -85214 -14737 48808 41584 30885 -16979 17194 64220 28921
14773 28921 14712 58919 90496 63754 31839 37012 64306 27927 21365 -13525 -15540 70738
14761 70738 95265 30266 55341 1845 -62036 -65652 -28388 -8029 20421 12455 54670 22721
14749 22721 -92 -36271 -81854 -33382 76720 48760 9778 6862 25 -84221 -89632 -106741
14737 -106741 -67250 -110402 -116112 -159320 -78790 -21619 -13093 -65073 -62627 -115086 -43550 19446
14725 19446 45230 79968 59035 17550 -34711 -44933 -25408 36089 128824 150279 149712 58559
14713 58559 10417 -5309 -16756 34212 21573 -75293 -77601 -1267 9787 -4258 -11180 9757
14701 9757 41487 38506 61922 74011 86599 33859 14700 -79432 -183558 -115221 -8284 -13063
14689 -13063 -15065 -44770 -47184 -14769 28252 43631 21402 57806 1903 50200 18390 -34513
14677 -34513 -3471 31099 -2602 -64370 -95456 -97080 -69559 -49860 20356 36149 -33204 -75776
14665 -75776 -51439 -52326 -39609 33272 38417 -436 -4834 -87359 -64528 -17203 -34327 -38005 -66561
14652 -66561 -85146 -46035 -21009 -25651 -11269 -17036 52505 17553 10711 20238 -15061 -52684
14640 -52684 -135979 -145393 -85219 -90732 -63088 -37655 -28849 15987 -191 -63069 -142372 -148249
14628 -148249 -88291 -67962 -54960 -42484 10990 88278 149433 95036 81684 98296 73770
14617 73770 38375 16536 27811 36860 35217 -8523 -10500 -61568 -65339 -52570 -35044 -5609
14605 -5609 58783 19118 -10229 -9095 -27400 -47421 12299 41039 7360 -68216 -85070 -67327
14593 -67327 -50484 -41868 -49415 -58037 -60953 -45980 18142 15237 16590 44599 21758 -33680 -6684
14580 -6684 -42297 -61969 -31036 -46864 -628 1141 20089 30123 20320 -35500 -81573 -82434 -44480
14567 -44480 19433 27586 27050 29595 78522 70045 -23265 -7190 10423 -16011 -24973 8933 23111
14554 23111 -79517 -121874 -116880 -44882 248 76332 77196 46560 -29509 -136916 -138443 -89087
14542 -89087 13787 81061 110245 66789 7598 -15521 19518 27042 -16284 -1218 9552 -942
14530 -942 13284 -16725 20326 45601 -4702 -11118 -47407 -17455 36232 3816 10128 13044 -36331
14517 -36331 -51628 16038 73657 99739 42873 15712 50473 24027 -49386 -41789 -12184 -3857
14505 -3857 -54713 -46296 16017 65303 38658 4102 9055 47718 18486 -12844 -86140 -132984
14493 -132984 -91937 -20305 23138 26116 10098 37453 -33522 -28817 -30072 -50845 -28996 -15246
14481 -15246 -1372 -111718 -171005 -85306 -21473 10717 48021 35776 -29134 -60063 16132
14470 16132 36589 47911 -7587 -71998 -31446 573 37804 2164 -88010 -68586 -71974 -31815
14458 -31815 -7112 -68816 -126859 -163979 -125686 -69092 -93856 -66301 -21645 27994 53771 -47436
14446 -47436 -140634 -96514 13042 74643 -14491 -13929 66184 94863 27283 -1483 -15368 55931
14434 55931 98618 69311 3198 -36718 -85203 -101108 -98769 -112529 -75151 13216 26241 -50597
14422 -50597 -20630 -26238 1388 31005 -10181 6081 -26602 -25371 -53544 93 16119 21408
14410 21408 25587 -3828 -65503 -72885 -52472 -7758 -39437 -14741 23340 -2661 -35270 -33445
14398 -33445 -25591 -52970 -67550 -32537 708 14294 -19996 -43493 9194 2749 -25474 -34632
14386 -34632 -6928 29438 6441 -47236 -141376 -101458 -30082 -7757 -7815 39486 71047 7746
14374 7746 -54921 -26603 -11805 49529 110129 97920 34196 6067 -17584 -1234 1123 -28581
14362 -28581 -12100 -48460 -97842 -64765 -106141 -195499 -165283 -114887 -58161 -58371 -46509 -53657
14350 -53657 -43482 16275 75402 109310 100226 79986 -12683 1278 -17264 -20476 -28332 -44768
14338 -44768 -26058 61002 85300 40028 2810 20927 90005 116164 90321 76486 62746 11907
14326 11907 -16949 -22567 19024 27897 -10880 -28823 -66759 -107157 -86770 -25418 17323 74650
14314 74650 60145 37306 4494 68244 31713 -58965 525 42341 39907 97996 60590 30310
14302 30310 -56664 -5557 34884 -21160 -42002 26858 55591 76865 96813 102848 46883 57752
14290 57752 54886 56046 30509 28414 3359 -36515 -77642 -116153 -82564 -64069 -113057 -89619
14278 -89619 -56737 3454 30290 55654 57292 88384 95823 64673 60421 43261 30487 56085
14266 56085 66621 45264 46331 73469 38882 36600 100114 48727 -7626 -10094 -54249 -60576
14254 -60576 -60457 -25305 3084 54633 43468 32674 26986 -24570 -54871 -100221 -65332 9738
14242 9738 65584 -26392 -55757 -47074 -16845 43231 57078 -29183 -103518 -106636 -82970 -60815
14230 -60815 -21019 36994 75322 52345 -10142 16936 29226 -68966 -103019 -73264 18393 31885
14218 31885 -68229 -75915 -14075 12673 -29561 -69777 869 31284 19391 60097 96546 18201
14206 18201 6438 23732 58751 51854 39633 36223 -33640 -33344 -26751 19327 35506 -8572 7706
14193 7706 -42675 -83670 -61253 -28213 -28359 6572 -36796 -53250 -33626 -101677 -84330 -17731
14181 -17731 48780 91629 43439 -29714 -56703 -68251 -30561 -15851 -59571 2671 30154 5319
14169 5319 -341 -17248 -50098 -81799 -67219 -62705 -64148 -97195 -82873 -47139 -45148 -26747 -13330
14156 -13330 15834 -1077 -809 8178 33232 7004 -86516 -102213 -3593 3338 -52300 -4055
14144 -4055 14129 29445 -12742 -4125 11429 44640 108728 132467 114565 66548 33916 16325
14132 16325 -25896 -49636 -38745 -39766 -48495 -6462 -9747 -65242 -111687 -118273 -84715 -86489 -156379
14119 -156379 -89943 -19596 2948 9218 -46320 -51002 -29446 -19568 -46462 -54256 -63494 -102283
14107 -102283 -81016 -29083 1407 15675 -393 -49700 -83822 -101366 -156556 -159655 -139560 -140288
14095 -140288 -40294 26304 2784 16875 40293 32893 -34948 -57578 -6055 43052 53416 61653
14083 61653 86430 65647 10166 16129 35790 25944 47203 34639 74239 107133 135409 135838
14071 135838 97283 -578 -31573 -75611 -84835 -60761 2857 43731 58802 91897 105828 98895
14059 98895 73505 122899 88272 33989 -13303 -52887 -73481 -101292 -84941 -90438 -114351 -104352
14047 -104352 -48060 130 42339 39609 33186 10365 21602 9832 -97433 -110565 -88835 -70290
14035 -70290 -29801 15976 -71280 -125721 -76355 -52668 -24277 -35334 -1582 42578 -6126 -2943
14023 -2943 22304 82870 56034 55094 22992 21857 4231 -9741 -32071 -34605 17134 89754 -11984
14010 -11984 -84549 -105629 -93015 -57674 -64377 -38606 -7320 35389 6302 -105366 -105993 -12021
13998 -12021 29320 -10440 -14603 -13675 -18299 -21359 -36890 -79890 -120742 -83688 -75099 -70849 -30132
13985 -30132 24465 35149 22907 45445 49203 38853 -4647 -42654 -42172 -26600 6406 45773
13973 45773 29244 33282 37223 65049 130049 141334 134379 108703 123569 116576 109344 119494 113889
13960 113889 79464 49867 8053 -24519 30830 68185 45890 61594 26228 33876 -2238 -71853
13948 -71853 -57336 -62550 4754 21161 -17763 -40085 -28959 35087 18831 -15832 -31682 -18667
13936 -18667 14789 67622 90537 64257 37814 7551 -3216 -57697 -87828 -23943 23623 -27975
13924 -27975 -13399 37962 73177 48262 -15478 -12244 -21258 22259 2468 -2723 -2732 4040 -2746
13911 -2746 21312 -24766 -36288 16170 43305 48474 -9274 -2223 -33852 -94196 -115975 -87228
13899 -87228 -58092 -67003 -59149 -46767 -46791 -22934 12955 -8813 -8771 27947 -35268 -63078 28705
13886 28705 62909 15290 8275 -1098 10386 4089 3284 33071 10034 -32982 -50101 -67843 -23120
13873 -23120 -25155 -54840 -51617 -42617 -51538 -35825 4106 -6528 -29085 7471 -8290 -72343
13861 -72343 -120035 -156686 -153664 -145990 -137348 -95422 -73112 -18387 -8756 19162 -35027 -34924 67829
13848 67829 113815 70416 45587 12090 13558 -25185 2149 -104 -30326 -56866 -23575 10493
13836 10493 -22335 -10712 39061 25657 -87740 -65274 11844 26215 29337 35632 24534 33584
13824 33584 56560 25837 -12070 -47846 -49178 -73421 -11247 20140 -10082 77344 83256 98449
13812 98449 78677 108673 127798 75190 62605 48512 35756 35810 28865 -16028 -35470 -4037
13800 -4037 11158 44272 31704 -632 2964 358 -10824 -7086 29417 -18579 -7143 -111233
13788 -111233 -180453 -133665 -80915 -17755 22662 28307 31412 18705 -7849 -67707 -55709 -71998
13776 -71998 -108116 -61650 -75567 -94442 -104153 -91791 -109777 -47014 -4288 -10492 1799 -5896
13764 -5896 -5937 98943 108116 75861 77064 42824 79725 87080 23698 59418 122071 138152 94187
13751 94187 28095 -21154 6873 -32468 2341 48464 60158 1381 -87647 -131359 -72276 -17079
13739 -17079 33244 12676 -29448 -102594 -54877 -10538 -15617 -41236 -87219 -59391 -24656 -9278
13727 -9278 -16290 -15124 -45312 -78419 -71174 -14745 74304 145584 101624 41983 53805 117318
13715 117318 71211 92008 109720 138999 124833 36456 -66458 -52807 10588 42865 85528
13704 85528 121097 99995 36433 24330 -14082 -25415 -51525 -47901 -77568 -79103 -37598 -34620
13692 -34620 -55827 -4686 36905 -20674 -55030 -6091 -42512 -8976 -56154 899 30745 -4741
13680 -4741 18411 72312 73118 51318 -34421 -75848 -74055 -5956 -10500 -16541 -18323 8124 38256
13667 38256 47858 28971 57055 28004 -1399 -25989 -5896 104947 103043 32592 -7379 -53086
13655 -53086 -92015 -105951 -53589 -10541 -6351 66508 52827 25350 -40218 -119760 -150300 -131838
13643 -131838 -121784 -86695 15309 32318 30072 5206 -13689 29439 63879 -4213 -35745
13632 -35745 -60818 -81688 -41159 -3218 49386 66170 -1746 -47812 -98662 -91251 -13719 -61695
13620 -61695 -48263 -6799 713 101401 186678 196167 124218 89064 80963 94553 88249 104013
13608 104013 68093 54176 2617 -10590 -79686 -53090 26109 73118 47621 64537 28113
13597 28113 21042 10471 27194 46135 -26061 35817 46730 2658 -37685 -37480 -9888 -3346
13585 -3346 -56502 -82378 1512 55619 53563 63569 76756 133220 105473 67538 75725 128255
13573 128255 128519 103928 134130 169752 150517 98815 70280 49590 2347 9929 -22585 -94385
13561 -94385 -82424 -43271 59910 87861 77900 58328 100529 200894 153601 146068 205083 110639
13549 110639 71553 94696 56028 73267 101246 165606 219987 212313 122449 80175 133276 171482
13537 171482 199973 149290 150480 132684 106360 76647 75419 93860 158522 146755 95898 58242
13525 58242 48853 121711 204042 250168 232089 247927 281189 210303 105595 187345 213504 213086
13513 213086 179916 187533 151499 130380 170313 106010 87548 155685 125174 65809 72776 83100
13501 83100 38358 76489 194412 220840 236155 198460 165980 110315 84289 55153 14324
13490 14324 52775 111892 127829 123746 75909 74106 27852 51464 116972 120407 102035 98799
13478 98799 97559 112748 30715 49201 57230 31070 56248 99666 104159 101269 131405 76467
13466 76467 13945 21725 67425 119722 136134 68729 25631 55156 24992 70732 157951 108467
13454 108467 35809 52726 57054 127052 107433 65488 19271 32343 44353 65368 101049 87521
13442 87521 152181 144870 69521 54962 59609 56198 92595 112496 67353 -8836 -12602 29722
13430 29722 162455 155473 154659 133851 74919 56448 75731 75823 70973 27204 88277 71656 -13661
13417 -13661 -49692 -5047 5490 16929 4415 14702 62401 17885 27440 19555 27327 62163
13405 62163 58025 82337 116211 132594 139670 103241 53328 102459 184286 171343 101788 68358
13393 68358 54245 77126 68898 -6837 44026 90130 101904 64072 26696 -23664 -42027 -24202
13381 -24202 77126 69746 44155 33071 31561 -9020 -29040 -4306 26004 69965 130244 185776
13369 185776 201180 116139 75201 87951 80582 61290 45575 25438 21688 84550 132270 99774
13357 99774 135729 192738 123089 15784 -65038 -20437 18276 39892 85502 68752 85559
13346 85559 80694 27287 -41322 -46913 6678 49459 114188 133302 106590 79239 90934 99633
13334 99633 49151 13105 7414 73619 153006 157560 155389 121200 57981 71267 92254 41112
13322 41112 28252 63547 83289 66599 69418 42649 21733 21100 74901 60391 16652 5745
13310 5745 -31657 17160 55893 81691 111725 127490 126212 158818 139688 135394 130495 62005
13298 62005 31375 44112 55200 30070 44144 65860 75297 76097 107313 86663 120128 141936
13286 141936 175510 202744 158574 154267 142462 157572 158464 95998 121870 149834 151034 93530
13274 93530 65318 85179 118699 143210 129515 110453 179953 146977 67209 107611 152547 117253
13262 117253 111004 167955 111439 95002 149256 119466 157411 140474 66471 131390 162267 157405
13250 157405 150651 153236 129440 82825 121945 161750 116540 99852 60820 94155 97161 148407
13238 148407 181773 83066 56272 85328 96688 76311 143616 146249 124402 164738 181423 177859
13226 177859 180314 110880 99442 168042 172064 107791 74152 42436 110868 192530 133679 120856
13214 120856 138246 147907 116203 204757 305651 280190 244086 180277 144224 151835 86206 129513
13202 129513 110665 93307 87462 92214 116127 165641 234769 293460 305143 269361 253786 269784
13190 269784 255947 250771 239303 234852 262337 378782 453503 489674 554892 564196 701096 866669
13178 866669 1118170 1381024 1725014 2058519 2269394 2315197 2312114 2340317 2313551 2236970 1942818
13167 1942818 1647683 1459677 1259110 1071025 872074 755027 694625 650225 620184 576816
13157 576816 498020 454073 450856 428595 434292 492519 566776 455526 355578 329261 349851 305795
13145 305795 308577 233203 173801 185579 276094 232934 242696 290428 292761 252862 188377 194676
13133 194676 262602 239139 228474 223565 179854 112316 147483 172882 178589 157925 144487 186869
13121 186869 256224 287328 244264 263326 200516 173219 133726 196169 169173 173713 201377 150891
13109 150891 154661 218369 253032 218792 173680 179475 205781 165129 150873 140770 131096 171885
13097 171885 167634 121707 115502 129861 132298 155027 176575 166040 104001 37840 45258 107608
13085 107608 137747 126416 99082 106374 132811 163515 124584 138679 153292 201748 291856 305030
13073 305030 298628 301232 288137 266916 250570 240582 246760 242907 193697 209846 177422 111802
13061 111802 144215 163321 108939 77630 62109 113047 102330 111949 130586 153378 133862 83268
13049 83268 109165 164943 168013 123826 114505 141017 171126 227683 181660 98306 18563 -14912
13037 -14912 29579 39560 63847 79893 41125 35006 26840 27587 42663 46079 65503 101900 105434
13024 105434 160309 200685 214399 258834 223946 217224 278079 309909 306312 256832 260988 222710
13012 222710 178069 209973 308583 346052 330419 235153 213885 191072 228636 283681 268678
13001 268678 184840 183344 204636 210544 193599 237428 215866 224859 282979 375983 444209 390038
12989 390038 398170 417968 369222 404488 400844 367354 369992 443097 468938 426515 378364 390607
12977 390607 318546 245724 283509 269909 266434 248785 223346 226396 314684 315081 224999 322777
12965 322777 377382 373050 395085 380518 326623 295493 254571 223398 213460 277937 288509 235186
12953 235186 129408 152845 182892 236966 243580 272846 262120 217918 150946 168570 145108
12942 145108 211829 274473 318308 319351 253951 189788 135115 120529 104756 80893 94542 61279
12930 61279 135276 181162 207912 194154 179348 227834 217359 299126 333955 311918 386907 421154
12918 421154 453437 410958 340292 281513 307655 303625 246600 186573 244613 308044 372162 355567
12906 355567 339212 344314 370297 390449 349181 381372 457116 504918 559872 571380 513048 461012
12894 461012 419606 452758 600825 624970 674473 649457 594244 589658 557775 506572 574900
12883 574900 669469 660398 640108 702225 803882 875233 866875 817564 765988 778657 825779 936986
12871 936986 1039900 1063032 1106142 1168948 1267374 1322612 1330828 1307154 1322512 1327921 1312588 1210006
12859 1210006 1077948 986498 864987 873209 795853 790431 813963 851379 823640 815543 840054
12848 840054 879108 900399 848698 873238 895650 941409 957915 983491 1009398 1106614 1217360
12837 1217360 1210802 1227500 1211890 1171667 1182266 1159675 1158135 1174571 1179895 1185277 1251609 1218149
12825 1218149 1251018 1302630 1339289 1403988 1501394 1583516 1571069 1457837 1450966 1596314 1625028
12814 1625028 1627385 1628122 1686008 1727633 1750670 1825166 1860972 1947643 2035373 2059359 2023791 2033405
12802 2033405 2039666 2102804 2187421 2279467 2302254 2316509 2361773 2428736 2480700 2564511 2636937
12791 2636937 2754154 2802508 2853873 2994975 3117360 3199636 3291535 3443548 3638187 3779860
12781 3779860 3907421 3975213 4036500 4201418 4412055 4658051 4915608 5158652 5478493 5733349
12771 5733349 5997045 6339801 6737751 7165529 7570536 8095573 8626440 9259273 9976005
12762 9976005 10753788 11580560 12539539 13671647 14897632 16359214 18036678 20012312 22293564
12753 22293564 24885599 28037062 31890105 36574610 42250290 49072426 57397121 67739709
12745 67739709 80846602 98239918 122083063 155787517 203878918 268323525 339673653
12738 339673653 400119166 439019633 458555688 468130388 466418588 445030390 403501778
12731 403501778 351311472 301242376 258176659 221278904 189562189 162800632 140796509
12724 140796509 122952991 108376509 96428728 86509594 78246713 71371563 65586484
12717 65586484 60672193 56339766 52574056 49288996 46383327 43818884 41466812 39296510
12709 39296510 37238828 35203427 33292124 31564418 30010566 28563816 27280349 26169904
12701 26169904 25156350 24135218 23181377 22275131 21408438 20639225 19900623 19218260 18518610
12692 18518610 17914910 17357959 16814690 16224975 15698154 15126702 14549647 14001275 13548036
12683 13548036 13110751 12759896 12419935 12030256 11575598 11188235 10837061 10559598 10288081
12674 10288081 10006370 9709899 9445110 9293168 9154904 8970078 8756374 8496001 8279800
12665 8279800 8056137 7902771 7711796 7454123 7243660 7036637 6774948 6542121 6347927
12656 6347927 6172244 5999997 5882874 5747078 5569832 5412639 5307897 5153528 5016112
12647 5016112 4842886 4776277 4693815 4680764 4604341 4388567 4244962 4262854 4210468 4134522 4045486
12636 4045486 4019829 4022285 4021348 3939855 3917121 3989499 3941123 3909149 4007001 4120985 4229238
12625 4229238 4342436 4354642 4404405 4383692 4312937 4213992 4021199 3758431 3577143 3412381
12615 3412381 3212355 3052937 2888547 2701939 2467985 2344208 2233702 2083978 1918125
12606 1918125 1779266 1614147 1492098 1375013 1289983 1242560 1166408 1140302 1101841 1077348
12596 1077348 1052949 1012600 1042553 1011661 1030925 1017952 1017733 988998 978942 984701 986019 955071
12584 955071 871185 832582 885459 882038 837492 864402 878027 904953 890546 802128 745986 774243
12572 774243 848186 877168 874985 877380 909538 870124 839915 922522 927359 890805 868905 854362
12560 854362 863149 832624 784547 766803 776077 711153 709380 740463 704717 676486 743467 769277
12548 769277 744840 730488 757944 827741 823857 747562 723432 771284 867083 823423 765108 730275
12536 730275 668980 666964 685009 686341 684954 664464 687966 712979 798502 817636 740761 735046
12524 735046 717692 656221 678385 675255 646782 666318 659846 611670 597191 556226 582629 567004
12512 567004 479784 423335 478223 544744 556087 581699 628587 626092 550836 496634 527399 502250
12500 502250 531301 564681 558060 476050 385703 422522 434435 408950 451023 465038 460830 481769
12488 481769 577316 590536 527771 494274 535228 542503 539952 547535 502034 485593 461350 457443
12476 457443 442726 442554 457980 438648 314991 296958 282785 257083 291626 314176 361495 381595
12464 381595 451538 400905 322976 334648 376425 368456 352363 356335 324642 318971 298211 225183
12452 225183 236381 250069 252350 263380 241193 249042 244239 221058 245763 308382 276196 228177
12440 228177 203383 261774 373401 408479 370962 337091 290430 282187 329003 325980 365327 404592
12428 404592 359489 327232 305881 271408 260281 282100 271603 246293 236622 220354 193780 148116
12416 148116 116070 126956 136992 129354 64372 71354 87400 80984 148180 207966 226319 266515
12404 266515 266055 203529 246738 212623 129607 153202 167509 200545 166617 169431 304064 270475
12392 270475 205582 217692 227596 258049 167609 164690 135724 165811 209897 209265 227580 223356
12380 223356 199148 206039 206812 253140 257057 255666 248575 180120 147067 181733 221612 205659 228422
12367 228422 212723 150013 142094 131267 137518 147751 144063 202720 233641 203486 191010 218336
12355 218336 179803 196060 145323 148783 220423 205775 212179 219395 166292 127892 124864 224164
12343 224164 310863 307909 282240 263030 303035 355267 334865 261817 252110 219374 207023 207091
12331 207091 200474 213570 268642 293033 311969 338869 320116 303077 349567 357619 357705 345429
12319 345429 358896 328461 267668 235907 254946 361856 434243 357926 378080 350348 325227
12308 325227 322528 384634 466057 476458 537690 581042 700926 713070 757813 920533 1109441
12297 1109441 1351001 1632755 1986044 2255500 2401558 2494710 2519617 2511050 2281926 1978914
12287 1978914 1775578 1602169 1391177 1221709 1090321 989397 962021 856005 703576 655918
12277 655918 637364 620412 607249 488805 439077 406623 487144 523897 518529 435232 437140 510652
12265 510652 477807 474299 428219 472948 514837 470634 502315 461477 460397 448383 415439 416554
12253 416554 397856 387439 411539 365969 347328 425711 481116 433728 452943 508863 448721
12242 448721 388211 325583 312386 385148 412221 385908 363932 350888 354704 346706 254447 298949
12230 298949 281538 330861 354191 307848 367350 306427 299421 279236 318735 330462 344989 362292
12218 362292 432266 444756 448513 431214 470890 492133 429820 487554 446146 445128 449901 444995
12206 444995 469234 427808 395876 399967 378585 334021 333279 378639 412796 410929 440637 435778
12194 435778 404265 408088 446828 426841 370190 357326 373277 422490 441849 429727 429145 433309
12182 433309 436997 396501 407004 395426 426409 464967 464712 447469 454795 483638 545018 584774
12170 584774 565151 551949 517569 486556 557987 612554 576013 512260 411228 415312 469817
12159 469817 472528 472165 478599 499217 484485 520571 545806 573426 525034 520543 567648 621927
12147 621927 631478 631724 619751 627654 667974 665863 678899 682253 736017 769009 792172 810579 787609
12134 787609 784383 768267 793179 801647 676466 622164 621040 631335 635492 671753 719914 691643
12122 691643 723283 755823 816366 804634 786069 808073 808548 756687 742067 783021 845686 897323
12110 897323 857119 818092 853245 886536 938002 972212 911357 834698 891214 955865 982794
12099 982794 1062279 1109161 1118647 1135583 1172571 1214608 1227243 1264356 1273860 1281029 1305712 1304376
12087 1304376 1230046 1237277 1238320 1246972 1243081 1269318 1317952 1267434 1231873 1278688 1339768 1346874
12075 1346874 1357313 1407865 1343197 1271113 1323556 1361119 1319851 1356568 1396483 1441333 1522493
12064 1522493 1580269 1625761 1611293 1583587 1543712 1595674 1739253 1804914 1870747 1853153 1844731
12053 1844731 1837674 1871045 1910139 1937878 1920855 1894721 1930473 2008603 2082783 2151727 2120825
12042 2120825 2129951 2148962 2153612 2167867 2163770 2088383 2048024 2086268 2138395 2167186 2247644 2354718
12030 2354718 2438641 2401904 2423058 2552994 2640364 2711363 2690270 2700253 2758857 2685660 2667919
12019 2667919 2706973 2790065 2800519 2787294 2847938 2939309 3041375 3147595 3252843 3288785 3320514
12008 3320514 3335680 3356908 3429273 3488889 3659898 3767941 3759219 3852995 3932482 3952389 3991944
11997 3991944 4022456 4124202 4241698 4335024 4504471 4649918 4755618 4846044 4944060 5075391
11987 5075391 5209078 5332009 5487220 5687198 5814209 5911296 6065756 6159591 6232240 6405093
11977 6405093 6645885 6860342 7002456 7151456 7374478 7661662 7872360 8032235 8240029
11968 8240029 8477428 8771059 9037930 9278685 9577185 9869140 10158234 10441400 10751569
11959 10751569 11076845 11397826 11795149 12190415 12520413 12901532 13300377 13705905 14090545
11950 14090545 14461265 14862952 15221180 15614921 16104735 16626196 17116724 17512484 17914324
11941 17914324 18310300 18699561 19090872 19509461 19907911 20230120 20610849 20935447 21203325
11932 21203325 21493779 21720715 21970179 22205748 22356941 22446220 22511204 22620263 22699165 22704490
11922 22704490 22628169 22481278 22378722 22249719 22061654 21836567 21584283 21268732 20942947
11913 20942947 20611597 20321339 20058764 19739341 19362538 18979623 18578543 18188519 17836245
11904 17836245 17454627 17120021 16640851 16237475 15860099 15432842 15059791 14721120 14368584
11895 14368584 14036011 13674070 13343653 12952798 12632330 12414128 12128529 11744920 11442955
11886 11442955 11166630 10841441 10608381 10371267 10086849 9876410 9599496 9347294 9169091
11877 9169091 9000165 8758414 8500437 8276269 8034422 7834950 7741278 7579005 7413726 7194603
11867 7194603 7092721 7002617 6878193 6769404 6588008 6393267 6254427 6143068 6012844 5841097
11857 5841097 5770478 5641545 5451809 5387678 5279829 5154949 5043066 4951189 4868079 4745664
11847 4745664 4578837 4495840 4409423 4301758 4235810 4158520 4005262 3919025 3877245 3828628 3765335
11836 3765335 3680781 3552185 3490380 3551933 3474035 3335028 3227366 3191258 3168098 3079025 3044565
11825 3044565 3006644 2877008 2854195 2797656 2734954 2685455 2680802 2684623 2696854 2656757 2602851
11814 2602851 2537405 2446934 2334347 2263078 2233932 2228729 2270655 2268738 2221743 2097693 2069713
11803 2069713 2104653 2045381 1957518 2000460 1907345 1843754 1839072 1794791 1738052 1713452 1653430
11792 1653430 1597148 1620831 1723290 1701422 1651894 1641807 1640691 1623657 1594366 1507844 1451376
11781 1451376 1482321 1471061 1405504 1417642 1341485 1314815 1293309 1348741 1413017 1300799 1213151
11770 1213151 1248299 1271417 1255728 1191412 1139419 1150884 1207586 1257563 1170154 1090877 1093600
11759 1093600 1104231 1083081 1015287 946310 984823 954565 931848 981199 949526 949510 989039 961350
11747 961350 940610 934954 852740 800712 908511 943378 981177 937635 880474 798221 762311
11736 762311 716805 736154 795872 780676 788838 824416 795953 776745 787733 814652 816304 742046
11724 742046 745440 729779 660665 675816 811563 803515 749644 701755 744934 704622 683894 666400
11712 666400 625354 640464 660237 657644 653183 642982 638899 654371 637777 651108 619230 603495
11700 603495 597729 652327 699463 635960 613339 627445 660832 558520 475976 446585 437927 494960
11688 494960 518094 504243 445012 401060 461356 513259 515064 515191 477146 441891 399702 438043
11676 438043 446688 407210 426121 451497 392266 415962 430369 433508 443769 412798 415579 411894
11664 411894 460633 464975 427227 433779 412260 376854 360021 425891 462088 419992 393208 387854
11652 387854 390349 441690 450367 464442 415073 413670 422945 388055 390344 376445 475809 504187
11640 504187 504713 490828 464418 379519 312212 296500 348865 377559 372054 399125 382943 310417
11628 310417 364372 354000 299885 306383 295601 266800 268619 248438 256019 297629 330191 325275
11616 325275 339510 308546 301520 242583 207745 242531 211621 250470 267528 278095 251348 217443
11604 217443 208174 196734 272016 328228 325749 314468 371245 364599 319983 248729 293265 352089
11592 352089 327398 304912 320523 354431 338695 312922 236818 197260 192045 200961 283335 288583
11580 288583 332538 303053 198806 163483 169717 183771 178793 198950 142066 141287 190432 224537
11568 224537 187548 187811 281658 289838 210798 149417 174634 217819 242697 311029 293260 326629
11556 326629 310306 237629 233583 219247 185082 177609 206148 241707 254018 275073 242557 187038
11544 187038 147377 147171 182928 129205 131503 155343 190734 224745 160876 125532 134372 217980
11532 217980 194136 202202 189292 158805 161731 133030 121024 122526 101776 95678 162849 140436
11520 140436 132305 120754 96203 50267 85391 87754 70084 115193 117326 82886 96415 144935
11508 144935 193678 195099 208003 183952 194106 228716 205996 134685 138393 121349 103998 121313
11496 121313 111697 135251 171572 162427 130993 121616 121563 43914 73647 78781 67611 120630 127812
11483 127812 147461 99308 92537 99835 24966 42695 67192 44405 73133 89481 123653 163966
11471 163966 186176 121070 158781 126859 68157 -18555 35407 63104 74529 130407 161156
11460 161156 105308 65137 36756 84278 97943 97260 81640 68652 106722 107281 159173 125649
11448 125649 80144 79940 104948 107113 107029 160119 192714 181259 161990 155482 192681 150150 118356
11435 118356 133795 142358 46139 33923 102776 95896 90627 39902 51938 164258 193315 142618
11423 142618 109819 129807 142716 191724 213019 161223 126144 119247 78985 44085 23072 58954
11411 58954 93385 149783 156318 136588 154922 132673 49963 3811 -6994 50631 89663 79007
11399 79007 64039 15834 -6519 47709 77059 37981 63413 89307 70935 105133 90754 106939
11387 106939 46825 14779 46397 55648 72150 145817 163635 141477 142571 156268 197127 142660
11375 142660 108617 93049 62254 104235 191259 204400 173034 138057 160135 202445 201602 179920
11363 179920 198273 223813 186187 176236 167790 188171 132414 79032 69467 93821 70004 58973
11351 58973 102598 152938 169955 92296 17423 79898 47359 81912 86895 84185 104998 157563
11339 157563 132729 131949 136246 125551 139037 110105 84851 73759 62261 55342 32718 99272
11327 99272 166604 135864 63617 64916 38693 59425 83857 70217 55601 106279 89644 51263
11315 51263 53308 81028 56195 -4936 18837 63510 172012 114374 41636 20223 21229 75351
11303 75351 80958 73841 28286 9757 47307 108456 93644 83345 73219 42585 23688 -8706
11291 -8706 13390 5626 6091 36187 56653 95865 108432 89440 107883 61912 51252 105898
11279 105898 85526 72700 18614 -32720 -40468 47341 91370 127711 102321 41014 3911 35148
11267 35148 -23450 -8038 47765 49524 34392 24925 -12924 -82928 -165022 -117446 -6841 55774
11255 55774 23930 17470 35397 33772 19464 -14537 -26566 35457 85500 27642 4214 33679
11243 33679 33653 41865 -16370 3430 49813 49083 43160 55008 53699 68567 75127 79542 -3552 56593
11229 56593 103190 123213 84941 76510 63401 78244 72862 15051 23067 60154 111064 133061
11217 133061 189113 99930 88395 109424 110645 54176 2444 -39282 -5993 34267 85492 167920
11205 167920 180047 103808 48845 87661 123790 67012 56165 91172 168685 176039 85529 35165
11193 35165 49883 89365 78682 25471 13946 -4810 -24723 57593 151785 179200 144891 66270
11181 66270 44379 28013 10301 40350 68434 134634 127974 137447 40835 -20002 -44407 -15086
11169 -15086 2833 56384 49530 25013 17572 75825 33159 74610 70621 92846 117367 74567
11157 74567 40015 15422 33727 36347 88375 89659 113686 108927 -5057 -50232 11072 46081
11145 46081 46216 6599 -13084 57266 22011 46562 77131 22445 -50316 -11564 -31899 -108594
11133 -108594 -94736 -104977 -57619 43879 33442 48524 114471 133552 67216 50994 7190
11122 7190 17246 71152 96588 70231 155236 123478 41712 60563 47482 89761 187049 254330
11110 254330 247820 183636 119957 135078 168625 120641 81848 127177 169039 160784 161475 183605
11098 183605 122615 61990 20759 48753 41959 73858 97708 114060 76514 69658 55949 -13392
11086 -13392 70258 52054 2903 -43793 -20559 60320 116407 141645 142856 119076 89672 79853
11074 79853 147774 87939 38996 8697 -18338 71177 131007 20891 64541 102643 99494 128585
11062 128585 104994 27339 55167 130808 119043 9019 -8950 22728 72942 86722 64903
11051 64903 56778 18533 -58878 25826 53547 19094 39637 96492 152602 205337 156950 166204
11039 166204 176114 166961 221621 210533 179660 157487 136350 147352 196530 308425 356647 359825
11027 359825 288885 303176 328449 345351 428674 457912 474018 559037 540797 485094 458676
11016 458676 457401 534498 522794 484712 490899 535932 516860 512216 456188 367946 383684 441840
11004 441840 469002 414581 395972 404524 383103 401996 466862 422763 384837 268004 157897
10993 157897 168519 158566 77914 52031 37005 128327 184706 228771 199092 141595 162668 159114
10981 159114 102374 84986 108010 153816 170070 128256 83478 104485 116182 108700 143439 175218
10969 175218 131026 122690 112705 33660 67793 95246 74408 78231 123959 83610 64217 32008
10957 32008 -9649 47449 76993 62492 100855 92461 101192 48084 62110 83986 120585 60143
10945 60143 56001 76118 130361 186937 193366 79621 39326 93945 44383 49956 73448 85583
10933 85583 109762 164969 110692 73991 33806 100639 97976 33400 -7179 -5734 24768 56371
10921 56371 48927 1950 -13809 -45878 -18855 58935 108790 110615 78250 83389 63240 61494
10909 61494 49206 23298 28630 32962 -5085 59728 29262 6689 39608 27300 69124 77549
10897 77549 90843 53117 -45035 -64673 -79421 -49980 -96335 45691 108845 86133 45503
10886 45503 18070 -7642 -70266 -42360 -104351 -117807 -34107 -23439 -13215 -893 20587 68873
10874 68873 90776 55132 -22505 -25287 26806 87322 96493 86017 90280 61234 128604 190410
10862 190410 157579 130457 52426 47862 88374 86334 118489 92658 107129 174728 123085 97001
10850 97001 151489 125677 68755 57409 84592 103105 122179 120983 122431 119830 117117 109328 106495
10837 106495 160889 147312 200991 150555 55664 31453 -23099 -39712 1533 67636 140209
10826 140209 57185 37054 71742 30724 10296 9651 47679 15823 33496 81092 118751 77764
10814 77764 104555 108295 110319 99248 60327 11755 18725 18294 35385 119368 105841 51878 82426
10801 82426 149701 145829 132377 139387 162251 181147 109123 56335 52738 58328 65324 102875 73880
10788 73880 50486 11264 7372 11668 16164 -644 -7894 -3265 -51285 -20556 9852 57250 53939
10775 53939 42674 27054 67246 65739 49778 96510 170464 152993 55779 73677 72770 76260
10763 76260 61799 97908 71767 60385 96233 77259 22608 -38774 -20870 25000 30637 60414
10751 60414 109259 124585 129901 208085 193466 104608 88545 120011 139224 168086 116276 68730
10739 68730 108888 189457 185181 231734 256440 226911 185012 220167 232841 227988 205902 169426
10727 169426 206770 240366 284266 354484 371561 334797 283626 263225 205411 232380 297423
10716 297423 318257 361936 428199 416070 367512 337644 317984 254235 298580 264247 200154
10705 200154 231435 268925 260338 206124 260928 304791 344396 346122 355451 353728 342210 303560
10693 303560 358113 451076 402397 349780 335529 370413 374352 358181 292456 265350 331523 326979
10681 326979 286164 237185 219208 233029 239812 242994 270879 301306 264343 258698 321983 347871
10669 347871 382116 491329 506570 484586 430213 450231 498555 537950 523974 534571 541647
10658 541647 421502 405874 474993 566100 631093 630847 660624 704050 678488 662457 695980 716661
10646 716661 682323 668084 741681 811616 912856 1009477 1031057 1005647 1028731 1122569 1204480
10635 1204480 1263494 1303567 1359147 1418383 1530131 1699691 1816633 1992042 2188369 2382147
10625 2382147 2526162 2751556 2991716 3289057 3648204 3999710 4418773 5040670 5799326
10616 5799326 6689862 7888690 9413544 11374731 13887168 16810909 19916392 22856854
10608 22856854 25349524 27484131 29400591 31091181 32492415 33695584 35337171 37932284
10600 37932284 41706905 46599883 51777159 56173892 59422458 61926972 63977195 65242159
10592 65242159 65465883 65261595 65785790 67751876 71432052 76524227 81788042 85597304
10584 85597304 87728302 88771882 88924737 87666625 84665880 80834756 77346263 75129168
10576 75129168 74466518 74993078 75703917 75517104 74361008 72746471 70721458 67783048 63813485
10567 63813485 59420321 55390559 52214155 49929478 48210998 46705846 44964456 43011176
10559 43011176 40922400 38653058 36133142 33212963 30112547 27207390 24454456 22117088
10551 22117088 20221034 18548126 17039650 15659433 14542696 13550874 12699345 11943704
10543 11943704 11301689 10704213 10229951 9789114 9270398 8869343 8619931 8272853 7966578
10534 7966578 7677346 7344606 7078495 6833919 6539470 6286481 6049477 5872845 5649674
10525 5649674 5456014 5350242 5225823 5089450 4917463 4651171 4539755 4394883 4277490
10516 4277490 4179352 4060315 3943903 3824788 3684456 3565603 3493704 3361328 3238022 3163276
10506 3163276 3119055 3005350 2960138 2941031 2848948 2748301 2621860 2604134 2585986 2532548 2508675
10495 2508675 2505274 2494928 2423435 2382745 2334721 2277987 2192108 2074990 1885521 1831628 1854326
10484 1854326 1827611 1800878 1763611 1716366 1622362 1588600 1618383 1580640 1535437 1481548 1469149
10473 1469149 1474987 1386611 1278665 1265293 1206224 1169374 1195524 1138058 1089771 1076063 1036166
10462 1036166 1005988 932965 803039 763859 828288 822765 737144 733501 720095 679729 571023
10451 571023 545177 552697 572080 609747 618031 548143 476348 451834 512667 522903 433972 400730
10439 400730 352939 271865 273306 266083 307673 378167 354103 311472 314459 326351 317416 299620
10427 299620 269528 288264 317960 344030 376257 439597 376798 340959 367363 366900 295735 302389
10415 302389 393475 406300 374815 411380 370770 231763 238457 271410 235627 218563 204116
10404 204116 184592 169708 246831 277536 214744 228577 285533 294557 262639 291062 282454 344614
10392 344614 326723 357474 395002 390003 355370 332235 341344 305128 284512 305753 303531 307350
10380 307350 361669 392281 358256 367846 294101 233890 210850 218998 204362 188752 264263 312740
10368 312740 367156 348038 264469 189028 133029 165131 227757 210148 134330 122825 126709 201025
10356 201025 153531 209380 252331 239677 186944 227375 247266 239553 225231 174183 170867 170718
10344 170718 160655 134108 78310 106546 116364 54314 54505 164693 191354 144439 156497 92554
10332 92554 70827 95300 95850 126798 94422 108507 143026 151813 156895 101021 92774 90705 108447
10319 108447 150840 114105 114090 155853 116925 77562 58175 13378 -16588 -9994 2791 97428
10307 97428 143724 157150 118987 119370 113892 117132 107804 124598 73814 26273 53579 88019 64213
10294 64213 127693 144326 138972 131403 133880 117082 86006 83931 133196 208315 170614 118696
10282 118696 209651 242555 173748 124481 120772 138923 176242 156231 150404 140554 126082 45642
10270 45642 7854 42335 72726 96303 105928 127486 120577 116465 186175 254415 154805 45783
10258 45783 9705 -3487 57543 109717 60700 74407 104379 108548 70871 60893 131003 142199
10246 142199 106612 84402 79861 52504 45224 2440 -67792 -34405 1694 7556 -5422 -10618
10234 -10618 -2044 15186 -22525 -31445 -69090 -89150 -22568 56725 88229 98564 56208 41231
10222 41231 109119 198746 179725 197079 243842 135907 75494 33690 -4064 38745 86985
10211 86985 125807 141431 242518 321910 392301 487616 600251 821566 975549 1076862 1128016
10200 1128016 1182815 1319402 1427521 1411609 1386774 1352475 1268735 1202475 1177593 1090590 980291
10189 980291 879976 784429 691423 484681 376748 333902 376989 445536 399425 392101 404396
10178 404396 385429 350424 288942 180197 214233 307366 382856 456866 498163 463876 417911
10167 417911 471099 447947 418086 416518 382622 387522 346030 401796 443603 465310 412879 394337
10155 394337 419313 429874 442040 401144 406690 476595 517972 560009 565261 494080 475560 452948
10143 452948 438658 461547 509601 512437 485261 470560 483195 446571 439135 423635 413163 452166
10131 452166 425176 370764 380429 393923 329937 346357 342455 303542 200470 188400 202279 223924
10119 223924 200150 136505 120187 148219 77136 108296 181815 183325 96920 88254 123244 114104
10107 114104 65047 32379 32982 30961 5023 -9396 38282 94090 79431 103287 111358 97502
10095 97502 86627 46140 26983 -566 -56710 -22797 -2616 24002 48744 38377 45127 120677
10083 120677 150765 155520 159804 164820 185168 78424 14257 -2390 -57230 -98606 -97288 -11787
10071 -11787 80531 106230 77822 23679 -22651 -6985 87968 133617 58798 105125 150842 53600
10059 53600 516 79120 81933 25625 -12236 73338 151281 142780 149530 95388 52187 34630
10047 34630 10680 3158 -40031 -56974 -75030 -109781 -81439 -57586 -2785 79650 85327 35660
10035 35660 15891 80022 103650 47954 48905 38454 24804 4447 -5847 31922 9040 -2197
10023 -2197 -26817 -27635 19172 88170 150403 111436 48837 13211 -42047 -15231 26447 -3135
10011 -3135 -42112 -84959 -53312 12846 495 15122 64127 75153 125331 90483 61710 41274
9999 41274 -10115 -53528 -23740 31567 38327 -645 40251 11164 23836 72282 85967 31062
9987 31062 23830 23618 71586 107416 104345 17626 29332 79048 90104 73949 49964 -12966 -25763
9974 -25763 -63181 -93647 -25671 -5669 -26564 888 -9212 -58582 -108548 -20615 45046 30697
9962 30697 -4061 -9263 -26205 68093 71916 45698 26350 24905 -22953 -85964 -44370 6572
9950 6572 40340 36176 -11250 -30992 8905 -12093 31538 -15978 -7348 10382 26659 55312
9938 55312 33100 2490 -43238 -125804 -107856 13521 2280 -12339 32046 102258 112479 44606
9926 44606 21376 -14855 14468 -45206 -17031 -8492 -15068 24841 25235 4060 53857 65034 82713
9913 82713 87924 66539 1541 26983 49865 100074 101348 22086 21877 31837 23246 -16772 -22312
9900 -22312 -23305 -50584 -43280 4773 -15208 -77902 -43653 -6289 -21121 -1785 72649 22616
9888 22616 -58967 -85594 -40710 19837 89828 108343 2431 -58128 -98052 -113913 -12739
9877 -12739 2743 -22922 -105317 -120130 -113161 -72403 -76412 -87888 -67147 501 13870 84160
9865 84160 64948 32951 -35717 -58863 30677 34500 25024 6943 45377 13847 -23411 1467
9853 1467 25360 47623 36158 1657 -35780 -14403 41387 963 -85641 -38622 50862 28289
9841 28289 -8487 585 56268 102213 96321 54849 9694 -15629 -48083 -96921 -76069 -41193
9829 -41193 -29667 -43511 -35845 -5910 31151 48975 93275 90277 51774 42455 -70102 -44985
9817 -44985 -7794 -13722 20102 17761 -53946 -76148 -1308 -1977 -30588 -43087 16589 100507 57273
9804 57273 -25258 -118372 -108281 -64170 -30926 -87126 -68769 -81735 -114430 -111450 -61444 12168
9792 12168 29960 49008 75681 54243 -22661 -55902 -29365 -18341 4638 18189 25805 -9960
9780 -9960 -117905 -133390 -80692 2409 8376 -19281 -10722 19557 78084 62688 -43749 -48202
9768 -48202 -39631 -66557 -131062 -123446 -61125 -32621 -31627 -77528 -104199 -93689 -110293 -96906 -25702
9755 -25702 -2528 -15536 -61681 -114411 -114148 -58224 -19251 27620 30565 69025 67014 -6882 -24326
9742 -24326 -20958 -85299 -65047 22087 34875 21343 -5111 28383 36524 -36160 -84452 -72459
9730 -72459 -10296 -42888 -79137 -94230 -110204 -143762 -184727 -141416 -70879 5438 -10605 -9985
9718 -9985 -22855 -41477 -75183 -60281 -13602 29390 35140 59895 3079 -66507 -88450 -82601
9706 -82601 -54214 -81934 -60601 -69158 -46515 -19275 6476 33793 -24181 -49087 2921 943
9694 943 43731 55432 -5366 -57384 -82034 -54804 -27800 19342 88963 43105 50662 18255
9682 18255 -13564 12895 -62365 -91028 -68346 -25453 2067 14098 -1605 -21076 -54465 -13857
9670 -13857 5115 62216 63574 22073 -23540 -37059 -40861 -103691 -172460 -104178 -74889 -81793
9658 -81793 -65885 -45517 1639 60853 89904 51854 27129 43489 101091 89277 83183 10914
9646 10914 -61104 -29596 -2007 11062 2136 -57399 -17858 -31619 -58799 -48872 -53561 -85246
9634 -85246 -110608 -85262 -74908 -71652 -70369 -21470 -56273 -55441 -31100 -13583 -34021 -29319 -21085
9621 -21085 27048 14465 250 -54441 -127514 -166993 -94356 -43684 -63718 -68535 -20907 -8714
9609 -8714 -58354 -117800 -77639 -1883 87524 144683 107558 25464 9145 -7003 -14790 -26215
9597 -26215 -58312 -76985 -109472 -81878 35438 60893 18475 -24827 -11059 73909 97451 84610
9585 84610 82710 87138 65908 129485 156734 168534 133888 50644 -2233 10807 8801 -4982
9573 -4982 -6454 -16363 -18434 35353 76839 7913 -6456 36228 -1829 -75743 -75339 -80650 -68406
9560 -68406 -45911 -95912 -59944 84989 182515 222991 177783 78381 -26551 -53458 -40944
9549 -40944 -27592 -22130 -7499 -20849 -48068 37141 129809 47937 -24049 -18511 15692 34590
9537 34590 76370 74982 4019 30283 -10959 -74593 -63220 -5414 25156 -9803 -63409 -65697
9525 -65697 -40070 -12825 25068 21474 16965 8514 32536 -11160 4348 13994 13247 10438 36016
9512 36016 38231 27182 13852 -16194 -7878 -42146 -20739 -49447 -61355 -100750 -56665 22578
9500 22578 39434 30293 35266 -16644 -16710 48657 72720 80114 121739 89900 13449 -11601 -32601
9487 -32601 -40811 -38173 -23116 23979 8153 -37253 -2112 44701 -42103 -113924 -131557 -84665
9475 -84665 -82601 481 50506 121674 87071 73057 28620 -1866 13868 -7982 -25503 -3603
9463 -3603 -62503 -98058 -23300 -60244 -152756 -127643 -116903 -70854 -78416 -81645 -85283 -111169 -129965
9450 -129965 -197434 -132776 -48911 -37892 -115619 -130510 -21781 71119 123278 77533 -11132
9439 -11132 628 29319 9880 2030 48328 73895 44777 9036 -20772 -2334 -18049 -68664
9427 -68664 -27949 7857 34443 72892 87385 59298 92438 72471 41560 77702 99385 8703
9415 8703 -126846 -142059 -96418 -45461 -64294 -94416 -78809 -43868 -51150 -17166 -27126 -71492
9403 -71492 -47432 -5603 -28612 -39151 -70297 -56839 16815 -47464 -150971 -142688 -104720 -83495
9391 -83495 -9966 -8298 -56475 -94416 -75527 -74050 -26026 -45179 -84961 -83544 -81568 -82642 -47294
9378 -47294 -30308 -29172 13151 272 -11924 -86376 -120017 -20610 35816 15153 50287 61070
9366 61070 29553 35689 99618 158697 161798 64798 -7558 -9671 456 107470 137273 69536
9354 69536 -43751 -79883 -66346 -43432 -58800 -132023 -97621 -57668 -7816 67181 111215 110379
9342 110379 11447 -2921 16925 -14088 -48043 27023 78381 72309 20383 -13604 57758 111759
9330 111759 118431 89129 47389 6236 -4840 60266 82042 -5044 -56526 -36340 -17030 -19730
9318 -19730 -31367 -64224 -121713 -107125 -99179 -55622 -78464 -56490 -54180 -32977 34792 50711
9306 50711 66986 39586 -27529 11047 101203 139911 23372 -18492 32620 10251 -42419 -53561
9294 -53561 118 23650 -10527 -15928 707 37386 47147 48291 -28435 -20933 4739 15104 -27652
9281 -27652 13181 83305 99318 17537 -26079 64162 113990 110183 104117 47026 -23389 26501
9269 26501 103244 142375 138657 56673 21468 2277 -54020 -138471 -142092 -28582 92904 83590
9257 83590 -8395 -102854 -65851 43814 164969 152442 136390 147737 155533 100026 76169 75208
9245 75208 34912 -34368 -39053 -104607 -85431 6472 60908 85200 91677 142027 106364 51878
9233 51878 22675 51210 64012 18227 22579 -12003 -64 39703 -8717 -103467 -98266 -94601
9221 -94601 -74562 30545 93120 3800 -64066 -102542 -54516 10538 56781 56697 37226 20276
9209 20276 -9647 -50243 -18616 -21734 -84682 -50963 20518 -7378 -6160 -10281 16690 45333
9197 45333 67741 31996 13854 75677 104748 27134 353 -42698 13554 52572 69029 30993
9185 30993 -4182 -64400 -56045 -20584 -82560 -65890 32315 96248 65122 36161 2228 -21488
9173 -21488 35933 44189 72195 46032 59708 61397 14348 -36372 -35143 -42247 -36305 25321 16585
9160 16585 27103 21910 16202 52341 2098 11629 -6309 -33599 -54937 -107447 -66569 -36491
9148 -36491 -23032 -23333 23653 43470 -19940 -38527 -26550 4879 -23031 -78345 -77604 -62266 -94078
9135 -94078 -70667 -9725 25867 25261 2193 -37966 -511 12623 -32848 -6909 42966 -12705
9123 -12705 -31433 8381 2877 47078 92986 83478 55603 50766 111945 36044 28408 -23378 -88174
9110 -88174 -28325 9199 -30956 -78681 -64883 -47663 -43057 -30345 -21633 7800 3539 -9119
9098 -9119 -1089 -2961 -59866 -65731 -53737 -80938 -66689 -41836 -16072 4044 51865 73218 29234
9085 29234 -33359 -63730 -97678 -134722 -128397 -133014 -67350 1279 -3899 21820 52383 86653
9073 86653 39979 -9790 4237 -21376 -25728 16353 -6108 -41383 -51032 27886 38128 40701
9061 40701 31298 64057 40382 36201 38469 29744 -55897 -147103 -180235 -119057 -108525 -152570 -123020
9048 -123020 -82718 -93125 -51855 -7164 -4522 30478 38056 60142 52060 29679 -1018 -34329
9036 -34329 -10342 48806 68483 26419 -5698 -8489 25623 -44831 -47357 -2627 -849 -32346
9024 -32346 -31145 -45497 -40640 -40368 -21031 -4621 -28933 -46295 36073 12007 18391 -33990 -94785
9011 -94785 -76830 -71095 -40254 -44798 -113982 -168240 -131407 -57749 -46494 7353 2525 17400
8999 17400 22311 16609 64626 31588 -23687 -55463 -39926 -36046 -44105 -65378 -75794 4316 46164
8986 46164 123353 84661 19463 5226 -57352 -35209 13534 -49910 -85092 -99023 -93439 22365
8974 22365 78503 68156 11666 -18201 -31820 -86249 -92369 -52493 -11110 21896 -9414 -69701
8962 -69701 -94784 -50040 16141 79399 30175 33310 77078 47877 8115 -61417 -77133 -67616
8950 -67616 -73652 -51671 -11085 -20204 -4816 27593 14078 -51901 -145281 -129144 -92328 36069
8938 36069 34858 -12072 -12407 33197 69207 54074 17906 27642 15767 18727 6010 -31293 -34634
8925 -34634 -1347 -19768 -32699 -4219 -46399 -64434 -111818 -149238 -100075 -8217 96777 93756
8913 93756 75436 77618 88253 68866 49769 55974 60265 18125 31227 -18428 -18058 -22646 -41839
8900 -41839 -17443 -43409 -62151 -167811 -112512 -22455 85002 134400 117328 52381 44485 59161
8888 59161 -11319 -69504 -60436 -73783 -87099 -89961 -68536 -42609 19352 14612 5733 14433 30903
8875 30903 56451 61628 7246 -41897 -100736 -125344 -35651 -62585 -86151 -48416 16577 95374
8863 95374 59076 50932 79807 107477 91585 80410 20417 40788 92281 87860 -6560 14186
8851 14186 6032 52140 21702 -8703 33467 27413 32192 35671 18813 -24347 -85415 -62816 -47707
8838 -47707 10115 34873 16456 -91246 -107760 -135777 -111154 -99103 -14238 101736 152860
8827 152860 83007 -14690 15174 11715 -17278 38099 25691 48101 65800 59501 56534 56622 43352
8814 43352 1843 -39248 -101507 -121683 -54977 34656 44847 -30172 -62513 -49232 -24413 -32542
8802 -32542 -10149 28623 24912 -34384 -37894 -42491 -63461 -54628 -69577 -91441 -127205 -72154 -39537
8789 -39537 -84694 -123579 -89131 -13413 12729 24460 11355 17338 48375 19724 18060 16860
8777 16860 8424 98978 163721 117230 113042 54429 36419 71150 102147 59585 19783 46009
8765 46009 21069 1853 17633 -4225 -9366 63947 31686 48374 72276 146899 134321 85256
8753 85256 46035 44530 -812 -62324 -31810 19025 22864 7134 10299 -6646 2501 10546 62390
8740 62390 95091 70033 9933 -14399 -39671 -76172 -93075 -88074 -68431 -46136 -44722 -93955
8728 -93955 -93161 -45948 -31507 -21654 -47308 -104678 -35438 -5477 14284 35190 15241 32739
8716 32739 10309 6496 37519 57110 123134 127146 93524 27703 13677 15226 38176 7215
8704 7215 -50142 -94 25852 -24797 -6965 22030 34333 60479 106833 80832 -14396 -17031
8692 -17031 61607 35380 -25959 -23205 57695 82687 32295 54322 32643 11240 55524 37662
8680 37662 -24424 -13661 13726 43800 25684 40677 5101 16577 7532 -17180 -17947 6948
8668 6948 -24990 -8698 39583 74383 73241 74355 -25527 -81328 -34023 -635 87645 102892
8656 102892 99163 55778 582 -2479 13100 -30463 4955 -7910 -42284 -22911 65266 50989
8644 50989 30121 61244 26334 28538 101983 108692 40038 -48339 -64665 -40431 -10216 1545
8632 1545 42559 33017 -38672 -67687 -84395 -94200 -107463 -179191 -154299 -71220 -96429 -66886
8620 -66886 -43979 4450 36634 19309 29446 6078 15810 36753 55539 65130 53198 50170
8608 50170 9029 19434 -7578 -63603 -19317 -27077 -20786 8158 -17690 -54258 -70405 -89879
8596 -89879 -153084 -136679 -102724 -50248 -18799 -32560 -19525 -32930 -67646 -87193 -61994 -35692
8584 -35692 38918 39266 10339 16893 75786 98629 130665 84423 8988 -21400 -77139 -3771
8572 -3771 1800 -46407 -32872 -46716 -41329 11088 86798 76659 28396 12160 -9025 -53889
8560 -53889 -77347 -91021 -42059 -95247 -102764 -78253 -31638 -12254 50218 64024 42353 64583
8548 64583 68246 29401 -80209 -98906 -20682 56263 77803 77065 66521 -4313 -13962 35381
8536 35381 77820 13560 -55421 -74920 -74370 10250 35316 -50375 -69394 -72429 -33401 -7010
8524 -7010 91693 183463 173841 107381 102731 90499 87045 137113 103683 64327 67028 -612 -85994
8511 -85994 -121286 -22134 31028 22392 18500 -11638 73015 74453 34868 32082 2210 -43573 -20987
8498 -20987 -34303 -75983 -32999 -5220 20784 31231 -21579 -30361 38385 78826 31058 -33389
8486 -33389 -116152 -83972 -50798 -75527 -38646 13039 51611 49235 16379 72237 53847 47094
8474 47094 47337 60410 66129 38696 -5165 -29875 -83178 -68318 -66813 -131458 -169285 -112866 -85391
8461 -85391 -94814 -64177 -68428 -37508 -73667 -34301 6602 13496 73708 101589 57795 7131
8449 7131 -44633 -60021 -26161 -52936 -19028 33888 98051 80944 78840 82827 122889 96427
8437 96427 72116 98392 82968 92702 158793 176973 145173 183964 131758 87590 142384 175999
8425 175999 183840 190284 155993 172111 132812 59839 12165 14753 42668 4794 -8283 -5880
8413 -5880 -11719 33335 102423 116457 72895 4024 -32143 18307 -1701 -52027 -35946 -24698
8401 -24698 17701 -91868 -81865 -50038 -40732 -30366 -30466 -48903 -16144 -25176 -28261 -1365 2741
8388 2741 7163 30143 44464 26661 13114 21259 -14979 -3170 -14999 -28688 -5747 -7051 -50677
8375 -50677 -12398 10119 -35839 -67965 -54348 -22443 31957 75806 21061 -37342 -10084 5195
8363 5195 17894 -27449 -115159 -132650 -112990 -54644 99317 192130 182068 136082 132655 76855
8351 76855 17563 31940 83455 109801 92794 63691 127209 173005 175632 279611 384555 469121
8339 469121 562198 528182 542972 638559 632653 547486 387384 349933 360640 325079 166818
8328 166818 134228 157562 192978 179160 133410 156352 166321 157328 72496 -5640 -9918 15013
8316 15013 37290 76604 66383 -12347 -50081 -97089 -88693 -61497 -28583 6983 -22726 -35782
8304 -35782 -19154 51606 108931 170350 230197 289494 418330 713366 981896 1106401 1138751
8293 1138751 1125104 1222324 1258665 1084457 857417 730781 625272 481961 416159 372741
8283 372741 364336 299618 235754 217975 236834 213999 215687 152914 136145 193531 229360 139538
8271 139538 134012 176280 170769 157903 123806 63411 21575 7904 -11272 23295 73764 47856
8259 47856 57071 87104 127796 236223 201915 228775 351810 490811 573929 548314 517524
8248 517524 522924 511009 561381 531408 376661 289616 250576 220687 198946 197883 225319 182442
8236 182442 142680 101598 129903 156120 181109 117332 100216 66346 65586 91274 76923 -27322
8224 -27322 28403 43267 113739 131456 92866 59932 22156 68087 42533 60545 74607 81867
8212 81867 97708 49096 -912 15406 42003 27488 54153 58852 35840 10612 -23007 -30342
8200 -30342 -20212 -83665 8168 934 -23436 5698 44889 -8193 -58441 -69531 -5860 -21766
8188 -21766 -7723 33040 102053 132879 133895 46974 -29211 -45441 -55420 -61560 -17557 21541
8176 21541 41732 15058 -14048 -48520 -102365 -95192 -40597 -11792 -54516 -103845 -54551 -110371
8164 -110371 -86688 -65308 -23537 -9952 26727 -32300 -33433 36337 11207 -52182 -89880 -123245
8152 -123245 -91893 -31188 57279 -12661 -105455 -142506 -145626 -136679 -97775 -73793 -70016 -32930
8140 -32930 -11161 -8765 -14444 3822 21324 31526 37053 58459 51591 35339 91649 23990 -13298
8127 -13298 -6159 70980 66519 1256 -29012 -8520 35491 57163 48668 56335 22112 53522 48163
8114 48163 -13195 -135445 -95103 -14934 24682 -18016 -22233 -24579 -6619 -15434 18866 67378
8102 67378 53761 -1464 -78129 -109296 -75669 -18222 -10082 -19241 -50100 -47517 -78908 -65018
8090 -65018 -34670 12439 -9511 -49523 -101792 -98103 -59663 -63042 -76011 -18193 11694 68175
8078 68175 63745 71925 79490 62978 18463 21508 50048 32874 -5268 -53351 -112269 -135617 -73222
8065 -73222 8417 48147 19037 -68593 -72941 -109655 -140854 -160033 -110776 -54544 -7954 30172
8053 30172 80405 130175 39978 -40349 -111717 -101608 -67913 -71242 -55349 43605 52670 78048
8041 78048 64829 19937 -30034 -36960 -25363 -590 51838 78135 29518 -60219 -58205 -35218
8029 -35218 -41180 -53356 -102155 -105539 -39015 -38432 -20058 1907 -5044 -50380 -33737 393 19728
8016 19728 59189 87183 17182 51084 132346 118013 75032 -22468 -6783 14992 44129 31572
8004 31572 24327 73325 96222 22744 16135 46946 45495 104655 68608 39675 12255 -23298
7992 -23298 29698 -26551 -80839 -40933 -63816 -147729 -111322 -75217 -17705 -28451 -57973 -72927
7980 -72927 -60968 -42864 -28151 -32501 -40523 -81747 -97563 -120193 -98947 -138361 -113498 -30961
7968 -30961 14233 6281 9336 56238 59396 13866 11476 11882 43453 55170 20919 -1932 3333
7955 3333 -7600 3192 42936 72550 51876 35422 58019 33293 -60814 -88068 -102208 -148372
7943 -148372 -107152 3198 -26522 -27432 7378 -9200 5317 -43182 -43811 38729 -13437 -88295
7931 -88295 -53174 -68120 28335 -9234 -70950 -66744 -58354 -28313 -84359 -110111 -65856 -164
7919 -164 -8418 -46188 -51628 -19579 -27350 20375 45021 133021 150865 69288 27853 -9628 -6927
7906 -6927 -6195 -4506 -1774 48250 143369 106750 -17148 -79537 -47540 12358 81127 86858 71276
7893 71276 -7492 -30525 -39729 -103097 -136405 -91678 -74716 -75030 -103696 -83725 -26132 -37116
7881 -37116 -10853 -89216 -99528 -80046 -1319 -32542 -56615 -89675 -95645 -128796 -89166 -123968
7869 -123968 -113400 -48218 -46654 -142388 -162860 -137375 -103095 -38888 -1340 21770 18856 41014
7857 41014 48347 18407 33301 91061 87113 21742 6067 2305 -33185 -61211 -120648 -120886 -68756
7844 -68756 -48745 -48266 -69347 -15730 7280 54807 29375 30863 -51 -62909 -127148 -61560
7832 -61560 -29804 77020 90457 -30406 -50203 15800 2025 -59190 -84396 -48490 -17927
7821 -17927 -45062 -64627 -59507 1617 -32831 -42547 37173 123645 104011 14819 -16803 44073
7809 44073 46843 -7161 -120581 -71869 -44082 -20289 19039 -17546 4140 46617 46555 8747
7797 8747 9876 -8696 -12497 -18924 1222 -26625 -41577 -1643 833 5365 -28521 -47293 -68323
7784 -68323 -39760 64913 79781 65251 64356 38545 -10289 -52232 -48078 6817 2383 -65412
7772 -65412 9612 23288 4656 14218 37879 -10323 18297 98556 101598 106566 102037 61097 25639
7759 25639 21678 19812 5789 17134 42247 50113 46665 57953 62930 14222 45492 95998 -19069
7746 -19069 -45054 -16339 -16431 -5136 -76800 -109791 -73547 -133508 -177317 -182293 -176598 -154990 -102136
7733 -102136 -64941 -35760 -8039 -26135 -57434 -62741 -24733 -63944 -113444 -106006 -123845 -148975
7721 -148975 -94208 -2538 5588 -28464 -89248 -82304 -8512 46458 50743 8396 -6413 -11326
7709 -11326 90336 93938 37205 49328 52232 2535 -20632 -90338 -44904 6790 -22048 -6500
7697 -6500 -1472 27430 36659 41062 14495 -2811 3292 43969 24244 14993 54000 43387 5631
7684 5631 -23238 -24933 4014 17863 30328 102990 69059 29784 -8273 -19438 17450 75428
7672 75428 23553 4981 24230 -2751 -81284 -123278 -181759 -213542 -207184 -159048 -123835 -88644
7660 -88644 -33400 -4248 13043 70683 18795 25773 41629 27655 38564 64502 79102 48035
7648 48035 4068 2130 -6904 21305 19924 15381 52933 77182 80842 23198 -13138 12671 4122
7635 4122 -69629 -58847 -5966 75144 118813 181788 123870 92494 102165 75957 27270 28246 6699
7622 6699 17223 -8994 -14647 -94288 -136328 -44098 -54509 -90692 -131215 -46297 17321 23122
7610 23122 95139 174162 105479 77384 28678 -1690 -7967 -30099 19187 -140 -48715 -52591
7598 -52591 11751 19324 -11654 121 92207 71115 47742 28011 16739 38334 24860 -25033
7586 -25033 -43206 -74654 -87611 -30484 -19207 12961 37502 27525 46938 14287 -47678 -80149
7574 -80149 -101274 -132740 -110898 -46623 -97380 -123923 -68464 -54290 -69583 -69609 -85630 -96455
7562 -96455 -19749 96134 72882 -4997 40984 91214 30462 -17995 21339 51717 24031 10430
7550 10430 -200 -9202 4473 -29480 -39825 -18661 65261 36613 -3826 -9356 -36777 -21056
7538 -21056 -40608 -91477 -50333 -37595 -47748 -61560 -30905 11524 102227 49547 -39225 -76099
7526 -76099 -82809 -30683 -15606 -59292 -46923 -64932 -16830 -30509 -27754 12445 -9348 -37535
7514 -37535 -10599 12875 48101 40901 82432 83673 69736 17673 -14798 35094 56415 -33678
7502 -33678 -23200 -49478 -18128 24357 46654 72530 65110 60626 52484 33067 65756 35626
7490 35626 -31833 -47827 27983 51813 60260 41719 52868 107101 93640 27868 -3278 -37381
7478 -37381 -17737 54051 103104 81001 39526 435 24076 48979 21742 -77368 -121695 -106089
7466 -106089 -50748 -10600 27558 10771 -10870 52509 56475 -14190 -21867 -5752 -45537 -72399
7454 -72399 -59924 -4320 11438 -20209 -50831 -46133 15924 78886 112485 66604 16438 -54234
7442 -54234 -1285 14939 29351 47226 13099 5372 33466 53462 -6739 -9532 -29730 -35641
7430 -35641 -29254 -24411 27543 13921 -44771 -103092 -77850 326 29354 15673 -4133 26958
7418 26958 21932 15406 11675 -58368 -73451 -115553 -108973 -31394 -8549 -24107 -29940 -39628 -1542
7405 -1542 -33969 -59369 -87139 -89476 -51286 3317 -6003 -53655 -126884 -177658 -116855 -93821
7393 -93821 -91046 -53080 931 20587 41510 7701 17028 -21278 12309 20745 -29516 -31048 -49889
7380 -49889 -11268 -12303 -39787 -31379 -1724 59969 42383 -12067 -70353 -82788 -135134 -153386
7368 -153386 -118845 -157311 -152836 -162568 -112711 -3092 935 -17655 18960 -13852 -23956 -46702
7356 -46702 -20909 -4891 -23899 -48006 -117805 -129489 -64143 -21214 -92200 -51297 42419 49349
7344 49349 6204 -11263 -69116 -116743 -120029 -178894 -137860 -92760 -103345 -82155 -25799 -46238
7332 -46238 -72244 -59002 -37298 5944 -27861 -43330 -15274 -60576 -77185 -23874 -58373 -70363
7320 -70363 -27700 -59964 -93515 31106 72062 63428 46273 -60664 -95317 -106738 -171624 -156822
7308 -156822 -97402 -111952 -23068 41983 84570 137531 199914 128993 91593 16763 -26147 -69791
7296 -69791 -47571 21567 61137 32699 -7078 14232 53651 17902 -27363 -16644 -24985 -60704
7284 -60704 -25410 14405 23255 35676 50790 107293 111901 84039 -1423 -16545 -15895 23283 31932
7271 31932 -9010 -76266 -103065 -93100 -26428 27652 59734 66628 23387 59634 119603 36575
7259 36575 -31874 -31281 -33402 22691 58652 80249 61426 81878 113835 132449 83253 -3630
7247 -3630 -3407 8533 22784 -2856 -29465 48845 14579 -52031 28543 69407 4834 -32787
7235 -32787 -38242 -2758 51148 29900 -41107 -76507 -131623 -84245 -17145 375 -3837 -63902
7223 -63902 -68263 2784 84479 100893 39074 -35458 -61191 17605 40179 37171 63172 105807
7211 105807 20272 24993 -24448 -28008 31880 -18730 -2066 57521 115867 92171 16736 8383
7199 8383 -49868 -97305 -18751 97446 148941 165177 125791 90498 37255 92157 46064 -60882
7187 -60882 -51216 -81558 -131750 -109853 -104528 -134480 -101161 -36989 45478 -7347 -17176 -45537
7175 -45537 -86886 -86916 -90589 -57267 -73033 -83305 -109934 -102577 -37429 14701 62553 23028 24700
7162 24700 55510 27883 -59618 -103546 -93377 -48488 18644 44608 16428 -86986 -135273 -86668
7150 -86668 -68035 -82470 -103741 -91377 -38868 21233 29958 -14817 10066 54293 52484 7140
7138 7140 75710 2930 -13840 -24973 -11693 -41296 -36328 9557 -23099 -97397 -103223 -76566
7126 -76566 -70914 -36789 -16097 19988 42964 -41061 -45599 -35925 -26317 -32671 -26339 14543 30199
7113 30199 -55578 -123174 -90627 -89402 -27996 709 -50828 -18346 40330 56841 93881 34258
7101 34258 -20644 -38503 -60305 -23097 24722 -10744 -33419 -30951 -76184 -103228 -61947 -9363
7089 -9363 2481 -2743 -38956 -67626 -81896 -84217 -66833 -38302 88165 98389 -25072 -97586
7077 -97586 -129543 -97517 -23969 23982 29081 57170 5124 51885 65056 -7783 -7465 -14639 -51861
7064 -51861 -16323 6524 88956 91657 34689 9458 4152 97928 116926 71689 61800 34010
7052 34010 13839 -11833 -48003 -67503 -77586 -36252 32770 70839 123388 77898 27454 -51627
7040 -51627 -76094 -47655 -1230 2174 -15729 26863 55571 2690 -31636 -21606 14456 50486
7028 50486 -3313 -49673 -84622 -44017 -11105 -17311 -72072 -11761 -9649 -22979 -38009 -48304
7016 -48304 -25676 -76793 -60355 5663 6673 -14806 -2133 14233 53388 93237 112367 51298
7004 51298 -26321 -25822 -23238 -56735 -68554 -52077 -15380 5976 -40293 -91886 -124838 -91244
6992 -91244 -27893 -35689 -64404 15534 77547 114513 107813 65717 -69427 -85467 -75040 -53327
6980 -53327 -38310 -22236 -39288 -93661 -30997 52059 19241 -74635 -88086 -79216 -71204 -84601
6968 -84601 -137111 -89801 -41964 -79014 -50191 20720 37262 -4346 13243 69108 56787 -12553
6956 -12553 -94328 -108399 -13203 50977 125660 124583 92067 59752 18733 -29401 -56703 -32385
6944 -32385 -19805 -46136 -19331 -28654 -6524 5088 5488 -85930 -44411 31930 52324 14003
6932 14003 -5043 -27964 780 -70081 -79294 -72618 -45542 52784 60263 -718 -62804 -90180
6920 -90180 -88647 -49964 -28767 -15555 -31343 3508 46403 -10053 -45750 -38077 -99689 -131571
6908 -131571 -124110 -148600 -150977 -131816 -136045 -53533 -15888 -116000 -152003 -117906 -120694 -108955
6896 -108955 -85633 -61948 54388 55239 -78712 -55254 -66694 -84014 -52784 -11151 -48049 -135589
6884 -135589 -185435 -152609 -93326 -34628 -39982 -63713 -57950 -106891 -147175 -171519 -83738 -103674
6872 -103674 -109827 -102571 -113494 -59728 23642 -35201 -107608 -100089 -103805 -51693 -29765 -56580
6860 -56580 -43147 9757 69874 53600 54928 24177 20539 14262 -53036 -85634 -36626 -29727 -36191
6847 -36191 -44832 -133406 -145427 -85576 -82985 -52225 -85132 -123568 -91055 -135344 -130171 -80691
6835 -80691 -12571 -25206 -41038 -60447 -43342 -11593 37458 36798 28907 45929 15891 -49383
6823 -49383 -40713 -61005 28382 16862 -7675 23650 31294 49499 45909 60082 74292 42826
6811 42826 -35117 -39132 1690 1123 -3210 -36048 -50066 -33434 13053 14769 -21083 -1757 58237
6798 58237 134456 113342 127941 65009 17705 15892 96239 128155 90409 101981 120351 66624
6786 66624 70509 29326 30576 -18593 -15500 -12446 22449 87431 94888 70122 41845 12244 -30735
6773 -30735 -12425 45492 62284 67791 95775 74836 56030 106202 144973 139757 111458 114383
6761 114383 46081 -39519 -81297 -86871 -33111 55347 70295 60774 55721 7151 -75632 -76779
6749 -76779 -70611 -105667 -71657 -93411 -140240 -93420 -44379 -67131 -5313 -32024 -53617 2447
6737 2447 4670 28129 29774 14901 -41970 -70864 -57948 -13244 -14675 18571 68239 21211 15881
6724 15881 -23330 -34803 33527 -30284 -3759 52344 19022 -16701 -73364 -122122 -114368 -87587
6712 -87587 -34042 35966 19620 14590 31122 12050 4262 85482 51939 45481 38689 -3762 -30598
6699 -30598 -2126 20691 63188 27929 -74564 -93617 -85966 -74204 -112264 -103035 -40863 -28982
6687 -28982 -5874 44832 29999 -3382 5639 19466 -8739 -95738 -113977 -90627 -88019 -61797
6675 -61797 -28151 -22631 -79188 -56247 -58297 -40660 -42502 -111294 -74923 -19570 1763 52543
6663 52543 55324 72182 23923 -30103 -50502 -80352 -76586 -95274 -123783 -96924 -57296 -6110
6651 -6110 59302 34996 -28523 -83830 -20388 54131 9145 -41482 6030 -32700 -79114 -153517
6639 -153517 -189726 -178379 -109435 9267 4782 -57139 -123875 -135370 -84100 -33039 -29648 -30774
6627 -30774 2566 -7410 -25617 -79232 -84675 -76822 28159 105693 58318 20225 -8144 -54535
6615 -54535 -64742 -39276 -74283 -80182 -50736 -26300 41883 -7978 -51878 -75620 -58684 -141486
6603 -141486 -133083 -31528 44729 75101 59744 67717 68209 57011 24972 1516 14566 73901
6591 73901 96612 54028 16710 -51318 -15991 4942 30310 -9046 56800 86153 21346 49203
6579 49203 45731 77116 69892 16271 -9493 25001 25368 -2680 -9519 24263 40576 -34944 -37978
6566 -37978 -70789 -49502 -46700 -70203 -36552 -543 4675 -44884 15089 -17609 -27058 12634
6554 12634 80070 60142 27941 40541 23536 5578 32779 10237 -15634 6538 65115 144404
6542 144404 147845 68363 44281 18434 6399 -31314 -48317 -1654 53184 66023 77224 85999
6530 85999 91941 129865 120651 62356 75688 94380 23712 24998 -8170 -6604 213 -33313 -50018
6517 -50018 15555 -202 -10041 -6292 -42248 -32718 -24189 5231 -11238 30835 20189 34351 32486
6504 32486 2348 -26533 -76226 -21975 1660 -24831 -36451 -42708 -38514 15925 -80 -70950
6492 -70950 -49282 -2419 -34871 -5145 6928 30242 31990 45807 47637 -6264 -1178 19636
6480 19636 70226 23604 -12537 5518 43116 -5221 -41401 -58216 -36651 -6805 25485 71854
6468 71854 77190 98102 153604 123691 95872 19027 35985 91765 87941 78286 53421 19571
6456 19571 11380 35926 12268 -15515 -6703 33661 134140 55270 -77491 -134019 -178088 -152096
6444 -152096 -88685 16146 83124 36873 -42314 -983 82082 134295 126933 123547 127264 103428
6432 103428 14812 -50548 -29067 55620 84477 61208 109146 125632 58003 2591 -64021 -83203
6420 -83203 7580 75622 105789 38923 -25611 -16332 74726 128590 132099 123241 144807 126938
6408 126938 52996 7568 25333 14295 -41953 -64331 -113244 -89344 -76234 -64287 -19984 -66048
6396 -66048 -95112 -135988 -122989 -93253 -104830 -67594 3146 26760 -3259 -19952 -57226 -102257
6384 -102257 -71085 -29375 9384 102372 194274 157454 9862 -73227 -43873 390 9336 50388
6372 50388 46969 52573 52593 18770 36460 45462 -28945 -71706 -26206 -19834 1249 59121 69669
6359 69669 24481 47585 46859 5926 -1919 -3475 5 -85319 -127520 -138285 -81454 -61899 -108267
6346 -108267 -91381 -61809 -8104 8135 89176 139675 99094 44926 34483 32180 80850 -1769
6334 -1769 -52063 -69286 -39122 -10219 -9227 57554 89744 28575 -24839 -58149 -12016 15965
6322 15965 -23751 -21074 -42949 -474 47954 12047 -53963 -25915 19797 66825 85620 5148
6310 5148 -83545 -128025 -117182 -159628 -96826 -82821 -87756 -73689 -60002 -15441 36358 73632
6298 73632 50792 61748 40236 14362 -55577 -55433 -57188 35367 79810 40115 14948 -34114
6286 -34114 -50872 37079 14769 -25945 31527 17140 3604 30795 25280 28604 85303 106032
6274 106032 93922 42257 -20764 -19224 -71270 -133557 -114590 -105275 -70446 -94789 -53389 -100470
6262 -100470 -60648 40000 66126 24754 20458 31067 -28930 2082 42191 35408 -30276 -75713
6250 -75713 -112946 -109273 -91646 -107733 -25613 44966 14374 23108 80514 24161 -26856 13497
6238 13497 -23842 34182 89272 14464 21948 12338 12107 78486 78503 56294 77386 73431 117996
6225 117996 85158 14923 -34735 -56795 7277 58137 90587 79452 61277 62537 36297 21074
6213 21074 24508 35240 25459 40683 85625 80860 13856 52675 127322 86359 29021 36189 25646
6200 25646 33139 -9489 -60631 -11161 88463 75191 44260 64395 91394 107683 123270 110474
6188 110474 80240 112706 58487 42531 80167 84887 18493 33872 78450 54678 -23867 -15227
6176 -15227 23297 24366 1225 -54412 -116392 -123674 -99857 -88982 -63842 -69450 -17831 -36001
6164 -36001 -39077 -8717 39611 39758 82952 46401 70416 -5950 -20109 -8460 -260 71590 77947
6151 77947 72622 66717 14483 -8899 -41723 -26849 -9432 22883 -13004 -59954 8546 31247
6139 31247 31227 17164 -5731 -3088 16825 14051 33227 -7941 -39024 -14098 -7192 23619 79045
6126 79045 63331 -110 -37207 -8329 9519 42641 13340 -16525 18222 34216 21236 -17882
6114 -17882 38823 116752 67812 -27512 -61110 -137066 -92497 -42560 22599 -16865 -95028 -146694
6102 -146694 -81401 -1501 11342 13428 -47049 -39288 -13786 26934 10752 536 39059 -6821
6090 -6821 -29440 -13450 38466 -59544 -105133 -21893 24224 65650 23435 -18554 -64974 -121769
6078 -121769 -152834 -164617 -157580 -97615 -84116 -45194 2866 43453 65070 61510 -28883 -99204
6066 -99204 -70621 -2067 52825 32489 51832 17361 21127 48637 78246 174695 144570 106848
6054 106848 65913 26633 7664 12046 18836 21196 -21818 -88055 -128437 -109328 -102681 -77157
6042 -77157 3139 -25379 -11535 -47133 -19771 -18662 -61120 -26570 15860 53504 73364 28567
6030 28567 -3851 -20131 8776 55931 55822 42764 -28605 -59703 -37063 -44295 -9791 30139
6018 30139 46202 18384 -23624 -20045 -59363 -69272 -61230 -44013 7961 42104 82516 -11817
6006 -11817 -104756 -144921 -167013 -89358 -10548 84885 95122 64885 27819 1650 1285 -21841
5994 -21841 -93498 -104248 -41166 -57133 -25483 -48164 -14614 22761 21751 27606 51459 19622
5982 19622 -4537 -10110 -36007 -32163 4859 -20876 -47495 -85154 -69487 -89831 -38183 -26484
5970 -26484 -4327 21058 98661 66387 -924 1288 -19307 4786 -53180 -14990 6937 -12369
5958 -12369 -35200 -8423 47688 14123 -105779 -106180 -9618 37687 18984 8206 -22459 -11876
5946 -11876 4283 43736 59770 8271 18257 84138 45330 76743 81168 1548 -14882 51217
5934 51217 41089 43135 57477 75655 27044 -22442 -13714 56400 97574 20603 42281 86651
5922 86651 122713 74530 7596 -13511 225 19860 -19013 -40343 769 52819 20696 -34858
5910 -34858 -77745 -136126 -92019 716 -4092 -21117 -9483 18619 945 -24886 12858 -22193
5898 -22193 -50578 -88661 -67734 -89371 -48997 -20710 -48227 -26518 108235 118217 15232 -45570
5886 -45570 -63794 -45070 -85563 -86748 -79500 -38619 -22786 5252 -53375 -90083 -70270 -34437
5874 -34437 -37389 -579 60738 64861 -19586 19996 40145 52614 103405 108478 54335 -51718
5862 -51718 -69744 -59076 -95411 -84173 -65596 -72857 -19989 21310 37244 63940 78692 37473
5850 37473 72738 73440 32317 -8390 15540 27885 -6357 -41247 -9082 19971 -36677 -58291
5838 -58291 -4464 29741 87209 54329 -19224 -8898 11308 40225 30200 7612 -27829 -37763
5826 -37763 -84280 -53618 2583 29790 27505 -71257 -105389 -88524 -33198 -60865 -153572 -184723
5814 -184723 -151152 -121863 -50238 -41548 -48723 -63717 -94576 -116931 -157606 -91528 -51306 -24848
5802 -24848 43955 28152 20242 37484 36785 -6628 -51113 -115884 -126490 -51335 -17993 5956
5790 5956 317 -19286 -21005 26640 9415 -41204 -58834 -15865 -16220 -27918 -91545 -76891 -106098
5777 -106098 -92076 7115 51156 76374 77953 98101 87341 94952 58242 51378 79201 45066
5765 45066 53752 83405 89500 102520 108531 72601 -76292 -98088 -41811 -65253 -74453 -47728
5753 -47728 -5389 13791 -4385 -11896 -28033 -429 28414 298 -86076 -108767 -78834 -29116
5741 -29116 -6227 19838 -24797 -69373 6420 80000 58698 24379 26306 29328 14111 87694
5729 87694 104091 19809 -34711 -30240 20624 -1092 -6867 -36941 -93799 -63459 -43913 -95742
5717 -95742 -73855 -50316 -26045 -20644 13019 -6670 -23370 -52433 -34490 -10209 -3897 -82296
5705 -82296 -92580 -46313 -31219 -11167 31697 34843 -2176 -31231 -17179 36863 -26748 -76884
5693 -76884 -72920 -126239 -151913 -108402 -21659 40757 35200 -6286 -37690 23665 104985 135244
5681 135244 104188 26257 -35014 -27629 17601 19590 37088 30104 -26390 -86363 -75417 -69059
5669 -69059 -105880 -97648 -116240 -151899 -81874 -31406 -2967 58025 139367 124490 45689 -2215
5657 -2215 -9904 -67865 -84184 -36649 3372 32991 22645 103546 86625 -3432 -51872 -31475
5645 -31475 26835 75237 54453 84230 83036 6718 -66601 -17025 9729 14400 14652 26577 -9322
5632 -9322 -16225 35678 68218 35215 -8736 -30005 -90106 -106707 -72820 5067 39635 17460
5620 17460 35816 23993 -29466 -74507 -61472 -29298 -34376 831 -3053 1164 9192 15379 23945
5607 23945 42019 64006 21174 24584 -50252 -126915 -69131 -78580 -39273 -8386 18859 127905
5595 127905 90542 74074 39233 -30172 -5890 44597 1653 -55142 -46626 9445 36142 5528
5583 5528 12455 -5795 -26173 -32966 -28815 -6864 -309 -10051 -33920 -29218 29979 41872 39329
5570 39329 17859 -25288 -61824 -61593 12558 8299 -25009 -18268 9980 13781 52573 -16492 -104615
5557 -104615 -81366 -10895 22980 -6742 -73756 -72052 -43295 -78073 -74055 -37623 -53093 -95578
5545 -95578 -90054 -58093 -25239 -20546 -48481 -82818 -72584 -41578 -40109 -67899 -74457 -26076 2667
5532 2667 -44751 -12532 11085 20431 -25001 -10874 -43077 -64391 -14092 41003 39827 -6317
5520 -6317 12989 24769 -12642 15944 -4220 -39768 -66838 -93821 -80363 -68016 -30247 -10678
5508 -10678 -39998 -71018 -83380 -28953 74404 120179 60389 -32814 -22889 3326 41331 -3788
5496 -3788 -72573 -164827 -123506 -10105 84395 90453 18795 6127 -9477 9735 7366 12137
5484 12137 55333 41196 -9059 44405 86650 72856 80013 86712 114538 30775 -16695 -4633
5472 -4633 -14808 -14851 -39852 -59793 -9931 36713 49387 22050 38285 -8969 -89208 -78107 -86863
5459 -86863 -19677 -5666 -43041 -35681 8004 -1930 -2133 31745 53769 41795 63772 60338 73214
5446 73214 9869 -40217 -52239 -69594 -10970 42136 -21990 -37775 3191 53922 127325 164102
5434 164102 103096 -11488 -120635 -103205 -74419 -60918 -15694 -4238 -37723 6393 43657
5423 43657 55525 33642 -19231 -38712 -42402 -36373 -41952 -23830 3129 -5084 37541 79317 55895
5410 55895 38282 57087 41228 -10639 28299 34259 22689 -35603 -30582 21715 144 -60363
5398 -60363 -37734 -21016 -35273 -34979 -118282 -145466 -91088 -41524 12311 37065 -25416 -74967
5386 -74967 -132659 -148184 -108713 -122357 -137614 -126744 -97275 -100296 -96722 -66715 -43293 11393
5374 11393 11069 49636 67952 6879 -5540 -42259 -55724 -97835 -99351 -89312 -64907 -68168 -48132
5361 -48132 -54281 -35968 -33461 -38530 -101034 -129953 -116319 -45777 -2307 66596 129771 95987
5349 95987 -27883 -37707 -47710 -113581 -132783 -58126 55026 87057 40227 6711 73426 121050
5337 121050 106084 114147 117279 47586 -20421 10232 7118 29380 29243 17027 25231 40643 36696
5324 36696 -98380 -144199 -50516 46860 47245 33407 7577 -7657 35126 61046 16368 -49339
5312 -49339 -86280 -83239 -125404 -143113 -161277 -78083 3764 -14775 3262 61520 90229 54237
5300 54237 12801 -76512 -35195 -25995 -29157 -47371 -43883 -24601 -54550 -71412 -62309 -44705 -14514
5287 -14514 -36514 -15791 -4499 12361 37112 62215 32593 -40215 -44660 -60600 -108108 -94061
5275 -94061 13437 -3404 -8386 -73791 -78249 -7614 35059 48852 8546 -89000 -110003 -67934
5263 -67934 -60886 -81709 -81405 -62480 -98033 -154952 -159482 -197817 -145271 -47627 -15602 -31815 -44659
5250 -44659 2216 9136 24981 37070 28690 38655 56475 136139 154849 101254 123655 141990
5238 141990 102683 61871 27016 34512 -53243 -123924 -177660 -157590 -53106 -48021 34245 47289
5226 47289 -18152 -32548 -27295 -19170 -37202 15439 29163 23748 -14993 -6080 4566 -6503 -20693
5213 -20693 7111 -45888 -53101 -79687 -55322 -46330 25762 81381 83685 68637 700 -13513
5201 -13513 -42364 -13413 -93268 -86595 -24675 -32299 5214 -44060 -81941 -56483 -57131 -41192 -42291
5188 -42291 3111 30886 3567 -47606 -26958 36669 38473 -18588 -54710 -45028 -44628 -15806 24661
5175 24661 58516 86630 52186 -7642 -2793 32664 -14984 -42242 -69897 -96198 -40198 -12177
5163 -12177 -13847 -13447 4306 -4671 675 11472 35176 69494 98295 113628 108441 97538 29208
5150 29208 -20636 -61478 -63437 -95600 -76210 -83553 -37345 11744 22128 19456 30148 24492 58982
5137 58982 33807 379 -30981 -66376 -58323 -87315 -74569 -52415 -49121 -77670 -34531 -1702
5125 -1702 -34657 -57223 -23221 -25953 -117321 -155098 -114816 -87594 -45838 -43784 -6007 62019
5113 62019 114039 86552 46080 -41504 -8756 37637 17855 3425 -25858 -24885 -64086 -28448
5101 -28448 -29094 -75028 -43941 -19078 -59661 -48634 -72508 -68619 -54936 -56683 -73949 -32107 -17510
5088 -17510 -27177 -13805 29207 96450 83495 79093 46124 62102 109162 107036 115506 118487 85835
5075 85835 75577 45303 67165 49135 48758 92230 100660 88803 82517 24302 -51153 -50805 18060
5062 18060 30575 42664 16948 44579 104428 171440 198138 161339 85697 -5933 -49255 -35854
5050 -35854 -22809 27099 -26990 -50889 -41881 -42823 -56885 -105493 -55099 -655 -31967 -610
5038 -610 28973 72243 98470 105340 96376 26459 -10240 16579 2657 -7810 -46192 -56599 -25540
5025 -25540 -11429 -13754 -3876 -23288 -71056 -84823 -26806 -30239 -55204 -114966 -105309 -137120 -136315
5012 -136315 -81849 -58089 -122008 -212386 -166619 -89973 -111475 -141979 -151053 -97031 -77171 -54151
5000 -54151 -113075 -87699 -70204 -5008 -28093 29845 75823 37441 4632 -29758 -103142 -66908
4988 -66908 -4522 38733 39598 22143 45996 115619 119249 129448 34503 -46295 -78244 -67587
4976 -67587 29045 19561 -87979 -127783 -106417 -36173 1400 21641 2811 -41978 -37340 -22905
4964 -22905 8050 788 -37201 -92192 -87296 -42045 -106299 -134541 -145414 -107857 -87074 -56884
4952 -56884 -20832 -37428 -102544 -144862 -132655 -102236 -152310 -92285 -13260 8215 -42030 3741
4940 3741 65259 68281 60430 -32561 -45656 -63419 -66788 -40890 -59420 -60919 -30023 6015 -19499
4927 -19499 -46117 -36273 -13941 10760 38416 37512 -10796 -19614 12240 30292 -31260 -26693 9911
4914 9911 -23338 -35862 -58677 -50384 -79289 -107439 -51014 -8024 21474 47908 93046 51643
4902 51643 66995 95181 73051 91896 132151 173252 174188 88337 86629 65032 1201 -9804
4890 -9804 -38794 -27832 -4108 -35607 -84768 -107361 -67411 -9988 40583 -12642 -87479 -96645
4878 -96645 -6024 -31810 -29453 18238 -27256 -54690 -41702 -23758 -58504 -104480 -140187 -131418
4866 -131418 -41758 5683 1938 -27215 -65175 -93451 -56838 -16142 -36600 -16902 39105 1762
4854 1762 -26340 -36078 33731 17777 -15494 -2375 -13170 -4236 -72865 6806 42045 34365 52740
4841 52740 37705 22506 -17751 14242 36314 -5202 7852 69717 79912 29924 -35513 -84498
4829 -84498 -73011 -104266 -117903 -106875 -49618 -8815 -25955 -47142 -57667 -94154 -171143 -130203
4817 -130203 -44491 37784 40304 -3643 -14627 -43038 8732 21942 40245 35782 -66312 -152999
4805 -152999 -103580 -63490 12331 13005 -51323 -26715 21885 23321 9801 34376 66923 -20416
4793 -20416 -90268 -50842 -53518 -89553 -93463 -100192 -31956 28423 38871 78365 14730 -72127
4781 -72127 -79542 -129781 -134408 -87158 -149188 -209098 -149837 -124223 -92109 -110997 -57627 32146
4769 32146 47497 22771 -26818 -83595 -40895 -17422 26735 99392 123456 85518 61990 58992
4757 58992 63791 87317 83528 67623 601 40419 52354 -32777 -77155 1368 26390 6826
4745 6826 -56236 -25986 7760 29014 35375 47155 93704 74753 24205 -17740 -19074 -34529
4733 -34529 -24943 -9697 -66552 -56792 4008 -10061 1353 46044 27261 39941 35966 43646 -384
4720 -384 -12445 -21032 -6172 61785 5638 32214 52601 47224 -38892 -13523 3104 -27138 -45647
4707 -45647 -81995 -176766 -104564 -5820 85761 118050 23721 -90727 -57064 18217 7849 -49043
4695 -49043 -59105 -62354 -30042 -16411 42418 70361 24331 -71490 -116978 -66959 -19422 20792
4683 20792 19089 -44219 -76789 -138497 -102295 -75265 -61919 -88166 -91777 -65256 -95011 -71560
4671 -71560 -30645 23980 -25944 -73876 -134288 -36789 50342 34471 -10512 -51433 -86518 -86319
4659 -86319 -75168 -78805 -86251 -31686 -12877 -50566 -107866 -80592 -97997 -113769 -47058 50104
4647 50104 9841 -21229 -11145 -20943 -9390 35332 62482 51584 20372 7360 8990 -1039
4635 -1039 -67326 -103131 -90858 -87983 -56085 -65154 -43021 -13102 -11358 -16751 -1101 42226 31130
4622 31130 59388 126244 148257 129430 128750 76033 44402 -20933 -20359 -40425 -52750 -4050 -13807
4609 -13807 39324 59456 -3968 -18180 -12363 -39717 -77509 -56423 -57778 -98639 -62794 1018
4597 1018 69696 43878 -7483 -8871 36503 11788 -45736 -59267 5827 31810 19275 51311
4585 51311 33558 -28335 -22369 20132 43691 66420 41912 59444 115876 57164 45467 52505
4573 52505 -4828 -89484 -58104 19109 17959 9901 47801 30500 61478 -2174 -46566 41162
4561 41162 112940 82918 12389 -38971 34965 65191 27107 17485 7493 -16842 -40094 -72396
4549 -72396 -82586 -59790 -47244 -117861 -103892 -74413 -4509 41860 -25069 -2750 -17447 -5757
4537 -5757 41428 34979 71394 72285 49358 21328 44205 11394 -1536 24061 57882 946 7675
4524 7675 58791 29988 18630 17079 -20741 -53992 -97034 -66039 -19035 -23814 -32627 10515 -17848
4511 -17848 42785 85954 101338 51860 78416 65565 55961 -12617 28589 63107 49202 38989
4499 38989 47946 84281 20672 -5096 7104 -28174 -107995 -105254 -51671 -51066 -24269 -684 -77448
4486 -77448 -165340 -149839 -88613 12610 46802 72334 11137 -53905 -41081 -16547 -35476 -35216
4474 -35216 590 -23306 -85539 -100466 -114378 -121079 -69845 -74184 -78825 -74631 -71091 -85419 -30701
4461 -30701 -62151 -90035 -48759 -29275 3251 18787 -7005 -46277 -29241 4232 31699 54307
4449 54307 60424 -10470 -103787 -103048 -127912 -159733 -139895 -72777 24761 47966 107372 15246
4437 15246 -52258 -24537 60527 115126 123033 46749 47279 64026 79872 -2406 13418 90632
4425 90632 47620 24224 -15828 -55433 -80532 -79755 -85826 -59826 -95310 -115403 -116000 -136689 -153827
4412 -153827 -114131 -109873 -55177 -8949 -31311 -60866 7067 17374 18850 36848 58814 94046
4400 94046 67440 3365 -29663 -27352 -44514 4007 -7690 10906 63329 62096 -53007 -62323
4388 -62323 -24367 -7818 15130 8374 -45191 258 57650 72871 80597 56246 -13519 55190
4376 55190 94786 125265 94314 71308 50746 50890 133145 119351 89092 95758 117913 109950 111032
4363 111032 19237 -11873 -592 -45083 -39179 28303 50942 2959 -50249 -45571 13989 64735
4351 64735 36304 8038 -44689 -21861 11793 31972 -13007 -42111 -95850 -85192 36340 83325
4339 83325 87551 35318 -34865 1496 18207 16989 27966 59537 3607 -15021 7487 48897
4327 48897 70288 61969 3260 11867 -621 24656 -626 -34994 -12986 42757 10647 -33106
4315 -33106 -40364 -5425 5730 27960 -1687 -29905 104 -1766 -3150 -26288 2093 81447
4303 81447 65339 8308 2571 -26636 -45729 -45724 -32426 -45958 46432 162099 187533 156254 108732
4290 108732 85225 71076 -33320 -49036 -1900 3869 -50906 -36314 6525 105095 175242 115884
4278 115884 51220 15049 -34730 -53642 1161 2913 -38265 -41513 -62109 19518 40862 1103
4266 1103 -21547 2102 43845 101211 103344 67249 10338 -39559 -26145 16751 41817 32741
4254 32741 21420 16927 -17572 -52261 24672 44508 48382 234 -1617 35344 19119 -40853
4242 -40853 -9778 9504 -15034 6756 -7588 -41782 -49420 -24051 11665 19955 16250 96690
4230 96690 73637 16050 -41198 -2837 6214 -72964 -79828 11792 29253 -3284 -44912 -77025
4218 -77025 -26847 -5248 18010 22563 -13565 -38293 -49126 -78740 -74567 -81348 -97082 -57573
4206 -57573 -82652 -72623 -50404 -111307 -152218 -74501 -56985 -36240 -36546 -7205 -2672 8609
4194 8609 13566 61601 18308 -68782 -76098 -58202 -4763 13447 67957 89414 33068 13326
4182 13326 66134 -7012 -40587 -11634 -44014 -22442 3955 -29013 -10720 -2972 -18943 21331
4170 21331 -7910 9899 5857 12241 42762 -310 16412 37406 33210 1710 -84662 -130663
4158 -130663 -62233 -26674 -13456 -2563 22798 57016 39020 43356 -4747 -15236 -41218 -54486
4146 -54486 -83957 -71805 -95047 -44231 -17436 -51998 -106370 -107347 -92106 23444 66201 103632
4134 103632 104098 102014 43246 -23598 4197 -12789 -48868 -63153 -38890 33801 79468 6182
4122 6182 -32133 -39041 -23848 8808 61894 74630 81886 114129 74566 48291 34023 -20400
4110 -20400 -42626 -18270 -36304 -46298 -19982 -18545 -16463 -33196 -57979 -26611 -39693 -62141
4098 -62141 -29493 907 25437 58382 8451 -57540 -38431 -52458 -68908 -70258 -19047 9580
4086 9580 -27199 23008 -23200 -17305 -21008 -69138 -41258 6309 3068 3182 29361 -29159 -84676
4073 -84676 -95738 -105418 -134524 -69411 751 10544 -2434 -3003 57336 102284 10940 -93296
4061 -93296 -6659 88558 45532 -18690 -16217 -18634 -45360 -59661 -34281 39866 67990 95750
4049 95750 72959 16318 55879 123640 99638 44255 7049 2957 -16454 593 90982 111090
4037 111090 115073 42797 -28926 -14722 30124 55291 19631 77462 128860 61219 -11015 -42149
4025 -42149 7857 -25290 -18406 45929 15620 9412 29052 -32657 -47752 -40630 -30763 -45896 530
4012 530 1455 13024 96987 61308 2318 -15156 -11147 -6834 36569 -20197 -59092 -28947 44785
3999 44785 111647 77177 62492 60243 98659 119659 102109 104653 87375 -11509 15784 51229
3987 51229 24506 81375 44181 24228 44901 -15323 -51830 -56627 -21458 4605 68143 97072
3975 97072 81642 -4825 18591 40459 6514 8117 -16893 -25074 35490 67775 19074 -66898
3963 -66898 -106491 -104598 -111624 -90576 -36378 13944 23974 24870 75755 94645 86751 60547 74859
3950 74859 94916 122793 103155 13956 -95932 -116989 -98826 -99278 -15712 -176 -78069 -177932
3938 -177932 -105705 -86110 -70026 -52102 -55048 -48386 4144 91853 88347 -16115 -36682 -17918
3926 -17918 -34502 -61529 -26936 -20504 -9582 -33395 -808 82827 71264 5505 -12432 -8966
3914 -8966 -10974 4676 12197 51780 -528 40988 31383 49147 30030 -890 -528 5573 14344
3901 14344 32896 68917 108130 30482 -25089 -89616 -74651 3909 90377 103653 47261 39116
3889 39116 -2786 22189 52316 51350 40273 61506 52874 6974 -37087 4466 36370 -14745
3877 -14745 -15211 -33183 -26054 -104077 -26524 -18421 -39228 -42616 -78257 -76086 -53429 -54182 -61893 -71121
3863 -71121 -29740 5808 -24258 -54108 -35794 20454 -8360 -55381 -120424 -105838 -38996 29149
3851 29149 24915 4074 54631 64280 45165 -66570 -135609 -159340 -124499 13059 84512 69630
3839 69630 -4680 -30790 5228 10230 24449 -50247 -67475 -36682 17938 -25559 -54051 -80319
3827 -80319 -18621 39330 54665 121805 102296 23799 -51490 -99801 -168692 -112585 -71078 10204
3815 10204 8 -25361 -29451 -6181 1153 22866 51126 70929 109266 74872 36191 29489
3803 29489 -2399 -11876 40757 9953 -38623 -61204 -91164 -87425 -66476 -19569 -8274 -59314
3791 -59314 -79065 -22440 -55387 -52513 -65391 -50153 -17717 23610 29259 4255 37644 35000
3779 35000 -37108 -93480 -77406 122 19749 22149 -46561 -46824 -56034 -37978 -38353 -11287 7738
3766 7738 46181 61666 27149 40136 59543 114167 125579 144855 146941 58088 -19089 -32005
3754 -32005 -8121 5586 9631 17218 16406 4898 -53219 64162 126990 78596 26340 29585 68010
3741 68010 76829 62068 46374 90704 56799 -13860 11111 -78225 -79364 20 -30412 -77120
3729 -77120 -12496 31778 -23265 -71049 -76498 -39326 -27660 -34287 -35933 -19714 18537 56837
3717 56837 51480 6475 2974 11285 -21844 -54685 57742 51388 18255 21699 20717 29729 12060
3704 12060 -58077 -30178 12131 27736 38745 23656 36469 909 -46548 -22953 6511 -13145
3692 -13145 -40695 -81698 -126785 -149183 -118836 -66918 -25319 12187 -9147 -14871 -18025 -13448
3680 -13448 21737 59441 61894 30127 -13958 -11777 14048 36685 50789 11609 46739 63989
3668 63989 51811 18098 -76665 -45707 -63960 -90224 -36067 -31568 -33087 48098 81812 53875
3656 53875 50317 41108 1413 -5298 -69804 -104564 -133989 -86266 -82310 -122124 -145823 -155888 -166367
3643 -166367 -138501 -75499 -66796 -71655 -35775 -30803 -17308 -22350 23441 25337 28168 32006 19561
3630 19561 1459 12943 23925 13625 68738 46968 2218 9612 -14745 -25280 -53840 -96500
3618 -96500 -100707 -52402 41670 60739 46360 438 62104 51648 17849 6390 -48452 -124261
3606 -124261 -119314 -158680 -104636 -109758 -105961 -121239 -164520 -152974 -125050 -23377 70864 40531
3594 40531 -12622 -3471 -70064 -75490 -21525 -37151 -66596 21481 31093 -3688 39657 65781
3582 65781 39386 4272 11901 -28269 -20327 107945 112300 80920 48780 64024 66948 -76285
3570 -76285 -120807 -71455 -77324 -43982 -18884 56425 72890 -37057 -43561 64530 147875 130192
3558 130192 82071 77669 88669 30194 9695 -4215 41207 42340 51503 64906 25092 27456
3546 27456 72801 16484 -13962 -35890 -4620 11942 -27741 -71758 -41444 5840 -38381 -23876
3534 -23876 -61382 -123458 -117100 -150750 -182304 -138818 -64828 -49262 -137761 -106269 -7207 33206
3522 33206 -23497 -10370 -8950 48251 133734 133057 49642 9572 8671 37020 13999 -28589 -49911
3509 -49911 -28672 -49714 -148327 -88697 -58694 -42259 -34214 -25395 -22877 -38373 -61166 5000
3497 5000 56454 62551 35870 21744 -22166 18960 31061 61685 20403 2473 -37781 -65860
3485 -65860 25610 76087 106212 129837 136976 88042 92509 114404 86022 29541 -18275 6489
3473 6489 36745 99312 83280 24400 19985 26480 -15403 -46934 -26018 14072 39699 23259
3461 23259 40053 28940 12061 22804 35016 100381 95307 5174 -62821 1867 6340 4809
3449 4809 69602 53467 -1682 -64351 -82993 -75898 -14971 20587 65739 12088 6381 7398 -18297
3436 -18297 -21589 -14426 -37307 -37384 21226 92478 39574 -40085 -73192 -36438 839 37414 -14422
3423 -14422 -50403 -77010 -14390 -590 -65515 -43371 -2371 -38316 -89583 -13934 74129 69083
3411 69083 17576 18981 -16229 -74494 -18947 9647 -10069 12280 618 24179 36281 -52218
3399 -52218 -76735 -59600 -53576 -71105 -81996 -69278 -35720 -29585 -22229 -104945 -124641 -68462
3387 -68462 47373 112465 143786 110965 27694 -17626 -61371 -101651 -79008 -31600 -3832 8714
3375 8714 1698 -21568 -36909 -27103 -9147 -34493 -21358 42672 42426 4184 -38748 -61647 -10571
3362 -10571 -4697 23326 68013 125865 84530 6719 -47697 -34462 24476 6423 1754 -13485
3350 -13485 -26125 89211 144025 131754 36679 10977 33383 -30965 -85559 -73501 -55585 -27445
3338 -27445 5573 26043 -35011 -81009 -69533 -54368 -58470 19393 16475 26323 55011 103381
3326 103381 108397 15941 2961 -19547 -23711 -70040 -62946 -60402 -118636 -79219 -65255 -63442 -78550
3313 -78550 -76942 -18999 72639 70429 36687 -13911 -17925 -26831 -105215 -84891 -52631 -51222 -33993
3300 -33993 -8705 -17354 -10212 -76780 -156375 -166188 -99669 -91711 -46823 2206 67220 135112 89063
3287 89063 22240 9516 -37564 -57886 -80404 -31881 -56826 -91214 -82412 -54513 -17961 5605
3275 5605 6809 -18870 -48343 -1643 -19356 -70987 -94111 -32159 3361 35649 12566 -34497
3263 -34497 -94118 -87251 -61663 -90847 -64280 -14441 -61071 -84071 -60597 -45436 -81580 -68221
3251 -68221 -882 41939 57386 101656 99193 66100 4187 11687 33996 86915 116509 108228
3239 108228 130060 133066 72247 -1779 -16807 4487 17058 -18450 -48754 -29993 21602 98610
3227 98610 91253 15636 27062 31102 33510 53130 31789 14107 -6480 -49218 -42234 -39557 -12239
3214 -12239 46385 92767 87752 61874 111101 108127 78573 89885 58485 57185 80764 101856
3202 101856 89292 119787 79030 -14403 1511 1179 22015 36475 56655 3427 10567 -9642
3190 -9642 -376 19295 8143 30654 62781 111884 86431 67186 96365 125483 159043 179555
3178 179555 162240 167756 142332 136805 118539 105856 68626 43874 11953 -71142 -145606 -91188
3166 -91188 -82715 -124551 -134518 -83318 -102588 -119256 -62116 -18915 29791 41588 58797 50484
3154 50484 71535 10346 2411 54115 61235 105999 106572 55343 -4724 10522 19973 8352 30802
3141 30802 7093 28971 -41015 -92313 -140621 -77235 -1549 24331 4244 16851 -61529 -121166
3129 -121166 -27705 92448 21752 -6056 -28645 -96674 -118608 -111046 -157668 -158091 -182831 -136246
3117 -136246 -67790 -29610 -60815 -133467 -152372 -52865 -24638 -54590 -22067 70180 83687 37674
3105 37674 11851 2733 -10660 -89908 -96354 -59544 -56214 -23950 40668 70734 67848 15147 -64908
3092 -64908 -60768 -56911 -31572 77277 128452 42676 -42542 -25768 -19996 13664 -9348 18745
3080 18745 -28633 -95553 -105124 -115855 -108815 -95241 -94059 -87540 -47752 -64883 -47458 -129524 -211898
3067 -211898 -112164 7724 12191 -52069 -39105 4528 4527 -12623 -46946 -11977 15320 -14359
3055 -14359 3716 32002 18383 3747 36689 -9850 21769 37691 35030 9830 2345 20301
3043 20301 44287 128565 133298 84037 54977 33242 -49401 -94773 -1721 57953 104486 104266
3031 104266 40321 16874 4043 18804 -7419 -11145 35107 32892 -43325 -66294 -28649 50176
3019 50176 165595 157475 129697 130893 156213 133438 64741 54754 29326 23184 -7843 37811
3007 37811 24833 17769 9020 -37335 -68541 -40263 -65397 34033 76053 45840 5917 19202
2995 19202 40976 -22113 -86539 -82570 -32545 -38486 22849 65918 13711 20392 22203 9195 -15520
2982 -15520 -86882 -43793 -13256 70305 47612 -66316 -81285 -59458 -64796 -77153 -15598 24133
2970 24133 -13691 -9973 3133 -8965 -48798 -52763 -84960 -138817 -168511 -165592 -78700 12550
2958 12550 90594 72299 2312 38032 74854 -12912 -73497 -65469 -26777 -23083 -9097 -78602
2946 -78602 -112390 -98773 -134383 -134383 -188357 -216603 -149707 -133119 -122626 -36157 14431 40969 60981
2933 60981 -14920 -117627 -79908 -104000 -72748 -42076 -13965 -9354 26571 -36241 -21844 13826
2921 13826 -30787 9149 53228 38954 60900 37661 -8146 -944 43214 30553 19679 -30410
2909 -30410 -40363 94449 108383 130982 156327 90406 13222 55638 53569 37946 19283 -12643
2897 -12643 -38985 -35235 -18011 -27825 -13877 -3208 -44335 -98597 -68473 -20345 50402 39240
2885 39240 20538 9512 -9835 -56058 -54172 54227 87474 99089 99961 64967 73199 59900
2873 59900 26287 9608 56062 72146 89808 74113 57799 69713 36380 7959 14057 35428
2861 35428 93949 60593 -23052 -32809 2611 20264 2680 36998 10225 21537 21378 -26694
2849 -26694 -62290 -83926 -131456 -76677 -33505 -69672 -96232 -67908 -1414 -19925 -49291 -13271
2837 -13271 6030 -48966 -75959 -128407 -125478 -178249 -212339 -103184 5016 -6519 -16067 5531
2825 5531 31012 40056 43042 39651 -11127 9964 37180 33279 -6881 -28777 4095 41704 97952
2812 97952 61669 34484 -12730 -31416 -51210 9226 -18651 -40902 -9215 -85451 -73452 -30820
2800 -30820 12620 65057 51919 8657 -43151 -34983 17600 -26149 -42484 -27993 51434 96760
2788 96760 53678 -32304 -81144 -110091 -53040 47017 77207 79339 27044 55815 107161 55208
2776 55208 -36577 -30755 -73095 -88596 1781 56424 23111 7561 -22982 -31640 3350 -15685
2764 -15685 -29778 42772 60398 69219 87262 26196 7944 -37250 -66034 -1155 39164 17445
2752 17445 -8839 6407 -30611 -76258 -40529 -28823 -25863 97533 116055 22490 37239 15028
$$ [...]
##END NTUPLES=NMR SPECTRUM
##END=
