##TITLE=Analysis number 320606
Compound Code cc 44204
Book Reference 468/93
Project Code adrs
Chemist Name colinb
##JCAMPDX= 6.0         $$ Bruker NMR JCAMP-DX V2.0
##DATA TYPE= NMR SPECTRUM
##DATA CLASS= NTUPLES
##ORIGIN= Bruker BioSpin GmbH
##OWNER= nmr
$$ XWIN-NMR		Version 3.5
$$ Mon Jul  3 08:19:56 2006 GMT Daylight Time (UT+1h)  MAYBRIDGE\nmr@NMR_250MHZ
##.OBSERVE FREQUENCY= 250.131544655141
##.OBSERVE NUCLEUS= ^1H
##.ACQUISITION MODE= SIMULTANEOUS (DQD)
##.ACQUISITION SCHEME= undefined
##.AVERAGES= 16
##.DIGITISER RES= 18
##SPECTROMETER/DATA SYSTEM= dpx250
##.PULSE SEQUENCE= zg30
##.SOLVENT NAME= CDCl3
##.SHIFT REFERENCE= (INTERNAL, CDCl3, 0, 16.522)
##AUDIT TRAIL= $$ (NUMBER, WHEN, WHO, WHERE, WHAT)
$$ ##TITLE= Audit trail, XWIN-NMR		Version 3.5
$$ ##JCAMPDX= 5.01
$$ ##ORIGIN= Bruker BioSpin GmbH
$$ ##OWNER= nmr
$$ C:\u/data/dgb/nmr/ADRS/2000/pdata/1/auditp.txt
$$ ##AUDIT TRAIL=  $$ (NUMBER, WHEN, WHO, WHERE, WHAT)
(   1,<2006-07-03 08:18:29.95 +100>,<MAYBRIDGE\nmr>,<NMR_250MHZ>,
      <created by zg, POWCHK disabled, PULCHK disabled
       configuration hash MD5:
       E2 DF 36 D8 04 B2 41 60 5A D7 A3 38 5A 4B D0 FE
       data hash MD5: 64K
       8A 22 A2 9D D2 14 50 B9 12 42 28 EB 08 8D A7 41>)
(   2,<2006-07-03 08:19:11.56 +100>,<MAYBRIDGE\nmr>,<NMR_250MHZ>,
      <Start of raw data processing
       ef LB = 0.3 FT_mod = 6 PKNL = 1 SI = 32K 
       data hash MD5: 32K
       9F 7F 54 45 0E EF B8 98 5B 16 9C DF 58 7D 70 A6>)
(   3,<2006-07-03 08:19:14.09 +100>,<MAYBRIDGE\nmr>,<NMR_250MHZ>,
      <apk 
       data hash MD5: 32K
       83 A5 93 13 A0 27 2D E4 42 7F 4C 2D DF A4 23 62>)
(   4,<2006-07-03 08:19:15.38 +100>,<MAYBRIDGE\nmr>,<NMR_250MHZ>,
      <abs ABSG = 5 
       data hash MD5: 32K
       A9 32 0E 03 4C F1 A2 DF B8 4C A4 D6 64 D0 8F 76>)
$$ ##END=
$$ 
$$ hash MD5
$$ FD 4A 3D B0 31 98 BE 60 D7 1C 4E 19 C4 92 40 8E
##$RELAX= 
##$RELAX= 
##$RELAX= 
##$RELAX= 
##$RELAX= 
##$RELAX= 
##$RELAX= 
$$ Bruker specific parameters
$$ --------------------------
##$DU= <C:\u>
##$EXPNO= 2000
##$NAME= <ADRS>
##$PROCNO= 1
##$TYPE= <nmr>
##$USER= <dgb>
##$AMP= (0..31)
100 100 100 100 100 100 100 100 100 100 100 100 100 100 100 100 100 100 
100 100 100 100 100 100 100 100 100 100 100 100 100 100 
##$AQSEQ= 0
##$AQ_mod= 3
##$AUNM= <au_zg>
##$AUTOPOS= <1 >
##$BF1= 250.13
##$BF2= 250.13
##$BF3= 250.13
##$BF4= 250.13
##$BF5= 500.13
##$BF6= 500.13
##$BF7= 500.13
##$BF8= 500.13
##$BYTORDA= 1
##$CFDGTYP= 0
##$CFRGTYP= 5
##$CHEMSTR= <none>
##$CNST= (0..31)
1 1 145 1 1 1 1 1 1 1 1 1 1 1 1 1 1 1 1 1 1 1 1 1 1 1 1 1 1 1 1 1 
##$CPDPRG= <>
##$CPDPRG1= <>
##$CPDPRG2= <>
##$CPDPRG3= <>
##$CPDPRG4= <mlev>
##$CPDPRG5= <mlev>
##$CPDPRG6= <mlev>
##$CPDPRG7= <mlev>
##$CPDPRG8= <mlev>
##$CPDPRGB= <>
##$CPDPRGT= <>
##$D= (0..31)
0 1 0 0 0 0 0 0 0 0.06 0 0 0 0 0 0 0.0002 0 0 0 0 0 0 0 0 0 0 0 0 0 0 
0 
##$DATE= 1151911106
##$DBL= (0..7)
120 120 120 120 120 120 120 120 
##$DBP= (0..7)
150 150 150 150 150 150 150 150 
##$DBP07= 0
##$DBPNAM0= <>
##$DBPNAM1= <>
$$ [...]
##$SUBNAM7= <"">
##$SUBNAM8= <"">
##$SUBNAM9= <"">
##$SW= 20.6930455092707
##$SWIBOX= (0..15)
0 0 3 0 0 0 0 0 0 0 0 0 0 0 0 0 
##$SW_h= 5175.983436853
##$TD= 65536
##$TD0= 1
##$TE= 298.16
##$TE2= 300
##$TE3= 300
##$TEG= 300
##$TL= (0..7)
0 120 120 120 120 120 120 120 
##$TP= (0..7)
150 150 150 150 150 150 150 150 
##$TP07= 0
##$TPNAME0= <>
##$TPNAME1= <>
##$TPNAME2= <>
##$TPNAME3= <>
##$TPNAME4= <>
##$TPNAME5= <>
##$TPNAME6= <>
##$TPNAME7= <>
##$TPOAL= (0..7)
0.5 0.5 0.5 0.5 0.5 0.5 0.5 0.5 
##$TPOFFS= (0..7)
0 0 0 0 0 0 0 0 
##$TUNHIN= 0
##$TUNHOUT= 0
##$TUNXOUT= 0
##$USERA1= <user>
##$USERA2= <user>
##$USERA3= <user>
##$USERA4= <user>
##$USERA5= <user>
##$V9= 5
##$VALIST= <valist>
##$VCLIST= <CCCCCCCCCCCCCCC>
##$VD= 0
##$VDLIST= <DDDDDDDDDDDDDDD>
##$VPLIST= <PPPPPPPPPPPPPPP>
##$VTLIST= <TTTTTTTTTTTTTTT>
##$WBST= 1024
##$WBSW= 4
##$XGAIN= (0..3)
0 0 0 0 
##$XL= 0
##$YL= 0
##$YMAX_a= 223559
##$YMIN_a= -372291
##$ZGOPTNS= <>
##$ZL1= 120
##$ZL2= 120
##$ZL3= 120
##$ZL4= 120
##$ABSF1= 16.522
##$ABSF2= -4.171173
##$ABSG= 5
##$ABSL= 3
##$ALPHA= 0
##$AQORDER= 0
##$ASSFAC= 0
##$ASSFACI= 0
##$ASSFACX= 0
##$ASSWID= 0
##$AUNMP= <proc_1d>
##$AZFE= 0.1
##$AZFW= 0.1
##$BCFW= 0
##$BC_mod= 0
##$BYTORDP= 0
##$COROFFS= 0
##$CY= 12.5
##$DATMOD= 1
##$DC= 0
##$DFILT= <>
##$DTYPP= 0
##$F1P= 14.0000005364418
##$F2P= -0.99999901652339
##$FCOR= 0.5
##$FTSIZE= 32768
##$FT_mod= 6
##$GAMMA= 0
##$GB= 0
##$INTBC= 1
##$INTSCL= 1
##$ISEN= 128
##$LB= 0.3
##$LEV0= 0
##$LPBIN= 0
##$MAXI= 10000
##$MC2= 0
##$MEAN= 0
##$ME_mod= 0
##$MI= 0
##$NCOEF= 0
##$NC_proc= -3
##$NLEV= 6
##$NOISF1= 0
##$NOISF2= 0
##$NSP= 0
##$NTH_PI= 0
##$NZP= 0
##$OFFSET= 16.522
##$PC= 1
##$PHC0= 164.8227
##$PHC1= 8.479162
##$PH_mod= 1
##$PKNL= yes
##$PPARMOD= 0
##$PSCAL= 4
##$PSIGN= 0
##$REVERSE= no
##$SF= 250.13
##$SI= 32768
##$SIGF1= 0
##$SIGF2= 0
##$SINO= 400
##$SIOLD= 32768
##$SREGLST= <1H.CDCl3>
##$SSB= 0
##$STSI= 32768
##$STSR= 0
##$SW_p= 5175.98343685301
##$SYMM= 0
##$S_DEV= 0
##$TDeff= 65536
##$TDoff= 0
##$TI= <Analysis number 999999
Compound Code 99
Book Reference 9
Project Code 9>
##$TILT= no
##$TM1= 0
##$TM2= 0
##$TOPLEV= 0
##$USERP1= <user>
##$USERP2= <user>
##$USERP3= <user>
##$USERP4= <user>
##$USERP5= <user>
##$WDW= 1
##$XDIM= 32768
##$YMAX_p= 285897055
##$YMIN_p= -481698
$$ End of Bruker specific parameters
$$ ---------------------------------
##NTUPLES= NMR SPECTRUM
##VAR_NAME=  FREQUENCY,     SPECTRUM/REAL,   SPECTRUM/IMAG
##SYMBOL=    X,             R,               I
##VAR_TYPE=  INDEPENDENT,   DEPENDENT,       DEPENDENT
##VAR_FORM=  AFFN,          ASDF,            ASDF
##VAR_DIM=   32768,         32768,           32768
##UNITS=     HZ,            ARBITRARY UNITS, ARBITRARY UNITS
##FACTOR=    0.157963299565203, 1,           1
##FIRST=     4132.6476996994, 0,             0
##LAST=      -1043.33573715361, 0,           0
##MIN=       -1043.33573715361, -481698,     0
##MAX=       4132.6476996994, 285897055,     0
$$ Real data points
##PAGE= N=1
##DATA TABLE= (X++(R..R)), XYDATA
$$ [...]
18490A51352p1053q3326k9590N7014K3847k4379K4716o111j150K7479k6419m4701
18478b321K7336N1909K1621K6692j0712m9954k8402J2265K0375M2278k6110j053
18466H3924k4580q516k8241J8374K9776r830k288Q0233K6994K2150j5629k1497
18454A50870q018n2493k7682j035l0164K1925M840J0531j9306l3269K9622J7794
18442F3615o9272m3194n0273n1640L6152J09366M0359m4561n1578J7537L3296
18431a0193L5280P702L4365l014l7637m8904l072r255N7002K0651J9346k8718
18419C3553j9645L5427K9146k2863p6185K3924M4837J4339N6477k9880J8562q335
18407I9357m4786J8770m3968l0632J5681N618j348k2900K942O6851N3890L6887
$$ plain form
18490 151352 80299 -3027 -32617 24397 48244 23865 48581 42470 41320 68799 42380 -2321
18478 -2321 25015 76924 98545 125237 114525 64571 36169 48434 68809 111087 84977 83924
18466 83924 59344 50828 22587 40961 70737 60907 58619 138852 165846 187996 172367 150870
18454 150870 142852 90359 62677 61642 31478 53403 58243 68774 49468 16199 45821 63615
18442 63615 -5657 -48851 -99124 -150764 -114612 -5246 35113 -9448 -61026 -43489 -10193
18431 -10193 25087 32789 67154 64140 26503 -22401 -25473 -34728 22274 42925 62271 33553
18419 33553 13908 49335 78481 55618 -20567 3357 48194 62533 119010 89130 107692 99357
18407 99357 54571 73341 29373 -1259 14422 20040 18692 -4208 -1266 65585 119475 156362
18395A56362j1679o5778p0276J6827N0517m3266m4019P7944O7617j7225L366m3556
18383G6834j7151q6765j4732P8127M6063k3080j5567n968m5529J6497N9902r08
18371F7723p2063R2587J01631k907j7096j3598K358K2950L1061k1683p3978n7160
18359E9825L3847M0646K3325p214J408j6740O9592K6098L1082j0054K92K8836
18347B80943k5635n1819O1100L6076r46l1079n9500K4565k6391k6937M6469j8477
18335B08369j016J7666J8272o7919k3187J7732p6506j15447m9258K9852n56N7737
18323A5739N6697o5733L0030N4239k2770k8217J5952j6197n4833k4305R1597J10387
18311A62586M4208L4873j5078q5330l7637L80l093o5016L7957J9458P9199M4658
$$ plain form
18395 156362 144683 78905 8629 25456 75973 32707 -11312 66632 134249 117024 120390 76834
18383 76834 59683 -27082 -41814 36313 82376 59296 43729 37761 -7768 8729 68631 67723
18371 67723 -4340 88247 189878 186971 169875 156277 158635 181585 212646 190963 116985 59825
18359 59825 93672 134318 157643 150429 151837 135097 204689 230787 261869 251815 252107 280943
18347 280943 255308 203489 264589 300665 299719 268640 209140 233705 207314 180377 226846 208369
18335 208369 207353 225019 243291 175372 152185 169917 93411 -22036 -71294 -41442 -41998 15739
18323 15739 72436 6703 36733 90972 68202 39985 55937 39740 -15093 -39398 52199 162586
18311 162586 206794 241667 226589 141259 103622 104002 100909 35893 73850 93308 172507 217165
18299B17165m1841p197n9348j1063M3207k0764L2036j7158M865O2817J8538l6200
18287A85057J9982l8584R48n185n633n6407k239K0295k3379p123M2235L9430M0930
18274B10327k3400m5302m3350l7775l6068O9778Q7835k3103o8266k0156K2649
18263I3169M6400L048m0265K3171L992l2925P085L4434N349j3962J3400r345k8541
18250A05010K0898K0344J5035q785j3169k2032M9834L5830j4393M8864q788l7367
18238A91281m1452L9338R9633m0998q687N0360j246o858N9018J6895J7149J1138
18226C85571n333m4496l181K1155L7161K6545Q073N616J4184m7149n9318l5574
18214C03254m9629N1345Q2536m2584r5184J5003M0233K7673M5361M6249j468m786
$$ plain form
18299 217165 175324 168127 108779 97716 140923 120159 152195 135037 139902 202719 221257 185057
18287 185057 205039 166455 167403 162218 156585 100178 97939 118234 94855 87732 129967 169397 210327
18274 210327 186927 141625 98275 60500 24432 94210 182045 158942 90676 70520 93169
18263 93169 139569 142617 102352 125523 129515 96590 103675 138109 143458 129496 142896 133551 105010
18250 105010 125908 146252 161287 152502 139333 117301 167135 202965 188572 237436 228648 191281
18238 191281 149829 189167 288800 247802 239115 289475 288229 281371 340389 357284 374433 385571
18226 385571 380238 335742 332561 353716 390877 417422 425495 431111 445295 398146 338828 303254
18214 303254 253625 304970 387506 344922 249738 264741 304974 332647 378008 424257 422789 418003
18202D18003M4671M3358n412q79k6620k5135N1033N4841N1933O6549K8972P1163
18190G72477O6948R1399J76606J72576R4859J19870J03753P6797J00939K0105
18180A796329L0108Q1574J18223J31776J55711K26834L05246M64708N33268O64844
18170D508621R22357J401725J984395L029504M495215N996928O873094O650480
18162C5862319N098847K802648L95566k161784m505250o051848o524615n491761
18154A9424122l843603k230329j172021m30597L43372J100020K141514L540579
18146A8873057N202569O522427O800002N766286L671546J165131j413586l993063
18138D2594369o046564p037659o512065m995887l409721k227809j515865j084974
$$ plain form
18202 418003 462674 506032 500620 499741 473121 447986 499019 553860 605793 672342 701314 772477
18190 772477 839425 930824 1107430 1280006 1374865 1494735 1598488 1675285 1776224 1796329
18180 1796329 1826437 1908011 2026234 2158010 2313721 2540555 2845801 3310509 3843777 4508621
18170 4508621 5430978 6832703 8817098 11846602 16341817 22338745 29211839 35862319
18162 35862319 40961166 43763814 44159380 41997596 37492346 31440498 24915883 19424122
18154 19424122 15580519 13350190 12178169 11747572 12090944 13190964 15332478 18873057
18146 18873057 24075626 30598053 37398055 43164341 46835887 48001018 46587432 42594369
18138 42594369 36547805 29510146 22998081 18002194 14592473 12364664 10848799 9763825
18130I763825p51094m85000l94460l26926k58578j16960k4353O8760J55258K58402
18120G888874K47408M31839O35092Q36154J251428K055165L534483O484652J1369576
18111C4734671J5479542J1602135J339663j675876J090228j945843j5802315j5832737
18103B8989468q741579m575461k655545j728962j234596r28192o77179m78784
18095G969170m19612m70333l76216l12227l04981k98336k68679j80169k01623
18086E136994j71568j12141j55548j24469j80757k20419j77765j16845j67526
18077C709956j79320r8591o9031r9047j15588j31326j34196p6688r9875m2460
18067B663834p6507j07228o8817j33974j35194p9570n0959o7599j364j6466n3112
$$ plain form
18130 9763825 9012731 8527731 8133271 7806345 7547767 7430807 7406454 7475214 7630472 7888874
18120 7888874 8136282 8568121 9203213 10039367 11290795 13345960 16880443 23365095 34734671
18111 34734671 50214213 61816348 63156011 61480135 62570363 60624520 44822205 28989468
18103 28989468 20247889 15672428 13016883 11287921 10053325 9125133 8447954 7969170
18095 7969170 7549558 7079225 6703009 6390782 6085801 5787465 5518786 5338617 5136994
18086 5136994 4965426 4853285 4697737 4573268 4392511 4172092 3994327 3877482 3709956
18077 3709956 3530636 3432045 3363014 3263967 3148379 3017053 2882857 2806169 2706294 2663834
18067 2663834 2587327 2480099 2411282 2277308 2142114 2062544 2011585 1943986 1942622 1926156 1873044
18056A873044r0186j01254n7769j00891K7210q5810p8964n674q6301J345k8169
18045A266581n9869q8096k0361O2462p9020l336j9971m8717J6706k55m7186p0577
18033I08361j8883j1135k6277o6080p6118j4769O596J4072N5579K3019r0383p0036
18021F33946q135r053l4660j5479J330J4861m3568k7327M916r457R821l8834p7983
18008D00378j2598J357j5847k4406j1654M2669O6469r833l3427m1108o6564k2446
17996B72990p945P545k7791l4357N9969o4361M5713j117K6051J5691L581l2288
17984B63681n3554j7959L2773K2013o076k2188J2572J6896M2921R140n3073l0160
17972B16986j4707q2086o1468l2770O0018P3455l7498N686p139m9121J4674N4355
$$ plain form
18056 1873044 1782858 1681604 1623835 1522944 1550154 1464344 1385380 1379706 1293405 1294750 1266581
18045 1266581 1206712 1118616 1098255 1160717 1081697 1078361 1058390 1009673 1026379 1026124 978938 908361
18033 908361 889478 878343 852066 785986 709868 695099 701695 715767 771346 794365 703982 633946
18021 633946 625811 616758 582098 566619 567949 582810 539242 511915 516831 507374 517195 478361 400378
18008 400378 387780 389137 373290 348884 337230 379899 446368 436535 403108 362000 295436 272990
17996 272990 265045 272590 244799 210442 270411 206050 251763 250646 276697 292388 295969 263681
17984 263681 210127 192168 224941 246954 240878 218690 231262 248158 291079 300219 247146 216986
17972 216986 202279 120193 58725 25955 85973 159428 121930 127616 120477 71356 86030 140385
17960A40385J4857Q552L5749Q697j6220l204n8553m6131l6722k3670l6294K7090
17948A4536N2703l4060n633l2681N929J3139N4071K8426J8192Q2N579m9998n8115
17935A2170J4878K6343l1207N4645O1044k9465M322R255K699j1709k2155m187
17923H6633M9253l2039j03394j11327k6609J5984O297j7780N1713k6237j6966
17912a24472o119N8065J1883l1239k2323K638J1382M2447M8540k5659J4503R145
17900a1209L5079K4003m6976N3520L6423k2586j2574l40n6812k2975J1671j8490
17888c1266L7867L4557M3147P3509k1199q1555L820k199L1227k4521q1990j7607
17876c6210K7661M0498l1066k1491j8260n6955j3917k5252Q0688N3798N635j0909
$$ plain form
17960 140385 155242 163794 199543 208240 192020 188816 130263 84132 47410 23740 -12554 14536
17948 14536 67239 33179 27546 -5135 794 13933 68004 96430 114622 114704 120283 70285 12170
17935 12170 27048 53391 22184 76829 137873 108408 112730 121985 124684 112975 90820 86633
17923 86633 135886 103847 453 -110874 -137483 -121499 -115202 -132982 -81269 -107506 -124472
17912 -124472 -130591 -72526 -60643 -91882 -114205 -111567 -100185 -57738 -9198 -34857 -20354 -11209
17900 -11209 23870 47873 897 54417 90840 68254 55680 55340 -1472 -24447 -12776 -31266
17888 -31266 6601 41158 84305 157814 136615 55060 58880 56681 87908 63387 -18603 -36210
17876 -36210 -8549 31949 883 -20608 -38868 -95823 -109740 -134992 -54304 -506 5129 -5780
17864e780J8840M1550K1963l3593k6526L7567J4158Q371k1379k0987K7130m5160
17852A6154j0777K1383J9959q143k3182M9807O1483k0499L0923q146o5029l3191
17840C0742o5000j8828k5019J6186K4857M7286M5362N2747J9291J3372m8676k7324
17828F4996m9267N93p1j4853K5179J2418k8623k4472k1964k8275L8839O9579l0028
17815A4051k3137k6734K0138N6664L9608j0105j0324K3238q343n5888p1555k622
17803e5009J7971r394L068J5021J2027K054N2719j1662n3950l2992J5586l003
17791d7564L5002J2274L4880j7267r775j0151J8237l288j2885j7604L7651L7846
17779E7356j3630n1738j5005O3799L8799K2946n3974p309k9578m1172J4352O0345
$$ plain form
17864 -5780 13060 54610 76573 42980 16454 54021 68179 76550 55171 34184 61314 16154
17852 16154 5377 26760 46719 38576 15394 65201 126684 106185 137108 128962 63933 30742
17840 30742 -34258 -53086 -78105 -61919 -37062 10224 55586 108333 127624 140996 92320 64996
17828 64996 15729 16322 16251 1398 26577 38995 10372 -14100 -36064 -64339 -25500 44079 14051
17815 14051 -9086 -35820 -15682 40982 80590 70485 60161 83399 75056 19168 -52387 -55009
17803 -55009 -37038 -46432 -43364 -28343 -16316 -14262 38457 26795 -27155 -60147 -44561 -47564
17791 -47564 -12562 -288 34592 17325 7550 -2601 15636 12348 -537 -18141 19510 57356
17779 57356 43726 -8012 -23017 40782 79581 102527 48553 41244 11666 -29506 -15154 45191
17767D5191l0624k0126o25l4971J0764N6680l8096J5762N4170N0812K199o9075
17755D2061j0889k30K650N0819K0831k3877L076k1566m114n965p9925j2655J01461
17742F1677K4143l1265k6378K2009N6085l8758j504l867J8243j453j7455k7430
17730C4047n8585K6153J4052j8971p3058N3300L0328l1802m122p005J800K9281
17718d582J7959L0406L7220o7715l4285M501L3766M6764J3676p9672o3274J4611
17706e0625M0162r409k36k9540o351M3921m5194r103J1563j775L8421M0808K6918
17693D9560p5093l9152k1928L0957L5079q37l0090j8369M704j7685L7948k457
17681d7363K4847K5432K2125n9369m5856n4475p019O0950K8331P429j9681j9283
$$ plain form
17767 45191 14567 -5559 -6184 -41155 -30391 26289 -11807 3955 58125 108937 111136 42061
17755 42061 31172 30942 33592 84411 105242 81365 84441 62875 58761 52796 -27129 -39784 61677
17742 61677 85820 54555 28177 50186 106271 67513 66009 62142 80385 78932 61477 34047
17730 34047 -24538 1615 15667 -3304 -76362 -23062 7266 -24536 -28658 -35663 -33863 -4582
17718 -4582 13377 43783 81003 13288 -20997 -16496 17270 64034 77710 -1962 -65236 -50625
17706 -50625 -10463 -19872 -20108 -49648 -55999 -12078 -57272 -66375 -54812 -56587 -18166 22642 49560
17693 49560 -25533 -64685 -86613 -55656 -20577 -21414 -51504 -69873 -65169 -82854 -44906 -47363
17681 -47363 -22516 2916 25041 -34328 -80184 -134659 -141678 -80728 -52397 -44968 -64649 -83932
17669h3932l7227l4176j1985J5517J4572j7210L4935O0573p88Q0593M254k0771
17657D355j1037o005P7636M8458m1751p7480n2300p431k8294L0985L7944O3786
17645C8866L5303J0886l6534K011m2724l6453k5479o400J6847N310J6309K3365
17633A307k2616o468L743j3199R116Q1473L5075l6052n2967l3085M1349j8010
17621a0334k2972J4037m1297n0301M0298n697Q947M3118P4790M2744J0826j7253
17609H6906n8039m0036L6086j8511J0500l4030K8135m9158J8853J06531J3093
17598A00330p9553L072O3704L831m1192L0545M8048m7132m2268O195m5291j4752
17586a4463O8131L9181r540N3715P8898M0058l1239o208k2568K2426m2078l7120
$$ plain form
17669 -83932 -121159 -155335 -167320 -151803 -137231 -154441 -119506 -58933 -59721 20872 25126 4355
17657 4355 -6682 -12687 64949 113407 71656 -5824 -58124 -65555 -93849 -62864 -24920 38866
17645 38866 74169 85055 48521 50532 7808 -28645 -54124 -60524 -43677 -38367 -22058 1307
17633 1307 -21309 -27777 -24034 -37233 -28117 53356 88431 52379 -588 -33673 7676 -10334
17621 -10334 -33306 -19269 -60566 -110867 -70569 -76266 -67319 -24201 50589 93333 104159 86906
17609 86906 28867 -11169 24917 6406 16906 -17124 11011 -38147 -19294 87237 100330
17598 100330 20777 23849 87553 91384 50192 80737 128785 81653 39385 45580 289 -14463
17586 -14463 53668 92849 83309 137024 215922 255980 224741 218533 195965 218391 176313 139193
17574A39193p913n1687J3926O9443N2732K9769j4875K1587M0607O2995K7074P2264
17562D55115o823l8857J1834o9109n0499N239k4797K5836k5154l0656l1976j3861
17550B06292o8715l8140J2284O8926Q1161k9956m9856M3199L903l4975m0011n1108
17538A03004K6122q1642q2957J3895o84J8648K7079N2054l666J5042m1679l7280
17526G936l1468K5456J9050k7525n1711K7285Q1298P318Q111L8903R74r7131K9672
17513C8168P638l5171l6049j4673K7343J2820M316j1888N1647J0202m3807j1838
17501a292J9615L7089j6425j7471j7287j2458l959k5360j8026O0703L6588o446
17489C5271j4793N863R389J1612l2875j4191O3577m9462p720O1693K7502M5721
$$ plain form
17574 139193 131280 79593 93519 162962 215694 245463 230588 252175 292782 355777 382851 455115
17562 455115 448292 409435 421269 352160 301661 306900 282103 307939 282785 252129 220153 206292
17550 206292 137577 99437 111721 180647 261808 231852 181996 225195 229098 194123 154112 103004
17538 103004 129126 47484 -35473 -21578 -22262 -3614 23465 75519 71853 86895 45216 7936
17526 7936 -23532 1924 20974 -6551 -58262 -30977 50321 57639 65750 104653 105627 8496 38168
17513 38168 45806 10635 -25414 -40087 -12744 76 4392 -7496 44151 54353 10546 -1292
17501 -1292 18323 55412 38987 21516 4229 -8229 -12188 -37548 -55574 5129 41717 35271
17489 35271 20478 26341 35730 47342 14467 276 63853 14391 6671 68364 95866 141587
17477A41587K7748m3918k4615j8394n206J7508M7521n1071r673P175n2282q6476
17465e0096k033P438L8319P8775j2912p9515l5580J1962q55j7702J1088L8247
17453a2864k5466Q441K7425M7627Q3260k7079K4880N7894M6380N9082K6001K0413
17441C35994Q4021M5356L669r5968j67288p0887o4816q0431J4214j339Q585K5609
17429C6719n861J1549N496n0953j0230k471k7554o3507k4242N0480M744L6384
17417c9446O2636n2137k1446M3242K8506N3707l6185J46L3028r2334p3700J333
17405i2650K6725K6355K3478K3590n9057J213j519K370P681q283m5652M332P0146
17392b1271j5431M1190L998m7170j0453J0139K9650O049J5277j158J650O42j0858
$$ plain form
17477 141587 169335 125417 100802 82408 77202 94710 142231 91160 81487 88662 36380 -50096
17465 -50096 -52129 -44691 -6372 72403 59491 -20024 -55604 -43642 -44497 -62199 -51111 -12864
17453 -12864 -38330 -29889 -2464 45163 128423 101344 126224 184118 230498 289580 315581 335994
17441 335994 420015 465371 469040 373072 205784 134897 70081 -10350 3864 2525 11110 36719
17429 36719 30858 42407 47903 -3050 -13280 -15751 -43305 -106812 -131054 -80574 -75830 -39446
17417 -39446 23190 -28947 -50393 -7151 21355 75062 38877 39023 72051 -20283 -93983 -92650
17405 -92650 -65925 -39570 -16092 7498 -51559 -50346 -51865 -49495 -41814 -50097 -95749 -91417 -21271
17392 -21271 -36702 4488 8486 -38684 -49137 -38998 -9348 -3299 11978 10820 12470 13112 2254
17379B254J0785Q579O05R4132r395m4879n3453k6723l3218N1075J13100l1685
17367H1177J9802j0362k4985n0555l1012K5320K0783k0946j5313j3866p671L7556
17355I928N8977K1041K1156m2094q8394J1785j3960k7577l1177J9383L6018O993
17343a7921K956K1089j6450K835j8434M6433M947l385M516o2976R686L7314M3752
17330E4362L2220n3123L699p2075q494p393J2597J2153K4355l2281l7705j9915
17318i1600N5110k0172l6369O462L9835j782q990J6585k4452q593M3099L5718
17306D851n219K2757K1772K5232L0948n0032n2475L5070K9384n8697j5883M505
17294g787K6550L3752O9030O718n408j3517m1981j9525K574o2399l0462K5726
$$ plain form
17379 2254 13039 21618 22223 116355 106960 62081 8628 -18095 -51313 -238 112862 81177
17367 81177 100979 90617 65632 15077 -15935 9385 30168 9222 -6091 -19957 -27628 9928
17355 9928 68905 89946 111102 69008 -19386 -7601 -21561 -49138 -80315 -60932 -24914 -17921
17343 -17921 -14965 6124 -10326 -7491 -25925 20508 25455 22070 26586 -36390 -26704 10610 54362
17330 54362 86582 33459 37158 -34917 -43411 -50804 -38207 -26054 -1699 -33980 -71685 -91600
17318 -91600 -36490 -56662 -93031 -86569 -46734 -48516 -57506 -40921 -65373 -73966 -30867 4851
17306 4851 -368 22389 44161 69393 100341 50309 -2166 32904 62288 3591 -12292 -7787
17294 -7787 18763 52515 121545 128263 122855 109338 67357 47832 50406 -11993 -42455 -16729
17282a6729N5926j2374J1201n5604r697O0196K3061Q180k8442L0525N2486N9283
17270A78012l4935l8661o5755j5431j0008q258m2538p343K6119J7491K6591O6069
17258I1353K2125j12203p4255J3364O6826J6283l7683l9686J7190O3568N5565
17247H2447q315J1182N1859K2822l0400m4229K3177o9455L8780Q1427l0935Q038
17235A36398j0982o4087o5589j7145K8640M7441L3393k4482N9102L0026l9242
17224A13473p3714m0494l1299K572O8539O4388J6266J3164L796N375J5926j8212
17212A39780J1119J748K1835l648j9057m2646O107J629p2727j292N663Q577r073
17199D8015J096R7714L7302N686m7694k2450K1774P991k3847l9349N5965L5585
$$ plain form
17282 -16729 39197 26823 38024 -17580 -27277 32919 55980 64160 35718 66243 118729 178012
17270 178012 143077 104416 38661 23230 13222 4964 -37574 -44917 -18798 -1307 25284 91353
17258 91353 113478 1275 -72980 -59616 7210 23493 -14190 -53876 -36686 26882 82447
17247 82447 74132 85314 137173 159995 129595 85366 108543 39088 77868 159295 128360 136398
17235 136398 125416 61329 -4260 -21405 7235 54676 88069 63587 122689 152715 113473
17224 113473 39759 -735 -32034 -29462 39077 103465 119731 132895 136691 142066 157992 139780
17212 139780 150899 152647 174482 170834 151777 109131 115238 116867 44140 42848 48511 57088 48015
17199 48015 49111 146825 184127 189813 142119 119669 141443 149434 125587 86238 142203 177788
17187A77788k4949R65J37q4592o7686j9006j6406j2426m0531O080L5003J6255
17175b9368J0478p156J3066k9946J1894J5120J5023J3959K1187r81o0190N185
17163b1729O7201K5601j7896K3705K941J5947r081n0858j2613m1506j9043j7775
17151e5106M8463R306K2552O8356j4510l3668K4459M0840k3794K1459l6753j14762
17139d3158l5316l0152N5156K4357O9739P70l4054k0436k1359M4608N9907k8439
17127D1623L9496N5797K4522L339o0022l8028K1950j480R66K1794L2111m8262
17115I3806k6332K3625k157j1078L294k651j1303m7559L2638N0248j1950j896
17103H8685L1066Q273n2422j3338K300J7313N5444j806K1040p153o2685k0930
$$ plain form
17187 177788 152839 153804 153941 69349 1663 -17343 -33749 -46175 -86706 -80626 -45623 -29368
17175 -29368 -18890 -26046 -12980 -42926 -31032 -15912 -889 13070 34257 33276 -26914 -21729
17163 -21729 45472 71073 53177 76882 79823 95770 86689 35831 23218 -18288 -37331 -55106
17151 -55106 -6643 2663 25215 93571 79061 45393 69852 110692 86898 108357 71604 -43158
17139 -43158 -78474 -108626 -53470 -29113 40626 41396 7342 -13094 -34453 10155 70062 41623
17127 41623 81119 136916 161438 164777 104755 66727 88677 87197 88163 109957 142068 93806
17115 93806 67474 91099 88942 77864 81158 78507 67204 19645 52283 102531 90581 88685
17103 88685 119751 128024 75602 62264 64564 81877 137321 135515 156555 149402 86717 65787
17091F5787M4696M4670j5144q0100O430K8180l0112K1667J084k7850L5410j0176
17079H4542L0340R792j7336m534N8370q955k0627N8262J8709j1325J8604P013
17067B22855r532J5792j4101n1182j2655K2157K6212O3460O2339Q2494J3089k0624
17055D00304J9367k5490M1216L8521l9021N353J7929K8691Q6456K9080M9379Q0714
17043G32499R0034R7448J06803P9290N5086N143J09148K06521J17286J15279J19769
17032A834306J13265J55950J98339L43384L96371M57706N27288P37203J055188
17023E819000J672926K687556M051795N335584N039765L181763K138337K864459
17015C2791185L284889J313519j228330k415255k246740j469790k220856m600881
$$ plain form
17091 65787 110483 155153 140009 59909 66339 94519 64407 86074 87158 59308 94718 84542
17079 84542 114882 124674 107338 102804 161174 152219 131592 189854 208563 197238 215842 222855
17067 222855 213323 229115 215014 163832 151177 173334 199546 263006 325345 407839 420928 400304
17055 400304 419671 394181 435397 473918 434897 440250 458179 486870 573326 602406 651785 732499
17043 732499 822533 919981 1026784 1106074 1161160 1166303 1275451 1481972 1599258 1714537 1834306
17032 1834306 1947571 2103521 2301860 2645244 3041615 3499321 4026609 4763812 5819000
17023 5819000 7491926 10179482 14231277 19566861 24606626 27788389 29926726 32791185
17015 32791185 36076074 37389593 36161263 33746008 31499268 30029478 27808622 23207741
17007B3207741m949263l216049j412018p1514J190160K691873M177005M814467
16999B6432402L496839J836451J918992K893595J986423o99339k533602k762980
16991C2568781k009118j964555l957913n521484m417703k742013j696645j154304
16983I105046q67467o91606n08126l36505l03754l91908l31743k27018j51754
16974E295165k29767k65178k25752j77882j14119j81669j47448j38273j69287
16965C645790j59684j35681j42873j79633j15752j28537j30013o7323j12890j13815
16955B359589j41634p1018r6915l4737l2554p5443p3255l7898n0401p8388M1371
16944A708717j2830r9066j00418n3975n0895n3260q6835j01696n5711K5616k0230
$$ plain form
17007 23207741 18258478 15042429 13630411 13558897 14749057 17440930 21617935 26432402
16999 26432402 29929241 31765692 33684684 36578279 38564702 37865363 35331761 32568781
16991 32568781 30559663 28595108 24637195 19115711 14698008 11955995 10259350 9105046
16983 9105046 8237579 7545973 7037847 6701342 6397588 6005680 5673937 5446919 5295165
16974 5295165 5065398 4800220 4574468 4396586 4282467 4100798 3953350 3815077 3645790
16965 3645790 3486106 3350425 3207552 3027919 2912167 2783630 2653617 2586294 2473404 2359589
16955 2359589 2217955 2146937 2050022 2015285 1982731 1907288 1834033 1796135 1745734 1667346 1708717
16944 1708717 1695887 1596821 1496403 1442428 1391533 1338273 1251438 1149742 1094031 1119647 1099417
16933A099417r6591J9158N6670k7452l6965q0805k6074N2311k2978o055p7147
16922H53489n5901l1244k7639m7926M0935J3074q20r9064m5642j8889n3463K2315
16910E49225K6287o2057k0138J7285o3474k8045O153J1254P269J584k1234j8195
16898D05914o7899m6180j7984k2745J7015L1394l6044o9927O126P2981L0906r587
16886B93970j0994k3371K602l7731r515m587k2067J6641J7690J8487l4692j841
16874B04592L528p354L8638k2058o2438m9571K0996m3825m9529L1294L0058j7782
16862G6549j1351N8475L5016L6679O524q7229n3935Q105j3887j5118j2941K5558
16850E2445N0867O4382L252J299M5309L1083o3787j01538J441M4193J2742j5742
$$ plain form
16933 1099417 1002826 1021984 1078654 1051202 1014237 933432 907358 959669 936691 930636 853489
16922 853489 797588 766344 738705 690779 731714 744788 743968 644904 599262 580373 526910 549225
16910 549225 575512 513455 493317 510602 447128 419083 425236 436490 443759 445343 424109 405914
16898 405914 338015 291835 273851 251106 268121 299515 263471 193544 199670 272651 303557 293970
16886 293970 282976 259605 262207 224476 214961 210374 188307 204948 222638 241125 206433 204592
16874 204592 208120 200766 239404 217346 154908 105337 126333 82508 32979 64273 94331 76549
16862 76549 65198 123673 158689 195368 201892 114663 60728 68833 54946 39828 26887 52445
16850 52445 103312 167694 170946 172245 217554 248637 184850 83312 84753 128946 141688 125946
16838A25946J350M005q162J1352p049O3653M0845p2228q3507n2085L4883N6322
16826A15325k5280j7877p8099j2222K7558m7316n3282M3979O4894j0384O195O487
16814A9978L1295m506k4199O9488m3336m2349k2341j0085K1945m2562M1916M4730
16802C9974p2726n9920l657J00146K0622l8108L1208J6139l949m913Q4635L7720
16790A47171j8935m5449o6421k4504K5497R425k8731k7684l9057L8672k3927m708
16778e8651O5631K1882l9498R694J7672p0202J4235j7422j0775L4430J5125J7240
16766f39p2945L3935P5979k2773L5869l1794m8677j9613l0314l0290J6229N4460
16754d0573M5893N8861n436k3330k5561k495j9537j3240q0123j3796p816k793
$$ plain form
16838 125946 127296 131301 123139 134491 127442 191095 231940 159712 76205 24120 59003 115325
16826 115325 90045 72168 -5931 -18153 9405 -37911 -91193 -47214 17680 7296 13491 19978
16814 19978 51273 46767 22568 92056 48720 6371 -15970 -26055 -4110 -46672 -4756 39974
16802 39974 -32752 -92672 -96329 3817 24439 -13669 17539 33678 29729 24816 109451 147171
16790 147171 128236 82787 16366 -8138 17359 26784 -1947 -29631 -68688 -30016 -53943 -58651
16778 -58651 6980 28862 -10636 -942 16730 -53472 -39237 -56659 -67434 -33004 -17879 -639
16766 -639 -73584 -39649 36330 13557 49426 17632 -31045 -50658 -80972 -111262 -95033 -40573
16754 -40573 5320 64181 58745 35415 9854 7359 -12178 -25418 -105541 -119337 -127153 -129946
16742a29946N5315Q2450j0761j7283M2029k8766l9574J9557j2523L1318N7300
16731D9116k0314m2663R46K93r320K4306J8267M3953k2357K6416j2669l2452K6100
16718D9622O2613R209k5633K729m1176K617m2600l9385K0277M076K576L4070K8249
16705F7244l6720m2996n0880n4576M959J7647m0848J701J6129J0313J2790l0057
16693a25294O1564M4169m5785l9039N7651K3666J0463r143j2708M320r408P972
16681c1572J3366J5320p7364m8905M4834K9145j2688O2834L5420R102L0321N689
16669G5502l9114l8064r973L0267j3709m0234K8123J7684O8444M744m9583j8831
16657A5256n2486p709n484j8168J4774J2967j3147K442L0006k156Q888K8451l0224
$$ plain form
16742 -129946 -74631 7819 -2942 -20225 21804 -6962 -46536 -26979 -39502 -8184 49116
16731 49116 28802 -13861 -12915 -12622 -21942 2364 20631 64584 42227 68643 55974 23522 49622
16718 49622 112235 121444 95811 98540 57364 59981 17381 -22004 -1727 2349 4925 38995 67244
16705 67244 30524 -12472 -63352 -117928 -112969 -95322 -136170 -134469 -118340 -108027 -95237 -125294
16693 -125294 -63730 -19561 -65346 -104385 -46734 -23068 -12605 -21748 -34456 -30136 -39544 -31572
16681 -31572 -18206 -2886 -80250 -129155 -84321 -55176 -67864 -5030 30390 39492 69813 75502
16669 75502 36388 -1676 -11649 18618 4909 -35325 -7202 10482 78926 83670 34087 15256
16657 15256 -37230 -44939 -50423 -68591 -53817 -40850 -53997 -51555 -21549 -23705 -14817 13634 -16590
16644a6590p9947M2828L4577n4581j4688k7957o096L5058Q2592o380q6150l0023
16632a27357L5195L2854l9944m385j3853k860L5894m9053J9390P2451l8006n871
16620h5545j3308J5007J3778q336j1725O6134P3881k9550n2497K968k5114L6559
16608a7748N653j6139k2033j8391O9483K1997K0387k0759n6434p778J2441M188
16596b5133j9685M162k530m83K547O9314O3338m110J8404j9751K910L5666J5885
16583A40534j29601q7478P863N4826j0063l9577m9179l5687m531M2480L4003M0694
16571c5716k215N463j7972K4288O1932L7176j1862k6100l3094L2181N245k26k0932
16558A8168j8700o2949O218k544k8091J6830J577k4847r946j4587M469L65K3125
$$ plain form
16644 -16590 -96537 -53709 -19132 -73713 -88401 -116358 -122454 -87396 -4804 -11184 -97334 -127357
16632 -127357 -92162 -59308 -99252 -103637 -117490 -120350 -84456 -133509 -114119 -41668 -79674 -85545
16620 -85545 -98853 -83846 -70068 -78404 -90129 -23995 49886 20336 -32161 -29193 -54307 -17748
16608 -17748 -12095 -28234 -50267 -68658 825 22822 43209 22450 -33984 -41762 -29321 -25133
16596 -25133 -44818 -40656 -43186 -43669 -41122 28192 91530 87420 105824 86073 88983 124649 140534
16583 140534 10933 -76545 -68682 -13856 -23919 -63496 -112675 -148362 -152893 -110413 -76410 -35716
16571 -35716 -37931 -32468 -50440 -26152 35780 72956 61094 34994 1900 34081 39326 39100 18168
16558 18168 -532 -63481 -57263 -59807 -87898 -71068 -69491 -94338 -104284 -118871 -114402 -114037 -90912
16545i0912Q7162P4844l4938q7510o6083N941O8705J3752k2888J2016j0203K5673
16533b4441J9288L5742l1223l8566K5142l5835m3952Q562j886j1929K5869O0420
16521a2809j0232J2585M8804L3243J055l6085k8285k3883L0158N3421N011j3187
16509E9796o3937l2650p795M1995q806o8514J3017P7114Q751l9276J7849N488
16497C032n0521L5414N5094j4286K2903o618j4384n8889p4093K3896k1193R291
16485i0354m0535Q1161O6595J9174L8316K4097r834N749n7154j5901j9275K7765
16473B9804L0247O0674K776o6623l2733m2073K0982P6057M4269n942k8475J5027
16461A03990r489P1956J18200P155n8341o0194n3732l8644O414M3215n5564n9874
$$ plain form
16545 -90912 -3750 71094 36156 -51354 -117437 -111496 -42791 -29039 -51927 -39911 -50114 -24441
16533 -24441 -5153 30589 -634 -39200 -14058 -49893 -93845 -85283 -87169 -99098 -73229 -12809
16521 -12809 -23041 -10456 38348 71591 72646 36561 8276 -15607 14551 67972 72983 59796
16509 59796 -4141 -36791 -44586 -2591 -11397 -79911 -66894 10220 18971 -20305 -2456 3032
16497 3032 -47489 -12075 43019 28733 51636 45018 30634 -28255 -102348 -78452 -99645 -90354
16485 -90354 -130889 -49728 16867 36041 74357 98454 88620 94369 37215 21314 2039 29804
16473 29804 60051 120725 123501 56878 24145 -17928 3054 79111 123380 117438 88963 103990
16461 103990 94501 166457 284657 291812 233471 173277 119545 80901 87315 130530 74966 15092
16449A5092k0911L2159m9492M184O0396R516o96M4485N6413k6907m7058N684M6532
16436A29397K023N911O830n7122l3201l0906j3295l6985l93O9160Q5270k8456
16424I8233p869N6616J1007N204l0688o825J3113o0467l2890J8052N5962n0084
16412F9364j2238n5472n6203M0610L2962p459M345j2028L2987J4531o0826J3296
16400C869L6887J2855k8011k4041M7713M3093j2756l4623l3297o2694o0773L9985
16388g1793O1455k1810K4345J0106j5540j2415J0319K6215O1601j8869M623l4829
16376B3408n6393J2541l3337j1507m2319l0160P3413M9394m499r108M590j0496
16364c4473K652J7020J2826j6478m7808j737K3176M3023L6250k3636l1225k713
$$ plain form
16449 15092 -5819 26340 -23152 -18968 41428 50944 50248 94733 151146 124239 77181 82865 129397
16436 129397 131420 137331 144161 87039 53838 22932 9637 -27348 -27741 41419 126689 98233
16424 98233 90364 146980 157987 163191 132503 125678 138791 78324 45434 63486 119448 69364
16412 69364 57126 1654 -54549 -13939 19023 11564 15909 3881 36868 51399 -9427 3869
16400 3869 40756 53611 25600 1559 49272 92365 79609 44986 11689 -51005 -111778 -71793
16388 -71793 -10338 -32148 -7803 2303 -13237 -25652 -15333 10882 72483 53614 58237 23408
16376 23408 -32985 -20444 -53781 -65288 -107607 -137767 -64354 -14960 -19459 -28567 -23977 -34473
16364 -34473 -31821 -14801 -1975 -18453 -66261 -67998 -44822 -1799 34451 10815 -20410 -23123
16352b3123K7540m6137K7368M1454n7502k3898J5597L2761L0313o0610o2186l3016
16340a31439M6896J08086M6541j3097m0719j723p2514k8522J5183j4513O1126
16329b4695N0235M0523l2064p706k7464J5389m9447l9869o3091m168M2045J4536
16317h5776K8113Q930K5977K1419j146m2024k9605M7696L490m3321p603K6722
16305d7128Q2446K3388k2223J6760J6704l2644J7093l0570l6878O9914m1222q1069
16293f5429k7169n252N6986M0262j015n4733j3404M3178l419r71j1152L6000K9832
16280B3714L1727Q423k2288l5840N59p4216q7645k0484L1451P7136N7503q189
16268a8149l0567n1718p409K2319j1712N93N737O8362L5715k7920p3211j1666
$$ plain form
16352 -23123 4417 -41720 -14352 27102 -30400 -54298 -38701 -5940 24373 -36237 -98423 -131439
16340 -131439 -84543 23543 70084 56987 16268 14545 -57969 -86491 -71308 -85821 -24695
16329 -24695 25540 66063 33999 26293 -1171 14218 -35229 -75098 -138189 -142357 -100312 -85776
16317 -85776 -57663 -48733 -22756 -1337 -2483 -44507 -74112 -26416 -22926 -66247 -73850 -47128
16305 -47128 35318 58706 36483 53243 69947 37303 54396 23826 -13052 56862 15640 -65429
16293 -65429 -92598 -97850 -40864 -602 -1617 -56350 -69754 -26576 -29995 -30966 -42118 -6118 23714
16280 23714 55441 63864 41576 5736 6295 -67921 -155566 -176050 -144599 -67463 -9960 -18149
16268 -18149 -48716 -100434 -107843 -85524 -97236 -96643 -90906 -22544 13171 -14749 -87960 -99626
16256i9626L3719l8947j4477P3823K7173L798k062k2366J0157n971K391L9919
16244G531L547N173j8223l745k7697l3573P0180M8883k6668n2909L29N493l3723
16231e5402k4160k3400K3666K0055j4613N2055J9889j0037O100N7678M4912l8216
16219E8527m0436n671J0158p4437l967k1153j8698L4679J9199L5119N6824l1774
16207A8370k5141L3365j7022p6911P652n5137q2258K894J35200P6042k5228k7148
16195c5322M7460L5852k5394l2603o7407j2860O3604L5353k2717J1867o035k7283
16183c5485k3402J3479j2083L2995N1317l0139K0948O1316J376j3132m4285k8377
16171e472Q017m8071k7272n6353J5450O482N5900O6053K9472M72k9059m3565o502
$$ plain form
16256 -99626 -65907 -104854 -119331 -45508 -18335 -14537 -16599 -38965 -28808 -34779 -32388 7531
16244 7531 11078 16251 -1972 -5717 -33414 -66987 3193 52076 25408 -27501 -27172 -21679 -55402
16231 -55402 -79562 -102962 -79296 -59241 -73854 -21799 -1910 -11947 -5847 51831 96743 58527
16219 58527 18091 12420 22578 -51859 -55826 -76979 -95677 -60998 -41799 -6680 50144 18370
16207 18370 -6771 26594 9572 -67339 -59687 -114824 -197082 -194188 -58988 17054 -8174 -35322
16195 -35322 12138 47990 22596 -10007 -77414 -90274 -26670 8683 -14034 -2167 -8202 -35485
16183 -35485 -58887 -45408 -57491 -24496 26821 -3318 17630 78946 80322 67190 22905 -5472
16171 -5472 2545 -45526 -72798 -129151 -113701 -107219 -51319 14734 44206 44678 15619 -27946 -34448
16158c4448M664l6790K4338N8026K8765k472M4547j9710M4188r1130q0407J5787
16146d4642k173L7082L6615o5210j17469n4032o008J2191J4413L8841O2197O2684
16134b5511O1503L5155n238j1572K6925p152l5042l7599o2138Q219J18129K0001
16122H5680o1190j0839J81p4592K540N6982p2807n9188j7706M6124l538j3247
16110a21600J9276M4148L1372N0217J9821J1662m5109L5149o5347n7462j9516
16099i7389K9022P3298K7066j2155m5202m9757O7969N7415k6660q472K3157k9377
16087H915q052Q2480r671j13263n320M4109M0027K3573J944o9199m350J3487K8799
16074C3479o6915L6973K7086j7358r7886l3558O6450L0285m6128L1952k424l6207
$$ plain form
16158 -34448 -29784 -66574 -42236 15790 44555 42083 86630 66920 111108 19978 -60429 -44642
16146 -44642 -46815 -9733 26882 -38328 -155797 -209829 -215837 -203646 -189233 -150392 -88195 -25511
16134 -25511 35992 71147 65909 54337 81262 74110 39068 1469 -60669 -52450 65679 85680
16122 85680 24490 13651 13832 -60760 -58220 -1238 -74045 -133233 -150939 -104815 -108353 -121600
16110 -121600 -102324 -58176 -26804 23413 43234 54896 9787 44936 -20411 -77873 -97389
16099 -97389 -68367 4931 31997 19842 -25360 -75117 -7148 50267 23607 15135 38292 8915
16087 8915 863 83343 73672 -39591 -44911 -802 39225 62798 64742 -4457 -8807 4680 33479
16074 33479 -33436 3537 30623 13265 -84621 -118179 -51729 -21444 -67572 -35620 -38044 -74251
16062g4251r415o449J6229K3884O6917k4962m9342K8401N8867Jl8537l3177P0657
16049B8823k3959J9707N1917j7294n54L1961k1487m6174m075J6414l206K1748
16037E3821Q41j2627m3887O623K2295l8460j02667L989O2526O8430M5837K8252
16025I4973k8213n0188l9113J4408L619j7848j691n130k2165k1075J4096j5234
16013g3561P1792J6083m2365l6461L0485j5303q8973J4531O3910O6749N348k5483
16001a3248k5910M075q821Q421J097J0989k3876Q837P3645J4265j5182j2365K8398
15988E0325K5325J2203k7706j0916o299k3564m518m6745M178n0368N9843l561
15976b1803l5172j0854k049M1967P368L2449K10k0391j4766k2646J5184M181k7160
$$ plain form
16062 -74251 -83666 -90115 -73886 -50002 16915 -8047 -57389 -28988 29879 29880 -8657 -41834 28823
16049 28823 4864 24571 76488 59194 58640 90601 69114 22940 18865 35279 32073 53821
16037 53821 54662 42035 -1852 4771 27066 -11394 -114061 -110072 -47546 20884 66721 94973
16025 94973 66760 16572 -22541 -8133 -4514 -22362 -24053 -29183 -51348 -72423 -58327 -73561
16013 -73561 -1769 14314 -28051 -64512 -34027 -49330 -138303 -123772 -59862 6887 12235 -13248
16001 -13248 -39158 -35083 -43904 -35483 -34386 -23397 -47273 -38436 35209 49474 34292 21927 50325
15988 50325 75650 87853 60147 49231 42932 19368 14850 -31895 -27717 -78085 -18242 -21803
15976 -21803 -56975 -67829 -69878 -27911 -20543 11906 12116 -8275 -23041 -45687 -30503 -26322 -53482
15963e3482J0940j5406O845Q210K7449J1863q88m9384k4626j4346L5599L65m9971
15950a06832Q826O5978K2446j7273m0090l4045o371L8555P8994K3302j2474n5554
15938c4538K7034Q118n0587J3889L2672K678j2223p212L9623j8447o7862k3672
15926i0527M5742K1752o3468p9388k280N0028l8555K7549O4321O9195Q927M6889
15914F0185j5482p5450J4227n2677k5867P5595L4150L0442O688R097l132K1065
15902G8841n676M3857R672k7931n1380n2191K777L0112J0775j1599k8716n0674
15890e2133k8636J9760K1071O075o448k1339p79k4695R0598P6991k3583k4037
15878C2845p11L6774n2523m5806N1689j4194k3253M2618K2048k4139m2271p2453
$$ plain form
15963 -53482 -42542 -57948 -51103 -42893 -15444 -3581 -4469 -53853 -78479 -92825 -57226 -56861 -106832
15950 -106832 -98006 -32028 -9582 -26855 -66945 -100990 -107361 -68806 10188 33490 21016 -34538
15938 -34538 -7504 614 -49973 -36084 -3412 -734 -12957 -20169 19454 1007 -66855 -90527
15926 -90527 -44785 -23033 -86501 -165889 -168169 -118141 -156696 -129147 -64826 4369 13296 60185
15914 60185 44703 -30747 -16520 -69197 -95064 -19469 14681 45123 51811 60908 57776 78841
15902 78841 73165 117022 126694 98763 47383 -4808 -2031 28081 38856 27257 -1459 -52133
15890 -52133 -80769 -61009 -39938 -33863 -40311 -61650 -62429 -87124 3474 80465 56882 32845
15878 32845 32134 68908 16385 -29421 22268 8074 -15179 27439 49487 25348 -16923 -89376
15866h9376P195O2944O8348K9566n2062l1039p0626M3800K140l928K6723K3518
15854A7203j960m754m6103o4530m132K7292j849J4174M6576j478p298K4372j3376
15841a5863O879o474O414q885L4347k29K5808j6645p263k2223l9748R660j8829
15828e3051m2806j7323P796N415N5822P4495l8473n2792Q714k7485J1556M3681
15816b4451j182J6549P801J0512j2970K8851M633l1686l3181M9731O2359J8384
15804I5350l4890q7556n328K2763J0083K5023L128K8651n585m92j13706o6254
15792a28813K1980O5831M8293m6124Q750N0670l5977m6332j2099k448q374k2460
15780a07103K0311l9515L0828J1756j4850P1841L0572j1178J2580o0556l4776
$$ plain form
15866 -89376 -82181 -19237 49111 78677 26615 -4424 -75050 -31250 -29110 -33038 -6315 17203
15854 17203 15243 10489 -35614 -100144 -104276 -76984 -78833 -64659 -18083 -19561 -26859 -2487 -15863
15841 -15863 -8984 -15458 -9044 -17929 16418 16189 41997 25352 18089 -4134 -43882 -34222 -53051
15828 -53051 -95857 -113180 -105384 -99969 -44147 30348 -8125 -60917 -52203 -79688 -68132 -24451
15816 -24451 -25633 -9084 -1283 9229 -3741 25110 29743 -1943 -35124 14607 76966 95350
15804 95350 60460 -27096 -32424 -9661 422 25445 28573 57224 51639 51147 -62559 -128813
15792 -128813 -106833 -41002 7291 -38833 -30083 20587 -15390 -61722 -73821 -76269 -84643 -107103
15780 -107103 -86792 -126307 -95479 -83723 -98573 -26732 3840 -7338 5242 -55314 -90090
15769i0090O6150L2586l4888M3015J1511l8073p0548j9940l1997K2555J1786J1102
15757h6831n3835Q1201M4425N3385M783J4185O1256J7178n7295N916j9764r0926
15745b6322n1535j8109r053J9874L7140O5127j0196l3026j9938J3242m6195p750
15733h6741K4776O2173K2343n088j1594j1356m316K2373M535Q646J6143m3846
15721a952o2470L6274M2316k994P662k0160M89K2421l2848k5299M2809k378j03120
15708i9250J1904j6010l3584K0942l291J3396O4426O8792j4864q746K3731k0330
15696G116k1476j3479Q724o3019j0139O905O0384N6879K2258j2734j4774l2605
15684e960m0007j4266M6712M4933m2279m0027O7568P418m8318l8568n8862J0316
$$ plain form
15769 -90090 -23940 8646 -26242 16773 28284 -9789 -80337 -100277 -132274 -109719 -97933 -86831
15757 -86831 -140666 -59465 -15040 38345 43128 57313 118569 135747 78452 84368 64604 -26322
15745 -26322 -77857 -95966 -105019 -85145 -48005 17122 6926 -26100 -46038 -32796 -78991 -86741
15733 -86741 -61965 208 22551 17463 5869 -5487 -9803 12570 17105 25751 41894 -1952
15721 -1952 -64422 -28148 14168 11174 18836 -1324 -835 21586 -11262 -36561 6248 3870 -99250
15708 -99250 -87346 -103356 -136940 -115998 -119289 -105893 -41467 27325 12461 3715 27446 7116
15696 7116 -14360 -27839 -19115 -82134 -92273 -85368 -24984 31895 54153 41419 26645 -5960
15684 -5960 -45967 -60233 -13521 31412 -10867 -50894 16674 24092 -24226 -62794 -121656 -111340
15672a11340L3889K3750K2277K8463j1314j6129J6853M7773J6808K0378m093K9749
15660I7064k7923m4103r129n383n0034k7591j8200J1591k2382L3036J280p281
15648f9055M4447N7974j0644m4922j0198Q430Q0838p974o4131J0865n4268p1986
15636a30624q470m8642L6924P8952P8586L0270k1182P124L6297j0120J7343K0329
15624H6787n3977j8752K5161J6042p616N12P15k5280m1978n0617P974K2794N8374
15611B0139o528n3023J8743K8618L2252p689l735J9255K6012j7005l4515p225
15599A5299L5158K4144M0296j3045q0927n3513l1053n792m2162L0893O7165K7882
15587A4345p265p2296J3677J9282l4295J5072M5193N2019N7891Q201j1826q8762
$$ plain form
15672 -111340 -77451 -53701 -31424 -2961 -14275 -30404 -13551 34222 51030 71408 67315 97064
15660 97064 69141 25038 15909 10526 -39508 -67099 -85299 -73708 -96090 -63054 -61774 -69055
15648 -69055 -24608 33366 22722 -22200 -32398 -23968 56870 48896 -15235 -4370 -58638 -130624
15636 -130624 -139094 -187736 -150812 -71860 6726 36996 15814 22938 59235 49115 66458 86787
15624 86787 32810 14058 39219 55261 47645 48157 48872 23592 -18386 -69003 -61029 -38235 20139
15611 20139 13611 -39412 -20669 7949 40201 32512 28777 48032 74044 57039 22524 15299
15599 15299 50457 74601 114897 101852 20925 -32588 -63641 -69433 -111595 -80702 -13537 14345
15587 14345 7080 -65216 -51539 -32257 -66552 -51480 -6287 45732 103623 111824 99998 11236
15575A1236l2787P467J744j9649q4497K1285P365k5081K6718P528K3472m0709
15563i5908n1679j9970J1968K1431J5421j8708K3291J8112p202J5750J4305J3314
15551e9875K133l0817L9584K0989L5380k0639m4665M9616M6431q370r013j5484
15539E270L4719j9513j6796M4845L827l2682p3732q9217P0441L9382J6053L929
15527a3474K2264k443p665R132j803k1389O234m1887n981M4279Q8933L3722k1581
15514H8341j6577j7545l8915k062M6410M8799m4771q0788J09M0530K7796j5726
15502C5601q953m7778k8651m9103Q311N0904N9858O9082m0120l8675L8590L8314
15490H7380l345J1441k1886l3115p641K8191p0851k5124K0195L282Q873k5586
$$ plain form
15575 11236 -21551 -14084 -12340 -31989 -116486 -95201 -87836 -112917 -86199 -78671 -55199 -95908
15563 -95908 -147587 -167557 -155589 -134158 -118737 -137445 -114154 -96042 -103244 -87494 -73189 -59875
15551 -59875 -57742 -88559 -48975 -27986 7394 -13245 -57910 -8294 38137 29767 20754 5270
15539 5270 39989 20476 3680 48525 52352 19670 -54062 -143279 -72838 -33456 -17403 -13474
15527 -13474 8790 6347 -1318 7814 6011 -15378 -9144 -51031 -57012 -12733 76200 109922 88341
15514 88341 71764 54219 15304 13242 59652 108451 63680 -17108 -16999 23531 51327 35601
15502 35601 26648 -21130 -49781 -98884 -90573 -39669 20189 89271 49151 10476 49066 87380
15490 87380 84035 95476 73590 40475 32834 61025 -9826 -34950 -14755 -11473 -2600 -28186
15478b8186O332J177M3777O201n8583l2758n9780j8905L8925O9492P173l9832
15466f4967l6956M1482M6525J7534q315R107l6798l5062L6831j814J9625L5784
15454B2976k4380p6964N3699L3587J6772L0116N8866l0260j05676O834N0407O0461
15442I6438k4852q5438j888L2121q005R345K7161J04O598K6216m3369J0561J2200
15429E7192n3986l1428p5676p474Q7368L6109K8075n1085j5808J0591K1138l527
15417A489k9996j9540p790k5108r93L3145N5794J2575o3191N1905O0059J5309
15405H3658n2656m6261J2601K0584L5263l2183n7899l8074L3463K9487K4672O5524
15393G8179K3620n6204k4844r463o344P731N9231J5950o1930m5556j4015j0467
$$ plain form
15478 -28186 -21854 -20677 23100 29301 -29282 -62040 -121820 -140725 -101800 -32308 -25135 -64967
15466 -64967 -101923 -60441 -13916 3618 -4697 4410 -32388 -67450 -30619 -32433 -12808 22976
15454 22976 -1404 -78368 -24669 8918 25690 55806 114672 84412 -21264 -14430 35977 96438
15442 96438 71586 -13852 -15740 16381 8376 17721 44882 44986 51584 77800 34431 44992 57192
15429 57192 3206 -28222 -103898 -111372 -24004 12105 40180 -10905 -26713 -16122 5016 1489
15417 1489 -28507 -48047 -55837 -80945 -81938 -48793 7001 19576 -43615 8290 68349 83658
15405 83658 31002 -15259 -2658 17926 53189 21006 -36893 -74967 -41504 -12017 12655 78179
15393 78179 101799 45595 20751 11288 4944 12675 71906 87856 25926 -19630 -33645 -44112
15381d4112K4727M9184j7986M18l534l7263m9188j5281O4720J9981k9606L9936
15369A996P0203N2140k2942J1964M3347n3289p7883n6881l8142k3616P1677M6550
15357B5124O100p2174l4887J049M2789l3441p2745J4232L4058K5953R273M0185
15345a4484N6823K1018o7057J0133N4044L0955l4979n0037o3659m9535j2909j3364
15333a33051K4471P0843K3123q324K2759J1951n8967k6759k6395l427M6644P899
15321d9233j614L2941L9425k6549j0688P5673p9163l9335l3851k3087L3922p625
15309h9184k3222M3861J7885M3883J9166m7880n4672K2098N6859k4169J1471l232
15297b7136j6695p772Q4605M8974j4300o9071J341K46k8965q272R739K9819k4677
$$ plain form
15381 -44112 -19385 29799 11813 12231 8697 -28566 -77754 -93035 -28315 -8334 -37940 1996
15369 1996 72199 124339 101397 113361 156708 103419 25536 -31345 -69487 -93103 -21426 25124
15357 25124 31224 -40950 -75837 -74788 -31999 -65440 -138185 -123953 -89895 -63942 -54669 -14484
15345 -14484 42339 63357 -3700 6433 60477 91432 56453 6416 -57243 -106778 -119687 -133051
15333 -133051 -108580 -37737 -14614 -22938 -179 11772 -47195 -73954 -100349 -103776 -57132 -49233
15321 -49233 -50847 -17906 21519 -5030 -15718 59955 -19208 -58543 -92394 -115481 -81559 -89184
15309 -89184 -112406 -68545 -50660 -6777 12389 -35491 -90163 -68065 -11206 -35375 -23904 -27136
15297 -27136 -43831 -51603 33002 81976 67676 -1395 -54 192 -28773 -37045 -27306 2513 -22164
15284b2164p2170M5534L1087K3712j2708j8151k6918k4815l1407O2953O0534j1150
15272D337l6056K2308K3406K9734K6741j1247m8521j7724M3471J0617j0307j3016
15260B3743k0666L4691r04N904j0807J5714J3190k8847l6616m1288m4085K5189
15248f4782k2002P007m372K7739J9290J3448n275m9627M2864P2975P6011k8357
15236H4919o1885k3878n0034L2017J1939N6570M035k2426k6561K3794n2159j5878
15224c9547j4135M945N1806j3533K439j0229l1831r8832L7678J0099o441M880
15212a02701K8016K9686L1549J4131k1402j7837J4416L286M6389J5672j295j6396
15200B3514l0217n1306m4062L5428P4265R465m484J6392k4149l3056j4913J5398
$$ plain form
15284 -22164 -94334 -48800 -17713 5999 -6709 -24860 -51778 -76593 -108000 -45047 15487 4337
15272 4337 -31719 -9411 13995 43729 70470 59223 10702 -7022 36449 47066 36759 23743
15260 23743 3077 37768 36864 42768 31961 47675 60865 32018 -4598 -45886 -89971 -64782
15248 -64782 -86784 -79777 -84149 -56410 -37120 -23672 -28947 -78574 -35710 37265 113276 84919
15236 84919 23034 -844 -50878 -18861 -6922 49648 53683 31257 4696 28490 -23669 -39547
15224 -39547 -53682 -48737 3069 -10464 -8025 -18254 -50085 -148917 -111239 -101140 -107581 -102701
15212 -102701 -74685 -44999 -13450 681 -20721 -38558 -24142 -20856 25533 41205 39910 23514
15200 23514 -6703 -58009 -102071 -66643 7622 17087 12603 28995 4846 -28210 -43123 -27725
15188b7725J0475J0897o18n042P0492J9027L3488k9174p6753k3176k2888q988
15176d9985M8465K7861J6662p2088o0588M4885L8537L4830J2281o81K2867k589
15164F0457J0589n6378l31L7807K412n4197n2835k8273M3863J1265j969O4171
15152C6581L8766M155n5140m2542P240p297L8011L2509L731M452l2439Q432r183
15139B7276k6230J6392M9875M8064m1249j02370k4513P702l8126K8002O2610L8390
15127D5823k7916l1099L7824L3799J9818q703k8003M2984k1301k4077j8191j0545
15115A0413k7278K8955N765j172M0187n1021o1762K9839j7025K4704N568O2835
15103E0008N4717m1976k2574L4907L6288n4411r8052m045M3365O241R716K48l554
$$ plain form
15188 -27725 -17250 -6353 -6971 -12013 58479 77506 110994 81820 5067 -18109 -40997 -49985
15176 -49985 -1520 26341 43003 -29085 -89673 -44788 -6251 28579 40860 40179 63046 60457
15164 60457 71046 14668 14337 52144 54556 359 -52476 -80749 -36886 -25621 -27590 36581
15152 36581 75347 79502 24362 -18180 -10940 -18237 19774 52283 56014 60466 28027 36459 27276
15139 27276 1046 17438 67313 115377 74128 -28242 -52755 -45053 -83179 -55177 7433 45823
15127 45823 17907 -13192 24632 58431 78249 69546 41543 84527 63226 39149 20958 10413
15115 10413 -16865 12090 17855 16683 56870 5849 -55913 -26074 -43099 -18395 -12827 50008
15103 50008 104725 62749 40175 75082 111370 56959 -41093 -45138 -1773 4468 14184 14432 10878
15090A0878k5498k2905j8270j5293k8428L0608O2322K980n0214J0815J8900K3139
15078i66K4879l3341O2262k6012k3562L3957M2605m924l6739M9612p0246m7566
15066c0041N7469l4090m4629O0843r429o393M731r638n7786o6164J5777J9588
15054i9762M4725O6296O0948n2939r2985l9225q247N7748M8132N7839L4080p5621
15042I89j24221J9983N9219M9800P242J6919j862j2876k4183J8608m517j7438
15030a2337j0859Q065J9961l2589n7287J4858L4041L491j7843j4013l6269k8307
15018a29088k6275L2142L4876N9630n473m6983L0439K2547j6440n8205j987L8034
15006f6783M5819M6647j9448l8765M0253N6798R897J109Q867j4246m9987j0253
$$ plain form
15090 10878 -14620 -37525 -55795 -71088 -99516 -68908 -6586 -3606 -53820 -43005 -24105 -966
15078 -966 23913 -9428 52834 26822 3260 37217 79822 74898 38159 87771 17525 -30041
15066 -30041 27428 -6662 -51291 9552 123 -6270 -1539 -11177 -68963 -135127 -119350 -99762
15054 -99762 -55037 11259 72207 19268 -73717 -112942 -121189 -63441 -15309 42530 76610 989
15042 989 -123232 -103249 -44030 5770 13012 29931 28069 15193 -8990 9618 5101 -12337
15030 -12337 -23196 -15131 4830 -27759 -85046 -70188 -36147 -32656 -50499 -64512 -100781 -129088
15018 -129088 -155363 -123221 -88345 -28715 -34188 -81171 -50732 -28185 -44625 -102830 -104817 -66783
15006 -66783 -20964 25683 6235 -32530 7723 64521 74418 75527 84394 70148 20161 9908
14994I908M4642M9576K9545m5703m4422J6600l1143n5681M5611J0643p9027j1849
14982f1300J0168J8191m9322N1548P2667k9872m0559R471q0342n670p332m008
14970a16360O6526K7018k1326Q822j497j4117O7023K2876j3314k744L650k9587
14958c030k9893O849K4121L719K8476Q783n4064q8472M658M2900R3494L5953O982
14945H0476l6202l7680m3896l8460k446J8964l9939J1056N8985M3867L4818N901
14933E5444j5421k6143k0420K2535j6695k9979n9225P5996L4898n1122J4395L1931
14921A6194m074n9531k6941N6202K1015l7072j1991K8951M0405k4866p0221J4472
14909e7457n2570l7371K1066R868K3212N9124M3166K1465k6619m1638l9526p795
$$ plain form
14994 9908 54550 104126 133671 87968 43546 60146 29003 -26678 18933 29576 -49451 -61300
14982 -61300 -51132 -32941 -82263 -30715 41952 12080 -28479 -19008 -99350 -105020 -112352 -116360
14970 -116360 -49834 -22816 -44142 -35320 -36817 -50934 16089 38965 25651 22907 26557 -3030
14958 -3030 -32923 -26074 -1953 1766 30242 39025 -15039 -103511 -98853 -55953 37541 73494 80476
14945 80476 44274 6594 -37302 -75762 -78208 -59244 -99183 -88127 -29142 14725 49543 55444
14933 55444 40023 13880 -6540 15995 -700 -30679 -89904 -13908 20990 -30132 -15737 16194
14921 16194 12120 -47411 -74352 -18150 2865 -34207 -46198 -17247 23158 -1708 -71929 -57457
14909 -57457 -110027 -147398 -126332 -116464 -93252 -34128 9038 30503 3884 -37754 -77280 -85075
14897h5075K2119j9485J9825L3241M75k2969k9376K9678j3935O1585L6385J2685
14885D5153N772K5696L660n5624J7438M0422K637l1134l8912J9234M5601L746
14873H3689n6754j10602o159L878O9777N5707m011P974j4576l803k7102k1762
14861b3744J6668p2732l5072P5253J9232j2830j8966k6529M7198L7074o8251N500
14849e7199K17L1314J7994l2823K6708Q165l050M460K1558q453Q018L2746p1628
14836b1973o3888J6826k2812O832M4368J6285J5511P6229N1787k3795j5757j8433
14824F1180n1344m6586J2649N8559K1073Q705N614j7997l8807l78m8254J9032
14812a6554k32J9790J8786j6133K4824m4680p8048m1758M9801N300j3975L5437
$$ plain form
14897 -85075 -62956 -82441 -62616 -29375 -28900 -51869 -81245 -51567 -65502 -3917 32468 45153
14885 45153 50925 76621 80281 24657 42095 82517 85154 54020 15108 34342 79943 83689
14873 83689 26935 -83667 -89826 -85948 -16171 39536 35525 43499 28923 25120 -1982 -23744
14861 -23744 -7076 -79808 -114880 -39627 -20395 -33225 -52191 -78720 -31522 5552 -62699 -57199
14849 -57199 -56982 -25668 -7674 -40497 -13789 -5624 -8674 -4214 17344 8891 16909 49655 -21973
14836 -21973 -85861 -69035 -91847 -85015 -40647 -24362 -8851 67378 119165 95370 79613 61180
14824 61180 9836 -36750 -24101 34458 55531 64236 69850 51853 13046 12668 -35586 -16554
14812 -16554 -16786 3004 21790 5657 30481 -14199 -92247 -134005 -84204 -78904 -92879 -57442
14800e7442N3898K4300P7735l4800o3229j7819P677L2048k5152j5072J3760p17
14788d813k2484P088M1406J6852q985k2409n2785k6110L0363k8787m3079K7319
14776h6424L594M2580P5206Q103l8759j9534N4401k5943k8669K739L2537j3989
14764E842l000n190j7930K083k9469L7274P256j2585K5807Q926k1123l5563L9079
14751A407M3654o9561m459O0957r74m6241N81l2557J4496J1682o0409N341R8377
14738B2294O9420m8189l5157k2264n3051J9490J0854m6701j0919L3170k077k0266
14726h3396N5144M4380K6878L7222L2496J8475m7540r1693P102J4713N402L2339
14714E1522p192l1566p883N6819J5326m0124k2528k7956k0003K071P3193k6511
$$ plain form
14800 -57442 -3544 20756 98491 63691 462 -17357 -9680 22368 -2784 -17856 -4096 -4813
14788 -4813 -27297 -20209 21197 38049 29064 6655 -46130 -72240 -41877 -70664 -113743 -86424
14776 -86424 -82830 -40250 34956 43059 4300 -15234 39167 13224 -15445 -12706 19831 5842
14764 5842 2842 -2348 -20278 -18195 -47664 -10390 -3134 -15719 10088 19014 -2109 -37672 1407
14751 1407 45061 -24500 -28959 31998 31024 -15217 -14636 -47193 -32697 -21015 -81424 -76083 22294
14738 22294 91714 43525 8368 -13896 -66947 -47457 -36603 -83304 -94223 -61053 -63130 -83396
14726 -83396 -28252 16128 43006 80228 112724 131199 83659 -8034 -932 13781 19183 51522
14714 51522 44330 12764 4881 61700 77026 36902 14374 -13582 -33585 -31514 41679 15168
14702A5168j5602J7481M533q664k971k2812l3177k4211k9984l0147r565L8975
14690a00976N7498l4578j3245L0443M4178K9951k4133J8620M6703Q659J2027k3124
14678E2023m3491n3433Q993Q455j4678N0906L20o163J984m0392k6479j7169M2922
14665c6202j1691j5492n38R670l4836M3046N1574j6152O773L1240j5686o3087
14653e1381l5616O3701J14646k1714m8592m7399K3104n7852j2122K6910J2766
14642c3549j1311l6749M1752J0339M5498N4872K8623K1136m9075J5340K884o3276
14630B6484o8656j4508L2423J1225L0638k1584l9943J6407K1251j0278J7537M430
14618E426l3293j2784L9230J1747n7750n0261P345M9476K2055L7969k4136k0404
$$ plain form
14702 15168 -434 17047 21580 12916 9945 -12867 -46044 -70255 -100239 -130386 -139951 -100976
14690 -100976 -43478 -78056 -91301 -60858 -16680 13271 -10862 7758 54461 63120 75147 52023
14678 52023 8532 -44901 -35908 -27453 -42131 8775 9095 2932 4916 -35476 -61955 -79124 -36202
14665 -36202 -47893 -63385 -63923 -54253 -89089 -46043 5531 -10621 -3848 27392 11706 -51381
14653 -51381 -86997 -23296 91350 69636 21044 -26355 -3251 -61103 -73225 -46315 -33549
14642 -33549 -44860 -81609 -39857 -29518 15980 70852 99475 120611 71536 86876 89760 26484
14630 26484 -42172 -56680 -24257 -13032 17606 -3978 -43921 -27514 -6263 -16541 996 5426
14618 5426 -27867 -40651 -1421 10326 -47424 -97685 -90340 -40864 -18809 19160 -4976 -25380
14606b5380J3256p425J8296L6062j8844O414p306r433J8423K8828j1352q6463
14594d4924m0195O3036L5554k0283K0475p191j97J282R111m8253K78J3937K0477
14581C107L901n6909J5768M510J7640j38k6648J6323K1311K0738l0349k9566r0502
14568a30814l015q904n937M9655K7858o1207k0862L5919K9315l3866Q291N108
14556a08459o0021K3379N7123K826J4158L7395J8775j2216p0034j8371O7135k5960
14544g4270p288k9449j0347M1238N6451q277K4861P537l0883J1697L8115j8276
14532A109R020N161K2398J393J3854L0464J5799l9947j7176m002o6944K0404L9914
14519C1447N630q9970l4906L7506j5761k7504Q118K3641J3071n2876N79L4807
$$ plain form
14606 -25380 -12124 -19549 -1253 34809 15965 22379 15073 5640 24063 52891 41539 -44924
14594 -44924 -85119 -22083 13471 -6812 13663 6472 6275 7557 16668 -31585 -31307 -17370 3107
14581 3107 7008 -49901 -34133 -29623 -11983 -12121 -38769 -22446 -1135 19603 -10746 -40312 -130814
14568 -130814 -133829 -142733 -148670 -99015 -71157 -132364 -153226 -117307 -87992 -121858 -113567 -108459
14556 -108459 -168480 -145101 -87978 -85152 -70994 -33599 -14824 -27040 -97074 -115445 -48310 -74270
14544 -74270 -81558 -111007 -121354 -80116 -23665 -31942 -7081 456 -30427 -18730 19385 1109
14532 1109 10129 15290 37688 39081 52935 83399 99198 59251 42075 38073 -28871 -8467 31447
14519 31447 37077 -52893 -87799 -50293 -66054 -93558 -85440 -61799 -48728 -101604 -101025 -66218
14507f6218k4338k3709L3421q365J5661J2116N9229l6988l5647L2272L6325k4354
14495c0595m0498l2141K4313L9751N2447M2883N396l3893o0786m5935K1472j2860
14483g0446l1558M2726L440q476j023k3634L3289K3825m1742k1856l0149N6567
14471f9037Q5883N7709M2189q089n223j04797m4635N7605l2872k9409P802O1044
14459A8170M3114j3951k4406K6479J2722J371o867N38R246j1416n271K4891m1266
14446C3354R281p6233k6599Q0584M6403n0551l2763N9883N3022m314m5740M1543
14434H7870J2487m5776p0393j6292M0845J5466L8892k2657r966K8590R108Q096
14422G6270j9233j085l8708N755k6346l5943J7023P2702N9769J2806o0202K246
$$ plain form
14507 -66218 -90556 -114265 -80844 -89209 -73548 -61432 -2203 -39191 -74838 -42566 -6241 -30595
14495 -30595 -71093 -103234 -78921 -39170 13277 56160 61556 27663 -33123 -79058 -57586 -70446
14483 -70446 -102004 -59278 -55838 -64314 -65337 -88971 -55682 -31857 -73599 -95455 -125604 -69037
14471 -69037 16846 74555 116744 108655 103432 -1365 -46000 11605 -21267 -50676 -42874 18170
14459 18170 61284 47333 22927 49406 62128 63499 56632 57170 66416 55000 49729 74620 33354
14446 33354 42635 -33598 -60197 20387 66790 16239 -16524 43359 96381 92067 46327 87870
14434 87870 100357 54581 -15812 -32104 8741 24207 63099 40442 30476 59066 68174 76270
14422 76270 57037 55952 17244 22999 -3347 -39290 -22267 50435 110204 123010 62808 65054
14410F5054J5787M217m7960o747K0402L4395O054p916K2636m3224o9047m0476
14398d6825k0869L1006M5865K216K2577m2128q6524J2250k635l325M0121J3897
14386c4374L3526M9496j3390k4634m5874L669N2582M8573j5150j9223j1575l8533
14374a4907p6493J6671J2039l2759r291J3118R0196R2763K6729o3619k7387J5151
14362D2211M475p6813l7964N9363K0858j7916M4162J5532l0954J404N4056O074
14350H4488l4153k9221l0739o4034J4591M8681K9719j5148K5565J6911L640j18635
14338f8335p4654M9118J07868k0092l4477j2936k5528P6673O0701L2710n6992
14327C4056n9190K8004m3670j9920J2969K0839M0167L6501l2172l9784L6106M5813
$$ plain form
14410 65054 80841 85058 37098 30351 50753 85148 91202 83286 105922 62698 -6349 -46825
14398 -46825 -67694 -36688 9177 11393 33970 -8158 -94682 -82432 -85067 -88392 -48271 -34374
14386 -34374 -848 48648 35258 10624 -35250 -31581 21001 69574 54424 35201 23626 -14907
14374 -14907 -91400 -74729 -62690 -95449 -104740 -91622 -1426 91337 118066 54447 27060 42211
14362 42211 46686 -30127 -68091 -8728 12130 -5786 38376 53908 22954 24358 78414 84488
14350 84488 50335 21114 -9625 -73659 -59068 -10387 19332 4184 29749 46660 50300 -68335
14338 -68335 -142989 -93871 13997 -6095 -40572 -53508 -79036 -2363 58338 91048 34056
14327 34056 -25134 2870 -40800 -60720 -47751 -26912 13255 49756 17584 -22200 13906 59719
14315E9719l7771n248L3917l8649k5047K9992q005N5490M1972n6789k2248N4043
14303H1376m6491l1240l0860o7886K9106J16868m77l5683l7892M4976k322m2007
14291b2532K5889n034J0487L3028J9634j2011j7046N6415L2788r5179j9335N4590
14279F1694l7010J9146n621O9898O3541k9645l7493K3181q831j4202J3398J0992
14267A29048k1395m5693j3989m9866k6212K7546L8626l2794k943l4730K7428j7734
14255b2708k7233L9991O419k4805P8132l8352o1629O698j9961q864j0158J2279
14243g0191M9554O5657J9210m1459j00990J4974L1475j2918J9883N2975M2167
14232G0337n8927P357M4689J5683k9235j8415k7369L5376Q766m4427j7503J4390
$$ plain form
14315 59719 21948 16700 50617 11968 -13079 16913 8908 64398 106370 49581 27333 81376
14303 81376 34885 3645 -27215 -95101 -65995 50873 50396 14713 -23179 21797 19475 -22532
14291 -22532 3357 -1677 8810 41838 61472 49461 32415 88830 121618 26439 7104 61694
14279 61694 24684 43830 38209 108107 171648 142003 104510 127691 118860 104658 118056 129048
14267 129048 107653 61960 47971 -1895 -28107 -561 38065 5271 2328 -32402 -4974 -22708
14255 -22708 -49941 -9950 -3531 -28336 49796 11444 -50185 -43487 -63448 -72312 -82470 -70191
14243 -70191 -20637 45020 64230 22771 -78219 -63245 -31770 -44688 -24805 28170 70337
14232 70337 11410 18767 63456 79139 49904 31489 4120 39496 48262 3835 -13668 722
14220G22J5061L4473j0753n4511J7081O8663M759n4785L060L9157J6687O11q4227
14207d002J174M7682M3881k4359l7509j0882j5713O107N7109N1460k3934J6293
14195A07307r393j4910r374o5236p6852R887l0294l2630Q7683N1132K0239K5491
14183F3050o854j9150l8281j9172K885Q149k7042k1532J36j8502k7622M0760L5140
14170b8035M0287n558L6187k3732L8034K2719p207r257M7395k1898j7994n2469
14158A8472j7010L3307K4191o0465k8879r328J4685o905M2445J263j1042K9551
14146C0285K198J8656l8093J4556L6526M4354J0492n3679j5385L456k3654l8509
14134h797K3627J1936j3992M4316L2179j3318k7890q742M3966k0096N341N5261
$$ plain form
14220 722 15783 50256 39503 -15008 2073 70736 75495 20710 23770 62927 79614 80225 -4002
14207 -4002 -2828 44854 88735 64376 26867 15985 272 6379 63488 114948 91014 107307
14195 107307 97914 83004 73630 8394 -68458 -58571 -88865 -121495 -33812 17320 37559 63050
14183 63050 56196 37046 -1235 -20407 -17522 -9373 -36415 -57947 -57811 -76313 -103935 -63175 -28035
14170 -28035 12252 6694 42881 19149 57183 79902 72695 63438 110833 88935 70941 18472
14158 18472 1462 34769 58960 -1505 -30384 -39712 -25027 -31932 10513 11776 734 30285
14146 30285 32483 51139 13046 27602 64128 108482 118974 65295 49910 53366 29712 -8797
14134 -8797 14830 26766 12774 57090 89269 75951 48061 39319 83285 63189 68530 123791
14122A23791l8786m2266q067R237l7107j5878K2716n8417R104M8649p71k6832
14110a4627l0783L7819J2119l9679L7196K2390M3317K7008m1994j8560K7695j2169
14098D9732K762l4355k5987p202R623M0283o0590L1247N8472j534m984l3809k3681
14085b3j185J8529j8359l1658M6235j5499j740n678o2128l6074L3975K9483J0104
14072c4018J1583k1614K1646R076L5704K6906l7282k88N1405M037J121l4064p2580
14059c8368n0521L6568L2415Q265K9225J4002m0055J0101K4384Q6856J2529n5350
14047G0051k0458m0668M1051M1472o0468n6364o9589J5033L6640j9047L0725j01792
14035a33414K272O2731O5804P9687J4489l9656l5406q624K9284N096p7847j2187
$$ plain form
14122 123791 85005 42739 34672 43909 6802 -9076 13640 -44777 -35673 12976 12205 -14627
14110 -14627 -45410 -7591 4528 -35151 2045 24435 67752 94760 52766 34206 61901 49732
14098 49732 52494 18139 -7848 -15050 -5427 34856 -25734 5513 63985 62451 57467 23658 -23
14085 -23 -1208 17321 -1038 -32696 13539 -1960 -3700 -9378 -71506 -107580 -73605 -44122 -34018
14072 -34018 -22435 -44049 -22403 -13327 22377 49283 12001 11713 63118 67155 68276 34212 -38368
14059 -38368 -88889 -52321 -19906 -11641 17584 31586 -8469 1632 26016 112872 125401 70051
14047 70051 49593 8925 49976 91448 30980 -25384 -94973 -79940 -43300 -62347 -31622 -133414
14035 -133414 -131142 -68411 -2607 77080 91569 51913 16507 7883 37167 42263 -35584 -47771
14023d7771J3960J3251P4880j4572L6671m0896J567J1404m4897n088K357L7326
14011C8192P5314Q962k6964j8785p0428q6322p3768K6342J01683O8219k9200p5304
13999f2059J9356L5438L1786K8088L8609K8948l6311k3597n196l1428n8149l323
13987c7838J8786J7465O9758k2083m4581L024j7225J7218K989r898K9806O2855
13975I0276M0915n9198p8614J0727L1683m6308k3892L5359o919k0966n4318k4547
13963a05802K3547O4477O1403N3503k6824m932Q485o8807l8137L1469N2348k2388
13951B8342r208l1850K5912K5089n724L7688k480m6464p152n5622K0283l524o9803
13938i4513J5721N7634L6919K2901N5183L982j2207L4865q0130l3438N7447k1296
$$ plain form
14023 -47771 -33811 -20560 54320 39748 76419 35523 37090 48494 3597 -1491 866 38192
14011 38192 113506 122468 95504 76719 6291 -80031 -153799 -127457 -25774 42445 13245 -62059
13999 -62059 -42703 -7265 24521 52609 91218 120166 83855 60258 55062 23634 -34515 -37838
13987 -37838 -19052 -1587 68171 46088 1507 4531 -12694 4524 7513 -2385 27421 90276
13975 90276 131191 71993 -6621 4106 35789 -10519 -34411 948 -5971 -26937 -81255 -105802
13963 -105802 -82255 -17778 43625 97128 70304 65372 73857 5050 -33087 -1618 50730 28342
13951 28342 19134 -12716 13196 38285 32561 70249 67769 21305 14153 -41469 -21186 -24710 -94513
13938 -94513 -78792 -21158 15761 38662 93845 97827 85620 120485 40355 6917 64364 43068
13926D3068k2978M0366J8712o7400j00884k8009Q5222K8639j0068k3038L6373
13915CO3546l4896l351k092l494m7409j7891K6557J4131m2026L0527M4779M9438
13902G7822M754r1393k1073K8690l2590k6761M3167N245j3495O148K3911P025
13890A1450k7671l8909N3739j4262K0634L2551o4038P0964Q5870K3554n8399r7442
13878a959n8465M6016J7648O0112J5298m8227j3308L8772j3542m0976k590J8373
13866A7152J3265m7809o762j5431m6989L2315K8363L5384q724m4348m0966O6529
13854a8021M3781m1843k9823l1333P54R090K0195J7344q221J7245J2856j9270
13842b7246K3860K809N1729K1959m0745l2221l1073J8838Q1093K6023l173L3097
$$ plain form
13926 43068 20090 60456 79168 11768 -89116 -117125 -31903 -3264 -13332 -36370 3
13915 3 63549 28653 25302 23210 19716 -27693 -45584 -19027 -4896 -46922 -16395 28384 77822
13902 77822 82576 -8817 -29890 -1200 -33790 -60551 -17384 -12139 -25634 -19486 4425 11450
13890 11450 -16221 -55130 -1391 -15653 4981 37532 -26506 44458 130328 153882 95483 -1959
13878 -1959 -60424 -14408 3240 63352 78650 30423 17115 55887 42345 1369 -1221 17152
13866 17152 30417 -17392 -24154 -39585 -86574 -54259 -25896 9488 764 -43584 -84550 -18021
13854 -18021 25760 -16083 -45906 -77239 -76485 -67395 -47200 -29856 -38077 -20832 -7976 -27246
13842 -27246 -3386 -577 51152 73111 32366 145 -30928 -12090 69003 95026 91853 124950
13830A24950J5765L705k3737k7629j2288n3552j5399K2122m2215k6121l524J5108
13818b2815M0440M179l6146K315l9639J1166K087r972O2959l126l6557l2645p895
13805f5649P813J6607L8273K7565l8435L3108K8744j7957O37l4464k5617M6115
13793A6740l8001P139N7696l0099L1289L1254K0047m4410m0513l8190l0539L515
13781e4072L0811j1784M2739J6040O5376K3303j05775J34j0079l7729j0234M4995
13769f275K9208k1197J4372k5972N1771N5751L9735k5023q3011l0877j5888L9866
13757B2460L7750N6643n4677l6916k527n271J0101M3368M9937l0239o6830q7611
13745f3812J9553O315l3225J0579j7668l816K5067r897J1224J8311Q762J00608
$$ plain form
13830 124950 140715 144420 120683 93054 80766 27214 11815 33937 -8278 -34399 -37923 -22815
13818 -22815 17625 21804 -14342 -12027 -51666 -40500 -38413 -48385 14574 11448 -25109 -57754 -65649
13805 -65649 -57836 -41229 -2956 24609 -13826 19282 48026 30069 30706 -3758 -29375 16740
13793 16740 -21261 -14122 43574 13475 44764 76018 96065 51655 11142 -27048 -57587 -54072
13781 -54072 -23261 -35045 7694 23734 89110 112413 6638 6772 -3307 -41036 -51270 -6275
13769 -6275 22933 1736 16108 -9864 41907 97658 137393 112370 29359 -1518 -17406 22460
13757 22460 60210 116853 62176 25260 22733 17462 27563 70931 120868 90629 23799 -63812
13745 -63812 -44259 -37944 -71169 -60590 -78258 -82074 -57007 -66904 -55680 -37369 -28607 72001
13733G2001J6171Q68O037k6270L0743K9742l3743o3208l2588q503J3238J2218
13721A6706O1069N9285m0076q2834l60k5365n6944k4742J0371J3787O0259M286
13709d558q8n5669k5247M5752K9638N4324J3222l9882r063q218l022l4563r990
13696d7364L2486j9926k6503L2466M8452J9548l3981K9151l4242J351m9958R139
13684c9381Q603L3206J9762L5813j4517m9574K1693L9390k9890Q285K8821P821
13672G0032Q024j5419m511K2004M1423O061j5323K4875m4344n7668P3887R25p8987
13659C0979M1744K5611o8864n2828P7782L3664p8241o1024K892O0336J5953o7158
13647c9154j5481k2241n653O5089K8372m017p238Q080J9796n545K2066K727k4538
$$ plain form
13733 72001 88172 89040 95077 68807 99550 129292 95549 32341 -247 -8750 4488 16706
13721 16706 77775 137060 96984 14150 13790 -11575 -68519 -93261 -82890 -69103 -8844 -4558
13709 -4558 -4646 -60315 -85562 -39810 -10172 44152 57374 17492 8429 211 -2811 -37374 -47364
13696 -47364 -14878 -34804 -61307 -28841 19611 39159 5178 34329 87 1438 -48520 -39381
13684 -39381 -30778 2428 22190 58003 43486 -6088 15605 54995 25105 33390 62211 70032
13672 70032 78056 62637 58126 80130 121553 127614 112291 137166 92822 35154 109041 109966 30979
13659 30979 72723 98334 29470 -23358 54424 88088 9847 -51177 -48285 12051 28004 -39154
13647 -39154 -54635 -76876 -82529 -17440 10932 6915 -323 7757 27553 22008 44074 46801 22263
13634B2263k6660k3273m1148m606Q809M4002M4150k7967k3627O5265O9110k8669
13622G7649k0079k8452n6861j4023q690Q109k610J3111M2017p762k6006m995m193
13609c2785j2381K5554K0309l665p5868p1067M2355M7933L6804n683J8557M4557
13597C4620L8876l5138K3462P888K5976k1630k4603J0294J944j2313J6514k8585
13585C7305l8382L0773P3855l1429p8231l2985j3331M0661K0979q141l3832l9652
13573g2410j8550N8501J23250L6866m0926r5488q0585N686l9361r253J9758K7713
13561h4799N8182J08502m4738m0341J7807n8634k5689N2389K9631k3694l3383
13550d4767N076M1027N6249M2111k561l284l5156m5670J1948j0784n2576J9328
$$ plain form
13634 22263 -4397 -27670 -68818 -73424 -64615 -20613 23537 -4430 -28057 37208 106318 77649
13622 77649 57570 29118 -27743 -41766 -50456 -42347 -44957 -31846 10171 2409 -23597 -28592 -32785
13609 -32785 -45166 -19612 697 -2968 -78836 -149903 -107548 -59615 -22811 -28494 -9937 34620
13597 34620 73496 38358 61820 69708 95684 74054 49451 59745 61689 49376 65890 37305
13585 37305 -1077 29696 103551 72122 -6109 -39094 -52425 -11764 9215 1074 -32758 -72410
13573 -72410 -90960 -32459 90791 127657 86731 -8757 -89342 -83656 -123017 -132270 -112512 -84799
13561 -84799 -26617 81885 37147 -3194 14613 -44021 -69710 -17321 12310 -11384 -44767
13550 -44767 -39691 1336 57585 99696 97135 93851 58695 13025 24973 14189 -38387 -19059
13538a9059M1414j3897L3293l5057K5316M5070j624q2964m5458J0964K5477n290
13526b1815L4664O6221J0139m4325k1228N496p5819P751K2165N067j352K2403
13514I367M3897k8084p663K0091n996j0435J2996m4256n4622J7341L1763J6151
13502E50k707m08k9006P01q884Q172J3326M1871k2553n2791O268K6660M5085R7992
13488A24276J4811n7735m2622o4141l3538L5826L026M3205J2939J6333l7877k6275
13476a1772N6275k952N263m7420m3614k2433M3304K4832O4771J3264O916k0554
13464F5880M543K574k9323l5047k4643k925m1723j4616M3307l7513l5822N2640
13452e2668O1579K7150j2635n7221l0217O736P2727L1479l4118k9616r704J2424
$$ plain form
13538 -19059 22355 8458 41751 6694 32010 77080 75456 -7508 -52966 -42002 -16525 -21815
13526 -21815 12849 79070 89209 44884 23656 29152 -46667 -38916 -16751 -11684 -13036 9367
13514 9367 53264 25180 17517 37608 31612 21177 34173 -10083 -64705 -47364 -15601 550
13502 550 -2157 -2565 -31571 -30870 -39754 -31582 -18256 23615 1062 -51729 -45461 -18801 26284 124276
13488 124276 139087 81352 38730 -25411 -58949 -23123 -20097 23108 36047 52380 14503 -11772
13476 -11772 44503 41551 46814 -606 -44220 -66653 -23349 1483 66254 79518 86434 65880
13464 65880 70423 72997 43674 8627 -16016 -18941 -60664 -75280 -31973 -69486 -105308 -52668
13452 -52668 8911 36061 23426 -33795 -64012 -57276 15451 46930 12812 -16804 -26508 -14084
13440a4084K767o17r49p088K0335N7845N2205J9158k0943K7033n6644l4525m7671
13427c178l6273M8549K8798n0169L1307J0929J8461j8227j7859K1764J6157L7566
13415H7825L921j0718j5690m3854q1378K8577K7958J9241M0084k9897l720j5578
13403F771J9607K0788n436l7005j8102O3010K7639m3930m6835j271N0564k4508
13391A1292n222j5215n322j8534L4318M6228J7190j1758p7925K3153R4325j390
13379I1140n3390r951K5049N0285M5201p798P051k7386k0815o6248k6581j4430
13367g873L546l0309j4657j1956J2097M5084M937P548L0219J8157J2011n1504
13355A7300k4836m1633j5157P7572L5434L52K2488k3669L13k5083M1160l5206
$$ plain form
13440 -14084 -11317 -11934 -12883 -19971 364 58209 110414 129572 108629 135662 79018 44493 -3178
13427 -3178 -39451 9098 37896 -12273 19034 29963 48424 30197 12338 34102 50259 87825
13415 87825 91746 81028 65338 21484 -59894 -31317 -3359 15882 55966 26069 22349 6771
13403 6771 26378 47166 41730 4725 -13377 49633 77272 33342 -13493 -14764 35800 11292
13391 11292 6070 -9145 -14467 -33001 1317 47545 64735 52977 -24948 -1795 92530 91140
13379 91140 37750 27799 52848 103133 148334 140536 147587 120201 99386 33138 6557 -7873
13367 -7873 -4327 -34636 -49293 -61249 -49152 -4068 869 8417 38636 56793 68804 17300
13355 17300 -7536 -49169 -64326 13246 48680 49032 71520 47851 48164 23081 64241 29035
13343B9035k1404K4116L0490n887M6273O4017m1998m2409K1476j8369L3561K2425
13331A41326l0992j2723J9656j1031n6824K2534k333k4478n994O351r753j67K8659
13318F4231j3671n376j171L2214M233p4006l4419O5116Q1834m1518r2686k7443
13306d2662q463L1661P2288J9577K7077j779r451m7317M1000n310m2506j0523
13294B3592n9386K0706l2478K7633J6550L6014L5130Q573J6559J9396o3828J311
13282D9772o859J5841j8141J0985K6723l0376j2343k4763l1108M0447N4092k2454
13270E1816J6168J6655m0698q062j9069m8286N3796P942o3318q2100j8231L0811
13258a02576J6073N6111k5513j2992P322M5300K5415L4361l0620k9054Q719M3375
$$ plain form
13343 29035 7631 31747 62237 56350 102623 166640 124642 82233 103709 85340 118901 141326
13331 141326 110334 97611 117267 106236 49412 71946 69613 45135 39141 45492 35739 35572 64231
13318 64231 50560 45184 44013 76227 80460 6454 -27965 37151 118985 77467 -15219 -42662
13306 -42662 -51125 -19464 52824 72401 99478 97699 88248 40931 81931 76621 34115 23592
13294 23592 -35794 -15088 -47566 -19933 -3383 32631 67761 76334 92893 112289 48461 49772
13282 49772 42913 58754 40613 51598 78321 47945 35602 10839 -20269 20178 74270 51816
13270 51816 67984 84639 43941 35879 16810 -31476 22320 30262 -33056 -115156 -133387 -102576
13258 -102576 -86503 -30392 -55905 -68897 -61575 -16275 9140 43501 12881 -16173 -7454 35921
13246C5921k7581k559M520j2843K7095M5078L9265M1972M3749o2638q4505k3128
13234B4346K2949L6346L409O5497j8777j4320J3861k0624o9374j6782O4829M7864
13222A39224N6870k095M1285L8978O8217M7452R8745K30008L27021K90998P6827
13211A413530M1276m1350j22441k09400k42054k53992j78701p8757l6401L9652
13201C31362j8322l5558l1375j8403n6802Q033r987r5667j8115L7041L7651l3081
13189I6777n3439L4424L1929P8236O6491k6181k1753K3558k7847l6684k4687K89
13177A41113J1823j5636j3819q175M464m8086j8053M4167l9265p0845M3244L3481
13165F4413m460J7353L2022J4672m9304k6006J7528j3487K8911l8204l664J619
$$ plain form
13246 35921 8340 5781 10301 -2542 24553 69631 108896 150868 194617 131979 47474 24346
13234 24346 47295 83641 87050 152547 133770 119450 133311 112687 43313 26531 91360 139224
13222 139224 196094 193999 235284 274262 342479 389931 488676 718684 1045705 1336703 1413530
13211 1413530 1454806 1413456 1291015 1081615 839561 585569 406868 328111 291710 331362
13201 331362 313040 277482 246107 227704 170902 178935 168948 73281 55166 92207 129858 96777
13189 96777 43338 77762 109691 187927 254418 228237 206484 230042 202195 165511 140824 141113
13177 141113 152936 137300 123481 115306 119770 71684 53631 97798 58533 -12312 30932 64413
13165 64413 59953 77306 109328 124000 74696 48690 66218 52731 81642 43438 39774 41393
13153D1393k3990J6914O0329R434L9018M1513M3292K1401r1150o5036r693M4441
13141A27866O781J7029k0311m532m0039L7559O0452j3282k7682l0237J4831n0473
13129G7962j4979M8839o3231o5426M8284O4728m9669P985L2540P6061q728j4406
13117A39960k2771m9417k6137J5090J2346k9583K2700l9459l7363K8460J9906
13106C3732L0471q604J3136L4028O463O7381k7407q4487n5566l5675O0661O8674
13094A02807m0335j4549K3415M5811K9358m525p1516k5559q596J770N158L7213
13082H0452J7188L8075l344j333k1722m0220q63m5129M763N1477K6884j5396Q8913
13069A79745M2354m7311p3453m3855j7150j16j1644j1442n3314j0866l4795L3543
$$ plain form
13153 41393 17403 34317 94646 104080 143098 184611 227903 249304 158154 93118 83425 127866
13141 127866 134647 151676 131365 126833 86794 124353 184805 171523 143841 113604 128435 77962
13129 77962 62983 111822 48591 -16835 31449 96177 46508 54493 87033 163094 154366 139960
13117 139960 117189 67772 41635 56725 69071 39488 62188 22729 -14634 13826 33732
13106 33732 64203 55599 68735 102763 109226 176607 149200 64713 9147 -26528 34133 102807
13094 102807 62472 47923 71338 117149 146507 141982 70466 44907 36311 38081 43239 80452
13082 80452 97640 135715 132371 131038 109316 69096 68233 23104 27867 79344 106228 90832 179745
13069 179745 222099 174788 101335 57480 40330 40214 28570 17128 -36186 -47052 -81847 -48304
13057d8304L3603L8262k0190q423l4457p263O8192J912P885O4025K3766p6009
13045D2999j6391Q9874Q9340p013n4200J9346M1625K6452K4675n3342m4549K511
13033A61327P1700O2469j8608k8226m3415l6867J8538j111k4788K6741M136k0251
13021A71645J5330L2052N736K335n9271l1597L19K5137J1797k5323q160o985l4274
13008I8741r230q421K7455J5797n1158j9574L5903O9486R41J5420L2555n2926
12996A54989k7901M9087L2506m2484r988K7699k5423N792K0949K4485J8355K1303
12984B49369J6148m8573m9041M000P6811J14070M2943l1634n0735J3399Q4717
12973D21474N7543l1309L418J37463J08724P5608M9380q5521j05254j65543j88588
$$ plain form
13057 -48304 -14701 23561 3371 -5052 -39509 -46772 21420 23332 31217 95242 119008 42999
13045 42999 26608 116482 205822 198809 144609 163955 205580 232032 256707 203365 158816 161327
13033 161327 233027 295496 276888 248662 205247 168380 186918 185807 161019 187760 191896 171645
13021 171645 186975 219027 224763 227098 167827 136230 136549 161686 173483 148160 140000 133015 98741
13008 98741 89511 81090 108545 124342 73184 53610 89513 158999 159940 175360 207915 154989
12996 154989 127088 176175 208681 166197 156209 183908 158485 164277 185226 209711 228066 249369
12984 249369 265517 216944 167903 171903 248714 362784 405727 374093 323358 336757 421474
12973 421474 479017 447708 451126 588589 697313 772921 822301 736780 631526 465983 277395
12962B77395k13285j93843j64713o4168R7681K3669K7578Q424P7718l07N4249
12951f9602j2004j6605J6528k5397K5733K6298k3713k9512L135q383j9937L7648
12939i5811K5038J1145l2744L4943K5702m4285m9004j2043O1673J1864r221j9273
12927i2016K5204J8671k3944l7456J3080q767p391n580L2970K5485j0168M7115
12915b2797O5831K000l4708Q7103m2708q5972r4465R721M3041R2783L6281M8267
12903A04377R3327Q0098L9078R70n1512O169q2323m919k0621m1980P5635J1049
12891B09348k7790O4936K6473l5438R274K0888M6623P472K6P270J6968Q7086J065
12878D34201o4491q3267k8031J5017L5431p252m8889m5377L3529P9030L1213j0416
$$ plain form
12962 277395 64110 -129733 -294446 -358614 -260933 -237264 -209686 -201262 -123544 -123851 -69602
12951 -69602 -81606 -98211 -81683 -107080 -81347 -55049 -78762 -108274 -105139 -113522 -133459 -95811
12939 -95811 -70773 -59628 -92372 -57429 -31727 -76012 -125016 -137059 -75386 -63522 -72743 -92016
12927 -92016 -66812 -48141 -72085 -109541 -96461 -105228 -112619 -118199 -85229 -59744 -69912 -22797
12915 -22797 43034 45034 10326 97429 54721 -31251 -125716 -115995 -72954 19829 56110 104377
12903 104377 197704 277802 316880 317850 266338 272507 190184 185265 164644 122664 198299 209348
12891 209348 181558 246494 272967 237529 246803 267691 314314 321786 321812 329082 346050 433136 434201
12878 434201 369710 286443 258412 273429 308860 301608 252719 207342 240871 319901 351114 340698
12866C40698m2369j6632J057O3513M6508M8122q284l1754m4662P987L1755L4679
12854D30618N68L7784L3671l2169p49j3551j7270L1838N2603J8866n2936o846
12842D82427m321m1458J787N0249R1278L9412K9047R420q90m751M9933M2251m910
12829G39474k2307j0563M642j809l682J0831O6147P3350L5609L3129O7212M7498
12817A039531P4523J09820J15797P7668M3677O3140Q0728Q6134R6852M8479K9942
12806A866291p920J14933J80879L01776L50332K61213L79880M32867M32688M72065
12796D785004M38853M97933N96910P91086J014609J259939J594662J977945K309708
12787A5266649K745913L358257M184517N743968Q258033J3024690K1882778L5891720
$$ plain form
12866 340698 298329 281697 282754 346267 392775 440897 432613 400859 356197 364184 395939 430618
12854 430618 431186 468970 502641 470472 469723 456172 438902 470740 523343 542209 489273 482427
12842 482427 478106 436648 438435 488684 579962 619374 648421 657841 656951 652200 702133 744384 739474
12829 739474 717167 706604 711246 709437 705755 716586 782733 856083 891692 924821 992033 1039531
12817 1039531 1114054 1223874 1339671 1417339 1461016 1524156 1604884 1691018 1787870 1836349 1866291
12806 1866291 1858371 1973304 2154183 2455959 2806291 3067504 3447384 3880251 4312939 4785004
12796 4785004 5223857 5721790 6318700 7109786 8124395 9384334 10978996 12956941 15266649
12787 15266649 18012562 21370819 25555336 31299304 39557337 52582027 74464805 110356525
12779A10356525N1023844N5331455M2438027K1497139N250065o859973k6902408
12772B52134674m6894286n5969870m5086621k7231173j5540555r668761o641755
12765D5101653m808079l621842k916128k604087k403988k124843j740417j461779
12757B3420490j241374j014426q68787q52494p58542n64032n02644n33605o77434
12748A6407152o82136o95337o26491n37435n46141n57420n29644n24486n11672
12739A1196390m51190l69337m36694l33853k90448k73806l25528k75900l25246
12730H114388k91103k06473k16306l01643k96088j48628k06720j90029k46144
12721F011254k23022k28431j85782j67001k18431k58358k01857j08201p5415p0298
$$ plain form
12779 110356525 161380369 216711824 259149851 280646990 285897055 279037082 252134674
12772 252134674 205240388 149270518 104183897 76952724 61412169 51743408 45101653
12765 45101653 40293574 36671732 33755604 31151517 28747529 26622686 24882269 23420490
12757 23420490 22179116 21164690 20295903 19443409 18684867 18120835 17618191 17084586 16407152
12748 16407152 15725016 15029679 14403188 13865753 13319612 12762192 12232548 11708062 11196390
12739 11196390 10745200 10375863 9939169 9605316 9314868 9041062 8715534 8439634 8114388
12730 8114388 7823285 7616812 7400506 7098863 6802775 6654147 6447427 6257398 6011254
12721 6011254 5788232 5559801 5374019 5207018 4988587 4730229 4528372 4420171 4344756 4274458
12711D274458o7582o7813j08129q5581j31723p0700j06169o4563q5878j22797
12701C363523j63339j61448r5204K5920o4568j37799m0586n9669p8677q3463j5795
12690B488895p3458o4604j12504n8465q9647m0541n6558j04835q9731p4763Q511
12679A732300m8876j6069L8648P78q0620l1877m4859q684m5771p8631q4875q6880
12667A244584k4078k7042r7048q7441n7833o693j3782o3564l2170k2965k7366
12656G84602p6650o0989k6520j6283k2361K4328M4432Q0944j0907j0934R150Q292
12644G27104K598P377n3826p1758m4503j0385R309k118M095N5631K2287J0986
12632F56797l3379l7943l6845M1045q156o492m017J6048l687l7028n8375m4682
$$ plain form
12711 4274458 4206876 4139063 4030934 3945353 3813630 3742930 3636761 3572198 3486320 3363523
12701 3363523 3200184 3038736 2943532 2969452 2904884 2767085 2726499 2666830 2588153 2504690 2488895
12690 2488895 2415437 2350833 2238329 2179864 2090217 2049676 1993118 1888283 1798552 1723789 1732300
12679 1732300 1683424 1667355 1706003 1706781 1626161 1594284 1549425 1540741 1494970 1416339 1331464 1244584
12667 1244584 1220506 1193464 1096416 1008975 951142 944449 930667 867103 834933 811968 784602
12656 784602 707952 646963 620443 604160 581799 606127 650559 731503 720596 709662 718812 727104
12644 727104 729702 737079 683253 611495 566992 556607 565916 563798 567893 623524 645811 656797
12632 656797 623418 585475 548630 589675 581519 575027 571010 587058 583371 546343 487968 443286
12620D43286K6803J1251L0737R642n1720r401J7554p044R431p256O689k4062R829
12607D65739j070N132M817n812l6272k8954j0322L8826M8989O7869j2582j176
12595E35184N2254Q3831O2526M105m8170k3267j18724j52989k10527k04115j77202
12584a97094j51858j26582o164P6207J31457K8997M972n190L3723Q4574J18662
12573h296M6773L1609k8043N3508K4318R843J3090N649J599J3188k6887p4128
12561F2223j5103k1702K4538N132O10P4923O683p8717J7541O917p7461l4267k124
12548c0807L6445N8767L3044Q323M631L937M943j4812j1790l6444K3345N0156
12536A29738k0605k963J9285K1678k8471k7709K4194L2623K3435r5274o3556Q719
$$ plain form
12620 443286 470089 481340 512077 521719 469999 460598 478152 471108 480539 473283 479972 455910 465739
12607 465739 464669 469801 474618 468806 432534 403580 393258 432084 481073 548942 536360 535184
12595 535184 587438 671269 733795 737900 689730 666463 547739 394750 184223 -19892 -197094
12584 -197094 -348952 -475534 -481698 -405491 -274034 -245037 -240065 -245255 -211532 -126958 -8296
12573 -8296 38477 70086 42043 95551 119869 129712 142802 148451 150050 163238 136351 62223
12561 62223 47120 25418 49956 55088 55698 130621 137304 58587 76128 83045 5584 -28683 -30807
12548 -30807 5638 64405 97449 105772 110403 114340 119283 104471 92681 56237 79582 129738
12536 129738 109133 106170 125455 147133 118662 90953 115147 147770 171205 75931 12375 21094
12524B1094Q999M7563J01145k6778n7478N184J4922L10l333k1052L6807k9179
12512I8204q5081k0263J9631q177M178j597k939P709N2455N31r8463k6649O9227
12499H766L2155m468j131J581L2000k3427n0617o632L5814J0903J4809P418j02462
12486d5291j910J8031k9153L9053Q0709P6650m4513o5048l6796l117n1631m4719
12474a07735K4931J0590l4414J6412O7803K1351M2322J5929m061j7972N1942P228
12462I4326p2135o1669M488N701j889L0540P5899O0112m0449J8004L8154l7007
12450A14075O514n1843n914q8428l1160O4637N1456k6620j6597p202J0500l6948
12438a7530J8859j4924M622K556R485L4062K6070j6406p490J0192J1777J7719
$$ plain form
12524 21094 30093 77656 178801 152023 94545 99729 114651 114961 111628 90576 127383 98204
12512 98204 13123 -7140 12491 4314 8492 6895 3956 11665 64120 64651 -33812 -60461 8766
12499 8766 40921 36453 35322 36903 68903 45476 -5141 -11773 24041 34944 49753 57171 -45291
12486 -45291 -47201 -29170 -58323 -19270 61439 138089 93576 28528 -8268 -11385 -63016 -107735
12474 -107735 -82804 -72214 -106628 -90216 -22413 -1062 41260 57189 53128 35156 87098 94326
12462 94326 22191 -39478 -34990 -29289 -31178 -638 75261 135373 94924 112928 151082 114075
12450 114075 120589 68746 62832 -25596 -56756 7881 59337 32717 16120 8918 19418 -17530
12438 -17530 1329 -13595 -8973 -6417 3068 37130 63200 46794 39304 49496 61273 78992
12426G8992l992k159j7085k5438J490L913q8146j221P3966J2717L7986j4551p8395
12413b1923K3947L3058K0060m8529m2400K1959J3284J8522J8937j8835J350O6362
12401H5792J0378n0471o3710k3258L7418L9451j0371l3479L0839O3222O638m7845
12389D4604n792m466J2157j6341O8813l608n4248m9775l4153K4383J9292p052
12377f186j6964j1785L2104K9121j9521K5125J0304l0900k3930l6873j5637Q708
12365e6434N4068K6758l9653K3236j7132M938L1514K2426M7263k4859p53j260
12353G0112J1419K7157P0591O882k6735K1338o123K3066m9067l5376J0557j1345
12341A12476j4791M4940J41938J39278J70550K69784K01074J12511Q2322J34818
$$ plain form
12426 78992 75000 72841 55756 30318 31808 35721 -52425 -53646 20320 33037 71023 56472 -21923
12413 -21923 2024 35082 55142 6613 -35787 -13828 -544 17978 36915 18080 19430 85792
12401 85792 96170 45699 -18011 -41269 -3851 35600 25229 -8250 22589 85811 92449 44604
12389 44604 38812 34346 46503 30162 98975 95367 41119 -8656 -42809 -18426 866 -6186
12377 -6186 -23150 -34935 -2831 26290 6769 31894 42198 11298 -12632 -49505 -65142 -56434
12365 -56434 -2366 24392 -15261 7975 -9157 -4219 27295 49721 96984 72125 71372 70112
12353 70112 81531 108688 179279 186161 159426 180764 174641 197707 148640 113264 123821 112476
12341 112476 97685 142625 284563 423841 594391 864175 1065249 1177760 1260082 1394900
12331A394900J046j79453k92096k15814j77124j69149o8348k6568l6478q8367
12321A42549j5277j08m2447l1666R5K3245L0564p9959m8680M999M019O549J4282
12308H165J0030L0630j5519M0988L6161j9518q9287k6735j994K2091M8399o157
12296C7254m0953K872l673k8782J1410J9106J6056P802K4197O9643q713M473m6805
12283F3887m1372j2939m5823o5024O7357P7983r5074M5505J2302k2916m5293J2304
12271d9103O108M6251m044L0664k482l4656M4576L8186Q012l3250j7635J6606
12259D9233k5062n9458K1794k9551Q96J30L1607J607M0511O1568l480j6015k3732
12246E0048o6647L242o056j0677J8952m3792l0508L6619M5867k4746m2954k6601
$$ plain form
12331 1394900 1395946 1216493 924397 708583 531459 362310 293962 267394 230916 142549
12321 142549 127272 127164 84717 53051 53146 76391 106955 26996 -21684 -16685 -12666 -6117 8165
12308 8165 18195 48825 33306 74294 110455 90937 1650 -25085 -27079 -4988 43411 37254
12296 37254 -3699 -827 -4500 -33282 -21872 -2766 13290 21092 45289 114932 106219 110692 63887
12283 63887 22515 9576 -36247 -101271 -33914 44069 -51005 -5500 6802 -16114 -61407 -49103
12271 -49103 -42995 3256 -788 29876 27394 -7262 37314 75500 83512 50262 32627 49233
12259 49233 24171 -35287 -13493 -43044 -42148 -42018 -10411 -8804 31707 93275 89795 73780 50048
12246 50048 -16599 -13357 -19413 -30090 -11138 -54930 -85438 -48819 -2952 -27698 -70652 -97253
12234i7253M2761L8435P043m0195L5836L8443K7088M9085Q7635r515P692J706
12222A88761p8139n5985p8276K9128L3498Q126J7583m7176N4617Q724k7930n174
12210D7757j5890k6048j4822L7129p107K8393J2323K7386M5114K6003j4814N565
12198A50989o9503n4952Q157q702P725K7764j5220J3836K2988o4072J7682K8139
12186F4831k4845j0598K7424n266m7769m626L3472j9068n3788J7276J0547J6637
12174D227L5406K9290L8220M455k1488N977j186k7530n865N155k8397K8075K3602
12161H9941K0502j1296l7720m4824K4410o321j865K9763K2735n836K1715J3072
12149A14276L3793Q1248J1357j5669N5888O918K2938o1562q8695n5633J5324p2692
$$ plain form
12234 -97253 -54492 -16057 -9014 -49209 -13373 25070 52158 101243 188878 179363 187055 188761
12222 188761 110622 54637 -23639 5489 38987 47113 64696 17520 72137 80861 52931 47757
12210 47757 31867 5819 -9003 28126 21019 49412 61735 89121 134235 160238 145424 150989
12198 150989 81486 26534 34691 25989 33714 61478 46258 60094 83082 19010 36692 64831
12186 64831 39986 29388 56812 51546 3777 -849 32623 13555 -40233 -22957 -12410 4227
12174 4227 39633 68923 107143 111598 90110 96087 94901 67371 61506 66661 38264 66339 89941
12161 89941 110443 99147 61427 16603 41013 34692 32827 62590 85325 79489 101204 114276
12149 114276 148069 229317 240674 225005 280893 287811 310749 249187 160492 104859 120183 47491
12137D7491p1220K2282N7293l898m1963j965j5334J6603K9890J7573m3606k3066
12125i920J5104Q671q697J3209L3699N6284k1332l2007O4156m004o0407j303k3837
12112B9616j6926l840O0246L8434k177o3499L0872R015J352K8307k6076j5768
12100F9556K7739L4458J3645K2133j329l8713j3601n0925l6177k4050J3594r819
12088F511Q2293J3534k9189m6281K883J57k3083K6616K6169j3287j3448n7185
12076b4310N510J3808L097L826K3628K8446J334n4535o170J2688J3209O3912M99
12063H4942l5545p4517k7018K5371N9206R8901Q825P203K4560l5290q5670J4526
12051F5494j7443j01739l0194p0368l8765M0229N5600O840R466K9765K2649j0052
$$ plain form
12137 47491 -23729 -1447 55846 51948 9985 8020 -7314 9289 39179 56752 13146 -9920
12125 -9920 5184 13855 5158 18367 52066 108350 87018 55011 119167 115163 54756 53453 29616
12112 29616 12690 8850 69096 107530 105353 41854 72726 81741 83093 111400 85324 69556
12100 69556 97295 131753 145398 167531 166202 127489 113888 62963 26786 2736 16330 6511
12088 6511 88804 102338 73149 26868 29751 29908 6825 33441 59610 46323 32875 -24310
12076 -24310 -18800 -4992 -1895 1931 25559 54005 55339 804 -5366 7322 20531 84443 84942
12063 84942 49397 -25120 -52138 -26767 32439 131340 140165 147368 171928 136638 50968 65494
12051 65494 48051 -53688 -83882 -154250 -193015 -152786 -97186 -90346 -80880 -51115 -28466 -38518
12039c8518O2572K4109m7373l4687R272j5208p2456R671K3443l761L2346J0456
12027d0134m470m4737K8206O5937M7924k446m7214K497K2254j0400Q675q367m4191
12014b6466k1786l9438Q079O6697R788j7661o1392J9876O1324K9325N645l0440
12002C551J5948J6464L1531M8931l4088j3679n787m8000k6093o0635n527K4808
11990e2576L6467J5952n7640l1316L3162N0985l4233j7492j549k275q861j5756
11978h5132n374j659M8110k5457L9887K4038k4905L5309J02410J4878r9221l1420
11966h536j3665M0636J7632k8671P558L6282l9341j1072o345j7939L7857N401
11954A9797l4386J6959J3707l1615K3304L3550L3493o195M246P0673N8397N524
$$ plain form
12039 -38518 24054 48163 790 -33897 -24625 -39833 -112289 -102618 -79175 -82936 -50590 -40134
12027 -40134 -44604 -89341 -61135 4802 52726 50280 3066 5563 27817 17417 26092 17725 -26466
12014 -26466 -48252 -87690 -79611 -12914 -3126 -20787 -82179 -62303 -979 28346 33991 3551
12002 3551 19499 35963 67494 116425 82337 68658 62871 14871 -11222 -71857 -77384 -52576
11990 -52576 -16109 -157 -57797 -89113 -55951 -4966 -39199 -56691 -58240 -60515 -69376 -85132
11978 -85132 -90506 -92165 -44055 -69512 -29625 -5587 -30492 4817 107227 122105 22884 -8536
11966 -8536 -22201 18435 36067 7396 14954 51236 11895 823 -5522 -23461 14396 19797
11954 19797 -14589 2370 16077 -15538 7766 41316 74809 68614 72860 143533 201930 207454
11942B07454J4686m7727N637M1598J3381n9995p5522o1678O909L1104j4428L562
11930F4981J3621J8244m1505o0640K186M2104J1747p5458l41P3771p930L1491
11918G2271r45p2868o494o5533O057q671J1458P6024L3251n7998r346O1290L1661
11905G0157K060l6304l0397K3031J51n48N2572l8643n5565r799j638m461p6064
11892a05448l1517K3495L7477N2432P453J9825K7376n4503m9725l7361l5094N6296
11880h9294M9780N9325J0894n7595n2287N6335j647k5695J4179j0834j0695j988
11868e9522o3846K6154P0249M2895k6110k6226N8884M4401p302Q833l4181l4762
11856e33J7612m8395m1073J706L8939r347J5281K8615M5702k6595l5833k3891
$$ plain form
11942 207454 222140 174413 180050 221648 235029 175034 99512 37834 44743 75847 61419 64981
11930 64981 78602 96846 55341 -5299 -3113 38991 50738 -24720 -25061 48710 40780 72271
11918 72271 71326 -1542 -8036 -73569 -67512 -76183 -64725 11299 44550 -13448 -22794 38496 70157
11905 70157 72217 35913 5516 28547 28698 28150 80722 42079 -13486 -23285 -24923 -29384 -105448
11892 -105448 -136965 -113470 -75993 -23561 -16108 3717 31093 -23410 -73135 -110496 -145590 -89294
11880 -89294 -39514 19811 30705 -26890 -79177 -22842 -24489 -50184 -36005 -46839 -57534 -59522
11868 -59522 -123368 -97214 -26965 15930 -10180 -36406 22478 66879 59577 68410 34229 -533
11856 -533 17079 -31316 -72389 -70683 -31744 -41091 -25810 2805 48507 21912 -13921 -37812
11844c7812n0696j7588P2351P658m5635J6114K0875K5606P9707L75k0876L4063
11832H4142P449k9927o8492j4713J328l0183J1302j111j5299J0389L544Q349n464
11819c8686k8450R569j4496j9330L1844M8575O878N0311j2687p5479L1327O6230
11807E5606L8751j608p9399j8203O6800k7936l3018L3184k737j9712L2089l042
11795D0775k8912q585K5139P4117o480o4922J8183M3480j4255p0601k807L4373
11783C9505j9917m7332j6394P703o219K4117L6681k2309k0849m0627K3580k6778
11771f8839M8399O8934K2097K669O480n7974j9921l0453K9888O3219M3497j5612
11759I2384j9705j6439p0628j4503L3212n66k8071J8414M1669Q901l908j0855
$$ plain form
11844 -37812 -88508 -106096 -33745 -26087 -71722 -55608 -34733 -9127 70580 70955 50079 84142
11832 84142 91591 61664 -6828 -21541 -20213 -50396 -39094 -40205 -55504 -45115 -41571 -33222 -38686
11819 -38686 -67136 -57567 -72063 -91393 -59549 -10974 -4096 46215 33528 -41951 -10624 55606
11807 55606 94357 92749 13350 -4853 61947 34011 993 34177 31440 11728 43817 40775
11795 40775 11863 3278 28417 102534 96054 31132 49315 92795 78540 7939 5132 39505
11783 39505 19588 -27744 -44138 -36435 -42654 -18537 18144 -4165 -25014 -65641 -42061 -68839
11771 -68839 -20440 48494 70591 73260 79740 21766 1845 -28608 1280 64499 107996 92384
11759 92384 72679 56240 -14388 -28891 4321 3755 -24316 -5902 35767 44668 40760 29905
11747B9905k1566j932p275l6629n495M0377J6214k9997o326q377k2652M7389O1073
11734E4709M893o3740m7583k8486l1791p07j2224K9946J28113P2855m4930K3680
11722H4735k7935m6572K7091k9836n1974J9687M5982m3794n9869P7592Q4620m5477
11710C4250p9575n20j8693J4184L0981J64J3123j534j9886l629l4698j7480J3206
11697g0107J1668j5261N707k1474j9602L9794l082p992K195l4154m1826K2660
11685a31474Q0954O1134L617n683m8120K4734M1368L1836j8937m1637O2039k5097
11673C4734n1476j10564k7815J20290K4733J2663L5214l2756k4530O192n5736
11662f9051p978M8386R46M1972O974k4962m6041M267L8346n483k6162J2418K5764
$$ plain form
11747 29905 8339 6407 -868 -37497 -42992 -2615 13599 -16398 -22724 -31101 -53753 -6364 54709
11734 54709 59602 -4138 -51721 -80207 -111998 -112705 -124929 -94983 33130 105985 61055 84735
11722 84735 56800 10228 37319 7483 -44491 -24804 21178 -22616 -82485 -4893 79727 34250
11710 34250 -45325 -45845 -64538 -50354 -19373 -19209 -6086 -7620 -27506 -31135 -65833 -83313 -70107
11697 -70107 -58439 -73700 -67993 -89467 -109069 -69275 -72357 -80349 -78154 -112308 -154134 -131474
11685 -131474 -50520 10614 14231 8548 -39572 -14838 26530 58366 39429 -2208 59831 34734
11673 34734 -16742 -127306 -155121 -34831 -10098 2565 37779 5023 -19507 -13315 -69051
11662 -69051 -77029 -28643 -27697 14275 21249 -3713 -49754 -45487 -7141 -12624 -38786 -26368 -604
11649f04L5086j4501K3696O625L1340n658m7560K1043K8187m825m072j1873k3584
11636C3300N3709k8118l0457j8430J3827L858o494j7765J3591K1951k3858n052
11624A0062j0306J5645J116P037K9344M2153l2193q837l9064k816j5835n9871
11612f3565K3389K6783K8254o2401L8521N5522K0519J4138m5359j8841k7882O893
11600d029O7839k745j0829m7639l3114N1682k088N578k2228k3608k3051K4127
11588b0105K6253R7541k6260n6710L018N4559J0763o595K4628J6477n8474k350
11576F2745m669N1775M0800k161q2929j3434r081L2304M6989J1164m7080l3659
11564E2764j9511n2386o280J8002L7370j128k1074P896N1918J9254l4384j5148
$$ plain form
11649 -604 34482 19981 43677 50302 81642 75984 28424 49467 77654 72829 68757 56884 33300
11636 33300 87009 58891 28434 10004 23831 27689 21195 3430 17021 38972 15114 10062
11624 10062 -244 15401 16517 23554 52898 95051 62858 54021 14957 12141 -3694 -63565
11612 -63565 -40176 -13393 14861 -47540 -9019 46503 67022 81160 35801 16960 -10922 -4029
11600 -4029 63810 61065 50236 2597 -30517 21165 19077 24655 2427 -21181 -44232 -20105
11588 -20105 6148 103689 77429 20719 23737 78296 89059 82464 107092 123569 65095 62745
11576 62745 58076 109851 150651 148490 65561 52127 43046 75350 122339 133503 86423 52764
11564 52764 33253 -19133 -25413 -7411 29959 28831 7757 15653 67571 86825 52441 37293
11552C7293l5998n034O080j7465j731L8295k2976m4614M6544j0631k6450n6642
11540i3329L1991K389N102j1958l3658L4600L6450K5060K9323J7708l8544p0852
11528f5718O2364O2215l9966j8513l3523K2788O3281M5468j1677l8393k6762k4895
11516c331j4315k4413K6073K0380N9384k2142J6938L405l5020J4385j0555m0337
11504i548o8271j4423k9618j1518n3650M3545J09091r622P334J6745m0527L3983
11492b6479M7556K5410L1338J8757J7860r175k3993p5056k2005K0094L7338l4755
11480F890L5127K8631m5364o7927P652k580L993k4942J0223k0717J9575M6715
11468b724N5200K4367j6933o1801J7457k2086k0585J090L5389l6146j747p822
$$ plain form
11552 37293 1295 -3739 2341 -15124 -16855 21440 -1536 -46150 394 -10237 -36687 -93329
11540 -93329 -61338 -58949 -53847 -65805 -99463 -64863 -28413 -3353 25970 43678 5134 -65718
11528 -65718 -3354 58861 18895 382 -33141 -10353 52928 98396 86719 48326 21564 -3331
11516 -3331 -17646 -42059 -15986 4394 63778 41636 58574 61979 26959 41344 30789 -9548
11504 -9548 -77819 -92242 -121860 -133378 -187028 -143483 -34392 -44014 -36680 -19935 -60462 -26479
11492 -26479 21077 46487 77825 96582 114442 105267 81274 6218 -15787 4307 41645 6890
11480 6890 42017 70648 25284 -42643 -34991 -37571 -33578 -58520 -48297 -69014 -49439 -2724
11468 -2724 52476 76843 59910 -1891 15566 -6520 -27105 -26015 9374 -26772 -28519 -36341
11456c6341J6458L2498n2079r043k337J4263N611j7562N6372j7898o5413O3946
11444a1525l1704k7565m9217J7099n12N810R031l4770L4326N1261M6323J5822
11432B4379L356L211l6838o0262k6715L4719k4804k0842L4337J6007K6983M4954
11420A8485p719m7009j4867L5660K2514J6625J6024k2525m1236l3261M946O276
11408d6087k0116L2939K1232K804k4295K4564N5571p219J0643ll3635k2289j9447
11395b5338k4279l251L3282J064M6793L5323Q585J8025k2722l9817k8031N1934
11383E1568j4971n3867p2942K9712L784K1117N7346M5234K017J1797m1195p4807
11371c5207l8582k597J3396J17439J0906m6919l6644m2946L0940k1869J1062K5502
$$ plain form
11456 -36341 -19883 12615 -39464 -48507 -50844 -36581 -30970 -48532 7840 -10058 -75471 -11525
11444 -11525 -43229 -70794 -120011 -102912 -103424 -97614 -88583 -123353 -89027 -37766 8557 24379
11432 24379 27735 30946 -5892 -66154 -92869 -58150 -82954 -103796 -69459 -53452 -26469 18485
11420 18485 10766 -36243 -51110 -15450 7064 23689 39713 17188 -24048 -57309 -52363 -46087
11408 -46087 -66203 -33264 -12032 -9228 -33523 -8959 46612 39393 50036 50033 16398 -5891 -25338
11395 -25338 -49617 -52868 -19586 -18522 28271 63594 72179 90204 67482 27665 -366 51568
11383 51568 36597 -17270 -90212 -60500 -56716 -35599 21747 66981 68998 80795 39600 -35207
11371 -35207 -73789 -76386 -62990 54449 65355 18436 -18208 -61154 -30214 -52083 -41021 -15519
11359a5519K1461k3476K7136L5111j9729J1678k2016J3799L7130l8309j4880K254
11347A4640m0455l8342M2548K4369m3288l6523J2367L2823q051l7937P4031k9134
11335c2952J3522J4877j214K8648j345k0993K688K4574J6387m1643p882J0999
11323E666k3358k9530j8697J486N4117K9932l8513o529J5447K2603K7601m3663
11311c438k3913j86L3899J0559j8748l6411P4770O266m1993n0002r812J6800N1312
11298I103N256p6509j2025L0900r281M2757J8026o2312k4530M4314R780K8365
11286C844P5940L3235p0271m8568l0156m8505j6298K6778L0311J8578l532m709
11274c3353K7735K6918J6259J9391L514m5078j8764k2490k7635J4467l4638R741
$$ plain form
11359 -15519 5942 -17534 9602 44713 24984 36662 14646 28445 65575 27266 12386 14640
11347 14640 -25815 -64157 -21609 2760 -40528 -77051 -64684 -31861 -39912 -77849 -3818 -32952
11335 -32952 -19430 -4553 -5767 22881 21536 543 3231 27805 44192 2549 -5333 5666
11323 5666 -17692 -47222 -65919 -64433 -10316 19616 -18897 -25426 -9979 12624 40225 -3438
11311 -3438 -27351 -27537 6362 16921 -1827 -38238 36532 42798 805 -49197 -59009 -42209 9103
11298 9103 14359 -62150 -74175 -43275 -52556 -9799 8227 -54085 -78615 -34301 -24521 3844
11286 3844 79784 113019 42748 -5820 -35976 -84481 -100779 -74001 -43690 -25112 -28644 -33353
11274 -33353 -5618 21300 37559 56950 60464 15386 -3378 -25868 -53503 -39036 -73674 -63933
11262f3933R299l7035L5710m945o3322Q4096K2108l93L0963p595o2947k6651p61
11249h5406j2461N9149n475k5251K1166L826K8114P4280l2614o8227j3125J7072
11237c8952L6052M1560j7935l7054j395l64N627k5269p482P4461j7154j0970j1915
11224a0790J5953L7195l1718j1251k4202J5515O383k7801n4312j925L479P256
11212g6218K1884J8649j739l2123o1182K0236L5210Q2008O0346p3495j8422K9938
11200E092j6165k5747R003N1945J5536m4316l9498l5427M7094M5703r424k8904
11188b5108O1128K4428J3996k9654m8370j0450J6176J0597J7490k0903j0617j5631
11176a6918K2724J1450Q859o5219j6508M2590l5410L0097m8776J1949J22J6031
$$ plain form
11262 -63933 -54634 -91669 -55959 -60904 -124226 -40130 -18022 -18415 12548 4953 -57994 -84645 -85406
11249 -85406 -97867 -38718 -44193 -69444 -48278 -44452 -16338 57942 25328 -42899 -56024 -38952
11237 -38952 -2900 38660 20725 -16329 -17724 -18088 -12461 -37730 -45212 29249 12095 1125 -10790
11224 -10790 5163 42358 10640 -611 -24813 -9298 -2915 -30716 -85028 -86953 -83474 -76218
11212 -76218 -54334 -35685 -37424 -69547 -130729 -110493 -75283 6725 67071 -6424 -24846 5092
11200 5092 -11073 -36820 -27817 24128 39664 -4652 -44150 -79577 -32483 13220 3796 -25108
11188 -25108 36020 60448 74444 44790 -3580 -14030 2146 12743 30233 9330 -1287 -16918
11176 -16918 5806 17256 26115 -39104 -55612 -13022 -48432 -18335 -67111 -55162 -55040 -39009
11164c9009L5734P2j9649j1649P0044J0969j6961M850L7566M2166o5673n0448
11152a988m6002J7144O9911j5885j6524l7808L048P0357k7450q5251l4773N3802
11140e1419K8973k7002l7286l5779L8476L7116Q0372M7715j7775m8458j3153k8651
11128b6871O0301l017j6798N9628p144m2034J6433Q415l3664l8797m4462k3594
11116i1604M3234K9753J3654J3665j4876q396M7839K3479L9000n392m2985l8076
11104I295q494l2094j1235O3131R670Q1450j5106o3095o8524J2988j3468l373
11092c8855K4689k9571m0295L1411P8513k2194n7420m3550M9167J7233p1744o2848
11080a65464O9328J05604L3299q476m3523n051K4879R560q272l6225l4184L4903
$$ plain form
11164 -39009 -3275 -3203 -22852 -34501 35543 46512 29551 34401 71967 114133 48460 -1988
11152 -1988 -47990 -30846 39065 23180 6656 -31152 -28104 42253 14803 -70448 -105221 -51419
11140 -51419 -22446 -49448 -86734 -122513 -84037 -46921 33451 81166 63391 14933 1780 -26871
11128 -26871 33430 30413 13615 73243 66099 24065 40498 48913 15249 -23548 -68010 -91604
11116 -91604 -48370 -18617 -4963 8702 -6174 -14570 33269 56748 95748 90356 47371 9295
11104 9295 801 -31293 -42528 20603 30273 111723 96617 33522 -35002 -22014 -35482 -38855
11092 -38855 -14166 -43737 -84032 -52621 25892 3698 -53722 -97272 -48105 -30872 -102616 -165464
11080 -165464 -96136 9468 42767 34291 -9232 -14283 10596 20156 11884 -24341 -58525 -23622
11068b3622L1364k023K5266K0340l7238J7936K5378j6041n0816j5855L168o682
11056b8825O1410K2347k8797m3869j334k226K0707j3526k7943L3038L5048L7953
11044F3983m115k4019l6355P927n5010Q533Q939K3675K6912j1099l5189l1364
11032e7182M437l5961j4767L6042O0951O587l3354o425j1397L6068M6050m3632
11020a2583l5965J7611K3125l5415K5224L8877J1594J062o963N5484P74p6734
11008F091k0324j4513P317M6862l2629l5174J6258O5558r24m5725k6662N7020
10996B3155K3473n8423l5446k1618k5056L4740O8078Q015l6396j5321l0394l7214
10984a02407L5367N567j8409M6925Q0580k6993K8227p5770q3742q2655L8924K9018
$$ plain form
11068 -23622 7742 5719 30985 51325 14087 32023 57401 41360 -9456 -25311 -22143 -28825
11056 -28825 32585 54932 26135 -17734 -19068 -21294 -587 -14113 -42056 -9018 26030 63983
11044 63983 59868 35849 -506 7421 -47589 -39056 -30117 -6442 20470 9371 -25818 -57182
11032 -57182 -52745 -88706 -103473 -67431 -6480 107 -33247 -39672 -51069 -15001 31049 -12583
11020 -12583 -48548 -30937 -7812 -43227 -18003 20874 32468 33530 26567 82051 82825 6091
11008 6091 -14233 -28746 -21429 25433 -7196 -42370 -26112 39446 38522 -7203 -33865 23155
10996 23155 46628 -11795 -47241 -68859 -93915 -59175 8903 16918 -19478 -34799 -65193 -102407
10984 -102407 -67040 -61473 -79882 -32957 47623 20630 48857 -26913 -110655 -193310 -154386 -125368
10972a25368m1513N9985J15776l010k0094j3394L1080M4882K688j8727j3470L3518
10960E2353j873l8069n5515L9434L7437J3518k1372k0993j7484m9831O575Q625
10948d7195Q3187q440o1752P7324J4184q2795q7449N7063M9747L6993m4939o2707
10936g6779L1388O4403p33l5920j4746j5768p6117j2721O5435M1244p9447o1180
10924a70941K1050L9011K9630M4132M3261m545J02064L4762l3564p3905r1306
10913f0351R508M9550j061N136K6826j0598K8301J8844k0700l0504K2786J5772
10901E3509m3814k2302L2623j914J9141M6935j0195o1750j9649J0649L7737m6043
10889e073L2528M9828J3134k4596r392q3420m0853N722M5319j4386j2156L564
$$ plain form
10972 -125368 -166881 -106896 8880 5870 -14224 -27618 3462 48344 51032 32305 18835 52353
10960 52353 50480 12411 -43104 -3670 33767 47285 25913 4920 -12564 -62395 -55820 -47195
10948 -47195 35992 27552 -34200 43124 57308 -25487 -112936 -55873 -6126 30867 -14072 -76779
10936 -76779 -45391 19012 18279 -17641 -32387 -48155 -124272 -136993 -71558 -30314 -109761 -170941
10924 -170941 -149891 -110880 -81250 -37118 6143 1598 103662 138424 104860 30955 -60351
10913 -60351 -50843 -1293 -2354 2782 29608 19010 47311 66155 45455 14951 37737 53509
10901 53509 9695 -12607 20016 18102 37243 84178 73983 12233 -7416 3233 40970 -5073
10889 -5073 27455 77283 90417 65821 56429 -26991 -67844 -62122 -16803 -31189 -43345 -39781
10877c9781P1510O7103J4980l7157j5994n1400j4011Q408J7111K0967p8517l6517
10865g3298K995K5863L6819L8064m050l4266k3504K0139K072K5239J9622O4762
10853A00457m3995p249N3632J8878l2953l7295p993J6215o1613r689n9456J988
10841f9073K1637R775O129O0037K4569r966K4556o650j9989J169O7707n6925j05007
10828e2031Q155O4484Q1065p000j8373J0816m0811k1145j1241j2168P057J5555
10816B4363J7788l8474m8935L8780N1908R104o2538l2273J4046Q584j8114j665
10804c7426M009l5242l52J4742P461R488M7407P3471k1793m8666J7952N604J4270
10791E0925L6004L3386m043m3656k4598q7170k6324n354p189L5910L5423J7881
$$ plain form
10877 -39781 31729 98832 113812 76655 60661 9261 -4750 3658 20769 41736 -36781 -73298
10865 -73298 -70303 -44440 -7621 30443 26393 -7873 -31377 -11238 -9166 16073 35695 100457
10853 100457 56462 49213 102845 121723 88770 51475 43482 59697 -1916 -11605 -71061 -69073
10841 -69073 -47436 -37661 -31532 28505 53074 43108 67664 61014 41025 42194 109901 52976 -52031
10828 -52031 -43876 20608 101673 94673 76300 87116 46305 25160 13919 1751 8808 24363
10816 24363 42151 3677 -45258 -6478 45430 54534 -8004 -40277 -26231 -17647 -35761 -37426
10804 -37426 -33417 -68659 -69011 -54269 -46808 -37320 10087 83558 61765 13099 31051 36655 50925
10791 50925 86929 120315 116272 72616 48018 -39152 -65476 -70830 -78019 -42109 -6686 11195
10779A1195o1500k4717Q4975N3837j5301o8844k3500M606q274m3854K2629L5021
10767c3727J8955k3278m2092K8396J9361N0163l8146K9324o450J9194K9388l4854
10755A6234k2213m570J7633K160j5907j3749k847k029l3321r267n2549N615J9044
10742i5766k4345L4228O1607K7287o1405k1048P0743M0922l375O814j9597K1853
10730C7918o4740n1793K0973r816O1447P4426k4886K7610L4964q156o9149k0055
10718H743j1728n5980k4209K479j3273l5603O476L3383N1130N0887J5908J4914
10706D3127J0190K2776K0566o7571l8804J3368Q311j4685M0948L0320K3073Q18
10694I2437N98l1800l4642N390K184l0997m7548l5807J2669P7035K4194p744p3239
$$ plain form
10779 11195 -50305 -75022 9953 63790 48489 -20355 -43855 -39249 -47523 -91377 -68748 -33727
10767 -33727 -14772 -38050 -80142 -51746 -32385 17778 -20368 8956 2506 21700 51088 16234
10755 16234 -5979 -10549 7084 9244 -6663 -20412 -23259 -25288 -58609 -67876 -120425 -114810 -95766
10742 -95766 -120111 -85883 -24276 3011 -58394 -79442 -8699 32223 28848 35662 16065 37918
10730 37918 -26822 -78615 -57642 -67458 -6011 68415 43529 71139 106103 97947 28798 8743
10718 8743 -2985 -58965 -83174 -80695 -93968 -129571 -123095 -89712 -38582 12305 28213 43127
10706 43127 53317 76093 96659 29088 -9716 3652 11963 -2722 38226 68546 91619 92437
10694 92437 93035 61235 26593 31983 34167 3170 -44378 -80185 -67516 9519 33713 25969 -47270
10681d7270j3931M9222L7197l9980j78838r493O9546K3301O5423L8626l5622r113
10669e0932P7780Q8437k7591j6285k7839m6680l1085P239O529R9321P830j3011
10657G3713j5963r7264p3642L9349J2130o90N3534P9968J975o4184k7541k7779
10645d6394J0236K9849j0186j29l0045K6548n4820M235Q8036L4623o3071o8852
10633g9970k4795j985L0727N4548Q309M6318r244l1843l6200P3896J5015n4947
10621a0171k4459L515J419J0235o299l7908p5067M8589J0133J0642O0029P4955
10609F5613j9644j12438o0006J9576N7037k5486k8761N9738k4535m128j6344J8863
10597g0515k1144k7672N0342K2929K07j6082L1050M3412m7268m1606n7404j2440
$$ plain form
10681 -47270 -61201 -11979 25218 -14762 -193600 -203093 -133547 -110246 -44823 -6197 -41819 -50932
10669 -50932 26848 115285 87694 71409 43570 -3110 -34195 -26956 -20427 78894 86724 73713
10657 73713 57750 -39514 -113156 -73807 -61677 -62367 -8833 71135 73110 8926 -18615 -46394
10645 -46394 -36158 -6309 -16495 -16624 -46669 -20121 -74941 -70706 17330 51953 -11118 -79970
10633 -79970 -104765 -106750 -76023 -21475 -13166 33152 23908 -7935 -44135 29761 44776 -10171
10621 -10171 -34630 -31115 -29696 -19461 -25760 -63668 -138735 -90146 -80013 -69371 -9342 65613
10609 65613 45969 -66469 -126475 -106899 -49862 -75348 -104109 -44371 -68906 -73034 -89378 -70515
10597 -70515 -91659 -119331 -68989 -46060 -45853 -61935 -30885 12527 -34741 -76347 -133751 -146191
10585a46191K6310K6092M9472M2412k6548k4680L0723k5335m4432m1114P3636
10574e9655J08366m4095n5914l5102K2563K6686N0910o919k9587l413K5029j89
10562a320l0043K6054L2466J7817j6267J9258P3059m3839k9237j16J5647n3978
10550I501j7579O257m257m182R179K9256q728l6052J5057J5799L2819k0412k3678
10537B980K9349j7648k2786L2269J8529n929L8625o0596n7935K6861R314N914
10525a053o1402L7509J06081N3668n658m1248r795k5887m8457j5191j1089j0610
10513c3132N76O7718M0751l9238m1338N415M3572O625o7894J085J0787m8204R3199
10500C9922N0475o3745K3001l87n2564j7938J4259j7575j7606J1638O5808M595
$$ plain form
10585 -146191 -119881 -93789 -44317 -1905 -28453 -53133 -22410 -47745 -92177 -133291 -59655
10574 -59655 48711 4616 -51298 -86400 -63837 -37151 13759 6840 -22747 -26160 -1131 -1320
10562 -1320 -31363 -5309 27157 44974 28707 47965 121024 77185 47948 47832 63479 9501
10550 9501 -8078 -1821 -6078 -10260 -1081 28175 19447 -16605 -1548 14251 47070 26658 2980
10537 2980 32329 14681 -8105 24164 42693 36764 75389 14793 -43142 -16281 -6967 -1053
10525 -1053 -62455 -24946 81135 134803 129145 87897 78102 52215 3758 -11433 -22522 -33132
10513 -33132 -32556 35162 75913 36675 -4663 752 44324 50949 -16945 -15860 -5073 -53277 39922
10500 39922 90397 26652 49653 49266 -3298 -21236 -6977 -24552 -42158 -30520 35288 39883
10488C9883r564q7585O705J3955J0364J6750r0455l3177j1541j5631M8716R9482
10476a2098N870l0776j3719N159J573n2138m656O3009K7487Q355J2597L5090n1722
10463e969n9253N0784J09655r087k7359j0157p3067k2683K0190M3840r802j3213
10451f121j8475l2549O4695O4575M803p609o4320j0234L313m0884j8936J890O715
10438e3137O875J2485J3624J4838j8725n0297J6104N7582K0686k4054r804K9942
10426A6119k6613m1109j2785J773M993j0537k0276j6931Q0883O6642J475O267
10414D9901q8506m4240N6599O4193R8584j2461o3184l0743Q705P019j9685m0958
10402a4776o005L3613N0615k8918L0652n9772k719j9252m0310l4499P4537K1626
$$ plain form
10488 39883 30319 -57266 -50561 -36606 -26242 -9492 -99947 -133124 -144665 -160296 -111580 -12098
10476 -12098 -6228 -37004 -50723 -45564 -43991 -96129 -100785 -37776 -10289 -1934 10663 45753 -5969
10463 -5969 -65222 -14438 95217 86130 58771 48614 -24453 -47136 -26946 16894 7092 -6121
10451 -6121 -24596 -57145 7550 72125 76928 69319 4999 -5235 -1922 -42806 -61742 -59852 -53137
10438 -53137 -46262 -33777 -20153 -5315 -24040 -74337 -58233 -651 20035 -4019 -13823 16119
10426 16119 -10494 -51603 -64388 -62615 -57622 -68159 -88435 -105366 -24483 42159 43634 49901
10414 49901 -38605 -82845 -26246 37947 136531 124070 60886 30143 38848 45867 26182 -14776
10402 -14776 -20781 12832 63447 34529 65181 5409 2690 -16562 -56872 -91371 -16834 4792
10390D792Q134L0410P036k8524k316Q410J1030k7163J8911K6217O846M949j3534
10377E5198j5086M0020L8897J110l3537k9117m581J6431o177K0857j6544J1083
10365G8554l6889n764j4557q310O5448L8843N3342l6730o2158k4483J277j8656
10353B9917K1283L3643J9322j9156J6026J7753O632p8958o2675M8406m0026j03949
10341a11782M5769Q6291j5222p0108N5011K772n7058n4731p494J7096M0874k3777
10329i2359R050Q4110K3072k8103O449O9999q192n3871J5751M1937k7457l3774
10317F612n6736M7710O9141N9575k1784n1964l3291L2323k0658l9654j9288p753
10305c5767j0049M1018j2092m6900P0181P6056J2853r075p4923J3382P0641o317
$$ plain form
10390 4792 12926 43336 50372 21848 19532 27942 38972 11809 30720 56937 63783 68732 55198
10377 55198 40112 80132 119029 120139 86602 57485 52904 69335 63158 84015 67471 78554
10365 78554 41665 35901 21344 13034 78482 117325 170667 133937 71779 47296 48573 29917
10353 29917 51200 84843 104165 85009 101035 118788 125420 46462 -16213 32193 -7833 -111782
10341 -111782 -66013 20278 5056 -65052 -10041 -7269 -64327 -119058 -126552 -109456 -68582 -92359
10329 -92359 -83309 801 23873 -4230 2219 72218 64026 10155 25906 67843 40386 6612
10317 6612 -50124 -2414 66727 126302 104518 52554 19263 51586 30928 -8726 -28014 -35767
10305 -35767 -45816 -4798 -16890 -63790 6391 82447 95300 86225 11302 24684 95325 89008
10293H9008o2560J4021p2834o5084q253L260N9081L8494m2611L1203n643l3906
10281e5824L1050J5674r461m5185N1644N9257j1942o1813m0985K3132j8021n1268
10269a13742J8275J1592O0339P264j4071Q811l8656J624Q4016M609n085m1339
10257a6363l843M5688j196j6216j7201k0277j9763P7695N5519n7482l6831J4895
10245D625K8060K6485J3737j313j2408K189n9194n4325o148K6273K1067J7378
10233F426j7123o578j2418j9610J9605L0235J0377L8335l4472j5780n394R991
10221C594K7589l843O427J0312J3174k6915j04207o1684m1389r073K6907n230
10209a64338R9504P2670j1861l5969n2190L032K1788M6874N1425J5861k8726Q389
$$ plain form
10293 89008 26448 40469 -32365 -97449 -105702 -102442 -43361 -4867 -47478 -16275 -21918 -55824
10281 -55824 -24774 -9100 -18561 -63746 -12102 47155 35213 -26600 -67585 -44453 -62474 -113742
10269 -113742 -95467 -83875 -23536 -16272 -30343 -21532 -60188 -58564 25452 30061 24976 -16363
10257 -16363 -20206 25482 24286 8070 -9131 -29408 -49171 28524 84043 26561 -10270 4625
10245 4625 32685 59170 72907 71594 59186 61375 2181 -52144 -58292 -32019 -10952 6426
10233 6426 -10697 -17275 -29693 -49303 -29698 537 10914 49249 14777 -1003 -6397 3594
10221 3594 31183 27340 33767 44079 57253 30338 -73869 -135553 -176942 -186015 -159108 -164338
10209 -164338 -64834 7836 -4025 -39994 -92184 -89152 -67364 -20490 30935 46796 18070 26459
10197B6459l4317k8694L943l2541m5623k862L5132N936j3447j6414M9265R0867
10185C7704Q0655j6463l6717J6950j5161J7597n4527l4979n352k7172j0403l0512
10173g8380M1115n813l7387L8061Q8072K500n4366p8449K6978Q632k9766K1944
10161e6859K5140L3213L8197j617p865r041j8399k6172P4501l1577m7845N628
10149b2696L9451l1484l8804k4710K1871L7941r1651J4040J5640N3178M8650l8154
10137a6728m1098N510R9909L7215K5550L0572n6814n3640m3969R720J8413m7205
10125c2565o5365K3267N1066O2375k889k680j9631j7195l2658K0803l2217k4411
10113g2100M7675p3152j870R5233l3155l4035O3604K1595P619M0805O2093N200
$$ plain form
10197 26459 -7858 -36552 -32609 -65150 -110773 -113635 -78503 -72567 -86014 -102428 -53163 37704
10185 37704 118359 101896 65179 82129 66968 84565 30038 -4941 -10293 -37465 -47868 -78380
10173 -78380 -37265 -43078 -80465 -42404 45668 48168 -6198 -84647 -57669 -49037 -78803 -56859
10161 -56859 -31719 1494 39691 38074 30209 21168 2769 -23403 51098 19521 -28324 -22696
10149 -22696 16755 -14729 -53533 -78243 -56372 -18431 -110082 -96042 -80402 -27224 21426 -16728
10137 -16728 -57826 -52316 47593 84808 110358 140930 84116 30476 -13493 -3773 14640 -32565
10125 -32565 -97930 -74663 -23597 38778 35889 33209 13578 -3617 -36275 -15472 -47689 -72100
10113 -72100 -24425 -97577 -99447 -4214 -37369 -71404 -7800 13795 21414 62219 124312 129512
10101A29512j7721n5458n0361m8926k7355j7201K1440K0374M1324M3620K0294
10090E9542r655o1722k0050o525M4543J7135l2575L0831M120J082l0867J1824
10078G683R2382J3514o8700N573l4502j3090K972l514M5587R435n831m142K2314
10065F9681q4065r4077K8826Q173N5975l3495l655L798J2663J3849K4572q590
10053f345n0660O362M0698r532K4519k5852m5000J9686L6289J3037m236l9955
10041d0989K1445J6728J7156k9002M93j8915P6715j1563n4598j5175L0418R245
10029A958K1206k3644k5575j5834l356M1747J8169l8114n0802j9981L1669L8921
10017b3636J3034n58L3467k4862J1038L2961m6935P345M5616l2772j6809O5336
$$ plain form
10101 129512 111791 56333 5972 -42954 -70309 -87510 -66070 -45696 -4372 39248 59542
10090 59542 49887 -11835 -31885 -38410 6133 23268 -9307 21524 25644 26726 -4141 7683
10078 7683 100065 113579 44879 50452 15950 2860 5832 2318 47905 57340 51509 47367 69681
10065 69681 -14384 -108461 -79635 -71462 -15487 -48982 -52637 -48839 -36176 -22327 2245 -6345
10053 -6345 -57005 -50643 -9945 -19477 5042 -20810 -65810 -46124 -9835 3202 -1034 -40989
10041 -40989 -19544 -2816 14340 -14662 -14169 -33084 43631 32068 -22530 -37705 -7287 1958
10029 1958 23164 -480 -26055 -41889 -45245 -3498 14671 -23443 -74245 -94226 -62557 -23636
10017 -23636 -10602 -11160 22307 -2555 8483 41444 -5491 1854 47470 14698 -2111 63225
10005F3225j5056o8301J1218O490N343k4096R032O8144j5698K9506K1833j0054
9993H1586Q879l3089m1107m0210K3329o9305K9609L2145l999m1107n2983J6547
9981h9705K6899M9883J2314m324L6469M815j058k3648L586m1332O76J3229J3418
9968A222L0002M270M4713k3526l6144m514J8430K3781n3498q622M5957k7860j0546
9955C665k8398P092M9037N4557P229o313n6283j6976j6027j2844J2079j846L2305
9942B7277M7158l7502m6435j7420l272M872j0546k746J2254L8235M7868M3351
9930A03094L1220n1932n3512m4735n442K6920M896k8207j0176J372M120O9685
9918D7303P4439m3377l6178P74n6635k05l3958j5977K8249k263K0241P585k0395
$$ plain form
10005 63225 48169 -20132 -8914 -2424 2919 -21177 -12145 55999 40301 69807 91640 81586
9993 81586 90465 57376 16269 -23941 -612 -69917 -40308 -8163 -12162 -53269 -106252 -89705
9981 -89705 -62806 -12923 -609 -4933 31536 36351 35293 11645 15231 -26101 -25425 -12196 1222
9968 1222 31224 35494 80207 56681 20537 16023 34453 58234 4736 -3886 42071 14211 3665
9955 3665 -24733 -17641 31396 85953 93182 86869 30586 13610 -2417 -15261 -3182 -5028 27277
9942 27277 74435 36933 -9502 -26922 -30194 -25322 -35868 -38614 -26360 11875 59743 103094
9930 103094 134314 82382 28870 -15865 -21307 5613 10509 -17698 -27874 -26502 -22382 47303
9918 47303 121742 78365 42187 42961 -13674 -13879 -47837 -63814 -35565 -37828 -17587 -10002 -30397
9905c0397R535j893K1384M1523l7122n4259M1646M0681J9973l7952k4625j8745
9893c0251m7622j9216Q525N9256J9512L99k1933M1141l2781J1882L2232k7924
9881f780l1451O6723p513n513m9347J6819P093M8359o081M006q942m808n395Q7296
9867A04466K9760n8363m384N4207L1181m0357m4876k4904J5048J7486m5087n5170
9855b0993k7506m979p031L4329L6624J4839M2629M332p2875m3773J6593M1527
9843A3716M3469p5142l3795n4099L1617N7424n0388j289O3489P281p229L4642
9831B9696o230K3665L7936L9718n651L4384P36p6843n4448k6945p93n836O637
9818c974n151N0679K7358M6773J395m6526R189J2852l2711j9193O004k3648l2859
$$ plain form
9905 -30397 -20862 -22755 -1371 40152 3030 -51229 -9583 31098 51071 13119 -11506 -30251
9893 -30251 -77873 -97089 -88564 -29308 -9796 -9397 -31330 9811 -22970 -11088 21144 -6780
9881 -6780 -38231 28492 20979 15466 -33881 -17062 -9969 38390 32309 36315 27373 22565 17170 104466
9867 104466 134226 75863 71479 125686 156867 116510 71634 46730 61778 79264 34177 -20993
9855 -20993 -48499 -53478 -60509 -26180 10444 25283 67912 72244 -631 -44404 -27811 13716
9843 13716 57185 -17957 -51752 -105851 -74234 -16810 -67198 -68487 -4998 2283 -4946 29696
9831 29696 23466 47131 85067 124785 119134 153518 154254 77411 22963 -3982 -4775 -10611 -3974
9818 -3974 -9125 41554 68912 115685 117080 70554 79743 92595 59884 40691 46695 23047 -9812
9805i812k3444k5531n6961r450P9243K3109R777k100P596L2776K5418j7003o1011
9792b7393j289K9785J6599n5116r791K1757p579k0955J3977l83l607j7447N606
9779e5836K9146o364L944P3037J9039l0274j0513K6308m6366o3738M810L9293
9767a7514K5785M0914m518j7496j1370o6258k2453O6917l6037l8550k5299L691
9755a02188p786J1059M5894k3213l2971O4686J04226J617p0116J5829o601J0874
9743A1310J553o1566k9248Q418L5266K3982k4921J5031K3250O383O3937l1614
9731D1781j7690M7475J8796q4908k9065K8177L4521M7925p0450q8089k0537O259
9719h5805M842O551L6401j3716p2182m054O1662M6230j7681p013N5741l4010n1525
$$ plain form
9805 -9812 -33256 -58787 -115748 -125198 -45955 -22846 -13069 -15169 -7573 25203 50621 33618 -27393
9792 -27393 -28682 1103 17702 -37414 -47205 -25448 -33027 -53982 -40005 -40388 -43995 -61442 -55836
9779 -55836 -26690 -33054 -29110 43927 62966 32692 22179 48487 2121 -61617 -56807 -17514
9767 -17514 8271 49185 44667 27171 15801 -50457 -72910 -5993 -42030 -80580 -105879 -102188
9755 -102188 -109974 -98915 -53021 -76234 -109205 -44519 59707 61324 -8792 7037 436 11310
9743 11310 12863 -48703 -77951 -69533 -34267 -10285 -35206 -20175 3075 9458 73395 41781
9731 41781 24091 71566 90362 5454 -23611 4566 39087 87012 16562 -71527 -92064 -85805
9719 -85805 -80963 -74412 -38011 -51727 -123909 -127963 -66301 -20071 -37752 -44765 10976 -23034 -74559
9706g4559R978L6783j7655r811N2668J3479J2958j9647k8934K9701L097k7076
9694a9018l4158r394K3212j6936P175j3856m4986n2837J6412K9483J9862O9112
9682b5929j2441j6007K0998M3487n1676n815o060N8412O033J4052k4865j2278
9670a2089k7703m8036P1835P0081J3976j1489m4791j6497j6861l6113J0271l7580
9658h4996M9992L6651j5871l9471n948P3313L9247J9915N427k502o1887m4768
9646c0898O137j597L996k885J7000r9714j3708M9976K7573l0878l7528M8021P9368
9633A4863J4147j4691j01066j00411L3964N7393N278P7625K2072K1554O5455M0732
9621A36915L824n9376p9193Q976K6377J1489k4154p2131j4120k5928m277J2646
$$ plain form
9706 -74559 -64581 -27798 -45453 -55264 -2596 10883 23841 4194 -24740 4961 8058 -19018
9694 -19018 -53176 -62570 -39358 -56294 -49119 -62975 -107961 -160798 -144386 -114903 -95041 -25929
9682 -25929 -38370 -54377 -33379 10108 -41568 -47383 -53443 4969 11002 25054 189 -12089
9670 -12089 -39792 -87828 -15993 54088 68064 56575 11784 -4713 -21574 -57687 -47416 -84996
9658 -84996 -35004 1647 -14224 -53695 -59643 13670 52917 72832 78259 75757 13870 -30898
9646 -30898 -24761 -26358 -22362 -25247 -8247 -107961 -121669 -71693 -44120 -74998 -112526 -64505 14863
9633 14863 29010 14319 -86747 -187158 -153194 -95801 -90523 -12898 9174 30728 96183 136915
9621 136915 140739 81363 2170 11146 37523 49012 24858 -47273 -61393 -87321 -91598 -78952
9609g8952q71N7074K2056j8168k7862K362N3144J8684k0681J8662l7507K4844
9597A2785K8706j9520J3075j1500L501k8038l8254K4852M462L1417J157Q408m1595
9584a0544K1824J7573J7456L3280J2310l3258r2210n6139J1944O6806k9067j893
9572d1918N2684J0526j0035n5467j6474O0205K0301j9099L2245K7323k2119k6514
9560A1658J9863r548o7134K3414j9336n734l0144P3501K9399j1236j0919M2549
9548D6333N522m9705l6528r823j8206k4678J5715O1851J9919j3933K8435K0648
9536D5550K0179J3770p3056o5585J1274K1014k8585k0145L1501m4122l988m5602
9524a37795N9186N0571n790j5565k1401J32816N2018o6579k6l4777l2170M2104
$$ plain form
9609 -78952 -79823 -22749 -693 -18861 -46723 -44361 8783 27467 6786 25448 -12059 12785
9597 12785 41491 21971 35046 23546 27047 -991 -39245 -14393 -9931 21486 22643 31051 -10544
9584 -10544 11280 28853 46309 79589 91899 58641 -33569 -89708 -77764 -10958 -40025 -41918
9572 -41918 10766 21292 11257 -44210 -60684 -479 19822 723 32968 60291 38172 11658
9560 11658 31521 21973 -45161 -21747 -41083 -46817 -76961 -3460 25939 14703 3784 46333
9548 46333 51855 2150 -34378 -44201 -62407 -87085 -71370 -9519 10400 -3533 24902 45550
9536 45550 65729 79499 6443 -59142 -47868 -26854 -55439 -75584 -44083 -88205 -92193 -137795
9524 -137795 -78609 -28038 -33828 -49393 -70794 62022 114040 47461 47435 12658 -19512 22592
9512B2592K3117k7759j66J3600J5097q4615l511K281M5884j7177m9503j5092M6630
9499b8622R0245L6538N4145p543k0312m2523r222k5443o4333q980J1384k4542
9487c9208l9453M2311J6981P904K029O8564J0981k4976n930J1656M754j4473j7529
9474B3611k2828k7529k174K8346o2651l2745J3464k7958Q260R890K6260N8497
9462g557j8792k2295J5535L9937j5260k046J3950k1740r1784l0344N2125L8831
9450d9440k4881j4104O4333N3003o3121L8213n178p508p2000p3535o4166K5580
9438a92804Q4914P6157K3863j7134Q592n71j7584k8129L5931M8592N519j2085
9426A5261p611J4761M7582j0930m6051n4100j9384p213K4229j4934j9052L0875
$$ plain form
9512 22592 45709 17950 17784 31384 46481 -38134 -41645 -39364 6520 -10657 -60160 -75252 -28622
9499 -28622 61623 98161 152306 144763 124451 81928 72706 47263 -17070 -26050 -14666 -39208
9487 -39208 -78661 -36350 -19369 -11465 -9436 59128 70109 45133 39203 50859 55613 41140 23611
9474 23611 783 -26746 -28920 -574 -63225 -95970 -82506 -110464 -102204 -92314 -66054 -7557
9462 -7557 -26349 -48644 -33109 6828 -8432 -10478 3472 -18268 -110052 -140396 -88271 -49440
9450 -49440 -74321 -88425 -24092 28911 -34210 4003 -1175 -8683 -80683 -154218 -218384 -192804
9438 -192804 -107890 -31733 -7870 -25004 -16412 -16983 -34567 -62696 -26765 21827 27346 15261
9426 15261 7650 22411 69993 59063 13012 -41088 -60472 -67685 -43456 -58390 -77442 -46567
9414d6567P0483k0366L6114N1140j0610L3492l1790m8936K4768K7892k718k7831
9402E5071q5455j1064M1928o4586n6634N3924J18553J24238O421m0765o9807O828
9390G8652M7710j5992k8567l8363L129K2463k7795q3096m8716J2105O0457P9998
9378F1985l9416l1653K0714l4032L5119M3030o76l7987o3420m0660J0328O718
9366f9950M5173M0236j02070L816J7567k777O9128m948p866R718Q1556q206l0572
9353D0805M8891j7857j7372j795K1998o6779o0817L6256j8866o522M0502K2019
9341B0463K7203j4221K9009l962J2556K7493k0996N644m2832m6629j2519K307
9329a6484O8156n1429m5576J4369M6523k6279K6579J03659L463m4966o2031m0343
$$ plain form
9414 -46567 23916 3550 39664 90804 80194 113686 81896 32960 57728 85620 82902 55071
9402 55071 -30384 -41448 480 -64106 -120740 -66816 51737 175975 182396 141631 71824 78652
9390 78652 126362 110370 81803 43440 46569 69032 41237 -41859 -90575 -78470 -18013 61985
9378 61985 22569 -9084 11630 -22402 12717 55747 55071 17084 -46336 -86996 -76668 -69950
9366 -69950 -24777 15459 -86611 -82795 -65228 -68005 1123 -3825 -11691 -1973 79583 71377 40805
9353 40805 89696 71839 54467 52672 74670 7891 -52926 -16670 -35536 -42058 -1556 20463
9341 20463 47666 33445 62454 58492 71048 98541 77545 83189 40357 -6272 -18791 -16484
9329 -16484 51672 243 -45333 -30964 15559 -10720 15859 119518 122981 78015 15984 -24359
9317b4359k0747M2094P4877j9779l3601L746m4328N2928M7753m0394n7888l5013
9305e4711j4692m2524M5593K3762r850L6100L0204k5815m9025j1157N3663L6217
9293A7765m7965L8859K5891l099N3268j1626j6287j5501o7816L1023p002N2319
9281D9829M3156k4856R640p3375j6693J124J3886k1818K9470P814k4007k7034
9269c2864R2323l3889k4637O565p6981n2050J8785K4683K615J2042J0872J8352
9257c4184j4128K1777O096j526P402Q3924K4416L0220o6232j9381j9049J2656
9245C1991N425M0825k8385q6241j5353K0891L5218J2299m118L2060L3154l952
9233G3814L786k8030j8296k6167j9576M2306l1871J9642m446l729J7296k877K0158
$$ plain form
9317 -24359 -45106 -3012 71865 52086 18485 22231 -22097 30831 78584 38190 -19698 -54711
9305 -54711 -69403 -111927 -66334 -42572 -52422 -16322 13882 -11933 -60958 -72115 -18452 17765
9293 17765 -30200 8659 34550 31451 84719 73093 56806 41305 -26511 4512 -2490 49829
9281 49829 92985 68129 77769 4394 -12299 -11175 2711 -19107 10363 18177 -5830 -32864
9269 -32864 59459 25570 933 7498 -69483 -121533 -102748 -78065 -75450 -63408 -52536 -34184
9257 -34184 -48312 -26535 -20439 -21965 -14563 69361 93777 123997 57765 38384 19335 31991
9245 31991 37416 78241 49856 -36385 -51738 -30847 4371 16670 12552 44612 77766 73814
9233 73814 77600 49570 31274 5107 -14469 27837 -4034 15608 11162 7433 24729 21852 42010
9220D2010K4472L054L0013j5599j0629P694N707m4799k1780k8585j8828r49O3622
9207C5403J7696j133L507l750k7510P582N465l9679n7009K0278N0203M6025K2243
9194G9321M8197l7155j1890Q1365L470r2176J2536j7179l4983J1873j9303J1323
9182C5399J891J5780J2535j2378M088j5653J3106K5816k8925r073J4893P7107
9170A34586M7212k7614o9628p3397m9348J9599j5884J2946P7711M4971L7317j6107
9158A22364j183L3403j2732m15k3306r9740n6830M1636J5899K8907j0L6033L6533
9145A20559J9693k9126M8134N4059j0417j7703k565M188j03808L0846O0207j7941
9133A56126k7860k0192K0801M2186J7352Q416J9681O6572L6750J227j8448k1524
$$ plain form
9220 42010 66482 69536 99549 83950 73321 81015 86722 41923 20143 -8442 -27270 -28219 35403
9207 35403 53099 51966 55473 51723 24213 31795 37260 -2419 -59428 -39150 11053 57078 79321
9194 79321 127518 90363 78473 159838 163308 71132 83668 66489 31506 43379 24076 35399
9182 35399 37290 53070 65605 53227 57315 41662 54768 80584 51659 42586 57479 134586
9170 134586 181798 154184 84556 11159 -38189 -18590 -34474 -21528 56183 101154 138471 122364
9158 122364 121181 154584 141852 141437 118131 18391 -38439 3197 19096 48003 47993 84026 120559
9145 120559 140252 111126 159260 213319 202902 185199 182634 186822 83014 113860 174067 156126
9133 156126 128266 108074 128875 171061 188413 196829 216510 283082 319832 321059 302611 281087
9121B81087l6504L7268m837J4637J9051M0346N1708O4347Q8429K5047M9937J25073
9109G55589J11869O7996P7080J51836K20279K18126K51168L56165M87393O89091
9099C386592J013992J596160K717678M522389O264870N877948K766349K93573
9091B8439551l3150n50631m016376o584882n175922l173067j845506j195662r06979
9082D957376o77613m42880l53352k39019j85008k43485j60203j01087j34895j56480
9072B263354j09579q5634j06155p3061p1761p62r485n7570q5463m5276j02258
9061A516350r7707m8165p5220p2876m7445m7508K875l4586n3028o2289n9187m3773
9049H77441j5945m4681M3768p519q7088l0635L4420n5284j17411n1584p157L3077
$$ plain form
9121 281087 244583 281851 277014 291651 310702 351048 402756 467103 555532 580579 630516 755589
9109 755589 867458 935454 1012534 1164370 1384649 1602775 1853943 2210108 2697501 3386592
9099 3386592 4400584 5996744 8714422 13236811 19501681 25379629 28145978 28439551
9091 28439551 28406401 27855770 23839394 17254512 12078590 8905523 7060017 5864355 4957376
9082 4957376 4279763 3836883 3483531 3244512 3059504 2816019 2655816 2554729 2419834 2263354
9072 2263354 2153775 2068141 1961986 1888925 1817164 1816402 1806917 1749347 1663884 1618608 1516350
9061 1516350 1418643 1370478 1295258 1222382 1174937 1127429 1130304 1095718 1042690 980401 921214 877441
9049 877441 861496 816815 860583 853064 765976 735341 769761 714477 597066 545482 538325 571402
9037E71402M976L9696k2374k7305l9961l036N866R783N437l8366n4079o3221L9442
9024D28260M2523M9808J448o3640o5161n3919k1074J6526K4512l8047P332k6119
9012C02449K0613j5559J517k4443p249K6250l7546J5549k9577k5271l6088k7225
9000A63420K4649L4576N5885J8561m833m5980J086l9728k5657M590o3L0195n4765
8987A61936J5682j739j4928o5383o016R933M7434k1037l8010J1056k3512m1679
8975C3737J6769k955L2869M0526j6624L2479K8031j5889p601j1247k1882K3226
8963A31439J0962l6187n6793N300Q715K0602J1116K2922J2521k9020n9233m7480
8951e136o146P0947P600k3067O46p295K8332k9929k4904j9484L8206Q566M2417
$$ plain form
9037 571402 576378 616074 593700 566395 526434 523398 529264 539047 544484 506118 452039 388818 428260
9024 428260 470783 520591 522039 458399 393238 339319 318245 334771 359283 321236 328568 302449
9012 302449 323062 307503 309020 284577 277328 303578 266032 281581 252004 226733 190645 163420
9000 163420 188069 222645 278530 297091 292258 246278 247364 207636 181979 186569 186506 216701 161936
8987 161936 177618 175879 160951 95568 89552 99485 146919 125882 87872 98928 75416 33737
8975 33737 50506 47551 80420 120946 104322 136801 164832 148943 141342 130095 108213 131439
8963 131439 142401 106214 49421 54721 63436 84038 95154 118076 130597 101577 42344 -5136
8951 -5136 -11282 59665 67265 44198 44844 37549 65881 35952 11048 -8436 29770 38336 80753
8938H0753l1414k5137M6425p637m7579k804j24m4765N8826P158N6044J01002k331
8925A88417o3423N994K0308O406n4228n8747j2622M9771J5409O1004Q5811j3493
8913B30607l6673r617l1288n4221K3655K4482o0639k7488J7795J1401M1842l0649
8901I9207q7090p4645j2602M7644K8368L5917j4400k0480p813o771M6771K2523
8889E6629l607k3969R921N9324L4787r989p8579r8733j3743k3260m5762J1682
8877a25299J9823N0059K5095j637Q847K2256N9616k7158r148L2872l5455n5504
8865c5633k6102K6429M3311O7132J3517j9018o8933O23l3654j7234O5504J09756
8853A25698n394n3691o7398k2808Q089m2045K5999k751o3010j1208L5141L7919
$$ plain form
8938 80753 49339 24202 70627 62990 15411 12607 12483 -32282 26544 33702 89746 190748 188417
8925 188417 124994 130988 151296 157702 103474 44727 32105 81876 97285 158289 244100 230607
8913 230607 193934 184317 153029 98808 122463 146945 86306 58818 76613 88014 129856 99207
8901 99207 12117 -62528 -75130 -27486 882 36799 22399 1919 -5894 -12665 34106 56629
8889 56629 53022 29053 38974 98298 133085 123096 44517 -54216 -67959 -91219 -136981 -125299
8877 -125299 -105476 -55417 -30322 -31959 -23112 -856 58760 31602 22454 55326 19871 -35633
8865 -35633 -61735 -35306 8005 75137 88654 69636 703 1326 -32328 -49562 15942 125698
8853 125698 120304 66613 -785 -23593 -15504 -57549 -31550 -34301 -97311 -108519 -73378 -35459
8841c5459j6811M216N3957j1441k5582q469M2790L3913L2953o0954L8357P2044
8829A19514m8004m4156p1342M8543P5169K3917j1017p4750q6307L659l9337r121
8817a13232J4539m0966O553M4526K7080K2039l136n4380p5168J5124M8499L5565
8805g2957N5239K2327p2169K1451M4883k3767O672k085j0134j4880j6367p855
8793f9642M1240k346j1198l8791n3689M4299M634L3188L8555l815q396j8567N796
8780c8732K9126J255P1726k8393P099k5497m7977Q547P502J5319j5843n4980k2495
8767i3343l9718J3105R2031N1543m567K6830L6611L409l0489n1417o0425K7044
8755b9386P901K3252J2672j8046J4925k3258L8026K9046L0939k0235m1436J0358
$$ plain form
8841 -35459 -52270 -48054 5903 -5538 -31120 -39589 3201 37114 70067 9113 47470 119514
8829 119514 71510 27354 -43988 4555 79724 103641 92624 17874 -68433 -64774 -104111 -113232
8817 -113232 -98693 -139659 -133106 -88580 -61500 -39461 -42597 -96977 -172145 -157021 -108522 -72957
8805 -72957 -17718 4609 -67560 -46109 -1226 -24993 -18321 -20406 -30540 -45420 -61787 -69642
8793 -69642 -28402 -30748 -41946 -80737 -134426 -90127 -85493 -52305 -13750 -17565 -25961 -44528 -38732
8780 -38732 -9606 -8351 63375 34982 42081 16584 -31393 -22846 -15344 -25 -15868 -70848 -93343
8767 -93343 -133061 -119956 -27925 23618 19051 45881 82492 85901 55412 3995 -56430 -29386
8755 -29386 -21485 1767 14439 -3607 11318 -11940 26086 55132 86071 65836 24400 34758
8743C4758K5267n4075k0095o2197L6088N0295L2999o925J208j0641L3041N5132
8731A14855J9638N7358q155n1379m5912k0885j6167m919j8481J4115k2122k885
8719A5061k849k0016M380j3769k9371K2364n5447J7581K8005K9952J4603l8395
8707b7901J8165L5978j18491l0099J3744K3575P246O4577o16j7626M2582K2041
8695C3175l8835j6913j8370j2344n0603J3073P9190J4752k7394m046K8376j7283
8683a7222L7782l2887k7001L7020p944j1004k2031K3264P1768K0966m3823l7870
8671h982k1936K4704K8797Q940J5016j1613j9253N1149K0261L8055m8885q6627
8659a0374K5108l827r4515n3598L2011L9290J3020L1674N280q509j2218J1256
$$ plain form
8743 34758 60025 5950 -14145 -76342 -40254 10041 43040 36115 37323 26682 59723 114855
8731 114855 134493 191851 183696 132317 86405 65520 49353 44434 25953 40068 17946 15061
8719 15061 12212 -7804 -3424 -17193 -46564 -24200 -79647 -62066 -34061 -4109 10494 -27901
8707 -27901 -9736 26242 -92249 -122348 -108604 -85029 -77783 -13206 -13822 -31448 11134 33175
8695 33175 -5660 -22573 -40943 -53287 -103890 -90817 -11627 3125 -24269 -28315 61 -17222
8683 -17222 20560 -12327 -39328 -2308 -10252 -21256 -43287 -20023 51745 72711 28888 -8982
8671 -8982 -30918 -6214 22583 31523 46539 34926 15673 66822 87083 125138 76253 -10374
8659 -10374 14734 10907 -83608 -137206 -105195 -65905 -52885 -21211 -15931 -24440 -36658 -25402
8647b5402N06M8470M8422j9428l5257o4375M0219M4921J4500L6882k6139m342
8635E8977j6054J9006l1419J745j1973l6966K1073k1894k5233M9489K7519K2270
8623E6540m1607K0246l5417K1097r655m3382l4734j0882O3743N9285K0631n5273
8611A0592j1949P2837p761J4503o6353k5844J715J1528L3106K373j6679J064N1664
8598G0796k9134R153k8100r4500p8693N9507L4770l8625K9219N0485L4421J1255
8586C0554k9342k3693L1517j8642J3178L5862O7853j328Q449K3455K0452k5369
8574A32946O4899M4861K915J154N3835j8544r0489r7547j16916k7527Q8559O1229
8562I9375K428m785m568j6692m9326j9025P845K1958O0N336M9752L3771j9604
$$ plain form
8647 -25402 -24896 23574 71996 52568 17311 -47064 -6845 38076 52576 89458 63319 58977
8635 58977 42923 61929 30510 32255 20282 -16684 4389 -17505 -42738 6751 34270 56540
8623 56540 14933 35179 -238 20859 11204 -32178 -66912 -77794 -14051 45234 65865 10592
8611 10592 -1357 71480 63719 78222 11869 -13975 -12260 -732 32374 34747 18068 19132 70796
8598 70796 41662 50815 22715 -71785 -150478 -90971 -56201 -94826 -65607 -15122 19299 30554
8586 30554 1212 -22481 9036 -9606 3572 39434 107287 105959 114408 137863 158315 132946
8574 132946 197845 242706 245621 246775 300610 282066 191577 94030 -22886 -50413 38146 99375
8562 99375 101803 97018 92450 75758 26432 7407 15252 37210 37270 42606 92358 126129 106525
8549A06525O559O139j021p0919o5649K5001K2864k1594R940K7455N6358j8553
8537H3105o0657L855O20P0191O0769J548P7427J18889J13779N510k8531j74o6439
8524C79892j04280m5013q9622k4477o898o8171l3824j9748m154j0684J5702L8178
8512B6901k7457O396L752M8791j8069K3129m17p8648M1554J4872L3643L292n2556
8499B5183n9217k4446K9084O2940R903K2570j4619n7043n7496L8665m2951J6879
8487e0548R1159M4740M9155M9419M233k5174R161n029m6108n2991l9625k5635
8475B757L6812N8841J8215p1512m3703P2925K387q1365o9972K1169N5381j1727
8463i792q5370j3404M4567K1142m482N0361M9944L3179o2548n8987j9476L5795
$$ plain form
8549 106525 113084 119223 118202 47283 -18366 6635 29499 7905 17845 45300 101658 83105
8537 83105 22448 26303 26923 97114 157883 159431 236858 355747 469526 475036 446505 446331 379892
8524 379892 275612 230599 140977 116500 109602 41431 7607 -12141 -16295 -26979 -11277 26901
8512 26901 -556 5840 9592 58383 40314 63443 63026 -15622 25932 40804 74447 77739 25183
8499 25183 -34034 -58480 -29396 33544 43447 66017 51398 -5645 -63141 -24476 -67427 -50548
8487 -50548 40611 85351 134506 183925 188158 162984 172145 167116 121008 68017 28392 2757
8475 2757 39569 98410 116625 45113 1410 74335 76722 -4643 -74615 -53446 1935 -9792
8463 -9792 -95162 -108566 -63999 -42857 -47339 3022 52966 86145 23597 -35390 -54866 -19071
8451a9071l6137M5748Q3140M297l9053n963o7354j1723n17m0875M9812M6037K6444
8438C4785K385K5874J7019k3654n5326K5279k2056l477N7220M7205n3817l1249
8426B0188O2763J6120l6951j33816l2591j47q461O9304M4946J1620j7389o125
8414a0539J1619L02p6878O1170M0174k2524J3855J0288m2951m9289m788J5945
8402e3616K7613M0620J3873o784m3639k3626k9375O5332L5162M356L9569O8122
8390A37607L8950K0038o0327r6307o0580J0933L1875K6785q5740o5651J6962J5972
8378f9483Q1273J4481K6322M9335l837l9895j318m8440P3408j7806m2881m9669
8366b8510p2P4739L8141O948M176m0784m5969n4568R30M6633l8982l4181K6756
$$ plain form
8451 -19071 -55208 -9460 73680 77977 38924 32961 -34393 -46116 -46633 -87508 -37696 8341 34785
8438 34785 37170 63044 80063 56409 1083 26362 4306 829 58049 105254 51437 20188
8426 20188 82951 99071 62120 -71696 -104287 -104434 -112895 -43591 1355 12975 -4414 -10539
8414 -10539 1080 1382 -75496 -14326 25848 3324 17179 27467 -15484 -64773 -69561 -53616
8402 -53616 -26003 14617 28490 21706 -21933 -45559 -74934 -9602 25560 29916 69485 137607
8390 137607 176557 196595 136268 39961 -20619 -9686 22189 48974 -36766 -102417 -85455 -69483
8378 -69483 11790 26271 52593 101928 98091 58196 56878 8438 81846 64040 21159 -28510
8366 -28510 -28582 46157 84298 91246 95422 54638 8669 -45899 -44969 1664 -37318 -71499 -44743
8353d4743R563K3341O5623j5847l1320j5011k5099J7553K458k5428M886M6917
8341A2893J1956o4626j9610J9319m8967L2560J3518K5828L93J6921j2080Q165
8329c730L0015m4185q9052j8895N2321J295J247J8769M8468J4925Q193L7043k3088
8316C3326m3136R622k3359L4288k405M139p453k2224M2892K2693k9453M717L2685
8303E6332L327k8891j6316K8837j0926K0245N230k9054m9060j2985K5321L1271
8291B3331J322k313m318m8913K3115N918O5421K6337q8238l153M8388K2603j9335
8278E0165k1663J0574q529j0195k4343l6540m2439L5079K1642m1927R928L3812
8266b4436M5559J0483j183k5335j4453O3968O44p666o2120j4358K1114j3463J9456
$$ plain form
8353 -44743 -35180 -11839 53784 37937 6617 -8394 -33493 -15940 -13482 -38910 -34024 12893
8341 12893 24849 -39777 -59387 -40068 -89035 -56475 -42957 -17129 -16736 185 -11895 -3730
8329 -3730 26285 -17900 -106952 -125847 -73526 -72231 -70984 -52215 -3747 11178 19371 56414 33326
8316 33326 -9810 -188 -23547 10741 8336 12475 5022 -17202 25690 48383 18930 23647 56332
8303 56332 59659 30768 14452 43289 32363 52608 57838 28784 -20276 -33261 -7940 23331
8291 23331 24653 22340 18022 -30891 -7776 -1858 63563 89900 1662 -1491 46897 69500 50165
8278 50165 28502 39076 30547 20352 -3991 -40531 -82970 -47891 -26249 -68176 -58248 -24436
8266 -24436 21123 31606 30423 5088 -9365 54603 55247 47581 -14539 -28897 -7783 -21246 -1790
8253a790l0949l367N8320l1119l7505L3823J0016K4345J6477j4382K2536k3693
8241B2712j574L3548Q907l6951k3001L6363L2300m089L3302m163m5609k4945L7068
8228F3868L232J129J9942j5674o557m6787m1385J7849K173j4608l6403k1283K3239
8215e1265P1241O6028k8044o0413K3920k5211q591J1684n1562J377N9826L5134
8203D4124N348p3651l548M8072N5044l6403k090N41m4102j6591J7717K8980N9983
8190H3424K7992j4753n4559n8900O9231k905m9676K65K637K4581J1330K3403j0923
8177E1147J5331J293p6244j2412O038k2904k450K7561j6950o5470L2749J40942
8165G8631M5426j4507l4685l7484o5449J1937Q3637L8489j02635l7432j8399J7328
$$ plain form
8253 -1790 -32739 -36106 22214 -8905 -46410 -12587 -2571 21774 38251 23869 46405 22712
8241 22712 21138 54686 63593 26642 3641 40004 72304 68215 101517 97354 51745 26800 63868
8228 63868 67100 68229 88171 72497 65940 19153 -22232 -4383 -2210 -16818 -53221 -74504 -51265
8215 -51265 19976 86004 57960 -2453 21467 -3744 -12335 -651 -52213 -50836 8990 44124
8203 44124 49472 -24179 -27727 20345 75389 38986 36896 37437 -6665 -23256 -5539 23441 83424
8190 83424 111416 96663 42104 -16796 52435 49530 -146 119 2756 27337 38667 62070 51147
8177 51147 66478 67771 -8473 -20885 -14847 -37751 -40201 -12640 -29590 -95060 -62311 78631
8165 78631 124057 109550 74865 37381 -28068 -16131 67506 105995 3360 -34072 -52471 -35143
8153c5143Q2734L778n6211l9723k8491M2958J4492N939L9951r3o133K0336J1070
8140E5464m1796k5979j2658k9746j753M638L88P0001k3152N097Q734L8540l6221
8127A1557l5515j1682K0437m9538K7595M4868m6254J8472l0520n5228m229K0221
8115h9816N1882J4502N7085K4751K5525k9831m1854L8768L2565j2819q301j5498
8103D6959n9288j8139l0771j7438P266M7611K0154j0386Q371M0759K7684M861
8091F7643K8937m3757m8547m2774O6158P302m3857o889L8798k8569l4797M4472
8079D120L9284n3720o980J284p030J0889l7044j5901m2284K9998O8926N5100J4519
8066F1161K5409l0770l3611N3182k3550j9380j5200N572K3949Q928J7204J6106
$$ plain form
8153 -35143 47591 51369 -4842 -44565 -73056 -30098 -15606 -9667 30284 30191 24058 44394 55464
8140 55464 13668 -12311 -24969 -54715 -56468 -51830 -51442 18559 -4593 504 9238 47778 11557
8127 11557 -23958 -35640 -15203 -64741 -37146 7722 -38532 -20060 -50580 -105808 -110037 -89816
8115 -89816 -37934 -23432 33653 58404 83929 54098 12244 51012 83577 70758 62457 46959
8103 46959 -12329 -30468 -61239 -78677 -71411 -23800 -3646 -14032 -5661 35098 62782 67643
8091 67643 96580 52823 4276 -38498 27660 34962 -8895 -15784 23014 -5555 -40352 4120
8079 4120 43404 -10316 -17296 -16012 -23042 -12153 -49197 -65098 -107382 -77384 -8458 46642 61161
8066 61161 86570 55800 22189 75371 51821 32441 17241 22813 46762 55690 72894 89000
8054H9000J5564j0556m4549J0255O304n3678o8859j8008k3305P6420k2451q1525
8042a25388l9905L0638K6859J7285k8978j7538M9552j2886j258M0943k0354k8018
8030a09048p089K9563R6056N7292K4748j3523K9866l0533o4326l1947m0933k2730
8018h2604l1679k3129L0426J21209R8431O294L0349j1492m3683l4098Q138J706
8006F9868k295j3243n3156m2371K9491M2093M6970M4303M455n8634m7839j0116
7994I526L9146J9909J1491L1453p0817n537J409m963r696k9370J3215M3137j4908
7981C3995j621k5356J3621O6489P417k5524o2951K5001M8139M1227O744j3948
7969A13233J9544k9054l1693m0937Q485q399l6301o9381k2905l1374K5705K1320
$$ plain form
8054 89000 104564 94008 49459 59714 66018 12340 -56519 -74527 -97832 -21412 -43863 -125388
8042 -125388 -165293 -134655 -107796 -90511 -119489 -137027 -87475 -100361 -101619 -60676 -81030 -109048
8030 -109048 -116137 -86574 9482 66774 91522 77999 107865 77332 13006 -18941 -59874 -82604
8018 -82604 -114283 -137412 -106986 14223 112654 118948 149297 137805 94122 60024 68162 69868
8006 69868 67573 54330 1174 -41197 -11706 30387 77357 121660 126115 67481 19642 9526
7994 9526 48672 68581 80072 111525 40708 35171 36580 31617 21921 -7449 5766 48903 33995
7981 33995 32374 7018 20639 87128 94545 69021 6070 31071 79210 120437 127181 113233
7969 113233 132777 103723 72030 31093 39578 31179 -5122 -74503 -97408 -128782 -103077 -81757
7957h1757K9128K3485K0695j6763m2444j112J1419N1024K4734K3435K093k0259
7945B3678l234P4169M9657L5621j8243n2265n8452l1385J2435J1035O7745M935
7933A15696m9539l1681K9914k5457k1902M461L3364L1903L0522m416n0366m0073
7921B2426m0854m2996m1289O5120Q0344K6287N0365L1974o2162p7446j9562l829
7909a1622r383k4105L7985K2405n938r2219P3433R6224k2033l0165J5477N4287
7897A04346J1375k6252m7549N0722n7093o4107J9972P625O7011N761o0512l0096
7885a8797k5515O849J6660O0501k938K3247P931j1276r615J644k8818k2749N496
7872B620L751o827m5014R953R8686O3319j8030K9754k1761p8091j4458l2224O3071
$$ plain form
7957 -81757 -52629 -29144 -8449 -25212 -67656 -68768 -57349 -6325 18409 41844 43937 23678
7945 23678 20444 94613 144270 179891 161648 109383 50931 19546 31981 43016 110761 115696
7933 115696 66157 34476 64390 38933 17031 21492 54856 86759 117281 112865 62499 22426
7921 22426 -18428 -61424 -102713 -37593 42751 69038 119403 151377 89215 11769 -7793 -11622
7909 -11622 -21005 -45110 -7125 15280 9342 -82877 -9444 86780 64747 34582 50059 104346
7897 104346 115721 89469 41920 92642 35549 -28558 -8586 -961 66050 71811 11299 -18797
7885 -18797 -44312 -37463 -20803 39698 36760 60007 67938 56662 47047 48691 19873 -2876 2620
7872 2620 6371 -456 -45470 -35517 63169 126488 108458 138212 116451 38360 23902 -8322 54749
7859E4749l8630p0226L6639R4490m9363n7107k0376K2673J769O3215N432k5930
7847A7335K6205j9905n0632P229J3939N479J04588l7152n4813o4809L3310O1958
7835D2732L499m4352n9842O012L3805r199p156K3963J7633o3728m6903O8237Q007
7822b7292j5494L6238J985m025O0670J413j5734L1509N818m9832n0247k1325j8904
7809f5220j7774O8384Q5859L3389o702j5588L1003J9483l8798j3317k8542l8835
7797A3342p2975j3956L7875P7814L1670m5490m4792p3519K09K7458m3139K2189
7785h3314P7367J322J223J4869N0125K2440k032l576q774o1351m1882J2225p011
7772b8369J5246K1354L1762k8262j7086L8427J6910j5123o0488n071J5469K894
$$ plain form
7859 54749 16119 -54107 -17468 77022 27659 -29448 -49824 -27151 -25382 37833 43265 17335
7847 17335 43540 23635 -26997 -19768 -5829 -350 104238 67086 12273 -52536 -19226 42732
7835 42732 46231 1879 -57963 -51951 -18146 -27345 -34501 -10538 7095 -56633 -103536 -35299 -27292
7822 -27292 -42786 -6548 -4563 -8588 52082 53495 37761 69270 75088 25256 -24991 -46316 -65220
7809 -65220 -82994 -14610 71249 104638 97936 82348 113351 132834 94036 80719 52177 13342
7797 13342 -59633 -73589 -35714 42100 73770 28280 -16512 -90031 -89822 -62364 -105503 -83314
7785 -83314 -5947 -4625 -3402 11467 61592 84032 82000 78424 69650 8299 -33583 -21358 -28369
7772 -28369 -13123 8231 39993 11731 -5355 33072 49982 34859 -25629 -30700 -15231 -12337
7760a2337k3307M9974J9169o0272l3473N0611M6556j414N3346l7376r1394l9952
7748g9869J7406K4463J1476J3162J878J8714J3652J2890p5485j635m863L8923
7736i288Q077p3010o4597J9503K8601J9934N7092M4219L9469l4851o1016J0518
7724a5349N1650j1121k7729j6506l7807j552J0948P2901N0075L2794j1229p2052
7712B5023k0481k0733M8557Q0338k2364n5252q978n7892j428O7389l2655m5720
7700d4196j9598O7320N603k5567J785l3676K7000M7179K0395J6014N019m9713
7688A7565m0562L7460j6510O293J1637j5913M3925k9983J5413L7459l2771l9727
7676e714k149L7530J0253l4622k9971K1611q130k1800j1737J2157R4547R56J1833
$$ plain form
7760 -12337 -35644 14330 33499 -26773 -60246 -9635 36921 35507 88853 51477 -39917 -79869
7748 -79869 -62463 -38000 -26524 -13362 -11484 7230 20882 33772 -41713 -43348 -48211 -9288
7736 -9288 -1211 -74221 -138818 -119315 -90714 -70780 -13688 30531 70000 35149 -25867 -15349
7724 -15349 36301 25180 -2549 -19055 -56862 -58414 -47466 25435 75510 108304 97075 25023
7712 25023 4542 -16191 32366 112704 90340 35088 26110 -31782 -33210 34179 1524 -44196
7700 -44196 -63794 3526 9129 -16438 -14653 -48329 -21329 25850 46245 62259 67278 17565
7688 17565 -22997 14463 -2047 4246 15883 -30 43895 13912 29325 66784 34013 -5714
7676 -5714 -7863 29667 39920 5298 -24673 -3062 -11192 -32992 -44729 -32572 61975 62931 74764
7663G4764P9898j5243k5537p3454m4534M54N4250k8665j6816K5282m787p439R346
7650B7519K4521j6023L340k7658l3770L9206K4915n1222O8564o202m1580o7773
7638e6163j7452M2487N6652k5398n2148Q769n3606K2547R5054N0567j2625n4605
7626D079K9726k287l5850j9480J6541K2390m272K7547l1524m2741j137P2779j3268
7613B2503J8178o146l8614l6435N332l8949n549Q5168j1331o382l9901n720m999
7600f2845P0389Q5877j7824o4240j7595n327J4199m7008m5044L6759J6424N2282
7588A6047O6481K5510L2963k0414r414m5459m2658m8367K8779N903J04905L3336
7576A47612k7782n1627j00778N69L0703q898O707M5739j3275j9805p5444k6828
$$ plain form
7663 74764 154662 139419 113882 40428 -4106 -3652 50598 21933 5117 30399 25612 18173 27519
7650 27519 52040 36017 39357 11699 -22071 17135 42050 -9172 59392 53190 11610 -56163
7638 -56163 -73615 -31128 25524 126 -52022 -43253 -96859 -74312 20742 71309 58684 4079
7626 4079 33805 31518 -4332 -23812 -7271 15119 10847 38394 6870 -35871 -37008 35771 22503
7613 22503 40681 34535 -4079 -40514 -35182 -74131 -79680 5488 -5843 -12225 -52126 -57846 -62845
7600 -62845 7544 93421 75597 11357 -6238 -11565 2634 -44374 -89418 -52659 -36235 16047
7588 16047 82528 108038 141001 120587 111173 65714 23056 -25311 3468 9371 114276 147612
7576 147612 119830 68203 -32575 -32006 -1303 -10201 -3494 42245 28970 9165 -66279 -93107
7564i3107K7779l821k998K0011N938p007L5701L9620l5285k85M4231M2906K6143
7551I9826n6206k8277j400k3616k9918n315O2788j4285N5214j8122l3076p914
7539c01j2647k9656n416L0711N958m1200L6328L3492m9325p4618m8478j7914O4644
7526a08422M3597J8405r007O11l3291j2534l2338M4546O8878l571l7135L754N5712
7513g95m46k6766p002K781L866R909J589K2452r529k6867k9724K7967j51j3527
7499d6243k6323O530Q816K3442O3120L7873N0565m5718o3100P345l3690m4842
7487f2225l536j2422O5280M4377P67K1557j1832R315k4171j3421m1450J0109K4314
7474F662J1292N9319j3904o1167o5089M4505J0724k1382k2587K575k4099O2863
$$ plain form
7564 -93107 -65328 -69149 -72147 -52136 -46198 -53205 -17504 22116 -13169 -13454 30777 73683 99826
7551 99826 43620 15343 13943 -9673 -39591 -44906 17882 3597 58811 40689 7613 -301
7539 -301 -12948 -42604 -48020 -17309 -11351 -52551 -16223 17269 -32056 -106674 -155152 -173066 -108422
7526 -108422 -64825 -46420 -55427 -54816 -88107 -100641 -132979 -88433 -19555 -23126 -60261 -56507 -795
7513 -795 -1241 -28007 -35009 -32228 -28362 -18453 -16864 5588 -3941 -30808 -60532 -32565 -32716 -46243
7499 -46243 -72566 -66036 -57220 -33778 29342 67215 117780 72062 8962 16307 -17383 -62225
7487 -62225 -65761 -78183 -12903 31474 32241 53798 41966 51281 27110 13689 -27761 -17652 6662
7474 6662 17954 77273 63369 2202 -62887 -18382 -7658 -29040 -51627 -49052 -73151 -10288
7462a0288K559n1217Q49L0981M4017N2936M6440R097m3468j01346n6288m0636
7450a16364K7880K3264k864j0053L9037P8934o5735m6695M819N9646K7788l1258
7438a1601k1187k7750l1860j0088J2472M2600J9294K2808N3891P023K8219k2835
7426F0986J554N108k4428p6498J0898N0927l8233j5515p0035O909J9672K6028
7414d2627m0516o276M8688k9577L6560L1216P6797J2338j7475N63n8530m6411
7402c5250k6736l7017K1039n739M7369J19821j6224q3520l5158j5882N795M3307
7390a8195k4199l864O4429L9638l6608m1226L3993L6985M2592j8800n2774j5038
7378F933j8365j6629R114J9017r867j2212L2622K4691L0695J7228j9710m5181
$$ plain form
7462 -10288 -7729 -58946 -58097 -27116 16901 69837 116277 125374 81906 -19440 -75728 -116364
7450 -116364 -88484 -65220 -68084 -78137 -39100 39834 -25901 -72596 -67777 -8131 19657 -11601
7438 -11601 -32788 -60538 -92398 -102486 -90014 -47414 -28120 -5312 48579 55602 83821 60986
7426 60986 62540 67648 43220 -33278 -22380 28547 -9686 -25201 -95236 -88327 -68655 -42627
7414 -42627 -83143 -89419 -40731 -70308 -33748 -2532 74265 86603 69128 69691 11161 -35250
7402 -35250 -61986 -99003 -77964 -83703 -36334 83487 67263 -16257 -51415 -67297 -61502 -18195
7390 -18195 -42394 -46258 18171 57809 21201 -20025 13968 50953 93545 74745 21971 6933
7378 6933 -11432 -28061 -18947 70 -9797 -22009 10613 35304 65999 83227 63517 18336
7366A8336l2499j0436J2748j7359K4730m9246m0040O5877J6887M4535Q148j4358
7354B7323j9994j6810M2766p758n9173K5408J8252J3974P7539q9443n8363J0468
7342c5811M3883L2615m5174n6598l5003J6258L8096M5427M1655m048k7516N2005
7330F5789K4310o2514m2860j0025O2878M1999n0128k3564K4069n2278k1269L2099
7318a1494K8504j5750k2556j1514M0795N4700J9981m1035N3640K8721k416n901
7306A15675l9446l7830L0172j8258o7419k9491N0431n9248j9699k7174Q040O2032
7294c2215k8139j2678j2021J3078M4344L3044n567K0690M8168K0015k8082l7255
7282B3382o7853L5636K2667O977K0347l5342L4865L5553k5575J6756r623m1853
$$ plain form
7366 18336 -14163 -24599 -11851 -29210 -4480 -53726 -93766 -27889 -11002 33533 41681 27323
7354 27323 7329 -9481 33285 25527 -33646 -8238 10014 23988 101527 12084 -46279 -35811
7342 -35811 8072 40687 -4487 -61085 -96088 -79830 -41734 3693 45348 41300 13784 65789
7330 65789 90099 27585 -15275 -25300 37578 79577 29449 5885 29954 -22324 -43593 -11494
7318 -11494 17010 1260 -21296 -32810 7985 62685 82666 41631 95271 123992 121576 115675
7306 115675 76229 38399 68571 50313 -17106 -46597 3834 -55414 -75113 -102287 -94247 -32215
7294 -32215 -60354 -73032 -85053 -71975 -27631 5413 -154 20536 68704 88719 60637 23382
7282 23382 -44471 -8835 13832 20809 41156 5814 40679 76232 50657 67413 57790 15937
7270A5937Q690j0556J6634J8106j7823Q496q146M853m1593k4041J810o3055J0391
7257h0297J4118M6402l2491l6773k6940Q841P2801M5520n9095l2193L3348R0761
7245D4002O8079j1180n2170m9904j16093m7482Q7455Q229K997M4020K498L9540
7233A9991O1418L741j7324j8320k1526m7219k0141J8621o225j14175k1621M9934
7221a12846O2207L7424J4874L4141j2931M1346L5055l2893o2699O4201l475n462
7209E8942l1442n7364O634M2212J0548R480n4084o981K6881l6561L827N8686M7608
7196G8386j6945k5264q02k3032m4722N479k3780k9746M2855K6381k7323O542M6329
7183A4358l90k6968k6409n385o10k2528j1612J9561L5183J1924m3931M8582O8100
$$ plain form
7270 15937 24627 14071 30705 48811 30988 39484 31338 36191 -5402 -29443 -27633 -90688 -80297
7257 -80297 -66179 -19777 -52268 -89041 -115981 -107140 -34339 11181 -47914 -80107 -46759 44002
7245 44002 112081 100901 48731 -1173 -117266 -164748 -77293 -69064 -66067 -22047 -19549 19991
7233 19991 81409 85150 67826 49506 27980 -19239 -39380 -20759 -26984 -141159 -162780 -112846
7221 -112846 -50639 -13215 1659 35800 22869 64215 99270 66377 3678 67879 64404 58942
7209 58942 27500 -29864 -23230 18982 29530 39010 -15074 -22055 4826 -31735 -27908 30778 78386
7196 78386 61441 36177 35375 12343 -32379 -26900 -50680 -80426 -37571 -11190 -38513 -31971 14358
7183 14358 13968 -13000 -39409 -44794 -45404 -67932 -79544 -59983 -24800 -12876 -56807 -8225 59875
7170E9875K8235l208l1488m8314J321o929m5799l3933M1148L8264J9785o120m5899
7157c3062j1822K0107j1367K9464J5443J9014K324m3476j3893j7536P415K957
7145c4432J96M5687M6392J3454J6366l3021l3549K3642j4763l0603M1444o0717
7133a9904k3831J4256j9610j8393j7690j2784l8073O2266j8888k0982m6736q164
7121a68533Q0695N7221l3784R806J8556m6431k0112j1650J9770M1649j692j5305
7109f9810l394j686K0720k7676J71L7397K7735J2126j1872n0448J9188L6916r1499
7096a02132J4941O7700P1107k9981l4560k0942M6855N9905k0575o2143j6781k9064
7084e5670q40l659j8670M4135K8064L220O463j8161j2244J6550L8675j4936l330
$$ plain form
7170 59875 88110 84902 53414 5100 6421 -508 -46307 -80240 -39092 -828 18957 12837 -33062
7157 -33062 -44884 -24777 -36144 -6680 8763 27777 30101 -13375 -27268 -44804 -37389 -34432
7145 -34432 -34236 11451 57843 71297 87663 54642 21093 44735 29972 -631 40813 -19904
7133 -19904 -43735 -29479 -49089 -67482 -85172 -97956 -136029 -73763 -92651 -113633 -160369 -168533
7121 -168533 -87838 -30617 -64401 -54595 -36039 -82470 -102582 -114232 -94462 -52813 -54505 -69810
7109 -69810 -73204 -74890 -54170 -81846 -81675 -44278 -16543 -4417 -16289 -66737 -47549 -10633 -102132
7096 -102132 -87191 -19491 51616 21635 -12925 -33867 12988 72893 52318 -9825 -26606 -55670
7084 -55670 -56510 -60169 -78839 -34704 -6640 -3420 3043 -15118 -27362 -10812 27863 12927 9597
7071I597N0286j7289o1371k9828k2855L421O7546J9368r103j4214R233R707n2325
7058c7827o3257M4461o3450r1184J3660L0278L9858J5423k0946j6279O4927J8882
7046f5454o196N2373R82K6211O4581K322p7098o9111m7724M6028L6334j5386o978
7033e9116L6831J5290p297N3200q482k9945q707N2681L851k8998m0182k6068n7770
7020a04712l5939N6302J4913P414K3002k87l0733n5886j1157n975N9085N1384
7008c2589l8857K6188K8895k6004k4004Q929j3955k3436J1084Q1371J0116o7915
6996f0177O927J9675M1952j40l8506l3447k2459K0363l6426J0477N0358Q645M5139
6983A2381m837Q741k9025P811K7637m1870k6027L5509l673l9429j7934M5016K1807
$$ plain form
7071 9597 59883 42594 -18777 -48605 -71460 -68039 -493 18875 9772 -4442 4791 14498 -37827
7058 -37827 -101084 -56623 -120073 -211257 -197597 -167319 -127461 -112038 -132984 -149263 -84336 -65454
7046 -65454 -71650 -19277 -18295 7916 72497 74819 -2279 -71390 -119114 -73086 -36752 -52138 -59116
7033 -59116 -22285 -6995 -14292 38908 30426 481 -8226 44455 48306 19308 -20874 -46942 -104712
7020 -104712 -140651 -84349 -69436 -62022 -39020 -39307 -70040 -125926 -137083 -143058 -83973 -32589
7008 -32589 -71446 -45258 -16363 -42367 -66371 -57442 -71397 -94833 -83749 -2378 7738 -60177
6996 -60177 -53250 -33575 8377 8237 -30269 -63716 -86175 -65812 -102238 -91761 -41403 -32758 12381
6983 12381 7544 16285 -12740 -4929 22708 -19162 -45189 -9680 -13353 -52782 -70716 -25700 -3893
6970c893M804j1920M7169j4731n6810n2917L0205p858J1332K3438O1079L7011
6958F6909k2875M637l6729m9282R272N387k0000j5981N2783J4297K016K4866k2426
6945A2874K0672n047j6764K4934m0163p0737P394K9797P3838M0389q6985q1670
$$ plain form
6970 -3893 911 -11009 36160 21429 -35381 -88298 -58093 -65951 -54619 -31181 29898 66909
6958 66909 44034 48671 11942 -37340 -28068 -22681 -42681 -58662 -5879 8418 10434 35300 12874
6945 12874 33546 28499 11735 36669 -3494 -74231 -66837 -37040 36798 77187 -9798 -91468
$$ [...]
##END NTUPLES=NMR SPECTRUM
##END=
