##TITLE=Analysis number 320652
Compound Code cc 44209
Book Reference 468/99
Project Code adrs
Chemist Name colinb
##JCAMPDX= 6.0         $$ Bruker NMR JCAMP-DX V2.0
##DATA TYPE= NMR SPECTRUM
##DATA CLASS= NTUPLES
##ORIGIN= Bruker BioSpin GmbH
##OWNER= nmr
$$ XWIN-NMR		Version 3.5
$$ Tue Jul  4 11:56:21 2006 GMT Daylight Time (UT+1h)  MAYBRIDGE\nmr@NMR_250MHZ
##.OBSERVE FREQUENCY= 250.131544655141
##.OBSERVE NUCLEUS= ^1H
##.ACQUISITION MODE= SIMULTANEOUS (DQD)
##.ACQUISITION SCHEME= undefined
##.AVERAGES= 16
##.DIGITISER RES= 18
##SPECTROMETER/DATA SYSTEM= dpx250
##.PULSE SEQUENCE= zg30
##.SOLVENT NAME= CDCl3
##.SHIFT REFERENCE= (INTERNAL, CDCl3, 0, 16.522)
##AUDIT TRAIL= $$ (NUMBER, WHEN, WHO, WHERE, WHAT)
$$ ##TITLE= Audit trail, XWIN-NMR		Version 3.5
$$ ##JCAMPDX= 5.01
$$ ##ORIGIN= Bruker BioSpin GmbH
$$ ##OWNER= nmr
$$ C:\u/data/dgb/nmr/ADRS/2200/pdata/1/auditp.txt
$$ ##AUDIT TRAIL=  $$ (NUMBER, WHEN, WHO, WHERE, WHAT)
(   1,<2006-07-04 11:55:52.54 +100>,<MAYBRIDGE\nmr>,<NMR_250MHZ>,
      <created by zg, POWCHK disabled, PULCHK disabled
       configuration hash MD5:
       E2 DF 36 D8 04 B2 41 60 5A D7 A3 38 5A 4B D0 FE
       data hash MD5: 64K
       B8 5E E6 07 BA 15 F0 50 28 B8 DF 68 1E 9F 2D 66>)
(   2,<2006-07-04 11:56:08.84 +100>,<MAYBRIDGE\nmr>,<NMR_250MHZ>,
      <Start of raw data processing
       ef LB = 0.3 FT_mod = 6 PKNL = 1 SI = 32K 
       data hash MD5: 32K
       05 E2 1C 6D B4 9D ED 50 AC B4 B3 6D 15 DD 03 CF>)
(   3,<2006-07-04 11:56:10.46 +100>,<MAYBRIDGE\nmr>,<NMR_250MHZ>,
      <apk 
       data hash MD5: 32K
       A6 AD 86 11 9D FC F9 8C 4F 78 9C 56 0B B7 48 5D>)
(   4,<2006-07-04 11:56:11.23 +100>,<MAYBRIDGE\nmr>,<NMR_250MHZ>,
      <abs ABSG = 5 
       data hash MD5: 32K
       E6 78 CE 10 BE 0F F7 DB 20 4E E3 A0 33 C4 62 C2>)
$$ ##END=
$$ 
$$ hash MD5
$$ 3E 2A 04 ED 2E 04 B8 B7 6F EB 6F 6D F0 ED 91 B8
##$RELAX= 
##$RELAX= 
##$RELAX= 
##$RELAX= 
##$RELAX= 
##$RELAX= 
##$RELAX= 
$$ Bruker specific parameters
$$ --------------------------
##$DU= <C:\u>
##$EXPNO= 2200
##$NAME= <ADRS>
##$PROCNO= 1
##$TYPE= <nmr>
##$USER= <dgb>
##$AMP= (0..31)
100 100 100 100 100 100 100 100 100 100 100 100 100 100 100 100 100 100 
100 100 100 100 100 100 100 100 100 100 100 100 100 100 
##$AQSEQ= 0
##$AQ_mod= 3
##$AUNM= <au_zg>
##$AUTOPOS= <20 >
##$BF1= 250.13
##$BF2= 250.13
##$BF3= 250.13
##$BF4= 250.13
##$BF5= 500.13
##$BF6= 500.13
##$BF7= 500.13
##$BF8= 500.13
##$BYTORDA= 1
##$CFDGTYP= 0
##$CFRGTYP= 5
##$CHEMSTR= <none>
##$CNST= (0..31)
1 1 145 1 1 1 1 1 1 1 1 1 1 1 1 1 1 1 1 1 1 1 1 1 1 1 1 1 1 1 1 1 
##$CPDPRG= <>
##$CPDPRG1= <>
##$CPDPRG2= <>
##$CPDPRG3= <>
##$CPDPRG4= <mlev>
##$CPDPRG5= <mlev>
##$CPDPRG6= <mlev>
##$CPDPRG7= <mlev>
##$CPDPRG8= <mlev>
##$CPDPRGB= <>
##$CPDPRGT= <>
##$D= (0..31)
0 1 0 0 0 0 0 0 0 0.06 0 0 0 0 0 0 0.0002 0 0 0 0 0 0 0 0 0 0 0 0 0 0 
0 
##$DATE= 1152010550
##$DBL= (0..7)
120 120 120 120 120 120 120 120 
##$DBP= (0..7)
150 150 150 150 150 150 150 150 
##$DBP07= 0
##$DBPNAM0= <>
##$DBPNAM1= <>
$$ [...]
##$SUBNAM7= <"">
##$SUBNAM8= <"">
##$SUBNAM9= <"">
##$SW= 20.6930455092707
##$SWIBOX= (0..15)
0 0 3 0 0 0 0 0 0 0 0 0 0 0 0 0 
##$SW_h= 5175.983436853
##$TD= 65536
##$TD0= 1
##$TE= 296.16
##$TE2= 300
##$TE3= 300
##$TEG= 300
##$TL= (0..7)
0 120 120 120 120 120 120 120 
##$TP= (0..7)
150 150 150 150 150 150 150 150 
##$TP07= 0
##$TPNAME0= <>
##$TPNAME1= <>
##$TPNAME2= <>
##$TPNAME3= <>
##$TPNAME4= <>
##$TPNAME5= <>
##$TPNAME6= <>
##$TPNAME7= <>
##$TPOAL= (0..7)
0.5 0.5 0.5 0.5 0.5 0.5 0.5 0.5 
##$TPOFFS= (0..7)
0 0 0 0 0 0 0 0 
##$TUNHIN= 0
##$TUNHOUT= 0
##$TUNXOUT= 0
##$USERA1= <user>
##$USERA2= <user>
##$USERA3= <user>
##$USERA4= <user>
##$USERA5= <user>
##$V9= 5
##$VALIST= <valist>
##$VCLIST= <CCCCCCCCCCCCCCC>
##$VD= 0
##$VDLIST= <DDDDDDDDDDDDDDD>
##$VPLIST= <PPPPPPPPPPPPPPP>
##$VTLIST= <TTTTTTTTTTTTTTT>
##$WBST= 1024
##$WBSW= 4
##$XGAIN= (0..3)
0 0 0 0 
##$XL= 0
##$YL= 0
##$YMAX_a= 428288
##$YMIN_a= -694520
##$ZGOPTNS= <>
##$ZL1= 120
##$ZL2= 120
##$ZL3= 120
##$ZL4= 120
##$ABSF1= 16.522
##$ABSF2= -4.171173
##$ABSG= 5
##$ABSL= 3
##$ALPHA= 0
##$AQORDER= 0
##$ASSFAC= 0
##$ASSFACI= 0
##$ASSFACX= 0
##$ASSWID= 0
##$AUNMP= <proc_1d>
##$AZFE= 0.1
##$AZFW= 0.1
##$BCFW= 0
##$BC_mod= 0
##$BYTORDP= 0
##$COROFFS= 0
##$CY= 12.5
##$DATMOD= 1
##$DC= 0
##$DFILT= <>
##$DTYPP= 0
##$F1P= 14.0000005364418
##$F2P= -0.99999901652339
##$FCOR= 0.5
##$FTSIZE= 32768
##$FT_mod= 6
##$GAMMA= 0
##$GB= 0
##$INTBC= 1
##$INTSCL= 1
##$ISEN= 128
##$LB= 0.3
##$LEV0= 0
##$LPBIN= 0
##$MAXI= 10000
##$MC2= 0
##$MEAN= 0
##$ME_mod= 0
##$MI= 0
##$NCOEF= 0
##$NC_proc= -3
##$NLEV= 6
##$NOISF1= 0
##$NOISF2= 0
##$NSP= 0
##$NTH_PI= 0
##$NZP= 0
##$OFFSET= 16.522
##$PC= 1
##$PHC0= 161.0279
##$PHC1= 7.951888
##$PH_mod= 1
##$PKNL= yes
##$PPARMOD= 0
##$PSCAL= 4
##$PSIGN= 0
##$REVERSE= no
##$SF= 250.13
##$SI= 32768
##$SIGF1= 0
##$SIGF2= 0
##$SINO= 400
##$SIOLD= 32768
##$SREGLST= <1H.CDCl3>
##$SSB= 0
##$STSI= 32768
##$STSR= 0
##$SW_p= 5175.98343685301
##$SYMM= 0
##$S_DEV= 0
##$TDeff= 65536
##$TDoff= 0
##$TI= <Analysis number 999999
Compound Code 99
Book Reference 9
Project Code 9>
##$TILT= no
##$TM1= 0
##$TM2= 0
##$TOPLEV= 0
##$USERP1= <user>
##$USERP2= <user>
##$USERP3= <user>
##$USERP4= <user>
##$USERP5= <user>
##$WDW= 1
##$XDIM= 32768
##$YMAX_p= 443595721
##$YMIN_p= -776797
$$ End of Bruker specific parameters
$$ ---------------------------------
##NTUPLES= NMR SPECTRUM
##VAR_NAME=  FREQUENCY,     SPECTRUM/REAL,   SPECTRUM/IMAG
##SYMBOL=    X,             R,               I
##VAR_TYPE=  INDEPENDENT,   DEPENDENT,       DEPENDENT
##VAR_FORM=  AFFN,          ASDF,            ASDF
##VAR_DIM=   32768,         32768,           32768
##UNITS=     HZ,            ARBITRARY UNITS, ARBITRARY UNITS
##FACTOR=    0.157963299565203, 1,           1
##FIRST=     4132.6476996994, 0,             0
##LAST=      -1043.33573715361, 0,           0
##MIN=       -1043.33573715361, -776797,     0
##MAX=       4132.6476996994, 443595721,     0
$$ Real data points
##PAGE= N=1
##DATA TABLE= (X++(R..R)), XYDATA
$$ [...]
$$ plain form
18393 527815 570806 585824 623938 677813 743275 796983 834568 842093 850099 841278 783087 744300
18381 744300 710879 675601 648991 613842 601608 573646 566715 572187 579181 605231 667985 722046
18369 722046 749177 777951 827796 857578 835964 797067 733566 658510 579696 545678 523616
18358 523616 498282 489395 490811 494496 479304 493126 520760 522961 504089 513059 518390 534916 555096
18345 555096 563707 581635 586699 600917 603998 593318 599079 595449 592703 598352 604073 588072 598514
18332 598514 614957 630290 643223 649501 627763 603835 579868 591681 601722 600559 616585 649968
18320 649968 688664 717726 708040 716390 752834 807477 825313 823718 864597 943545 1022185 1102306
18308 1102306 1195972 1275312 1372299 1473193 1600338 1738935 1934990 2171446 2426732 2682089
$$ packed form
18393E27815M2991J5018L8114N3875O5462N3708L7585P525Q006q821n8191l8787
18381G44300l3421l5278k6610l5149j2234k7962o931N472O994K6050O2754N4061
18369G22046K7131K8774M9845K9782k1614l8897o3501p5056p8814l4018k2062
18358E23616k5334q887J416L685j5192J3822K7634K201j8872Q970N331J6526K0180
18345E55096Q611J7928N064J4218L081j0680N761l630k746N649N721j6001J0442
18332E98514J6443J5333J2933O278k1738k3928k3967J1813J0041j163J6026L3383
18320F49968L8696K9062r686Q350L6444N4643J7836j595M0879P8948P8640Q0121
18308A102306R3666P9340R6987J00894J27145J38597J96055K36456K55286K55357
$$ plain form
18298 2682089 2956314 3287192 3690021 4114219 4598607 5206088 6024090 7143591 8624641
18289 8624641 10467684 12670743 15315563 18657413 22782803 27241953 31556555 36015330
18281 36015330 41233586 46933145 51938202 55759024 59272432 63390334 67411498 69789102
18273 69789102 70393882 70715469 71633014 71950426 70251486 67031496 63900008 61211852 57833501
18264 57833501 53042966 47688182 42908486 38734173 34495782 30048348 25934530 22591533
18256 22591533 19945517 17663610 15697571 14077035 12829940 11878406 11077199 10372199
18248 10372199 9743240 9199826 8732395 8298693 7849640 7452644 7114721 6778713 6445717
18239 6445717 6127754 5842159 5585170 5371721 5143884 4903449 4698532 4528255 4361889
$$ packed form
18298B682089K74225L30878M02829M24198M84388O07481Q18002J119501J481050
18289H624641J843043K203059K644820L341850M125390M459150M314602M458775
18281C6015330N218256N699559N005057L820822L513408M117902M021164K377604
18273F9789102O04780L21587R17545L17412j698940l219990l131488k688156l378351
18264E7833501m790535n354784m779696m174313m238391m447434m113818l342997
18256B2591533k646016k281907j966039j620536j247095r51534q01207p05000
18248A0372199o28959n43414m67431m33702m49053l96996l37923l36008l32996
18239F445717l17963k85595k56989k13449k27837k40435k04917j70277j66366
$$ plain form
18230 4361889 4216784 4060545 3931443 3804265 3648167 3536497 3417779 3311680 3221844 3161581
18220 3161581 3092688 2968175 2878930 2787542 2709080 2654778 2564404 2494844 2436678 2345864 2262986
18209 2262986 2192179 2135682 2068825 1985913 1919597 1848801 1799156 1782236 1765942 1763335 1762113 1752338
18197 1752338 1722599 1670992 1653960 1645079 1609532 1537921 1465282 1407370 1356097 1319047 1305234
18186 1305234 1259544 1226863 1199302 1171979 1142069 1110554 1089764 1047845 1029426 1003004 942109
18175 942109 884677 852802 810209 780042 769047 751506 718023 677478 657388 639041 608297
18164 608297 597865 586011 577414 573290 568642 535696 528512 501671 469130 460034 452449 474359 510461
18151 510461 523598 521349 536417 595784 650551 675304 702131 731430 758867 762733 733309 705649
$$ packed form
18230D361889j45105j56239j29102j27178j56098j11670j18718j06099q9836o0263
18220C161581o8893j24513q9245r1388p8462n4302r0374o9560n8166r0814q2878
18209B262986p0807n6497o6857q2912o6316p0796m9645j6920j6294k607j222r775
18197A752338k9739n1607j7032q881l5547p1611p2639n7912n1273l7050j3813
18186A305234m5690l2681k7561k7323k9910l1515k0790m1919j8419k6422o0895
18175I42109n7432l1875m2593l0167j0995j7541l3483m0545k0090j8347l0744
18164F08297j0432j1854q597m124m648l2946p184k6841l2541r096p585K1910L6102
18151E10461J3137k249J5068N9367N4767K4753K6827K9299K7437L866k9424k7660
$$ plain form
18139 705649 697542 677591 639118 626202 633731 645697 649561 679763 725466 763223 780340 811811
18127 811811 868132 924922 1014977 1079522 1165776 1263295 1383373 1555982 1795853 2075834 2442386
18116 2442386 2995155 3821781 5161639 7537956 11683872 17715843 22708406 23921052
18108 23921052 24081434 24386524 23096854 18545919 12455667 8450590 6251084 4999847
18100 4999847 4175227 3627052 3248691 2947964 2694898 2479735 2314830 2217908 2130519 2033226
18090 2033226 1953171 1876153 1813114 1733479 1649183 1559809 1495389 1450383 1384002 1337632 1315992
18079 1315992 1308503 1281596 1233575 1177125 1118532 1074291 1068018 1061114 1042183 1035633 1043514 1038570
18067 1038570 1014744 981164 973954 956217 906634 861714 838287 828384 826028 822828 826069 840302
$$ packed form
18139G05649q107j9951l8473j2916P529J1966L864L0202M5703L7757J7117L1471
18127H11811N6321N6790R0055O4545Q6254R7519J20078J72609K39871K79981L66552
18116B442386N52769Q26626J339858K376317M145916O031971M992563J212646
18108B3921052J60382L05090j289670m550935o090252m005077k199506j251237
18100D999847q24620n48175l78361l00727k53066k15163j64905r6922q7389r7293
18090B033226q0055p7018o3039p9635q4296q9374o4420m5006o6381m6370k1640
18079A315992p489k6907m8021n6450n8593m4241o273o904j8931o550P881m944
18067A038570k3826l3580p210j7737m9583m4920k3427r903k356l200L241J4233
$$ plain form
18055 840302 820178 783219 767926 762143 733930 699451 679796 653251 627337 608875 607014 583254
18043 583254 568783 593702 606582 616431 630513 634367 609354 580408 553334 538261 528146 524698
18031 524698 511143 504029 527975 547704 539802 516221 474104 477597 471606 451143 424819 416500
18019 416500 414396 440719 465920 483209 491438 466367 450011 461690 464717 463487 464465 492260 518499
18006 518499 554437 602483 608348 583370 554209 540108 478989 418436 398021 400751 390428 386254
17994 386254 374699 369696 378573 383800 399545 438213 465709 505054 530393 525856 520380 527765 513627
17981 513627 481163 485419 478008 469711 452354 418108 426523 441570 436751 437130 446285 466951 468853
17968 468853 461960 465200 459958 446304 465906 443792 423659 428277 421200 421706 406910 407168 405326
$$ packed form
18055H40302k0124l6959j5293n783k8213l4479j9655k6545k5914j8462j861k3760
18043E83254j4471K4919J2880R849J4082L854k5013k8946k7074j5073j0115l448
18031E24698j3555p114K3946J9729p902k3581m2117L493n991k0463k6324q319
18019D16500k104K6323K5201J7289Q229k5071j6356J1679L027j230R78K7795K6239
18006E18499L5938M8046N865k4978k9161j4101o1119o0553k0415K730j0323m174
17994C86254j1555n003Q877N227J5745L8668K7496L9345K5339m537n476P385j4138
17981E13627l2464M256p411q297j7357l4246Q415J5047m819L79R155K0666J902
17968D68853o893L240n242j3654J9602k2114k0133M618p077N06j4796K58j842
$$ plain form
17955 405326 413986 395012 396726 424681 424636 421926 450226 484072 513538 535048 561548 578011 621057
17942 621057 649675 670444 697117 720242 730839 755144 795343 826093 854192 879978 902347
17931 902347 954383 1028963 1106581 1186229 1283543 1422646 1527651 1639840 1758052 1851695 1974172
17920 1974172 2101516 2230292 2358969 2534011 2767644 3042982 3338931 3636697 4026678
17911 4026678 4538427 5237288 6217237 7691015 9943279 13277042 17545092 22359741 27796926
17902 27796926 33238010 37254422 39707173 40987674 41150093 40422600 39403045 39027647
17894 39027647 39587533 40858254 41838954 41871510 41005257 38912796 35291966 30411001 25432459
17885 25432459 21049325 17225996 14207494 12112200 10724500 9765420 9059677 8544286
$$ packed form
17955D05326Q660j8974J714K7955m5k710K8300L3846K9466K1510K6500J6463M3046
17942F21057K8618K0769K6673K3125J0597K4305M0199L0750K8099K5786K2369
17931I02347N2036P4580P7618P9648R7314J39103J05005J12189J18212R3643J22477
17920A974172J27344J28776J28677J75042K33633K75338K95949K97766L89981
17911D026678N11749O98861R79949J473778K252264L333763M268050M814649N437185
17902B7796926N441084M016412K452751J280501J62419p27493j019555l75398
17894C9027647N59886J270721R80700L2556q66253k092461l620830m880965m978542
17885B5432459m383134l823329l018502k095294j387700r59080p05743n15391
$$ plain form
17877 8544286 8156701 7839457 7546741 7314717 7115926 6942928 6820290 6683692 6544327
17868 6544327 6453307 6396428 6379363 6398390 6454679 6515808 6623222 6790467 7046666 7461264
17858 7461264 8142901 9207036 10936925 13570952 17088904 21150529 25693216 30551894
17850 30551894 34436758 36860521 38221661 38587077 38079327 37172519 36689051 37052880 38200511
17841 38200511 39361523 39713841 39292700 37844792 35032041 30960935 26536288 22604787
17833 22604787 19197584 16442794 14597603 13505750 12944355 12765797 12909859 13378219 14254958
17824 14254958 15670242 17904823 21446335 26917148 34687420 44456853 54897026 64056190
17816 64056190 70280290 72853518 71585489 66527098 58332967 48504420 39104187 31647386
$$ packed form
17877H544286l87585l17244k92716k32024j98791j72998j22638j36598j39365
17868F544327r1020n6879j7065J9027N6289O1129J07414J67245K56199M14598
17858G461264O81637J064135J729889K634027L517952M061625M542687M858678
17850C0551894L884864K423763J361140L65416n07750r06808m83468L63829J147631
17841C8200511J161012L52318m21141j447908k812751m071106m424647l931501
17833B2604787l407203k754790j845191j091853n61395j78558J44062M68360Q76739
17824A4254958J415284K234581L541512N470813P770272R769433J0440173R159164
17816F4056190O224100K573228j268029n058391q194131r828547r400233p456801
$$ plain form
17808 31647386 26576734 23523904 21934248 21472227 22090466 23948450 27533188 33408172
17800 33408172 41826674 52085755 62396571 70706139 75612998 76619611 73610020 66770223
17792 66770223 57070357 46337333 36562685 28964436 23654885 20058276 17539166 15699401
17784 15699401 14299729 13216665 12366861 11713022 11159500 10716146 10348437 9989146 9635929
17775 9635929 9300640 9013458 8713204 8411153 8084919 7764718 7414737 7072478 6736593
17766 6736593 6388566 6052774 5728145 5445559 5215034 5016006 4852020 4679576 4512671
17757 4512671 4324947 4190422 4090772 3942885 3813545 3694770 3554458 3414400 3273957 3135073
17747 3135073 3032256 2922365 2811693 2674086 2580397 2489507 2396741 2297518 2219672 2156418
$$ packed form
17808C1647386n070652l052830j589656m62021O18239J857984L584738N874984
17800C3408172Q418502J0259081J0310816Q309568M906859J006613l009591o839797
17792F6770223r699866j0733024r774648p598249n309551l596609k519110j839765
17784A5699401j399672j083064q49804o53839n53522m43354l67709l59291l53217
17775I635929l35289k87182l00254l02051l26234l20201l49981l42259l35885
17766F736593l48027l35792l24629k82586k30525j99028j63986j72444j66905
17757D512671j87724j34525r9650j47887j29340j18775j40312j40058j40443j38884
17747C135073j02817j09891j10672j37607r3689r0890r2766r9223p7846o3254
$$ plain form
17737 2156418 2136926 2096320 2066333 2033676 1996412 1945654 1885376 1800626 1716272 1642215 1571164
17726 1571164 1502137 1430660 1369859 1328135 1279779 1251998 1221987 1168123 1112734 1068223 1034154
17715 1034154 975904 911207 857363 809042 796800 763712 730880 682120 674739 683460 671416 672329
17703 672329 657431 633439 586842 541477 547426 545644 517314 495318 476170 481363 467295 465988
17691 465988 456755 420713 374176 378317 383291 367248 361690 348512 319901 297828 297933 293934 274204
17678 274204 266260 260703 239020 220906 237138 257093 271304 259764 228085 228400 221746 186774
17666 186774 149303 157185 158603 138012 143195 123766 113909 100613 101789 100873 109021 138820 160650
17653 160650 158409 134240 103007 94277 92123 81304 97354 100444 99393 134699 140171 143254 133336
$$ packed form
17737B156418j9492m0606k9987l2657l7264n0758o0278q4750q4354p4057p1051
17726A571164o9027p1477o0801m1724m8356k7781l0011n3864n5389m4511l4069
17715A034154n8250o4697n3844m8321j2242l3088l2832m8760p381Q721j2044R13
17703F72329j4898k3992m6597m5365N949j782k8330k1996j9148N193j4068j307
17691D65988r233l6042m6537M141M974j6043n558j3178k8611k2073J05l999j9730
17678B74204p944n557k1683j8114J6232J9955J4211j1540l1679L15o654l4972
17666A86774l7471P882J418k0591N183j9429r857j3296J176r16Q148K9799K1830
17653A60650k241k4169l1233q730k154j0819J6050L090j051L5306N472L083r918
$$ plain form
17640 133336 127402 129022 116081 113430 112722 101705 92476 75402 67739 58984 55865 56410 32615 -14117
17626 -14117 -42864 -54787 -29655 5880 4421 19492 32069 25992 50507 65077 74951 67601
17614 67601 73407 66380 37857 8116 -13446 -37432 -28861 -35471 -23980 -7291 -9351 -2961 17384
17601 17384 49130 75417 90772 97549 118142 140558 142812 144973 145645 156276 187602 224156 221358
17588 221358 224183 224842 206325 171609 158731 158791 124821 70969 36720 39666 52323 75307 77206
17575 77206 98907 132849 156994 166343 191861 215714 218510 209551 179972 157532 150358 146242 131989
17562 131989 104364 94160 76704 71878 60575 50990 54143 53826 46576 37231 24127 25079 45361
17549 45361 54116 35355 12082 24900 26223 11162 15625 18610 14054 8384 14394 -2157 1462
$$ packed form
17640A33336n934J620j2941k651p08j1017r229j7074p663q755l119N45k3795m6732
17626a4117k8747j1923K5132L5535j459J5071J2577o077K4515J4570R874p350
17614F7601N806p027k8523k9741k1562k3986Q571o610J1491J6689k060O390K0345
17601A7384L1746K6287J5355O777K0593K2416K254K161O72J0631L1326L6554k798
17588B21358K825O59j8517l4716j2878O0l3970n3852l4249K946J2657K2984J899
17575G7206K1701L3942K4145R349K5518K3853K796q959k9579k2440p174m116j4253
17562A31989k7625j0204j7456m826j1303r585L153l17p250r345j3104R52K0282
17549D5361Q755j8761k3273J2818J323j5061M463K985m556n670O010j6551L619
$$ plain form
17536 1462 1875 -559 -10322 20040 39226 27892 29033 34726 30288 12091 10639 9945 -5740 7921
17522 7921 13855 9494 -4552 -9731 -16199 8336 52947 52020 53424 50118 41201 55230 50241 52455
17508 52455 70426 55558 37664 30912 63332 60819 41297 37357 35685 50589 48764 61056 37462
17495 37462 33092 44887 42948 69811 79385 85976 74837 76878 72173 73345 67908 59223 40497
17482 40497 20455 35219 61961 41760 27881 28932 41761 19891 7678 25498 33150 23304
17470 23304 14773 28128 29794 28180 11769 5104 4867 21509 35988 39894 54501 54323 61592 64973
17456 64973 62245 88609 106219 80291 91827 112209 118138 140540 183217 222448 276406 366426
17444 366426 470676 514391 547596 580545 547211 503596 457564 406472 336630 289367 251601
$$ packed form
17536A462M13k434r763L0362J9186j1334J141N693m438j8197j452o94j5685J3661
17522G921N934m361j4046n179o468K4535M4611r27J404l306q917J4029m989K214
17508E2455J7971j4868j7894o752L2420k513j9522l940j672J4904j825J2292k3594
17495C7462m370J1795j939K6863R574O591j1139K041m705J172n437q685j8726
17482D0497k0042J4764K6742k0201j3879J051J2829k1870j2213J7820P652r846
17470B3304q531J3355J666j614j6411o665k37J6642J4479L906J4607j78P269L381
17456F4973k728K6364J7610k5928J1536K0382N929K2402M2677L9231N3958R0020
17444C66426J04250M3715L3205L2949l3334m3615m6032n1092o9842m7263l7766
$$ plain form
17433 251601 232080 243733 224569 236198 274667 346909 377190 386022 402661 388056 378124 377536
17421 377536 370568 351072 311550 294559 259458 224164 186581 154539 150551 135367 124272 139938
17409 139938 142441 152089 171781 190755 192789 226210 255327 280713 305923 283316 284118 268881
17397 268881 264749 269018 271317 268023 252981 246640 254309 219372 181036 169852 160057 150990 113091
17384 113091 100971 91069 54268 34270 34981 58550 56278 72848 81398 71604 53741 44761 56622
17371 56622 49552 21114 13830 19379 22009 18351 29092 46168 51892 49082 42507 43157 42899 41143
17357 41143 58432 66872 89838 132819 171516 197120 202892 201463 206679 210899 230594 196850 186155
17344 186155 206847 221868 203865 151788 123487 111457 126479 120883 96301 86474 103638 120876
$$ packed form
17433B51601j9521J1653j9164J1629L8469P2242L0281Q832J6639j4605r932n88
17421C77536o968j9496l9522j6991l5101l5294l7583l2042l988j5184j1095J5666
17409A39938K503R648J9692J8974K034L3421K9117K5386K5210k2607Q02j5237
17397B68881m132M269K299l294j5042o341P669l4937l8336j1184r795r067l7899
17384A13091j2120r902l6801j9998P11K3569k272J6570Q550r794j7863q980J1861
17371E6622p070k8438p284N549K630l658J0741J7076N724k810o575O50k58j756
17357D1143J7289Q440K2966M2981L8697K5604N772j429N216M220J9695l3744j0695
17344A86155K0692J5021j8003n2077k8301j2030J5022n596k4582r827J7164J7238
$$ plain form
17332 120876 108508 84166 59869 52761 58206 67233 81164 90281 84305 84680 60002 64851 52724
17319 52724 41740 64266 51571 28503 11344 -7169 2997 7773 7777 25816 33032 17917 5427
17306 5427 13552 7204 4364 12227 -2985 -15415 -23723 -2700 22976 21064 16814 2475 18935
17293 18935 326 -3732 10546 33483 42295 46737 49996 76506 86007 87083 96002 78010 65017
17280 65017 67139 75561 66389 50292 66133 59908 75830 86411 92155 102704 113791 123895 129311
17267 129311 138371 131065 139197 108516 84857 74924 74120 82810 72715 47693 45887 58964 47463
17254 47463 31272 28608 38259 29858 10971 -397 12705 47257 71632 96385 107466 119436
17242 119436 164589 226301 283546 340163 360079 387405 404778 381752 321950 272729 228854
$$ packed form
17332A20876j2368k4342k4297p108N445R027J3931R117n976L75k4678M849j2127
17319E2724j0984K2526j2695k3068j7159j8513J0166M776MJ8039P216j5115j2490
17306E427Q125o348k840P863j5212j2430q308K1023K5676j912m250j4339J6460
17293A8935j8609m058J4278K2937Q812M442L259K6510R501J076Q919j7992j2993
17280F5017K122Q422r172j6097J5841o225J5922J0581N744J0549J1087J0104N416
17267A29311R060p306Q132l0681k3659r933q04Q690j0095k5022j806J3077j1501
17254D7463j6191k664R651q401j8887j1368J3102L4552K4375K4753J1081J1970
17242A19436M5153O1712N7245N6617J9916K7326J7373k3026n9802m9221m3875
$$ plain form
17231 228854 202436 153239 132813 117214 108676 113164 130189 155353 198380 250108 318741 386818
17219 386818 402037 418590 424532 413190 379182 321841 278903 229441 196408 177906 157520 136804
17207 136804 149709 128086 122164 138326 157391 151753 128472 110671 83432 65817 71467 100487
17195 100487 87392 80063 100213 128066 155048 149824 128591 111060 95268 86650 93283 71052
17183 71052 49948 33935 15524 6116 -8441 27069 52798 36039 26938 22508 -321 17284
17171 17284 42957 39283 46396 42169 30321 21257 24764 56421 53068 60313 77195 80148 70739
17158 70739 55844 60952 110979 145015 163101 162768 153382 152601 166869 187201 181369 162758 128295
17145 128295 102281 89840 103980 95862 81357 63902 40471 59562 100900 117441 99113 118000
$$ packed form
17231B28854k6418m9197k0426j5599q538M488J7025K5164M3027N1728O8633O8077
17219C86818J5219J6553N942j1342l4008n7341m2938m9462l3033j8502k0386k0716
17207A36804J2905k1623n922J6162J9065n638k3281j7801k7239j7615N650K9020
17195A00487j3095p329K0150K7853K6982n224k1233j7531j5792q618O633k2231
17183G1052k1104j6013j8411r408j4557L5510K5729j6759r101m430k2829J7605
17171A7284K5673l674P113m227j1848r064L507L1657l353P245J6882K953r409
17158G0739j4895N108N0027L4036J8086l33r386p81J4268K0332n832j8611l4463
17145A28295k6014j2441J4140q118j4505j7455k3431J9091M1338J6541j8328J8887
$$ plain form
17133 118000 130379 114577 77325 56843 61726 82808 88736 62885 42975 60341 89621 101525
17121 101525 97923 79695 28393 9280 3875 13760 18403 28798 41538 50744 35190 22785
17109 22785 16866 17410 6606 24304 13063 35133 40012 29962 22226 16263 23139 31028 49047
17096 49047 40755 17767 23036 48235 87620 104670 115413 131154 121392 136168 162052 192856
17084 192856 191249 161281 134531 131968 140241 123237 121572 120474 121890 124303 105583 120790 145527
17071 145527 158974 188614 207984 204936 246633 276779 281353 275691 242581 247190 247586 238793 204579
17058 204579 196483 187257 181521 151659 128584 133246 126140 112917 98148 65624 66484 74103 80139
17045 80139 81883 79036 75620 74308 80117 103894 114656 106189 98112 82294 75237 72688 88201
$$ packed form
17133A18000J2379j5802l7252k0482M883K1082N928k5851j9910J7366K9280J1904
17121A01525l602j8228n1302j9113n405R885M643J0395J2740R206j5554j2405
17109B2785n919N44j0804J7698j1241K2070M879j0050p736n963O876P889J8019
17096D9047q292k2988N269K5199L9385J7050J0743J5741r762J4776K5884L0804
17084A92856j607k9968k6750k563Q273j7004j665j098J416K413j8720J5207K4737
17071A45527J3447K9640J9370l048M1697L0146M574n662l3110M609L96q793l4214
17058B04579q096r226n736k9862k3075M662p106j3223j4769l2524Q60P619O036
17045H0139J744k847l416j312N809K3777J0762q467q077j5818p057k549J5513
$$ plain form
17032 88201 72786 65591 67051 98646 111568 116557 120415 121335 131011 169151 180485 162122 136493
17019 136493 143780 160646 173135 188872 195286 194367 191326 166585 143611 157874 181576 198841
17007 198841 194764 202834 192980 210518 227193 229222 221515 219259 210677 203680 180849 188820 210768
16994 210768 200255 214063 238625 245229 219647 214845 206490 203961 217788 248915 271388 265927
16982 265927 254060 245125 249092 246708 249600 257429 261514 245992 259456 273497 281466 269797 250547
16969 250547 259696 261936 265122 280091 296584 306337 312970 334477 326296 303359 293261 305515 312529
16956 312529 321683 320635 317380 333865 345848 354677 348371 359037 370719 391386 404587 403134 404623
16943 404623 403415 415091 460020 458819 480481 516587 544808 562550 563807 590174 637448 694627
$$ packed form
17032H8201j5415p195J460L1595J2922M989L858R20R676L8140J1334j8363k5629
17019A36493P287J6866J2489J5737O414r19l041k4741k2974J4263K3702J7265
17007A98841m077Q070r854J7538J6675K029p707k256q582o997k2831P971K1948
16994B10768j0513J3808K4562O604k5582m802q355k529J3827L1127K2473n461
16982B65927j1867q935L967k384K892P829M085j5522J3464J4041P969j1669j9250
16969B50547R149K240L186J4969J6493R753O633K1507q181k2937j0098J2254P014
16956C12529R154j048l255J6485J1983Q829o306J0666J1682K0667J3201j453J489
16943D04623j208J1676M4929j201K1662L6106K8221J7742J257K6367M7274N7179
$$ plain form
16931 694627 757062 825839 901454 979480 1071106 1178163 1281265 1402792 1555295 1738032
16921 1738032 1917519 2079802 2247042 2425509 2628738 2846021 3103419 3365138 3652849
16912 3652849 3980659 4349741 4857397 5491713 6326705 7515767 9206648 11731906 15683289
16903 15683289 21795732 29977389 38002694 43489930 47469667 51908119 56497796 59185938
16895 59185938 58136664 54579336 51276567 48548136 44497671 37931861 30575073 25203932
16887 25203932 22402807 21642831 22686714 25839678 31495136 38824566 45131321 48974785
16879 48974785 52191108 56056573 59489745 60296420 57557842 53391833 49932199 46522499
16871 46522499 41188350 33549762 26015637 20669148 17316966 15130470 13586552 12459157
$$ packed form
16931F94627O2435O8777P5615P8026R1626J07057J03102J21527J52503J82737
16921A738032J79487J62283J67240J78467K03229K17283K57398K61719K87711
16912C652849L27810L69082N07656O34316Q34992J189062J690881K525258L951383
16903A5683289O112443Q181657Q025305N487236L979737M438452M589677K688142
16895E9185938j049274l557328l302769k728431m050465o565810p356788n371141
16887B5203932k801125p59976J043883L152964N655458P329430O306755L843464
16879D8974785L216323L865465L433172Q06675k738578m166009l459634l409700
16871D6522499n334149p638588p534125n346489l352182k186496j543918j127395
$$ plain form
16863 12459157 11613812 10924149 10276388 9701987 9231915 8790796 8371817 7965734 7566035
16854 7566035 7194120 6854279 6514174 6217042 5933331 5647138 5437245 5263913 5075473
16845 5075473 4888276 4721623 4563900 4376870 4194486 4027375 3860244 3699558 3530869
16836 3530869 3376827 3234823 3111971 3006311 2880537 2749799 2647732 2549889 2470716 2397023
16826 2397023 2306304 2213598 2131560 2048289 1988847 1934627 1895043 1824473 1762619 1685058 1636065
16815 1636065 1578288 1526475 1486236 1447213 1409148 1383702 1348552 1284209 1249219 1225852 1191480
16804 1191480 1149770 1124456 1096941 1041385 995375 999837 980823 916863 887533 855545 830351
16793 830351 804081 767396 734582 710819 694244 676528 666963 647397 625838 601976 584447 585872
$$ packed form
16863A2459157q45345o89663o47761n74401m70072m41119m18979m06083l99699
16854G566035l71915l39841l40105k97132k83711k86193k09893j73332j88440
16845E075473j87197j66653j57723j87030j82384j67111j67131j60686j68689
16836C530869j54042j42004j22852j05660j25774j30738j02067r7843p9173p3693
16826B397023r0719r2706q2038q3271n9442n4220l9584p0570o1854p7561m8993
16815A636065n7777n1813m0239l9023l8065k5446l5150o4343l4990k3367l4372
16804A191480m1710k5314k7515n5556m6010M462j9014o3960k9330l1988k5194
16793H30351k6270l6685l2814k3763j6575j7716r565j9566k1559k3862j7529J425
$$ plain form
16781 585872 584171 540042 507562 489147 464500 452339 457691 442246 424663 411507 407851 407912 413264
16768 413264 390028 363419 365880 359592 350671 377273 388118 365102 365885 361460 334207 329150 298044
16755 298044 265646 243273 228274 263393 286877 278575 277767 279756 245948 211662 218171 223507 204241
16742 204241 201013 186228 165538 140723 133546 122743 132480 143830 142854 131132 114367 110763 122214
16729 122214 145778 143296 130722 125577 127036 113901 99755 89358 76083 82525 103621 92200
16717 92200 81350 64392 25721 -5788 -36191 -50708 -59270 -64649 -31194 -21545 -66358 -60272
16705 -60272 -56207 -57350 -70865 -70384 -40394 -4698 22810 37219 21009 28675 13899 -8084 -21263
16692 -21263 -45155 -38376 -25815 -53176 -72417 -81200 -78271 -93260 -98345 -76655 -52648 -23231
$$ packed form
16781E85872j701m4129l2480j8415k4647j2161N352j5445j7583j3156l656O1N352
16768D13264k3236k6609K461o288q921K6602J0845k3016P83m425k7253n057l1106
16755B98044l2398k2373j4999L5119K3484q302q08J989l3808l4286O509N336j9266
16742B04241l228j4785k0690k4815p177j0803R737J1350r76j1722j6765l604J1451
16729A22214K3564k482j2574n145J459j3135j4146j0397j3275O442K1096j1421
16717I2200j0850j6958l8671l1509l0403j4517q562n379L3455R649m4813O086
16705f0272M065j143j3515M81K9990L5696K7508J4409j6210P666j4776k1983j3179
16692b1263k3892O779J2561k7361j9241q783K929j4989n085K1690K4007K9417
$$ plain form
16680 -23231 30332 61081 56495 54054 47949 35460 31705 49974 47577 4474 22359 55032 51656
16667 51656 54630 48409 41454 53330 72046 72841 61294 40748 34179 30941 61735 93142 97278
16654 97278 84878 75314 58270 37784 3273 -659 30356 36310 34605 46878 44184 35597 37212
16641 37212 50225 49854 50286 66754 74172 47605 28141 -3339 -25050 -16005 -14770 -33137 -54268
16628 -54268 -50073 -21976 -21417 -20192 -26094 -23484 -27675 -14630 -2043 -25955 -43593 -54065 -42026
16615 -42026 -45129 -40563 -56283 -30608 -33691 -21318 -12332 5415 9201 4741 22111 12902 -224
16602 -224 -3691 -13411 -20369 -25326 -17921 585 -12300 6119 22506 14291 18310 31682 29782 13192
16588 13192 10596 36384 25429 5817 -2194 15588 1294 -5694 31328 29642 33512 12512 4123
$$ packed form
16680b3231N3563L0749m586k441o105j2489l755J8269k397m3103J7885L2673l376
16667E1656K974o221o955J1876J8716P95j1547k0546o569l238L0794L1407M136
16654I7278j2400r564j7044k0486l4511l932L1015N954j705J2273k694q587J615
16641C7212J3013l71M32J6468P418k6567j9464l1480k1711R045J235j8367k1131
16628e4268M195K8097N59J225n902K610m191J3045J2587k3912j7638j0472J2039
16615d2026l103M566j5720K5675l083J2373Q986J7747L786m460J7370r209j3126
16602b24l467r720o958m957P405J8506j2885J8419J6387q215M019J3372j900j6590
16588A3192k596K5788j0955j9612q011J7782j4294o988L7022j686L870k1000q389
$$ plain form
16575 4123 1822 3138 -13760 -20959 -15507 -37107 -34986 -31829 -40816 -39786 -33932 -23786 -10391 -17007
16561 -17007 -9788 -6064 -33359 -25942 -18598 -16014 -24260 -23150 6687 10567 2232 -10678 -3780 3637
16547 3637 9408 15278 14631 12287 -29 -19044 -4386 -11324 -8070 -254 -15144 -38082 -55427
16534 -55427 -64098 -19821 5308 6549 -23254 -19985 2042 15302 -7322 -27338 -16674 -37989
16522 -37989 -34605 -25221 5220 8796 -15310 -23616 -6116 14474 28358 13960 -25903 -20970 -14032
16509 -14032 -3380 5771 -9788 -21197 -28676 -23869 -43714 -18968 -10057 -19633 -25455 -41489 -59698
16496 -59698 -50112 -25554 -13502 -28073 -32295 -22546 3371 1342 5963 -18795 -14224 9360 -1476
16483 -1476 3743 23902 28487 20788 29599 19234 24042 13701 -20501 -30443 -21681 -36514 -28907
$$ packed form
16575D123k301J316j6898p199N452k1600K121L157q987J030N854J0146J3395o616
16561a7007P219L724k7295P417P344K584q246J110K9837L880q335j2910O898P417
16547C637N771N870o47k344j2316j9015J4658o938L254P816j4890k2938j7345
16534e5427q671M4277K5129J241k9803L269K2027J3260k2624k0016J0664k1315
16522c7989L384R384L0441L576k4106q306J7500K0590J3884j4398l9863M933O938
16509a4032J0652R151j5559j1409p479M807j9845K4746Q911r576n822j6034j8209
16496e9698R586K4558J2052j4571m222R749K5917k029M621k4758M571K3584j0836
16483a476N219K0159M585p699Q811j0365M808j0341l4202r942Q762j4833P607
$$ plain form
16470 -28907 -39189 -45854 -61743 -55873 -26041 -21182 -42542 -36242 -51006 -54644 -51762 -30559 -36813
16457 -36813 -58652 -68530 -34688 2140 -1539 9059 -2611 -15851 -2786 11543 -511 -9280
16445 -9280 -26478 -50766 -51026 -29703 -13972 2971 -3448 -22288 -29166 -19870 -13080 -21746 -17502
16432 -17502 -1600 19833 17916 2391 372 -13751 -70 15171 15465 7539 1452 -25900 -25572
16419 -25572 -3608 12026 -211 -30963 -54463 -55703 -35977 -50549 -52150 -40508 -47184 -43353
16407 -43353 -40200 -11732 -15145 -29830 -36809 -16149 19764 38677 21535 -2107 -6115 13868
16395 13868 16639 13065 -6529 -18809 2361 -14020 -14484 -21552 -26125 -21236 -9473 1568 34646
16382 34646 49354 29030 14511 16770 2849 -9796 -28273 -32978 -31281 -38642 -24823 -15888 -18319
$$ packed form
16470b8907j0282o665j5889N870K9832M859k1360O300j4764l638K882K1203o254
16457c6813k1839r878L3842L6828l679J0598j1670j3240J3065J4329j2054q769
16445i280j7198k4288k60K1323J5731J6943o419j8840o878R296O790q666M244
16432a7502J5902K1433j917j5525k019j4123J3681J5241K94p926o087k7352L28
16419b5572K1964J5634j2237l0752k3500j240J9726j4572j601J1642o676L831
16407d3353L153K8468l413j4685o979K0660L5913J8913j7142k3642m008J9983
16395A3868K771l574j9594j2280K1170j6381m64p068m573M889J1763J1041L3078
16382C4646J4708k0324j4519K259j3921j2645j8477m705J697p361J3819Q935k431
$$ plain form
16369 -18319 3883 27254 28553 36283 11916 9497 26602 17949 13616 19153 15989 27828 43378
16356 43378 32502 4512 7140 25547 59840 93955 122684 156968 209475 220030 271511 296372
16344 296372 287346 287258 290647 261554 241350 219011 209393 185496 125788 91017 72417 63888 80108
16331 80108 133760 176082 208787 226624 222649 234247 286641 298021 289861 269135 229387 211816
16319 211816 192322 168708 124952 71001 55023 54014 42911 42144 52740 68828 57243 30354
16307 30354 16899 25488 23545 38787 34222 16017 12511 12886 2641 -7482 -9902 2742 21366
16294 21366 9681 -32616 -33868 -23831 -5897 5450 -4887 -29063 -30697 -25211 -30973 -34204 -28980
16281 -28980 -17446 -8089 7272 3182 1628 -12722 -11918 -23697 -11644 18474 41681 36357 41287
$$ packed form
16369a8319K2202K3371J299P730k4367k419J7105q653m333N537l164J1839J5550
16356D3378j0876k7990K628J8407L4293L4115K8729L4284N2507J0555N1481K4861
16344B96372r026q8L389k9093k0204k2339r618k3897n9708l4771j8600q529J6220
16331H0108N3652M2322L2705J7837l975J1598N2394J1380q160k0726l9748j7571
16319B11816j9494k3614m3756n3951j5978j009j1103p67J0596J6088j1585k6889
16307C0354j3455Q589j943J5242m565j8205l506L75j0245j0123k420J2644J8624
16294B1366j1685m2297j252J0037J7934J1347j0337k4176j634N486n762l231N224
16281b8980J1534R357J5361m090j554j4350Q04j1779J2053L0118K3207n324M930
$$ plain form
16268 41287 36891 26971 6418 7705 6075 6430 8938 20990 32244 9927 -12591 -21854 -24238
16255 -24238 -14501 -18046 -33767 -28905 -13048 -8434 -19373 -4397 -6660 -9068 -14528 -22093 -26499
16242 -26499 -60575 -60893 -48153 -32894 -10582 2230 -11609 -17177 -16565 -26456 -47476 -32997 -18854
16229 -18854 -12355 2301 -16472 -28845 -28140 -24774 -4173 3366 5038 4429 1883 7642 -4288 -3496
16215 -3496 -18754 -12899 -3255 8777 4051 7976 4388 -20278 -38235 -59851 -22917 5714 -809
16202 -809 -10334 907 -6518 -33653 -48676 -38537 -35952 -11070 -17960 -37960 -35113 -45223 -35487
16189 -35487 -38985 -36059 -27616 -29514 -6414 -3944 -5313 -3584 -13302 -3015 13192 17927 -11036
16176 -11036 -12245 -33445 -43818 -13582 -5330 6236 -4061 -19102 -31176 -30263 -17866 -30119
$$ packed form
16268D1287m396r920k0553J287j630L55K508J2052J1254k2317k2518r263k384
16255b4238R737l545j5721M862J5857M614j0939J4976k263k408n460p565m406
16242b6499l4076l18J2740J5259K2312J2812j3839n568O12r891k1020J4479J4143
16229a8854O499J4656j8773j2373P05L366K0601P539J672o09k546N759j1930P92
16215c496j5258N855R644J2032m726L925l588k4666j7957k1616L6934K8631o523
16202h09r525J1241p425k7135j5023J0139K585K4882o890k0000K847j0110R736
16189c5487l498K926Q443j898K3100K470j369J729r718J0287J6207M735k8963
16176a1036j209k1200j0373L0236Q252J1566j0297j5041j2074R13J2397j2253
$$ plain form
16164 -30119 -72123 -53201 -20397 -10655 -14952 -16778 -20442 -31908 -19340 2369 6887 -3234 -9368
16151 -9368 -4687 -3026 6353 4144 -7010 -15630 -26684 -34542 -48383 -36482 -44863 -36868 -15940
16138 -15940 6731 -19398 -20480 -2211 7198 -11253 -33898 -28448 -1161 -7318 2508 12504 4984
16125 4984 -16618 -26712 -35830 -30770 -27325 -14893 -1866 -5262 -7355 12096 21256 2991 5804
16112 5804 29239 21917 9671 -3747 -10729 -30558 -39496 -32382 -6397 6306 3375 -12124 -12797
16099 -12797 4173 17833 28291 7723 6518 -4305 -7134 -10289 -34722 -27177 -22341 -34832 -32944
16086 -32944 -18637 -27519 -76213 -75883 -66936 -27192 -6936 -4266 -10163 -10833 -2632 -12847 -33039
16073 -33039 -45672 -33892 -20199 -20387 -49108 -33910 -3715 2356 -5420 -23495 -44353 -50530 -25564
$$ packed form
16164c0119m2004J8922L2804R742m297j826l664j1466J2568K1709M518j0121o134
16151i368M681J661R379k209j1154q620j1054p858j3841J1901q381P995K0928
16138a5940K2671k6129j082J8269R409j8451k2645N450K7287o157R826R996p520
16125D984k1602j0094r118N060L445J2432J3027l396k093J9451R160j8265K813
16112E804K3435p322j2246j3418o982j9829q938P114K5985J2703k931j5499o73
16099a2797J6970J3660J0458k0568j205j0823k829l155k4433P545M836j2491J888
16086c2944J4307q882m8694L30Q947L9744K0256K670n897o70Q201j0215k0192
16073c3039j2633J1780J3693j88k8721J5198L0195O071p776j8075k0858o177K4966
$$ plain form
16060 -25564 -8866 1312 -8614 -6930 -16394 1034 13320 1139 -23161 -6185 11533 20636
16048 20636 14002 13737 11248 -2562 -22057 -20154 5545 2622 -7661 -22199 -8163 -15381 -49468
16035 -49468 -42995 -44266 -57483 -66318 -48420 -28475 -27400 -14258 -2237 610 704 3105 11826 11593
16021 11593 17488 -2116 -19858 -14179 1779 -2693 1522 6632 -15681 -21419 -21666 -33687 -23524
16008 -23524 -19213 -16926 -17501 -7377 -5449 4658 -7582 -8283 -9091 -7771 625 12534 2913 -5937
15994 -5937 5868 9915 24199 12529 24478 28117 30028 8876 -20598 -16175 -11974 -16094 -6455
15981 -6455 -6674 -7166 -5749 26509 14785 6637 21752 10421 -6885 -15319 -11597 -31565 -43638
15968 -43638 -24515 -7124 6147 25272 31616 31145 19008 14268 8152 -5883 -32784 -35276 -32720
$$ packed form
16060b5564J6698J0178r926J684r464J7428J2286j2181k4300J6976J7718R103
16048B0636o634k65k489j3810j9495J903K5699k923j0283j4538J4036p218l4087
16035d9468O473j271j3217q835J7898J9945J075J3142J2021K847R4K401Q721k33
16021A1593N895j9604j7742N679J5958m472M215N110k2313n738k47j2021J0163
16008b3524M311K287n75J0124J928J0107j2240p01q08J320Q396J1909r621q850
15994e937J1805M047J4284j1670J1949L639J911k1152k9474M423M201m120R639
15981f455k19m92J417L2258j1724q148J5115j1331j7306q434L722j9968j2073
15968d3638J9123J7391J3271J9125O344m71j2137m740o116j4035k6901k492K556
$$ plain form
15955 -32720 3547 20232 22592 -167 -10351 -10681 -16047 -15385 997 20917 42717 39871 12228
15942 12228 22048 29925 8054 -11361 -29839 -37286 -21587 -13519 -8838 6584 -3962 -18152 -33817
15929 -33817 -27030 -8971 -1774 -7284 -12897 -18894 -32107 -14432 222 -4525 -32959 -49077 -17393
15916 -17393 -11741 -26928 -37207 -28268 -7255 -2026 -5776 6531 371 3436 -9124 -5269 -6419
15903 -6419 -4365 -4706 -15657 -18401 -21351 -25497 -16096 -8111 -39225 -47547 -33039 -36291 -33849 -30392
15889 -30392 -42260 -39553 -3177 25537 16516 5102 -5519 1552 4129 -15255 -13058 -13456 -27945
15876 -27945 -7693 -5132 -4380 20415 10024 -15894 -13019 -3346 -3132 -16411 -16389 3067 -12405 -35162
15862 -35162 -44650 -46318 -29526 -7445 -25329 -50091 -33105 -32283 -40916 -45707 -40258 -16684 261
$$ packed form
15955c2720L6267J6685K360k2759j0184l30n366O62J6382J9920K1800k846k7643
15942A2228R820P877k1871j9415j8478p447J5699Q068M681J5422j0546j4190j5665
15929c3817O787J8059P197n510n613n997j3213J7675J4654m747k8434j6118L1684
15916a7393N652j5187j0279Q939K1013N229l750J2307o160L065j2560L855j150
15903f419K054l41j0951k744k950m146R401P985l1114q322J4508l252K442L457
15889c0392j1868K707L6376K8714r021j1414j0621P071K577j9384K197l98j4489
15876b7945K0252K561P52K4795j0391k5918K875R673K14j3279K2J9456j5472k2757
15862c5162r488j668J6792K2081j7884k4762J6986Q22q633m791N449K3574J6945
$$ plain form
15849 261 -16740 -35166 -27618 -25241 -22871 -42040 -44166 -42196 -46550 -35559 -26864 -45867 -36863 -26325
15835 -26325 -25433 -14754 -5706 -19216 -42574 -19389 -26029 -38828 -21394 -18780 -27221 -7174 7365
15822 7365 -2228 -1176 -29741 -39251 -52948 -27520 -7873 -21981 3466 9086 14881 29468 40417
15809 40417 22156 4165 -25573 -46861 -41114 -34379 -35517 -37812 -43390 -39757 -26736 -25377 -6663
15796 -6663 -6967 717 709 -12575 -11284 -38223 -69750 -52396 -11844 5617 -4964 -22077 -28029 -34749
15782 -34749 -42473 -65254 -71795 -39697 -40043 -51058 -52597 -59907 -48460 -38146 -23291 -14855 -36913
15769 -36913 -29310 -40216 -51457 -31679 -17060 -24418 -32796 -20276 -10796 -6068 -31250 -34706 -30183
15756 -30183 -54357 -59420 -33575 -22306 -37774 -30010 -17233 -32209 -43104 -22259 -17948 -15476
$$ packed form
15849B61j7001j8426P548K377K370j9169k126J970m354J0991Q695j9003R004J0538
15835b6325Q92J0679R048j3510k3358K3185o640j2799J7434K614q441K0047J4539
15822G365r593J052k8565r510j3697K5428J9647j4108K5447N620N795J4587J0949
15809D0417j8261j7991k9738k1288N747O735j138k295n578L633J3021J359J8714
15796f663l04P684qj3284J291k6939l1527J7354M0552J7461j0581j7113n952o720
15782c4749p724k2781o541L2098l46j1015j539p310J1447J0314J4855Q436k2058
15769c6913P603j0906j1241J9778J4619p358q378J2520R480M728k5182l456M523
15756c0183k4174n063K5845J1269j5468P764J2777j4976j0895K0845M311K472
$$ plain form
15744 -15476 -3057 13328 -932 -15033 -37794 -32142 -7809 -1143 13759 35739 31978 5552
15732 5552 -2252 5329 30334 34058 38230 17654 -6649 -16996 -10108 -11369 3291 -4537 -2274
15719 -2274 5028 -26314 -39984 -32176 -6234 -26329 -36233 -30277 -16666 8777 3620 5642 10498
15706 10498 10144 -1345 12832 -8684 -11266 -5510 -16656 -26340 -26370 -24048 -7921 -19557 -27552 -28807
15692 -28807 -8081 15954 14169 4248 -5939 6953 22194 16509 3416 -22315 -27886 -12450
15680 -12450 -4496 -8873 -25438 -23843 -46677 -59040 -41476 -18775 18324 17285 25410 27692 -3660
15667 -3660 -24544 -52453 -39658 -23666 -22606 -18485 -30939 -32382 -4524 -17897 -17423 -26716 -36105
15654 -36105 -28779 -24110 -30415 -33214 -22705 -9906 -13910 -24018 -41112 -20002 12392 25798 10643
$$ packed form
15744a5476J2419J6385j4260j4101k2761N652K4333O666J4902K1980l761k6426
15732E552p804P581K5005L724M172k0576k4303j0347O888j261J4660p828K263
15719b274P302l1342j3670P808K5942k0095r904N956J3611K5443n157K022M856
15706A0498l54j1489J4177k1516k582N756j1146r684l0K322J6127j1636p995j255
15692b8807K0726K4035j785r921j0187J2892J5241n685j3093k5731n571J5436
15680a2450P954m377j6565J595k2834j2363J7564K2701L7099j039Q125K282l1352
15667c660k0884k7909J2795J5992J060M121j2454j443K7858j3373M74r293r389
15654c6105P326M669o305k799J0509J2799m004j0108j7094K1110L2394J3406j5155
$$ plain form
15641 10643 -17093 -23350 -27108 -41917 -37495 -39538 -30952 -25186 -10534 -15574 -33862 -25525 -9247
15628 -9247 -3810 595 7640 -23041 -36246 -16699 -24760 -46537 -44066 -19958 -28481 -36415 -34733
15615 -34733 -16185 -14491 -39309 -48125 -37804 -11865 -17540 -37573 -46676 -36962 -17380 -35018 -51704
15602 -51704 -33700 -20344 -31581 -9496 8725 -9349 -21042 -47194 -41486 -27419 -28328 -36641
15590 -36641 -26128 -39990 -30753 -16137 -9122 -3366 -8765 -23150 -31978 -39578 -40179 -39739 -31285 -11637
15576 -11637 -16209 -20165 -27434 -36028 -63974 -45348 -29379 -38567 -34647 -35391 -30734 -25509 -19794 -28304
15562 -28304 -19833 1847 -4054 -24743 -35831 -57294 -37817 -19140 -14133 -666 -17995 -9633
15550 -9633 -20599 -14494 -10448 -21542 -43421 -38266 -27758 -18358 -19317 -26045 -36193 -30063 -37563 -50376
$$ packed form
15641A0643k7736o257l758j4809M422k043Q586N766J4652n040j8288Q337J6278
15628i247N437M405P045l0681j3205J9547q061k1777K471K4108q523p934J682
15615c4733J8548J694k4818q816J0321K5939n675k0033r103R714J9582j7638j6686
15602e1704J8004J3356j1237K2085J8221j8074j1693k6152N708J4067r09q313
15590c6641J0513j3862R237J4616P015N756n399j4385q828p600o01M40Q454J9648
15576a1637m572l956p269q594k7946J8626J5969r188L920p44M657N225N715q510
15562b8304Q471K1680n901k0689j1088k1463J9477J8677N007J3467j7329Q362
15550i633j0966O105M046j1094k1879N155J0508R400r59o728j0148O130p500j2813
$$ plain form
15536 -50376 -42419 -37274 -13296 -16870 -9431 1228 20625 15311 -982 4983 20277 23098 6218
15523 6218 7229 19800 18902 23219 19384 13273 4904 -11809 -7820 -16712 -18266 -1100 -12634 -12230
15509 -12230 -28102 -34787 -27192 205 4100 -2828 -5078 -17048 -22265 -3284 -10275 -10658 11766
15496 11766 15 -19249 -23445 -11715 -8105 -29463 -48403 -49238 -40135 -59340 -62477 -47248 -24998
15483 -24998 -6506 -15324 -39008 -28537 -24877 -31506 -39394 -30448 -27934 -42261 -49848 -19329 -18835
15470 -18835 -32159 -6257 10288 14387 28176 18341 -10311 -16677 -24202 -19957 -30553 -37616 -17995
15457 -17995 -8849 2743 -2142 -14001 -22311 -50185 -65172 -29650 -30927 -34803 -16440 -25651 -40061
15444 -40061 -39789 -24957 -34962 -44973 -53314 -46749 -50533 -50269 -29531 -31802 -38946 -26453 -15389
$$ packed form
15536e0376P957N145K3978l574P439J0659J9397n314j6293N965J5294K821j6880
15523F218J011J2571q98M317l835o111q369j6713L989q892j554J7166j1534M04
15509a2230j5872o685P595K7397L895o928k250j1970n217J8981o991l83K2424
15496A1766j1751j9264m196J1730L610k1358j8940q35R103j9205l137J5229K2250
15483b4998J8492q818k3684J0471L660o629p888Q946K514j4327p587L0519M94
15470a8835j3324K5902J6545M099J3789r835k8652o366p525M245j0596p063J9621
15457a7995R146J1592m885j1859q310k7874j4987L5522j277l876J8363r211j4410
15444d0061K72J4832j0005j0011q341O565l784K64K0738k271p144J2493J1064
$$ plain form
15431 -15389 -12462 -35353 -22837 -2269 22455 29229 11162 230 -4462 -13548 -8831 -31149 -43161
15418 -43161 -14278 -15269 -16763 11958 11810 -3583 -16166 -20304 -13577 -30092 -39064 -13616 -10046
15405 -10046 -31729 -37327 -20157 -18166 -23171 -37153 -32039 -17108 -7571 2077 -14220 -19047 -6503
15392 -6503 -26137 -34219 -24370 -21097 -29220 -62705 -66053 -42944 -7092 -4342 -2971 5351 18289
15379 18289 25596 19267 25402 2059 -26797 -25956 -7216 -324 3756 18218 33866 35982 10328
15366 10328 -2140 -4188 -6813 -3290 -7832 -2644 -22452 -9257 -24733 -27975 -18025 426 -10609
15353 -10609 -16537 -28891 -32181 -35988 -44663 -46669 -47357 -40331 -47530 -29084 -29996 -35606 -26789 -9555
15339 -9555 12160 5658 -7269 -9584 7136 30575 18798 10208 78 -36437 -48881 -58783 -47822
$$ packed form
15431a5389K927k2891J2516K0568K4724O774j8067j0932m692r086M717k2318j2012
15418d3161K8883r91j494K8721j48j5393j2583m138O727j6515q972K5448L570
15405a0046k1683n598J7170J991n005j3982N114J4931R537R648j6297m827J2544
15392f503j9634q082R849L273q123l3485l348K3109L5852K750J371Q322J2938
15379A8289P307o329O135k3343k8856Q41J8740O892M080J4462J5648K116k5654
15366A0328j2468k048k625L523m542N188j9808J3195j5476l242R950J8451j1035
15353a0609n928j2354l290l807q675k006o88P026p199J8446r12n610Q817J7234
15339i555K1715o502j2927k315J6720K3439j1777q590j0130l6515j2444r902J0961
$$ plain form
15326 -47822 8481 21094 3749 -8842 269 3813 -27672 -34675 -28551 -18537 6055 7364 -3496
15313 -3496 2174 -6951 -2140 8473 10303 19484 6676 -2246 -4117 -6686 6901 24309 16435 14681
15299 14681 15545 8060 3315 1463 14429 21051 11116 -798 10103 12238 5077 6562 5084 2205
15285 2205 -25192 -30340 -20026 3947 3051 12948 24763 12660 -16567 -30219 -27756 -4972 -5424
15272 -5424 6035 -4700 6403 3112 6648 -5667 -18267 -31235 -29399 1317 29525 10280
15260 10280 75 8914 8615 1603 -9787 2872 -26585 -31982 -15607 -5683 9048 22251 43164
15247 43164 30035 -11208 -20685 -29318 -28583 -6669 16895 17915 14272 21767 35112 29113 11044
15234 11044 4014 4489 -12038 -20265 -7963 6722 -21565 -19888 -33154 -36632 -31920 -17747 14033
$$ packed form
15326d7822N6303J2613j7345j2591R111L544l1485p003O124J0014K4592J309j0860
15313c496N670r125M811J0613J830R181j2808q922j871k569J3587J7408p874j754
15299A4681Q64p485m745j852J2966O622r935j1914J0901K135p161J485j478k879
15285B205k7397n148J0314K3973q96R897J1815j2103k9227j3652K463K2784m52
15272e424J1459j0735J1103l291L536j2315j2600j2968J836L0716K8208j9245
15260A0280j0205Q839k99p012j1390J2659k9457n397J6375R924J4731J3203K0913
15247D3164j3129m1243r477q633P35K1914K3564J020l643P495J3345n999j8069
15234A1044p030M75j6527q227J2302J4685k8287J677j3266l478M712J4173L1780
$$ plain form
15221 14033 32829 39965 26266 -2952 -17549 -21897 -21250 -12596 25290 39928 15514 17246 11946
15208 11946 24279 13315 -2893 -12090 19520 39870 18701 -3924 -17007 -20718 -2424 -10111
15196 -10111 -23836 -19675 -2975 -20529 -36253 -33808 -44817 -45543 -34445 -24937 -21120 -17609 -7049
15183 -7049 11482 12817 -5598 -16793 -6418 3207 26201 20829 2419 4888 7901 3041 6387
15170 6387 -2262 14387 13975 16094 21618 27687 -5346 -34002 -47827 -39756 -26525 -11481 -12667
15157 -12667 -6406 9734 12459 19941 17516 32426 45207 54189 37379 18223 -178 17426 33471
15144 33471 14687 -5537 15240 35415 20427 6045 -3820 -9705 -9876 -8053 6597 80 -20776
15131 -20776 -17780 4342 -19548 -13385 -1603 23091 12152 23706 12620 9224 1701 11462 11880
$$ packed form
15221A4033J8796P136j3699k9218j4597m348O47Q654L7886J4638k4414J732n300
15208A1946J2333j0964j6208r197L1610K0350k1169k2625j3083l711J8294p687
15196a0111j3725M161J6700j7554j5724K445j1009p26J1098R508L817L511J0560
15183g049J8531J335j8415j1195J0375R625K2994n372j8410K469L013m860L346
15170F387q649J6649m12K119N524O069l3033k8656j3825Q071J3231J5044j186
15157a2667O261J6140K725P482k425J4910J2781Q982j6810j9156j8401J7604J6045
15144C3471j8784k0224K0777K0175j4988j4382r865n885j71J823J4650o517k0856
15131b0776K996K2122k3890O163J1782K4694j0939J1554j1086l396p523R761M18
$$ plain form
15118 11880 6754 -6841 -15135 -30518 -15448 10892 487 -13283 -14600 -22575 -27420 -20978 -24077
15105 -24077 -31935 -47259 -55413 -43397 -9362 3678 363 6395 3841 6111 18993 4694 16588
15092 16588 13207 9582 5583 -3001 -3112 27183 52849 39390 28913 34889 34536 22776 5573
15079 5573 -3879 18728 16899 26263 23852 11156 10357 -6871 -1001 7913 1508 -6987 -1847 -11611
15065 -11611 1350 3567 -22242 -28716 -30772 -32570 -15735 -11760 -11110 -8142 -24852 -47222 -44325
15052 -44325 -43296 -29017 -30125 -21107 -7762 -33769 -41298 -28968 -24825 -23177 -27612 -16086 -23499
15039 -23499 -23956 -35712 -27031 -14526 -21670 -22847 -17682 -7302 1192 -17482 -9855 -5885 -15891
15026 -15891 -5730 -8167 -9351 -10330 17093 16598 -3514 -26747 -15863 15832 12279 1068 4539
$$ packed form
15118A1880n126j3595q294j5383J5070K6340j0405j3770j317p975m845O442l099
15105b4077p858j5324q154J2016L4035J3040l315O032k554K270J2882j4299J1894
15092A6588l381l625l999q584j11L0295K5666j3459j0477N976l53j1760j7203
15079E573r452K2607j829R364k411j2696p99j7228N870Q914o405q495N140r764
15065a1611J2961K217k5809o474k056j798J6835L975O50K968j6710k2370K897
15052d4325J029J4279j108R018J3345k6007p529J2330M143J648m435J1526p413
15039b3499m57j1756Q681J2505p144j177N165J0380Q494j8674P627L970j0006
15026a5891J0161k437j184r79K7423m95k0112k3233J0884L1695l553j1211L471
$$ plain form
15013 4539 5787 -15858 -10872 -849 7759 30241 12742 12069 11761 1583 8917 33648 3462
15000 3462 -10525 -158 13960 16904 39231 76649 82550 63329 44788 27572 -2711 -19212
14988 -19212 -10172 -22346 -16381 -7967 -22331 -12455 1241 -16788 -18249 -19883 -2178 10972 20935
14975 20935 23215 8754 25306 26888 2642 -10027 976 25459 19685 47240 15259 -20220
14963 -20220 -15602 -17010 3667 23887 24783 18997 2673 -4056 -15451 -11717 -1974 14557 21471
14950 21471 10267 3087 1928 20645 -1272 5501 2283 -13419 -25475 -8683 2527 -5003 -13404
14937 -13404 872 16884 33843 15334 -10847 2126 17759 27026 43473 23212 18773 15150
14925 15150 11835 20725 43518 37956 18602 12153 24006 44799 52016 36255 25531 31534 62344
$$ packed form
15013D539J248k1645M986J0023Q608K2482j7499o73l08j0178P334K4731l0186
15000C462j3987J0367J4118K944K2327L7418N901j9221j8541j7216l0283j6501
14988a9212R040j2174N965Q414j4364R876J3696j8029j461j634J7705J3150R963
14975B0935K280j4461J6552J582k4246j2669J1003K4483n774K7555l1981l5479
14963b0220M618j408K0677K0220Q96n786j6324o729j1395L734R743J6531O914
14950B1471j1204p180j159J8717k1917O773l218j5702j2056J6792J1210p530q401
14937a3404J4276J6012J6959j8509k6181J2973J5633R267J6447k0261m439l623
14925A5150l315Q890K2793n562j9354o449J1853K0793P217j5761j0724O003L0810
$$ plain form
14912 62344 69933 56260 20279 -11125 -34063 -34181 -17803 -34929 -39095 -30746 -4024 525 -3377
14899 -3377 -3585 13494 12643 -573 -8975 -11711 1258 8687 14712 16853 15269 17949 7042 -9302
14885 -9302 -11000 -9261 -14287 -13694 8548 27450 27349 39071 45980 47091 47426 48913 60794 64707
14871 64707 30214 22477 19977 20633 56026 54402 45955 46232 24105 5896 5360 8582 4674 -7566
14857 -7566 -14436 -17464 627 17924 27989 9966 6092 16114 30108 41967 41747 28118 10460
14844 10460 11411 4365 -4652 2645 4241 -6250 5302 12951 -3223 -5050 6322 -2092 -12612
14831 -12612 -18354 -11786 2313 18664 39163 41574 50163 60585 56791 59610 50981 27642 10189
14818 10189 15158 597 -1998 -10104 -26215 -41224 -31026 -22444 -8686 -4101 -10041 5751 11796
$$ packed form
14912F2344P589j3673l5981l1404k2938j18J6378j7126m166Q349K6722M549l902
14899c377k08J7079q51j3216q402k736J2969P429O025K141j584K680j0907j6344
14885i302j698J739n026N93K2242J8902j01J1722O909J111L35J487J1881L913
14871F4707l4493p737k500O56L5393j624q447K77k2127j8209n36L222l908j2240
14857g566o870l028J8091J7297J0065j8023l874J0022J3994J1859k20j3629j7658
14844A0460R51p046r017P297J596j0491J1552P649j6174j827J1372q414j0520
14831a2612n742O568J4099J6351K0499K411Q589J0422l794K819q629k3339j7453
14818A0189M969j4561k595q106j6111j5009J0198Q582J3758M585n940J5792O045
$$ plain form
14805 11796 -14235 -3935 8583 16128 575 -5761 -2787 9339 15633 1700 -13848 -8240 4988
14792 4988 5439 7453 7956 18405 35463 34898 23541 7155 3309 3355 14110 13777 -4871 -9229 48
14777 48 23565 21949 19858 33198 -11916 -9721 25657 74635 51505 38301 49862 50897 44615
14764 44615 20764 -9026 3964 5463 959 12897 24567 17799 2224 5804 8081 9997 6830
14751 6830 17231 9316 12763 21670 11829 5192 18227 22076 21037 18196 28076 38673 39186 51594
14737 51594 53611 26111 13181 9028 18712 24501 50133 73568 60491 39034 37435 43004 63716
14724 63716 67799 71524 102656 119205 127286 101976 103695 134428 147726 165311 140655 140178 169086
14711 169086 188996 216300 228322 229572 252553 278845 271239 262521 281765 315825 329405 348977
$$ packed form
14805A1796k6031J0300J2518P545j5553o336K974J2126O294j3933j5548N608J3228
14792D988M51K014N03J0449J7058n65j1357j6386l846M6J0755l33j8648m358R277
14777D8K3517j616k091J3340m5114K195L5378M8978k3130j3204J1561J035o282
14764D4615k3851k9790J2990J499m504J1938J1670o768j5575L580K277J916l167
14751F830J0401p915L447Q907r841o637J3035L849j039k841R880J0597N13J2408
14737E1594K017k7500j2930m153R684N789K5632K3435j3077k1457j599N569K0712
14724F3716M083L725L1132J6549Q081k5310J719L0733J3298J7585k4656m77K8908
14711A69086J9910K7304J2022J250K2981K6292p606q718J9244L4060J3580J9572
$$ plain form
14699 348977 366224 386394 392130 396023 403003 420396 441778 472677 507292 510266 511078 509651 505480
14686 505480 483347 491100 482519 450161 445317 437744 426818 398291 403058 405089 367546 317587 308167
14673 308167 320157 310039 294221 253160 230523 230883 198706 183889 203225 194511 175404 168039
14661 168039 154558 122995 139015 157430 161819 157452 151518 123982 110859 103545 126653 108718
14649 108718 92079 94384 94528 94986 93072 103766 101101 81247 67903 70380 45417 39213 36828
14636 36828 43347 63263 78209 84765 100653 86150 58365 65365 53985 37686 29724 38294 64284
14623 64284 42277 55903 38183 14288 6482 -5588 6667 10300 26505 54332 35668 5356
14611 5356 32796 58468 80783 60571 61002 54141 56735 82554 84532 63302 28946 5675 13217
$$ packed form
14699C48977J7247K0170N736L893O980J7393K1382L0899L4615K974Q12j427m171
14686E05480k2133P753q581l2358m844p573j0926k8527M767K031l7543m9959r420
14673C08167J1990j0118j5818m1061k2637L60l2177j4817J9336q714j9107p365
14661A68039j3481l1563J6020J8415M389m367n934k7536j3123p314K3108j7935
14649A08718j6639K305J44M58j914J0694k665j9854j3344K477k4963o204k385
14636C6828O519J9916J4946O556J5888j4503k7785P000j1380j6299p962Q570K5990
14623F4284k2007J3626j7720k3895p806j2070J2255L633J6205K7827j8664l0312
14611E356K7440K5672K2315k0212M31o861K594K5819J978k1230l4356k3271P542
$$ plain form
14598 13217 23803 24913 9026 -3272 10865 23598 25974 25912 25733 36806 45322 48355 51213 46087
14584 46087 43367 48281 36472 20481 21390 28257 20582 34042 59166 62073 38417 15023 37388
14571 37388 31853 18122 -6256 -23434 -34645 -27423 -17797 6117 17729 5504 9613 10823 6819
14558 6819 4195 12280 24252 16288 -1319 2880 -4815 -638 5760 3222 9139 23205 35724 752
14544 752 -7995 -14443 3572 29016 38154 28017 -4834 -22396 -15185 8560 4846 8795 -8282
14531 -8282 -12304 10785 16007 29426 43126 51785 70657 82725 67326 58771 48655 58831 65746
14518 65746 80349 82373 84316 68422 76322 82220 77955 76524 61188 70616 73834 75309 96705
14505 96705 99851 101343 103132 102639 99752 118846 115564 108065 93503 95058 102553 121731 129048 116580
$$ packed form
14598A3217J0586J110j5887j2298J4137J2733K376o2j79J1073Q516L033K858n126
14584D6087k720M914j1809j5991R09O867p675J3460K5124K907k3656k3394K2365
14571C7388n535j3731k4378j7178j1211P222R626K3914J1612j2225M109J210m004
14558F819k624Q085J1972p964j7607M199p695M177O398k538N917J4066J2519l4972
14544G52q747o448J8015K5444R138j0137l2851j7562P211K3745l714L949j7077
14531h282m022K3089N222J3419J3700Q659J8872J2068j5399q555j0116J0176O915
14518F5746J4603K024J943j5894P900N898m265j431j5336R428L218J475K1396
14505I6705L146J492J789m93k887J9094l282p499j4562J555P495J9178P317j2468
$$ plain form
14491 116580 100085 105326 86709 94875 106671 127689 145806 136018 124284 102301 84209 87802
14479 87802 118645 118108 119368 109301 94145 103644 118928 99682 77845 70365 79668 88515 76054
14466 76054 78987 88673 94403 93192 83757 75134 59823 72897 105986 139710 161303 161163 128289
14453 128289 115156 114124 125135 153600 173400 191983 201642 195103 197413 222316 214929 215255 216631
14440 216631 220893 240300 262677 272566 260977 260475 267057 273017 299321 297330 284300 281560 307623
14427 307623 305009 297279 304783 320060 325973 337983 331927 318344 310781 291955 277663 260988 254980
14414 254980 260266 264746 254185 262159 238295 228216 231750 230210 222701 207871 202139 188489 179230
14401 179230 193576 183545 134403 131885 147815 170230 176035 198598 203652 172800 169469 187063
$$ packed form
14491A16580j6495N241j8617Q166J1796K1018J8117r788j1734k1983j8092L593
14479H7802L0843n37J260j0067j5156R499J5284j9246k1837p480R303Q847j2461
14466G6054K933R686N730j211r435q623j5311J3074L3089L3724K1593j40l2874
14453A28289j3133j032J1011K8465J9800J8583R659o539K310K4903p387L26J376
14440B16631M262J9407K2377R889j1589n02O582N960K6304j991j3030k740K6063
14427C07623k614p730P504J5277N913J2010o056j3583p563j8826j4292j6675o008
14414B54980N286M480j0561P974k3864j0079L534j540p509j4830n732j3650r259
14401A79230J4346j0031m9142k518J5930K2415N805K2563N054l0852l331J7594
$$ plain form
14389 187063 177312 162527 174133 205368 206590 203249 207019 213393 227524 277308 280088 281828 283523
14376 283523 298816 329663 328387 276765 280364 285107 290758 310223 308492 323906 313873 325412
14364 325412 354896 362516 344055 374097 380196 388571 410461 427937 424603 429924 428856 419601 422728
14351 422728 414810 435299 440201 443427 468841 465710 474284 482136 480747 509132 526643 525836 531891
14338 531891 538672 547995 570472 603017 614274 627606 647387 663624 689199 702046 729028 762215
14326 762215 782053 797619 808800 822530 845284 859496 876765 893324 943246 960235 966634 986281
14314 986281 1015590 1068784 1118982 1154732 1182420 1228176 1310452 1354386 1405247 1458502 1528203
14303 1528203 1581197 1645227 1743109 1847962 1928991 2017785 2128092 2262861 2401793 2566697
$$ packed form
14389A87063r751j4785J1606L1235J222l341L770O374J4131M9784K780J740J695
14376B83523J5293L0847j276n1622L599M743N651J9465j731J5414j0033J1539
14364C25412K9484P620j8461L0042O099Q375K1890J7476l334N321j068r255L127
14351D22728p918K0489M902L226K5414l131Q574P852j389K8385J7511q07O055
14338E31891O781R323K2477L2545J1257J3332J9781J6237K5575J2847K6982L3187
14326G62215J9838J5566J1181J3730K2754J4212J7269J6559M9922J6989O399J9647
14314I86281K9309N3194N0198L5750K7688M5756Q2276M3934N0861N3255O9701
14303A528203N2994O4030R7882J04853Q1029Q8794J10307J34769J38932J64904
$$ plain form
14293 2566697 2725975 2885671 3052140 3248526 3467924 3715419 3984795 4275196 4572254
14284 4572254 4915103 5299010 5732868 6199738 6695814 7237215 7851774 8521096 9251692
14275 9251692 10085247 11010162 12015202 13120679 14352380 15710930 17227565 18880610
14267 18880610 20684612 22649191 24760978 27065193 29525262 32205327 35058127 38059986
14259 38059986 41209922 44466463 47824848 51220852 54658717 58078345 61421857 64661010
14251 64661010 67775594 70704376 73428402 75907850 78118360 80063712 81714593 83081591
14243 83081591 84159973 84928517 85402011 85591318 85476958 85031493 84233019 83147001 81766056
14234 81766056 80105730 78150466 75934432 73509317 70861775 68019935 65044892 61993585
$$ packed form
14293B566697J59278J59696J66469J96386K19398K47495K69376K90401K97058
14284D572254L42849L83907M33858M66870M96076N41401O14559O69322P30596
14275I251692Q33555R24915J005040J105477J231701J358550J516635J653045
14267A8880610J804002J964579K111787K304215K460069K680065K852800L001859
14259C8059986L149936L256541L358385L396004L437865L419628L343512L239153
14251F4661010L114584K928782K724026K479448K210510J945352J650881J366998
14243H3081591J078382P68544M73494J89307j14360m45465p98474j086018j380945
14234H1766056j660326j955264k216034k425115k647542k841840k975043l051307
$$ plain form
14226 61993585 58903574 55793178 52709656 49684167 46756950 43930944 41253192 38712153
14218 38712153 36323914 34088138 31990907 30013560 28177999 26478307 24897665 23462944
14210 23462944 22117179 20890717 19745066 18655925 17640734 16694030 15843296 15081782
14202 15081782 14367614 13666359 12990255 12388644 11800849 11279936 10817845 10380415 9948500
14193 9948500 9494545 9051723 8705780 8365490 7983955 7655803 7399885 7118110 6857315
14184 6857315 6592614 6331510 6099090 5859131 5663034 5467797 5266372 5089859 4930185
14175 4930185 4758178 4581935 4430546 4302325 4171874 4029538 3881487 3754853 3632070
14166 3632070 3497290 3403706 3312141 3172504 3085580 2977926 2892016 2815906 2738407 2662644 2603650
$$ packed form
14226F1993585l090011l110396l083522l025489k927217k826006k677752k541039
14218C8712153k388239k235776k097231j977347j835561j699692j580642j434721
14210B3462944j345765j226462j145651j089141j015191r46704q50734p61514
14202A5081782p14168p01255o76104o01611n87795n20913m62091m37430m31915
14193I948500m53955m42822l45943l40290l81535l28152k55918k81775k60795
14184F857315k64701k61104k32420k39959j96097j95237k01425j76513j59674
14175D930185j72007j76243j51389j28221j30451j42336j48051j26634j22783
14166C632070j34780r3584r1565j39637q6924j07654q5910p6110p7499p5763n8994
$$ plain form
14155 2603650 2522699 2443508 2362832 2251221 2179324 2131101 2055369 1976683 1906698 1842794 1779012
14144 1779012 1702278 1655104 1627117 1573261 1524815 1492820 1435854 1377202 1319728 1253664 1205078
14133 1205078 1191589 1157736 1090228 1027372 965937 917110 884474 840296 808566 787403 771561
14122 771561 760604 736244 716461 692980 662571 635169 612435 585033 577817 579907 557710 531798
14110 531798 512540 500226 503594 494858 478882 456235 417112 398814 393844 382291 394245 369218
14098 369218 374415 381882 361676 386275 372610 347644 319966 301799 309892 293289 274654 272103
14086 272103 274826 276432 259391 256007 279313 285903 267474 219862 213285 223066 230795 215757 180036
14073 180036 168587 161446 163701 163472 138021 133500 110622 108704 103382 101734 98180 82893 67040
$$ packed form
14155B603650q0951p9191q0676j11611p1897m8223p5732p8686o9985o3904o3782
14144A779012p6734m7174k7987n3856m8446l1995n6966n8652n7474o6064m8586
14133A205078j3489l3853o7508o2856o1435m8827l2636m4178l1730k1163j5842
14122G71561j0957k4360j9783k3481l0409k7402k2734k7402p216K090k2197k5912
14110E31798j9258j2314L368q736j5976k2647l9123j8298m970j1553J1954k5027
14098C69218N197P467k0206K4599j3665k4966k7678j8167Q093j6603j8635k551
14086B72103K723J606j7041l384K3306O590j8429m7612o577R781P729j5038l5721
14073A80036j1449p141K255k29k5451m521k2878j918n322j648l554j5287j5853
$$ plain form
14060 67040 51910 40603 21653 19505 19456 9713 44735 46712 21859 47 -12472 -13904 -31167
14047 -31167 -36634 -6760 1304 29602 19488 5170 19024 20467 19056 17581 22345 32994 62566
14034 62566 71303 65573 74606 89926 90979 77221 75922 93793 114675 125908 127194 129019 122574
14021 122574 96351 113615 138513 164708 159914 161634 169975 144144 118914 122507 121420 122178 117090
14008 117090 126699 123415 109495 92912 75755 77824 106027 100732 105434 111526 118604 124140 117259
13995 117259 108121 102896 91609 99293 93799 83882 72748 79360 77902 67239 54492 41605 5206
13982 5206 14177 49885 71987 71899 63422 75202 71729 67343 62530 69790 51252 17904 13495 39387
13968 39387 48684 41006 33047 13343 7289 14885 22994 34498 45736 45815 53333 61089 48881 33429
$$ packed form
14060F7040j5130j1307j8950k148m9r743L5022J977k4853k1812j2519j432j7263
14047c1167n467K9874Q064K8298j0114j4318J3854J443j411j475M764J0649K9572
14034F2566Q737n730R033J5320J053j3758j299J7871K0882J1233J286J825o445
14021A22574k6223J7264K4898K6195m794J720Q341k5831k5230L593j087P58n088
14008A17090R609l284j3920j6583j7157K069K8203n295M702O092P078N536o881
13995A17259r138n225j1287P684n494r917j1134O612j458j0663j2747j2887l6399
13982E206Q971L5708K2102q8q477J1780l473m386m813P260j8538l3348m409K5892
13968C9387R297p678p959j9704o054P596Q109J1504J1238P9P518P756j2208j5452
$$ plain form
13954 33429 24693 29165 45446 60884 78206 74978 68634 66293 76387 71456 57580 68892 71165
13941 71165 57156 57041 53702 51816 43629 27770 23798 32657 30678 19346 25332 11479 14953 28172
13927 28172 51689 51348 19265 20935 44987 60082 61146 67180 62736 55724 60692 36875 5463
13914 5463 15312 39542 52410 24713 17326 47669 50851 48094 41441 50285 54228 29392 26050
13901 26050 39266 55487 23842 -9818 -4716 15237 19412 2649 1569 27442 25151 6370
13889 6370 17012 29731 32616 57072 70653 46247 11382 -16011 -18783 8297 10869 13462 38100
13876 38100 34001 34339 58875 55831 43519 32186 -9362 -17799 -7088 80 11640 15526 16383
13863 16383 9728 40085 38209 37414 22790 3173 -3106 8930 17745 11557 14946 17531 23569 46390
$$ packed form
13954C3429q736M472J6281J5438J7322l228o344k341J0094m931j3876J1312K273
13941G1165j4009j15l339j886q187j5859l972Q859j979j1332N986j3853L474J3219
13927B8172K3517l41l2083J670K4052J5095J064O034m444p012M968k3817l1412
13914E463R849K4230J2868k7697p387L0343L182k757o653Q844L943k4836l342
13901B6050J3216J6221l1645l3660N102J9953M175j6763j080K5873k291j8781
13889F370J0642J2719K885K4456J3581k4406l4865k7393k772K7080K572K593K4638
13876C8100m099L38K4536l044j2312j1333m1548q437J0711P168J1560L886Q57
13863A6383o655L0357j876p95j4624j9617o279J2036Q815o188L389K585O038K2821
$$ plain form
13849 46390 41177 35922 34380 24104 31999 33901 36329 28011 45378 64443 57910 51249 17643
13836 17643 11100 19010 21324 4131 -17485 -30070 -17210 6187 13450 15137 11625 14171 35255
13823 35255 46655 22365 22960 54890 85920 99083 101121 113621 121290 133386 123803 127972 148117
13810 148117 152885 170846 167832 175218 212719 229313 252270 271731 282255 298571 313987 329411
13798 329411 351257 375722 363134 360901 382990 416897 429089 432203 439268 427417 422459 435182
13786 435182 462683 476442 485653 465868 446490 441157 447434 433791 410870 396870 404238 400357
13774 400357 394239 402813 389442 350306 333253 310039 293454 267918 242461 236291 201682 168051
13762 168051 161035 160654 174045 184133 176982 153219 109105 107963 98523 86920 110654 114686 97284
$$ packed form
13849D6390n213n255j542j0276P895J902K428q318J7367J9065o533o661l3606
13836A7643o543P910K314j7193k1616j2585J2860K3397P263J687l512K546K1084
13823C5255J1400k4290N95L1930L1030J3163K038J2500P669J2096r583M169K0145
13810A48117M768J7961l014P386L7501J6594K2957J9461J0524J6316J5416J5424
13798C29411K1846K4465j2588k233K2089L3907J2192L114P065j1851m958J2723
13786D35182K7501J3759R211j9785j9378n333O277j3643k2921j4000P368l881
13774D00357o118Q574j3371l9136j7053k3214j6585k5536k5457o170l4609l3631
13762A68051p016l81J3391J0088p151k3763m4114j142r440j1603K3734M032j7402
$$ plain form
13749 97284 82673 77665 74606 82285 90165 98726 91207 73898 66006 69700 60565 50309 53563 59003
13735 59003 27379 17866 10550 18093 6924 4266 3495 14658 32169 35601 54247 38863 21098
13722 21098 18325 9101 11146 19815 11639 37762 46791 57501 60523 56005 27399 3780 4706 14863
13708 14863 -7482 1356 20168 5008 -7596 -1557 12500 21863 38230 47201 44994 27339 2882
13695 2882 -8329 -33 5928 8247 22091 22357 -12330 -12842 -9070 293 -138 5592 23062 32832
13681 32832 17107 32912 21032 -22813 -21653 -23435 -28684 -6083 14764 13562 -5559 -13645 -6561
13668 -6561 19161 14245 17339 -250 -21126 -35465 -28900 5081 5276 -28752 -25297 -31220 -42380
13655 -42380 -17832 -15706 1161 30312 21828 -595 -16518 -32782 -42971 -46221 -49913 -33799
$$ packed form
13749I7284j4611n008l059P679P880Q561p519j7309p892L694r135j0256L254N440
13735E9003l1624r513p316P543j1169k658p71J1163J7511L432J8646j5384j7765
13722B1098k773r224K045Q669q176K6123R029J0710L022m518k8606k3619R26J0157
13708A4863k2345Q838J8812j5160j2604O039J4057R363J6367Q971k207j7655k4457
13695B882j1211Q296N961K319J3844K66l4687n12L772R363m31N730J7470R770
13681C2832j5725J5805j1880m3845J160j782n249K2601K0847j202j9121q086P084
13668f561K5722m916L094j7589k0876j4339O565L3981J95l4028L455n923j1160
13655d2380K4548K126J6867K9151q484k2423j5923j6264j0189l250l692J6114
$$ plain form
13643 -33799 -89 -10360 -11964 -26287 -15390 -7850 -23434 -10354 13859 13017 11289 -9403 -11068
13630 -11068 -15283 -37745 -47939 -36003 7271 25640 41715 45248 47331 34989 2161 16863
13618 16863 9260 -3531 -16366 -10286 -3004 21240 26737 28663 27011 34333 5460 -35252 -4153
13605 -4153 3316 -871 4212 -9315 3112 12364 13267 4328 25597 44616 31278 16621 12600
13592 12600 -13897 -12827 -6221 -8389 9752 27980 8542 -2891 8681 1147 17970 15183 25176
13579 25176 45721 36933 35151 22114 10449 16339 12818 -1589 -23091 -23490 -7012 -504 9363
13566 9363 8796 -6438 -28931 -11107 2576 21248 39993 23187 -8345 -30061 -20996 -12684 -18361
13553 -18361 8529 3414 18233 26468 8326 -12450 -11204 -14561 -6816 8849 23801 8428 17915
$$ packed form
13643c3799L3710j0271j604j4323J0897P540j5584J3080K4213q42j728k0692j665
13630a1068m215k2462j0194J1936M3274J8369J6075L533K083j2342l2828J4702
13618A6863p603j2791j2835O080P282K4244N497J926j652P322k8873m0712L1099
13605d153P469m187N083j3527J2427R252R03q939K1269J9019j3338j4657m021
13592A2600k6497J070O606k168J8141J8228j9438j1433J1572p534J6823k787R993
13579B5176K0545q788j782j3037j1665N890l521j4407k1502l99J6478O508R867
13566I363n67j5234k2493J7824J3683J8672J8745j6806l1532k1716R065Q312n677
13553a8361K6890n115J4819Q235j8142k0776J246l357P745J5665J4952j5373R487
$$ plain form
13540 17915 33277 23974 7015 10659 -9044 -16424 -30013 -22196 -5938 -2103 -15533 -39920 -33715
13527 -33715 -33287 -30091 14561 11494 -27219 -17121 -13873 -38782 -23005 -12509 -15289 -5477 1834
13514 1834 -13788 -28032 -31565 -26215 -20567 -1616 161 -20860 -19050 -7693 567 -20934 -19493
13501 -19493 -35138 -39762 -32930 -5960 502 1739 10882 5383 17800 5596 -23406 1747 37376
13488 37376 46641 57013 35074 4551 -9391 -6416 -16120 -15741 5196 -7210 -4191 6761 -8273
13475 -8273 -19141 10499 19628 38567 19312 -25428 -3787 28964 24621 5265 -1087 -5505 6360
13462 6360 21418 19618 2014 348 27814 20582 4526 21615 29532 27611 24314 13075 32147
13449 32147 24838 19761 17047 42733 42382 49012 50808 38363 -1255 -1151 -3579 -14683 -4664 7245
$$ packed form
13540A7915J5362r303j6959L644j9703p380j3589P817J6258L835j3430k4387O205
13527c3715M28L196M4652l067l8713J0098L248k4909J5777J0496k780R812P311
13514A834j5622j4244l533N350N648J8951J777k1021J810J1357Q260k1501J441
13501a9493j5645m624O832K6970O462J237R143n499J2417j2204k9002K5153L5629
13488C7376R265J0372k1939l0523j3942K975r704L79K0937j2406L019J0952j5034
13475h273j0868K9640R129J8939j9255m4740K1641L2751m343j9356o352m418J1865
13462F360J5058j800j7604j666K7466p232j6056J7089P917j921l297j1239J9072
13449C2147p309n077k714K5686l51O630J796j2445l9618J04k428j1104J0019J1909
$$ plain form
13435 7245 20695 42827 31255 -9757 -18165 -18064 -18724 -2489 -17190 -24067 -14665 4844 8247
13422 8247 8150 1399 3568 17147 3088 -29136 -34906 -29775 -7599 -9872 -17427 -23777 -24175 -6052
13408 -6052 -22395 -52559 -24590 -23633 -25140 -22197 -11137 -12719 5243 27132 8142 -12257 5142
13395 5142 17384 28940 6661 192 15337 7312 -2758 5625 3589 11912 -6474 -34613 -32915
13382 -32915 -26248 -20883 9555 24511 26661 30909 25678 10062 -174 6100 14246 -4306 1392
13369 1392 11278 1639 -24298 -6439 15778 13345 12224 -11412 -24583 -2873 5836 14393 29732
13356 29732 46324 60251 27625 7007 12955 29617 8881 12951 11831 25965 31758 33398 36607
13343 36607 37026 36263 46171 58611 43725 34081 41064 39848 38614 33665 23970 27537 36311 30117
$$ packed form
13435G245J3450K2132j1572m1012q408J01o60J6235j4701o877R402J9509L403
13422H247r7o751K169J3579j4059l2224n770N131K2176k273p555o350l98J8123
13408f052j6343l0164K7969R57j507K943J1060j582J7962K1889j8990k0399J7399
13395E142J2242J1556k2279o469J5145q025j0070Q383k036Q323j8386k8139J698
13382c2915O667N365L0438J4956K150M248n231j5616j0236O274Q146j8552N698
13369A392R886r639k5937J7859K2217k433j121k3636j3171K1710Q709Q557J5339
13356B9732J6592J3927l2626k0618N948J6662k0736M070j120J4134N793J640L209
13343C6607M19p63R908J2440j4886r644O983j216j234m949r695L567Q774o194
$$ plain form
13329 30117 27627 26468 21380 20687 30146 46600 38066 46414 70390 68728 58456 37354 8208
13316 8208 -8583 -26880 -9755 19362 3196 17100 39756 -1490 -31295 -44379 -17788 -5680
13304 -5680 -19257 -16674 -22068 -37350 -30295 -12920 510 8726 -3819 -1047 20941 35883 29535
13291 29535 27688 17717 9122 15074 27863 36153 38619 29302 2748 -22221 -19180 3093 15158
13278 15158 17964 22010 7863 7974 23079 58470 85340 59522 31942 9758 14260 41401 20953
13265 20953 24729 27671 26870 14248 -18018 -22939 -7501 32394 60267 52292 18987 11499 33094
13252 33094 69626 69050 71270 66521 59585 59267 60676 32793 35521 31521 35226 49514 46755 49690
13238 49690 49602 40681 36921 21720 15769 34871 41236 10161 -16502 -4434 37337 59032 62323
$$ packed form
13329C0117k490j159n088o93R459J6454q534Q348K3976j662j0272k1102k9146
13316H208j6791j8297J7125K9117j6166J3904K2656m1246k9805j3084K6591J2108
13304e680j3577K583n394j5282P055J7375J3430Q216j2545K772K1988J4942o348
13291B9535j847r971q595N952J2789Q290K466r317k6554k4969L041K2273J2065
13278A5158K806M046j4147J11J5105L5391K6870k5818k7580k2184M502K7141k0448
13265B0953L776K942q01j2622l2266m921J5438L9895K7873p975l3305p488K1595
13252C3094L6532n76K220m749o936l18J409k7883K728m000L705J4288k759K935
13238D9690q8q921l760j5201n951J9102O365l1075k6663J2068M1771K1695L291
$$ plain form
13225 62323 59605 77010 80106 69409 82646 81632 58621 54710 39451 14735 14169 20478 48329
13212 48329 68867 67148 56795 52941 42426 34179 33011 30261 17332 22045 12286 -9269 -7299
13199 -7299 -20382 -31323 -51942 -24448 5324 18412 30636 11116 1327 12654 19116 51172
13187 51172 53508 53913 54548 64706 78734 111346 164321 214915 221316 214961 197486 188227 149886
13174 149886 112003 86889 82217 70749 68810 57701 52336 57876 55174 58224 85272 83826 56549
13161 56549 25684 46254 48616 34964 35903 37972 26664 14713 21321 17094 28049 32976 25130
13148 25130 14766 -167 -9636 19266 36081 31093 68485 81100 84099 92184 116166 159180
13136 159180 195031 212170 249392 260848 264266 264214 236301 217803 169181 133209 104754 93960
$$ packed form
13225F2323k718J7405L096j0697J3237j014k3011l911j5259k4716n66O309K7851
13212D8329K0538j719j0353l854j0515q247j168k750j2929M713r759k1555J970
13199g299j3083j0941k0619K7494K9772J3088J2224j9520r789J1327O462L2056
13187E1172K336M05O35J0158J4028L2612N2975N0594O401o355j7475r259l8341
13174A49886l7883k5114m672j1468j939j1109n365N540k702L050K7048j446k7277
13161E6549l0865K0570K362j3652R39K069j1308j1951O608m227J0955M927p846
13148B5130j0364j4933r469K8902J6815m988L7392J2615K999Q085K3982M3014
13136A59180L5851J7139L7222J1456L418n2k7913j8498m8622l5972k8455j0794
$$ plain form
13124 93960 94503 84536 65176 48233 54680 50237 43811 27639 29578 24185 27720 22348 14240 21155
13110 21155 33445 32530 47074 56781 54037 42474 35611 46526 65865 75841 61174 61735 67496
13097 67496 66964 62834 57808 59522 64827 76171 95453 104018 101452 74813 77938 85713 87145 82738
13083 82738 62574 30562 47495 50168 46215 37368 39886 61489 96699 92445 91287 125278 132878
13070 132878 144453 149894 152948 174405 219786 270086 344732 453952 641376 921960 1298197
13059 1298197 1720201 2052605 2222864 2240590 2191829 1982240 1605058 1183000 873935 667844
13049 667844 533579 441883 415114 385008 345804 318586 316806 311122 285338 236318 205516 186092
13037 186092 158778 136038 116589 80267 76743 92410 104974 115609 144295 150369 131127 122019
$$ packed form
13124I3960N43r967j9360j6943O447m443o426j6172J939n393L535n372q108O915
13110B1155J2290r15J4544R707k744j1563o863J0915J9339R976j4667N61N761
13097F7496n32m130n026J714N305J1344J9282Q565k566k6639L125P775J432m407
13083H2738k0164l2012J6933K673l953q847K518K1603L5210m254j158L3991P600
13070A32878J1575N441L054K1457M5381N0300P4646J09220J87424K80584L76237
13059A298197M22004L32404J70259J7726m8761k09589l77182m22058l09065k06091
13049F67844j34265r1696k6769l0106l9204k7218j780n684k5784m9020l0802j9424
13037A86092k7314k2740j9449l6322l524J5667J2564J0635K8686O074j9242r108
$$ plain form
13025 122019 123334 114987 102109 115087 111594 82523 90258 109907 103451 99624 79241 47483 52142
13012 52142 64455 84574 106991 117963 121385 124307 111783 83192 83080 97522 92308 77478 61843
12999 61843 50582 63771 75638 67275 60684 67300 58581 57030 60028 52515 50325 68828 87268
12986 87268 89047 81639 88811 82444 64526 48795 56129 66451 75123 58499 46147 26773 35710
12973 35710 35200 25706 15781 24897 18977 5378 -12048 -13830 22755 48252 63554 52720 24809
12960 24809 23616 35138 39383 47671 36217 44506 39735 36404 31953 29046 40826 46902 67106
12947 67106 78389 89352 74196 67407 59601 51751 66244 76016 76213 64742 44829 54903 58463
12934 58463 22535 20386 3445 -14488 -27166 -40208 -38524 -8662 2771 4288 30847 37128
$$ packed form
13025A22019J315q347j2878J2978l493k9071P735J9649o456l827k0383l1758M659
13012E2142J2313K0119K2417J0972L422K922j2524k8591j12J4442n214j4830j5635
12999F1843j1261J3189J1867q363o591O616q719j551K998p513k190J8503J8440
12986H7268J779p408P172o367j7918j5731P334J0322Q672j6624j2352j9374Q937
12973C5710n10r494r925R116n920j3599j7426j782L6585K5497J5302j0834k7911
12960B4809j193J1522M245Q288j1454Q289m771l331m451k907J1780O076K0204
12947F7106J1283J0963j5156o789p806p850J4493R772J97j1471j9913J0074L560
12934E8463l5928k149j6941j7933j2678j3042J684K9862J1433J517K6559O281
$$ plain form
12922 37128 25313 10555 -2389 -13785 3026 49010 78027 66123 57702 52757 42984 11376
12910 11376 -8249 -11817 -3813 9735 6364 16420 47541 74029 83634 72183 71146 67883 60198
12897 60198 59151 61254 51470 60290 72608 94521 121715 133292 152185 144801 179598 193928 208623
12884 208623 212852 232244 211219 170308 157800 173955 192350 213609 240284 273545 292219 294446
12872 294446 294638 298703 293067 262805 206834 191374 165308 141258 134959 101284 90180 97577 110201
12859 110201 128268 131484 106513 104086 84854 65154 48089 30286 7097 6642 27319 40310
12847 40310 64020 73998 76929 81390 56709 29273 39471 61184 73467 82932 80945 85474 87893
12834 87893 84100 75600 84221 76785 66226 60865 64672 98122 116389 137083 137412 170760 166623
$$ packed form
12922C7128j1815j4758j2944j1396J6811M5984K9017j1904q421m945r773l1608
12910A1376j9625l568Q004J3548l371J0056L1121K6488R605j1451j037l263p685
12897F0198j047K103r784Q820J2318K1913K7194J1577J8893p384L4797J4330J4695
12884B08623M229J9392k1025m0911j2508J6155J8395K1259K6675L3261J8674K227
12872B94446J92M065n636l0262n5971j5460k6066k4050o299l3675j1104P397J2624
12859A10201J8067L216k4971k427j9232j9700j7065j7803k3189m55K0677J2991
12847D0310K3710R978K931M461k4681k7436J0198K1713J2283R465j987M529K419
12834H7893l793q500Q621p436j0559n361L807L3450J8267K0694L29L3348m137
$$ plain form
12821 166623 191022 231097 292810 309350 359142 507673 717263 942920 1114102 1204285 1244231
12810 1244231 1249335 1170864 996753 788401 616377 505888 409828 351287 333686 315189 298130
12799 298130 304088 296405 277825 230917 221290 215039 224242 242593 244843 230099 218239 215310 240129
12786 240129 251057 260017 263530 265779 268971 267654 263669 268005 267662 242360 217649 201762 171774
12773 171774 161503 150526 149469 144381 137092 131057 165953 182634 193049 216597 233586 242796
12761 242796 262835 267423 269344 293115 326667 343615 352099 410121 548603 745905 878316
12750 878316 864166 719599 533599 419439 403988 447522 449102 440991 433024 415686 421014 454808
12738 454808 474152 486896 493320 483290 504868 541252 599909 619615 620910 620463 634935 661913
$$ packed form
12821A66623K4399M0075O1713J6540M9792J48531K09590K25657J71182R0183L9946
12810A244231N104p8471j74111k08352j72024j10489r6060n8541j7601j8497j7059
12799B98130N958p683j8580m6908r627o251R203J8351K250j4744j1860k929K4819
12786B40129J0928Q960L513K249L192j317l985M336l43k5302k4711j5887k9988
12773A71774j0271j0977j057n088p289o035L4896J6681J0415K3548J6989R210
12761B42796K0039M588J921K3771L3552J6948Q484N8022J38482J97302J32411
12750H78316j4150j44567j86000j14160j5451M3534J580q111p967j7338N328L3794
12738D54808J9344J2744O424j0030K1578L6384N8657J9706J295m47J4472K6978
$$ plain form
12726 661913 674281 659979 649244 632447 604960 606298 610059 603581 596061 613875 622639 622375 620396
12713 620396 627249 665675 716870 764891 777301 809091 851324 904936 942923 989766 1024867 1033441
12701 1033441 1061256 1051858 990488 985364 972303 944608 917787 881809 866448 857885 860342 856357
12689 856357 873026 882984 914983 937723 939057 934872 923133 903606 876448 884013 911369 935590
12677 935590 974809 1012149 1051572 1102786 1163799 1236497 1307523 1384588 1474616 1593582 1705443
12666 1705443 1808478 1890994 1952795 2013922 2083732 2146549 2238424 2352692 2499359 2678022
12656 2678022 2888432 3092233 3337664 3642099 3928023 4236536 4579837 4978593 5454751
12647 5454751 6023456 6647384 7323114 8119561 9025857 10077924 11278302 12694965 14497613
$$ packed form
12726F61913J2368j4302j0735j6797k7487J338L761o478p520J7814Q764k64j979
12713F20396O853L8426N1195M8021J2410L1790M2233N3612L7987M6843L5101Q574
12701A033441K7815r398o1370n124j3061k7695k6821l5978j5361q563K457l985
12689H56357J6669R958L1999K2740J334m185j1739j9527k7158P565K7356K4221
12677I35590L9219L7340L9423N1214O1013P2698P1026P7065R0028J18966J11861
12666A705443J03035Q2516O1801O1127O9810O2817R1875J14268J46667J78663
12656B678022K10410K03801K45431L04435K85924L08513L43301L98756M76158
12647E454751N68705O23928O75730P96447R06296J052067J200378J416663J802648
$$ plain form
12638 14497613 16825451 19753203 23296161 27387315 32108222 37734650 44821951 54279792
12630 54279792 67868397 89038092 124084220 180757371 259763924 342843327 404757277
12623 404757277 435861095 443595721 431571460 389604759 317582524 236199423 170029899
12616 170029899 127665193 102334070 86357233 75434405 67333467 60823253 55257023
12609 55257023 50439163 46437795 43184194 40461936 38077232 35950020 34003076 32194252
12601 32194252 30492981 28830047 27266127 25876207 24678033 23640722 22620548 21620403
12593 21620403 20626200 19682028 18841997 18097920 17445544 16896559 16428873 15953042 15433976
12584 15433976 14853811 14221173 13544865 12927558 12364171 11855499 11410876 11022628 10626488
$$ packed form
12638A4497613K327838K927752L542958M091154M720907N626428P087301R457841
12630E4279792J3588605K1169695L5046128N6673151P9006553Q3079403O1913950
12623D04757277L1103818P734626j2024261m1966701p2022235q1383101o6169524
12616A70029899m2364706k5331123j5976837j0922828q100938o510214n566230
12609E5257023m817860m001368l253601k722258k384704k127212j946944j808824
12601C2194252j701271j662934j563920j389920j198174j037311j020174j000145
12593B1620403r94203r44172q40031p44077o52376n48985m67686m75831n19066
12584A5433976n80165o32638o76308o17307n63387n08672m44623l88248l96140
$$ plain form
12575 10626488 10246107 9920750 9609139 9316290 9020275 8764136 8526807 8301194 8077310
12566 8077310 7845802 7698766 7608280 7570747 7583700 7571721 7486577 7313350 7108399 6843150
12556 6843150 6506126 6104963 5718821 5420079 5154420 4918952 4703083 4503080 4328682
12547 4328682 4161711 4031754 3903908 3790277 3713080 3656687 3574442 3493564 3453513 3429320
12537 3429320 3440255 3459459 3429405 3377941 3314158 3253104 3194707 3129552 3055168 2949168 2858380
12526 2858380 2783464 2718448 2681917 2668306 2616452 2504820 2398544 2255980 2099719 1900028
12516 1900028 1719123 1564296 1436196 1349118 1270247 1197683 1168255 1135239 1090996 1055562 1018464
12505 1018464 976963 936087 913179 896965 878269 876430 870326 831665 752976 694129 666244 677390
$$ packed form
12575A0626488l80381l25357l11611k92849k96015k56139k37329k25613k23884
12566H077310k31508j47036r0486l7533J2953j1979q5144j73227k04951k65249
12556F843150l37024m01163l86142k98742k65659k35468k15869k00003j74398
12547D328682j66971j29957j27846j13631p7197n6393q2245q0878m0051k4193
12537C429320J0935J9204l0054n1464o3783o1054n8397o5155p4384j06000r0788
12526B858380p4916o5016l6531j3611n1854j11632j06276j42564j56261j99691
12516A900028j80905j54827j28100q7078p8871p2564k9428l3016m4243l5434l7098
12505A018464m1501m0876k2908j6214j8696j839o104l8661p8689n8847k7885J1146
$$ plain form
12493 677390 659289 596130 562691 577605 616798 643544 632336 619217 620248 614439 604303 597299
12481 597299 607593 624991 638048 620105 609365 614326 606632 585663 593207 591313 573602 553443
12469 553443 549399 543987 535394 524488 499858 463466 449483 466990 461944 455553 448416 452049 460593
12456 460593 448003 436306 428634 421235 409101 444392 444571 411365 377210 353854 353581 356985 340749
12443 340749 303147 256769 221653 140754 9504 -132648 -336439 -544525 -704253 -776797
12433 -776797 -748078 -678181 -520013 -291724 -11824 283057 521520 719382 850861 934516
12423 934516 1003855 985395 865814 721531 584765 491046 452379 413332 396833 384661 353918
12412 353918 319737 307851 328159 354934 375326 362948 348438 332117 330067 339135 367397 378458
$$ packed form
12493F77390j8101o3159l3439J4914L9193K6746j1208j3119J031n809j0136p004
12481E97299J0294J7398J3057j7943j0740M961p694k0969P544j894j7711k0159
12469E53443m044n412q593j0906k4630l6392j3983J7507n046o391p137L633Q544
12456D60593j2590j1697p672p399j2134L5291J79l3206l4155k3356k73L404j6236
12443C40749l7602m6378l5116q0899j31250j42152k03791k08086j59728p2544
12433g76797K8719O9897J58168K28289K79900K94881K38463J97862J31479Q3655
12423I34516O9339j8460j19581j44283j36766r3719l8667l9047j6499j2172l0743
12412C53918l4181j1886K0308K6775K0392j2378j4510j6321k050R068K8262J1061
$$ plain form
12400 378458 383224 385511 362027 367911 376826 382103 408533 416284 402912 364009 342134 345150 323949
12387 323949 304647 300972 282966 266368 266229 284382 287805 291948 277871 246104 265339 261973 220183
12374 220183 206841 213558 234113 243210 236084 219022 180820 151690 103980 59819 56971 46705
12362 46705 44870 47062 67197 104689 105438 69328 69030 67608 74548 93873 103728 93833 79398 74510
12348 74510 82479 67193 21565 42859 45758 26997 38303 49401 56883 87668 122894 111928
12336 111928 103649 111596 106624 105487 101305 89305 118185 114925 130401 148719 131757 106073 95707
12323 95707 93227 105018 110027 130480 154724 156336 148614 159752 147771 158426 161523 131745 109681
12310 109681 59013 36066 36085 47261 42914 48247 53555 60522 70263 53159 45484 34224 27856
$$ packed form
12400C78458M766K287k3484N884Q915N277K6430P751j3372l8903k1875L016k1201
12387C23949j9302l675j8006j6598j39J8153L423M143j4077l1767J9235l366m1790
12374B20183j3342O717K0555R097p126j7062l8202k9130m7710m4161k848j0266
12362D6705j835K192K0135L7492P49l6110k98j422O940J9325R855r895j4435m888
12348G4510P969j5286m5628K1294K899j8761J1306J1098P482L0785L5226j0966
12336A11928q279P947m972j137m182j2000K8880l260J5476J8318j6962k5684j0366
12323I5707k480J1791N009K0453K4244J612p722J1138j1981J0655L097k9778k2064
12310A09681n0668k2947J9J1176m347N333N308O967R741j7104p675j1260o368
$$ plain form
12297 27856 32792 49566 53013 45528 54569 80170 96674 75265 56367 47494 39357 48579 49068
12284 49068 28977 25672 43211 76473 86078 71619 75382 88325 98030 97162 97013 88401 51426
12271 51426 40851 49694 45638 12706 6246 9902 13304 28610 13374 11584 -8550 -10430 -10751
12258 -10751 -11184 4193 23419 30799 29388 55716 64563 72824 85080 98101 87089 94850 122088
12245 122088 119923 111109 83246 97108 90723 72480 68896 59102 65041 41534 39551 52672 66692
12232 66692 80424 55756 53196 53086 49809 72621 57312 31211 28047 50032 74916 79207 66168
12219 66168 44321 28079 18662 29082 61728 80764 73741 63726 63507 77785 91635 108401
12207 108401 91246 93284 121533 125265 134366 131032 130811 138836 143211 148026 161892 159994 155333 153966
$$ packed form
12297B7856M936J6774L447p485R041K5601J6504k1409j8898q873q137R222M89
12284D9068k0091l305J7539L3262R605j4459L763J2943R705q68j49q612l6975
12271E1426j0575Q843m056l2932o460L656L402J5306j5236j790k0134j880l21
12258a0751m33J5377J9226P380j411K6328Q847Q261J2256J3021j1012P761K7238
12245A22088k165q814k7863J3862o385j8243l584r794N939k3507j983J3121J4020
12232F6692J3732k4668k560j10l277K2812j5309k6101l164K1985K4884M291j3039
12219F6168k1847j6242r417J0420L2646J9036p023j0015k19J4278J3850J6766
12207A08401j7155K038K8249L732R101l334k21Q025M375M815J3866j898m661j367
$$ plain form
12193 153966 168028 226195 283388 345257 426039 544158 715271 1054728 1480673 1870148
12183 1870148 2116596 2221787 2220302 2096628 1839343 1456388 1055423 761873 594683 476240
12173 476240 404564 376916 361834 316843 280909 267245 270726 255216 225693 221252 204453 192369
12161 192369 199784 175970 168332 167304 156538 137060 142530 151047 125788 107927 102015 116605 125290
12148 125290 135669 137175 132369 125815 144132 143690 132642 122781 116565 112841 95614 82987 81231
12135 81231 85109 73658 81075 59942 62491 69975 58230 68461 58583 62390 68299 52606 21568
12122 21568 26237 35961 60591 92330 97193 79758 60026 47800 54259 41204 49550 61839 35397
12109 35397 19247 19708 18937 24703 59521 65773 58903 55020 43130 25769 26374 21199 17951 18406
$$ packed form
12193A53966J4062N8167N7193O1869Q0782J18119J71113L39457M25945L89475
12183A870148K46448J05191j485j23674k57285l82955m00965k93550j67190j18443
12173D76240p1676k7648j5082m4991l5934j3664L481j5510k9523m441j6799j2084
12161A92369P415k3814p638j028j0766j9478N470Q517k5259j7861n912J4590Q685
12148A25290J0379J506m806o554J8317m42j1048r861o216l724j7227j2627j756
12135H1231L878j1451P417k1133K549P484j1745J0231r878L807N909j5693l1038
12122B1568M669R724K4630L1739M863j7435j9732j2226O459j3055Q346J2289k6442
12109C5397j6150M61p71N766L4818O252o870l883j1890j7361O05n175l248M55
$$ plain form
12095 18406 15940 1228 -4631 -6735 9544 16491 29130 41305 51487 18693 16354 35065 19221
12082 19221 -17151 -35763 -28032 -5102 13783 39281 29984 7351 849 21718 8915 424
12070 424 -3001 6403 28461 44220 50541 52845 42545 26035 22889 36620 48974 61078 70457
12057 70457 69294 16927 40858 40376 25670 22456 9909 9169 19533 28645 39646 17754 -6701
12044 -6701 -25496 -43505 -60205 -54623 -27872 13144 8946 17419 18438 14920 23157 29741 39028
12031 39028 16238 13419 22852 48308 54384 36093 26035 18186 10052 218 1915 23843 15822
12018 15822 14002 8016 -2115 -621 -2621 904 10419 11105 306 16863 28121 35273 50157
12005 50157 50369 24218 4520 -26996 -13177 2470 -9472 861 -448 -1938 -14564 -6351 -25793
$$ packed form
12095A8406k466j4712n859k104J6279O947J2639J2175J0182l2794k339J8711j5844
12082A9221l6372j8612P731K2930J8885K5498r297k2633o502K0869j2803q491
12070D24l425R404K2058J5759O321K304j0300j6510l146J3731J2354J2104R379
12057G0457j163n2367K3931m82j4706l214j2547p40J0364R112J1001k1892k4455
12044f701j8795j8009j6700N582K6751M1016m198Q473J019l518Q237O584R287
12031C9028k2790k819R433K5456O076j8291j0058p849q134r834J697K1928q021
12018A5822j820n986j0131J494k000L525R515O86j0799J6557J1258P152J4884
12005E0157K12k6151j9698l1516J3819J5647j1942J0333j309j490j2626Q213j9442
$$ plain form
11992 -25793 -40151 -22893 10998 25378 19047 13082 5912 1436 12261 18798 10827 -17142 -26652
11979 -26652 -27064 -6822 -7744 -17692 -17622 -23843 3311 19183 21012 51532 60608 46616 56287 52367
11965 52367 44460 36558 37323 28491 20665 29459 15082 14598 6885 -7921 -20726 4178 49008 56451
11951 56451 36640 32282 28173 11294 -5506 12617 13913 2252 -10380 -12118 8185 33288
11939 33288 25214 29819 31369 21205 21421 23351 36234 30203 29457 8884 1842 -15346 -18445 -2711
11925 -2711 1947 2253 9480 -728 -27036 -50375 -54802 -17134 4421 2235 -11621 -5818 -11009
11912 -11009 -26992 -10294 -5422 -8492 -16366 -20037 -29511 -17323 -8555 -18746 -21221 -13274 457
11899 457 -14703 -33786 -19023 -12107 3783 -7780 -2487 4892 -3791 9702 11289 19606 44978
$$ packed form
11992b5793j4358J7258L3891J4380o331n965p170m476J0825O537p971k7969r510
11979b6652m12K0242r22r948P0o221K7154J5872J829L0520R076j3992R671l920
11965E2367p907p902P65q832p826Q794j4377m84p713j4806j2805K4904M4830P443
11951E6451j9811m358m109j6879j6800J8123J296j1661j2632j738K0303K5103
11939C3288q074M605J550j0164K16J930J2883o031p46k0573p042j7188l099J5734
11925b711M658L06P227j0208k6308k3339m427L7668K1555k186j3856N803n191
11912a1009j5983J6698M872l070p874l671r474J2188Q768j0191k475P947J3731
11899D57j5160j9083J4763O916J5890j1563N293P379q683J3493J587Q317K5372
$$ plain form
11886 44978 34592 502 -20427 -32142 -16755 -14347 -22070 -23026 -51543 -41384 -39527 -22879 -4536
11873 -4536 -9726 -6877 -7090 -5516 11247 16081 14718 26376 20884 24054 15881 6505 -13020 -13851
11859 -13851 -13310 7996 9845 7568 9403 -7081 -2455 22039 8974 -13495 -24436 -3211 18089
11846 18089 10554 13188 14208 9009 -1855 -45 6294 8924 34023 23120 -24525 -57799 -83170
11833 -83170 -67984 -41906 -18584 -11394 -10445 -23064 -48045 -37401 -14033 -7871 4743 6347 9730
11820 9730 1602 -13846 -26969 -27448 -27853 -29407 -17066 -19393 -13741 -12542 -11637 8947 24134 6408
11806 6408 11149 13376 -14398 -9421 8999 3654 -10761 -8478 4406 13976 11787 -16103 -24763
11793 -24763 -24296 -2856 2078 -5916 1350 4319 -18158 -31687 -49563 -55723 -51167 -26595 -9875
$$ packed form
11886D4978j0386l4090k0929j1715J5387K408p723r56k8517J0159J857J6648J8343
11873d536n190K849k13J574J6763M834j363J1658n492L170q173r376j9525q31
11859a3851N41K1306J849k277J835j6484M626K4494j3065k2469j0941K1225K1300
11846A8089p535K634J020n199j0864J810O339K630K5099j0903m7645l3274k5371
11833h3170J5186K6078K3322P190R49j2619k4981J0644K3368O162J2614J604L383
11820I730q128j5448j3123m79m05j554J2341k327N652J199R05K0584J5187j7726
11806F408M741K227k7774M977J8420n345j4415K283J2884R570k189k7890q660
11793b4763M67K1440M934p994P266K969k2477j3529j7876o160M556K4572J6720
$$ plain form
11780 -9875 -15810 14865 44089 44962 32281 24753 15814 1581 7570 14356 18787 19641 7221 -17574
11766 -17574 -15831 -11222 -27251 -22447 -39165 -19117 -5209 6797 20288 4327 -1783 17734
11754 17734 39606 36912 33313 37929 17647 17762 6355 4995 11230 34362 17855 -12388 -16981
11741 -16981 -35757 -28427 -17021 -983 26340 23717 8198 -5500 -19645 -16856 -4871 -27603
11729 -27603 -32276 -18377 -25646 -32690 -13249 10372 7309 17150 40549 47133 30612 11156 716
11716 716 -12203 -12677 -25316 3999 24037 25276 17447 7110 -21326 -34269 -21659 -2150 8935
11703 8935 9884 -6013 355 32955 30142 27992 15608 15124 24258 13917 18029 535 -23931 -48641
11689 -48641 -36258 -12224 -715 22446 28776 15824 -6096 -12287 8281 6630 7910 -13008
$$ packed form
11780i875n935L0675K9224Q73j2681p528q939j4233N989O786M431Q54j2420k4795
11766a7574J743M609j6029M804j6718K0048J3908J2006J3491j5961o110J9517
11754A7734K1872k694l599M616k0282J15j1407j360O235K3132j6507l0243m593
11741a6981j8776P330J1406J6038K7323k623j5519j3698j4145K789J1985k2732
11729b7603m673J3899p269p044J9441K3621l063R841K3399O584j6521j9456j0440
11716G16j2919m74j2639K9315K0038J239p829j0337k8436j2943J2610J9509J1085
11703H935R49j5897O368L2600k813k150j2384m84R134j0341M112j7494k4466k4710
11689d8641J2383K4034J1509K3161O330j2952k1920o191K0568j651J280k0918
$$ plain form
11677 -13008 -44632 -68032 -56784 -40159 -34965 -47446 -39892 -31269 -31154 -7106 -106 13590 19816
11664 19816 16124 4757 845 -11072 -9032 -4127 -20795 -30407 -52936 -55166 -47322 -48330 -36487
11651 -36487 -35157 -18097 -4664 -1750 -9448 -6804 22560 17160 28898 19046 -15706 -19293 -11065
11638 -11065 -20542 6951 13271 9699 18420 23683 3543 -21133 -36125 -43852 -38861 -24003 2122
11625 2122 2161 -7861 -5664 29 2507 3588 16394 8303 -1531 566 16320 27551 28331 24110
11611 24110 9919 12687 16612 17480 6101 -6530 6299 -6189 -17928 -23343 -6691 7901 -7651
11598 -7651 -9948 -15068 -14783 -8047 -13977 -5971 -3883 5716 21648 5786 15532 -5450 -17225 -8745
11584 -8745 4959 13865 10104 11185 15670 21282 1441 -6006 -15957 -8069 16614 20201 26179 253
$$ packed form
11677a3008l1624k3400J1248J6625N194j2481P554Q623J15K4048P000J3696O226
11664A9816l692j1367l912j1917K040M905j6668r612k2529k230P844j008J1843
11651c6487J330J7060J3433K914p698K644K9364n400J1738r852l4752l587Q228
11638a1065r477K7493O320l572Q721N263k0140k4676j4992p727M991J4858K6125
11625B122L9j0022K197N693K478J081J2806q091r834K097J5754J1231P80m221
11611B4110j4191K768L925Q68j1379j2631J2829j2488j1739n415J6652J4592j5552
11598g651k297n120K85O736n930Q006K088R599J5932j5862R746k0982j1775Q480
11584h745J3704Q906l761J081M485N612j9841p447r951P888K4683L587N978k5926
$$ plain form
11570 253 -4830 3467 26092 34946 28869 -10854 -28018 -14376 2290 26707 48615 49890 40939
11557 40939 19560 5376 21501 26967 41584 46616 47162 34593 18158 16083 21665 17767 24130
11544 24130 40199 49494 44234 30087 24340 17963 12695 20874 16841 22444 39482 41210 23078
11531 23078 30808 49804 21205 26732 28331 25003 29719 32476 36230 25424 45681 59466 66008
11518 66008 58154 48318 55133 48151 57780 79338 49318 41149 39791 49952 46383 43887 59224
11505 59224 37796 24248 22330 7751 28776 50303 83362 86167 48772 42865 49026 43519 28223
11492 28223 19778 4332 17614 47821 76192 64292 49449 34305 14677 17287 47952 55673
11480 55673 77092 88354 66553 68140 61323 43982 59516 56614 63629 42900 7984 6664 18112
$$ packed form
11570B53n083Q297K2625Q854o077l9723j7164J3642J6666K4417K1908J275q951
11557D0939k1379j4184J6125N466J4617N032N46j2569j6435k075N582l898O363
11544B4130J6069R295n260j4147n747o377n268Q179m033N603J7038J728j8132
11531B3078P730J8996k8599N527J599l328M716K757L754j0806K0257J3785O542
11518F6008p854r836O815o982R629K1558l0020q169j358J0161l569k496J5337
11505E9224k1428j3548j918j4579K1025K1527L3059K805l7395n907O161n507j5296
11492B8223q445j5446J3282L0207K8371j1900j4843j5144j9628K610L0665P721
11480E5673K1419J1262k1801J587o817j7341J5534k902P015k0729l4916j320J1448
$$ plain form
11467 18112 40465 41036 34737 25992 30183 30642 12161 2229 11343 5446 -1700 -3472 6499 23091
11453 23091 35848 45718 48627 46537 29104 28087 40305 36897 13758 -5536 -10732 -5503 -6061
11440 -6061 -9165 1028 -874 6230 21042 -1766 -2436 27898 47497 37473 10214 -4383 -1360
11427 -1360 10210 17158 30705 -3725 -50220 -51408 -38832 -6754 408 -1120 -16973 -10435 8054
11414 8054 34789 42791 25005 -4407 9850 34424 38048 29880 27866 19352 13422 2120 8431
11401 8431 -9 -6129 -12288 -1526 8863 14974 56946 81534 41723 12834 -12072 -11291 8239
11388 8239 3458 -839 -13942 5325 15482 16680 26774 29101 26683 14896 37104 52468 42057
11375 42057 38296 31457 18299 4895 18387 25862 24219 31312 37573 17108 33865 52751 53425
$$ packed form
11467A8112K2353N71o299q745M191M59j8481r932R114n897p146j772R971J6592
11453B3091J2757R870K909k090j7433j017J2218l408k3139j9294n196N229n58
11440f061l104J0193j902P104J4812k2808o70L0334J9599j0024k7259j4597L023
11427a360J1570O948J3547l4430m6495j188J2576L2078P162j528j5853O538J8489
11414H054K6735Q002j7786k9412J4257K4574L624q168k014q514n930j1302O311
11401H431q440o120o159J0762J0389O111M1972K4588l9811k8889k4906P81J9530
11388H239m781m297j3103J9267J0157J198J0094K327k418j1787K2208J5364j0411
11375D2057l761o839j3158j3404J3492P475j643P093O261k0465J6757J8886O74
$$ plain form
11362 53425 66434 71421 75401 74319 71945 66114 28035 1683 -6123 -3616 2747 2622 438 11160
11348 11160 14912 42552 54215 28489 19590 2178 32965 41823 5044 4929 9439 12903 27204
11335 27204 46205 55922 64713 61298 36606 6246 27334 34475 36354 35693 20634 164 -20060
11322 -20060 -16872 1737 6688 4469 -31225 -44318 -60916 -40928 -17240 -9421 10672 30698
11310 30698 36838 34802 26620 8870 14090 40441 23954 10725 2718 3701 15701 22326 23941
11297 23941 38001 34336 20122 5170 -2392 2694 -7458 17733 43870 45551 57265 59339 24327
11284 24327 23713 22681 35119 53953 27146 9482 8486 7271 -3338 3598 10464 14094 19024 9026
11270 9026 -12480 17303 45860 71380 75844 78374 75456 75481 66044 42263 33756 48470 40286 39683
$$ packed form
11362E3425J3009M987L980j082k374n831l8079k6352p806K507O363j25k184J0722
11348A1160L752K7640J1663k5726q899j7412L0787Q858l6779j15M510L464J4301
11335B7204J9001R717Q791l415k4692l0360K1088P141J879o61j5059k0470k0224
11322b0060L188J8609M951k219l5694j3093j6598J9988K3688P819K0093K0026
11310C0698O140k036q182j7750N220K6351j6487j3229q007R83J2000O625J615
11297B3941J4060l665j4214j4952p562N086j0152K5191K6137J681J1714K074l5012
11284B4327o14j032J2438J8834k6807j7664r96j215j0609O936O866L630M930r998
11270I026k1506K9783K8557K5520M464K530k918K5r437k3781q507J4714q184o03
$$ plain form
11256 39683 57140 94425 96888 94468 64117 26908 8086 28819 40043 46011 28882 35838
11244 35838 53335 39078 26462 30919 17467 19007 29212 37828 16241 -19621 -24566 -19437 7059
11231 7059 30071 35305 34705 19773 -3783 -20036 3175 -7 -4302 -12448 3926 24765 23892
11218 23892 13758 4885 -9131 -1674 -4168 -23409 -29871 -42949 -44428 -23846 -4843 3071 324
11205 324 -14119 -15188 -2240 16201 18304 15076 3617 -7808 -36705 -46490 -35800 -31750 -34118
11192 -34118 -24749 -5491 2997 2721 -2911 -2534 -1821 -4860 955 -3899 -2893 7283 -9623 -22856
11178 -22856 1317 6846 5949 -11958 -9236 -21318 -4134 26204 32184 33802 25021 23059 7611
11165 7611 4196 27879 29090 52272 53659 33338 29010 10796 24007 38358 27805 16064 550
$$ packed form
11256C9683J7457L7285K463k420l0351l7209j8822K0733J1224N968j7129O956
11244C5838J7497j4257j2616M457j3452J540J0205Q616k1587l5862m945N129K6496
11231G059K3012N234o00j4932k3556j6253K3211l182m295q146J6374K0839q73
11218B3892j0134q873j4016P457k494j9241o462j3078j479K0582J9003P914k747
11205C24j4443j069J2948J8441K103l228j1459j1425k8897r785J0690M050k368
11192c4118R369J9258Q488k76n632L77P13l039N815m854J006J0176j6906j3233
11178b2856K4173N529q97j7907K722j2082J7184L0338N980J618q781j962j5448
11165G611l415K3683J211K3182J387k0321m328j8214J3211J4351j0553j1741j5514
$$ plain form
11152 550 -5732 9025 52166 35766 38925 52733 12948 -35881 -30640 -11308 4393 6364 -3400
11139 -3400 3078 -2180 -6967 7994 7412 -7817 -13327 -19222 -22203 -26289 -42893 -41304 -24392 -40082
11125 -40082 -39222 -43042 -44013 -46202 -42292 -14396 6902 -2762 -12141 -21509 -11855 -27083 -20289 3487
11111 3487 983 -1405 3301 9958 2878 -483 -13569 -21436 -23671 -13258 23480 9930 -4153
11098 -4153 -7314 -10391 3106 9861 -12194 -13813 9288 -5459 -20773 -25200 9411 28433 4632
11085 4632 -6424 -6296 24961 14445 5902 -5986 -15061 -6314 7646 5282 -5937 -3553 -8751
11072 -8751 -10042 -8244 24370 35621 15822 16674 -940 -18686 2278 -6696 -30180 -16341 -1542
11059 -1542 10833 -3705 10807 9979 -11533 -26867 -38890 -51278 -47654 -26073 -775 14262
$$ packed form
11152E50o282J4757M3141j6400L159J3808l9785m8829N241J9332J5701J971r764
11139c400O478n258m787J4961n82j5229n510n895k981m086j6604J589J6912j5690
11125d0082Q60l820r71k189L910K7896K1298r664r379r368R654j5228O794K3776
11111C487k504k388M706O657p080l361j3086p867k235J0413L6738j3550j4083
11098d153l161l077J3497O755k2055j619K3101j4747j5314m427L4611J9022k3801
11085D632j1056J28L1257j0516q543j1888r075Q747J3960k364j1219K384n198
11072h751j291J798L2614J1251j9799Q52j7614j7746K0964q974k3484J3839J4799
11059a542J2375j4538J4512q28k1512j5334j2023j2388L624K1581K5298J5037
$$ plain form
11047 14262 3887 4428 10525 20970 39105 20541 9224 21835 37572 22958 1698 16504
11035 16504 23125 50400 75754 52482 38272 19964 13020 36799 37213 23344 24271 44270 26557
11022 26557 -3801 -4893 17339 6359 -3684 18814 59156 39441 15344 -4906 -18080 -1455
11010 -1455 15144 29575 6522 49 -15718 -20581 4978 31022 14939 -3010 -5074 -13491 7794
10997 7794 588 2563 9427 18740 2592 -1456 -5021 4024 1081 14254 19147 11402 8465 -4137
10983 -4137 26557 28712 39512 44528 5748 5246 24393 33128 -21489 -49611 -44034 -20817 -8160
10970 -8160 2412 -7191 -17720 -7100 9952 4474 -13205 84 -7402 -29899 -21476 -15 -661
10957 -661 3550 -4422 -16342 -13727 -18416 -3934 -786 -14085 -17589 -19761 -28809 -20128 -20335 -30355
$$ packed form
11047A4262j0375N41O097J0445J8135j8564j1317J2611J5737j4614k1260J4806
11035A6504O621K7275K5354k3272j4210j8308o944K3779M14j3869R27J9999j7713
11022B6557l0358j092K2232j0980j0043K2498M0342j9715k4097k0250j3174J6625
11010a455J6599J4431k3053o473j5767m863K5559K6044j6083j7949k064q417K1285
10997G794p206J975O864R313j6148m048l565R045k943J3173M893p745k937j2602
10983d137L0694K155J0800N016l8780n02J9147Q735n4617k8122N577K3217J2657
10970h160J0572r603j0529J0620J7052n478j7679J3289p486k2497Q423K1461o46
10957f61M211p972j1920K615m689J4482L148j3299l504k172r048Q681k07j0020
$$ plain form
10943 -30355 -14817 1280 -17817 -6803 17356 23050 8927 -20518 -23819 19328 30266 17702
10931 17702 1873 -9702 -19887 -26095 -41202 -13502 -6840 -21445 -25263 -6255 -16301 8102
10919 8102 28063 3010 1373 -5061 -6948 -5918 -17683 2160 -10742 -32745 -44770 -37911 -20374
10906 -20374 -12993 -14967 -22832 -21262 -25219 -14487 -4993 -8828 -19174 -31764 -29365 -22783 -10172
10893 -10172 1201 -1873 -20642 -25377 -24186 -33291 -39609 -22317 -4530 19322 25122 24322 28813
10880 28813 25264 27812 6262 -3151 -6205 -2575 29603 33759 24210 34354 11934 13810 -9072
10867 -9072 -21924 -23272 -1216 500 -20055 -47417 -71622 -64769 -61174 -26881 -861 -3913 -30552
10854 -30552 -17819 14300 28772 2974 -16166 210 12561 26992 19178 14456 23127 30450
$$ packed form
10943c0355J5538J6097j9097J1014K4159N694j4123k9445l301M3147J0938j2564
10931A7702j5829j1575j0185o208j5107K7700O662j4605l818J9008j0046K4403
10919H102J9961k5053j637o434j887J030j1765J9843j2902k2003j2025O859J7537
10906b0374P381j974p865J570l957J0732R494l835j0346j2590K399O582J2611
10893a0172J1373l074j8769m735J191r105o318J7292J7787K3852N800q00M491
10880B8813l549K548k1550r413l054L630L2178M156r549J0144k2420J876k2882
10867i072j2852j348K2056J716k0555k7362k4205O853L595L4293K6020l052k6639
10854c0552J2733L2119J4472k5798j9140J6376J2351J4431p814m722Q671P323
$$ plain form
10842 30450 17727 12213 -11157 -11546 -12737 -4081 -19383 -19995 -13624 15693 18352 -5818 -16030
10829 -16030 -21551 -14223 -13755 7720 -2547 -8406 3489 -9507 -25743 -28650 -17438 636 -9865
10816 -9865 8868 26431 29112 15025 2646 5264 1146 21035 15990 -1978 -37514 -19592 13461
10803 13461 18278 12409 4914 -10333 -2358 11298 -5025 -18156 4491 -17209 -52302 -32836
10791 -32836 -15119 -17788 5324 24074 319 -4767 11517 9755 -12763 -11873 2227 8043 17086
10778 17086 1233 -9325 8521 12734 -13985 -29351 -20171 2077 32592 11749 1539 16291
10766 16291 7128 -38122 -42280 -38975 -57488 -38329 -16276 -20256 -17122 -6270 -1041 -8335 7939
10753 7939 19191 15487 10161 -13237 -17790 -4267 5257 4416 -6800 -31813 -24143 -27966 -17000
$$ packed form
10842C0450j2723n514k3370l89j191Q656j5302o12O371K9317K659k4170j0212
10829a6030n521P328M68K1475j0267n859J1895j2996j6236k907J1212J8074j0501
10816i865J8733J7563K681j4087j2379K618m118J9889n045j7968l5536J7922L3053
10803A3461M817n869p495j5247P975J3656j6323j3131K2647k1700l5093J9466
10791c2836J7717k669K3112J8750k3755n086J6284j762k2518Q90J4100N816R043
10778A7086j5853j0558J7846M213k6719j5366R180K2248L0515k0843j0210J4752
10766A6291r163m5250m158L305j8513J9159K2053l980L134J0852N229p294J6274
10753G939J1252l704n326k3398m553J3523R524q41j1216k5013P670l823J0966
$$ plain form
10740 -17000 -12789 -14470 -4917 -7471 -2550 -21105 -8952 17080 26750 42313 48599 23841 1014
10727 1014 -26606 -57147 -47467 -24960 -12254 -8033 -10046 6881 18377 20530 1975 13999 26216
10714 26216 24583 -12665 -16286 -8369 861 10307 16731 17088 6493 -1254 -3321 4380 -100 2428
10700 2428 -900 -6337 41816 54729 60644 59701 36108 5668 97 12120 20142 -503 -5296
10687 -5296 2257 2946 32581 28561 14839 12006 33651 34193 17810 22225 5402 11252 23269 44814
10673 44814 48295 16485 14015 23724 5891 -14246 -16239 7479 6432 -10913 -2211 -16699 -10270
10660 -10270 -24646 -48136 -49684 -15610 5731 -9668 -43611 -35935 -29681 -19497 24450 22723
10648 22723 -9036 -19019 -26620 -32234 -16685 -3410 -7850 -10472 -5061 241 -5080 -21077 -31272
$$ packed form
10740a7000M211j681R553k554M921j8555J2153K6032R670J5563O286k4758k2827
10727A014k7620l0541R680K2507J2706M221k013J6927J1496K153j8555J2024J2217
10714B6216j633l7248l621P917R230R446O424L57j0595p747k067P701m480K528
10700B428l328n437M8153J2913N915r43k3593l0440n571J2023Q022k0645m793
10687e296P553O89K9635m020j3722k833K1645N42j6383M415j6823N850J2017K1545
10673D4814L481l1810k470R709j7833k0137j993K3718j047j7345Q702j4488O429
10660a0270j4376k3490j548L4074K1341j5399l3943P676O254J0184M3947j727
10648B2723l1759r983p601n614J5549J3275m440k622N411N302n321j5997j0195
$$ plain form
10635 -31272 -14134 -9878 1068 26985 31106 17472 109 -14771 -35860 -35673 -32769 -45129 -30684
10622 -30684 -22187 -9314 -20858 -13018 -4695 5755 7237 -11499 -9834 3197 18975 14556 2298
10609 2298 -24601 -25714 -16772 -15807 -8273 34397 41952 35269 35801 27117 11280 19226 9310 13289
10595 13289 12956 57 7731 -5353 -19581 -16328 -14739 -1517 8085 -5405 -26313 -25444 -20119
10582 -20119 -30494 -58840 -52836 -22901 -10207 6148 27983 41831 42431 28082 12220 1453
10570 1453 13381 -12043 -3515 23241 3883 4467 -17282 -15806 -2099 -1582 -7531 -17880 -33228
10557 -33228 -31381 -10716 20799 20607 7162 -8181 -18438 -23923 -21482 -13282 -21230 2872 4115
10544 4115 -6809 -12875 -17004 -45895 -68061 -63948 -55560 -58095 -53989 -20880 -5079 4515 -708
$$ packed form
10635c1272J7138M256J0946K5917M121j3634j7363j4880k1089J87K904j2360J4445
10622c0684Q497J2873j1544P840Q323J0450J482j8736J665J3031J5778m419j2258
10609B298k6899j113Q942R65P534M2670P555o683N32q684j5837P946r916L979
10595A3289l33j2899P674j3084j4228L253J589J3222R602j3490k0908Q69N325
10582b0119j0375k8346O004K9935J2694J6355K1835J3848O00j4349j5862j0767
10570A453J1928k5424Q528K6756j9358N84k1749J476J3707N17n949j0349j5348
10557c3228J847K0665L1515j92j3445j5343j0257n485K441Q200p948K4102J243
10544D115j0924o066m129k8891k2166M113Q388k535M106L3109J5801R594n223
$$ plain form
10531 -708 -16241 3978 29000 35995 44701 15128 -22670 -19367 12129 17251 3870 9368 5111
10518 5111 -3836 -20061 -40050 -52417 -53420 -40497 -19168 9268 21481 24252 33004 14902 -18142
10505 -18142 -33338 -34892 -27966 -30438 -12371 7027 14331 -11850 -14804 1598 -21671 -22025 16099
10492 16099 28098 27970 17974 26249 48827 49928 31833 909 -9538 9163 22418 12419 15897
10479 15897 16283 26734 -17072 -38137 -42453 -31659 -16934 -10115 -2706 -23778 -39074 -32088 -47622
10466 -47622 -48354 -47505 -55856 -40718 1103 43793 45601 50601 52676 29980 12609 18811 25204 35859
10452 35859 21931 21338 -5607 -14040 -24408 -20385 -36532 -37060 -19605 -25755 -21042 -13902 -31590
10439 -31590 -42840 -43942 -54528 -32757 715 11939 -4748 -15699 -2066 15073 24899 20394
$$ packed form
10531g08j5533K0219K5022O995Q706k9573l7798L303L1496N122j3381N498m257
10518E111q947j6225j9989j2367j003J2923K1329K8436J2213K771Q752j8102l3044
10505a8142j5196j554O926k472J8067J9398P304k6181k954J6402k3269l54L8124
10492A6099J1999j28r996Q275K2578J101j8095l0924j0447J8701J3255r999L478
10479A5897L86J0451m3806k1065m316J0794J4725O819P409k1072j5296O986j5534
10466d7622p32Q49q351J5138M1821M2690J808N000K075k2696j7371O202O393J0655
10452C5859j3928n93k6945q433j0368M023j6147n28J7455o150M713P140j7688
10439c1590j1250j102j0586K1771L3472J1224j6687j0951J3633J7139R826m505
$$ plain form
10427 20394 12462 7356 13246 2308 -3128 14058 -4142 -19758 302 12486 4649 -2098 9575
10414 9575 17024 -736 -7414 -16684 -8696 4977 7693 22189 43919 43317 53977 62123 64778 62661
10400 62661 35586 44609 36659 15744 -4366 -7645 -30505 -18402 -18982 -4465 -8496 -19513 -18457
10387 -18457 -1722 8885 21755 638 -21162 -17340 -7442 -2302 -33433 -47079 -23126 -6741
10375 -6741 -27009 -20752 1866 10260 4965 2988 12295 20181 -22475 -38117 -31398 -6736 1792
10362 1792 -6476 3876 5667 -12039 -14002 -2212 5330 8380 25643 46377 40282 30787 17602
10349 17602 16650 28963 19663 -12374 -52929 -46629 -33014 -31369 -20446 -13101 9802 27594 10238
10336 10238 885 21566 38387 58132 49683 35028 43735 58716 54529 47278 32509 5615 19182
$$ packed form
10427B0394p932n106N890j0938n436J7186j8200j5616K0060J2184p837o747J1673
10414I575P449j7760o678r270P988J3673K716J4496K1730o02J0660Q146K655k117
10400F2661k7075R023p950k0915k0110l279k2860J2103n80J4517m031j1017J056
10387a8457J6735J0607J2870k1117k1800L822R898N140l1131j3646K3953J6385
10375f741k0268O257K2618Q394n295j977R307P886m2656j5642O719K4662Q528
10362A792q268J0352J791j7706j963J1790P542L050J7263K0734o095r495j3185
10349A7602r52J2313r300l2037m0555O300J3615J645J0923P345K2903J7792j7356
10336A0238r353K0681J6821J9745q449j4655Q707J4981m187p251j4769k6894J3567
$$ plain form
10323 19182 33084 40444 24754 -16094 -15364 15660 13025 6052 36336 67186 89082 117541 184597
10310 184597 247011 303924 322437 346661 362462 374689 373137 370395 345630 324040 329056 318380
10298 318380 288451 220301 175197 139938 116284 123512 114705 111112 112686 96783 77711 83815
10286 83815 87564 103099 114538 113551 99270 79066 58887 24316 15494 22028 20916 21632 7558
10273 7558 19716 12314 -4090 -12837 -362 2591 14943 23290 18076 18806 33038 10684 -11184
10260 -11184 -37626 -32009 -1789 28738 30092 40491 41575 54315 23832 -8219 -41177 -47035
10248 -47035 -30241 -4065 -8185 -1143 17724 5564 13992 18227 16088 8415 23376 49216 38028
10235 38028 31301 28016 38347 46984 40924 50133 56744 46039 37407 42416 31925 31512 27522 34921
$$ packed form
10323A9182J3902P360j5690m0848P30L1024k635o973L0284L0850K1896K8459O7056
10310A84597O2414N6913J8513K4224J5801J2227j552k742k4765k1590N016j0676
10298C18380k9929o8150m5104l5259k3654P228q807l593J574j5903j9072O104
10286H3815L749J5535J1439r87j4281k0204k0179l4571q822O534j112P16j4074
10273G558J2158p402j6404q747J2475K953J2352Q347n214P30J4232k2354k1868
10260a1184k6442N617L0220L0527J354J0399J084J2740l0483l2051l2958n858
10248d7035J6794K6176m120P042J8867j2160Q428M235k139p673J4961K5840j1188
10235C8028o727l285J0331Q637o060R209O611j0705q632N009j0491m13l990P399
$$ plain form
10221 34921 14993 3952 -987 827 -5317 4834 2538 -12766 5363 17153 31213 24904 1009
10208 1009 14745 35779 37313 26339 22886 51092 55094 25189 12917 26040 21262 22092 7521
10195 7521 -12358 10641 40033 58681 54669 17364 3063 -578 -15758 -1158 23370 23751 24797
10182 24797 10058 2286 19902 22396 12835 19422 19690 43381 56216 53636 43703 12733 13555 11618
10168 11618 11191 2061 -5012 -2461 2782 -15704 -19345 -1212 1898 -187 9726 -13811 8040 23103
10154 23103 20864 -9818 -10817 9728 23224 12639 16891 -1389 6196 13839 9666 9910 11531 13172
10140 13172 22688 12485 14192 7151 -14414 -30509 -23634 -16699 -13820 -3554 8299 6645 -11600
10127 -11600 -7883 12348 5274 7083 8415 6540 -11014 2061 15383 32208 46910 23552 22419
$$ packed form
10221C4921j9928j1041m939J814o144J0151k296j5304J8129J1790J4060o309k3895
10208A009J3736K1034J534j0974l453K8206M002k9905j2272J3123m778Q30j4571
10195G521j9879K2999K9392J8648m012l7305j4301l641j5180J4600K4528L81J046
10182B4797j4739p772J7616K494r561O587K68K3691J2835k580r933l0970Q22j937
10168A1618m27r130p073K551N243j8486l641J8133L110k085R913k3537K1851J5063
10154B3103k239l0682r99K0545J3496j0585M252j8280P585P643m173K44J621J641
10140A3172R516j0203J707p041k1565j6095O875O935K879J0266J1853j654j8245
10127a1600L717K0231p074J809J332j875j7554J3075J3322J6825J4702k3358j133
$$ plain form
10114 22419 32391 17572 19107 42568 27044 20296 31676 46027 63318 57043 32113 45534
10102 45534 54592 49305 24865 11514 23398 14307 22099 28260 35286 27483 52610 40171 23685
10089 23685 11762 -4518 -2492 -22673 4534 12634 6952 16611 32955 34431 2990 254 9620
10076 9620 -24894 -35626 -44286 -30140 -10373 -2302 -2796 2753 28295 33408 12861 24645 51523
10063 51523 47160 36382 41091 48176 37273 8110 5394 23482 6279 6303 9371 -6066 -145
10050 -145 8939 27556 28163 -5733 -22994 -9379 15937 23735 20795 19092 22416 36150 57259
10037 57259 56879 57970 48287 39781 37472 24945 601 -7405 -8087 -22326 -134 11118 18743 3985
10023 3985 5659 15218 10678 8235 7816 16623 -4151 -29576 -37725 -41075 -14273 4172 -9269 -13517
$$ packed form
10114B2419R972j4819J535K3461j5524o748J1380J4351J7291o275k4930J3421
10102D5534R058n287k4440j3351J1884r091P792O161P026p803K5127j2439j6486
10089B3685j1923j6280K026k0181K7207Q100n682R659J6344J476l1441k736R366
10076I620l4514j0732q660J4146J9767Q071m94N549K5542N113k0547J1784K6878
10063E1523m363j0778M709P085j0903k9163k716J8088j7203K4L068j5437N921
10050a45R084J8617O07l3896j7261J3615K5316P798k940j703L324J3734K1109
10037E7259l80J091r683q506k309j2527k4344q006o82j4239K2192J1252P625j4758
10023C985J674R559m540k443m19Q807k0774k5425q149l350K6802J8445j3441m248
$$ plain form
10009 -13517 -27311 -17773 4545 3998 27587 40485 23227 -13097 -24880 -48168 -20181 7202
9997 7202 4720 -8002 -26678 -24392 -31545 -19016 -130 5487 14633 -1660 -15723 -13218 3611
9984 3611 11816 -5940 6915 30743 35417 41043 21907 26131 21011 9549 18719 32632 8061
9971 8061 19607 32485 31674 39190 31130 14451 13850 14272 2372 14701 28095 53698 51296 34307
9957 34307 17049 8085 6360 18511 21558 24504 24681 45184 68165 101824 91119 70359 56478
9944 56478 51470 32058 30615 27547 31370 42762 51935 40131 9868 7490 6457 9634 10705 28357
9930 28357 20988 7773 22529 21019 15355 4090 12470 2928 20185 17809 4599 8142 -711
9917 -711 3004 13093 22545 17771 39179 69739 57850 47798 42001 53362 47671 24977 17363
$$ packed form
10009a3517j3794R538K2318n47K3589J2898j7258l6324j1783k3288K7987K7383
9997G202k482j2722j8676K286p153J2529J8886N617R146j6293j4063K505J6829
9984C611Q205j7756J2855K3828M674N626j9136M224n120j1462R170J3913k4571
9971H061J1546J2878q11P516q060j6679o01M22j1900J2329J3394K5603k402j6989
9957C4307j7258q964j725J2151L047K946J77K0503K2981L3659j0705k0760j3881
9944E6478n008j9412j443l068L823J1392R173j1804l0263k378j033L177J071J7652
9930B8357p369j3215J4756j510n664j1265Q380r542J7257k376j3210L543q853
9917g11L715J0089R452m774K1408L0560j1889j0052n797J1361n691k2694p614
$$ plain form
9904 17363 30131 29886 48430 86151 86427 86841 101701 147129 144833 126174 93896 64158 76122
9891 76122 81549 49842 50217 34472 28187 45068 81986 81625 57104 47599 63709 66419 82859
9878 82859 74267 77666 95041 111459 131013 205703 321768 465311 644208 785195 861029
9867 861029 900111 884436 832410 698317 486208 346591 264774 196734 178261 168959 150215
9856 150215 122394 102251 105918 94131 79366 94835 102307 90745 83057 74898 53659 46906 48311
9843 48311 66862 52958 21537 43348 71290 63303 43189 49423 49957 54312 48051 39249 35424
9830 35424 29161 14953 5767 13689 25072 19974 9864 1687 10783 28243 25632 21508 17864 23831
9816 23831 187 15754 22321 19744 19100 8809 12733 18160 22376 24170 35110 38167 42105 64121
$$ packed form
9904A7363J2768k45J8544L7721K76M14J4860M5428k296j8659l2278k9738J1964
9891G6122N427l1707L75j5745o285J6881L6918l61k4521r505J6110K710J6440
9878H2859q592L399J7375J6418J9554P4690J16065J43543J78897J40987P5834
9867H61029L9082j5675n2026j34093k12109j39617q1817o8040j8473r302j8744
9856A50215k7821k0143L667j1787j4765J5469P472j1562p688q159k1239o753J405
9843D8311J8551j3904l1421K1811K7942p987k0114O234N34M355o261q802l825
9830C5424o263j4208r186P922J1383n098j0110q177R096J7460k611m124l644N967
9816B3831k3644J5567O567k577o44j0291L924N427M216J794J0940L057L938K2016
$$ plain form
9802 64121 52768 23133 31476 38217 49464 35447 15502 13408 21780 32705 34603 21613 24996
9789 24996 28094 33809 46247 45303 30615 36763 46684 42437 29155 31879 21586 16574 26800 8307
9775 8307 12990 9372 4485 -8633 -18101 11618 13632 -3979 -16816 1279 16513 5446 25703
9762 25703 27064 41430 65800 72866 50669 25600 -5284 -16732 714 16749 7543 28376
9750 28376 39206 47757 39202 24028 18926 37505 48067 49156 11588 -6162 -12536 5817 21116
9737 21116 28788 43723 46605 35320 40749 48889 53174 48510 55718 65812 47435 34625 19683
9724 19683 -5196 -4463 6683 -2695 -16136 -5239 -16731 2721 14576 25491 17357 12317 8684
9711 8684 2046 -236 21280 23663 11228 18904 18887 47727 74863 74294 51025 51088 69772 68166 72883
$$ packed form
9802F4121j1353k9635Q343O741J1247j4017j9945k094Q372J0925J898j2990L383
9789B4996L098N715J2438r44j4688O148R921m247j3282K724j0293n012J0226j8493
9775H307M683l618m887j3118r468K9719K014j7611j2837J8095J5234j1067K0257
9762B5703J361J4366K4370P066k2197k5069l0884j1448J7446J6035r206K0833
9750B8376J0830Q551q555j5174n102J8579J0562J089l7568j7750o374J8353J5299
9737B1116P672J4935K882j1285N429Q140M285m664P208J0094j8377j2810j4942
9724A9683k4879P33J1146r378j3441J0897j1492J9452J1855J0915q134n040l633
9711H684o638k282K1516K383j2435P676j7K8840K7136n69k3269O3J8684j606M717
$$ plain form
9696 72883 87911 82128 66264 47358 32021 60644 72846 72641 46388 50630 69744 57425 28361
9683 28361 10245 12732 20487 36669 37855 48560 33474 22861 14805 38401 62990 66688 90883
9670 90883 90949 104590 112389 123732 121392 101617 115062 135159 134988 155858 149753 145551 138156 125151
9656 125151 110620 111551 142726 137940 116681 110935 103882 89104 81532 69072 71767 78221 87150
9643 87150 106027 122782 119561 114113 104969 91728 86163 102462 88595 89708 84291 94132 99569
9630 99569 96885 105653 122795 129237 132116 129529 133988 143759 137540 146455 144177 124211 110081 137022
9616 137022 146752 140731 155100 154011 162016 167751 151416 152861 142213 173028 211812 195274 155587
9603 155587 140671 159473 201972 206208 175721 173088 167806 169487 173636 153985 149302 156177 165458
$$ packed form
9696G2883J5028n783j5864j8906j5337K8623J2202k05k6253M242J9114j2319k9064
9683B8361j8116K487P755J6182J186J0705j5086j0613q056K3596K4589L698K4195
9670I0883O6J3641P799J1343k340j9775J3445K0097j71K0870o105m202p395j3005
9656A25151j4531R31L1175m786k1259n746p053j4778p572j2460K695O454Q929
9643H7150J8877J6755l221n448r144j3241n565J6299j3867J113n417R841N437
9630I9569k684Q768J7142O442K879k587M459R771o219Q915k278j9966j4130K6941
9616A37022R730o021J4369j089Q005N735j6335J445j0648L0815L8784j6538l9687
9603A55587j4916J8802M2499M236l0487k633n282J681M149j9651m683O875R281
$$ plain form
9590 165458 172979 176069 180792 185102 160081 157781 153007 161901 162354 160582 145141 141490 148151 145275
9576 145275 151758 163730 160787 151358 160465 178998 191383 189210 175321 177585 188199 194619 193196
9563 193196 185685 190421 186346 186307 181485 196268 215534 204685 203802 204454 211745 228402 233700 237352
9549 237352 221550 245651 253462 259136 255036 253338 278180 275751 272033 295604 307899 336488 320188
9536 320188 301928 324195 335974 350849 358076 361603 356899 365749 396521 401327 406512 423660 422763
9523 422763 444114 434871 431840 440291 452266 490092 482769 497512 519967 545557 578916 592278
9511 592278 599920 619410 628055 645112 678248 697859 723918 742607 748449 772409 812933 833672
9499 833672 863985 889649 905760 946018 971442 1022656 1079471 1127394 1173306 1210141 1224607 1256089
$$ packed form
9590A65458P521L090M723M310k5021k300m774Q894M53j772j5441l651O661k876
9576A45275O483J1972k943r429R107J8533J2385k173j3889K264J0614O420j423
9563A93196p511M736m075l9m822J4783J9266j0849q83O52P291J6657N298L652
9549B37352j5802K4101P811N674m100j698K4842k429l718K3571J2295K8589j6300
9536C20188j8260K2267J1779J4875P227L527m704Q850L0772M806N185J7148q97
9523D22763K1351r243l031Q451J1975L7826p323J4743K2455K5590L3359J3362
9511E92278P642J9490Q645J7057L3136J9611K6059J8689N842K3960M0524K0739
9499H33672L0313K5664J6111M0258K5424N1214N6815M7923M5912L6835J4466L1482
$$ plain form
9487 1256089 1311758 1371637 1470799 1548900 1650932 1761347 1834573 1891370 1974257 2082485 2217373
9476 2217373 2325973 2442962 2578144 2724297 2871997 3034152 3210856 3403536 3586992 3795070
9466 3795070 4036036 4293771 4533202 4801092 5084339 5365431 5669818 6010862 6351903 6715581
9456 6715581 7101776 7481847 7897429 8316112 8746327 9189415 9627668 10113006 10581227 11061579
9446 11061579 11570119 12063728 12543003 13059400 13594387 14133258 14678888 15225011 15788763
9437 15788763 16379265 16992621 17640540 18294019 18989710 19680505 20398877 21196328 21983724
9428 21983724 22778500 23581491 24377350 25153179 25929355 26674553 27438758 28137906 28771269
9419 28771269 29293682 29694659 29979149 30151415 30194342 30126679 29934946 29627605 29214177 28706635
$$ packed form
9487A256089N5669N9879R9162P8101J02032J10415P3226N6797Q2887J08228J34888
9476B217373J08600J16989J35182J46153J47700J62155J76704J92680J83456K08078
9466C795070K40966K57735K39431K67890K83247K81092L04387L41044L41041L63678
9456F715581L86195L80071M15582M18683M30215M43088M38253M85338M68221M80352
9446A1061579N08540M93609M79275N16397N34987N38871N45630N46123N63752
9437A5788763N90502O13356O47919O53479O95691O90795P18372P97451P87396
9428B1983724P94776Q02991P95859P75829P76176P45198P64205O99148O33363
9419B8771269N22413M00977K84490J72266M2927o7663j91733l07341m13428n07542
$$ plain form
9409 28706635 28116417 27488913 26809528 26082746 25348841 24612277 23872317 23149847 22432343
9400 22432343 21727897 21078824 20446862 19836472 19250947 18673468 18136307 17626620 17115894
9391 17115894 16626572 16151642 15710840 15264255 14828846 14432458 14040536 13633827 13249151
9382 13249151 12877324 12514928 12139140 11759586 11374086 11002773 10662597 10341324 10011168
9373 10011168 9694952 9371502 9031509 8687953 8368989 8062708 7808792 7524819 7264032
9364 7264032 7016552 6735280 6486564 6268991 6061677 5830041 5626421 5438988 5245825 5043047
9354 5043047 4892186 4742649 4585779 4445254 4317022 4163029 4028933 3899431 3788105 3663808
9344 3663808 3530069 3427344 3322975 3230852 3142092 3062417 2972027 2867959 2805172 2756270 2696525
$$ packed form
9409B8706635n90218o27504o79385p26782p33905p36564p39960p22470p17504
9400B2432343p04446o49073o31962o10390n85525n77479n37161n09687n10726
9391A7115894m89322m74930m40802m46585m35409l96388l91922m06709l84676
9382A3249151l71827l62396l75788l79554l85500l71313l40176l21273l30156
9373A0011168l16216l23450l39993l43556l18964l06281k53916k83973k60787
9364G264032k47480k81272k48716k17573k07314k31636k03620j87433j93163k02778
9354E043047j50861j49537j56870j40525j28232j53993j34096j29502j11326j24297
9344C663808j33739j02725j04369r2123q8760p9675r0390j04068o2787m8902n9745
$$ plain form
9333 2696525 2638941 2576704 2524752 2464058 2397339 2319506 2284850 2244676 2184443 2121129 2058865
9322 2058865 2027087 1999361 1969793 1931053 1890726 1830639 1779170 1742681 1713853 1681494 1630963
9311 1630963 1605161 1600302 1570915 1527767 1498007 1479922 1471053 1462291 1448751 1425833 1402111 1398687
9299 1398687 1377653 1350792 1320296 1305461 1315239 1281183 1260814 1257469 1263846 1289052 1288012 1275142
9287 1275142 1260020 1249785 1247521 1257925 1281001 1281217 1269607 1254334 1263735 1298466 1316140 1331716
9275 1331716 1339229 1358276 1366166 1392032 1415095 1412191 1396988 1414899 1413805 1441748 1472947 1474297
9263 1474297 1466340 1467805 1506840 1559645 1607787 1652516 1689381 1706955 1740334 1784153 1826083 1868783
9251 1868783 1929796 1977482 2027502 2090911 2148154 2220552 2303416 2354649 2391304 2463613 2551948
$$ packed form
9333B696525n7584o2237n1952o0694o6719p7833l4656m0174o0233o3314o2264
9322B058865l1778k7726k9568l8740m0327o0087n1469l6489k8828l2359n0531
9311A630963k5802m859k9387m3148k9760j8085q869q762j3540k2918k3722l424
9299A398687k1034k6861l0496j4835R778l4056k0369l345O377K5206j040j2870
9287A275142j5122j0235k264J0404K3076K16j1610j5273R401L4731J7674J5576
9275A331716P513J9047P890K5866K3063k904j5203J7911j094K7943L1199J350
9263A474297p957J465L9035N2805M8142M4729L6865J7574L3379M3819M1930M2700
9251A868783O1013M7686N0020O3409N7243P2398Q2864N1233L6655P2309Q8335
$$ plain form
9240 2551948 2639051 2726740 2783262 2839775 2918350 3006692 3064007 3123966 3153155 3213528 3256423
9229 3256423 3308422 3347630 3367350 3360451 3334018 3343189 3316490 3298720 3255225 3208585 3159513 3086022
9217 3086022 2989738 2911417 2830332 2736095 2640773 2567552 2486031 2388984 2307296 2241777 2161377
9206 2161377 2069791 1974693 1906627 1857773 1787837 1718387 1625575 1550142 1508630 1500953 1453835 1398383
9194 1398383 1349245 1295172 1251314 1214319 1181861 1133168 1082521 1030029 998379 986096 931310
9183 931310 902089 883840 854555 843394 815233 788278 751814 731165 719196 696661 682382 661451
9171 661451 647270 635772 610567 598379 592036 574946 541954 515190 471742 420189 405095 435650
9159 435650 430934 405141 435782 430242 396498 394200 397591 389858 355417 344716 356054 339118 328525
$$ packed form
9240B551948Q7103Q7689N6522N6513P8575Q8342N7315N9959K9189O0373M2895
9229C256423N1999L9208J9720o899k6433R171k6699j7770m3495m6640m9072p3491
9217C086022r6284p8321q1085r4237r5322p3221q1521r7047q1688o5519q0400
9206B161377r1586r5098o8066m8854o9936o9450r2812p5433m1512p677m7118n5452
9194A398383m9138n4073m3858l6995l2458m8693n0647n2492l1650j2283n4786
9183I31310k9221j8249k9285j1161k8161k6955l6464k0649j1969k2535j4279k0931
9171F61451j4181j1498k5205j2188o343j7090l2992k6764m3448n1553j5094L0555
9159D35650m716k5793L0641n540l3744k298L391p733l4441j0701J1338j6936j0593
$$ plain form
9146 328525 325351 311064 300831 294485 275174 272223 276193 272845 261486 238993 227635 247267 270234
9133 270234 245744 242523 230661 242256 238981 217707 212129 222473 224321 208241 215069 200654 168050
9120 168050 173949 185273 178727 178988 177949 168829 170665 167211 159959 154299 148060 149516 162963 154907
9106 154907 135519 124703 108009 105528 103379 116345 126939 100092 82777 68934 55400 60295
9094 60295 89083 108721 114346 112092 129625 125976 106624 84312 91369 103213 103293 90018 79828
9081 79828 76221 78450 78248 80765 74293 72416 95965 108482 98966 86673 79915 94179 105868 105469
9067 105469 120692 107959 94895 76566 68638 72530 66963 64141 65543 43241 27361 27172 52039
9054 52039 63483 58740 52989 29089 10916 31125 44147 67987 70689 77402 94667 99254 80714
$$ packed form
9146C28525l174j4287j0233o346j9311k951L970l348j1359k2493j1358J9632K2967
9133B70234k4490l221j1862J1595l275k1274n578J0344J848j6080O828j4415l2604
9120A68050N899J1324o546K61j039r120J836l454p252n660o239J456J3447q056
9106A54907j9388j0816j6694k481k149J2966J0594k6847j7315j3843j3534M895
9094F0295K8788J9638N625k254J7533l649j9352k2312P057J1844Q0j3275j0190
9081G9828l607K229k02K517o472j877K3549J2517r516j2293o758J4264J1689l99
9067A05469J5223j2733j3064j8329p928L892n567k822J402k2302j5880j89K4867
9054E2039J1444m743n751k3900j8173K0209J3022K3840K702O713J7265M587j8540
$$ plain form
9041 80714 80858 87755 63142 52937 53116 61369 59106 82709 91625 80357 69080 31351 22817 50233
9027 50233 45878 36994 51485 73195 61153 52246 49838 44718 39019 23635 14370 29384 40586
9014 40586 32900 42458 44029 49043 51913 35834 35976 77566 87569 65243 57456 50189 53079 60850
9000 60850 55519 57871 22964 27171 63419 77772 73490 59278 54212 49652 69129 70669 71203 59930
8986 59930 51984 33218 12627 -8475 -13719 14280 28684 5389 4220 11994 -8208 18253 45952
8973 45952 65579 65491 54874 53108 45323 24401 29728 32027 28457 53954 69547 56077 41717
8960 41717 36289 29572 18602 2629 -12016 -2429 -9846 14082 42873 60222 54183 50627 29632
8947 29632 5717 1762 9355 34100 42152 54771 50360 36006 30976 50039 81739 80412 75135
$$ packed form
9041H0714J44O897k4613j0205J79Q253k263K3603Q916j1268j1277l7729q534K7416
9027E0233m355q884J4491K1710j2042q907k408n120n699j5384r265J5014J1202
9014D0586p686R558J571N014K870j6079J42M1590J0003k2326p787p267K890P771
9000F0850n331K352l4907M207L6248J4353m282j4212n066m560J9477J540N34j1273
8986E9930p946j8766k0591k1102n244K7999J4404k3295j169P774k0202K6461K7699
8973D5952J9627q8j0617j766p785k0922N327K299l570K5497J5593j3470j4360
8960D1717n428o717j0970j5973j4645R587p417K3928K8791J7349o039l556k0995
8947B9632k3915l955P593K4745Q052J2619m411j4354n030J9063L1700j327n277
$$ plain form
8934 75135 63098 53965 50345 27862 18354 3907 -17488 14941 49042 68261 52068 48653 50865
8921 50865 60566 66434 66154 75976 81284 55197 68979 105048 116538 127582 135377 102472 99146
8908 99146 88987 58577 65221 43237 72970 87498 57435 61954 76406 65400 52246 56441
8896 56441 61352 20948 19207 23093 15048 19378 21465 29812 34571 20935 -894 -7253 -9575 4419
8882 4419 8111 31486 47053 35091 31755 17186 -7929 1468 8338 3823 36149 26959 9063
8869 9063 23973 6685 16242 17972 10604 37365 33901 4567 -7290 24 3274 1102 8250 35044
8855 35044 45717 48925 45796 26549 12455 23026 16559 -3127 10926 18951 31475 43857 38163
8842 38163 28729 32088 46772 57631 42711 28791 16252 8331 15929 24864 30957 15291 -2999
$$ packed form
8934G5135j2037r133l620k2483r508j4447k1395L2429L4101J9219j6193l415K212
8921E0865R701N868k80R822N308k6087J3782L6069J1490J1044P795l2905l326
8908I9146j0159l0410O644k1984K9733J4528l0063M519J4452j1006j3154M195
8896E6441M911m0404j741L886q045M330K087Q347M759j3636k1829o359k322J3994
8882D419L692K3375J5567j1962l336j4569k5115R397O870m515L2326r190j7896
8869I063J4910j7288R557J730p368K6761l464k9334j1857P314L250k172P148K6794
8855C5044J0673L208l129j9247j4094J0571o467j9686J4053Q025J2524J2382n694
8842C8163r434L359J4684J0859j4920j3920j2539p921P598Q935O093j5666j8290
$$ plain form
8829 -2999 -3061 -3506 5958 34972 32506 -2025 -20254 -10007 8748 21065 32918 42512 17149 12417
8815 12417 34925 55958 74024 30471 6355 -952 6984 8896 13995 53127 60610 38467 36272
8802 36272 46527 23174 -9014 -7018 14765 12450 21531 35509 27550 7863 4532 21682 32479
8789 32479 12746 13699 -306 -10645 -4585 -33 -11577 6706 21044 33006 17836 36336 61849
8776 61849 65081 31330 7950 988 216 21670 36715 39011 15131 23582 17779 8642 12648 30675
8762 30675 32995 24904 37587 34390 28717 60183 68644 50136 36450 43426 53439 48733 21941
8749 21941 3688 -10893 -18 18021 29479 3701 -2749 24004 31082 5651 -10620 -8367
8737 -8367 10323 54391 75313 66338 30781 19615 28680 31246 17901 12524 44032 36570 34680
$$ packed form
8829b999o2m45R464K9014k466l4531j8229J0247J8755J2317J1853R594k5363m732
8815A2417K2508K1033J8066m3553k4116p307P936J912N099L9132P483k2143k195
8802C6272J0255k3353l2188J996K1783k315R081J3978p959j9687l331J7150J0797
8789C2479j9733R53j4005j0339O060M552j1544J8283J4338J1962j5170J8500K5513
8776F1849L232l3751k3380o962p72K1454J5045K296k3880Q451n803r137M006J8027
8762C0675K320q091J2683l197n673L1466Q461j8508j3686O976J0013m706k6792
8749B1941j8253j4581J0875J8039J1458k5778o450K6753P078k5431j6271K253
8737h367J8690M4068K0922q975l5557j1166R065K566j3345n377L1508p462j890
$$ plain form
8724 34680 30608 15596 37324 34901 26118 33342 38416 28090 22474 25706 20671 15020 11769 7485
8710 7485 -7417 529 17555 20051 5111 4904 12075 8257 2550 23977 25137 21177 22352 37987
8696 37987 27965 15251 17220 28392 22774 41536 37496 31990 22600 4093 -8747 7827 31047
8683 31047 30196 61810 65717 59810 55850 72917 101129 100064 111188 149537 203377 278740 303412
8670 303412 279719 250164 242993 204781 145851 121083 111478 110811 112186 120231 107770 72620 38315
8657 38315 27949 31026 28305 37129 56310 72654 60319 45512 48154 47268 68743 68444 65108 84379
8643 84379 106890 107716 97630 110685 101965 86328 83998 88977 89927 86138 100985 145004 180959
8630 180959 225379 287061 382408 463637 511634 510529 504079 461113 379268 280595 188111 144430
$$ packed form
8724C4680m072j5012K1728k423q783P224N074j0326n616L232n035n651l251m284
8710G485j4902P946J7026K496j4940k07P171l818n707K1427J160l960J175J5635
8696C7987j0022j2714J969J1172n618J8762m040n506r390j8507j2840J6574K3220
8683C1047q51L1614L907n907l960J7067K8212j065J1124L8349N3840P5363K4672
8670C03412k3693k9555p171l8212n8930k4768r605o67J375Q045j2461l5150l4305
8657C8315j0366L077k721Q824J9181J6344j2335j4807K642q86K1475k99l336J9271
8643H4379K2511Q26j0086J3055q720j5637k330M979R50l789J4847M4019L5955
8630A80959M4420O1682R5347Q1229M7997j105o450m2966q1845r8673r2484m3681
$$ plain form
8618 144430 130753 125637 111587 97708 46392 17683 32521 67710 75590 81163 77164 58457
8606 58457 49328 65071 81665 82144 89601 74331 43177 44507 60766 53340 39869 37014 54658
8593 54658 67808 62266 59024 20044 7836 1061 14623 51976 98794 145510 211336 264408
8581 264408 265753 276728 276014 259832 218761 183240 136976 113577 100195 79909 58167 48271
8569 48271 52831 63402 50022 21411 26022 25216 36443 34061 19469 28530 26105 8542 30661
8556 30661 43213 36965 7802 1217 -904 26992 15344 8179 24040 39560 43084 33489 6490
8543 6490 -3482 19502 27382 30456 13608 1922 12746 5410 -9874 1746 29481 45536 37151
8530 37151 34316 20168 14924 20529 20788 25595 24929 43144 45259 33411 14316 9152 -5706 -10170
$$ packed form
8618A44430j3677n116j4050j3879n1316k8709J4838L5189P880N573l999j8707
8606E8457r129J5743J6594M79P457j5270l1154J330J6259p426j3471k855J7644
8593E4658J3150n542l242l8980j2208o775J3562L7353M6818M6716O5826N3072
8581B64408J345J0975p14j6182m1071l5521m6264k3399j3382k0286k1742r896
8569D8271M560J0571j3380k8611M611q06J1227k382j4592R061k425j7563K2119
8556C0661J2552o248k9163o585k121K7896j1648p165J5861J5520L524r595k6999
8543F490r972K2984P880L074j6848j1686J0824p336j5284J1620K7735J6055q385
8530C7151k835j4148n244N605K59M807o66J8215K115j1848j9095n164j4858m464
$$ plain form
8516 -10170 -16414 -29298 -853 21567 5915 -7918 -4968 -1804 3327 1374 9730 14348 -8265
8503 -8265 -18106 -1427 -4008 -11032 -20988 -42201 -27460 -22105 -33317 -38701 -18775 -16103 -22805 -10614
8489 -10614 112 -7532 -16296 -8400 11470 4757 -11306 -20867 -15735 -20350 -26071 -23953 -13369 -6498
8475 -6498 -5760 3397 -2360 -16345 -7141 -118 -17230 1330 21134 25042 39608 44837 43805 52697
8461 52697 34939 -4377 2184 19867 20102 5702 -19300 -23178 -25318 -28659 -44635 -48657 -57922
8448 -57922 -54315 -42271 -10576 2871 20617 7768 -9471 2327 6707 13606 22322 24849 47811
8435 47811 38316 -1937 7495 6418 7173 14972 13241 -9656 -8882 14859 15500 13847 4308 4663 777
8420 777 -35395 -57885 -57886 -33180 -23207 -10073 -22832 -7195 1744 -10371 -10170 4368 7088 -24002
$$ packed form
8516a0170o244j2884K8445K2420j5652j3833K950L164N131j953Q356M618k2613
8503h265r841J6679k581p024r956k1213J4741N355j1212n384J9926K672o702J2191
8489a0614J0726p644q764P896J9870o713j6063r561N132m615n721K118J0584O871
8475f498P38R157n757j3985R204P023j7112J8560J9804L908J4566N229j032Q892
8461E2697j7758l9316O561J7683K35j4400k5002l878k140l341j5976m022r265
8448e7922L607J2044L1695J3447J7746j2849j7239J1798M380O899Q716K527K2962
8435D7811r495m0253R432j077P55P799j731k2897P74K3741O41j653r539L55l886
8420G77l6172k2490jK4706R973J3134j2759J5637Q939j2115K01J4538K720l1090
$$ plain form
8406 -24002 -28223 -13155 -11412 -7797 9750 -11270 -10084 -20841 -27848 -22661 -4296 15919 1198
8393 1198 -15039 -38428 -33317 -14499 4982 11335 11361 -7792 -9623 -2914 -18689 -18188 3810 1561
8379 1561 5800 17720 8984 14330 17278 -6905 -19963 -2284 34325 30400 -4884 -20309 -14874
8366 -14874 -20163 -34070 -6781 -8863 -35672 -6000 9236 2946 -12722 -27437 -31453 -36149 -22340
8353 -22340 7831 16468 25174 5362 9048 21172 29126 25803 5295 -7505 -15777 17067 17853
8340 17853 14712 13928 7341 4076 13318 17656 2629 8866 17480 -1286 -783 -10350 -850 -7457 -6383
8325 -6383 1768 32147 28478 -7349 -40873 -62332 -43724 -29760 -25709 -16497 -22869 -20441 -6966
8312 -6966 7713 -16884 11334 12922 14548 16792 9868 -6428 2286 6062 -4063 -24619 -19348
$$ packed form
8406b4002m221J5068J743L615J7547k1020J186j0757p007N187J8365K0215j4721
8393A198j6237k3389N111J8818J9481O353K6j9153j831O709j5775N01K1998k249
8379A561M239J1920q736N346K948k4183j3058J7679L6609l925l5284j5425N435
8366a4874n289j3907K7289k082k6809K9672J5236o290j5668j4715m016m696J3809
8353b2340L0171Q637Q706j9812L686J2124P954l323k0508j2800q272L2844P86
8340A7853l141p84o587l265R242M338j5027O237Q614j8766N03r567R500o607J074
8325f383Q151L0379l669l5827l3524k1459J8608J3964M051R212o372K428J3475
8312f966J4679k4597K8218J588J626K244o924j6296Q714L776j0125k0556N271
$$ plain form
8299 -19348 -32752 -55594 -36858 -9511 4033 9242 21548 37385 41731 35546 34961 19747 4564
8286 4564 -6990 -19908 -30371 -23776 -10484 -10544 -13844 -13818 -8709 -4597 12888 29306 -3246 -26002
8272 -26002 -19588 -33776 -26428 -1517 14199 3870 -9465 -13441 -24194 -17368 -19957 -22021 -19077
8259 -19077 -24437 -12582 -4455 -20207 -35347 -3389 3070 -2962 14594 30576 40415 42018 24249
8246 24249 35838 33270 18408 656 -3874 -16153 -35154 -43744 -50608 -51293 -27226 -10050 13113
8233 13113 23112 20269 7433 -4018 -10048 -9129 11233 26264 41464 21531 113 -8552 5642
8220 5642 17495 9855 -1673 -8655 -25954 -21272 -9370 1817 11629 12465 10619 -2617 -16012
8207 -16012 -36434 -32196 -744 6657 42819 48803 35552 30300 45018 41634 18599 12592 20849
$$ packed form
8299a9348j3404k2842J8736K7347J3544N209J2306J5837M346o185n85j5214j5183
8286D564j1554j2918j0463O595J3292o0l300K6N109M112J7485J6418l2552k2756
8272b6002O414j4188P348K4911J5716j0329j3335l976j0753O826k589k064K944
8259a9077n360J1855Q127j5752j5140L1958O459o032J7556J5982R839J603j7769
8246B4249J1589k568j4862j7752m530j2279j9001q590o864o85K4067J7176K3163
8233A3113R999k843j2836j1451o030R19K0362J5031J5200j9933k1418q665J4194
8220E642J1853p640j1528o982j7299M682J1902J1187R812Q36j846j3236j3395
8207a6012k0422M238L1452P401L6162N984j3251n252J4718l384k3035o007Q257
$$ plain form
8194 20849 15621 -5246 -28252 -27955 -2218 8589 10627 17042 16647 44837 46198 20147 37386
8181 37386 43383 47614 50188 36488 44640 52937 72300 70912 56612 28717 23790 22076 -5381
8168 -5381 -14074 -10906 -4130 8980 6614 15245 29801 29395 24306 27762 4554 5222 15575 20640
8154 20640 -12583 -15886 5744 -3026 -1724 -4577 -3634 -5540 12610 -2823 -9078 5618 29606
8141 29606 26713 16886 -8068 10825 28580 60903 72310 45212 51992 72278 61136 42788
8129 42788 47993 42278 58982 58979 29245 24454 47235 59489 72298 64675 16861 -2825 -8194 -14851
8115 -14851 -8525 12078 12149 6991 12290 22825 22056 19963 -2742 -3298 6881 27673 42785 34018
8101 34018 40185 39177 40406 46851 25174 15789 12944 15035 13172 1236 -16376 -5245 6953
$$ packed form
8194B0849n228k0867k3006K97K5737J0807K038O415l95K8190J361k6051J7239
8181C7386N997M231K574j3700Q152Q297J9363j388j4300k7895m927j714k7457
8168e381q693L168O776J3110k366Q631J4556m06n089L456k3208O68J0353N065
8154B0640l3223l303K1630q770J302k853R43j906J8150j5433o255J4696K3988
8141B9606k893r827k4954J8893J7755L2323J1407k7098O780K0286j1142j8348
8129D2788N205n715J6704lk9734m791K2781J2254J2809p623m7814j9686n369o657
8115a4851O326K0603P1n158N299J0535p69k093k2705n56J0179K0792J5112q767
8101C4018O167j008J229O445k1677r385k845K091j863j1936j7612J1131J2198
$$ plain form
8088 6953 6285 5947 -16953 -17895 4147 21816 51617 50634 27534 36356 33050 7230 22581 46876
8074 46876 70228 74225 46460 17529 3249 -6133 -12646 -5447 7228 34284 41812 46469 29012
8061 29012 16672 11379 8144 29203 57798 39786 38507 28422 17756 2896 7487 13489 21749
8048 21749 24281 26496 37608 43073 40625 39726 22786 22222 26402 16831 10046 5800 -2485 11542
8034 11542 27063 32981 20666 6159 -15666 -32443 -3748 -1655 10583 33425 53345 58110
8022 58110 77096 61056 12597 -12568 -23360 -23078 -13197 2995 10317 19551 21410 30131 34102
8009 34102 33332 29067 36442 36638 44132 37226 34063 21913 27013 37743 31266 30324 48088 34900
7995 34900 50066 33987 22538 36641 50442 55755 63530 60277 61821 52238 30947 19043 14149
$$ packed form
8088F953o68l38k2900r42K2042J7669K9801r83k3100Q822l306k5820J5351K4295
8074D6876K3352L997k7765k8931j4280r382o513P199J2675K7056P528M657j7457
8061B9012j2340n293l235K1059K8595j8012j279j0085j0666j4860M591O002Q260
8048B1749K532K215J1112N465k448q99j6940n64M180r571o785m246q285J4027
8034A1542J5521N918j2315j4507k1825j6777K8695K093J2238K2842J9920M765
8022E8110J8986j6040m8459k5165j0792K82R881J6192P322R234J859Q721L971
8009C4102p70m265P375J96P494o906l163j2150N100J0730o477r42J7764j3188
7995C4900J5166j6079j1449J4103J3801N313P775l253J544r583k1291j1904m894
$$ plain form
7982 14149 32822 49711 64111 40777 17698 17198 19571 22513 18709 37734 21716 41225 55129
7969 55129 61724 61763 50045 34628 52069 77839 61032 37456 44370 64212 52581 39752 45687
7956 45687 41421 17448 -15431 -14349 303 19855 1092 7705 29530 49718 49529 18942 2382
7943 2382 14302 43013 46184 36866 55499 67761 59236 50443 51920 31827 -14209 -25456 -28469
7930 -28469 -21007 -20726 -6225 11652 10849 40465 57184 42143 21061 19398 38243 29913 12140
7917 12140 22162 32962 55718 35755 18714 18835 2023 8594 9303 -3745 -24739 -15279 5647
7904 5647 57739 52989 13518 17012 24654 5851 -1668 -12839 4406 2142 -6239 16949 -2283
7891 -2283 -9267 -18687 -32659 -30039 -10304 -4300 -3235 -2846 -1302 -9669 -14216 -3044 -4240 -5639
$$ packed form
7982A4149J8673J6889J4400k3334k3079n00K373K942l804J9025j6018J9509J3904
7969E5129O595L9j1718j5417J7441K5770j6807k3576O914J9842j1631j2829N935
7956D5687m266k3973l2879J082J4652J9552j8763O613K1825K0188j89l0587j6560
7943B382J1920K8711L171r318J8633J2262q525q793J477k0093m6036j1247l013
7930b8469P462K81J4501J7877q03K9616J6719j5041k1082j663J8845q330j7773
7917A2140J0022J0800K2756j9963j7041J21j6812O571P09j3048k0994R460K0926
7904E647N2092m750l9471L494P642j8803p519j1171J7245k264q381K3188j9232
7891b283o984r420j3972K620J9735O004J065L89J544q367m547J1172j196j399
$$ plain form
7877 -5639 -16536 -10557 4015 11176 -5927 -27219 -26495 5779 -7216 -4921 9620 -6465 -10701
7864 -10701 4877 -5415 -30480 -38023 -20394 5581 -2358 -17835 -13770 3523 -2309 -14451 -21192
7851 -21192 -3355 3052 -13544 -14374 -12703 -25612 -12206 -18736 -29073 -36660 -26525 -24751 -15620
7838 -15620 -14311 -38058 -44816 -30746 2150 21023 10152 12982 8645 5911 12818 6751 -3216
7825 -3216 -1391 -5737 -12988 -26057 -4153 6444 -1384 -7714 -24227 -40260 -27475 -12892 6631
7812 6631 16540 17205 14659 12653 26901 30324 13642 -2646 -3786 1377 17719 1724 -9423 -17126
7798 -17126 -21909 15160 11000 -2998 -14257 4164 40089 37225 26729 2227 -938 -2795 -7796
7785 -7796 230 -1187 -379 7772 33582 31405 21165 26480 38158 37722 45271 36796 28305 6469
$$ packed form
7877e639j0897N979J4572P161j7103k1292P24L2274j2995K295J4541j6085m236
7864a0701J5578j0292k5065p543J7629K5975p939j5477M065J7293n832j2142o741
7851b1192J7837O407j6596q30J671j2909J3406o530j0337p587J0135J774R131
7838a5620J309k3747o758J4070L2896J8873j0871K830m337k734O907o067r967
7825c216J825m346p251j3069K1904J0597p828o330j6513j6033J2785J4583J9523
7812F631R909O65k546k006J4248L423j6682j6288j140N163J6342j5995j1147p703
7798a7126m783L7069m160j3998j1259J8421L5925k864j0496k4502l165j857n001
7785g796Q026j417Q08Q151K5810k177j0240N315J1678m36P549q475q491k1836
$$ plain form
7771 6469 -7935 -6779 -6887 -11091 -19983 -14101 -14568 -26268 -21360 -15098 -18961 -13842 -12779 -14412 -9302
7756 -9302 -6214 7388 17276 9406 27571 18901 12410 24619 4819 7692 17536 -616 915 4174
7742 4174 -10994 -24528 -16056 -8874 -283 5917 19898 36954 42956 23637 15179 28341 38143
7729 38143 13467 -20625 -25440 -28420 -9120 -8368 -25423 -21249 -22284 -28401 -11906 -4716 8814
7716 8814 175 -40977 -42424 -39196 -11137 -7789 -12906 -9342 -13553 24347 40236 33812 21765 8651
7702 8651 21314 12509 -11564 -10187 7929 6101 -13782 -34002 -31630 -41157 -24530 -8605 11895
7689 11895 -4276 -7239 -3616 -7757 -1044 -1974 -10400 -29499 -35302 -22800 6203 -2326 -1134 -8075
7675 -8075 -10590 10940 4085 -20734 -18761 -24355 -31983 -6324 3760 -5471 -5066 -16216 -11665 -16711
$$ packed form
7771F469j4404J156j08m204q892N882m67j1700M908O262l863N119J063j633N110
7756i302L088J3602R888p870J8165q670o491J2209j9800K873R844j8152J531L259
7742D174j5168j3534Q472P182Q591O200J3981J7056O002j9319q458J3162R802
7729C8143k4676l4092m815k980J9300P52j7055M174j035o117J6495P190J3530
7716H814q639m1152j447L228K8059L348n117L564m211L7900J5889o424j2047j3114
7702H651J2663q805k4073J377J8116j828j9883k0220K372r527J6627J5925K0500
7689A1895j6171k963L623m141O713r30q426j9099n803J2502K9003q529J192o941
7675h075k515K1530o855k4819J973n594p628K5659J0084r231M05j1150M551n046
$$ plain form
7661 -16711 -30554 -35188 -21330 -667 38784 14725 -5067 -8947 -2114 14692 9317 -18024 -13174
7648 -13174 -10214 -126 15698 2946 -4762 3892 -19984 -18167 -38309 -33366 2752 25318 6509
7635 6509 -3856 12954 -248 7893 27573 2962 -21653 -37504 -32002 -11024 347 -3951 -4748
7622 -4748 -1109 5919 -8850 -23819 3271 10807 -13282 -6842 590 5336 6327 12446 13494 9859
7608 9859 4011 -2856 -9132 -8859 -20049 -36952 -33294 -8140 -18160 -18129 -19155 -32809 -41609 -37887
7594 -37887 -15582 -21602 -19421 -25495 -48139 -53357 -64506 -61786 -34440 -15399 -12951 -20017 -21582
7581 -21582 -19878 -10182 -22018 -13170 7181 1104 -23477 -42681 -42513 -40348 -30704 -24144 -14370 -4908
7567 -4908 -1625 11397 -2342 -13555 4069 -3871 -18749 -17848 -30461 -34012 -10225 16386 23428
$$ packed form
7661a6711j3843m634J3858K0663L9451k4059j9792l880O833J6806n375k7341M850
7648a3174K960J0088J5824j2752p708Q654k3876J817k0142M943L6118K2566j8809
7635F509j0365J6810j3202Q141J9680k4611k4615j5851N502K0978J1371m298p97
7622d748L639P028j4769j4969K7090P536k4089O440P432M746R91O119J048l635
7608I859n848o867o276K73j1190j6903L658K5154j0020L1j026j3654q800L722
7594c7887K2305o020K181o074k2644n218j1149K720K7346J9041K448p066j565
7581b1582J704R696j1836Q848K0351o077k4581j9204J68K165R644O560R774R462
7567d908L283J3022j3739j1213J7624p940j4878R01j2613l551K3787K6611P042
$$ plain form
7554 23428 18386 10329 15579 12406 -21715 -46206 -34751 -33242 -21882 -27391 -28243 -33587 -19166 7353
7540 7353 13329 12516 11569 -9726 -15374 -21159 -24508 -23223 -32961 -30695 -10960 26694 51225 34797
7526 34797 40708 39517 40377 30423 18360 -5052 -32784 -46334 -36088 -4058 10634 16550 26790
7513 26790 16820 22467 4268 -15553 -20808 -13397 -5621 9189 21464 11181 2548 -6303 -10816
7500 -10816 -1609 -2668 15060 12432 -6220 -24897 -25163 -13070 -3339 1716 819 2310 -2252 9215
7486 9215 24963 15266 13312 319 -14534 4203 14669 11935 8644 -3291 -21027 -10945 5372
7473 5372 7626 -17850 -26073 -22307 -13935 -5379 -3718 -8223 -10591 1265 -28979 -34285 -20018 -28445
7459 -28445 -35496 -30683 -22847 -8126 -1366 6274 690 7480 390 26605 32742 16239 3391 -6337
$$ packed form
7554B3428n042q057N250l173l4121k4491J1455J509J1360n509q52n344J4421K6519
7540G353N976q13r47k1295n648n785l349J285r738K266J9735L7654K4531j6428
7526C4797N911j191Q60r954j2063k3412k7732j3550J0246L2030J4692N916J0240
7513B6790r970N647j8199j9821n255P411P776J4810J2275j0283q633q851m513
7500a0816R207j059J7728k628j8652j8677k66J2093R731N055q97J491m562J1467
7486I215J5748r697j954j2993j4853J8737J0466k734l291j1935j7736J0082J6317
7473E372K254k5476q223L766Q372Q556J661m505k368J1856l0244n306J4267q427
7459b8445p051M813P836J4721O760P640n584O790p090K6215O137j6503j2848r728
$$ plain form
7445 -6337 -1207 -6204 -20745 -2606 11834 7130 -729 -16751 -25689 -45323 -47032 -18867 12572
7432 12572 40995 46675 39895 43963 24856 18001 5101 -17655 -17368 -8988 -26065 -22692 -28545 -24839
7418 -24839 -3573 -9159 -14135 -2950 -1635 -12011 -22040 -22272 -11017 7354 -2900 -23589 -23785
7405 -23785 -14222 -31305 -31420 -43986 -29448 -36701 -20068 -4246 -7803 -12409 -14153 -26208 -27054 -13240
7391 -13240 -1413 -23901 -25431 -8355 -13485 -19143 -30012 -41399 -27499 -10202 -10017 3526 9100
7378 9100 -2434 -12022 -21629 -26458 -10744 -17933 -44488 -43475 -38268 -18154 -8250 -19055 -1718
7365 -1718 20540 2510 -13584 -18910 -22388 -4295 -6144 8769 16272 26468 46828 75611 58843
7352 58843 24269 5603 2590 5139 1675 -9096 -9169 -7117 124 4152 10187 12336 9208 1791
$$ packed form
7445f337N130m997j4541J8139J4440m704p859j6022q938j9634j709K8165L1439
7432A2572K8423N680o780M068j9107o855j2900k2756K87Q380j7077L373n853L706
7418b4839K1266n586m976J1185J315j0376j0029k32J1255J8371j0254k0689j96
7405b3785R563j7083j15j2566J4538p253J6633J5822l557m606j744j2055q46J3814
7391a3240J1827k2488j530J7076n130n658j0869j1387J3900J7297J85J3543N574
7378I100j1534r588r607m829J5714p189k6555J013N207K0114R904j0805J7337
7365a718K2258j8030j6094n326l478J8093j849J4913P503J0196K0360K8783j6768
7352E8843l4574j8666l013K549l464j0771p3K052P241M028O035K149l128p417
$$ plain form
7338 1791 1142 18214 -6636 -23665 2706 5298 -15530 -40263 -60540 -67772 -45816 -16393 -8644
7325 -8644 4264 -1659 2896 -3853 -13525 -17854 3485 13446 23204 34910 26085 949 8268 9428
7311 9428 6759 5142 -2956 -3888 6694 3670 15001 17628 14028 29237 16076 5114 -16341 -37649
7297 -37649 -32927 -20616 -23507 -18818 245 11058 27816 24580 23509 13113 -11512 -43666 -44379
7284 -44379 -25751 -308 22006 13418 -8687 7775 36195 42395 29079 10612 6433 -1871 16076
7271 16076 8246 -4417 -15291 -19535 -27517 -16874 -12264 -20149 -33183 -48801 -60785 -20412 -4854
7258 -4854 -8472 -124 -969 -16128 -8380 -5106 3617 9273 19443 13320 -26061 -47471 -43959 -24602
7244 -24602 -27239 -28195 -16934 -21305 -20308 -23053 -35234 -38574 -43538 -51077 -35783 -11667 -19667 -26713
$$ packed form
7338A791o49J7072k4850j7029K6371K592k0828k4733k0277p232K1956K9423P749
7325h644J2908n923M555o749r672m329K1339R961R758J1706q825k5136P319J160
7311I428k669j617q098r32J0582l024J1331K627l600J5209j3161j0962k1455k1308
7297c7649M722J2311k891M689J9063J0813J6758l236j071j0396k4625l2154p13
7284d4379J8628K5443K2314q588k2105J6462K8420O200j3316j8467m179q304J7947
7271A6076p830j2663j0874m244p982J0643M610p885j3034j5618j1984M0373J5558
7258d854l618Q348q45j5159P748L274Q723N656J0170o123l9381k1410L512J9357
7244b4602k637r56J1261m371R97k745j2181l340m964p539J5294K4116q000p046
$$ plain form
7230 -26713 -4920 -3228 -6044 -1787 16600 38007 26450 29381 39343 51097 29949 15051 14697
7217 14697 9354 -1305 -5044 -9593 -13322 -13508 -17676 -8258 -1710 -11787 -8957 4950 -15191 -26728
7203 -26728 -31956 -47217 -34956 -30978 -13798 -1290 3505 -4416 -15375 -13806 -9545 -10665 -14639
7190 -14639 -10098 5190 17923 25097 -11160 -58806 -48017 -21964 3151 37526 31754 20326
7178 20326 -8547 -11378 9420 15119 13836 16289 -510 421 -9698 -10402 -22075 -14908 7929 17222
7164 17222 642 -19531 -16343 -4085 -17031 -9537 11326 18477 17080 -4563 6669 26549 15329
7151 15329 -2964 -9165 -8451 -14300 -23777 -43731 -31184 -53502 -54167 -15403 7854 -13495 11507
7138 11507 18917 4258 -8127 -24845 -21066 -4905 -2618 20683 32432 13069 7808 5096 11082
$$ packed form
7230b6713K1793J692k816M257J8387K1407j1557K931R962J1754k1148j4898l54
7217A4697n343j0659l739m549l729j86m168R418O548j0077K830J3907k0141j1537
7203b6728n228j5261J2261L978J7180J2508M795p921j0959J569M261j120l974
7190a4639M541J5288J2733P174l6257m7646J0789K6053K5115L4375n772j1428
7178B0326k8873k831K0798N699j283K453j6799R31j0119p04j1673P167K2837R293
7164A7222j6580k0173L188J2258j2946P494K0863P151j397k1643J1232J9880j1220
7151A5329j8293o201P14n849r477j9954J2547k2318o65L8764K3257k1349K5002
7138A1507P410j4659j2385j6718L779J6161K287K3301J1749j9363n261k712N986
$$ plain form
7125 11082 8952 1990 -11705 17544 42316 42215 31395 24040 5883 -9181 -23069 -25305 -24423
7112 -24423 -26141 -1987 20791 4850 -30675 -38037 -25864 5144 6695 297 -16692 -29860 -48658
7099 -48658 -32337 -9122 -20867 -34723 -36500 -24689 -4380 12513 2408 2638 -1286 -7866 -11056
7086 -11056 -575 8584 7472 10636 2586 -8837 -2621 15739 26657 -380 -5027 -3335 463
7073 463 -3895 -10891 -13453 -6592 3651 -1609 -10789 -20412 -11192 -17747 -26243 -24950 6830 2542 5997
7058 5997 1356 -11912 -12592 14695 19588 7469 -8289 -7541 -1999 -462 -3207 7899 -10928 -23866
7044 -23866 -21970 -853 23516 6168 16363 14578 -14104 7004 15011 31292 27656 10037 9868
7031 9868 13321 12139 -13044 -33352 -22940 -40900 -38442 -16497 -25094 -39573 -6378 -11258 -6419
$$ packed form
7125A1082k130o962j3695K9249K4772j01j0820p355j8157j5064j3888k236Q82
7112b4423j718K4154K2778j5941l5525p362J2173L1008J551o398j6989j3168j8798
7099d8658J6321K3215j1745j3856j777J1811K0309J6893j0105K30l924o580l190
7086a1056J0481R159j112L164q050j1423O216J8360J0918k7037m647J692L798
7073D63m358o996k562O861J0243n260r180r623R220o555q496J293L1780m288L455
7058E997m641j3268o80K7287M893j2119j5758P48N542J537k745J1106j8827j2938
7044b3866J896K1117K4369j7348J0195j785k8682K1108Q007J6281l636j7619j69
7031I868L453j182k5183k0308J0412j7960K458K1945q597j4479L3195m880M839
$$ plain form
7018 -6419 -556 6074 2940 8430 2247 -16887 -2408 10686 -10034 -11515 -18300 -11205 -21372 -27280
7004 -27280 -9612 13210 46619 43977 17026 18795 29960 35393 11439 -19098 -13151 -2045 2908
6991 2908 -11072 -24891 -48080 -25252 -13620 9339 21728 21061 38030 46190 46752 34110 41165
6978 41165 30786 12105 3467 5362 458 -7093 -1493 -6144 -41413 -32282 -10016 -4907 6270
6965 6270 -16871 -33718 -28500 -22885 -36721 -12898 9916 11413 8525 8143 -23536 -37243 -19461
6952 -19461 -28374 -10018 4550 18327 28073 38803 10986 -1123 -19015 -33193 -53944 -35811
6940 -35811 6585 28388 19029 10931 26642 45191 44733 36470 18573 19837 23321 12849 -2474
6927 -2474 14790 11360 17897 24679 17701 -3986 -15247 3557 28960 24981 14596 -4279 -15438
$$ packed form
7018f419N863O630l134N490o183j9134J4479J3094k0720j481o785P095j0167n908
7004b7280J7668K2822L3409k642k6951J769J1165N433k3954l0537N947J1106M953
6991B908j3980j3819k3189K2828J1632K2959J2389o67J6969Q160N62j2642P055
6978D1165j0379j8681q638J895m904p551N600m651l5269R131K2266N109J1177
6965F270k3141j6847N218N615j3836K3823K2814J497k888l82l1679j3707J7782
6952a9461q913J8356J4568J3777R746J0730k7817j2109j7892j4178k0751J8133
6940c5811M2396K1803r359q098J5711J8549m58q263j7897J264L484j0472j5323
6927b474J7264l430O537O782o978k1687j1261J8804K5403l979j0385j8875j1159
$$ plain form
6914 -15438 -16994 -22747 -10737 -26755 -28493 8063 25265 13516 11042 9692 5426 -5509 -14573
6901 -14573 -9094 -7838 1124 10434 1777 -8403 -5745 -142 -2468 -20405 -14009 10224 14521 10184
6887 10184 -684 4530 -253 -8730 -13634 2010 -3742 -10731 -5883 -7286 -2839 -5990 -1771 -813
6873 -813 -8350 -26726 -31162 -24262 -3941 -135 -2495 5001 10994 -1946 -21221 -14111 9163 23381
6859 23381 24307 32244 37359 -5951 -38816 -41880 -20726 -13502 -10133 4616 4248 14567 11220 2738
6845 2738 -16214 -8741 4278 9712 -13055 -37089 -63033 -72341 -36644 -16976 -14036 -38551 -39265
6832 -39265 -19809 -24189 -3386 18012 9898 -6247 -19502 -9234 -14126 -5464 14896 471 -38015
6819 -38015 -30959 -20055 -24891 -42886 -38681 6369 -694 -22935 -21870 -3612 -158 -6067 20053
$$ packed form
6914a5438j556n753J2010j6018j738L6556J7202j1749k474j350m266j0935r064
6901a4573N479J256Q962R310q657j0180K658N603k326j7937O396K4233M297m337
6887A0184j0868N214m783q477m904J5644n752o989M848j403M447l151M219R58
6873h13p537j8376m436O900K0321L806k360P496N993j2940j9275P110K3274J4218
6859B3381R26P937N115m3310l2865l064K1154P224L369J4749l68J0319l347q482
6845B738j8952P473J3019N434k2767k4034k5944r308L5697J9668K940k4515p14
6832c9265J9456m380K0803K1398q114j6145j3255J0268m892Q662K0360j4425l8486
6819c8015P056J0904m836j7995M205M5050p063k2241J065J8258L454n909K6120
$$ plain form
6806 20053 5036 -41834 -58499 -44684 -58038 -64085 -51382 -31728 -23436 -7806 -19306 -19689 -13378
6793 -13378 -26421 -22737 -19059 -29677 -34290 -27111 -2045 8091 17371 17930 -20518 -30964 -28876
6780 -28876 -28751 -16575 -16835 -18049 -9319 -1605 2951 9940 31989 36991 51899 51515 30742 50190
6766 50190 90442 124917 150225 156854 185775 184622 188339 162587 122002 93273 89155 74160 42520
6753 42520 34282 38986 34881 22009 -1053 8289 -12605 -25874 -18291 -5068 -6230 24062 47792
6740 47792 35707 32194 15315 3230 16582 14367 38129 40827 26398 17489 14996 25937 7373
6727 7373 122 8350 25978 28601 2553 -10538 -17473 -128 24882 3674 17552 19017 -5940
6714 -5940 3647 8189 15438 3020 -1729 -7770 6359 -1859 -19589 -41748 -28431 -8898 10655
$$ packed form
6806B0053j5017m6870j6665J3815j3354o047J2703J9654Q292J5630j1500l83O311
6793a3378j3043L684L678j0618m613P179K5066J0136R280N59l8448j0446K088
6780b8876J25J2176k60j214Q730P714M556O989K2049N002J4908l84k0773J9448
6766E0190M0252L4475K5308O629K8921j153L717k5752m0585k8729m118j4995l1640
6753D2520q238M704m105j2872k3062R342k0894j3269P583J3223j162L0292K3730
6740D7792j2085l513j6879j2085J3352k215K3762K698j4429q909k493J0941j8564
6727G373p251Q228J7628K623k6048j3091o935J7345K5010k1208J3878J465k4957
6714e940R587M542P249j2418m749o041J4129q218j7730k2159J3317J9533J9553
$$ plain form
6701 10655 3328 15589 16109 11481 13262 23129 25407 38273 30157 30824 15204 5682 11058 24214
6687 24214 29791 10103 -1291 15273 38877 25381 21308 -3703 -20568 -4458 11392 5031
6675 5031 -26156 -158 15291 29648 4326 -4026 -4551 -6231 -17294 9650 4470 18758 21708
6662 21708 -14044 -61355 -59368 -52719 -47511 -28460 -14902 11958 16968 5854 3614 607 10704
6649 10704 10468 14266 1423 1940 800 -13277 -42745 -48323 -23846 -23223 -33543 -26961 -20573 -26856
6635 -26856 -29110 -10159 -8301 -9821 -30447 -25190 -5791 -319 -3424 -28346 -20742 -25470 -7611
6622 -7611 -2587 -15324 -3872 3872 48 -1841 9715 1604 -43746 -71696 -35989 -38660 -36267
6609 -36267 -7962 -1357 3804 5515 -11303 -5399 30670 29885 17394 9383 13492 23785 14161 5801
$$ packed form
6701A0655p327J2261N20m628J781R867K278J2866q116O67j5620r522N376J3156
6687B4214N577j9688j1394J6564K3604j3496m073k5011j6865J6110J5850o361
6675E031l1187K5998J5449J4357k5322q352n25j680j1063K6944n180J4288K950
6662B1708l5752m7311J987O649N208J9051J3558K6860N010j1114k240l007J0097
6649A0704k36L798j2843N17j140j4077k9468n578K4477O23j0320O582O388o283
6635b6856k254J8951J858j520k0626N257J9399N472l105k4922P604m728J7859
6622g611N024j2737J1452P744l824j889J1556q111m5350k7950L5707k671K393
6609c6267K8305O605N161J711j6818N904L6069p85j2491q011M109J0293r624q360
$$ plain form
6595 5801 -9270 -6279 9906 11605 454 6498 -7394 -5538 -5222 -22080 -31462 -43024 -48497 -37098
6581 -37098 -37575 -32130 -25211 -13144 -31428 -29608 -12138 -13040 -1993 10172 -1947 -31761 -66086
6568 -66086 -57018 -50598 -52088 -46100 -30114 -11306 4946 5750 -16010 -6519 -3414 -20760 -8134
6555 -8134 13077 24709 8329 5199 6095 10174 -9976 -22534 -6366 243 -5672 -22559 -12559
6542 -12559 -24159 -36265 -30054 -24092 -22550 -581 -33096 -44438 -37275 -49441 -35257 -14648 -1393
$$ packed form
6595E801j5071K991J6185J699j1151O044j3892J856L16j6858r382j1562n473J1399
6581c7098m77N445O919J2067j8284J820J7470r02J1047J2165j2119k9814l4325
6568f6086R068O420j490N988J5986J8808J6252Q04k1760R491L105j7346J2626
6555h134K1211J1632j6380l130Q96M079k0150j2558J6168O609n915j6887J0000
6542a2559j1600j2106O211N962J542K1969l2515j1342P163j2166J4184K0609J3255
$$ [...]
##END NTUPLES=NMR SPECTRUM
##END=
