##TITLE=Analysis number 320725
Compound Code cc 44239
Book Reference 468/107
Project Code adrs
Chemist Name colinb
##JCAMPDX= 6.0         $$ Bruker NMR JCAMP-DX V2.0
##DATA TYPE= NMR SPECTRUM
##DATA CLASS= NTUPLES
##ORIGIN= Bruker BioSpin GmbH
##OWNER= nmr
$$ XWIN-NMR		Version 3.5
$$ Thu Jul  6 14:42:31 2006 GMT Daylight Time (UT+1h)  MAYBRIDGE\nmr@NMR_250MHZ
##.OBSERVE FREQUENCY= 250.131544655141
##.OBSERVE NUCLEUS= ^1H
##.ACQUISITION MODE= SIMULTANEOUS (DQD)
##.ACQUISITION SCHEME= undefined
##.AVERAGES= 16
##.DIGITISER RES= 18
##SPECTROMETER/DATA SYSTEM= dpx250
##.PULSE SEQUENCE= zg30
##.SOLVENT NAME= CDCl3
##.SHIFT REFERENCE= (INTERNAL, CDCl3, 0, 16.4356)
##AUDIT TRAIL= $$ (NUMBER, WHEN, WHO, WHERE, WHAT)
$$ ##TITLE= Audit trail, XWIN-NMR		Version 3.5
$$ ##JCAMPDX= 5.01
$$ ##ORIGIN= Bruker BioSpin GmbH
$$ ##OWNER= nmr
$$ C:\u/data/dgb/nmr/ADRS/2440/pdata/1/auditp.txt
$$ ##AUDIT TRAIL=  $$ (NUMBER, WHEN, WHO, WHERE, WHAT)
(   1,<2006-07-06 14:41:53.71 +100>,<MAYBRIDGE\nmr>,<NMR_250MHZ>,
      <created by zg, POWCHK disabled, PULCHK disabled
       configuration hash MD5:
       E2 DF 36 D8 04 B2 41 60 5A D7 A3 38 5A 4B D0 FE
       data hash MD5: 64K
       57 F7 74 A7 7C 61 E0 B6 28 A1 D6 71 D3 C6 A3 5B>)
(   2,<2006-07-06 14:42:13.67 +100>,<MAYBRIDGE\nmr>,<NMR_250MHZ>,
      <Start of raw data processing
       ef LB = 0.3 FT_mod = 6 PKNL = 1 SI = 32K 
       data hash MD5: 32K
       38 0F 8E B2 04 92 1D B9 7A 7C 35 94 CB 85 2E 9C>)
(   3,<2006-07-06 14:42:17.72 +100>,<MAYBRIDGE\nmr>,<NMR_250MHZ>,
      <apk 
       data hash MD5: 32K
       63 7B 68 AD 84 B8 E2 E8 5A E4 DC 7C C4 38 0C A0>)
(   4,<2006-07-06 14:42:19.14 +100>,<MAYBRIDGE\nmr>,<NMR_250MHZ>,
      <abs ABSG = 5 
       data hash MD5: 32K
       72 87 CC A8 C0 04 6F 87 46 64 3C BB 28 21 A7 24>)
$$ ##END=
$$ 
$$ hash MD5
$$ 45 81 AA 31 38 6E C3 96 B3 84 F1 1A FD 81 72 3A
##$RELAX= 
##$RELAX= 
##$RELAX= 
##$RELAX= 
##$RELAX= 
##$RELAX= 
##$RELAX= 
$$ Bruker specific parameters
$$ --------------------------
##$DU= <C:\u>
##$EXPNO= 2440
##$NAME= <ADRS>
##$PROCNO= 1
##$TYPE= <nmr>
##$USER= <dgb>
##$AMP= (0..31)
100 100 100 100 100 100 100 100 100 100 100 100 100 100 100 100 100 100 
100 100 100 100 100 100 100 100 100 100 100 100 100 100 
##$AQSEQ= 0
##$AQ_mod= 3
##$AUNM= <au_zg>
##$AUTOPOS= <41 >
##$BF1= 250.13
##$BF2= 250.13
##$BF3= 250.13
##$BF4= 250.13
##$BF5= 500.13
##$BF6= 500.13
##$BF7= 500.13
##$BF8= 500.13
##$BYTORDA= 1
##$CFDGTYP= 0
##$CFRGTYP= 5
##$CHEMSTR= <none>
##$CNST= (0..31)
1 1 145 1 1 1 1 1 1 1 1 1 1 1 1 1 1 1 1 1 1 1 1 1 1 1 1 1 1 1 1 1 
##$CPDPRG= <>
##$CPDPRG1= <>
##$CPDPRG2= <>
##$CPDPRG3= <>
##$CPDPRG4= <mlev>
##$CPDPRG5= <mlev>
##$CPDPRG6= <mlev>
##$CPDPRG7= <mlev>
##$CPDPRG8= <mlev>
##$CPDPRGB= <>
##$CPDPRGT= <>
##$D= (0..31)
0 1 0 0 0 0 0 0 0 0.06 0 0 0 0 0 0 0.0002 0 0 0 0 0 0 0 0 0 0 0 0 0 0 
0 
##$DATE= 1152193312
##$DBL= (0..7)
120 120 120 120 120 120 120 120 
##$DBP= (0..7)
150 150 150 150 150 150 150 150 
##$DBP07= 0
##$DBPNAM0= <>
##$DBPNAM1= <>
$$ [...]
##$SUBNAM7= <"">
##$SUBNAM8= <"">
##$SUBNAM9= <"">
##$SW= 20.6930455092707
##$SWIBOX= (0..15)
0 0 3 0 0 0 0 0 0 0 0 0 0 0 0 0 
##$SW_h= 5175.983436853
##$TD= 65536
##$TD0= 1
##$TE= 295.16
##$TE2= 300
##$TE3= 300
##$TEG= 300
##$TL= (0..7)
0 120 120 120 120 120 120 120 
##$TP= (0..7)
150 150 150 150 150 150 150 150 
##$TP07= 0
##$TPNAME0= <>
##$TPNAME1= <>
##$TPNAME2= <>
##$TPNAME3= <>
##$TPNAME4= <>
##$TPNAME5= <>
##$TPNAME6= <>
##$TPNAME7= <>
##$TPOAL= (0..7)
0.5 0.5 0.5 0.5 0.5 0.5 0.5 0.5 
##$TPOFFS= (0..7)
0 0 0 0 0 0 0 0 
##$TUNHIN= 0
##$TUNHOUT= 0
##$TUNXOUT= 0
##$USERA1= <user>
##$USERA2= <user>
##$USERA3= <user>
##$USERA4= <user>
##$USERA5= <user>
##$V9= 5
##$VALIST= <valist>
##$VCLIST= <CCCCCCCCCCCCCCC>
##$VD= 0
##$VDLIST= <DDDDDDDDDDDDDDD>
##$VPLIST= <PPPPPPPPPPPPPPP>
##$VTLIST= <TTTTTTTTTTTTTTT>
##$WBST= 1024
##$WBSW= 4
##$XGAIN= (0..3)
0 0 0 0 
##$XL= 0
##$YL= 0
##$YMAX_a= 503106
##$YMIN_a= -542653
##$ZGOPTNS= <>
##$ZL1= 120
##$ZL2= 120
##$ZL3= 120
##$ZL4= 120
##$ABSF1= 16.43565
##$ABSF2= -4.257523
##$ABSG= 5
##$ABSL= 3
##$ALPHA= 0
##$AQORDER= 0
##$ASSFAC= 0
##$ASSFACI= 0
##$ASSFACX= 0
##$ASSWID= 0
##$AUNMP= <proc_1d>
##$AZFE= 0.1
##$AZFW= 0.1
##$BCFW= 0
##$BC_mod= 0
##$BYTORDP= 0
##$COROFFS= 0
##$CY= 12.5
##$DATMOD= 1
##$DC= 0
##$DFILT= <>
##$DTYPP= 0
##$F1P= 14.0000005364418
##$F2P= -0.99999901652339
##$FCOR= 0.5
##$FTSIZE= 32768
##$FT_mod= 6
##$GAMMA= 0
##$GB= 0
##$INTBC= 1
##$INTSCL= 1
##$ISEN= 128
##$LB= 0.3
##$LEV0= 0
##$LPBIN= 0
##$MAXI= 10000
##$MC2= 0
##$MEAN= 0
##$ME_mod= 0
##$MI= 0
##$NCOEF= 0
##$NC_proc= -2
##$NLEV= 6
##$NOISF1= 0
##$NOISF2= 0
##$NSP= 0
##$NTH_PI= 0
##$NZP= 0
##$OFFSET= 16.43565
##$PC= 1
##$PHC0= 162.0271
##$PHC1= 7.974033
##$PH_mod= 1
##$PKNL= yes
##$PPARMOD= 0
##$PSCAL= 4
##$PSIGN= 0
##$REVERSE= no
##$SF= 250.130021597161
##$SI= 32768
##$SIGF1= 0
##$SIGF2= 0
##$SINO= 400
##$SIOLD= 32768
##$SREGLST= <1H.CDCl3>
##$SSB= 0
##$STSI= 32768
##$STSR= 0
##$SW_p= 5175.98343685301
##$SYMM= 0
##$S_DEV= 0
##$TDeff= 65536
##$TDoff= 0
##$TI= <Analysis number 999999
Compound Code 99
Book Reference 9
Project Code 9>
##$TILT= no
##$TM1= 0
##$TM2= 0
##$TOPLEV= 0
##$USERP1= <user>
##$USERP2= <user>
##$USERP3= <user>
##$USERP4= <user>
##$USERP5= <user>
##$WDW= 1
##$XDIM= 32768
##$YMAX_p= 385547544
##$YMIN_p= -169634
$$ End of Bruker specific parameters
$$ ---------------------------------
##NTUPLES= NMR SPECTRUM
##VAR_NAME=  FREQUENCY,     SPECTRUM/REAL,   SPECTRUM/IMAG
##SYMBOL=    X,             R,               I
##VAR_TYPE=  INDEPENDENT,   DEPENDENT,       DEPENDENT
##VAR_FORM=  AFFN,          ASDF,            ASDF
##VAR_DIM=   32768,         32768,           32768
##UNITS=     HZ,            ARBITRARY UNITS, ARBITRARY UNITS
##FACTOR=    0.157963299565203, 1,           1
##FIRST=     4111.04945740326, 0,            0
##LAST=      -1064.93397944975, 0,           0
##MIN=       -1064.93397944975, -169634,     0
##MAX=       4111.04945740326, 385547544,    0
$$ Real data points
##PAGE= N=1
##DATA TABLE= (X++(R..R)), XYDATA
$$ [...]
15285G81K899J1822j1692r351J664p581k793P317P412K754n43q398j0657P586
$$ 781 3680 15502 3810 -5541 -3877 -11458 -14251 -6934 478 3232 2689 -5709 -16366 -8780
15271h780J1657L286j3472k971j255K552L517p565M863l255q685k274L135J8466
$$ -8780 2877 6163 -7309 -10280 -11535 -8983 -5466 -13031 -8168 -11423 -20108 -22382 -19247 -781
15257g81M615p982l558L344J904O860M553k995k189p111q647j0499N963N532P339
$$ -781 3834 -4148 -7706 -4362 -2458 4402 8955 5960 3771 -3340 -11987 -22486 -16523 -10991 -3652
15242c652Q139n590j2778j8557J3192K3518N259j2977n84m155k22P684L873n688
$$ -3652 4487 -1103 -13881 -32438 -19246 4272 9531 -3446 -4030 -8185 -8407 -723 3150 -2538
15228b538m222m752k097J2005K1491J473K839n376l572j4616r684L763p861P505
$$ -2538 -6760 -11512 -13609 -1604 19887 21360 24199 18823 15251 635 -9049 -5286 -13147 -5642
15214e642r589n439N024O025r23m922J568J3575O644j0216p24K041k776O113P185
$$ -5642 -15231 -20670 -15646 -9621 -10544 -15466 -13898 -323 6321 -3895 -4619 -2578 -5354 759 7944
15199G944J699l028j0766K679Q242j350N750r314j3348l096j058K971L651j060
$$ 7944 9643 6615 -4151 -1472 6770 5420 11170 1856 -11492 -14588 -15646 -12675 -9024 -10084
15185a0084o69q63L990M706Q041Q293k677j9998l489N265N451Q94k70q220J0568
$$ -10084 -10753 -11616 -7626 -2920 5121 13414 10737 -9261 -12750 -7485 -2034 -1140 -1410 -9630 938
15170I38J4835j239j8406j5360J7209R190r851m042o20P869K851j975l723K296
$$ 938 15773 14534 -3872 -19232 -2023 7167 -2684 -6726 -7346 523 3374 1399 -2324 -28
15156b8M855j2137n252J332J214P072P257M791l963j0047N00O296j1733j562J8514
$$ -28 4827 -7310 -12562 -11230 -10016 -2944 4313 9104 5141 -4906 -4406 1890 -9843 -11405 7109
15141G109j750p196rr513q955P484O918p523p717J2295j589K282J270m757n896
$$ 7109 5359 -1837 -1846 -11359 -20314 -12830 -5912 -13435 -21152 -8857 -10446 -8164 -6894 -11651 -17547
15126a7547K122l263Q07J4155J1814K982j2342m594o404r551o027p17Q184O722
$$ -17547 -15425 -18688 -17881 -3726 8088 11070 -1272 -5866 -12270 -21821 -27848 -28565 -20381 -13659
15112a3659P625n45L175O814J280r155r030O494J4269K288p91j067l561J2044
$$ -13659 -6034 -6579 -3404 3410 4690 -4465 -13495 -7001 7268 9556 8765 7698 4137 16181
15098A6181l964q748m412j5850j643l108N107J679m894n606R879O233K15m995
$$ 16181 12217 3469 -943 -16793 -18436 -21544 -16437 -14758 -19652 -25258 -15379 -9146 -8931 -13926
15084a3926l93R099j132O380J734J349K591N527R47j2875j3575K661R639o520
$$ -13926 -14319 -5220 -6352 28 1762 3111 5702 11229 12176 -699 -14274 -11613 -1974 -8494
15070h494j0499p588p16J6582J1067j49j3040p104j416L073N319L867r56K095
$$ -8494 -18993 -26581 -27297 -10715 352 203 -12837 -19941 -21357 -18284 -12965 -9098 -10054 -7959
15056g959n135N632n799O584m751n182J606J0037J2125l762j985j589j999J940
$$ -7959 -13094 -7462 -13261 -6677 -11428 -16610 -15004 -4967 7158 3396 1411 -178 -2177 -237
15042b37k028m219j790o746k247o490m625R084L940P212J496k882M81J872M422
$$ -237 -2265 -6484 -8274 -15020 -17267 -23757 -28382 -19298 -15358 -8146 -6650 -9532 -9051 -7179 -2757
15027b757K399J299J636o992r912l615J07J2176o156m084P851n938J999J0831
$$ -2757 -358 941 2577 -4415 -14327 -17942 -17835 -5659 -11815 -15899 -8048 -13986 -11987 -1156
15013a156J7218J1917M0l190j7182m218O979j693j2431n949J937q384K336o114
$$ -1156 16062 27979 28019 24829 7647 3429 10408 8715 -3716 -9665 -7728 -16112 -13776 -19890
14999a9890l043J0808O446p488j073J4815K313O447R994l025J484K760K040j965
$$ -19890 -22933 -12125 -5679 -13167 -14240 575 2888 9335 19329 16304 17788 20548 22588 20623
14985B0623j3467j6380p030M401q560q629J1216J7260J8719j0682j1045j1668
$$ 20623 7156 -9224 -16254 -11853 -20413 -29042 -17826 -566 18153 7471 -3574 -15242
14973a5242n08k259m54K35J3546O34q248k047M957k37L659r46n200j2072N051
$$ -15242 -15750 -18009 -18463 -18228 -4682 -4048 -12296 -14343 -9386 -9623 -5964 -6910 -12110 -24182 -19131
14958a9131P053m640j7095J4468J3979N625K095N646N20o380L089k641k877Q170
$$ -19131 -12078 -16718 -33813 -19345 -5366 259 2354 8000 8520 2140 5229 2588 -289 7881
14944G881N692r94o310K376R623n859L741K662N772j2319p566R195N757k1727
$$ 7881 13573 12579 6269 8645 18268 12409 16150 18812 24584 12265 4699 13894 19651 -2076
14930b076r609R495R197j891l360l639K486k818n659L327J1832J697L562N484
$$ -2076 -11685 -2190 7007 5116 1756 -1883 603 -2215 -7874 -4547 7285 8982 12544 18028
14916A8028j6139j4088K947J58Q052Q620j989l137j190j1236O524R554r271m061
$$ 18028 1889 -12199 -9252 -9094 -1042 7578 5589 2452 1262 -9974 -3450 6104 -3167 -7228
14902g228L669K134K693P354j4072j620P250J615K927j1332r551j04L098P291
$$ -7228 -3559 -1425 1268 8622 -5450 -7070 180 1795 4722 -6610 -16161 -16265 -13167 -5876
14888e876K3268J4270n408l62o099o818k818O39n085j0598K579J0536J1758O57
$$ -5876 17392 31662 26254 25892 19793 12975 10157 10796 5711 -4887 -2308 8228 19986 20643
14874B0643q385q791j5504j8843p8j145R659N042K402L771o303o30O741m048P967
$$ 20643 12258 3467 -12037 -30880 -30958 -32103 -22444 -17402 -15000 -11229 -17532 -18162 -11421 -15469 -7502
14859g502M092o694p880k387J4002J262k607n104J6602Q05l611k105M83l38K463
$$ -7502 -3410 -10104 -17984 -20371 -6369 -5107 -7714 -12818 3784 4589 978 -1127 -644 -982 1481
14844A481q685r315n684K254J981J4158J9689L771m375o775j8634m448J947O82
$$ 1481 -7204 -16519 -22203 -19949 -17968 -3810 15879 19650 15275 8500 -10134 -14582 -12635 -11953
14830a1953N476p471L961J2088Q171p509p828L995Q762k416m102n614n694K754
$$ -11953 -6477 -13948 -9987 2101 10272 2763 -5065 -1070 7692 5276 1174 -4440 -10134 -7380
14816g380N973o61n472l411m367O403L175q732m257P845M447J632K707p880l018
$$ -7380 -1407 -2068 -7540 -10951 -15318 -8915 -5740 -14472 -18729 -10884 -6437 -4805 -2098 -9978 -12996
14801a2996j880L947Q953l871o276K572K079M225J129q062q076J4305J3684Q774
$$ -12996 -14876 -10929 -1976 -5847 -12123 -9551 -7472 -3247 -2118 -10180 -18256 -3951 9733 18507
14787A8507p866m294j046O283j3249j428M489L24L363k030r377n200k433Q30j090
$$ 18507 10641 6347 5301 11584 -1665 -3093 1396 1720 5083 3053 -6324 -11524 -13957 -13127 -14217
14772a4217O610J751K413p66N12J742k532J0105L395p501k040m364L168J2500
$$ -14217 -7607 -5856 -3443 -4209 -3697 -1955 -4487 5618 9013 1512 -528 -4892 -1724 10776
14758A0776J5874r17k5025q749K5142J2773j5085J581n730p861j722K546j749
$$ 10776 26650 25733 708 -8041 17101 29874 14789 16370 10640 2779 1057 3603 1854
14745A854j3699n866N17r40m231K051J0035Q637P822K033q215o254J458Q693k498
$$ 1854 -11845 -17711 -17194 -18134 -22365 -20314 -10279 -1642 6180 8213 -2 -6256 -4798 3895 1397
14730A397O7M045r797m230J969O015k980K871M7j807k59P758k885n651l293j3371
$$ 1397 1464 5509 -4288 -8518 -6549 -534 -3514 -643 -596 -2403 -2662 5096 2211 -3440 -6733 -20104
14714b0104p537J937P564q25j0142o95R860J2667P052L136j086j2617j4893O033
$$ -20104 -27641 -25704 -18140 -18965 -29107 -29802 -19942 -7275 -223 2913 1827 -10790 -25683 -19650
14700a9650Q380m805R50Q089j167m019j0247J6623O861k154m35N820N886J210
$$ -19650 -11270 -16075 -15125 -7036 -8203 -12222 -22469 -5846 1015 -1139 -1574 4246 10132 11342
14686A1342r214k863k66M871p980K257M740q81L147O78j1625p108Q440N921L186
$$ 11342 2128 -735 -1001 3870 -4110 -1853 2887 2006 5153 5831 -5794 -12902 -4462 1459 4645
14671D645M495m112k587Q059j761l188p009q659N768p929j646O324j21N093R626
$$ 4645 9140 5028 2441 10500 8739 5551 -1458 -10117 -4349 -12278 -13924 -7600 -7721 -2628 6998
14656F998j422l945m879J073l486M934P103J99j830o570k916J058J2959K978l974
$$ 6998 5576 1631 -3248 -2175 -5661 -727 6376 6575 4745 -1825 -4741 -3683 9276 12254 8280
14641H280p995N713M614l929k692Q182l607j3910k218P717J1620k370j2060p670
$$ 8280 285 5998 10612 6683 3991 12173 8566 -5344 -7562 155 11775 9405 -2655 -10325
14627a0325o313j50m708J4694J0591o852J861l120J476R346n160m899O841P782
$$ -10325 -16638 -16788 -21496 -6802 3789 -3063 -1202 -4322 -2846 6500 1340 -3559 3282 11064
14613A1064J781q056j1125j0195N122J654m095L81M590J5200J1955j3303p436
$$ 11064 12845 4789 -6336 -16531 -11409 -9755 -13850 -13469 -8879 6321 18276 4973 -2463
14600b463k290n520n415n684k370P938R671j663k691L018L475k720l041j0959
$$ -2463 -4753 -10273 -15688 -21372 -23742 -15804 -6133 -7796 -10487 -7469 -3994 -6714 -9755 -20714
14586b0714J2086J1835j984O73K076r73l589K892p300l373J1071K190q65J0905
$$ -20714 -8628 3207 1223 1896 3972 2999 -590 2302 -4998 -8371 2700 4890 4025 14930
14572A4930Q710j6049j7682l143L466J523j2352k987K918J2231j150M522j0967
$$ 14930 23640 7591 -10091 -13234 -9768 -8245 -20597 -23584 -20666 -8435 -9585 -5063 -16030
14559a6030L094j657R836J5050N032j1215k044Q714N798O004p634M9M837o125
$$ -16030 -12936 -14593 -4757 10293 15325 4110 2066 10780 16578 22582 14948 14997 19834 13709
14545A3709m977j74j0690Q871l337q886N473J1593j689l375k968r182J771O56
$$ 13709 8732 8558 -2132 6739 3402 -5484 -11 11582 9893 6518 3550 -5632 -3861 -3205
14531c205O532J624l359J981o53l993J723l823L132m430J0032P299k0904l197
$$ -3205 3327 4951 1592 3573 2920 -1073 650 -3173 -41 -4471 5561 12860 -8044 -11241
14517a1241R828m757j2283R33J6597J9143J4466j6783j0482M382p36r112M307
$$ -11241 -1413 -6170 -18453 -17520 -923 18220 32686 15903 5421 9803 9067 -45 4262
14504D262L248O007j494P47j4039j469J5357M780j3437j5658m892N177J2198K110
$$ 4262 7510 13517 12023 12770 -1269 -2738 12619 17399 3962 -11696 -16588 -11411 787 2897
14490B897o823l919O671q014j342K629q788L831P339p358n580O153L114J080J4052
$$ 2897 -3926 -7845 -1174 -9188 -10530 -7901 -16689 -12858 -5519 -12877 -18457 -12304 -9190 -8110 5942
14475E942O407j4058n222J3220q728j3606o12J0034O942n558r339L389j24P163
$$ 5942 12349 -1709 -6931 6289 -2439 -16045 -16657 -6623 319 -5239 -14578 -11189 -11313 -4150
14461d150o512m575P918P12l377M808J222J491O840K19p892Q777l268j7152k961
$$ -4150 -10662 -15237 -7319 -6607 -9984 -5176 -3954 -2463 4377 4596 -3296 5481 2213 -14939 -17900
14446a7900J7605R656r626M743R216J276P480k51j5208j9614K12l698J912J3173
$$ -17900 -295 9361 -265 4478 13694 14970 22450 22199 6991 -12623 -12411 -16109 -14197 -1024
14432a024Q84K920m785j326Q33k512O433j115j7O576J4312m065q368m716L500
$$ -1024 -140 2780 -2005 -3331 -2498 -5010 1423 308 291 6867 21179 17114 8746 4030 7530
14417G530j22j1811j0779J2775P789j724m628J5131q676q090Q622r842N684l655
$$ 7530 7408 -4403 -15182 -2407 5382 3658 -970 14161 5485 -2605 6017 -3825 1859 -1796
14403a796M481l47P169M728p670q785q145J968l971K566J0499J473j209j991J7475
$$ -1796 2685 2338 9507 14235 6565 -2220 -10365 -8397 -12368 -9802 697 2170 961 -1030 16445
14388A6445J6131o788o214q448k118K794Q952J541q564j593R930k316r085q958
$$ 16445 32576 25788 19574 11126 9008 11802 20754 22295 13731 12138 22068 19752 10667 1709
14374A709j699M316L463j1542j1630J068J501O324p732k492N040O103j1552q75
$$ 1709 10 4326 7789 -3753 -15383 -14315 -12814 -6490 -14222 -16714 -11674 -5571 -17123 -17998
14360a7998K341M15N819k263N536L721P984K047l888J45n826l146j655j771q999
$$ -17998 -15657 -15242 -9423 -11686 -6150 -2429 5555 7602 3714 3859 -1967 -5113 -6768 -8539 -17538
14345a7538O564J3542N05j943R073M609m629j0429K403j8135l018K886N119N013
$$ -17538 -10974 2568 3073 1130 10203 14812 10183 -246 2157 -15978 -18996 -16110 -10991 -5978
14331e978K086K187O991N88p657n026K877P59o19l001m20Q436M650r824q073j2924
$$ -5978 -3892 -1705 5286 5874 -1783 -6809 -3932 -3173 -3792 -6793 -7213 1223 5873 -3951 -12024 -24948
14315b4948l916K684L820J4631l058M71J456k199P33N20k371J0473J0640j5524
$$ -24948 -28864 -26180 -22360 -7729 -10787 -10316 -8860 -11059 -10326 -9806 -12177 -1704 8936 -6588
14301f588q411R003M345J1666K1974k044j5068o989l379J913J899n243q961O696
$$ -6588 -14999 -5996 -1651 10015 31989 29945 14877 7888 4509 6422 8321 3078 -5883 813
14287H13k479k153m063j3159K683J1364O098l689O848J311q21r105l66L202O196
$$ 813 -1666 -3819 -7882 -21041 -18358 -6994 -896 -4585 2263 3574 2753 -6352 -6718 -3516 2680
14272B680M233q474j3735N628K670L131N127k109N371m157N185q73N753L29m814
$$ 2680 6913 -1561 -15296 -9668 -6998 -3867 1260 -849 4522 365 5550 4677 10430 10759 5945
14257E945j0091J367L548j5817p151J0364r45l920j46P380R935m215j626M991
$$ 5945 -4146 -2779 769 -15048 -22199 -11835 -12780 -16700 -16846 -9466 469 -3746 -5372 -381
14243c81k500m616k278j4655p473p83J5337J2622k930R171m628q318p587O6o75
$$ -381 -2881 -7497 -9775 -24430 -31903 -32686 -17349 -4727 -7657 1514 -3114 -11432 -19019 -18953 -19628
14228a9628K951P739n604Q788M279L182M883o975r349k886K659n714o892K540
$$ -19628 -16677 -8938 -14542 -5754 -1475 1707 6590 -385 -9734 -12620 -9961 -15675 -22567 -20027
14214b0027M905J5378J3496k952r534j3713O625O728n69L610l863r290P689m061
$$ -20027 -15122 256 13752 10800 1266 -12447 -5822 906 337 3947 84 -9206 -1517 -5578
14200e578N87k33L869Q918m950m519K087N376l595K819P664N715J1347P497J002
$$ -5578 -4991 -5224 -1355 7563 2613 -1906 181 5557 1962 4781 12445 18160 29507 37004 38006
14185C8006o472j7499O406k972j0154l109n048k641M475o114o913o269K132l103
$$ 38006 31534 14035 20441 17469 7315 4206 -842 -3483 992 -5122 -12035 -18304 -16172 -19275
14171a9275O706J6852K849j284k099K543j3K008q260N406k216p174n681n974k89
$$ -19275 -12569 4283 7132 5848 3749 6292 6279 8287 27 5433 3217 -3957 -9638 -15612 -15901
14156a5901O365P976K694n273j1990k363J4199N353l416m542q900K101K931J0358
$$ -15901 -9536 -1560 1134 -4139 -16129 -18492 -4293 1060 -2356 -6898 -15798 -13697 -10766 -408
14142d08m649K80o019M751J0031j857j813j1374k602k179k255O966J3955Q440
$$ -408 -5057 -4777 -10796 -6045 3986 2129 316 -11058 -13660 -15839 -18094 -11128 2827 11267
14128A1267q632k89N500n087j2691O891Q330l893l348o118P186Q555J305M951
$$ 11267 2635 2346 7846 2759 -9932 -3041 5289 1396 -1952 -8070 -884 7671 8976 13927
14114A3927k051J78L061O594j303p902j1386n677k021L651N002K965j1526n984
$$ 13927 11876 12054 15115 21709 20406 12504 1118 -4559 -6580 -2929 2073 5038 -6488 -12472
14100a2472m440Q53N884J971J104L820o186M766J376Q20r467n960L252N612p98
$$ -12472 -16912 -16059 -10175 -8204 -7100 -3280 -9466 -4700 -3324 -2504 -11971 -17931 -14679 -9067 -9865
14085i865k300J4915L471K177J052n329J528l059l693j875P983p444j0284N008
$$ -9865 -12165 2750 6221 8398 9450 4121 5649 2590 -1103 -2978 5005 -2439 -12723 -7715
14071g715M683K797o345n764k547J848K245k106l454j670j4920j961N944Q235
$$ -7715 -3032 -235 -6580 -12344 -14891 -13043 -10798 -12904 -16358 -18028 -32948 -34909 -28965 -20730
14057b0730P848M351O533K986j751r904N857M374Q212j1822j1865P759O308m300
$$ -20730 -12882 -8531 -1998 988 -763 -10667 -4810 -436 7776 -4046 -15911 -8152 -1844 -6144
14043f144l527l595k348j2371q41N039J5917O710j2652L832J4503j840M090K487
$$ -6144 -9671 -13266 -15614 -27985 -28826 -23787 -7870 -1160 -13812 -9980 4523 2683 6773 9260
14029I260M329o116j2495p085o022R780J4289N55k747k258j0742r385R0L004M61
$$ 9260 13589 7473 -5022 -12107 -18129 -8349 5940 6495 3748 1490 -9252 -18637 -18547 -15543 -15082
14014a5082J7196R072J108l082l071K39P791O309m425N13K454m910o611J292O663
$$ -15082 2114 11186 12294 9212 6141 6380 14171 20480 16055 16568 19022 14112 7501 8793 15456
13999A5456m502o804j5444o359K562K720P257J0233N417L167p83l630m280m190
$$ 15456 10954 4150 -11294 -17653 -15091 -12371 -5114 5119 10536 13703 12920 9290 5010 820
13985H20K086m286n067o035j5022J645J1299J0986J875o054r066n002p169m596
$$ 820 2906 -1380 -6447 -12482 -27504 -25859 -14560 -3574 -1699 -7753 -16819 -21821 -28990 -33586
13971c3586Q897O937J7715K0284o544j4996N569l58l838k135L510K39J242j737
$$ -33586 -24689 -17752 -37 20247 13703 -1293 4276 3918 80 -2055 1455 1694 2936 1199
13957A199o031p43J699K147J2347Q622r92j4282J885j363L954q164j225R561J2418
$$ 1199 -4832 -5575 -3876 -1729 10618 19240 18248 3966 5851 4488 8442 278 -947 8614 21032
13942B1032l212j5741j4407K943J1840J72j401J6897J0113j0020j746M099l935
$$ 21032 17820 2079 -12328 -9385 2455 2627 1226 18123 28236 18216 16470 20569 16634
13929A6634M992M917n478l147n939n713n676k734m183Q17O778o243k790R795O819
$$ 16634 21626 26543 21065 17918 11979 6266 590 -2144 -6327 -5510 1268 -4975 -7765 2030 8849
13914H849q303l285J0743J302j842r004K380j78J569l352J4725R118k586k504
$$ 8849 546 -2739 8004 9306 7464 -1540 840 662 2231 -1121 13604 22722 20136 17632
13900A7632l839p063m647j0833m418q500N294J929J2118P211m715o017J5558P138
$$ 17632 13793 6730 2083 -8750 -13168 -21668 -16374 -14445 -2327 4884 169 -5848 9710 16848
13886A6848o666j5770j554P603j166n333N39l000J1845p01m121p392p040K283
$$ 16848 10182 -5588 -7142 461 -705 -6038 -5499 -8499 3346 2645 -1476 -8868 -15908 -13625
13872a3625M966P839J1134n036m315R147J7215l43m771m7o991j7341m400N610
$$ -13625 -8659 -820 10314 5278 963 10110 27325 26982 22211 22164 15173 -2168 -6568 -958
13858i58J3172L793o556n13l812K349m768q158o274o479P251L879N143N886M14
$$ -958 12214 16007 9451 8938 5126 7475 2707 -5451 -11725 -18204 -10953 -7074 -1931 3955 4369
13843D369P43M56j3999j3170J2380R485P082M314M3m184j7513l220J558Q796J085
$$ 4369 5112 5568 -8431 -21601 -9221 264 7346 11660 11703 7519 -9994 -13214 -11656 -2860 -1775
13828a775m301M723J688j680l317l179M327K0659p57j527J145p432l569O785j641
$$ -1775 -6076 -1353 335 -1345 -4662 -7841 -3514 17145 16388 14861 16006 8574 5005 11790 10149
13813A0149q347J472j1573m312J1874N509K245k713l728l731Q99K778P138K809
$$ 10149 1802 3274 -8299 -12611 -737 4772 7017 4304 576 -3155 -2256 522 7660 10469
13799A0469M742l732j4975j6460L079J3914P257J1931K1J531j0318O850K387J566
$$ 10469 15211 11479 -3496 -19956 -16877 -2963 4294 16225 16246 17777 7459 14309 16696 18262
13785A8262q89o463r134J2870M558q37p64l707o657n217J0944q389m303n975n611
$$ 18262 17373 10910 1776 14646 19204 18367 17603 13896 7239 2022 12966 4577 274 -5701 -11312
13770a1312j119n521l56J225M261J1531Q048O79Q119K0354m687q497j437L241
$$ -11312 -12431 -17952 -18308 -17083 -12822 -1291 6757 7436 15555 35909 31222 22725 21288 24529
13756B4529R13m851p875j0362l72J831N588P91M095L726m253O96m409j1913O914
$$ 24529 25442 20591 12716 2354 1982 3813 9401 10192 14287 18013 13760 14456 10047 -1866 5048
13741E048N134k915k233o804l173L806K812l979n095L102J4188J1248n279N41
$$ 5048 10182 7267 5034 -1770 -4943 -1137 1675 -2304 -7399 -4297 9891 21139 15860 16401
13727A6401n832o1m487J279j6119R930J1266m254p026n979k28M245j485M361r189
$$ 16401 10569 10508 6021 7300 -8819 1111 12377 8123 1097 -4882 -5110 -865 -2350 2011 -7178
13712g178j4149N417M516K805P227O925l555k345J2999M436j7960k024P92n10
$$ -7178 -21327 -15910 -11394 -8589 -1362 5563 2008 -337 12662 17098 -862 -2886 -2094 -2604
13698b604Q082j061r243l356o277L533M328o04m480J5442O420k122J593j840K12
$$ -2604 5478 4417 -4826 -8182 -14459 -10926 -6598 -7202 -11682 3760 10180 8058 9651 7811 8023
13683H023p411Q8o996m954l26r59j95P681O114j2030m808J131J387N459L187Q551
$$ 8023 612 700 -6296 -11250 -11576 -12535 -12730 -5049 1065 -10965 -15773 -14642 -13255 -7796 -4609 3942
13667C942N591Q28p117J0663m781r206j4211M655Q909J872n617m273n605O170
$$ 3942 9533 10361 3244 13907 9126 -80 -14291 -9636 -727 1145 -4472 -8745 -14350 -8180
13653h180J1253J44M356M841p77o74j207l146k0041k722O993j151P602J3679o336
$$ -8180 3073 3217 7573 12414 11637 10963 9756 6610 -13431 -16153 -9160 -10311 -2709 10970 4634
13638D634p370n39Q454m30m88Q447m478j1843o29J0349N19j2248l559k309L068
$$ 4634 -2736 -3275 5179 4749 4261 12708 8230 -3613 -4242 6107 6626 -5622 -9181 -11490 -8422
13623h422J1087O221J0066O673J903j0272k785K43L566m053l711q477j3486m508
$$ -8422 2665 8886 18952 25625 27528 17256 14471 14714 18280 14227 10516 2039 -11447 -15955
13609a5955R046J2310M353j279r45l577N12l875O395N128R453m63j908j137o189
$$ -15955 -6909 5401 9754 8475 7530 3953 4465 590 6985 12113 21566 21103 19195 18058 11869
13594A1869m638O55N684Q678N457j125K398L876K730m377q851k606j453j564M00
$$ 11869 7231 7886 13570 22248 27705 26580 28978 32854 35584 31207 22356 19750 18297 16733 17133
13579A7133j954J637P837o503j7580P993O643O05P528J3230p314j4016n858p869
$$ 17133 15179 16816 24653 18150 570 8563 15206 15811 23339 36569 29255 15239 9381 1512
13565A512M367K608j5962j1168q823R805q241M013J1052p73n512K2143M525M738
$$ 1512 5879 8487 -7475 -18643 -27466 -17661 -25902 -21889 -10837 -11610 -17122 5021 9546 14284
13551A4284j324O508O330j713m837j1392j0054l34J5128J560j5393Q572j626j3356
$$ 14284 12960 19468 25798 24085 19248 7856 -2198 -2532 12596 14156 -1237 7335 5709 -7647
13537g647m765m949j0483r697o224R228J2004O125l223j292k726J3703J1854r36
$$ -7647 -12412 -17361 -27844 -37541 -43765 -34537 -22533 -16408 -19631 -20923 -23649 -9946 1908 972
13523I72j236L009N146P449N21J255K483M3J349o389q486j6107K325J0251o204
$$ 972 -264 2745 7891 15340 15861 17116 19599 19642 20991 14602 6116 -9991 -7666 2585 -3619
13508c619O582k192m178j581l767l98Q630Q163N7J1114N995j2357J0395O618r399
$$ -3619 2963 771 -3407 -4988 -8755 -9153 -523 7640 7697 18811 24806 12449 22844 29462 20063
13493B0063j9836k2258L757K460J040l148J3706J0471j795j225j7325Q78J9814
$$ 20063 227 -22031 -18274 -15814 -14774 -17922 -4216 6255 4460 3235 -14090 -13212 6602
13480F602M405n701q296L489R024J1846K758K293l175l463m618l444j2571L204
$$ 6602 11007 5306 -2990 499 9523 21369 24127 26420 23245 19782 15164 11720 -851 2353
13466B353Q89R00m72K319p17J633j4696j1823N50J1129J2115J0258O23K68J7528
$$ 2353 3242 4142 3670 5989 5272 6905 -7791 -19614 -19064 -7935 4180 14438 15061 15329 32857
13451C2857j3328k2887k341P568n06K62O338J0974n757J025j0921j7776L72q592
$$ 32857 19529 -3358 -5699 1869 1363 1625 7963 18937 13180 14205 3284 -14492 -14120 -22712
13437b2712j60J4691j0571j243k47k77M582n738J497K0895j667q197r8O992m284
$$ -22712 -22872 -8181 -18752 -19995 -20242 -20519 -15937 -21675 -20178 717 -950 -9147 -9245 -2253 -6537
13422f537N678J6302L740P9p166j1774q111J0258N780M10l25r491J1929P457n609
$$ -6537 -859 15443 19183 19262 12096 322 -7789 2469 8249 8659 8334 -1157 10772 18229 12620
13407A2620L314P701q89o023Q293M384j3864j2317l998n369K283P573m834q884
$$ 12620 15934 23635 22746 16723 25016 29400 15536 3219 -779 -6148 -3865 3708 -1126 -10010
13393a0010J6210M633M456M986j5734j0836K276j162n58Q44o752J247q864j2513
$$ -10010 6200 10833 15289 20275 4541 -6295 -4019 -5181 -5739 -4895 -11647 -10400 -19264 -31777
13379c1777J0789O415N955o58n77O763J5214J535q466j580j961o624N470j7295
$$ -31777 -20988 -14573 -8618 -9276 -9853 -3090 12124 13659 5193 3613 1652 -4972 498 -16797
13365a6797j175J0078J388L404O374N411Q671p628M84J0492Q94K6n12r500j3799
$$ -16797 -17972 -7894 -6506 -3102 3272 8683 17354 9726 10210 20702 21596 21622 21110 11610 -2189
13350b189m159r33m970R227P674m865q453n65Q761j2581M161J0640m723q041o38
$$ -2189 -6348 -7281 -12251 -3024 4650 -215 -8668 -9233 -472 -13053 -8892 1748 -2975 -11016 -11654
13335a1654K291J1717m242m875J308O337L523q89M52N792j010J2784J0569O824
$$ -11654 -9363 2354 -1888 -6763 -5455 882 4405 3516 3968 9760 8750 21534 32103 38927
13321C8927j5234j3755J198L838M381j1581r483L410n186K198N301R981j124n226
$$ 38927 23693 9938 11136 14974 19355 7774 -1709 1701 -3485 -1287 4014 13995 12871 7645
13307G645m635R533k917R147J0401N658p948p095q727m792j342J5532L840j1450
$$ 7645 3010 12543 9626 18773 29174 34832 26884 19789 11062 6270 4928 20460 24300 12850
13293A2850K185P76n51K370l530J0291j136j0735N101M513j2207K183J0443J63
$$ 12850 15035 15811 15260 17630 14100 24391 23255 12520 17621 22134 9927 12110 22553 22716
13279B2716O550j0739n140Q413O293J84q269j0299r900J45p213L250O353J3360
$$ 22716 29266 18527 13387 21800 28093 28277 20008 9709 -191 -46 -7259 -4009 2344 15704
13265A5704k278m515R91L565j670j472Q285J539n429n637l854N998Q19k586n457
$$ 15704 13426 8911 9902 13467 11797 10325 18610 20149 14720 9083 5229 11227 12046 9460 4003
13250D003o06J6475J7752Q318m751m941J546o083J701P382K294q435n879Q281
$$ 4003 3397 19872 37624 45942 41191 36250 37796 31713 33414 40796 43090 34655 28776 37057
13236C7057m703j7346j3273m585J0632J985J1547J3187j4750j1231p207J9227
$$ 37057 32354 15008 1735 -2850 7782 9767 21314 34501 19751 8520 1313 20540
13224B0540k824q269j523P651Q727J728n175q252J0539R172o903j1508l740R844
$$ 20540 17716 9447 7924 15575 24302 26030 20855 12603 23142 32314 25411 13903 10163 20007
13210B0007O271o159j509j054N571r287j0046R427O579j1j0540j3287j5452J2603
$$ 20007 26278 20119 18610 17556 23127 13840 3794 13221 19800 19789 9249 -4038 -19490 -6887
13196f887J8158p372m238P226R623k170j2900m301N683J0903n40o756l95O033
$$ -6887 11271 3899 -339 6887 16510 14340 1440 -2861 2822 13725 13185 6429 6034 12067
13182A2067M862j184j3979p627J9385K50k080K817J393l28O007O766l118n724
$$ 12067 16929 15745 1766 -5861 13524 13774 11694 14511 15904 15576 21583 28349 25231 19507
13168A9507J9j5417o505L623Q490L420N426k345N798J7178p45l111p355n813q60
$$ 19507 19526 4109 -2396 1227 9717 13137 18563 16218 22016 39194 38449 35338 27983 22170 21310
13153B1310p690j6071N443Q870Q036P533J0273O480j4455n076N414O110o513J54
$$ 21310 13620 -2451 2992 11862 19898 27431 37704 44184 29729 24653 30067 36177 29664 29818
13139B9818l559J726L193R792J5232L920N815j582J5000L7711O7810P7046J04203
$$ 29818 26259 27985 31178 40970 56202 60122 65937 64355 79355 117066 184876 261922 366125
13126C66125R5033O0573L1055k862k3977n6136r7178r6685o3853l1984l1169k3747
$$ 366125 461158 521731 552786 549924 525947 469811 372633 275948 212095 180111 148942 125195
13114A25195q329K11q847j5810o681j8392r200n473K031J183m051K652k269n27
$$ 125195 116866 117077 108230 92420 85739 67347 58147 52674 54705 55888 51837 54489 52220 51693
13100E1693q125j582K610J5465J4949j3388o685K2556J4825j3802j1011j0756
$$ 51693 43568 41986 44596 60061 75010 61622 54937 77493 92318 78516 67505 56749
13088E6749m795j4779r531r891J1242O940k496r888R33J2293k320k113Q87K990
$$ 56749 51954 37175 27644 17753 28995 35935 33439 23551 24484 36777 34457 32344 33231 36221
13074C6221j1869J199J3943J9803N1j0515J1402k070q399n761l29j2547j0160
$$ 36221 24352 25551 39494 59297 59348 48833 60235 58165 49766 44005 43676 31129 20969
13061B0969q17m304j191k943L398j108M587K729R828j809Q367P71p570n839k797
$$ 20969 20152 15848 14657 11714 15112 14004 18591 21320 31148 29339 37706 38477 30907 25068 22271
13046B2271m817j4451k341Q423J3151m497M618N662O548j754l006M381M079j6918
$$ 22271 17454 3003 662 9085 22236 17739 22357 28019 34567 32813 29807 34188 38267 21349
13032B1349p363P699J0791l294j8602N44M083n570L905P56o444K259j566K065
$$ 21349 13986 21685 32476 29182 10580 11124 15207 9637 13542 14298 7854 10113 8547 10612
13018A0612J008J5044J1407l105j948n404j4465k235J0576J0242J254k921j720
$$ 10612 11620 26664 38071 34966 33018 27614 13149 10914 21490 31732 32986 30065 28345
13005B8345J624j0459l186m611M153M803K577M154R475K805N669L065j2040N922
$$ 28345 29969 19510 16324 11713 15866 20669 23246 27400 36875 39680 45349 48414 36374 42296
12991D2296M268j1805m988l628p894K025K394j688N292r95k569J376M842L976
$$ 42296 46564 34759 29771 26143 18249 20274 22668 20980 26272 25277 22708 24084 28926 32902
12977C2902n327j0763j99r844q452N540l236R38J8800p47p567k005L9N537j288
$$ 32902 27575 16812 16613 6769 -1683 3857 621 1559 20359 19612 12045 10040 10079 15616 14328
12962A4328j446L115%k400o633k697N532K1489N928K005n3K155O273O945P887
$$ 14328 12882 15997 15997 13597 6964 4267 9799 31288 37216 39221 39168 41323 47596 54541 62428
12947F2428P280n097o549m684R147K5105Q076n676j6553q011j646k072q552j377
$$ 62428 69708 64611 58062 53378 62525 87630 95706 90030 73477 65466 63820 61748 53196 51819
12933E1819Q318Q837j9222j5380Q581L135q263L088m503o860l686j0330k651M186
$$ 51819 60137 68974 49752 34372 42953 46088 37825 40913 36410 29550 25864 15534 12883 17069
12919A7069N437N305N088j836n115n397j9o364O563R215l230l344k099j6547P85
$$ 17069 22506 27811 32899 31063 25948 20551 20532 14168 20731 29946 26716 23372 21273 4726 5511
12904E511L492p799k935K751P580J675l173l746J6995J0656M80j050K099p807
$$ 5511 9003 1204 -1731 1020 8600 10275 7102 3356 20351 31007 31487 30437 32536 24729
12890B4729K517m777o909J1402J795N474J2605J9620K1858L0842M4325K9540J0688
$$ 24729 27246 22469 15560 26962 28757 34231 46836 66456 88314 119156 163481 193021 203709
12877B03709J2777M77j0071j6871l4112j4954J540k481k3738j4225j4148M790
$$ 203709 216486 216963 206892 190021 155909 140955 142495 140014 116276 102051 87903 92693
12865I2693j039q460j0017l52j5743k412P242q300o962p104L419M273p178l245
$$ 92693 91654 83194 73177 72825 57082 54670 61912 53612 46650 39546 42965 47238 40060 36815
12851C6815j0491L081J3067P730L076R603L240o162j657O227k123L141m370n444
$$ 36815 26324 29405 42472 50202 53278 62881 66121 59959 58302 64529 62406 65547 61177 55733
12837E5733N434R336Q736o200Q470R666j0015j3415R140J1759Q887K736J016q37
$$ 55733 61167 70503 79239 73039 81509 91175 81160 67745 76885 88644 97531 100267 101283 100446
12823A00446P038Q692k695N927K0576J2572O842M574l170R333Q915N863Q66j4844
$$ 100446 107484 116176 113481 119408 139984 152556 159398 163972 160802 170135 179050 184913 185779 170935
12809A70935j6527j3802p924P636j0711k305J1583J3216J1295J1312O721L053
$$ 170935 154408 140606 132682 140318 129607 127302 138885 152101 163396 174708 181429 184482
12797A84482J7902L372m138M128Q124K652m299r972k1291k307j3607j7709J402
$$ 184482 202384 205756 201618 205746 213870 216522 212223 202251 180960 178653 165046 147337 148739
12784A48739M616J654J2483J1450L111J2646L171k993L007j94j0319qJ1173Q234
$$ 148739 153355 155009 167492 178942 182053 194699 197870 194877 197884 197690 187371 187363 198536 206770
12770B06770J5678R309p221n367J15K881L867J107p249m3J6694o22K742Q289l588
$$ 206770 222448 231757 224536 219169 219284 222165 226032 227139 219890 219847 236541 235919 238661 246950 243362
12755B43362j876P615J0306J1776N360j596J689K977N420J6959K5134J1581J0109
$$ 243362 241486 249101 259407 271183 276543 274947 276636 279613 285033 301992 327126 338707 348816
12742C48816J1700M432R192J5696R810J4021K1282J3737J6976R799J752K3055
$$ 348816 360516 364948 374140 389836 399646 413667 434949 448686 465662 475461 477213 500268
12730E00268J7182N391P556J7756L6554N0004N6773N6382M6619L7114M4419M8447
$$ 500268 517450 522841 530397 548153 584707 634711 691484 747866 794485 831599 876018 924465
12718I24465N0346N5666O0387O9101R9187J21667J42487J86459K16255K31726
$$ 924465 974811 1030477 1090864 1159965 1259152 1380819 1523306 1709765 1926020 2157746
12708B157746K83218L32309M07453N15535O65050Q51400J042411J260500J512875
$$ 2157746 2440964 2773273 3180726 3696261 4361311 5212711 6255122 7515622 9028497
12699I028497J926180K627782L839621N996919R638969J4754373J9215513J9325606
$$ 9028497 10954677 13582459 17422080 23418999 33057968 47812341 67027854 86353460
12691H6353460J4265799P252304K325782j873150r588544j7924035k1288697j7215399
$$ 86353460 100619259 107871563 110197345 108324195 98735651 80811616 59522919 42307520
12683D2307520j0550541o134545l864189k674644j969397j559103j324081j147782
$$ 42307520 31756979 25622434 21758245 19083601 17114204 15555101 14231020 13083238
12675A3083238r79624p99134o36952n18395m88797m76027m31167m20050l94460
$$ 13083238 12103614 11304480 10667528 10149133 9660336 9184309 8753142 8333092 7938632
12666G938632l61366l59593l55888l52337l47249l35456l03407k74133k59771
$$ 7938632 7577266 7217673 6861785 6509448 6162199 5826743 5523336 5249203 4989432
12657D989432k34982k09762j84251j72666j54054j42721j28614j39686j56929
$$ 4989432 4754450 4544688 4360437 4187771 4033717 3890996 3762382 3622696 3465767
12648C465767j45025j26920r2188q9795q5959n6580l0791N057P1155J55700K07450
$$ 3465767 3320742 3193822 3101634 3011839 2925880 2869300 2838509 2843566 2914721 3070421 3277871
12637C277871J85758R7695J015m5145j14909k50885l46144l63140k68126j62346
$$ 3277871 3463629 3561324 3562339 3517194 3402285 3151400 2805256 2442116 2173990 2011644
12627B011644j24829r7621q3946p5073o0973o1099o1145n5549l9349l2112l9142
$$ 2011644 1886815 1789194 1705248 1630175 1569202 1508103 1446958 1391409 1352060 1319948 1280806
12616A280806n4446k3304l5764l2771l1405n3651m3333k7576l9697l6277k1673
$$ 1280806 1226360 1203056 1167292 1134521 1103116 1049465 1006132 978556 938859 902582 880909
12605H80909r522k2164l0674j2262j8568k7174p630J548j5476j1797q699j6824
$$ 880909 871387 849223 818549 806287 787719 760545 752915 754463 738987 727190 718491 701667
12593G01667K228J6602K6940M0277L8502L5335J0392p351j3806k2666n4602o3996
$$ 701667 703895 720497 747437 787714 826216 861551 871943 864592 850786 828120 773518 709522
12581G09522p3947o6260l5923l9493l0566k0081k5729k8456k3263j6494j5175
$$ 709522 635575 569315 533392 493899 463333 443252 417523 389067 365804 349310 334135
12570C34135j9479j8055j6182k5329k3395j0961l456j6984o547l73j8651j3340
$$ 334135 314656 296601 280419 255090 231695 220734 217278 200294 193747 193374 174723 161383
12558A61383j3703o650o284m206k957j510j4922K873R508j735q070r727j1901
$$ 161383 147680 141030 134746 130540 127583 126073 111151 114024 123532 121797 113727 104000 92099
12545I2099n008l894R022O425O208Q97j105j003M119J1433j3290o383Q262O666
$$ 92099 87091 83197 92219 98644 104852 105749 104644 103641 107760 119193 105903 99520 107782 114448
12531A14448o746m444p993n551r63O290M479n503j4224R712R896n180q830j374
$$ 114448 107702 103258 95265 89714 88751 95041 99520 94017 79793 89505 99401 94221 85391 84017
12517H4017l136N239n000k756l705j8144k0639j5190r478n974q783j8161k5918
$$ 84017 80881 86120 81120 78364 74659 56515 35876 20686 11208 5234 -3549 -21710 -47628
12504d7628l4236j9451m757P125J1774L0659M0965M1958L5409J3359J8087K7121
$$ -47628 -81864 -101315 -106072 -98947 -87173 -56514 -15549 26409 61818 75177 93264 120385
12492A20385J1166N358O64j686l958q368j1942j8171k284J06l286j2279L19K054
$$ 120385 131551 136909 137573 135887 131929 123561 111619 93448 91164 91270 87984 75705 76024 78078
12478G8078N000L259l152r9K304K181q484j0956o021p067j671N644Q191J897j020
$$ 78078 83078 86337 83185 83086 85390 87571 79087 68131 62110 55043 53372 59016 67207 69104 68084
12463F8084J0211o278n103m042n453O382J1380R824J475n71J0921K223j3791j5584
$$ 68084 78295 72017 66914 62872 57419 63801 75181 85005 86480 85909 96830 99053 85262 69678
12449F9678j6020n237Q614J7112k810K04n711j0543o005J800l110O037J5343r415
$$ 69678 53658 48421 57035 74147 71337 71541 65830 55287 49282 51082 47972 54009 69352 59937
12435E9937r100l313m675q837k544J7904K802l700n757n252j452p362m320r674
$$ 59937 50837 47524 42849 34012 31468 49372 52174 48474 42717 37465 36013 28651 24331 14657
12421A4657n543L940l739K611j177J6577m390K958J1636j1850j819j213r559j884
$$ 14657 9114 13054 9315 11926 10749 27326 22936 25894 37530 25680 23861 22648 13089 11205
12407A1205m18O048J0338p530j2419K40J4792p196r723N749L626L729J1417L080
$$ 11205 10787 16835 27173 19643 7224 7464 22256 15060 5337 11086 14712 18441 29858 32938
12393C2938n413k4751j3944O884R68k864n686L821O782r824m018L153J218J0000
$$ 32938 27525 2774 -11170 -4286 -3318 -6182 -11868 -8047 -1265 -11089 -15107 -11954 -10736 -736
12379g36q583j447M141R67L734J0738N75k023r614q261P561R172l910M93o694
$$ -736 -9319 -10766 -6625 -5658 -1924 8814 9389 7366 -2248 -10509 -2948 6224 2314 2807 -3887
12364c887o417Q331Q133l90N848P53q952K406O801M98Q380P666m936j1132L917
$$ -3887 -10304 -1973 6160 5770 11618 12371 3419 5825 12626 13124 21504 29170 24234 13102 17019
12349A7019L772K082M34o017r523j418r28k381j2078J4047Q444n134j062O047
$$ 17019 20791 22873 23307 17290 7767 6349 5421 3040 -9038 5009 13453 8319 7257 13304
12335A3304q96r03K462j348P792O39Q73l233M713r752L553O79k163K912l065J957
$$ 13304 12408 11505 13967 12619 20411 21050 21923 18690 23403 13651 17204 17883 15720 18632 15567 17524
12319A7524j5905j0968l073K366J54J239J1658o021N200K0228J920n177q349K033
$$ 17524 1619 -9349 -12422 -10056 -9902 -8663 2995 -3026 2174 22402 24322 19145 10796 12829
12305A2829N583L901n592M96o12l084k889j619m732L842q209r279O97p282Q818
$$ 12829 18412 22313 16721 17217 16605 13521 10632 9013 4281 8123 -86 -9365 -8668 -15950 -7132
12290g132o679J87J3200J376q207K687l718J877j92m113Q487J2591P550J1670
$$ -7132 -13811 -13624 -424 952 -7255 -4568 -8286 -6409 -6601 -10714 -2227 10364 17914 29584
12276B9584r591j0353j4366R663P153p675l078l537Q047J2139o255k336j372O803
$$ 29584 19993 9640 -4726 4937 12090 4415 1337 -2200 5847 17986 11731 9395 8023 14826
12262A4826P807m893P187J7929O905O140J6473L7910N7773P7633Q8700Q9282O5756
$$ 14826 22633 17740 24927 42856 49761 55901 72374 110284 168057 245690 334390 423672 489428
12249D89428L4068N554j9616n7421q5507j05999p7314n3554m1009j1125r524r881
$$ 489428 523496 529050 509434 452013 366506 260507 183193 129639 88630 77505 67981 58100
12237E8100p069L554j0075j84P490l17r040k122K512k271O145n055k0486n321
$$ 58100 51031 54585 44510 44326 51816 51499 42459 40337 42849 40578 46723 41668 21182 15861
12223A5861O651l453n832l605Q344L419k861l314M764N161L562j238k028j502
$$ 15861 22512 19059 13227 9622 17966 21385 18524 15210 19974 25135 28697 27459 25431 23929
12209B3929p46M739p961K41O629L482k026j0623j3089q712r205N148K376R189
$$ 23929 23183 27922 19961 20202 26831 30313 28287 17664 4575 -4137 -13342 -8194 -5818 3371
12195C371J535N848J0926n482j3132M11O60m686L033J0848P17j5821p534L29m257
$$ 3371 4906 10754 21680 16198 3066 3477 4137 -549 2484 13332 14049 -1772 -9306 -8977 -13234
12180a3234J69J018J0264k738J193m757K830J6675R225j1321o404n602p49O508
$$ -13234 -13065 -12047 -1783 -4521 -3328 -8085 -5255 11420 20645 9324 2920 -2682 -3431 3077
12166C077R56M47j968M286m022k771M524l94p570k635P37J1971K0125M212o017
$$ 3077 4033 4480 2512 6798 2776 5 4529 4135 -3435 -6070 -5333 6638 26763 30975 24958
12151B4958j4282l125l270o967j886N731k673k406j332j521r302n184J4396J3474
$$ 24958 10676 7551 4281 -2686 -4572 1159 -1514 -3920 -5252 -6773 -16075 -21259 -6863 6611
12137F611J1729Q61r699o74J1433R735Q012k427P83o47j1479o586j1713k1811
$$ 6611 18340 19201 9502 8828 20261 29996 38008 35581 36364 35717 24238 17652 5939 -15872
12123a5872q489r66J5813P676J1159m770j1549j4510k846P124J030L443m070O672
$$ -15872 -24361 -25327 -9514 -1838 9321 4551 -6998 -21508 -24354 -17230 -16200 -12757 -16827 -10155
12109a0155q643R59K745Q240k576N917J1847K70P86m857J076n533k65O383j1629
$$ -10155 -18798 -17839 -15094 -6854 -9430 -3513 8334 8604 9390 4533 5609 76 -189 6194 -5435
12094e435M858o05J1439Q527p410j671K227r377r631K402O04J455R126O228j2034
$$ -5435 -577 -1182 10257 18784 11374 9703 11930 2553 -7078 -4676 -4072 -2617 6509 12737 703
12079G03q285M143Q126J3802l745m726L483n743r527j3049q951N077P017N203
$$ 703 -7582 -3439 4687 18489 14744 10018 13501 7758 -1769 -14818 -23769 -18692 -11675 -6472
12065f472N381j0236o982M796O19m843N560o158L763k968j1111J5074k574l638
$$ -6472 -1091 -11327 -18309 -13513 -12894 -17737 -12177 -18335 -14572 -17540 -28651 -13577 -16151 -19789
12051a9789J5217J2806l867p808j410m363k335J4691Q100k950j0067P355o358
$$ -19789 -4572 8234 4367 -3441 -4851 -9214 -11549 3142 11242 8292 -1775 5580 -778
12038g78q103p140k029J396j2893j1385l841L805J996J496l125J9472K3201L001
$$ -778 -8881 -16021 -18050 -16654 -29547 -40932 -44773 -40968 -38972 -37476 -40601 -21129 2072 5073
12024E073K319j1826l320J548N368J702M744K716k735M671J255j4050j753M353
$$ 5073 7392 -4434 -7754 -6206 -838 864 5608 8324 5589 10260 11515 -2535 -4288 65
12010F5q74O180J481j785o067M878k567j007J3647K342p548J98m50j1505j8050
$$ 65 -809 5371 6852 5067 -1000 3878 1311 304 13951 16293 8745 8943 8493 -3012 -21062
11995b1062o493N873J2109L557k945P778l138k1538m433J5068K6650R567L059
$$ -21062 -27555 -21682 -9573 -6016 -8961 -1183 -4321 -25859 -30292 -15224 11426 20993 24052
11982B4052r692N416k814j641K417O547R522l603j1430o268N584P182j025j2796
$$ 24052 14360 19776 16962 15321 17738 24285 33807 30204 18774 12506 18090 25272 24247 11451
11968A1451p401n730n370M066n090j411l96M623R132J472p125k927k276k268O467
$$ 11451 4050 -1680 -7050 -2984 -8074 -9485 -9881 -5258 3874 5346 -1779 -4706 -6982 -9250 -2783
11953b783J5395J0629l766j1218q698q907M726L112k2637J885N652j3586j0851
$$ -2783 12612 23241 19475 8257 -441 -9348 -4622 -1510 -24147 -22262 -16610 -30196 -41047
11940d1047J0339J2857J7467K283L239O977J340K809o710j7687p026N561J3030
$$ -41047 -30708 -17851 -384 1899 5138 12115 13455 16264 9554 -8133 -15159 -9598 3432
11927C432J0570k553r434k979n94l435J600O6l936p621k282q000J620J2176j4401
$$ 3432 14002 11449 2015 -964 -1558 -4993 -3393 -3327 -7263 -14884 -17166 -25166 -23546 -11370 -25771
11912b5771J179J7799J9704j552k2438l214Q437O188R707j0029j825M93L362k184
$$ -25771 -24592 -6793 12911 11359 -11079 -14293 -5856 332 10039 10 -1815 -1322 2040 -144
11898a44j1057O753P115K088j0710j328j008l049l974j526j724J716p403N38n128
$$ -144 -11201 -4448 2667 4755 -5955 -7283 -8291 -11340 -15314 -16840 -18564 -16848 -24251 -23713 -28841
11883b8841k149J2145L799R253j337N035P5M572k650L963R517M445J708p356q373
$$ -28841 -30990 -18845 -15046 -5793 -7130 -2095 -2020 2552 -98 3865 13382 17827 19535 12179 3806
11868C806m159J279k620J818m663O373Q64m924k094J0407K0735J1150j4577q001
$$ 3806 -353 926 -1694 124 -4539 1834 2698 -2226 -4320 6087 26822 37972 23395 15394
11854A5394L211Q635k0533k0251j2214O085J3006J8700K900r04m472r557Q696
$$ 15394 18605 27240 6707 -13544 -25758 -19673 -6667 12033 14933 14029 9557 0 8696
11841H696j796n601l849K932J675j098o135m827p560o473J1256N677J412j101
$$ 8696 6900 1299 -2550 382 2057 959 -5176 -10003 -17563 -24036 -12780 -7103 -5691 -6792
11827f792j208M832K361o41o672l481K781o530p371N169J1465l732n020J105N0
$$ -6792 -8000 -3168 -807 -1448 -8120 -11601 -8820 -15350 -22721 -17552 -6087 -9819 -14839 -13734 -13684
11812a3684L23O270R484k673j2758O811r466q097O428O94Q03J427m571o058J4178
$$ -13684 -13361 -7091 2393 -280 -13038 -6227 -15693 -23790 -17362 -16668 -15865 -14438 -19009 -25067 -10889
11797a0889M873r754n025l605O846N710l353O91O54M300O065N120L300o323r105
$$ -10889 -6016 -15770 -20795 -24400 -17554 -11844 -15197 -14506 -13852 -9552 -3487 1633 4933 -1390 -10495
11782a0495k096j366Q804M188M288M705M45L316m596J071N54j6841j5739J836
$$ -10495 -12591 -13957 -5153 -965 3323 8028 8473 11789 7193 8264 8818 -8023 -23762 -21926
11768b1926J1710R7K322J1684L629R675n586j1615l765j1299L59R86L744J947
$$ -21926 -10216 -10119 -7797 3887 7516 17191 11605 -10 -3775 -15074 -14715 -13729 -9985 -8038
11754h038L75n880l278K854K54J5151J0824o879q054j197L653L019J3569J920
$$ -8038 -7663 -13543 -16821 -13967 -13713 1438 12262 5383 -2671 -3868 -215 2804 16373 18293
11740A8293K535R525O85j5436m446J934j395j3622P139j336j1650k67p224m779
$$ 18293 20828 30353 31038 15602 11156 13090 11695 -1927 5212 3876 -7774 -8041 -15265 -20044
11726b0044K765L627l337m847L395o733K244J0864O949J367O330P344J1379P86
$$ -20044 -17279 -13652 -16989 -21836 -18441 -25174 -22930 -12066 -5117 -3750 2580 9924 21303 22089
11712B2089r937m494j0259N982L309N127J607J545P563j1098j9436m619K178P704
$$ 22089 12152 7658 -2601 3381 6690 11817 13424 14969 22532 11434 -8002 -12621 -10443 -2739
11698b739J0791n599l731K141n692J627O965j186J3673k624J835R493K758j2847
$$ -2739 8052 2453 -1278 863 -4829 -3202 3763 2577 16250 13626 15461 24954 27712 14865
11684A4865j8505L342P158N979m781n235o041n957J423J5945k672p242L929o519
$$ 14865 -3640 -298 6860 12839 8058 2823 -3218 -9175 -7752 8193 5521 -1721 2208 -4311
11670d311J288m89l176l1j2111o390J0650K350j599m347P066J0119R405J895r830
$$ -4311 -3023 -3512 -6688 -6719 -18830 -25220 -14570 -12220 -13819 -18166 -11100 -981 8424 10319 489
11655D89j551J5413k340o016L864j2368M277J0605j0566l928m352L571k294L275
$$ 489 -1062 14351 12011 5995 9859 -2509 1768 12373 1807 -2121 -6473 -2902 -5196 -1921
11641a921J1351J2712p926p525P217l563q734j0900M888O253K68j517p998O611
$$ -1921 9430 22142 14216 6691 13908 10345 1611 -9289 -4401 1852 2120 603 -7395 -784
11627g84N827j1607Q92R158J1783o772j3158m574P016J0989n90k076k795n542
$$ -784 5043 -6564 -5672 3486 15269 8497 -4661 -9235 -2219 8770 8180 6104 3309 -2233
11613b233q641o162M548J2497o34q283j693Q683J73k066l588l261J980K447J400
$$ -2233 -10874 -17036 -12488 9 -625 -8908 -10601 -1918 -1745 -3811 -7399 -10660 -8680 -6233 -4833
11598d833k83k819K041k218m105p523N803J3235K734m04M647o069n675J4295O512
$$ -4833 -5116 -7935 -5894 -8112 -12217 -19740 -13937 -702 2032 1628 6275 206 -5469 8826 15338
11583A5338j6590J2942P656j5505j3098l704R663K779K946M892M14j2543j180
$$ 15338 -1252 11690 19346 3841 -9257 -12961 -3298 -519 2427 7319 7733 -4810 -5990
11570e990L342L172J532J5555L968j0395j7692M650R644m336l217L78p942n514
$$ -5990 -2648 524 2056 17611 21579 11184 -6508 -1858 7786 3450 233 611 -7331 -12845
11556a2845J1327M668j4954m338J1769M868L424L106J956O273j2912j6921n00
$$ -12845 -1518 3150 -11804 -16142 -4373 495 3919 7025 8981 15254 2342 -14579 -15079
11543a5079J4291J5953o33L113M569p662o102J144j1558j2022J564J866J378N28
$$ -15079 -788 15165 14532 17645 22214 14552 8450 9594 -1964 -13986 -12422 -10556 -9178 -8650
11529h650M342R959q39j3284o194n153J071P810p114p541O480L476k901L269P470
$$ -8650 -4308 5651 4812 -8472 -14666 -19819 -18748 -10938 -18052 -25593 -19113 -15637 -18538 -15269 -7799
11514g799j0235O326K986n53o130J4693P828J062p519o693J415M629j0364o014
$$ -7799 -18034 -11708 -8722 -9275 -15405 -712 7116 8178 659 -6034 -4619 10 -10354 -16368
11500a6368m018J0168M191J1717N65Q950l096q457M27K16m842j40K056L618n126
$$ -16368 -20386 -10218 -6027 5690 6255 15205 12109 3652 4079 4295 -547 -687 1369 4987 -139
11485a39R40K184J210o243l186k713j114J2370j435p619o418o722n17J5404p650
$$ -139 801 2985 4195 -2048 -5234 -7947 -9061 3309 1874 -5745 -12163 -18885 -19402 -3998 -11648
11470a1648j7002l108j631N107J3628N606q35m855o725R002J4959o41j2633K446
$$ -11648 -28650 -31758 -33389 -28282 -14654 -9048 -9883 -14738 -21463 -12461 2498 1857 -10776 -8330
11456h330l183n010m776J1834n045O381J3917Q244o780r824j0753j613J720j846
$$ -8330 -11513 -16523 -21299 -9465 -14510 -8129 5788 14032 7252 -2572 -13325 -14938 -13218 -15064
11442a5064k187r91Q193R345J0177o251m69m441J682R893k720j211M832N90j5599
$$ -15064 -17251 -18242 -10049 -704 9473 3222 2753 -1688 -6 9887 7167 5956 10788 11378 -4221
11427d221N605J5319k887p790j1315L092j329LR858M804N071L289n203k709p742
$$ -4221 1384 16703 13816 6026 -5289 -2197 -3526 -3523 6335 11139 16210 19499 14296 11587 3845
11412C845j0241J623K205L294o648L784N323J1670M827K348j327K873O387j2380
$$ 3845 -6396 -4773 -2568 726 -5922 -2138 3185 14855 19682 22030 20703 23576 29963 17583
11398A7583N66n130q600j360M855j0442K193j343q927r587k432q471J3892M502
$$ 17583 18149 13019 4419 3059 7914 -2528 -335 -1678 -10605 -20192 -22624 -31095 -17203 -12701
11384a2701p791L29N369k613L540N281k39R826J1179M663j0055J926O46q646k688
$$ -12701 -20492 -20163 -14794 -17407 -13867 -8586 -8825 1001 12180 16843 6788 8714 9360 714 -1974
11369a974P853m422O954J9108n903j5081o938j0407N589O751N171N256J173L026
$$ -1974 5879 1457 8411 27519 21616 6535 -403 -10810 -5221 1530 6701 11957 13130 16156
11355A6156r209j1911k3615L125J1264J6592J5259l943j572j2200n456R460l802
$$ 16156 6947 -4964 -28579 -25454 -14190 2402 17661 13718 12146 -54 -5510 3950 148
11342A48O172j1869q053k353q009k645L659k638R27J0756J539Q157O982n819n334
$$ 148 6320 -5549 -13602 -15955 -23964 -26609 -22950 -25588 -24661 -13905 -12366 -4209 2773 -3046 -8380
11327h380m534j678k979j39N107l397k549M760q389m885L63r182L025R804N958
$$ -8380 -12914 -14592 -17571 -17710 -12603 -16000 -18549 -13789 -22178 -27063 -26700 -35882 -32857 -23053 -17095
11312a7095J4709J5857K86j0451r480l861n744j870l632M378J4937O201O622q080
$$ -17095 -2386 13471 13757 3306 -6174 -10035 -15779 -17649 -21281 -16903 -1966 4235 10857 2777
11298B777k961Q491k156j1702j5198J6012O701L590p154m76O910j521j228l695
$$ 2777 -184 8307 6151 -5551 -20749 -4737 1964 5554 -1600 -2076 4834 3313 2085 -1610
11284a610R361M753J884R951M602n166k018j3942j5038J0583P484j1723k849R210
$$ -1610 7751 12504 14388 24339 28941 23775 21757 7815 -7223 3360 10844 -879 -3728 5482
11270E482l533q677m10N053O895M043Q078J918j8641M163K228l180r581j1493
$$ 5482 1949 -6728 -7138 -2085 4810 8853 16931 18849 208 4371 6599 3419 -6162 -17655
11256a7655R482K038J9722J9871J225p378n488j6473q374O409m54p823K672Q464
$$ -17655 -8173 -6135 13587 33458 34683 27305 21817 5344 -3030 3379 2925 -4898 -2226 6238
11242F238p315O25L270M676j0090J385M595n875P960J8914J4041p50j5199k843
$$ 6238 -1077 -452 2818 7494 -2596 -1211 3384 -2491 5469 24383 38424 37674 22475 19632
11228A9632R348p307p143k398o30M903J498M425L612j0578l916o511k856L542
$$ 19632 28980 21673 14530 12132 11502 16405 17903 22328 25940 15362 11446 4935 2079 5621
11214E621O811J100J226p177r577l085p359K73P874Q054Q877j613N73l606j1231
$$ 5621 12432 13532 14758 7581 -1996 -5081 -12440 -12167 -4293 3761 12638 11025 11598 7992 -3239
11199c239j129k777J3104j457k60m341j544m885P96M523M546M710R083Q502K285
$$ -3239 -4368 -7145 5959 4502 4242 -99 -1643 -6528 -5732 -1209 3337 8047 17130 25632 27917
11184B7917m878J416p035j0741j4110K42M727J0288J6770m293j5344j4888N205
$$ 27917 23039 24455 17420 6679 -7431 -7189 -2462 7826 24596 20303 4959 -9929 -4724
11171d724l506J4495K929m493N255R345P251j6894j8284L75K77P586J2744K741
$$ -4724 -8230 6265 9194 4701 9956 19301 26552 9658 -8626 -8251 -7974 -388 12356 15097
11157A5097J918N977n649j4372P165k052K178j969J1413P114j317j5296j2465
$$ 15097 17015 22992 17343 2971 10136 8084 10262 8293 19706 26820 25503 10207 -2258
11144b258m911P126J6121N286n917J879j52K24L582j2634k931j076K330l699m198
$$ -2258 -7169 -43 16078 21364 15447 17326 17174 17398 20980 8346 5415 4339 6669 2970 -1228
11129a228J2636P013r87L166j4108j0327j833l947l133J2996O090q439J774M678
$$ -1228 11408 18421 17434 20600 6492 -3835 -5668 -9615 -12748 248 6338 -2101 -327 4351
11115D351P400M211J415o642l472R532j69J963l196O690j521m431p519n587J3844
$$ 4351 11751 15962 17377 10735 7263 16795 16626 18589 15393 22083 20562 16131 8612 3025 16869
11100A6869J164L007P134O562L458l54m197k889R278k857j4049n112j704r310
$$ 16869 18033 21040 28174 34736 38194 37840 33643 30754 40032 37175 23126 18014 16310 7000
11086G000K623j1888J1510K742r019L039J0620O22q206j4670q496p016l433L712
$$ 7000 9623 -2265 9245 11987 2968 6007 16627 17249 9043 -5627 -14123 -21139 -24572 -20860
11072b0860N25L985J2124J1017l540M396P717j977j4963l368M406m061J970J3997
$$ -20860 -20335 -16350 -4226 6791 3251 7647 15364 13387 -1576 -4944 -538 -4599 -2629 11368
11058A1368Q243r647O01J2600j603L485J1484J2888Q847O299K593M785P032O413
$$ 11368 19611 9964 10565 23165 21562 25047 36531 49419 58266 64565 67158 71943 78975 85388
11044H5388j577k6420j3534Q650j1183O065n752m370n299j99m681k441k432o083
$$ 85388 83811 57391 43857 52507 41324 47389 41637 37267 31968 31769 27088 24647 22215 16132
11030A6132j471O392j652j5066j4443l497M888O884R401L936M66q93q545N54J4122
$$ 16132 14661 21053 19401 4335 -10108 -13605 -8717 -1833 7568 11504 11970 11077 2532 3086 17208
11015A7208r27P204m407q835M772N659J0096J2763J1456O887J1681j97K0826J6286
$$ 17208 16281 23485 19078 10243 15015 20674 30770 43533 54989 61876 73557 73360 94186 110472
11001A10472j1643k0501q745q496p754j1946n819J3894R332k2501j0062n987q828
$$ 110472 98829 78328 69583 61087 53333 41387 35568 49462 58794 36293 26231 20244 11416
10988A1416o411j300O822P733K697l427m93m030m199K940n430j338n496n759O918
$$ 11416 5005 3705 10527 18260 20957 17530 17037 13007 8808 11748 6318 4980 -516 -6275 643
10973F43J568r065R258J0498N353R11j0911k381J4390l981K139R847p150j6637
$$ 643 2211 -6854 2404 12902 18255 19166 8255 5874 20264 16283 18422 28269 21119 4482
10959D482M099R701J3647R185J887j3060j2345o626J6415J0713j753j1740j5265
$$ 4482 8581 18282 31929 41114 43001 29941 17596 10970 27385 38098 36345 24605 9340
10946I340L595J178J809J96K128N416K577j077N23j2350J333l096r529j2258q903
$$ 9340 12935 14113 15922 16118 18246 23662 26239 25162 25685 13335 14668 11572 2043 -10215 -19118
10931a9118J6234j251O215p112p436L45J4547J0203J1162o800j0421j380M234
$$ -19118 -2884 -4135 2080 -5032 -12468 -12123 2424 12627 23789 16989 6568 5188 9422
10918I422l401q15j2390j3932O29Q690O310O928q360k706Q844p819k297Q769R291
$$ 9422 6021 5206 -7184 -21116 -20487 -11797 -5487 1441 -6919 -9625 -781 -8600 -10897 -2128 7163
10903G163j4304r266O883J1722O043R77m566N038j668r867j2279k71N006J2401
$$ 7163 -7141 -16407 -9524 2198 8241 9218 4652 9690 8022 -1845 -14124 -14395 -9389 3012
10889C012Q015m296K070K982j924O920j1690j0355R051l101N77N712o073L630
$$ 3012 11027 6731 8801 11783 9859 16779 5089 -5266 3785 684 1261 6973 900 4530
10875D530J200q662N613M964k621p565j3193P49l045r669R871M941l486n436J3572
$$ 4530 5730 -2932 2681 7645 5024 -2541 -15734 -14985 -18030 -27699 -17828 -12887 -16373 -21809 -8237
10860h237J8319L037k861M484j8731j9409L009L719p670q883J655K1962M641o335
$$ -8237 10082 13119 10258 14742 -3989 -23398 -20389 -16670 -24340 -33223 -31568 -9606 -4965 -11300
10846a1300M956K419O508J2662j2045J32k201q751n363P511J6611J968j2922N030
$$ -11300 -6344 -3925 2583 15245 3200 3332 1131 -7620 -12983 -5472 11139 13107 185 5215
10832E215J115m911K174K940N553p133p286N650j595Q794J806l761J134k63n641
$$ 5215 6330 1419 3593 6533 12086 4953 -2333 3317 1722 10516 12322 8561 9695 9432 3791
10817C791o499M524P966J661n15N726j5048j2018j19O718J76N650k358q051P919
$$ 3791 -2708 1816 9782 11443 10928 16654 1606 -10412 -10531 -3813 -3637 2013 -345 -8396 -477
10802d77j738O688R254k827j0405p339l057N981N709j609P487J0566r114j452
$$ -477 -2215 4473 13727 10900 495 -6844 -9901 -3920 1789 180 7667 18233 9119 7667
10788G667j394q055p823l674J601J885p105K221K3098j0937r052q266o176j287
$$ 7667 6273 -1782 -9605 -13279 -11678 -9793 -16898 -14677 8421 -2516 -11568 -19834 -26010 -27297
10774b7297J3979N490N05N323P230q111j092N028l64P23m089O939K668l742r201
$$ -27297 -13318 -7828 -7323 -2000 5230 -2881 -3973 1055 691 1414 -2675 4264 6932 3190 -6011
10759f011n96m368N654j054j9463K569O265p986m961J7346J7515m752j1109J1668
$$ -6011 -6607 -10975 -5321 -6375 -25838 -23269 -17004 -24990 -29951 -12605 4910 158 -10951 717
10745G17N119m131Q89p437j4588R80J0297p53n028m857l355J4593P614l190R144
$$ 717 5836 1705 2594 -4843 -19431 -18451 -8154 -8907 -13935 -18792 -22147 -7554 60 -3130 6014
10730F014N510j0418n6O470J8r409k437P332O31p01L354J0973q92k67J59j1444
$$ 6014 11524 1106 1050 7520 7538 -1871 -4308 3024 3655 2954 6308 17281 16389 16122 16281 4837
10714D837j1442J5455j25k206m355L260M373k0122j5553O801J5978Q736Q51Q149
$$ 4837 -6605 8850 8725 6519 2164 5424 9797 -10325 -25878 -19077 -3099 5637 6488 14637
10700A4637R047j614L692j5689k991J140j0572K237l282j349Q176o163P100K222
$$ 14637 23684 22070 25762 10073 7082 8222 -2350 -113 -3395 -4744 3432 -2731 4369 6591
10686F591m485n297q535J3308k430Q225p350j485l415j924R431O786N392j082
$$ 6591 2106 -3191 -11726 1582 -848 7377 27 -1458 -4873 -6797 2634 9420 14812 13730
10672A3730j8067K58K626r61k46k583L061J517K164p875p24P839K374N24L343
$$ 13730 -4337 -4079 -1453 -2414 -2660 -5243 -2182 -665 1499 -6376 -7100 739 3113 3637 6980
10657F980J3754o600q628J112q831j165M183J4491p176j2326m887J806Q091Q797
$$ 6980 20734 14134 5506 6618 -2213 -3378 805 15296 8120 -4206 -9093 -7287 804 9601
10643I601O073j407j4405j2768r937J0442J0790k1503o815Q722O721P632R831
$$ 9601 15674 14267 -138 -12906 -22843 -12401 -1611 -23114 -29929 -21207 -14486 -6854 2977
10630B977j392j3049J912N677k531O404K6167m078j7531P258R722k527j5322l970
$$ 2977 1585 -11464 -9552 -3875 -6406 -2 26165 22087 4556 11814 21536 19009 3687 -283
10616b83M2M443n543q650P212p731J2344J3886j292L17j0364k0836k362J7691
$$ -283 -241 4202 -1341 -9991 -2779 -10510 1834 15720 14428 14745 4381 -16455 -18817 -1126
10602a126R377j0318j2468M491M819l148q130M03P025J4412j872J050n797J640
$$ -1126 8251 -2067 -14535 -10044 -5225 -8373 -16503 -16100 -9075 5337 3465 4515 -1282 358
10588C58Q420j383k1122p073J1905N894o412k58N480L961N279R45K52K705j7389
$$ 358 8778 7395 -13727 -20800 -8895 -3001 -9413 -9671 -4191 -230 5049 5994 6246 8951 -8438
10573h438K10k010L168J5276p59j5971L511L929k152p066P849l82r798N873L424
$$ -8438 -8228 -10238 -7070 8206 7447 -8524 -5013 -1084 -3236 -10302 -2453 -2835 -12633 -6760 -3336
10558c336R000K539j1264l349J472O423J0242l04P110Q44P760m822p846k564J1285
$$ -3336 5664 8203 -3061 -6410 -4938 1485 11727 11423 18533 19377 27137 22315 14469 11905 23190
10543B3190Q421m360q245J085o396N567j3806j5574L02Q256K120J1402j080l061
$$ 23190 31611 27251 19006 20091 13695 19262 5456 -10118 -9816 -1560 560 11962 10882 7821
10529G821r300r054O108L222r444k730o232j929P493Q975P566M352l800J23j15
$$ 7821 -1479 -10533 -4425 -1203 -10647 -13377 -19609 -21538 -14045 -5070 2496 6848 3048 3171 3056
10514C056j6237J790J5030k945q337o390K561J1502K607o544O102k79q637j1211
$$ 3056 -13181 -11391 3639 694 -7643 -14033 -11472 30 2637 -3907 2195 1916 -6721 -17932
10500a7932P645P515k151M610K566j682Q110J0129j5986j635J531P809P378n52
$$ -17932 -10287 -2772 -4923 -313 2253 571 8681 18810 2824 1189 2720 10529 17907 17355
10486A7355j3240o397j070k325j5131j0619N766N764N985J258K276J8066J2764
$$ 17355 4115 -2282 -3352 -5677 -20808 -31427 -25661 -19897 -13912 -12654 -10378 7688 20452
10473B0452l514p155K180L205p235n955j1619J79N637N765r900q494K086r172
$$ 20452 16938 9783 11963 15168 7933 1978 -9641 -9462 -3825 1940 -7960 -16454 -14368 -23540
10459b3540r412J5312J8505j886K360N633Q419J646J329j4057k865j832K867k522
$$ -23540 -32952 -17640 865 -1021 1339 6972 15391 17037 18366 4309 1444 -388 2479 -43
10445d3m770n01O716L246J948j0248j178Q90O961J4258n8j1235j846O750J832
$$ -43 -4813 -5314 1402 4648 6596 -3652 -4830 -3940 3021 17279 17221 5986 4140 10890 12722
10430A2722R903l131j3091k371n2j180j559K902M618N830M370o442p001Q813O718
$$ 12722 22625 19494 6403 4032 3980 2800 1241 4143 8761 14591 18961 12519 5518 14331 21049
10415B1049j6063j1314n656L29L977M282r93q04n62r00J1969k824j1174P95q09
$$ 21049 4986 -6328 -11984 -11655 -7678 -3396 -4389 -5193 -5755 -6655 5314 2490 -8684 -7889 -8698
10400h698K697N583R78J4561R887n375o100j4879j1243J0263N863O573m49P326
$$ -8698 -6001 -418 560 15121 25008 19633 13533 -1346 -12589 -2326 3537 10110 9661 16987
10386A6987o434j0281j5643O971R011p087n232r328J6045J6806o503m388p471
$$ 16987 10553 272 -15371 -8400 611 -6476 -11708 -21036 -4991 11815 5312 924 -6547
10373f547N540J163J839Q451N528j0939p59M979j1818K462J0680K954N70O93Q429
$$ -6547 -1007 156 1995 10446 15974 5035 4276 9255 -2563 -101 10579 13533 14103 14796 23225
10358B3225j3359L240M632j9511j2673O193k860J2183J0349N906Q09p719J094
$$ 23225 9866 13106 17738 -1773 -14446 -8253 -11113 1070 11419 17325 18134 10415 11509
10345A1509P723k709M83n872n733N7j1001J937J9014J0712o734j0265p390K1R560
$$ 11509 19232 16523 17006 11134 5401 5458 -5543 -3606 15408 26120 19386 9121 1731 1752 11312
10330A1312N670j802k845K952m973P808O520m60k728j675j804q414p862R752J0451
$$ 11312 16982 15180 12335 15287 10314 18122 24642 24182 21454 19779 17975 9561 1699 11451 21902
10315B1902k149R0j1983j0162n809J563J6391J0909O263J271P195K0517N277n646
$$ 21902 19753 19843 7860 -2302 -8111 -6548 9843 20752 27015 28286 35481 55998 61275 55629
10301E5629J2696L0555J9585L6847L6375J7482J4699N324R627K1524J1660k220
$$ 55629 68325 98880 118465 155312 191687 209169 223868 229192 238819 260343 272003 269783
10289B69783j9825j8282r242j3264k6547l9751l3994j2337j0974l965n818j0442
$$ 269783 249958 231676 222434 209170 182623 142872 108878 96541 85567 81602 75784 65342
10277F5342K84p0k668p736j3710k118k307j550J6633K915r970j9996r545k661
$$ 65342 65626 65556 62888 55152 41442 39324 37017 35467 52100 55015 45045 25049 15504 12843
10263A2843L823p174Q474J5183l699L399j227j3546j5348M227K549M248J7563
$$ 12843 16666 9492 17966 33149 29450 32849 31622 18076 2728 6955 9504 13752 31315
10250C1315J2652Q725N976o378n023Q269N775o228j0457n417j429j0855j2554
$$ 31315 43967 52692 58668 52290 47267 55536 61311 55083 44626 39209 37780 26925 14371
10237A4371j697R411r37j2401l302J0108K697n685l558k826r542N869O995N469
$$ 14371 12674 22085 21148 8747 5445 15553 18250 12565 9007 6181 -3361 2508 9503 14972
10223A4972J570J0328n427l236n959N386J0968n180n303l726J0125J2713M204
$$ 14972 16542 26870 21443 18207 12248 17634 28602 23422 18119 14393 24518 37231 41435
10210D1435r96m884m932p158Q589O176p785j6441l426R654n274N80M141p443m852
$$ 41435 40439 35555 30623 23465 32054 38230 30445 14004 10578 20232 14958 15538 19679 12236 7384
10195G384n326L956P883J7573O310j7573j439N004O033l520l463j2073j6224l065
$$ 7384 2058 6014 13897 31470 37780 20207 18768 23772 29805 26285 22822 10749 -5475 -8540
10181h540J5136J8809Q654O371m099n754l589J657m445p153l202r410O856J358
$$ -8540 6596 25405 34059 40430 36331 30577 26988 28645 24200 17047 13845 4435 11291 12649
10167A2649l277o685R714N941p013j3604J1127J002m706j2203l762R884j571p116
$$ 12649 9372 2687 12401 18342 11329 -2275 8852 9854 5148 -7055 -10817 -933 -2504 -9620
10153i620J4248J2635o277L37L301j81K82J9735M971q035j5283j1386N333J0677
$$ -9620 4628 17263 10986 11323 14624 14443 14725 34460 39431 31396 16113 4727 10060 20737
10139B0737M920K642N358N877r70j298q840j3058j932R52J2208J24m237l683k553
$$ 20737 25657 28299 33657 39534 38564 37266 28426 15368 13436 14388 26596 26720 22483 18800 16247
10124A6247j0307k161n18o614K645R877J2049j1951j2542k92j8791p297J5554
$$ 16247 5940 3779 3261 -3353 -708 9169 21218 9267 -3275 -3567 -22358 -29655 -14101
10111a4101J2700O388p317p995q179J6057j033m403N752l505j2247k544N414J2115
$$ -14101 -1401 4987 -2330 -10325 -18504 -2447 -3480 -7883 -2131 -5636 -17883 -20427 -15013 -2898
10097b898J7848N512N50O153R21j2341n757k705K453Q959l054l14K234N192j4356
$$ -2898 14950 20462 21012 27165 28086 15745 9988 7283 9736 18695 15641 15327 17561 22753 8397
10082H397k027J4678l440j0913O47J4858R910K339M883j587K432J0714Q677P562
$$ 8397 6370 21048 17608 6695 7342 22200 32110 34449 39332 37745 40177 50891 59568 67130
10068F7130N661P098J9900L9270O9055J03477J49378J50823O3824N223j1306K9075
$$ 67130 72791 79889 99789 139059 208114 311591 460969 611792 675616 680839 669533 698608
10056F98608o9165k25705j40279o5147l9136l2136k7449k3995r089O32L728n078
$$ 698608 629443 403738 263459 198312 159176 127040 99591 75596 66507 67139 70867 65789
10044F5789P412J795p830o1l947q05p05L238m512J98m060l399K424k714L514N663
$$ 65789 73201 74996 67166 67105 63158 62353 61648 64886 60374 60572 56512 53113 55537 52823 56337 62000
10028F2000L493q582j796j880n084j2346j4086P076Q509R089j0877j5868r559
$$ 62000 65493 56911 55115 53235 48151 35805 21719 28795 37304 46393 35516 19648 10089
10015A0089Q978J1629j319j6516M708Q425K622J0627K168j08j5133J84P733K419
$$ 10089 19067 30696 29377 12861 17569 25994 28616 39243 41411 41303 26170 26354 34087 36506
10001C6506n107n200n505p204k801p97j231o535J474J357j2596k379M610R04J4141
$$ 36506 31399 26199 20694 13490 10689 9892 8661 2126 3600 4957 -7639 -10018 -5408 -4504 9637
9986I637k84j72o811n203J0104O547l096L811N000p225J028o71o87K226j2322
$$ 9637 9353 9181 2370 -2833 7271 13818 10722 14533 19533 12308 13336 12665 11978 14204 1882
9971A882r199L489N471M702j138O827J3843Q362M982r517j9156j284L012O274
$$ 1882 -7317 -3828 1643 6345 5207 12034 25877 34239 39221 29704 10548 9264 12276 18550
9957A8550j735m655J926o024q146j46J712O016J4744k434k0261k576P033M663
$$ 18550 16815 12160 14086 8062 -84 -230 1482 7498 22242 19808 -453 -3029 4004 8667
9943H667k734L366O159j4577n317Q632q319m16P975P414O750o241o606k011Q710
$$ 8667 5933 9299 15458 881 -4436 4196 -4123 -4539 3436 10850 17600 11359 4753 2742 11452
9928A1452O687O58j753m852m375Q110K00k528m553R946J296r890n737o078n162
$$ 11452 18139 18797 17044 12192 7817 15927 16127 13599 9046 18992 20288 10398 4661 -1417 -6579
9913f579Q114J7955p342k746n352N370Q784N546r479q81q4N520O632q412p638
$$ -6579 1535 19490 12148 9402 4050 9420 18204 23750 14271 13390 13306 18826 25458 17046 9408
9898I408k071K000K051n456m045K081K062K609l608K028j821M46J4230L339p060
$$ 9408 7337 9337 11388 5932 1887 3968 6030 8639 5031 7059 5238 5684 19914 23253 16193
9883A6193N362J2852q263j5136M175R858J1652l011j142j701o841r312P400N513
$$ 16193 21555 34407 26144 11008 15183 25041 36693 33682 32540 30839 23998 14686 22086 27599
9869B7599j5033k114O406L063L953o495j24m48p869Q076j050j0654Q744Q534l210
$$ 27599 12566 10452 16858 19921 23874 17379 17255 16807 8938 17014 15964 5310 14054 22588 19378
9854A9378O156J464m097J917L055o801N136J4644j148m022n471j1768j0062Q283
$$ 19378 25534 26998 22901 24818 27873 21072 26208 40852 39704 35682 30211 18443 8381 16664
9840A6664N402m48q711J180J0612J5148M050j1470q918l61K527J0004o911j6134
$$ 16664 22066 21618 12907 14087 24699 39847 43897 32427 23509 23148 25675 35679 28768 12634
9826A2634k403j5739o855q21J0016J0401p645j470J8028p771P558j671p378l567
$$ 12634 10231 -5508 -12363 -13184 -3168 7233 -412 -1882 16146 8375 15933 14262 6884 3317
9812C317K962M806M716q669r755J3976P795p291P77O80r573O627k54k882o950
$$ 3317 6279 11085 15801 7132 -2623 11353 19148 11857 12634 13314 3741 10368 10114 7232 282
9797B82l011P412M01L719n411O4N726Q932J2461l007j5627l797K660J9066M939
$$ 282 -2729 4683 5084 8803 3392 3456 9182 18114 30575 27568 11941 8144 10804 29870 34809
9782C4809j6737p795j331r168m256M398P538M665m639p782L44N503O261J0743
$$ 34809 18072 10277 8946 -222 -4478 -80 7458 12123 7484 -298 46 5549 11810 22553
9768B2553o658j6304j280J824P150j3760k578O922R459j416p148m013J369j4375
$$ 22553 15895 -409 -1689 135 7285 -6475 -9053 -2131 7328 5912 -1236 -5249 -3880 -18255
9754a8255L077K1422J6458k464r115j1402q364M702O812j536K461l589K561J1785
$$ -18255 -15178 6244 22702 20238 11123 -279 -8643 -3941 2871 1335 3796 207 2768 14553
9740A4553k60r151R645M388j3089L785j894n615R692P145j5241j374M252k029
$$ 14553 14293 5142 14787 19175 6086 9871 7977 2362 12054 19199 3958 2584 6836 4807
9726D807l606J523Q222N95Q683j151o48R089q820M698m473K811K605L42J0452
$$ 4807 1201 2724 10946 11541 20224 19073 18425 27514 18694 23392 18919 21730 24335 24677 35129
9711C5129L304n678o950m451K349J054j2682N633L712l225L588k927N675l760
$$ 35129 38433 32755 25805 21354 23703 24757 12075 17708 21420 18195 21783 18856 24531 20771
9697B0771l494j4157j893P774Q154L303l677m025j887M893R008L00j1123N925
$$ 20771 17277 3120 1227 9001 17155 20458 16781 12756 10869 15762 24770 25070 13947 19872
9683A9872R1j907q156k548J255J551j527O618o031L33M91P336J0796L44j66m71
$$ 19872 19963 18056 9900 7352 8607 10158 8631 15249 9218 9551 10042 17378 28174 28518 28352 27881
9667B7881l893k615j3129r226j937J0120P453K285K080k151q632M833L587M343
$$ 27881 23988 21373 8244 -982 -2919 7201 14654 16939 19019 16868 8236 13069 16656 20999
9653B0999J482k433o487K114O453N921l89j6488j123m133Q169J2594p096m483
$$ 20999 22481 20048 13561 15675 22128 28049 27660 11172 10049 5916 14085 26679 19583 15100
9639A5100j0555K010J1976n802l115J3100O23J1070j0446o715r488k52P995l59
$$ 15100 4545 6555 18531 12729 9614 22714 23337 34407 23961 17246 7758 7506 15501 15142
9625A5142j497o133O415O817J328j0807j2224J326m981K48L941J3897N401q02
$$ 15142 13645 7512 13927 20744 22072 11265 -959 367 -4614 -4366 -425 13472 18873 18071
9611A8071j1652Q712n13n918J4642J4945j644j904j394K728p117j2943j0060J036
$$ 18071 6419 15131 14618 8700 23342 38287 36643 34739 33345 36073 28956 16013 5953 6989
9597F989J2219N67l721K200n683M752M393k662n603q62O480J632M85k940j1304
$$ 6989 19208 19775 16054 18254 12571 17323 21716 19054 13451 12589 19069 20701 21186 18246 6942
9582F942p533N022J2222J2302N253m067l100j120L345o057p317L757K893J067
$$ 6942 -591 4431 16653 28955 34208 30141 27041 25921 29266 23209 15892 19649 22542 23609
9568B3609n237q236Q714J0284K079m67j097N400J188m616K16J606q71M616o078
$$ 23609 18372 10136 18850 29134 31213 30746 29649 35049 36237 31621 31837 33443 32572 37188 31110
9553C1110j40J1057k556m871K057M688j462j1123p848J6422J3062N811j4547q819
$$ 31110 30970 42027 39471 34600 36657 41345 39883 28760 20912 37334 50396 56207 41660 32841
9539C2841P539J544M600j1206j6341j3203p320J5204J4714J9536J5266j1390j1975
$$ 32841 40380 41924 46524 35318 18977 5774 -1546 13658 28372 47908 63174 51784 39809
9526C9809o467M105L200L888l859j3342P902J3793j0466n770J1014J0077j3064
$$ 39809 33342 37447 40647 44535 40676 27334 35236 49029 38563 32793 43807 53884 40820
9513D0820k0800Q461O825K716J3265K10Q038p117j2030n18L180n839P39O119R652
$$ 40820 20020 28481 35306 38022 51287 51497 59535 52418 40388 39870 43050 37211 37950 44069 53721
9498E3721l078j8269j869k32K439j3687J1869K4061K320j2082j597J360p162J2841
$$ 53721 50643 32374 30505 30273 32712 19025 30894 54955 57275 45193 43596 44956 37794 50635
9484E0635J1526j7273p52j893Q57m287R872R597q266J0122M542r040j1171j2599
$$ 50635 62161 44888 44136 42243 43100 38813 48685 58282 50016 60138 64680 55640 44469 31870
9470C1870L323P760L467J25N411N649J939j904J251L560r215O014r854n379K595
$$ 31870 35193 42953 46420 46545 51956 57605 59544 57640 58891 62451 53236 59250 49396 44017 46612
9455D6612j2510j9385n096Q899J999O446N144J0918k357j422J2736J0045l689
$$ 46612 34102 14717 9621 18520 20519 26965 32109 43027 40670 39248 51984 62029 58340
9442E8340j1074M522m466L681j08K342M415m308j3209r81j067K427J4731N368
$$ 58340 47266 51788 47322 51003 50895 53237 57652 53344 40135 39154 38087 40514 55245 60613
9428F0613q618J693l046n383m13J1745J040r215j803L813j0753l802J1057P578
$$ 60613 51995 53688 50642 45259 44846 56591 57631 48416 46613 50426 39673 35871 46928 54506
9414E4506M350j447K116m147j497L345O034O456K730m833k247m252q917J2028
$$ 54506 58856 57409 59525 55378 53881 57226 63260 69716 72446 67613 65366 61114 52197 64225
9400F4225j2459j0606j738M349N73J8856r292j0811M976q51K727j561J389Q766
$$ 64225 51766 41160 39422 43771 44344 63200 53908 43097 48073 47222 49949 48388 49777 58543
9386E8543R519j357K032o414k609j4944j476J5354m566n177J254J5596J206l367
$$ 58543 68062 66705 68737 62323 59714 44770 43294 58648 54082 48905 50159 65755 66961 63594
9372F3594j0280j8875o766O62J0867J5935J1835r023j3974N273N7l234K378l332
$$ 63594 53314 34439 27673 28335 39202 55137 66972 57949 43975 49248 49305 46071 48449 45117
9358D5117J673k618p94n672o646M462O157J818j389o070k891N361O799L407O866
$$ 45117 46790 44172 43378 37706 31060 35522 41679 43497 42108 36038 33147 38508 45307 48714 55580
9343E5580J2472j565N142k806r714o705k45L107j8973l345P796J8437R133J725
$$ 55580 68052 66487 71629 68823 59109 52404 52159 55266 36293 32948 40744 59181 68314 70039
9329G0039k891L594k211L51j0307K790l082j0755o370o054M972O8J0181J3867
$$ 70039 67148 70742 68531 68882 58575 61365 58283 47528 41158 35104 40076 40144 50325 64192
9315F4192P652o97K569J77L16J82n403L430L818J0972M364p592P49L645K964k836
$$ 64192 71844 71147 73716 73893 74209 74391 68988 72418 76236 87208 91572 83980 84729 88374 91338 88502
9299H8502o779q104m073j0859q600R900P641K913J309j0222O750O977K891j2615
$$ 88502 81723 73619 69546 58687 50087 59987 67628 70541 71850 61628 68378 75355 78246 65631
9285F5631N642J2435N719J3389l267j2178j4737k0681J5957R837j1559L40L243
$$ 65631 71273 83708 89427 102816 99549 87371 72634 51953 67910 77747 66188 66528 69771
9272F9771m732J1674N994j4162K029O942l222N63J2003P277n257J0964n44M665
$$ 69771 65039 76713 82707 68545 70574 77516 74294 74857 86860 94137 88880 99844 99300 103965
9258A03965k933J0423j1067j4605J0120K814L043r148Q494J3703k470K069k801
$$ 103965 101032 111455 100388 85783 95903 98717 101760 92612 101106 114809 112339 114408 111607
9245A11607O764j786j0225J255N333J434Q856o276n289l693K41J0939N621P262
$$ 111607 118371 116585 106360 107615 112948 114382 123238 116962 111673 107980 108221 119160 124781 132043
9231A32043L537k899K124N750K0798J9204J0407j069m895J2015J6696L7002M4707
$$ 132043 135580 132681 134805 140555 161353 180557 190964 189895 185000 197015 213711 250713 295420
9218B95420M5892O1395O9764P5736R5950J29377J61287J76150J72398J57389J25073
$$ 295420 341312 402707 472471 548207 644157 773534 934821 1110971 1283369 1440758 1565831
9207A565831R5963L8696j5911p6732j26789j48694j56953j55252j36234j33011
$$ 1565831 1661794 1700490 1684579 1607847 1481058 1332364 1175411 1020159 883925 750914
9197G50914j02519q0752o1898l0523l7487k7329p638k5611k4891j4902n241k4753
$$ 750914 648395 567643 505745 475222 437735 410406 402768 377157 352266 337364 332123 307370
9185C07370j6331p359N471o655n702q727p694N989p024j0410j2934k358K059j4193
$$ 307370 291039 283680 289151 282496 276794 268067 260373 266362 259338 248928 235994 233636 235695 221502
9171B21502o023R113Q167q370r845o277K847n585M45q91M672L71o36R11l935k915
$$ 221502 215479 224592 232759 224389 214544 208267 211114 205529 205974 205083 209755 210126 209490 210401 206466 203551
9155B03551P628N142P659j2605j7869j5340k717J4702J0845M910L348J3086J0723
$$ 203551 211179 216321 223980 211375 193506 178166 175449 190151 200996 205906 209254 222340 233063
9142B33063K849J2516J5984J5280J8738L1079N0577P0741O4545P3466J07094J36373
$$ 233063 235912 248428 264412 279692 298430 329509 380086 450827 515372 588838 695932 832305
9130H32305J64139K23868L13893M98147Q03947J294942J854744J842265J052869
$$ 832305 996444 1220312 1534205 2032352 2836299 4131241 5985985 7828250 8881119
9121H881119K87692L0339k4189q84022k146251j902244j137941o70531m27519
$$ 8881119 9168811 9199150 9174961 8290939 6144688 4242444 3104503 2433972 2006453
9112B006453k86476j99241j57180j19034j03407o5127m8300l5106k9409l9600
$$ 2006453 1719977 1520736 1363556 1244522 1141115 1075988 1027688 992582 963173 923573
9102I23573m0529l7393l6851l8550k9343l3375l1023k1165k9221m2064k7152k2960
$$ 923573 883044 845651 808800 770250 740907 707532 676509 655344 626123 584059 556907 533947
9090E33947k0043k3838j8729j9575j3887m145j5494k0219j9535j3487j2247j0241
$$ 533947 513904 490066 471337 451762 437875 433730 418236 398017 378482 364995 352748 342507
9078C42507q388j607J8084J321q383j1226L135P957J3703K6401K0794J6622M75
$$ 342507 334119 332512 350596 351917 343534 332308 335443 343400 357103 383504 404298 420920 421395
9065D21395k021J1408O398J6336R648j7694j2640j1225k3306k7115l5341j7407
$$ 421395 419374 430782 437180 453516 463164 445470 432830 421605 398299 371184 335843 318436
9053C18436O228Q562n268k8832n351Q57p630j2966j9065k4253j9694q582o129
$$ 318436 324664 333226 327958 299126 293775 294632 287002 274036 254971 230718 211024 202442 196313
9040A96313j0810m419M254k928r92q518o044N471j041r493K668J984k013K279
$$ 196313 185503 181084 185338 182410 181418 172900 166856 172327 171286 161793 164461 166445 164432 166711
9026A66711o19j7593p40P897r627J0857R259p44k188J715n52R70k496n30Q703
$$ 166711 166092 148499 147759 155656 146029 156886 166145 165401 163213 164928 164376 165346 162850 162320 171023
9011A71023R567P631p742P84L130Q245J7824J9243M2765O7245Q7207J07334J04465
$$ 171023 180590 188221 180479 181263 184393 192638 210462 229705 272470 339715 426922 534256 638721
8998F38721Q1362O8267L6928r182p3785r3653p4757n7595m6924l8803j6318j1772
$$ 638721 720083 788350 825278 816096 742311 648658 573901 516306 469382 430579 414261 402489
8986D02489j7591k2917k1319j9154q482r967j2529r884J752r359j291k847O462
$$ 402489 384898 361981 340662 321508 313026 303059 290530 280646 282398 273039 271748 268901 275363
8973B75363P848R129M555M608j8639j6825L126j709n770r212P426K7578P806J2060
$$ 275363 283211 292340 296895 301503 282864 266039 269165 267456 261686 252474 259900 287478 295284 307344
8959C07344J2490L77N005J3850K388m331k82J0714J3523K0093K8488K8150J1580
$$ 307344 319834 320211 325216 339066 341454 337123 336841 347555 361078 381171 409659 437809 449389
8946D49389J2564J0224K7155K3995J894J4559J0389L3072L7681K9323J9966J0479
$$ 449389 461953 472177 499332 523327 525221 539780 550169 583241 620922 650245 670211 680690
8934F80690K5798K5220j8696k6767k3400l1805k6240j8632n50L653N277K0204
$$ 680690 706488 731708 713012 686245 662845 631040 604800 586168 585618 589271 594548 614752
8922F14752L2069M0272M9660M3664K7894K2640M4100M1338K7379J2173L854j6757
$$ 614752 646821 687093 736753 780417 808311 830951 875051 916389 943768 955941 959795 943038
8910I43038k7680k0946k5619j7932k0073j4746l720J2560K1096J3409J6719J7652
$$ 943038 915358 894412 868793 850861 830788 816042 812322 824882 845978 859387 876106 893758
8898H93758J8712K0995K7926J8080J7470K0257K7390L0521M4961M7551L1378J7665
$$ 893758 912470 933465 961391 979471 996941 1017198 1044588 1075109 1120070 1167621 1198999 1216664
8886A216664Q899P309o655k646j9252l561J370R996J8288P076M0407L5045K9092
$$ 1216664 1225563 1232872 1226217 1223571 1204319 1200758 1202128 1212124 1230412 1237488 1277895 1312940 1342032
8873A342032K8175L1043K6238K9848L0835K6467L7729M8779L8485L2710L9433
$$ 1342032 1370207 1401250 1427488 1457336 1488171 1514638 1552367 1601146 1639631 1672341 1711774
8862A711774O3766O6205N6223O9288O0704O4515R1377J11727R6082P7260R6555
$$ 1711774 1775540 1841745 1897968 1967256 2027960 2092475 2183852 2295579 2391661 2468921 2565476
8851B565476J00253Q8705R3153R9853J42372J65935K01205K25748K43475K75659
$$ 2565476 2665729 2754434 2847587 2947440 3089812 3255747 3456952 3682700 3926175 4201834
8841D201834K97415L18107L14375L23703L41462L53314M20842N23886O51102P89501
$$ 4201834 4499249 4817356 5131731 5455434 5796896 6150210 6571052 7094938 7746040 8535541
8831H535541R49058J108356J284909J510914J802431K161313K609343L137159
$$ 8535541 9484599 10592955 11877864 13388778 15191209 17352522 19961865 23099024
8823B3099024L715160M299492M973762N870042P217695R228231J2435124J7706213
$$ 23099024 26814184 31113676 36087438 41957480 49175175 58403406 70838530 88544743
8815H8544743K6066843L8446575N3747319O4721764N9009363L6917242J5369963
$$ 88544743 114611586 153058161 206805480 271527244 330536607 367453849 382823812
8808C82823812K723732q627405l5173842o5815330o7266713m9351706l2808843
$$ 382823812 385547544 376920139 341746297 275930967 208664254 159312548 126503705
8801A26503705k1893769j5120177j0800374p879408n866165m538155l749425l246817
$$ 126503705 104609936 89489759 78689385 70809977 64943812 60405657 56656232 53409415
8793E3409415k853305k628803k575720k474574k292678k110472j928963j751654
$$ 53409415 50556110 47927307 45351587 42877013 40584335 38473863 36544900 34793246
8785C4793246j587683j462144j362611j242589j083589q86290o50040m66647m55727
$$ 34793246 33205563 31743419 30380808 29138219 28054630 27168340 26518300 26051653 25595926
8776B5595926n52237o69929p66704q97680j088393j215594j197736j063157q86940
$$ 25595926 25043689 24373760 23607056 22709376 21620983 20405389 19207653 18144496 17257556
8767A7257556o70826m47748j98389J60817O09582R64866Q26683K50665j95696
$$ 17257556 16586730 16138982 15940593 16101410 16710992 17675858 18502541 18753206 18557510
8758A8557510l54067n23605j332504k030487j703967j158191q33886o29949n08210
$$ 18557510 18203443 17679838 16347334 14316847 12612880 11454689 10620803 9990854 9482644
8749I482644m19330l77780l27590k96787k77026k53985k34712k33421k27053k17929
$$ 9482644 9063314 8685534 8357944 8061157 7784131 7530146 7295434 7062013 6834960 6617031
8739F617031k14334k00405j80883j78287j81461j73215j63196j70157j68676j65876
$$ 6617031 6402697 6202292 6021409 5843122 5661661 5488446 5325250 5155093 4986417 4820541
8729D820541j52135j55465j39410j38841j26462j21506j03563j14617j21635r3376
$$ 4820541 4668406 4512941 4373531 4234690 4108228 3986722 3883159 3768542 3646907 3553531
8719C553531r8256r7632p9441o9844o0737o1814p9107q6073q0212q0296r6260
$$ 3553531 3455275 3357643 3278202 3208358 3147621 3085807 3006700 2920627 2840415 2760119 2663859
8708B663859r0279o9448p1528o9954m8956m9610m8840o4880p6128p1538n7431
$$ 2663859 2573580 2504132 2432604 2362650 2313694 2264084 2215244 2150364 2074236 2002698 1945267
8697A945267o3761o7261p4367q2793q7345p4090p2742q8361r2883p3975q0763
$$ 1945267 1881506 1814245 1739878 1657085 1569740 1495650 1422908 1334547 1241664 1167689 1086926
8686A086926r3044m8037k8605l1135l0253k3667l2751l7218k4603k6452l5594
$$ 1086926 993882 945845 917240 886105 855852 832185 799434 762216 737613 711161 675567
8675F75567m3431m5057k9217q191j4126j2189p435m896N046j0229P31j0723L004
$$ 675567 632136 587079 557862 549671 535545 523356 515921 511025 516071 505842 506573 495850 498854
8662D98854Q994J272j1915j189J1709p845j1442p006n858K938n680j5832k3119
$$ 498854 507848 509120 497205 496016 507725 499880 488438 481432 475574 478512 472832 457000 433881
8649D33881j9705J406M532P235J3422j392M167J8086Q819K525M995K2925K9888
$$ 433881 414176 415582 420114 427349 440771 439379 443546 461632 470451 472976 477971 500896 530784
8636E30784M8157O5354M7030L463l3524n2596n4599o6696j12539j07567r6428
$$ 530784 578941 644295 691325 694788 661264 608668 554069 487373 374834 267267 170839
8625A70839q9709j06188r3979m1869q728K6473M0956O4055J04788J13428J01844
$$ 170839 81130 -25058 -119037 -160906 -169634 -143161 -102205 -38150 66638 180066 281910
8614B81910O1602K5611l863o79n831Q5Q204l304o039n622j4041j2907Q020K1943
$$ 281910 343512 369123 365260 364581 358750 358835 367039 363735 357696 352074 338033 325126 333146 355089
8600C55089J3344P301K0221J4405O847k20J9759K3908L6430L2514Q095M601K0537
$$ 355089 368433 375734 395955 410360 417207 416987 436746 460654 497084 529598 537693 542294 562831
8587E62831k803l6642k7203j1275j1657k2142k3019j4453j6341j4145q596q088
$$ 562831 560028 523386 496183 484908 473251 451109 428090 413637 397296 383151 374555 366467
8575C66467l563n781q045n340M159j4240k0203j1267k435J1889P013J436K630
$$ 366467 362904 357123 349078 343738 347897 333657 313454 302187 299752 311641 318654 320090 322720
8562C22720L234j459n26n944r29p577k194P79J8179J3348J0704K3891J5170K6034
$$ 322720 325954 324495 323969 318025 317096 309519 307325 308104 326283 339631 350335 374226 389396 415430
8548D15430K3164J8483L519k6739k5079k1561l2699l5555k1139n230j6278j2508
$$ 415430 438594 457077 460596 433857 408778 387217 354518 318963 297824 292594 276316 263808
8536B63808k1886j2377r801p692k491N896j2578j9073l282Q8J953r405j3404p358
$$ 263808 241922 229545 219744 212052 209561 215457 202879 183806 180524 180612 182565 173160 159756 152398
8522A52398r728j135n733Q000J1145j7402l338J534j1371L703L998K237J86l84
$$ 152398 142670 141535 135802 143802 154947 137545 134207 135741 124370 128073 132071 134308 134494 134110
8508A34110M524J1318K2535M3476M2574L5530K5021J1311M863j2274k9614m5572
$$ 134110 138634 149952 172487 215963 258537 294067 319088 330399 335262 322988 293374 247802
8496B47802l3442l0673k7154j6879j5186j1065m781n244j6365M718J1301K27m668
$$ 247802 214360 183687 156533 139654 124468 113403 108622 103378 87013 91731 103032 103259 98591
8483I8591j0229L318L785J0962K740L427m465j7362O639J7680l877j4632r256
$$ 98591 88362 91680 95465 106427 109167 112594 108129 90767 97406 115086 111209 96577 87321
8470H7321j1421L123J0977J871o073j0488P690J615j247J6547K9235J5223J7359
$$ 87321 75900 79023 90000 91871 85798 75310 83000 84615 83368 99915 129150 144373 161732
8457A61732J8383J3704L097J632M039j4177l0743l1567j8592j0292q85Q113r461
$$ 161732 180115 193819 196916 198548 202587 188410 157667 126100 107508 97216 96331 104444 94983
8444I4983P055J5751p670j8273j0909p329N982n134m399j460O309O80K1733J5912
$$ 94983 102038 117789 110119 91846 80937 73608 79590 74456 70057 68597 74906 75586 97319 113231
8430A13231M507j3353R353J0424N233K5116J7635N106J0994L2689K5572K6165
$$ 113231 117738 104385 113738 124162 129395 154511 172146 177252 188246 220935 246507 272672
8418B72672L6443L5221N2972P1481J02672J14446J38684J64473J66810J68223
$$ 272672 309115 344336 397308 468789 571461 685907 824591 989064 1155874 1324097
8408A324097J51116J19022P4995J2104l6606q9140j42281j65808j64352j55245
$$ 1324097 1475213 1594235 1669230 1681334 1644728 1555588 1413307 1247499 1083147 927902
8398I27902j36847j12838q8405o5241n2653m8726m9768k8111j6011j4730k7711
$$ 927902 791055 678217 589812 524571 471918 423192 373424 345313 329302 314572 286861
8387B86861j6864o041j4167k2988k0275L998n063P490j9999j7380r964L320r493
$$ 286861 269997 263956 249789 226801 206526 210524 205461 212951 192952 175572 165608 168928 159435
8374A59435p857o483j3312m747k889j2002j3002m501J0543O576j890p290o057
$$ 159435 151578 145095 131783 127036 124147 112145 99143 94642 105185 111761 109871 102581 96524
8361I6524p445K036O446Q143K717L781l460m868m160M246M749j2493j6463k3458
$$ 96524 89079 91115 97561 105704 108421 112202 108742 103874 99714 103960 108709 96216 79753 56295
8347E6295o732j1374N03J3104J6740J2087j8356j3927M666J601J864O160n565
$$ 56295 49563 38189 38692 51796 68536 80623 62267 48340 53006 54607 56471 62631 57066
8334E7066j4470J5453J4192J2984n105r253n94p961m751j439k234n075l957O023
$$ 57066 42596 58049 72241 85225 80120 70867 70273 62312 57561 56122 53888 48813 44856 50879
8320E0879J790j6458m786O713J4730o701O408N884P54l724j4740L562M302l185
$$ 50879 52669 36211 31425 38138 52868 46167 52575 58459 59213 55489 40749 44311 48613 45428
8306D5428k161J11j250k663j806J397P340j3971j6935O751J2598J1097j0670j1741
$$ 45428 43267 43378 42128 39465 37659 39056 46396 32425 15490 22241 34839 45936 35266 23525
8292B3525k104P843L773L102O380J231j4753j2887O500J1514R127J922J2057K058
$$ 23525 21421 29264 33037 36139 42519 43750 28997 16110 22610 34124 43251 45173 57230 59288
8278E9288r347k4178Q680k179J315n968l858K633j0590m78l987Q7p90q83M044
$$ 59288 49941 25763 34443 32264 33579 27611 23753 26386 15796 15318 11331 11418 10628 9745 13789
8263A3789J2974n690j572K673N666K913k650L498k333p728n410j0973J823J5170
$$ 13789 26763 21073 19501 22174 27840 30753 28103 31601 29268 21540 16130 5157 6980 22150
8249B2150Q813P51O883k2612j9964Q861K08o263K513o079m063N779J4134P233
$$ 22150 30963 31714 38597 15985 -3979 4882 5090 -1173 1340 -4739 -8802 -3023 11111 18344
8235A8344o42N412p664j6421K157J0309L089o08k596k700n762l961m252R34P390
$$ 18344 17702 23114 15450 -971 1186 11495 14584 13976 11380 8680 2918 -1043 -5295 -4361 3029
8220C029l44J565J3559Q064m006p913J450j380p092O428K152j8444j0687J0295
$$ 3029 2685 4250 17809 25873 21867 13954 15404 14024 6932 13360 15512 -2932 -13619 -3324
8206c324J5026O257R026O192p267o818j2541m829L109K490J954J1959m136k937
$$ -3324 11702 17959 26985 33177 25910 19092 6551 1722 4831 7321 9275 21234 17098 14161
8192A4161o581p002J447O855M105m249j0837k491N021J6596J8196k355j148p949
$$ 14161 7580 578 2025 8880 12985 8736 -2101 -4592 429 17025 35221 32866 31718 23769
8178B3769j7201k876N101m294m90J539n41L966k206o905O527J2985l928j0409
$$ 23769 6568 3692 8793 4499 4009 5548 5007 8973 6767 -138 6389 19374 15446 5037
8164E037J841P118J2807N425k0654J913k867m434M828j1710m226J1800P868J272
$$ 5037 6878 13996 26803 32228 11574 13487 10620 6186 11014 -696 -4922 6878 14746 16018
8150A6018K58l242Q463M254n286p205l729O363R647r653j2217K428N508J3934
$$ 16018 16276 13034 21497 25751 20465 13260 9531 15894 25541 15888 3671 6099 11607 25541
8136B5541M769m038q730j0814M377j594M391J2343L963n447j2257R528J568K864
$$ 25541 30310 26272 17542 6728 11105 9511 13902 26245 30208 24761 12504 22032 23600 26464
8122B6464J245j7674j130k604R40m046k176N488J4653K882n895p522M903M878
$$ 26464 27709 10035 8905 6301 7241 3195 1019 6507 21160 24042 18147 10625 15528 20406
8108B0406k458n036k795l360k66n63j895J152j467m047l515L723J9097J0839L283
$$ 20406 17948 12912 10117 6757 6491 5928 4033 5185 3718 -329 -3844 -121 18976 29815 33098
8093C3098L35J0125N00j4575o018J877p489j130j5386n754K013l544J81J0485
$$ 33098 33433 43558 44058 29483 23465 25342 17853 16723 1337 -4417 -2404 -5948 -5767 4718
8079D718L5Q6j38q017K141J1154k586m826N772K98J4465R075O840k965j0773k005
$$ 4718 4753 4839 4701 -3316 -1175 9979 7393 2567 8339 8637 23102 32177 39017 36052 25279 23274
8063B3274n368Q402q715r813l43n495m439M939m14q292L738J3483O824l934J250
$$ 23274 17906 26308 17593 7780 7437 1942 -2497 2442 2028 -6264 -2526 10957 17781 13847 15097
8048A5097k869R370J984n425j2011p625M90K09L923M652L494Q369j1708k430M61
$$ 15097 12228 21598 23582 18157 6146 -1479 -989 -780 3143 7795 11289 19658 7950 5520 5981
8033E981O511q05J2852l579L125J0695j582o786k380L047L317p168k244L145Q997
$$ 5981 12492 11687 24539 20960 24085 34780 33198 26412 24032 27079 30396 23228 20984 24129 33126
8018C3126R49m501p541O198L507Q980m320m315m278r656l047P336k233K491J007
$$ 33126 34075 29574 22033 28231 31738 40718 36398 32083 27805 18149 15102 22438 20205 22696 23703
8003B3703P801r019j731k444P968n012r26R229j0341j558Q724p492j0145k916
$$ 23703 31504 22485 20754 18310 26278 21266 20340 29569 19228 17670 26394 18902 8757 5841
7989E841o98o712M89O374r48l021P058O642J2525j467p848l646K263P044M713
$$ 5841 5143 -1569 -1080 5294 4346 1325 8383 15025 27550 26083 18235 14589 16852 23896 28609
7974B8609O670j6q034q864l164q224l962J0460M041m930L723n414n602J2429R829
$$ 28609 35279 35263 27229 18365 15201 6977 3015 13475 17516 12586 16309 10895 5293 17722 27551
7959B7551J240m989m94L339P707k604p899q29p141r261l455J1644r316j66j794
$$ 27551 28791 23802 23308 26647 34354 31750 23851 23022 15881 6620 3165 14809 5493 5327 3533
7944C533j43P21M598J0855O174O035j6517P228O433R430J159j5252k9433k414
$$ 3533 3390 4111 8709 19564 25738 31773 15256 22484 28917 38347 39506 24254 -5179 -7593
7930g593O64n61P499K73O397p576j3487J737P13L868J1574k400j0869J351N456
$$ -7593 -6929 -7490 9 282 6679 -897 -14384 -12647 -11934 -8066 3508 1108 -9761 -8410 -2954
7915b954j441k776L643J0245Q445J1096Q640K866j3587j8252j0591o292p497O831
$$ -2954 -4395 -7171 -3528 6717 15162 26258 34898 37764 24177 5925 -4666 -10958 -18455 -11624
7901a1624O529L573l329n940N211K107J10J1050K113k168m431n869j448N970Q94
$$ -11624 -5095 -1522 -4851 -10791 -5580 -3473 -3363 7687 9800 7632 3201 -2668 -4116 1854 2748
7886B748j0826k693O464J1380O135J6565q612m002m572k805J254K365K28q352
$$ 2748 -8078 -10771 -4307 7073 13208 29773 21161 17159 12587 9782 11036 13401 13629 5277
7872E277k405l617N592j352k506M728J1720k149p67J782j0380k705n618p463J2178
$$ 5277 2872 -745 4847 3495 989 5717 17437 15288 14521 16303 5923 3218 -2400 -9863 2315
7857B315j492m633L876m236j2226n01J7145n41R021M091O04m580m760m712R219
$$ 2315 823 -3810 66 -4170 -16396 -16897 248 -293 8728 12819 13423 8843 4083 -629 8590
7842H590n424K258J5964j0354k0317n462K4886o235j5911P80J3361M240j1051
$$ 8590 3166 5424 21388 11034 -9283 -14745 10141 3906 -12005 -11225 2136 6376 -4675
7829d675J866Q120O928P85j4734q398M230O478M440K305j7704r339J8012Q569
$$ -4675 -2809 5311 12239 13024 -1710 -10108 -5878 600 5040 7345 -10359 -19698 -1686 6883
7815F883l13o932N66j1720p742J2417l487o842j64O447K0956k560o295k884L069
$$ 6883 6570 -362 204 -11516 -19258 -6841 -10328 -17170 -17334 -10887 10069 7509 1214 -1670 1399
7800A399L269o107j5527j1719P457R599J0735J159p978m088q812P049J7598P160
$$ 1399 4668 -1439 -16966 -28685 -21228 -11629 -894 265 -7713 -11801 -20613 -13564 4034 11194
7786A1194m447o461k573p990R761P540J176j1354K506R678J2584o443l586p830
$$ 11194 6747 286 -2287 -10277 -516 7024 8200 -3154 -648 9030 21614 15171 11585 3755
7772C755q811L353L691j0799l91n944O433P879J2883k472j2301N142R285M85M124
$$ 3755 -5056 -1703 1988 -8811 -9202 -15146 -8713 -834 12049 9577 -2724 2418 11703 12188 16312
7757A6312r99n363o904Q17n346j1836K422P93m519m030k882M185J0050P846j1180
$$ 16312 15313 9950 3046 3863 -1483 -13319 -10897 -10104 -14623 -18653 -21535 -17350 -7300 546 -10634
7742a0634Q65K176N723p680l379J457M824N68K51n385m51M043O575Q79O16k049
$$ -10634 -9769 -7593 -1870 -9550 -12929 -11472 -6648 -6080 -5829 -11214 -11665 -7622 -1047 -168 448 -1601
7726a601Q939l300r088q388r767k080J8064N484l462q88n609J429O896o462J52
$$ -1601 7338 4038 -5050 -13438 -23205 -25285 -7221 -1737 -5199 -6087 -11696 -10267 -3371 -9833 -9681
7711i681N788J5052j381j8847l955J515P70m849M129N573J2592p894j2488k292
$$ -9681 -3893 11159 9778 -9069 -13024 -11509 -10739 -15588 -11459 -5886 6706 -1188 -13676 -15968
7697a5968Q467Q044R49J2431P718r252M208J3506o85j8030r339j5978o835K0328
$$ -15968 -7501 543 1492 13923 21641 12389 16597 30103 29418 11388 2049 -13929 -20764 -436
7683d36k89n994k801M510m779l862M608J031K749p888j030O510M573J117J878
$$ -436 -725 -6719 -9520 -5010 -9789 -13651 -9043 -8012 -5263 -13151 -14181 -7671 -3098 -1981 -103
7668a03k00p355p817L128j1544q67J626K392J3239J1687m606m159m039K959p818
$$ -103 -303 -7658 -15475 -12347 -23891 -24758 -23132 -20740 -7501 4186 -420 -4579 -8618 -5659 -13477
7653a3477J156O79j2504N216J5261l383j053Q615o359p374J4141J6202o555j4810
$$ -13477 -12321 -11642 -24146 -18930 -3669 -7052 -8105 510 -5849 -13223 918 17120 10565 -4245
7639d245j204J980k078l112J099j444L950O110J247K737N330J5449N907L177K877
$$ -4245 -5449 -3469 -5547 -8659 -7560 -9004 -5054 1056 2303 5040 10370 25819 31726 34903 37780
7624C7780o974r066k956j042N168K872K673o912j964P761P33j0990j3224n127
$$ 37780 30806 21740 18784 17742 22910 25782 28455 21543 19579 27340 28073 17083 3859 -1268
7610a268R794N621l632n362O831r413m935n991m93m852j3051P053J5886L009q92
$$ -1268 8526 14147 10515 5153 11984 2571 -2364 -8355 -8848 -13700 -26751 -19698 -3812 -803 -1695
7595a695n2K113m455O786J3169o702k642R353l057l624O7K376l151l844n453m295
$$ -1695 -1747 366 -4089 2697 15866 9164 6522 15875 12818 9194 9261 11637 8486 4642 -811 -5106
7579e106j1337J654P962Q676L438J254n528q80J111P034m852p074M49p456p97
$$ -5106 -16443 -14789 -6827 1849 5287 6541 1013 133 1244 8278 3426 -3648 -3199 -10655 -11452
7564a1452J1494R999L06j5826q822j525K287Q455J1558l176q484M73P034n462
$$ -11452 42 10041 10347 -5479 -14301 -15826 -13539 -5084 6474 3298 -5186 -4713 2321 -3141
7550c141n313j2612J722J1322J7419P623n605j1721k717R289J4795l218j8115
$$ -3141 -8454 -21066 -19344 -8022 9397 17020 11415 -306 -3023 6266 21061 17843 -272
7537b72m761j545M675q85O20O977j4670o936J0908O889j3683j0527K564N053K2396
$$ -272 -5033 -6578 -1903 -2788 -2168 4809 -9861 -16797 -5889 1000 -12683 -23210 -20646 -15593 6803
7522F803l583o349q638m204J2152K49n271O390p490m155J3245J4949M590p549
$$ 6803 3220 -3129 -11767 -15971 -3819 -3570 -8841 -2451 -9941 -14096 -851 14098 18688 11139
7508A1139j2420q065P501J1706O311O026j43r095j4241r647p05Q710Q260q09j2647
$$ 11139 -1281 -9346 -1845 9861 16172 22198 22055 12960 -1281 -10928 -11633 -2923 5337 4528 -8119
7493h119o919L928J7102m1j7229p031J2461J4243M214j0256J995J548j2857L066
$$ -8119 -15038 -11110 5992 5951 -11278 -18309 -5848 8395 12609 2353 4348 5896 -6961 -3895
7479c895P189Q237n833l206j0945K959O183K174L175R165j554j7541l389J783
$$ -3895 3294 11531 5698 2492 -8453 -5494 689 2863 6038 15203 13649 -3892 -7281 -5498
7465e498k746q048r980Q184L747O783l88J208o274k907J0266k087K001j894P195
$$ -5498 -8244 -16292 -26272 -18088 -14341 -7558 -7946 -6738 -13012 -15919 -5653 -7740 -5739 -7633 -438
7450d38j639k55L212K653O376n32o921Q71q475o098L160k921k691k886K288K85
$$ -438 -2077 -2332 880 3533 9909 9377 2456 3327 -5148 -11246 -8086 -11007 -13698 -16584 -14296 -14011
7434a4011J680k306o710k759P230L261J0684J2747L281q485m368J1566j0508r584
$$ -14011 -12331 -14637 -21347 -24106 -16876 -13615 -2931 9816 13097 4612 244 11810 1302 -8282
7420h282n418J5069L483r739J361k592k6m773M486l146m372n401Q482J542O379
$$ -8282 -13700 1369 4852 -4887 -3526 -6118 -6144 -10917 -6431 -9577 -13949 -19350 -10868 -9326 -2947
7405b947ml407J006K975J655P247j431j3119N05m500p222l729J775k599j783j401
$$ -2947 -2951 -6358 -5352 -2377 -722 6525 5094 -8025 -7520 -12020 -19242 -22971 -21196 -23795 -25578 -26979
7389b6979J0531k294k044R583J2943L253N681q304p084L291p654l038J882N868
$$ -26979 -16448 -18742 -20786 -11203 1740 4993 10674 2370 -4714 -1423 -9077 -12115 -10233 -4365
7375d365O926J0154p16q010o877J260r468n62m966j256K03J1731j215O793J4346
$$ -4365 2561 12715 11999 3989 -2888 -1628 -11096 -11658 -16624 -17880 -17677 -5946 -7161 -368 13978
7360A3978l35j9624n042R98J7193M471r284l833K321P399J0791L332K349m157
$$ 13978 13643 -5981 -11023 -10025 7168 11639 2355 -1478 843 8242 19033 22365 24714 20557
7346B0557p69l720n988n282O819J0134O923r284j4931m042m635m061m393R377
$$ 20557 19788 16068 10080 4798 11617 21751 28674 19390 4459 417 -4218 -8279 -12672 -3295
7332c295K961J07j3180K026P907J886K242l757l648O043K640K195o723Q739M082
$$ -3295 -334 -227 -13407 -11381 -3474 -1588 654 -3103 -6751 -708 1932 4127 -2596 6143 10225
7317A0225r34L048q498r230n542P572J0978l806n258j164n141P812j4714p262
$$ 10225 9291 12339 3841 -5389 -10931 -3359 7619 3813 -1445 -2609 -7750 62 -14652 -21914
7303b1914m09M881P854K445O556Q037m501k756J2841J0125n643m020J346j1880
$$ -21914 -22323 -17442 -9588 -7143 -587 7450 2949 193 13034 23159 17516 13496 14842 2962
7289B962q36m79N711J816m204j0894j2348P997P319P679r029m444J2617n722k372
$$ 2962 2126 1647 7358 9174 4970 -5924 -18272 -10275 -2956 4723 -4306 -8750 3867 -1855 -4227
7274d227j799o655L079J1505P211m064Q548l210k591P432j2043o881M640O964
$$ -4227 -6026 -12681 -9602 1903 9114 5050 13598 10388 7797 15229 3186 -3695 945 7909
7260G909M893q911K899j0198R25N013M20P972q093n527p437l867p031P229J6561
$$ 7909 12802 3891 6790 -3408 -2483 2530 2950 10922 2829 -2698 -10135 -14002 -21033 -13804 2757
7245B757R187q984j5524j09L866m304l30M831k081J174k4r635M673R841J0372
$$ 2757 11944 2960 -12564 -12673 -8807 -13111 -13441 -8610 -10691 -9517 -9541 -19176 -14503 -4662 5710
7230E710n450o318K123L965j3282p948j47P378P411N146J512j1342j3312K774
$$ 5710 260 -6058 -3935 30 -13252 -21200 -21347 -13969 -6558 -1412 100 -11242 -24554 -21780
7216b1780J072K443N91R6P090r119J350k608J467Q529R017l717m615p74P741J1
$$ -21780 -20708 -18265 -17674 -17578 -10488 -19607 -18257 -20865 -19398 -10869 -1852 -5569 -10184 -10958 -3217 -3206
7200c206k546j074L265o592p098J1874J7042n688j0293O224j2206j809O964p953
$$ -3206 -5752 -6826 -3561 -10153 -17251 -5377 11665 5977 -4316 1908 -10298 -12107 -5143 -13096
7186a3096o254j1356N795m222R471J6186O291K574Q982K344j203m197k014l834
$$ -13096 -19350 -30706 -24911 -29133 -19662 -3476 2815 5389 14371 16715 15512 11315 9301 5467
7172E467P926k179j5280K417r477j3849O78J1425P41j4620L84o34J440O333K857
$$ 5467 13393 11214 -4066 -1649 -11126 -24975 -24297 -12872 -12131 -26751 -26367 -27001 -25561 -19228 -16371
7157a6371j1844K1251J5085o470j2033k083K265M165N603R800k581M102m388J818
$$ -16371 -28215 -6964 8121 1651 -10382 -12465 -10200 -6035 -432 9368 6787 10889 6501 8319
7143H319q908o378O852J836m08j488l790k968R244J2753k243j1971k120l570m040
$$ 8319 -589 -6967 -115 1721 1313 -175 -3965 -6933 2311 15064 12821 850 -1270 -4840 -8880
7128h880L348P600P065o977n668K482Q259K310j45j762N393n937q048M504J7589
$$ -8880 -5532 2068 9133 2156 -3512 -1030 7229 9539 9394 7632 13025 7088 -960 3544 21133
7113B1133L599K491Q972K669q160j8537j7846L310K403j5076l309L238P868M813
$$ 21133 24732 27223 36195 38864 30704 12167 -5679 -2369 34 -15042 -18351 -15113 -7245 -2432
7099b432j385r695j0860m697J5448Q334n233r759n97M361M949J236O770m150m257
$$ -2432 -3817 -13512 -24372 -29069 -13621 -5287 -10520 -20279 -20876 -16515 -11566 -10330 -3560 -7710 -11967
7084a1967K616J0688l008R73p44K810K4584l393j0135p627J149m8j1451p52J2879
$$ -11967 -9351 1337 -1671 -698 -1442 1368 25952 22559 12424 4797 5946 5898 -5553 -6305 6574
7069F574J0894p832N394r115j0977o206R419N573Q64r40l796j541J713j507j013
$$ 6574 17468 9636 15030 5915 -5062 -11268 -1849 3724 4588 3648 -148 -1689 24 -1483 -2496
7054b496L750l961R080M050n902K72k269j5421L49P132m116m65P634J0414j0271
$$ -2496 1254 -2707 6373 10423 4521 4793 2524 -12897 -12548 -5416 -9532 -9997 -2363 8051 -2220
7039b220j9815j5290J6546K6295o76q763n354Q593J2956J509n270m337q108k918
$$ -2220 -22035 -37325 -20779 5516 4840 -3923 -9277 -684 12272 13781 8511 4174 -3934 -6852
7025f852J142K148L320N226n910n840k831p71J5656L96K900Q047m197q812j668
$$ -6852 -5710 -3562 -242 4984 -926 -6766 -9597 -10368 5288 5684 8584 16631 12434 3622 1954
7010A954L558N657k433j2021Q52J020m839O302R548N228n449j1443K468K233K691
$$ 1954 5512 11169 8736 -3285 -2433 -1413 -6252 50 9598 14826 9377 -2066 402 2635 5326
6995E326k5675L16P171J2530L544J907m593j1211L463R081j009P192l543r431
$$ 5326 -20349 -20033 -12862 -332 3212 5119 526 -10685 -7222 1859 850 8042 4499 -4932
6981d932O719M268l111J761N635P30o876q063P639n061j353P273k589M130O552
$$ -4932 1787 6055 2944 4705 10340 11070 4194 -3869 3770 -1291 -2644 4629 2040 6170 12722
6966A2722j2916n290l010q017L814J4227P593j6569j7641j232P514Q215J900R726
$$ 12722 -194 -5484 -8494 -16511 -12697 1530 9123 -7446 -25087 -26319 -18805 -10590 -8690 1036
6952A036k077J3965J0043m480K608J14j6124n198P135j5306l651L391l674O852
$$ 1036 -1041 12924 22967 18487 21095 21209 5085 -113 7022 -8284 -11935 -8544 -12218 -5366
6938e366J2278m772j8022o62O448Q308K126J0576N432m131K792R48n871j5318
$$ -5366 6912 2140 -15882 -16544 -10096 -1788 338 10914 16346 12215 15007 15955 10084 -5234
6924e234m048J2376L438J306L7K435q805n749K06Q64n506j9219M93N461J3759
$$ -5234 -9282 3094 6532 7838 7875 10310 1505 -4244 -4038 -3174 -8680 -27899 -27406 -21945 -8186
6909h186O785k103M154K894J449k485j1025j0737R743R070J1685Q999o390P73
$$ -8186 -1401 -3504 650 3544 4993 2508 -8517 -19254 -9511 -441 11244 20243 13853 14626
6895A4626q442J219M883j0923k492n544r525o767J110O642P25L510J9678R689
$$ 14626 6184 7403 12286 1363 -1129 -6673 -16198 -22965 -21855 -15213 -14488 -10978 8700 18389
6881A8389m336R01j5535j176P411Q956P01l514n646k876L365O13j526p551J793
$$ 18389 14053 14954 -581 -1757 5654 14610 15311 11797 6151 3275 6640 7253 5727 -1824 -31
6866c1M996R183k40l93k548m720l114j1679j4094Q482K0196J9232k963K283p322
$$ -31 4965 14148 13908 13515 10967 6247 3133 -8546 -22640 -14158 6038 25270 22307 24590 17268
6851A7268N37q86j0381k457o430p331n036J0253R28j2024J349n951p25P139J5653
$$ 17268 17805 16919 6538 4081 -2349 -9680 -14716 -4463 -3535 -15559 -14210 -20161 -20886 -13747 1906
6836A906j0771l064k162l894J4841O187o801J281L535J5232j391J525k334j2469
$$ 1906 -8865 -11929 -14091 -17985 -3144 3043 -3758 -2477 1058 16290 14899 16424 14090 1621
6822A621M682Q96R00j2174L592M293K841m877L502R315q884J10J302R211p913
$$ 1621 6303 7199 8099 -4075 -483 3810 6651 1774 5276 14591 5707 5817 7119 16330 8417
6807H417o005k118K283L709J1892N543l404j1306m442l850q208J900k915J1494
$$ 8417 2412 294 2577 6286 18178 23721 20317 9011 4569 719 -7489 -5589 -8504 2990
6793B990R939m636Q574o313n072J2804K62j0965j0235O600M577P298o950j1239
$$ 2990 12929 8293 16867 10554 5482 18286 18548 7583 -2652 3948 8525 15823 8873 -2366
6779b366K190J2246J4607K093k252R727m632J7656O684M726Q610J4131L305K782
$$ -2366 -176 12070 26677 28770 26518 36245 31613 49269 55953 60679 69289 83420 86725 89507
6765H9507M984o516j6326o247M131J1612J037P308N020J7958Q979L8157L4402
$$ 89507 94491 87975 71649 65402 69533 81145 82182 89490 94510 112468 121447 159604 194006
6752A94006M5620N0497P1412J19426J88372L05156M28403M70536L23444J23869
$$ 194006 239626 290123 361535 480961 669333 974489 1402892 1873428 2196872 2320741
6742B320741K4071j3555j18922m51535n48504l57887k15368j20881p4276n5004
$$ 2320741 2344812 2331257 2212335 1760800 1212296 854409 639041 518160 443884 388880
6732C88880m6600m1726k0428k7718q739m427j2711q484P34q390K582J0621J775
$$ 388880 342280 300554 280126 252408 243669 239242 226531 218047 218781 210391 212973 223594 225369
6719B25369o962j1838r145r079j3206r726j1450j5953j0802k514N6j575j0146
$$ 225369 218407 206569 197424 188345 175139 165413 153963 138010 127208 124694 124750 123175 113029
6706A13029o748j0165p102l782o726K809m35J174M247m629o969P247n424j0987
$$ 113029 106281 96116 89014 85232 78506 81315 80880 82054 86301 81672 74703 81950 76526 65539
6692F5539n184m266j9775j1584P352N238q343j242r074K826J1761n185K13K423
$$ 65539 60355 56089 36314 24730 32082 37320 28977 27735 18661 21487 33248 28063 28276 30699
6678C0699n702j242M957L126o71m932m754J0008P476j3689j015m438j445j0646
$$ 30699 24997 23755 28712 31838 31167 26235 21481 31489 38965 25276 24261 19823 18378 7732
6664G732p022J1109K1934l979j0370J243q141n750O34n883K074n28j142N382l075
$$ 7732 710 11819 33753 29774 19404 20647 12506 6756 7390 1507 3581 3053 1911 7293 4218
6649D218m333o439K200N38J049L955Q939L414n881q049o529J9653P554j620m421
$$ 4218 -115 -6554 -4354 -3816 -2767 1188 10127 13541 7660 -389 -6918 12735 20289 18669 14248
6634A4248N39n231q314Q633Q190j0024j263K040J908m94j46l518J416N315M599
$$ 14248 14787 9556 1242 9875 18065 8041 6778 8818 10726 10232 10086 6568 7984 13299 17898
6619A7898p596m984q083L682O26q256L031j20J0661R117P024n705L307J0795n56
$$ 17898 10302 5318 -2765 917 1543 -6713 -3682 -3802 6859 15976 23000 17295 20602 31397 30841
6604C0841j2105j769l594P919O04L926l049p531k0489r982o723N668M609L263
$$ 30841 18736 16967 13373 21292 21896 25822 22773 15242 -5247 -15229 -21952 -16284 -11675 -8412
6590h412j86k350M389L946M502k977J6038J0404o272j8497j4179j6426J7021N058
$$ -8412 -8598 -10948 -6559 -2613 1889 -1088 14950 25354 19082 585 -13594 -30020 -12999 -7941
6576g941j0609o104J0269J4566J859j397P450m055O321o808q724j2205q347J1427
$$ -7941 -18550 -24654 -14385 181 2040 643 8093 4038 10359 3551 -5173 -17378 -25725 -14298
6562a4298L831k008R009L413q980P042q510r588L85L3J4832K1213n62l448o574
$$ -14298 -10467 -12475 -3466 -53 -9033 -1991 -10501 -20089 -19704 -19671 -4839 16374 15812 12364 5790
6547E790K57p695M7Q466J6223j4887j5437Q665k550J158j0524j0443j647L672
$$ 5790 6047 -1648 -1601 6865 23088 8201 -7236 1429 -1121 37 -10487 -20930 -22577 -18905
6533a8905P931K869n27k804L106K564l693O152j477K455n220Q22P283P706j3175
$$ -18905 -10974 -8105 -8632 -11436 -8330 -5766 -9459 -3307 -4784 -2329 -7549 -6727 556 8262 -4913
6518d913K239J0842N180l993k2027j0862J75J3418J4001k496p760j7703l684M981
$$ -4913 -2674 8168 13348 9355 -12672 -23534 -23359 -9941 4060 1564 -6196 -23899 -27583 -22602
6504b2602J1644J0815O320O941p262k917J570j6173l705R880P339J6923j0875
$$ -22602 -10958 -143 6177 13118 5856 2939 4509 -11664 -15369 -5489 1850 18773 7898
6491G898n176N652Q041N418j0482r330O183m57K726J287K401j3130k531O025j015
$$ 7898 2722 8374 16415 21833 11351 2021 8204 7747 10473 11760 14161 1031 -1500 4525 3510
6476C510n317j446m981k484j989q941m444P65K386J1758o645N327J5168P348p897
$$ 3510 -1807 -3253 -8234 -10718 -12707 -21648 -26092 -25327 -22941 -11183 -17828 -12501 2667 10015 2118
6461B118p992l285j196L111k127J829k140N611J1386N51L024n046q331M10N912
$$ 2118 -5874 -9159 -10355 -7244 -9371 -7542 -9682 -4071 7315 7866 10890 5844 -2487 -2077 3835
6446C835l172L523o772r251J1390N430J519r492k806k998m908p242j895M813J6857
$$ 3835 663 4186 -2586 -11837 -447 4983 6502 -2990 -5796 -8794 -13702 -20944 -22839 -18026 -1169
6431a169Q966J185J351j2524R46L746p07Q592m817Q046J0157M78R350j7384m261
$$ -1169 7797 8982 10333 -2191 -1245 2501 1794 10386 5569 13615 23772 24250 33600 16216 11955
6416A1955l605j144R950Q22r447p519j4266o057M416J4907J3564L873M78n56r950
$$ 11955 8350 7206 17156 17978 8531 1012 -13254 -19311 -14895 12 13576 17449 17927 17371 7421
6401G421o193n271k657q282o746M025J7937O726p48l438R571J5950K800l958o386
$$ 7421 1228 -4043 -6700 -14982 -21728 -17703 234 6960 6212 2774 12345 28295 31095 27137 20751
6386B0751j6067k600j5229m956K4002K948o429q472k112j019J813L220n142K565
$$ 20751 4684 2084 -13145 -18101 5901 8849 2420 -6052 -8164 -9183 -7370 -4150 -9292 -6727
6372f727p32J685J2947q708j5156O68J3164m210k384Q896M740m162k385P043N174
$$ -6727 -7459 -5774 7173 -1535 -16691 -16023 -2859 -7069 -9453 -557 4183 21 -2364 4679 9853
6357I853k52L306R46j3184l700L201q725M903O982M989n837n305k453o541P095
$$ 9853 9601 12907 13853 669 -3031 170 -8555 -3652 3330 8319 2482 -2823 -5276 -11817 -4722
6342d722k738o223N228M296M275j1473l976K564O084P585O571m021o868j5487
$$ -4722 -7460 -13683 -8455 -4159 116 -11357 -15333 -12769 -6685 900 7471 3450 -3418 -18905
6328a8905N559J9775Q714l369J952L195m991n940Q234n533j0338l242q558L215
$$ -18905 -13346 6429 15143 11774 13726 16921 11930 5990 14224 8691 -1647 -4889 -13447 -10232
6314a0232P274Q303O514J261K123q187K361K806n99p6m211o97q674j4708o836
$$ -10232 -2958 5345 11859 13120 15243 7056 9417 12223 11624 11548 7337 6640 -2034 -16742 -23578
6299b3578P701J5482J7603J0p09K260K34r213q313j2432J040J0619Q331P325j6976
$$ -23578 -15877 -395 17208 17218 16509 18769 19003 9790 1477 -10955 -9915 704 9035 16360 -616
6284f16j6665J075J8374N697j5194k874l356m258k459J6393M716J903q595k704
$$ -616 -17281 -16206 2168 7865 -7329 -10203 -13559 -17817 -20276 -3883 833 2736 -5859 -8563
6270h563R721L683k476m481N054M421P368N296j5660j1881k950J5085l599j843
$$ -8563 1158 4841 2365 -2116 2938 7359 14727 20023 4363 -7518 -10468 4617 1018 -825
6256h25q510r827m527Q125L101q36J862q517Q781J4748n346k977J893j515L279
$$ -825 -9335 -19162 -23689 -15564 -12463 -13299 -11437 -19954 -11173 3575 -1771 -4748 -2855 -4370 -1091
6241a091l490j5590N186J8023J2071n7q016p651J0738O215o075n102r867q055
$$ -1091 -4581 -20171 -14985 3038 15109 15052 7036 -615 10123 16338 10263 5161 -4706 -12761
6227a2761m775o96L243J681J2575J1741Q79K608r923j612p191m57J0291Q692p79
$$ -12761 -17536 -18232 -14989 -13308 -733 11008 11887 14495 4572 2960 -4231 -4688 5603 14295 13516
6212A3516j3746o067K637M515J785R761R422N88P90k1130j3800j366J0378P704
$$ 13516 -230 -6297 -3660 855 2640 12401 21823 22411 23201 2071 -11729 -13095 -2717 4987
6198D987l13K436o32p379n648j0011n012k068P137O317J7522J1625j6623q265
$$ 4987 4674 7110 6478 -901 -6549 -16560 -21572 -23640 -16503 -10186 7336 18961 2338 -5927
6184e927R570K263l181o438o666Q572J1477j322n240J945j817L877J9589m777
$$ -5927 3643 5906 2725 -3713 -10379 -1807 9670 8348 3108 5053 3236 7113 26702 21925
6170B1925j3992l651j799q97j1747L910J8816R946j3530n310L087q5R531k925
$$ 21925 7933 4282 2483 1586 -10161 -6251 12565 22511 8981 3671 6758 6673 16204 13279
6156A3279q736l076N193j992n443k68L366j0352j3248M091J228k228J2195R514
$$ 13279 4543 1467 6660 4668 -775 -1043 2323 -8029 -21277 -17186 -15958 -18186 -5991 3523
6142C523l543m639q22j2849K540Q017J17o12O357M363R424l260q467N609K029
$$ 3523 -20 -4659 -5481 -18330 -15790 -7773 -7656 -8268 -1911 2452 11876 8616 149 5758 7787
6127G787p354j3o611M06J358P284k441j207J5409J627q173j1192O443j175j8342
$$ 7787 433 420 -6191 -5785 -4427 2857 416 -791 14618 16245 8072 -3120 3323 2148 -16194
6112a6194j781J5804Q419n980q558L399O003M172j285j647j2808q251J1211R651
$$ -16194 -17975 -2171 6248 268 -8290 -4891 1112 5284 3999 2352 -10456 -18707 -7496 2155
6098B155p920K412k413l102j960l768m800M792J2075l855K492R313n694j0143
$$ 2155 -5765 -3353 -5766 -8868 -10828 -14596 -19396 -14604 -2529 -6384 -3892 5421 -273 -10416
6084a0416n345l534Q642P048L933P216M465J613J3366j0104J12Q044m81L495O55
$$ -10416 -15761 -19295 -10653 -3605 328 7544 12009 13622 26988 16884 16996 25040 24559 28054 28709
6069B8709j5267k476N583r41j3076j2002J075M707l970J0332K940n010J610J0187
$$ 28709 13442 10966 16549 15608 2532 -9470 -8395 -3688 -7658 2674 5614 604 2214 12401
6055A2401Q117m701m729j0895p311O979J333M460o174q436Q38n581p407r758n71
$$ 12401 20518 15817 11088 193 -7118 -139 1194 5654 -520 -8956 -8118 -13699 -21106 -30864 -31435
6040c1435J0384N473J2615J7529k506J679J417q70L793j3424p135j3181l339J383
$$ -31435 -21051 -15578 -2963 14566 12060 13739 15156 14286 18079 4655 -2480 -15661 -19000 -17617
6026a7617Q096k463Q222J4088j5401p283Q846O973m736j426K136J380J175Q11
$$ -17617 -9521 -11984 -3762 10326 -5075 -12358 -3512 3461 -1275 -2701 -565 815 1990 2801
6012B801N509j3135O02O380Q867M774n667m446K733l633J637N195l692q728P97
$$ 2801 8310 -4825 -4223 2157 11024 15798 10131 5685 8418 4785 6422 11617 7925 -803 -6
5997fK067J710n828R164J797J655p717j5801m37N184J4095j821L214O791j359
$$ -6 2061 3771 -2057 7107 8904 10559 2842 -12959 -13396 -8212 5883 4062 7276 14067 12708
5982A2708k813K055P247K78r59j2133R69L637O265m668p703n462j483K732m407
$$ 12708 9895 11950 19197 19475 18516 6383 7352 10989 17254 12586 4883 -579 -2062 670 -3737
5967c737j247K13J093o846l250Q584J729j013M840L308J398q349K017l284m647
$$ -3737 -4984 -4771 -3678 -10524 -13774 -5190 -3461 -4474 366 3674 5072 -3277 -1260 -4544 -9191
5952i191k580Q867L453P98L895K962q664p354p274n393q40L35J257R694L863L159
$$ -9191 -11771 -2904 549 1347 5242 8204 -460 -7814 -15088 -20481 -21321 -20986 -19729 -10035 -6172 -3013
5936c013j658M701p1M645m495j819k837K863P894k87j223K874l858M193N558q254
$$ -3013 -4671 30 -41 4604 109 -1710 -4547 -1684 6210 5923 4700 7574 3716 7909 13467 5213
5920E213j6823R050m016l54Q233O390Q25n712j6322O92P738J090L985J5959K89
$$ 5213 -11610 -2560 -6576 -6930 1303 7693 8518 2806 -13516 -12824 -5086 -3996 -11 15948 16237
5905A6237L511j691q825J596R88p390j6077L794J1791L097j2479o470k620R010
$$ 16237 19748 18057 9232 10828 11816 4426 -11651 -7857 3934 7031 -5448 -11918 -14538 -5528
5891e528J7391k306J438j240N919L692K617o8o89o88j0568j5467p895l883l264
$$ -5528 11863 9557 10995 9755 15674 19366 21983 21915 21226 20538 9970 -5497 -13392 -17275 -20539
5876b0539K488N380J587J543J0485r886j4847M02J296M983K0179n040o115Q136
$$ -20539 -18051 -12671 -11084 -9541 944 -8942 -23789 -23387 -22091 -17108 3071 -1969 -8084 52
5862E2l033J1504j662k599N096j230O72r539j0272r3J8487J220j53k490l863K532
$$ 52 -2981 8523 6861 4262 9358 8128 8800 -739 -11011 -11104 7383 8603 8450 5960 2097 4629
5846D629l804l674Q106k939j9111J747J3163R523n673j5384r341J147n494M295
$$ 4629 825 -2849 5257 2318 -16793 -15046 -1883 7640 1967 -13417 -22758 -21611 -27105 -22810
5832b2810R286j3114P901R104p424M980J352n646K584J75r10M046M214J188J910
$$ -22810 -13524 -26638 -18737 -9633 -17057 -12077 -10725 -16371 -13787 -13612 -14522 -10476 -6262 -5074 -3164
5817c164j5184j741J3575J2945r519j767m369P563M484N324l598l272k291j0413
$$ -3164 -18348 -20089 -6514 6431 -3088 -4855 -9224 -1661 2823 8147 4549 1277 -1014 -11427
5803a1427j3853k482J4173P165k250J6663j858L64M045l438M91l419n042j409
$$ -11427 -25280 -27762 -13589 -6424 -8674 7989 6131 6495 10540 7102 7593 4174 -868 -2277
5789b277M14M208N837J282q067n605J17k548j831k818K198l129o481N550o367
$$ -2277 -1863 2345 8182 9464 1397 -4208 -4091 -6639 -8470 -11288 -9090 -12219 -18700 -13150 -19517
5774a9517q724O102K236J3774P033N36n527O994J660j1704l563J230k683n106
$$ -19517 -28241 -22139 -19903 -6129 904 1440 -4087 2907 4567 -7137 -10700 -9470 -12153 -17259
5760a7259n504J1530Q243m405j388N793P647N529q597q449P353O581j0406r442
$$ -17259 -22763 -11233 -2990 -7395 -8783 -2990 4657 10186 1589 -6860 493 7074 -3332 -12774
5746a2774k304L693N822N813j402Q292m716L252l010j2473J723Q070K796n506
$$ -12774 -15078 -11385 -5563 250 -1152 7140 2424 5676 2666 -9807 -8084 -14 2782 -2724
5732b724j256K656n761J2244J1721o387n385M615N751r190k800j2512j067J181
$$ -2724 -3980 -1324 -7085 5159 16880 10493 5108 9723 15474 6284 3484 -9028 -10095 -8914
5718h914k604M148m891N870L01n136j1661m160o448L212J7569K646K310Q886p25
$$ -8914 -11518 -7370 -12261 -6391 -6090 -11226 -22887 -27047 -33495 -30283 -12714 -10068 -7758 1128 403
5703D03K164J0578L76l928P41O011M531o350j2009j997P677j995j6440Q559J446
$$ 403 2567 13145 13521 9593 10334 16345 20876 14526 2517 520 8197 6202 -10238 -1679 -233
5688b33L379J337r352M071N022J0923N030j0129K122O443n135o011L813R077m303
$$ -233 3146 4483 -4869 -798 4224 15147 20177 10048 12170 18613 13478 7467 11280 20357 16054
5673A6054m830j008j1311j03m977q396J518L185L140J3528J561j0436l630J135
$$ 16054 11224 10216 -1095 -1198 -6175 -14571 -13053 -9868 -6728 6800 8361 -2075 -5705 -4570
5659d570o9j2045M427l653j219Q333p697J5834J2517q505o434J804o666p344k125
$$ -4570 -4639 -16684 -12257 -15910 -17129 -8796 -16493 -659 11858 3353 -3081 -1277 -7943 -15287 -17412
5644a7412L716J820N35k729l13j903O693J0515O46l402m064L550l945k874P830
$$ -17412 -13696 -11876 -11341 -14070 -14383 -16286 -9593 922 1568 -1834 -5898 -2348 -6293 -9167 -1337
5629a337R246q166o129o21O960R844M212j5195j5326j068L066m428L524Q077j090
$$ -1337 7909 -257 -6386 -7007 -47 9797 14009 -1186 -16512 -17580 -14514 -18942 -15418 -7341 -8431
5614h431j163M829m243o702J3302O033O942l368l095K020j3909M516J4664r45
$$ -8431 -9594 -4765 -9008 -15710 -2408 3625 10567 7199 4104 6124 -7785 -3269 11395 10450
5600A0450k929o818n407r03m62l30l736R66j400P987J1361N759n607n872r056
$$ 10450 7521 703 -4704 -5607 -6069 -6399 -10135 -9169 -10569 -2582 8779 14538 8931 3059 -5997
5585e997j0169p117O709M644L603P681P156k653J617k282j6374M513j148j4839
$$ -5997 -16166 -23283 -16574 -11930 -8327 -646 6510 3857 5474 3192 -13182 -8669 -9817 -24656
5571b4656N439R585M822j1042P388O010J836J913o910m460j84m838o51K116L241
$$ -24656 -19217 -9632 -4810 -15852 -8464 -2454 -618 1295 -5615 -10075 -10259 -15097 -15748 -13632 -10391
5556a0391j120M231N609M280j3302m262l104N045N225Q194r54n158p461M429M360
$$ -10391 -11511 -7280 -1671 2609 -10693 -14955 -18059 -13014 -7789 405 -549 -5707 -13168 -8739 -4379
5541d379O590j92j045Q366q450j28M500j83p60k83j947q563j284Q92k748Q874
$$ -4379 2211 2019 974 9340 890 762 5262 5079 4319 4036 2089 -6474 -7758 -6866 -9614 -740
5525g40M243N005r830l075Q381l63r197o499O81N144n510l113R443k95K815j4474
$$ -740 3503 8508 -1322 -4397 3984 3621 -5576 -12075 -11394 -6250 -11760 -14873 -5430 -5725 -2910 -17384
5509a7384P379R296M619j794M09K027j2456J430J4865j8063j9365M675J4475J0330
$$ -17384 -10005 -709 3910 2116 2525 4552 -7904 -6474 8391 -9672 -29037 -24362 -9887 443
5495D43M039N915K75j2941q77k88n60J851P630R29o250m493n71K0P847N717J1823
$$ 443 4482 10397 10672 -2269 -3146 -3434 -3994 -2143 5487 6416 166 -4327 -4898 -4878 2969 8686 20509
5478B0509q366p227M874o049J551n543J32P285j171q226p4J159p213r108j0012
$$ 20509 12143 4916 9790 3741 5292 -251 -119 7166 5995 -2231 -2305 -1146 -8359 -17467 -27479
5463b7479k299Q311J1236L148J0607N272K32o920k066L823Q691n233k4472l035
$$ -27479 -29778 -21467 -10231 -7083 3524 8796 9028 2108 42 3865 12556 7323 -17149 -20184
5449b0184R817K1210J7104j9315j3204O11l818j450l51K896p21J0171l30r019
$$ -20184 -10367 10843 27947 8632 -4572 -3961 -7779 -9229 -9580 -6684 -7405 2766 2436 -6583
5435f583p025k227J7372J1677p613q287J035M987o45j5889K687N395J321K261
$$ -6583 -13608 -15835 1537 13214 5601 -2686 -1651 3336 2691 -13198 -10511 -5116 -3795 -1534
5421a534j4293l494J3329K564m381j902r243O866J4149Q685j1234N757j3114j3531
$$ -1534 -15827 -19321 -5992 -3428 -7809 -9711 -18954 -12088 2061 10746 -488 5269 -7845 -21376
5407b1376N028L187j4298l390L847K807j745N578J4534J223P496J2315n767j4259
$$ -21376 -16348 -13161 -27459 -30849 -27002 -24195 -25940 -20362 -5828 -4605 2891 15206 9439 -4820
5393d820j0894L838J789n511J462J1805O539L160q534o031M213j247K410L166
$$ -4820 -15714 -11876 -10087 -15598 -14136 -2331 4208 7368 -1166 -7197 -2984 -4231 -1821 1345
5379A345j2752J591J0618O451j086k200p501j0214q319P156J0310P553L781q957
$$ 1345 -11407 -9816 802 7253 6167 3967 -3534 -13748 -22067 -14911 -4601 2952 6733 -2224
5365b224k6P926L976L478p178j3026p263J7241L291r556j7432K950J0365P231
$$ -2224 -2250 5676 9652 13130 5952 -7074 -14337 2904 6195 -3361 -20793 -17843 -7478 -247
5351b47P610o366j0984L06O614K85K607p91O585K267Q006Q173j361l937K652l00
$$ -247 7363 997 -9987 -9681 -3067 -2782 -175 -966 5619 7886 15892 24065 22704 18767 21419 21119
5335B1119r128j4592q891L490m695l291o01L735o471k839Q391mL679m469k404
$$ 21119 11991 -2601 -11492 -8002 -12697 -15988 -16589 -12854 -19325 -22164 -13773 -13777 -10098 -14567 -16971
5320a6971K962p340mO651P379j323K629m52j0131K2R379J959M787l90p250K396
$$ -16971 -14009 -21349 -21353 -14702 -7323 -8646 -6017 -6469 -16600 -16578 -7199 -5240 -453 -843 -8093 -5697
5304e697L648O989R2m029L488l554o88m734q211j1845l712J4009k717L356J1650
$$ -5697 -2049 4940 5032 1003 4491 937 249 -4485 -12696 -24541 -28253 -14244 -16961 -13605 -1955
5289a955Q683o362N05Q018Q444k947J632L510j3293K933L188o693m036m553M396
$$ -1955 6728 366 871 8889 17333 14386 16018 19528 6235 9168 12356 5663 1627 -2926 1470
5274A470J1671M947m514j3373l301k797k105J1234R630k070N881J853j5265L714
$$ 1470 13141 18088 13574 201 -3100 -5897 -8002 3232 12862 10792 16673 18526 3261 6975
5260F975k817k0909K541Q677P063J5022j605j1822j2742j279N589L097r610L339
$$ 6975 4158 -16751 -14210 -5533 1530 16552 14947 3125 -9617 -10896 -5307 -2210 -11820 -8481
5246h481p33L13j173P246M100Q573K268q472q80j7906n229P206M267K962R074
$$ -8481 -9214 -8901 -10074 -2828 1272 9845 12113 3641 2761 -15145 -20374 -13168 -8901 -5939 3135
5231C135k290q301L766m597m398Q852K10J283J6477M905p541j1428J201M405j816
$$ 3135 845 -7456 -3690 -8287 -12685 -3833 -3623 -2340 14137 19042 11501 73 1274 5679 3863
5216C863L422j710o485J406Q15j0729L993K1603R289o011l433J8049M50j9509
$$ 3863 7285 5575 -910 496 1311 -9418 -5425 16178 25467 19456 16023 34072 34522 15013
5202A5013o362k794r428o828N728m816N897k70M785J521L973K348l487n782k70
$$ 15013 8651 5857 -3571 -10399 -4671 -9487 -3590 -3860 925 2446 6419 8767 5280 -502 -772
5187g72m895Q307J2716K671o007k463j0336l90R396k047q908j6350L732J2186
$$ -772 -5667 2640 15356 18027 12020 9557 -779 -1169 8227 6180 -2728 -19078 -15346 -3160
5173c160P956n577r63j1843j0000m582J1719j462L656O837M832m167M514P055
$$ -3160 4796 -781 -1744 -13587 -23587 -28169 -16450 -17912 -14256 -7419 -2587 -6754 -2240 4815
5159D815L245o492L589L076J320n064K848K343K429l71j441o953P032l064o013
$$ 4815 8060 1568 5157 8233 9553 4489 7337 9680 12109 11738 10297 3344 10376 7312 1299
5144A299j6641P207J4576K044m43r597L746L234o264O10j1059K465N808l112N015
$$ 1299 -15342 -8135 6441 8485 8042 -1555 2191 5425 -839 -229 -11288 -8823 -3015 -6127 -1112
5129a112j3703k284m160J3674j134l669N072M534O717m697m448j4363n161l158
$$ -1112 -14815 -17099 -21259 -7585 -8719 -12388 -7316 -2782 3935 -762 -5210 -19573 -24734 -27892
5115b7892O721O015P997n227q90L337K727q24K001m728p128o95N072J0285P261
$$ -27892 -21171 -15156 -7159 -12386 -13276 -9939 -7212 -8036 -6035 -10763 -17891 -18586 -13514 -3229 4032
5100D032j82j3484j5987K218J2183N679K441J3011O482m951j1736m733L248j1802
$$ 4032 3850 -9634 -25621 -23403 -11220 -5541 -3100 9911 16393 11442 -294 -5027 -1779 -13581
5086a3581K48P193M037j818L944m480j354L090l44j312l154J697n452O478J4687
$$ -13581 -13333 -6140 -2103 -3921 23 -4457 -5811 -2721 -3065 -4377 -7531 -5834 -11286 -4808 9879
5071I879R088j2154N77P282j0732j4617l890O156j814K50K0206M051j7156j56
$$ 9879 18967 6813 7390 14672 3940 -10677 -14567 -8411 -10225 -9975 10231 14282 -2874 -3030
5057c030P408L200k698m466l697n646L166m647J3319L189k77o875J733O159K171
$$ -3030 4378 7578 4880 414 -3283 -8929 -5763 -10410 2909 6098 5821 -1054 679 6838 9009
5042I009j0177m837O304M675O85J2157r357p765M557p163P389l3o024L580j299
$$ 9009 -1168 -6005 299 4974 5659 17816 8459 694 5251 -1912 5477 5444 -580 3000 1701
5027A701p09K471j652M170J0978J215m261r234j0621r450P583N062k798r631p897
$$ 1701 992 3463 1811 5981 16959 18174 13913 4679 -5942 -15392 -7809 -2747 -5545 -15176 -23073
5012b3073Q178R828j0686R79n382O554N93N221Q803q064j1062N79K96J25L685
$$ -23073 -14895 -5067 -15753 -14774 -20156 -13602 -13009 -7788 1015 -7049 -18111 -17532 -17236 -17111 -13426
4997a3426Q442r691J930P627J621q034j4108K789k702o643J0251O320o387l063
$$ -13426 -4984 -14675 -12745 -5118 -3497 -11531 -25639 -22850 -25552 -32195 -21944 -15624 -22011 -25074
4983b5074M033R216M011p42o197J499O989Q696R709N059K940j2295j7257O7K084
$$ -25074 -21041 -11825 -7814 -8556 -14753 -13254 -6265 2431 12140 17199 20139 7844 -9413 -9346 -7262
4968g262O900l254J75K247L467P977j0462j221J0607o472O189l702n286J3251
$$ -7262 -362 -3616 -3441 -1194 2273 10250 -212 -1433 9174 2702 8891 5189 -97 13154
4954A3154K020p452m286k332Q57m906n003Q190o305j3306j438O736M083r43k720
$$ 13154 15174 7722 3436 1104 1961 -2945 -7948 242 -6063 -19369 -20807 -14071 -9988 -10931 -13651
4939a3651N72P029L01l958n485Q998L778M198N599m498J0313J1249j3005r181
$$ -13651 -13079 -6050 -5749 -9707 -15192 -6194 -2416 1782 7381 2883 13196 24445 11440 2259
4925B259r693k751o584j1740l993J8206O102J945R374R289J951k854r276l884
$$ 2259 -7434 -10185 -16769 -28509 -32502 -14296 -8194 -6249 3125 12414 14365 11511 2235 -1649
4911a649R689O79M89j05Q84J571p942o851J4677l943r197q275J490J1183j412
$$ -1649 8040 8719 9208 9103 9987 11558 3616 -3235 11442 7499 -1698 -9973 -8483 2700 1288
4896A288o385O413Q737j0315M359J2829L99p365K99K524p268o440J1557M921L445
$$ 1288 -5097 1316 10053 -262 4097 16926 17325 9960 10259 12783 5515 -925 10632 15553 18998
4881A8998k0514q475O658j1427j1039m314N168J7951K0342J635O971l659m388
$$ 18998 -1516 -9991 -3333 -14760 -25799 -30113 -24945 -6994 13348 14983 21954 18295 13907
4868A3907j5704q621J3798J5603j5684n087o249M019K0k907J255k518k212R696
$$ 13907 -1797 -10418 3380 18983 3299 -1788 -8037 -4018 -3998 -6905 -5650 -8168 -10380 -684
4854f84K623K07O391R373k422o550j3003k970j102p26J696R876k701k1332l263
$$ -684 1939 2146 8537 17910 15488 8938 -4065 -7035 -8137 -8863 -7167 2709 8 -21324 -24587
4839b4587J2101j84j899n647P241J5180J7106O806n596m595r560q743j894K981
$$ -24587 -12486 -12670 -14569 -20216 -12975 2205 19311 26117 20521 15926 6366 -2377 -4271 -1290
4825a290k210n047j4291M258Q141N904jM887J748P723k705Q811j6077j1254N944
$$ -1290 -3500 -8547 -22838 -18580 -10439 -4535 -4536 351 2099 9822 7117 15928 -149 -11403 -5459
4810e459n59k495M644P611Q146m932N341n2L161p330n923L489m078o550Q096l615
$$ -5459 -6018 -8513 -3869 3742 11888 6956 12297 12245 15406 8076 2153 5642 1564 -4986 3110 -505
4794e05j2106O29R569P947N219M77L367M939K655j0931j4396m634Q183O85j20
$$ -505 -12611 -11982 -2413 5534 10753 11230 14597 19536 22191 11260 -3136 -7770 413 1098 978
4779I78L639O152p696j0797M364N981n738K257j985q413l058J4249K324J931q655
$$ 978 4617 10769 3073 -7724 -3360 2621 -3117 -860 -2845 -11258 -14316 -67 2257 4188 -4467
4764d467Q889n44m434q080R69P588O50J1353R484J2235L040j5903j2170j2298
$$ -4467 4422 3878 -556 -8636 -7667 -79 571 11924 21408 33643 36683 20780 8610 -3688
4750c688L711Q837l31q250m040j181p12r68j1574M874N561N926Q076L449m796
$$ -3688 23 8860 8529 279 -3761 -4942 -5654 -6622 -18196 -13322 -7761 -1835 6241 9690 4894
4735D894M763m908m686L485L291l063n657l727o254p547R57l846l757R078J3615
$$ 4894 9657 4749 63 3548 6839 3776 -1881 -5608 -11862 -19409 -18452 -22298 -26055 -16977 -3362
4720c362J6790p178o643q884n989l700L584J2081N859P634N395j7861L11J5612
$$ -3362 13428 6250 -393 -9277 -15266 -18966 -15382 -3301 2558 10192 15587 -2274 -1963 13649
4706A3649J647m358N450P07j2988L070L959j3357r596K910J4036P809jN344m05
$$ 13649 15296 10938 16388 17095 4107 7177 11136 -2221 -11817 -8907 5129 12938 12937 18281 17876
4691A7876k642n393o120o138l902m49Q093l258L986J480N718M040q83n321l260
$$ 17876 15234 9841 3721 -2417 -6319 -6768 1325 -1933 2053 3533 9251 13291 12408 7087 3827
4676C827P50k762j621L560j520L020l18j9566L939J2349J771K78n59q124k18N85
$$ 3827 4577 1815 194 3754 2234 5254 4936 -14630 -10691 1658 3429 3707 3148 -4976 -5194 -4609
4660d609M748p657m79O726K568p841j0070m691Q714J1498r797N376L387J91j6928
$$ -4609 139 -7518 -7997 -1271 1297 -6544 -16614 -21305 -12591 -1093 -10890 -5514 -2127 -1936 -18864
4645a8864l387l342l04J5663L597k433m240p148n485Q106J7868N222n111N78n709
$$ -18864 -22251 -25593 -25897 -10234 -6637 -9070 -13310 -20458 -25943 -17837 31 5253 142 720 -4989
4630d989K713R38m569Q115O874J459n658N19J27l803K352O641r056k164k761Q275
$$ -4989 -2276 -1338 -5907 2208 9082 10541 4883 5402 5529 1726 4078 10719 1663 -501 -3262 5013
4614E013J783n852m056l94J223M883N932N714K679R382p386j5275n860k239M670
$$ 5013 6796 944 -3112 -3506 -2283 2600 8532 14246 16925 26307 18921 3646 -2214 -4453 217
4599B17J801Q3K576N538n441Q00m081p549q56L644M749M002N752r040j1138J646
$$ 217 2018 2101 4677 10215 4774 5574 1493 -6056 -6912 -3268 1481 5483 11235 2195 -8943 -7297
4583g297o17q646p95N07O418l72k978Q58L687p011l160j471J7507J0347N858l919
$$ -7297 -7914 -16560 -17355 -16848 -10430 -10802 -13780 -12922 -9235 -16246 -19406 -20877 -3370 6977 12835 8916
4567H916K380k388j5960j56n253J815L729n359Q84L592m38k162j3091J780J5801
$$ 8916 11296 8908 -7052 -7208 -12461 -10646 -6917 -12276 -11392 -7800 -8238 -10400 -23491 -21711 -5910
4552e910P352R588p990j0148l402M215P31j579J0997l971l264J742J1890l444
$$ -5910 1442 11030 3040 -7108 -10510 -6295 -5564 -7143 3854 -117 -3381 -1639 10251 6807
4538F807M045R098j80q878j2902k960P053M926k307l018n19O937k6q999k119N52
$$ 6807 10852 19950 19770 10892 -2010 -4970 2083 7009 4702 1684 1165 8102 8076 -923 -3042 -2490
4522b490p777l181l176o570o041R226Q862M763j43Q345J9365P909l280O794o947
$$ -2490 -10267 -13448 -16624 -23194 -29235 -20009 -11147 -6384 -6527 1818 21183 29092 25812 32606 25659
4507B5659j9811l487L173M844j656L25M190j9496m390M146R971J3185q628n679
$$ 25659 5848 2361 5534 10378 8722 9047 13237 -6259 -10649 -6503 3468 16653 8025 2346
4493B346J0340P506K708K693j0477o599l565o702l196J260n136l906J325O976
$$ 2346 12686 20192 22900 25593 15116 8517 4952 -1750 -4946 -3686 -8822 -12728 -11403 -4427
4479d427N384o656J0671Q246k13r265r190P178O780J0360J428j3015j0231J0364
$$ -4427 957 -5699 4972 13218 13005 3740 -5450 1728 8508 18868 20296 7281 -2950 7414
4465G414P211P352O694k940o849l818J1254L985j400o478p091q251o237J307j5631
$$ 7414 14625 21977 28671 25731 18882 15064 26318 30303 28903 22425 15334 7083 846 2153 -13478
4450a3478J1320M339k507P605k921j0325J754J3389n620j1141p58J374J049l146
$$ -13478 -2158 2181 -326 7279 4358 -5967 -4213 9176 3556 -7585 -8343 -6969 -5920 -9066
4436i066L353k798j773k204J304o96J3842m197j3602k353K224l923M840Q109j759
$$ -9066 -5713 -8511 -10284 -12488 -11184 -11880 1962 -2235 -15837 -18190 -15966 -19889 -15049 -6940 -8699
4421h699q946Q5M796n02O207L680m340R30P198m054j3106j3053m76N328R512L417
$$ -8699 -17645 -17560 -12764 -13266 -7059 -3379 -7719 -6789 409 -3645 -16751 -29804 -30280 -24952 -15440 -12023
4405a2023k980P512J1605O576K385P740P865j2876q518r181q369j631L557O057
$$ -12023 -15003 -7491 4114 10690 13075 20815 28680 15804 7286 -1895 -10264 -11895 -8338 -2281
4391b281K463p207o618M823K257J406Q858O156l460q642J338j208k683m292j6364
$$ -2281 182 -7025 -13643 -8820 -6563 -5157 3701 9857 6397 -2245 -907 -2115 -4798 -9090 -25454
4376b5454j1183J5154J4274J8802J4543k2234q751R432K190o644M152L276q498
$$ -25454 -36637 -21483 -7209 11593 26136 3902 -4849 4583 6773 129 4281 7557 -941
4363i41j2054K776R145O461q483k73k279r622R653O030O602j232j3348p591Q368
$$ -941 -12995 -10219 -1074 5387 -3096 -3369 -5648 -15270 -5617 413 7015 5783 -7565 -15156 -6788
4348f788j510N819L815p897L979Q22j2537j806R65k254L892P770j454M050k59
$$ -6788 -8298 -2479 1336 -6561 -2582 -1760 -14297 -16103 -15138 -17392 -13500 -5730 -7184 -3134 -3393
4333c393o063j1321J0343J2081R120j1620p135L570j0761j1848k04R518P059J2891
$$ -3393 -9456 -20777 -10434 1647 10767 -853 -7988 -4418 -15179 -27027 -27231 -17713 -10654 2237
4319B237P996O763M805p364j8061j898m233j66o98M506j633p628n263J4717P359
$$ 2237 10233 16996 21801 14437 -3624 -5522 -9755 -9921 -10619 -6113 -7746 -15374 -20637 -5920 1439
4304A439N286R86K341m800o477p463k004r341J0969J6513l920k075p132j7007
$$ 1439 6725 7711 10052 5252 -1225 -8688 -10692 -20033 -9064 7449 3529 1454 -5678 -22685
4290b2685l527L943J5325J2886l714J997N337M8l818j540J028J046n469p543K781
$$ -22685 -26212 -22269 -6944 5942 2228 4225 9562 9610 5792 4252 5280 6326 857 -6686 -3905
4275c905m038o707N170O581P536o15J254O547j039k555M04j967l492j1336j0218
$$ -3905 -7943 -14650 -9480 -2899 4637 4022 5276 11823 10784 8229 8633 6666 3174 -8162 -18380
4260a8380m117O057J2536K36L190N393K471j9881o758J2374J1548m518q173j0627
$$ -18380 -22497 -16440 -3904 -3668 -478 4915 7386 -12495 -19253 -6879 4669 151 -8022 -18649
4246a8649r587J059L608M798j616j459L901N991M760P971O122j4816p831J661
$$ -18649 -28236 -27177 -23569 -18771 -20387 -21846 -17945 -11954 -7194 777 6899 -7917 -15748 -14087
4232a4087N375R589N572L486k5P034p380l785Q75k521o02O448k85R85l200L48
$$ -14087 -8712 877 6449 9935 9910 16944 9564 5779 6654 4133 3531 9979 9694 10679 7479 7827
4216G827L948o143k992P82q748q547k326J1379Q294O072J6746N279q671P956n330
$$ 7827 11775 5632 2640 3422 -5326 -13873 -16199 -4820 3474 9546 26292 31571 22900 30856 25526
4201B5526j5784l8o950j7625l810m353J6658L732j262p45P554M856J671M745r431
$$ 25526 9742 9704 2754 -14871 -18681 -23034 -6376 -2644 -3906 -4651 2903 7759 9430 14175 4744
4186D744l998q579k579M319J4688L661L921m403o976J0369k678j1439j0033m265
$$ 4744 746 -7833 -10412 -6093 8595 12256 16177 11774 4798 15167 12489 1050 -8983 -13248
4172a3248k634J2987R090p32r909m629J8110l900j1115L315K839L28l638j1609
$$ -13248 -15882 -2895 6195 5463 -4446 -9075 9035 5135 -5980 -2665 174 502 -3136 -14745
4158a4745J1192K300L602m173j803J0262K652l004j755n797K644p861J0450L143
$$ -14745 -3553 -1253 2349 -1824 -3627 6635 9287 6283 4528 -1269 1375 -6486 3964 7107
4144G107r561l045N930j13J0074O212O980r498j4483j3000l241M392K576K511
$$ 7107 -2454 -5499 431 318 10392 16604 23584 14086 -397 -13397 -16638 -12246 -9670 -7159
4130g159J464j655J0799j636p340N100L903K67J27k379L330Q275J0197j663J262
$$ -7159 -5695 -7350 3449 1813 -5527 -427 3476 3743 3870 1491 4821 13096 23293 21630 22892
4115B2892M59p825m231J186o414j6571k485M238M10N233L32k966P068k259l702
$$ 22892 23351 15526 11295 12481 6067 -10504 -12989 -8751 -8341 -3108 -2776 -5742 1326 -933 -4635
4100d635K66J851O640K181R78m556j465p268J1030m396m798J1233N764m265O116
$$ -4635 -4369 -2518 4122 6303 7281 2725 1260 -6008 5022 626 -4172 7061 12825 8560 14676
4085A4676j0153p203L89L712J4874n483j4131L161L882n20p207j0441O027M959
$$ 14676 4523 -2680 -2291 1421 16295 10812 -3319 -158 3724 3204 -4003 -14444 -8417 -3458
4071c458K086m78o953M171J3618N004j0474n984q832M195M320j0003r198R950
$$ -3458 -1372 -1850 -8803 -4632 8986 13990 3516 -2468 -11300 -7105 -2785 -12788 -21986 -12036
4057a2036J6657M98j471O994J907m816m810N458l640j689J3280q681k0179K626
$$ -12036 4621 5119 3648 10642 12549 7733 2923 8381 4741 3052 16332 7651 -12528 -9902
4043i902M002j6752k702J7939J0772o521J916O057K234q72O543R650j199O254
$$ -9902 -5900 -22652 -25354 -7415 3357 -3164 -1248 4809 7043 6171 12714 22364 21165 27419
4029B7419J098j3259j0848M275r017q653P276m924O778J1442j498j5287p191K713
$$ 27419 28517 15258 4410 8685 -332 -8985 -1709 -6633 145 11587 10089 -5198 -12389 -9676
4015i676K198m896O593j615L023J496p023M897p284m143N490J3093k156l2N17
$$ -9676 -7478 -12374 -5781 -7396 -4373 -2877 -9900 -5003 -12287 -16430 -10940 2153 -3 -35 482
4000D82Q268k504L513k738q276l003k016n031J0853J518p51M420l506J651M989
$$ 482 8750 6246 9759 7021 -1255 -4258 -6274 -11305 -452 1066 315 4735 1229 2880 7869
3985G869O17p024K257K519R34K337k535q322j451R598J9619o30p939j0713j6763
$$ 7869 8486 1462 3719 6238 7172 9509 6974 -1348 -2799 6799 26418 25788 17849 7136 -9627
3970i627K593Q657M782R349N525n683p063J769K545n639K638M466j267j7004k121
$$ -9627 -7034 1623 6405 15754 21279 15596 8533 10302 12847 7208 9846 14312 13045 -3959 -6080
3955f080o012M283O622N364P81M706m749p744k869j045l075m482K176j90K196
$$ -6080 -12092 -7809 -1187 4177 4958 9664 4915 -2829 -5698 -6743 -9818 -14300 -12124 -12314 -10118
3940a0118K710P546R825J2392O11J761r482j0795K706K132k328J95q444j766K89
$$ -10118 -7408 138 9963 22355 22966 24727 15245 4450 7156 9288 6960 7155 -1289 -3055 -2766
3925b766n894r683Q52P571N595N913L153j7027j6498l915J2493J5638k330q19
$$ -2766 -8660 -18343 -17491 -9920 -4325 1588 4741 -12286 -28784 -32699 -20206 -4568 -6898 -7717
3911g717J511j083M543J16P25M93q953M591r419j1192J4324J8932k126r760o198
$$ -7717 -6206 -7289 -2746 -2630 -1905 -1412 -10365 -5774 -15193 -26385 -12061 6871 4745 -5015 -11213
3896a1213J4887l94j3675j0212R29P593O499N241M293Q642j491K856k42m441p410
$$ -11213 3674 3280 -10395 -20607 -19678 -12085 -5586 -345 3948 12590 11099 13955 13713 9272 1862
3881A862j0952o030R06k440J3024N404o950o368O168P895Q255N256o038j3542
$$ 1862 -9090 -15120 -14214 -16654 -3630 1774 -5176 -11544 -5376 2519 10774 16030 9992 -3550
3867c550r597k561j589k296k603L770Q808M642K752K178k199j3539j139J1423
$$ -3550 -13147 -15708 -17297 -19593 -22196 -18426 -9618 -4976 -2224 -46 -2245 -15784 -16923 -5500
3853e500J5041Q577o13m047l017q746rM319l720n482l187j0448q515O83K0362
$$ -5500 9541 18118 17505 13458 10441 1695 1686 6005 2285 -3197 -6384 -16832 -25347 -24664 -4302
3838d302J1048j6200q058J1919L374J2150J0113j1173k0593o309k488M806Q102
$$ -4302 6746 -9454 -17512 -5593 -2219 9931 20044 8871 -11722 -18031 -20519 -15713 -7611
3825g611j6757Q133K779j75K749L728J5934j752p141O397j208k986k62Q28J7243
$$ -7611 -24368 -16235 -13456 -13631 -10882 -7154 8780 7028 -113 6284 5076 2090 1828 2656 19899
3810A9899L652o778j0680n951P026m136l059p062L654m76n280J0727M666J451
$$ 19899 23551 16773 6093 142 7168 3032 -27 -7089 -3435 -3911 -9191 1536 6202 7653
3796G653l401J2038J3113N763O96l671q192q734j1837j800r489M138J154j2219
$$ 7653 4252 16290 29403 35166 35862 32191 23999 15265 3428 1628 -7861 -3723 -2569 -14788
3782a4788j1391J1567Q216K548n573j54K423R736q001m742R977N956j2125n741
$$ -14788 -26179 -14612 -6396 -3848 -9421 -9575 -7152 2584 -5417 -10159 -182 5774 -6351 -12092
3768a2092J4325j6989j0707J1270J8143M088j0315q427L785P237J0580q295q839
$$ -12092 2233 -14756 -25463 -14193 3950 8038 -2277 -10704 -6919 318 10898 2603 -6236
3755f236j3620M107J5533O208p252n941J40P40N366N883q097J800K024k014L48
$$ -6236 -19856 -15749 -216 5992 -1260 -7201 -7061 -6321 -955 4928 -3169 -1369 655 -1359 -1011
3740a011l066j2235p268Q084N88K57M825K561K736N046j440j3193r111O479M656
$$ -1011 -4077 -16312 -23580 -15496 -14908 -14651 -9826 -7265 -4529 517 -923 -14116 -23227 -16748 -12092
3725a2092j944q915J8236N446k69J260p844M113n558o480K290O517j149j0916
$$ -12092 -14036 -22951 -4715 731 462 1722 -6122 -2009 -7567 -14047 -11757 -5240 -6389 -17305
3711a7305M322M117j2024M48r63J2579k077N689J5091q551p884j2536L389l081
$$ -17305 -12983 -8866 -20890 -20442 -21405 -8826 -10903 -5214 9877 1326 -6558 -19094 -15705 -18786
3697a8786N361r60J607L766J694o193N771q731k584J2409K549Q460P80m256J488
$$ -18786 -13425 -14385 -12778 -9012 -7318 -13511 -7740 -16471 -19055 -6646 -4097 4363 5143 887 2375
3682B375r866o17m141k971k904J453n848l38L735J266p95J4190M163p778O070
$$ 2375 -7491 -8108 -12249 -15220 -18124 -16671 -22519 -22857 -19122 -17856 -18651 -4461 -298 -8076 -2006
3667b006K271n08p607q423J1402J5082J163j1462j544J60j4861r94J575N685N21
$$ -2006 265 -243 -7850 -16273 -4871 10211 11374 -88 -1632 -1472 -16333 -17327 -15752 -10067 -9546
3652i546M579J846j035K199q28L146P450N129j3858r396J0452j599m885L17J0793
$$ -9546 -4967 -3121 -4156 -1957 -2785 361 7811 12940 -918 -10314 138 -1461 -6346 -6029 4764
3637D764K125j4294M409N845k062o396m673p155j1326l631J724K559R866M755
$$ 4764 6889 -7405 -2996 2849 787 -5609 -10282 -17437 -28763 -32394 -30670 -28111 -18245 -13490
3623a3490q390n374P100O801M039j0280j0189N961L253J5839J3877N35R597L391
$$ -13490 -21880 -27254 -20154 -13353 -9314 -19594 -29783 -23822 -20569 -4730 9147 9682 19279 22670
3609B2670k54q423j5438q860O163j470N0M583M452N528O472J694r503n099M706
$$ 22670 22416 13993 -1445 -10305 -4142 -5612 -5562 -979 3473 9001 15473 17167 7664 2565 7271
3594G271K547N531j2093j886L157O038J536q152q560k588K688N943J1878k741
$$ 7271 9818 15349 3256 1370 4527 10565 12101 3949 -4611 -7199 -4511 1432 13310 10569
3580A0569j077l606J1194J330r790j2323P405J5742k167J60o152n669l314m02
$$ 10569 9492 5886 17080 18410 8620 -3703 3702 19444 17277 17437 11285 5616 2302 1900
3566A900r292k76r5M896N427k078n505m021K939q94J8265J440j6905n292R532
$$ 1900 -7392 -7668 -7763 -2867 2560 482 -5023 -9044 -6105 -6999 11266 12706 -4199 -9491 41
3551D1j1777q727O812Q530n07L60r901l612J665J1988L719K853N504R622q161
$$ 41 -11736 -20463 -13651 -5121 -5628 -5268 -15169 -18781 -17116 -5128 -1409 1444 6948 16570 8409
3536H409k2481l936O936N398o667l306L490J1081k275J911k153J699Q889J678
$$ 8409 -14072 -18008 -11072 -5674 -12341 -15647 -12157 -1076 -3351 -1440 -3593 -1894 6995 8673
3522H673m874j4935R4j124P793M68R63J567K506K919p949q582R551L318M74M781
$$ 8673 3799 -11136 -11042 -12166 -4373 -3905 -2942 -1375 1131 4050 -3899 -12481 -2930 388 862 5643
3506E643k46j922j726l095O471q088p22J118Q789q799n956n290n810K968J3812
$$ 5643 5397 3475 1749 -1346 5125 -2963 -3685 -2567 6222 -2577 -8533 -13823 -19633 -16665 -2853
3491b853q795o243P289O483o706P16J4668m953L862L743n850j18o6J264m931n742
$$ -2853 -11648 -17891 -10602 -4119 -10825 -10109 4559 -394 3468 7211 1361 1243 1177 2441 -2490 -8232
3475h232l737l47K910L814j59J6639K448o882n393L012N567N078j2830o579L36
$$ -8232 -11969 -12316 -9406 -5592 -5751 10888 13336 6454 1061 4073 9640 14718 1888 -4691 -4355
3460d355J5817M366l450n198o279N014J1790r947n755J632q757j393J1080L83
$$ -4355 11462 15828 12378 7180 901 5915 17705 7758 2003 3635 -5122 -6515 4565 4948
3446D948o352m152J0665L796o646Q02O018p027q492j0877O1R221J2121J1548r664
$$ 4948 -1404 -5556 5109 8905 2259 3061 9079 2052 -6440 -17317 -17256 -8035 4086 15634 5970
3431E970j4693r950K91J6737J3893q127P917J200K640k503l448j657p30k0572
$$ 5970 -8723 -18673 -18382 -1645 12248 4121 12038 13238 15878 13375 9927 8270 7540 -13032
3417a3032n88M227L243l574o742K563n804q409Q879J4573J0034L130N208n261
$$ -13032 -13620 -9393 -6150 -9724 -16466 -13903 -19707 -28116 -19237 -4664 5370 8500 13708 8447
3403H447r538r923J1562Q411K190J384l225m581r800L722Q340K40k056L615K993
$$ 8447 -1091 -11014 548 8959 11149 12533 9308 4727 -5073 -1351 6989 7229 5173 8788 11781
3388A1781J97m261J889q690j8502q488J7953R009k094o346p63k153K016J0133
$$ 11781 11978 7717 9606 916 -17586 -26074 -8121 888 -1206 -7552 -8315 -10468 -8452 1681
3374A681O35q572J153K833J2164M839j097J16k970m786Q086P818j646q434p558
$$ 1681 2316 -6256 -5103 -2270 9894 14733 13636 13752 10782 5996 14082 21900 20254 11820 4262
3359D262k616r098O603J1839O3j7470o132Q376p196k511N466p5j1546l413P969
$$ 4262 1646 -7452 -849 10990 11053 -6417 -12549 -4173 -11369 -13880 -8414 -8489 -20035 -23448 -15479
3344a5479M150q138R721J5588l669L16l943j79P142L752K870K955m555J1700J820
$$ -15479 -11329 -19467 -9746 5842 2173 2489 -1454 -1633 5509 9261 12131 15086 10531 22231 24051
3329B4051m605k676L889j9374r072O5J1431M615q097q763R449J716Q046m578r137
$$ 24051 19446 16770 20659 1285 -7787 -7722 3709 8324 227 -8536 913 2629 10675 6097 -3040
3314c040L209L337n486N399J082P051P585j2633j1607N496L111m53O540M15Q195
$$ -3040 169 3506 -1980 3419 4501 11552 19137 6504 -5103 393 3504 3051 9591 10006 18201
3299A8201k418o147j1105N040L765J0702L328q70N370r920j2243O515p968J645
$$ 18201 15783 9636 -1469 3571 7336 18038 21366 20496 25866 15946 3703 10218 2250 3895
3285C895R456p202o458L215L744n457L037m877q045m82k474N40Q503j3509j4982
$$ 3895 13351 6149 -309 2906 6650 1193 4230 -647 -8692 -9174 -11648 -11108 -2605 -16114 -31096
3270c1096J0093J7560Q471O924j548r044J1269J2480j2160j185l017M54P010m550
$$ -31096 -21003 -3443 5028 11952 10404 1360 12629 25109 12949 11764 8747 9201 16211 11661
3256A1661m542L01q096K605O788j153J984j1602j0954K412R272P94j1664n545
$$ 11661 7119 7420 -676 1929 8717 7564 9548 -2054 -13008 -10596 -1324 -530 -12194 -17739
3242a7739J5608O917q486p321K596n978J619O462j029P438n627n89L342J2574
$$ -17739 -2131 4786 -3700 -11021 -8425 -14403 -12784 -6322 -7351 87 -5540 -6129 -2787 9787
3228I787j105j912o836l735K251j1942n907K27O439q395O323R325Q119j3548m450
$$ 9787 8682 6770 -66 -3801 -1550 -13492 -19399 -19172 -12733 -21128 -14805 -5480 2639 -10909 -15359
3213a5359n52Q102N770j5076j258R980J2390Q619r144j9003K324J978J0949l302
$$ -15359 -15911 -7809 -2039 -17115 -18373 -8393 3997 12616 3472 -15531 -13207 -11229 -280 -3582
3199c582N412o0P34P768o80L968M444p566J780k134J082m052n322P493Q759M820
$$ -3582 1830 1770 2504 10272 9592 13560 18004 10438 12218 10084 11166 7114 1792 9285 18044 22864
3183B2864j0659j6077k091j0095o70L960O018M729j932Q817M178m102p999l148
$$ 22864 12205 -3872 -5963 -16058 -16728 -12768 -6750 -2021 -3953 4864 9042 4940 -3059 -6207
3169f207J4266o310P522L104J93L693K844j7774l267R68m041l176k554l535k352
$$ -6207 8059 1749 9271 12375 12568 16261 19105 1331 -1936 -968 -5009 -8185 -10739 -14274 -16626
3154a6626j293L786p816j150J4386Q317J604L511L938O49q768p993p87M535M377
$$ -16626 -17919 -14133 -21949 -23099 -8713 -396 1208 4719 8657 9306 538 -7455 -8242 -3707 670
3139F70R091p121j0041j6130K955M088q35J831L2R398j0624l480m928O674K4255
$$ 670 9761 2640 -7401 -23531 -20576 -16488 -17323 -15492 -15460 -6062 -16686 -20166 -25094 -18420 5835
3124E835J0089j0738n257o452O244o939k530m516J869Q763J0725k277K733q407
$$ 5835 15924 5186 -71 -6523 -279 -7218 -9748 -14264 -12395 -3632 7093 4816 7549 -858
3110h58O629J848P100k235l808j2178O033n284j1354n396J3443l637p958j918
$$ -858 5771 7619 14719 12484 8676 -3502 2531 -2753 -14107 -19503 -6060 -9697 -17655 -19573
3096a9573R228J2561n808m449L305K740J1763O000L062O26n50n87j480l294j400
$$ -19573 -10345 2216 -3592 -8041 -4736 -1996 9767 15767 18829 19455 18905 18318 16838 13544 12144
3081A2144p001l810M644R302n200l955O834j4458j0636J774j32j369O030L973
$$ 12144 5143 1333 5977 15279 10079 6124 12958 -1500 -12136 -10362 -10494 -11863 -5833 -1860
3067a860o46P617k159L992M653o79j1184j813R807q2P9k791K182p571l662o964
$$ -1860 -2506 5111 2952 6944 11597 10918 -266 -2079 7728 7646 7725 4934 7116 -455 -4117 -11081
3051a1081L285L244m953m913J300j952k875Q32Q326l61p682K525l755M184l61
$$ -11081 -7796 -4552 -9505 -14418 -13118 -15070 -17945 -17113 -8787 -9148 -16830 -14305 -18060 -13876 -14237
3036a4237J401o524O023L228M449K185r70j1891o16N077m653j1483J507O545K089
$$ -14237 -12836 -19360 -13337 -10109 -5660 -3475 -4445 -16336 -16952 -11875 -16528 -28011 -26504 -19959 -17870
3021a7870n088n840N862N719P366q179q44K939N381P126J3455j0227k244K718
$$ -17870 -22958 -28798 -22936 -17217 -9851 -18030 -18874 -15935 -10554 -3428 10027 -200 -2444 274
3007B74j3203j4014l06M964M448p021J445l491n579P391Q565N081J4706J1917
$$ 274 -12929 -26943 -27249 -22285 -17837 -24858 -23413 -26904 -32483 -25092 -16527 -11446 3260 15177
2993A5177K779j8334M331n64J401l442M145j467p3Q489r962O159J5765r264j0593
$$ 15177 17956 -378 3953 3389 4790 1348 5493 4026 3953 12442 2480 8639 24404 15140 4547
2978D547n06J333J587o240j1440n114L357M989j847O478m995Q023o071J606M954
$$ 4547 4041 5374 6961 721 -10719 -15833 -12476 -7487 -9334 -2856 -7851 172 -5899 -4293 661
2963F61j0582q106O37J5584J181K820Q848K195l729J856q743o98O751o603L45
$$ 661 -9921 -18027 -17390 -1806 -625 2195 11043 13238 9509 11365 2622 1924 8675 2072 2417
2948B417J2299k637j0197O8Q555k023L663N236K56l705k5423n526k259M252k105
$$ 2417 14716 12079 1882 1950 10505 8482 12145 17381 17637 13932 -11491 -17017 -19276 -15024 -17129
2933a7129L400J0880J4859R682n445j2067l738n805P966J1316M422N607j5223
$$ -17129 -13729 -2849 12010 21692 16247 4180 442 -5363 2603 13919 18341 23948 8725
2920H725j1201j421J0775O316j2892r015n12K023N592N218J667K494q915Q176
$$ 8725 -2476 -3897 6878 13194 302 -8713 -9225 -7202 -1610 3608 5275 7769 -1146 7030
2906G030R569o203n086j80L785k317k75l268n051j0800P75j561J451K40Q146K493
$$ 7030 16599 10396 5310 5130 8915 6598 6323 3055 -1996 -12796 -12021 -13582 -12131 -11891 -3745 -1252
2890a252m878P573n081j566K327j83p844R990O615O332P299K343r416m152k762
$$ -1252 -6130 1443 -3638 -5204 -2877 -3060 -10904 -914 5701 12033 19332 21675 12259 8107 5345
2875E345m253K596J4037J763J720O256k079j8330j470L314J890Q867P983j760
$$ 5345 1092 3688 17725 19488 21208 27464 25385 7055 5585 8899 10789 19656 27639 25879
2861B5879j0520k475l459K777J148L03p568r36K520n249r091O999J2439m543n662
$$ 25879 15359 12884 9425 12202 13350 13653 6085 5149 7669 2420 -6671 328 12767 8224 2562
2846B562l525R04J0979K568l819r653j468m561p026l372J4265J376j463o760K085
$$ 2562 -963 -59 10920 13488 9669 16 -1452 -6013 -13039 -16411 -2146 -770 -2233 -8993 -6908
2831f908J0386J0136M531n994j2014J952Q789k202l680j761N299Q175K508P86
$$ -6908 3478 13614 18145 12151 137 2089 10878 8676 4996 3235 8534 16709 19217 20003
2817B0003K5n864j3120j821N549j01J2302J895j3717k218j202j0256m994N974
$$ 20003 20028 14164 1044 -777 4772 4671 16973 18868 5151 2933 1731 -8525 -13519 -7545
2803g545Q688Q656J00O01q362M529q256o125l006j2880M84L020J4087L862k008
$$ -7545 1143 9799 9899 10500 2138 6667 -1589 -7714 -10720 -23600 -23116 -20096 -6009 -2147 -4155
2788d155k256j0996P383J4283p070R172O458p34n068j2245n500p27L049N57k484
$$ -4155 -6411 -17407 -10024 4259 -2811 6361 12819 12085 7017 -5228 -10728 -11455 -8406 -7849 -10333
2773a0333M403P467O707m565j805Q055N973j1301q143P998Q736j58n806m353K622
$$ -10333 -5930 1537 8244 3679 1874 9929 15902 4601 -3542 4456 13192 13034 7228 2875 5497
2758E497L85P381j0830j3123j799l493k24J0588j4192p280J1540J4814L859j238
$$ 5497 5882 13263 2433 -10690 -12489 -15982 -16206 -5618 -19810 -27090 -15550 -736 3123 1885
2744A885k933r88M540r9p559j719J1501Q619K492n872r472j3623r95k336K057
$$ 1885 -1048 -2036 2504 2405 -5154 -6873 4628 13247 15739 9867 395 -13228 -14223 -16559 -14502
2729a4502K3O295m621m514k524J493Q424O061K893L850N91K473O74j1803l899
$$ -14502 -14479 -8184 -12805 -17319 -19843 -18350 -9926 -3865 -972 2878 3469 5942 6616 -5187 -9086
2714i086M819O582P190J747o308M728j26j7744k2772O436J5692J2841K890O740
$$ -9086 -4267 2315 9505 11252 4944 9672 9546 -8198 -30970 -24534 -8842 3999 6889 13629
2700A3629o314j2534M673O428j1600k420J7237K497J2045j008l263O237j0640
$$ 13629 7315 -5219 -546 5882 -5718 -8138 9099 11596 23641 22633 19370 25607 14967
2687A4967k935m54j980K248J151J238M290J222o098j1643J1032M222o526p950
$$ 14967 12032 11578 9598 11846 12997 14235 18525 19747 13649 2006 13038 17260 10734 2784
2673B784j8215q19J1305N687q466L83M622N161j0111l21J4928L038j36l682l867
$$ 2784 -15431 -16250 -4945 742 -7724 -7341 -2719 2442 -7669 -7990 6938 9976 9840 6158 2291
2658B291J3879n912j3780P366K926L156m3q668j895o3r863k6M116m91J0450J7805
$$ 2291 16170 10258 -3522 3844 6770 9926 9883 1215 -680 -743 -10606 -10632 -6516 -7007 3443 21248
2642B1248k705l632p809j2962l307l588n612M141K391J9253J644p711q75L983
$$ 21248 18543 14911 7102 -5860 -9167 -12755 -18367 -14226 -11835 7418 9062 1351 476 4459
2628D459l713P427J533n247K52k492q805m631O183J3296K427n846p283p968K55
$$ 4459 746 8173 9706 4459 4711 2219 -6586 -11217 -5034 8262 10689 4843 -2440 -10408 -10153
2613a0153K4451P792j0731j0498q6Q554n147q492j9538M916K2046P119j1389r788
$$ -10153 14298 22090 11359 861 775 9329 4182 -4310 -23848 -18932 3114 10233 -1156 -10944
2599a0944O411Q646J2069L701j0436j7758q957J245J0211K365M521J3504l672
$$ -10944 -4533 4113 16182 19883 9447 -8311 -17268 -16023 -5812 -3447 1074 14578 10906
2586A0906k02n051K307J1854M350q525j9099r615J0994J3415j1480j886K689O362
$$ 10906 10704 5653 7960 19814 24164 15639 -3460 -13075 -2081 11334 -146 -2032 657 7019
2572G019J1749J125l87j733l298l092K781J7873m26p084j2514m960J089K579j2424
$$ 7019 18768 19893 19506 17773 14475 11383 14164 32037 31611 24527 12013 7053 8142 10721 -1703
2557a703j4308m651J8421P949q084j1467J2899J1127L702r608Q146M334q340j3884
$$ -1703 -16011 -20662 -2241 5708 -2376 -13843 -944 10183 13885 4277 12423 16757 8417 -5467
2543e467K149j0002l00K097L414N445j196j3571J3497J4180Q04j1809J467l426
$$ -5467 -3318 -13320 -13620 -11523 -8109 -2664 -3860 -17431 -3934 10246 11050 -759 708 -2718
2529b718q862J78J5556m100L052K978L31j297n157Q412p093j674L741L099J0686
$$ -2718 -11580 -11402 4154 54 3106 6084 6415 5118 -39 8373 1280 -394 3347 6446 17132
2514A7132p945j9417L368J5205P259j229p942p587L044O12O499O908l741p635
$$ 17132 9187 -10230 -6862 8343 15602 14373 6431 -1156 1888 2500 8999 15907 12166 4531
2500D531o295j7170j549K700Q452m017l45J398K513R592n029q940L462N853L801
$$ 4531 -1764 -18934 -20483 -17783 -9331 -13348 -13693 -12295 -9782 -190 -5219 -14159 -10697 -4844 -1043
2485a043o54p479K117P40k233k229M778O713m08M722k990j360K139K070L17J867
$$ -1043 -1697 -9176 -7059 -6319 -8552 -10781 -6003 710 302 5024 2034 674 2813 4883 5200 7067
2469G067J789n684K440n676n122r228N631k4l363R990j242n658l965R944P736
$$ 7067 8856 3172 5612 -64 -5186 -14414 -8783 -8807 -12170 -2180 -3422 -9080 -13045 -3101 4635
2454D635m790N042O637j037j90q456l701p965L137o403j0315J3268J3744j236
$$ 4635 -155 4887 11524 10487 10297 1841 -1860 -9825 -6688 -13091 -23406 -10138 3606 2370
2440B370m198L87K310N117M246j83n503p669P341l0p324m376Q81J710J0312q808
$$ 2370 -1828 -1441 869 5986 10232 10049 4546 -3123 4218 4188 -3136 -7512 -6631 -4921 5391 -3417
2424c417K813P968N02r731k747M384k74O482Q895p851l366p617l120r741P228
$$ -3417 -604 7364 7866 -1865 -4612 -228 -502 5980 14875 7024 3658 -3959 -7079 -16820 -9592
2409i592J1784K310M393l414l387O839q551O015J1775j3581o868o254K96P483
$$ -9592 2192 4502 8895 5481 2094 8933 382 6397 18172 4591 -2277 -8531 -8235 -752
2395g52K213k98m686M894L983J934n721o357P885L862j0376j1526j161R358q400
$$ -752 1461 1163 -3523 1371 5354 7288 1567 -4790 3095 6957 -3419 -14945 -16106 -6748 -15148
2380a5148J710L081n264M831J531L742J5294n358j1615P703P638N89l614p985
$$ -15148 -13438 -10357 -15621 -10790 -9259 -5517 9777 4419 -7196 507 8145 8734 5120 -2865
2366b865J004j2733K678P239l345R136j081p711o10j450Q379M044M67m709q211
$$ -2865 -1861 -14594 -11916 -4677 -8022 1114 33 -7678 -8288 -9738 -1359 2685 3152 -1557 -9768
2351i768M584L780Q308R0O395l957m605Q99R752m567n483m15j15k864o468J3249
$$ -9768 -5184 -1404 6904 6994 13389 9432 4827 5726 15478 10911 5428 5013 4898 2034 -4434 8815
2335H815O429p99j1551j424n415L417r470l393j872J1292J206M867k034P664K38
$$ 8815 15244 14445 2894 1470 -3945 -528 -9998 -13391 -15263 -3971 -2765 2102 68 7732 7970
2320G970o945N466N077l653n043j2917l899j783r798K686J0382K074O676m281
$$ 7970 1025 6491 11568 7915 2872 -10045 -13944 -15727 -25525 -22839 -12457 -10383 -3707 -7988
2306g988j841J3924Q959l564j0972p409Q468n406P99m287P16Q830O123J0392n621
$$ -7988 -9829 4095 13054 9490 -1482 -8891 -423 -5829 -5030 -9317 -8601 229 6352 16744 11123
2291A1123O994P67r602o579n228J409j70J1777R715o841j0064p086k088k95P907
$$ 11123 18117 18884 9282 2703 -2525 -1116 -1286 10491 20206 13365 3301 -3785 -5873 -6168 1739
2276A739M908Q152o125l18R358q765j5938K978R180O016j7611p760R556N217Q261
$$ 1739 6647 14799 8674 8356 17714 8949 -6989 -4011 5169 11185 -6426 -14186 -4630 587 8848
2261H848q116M041o841n488P229q039r46J0441R87n576k246L586j5542j2139K687
$$ 8848 732 4773 -2068 -7556 -327 -8366 -9312 1129 2116 -3460 -5706 -2120 -17662 -29801 -27114
2246b7114R704J6900J889j086k870l803J3431q227k112L164M92K717O78j891j127
$$ -27114 -17410 -510 1379 293 -2577 -6380 7051 -1176 -3288 -124 368 3085 3763 1872 745
2231G45K305q314R340J080J3597O352q677O217N046k4506j9251k768R599J5364
$$ 745 3050 -5264 4076 5156 18753 25105 16428 22645 27691 3185 -16066 -18834 -9235 6129
2217F129R023L628J0164O798q251o943J771p235r170n074K751o78q11n91n12j119
$$ 6129 15152 18780 28944 35742 27491 20548 22319 15084 5914 840 3591 2913 2102 1511 999 -120
2201a20J794L567R745n790j6593m796M146O559J0810L568J5263o260k3892j2534
$$ -120 1674 5241 14986 9196 -7397 -12193 -8047 -1488 9322 12890 28153 21893 -1999 -14533
2187a4533O445Q559N591N205M500M671Q8r764j4749J090k018k15J521j136K837
$$ -14533 -8088 471 6062 11267 15767 20438 20526 10762 -3987 -2897 -4915 -5130 -3609 -4745 -1908
2172a908J181K396j107j369j0121M36P180K553M023J0364K780j550n602n739j9
$$ -1908 -727 1669 562 -807 -10928 -10492 -3312 -759 3264 13628 16408 14858 9256 3517 3498
2157C498m9J860O789r403l843o808L410Q583R720K657m490p008k550o447m013
$$ 3498 3449 5309 12098 2695 -1148 -7956 -4546 4037 13757 16414 11924 4916 2366 -4081 -8094
2142h094J8708K908j0129j0330r686R302J078K692o785l763J0074l464p147J9588
$$ -8094 10614 13522 3393 -6937 -16623 -7321 -6243 -3551 -10336 -14099 -4025 -7489 -14636 4952
2128D952N373o287p357Q93L239l840N637R531K788j6839j8550N635J2324Q30q13
$$ 4952 10325 4038 -3319 -2426 813 -3027 2610 12141 14929 -1910 -20460 -14825 -2501 -1671 -2484
2113b484j4624j4886j560O642J4503r027m804J5537P629m839N624M113m763o822
$$ -2484 -17108 -31994 -33554 -26912 -12409 -21436 -26240 -10703 -3074 -7913 -2289 1824 -2939 -9761
$$ [...]
##END NTUPLES=NMR SPECTRUM
##END=
